##TITLE=NES1006_50530289_9232656_fRCv0EkKs0
##JCAMPDX= 6.0         $$ Bruker NMR JCAMP-DX V2.0
##DATA TYPE= NMR SPECTRUM
##DATA CLASS= NTUPLES
##ORIGIN= BRUKER
##OWNER= Administrator
$$ 1.72 TOPSPIN		Version 2.1
$$ 2015-06-17 17:23:58.628 -0700  Administrator@X
$$ Compression mode = diff/dup
##.OBSERVE FREQUENCY= 400.02188249412
##.OBSERVE NUCLEUS= ^1H
##.ACQUISITION MODE= SIMULTANEOUS (DQD)
##.ACQUISITION SCHEME= undefined
##.AVERAGES= 8
##.DIGITISER RES= 22
##SPECTROMETER/DATA SYSTEM= spect
##.PULSE SEQUENCE= zg30
##.SOLVENT NAME= COFFEE_meoh
##.SHIFT REFERENCE= INTERNAL, COFFEE_meoh, 1, 14.98509
##AUDIT TRAIL= $$ (NUMBER, WHEN, WHO, WHERE, PROCESS, VERSION, WHAT)
$$ ##TITLE= Audit trail, TOPSPIN		Version 2.1
$$ ##JCAMPDX= 5.01
$$ ##ORIGIN= Bruker BioSpin GmbH
$$ ##OWNER= Administrator
$$ $$ E:\/data/COFFEE/nmr/NES1006_50530289_9232656_fRCv0EkKs0/10/pdata/1/auditp.txt
$$ ##AUDIT TRAIL=  $$ (NUMBER, WHEN, WHO, WHERE, PROCESS, VERSION, WHAT)
(   1,<2015-06-17 17:23:51.206 -0700>,<Administrator>,<X>,<go>,<TOPSPIN 2.1>,
      <created by zg
	started at 2015-06-17 17:22:44.534 -0700,
	POWCHK enabled, PULCHK disabled,
       configuration hash MD5:
       21 0F 79 D6 B3 7B B4 F6 88 20 88 DB 03 48 BD 9F
       data hash MD5: 64K
       DA 86 F2 08 2F 5F 88 1B A4 54 18 74 6D A8 0E 05>)
(   2,<2015-06-17 17:23:54.534 -0700>,<Administrator>,<X>,<proc1d>,<TOPSPIN 2.1>,
      <Start of raw data processing
       efp LB = 0 FT_mod = 6 PKNL = 1 PHC0 = 0 PHC1 = 0 SI = 32K 
       data hash MD5: 32K
       6B 97 44 1C E4 9C 73 2C BF 15 43 B9 C5 6D C8 3A>)
(   3,<2015-06-17 17:23:54.816 -0700>,<Administrator>,<X>,<proc1d>,<TOPSPIN 2.1>,
      <pk PHC0 = 93.35632 PHC1 = 0 
       data hash MD5: 32K
       31 3E 8B 59 87 88 6C DA FB A2 31 2E B9 68 D0 B5>)
(   4,<2015-06-17 17:23:54.925 -0700>,<Administrator>,<X>,<proc1d>,<TOPSPIN 2.1>,
      <abs ABSG = 1 
       data hash MD5: 32K
       B8 D3 76 B8 63 40 1B AF CB 21 9E E7 3D 31 5E 71>)
(   5,<2015-06-17 17:23:54.987 -0700>,<Administrator>,<X>,<proc1d>,<TOPSPIN 2.1>,
      <abs ABSG = 2 
       data hash MD5: 32K
       CE 7B 44 54 F0 84 8B 2B A5 FA 84 F0 87 98 18 E8>)
(   6,<2015-06-17 17:23:55.034 -0700>,<Administrator>,<X>,<proc1d>,<TOPSPIN 2.1>,
      <abs ABSG = 3 
       data hash MD5: 32K
       3F E4 37 D4 FA A0 5F 95 93 F2 0F 01 16 3C 47 69>)
(   7,<2015-06-17 17:23:55.097 -0700>,<Administrator>,<X>,<proc1d>,<TOPSPIN 2.1>,
      <abs ABSG = 4 
       data hash MD5: 32K
       5E E6 B4 9E DB 1C 28 EE 78 0C 05 9C 6E A1 13 89>)
(   8,<2015-06-17 17:23:55.159 -0700>,<Administrator>,<X>,<proc1d>,<TOPSPIN 2.1>,
      <abs ABSG = 5 
       data hash MD5: 32K
       7D 19 1F 49 ED E8 C1 B9 E3 05 2F 77 A0 00 7F AA>)
$$ ##END=
$$ 
$$ $$ hash MD5
$$ $$ F4 E9 44 9B ED D6 EE 74 95 70 7F D8 E5 24 F4 5A
##$RELAX= 
##$RELAX= 
##$RELAX= 
##$RELAX= 
##$RELAX= 
##$RELAX= 
##$RELAX= 
$$ Bruker specific parameters
$$ --------------------------
##$DU= <E:\>
##$EXPNO= 10
##$NAME= <NES1006_50530289_9232656_fRCv0EkKs0>
$$ [...]
150 150 150 150 150 150 150 150
##$TP07= 0
##$TPNAME0= <>
##$TPNAME1= <>
##$TPNAME2= <>
##$TPNAME3= <>
##$TPNAME4= <>
##$TPNAME5= <>
##$TPNAME6= <>
##$TPNAME7= <>
##$TPOAL= (0..7)
0.5 0.5 0.5 0.5 0.5 0.5 0.5 0.5
##$TPOFFS= (0..7)
0 0 0 0 0 0 0 0
##$TUNHIN= 0
##$TUNHOUT= 0
##$TUNXOUT= 0
##$USERA1= <user>
##$USERA2= <user>
##$USERA3= <user>
##$USERA4= <user>
##$USERA5= <user>
##$V9= 5
##$VALIST= <valist>
##$VCLIST= <CCCCCCCCCCCCCCC>
##$VD= 0
##$VDLIST= <DDDDDDDDDDDDDDD>
##$VPLIST= <PPPPPPPPPPPPPPP>
##$VTLIST= <TTTTTTTTTTTTTTT>
##$WBST= 2048
##$WBSW= 25
##$XGAIN= (0..3)
0 0 0 0
##$XL= 0
##$YL= 0
##$YMAX_a= 586446
##$YMIN_a= -496784
##$ZGOPTNS= <>
##$ZL1= 120
##$ZL2= 120
##$ZL3= 120
##$ZL4= 120
##$ABSF1= 14.98509
##$ABSF2= -5.573092
##$ABSG= 5
##$ABSL= 3
##$ALPHA= 0
##$AQORDER= 0
##$ASSFAC= 0
##$ASSFACI= 0
##$ASSFACX= 0
##$ASSWID= 0
##$AUNMP= <proc_prof1d_extract_pilot.lims>
##$AXLEFT= 0
##$AXNAME= <>
##$AXNUC= <1H>
##$AXRIGHT= 0
##$AXTYPE= 0
##$AXUNIT= <>
##$AZFE= 0.1
##$AZFW= 0.1
##$BCFW= 0
##$BC_mod= 0
##$BYTORDP= 0
##$COROFFS= 0
##$CY= 15
##$DATMOD= 1
##$DC= 0
##$DFILT= <>
##$DTYPP= 0
##$F1P= 0
##$F2P= 0
##$FCOR= 0.5
##$FTSIZE= 32768
##$FT_mod= 6
##$GAMMA= 0
##$GB= 0
##$INTBC= 1
##$INTSCL= 1
##$ISEN= 128
##$LB= 0
##$LEV0= 0
##$LPBIN= 0
##$MAXI= 10000
##$MC2= 0
##$MEAN= 0
##$ME_mod= 0
##$MI= 0
##$NCOEF= 0
##$NC_proc= -8
##$NLEV= 6
##$NOISF1= 0
##$NOISF2= 0
##$NSP= 0
##$NTH_PI= 0
##$NZP= 0
##$OFFSET= 14.98509
##$PC= 1
##$PHC0= 93.35632
##$PHC1= 0
##$PH_mod= 1
##$PKNL= yes
##$PPARMOD= 0
##$PPDIAG= 0
##$PPIPTYP= 0
##$PPMPNUM= 2147483647
##$PPRESOL= 1
##$PSCAL= 4
##$PSIGN= 0
##$PYNMP= <proc.py>
##$REVERSE= no
##$SF= 400.02
##$SI= 32768
##$SIGF1= 0
##$SIGF2= 0
##$SINO= 400
##$SIOLD= 32768
##$SPECTYP= <>
##$SREGLST= <1H.CDCl3>
##$SSB= 0
##$STSI= 32768
##$STSR= 0
##$SW_p= 8223.68421052631
##$SYMM= 0
##$S_DEV= 0
##$TDeff= 65536
##$TDoff= 0
##$TI= <>
##$TILT= no
##$TM1= 0
##$TM2= 0
##$TOPLEV= 0
##$USERP1= <user>
##$USERP2= <user>
##$USERP3= <user>
##$USERP4= <user>
##$USERP5= <user>
##$WDW= 1
##$XDIM= 32768
##$YMAX_p= 424398554
##$YMIN_p= -696682
##$CURPLOT= <Network HP LaserJet P1505>
##$CURPRIN= <$Network HP LaserJet P1505>
##$DFORMAT= <normdp>
##$LAYOUT= <+/1D_H.xwp>
##$LFORMAT= <normlp>
##$PFORMAT= <normpl>
##$SURQMSG= 1
$$ End of Bruker specific parameters
$$ ---------------------------------
##NTUPLES= NMR SPECTRUM
##VAR_NAME=  FREQUENCY,     SPECTRUM/REAL,   SPECTRUM/IMAG
##SYMBOL=    X,             R,               I
##VAR_TYPE=  INDEPENDENT,   DEPENDENT,       DEPENDENT
##VAR_FORM=  AFFN,          ASDF,            ASDF
##VAR_DIM=   32768,         32768,           32768
##UNITS=     HZ,            ARBITRARY UNITS, ARBITRARY UNITS
##FACTOR=    0.250966925370066, 1,           1
##FIRST=     8223.43324360094, -96890,       -224149
##LAST=      0,             161355,          135670
##MIN=       0,             -696682,         0
##MAX=       8223.43324360094, 424398554,    0
$$ Real data points
##PAGE= N=1
##DATA TABLE= (X++(R..R)), XYDATA
$$ [...]
19503B94062G3555J42551e2725P944C0866b40211h1124j10194N1760e3380C91500
19491A27446a18576L2863G0946N579d1408j24317j89790f3497l85809D4928A1738
19479a88746g6891k29372A97544L1674q7893m3345b55978b3904k278A00188a2715
19467a23128d4616k12424J16410j71177r0793J63843C8446a85753B76209C2045
19456a96394c9656l21910a24188A4741b61943a1025E1959Q7671F2169A7156g5854
19444G0142J37821h8176B60674b5395j67858b9969C0567f8620j55195A03202a39378
19432b22382h7116F9605a33129k32157Q0637k27642e818C17312A57782C7470a07972
19420d4971j56905F1457c43077E7863J18961a03011A07768g9138Q797E6892b79160
$$ y = [294062, 73555, 216106, -52725, -44781, 30866, -240211, -81124, -191318, -139558, -53380, 391500, 127446, -118576, -85713, 70946, 76525, -41408, -165725, -355515, -63497, -449306, 44928, 11738, -188746, -76891, -306263, 197544, 229218, 141325, 97980, -255978, -23904, -26182, 100188, -12715, -123128, -44616, -257040, -140630, -311807, -402600, -238757, 38446, -185753, 276209, 32045, -196394, -39656, -361566, -124188, 14741, -261943, -11025, 51959, 139630, 62169, 17156, -75854, 70142, 207963, -88176, 260674, -25395, -193253, -29969, 30567, -68620, -223815, 103202, -139378, -222382, -87116, 69605, -133129, -365286, -284649, -512291, -5818, 317312, 157782, 37470, -107972, -44971, -201876, 61457, -343077, 57863, 176824, -103011, 107768, -79138, -70341, 56892, -279160]
19408c44055a37875A88258a81807c3575A66144a53293B43192a92013B2164b26949
19397h6868n1103k935N6681H8746d10947J99575B61920a39581q6025N9274A64422
19385f3361A2121a85773A06993m9324b30409a00897c2692A10812a90956k0530
19375b11486i2570c1658n0181A74585a50468A45963f7456I8064b86349B15115
19364A55603c8702k35837A6389a63680M4512M7613j14376A67208c29228d3387
19353G7089b25354A8393b98278a30779e6791l4645o0509o6429A4926f6594b8304
19341a90079A88507e940C6678M4158f0494b9709j7343R023B71510F1441A2779
19329A73008d48594a96531J0266B13541E0697a01471d1758G3399b90062R7006
$$ y = [-344055, -137875, 188258, -181807, -33575, 166144, -153293, 243192, -192013, 22164, -226949, -86868, -137971, -140906, -84225, 88746, -410947, -211372, 261920, -139581, -225606, -166332, 164422, -63361, 12121, -185773, 106993, 57669, -230409, -100897, -32692, 110812, -190956, -211486, -92570, -31658, -81839, 174585, -150468, 145963, -67456, 98064, -286349, 215115, 155603, -38702, -274539, 16389, -163680, -119168, -71555, -185931, 167208, -329228, -43387, 77089, -225354, 18393, -298278, -130779, -56791, -91436, -151945, -218374, 14926, -66594, -28304, -190079, 188507, -5940, 36678, 80836, -60494, -29709, -47052, -38029, 271510, 61441, 12779, 173008, -448594, -196531, -186265, 213541, 50697, -101471, -41758, 73399, -290062, -193056]
19319a93056O1821C1208a53362A89254g4902j03011j5200d5032C290P0082g8225
19307d5315k03870F0217a04698o0598B13310a01022k90290G0660k439O9248c6979
19295a49035B5305c1428k69939g8276b0020j02028A55341F7918b87708a25334
19284b09316j24782a04219N1993j05808j01513f2378A00997N2035A9194d5001
19273b14248Q6707I7981b80349c1395a3147C2343K08864b72154G1468d4420j13793
19262a58213j21361C05402j19602D259i7609A49525a32596q4851h8783A58803
19251D2849d6283E1921a31070G2642c47731J12977d7566j23280C0136J96338o0444
19240A66030a51620E7938c4783C9626b32255P9387A7066b35783D2340b12968F3370
$$ y = [-193056, -131235, 31208, -153362, 189254, -74902, -177913, -193113, -45032, 3290, 73372, -78225, -45315, -249185, 60217, -104698, -165296, 213310, -101022, -391312, 70660, 68221, 137469, -36979, -149035, 25305, -31428, -301367, -78276, -20020, -122048, 155341, 67918, -287708, -125334, -209316, -334098, -104219, -52226, -158034, -259547, -62378, 100997, 153032, 19194, -45001, -214248, -127541, 97981, -280349, -31395, -13147, 32343, 241207, -272154, 71468, -44420, -158213, -279574, 305402, 185800, 4259, -97609, 149525, -132596, -217447, -88783, 158803, 42849, -46283, 51921, -131070, 72642, -347731, -234754, -47566, -170846, 30136, 226474, 166030, -151620, 57938, -34783, 39626, -232255, -152868, 17066, -235783, 42340, -212968, 63370]
19228C30096A60915B6745F224A734K14151K1879C3524J51786a83507B33054H4712
19216F2954b29319A99109g8267H0538l1004b16832a2461k87022J31848j40990
19206c08625J11576A93307a68939E0214e1777m2231j91950K5589a26351l7768
19196a64119B05072b24830g7529c1904B5018b49464A9388d1159j45288O49B38061
19184I8111b0837l1171j94238i5005I5767J05949c54365A71971g9915D9461a0505
19172a41240k2357b7221l7592B56306A3298O2275K83020j32418g7077m02941E2867
19160b48921I7224a56620A60340c03838J16882C227a33149n3600P502k0904J7229
19149a82922M7717n3327k998j26548B05159b16057R6135N2813o2348E0935a17624
$$ y = [330096, 160915, 26745, 6224, 1734, 215885, 237764, 33524, 185310, -183507, 233054, 84712, 62954, -229319, 199109, -78267, 80538, 49534, -216832, -12461, -299483, -167635, -308625, -197049, 193307, -168939, 50214, -51777, -94008, -285958, -260369, -126351, -164119, 205072, -224830, -77529, -31904, 25018, -249464, 19388, -41159, -186447, -185798, 238061, 98111, -20837, -52008, -246246, -95005, 95767, 201716, -354365, 171971, -79915, 49461, -10505, -141240, -163597, -27221, -64813, 256306, 13298, 75573, 358593, 226175, -77077, -480018, 52867, -248921, 97224, -156620, 160340, -303838, -186956, 3227, -133149, -186749, -179247, -200151, -182922, -135205, -188532, -191530, -318078, 205159, -216057, -119922, -67109, -129457, 50935, -117624]
19137A47281E7542b44606B4852a4246r6885M1858b3611O023j78853R184Q5356
19126a01901k3723E6524a45679A8203b70551g976C2599a47109l8238P2926r859
19115a22280L1382G4994L046Q5473D5015P2462b42585c6587p3733m2533m6997
19104a99850j64539A55572b52843P7492E8424B593J25361b4242n1646L5799A0477
19092A2423c18765O0582A05179J06691a46549e8476j75068J13809G7267a26806
19081A23749b3560D55775d18195I296P8311b16056J05899B10063l7937p7292a51883
19069a12909j26098a17577E9277N0159d574k22677A27012c51970j3913J27878
19059b38005L3931O7515E8052f8252C3253b61434A0639N4148d4385l3052F60424
$$ y = [147281, 57542, -244606, 24852, -14246, -111131, -69273, -23611, -17588, -196441, -187257, -101901, -125624, 56524, -145679, 18203, -270551, -7976, 32599, -147109, -185347, -112421, -122280, -90898, 74994, 78040, 163513, 45015, 117477, -242585, -36587, -110320, -152853, -199850, -364389, 155572, -252843, -175351, 58424, 2593, 127954, -24242, -75888, -40089, 10477, 12423, -318765, -258183, 105179, 211870, -146549, -58476, -233544, -119735, 77267, -126806, 123749, -23560, 455775, -418195, 9296, 87607, -216056, -110157, 210063, 172126, 94834, -151883, -112909, -239007, -117577, 59277, 109436, -4574, -227251, 127012, -351970, -365883, -238005, -204074, -136559, 58052, -68252, 33253, -261434, 10639, 64787, -44385, -77437, 660424]
19047C34802i9054j74922B61637a44156o3514e6381J9548C48762b10517c500m2092
19036d5592j64010A12946b32491b801H4906R5432h5056k37333G3519J29776a46627
19024e9724a8047j70469j9965F5251A5319g4075q8869H5542b83360a04084B19186
19012a20427B08349F3615c61942G0351c71068B1119b16727M5126P4509A15620
19001A38539b68634b1976k69176I6908J71881A15762b76985f5887H4564j0814
18991G3750R4755R3774j07595b37056H3961d85565a12841b5321E2749j4402J15378
18980A53725c13538f4151B2144d03293h3790A16116J50641j02359L6258a47263
18969A68290H3370a01557b7505j940q9588b7730j46506a674H714h8549m2171q6715
$$ y = [334802, -99054, -273976, 261637, -144156, -207670, -56381, -36833, 348762, -210517, -3500, -45592, -209602, 112946, -232491, -2801, 84906, 180338, -85056, -322389, 73519, 203295, -146627, -59724, -18047, -188516, -208481, 65251, 15319, -74075, -162944, 85542, -283360, -104084, 219186, -120427, 208349, 63615, -361942, 70351, -371068, 21119, -216727, -171601, -97092, 115620, 138539, -268634, -21976, -291152, 96908, 268789, 115762, -276985, -65887, 84564, 73750, 168505, 262279, 154684, -237056, 83961, -485565, -112841, -25321, 52749, 38347, 153725, -313538, -64151, 22144, -403293, -83790, 116116, 266757, 164398, 200656, -147263, 168290, 83370, -101557, -27505, -29445, -119033, -27730, -174236, -1674, 8714, -88549, -130720, -217435]
18957b17435a2939j70057L4721H8254a89601b1002j8936A24e5033j58317A9910
18945A02421a8741F3598K29974C2838g862A36875i0461A9844P0362h4266F4789
18933A79439g779j88417P3128j12423e0274C4935i0837k97814B8853R6850B2056
18921b64947A05114a0117j98190B97469a91311D5158J8510C1772P4642B5031M2614
18910F7645N169a8073N824G7103k6173d7977l08198e3353B6371E332a97446C0879
18897C27308I7691b17100i148r0660k5147o1422Q530b3802A9566i8836d2257n7189
18885i9446K9370L71a3775A15868a66190r7968d3486D01433f5934I176d3939J5854
18873b8085l11893d0438l07563D2331K14575a79777F723f3221j68664K6371e298
$$ y = [-217435, -12939, -182996, -148275, 88254, -189601, -21002, -39938, 124, -55033, -213350, 19910, 102421, -18741, 63598, 293572, 32838, -7862, 136875, -90461, 19844, 90206, -84266, 64789, 179439, -7779, -196196, -123068, -235491, -50274, 34935, -90837, -388651, 28853, 125703, 22056, -264947, 105114, -10117, -208307, 297469, -191311, 45158, 63668, 31772, 106414, 25031, 67645, 72814, -18073, -12249, 77103, 50930, -47977, -356175, -53353, 26371, 5332, -197446, 30879, 327308, 97691, -217100, -9148, -99808, -124955, -186377, -177847, -23802, 19566, -98836, -42257, -99446, -70076, -69705, -13775, 115868, -166190, -264158, -43486, 401433, -65934, 9176, -43939, -28085, -339978, -40438, -348001, 42331, 256906, -179777, 6723, -63221, -231885, -205514, -5298]
18861c57572J22497e4366r4792O5773J5182A23109a3516k28634a13333j98778
18851c12111H2570c1752j81843d4451E8998b51401P4914J3683J8185e0481A78653
18839D0678a07288a0330l6343d861l04284M5470P0329B30839h7096A2483J71530
18828A84013Q9117c14725Q1333B28400c8247E4261a94778a7336B85649a69683
18817b50721A31094b13435A61138J41571b953A56598n4684J65929A01887i2646
18806a86104A72594J2129a03560l1007G5068a28061e6728k64006i4737k8389k510
18795a25636J8540I1070B1949a40433F3252a96304k98983a28757I4361a22337
18784A5324J54091E9959d3323n3908d897j41804J5382k57073J59726g6927r3241
$$ y = [-357572, -235075, -54366, -149158, -83385, -68203, 123109, -13516, -242150, -113333, -312111, 82570, -31752, -213595, -44451, 58998, -251401, -176487, -162804, -144619, -50481, 178653, 40678, -107288, -10330, -46673, -4861, -309145, -263675, -193346, 230839, -87096, 12483, 184013, 273130, -314725, -233392, 228400, -38247, 54261, -194778, -17336, 285649, -169683, -250721, 131094, -213435, 161138, 302709, -2953, 156598, 101914, 267843, 101887, -92646, -186104, 172594, 184723, -103560, -134567, 75068, -128061, -56728, -320734, -94737, -123126, -125636, -107096, 91070, 21949, -140433, 63252, -196304, -495287, -128757, 94361, -122337, 15324, 169415, 59959, -43323, -97231, -4897, -146701, -131319, -388392, -228666, -76927, -170168]
18773a70168j69815e4821C8745J45823b0523j03287a2451C01474F8815a00751
18762a62080A1594i7898j36101C8649a84364j66358c2197j65910A01312J093g2959
18750a77866A0095K39472b19079I4833b65421A99110L5685a59080C4211a31898
18739e037k43438A98948i8159K3241F6009a63529H2177d07242J30611G8854a05899
18727A35890a78797a2054E9013g319B4538b74214A65706J84313b48204a00470
18716b67922H6234J73383d3569A07142B6383a3570j90299l13550b728A28508b67174
18704A81271b87807e211o1430A23906P6648c9456A18348P1278d06504h2045a9254
18692A94505l1523O8842b7416B98314F3899a07539d5695A8343a9107B306a28238
$$ y = [-170168, -339983, -54821, 38745, 184568, -20523, -123810, -12451, 301474, 68815, -100751, -162080, 11594, -97898, -233999, 38649, -184364, -350722, -32197, -198107, 101312, 102405, -72959, -177866, 10095, 249567, -219079, 94833, -265421, 199110, 234795, -159080, 34211, -131898, -5037, -248475, 198948, -98159, -74918, 66009, -163529, 82177, -407242, -276631, 78854, -105899, 135890, -178797, -12054, 59013, -7319, 24538, -274214, 165706, 350019, -248204, -100470, -267922, 86234, 259617, -43569, 107142, 26383, -13570, -203869, -517419, -2728, 128508, -267174, 181271, -287807, -5211, -66641, 123906, 200554, -39456, 118348, 189626, -406504, -82045, -19254, 194505, 162982, 231824, -27416, 298314, 63899, -107539, -45695, 18343, -19107, 2306, -128238]
18680C43949j68458K22736d0546B9215J00126n9067J719a7495D0891R6045L4677
18669A71613b74000P4710A22140l8985P2162d01059A81881a04069M8111A50945
18658e00813A5185a47759N4140c099j03315G3823B3676c57000i9020n7994A66340
18646A60560g8696j18046k51751K24245B01903c65982A99436a66072f7865b7442
18635d66464a99766m4218K1988L013m3477C19347c952I085J07110a17120A77593
18623E459b20487b7933k40207A52188O3668c43872C4955g8184m2574I1383a25800
18611a61333p0881B74702o5040H086c09630g3858r4922E0845A2445L10371d2867
18599a92549Q5612m2430F9432a94579b4687k19249A33219c85384i8575j92247
$$ y = [343949, 175491, 398227, -40546, 29215, 129341, 70274, 71993, -17495, 40891, 136936, 171613, -274000, -199290, 122140, 83155, 155317, -401059, 181881, -104069, -55958, 150945, -500813, 15185, -147759, -93619, -3099, -106414, 73823, 23676, -357000, -99020, -157014, 166340, 160560, -78696, -196742, -448493, -224248, 201903, -365982, 199436, -166072, -67865, -27442, -466464, -199766, -243984, -221996, -218983, -262460, 319347, -3952, 9085, 116195, -117120, 177593, 5459, -220487, -27933, -268140, 152188, 215856, -343872, 34955, -78184, -120758, 91383, -125800, -161333, -232214, 274702, 209662, 8086, -309630, -73858, -168780, 50845, 12445, 322816, -42867, -192549, -106937, -149367, 69432, -194579, -24687, -243936, 133219, -385384, -98575, -290822]
18589b90822g0903O248b5799k06047j6854h7974k2180o9697M0261f2126p7154
18578a39280B22289a75518C9190f3674a8178j19384O963O1438H4037J68500e5484
18566c7492H9547d97907a7867j0141A26554a92476j06642A32565b2966k05764
18556b28730B06662b23647n6466a19839E8152r9i731j67739m634M8660G2616Q0490
18544A53106p2599b80613c7379o1668B4225P7735J37384c4824E4539d8303C1045
18532b86246E3201f7958p8204q6418m1103i2720A44724C3105D958a60237k69387
18521d29624a30297d2137C13761C1120c3768j81987A39791h9722k80037a44633
18510b00675R5534l620r785E7821L1010C5868K25647m9585a2517j71692c0295
$$ y = [-290822, -70903, -64655, -25799, -231846, -248700, -87974, -110154, -179851, -139590, -62126, -139280, 222289, -175518, 39190, -63674, -18178, -137562, -130599, -69161, 84037, 252537, -55484, -37492, 89547, -497907, -17867, -28008, 126554, -192476, -299118, 132565, -22966, -228730, 206662, -223647, -280113, -119839, 58152, 58053, -9731, -177470, -182104, -133444, 72616, 153106, 80507, -280613, -37379, -99047, 24225, 101960, 239344, -34824, 54539, -48303, 31045, -286246, 53201, -67958, -146162, -232580, -273683, -92720, 144724, 33105, 4958, -160237, -429624, -130297, -42137, 313761, 31120, -33768, -215755, 139791, -89722, -369759, -144633, -200675, -105141, -108761, -118546, 57821, 88831, 35868, 261515, 211930, -12517, -184209, -30295]
18498b41264a08701J2526b9952B51869d4660E6456b61359K1568A07580C3141a80726
18486h3336A2418J27262H059O9409J00084c27199b8880k27526i8244m4960a7937
18474a81010Q7737e267A3359M04281E7747a92845K3282c0998l12052F2635K55865
18463C18500b89217J33635f7444J6876J3609j13968b5759G5341J10978d58127
18452B9030J0913Q428P0456J51731d3915o1749A91566l6066a44879N4391k54891
18441c45379c2547l1154j3449L1897b2197A12541J6921J95039H6933K14406I0760
18429i8133I8423A2186J22401b56012A4972h6310j3968m10067i4803r0203d9723
18417I3248d11399c7444F628o40b07881A63523g9005p5213A21966c91231h5123
$$ y = [-241264, -108701, -96175, -29952, 251869, -44660, 56456, -261359, -239791, 107580, 33141, -180726, -83336, 12418, 139680, 8059, 77468, 177552, -327199, -28880, -256406, -98244, -143204, -17937, -181010, -93273, -5267, 13359, 417640, 57747, -192845, -169563, -30998, -343050, 62635, 318500, -289217, -155582, -67444, -50568, -36959, -150927, -25759, 75341, 186319, -458127, 29030, 39943, 48371, 118827, 270558, -43915, -105664, 191566, 155500, -144879, -90488, -345379, -32547, -63701, -77150, -45253, -22197, 112541, 129462, 324501, 86933, 301339, 90760, -98133, 98423, 12186, 134587, -256012, 14972, -86310, -100278, -510345, -94803, -185006, -49723, 93248, -411399, -37444, 6628, 5988, -207881, 163523, -79005, -154218, 121966, -391231, -85123]
18405I1806O4551o454B7504K3191b59176A38363a16709m9181d4761F2547A9694
18393A92259a06811B9418g1091K2710A54823a66089g6837j90881b8348m655m6845
18382g9848B83233i4260j96377h6833j31145g6125H4425K95364A46802K69643
18372D16445a96028A31365M9804J25769F3177g08l33538d2882C1942a14209H2279
18360d48529A06763g2144j34828L1754C39199k5752j47103b77229F3503A5595
18349a22666B16474a26470D6847a0456A94181B801b7930A0979O8432h5515j18568
18338b04083b5519r6512o9677F8564b95222F0407a04231A48185l3744c08846b5829
18326c82338C28535G4182R0759b44147N7156A16609b20666k25874J16484a33869
$$ y = [91806, 156357, 149903, 27504, 50695, -259176, 138363, -116709, -165890, -44761, 62547, 19694, 192259, -106811, 29418, -71091, -48381, 154823, -166089, -76837, -267718, -28348, -33003, -79848, 283233, -94260, -290637, -86833, -217978, -76125, 84425, 379789, 146802, 416445, -196028, 131365, 181169, 306938, 63177, -708, -334246, -42882, 31942, -114209, 82279, -448529, 106763, -72144, -206972, -175218, 339199, 313447, 166344, -277229, 63503, 15595, -122666, 216474, -126470, 46847, -10456, 194181, 2801, -27930, 10979, 79411, -85515, -204083, -25519, -122031, -191708, 68564, -295222, 60407, -104231, 148185, 114441, -308846, -25829, -382338, 328535, 74182, 164941, -244147, -186991, 116609, -220666, -446540, -330056, -133869]
18315A28396i4760p4779N6553A49311g7355f304I8938Q7199a25466I4154J47648
18304B41802j07764b57099f5746A95917q4327h4247A23441f0785r6612k09339
18294c66736B49061F5650b48409f3340o701D49283c8331j67721o78J8787A68986
18282B91750i5692b9431B03736B5817b28036H2133J17853m7577e3583F2062h7195
18270A69594f4245H0009K4031b38101L6053a1626j77508e6409A16369K23156G7468
18258d4552q0280k53900A28501d747j66540A79313F6265Q7045A2405a74335Q4992
18247h9343C36106a32834E8636J02072c02323a47503K5704j78593B47721c13866
18236a45345b492j66818I6267m3615b32861J3533j39621d6963C31404A43239l6108
$$ y = [128396, -94760, -169539, -112986, 149311, -77355, -6304, 98938, 186137, -125466, 94154, 241802, 134038, -257099, -65746, 195917, 111590, -84247, 123441, -60785, -157397, -366736, 249061, 65650, -248409, -63340, -70041, 449283, -38331, -206052, -206730, -187943, 168986, 291750, -95692, -29431, 203736, 25817, -228036, 82133, 199986, 152409, -53583, 62062, -87195, 169594, -64245, 80009, 104040, -238101, -202048, -11626, -189134, -56409, 116369, 339525, 77468, -44552, -124832, -378732, 128501, -4747, -171287, 179313, 66265, 153310, 12405, -174335, -89343, 336106, -132834, 58636, 160708, -302323, -147503, -121799, -300392, 247721, -313866, -145345, -2492, -169310, 96267, 52652, -232861, -219328, -358949, -46963, 331404, 143239, 107131]
18225A07131c7710C6593a10684A53759a08962B20937j01662m6381l5602J46319
18215A83611a35582G6158F385L9529c63252e0761n8469A23320J1168M1773i2940
18203I0536e602k05206N3423C51939b18051C9387e1689D2633b52521j657a2610
18191b5055Q602r0808K8020q9853K7199A37713C8783J11851a9188k16016n757
18180b40961R7672B56997R7279F9305b64545F5737J54018a40288K0655G2614a38319
18168a62336g8011I100a16260p3761L4821g688B89563b78980c9280k6006J5198
18157e0088A4785K68235c8098A6048J12759a49062K3478D6433b51306F8003B7270
18145b082B8682c80584C39855h6396q1376B92506L2564a53196A09140E2314b68664
$$ y = [107131, -37710, 36593, -110684, 153759, -108962, 220937, 119275, 72894, 37292, 183611, -135582, 76158, 6385, 45914, -363252, -50761, -109230, 123320, 134488, 176261, -92940, 90536, -5602, -210808, -157385, 351939, -218051, 39387, -51689, 42633, -252521, -254178, -12610, -25055, -16453, -107261, -79241, -169094, -141895, 137713, 38783, 150634, -19188, -235204, -240961, -143289, 256997, 354276, 69305, -264545, 65737, 219755, -140288, -119633, 72614, -138319, -162336, -78011, 9100, -116260, -190021, -155200, -7688, 289563, -278980, -39280, -65286, -50088, 14785, 283020, -38098, 16048, 128807, -149062, -125584, 46433, -251306, 68003, 27270, -2082, 28682, -380584, 339855, -86396, -167772, 292506, 325070, -153196, 109140, 52314, -268664]
18133a07061r2519i4224B40141a16328I6130c00128I1151J3201a36219K3457A08091
18121h6054p5084m3106D5035A2775L84902a8409j69131A08838e6159H3470b43507
18109H6838i8140A19752c59209G5c43764E6743M0571i9203C06225p1585J72308
18098D06948d8552q6423M4441b6356A0926a54856A04194a9742D0542J98241a42650
18086a10077D00374A76718a20433N7381q6888M2731b0971j13846M8511j02169
18076a88475a0301n9380p3215H9752K4429b14083A43344P15a20952m1706j02774
18065b65432B24249a76232f4178m2080E1930a87236D51979j72086G6540b988A03168
18053a31411B8895b85781A82666H7540c14966A34619E7447A7279j29a78339G1105
$$ y = [-107061, -199580, -94224, 240141, -116328, 96130, -300128, 91151, 104352, -136219, -112762, 108091, -86054, -161138, -204244, 45035, 12775, 397677, -18409, -187540, 108838, -56159, 83470, -243507, 86838, -98140, 119752, -359209, 75, -343764, 56743, 97314, -99203, 306225, 234640, 406948, -48552, -134975, -90534, -26356, 10926, -154856, 104194, -19742, 40542, 238783, -142650, -110077, 400374, 176718, -120433, -63052, -149940, -107209, -20971, -134817, -86306, -188475, -10301, -69681, -142896, 89752, 114181, -214083, 143344, 144059, -120952, -162658, -265432, 224249, -176232, -64178, -106258, 51930, -187236, 451979, 279893, 76540, -2988, 103168, -131411, 28895, -285781, 182666, 87540, -314966, 134619, 57447, 17279, 17150, -178339, 71105]
18041A28150a34053j14428a059j66972O9393f379j12626I918c5027F7678b75171
18029B30800a94621H8719C3311A2222J6243b85651B9354K6535a03678A7766a07077
18017b59804d8168j15404o3286b2385j24815D01041a18637j20803J03510B06862
18006a81497A46752M2188e6900j92022J04206j60127k47064g9808A89469a42911
17995c8186C45973b94028a36870c9607A82690n9501a25337A98423a06175D5671
17984A16304a02982e22m9580A49897B2298M3675N1613L25120B5781a36591j07835
17973b44426J17473c9213a685G1989A9825e6620p958B96862K7186A34421a98A02228
17960a57817I5L9101a10235A44487a90137G0592j0799R1094b50430O5720Q4763
$$ y = [128150, -134053, -248481, -1059, -168031, -98638, -6379, -119005, 9918, -35027, 67678, -275171, 230800, -194621, 88719, 33311, 12222, 28465, -285651, 29354, 55889, -103678, 17766, -107077, -259804, -48168, -163572, -226858, -22385, -147200, 401041, -118637, -239440, -135930, 206862, -181497, 146752, 188940, -56900, -248922, -144716, -304843, -551907, -79808, 189469, -142911, -38186, 345973, -294028, -136870, -39607, 182690, 123189, -125337, 198423, -106175, 45671, 116304, -102982, -522, -50102, 149897, 22298, 65973, 117586, 442706, 25781, -136591, -244426, -126953, -39213, -1685, 71989, 19825, -56620, -64578, 296862, 324048, 134421, -198, 102228, -157817, 95, 39196, -110235, 144487, -190137, 70592, 59793, 150887, -250430, -184710, -99947]
17949i9947B00205A3610J96210a34817A19910k6686M906J75414a39563C6401K8903
17938F5304K22963G2838B7440g6882C58576a59635A74757J25855j04045a89338
17927B30870c12150A00222h5073L2999n596b5882D218K21068a3704A34970d1537
17915c11779h6001A74082a37335A67570F2996a03413M6948I2811A6862c6063j58114
17904a94177R0772p4146n5580P0176A07767J3117d5477j85225f6054m5471A62988
17892B35651p9298C3335b00722l1064B60625b74378b9122l00169B07439c8899
17881b41508B9735h2821r7835d6238P969k4345B52827h5311m7583B58864I1569
17869A06055J62067G7193a25762a6329j8083B6373d2904B27582i5592D7899c4854
$$ y = [-99947, 200205, 13610, 209820, -134817, 119910, 93224, 98130, 273544, -139563, 36401, 65304, 288267, 72838, 27440, -76882, 358576, -159635, 174757, 300612, 196567, -189338, 230870, -312150, 100222, -85073, -52074, -57670, -25882, 4218, 225286, -13704, 134970, -41537, -311779, -86001, 174082, -137335, 167570, 62996, -103413, -56465, 92811, 16862, -36063, -194177, -103405, -177551, -233131, -162955, 107767, 120884, -45477, -230702, -66054, -111525, 162988, 235651, 156353, 33335, -200722, -231786, 260625, -274378, -29122, -329291, 207439, -38899, -241508, 29735, -82821, -180656, -46238, -38269, -62614, 252827, -85311, -132894, 258864, 91569, 106055, 268122, 77193, -125762, -16329, -34412, 26373, -42904, 227582, -95592, 47899, -34854]
17857e9424C18795e9025l69506A51628R6740P426a34692A03127J08059O6343j9855
17846B57674b7265j9491J2090F1840c22703B8247a54043k21569A9507M8663a92767
17834B02982b7685m8846A48515D3844j2763j0056J23457f585G4233k2972q259
17823D3002a10647M7545A68619m7551f6377C18085r9274a06890Q52N1806B4516
17811B57374E9369K08397b9538G0460J08466D7105J18768J09825a89497B04761
17800h8779B71092H9121c23198a43216H299c32420J65588F0504b04736A63269
17789D56650A9287J02593E4361j6193a29155a5082A22233k5489b2913A15781D2002
17777A57389b3681j43900H5260J08856m9921F2573J54080h6812E775K65027g996
$$ y = [-59424, 318795, -59025, -428531, 151628, 248368, 255794, -134692, 103127, 211186, 277529, 257674, -27265, -46756, -34666, 61840, -322703, 28247, -154043, -375612, 19507, 68170, -192767, 202982, -27685, -76531, 148515, 43844, 31081, 21025, 144482, -6585, 74233, 51261, 43002, -110647, -63102, 168619, 121068, -66377, 318085, 218811, -106890, -106038, -54232, 24516, 257374, 59369, 267766, -29538, 70460, 178926, 47105, 165873, 275698, -189497, 204761, -88779, 271092, 89121, -323198, -143216, 8299, -332420, -166832, 60504, -204736, 163269, 456650, 19287, 121880, 54361, 38168, -129155, -15082, 122233, 96744, -22913, 115781, 42002, 157389, -23681, -167581, 85260, 194116, 144195, 62573, 216653, -86812, 5775, 270802, -7996]
17765B14008Q4130b67108F5684J76085E7419a54395b9700G674c6952N282j50319
17754a81989A959j30J71957J47645C7751e039B47840B9719c07958A77543K03889
17743C81432h3733H2594k318a14054A07123b18543A01029a73347A06413K46671
17733C53084j32688R345Q8007D1537i3786A31700K2614p4974i027j30879B23540
17721A21167J19794a5682H0560J07303J04484j17002L06864b32752B19614h7400
17710A89498g4509C84758E8449J0017J5193C9989a47822K9804j8235J6611j49049
17699b68691f4152D7682i0839d4581j01716E1859J31743I619b76475c9118D39533
17687a6937A97703i8748A17327f763D04270A87266a54929O9879A42220M01561
$$ y = [214008, 298138, -267108, 65684, 241769, 57419, -154395, -29700, 7674, -36952, -31670, -181989, 1959, 1829, 173786, 321431, 37751, -5039, 247840, 29719, -307958, 177543, 381432, -83733, 82594, 80276, -114054, 107123, -218543, 101029, -173347, 106413, 353084, 220396, 229741, 317748, 41537, -93786, 131700, 154314, 79340, -9027, -139906, 223540, 121167, 240961, -15682, 80560, 187863, 292347, 175345, 482209, -232752, 219614, -87400, 189498, -74509, 384758, 58449, 68466, 83659, 39989, -147822, -118018, -136253, -119642, -268691, -64152, 47682, -90839, -44581, -146297, 51859, 183602, 9619, -276475, -39118, 439533, -16937, 197703, -98748, 117327, -6763, 404270, 187266, -154929, -85050, 142220, 543781]
17677E43781B16090F0841a74981B79811A28667Q1450g032j2496r9121L7468B6926
17665A75597b1497A95275B3681R4359c9966A12041a88426b2968r2400n3703A18088
17653H4892c8902j12027g3138E4233a04718j08539p2637B38116q5978K0355a84607
17641H0793d12700f4183B10284b09050c0889j41288a4060O49n2091B62353c6471
17629G7809J53272A7705K889J50235o6123m3831K13673n0393d8909j70407H5208
17617D9603K57508F120a10044B62249K6323j13559G1342J15667q9275g1921A64428
17605C3930J50619L2478a79m9317m7550B05134a40352L5824k398H6104K3525k7038
17593H2591B3291K80722j25109N3502e8156A49927K7212A0958K616c8078A16141
$$ y = [543781, 216090, 60841, -174981, 279811, 128667, 210117, -7032, -19528, -118649, -81181, 26926, 175597, -21497, 195275, 23681, 118040, -39966, 112041, -188426, -22968, -115368, -169071, 118088, 84892, -38902, -150929, -73138, 54233, -104718, -213257, -285894, 238116, 152138, 172493, -184607, 80793, -412700, -64183, 210284, -209050, -30889, -172177, -14060, -13411, -65502, 262353, -36471, 77809, 231081, 17705, 20594, 170829, 104706, 60875, 274548, 224155, -48909, -219316, 85208, 49603, 307111, 6120, -110044, 262249, 288572, 175013, 71342, 187009, 97734, -71921, 164428, 33930, 184549, 217027, -179, -49496, -97046, 205134, -140352, -104528, -106926, 86104, 109629, 82591, 23291, 304013, 178904, 232406, -58156, 149927, 177139, 10958, 13574, -38078, 116141]
17581a07729L6284E3192c63856G7622e5532D55623j94449I5923J03016j4075K1472
17570B06336a01676B12203E6991b6312D7249a0641k25014C45574A14184M0706
17560A54890C0330K27792M3114l3561m7875p0504e3354A59453o5437J15288p6747
17549A32557E8516J28672l4978n1391j3524a45573A2854K04400C9925c26181A23514
17537f8855b0891m9324p7767b5999B00884a21376e3549I7019a9405q0812C2105
17525A08763a15801A64474j051D1535O21905A05189L20849j48244q0595H3629
17514A79603n9340O8971G2241a9604H5984D707J21813J16894O981J45078A6989
17502E03383j81342K0226C9709J78911h0781A47449J33136B3797K74748j37246
$$ y = [-107729, -71445, 53192, -363856, 77622, -55532, 455623, 261174, 95923, 198939, 184864, 206336, -101676, 212203, 56991, -26312, 47249, -10641, -235655, 345574, 114184, 154890, 30330, 258122, 301236, 267675, 219800, 149296, -53354, 159453, 94016, 209304, 132557, 58516, 187188, 152210, 100819, 87295, -145573, 12854, 217254, 39925, -326181, 123514, -68855, -20891, -70215, -147982, -25999, 200884, -121376, -53549, 97019, -19405, -100217, 32105, 108763, -115801, 164474, 163423, 41535, 663440, 105189, 426038, 277794, 197199, 83629, 179603, 120263, 189234, 72241, -19604, 85984, 4707, 126520, 243414, 250395, 395473, 16989, 503383, 322041, 342267, 39709, 218620, -80781, 147449, 280585, 23797, 298545, 161299]
17492A61299p3519N2247m9896Q034K28163E973K14093m31j07361R9212J04523
17481C16009B3893M97035B1520b22896B97205H889h4393B41855n9397a05418D04136
17469A76154F9406K94683h8581A88556k6747G6574a84427A40533P0751l9628N5881
17458B27537b65145A44193o9334J4060j1692a12448C09180j8427n1965H2087K63939
17447C46026A57624F3009j2379K19506a25522A19430J81984M0306j11125f6475
17436C3974J26393J47383p0200l6947H9125b17154f4054A57917O8574A02395M4220
17425A46615J41316n5154E821a1337C79637L963a29983C79614c507j29979B02485
17413E5164d9106G1403J18144E8673a15347a1401j75872A51451K43351j87868
$$ y = [161299, 87780, 140027, 90131, 98165, 326328, 5973, 220066, 219635, 112274, 211486, 316009, 23893, 520928, 21520, -222896, 297205, 8889, -84393, 241855, 182458, -105418, 404136, 176154, 69406, 364089, -88581, 188556, 161809, 76574, -184427, 140533, 211284, 171656, 227537, -265145, 144193, 74859, 88919, 77227, -112448, 309180, 290753, 238788, 82087, 346026, 157624, 63009, 50630, 270136, -125522, 119430, 301414, 341720, 230595, -66475, 33974, 160367, 307750, 237550, 200603, 89125, -217154, -64054, 157917, 226491, 102395, 146615, 287931, 232777, 5821, -11337, 379637, 383600, -129983, 379614, -3507, -133486, 202485, 55164, -49106, 71403, 189547, 58673, -115347, -11401, -187273, 151451, 394802, 206934]
17403B06934C6542O9297k4848O9950l3462M4835p6252e570k9154A32264J8420
17392A50684b61555C12378J3017b05906a5927F6149P9612D6011K19511j09792
17382A55730l349k744k530f6127H4299J80924m4825C3925J59478E7503L68337
17371D25840A71981F3135J06200a238q7692A15642a49553B09249k5702P2989j4564
17360B41972M0194p5044q1589L7620L5981J11943F9227J61154A04621l4727P0281
17349A40175q073L87825q28E7219e7636q7517C11774B0045J0055A1755K8345i4013
17336C34699A11181c898B88844j31015O4474o3901l8084J32261G7053N3629K29928
17325C60610j71562n6195b18032A82019J55483j54038J14221a47119C79439B4197
$$ y = [206934, 36542, 105839, 80991, 150941, 117479, 162314, 86062, -5570, -34724, 132264, 150684, -261555, 312378, 325395, -205906, -15927, 66149, 145761, 46011, 265522, 155730, 152381, 149637, 147107, -66127, 84299, 265223, 220398, 33925, 193403, 57503, 425840, 171981, 63135, 169335, -1238, -88930, 115642, -149553, 209249, 183547, 256536, 241972, 282166, 207122, 125533, 163153, 199134, 311077, 69227, 230381, 104621, 69894, 140175, 132102, 519927, 519099, 57219, -57636, -145153, 311774, 20045, 30100, 11755, 40100, -94013, 334699, 111181, -3898, 288844, 157829, 222303, 158402, 120318, 252579, 77053, 130682, 360610, 189048, 132853, -218032, 182019, 337502, 183464, 297685, -147119, 379439, 24197]
17314f9535D88734A96655K08579j17086A22848J20845J01417j68210J14099r4545
17304A96454f948B34715G6753R1805L5777F5721K34031A1976K49417D9971M34696
17293D84667k08131r0095a71860F8036K11241R8257a34138A76598a04719B39918
17282B88243j10030R5621D044M7917O8053O0245A4683N94806B16695C7117L20792
17271C57909j17696J02910p6848o2695a33287a9744C75070A25993a40328A43649
17260D9014a66333A18396M0724a00447I0792a41408B41591q5887a4986A70502
17249C97471j91788g9991F9376J06070g2223C08167A42301K82885r1151E4924
17238D53811j33559q5861J14936m2736C0083J36137l1078n1748J35625K6458n8659
$$ y = [-69535, 488734, 196655, 405234, 288148, 122848, 243693, 345110, 176900, 290999, 196454, -6948, 234715, 76753, 168558, 204335, 65721, 299752, 11976, 261393, 49971, 484667, 276536, 186441, -171860, 68036, 279277, 377534, -134138, 176598, -104719, 239918, 288243, 178213, 273834, 4044, 51961, 120014, 180259, 14683, 609489, 216695, 37117, 357909, 240213, 343123, 266275, 203580, -133287, -19744, 375070, 125993, -140328, 143649, 49014, -166333, 118396, 159120, -100447, 90792, -141408, 241591, 155704, -14986, 170502, 397471, 205683, -79991, 69376, 175446, -72223, 308167, 142301, 425186, 334035, 54924, 453811, 320252, 234391, 349327, 306591, 30083, 166220, 135142, 83394, 219019, 245477, 186818]
17227A86818E9398J18909c5095A77651J00440N3074A42494k8847P6165J05220
17217B95032a9526B95765o6818J09038r2941j02359a61758B70125K01471C5344
17206C23290O0476j86134k2869a37753e0733A44024M76827k88626G4584k3852
17196E0732L18809j67712O3928n8386k8425n7141J49767J24220l0124A21600O1227
17185A82827K59585N6764I4316J73722r861L9363A35024J47185J25412j46160
17175B61461A1143b9778B46657Q2641E6925C409K70010G7725J36475K14300j18311
17164C10189J63797B17439L1736J22144o6359F7067A4436K44593g7173e802n5670
17153f1472B52662M18406R546n1110A12123m1427P5650r016J39890M7873I6773
$$ y = [186818, 59398, 178307, -35095, 177651, 278091, 331165, 142494, 113647, 189812, 295032, -19526, 295765, 228947, 337985, 245044, 142685, -161758, 270125, 471596, 35344, 323290, 383766, 197632, 174763, -137753, -50733, 144024, 620851, 332225, 74584, 50732, 369541, 201829, 265757, 207371, 178946, 121805, 271572, 395792, 365668, 121600, 182827, 442412, 499176, 94316, 268038, 258177, 297540, 135024, 282209, 407621, 261461, 11143, -29778, 246657, 329298, 56925, 3409, 273419, 77725, 214200, 428500, 310189, 473986, 217439, 249175, 371319, 304960, 67067, 14436, 259029, -77173, -5802, -61472, 252662, 671068, 680614, 629504, 112123, 70696, 146346, 137330, 277220, 325093, 96773]
17141B43053L01929I8533K63447O4180A34151J23245D3525M12238I3734K27303
17131C21037p5508J06698m742n0520n5742L37776B64308P595P4609M49232b43935
17119B17506R513a4375A78188A8747M77127j34958q0411n8002M73973B81151L961
17108B85112K51381B24510J53021J96434p8002j42725o2347J07812C8573L30616
17098C69189o1529N868j22967F5003J14236N9076L0403O9162J1080K4281a21507
17086E35795j61390R8298p2258L037J30461l947k42006K01560j9239B33879P7097
17075C10976Q8049F5559K79076l0510a0398E85326p0954J87999j71394J4037n3719
17064D91295J26384k90920A06671M60197k57263N8328P7731j29680J55324K39107
$$ y = [243053, 544982, 98533, 361980, 426160, 134151, 257396, 43525, 455763, 93734, 321037, 245529, 352227, 347485, 296965, 241223, 578999, 264308, 271903, 346512, 795744, -243935, 217506, 227019, -14375, 178188, 18747, 495874, 360916, 280505, 222503, 696476, 281151, 285112, 536493, 224510, 377531, 573965, 495963, 353238, 290891, 398703, 38573, 369189, 307660, 313528, 190561, 65003, 179239, 238315, 268718, 337880, 348960, 373241, -121507, 535795, 374405, 472703, 400445, 403482, 533943, 529996, 287990, 489550, 470311, 233879, 310976, 399025, 65559, 344635, 314125, -10398, 585326, 514372, 702371, 530977, 545014, 491295, 617679, 326759, 106671, 566868, 309605, 367933, 445664, 315984, 471308, 710415]
17054G10415J60395l41573B29516N40515j53380P3728k35971j39667K6612J31244
17044D72597K30276C41902J12203K19332A35023M28159j10172j20143J69087J6898
17034E18852j20410j55834K58973P6089j10226K77534l4473l52848J43738K9542
17024E30937j11826M3090K715n4128P2605J19236M17463l67267k38661M26709
17014H40873D02075L04120m1436k86702J33382L18166j18725J76218j95869K12981
17004I04210l61415q7306O31859m92591J00700l8625J64013k15049K61978j84484
16994F83290J19287L8234k15466Q440K9855j77843J51870p7003L02120P7805J43022
16983A083611k44995K53596l38842k35925M87086n780k11344p1044K31317k81134
$$ y = [710415, 870810, 529237, 229516, 770031, 616651, 690379, 454408, 314741, 341353, 472597, 702873, 341902, 454105, 673437, 135023, 563182, 453010, 332867, 501954, 518852, 398442, 242608, 501581, 577670, 467444, 744978, 710505, 357657, 501395, 530937, 419111, 462201, 464916, 410788, 483393, 602629, 1020092, 652825, 414164, 840873, 402075, 706195, 664759, 378057, 511439, 829605, 710880, 887098, 691229, 904210, 542795, 455489, 1087348, 594757, 695457, 656832, 820845, 605796, 867774, 683290, 802577, 840811, 625345, 633785, 663640, 485797, 637667, 560664, 862784, 940589, 1083611, 838616, 1092212, 753370, 517445, 1004531, 998751, 787407, 716363, 947680, 666546]
16973F66546L2076R8616P0974J23251j43803K37478j53983N1236j26954m06185
16963D49252M96065J2137K8745j46834j03490R28K78966J85325j01290o7198j15064
16952I17542K16160k3266m4012j77275K85288J26335j59588R1322j52789L29550
16942A409267m04602M14040q1575j38410k68271J321M06029P3168j36668J50052
16932A424351k70869R912J73723o1833P388J40681k54678K14377j1069j96425
16922A175558q6601M54705j36656R0885K62883l90120J51045L4117l08576K86474
16912A533714j19669J99610j08269N9533J77497O398l7574n7790J38018J47861
16902A939329l24569R8035R4299j85550Q1418K0131R8137j13513K83062k34074
$$ y = [666546, 698622, 797238, 868212, 991463, 847660, 1085138, 931155, 982391, 855437, 449252, 945317, 957454, 986199, 839365, 735875, 736803, 1015769, 1201094, 1099804, 1032606, 917542, 1133702, 1110436, 1066424, 889149, 1174437, 1300772, 1141184, 1232506, 1079717, 1409267, 1004665, 1418705, 1337130, 1198720, 930449, 931770, 1337799, 1410967, 1274299, 1424351, 1153482, 1163394, 1337117, 1275284, 1282672, 1423353, 1168675, 1383052, 1371983, 1175558, 1088957, 1543662, 1407006, 1497891, 1760774, 1370654, 1521699, 1555816, 1247240, 1533714, 1414045, 1613655, 1505386, 1564919, 1742416, 1748814, 1711240, 1653450, 1791468, 1939329, 1614760, 1712795, 1807094, 1621544, 1702962, 1723093, 1821230, 1707717, 1990779, 1756705]
16892A756705K76400J6847K51620q2405O4185l29059M4415L53385l28689L75342
16882B398746j22452k02138L44034l1330N3735K5619K84591j04510R137m1013
16872B614419Q4998n6968j0673K61123J8882K99750k57473Q4363p7229N37201
16862C498393j41297L7573O580J24984j03648R5238k46976M62654N1564k53155
16852C531910L93443J54758j45950K17046J38532k20441K56338J19442k1460K21133
16842D644751J43267k11911M41273J9579K20406r3949K415M47578k4279j1965
16832E577165K50170J78862j18908J20381l8409M85125J6156L0319M50083J89239
16822G140183l66600O67179L50436J38276k77288L45721N68843L18158q8636L38444
$$ y = [1756705, 2033105, 2049952, 2301572, 2219167, 2283352, 1954293, 1998708, 2352093, 2023404, 2398746, 2276294, 2074156, 2418190, 2386860, 2440595, 2466214, 2750805, 2646295, 2655432, 2614419, 2699417, 2642449, 2631776, 2892899, 2911781, 3211531, 2954058, 3038421, 2961192, 3498393, 3357096, 3394669, 3401249, 3526233, 3422585, 3517823, 3270847, 3733501, 3785065, 3531910, 3925353, 4080111, 3934161, 4151207, 4289739, 4069298, 4325636, 4445078, 4423618, 4644751, 4788018, 4576107, 5017380, 5036959, 5257365, 5163416, 5165831, 5613409, 5589130, 5577165, 5827335, 6006197, 5887289, 6007670, 5969261, 6454386, 6470542, 6500861, 6950944, 7140183, 6773583, 7440762, 7791198, 7929474, 7652186, 7997907, 8566750, 8884908, 8796272, 9134716]
16812I134716l23079P52322M08172R4736L28789K85654J55682M87019K26055M84250
16802A2034316L45332j31218M92189O11896N81707K43320K88168L88348Q23839
16793A5677897N49415J96212R55811L46556K84102P16418O32865M54051J035470
16784B0848797M94668J026640P34257O88151J034893Q24236J084404Q29734J252020
16775B8817800R75633J134816J547584R85023J267148J421516J658277J727712
16767C9535509J632083J380698K076386K157446K032638J885969K514487K147180
16759E5362396K557300K311668L171213K471811K737118L197751L056393L438266
16751G8303916L314668L421022L673794L623509L500660L422934L879427L278502
$$ y = [9134716, 8811637, 9563959, 9972131, 10066867, 10395656, 10681310, 10836992, 11324011, 11550066, 12034316, 12379648, 12248430, 12740619, 13352515, 13934222, 14177542, 14465710, 14854058, 15677897, 16227312, 16423524, 17379335, 17725891, 18009993, 18726411, 19359276, 19813327, 20848797, 21343465, 22370105, 23104362, 23792513, 24827406, 25651642, 26736046, 27565780, 28817800, 29793433, 30928249, 32475833, 33460856, 34728004, 36149520, 37807797, 39535509, 41167592, 42548290, 44624676, 46782122, 48814760, 50700729, 53215216, 55362396, 57919696, 60231364, 63402577, 65874388, 68611506, 71809257, 74865650, 78303916, 81618584, 85039606, 88713400, 92336909, 95837569, 99260503, 103139930, 106418432]
16743A06418432L509493L285329L069169K912161K674172K182067J948825J626019
16735A27625667R81758J094455M00683m10983p41321n21911j765673j458312k227903
16726A22976460k495447k994186k587669l226095l310468l213321l444010l245347
16718I8459917l592254l127151l449765l528480l537522k937345l301858k687176
16710G2298366l236874k553203k876510k347201k494893k601069k054713j977971
16702E2155932k135712j924529k076605j618945j744056j232231j886410j505804
16694C8031640j385897j018719j473988j448564p90602j351605q16815j330829
16686B8414621r88049q59891q67317p11962n54405q56588j028963m96551p20774
$$ y = [106418432, 109927925, 113213254, 116282423, 119194584, 121868756, 124050823, 125999648, 127625667, 128607425, 129701880, 130102563, 129691580, 128950259, 128428348, 126662675, 125204363, 122976460, 120481013, 117486827, 114899158, 111673063, 108362595, 105149274, 101705264, 98459917, 94867663, 91740512, 88290747, 84762267, 81224745, 78287400, 74985542, 72298366, 69061492, 66508289, 63631779, 61284578, 58789685, 56188616, 54133903, 52155932, 50020220, 48095691, 46019086, 44400141, 42656085, 41423854, 39537444, 38031640, 36645743, 35627024, 34153036, 32704472, 31913870, 30562265, 29745450, 28414621, 27426572, 26566681, 25699364, 24987402, 24432997, 23576409, 22547446, 22050895, 21330121]
16677B1330121p17349o25437m73659n89754p86500l65560m12732p12878k85569
16668A6360683k96302m98243o81856j89361n03555n02438m21976k4109l97241
16659A2845602r2672k82440n29896n10793j8480o67871l36618r3598p0977j96202
16649A0046055j85106l17128l74096k75869L87059q98423j28383L01467m92322
16640H063254K65578m74440m81927M9495j81904l5575p1425j32554n1983l87814
16630F560705K58j76865K00933l56847q7475m47813l1777j4795k58734P282L61718
16619E756590n71600P8871m1798j46556k74219K00140l67128K43000k76194r9333
16609D501773l94834K02939k12281K10640j34437K82438l24190r2045j86885j40573
$$ y = [21330121, 20612772, 19987335, 19513676, 18923922, 18137422, 17771862, 17359130, 16646252, 16360683, 16064381, 15566138, 14884282, 14694921, 14191366, 13688928, 13266952, 13242843, 12845602, 12752930, 12470490, 11940594, 11429801, 11411321, 10743450, 10406832, 10313234, 10242257, 10046055, 9860949, 9543821, 9169725, 8893856, 9280915, 8382492, 8254109, 8555576, 8063254, 8328832, 7854392, 7372465, 7421960, 7240056, 7204481, 7133056, 7000502, 6948519, 6560705, 6560963, 6384098, 6585031, 6228184, 6140709, 5692896, 5661119, 5646324, 5387590, 5394872, 5756590, 5184990, 5263861, 5222063, 5075507, 4801288, 5001428, 4634300, 4877300, 4601106, 4501773, 4106939, 4309878, 4097597, 4308237, 4173800, 4456238, 4132048, 4040003, 3853118, 3712545]
16599C712545K43251k80514K58127k55672n3740N5959m42829j6847K88566l10748
16589C198098J6359L5508j18204N44472n17998o8133k19223J61961o7168l8332
16579B927340l05009m1641K16844k05237L3480j41602M07131k13664j61012K78483
16569B795113m49073j56701L66534j431l30046K0557J96961J42957m85179P5269
16559B174961J08930K1397j82516J71685j55118n6150k79021L85467n557P3479
16549B257557j29018k36624J3334o9985M10874n03179J2068J07184J42893j46790
16539A858314p7718L12305n2054o7030j20149J34937j29025j36321J06165r0449
16529A738975k75941M85541r4695J15697k93620J59494l16623n8458L17287j03684
$$ y = [3712545, 3955796, 3675282, 3933409, 3677737, 3623997, 3679956, 3237127, 3220280, 3508846, 3198098, 3214457, 3249965, 3131761, 3676233, 3158235, 3090102, 2870879, 3032840, 2965672, 2927340, 2622331, 2580690, 2797534, 2592297, 2625777, 2484175, 2891306, 2677642, 2516630, 2795113, 2346040, 2189339, 2555873, 2554442, 2224396, 2244953, 2441914, 2584871, 2099692, 2174961, 2283891, 2305288, 2122772, 2294457, 2139339, 2083189, 1804168, 2189635, 2184078, 2257557, 2128539, 1891915, 1905249, 1835264, 2246138, 1742959, 1755027, 1862211, 2005104, 1858314, 1780596, 2092901, 2040847, 1973817, 1853668, 1988605, 1859580, 1723259, 1829424, 1738975, 1463034, 1948575, 1853880, 1969577, 1675957, 1835451, 1518828, 1460370, 1777657, 1673973]
16519A673973j12909L4043r1285L03608k41820K32731l33024J42513k69472K5655
16509A364013K26217j2784l3417J29178l34077J74380k28444J91735l50305N07076
16499A633572l70436J39614q4765L19374l27511K4012K47000j48145k55840l8485
16489A138390J09063J24235p2726K87645n1859m02353J64117J0362L9546K6340
16479A372760j38337J91142k3664m2569l7737J17620k62442K40042j20808K3004
16469A319011K113m2423K48238k81677J82337m54404K19960J58523j38160O9016
16459A282534j56539K5751L4591J25794J24208l63897L98783o59604K67639l09172
16449G70088L58322J26234k37425l1494R782N5681Q504j97034M61532j54582l0616
$$ y = [1673973, 1561064, 1595107, 1503822, 1807430, 1565610, 1798341, 1465317, 1607830, 1338358, 1364013, 1590230, 1577446, 1544029, 1673207, 1339130, 1513510, 1285066, 1476801, 1126496, 1633572, 1263136, 1402750, 1317985, 1637359, 1309848, 1333860, 1580860, 1432715, 1176875, 1138390, 1247453, 1371688, 1298962, 1586607, 1534748, 1132395, 1296512, 1306874, 1346420, 1372760, 1234423, 1425565, 1401901, 1359332, 1321595, 1439215, 1176773, 1416815, 1296007, 1319011, 1321124, 1278701, 1526939, 1245262, 1427599, 973195, 1193155, 1351678, 1213518, 1282534, 1125995, 1151746, 1186337, 1312131, 1436339, 1072442, 1471225, 811621, 1079260, 770088, 1128410, 1254644, 1017219, 985725, 995507, 1051188, 1059692, 862658, 1324190, 1169608, 1138992]
16438A138992k44366K39826R1682l01073J95256j02255J75832k48578J53628k21195
16428H77749R8601J48648l3757J70561K98217j94160k90518j61412N7960K61495
16418A233384m12731N02126l55045J32270k26888K22346j15618j11662J58959
16409A027141J7986j28985J36499m1389J59790n7763j39808l8956j27254K97197
16399A104458R25p8986J08736J96806k18193N3345P8438j49127J18547J8820p6480
16388A157289j9458l01349K4380K40147M3570j59593K72532l77136q5657L85554
16378A180279l93J32745l64213O9285J24151j47861J81772K27536k88829k19188
16368H95284P0055n4599J38690O0639q3236j2661J96348j29231M7692m562k4052
$$ y = [1138992, 894626, 1134452, 1226134, 925061, 1120317, 1018062, 1193894, 945316, 1098944, 877749, 976350, 1124998, 1091241, 1261802, 1560019, 1365859, 1075341, 913929, 971889, 1233384, 820653, 1322779, 967734, 1100004, 873116, 1095462, 979844, 868182, 1027141, 1045127, 916142, 1052641, 1011252, 1171042, 1113279, 973471, 934515, 807261, 1104458, 1105383, 1026397, 1135133, 1331939, 1113746, 1167091, 1245529, 1096402, 1214949, 1233769, 1157289, 1137831, 836482, 860862, 1101009, 1144579, 984986, 1257518, 880382, 794725, 1180279, 1179886, 1312631, 948418, 1017703, 1141854, 993993, 1175765, 1403301, 1114472, 895284, 965339, 910740, 1049430, 1110069, 1026833, 1014172, 1210520, 1081289, 1128981, 1124419, 1100367]
16357A100367j92541J16341N38168l31250m08555L86996j04268K18985k65946
16348A058297K80861j64812P8622k02896M07341o38292L39752j56753L0207Q4210
16338A116537q3060q3258L24162o6904j90126K82131j33750J49135j27392p7242
16328A110233k20635K69790j17051o3022q1117J18544K34131m2413J39136j35366
16318A212230p3568J58528m95228M82253l45787J30488J89204L4737J85625p02657
16308G75825M46378m5467N059j14283J62030j57377K41264q2147k22637l41754
16298F66891N54779j48692l46654L81687L8540q235l0116j32978M43460k56477
16288A162205J5304Q8139n50697O46367l20755O8511M7765k2617J69635n42159
$$ y = [1100367, 907826, 1024167, 1562335, 1231085, 822530, 1209526, 1105258, 1324243, 1058297, 1339158, 1174346, 1252968, 1050072, 1457413, 819121, 1158873, 1002120, 1032327, 1116537, 1033477, 950219, 1274381, 1207477, 1017351, 1299482, 1165732, 1314867, 1187475, 1110233, 889598, 1159388, 1042337, 979315, 898198, 1016742, 1250873, 1208460, 1347596, 1212230, 1138662, 1297190, 801962, 1284215, 938428, 1068916, 1258120, 1292857, 1478482, 775825, 1222203, 1176736, 1181795, 1067512, 1229542, 1072165, 1313429, 1231282, 1008645, 666891, 1221670, 1072978, 726324, 1108011, 1146551, 1138316, 1108200, 975222, 1418682, 1162205, 1177509, 1265648, 714951, 1361318, 1040563, 1109074, 1156839, 1134222, 1303857, 761698]
16278G61698P11036m38832K45078K47426n35648L80765k76449K20299n05783L07142
16268A116732Q5830k42497n6575K14110l5457k15526M65360m52549K15080k05383
16258H89125J8856k1362N39318k54265j26892j31339K56595L27136k88164k16822
16248I92186n8467J1896J11333j00067k69465M53700J4616l25647j0264J35873
16238I55694j20605K94007j63496R3964J64356k54397l75883M68894k66954m5549
16228G50031L10527m22156R6973K45201j32186L00109j5651j35169k8901M1748
16218A010526m03031K34073K31561m23967K11670n5115J86142P2869o4334j42124
16208H58270K25062j06029n4640r9706J8825j11031o6954P4277J33314O476k39439
$$ y = [761698, 1472734, 1033902, 1278980, 1526406, 990758, 1371523, 1095074, 1315373, 809590, 1116732, 1202562, 960065, 903490, 1117600, 1082143, 866617, 1331977, 879428, 1094508, 889125, 907981, 886619, 1425937, 1171672, 1044780, 913441, 1170036, 1497172, 1209008, 992186, 933719, 945615, 1056948, 956881, 687416, 1141116, 1155732, 830085, 819821, 955694, 835089, 1129096, 965600, 1059564, 1223920, 969523, 593640, 1062534, 795580, 750031, 1060558, 638402, 735375, 980576, 848390, 1148499, 1132848, 997679, 968778, 1010526, 607495, 841568, 1073129, 649162, 860832, 805717, 991859, 1064728, 1000394, 858270, 1083332, 977303, 922663, 822957, 841782, 730751, 663797, 738074, 871388, 877864, 638425]
16197F38425J93861J7464J62903k50830j35076j77209J95002N7861K28365k15084
16187G15682L4419j30255k226K23750k38527K2454k68603L28004j48622n2751
16177D83325K13954o2425N0047J65391j57609l701J43935j11983k7920J75938
16167H68952m02622K63525l39399J03857J56612l4746j80365J28632n9649J21267
16157F26064J04763k90615Q1392J8146j9118j32180K15907M3927K4295l15681
16147C56900O730j06454L43843k01458A89544M87029l5230j87744A70077M91668
16137F61745k12326N168j73236R4343j03166A14789L2268a86069E27551B16235
16126F06462b5858A07697P8436j5057M82738j08368A43418M17390j70095l3801
$$ y = [638425, 832286, 849750, 1012653, 761823, 626747, 449538, 644540, 702401, 930766, 715682, 750101, 619846, 617620, 841370, 602843, 625297, 356694, 684698, 536076, 483325, 697279, 634854, 684901, 850292, 692683, 688982, 832917, 720934, 693014, 868952, 466330, 729855, 390456, 494313, 650925, 616179, 435814, 564446, 504797, 626064, 730827, 440212, 521604, 539750, 520632, 388452, 604359, 648286, 672581, 356900, 363630, 257176, 601019, 399561, 189544, 676573, 641343, 453599, 170077, 661745, 449419, 454587, 281351, 375694, 272528, 114789, 147057, -186069, 527551, 216235, 606462, -25858, 107697, 186133, 171076, 653814, 545446, 143418, 560808, 390713, 356912]
16116C56912N3843j38978l8721R4548j37109J00667r6379K61400A99452L01309
16106E00761G061N96334B50933d8038B99996j47834p0574N34074J0651k84782
16096C41531p3688P7961N0460o3173j29758k8556J79453j31592p8960J74539L4434
16085C52651A30028a98575B73040A21373L4587J57014j22877B3143K57259J7357
16075B97759A21287m2527a16644A37037Q2693k8689f3837j4441A04588K10147
16065C14735B3951K45737N4003n0011j30553j6089E4942B1923b34072M9977C11263
16053D23495b9524A17630f1489A55910a18371B39385b35105B51194a93060D7592
16042C65716A55688O6338r1355F4588k2249Q4659c351j26540A72238B8788K70826
$$ y = [356912, 410755, 271777, 233056, 327604, 190495, 291162, 194783, 456183, 199452, 500761, 7061, 603395, 250933, -48038, 299996, 152162, 81588, 615662, 626313, 341531, 267843, 345804, 396264, 333091, 203333, 174777, 354230, 222638, 143678, 318217, 352651, 130028, -198575, 273040, 121373, 155960, 312974, 190097, 23143, 280402, 297759, 121287, 78760, -116644, 137037, 219730, 191041, -63837, -78278, 104588, 314735, 23951, 269688, 323691, 273680, 143127, 127038, 54942, 21923, -234072, -184095, 311263, 423495, -29524, 117630, -61489, 155910, -118371, 239385, -235105, 251194, -193060, 47592, 365716, 155688, 222026, 130671, 64588, 42339, 126998, -3351, -129891, 172238, 28788, 299614]
16031B99614k0736e7848A89511K19360j51648L1224h4456Q174a1948j77604i4594
16019c7854o1864l237D00932B4112L49842g5555E4812M13214i384A42133a86828
16007A41295e975B32504N8556A3251b5844B95135K08244F3157a49623a1528A97549
15995H6201f3141i798E8617J53943p4968L7710K6393K44856a6624B42277L4878
15984B77155j11477K69399j79731I1457j1023K37223f28o1451B74911a22244L9583
15973h2661A5144L97075h3623k2674B5996K28912D8735b4534n0335E1372j5562
15962C5810b04664P3627j11193a02463M8524H5958b90543H4292J75641b04177
15951a17581A49048A231O3150M2897f2018k5817C42505A47658b48638A70463d59261
$$ y = [299614, 278878, -57848, 189511, 408871, 257223, 288447, -84456, -76282, -11948, -189552, -94594, -37854, -99718, -102955, 400932, 24112, 373954, -75555, 54812, 468026, -9384, 142133, -186828, 141295, -5975, 232504, 291060, 13251, -25844, 295135, 503379, 63157, -149623, -11528, 197549, 86201, -63141, -9798, 58617, 212560, 137592, 175302, 201695, 446551, -16624, 242277, 277155, 165678, 435077, 255346, 91457, 80434, 317657, -628, -62079, 274911, -122244, -82661, 15144, 412219, -83623, -106297, 25996, 254908, 48735, -24534, -74869, 51372, 35810, -204664, -131037, -242230, -102463, -53939, 85958, -290543, 84292, 259933, -204177, -117581, 149048, 1231, 64381, 107278, -62018, -87835, 342505, 147658, -248638, 170463, -459261]
15939b949A6263J00220c8375C6182R7253a09886p798j15561J3899A33308M5975
15928A79283G3987M0803b06093H0755a17679H0626J9782A7320b6325j52609M9647
15917a29287A74092i3955J3494I969L7684b78681B72217b7061k94463g4905a2226
15905C80959o1586b30581a4924n8080A26898j9041a55674e35j37998d9408a1009
15893b26251A0537K56648c0620E7972c39756B10631a90806b892E0160n502a31691
15881G095Q891g788k03805b8714j88076J8881A10586d0586B17279o4623a5007
15869c03280A25188C2216a09484C1556a00333A30642a16652J1029I7368j6532
15859H0836M0430a21718M9580a5612j40894B05582R1136b2586j42036m2715E9083
$$ y = [-2949, 16263, 116483, -38375, 36182, 133435, -109886, -117684, -233245, -219346, 133308, 179283, 73987, 114790, -206093, 80755, -117679, 80626, 100408, 17320, -26325, -178934, -129287, 174092, -93955, -80461, 9969, 47653, -278681, 272217, -27061, -321524, -74905, -12226, 380959, 319373, -230581, -14924, -73004, 126898, 107857, -155674, -535, -138533, -49408, -11009, -226251, 10537, 267185, -30620, 57972, -339756, 210631, -190806, -2892, 50160, 44658, -131691, 7095, 15986, -7788, -211593, -28714, -216790, -197909, 110586, -40586, 217279, 152656, -15007, -303280, 125188, 32216, -109484, 31556, -100333, 130642, -116652, -105623, 97368, 80836, 121266, -121718, -72138, -15612, -156506, 205582, 296718, -22586, -164622, -207337, 59083]
15847a08849A98611l554a77158A23602c06040g7916j34553A75029c8699J6491
15837b2208A42044c92027e9821l13959A01929k19b8552k1610n5532k24627D4455
15825E3730M0399c5475j90253F3115e7957A52328m4210D4378a46261E6274d25789
15813I6585C6207i2870M336j23265c2970B82962a00161l8951j11190B02452a78003
15801A53382i7259H044Q8047f6704B52057G374J46055b88590A72274b50825f0209
15789A44670a08760d3668j16477g5232B54833a10580n6306g6756l2618e2376j15455
15778a67831Q1103M1065A28049J09007i648k11265J09269B5304J81528E0683M9290
15767I9973L7446F851e74648A45179c64569B1872J01797M9995l8561a28461l45002
$$ y = [-108849, 198611, 195057, -177158, 123602, -306040, -77916, -212469, 175029, -38699, -22208, 142044, -392027, -59821, -373780, 101929, 101710, -28552, -50162, -105694, -330321, 44455, 53730, 94129, -35475, -225728, 63115, -57957, 152328, 108118, 44378, -146261, 56274, -425789, 96585, 36207, -92870, -88534, -211799, -32970, 282962, -100161, -139112, -250302, 202452, -178003, 153382, -97259, 8044, 96091, -66704, 252057, 7374, 153429, -288590, 172274, -250825, -60209, 144670, -108760, -43668, -160145, -75232, 254833, -110580, -166886, -76756, -109374, -52376, -167831, -86728, -45663, 128049, 237056, -9648, -220913, -111644, 25304, 206832, 50683, 99973, 137419, 6851, -574648, 145179, -364569, 21872, 123669, 173664, 135103, -128461, -473463]
15756d73463a62353A06818M4911a86119M0581I618b03445k1130A09498K303a3010
15744a55848a1583B29188A13712l5691a99215Q4274A25056D4990N1544d97078
15733a20107B88660j42014o5443A920P8365b30321J13041f990B50942e9381l2407
15722i1788B49195J9887b42780O4043d712G2988i1200m40868a87302B1199a17210
15710I2099j006F652d5468q0338j98572J57340B6449f6978j54584i2799L4049
15699e8750A08089e43D9064K42393a40477b0759A17437K15345f2624k50134e1349
15687a98389R8346B61599h1398q2139K8041A28931b0343E8156b23475K2890N5409
15676a45176j74136j8614a12463o523D9978b09691C58012D1291K64815A25502
$$ y = [-473463, -162353, 106818, 151729, -186119, -145538, 9618, -203445, -224575, 109498, 111801, -13010, -155848, -11583, 229188, 113712, 78021, -199215, -114941, 125056, 44990, 96534, -497078, -120107, 288660, 146646, 81203, 1920, 80285, -230321, -117280, -6990, 250942, -59381, -91788, 249195, 269082, -242780, -178737, -4712, 72988, -91200, -532068, -187302, 21199, -117210, 92099, 91093, 6652, -45468, -125806, -324378, -167038, 26449, -66978, -221562, -92799, -58750, 108089, -543, 49064, 291457, -140477, -20759, 117437, 332782, -62624, -312758, -51349, -198389, -100043, 261599, -81398, -163537, -135496, 128931, -20343, 58156, -223475, -200585, -145176, -319312, -337926, -112463, -118986, 49978, -209691, 358012, 41291, 306106, 125502]
15665e3907j15978k18924J56994C4805a16337A37658d4515A2428N9453a19547
15654b12785g3017C11536i2773k16193h5329j78903d7367R459n329D5914K8358
15643G4272K8792B0155J79208c64040d8521j49534j4778F0467R5842c5693C42117
15631a15646M3667k4709d6775j21851C43014c83125a45824H1062c15991A38747
15620A32994b79223f9281F2296e2750k7580Q561A82789d70572B39191a01382j16331
15609b17713l7280O893a3676D1035a23922b6195G1758L86332f3935k1639d2570
15597a80169N1602b8132C32740a83813Q8393j36021a2044F8182j8662c5444k17653
15586b53097A5825L51086a34884m9756R0322D19022B2474R4339N1722a23206d4693
$$ y = [-53907, -169885, -388809, -231815, 34805, -116337, 137658, -44515, 12428, 71881, -119547, -212785, -73017, 311536, -92773, -308966, -85329, -264232, -47367, -37908, -43237, 45914, 74272, 103064, 20155, 199363, -364040, -48521, -198055, -212833, 60467, 156309, -35693, 342117, -115646, -71979, -96688, -46775, -168626, 343014, -383125, -145824, 81062, -315991, 138747, 132994, -279223, -69281, 62296, -52750, -80330, -71769, 182789, -470572, 239191, -101382, -217713, -254993, -248100, -13676, 41035, -123922, -26195, 71758, 458090, -63935, -85574, -42570, -180169, -128567, -28132, 332740, -183813, -95420, -231441, -12044, 68182, 49520, -35444, -253097, 15825, 366911, -134884, -184640, -94318, 419022, 22474, 116813, 168535, -123206, -44693]
15574a9910j24065A88647L3535p566b81495d4823n0843B4726J47666C5803i7451
15562e2626F5631f2729F809a24321B20992a47890A37813m5907a55567A1383e7528
15550b92593H3904J5411M8231b30360a04584B5729a36012A45588b34305A61906
15539c02825N8666g1885G0474e5961D2881b58802A51641b0549A01622k4138B6354
15527A86239m1151J3664A3414a79110N6160m3267a4562j90288A98610b26502C7458
15515A28972E5598k1622a13425I2264b26316g7620A24409a60032C4734a23344
15504C34446C1885P2574h6670j80064q9023A9356L6064O8071a53356b38A21676
15492B50602e7001j07725k2389B10896c88618a44866B44529C457a48905b6766
$$ y = [-19910, -143975, 188647, 222182, 214616, -281495, -44823, -95666, 24726, 172392, 35803, -97451, -52626, 65631, -62729, 6809, -124321, 220992, -147890, 137813, 91906, -155567, 11383, -57528, -292593, 83904, 99315, 147546, -230360, -104584, 25729, -136012, 145588, -234305, 161906, -302825, -244159, -71885, 70474, -55961, 42881, -258802, 151641, -20549, 101622, 77484, 26354, 186239, 145088, 158752, 13414, -179110, -122950, -166217, -14562, -204850, 198610, -226502, 37458, 128972, 55598, 33976, -113425, 92264, -226316, -77620, 124409, -160032, 34734, -123344, 334446, 31885, 104459, -86670, -266734, -355757, 19356, 55420, 123491, -153356, -238, 121676, 250602, -57001, -164726, -187115, 210896, -388618, -144866, 244529, 3457, -148905, -26766]
15481C0188J33232g5652j08203f0587a1511j23155B484c9043A72041a48525c0047
15469e4379o8391A57396c67926b2156j6405A06715b01785A0415O4937A0568N5810
15458F6378d7703j28104q2063B03660b62803a3809o3336A76042b17011d1371A7572
15446a9928k4685j2868a9222H2595q001L7168J45749k0525J33418g7752A47734
15434d3473D98562j2804i1522A90466i6116A58238b4902j19268C8843a28536F947
15422C37063h0036B25128e4577A86385l5344d6327B49553b84198F6595I647d01602
15410b14749B37249f8944A28492c9668k6669K3986A23783a62009A21433m4873
15400G6560K5604A9353b00575g4933e369p9212q9843A76275L7540H328b41975
$$ y = [30188, 163420, -75652, -183855, -60587, -11511, -134666, 2484, -39043, 172041, -148525, -30047, -54379, -122770, 157396, -367926, -22156, -38561, 106715, -201785, 10415, 75352, 10568, 66378, -47703, -175807, -257870, 203660, -262803, -13809, -77145, 176042, -217011, -41371, 17572, -19928, -44613, -57481, -19222, 82595, 74594, 111762, 257511, 236986, 370404, -77752, 147734, -43473, 498562, 485758, -91522, 190466, -96116, 158238, -24902, -144170, 38843, -128536, 6947, 337063, -80036, 225128, -54577, 186385, 151041, -46327, 249553, -284198, 66595, 9647, -401602, -214749, 237249, -68944, 128492, -39668, -66337, -42351, 123783, -162009, 121433, 76560, 102164, 19353, -200575, -74933, -5369, -84581, -174424, 176275, 213815, 8328, -241975]
15388A09638b26220I6351L1120K34278e6919h393k15411J03207F3840J56897E8228
15376A4490J32989a27527E2997J8532J21535j8701H933L4181J1914J4381M7190
15365A16599j5657g2981C7484g7143B3189J86158N0255a5134H0931a42155L5235
15354a06920j14356C04089o9367E5831K39993j10306H5783b2000b632B05951e5253
15342B87734A1512J04071J21898A05204a42449C32233A04634d9348A44915f0895
15331b39427i418m2175B02322r7020a64631f1302A08218a8536B07654m9943N8918
15320B16629a6613n8534l8862F7840E369L5010E284J50337R0808G1228Q3663b57336
15307a38953c2550Q908E5852K0098K20849K35751a42341H5565b7490A82661K59122
$$ y = [109638, -226220, 96351, 127471, 361749, -56919, -8393, -223804, -120597, 63840, 220737, 58228, 14490, 147479, -127527, 52997, 71529, 193064, 174363, 8933, 43114, 55028, 69409, 116599, 100942, -72981, 37484, -77143, 23189, 209347, 259602, -15134, 80931, -142155, -106920, -221276, 304089, 234722, 55831, 295824, 185518, 85783, -22000, -2632, 205951, -55253, 287734, 11512, 115583, 237481, 105204, -142449, 332233, 104634, -49348, 144915, -60895, -239427, -9418, -51593, 202322, 105302, -164631, -61302, 108218, -18536, 207654, 157711, 216629, -16613, -75147, -114009, 67840, 5369, 40379, 5284, 155621, 246429, 71228, 154891, -257336, -138953, -32550, -23642, 55852, 75950, 296799, 532550, -142341, 85565, -27490, 182661, 441783]
15296D41783C044J99142p8388n8682k4529E546b91672F9692a79804A16405m5251
15285G1154Q831A197J0868a35847B04916m2678a2813q068o549a0326A79054J91052
15273C70106A61354P9927a82234e6400B72717b3308k28779J094B04714a47292
15262C9708J76311r6664K08059B9315b85399c6421j82477O8027F2968J68920A6623
15250D8569R9126J2474f5361A79398i8024j77332A30822j461K57643d7184A91989
15238C80635a12359B25637b87968h2925A19183K86696c6374l63130a65783e9123
15227D4551b26289A5780a04571A72727J66202a99582j19746A14793b009l68074
15217c70083e0937A68927a4022A15879K607C0515O6971c9223F6731j3437e8995
$$ y = [441783, 3044, 202186, 123798, 65116, 40587, 5546, -291672, 69692, -179804, 116405, 71154, 79985, 1197, 12065, -135847, 204916, 162238, -12813, -20881, -27430, -10326, 179054, 370106, 161354, 241281, -182234, -56400, 272717, -23308, -252087, -250993, 204714, -147292, 39708, 216019, 119355, 327414, 29315, -285399, -36421, -218898, -150871, 62968, 231888, 16623, 48569, 147695, 160169, -65361, 179398, -98024, -275356, 130822, 129361, 387004, -47184, 191989, 380635, -112359, 225637, -287968, -82925, 119183, 405879, -36374, -399504, -165783, -59123, 44551, -226289, 15780, -104571, 172727, 338929, -199582, -319328, 114793, -2009, -370083, -50937, 168927, -14022, 115879, 118486, 30515, 97486, -39223, 66731, 53294, -58995]
15205H9219a79843A62349j0096a05417A50415K9655J75d2924A37327l1620J9569
15194A25276a8970j36324A39264h4003B27538c75801A65a86717O3554J8346A72738
15182B465P6823L40844A33728l9565a17439n6461A06315O7110J04149J4995j31068
15171A61501l755O3124c1323p5136B17697B8507a95171A8172J95928F1926Q3508
15160A45434K24071B8178J04286E8328n3b0459j62729A58903E9117A2365b7226
15148G3939B9439K23391G347l623a33029B36636n7892K42642j75276A09104r707
15137I9397F623J65743a3687C03207c20390A15702a5959H9645K21850j10754J6638
15126B17379k9057p5859K38009A1312R0885f6717A82464l5422K06350D7889K4502
$$ y = [89219, -179843, 162349, 152253, -105417, 150415, 180070, 180245, -42924, 137327, 105707, 125276, -18970, -155294, 139264, -84003, 227538, -375801, 165, -186717, -123163, -104817, 172738, 2465, 79288, 420132, 133728, 94163, -117439, -173900, 106315, 173425, 277574, 292569, 161501, 157746, 220870, -31323, -106459, 217697, 28507, -195171, 18172, 214100, 61926, 145434, 369505, 28178, 132464, 58328, 58275, -20459, -183188, 158903, 59117, 12365, -27226, 73939, 29439, 252830, 7347, 3724, -133029, 236636, 178744, 421386, 246110, 109104, 99397, 6623, 172366, -13687, 303207, -320390, 115702, -15959, 89645, 311495, 200741, 217379, 188322, 112463, 350472, 11312, 102197, -66717, 182464, 147042, 353392, 47889, 72391]
15115G2391c23189G8551R7494B5173H909L77994I427a26458C52236A06114J56182
15104B62296n9197B9748M5486b81938D2318Q1393N6032k6800c65101D34904C4077
15092A18486J7402P3772Q913b7126j23090A99495j431q8512e1228j55325G3448
15080B24726k1370a64885A63066D3051A8076O6493R7513l1880B4019L95066A3430
15068A66024q104K63535k01620a3221F7660K18180h2086A85662K26401G4158L64756
15057D38914A61796R4597L27363f8353A37287l3058D9642M4359l7357K59953G9306
15045a3159A54454F5284K85285J5305K6112a56565B58822q9737J81593o7361b5508
15033E32633A39228K97343H8187K70277A72265K23053A39605J27477l1593J47223
$$ y = [72391, -323189, 78551, 176045, 25173, 8909, 386903, 9427, -126458, 352236, 106114, 262296, 203099, 29748, 75234, -281938, 42318, 123711, 179743, 152943, -365101, 434904, 34077, 118486, 135888, 209660, 218573, -27126, -150216, 199495, 198064, 109552, -51228, -206553, 73448, 224726, 203356, -164885, 163066, 43051, 18076, 84569, 182082, 150202, 24019, 419085, 13430, 166024, 157920, 421455, 219835, -13221, 67660, 285840, -82086, 185662, 412063, 74158, 438914, 161796, 256393, 583756, -68353, 137287, 104229, 49642, 94001, 56644, 316597, 79306, -13159, 154454, 65284, 350569, 365874, 391986, -156565, 258822, 169085, 350678, 283317, -25508, 532633, 139228, 436571, 88187, 358464, 172265, 395318, 139605, 267082, 235489, 382712]
15023C82712j9410j03641J70288a79637D0399L31465j67300I5630Q6276q6666
15013I5240L31917j18568f6123B37194o9269Q4906J20554l9747J40710A12168
15002D59336B19287J31406j07091j0034r8334J57502A23616J56636M0356J2756
14992C33364a79444D28618J14040B37796O3465J26511A24048P2658N0216j8507
14982B28415O6020M7955l1634A1822M61940k20653J87413j24839L8609j53436
14972B00856J07559j48263F2339J77721m2952K44707J24710j39511o3058J52362
14962E16318A86144q0330K99481D3994L21654p0487J1145I0184j9333g4389C68748
14950D88032p4688n3628M39762C5590a2620A79910A5570J42781k8408J29854j26313
$$ y = [382712, 363302, 259661, 429949, -179637, 40399, 371864, 204564, 95630, 181906, 95240, 427157, 308589, -66123, 237194, 167925, 252831, 373385, 333638, 474348, 112168, 459336, 219287, 350693, 243602, 233568, 135234, 292736, 123616, 280252, 320608, 333364, -179444, 428618, 542658, 237796, 301261, 427772, 124048, 196706, 246922, 228415, 294435, 342390, 310756, 11822, 473762, 253109, 440522, 315683, 354292, 200856, 308415, 160152, 62339, 240060, 197108, 441815, 566525, 427014, 363956, 516318, 186144, 105814, 405295, 43994, 365648, 295161, 306306, 90184, 70851, -74389, 368748, 488032, 413344, 359716, 799478, 35590, -12620, 179910, 15570, 158351, 129943, 259797, 133484]
14939A33484K79702K92552j68765n8941r8473L1692N7945P5859k28373h9326G36325
14927B84393J02765M58150C61030L53250P5878j00849j61066o1092K94228k23651
14917E37728j48357L26649K7251j96782A93144K72872L06076j83802j04184j7570
14907D66536K74052B26577N6940j32167J92615l4187j14723K9635L0810M86236
14897G41736B09078Q4134I9336L32120j04319P7532j9859J31382k34657O852Q2605
14886C70992n9349j02383P2191j7900K52339J56988o7391k66037l0840O8348J9133
14875C96091j25601L554N5902N0765J23538k30728J68457j82094J42791J28662
14865E31337j84033J99076j45718j81323k2018K89415B0460d1954E04711j72717
$$ y = [133484, 413186, 705738, 536973, 478032, 379559, 411251, 469196, 545055, 316682, -89326, 736325, 284393, 387158, 845308, 361030, 714280, 790158, 689309, 528243, 467151, 761379, 537728, 389371, 716020, 743271, 546489, 193144, 466016, 772092, 588290, 484106, 466536, 740588, 226577, 283517, 151350, 343965, 309778, 195055, 224690, 255500, 741736, 209078, 293212, 99336, 431456, 327137, 404669, 384810, 516192, 281535, 288387, 370992, 311643, 209260, 281451, 263551, 515890, 672878, 605487, 339450, 308610, 376958, 396091, 270490, 274044, 329946, 380711, 504249, 273521, 441978, 259884, 402675, 531337, 347304, 546380, 400662, 219339, 197321, 486736, 20460, -41954, 504711, 331994]
14855C31994J18823l6859P8135J18886B40412L43851I8498N08443k17758q5939
14845C03244J49834n7950f7373C94235r2045L10636j18441K10489j88286B49732
14834D32262l3277P9775N568N7948K47985l54879j30173K47426j17271M5972k3068
14823D58268A28018K91448L089j82602J10662J01798j66151L57243J9702C22359
14812B44946L94674o8280J16029l06052N2574L30157l17077j07933L48684B69219
14801D68504j35945J07719n9693M1226L57080k56227B02614K85546A53149L66935
14791E20084j64580p0576L33582B93586j19097M85475j88729L746n511j8405l7299
14780D13766i590G27774k64350P6490j02773O1098j90094L54881G5778M93087
$$ y = [331994, 450817, 413958, 492093, 610979, 240412, 584263, 98498, 606941, 389183, 303244, 453078, 395128, -67373, 394235, 302190, 612826, 494385, 704874, 516588, 249732, 432262, 398985, 478760, 484328, 542276, 790261, 435382, 305209, 552635, 435364, 481336, 458268, 128018, 419466, 422555, 239953, 350615, 452413, 286262, 643505, 663207, 322359, 244946, 639620, 571340, 687369, 381317, 433891, 764048, 446971, 339038, 687722, 269219, 468504, 332559, 440278, 380585, 421811, 778891, 522664, 202614, 488160, 153149, 520084, 355504, 284928, 618510, 293586, 174489, 659964, 471235, 474981, 469470, 451065, 413766, -9590, 727774, 463424, 539914, 437141, 498239, 308145, 663026, 75778, 568865]
14770E68865J34622o9065m646o0040k4923L31625C76536L38014j81883K06843
14760G39510l28858H3711O08996k07992K95444j63197o2406m1647K57329k81354
14750D88884K02985k75134N7543J2824j94508J36963L55671m2015l09179A69222
14739D92681k12378L95744B07307L71934K6769J17889k4536M5431k46667J76175
14729F74302p0502L6708J06583j14571R7588J10036k23054N21834j91645l79271
14719E68008L70709j72366L38850j80372j6196J34696D50502J18534L26264O9659
14709I64959l54914N418L39456k33987J66232J93445m13662K24382k40861k4058
14699F26410J02991K49684l40380Q0282J91599L12643k13712j46317P0758M0356
$$ y = [568865, 703487, 634422, 629776, 569736, 544813, 876438, 376536, 714550, 532667, 739510, 410652, 83711, 692707, 484715, 780159, 616962, 554556, 512909, 770238, 488884, 691869, 416735, 474278, 487102, 292594, 429557, 785228, 743213, 434034, 169222, 492681, 280303, 676047, 207307, 579241, 606010, 723899, 699363, 744794, 498127, 674302, 603800, 640508, 747091, 632520, 730108, 840144, 617090, 1138924, 947279, 568008, 938717, 766351, 1105201, 924829, 908633, 1043329, 450502, 569036, 895300, 964959, 610045, 615463, 954919, 720932, 887164, 1080609, 666947, 891329, 650468, 626410, 729401, 979085, 638705, 718987, 910586, 1223229, 1009517, 863200, 933958, 974314]
14689I74314k09320J12842J80279k59881L8091k5396k81094N53271j82873l23123
14679E77110K04591L63987k1758l38775K46983k88111K84514k64949K95534n11800
14669E47326L98754R5480J011j78200O9823n3039j86713o4660k3345M3729n7097
14658E93069L58359L05870k11905k65759K9795K55835n1468J58989O6627k10975
14648A028437L43621j34062j50520j59101L33767o2750l40258K91790P5397j88689
14638A037632k5896j39250M90274l70029j0540j2229j5627P4668L81704j36778
14628A273929l00105N42044k91477o241J98193l72656N4497l21422M95252k76366
14618I95648M12515l47473J1321l8214M69020l68482J32655J0259o1846J29634
$$ y = [974314, 764994, 877836, 1058115, 798234, 836325, 810929, 529835, 1083106, 900233, 577110, 781701, 1145688, 1123930, 785155, 1032138, 744027, 1028541, 763592, 1059126, 547326, 946080, 1041560, 1042571, 864371, 934194, 881155, 694442, 629782, 606437, 650166, 593069, 951428, 1257298, 1045393, 779634, 809429, 1065264, 1013796, 1172785, 1239412, 1028437, 1372058, 1237996, 1087476, 928375, 1262142, 1199392, 859134, 1150924, 1226321, 1037632, 1011736, 872486, 1362760, 992731, 982191, 969962, 954335, 1029003, 1410707, 1273929, 973824, 1515868, 1224391, 1218150, 1416343, 1043687, 1098184, 776762, 1272014, 995648, 1408163, 1060690, 1072011, 1033797, 1502817, 1134335, 1266990, 1277249, 1215403, 1345037]
14608A345037k63412M80991k67847J73804j81496M5899j5821J97775k16922J45707
14598A443715J56573j02117k58984K45186k21630L53096q9933j56745J55797j97254
14588A327704R6684J29295n5448L6624L11805m14610J94592N65437k06709l41028
14578A644346K73855k59720N53778n62188L05003l16269K40553J72878l25709
14569A726527L89949k62722K54416O8165K39715j80399M56823j75553O6611j75316
14559B408216J49726k05645M56481J91226M8892K77699O22392J13194P82921J310421
14549F155523K514971L866343O002986N964816q88378o963599o385137m006432
14541F261093j649653q25127j129866M8401j86984l38832j81195L43516j90206
$$ y = [1345037, 1081625, 1562616, 1294769, 1468573, 1287077, 1332976, 1317155, 1514930, 1298008, 1443715, 1600288, 1498171, 1239187, 1484373, 1262743, 1615839, 1525906, 1369161, 1524958, 1327704, 1424388, 1553683, 1498235, 1534859, 1846664, 1432054, 1626646, 2192083, 1985374, 1644346, 1918201, 1658481, 2212259, 1650071, 1955074, 1638805, 1879358, 2052236, 1726527, 2116476, 1853754, 2108170, 2176335, 2416050, 2235651, 2692474, 2516921, 2583532, 2408216, 2557942, 2352297, 2808778, 3000004, 3048896, 3326595, 3948987, 4062181, 4845102, 6155523, 8670494, 12536837, 18539823, 24504639, 23616261, 16652662, 10267525, 6261093, 4611440, 3786313, 2656447, 2704848, 2517864, 2179032, 1997837, 2341353, 2151147]
14532B151147J97317l98216R9620Q1219J8468k81219J77251N6193M53842m68259
14522B087363m5925K77745l73659K98437p4367p0295J46048l36709N10356j67601
14512B251393Q1498j65264L42014j79007K31783J5265j74287J37544N3835L3608
14502B628382j25331J46136N5249L6482k12707M22013l41247O23295k83121j00070
14492B849081m1252K99122k32385K45618R1317j81760n6695J02241O1525j07445
14482C029367q4304J54676m8599L25164j21821L72624n8121q9853K42282k70710
14472C450705L11846j78959K61288r7191K70385j57099M985J38693J95110p745
14462D192018m73136J46046K39515K34612j90152J59716j15444K70274K78653
$$ y = [2151147, 2348464, 1950248, 2049868, 2131087, 2149555, 1868336, 2045587, 2101780, 2555622, 2087363, 2041438, 2319183, 1945524, 2243961, 2169594, 2099299, 2245347, 1908638, 2418994, 2251393, 2332891, 2167627, 2509641, 2330634, 2562417, 2577682, 2403395, 2540939, 2594774, 2628382, 2503051, 2649187, 2704436, 2740918, 2528211, 2950224, 2608977, 3232272, 2949151, 2849081, 2807829, 3106951, 2874566, 3120184, 3211501, 3029741, 2973046, 3075287, 3136812, 3029367, 2945063, 3099739, 3051140, 3376304, 3254483, 3627107, 3568986, 3479133, 3721415, 3450705, 3762551, 3583592, 3844880, 3747689, 4018074, 3860975, 3865960, 4004653, 4199763, 4192018, 3718882, 3864928, 4104443, 4339055, 4148903, 4308619, 4193175, 4463449, 4742102]
14453D742102l65522K53049j3436L46837k11371L2138J40138k26772N07158k32600
14443D971721J03678p5417M3317K49033P9760K1177j2487J46407K47784q888j94939
14432E571146Q566L75274K01401k99292L66980M7359J67201J86289l69395M15545
14422F671074J07041j10050L18394K77651j55570O4974M19312q9248L5902K42282
14412G781762j10663P6441M67398l42089p9757Q02139l77521K54584J54628N20103
14402I147025l4588r2498N0418P41369j22919m3253J71925M19655q234j2878M42951
14391A0658973j04038K76721k532J36413O66273J63510J86200n5073M57174R3324
14381A2476945J66756L31606L38953J14027K28541L56227K78241L79171K78097
$$ y = [4742102, 4376580, 4629629, 4616193, 4963030, 4751659, 4783797, 4923935, 4697163, 5204321, 4971721, 5075399, 4999982, 5043299, 5292332, 5372092, 5393269, 5380782, 5527189, 5774973, 5766085, 5571146, 5579712, 5954986, 6156387, 5857095, 6224075, 6271434, 6438635, 6624924, 6255529, 6671074, 6778115, 6668065, 6986459, 7264110, 7108540, 7173514, 7592826, 7503578, 7539480, 7781762, 7671099, 7747540, 8214938, 7872849, 7793092, 8595231, 8217710, 8472294, 8626922, 9147025, 9112437, 9019939, 9070357, 9811726, 9688807, 9645554, 9817479, 10237134, 10228900, 10216022, 10658973, 10554935, 10831656, 10829124, 10965537, 11631810, 11795320, 11981520, 11926447, 12383621, 12476945, 12643701, 12975307, 13314260, 13428287, 13656828, 14013055, 14291296, 14670467, 14948564]
14372A4948564J15242N24022K52654K52239R3215P76101K34201J74457M85653
14363A7856348K86074N49468L56892Q18916j97476J133337L22766j595P23451
14354B1848181N53551O28316M78713N68347P22206O32348N16263N85778P36615
14345B7270318Q73655L09360J162752J225536K58738J136912P35049J073724R31558
14336C4977602P45709J144924J307662J191404J069793J017062J638256J297404
14328D4389816J400759J590534J463806J627200J578968K021562J723221K113886
14320E7909752J853423K039357K507354K149826K246264K882032K433539K960263
14312G6981810L055830K976342L397955L830200L424897M322898M162410M341701
$$ y = [14948564, 15063806, 15587828, 15840482, 16092721, 16185936, 16962037, 17196238, 17370695, 17856348, 18142422, 18691890, 19048782, 19867698, 19670222, 20803559, 21126325, 21124730, 21848181, 22401732, 23030048, 23508761, 24077108, 24799314, 25431662, 25947925, 26533703, 27270318, 28143973, 28453333, 29616085, 30841621, 31100359, 32237271, 32972320, 34046044, 34977602, 35723311, 36868235, 38175897, 39367301, 40437094, 41454156, 43092412, 44389816, 45790575, 47381109, 48844915, 50472115, 52051083, 54072645, 55795866, 57909752, 59763175, 61802532, 64309886, 66459712, 68705976, 71588008, 74021547, 76981810, 80037640, 83013982, 86411937, 90242137, 93667034, 97989932, 102152342, 106494043]
14304A06494043M519034M855542N615161N298372O065924O020531O759860P085365
14296A52713832P225042Q256162Q082120Q576324R790410R693811J0440098J0651447
14288B25429246J1946203J1920478J2231001J3652096J2804801J4108097J3757829
14281C15849751J4262716J3993081J3838426J3328697J2987237J1459188J0079044
14274D05798140Q310713N437079K701898J596468N54256q37317l265917m115190
14266D16180130m525951p366832r006677j0546681j1476155j2704755j2802731
14259C47750348j3719439j4041743j3563132j4181830j3746877j3105139j2702428
14252B52689760j2358925j1898776j1329587j0968600j0036129r642314r219903
$$ y = [106494043, 111013077, 115868619, 121483780, 126782152, 132848076, 138868607, 145628467, 152713832, 159938874, 168195036, 176277156, 184853480, 194643890, 204337701, 214777799, 225429246, 237375449, 249295927, 261526928, 275179024, 287983825, 302091922, 315849751, 330112467, 344105548, 357943974, 371272671, 384259908, 395719096, 405798140, 414108853, 419545932, 422247830, 423844298, 424398554, 423561237, 420295320, 416180130, 411654179, 404287347, 395280670, 384733989, 373257834, 360553079, 347750348, 334030909, 319989166, 306426034, 292244204, 278497327, 265392188, 252689760, 240330835, 228432059, 217102472, 206133872, 196097743, 186455429, 177235526]
14245A77235526q368397q263154p546267p239092o866590o646798n872768n728424
14237A20704036n089241n604113m570468m484237m342230m008238m118480l495504
14229H4991525l134772l661471k992522k885135k699896k530256k589778k402860
14221F2094835k108695k438728j956423j459879j786301k048417j321311j843762
14213D7131319j075914j874258j177953j147540j525879j001423j116895j218344
14205C6993113o63670j129401j231868r36343q67269n13347j375167n53655p82878
14196B8939515q69600m07735r02044o53533o42100p66502o57463n35177n23927
14187B2981434n53457m92498m80947m25983l35026k72095q31984k29279p33930
$$ y = [177235526, 168867129, 160603975, 153057708, 145818616, 138952026, 132305228, 126432460, 120704036, 115614795, 110010682, 105440214, 100955977, 96613747, 92605509, 88487029, 84991525, 81856753, 78195282, 75202760, 72317625, 69617729, 67087473, 64497695, 62094835, 59986140, 57547412, 55590989, 54131110, 52344809, 50296392, 48975081, 47131319, 46055405, 44181147, 43003194, 41855654, 40329775, 39328352, 38211457, 36993113, 36329443, 35200042, 33968174, 33031831, 32164562, 31651215, 30276048, 29722393, 28939515, 28069915, 27662180, 26760136, 26106603, 25464503, 24698001, 24040538, 23505361, 22981434, 22427977, 21935479, 21454532, 21028549, 20693523, 20421428, 19589444, 19360165, 18626235]
14178A8626235j164m18252n80681q9953p08853J50325r19831j7059m83037J21401
14168A5679131n97322n23856r6265l72245j0331j72528m10352p8145m13403o44433
14158A2360251L65039l44703k12640l72407O6937l68876k30080O2965l58729m48458
14148A0519299J51962l20057K8549k85296p1540n13604K93343j99650l46783P0488
14138I326711m37364q6989k36925l8196m5844o0714J23193p98388j68085K06043
14128G783442k55037r2675j29699J31677l21395L02701l25640J39074j5616m25875
14118F790957j27367m55647M63255j62350k47903K64104m29806J6235L6639j0523
14108F137594k89638J01113j65763J36454k62623j71936L97162p05358M79711
$$ y = [18626235, 18625071, 18206819, 17626138, 17536185, 16827332, 16977657, 16057826, 16040767, 15557730, 15679131, 15081809, 14557953, 14461688, 14089443, 14079112, 13906584, 13496232, 13418087, 13004684, 12360251, 12725290, 12380587, 12167947, 11795540, 11862477, 11493601, 11263521, 11326486, 10967757, 10519299, 10671261, 10351204, 10379753, 10094457, 10022917, 9509313, 9802656, 9603006, 9256223, 9326711, 8889347, 8802358, 8565433, 8527237, 8481393, 8420679, 8543872, 7745484, 7577399, 7783442, 7528405, 7435730, 7306031, 7437708, 7116313, 7419014, 7093374, 7232448, 7216832, 6790957, 6663590, 6207943, 6671198, 6508848, 6260945, 6525049, 6095243, 6111478, 6148117, 6137594, 5847956, 5949069, 5783306, 5919760, 5657137, 5485201, 5882363, 5177005, 5656716]
14099E656716l01216j26550m4065j85553L16721n97539K91044k83654q1039j1830
14089D633035J30043q0922m9231j24572j09679N95881m65535k57739J61939L6269
14079D469489J18434l16064j31855J33651j34239J12884r7490j80766p1363J00548
14069D003229k29801m21135N23671k22621j4150M17392k02964q2414j18319M9289
14059C702177j42404J44908k14073l6251m4913J77048k01850J70989k28605n2381
14049C274645k03857K67266j30463K32426m02907L3132q5683J23768o2296p6886
14039B969145J30393j37184j6058l07510L06780J51460n54577N2285J42838k7151
14029B710421J14880j48647N7213r7291J20252k63430j12442q0913N4617J04135
$$ y = [5656716, 5355500, 5228950, 5184885, 4999332, 5316053, 4718514, 5009558, 4725904, 4644865, 4633035, 4763078, 4682156, 4632925, 4508353, 4398674, 4994555, 4529020, 4271281, 4433220, 4469489, 4587923, 4271859, 4140004, 4273655, 4139416, 4252300, 4154810, 3974044, 3902681, 4003229, 3773428, 3352293, 3875964, 3653343, 3639193, 4056585, 3853621, 3771207, 3652888, 3702177, 3559773, 3704681, 3490608, 3454357, 3409444, 3586492, 3384642, 3555631, 3327026, 3274645, 3070788, 3338054, 3207591, 3440017, 3037110, 3070242, 2984559, 3108327, 3046031, 2969145, 3099538, 2962354, 2946296, 2638786, 2945566, 3097026, 2542449, 2594734, 2737572, 2710421, 2825301, 2676654, 2733867, 2636576, 2756828, 2493398, 2380956, 2300043, 2354660, 2458795]
14019B458795j30081L9671K3381j47601O615j46908N3502J60346j99791J29739
14009B247668j33240n9594J47798m2266j45940J27143N171j63779L38967l80170
13999A941758K71885r6550L30221m02459K50425k02751L04286N02698N07609M79078
13989C886200J877395K926847O081356P125420L158213n171722o168166m426082
13981I289461k421204j497298p87263o82744m20367o23909J89152j94913k13840
13972B637075j28828K03247m12219j9856M5215k03747j30520J54227k8305o0210
13962B056079q4528r3980p1355l3091J9158m7595N50360o24186j47006L20645
13952A844501l41222M12992m25596k9416K66145k2111K43425l35491j29506K28049
$$ y = [2458795, 2328714, 2368385, 2391766, 2244165, 2250780, 2103872, 2157374, 2317720, 2117929, 2247668, 2114428, 2054834, 2202632, 2160366, 2014426, 2141569, 2146740, 1982961, 2321928, 1941758, 2213643, 2117093, 2447314, 2044855, 2295280, 2092529, 2396815, 2899513, 3407122, 3886200, 5763595, 8690442, 14771798, 21897218, 25055431, 19883709, 13715543, 9289461, 6868257, 5370959, 4583696, 3900952, 3480585, 2856676, 3045828, 2850915, 2637075, 2508247, 2711494, 2299275, 2279419, 2324634, 2120887, 1990367, 2144594, 2116289, 2056079, 1971551, 1877571, 1806216, 1773125, 1792283, 1744688, 2295048, 1670862, 1523856, 1844501, 1503279, 1916271, 1490675, 1461259, 1727404, 1705293, 1948718, 1613227, 1483721, 1711770]
13942A711770m9130N158j53869j26928K19305j69570k0048K97465k80520J93407
13932A627040K28775o6495k91502J38765l6533k8122r5915J97728m74074L85983
13922A585650j96391Q1462k57876L33424j97963M1148j59838l03791L41089P8105
13912A345019j51829j80219L50656O1198q8057J06967k97622K7043J61622J81396
13902A516174j73290M8843j41485R9502n04416J28472L11257j76039L14983m63282
13892I60719L01495l10524J98061L04496m69572J71862j35879R1435m18313N47034
13882A240814J03575m19939K58392k07114K27832l94246J71569K07116k08690
13873I79309J20183l4223l54191n7988M96239J02965j98817j09273R6336j31451
$$ y = [1711770, 1662640, 1667798, 1513929, 1387001, 1606306, 1436736, 1416688, 1714153, 1433633, 1627040, 1855815, 1789320, 1497818, 1636583, 1600050, 1571928, 1476013, 1673741, 1199667, 1585650, 1389259, 1470721, 1212845, 1546269, 1348306, 1389454, 1229616, 925825, 1266914, 1345019, 1193190, 1012971, 1363627, 1424825, 1336768, 1443735, 1146113, 1173156, 1334778, 1516174, 1342884, 1391727, 1250242, 1349744, 845328, 973800, 1285057, 1109018, 1424001, 960719, 1262214, 951690, 1149751, 1454247, 984675, 1156537, 1020658, 1112093, 693780, 1240814, 1344389, 924450, 1182842, 975728, 1203560, 809314, 980883, 1187999, 979309, 1099492, 1065269, 711078, 653090, 1149329, 1252294, 1053477, 944204, 1040540, 909089]
13863I09089k48842N03858j30994k97671J02660l1156K99782k43357K48069k06376
13853I05062n2670P0365P1710j57355L34632j07089j44426l24322L78956M9022
13843A023885j6863J87543n90522J18568j25227P5541K15921Q2383l46270O8687
13833F93646K77766J58045m79536O9092J45934j86862K31506K6327J75021l05074
13823H05865J97685m03071K44255j13087J87240l42044J16054J45549k84057K50514
13813H04903Q341m03454K69508J17016k03487L22835j19882n8931J13551n8325
13803G92075J19256m36386Q0764M56856k82932J18857o8698k58258K65969n1410
13793G36093j37629L83268D63972M24972j42077j32194j03941L55626R097D28482
$$ y = [909089, 660247, 1164105, 1033111, 735440, 838100, 806944, 1106726, 863369, 1111438, 905062, 852392, 922757, 994467, 837112, 1171744, 1064655, 920229, 595907, 974863, 1023885, 1007022, 1194565, 604043, 722611, 597384, 672925, 888846, 971229, 624959, 693646, 971412, 1129457, 649921, 719013, 864947, 678085, 909591, 935918, 1110939, 805865, 1003550, 600479, 844734, 731647, 918887, 576843, 692897, 838446, 554389, 804903, 813244, 409790, 679298, 796314, 592827, 915662, 795780, 736849, 850400, 792075, 911331, 474945, 555709, 1012565, 729633, 848490, 779792, 521534, 787503, 736093, 598464, 981732, 463972, 888944, 746867, 614673, 510732, 866358, 875455, 428482]
13782F55035j25562R5055j33487N59882L0664m64982p6772j97009j2379L02671
13772F33116K40122l69800M21621l69442K8225L7651J01355j66146M3593j01353
13762D98942o3864L62993C56755M19367J17494D30263j05435M94691j95427k46552
13752C77540M14052q7874C26809L61709j08314K513K8952m8305M7171j81898K62488
13741F91125q1608j50661J75885K27285C86457J14895P6275o5349K38920C42452
13730B64761K88556Q5283K6854l19650K48549k02746K25746l1401k10270j4747
13720C60935K02344J01456l6347G2610N02185r3320k30446O36139l62051m9884
13710D75233j89331J82420R818M4600k51203K71222J5854K99909J64150m64947
$$ y = [655035, 529473, 624528, 491041, 1050923, 1081587, 616605, 539833, 342824, 330445, 633116, 873238, 503438, 925059, 555617, 583842, 621493, 722848, 556702, 600295, 498942, 435078, 798071, 356755, 776122, 893616, 430263, 324828, 819519, 624092, 377540, 791592, 703718, 326809, 688518, 580204, 582717, 611669, 563364, 610535, 428637, 691125, 609517, 458856, 634741, 862026, 386457, 501352, 577627, 512278, 751198, 342452, 264761, 553317, 638600, 665454, 345804, 594353, 391607, 617353, 585952, 375682, 360935, 563279, 664735, 628388, 72610, 574795, 481475, 251029, 887168, 525117, 475233, 285902, 468322, 478140, 522740, 271537, 542759, 558613, 858522, 1022672, 557725]
13700E57725J07157j21991J16743C04812K22627A79033Q5905L18913j32443M7172
13690D98580B27978M12441K1023j26720j37865N713K62579l29222r9264L69041
13680F05704O03C01842J86804N4066n6676K05553B36838K48153o0599A91332L04304
13669D95636A47959N13428j44189B39240N58083B66627J52949N8055J57890j42004
13659D93517j41528N7978J08764B22290J15962m3439k393K12285J00061k00816
13649D03950l7835P58m3966j19612G3434K87913r3824L0327k6238Q0932K44481
13638E97025q7269O6024j97186k3450J96343k11581K09236k07979q7701L22309
13628E75771B68112J91748q6750L0834n3533o9148O8682R936A34685K03006p7285
$$ y = [557725, 664882, 542891, 659634, 304812, 527439, 179033, 264938, 583851, 451408, 498580, 227978, 640419, 661442, 534722, 396857, 402570, 665149, 335927, 236663, 605704, 606307, 301842, 488646, 542712, 486036, 691589, 236838, 484991, 424392, 191332, 495636, 147959, 661387, 517198, 239240, 797323, 266627, 419576, 477631, 635521, 493517, 351989, 409967, 518731, 222290, 338252, 294813, 292420, 504705, 604766, 403950, 366115, 366873, 322907, 203295, 73434, 361347, 267523, 297850, 271612, 352544, 597025, 509756, 575780, 378594, 355144, 551487, 339906, 549142, 341163, 253462, 575771, 268112, 459860, 373110, 403944, 350411, 281263, 349945, 359881, 134685, 337691, 260406]
13617B60406J44824K77771A68391K89225P1415l4635m9936K36793k79327O6883
13607D68809H7566N4072C8963L28828j08859R7259j06169O21A00182J86494J18432
13596D05108J7337D6727M63258j48493A67140K24225l36J2780l2093A58780M5691
13585B04471p3166J49473r5026K59227j23225j60484J21595L67506k33744j23681
13575B92946J19128k05256j3929c2082D44096D3664K5674J03647M120o4125M79042
13564E92022k46582L85000A84872B637N16553A2394K1213M34045A6038J55671
13554A71709K49445j83166m4033h3881D25552j24171b06544B00172H2966d7070
13543I3716f4371B88053J25876A4504N70762A15731a57787B13853J34448A71318
$$ y = [260406, 405230, 683001, 168391, 457616, 529031, 494396, 444460, 681253, 401926, 468809, 87566, 141638, 38963, 367791, 258932, 356191, 250022, 250643, 100182, 286676, 405108, 422445, 46727, 509985, 361492, 167140, 391365, 391029, 403809, 371716, 158780, 204471, 131305, 280778, 185752, 444979, 321754, 161270, 282865, 650371, 416627, 292946, 412074, 206818, 192889, -32082, 444096, 43664, 69338, 172985, 177105, 112980, 592022, 345440, 730440, 184872, 2637, 519190, 12394, 33607, 467652, 16038, 171709, 421154, 237988, 193955, -83881, 425552, 301381, -206544, 200172, 82966, -47070, 93716, -64371, 288053, 413929, 14504, 585266, 115731, -157787, 213853, 348301, 171318]
13532A31448c9436B53295o4094K12026j57684L44408B77823n2514D3596N30988
13522E74584B38194d6851A7151L56854J61336q6170q9832j56890B5978K46190
13512B72168A242K26741E0212L25220N2072j28252J1500N5860A52364l6946b682
13500B74709J96414f438B17537J45695K75798k64009A45050L82580A34647J8254
13490A52901J43838A27412J55721J76267p2772o8784I534J7432j0143d5637C91618
13478c3514p6426D07303A42110M86229A45804J84023N8147n0952N169a55538A23345
13466C08215o7055K64241k23584A18514J12476G6171a9679B45222n5080R8045
13456B88187k0390J78322j83814R2438j35803L8182G4026N59638E7820J61761
$$ y = [131448, -39436, 253295, 189201, 401227, 243543, 587951, 277823, 225309, 43596, 574584, 238194, -46851, 17151, 374005, 535341, 449171, 359339, 202449, 25978, 272168, 1242, 227983, 50212, 375432, 427504, 299252, 310752, 366612, 152364, 115418, -2682, 274709, 471123, -6438, 217537, 363232, 639030, 375021, 145050, 527630, 134647, 152901, 296739, 127412, 283133, 459400, 386628, 317844, 9534, 26966, 16823, -45637, 391618, -33514, -109940, 407303, 142110, 628339, 145804, 329827, 387974, 337022, 342191, -155538, 123345, 308215, 241160, 505401, 281817, 118514, 230990, 76171, -19679, 245222, 190142, 288187, 267797, 446119, 262305, 354743, 218940, 257122, 74026, 633664, 57820, 219581]
13446B19581D9431L91920a07943B79063J296P7201J52483A51425J87899F696K67856
13435B74552g29B99906h0298A11718J31030K35394g2979B11512o8454L7048l5367
13424A44739n5850O5508a84406C21776a1759A74050J52388O7339r7955A06472
13413C81722o4948k9905A03721a89058A09633J07325b2480I1142g2676A02729
13402B71610J02538h6018C44288A29411A0914J62712b85341A29782Q0230J48470
13392C58482a862k2694r5403A05242K42382F8961J58978J20624a17608B08479
13381B87687F211L06926A37707J45194j29500K17935A22343j4138K41508A10018
13370D50897G5619K96094A59915a22961A78012k544J86862e846I0565K47702B1147
$$ y = [219581, 49431, 441351, -107943, 279063, 280359, 357560, 510043, 151425, 339324, 6696, 274552, -729, 299906, -80298, 111718, 242748, 478142, -72979, 211512, 143058, 180106, 144739, 88889, 154397, -184406, 321776, -11759, 174050, 326438, 393777, 295822, 106472, 381722, 316774, 286869, 103721, -189058, 109633, 216958, -22480, 91142, -72676, 102729, 271610, 374148, -86018, 344288, 129411, 10914, 173626, -285341, 129782, 210012, 358482, -1862, -24556, -119959, 105242, 347624, 68961, 227939, 348563, -117608, 208479, 287687, 6211, 313137, 137707, 282901, 153401, 371336, 122343, 108205, 349713, 110018, 450897, 75619, 371713, 159915, -122961, 178012, 175468, 362330, -5846, 90565, 338267, 21147]
13358D56846F2021K41198o9117b684E4299K46943M581A0699h063B61745p5572
13347A86173n83q0929J37205K46034j97567m1014k278g1478F0719A6254O9819
13336H6073E580L03818a26944A53424b34408B55753Q0317d9241j1180C7172J04655
13325A41827O8951n020r9688k0692J13386F9272b9575A1586b8565J664C11800
13313B05672O6852a62226A16176K6915k1254m1258a84359B37902J6525j01451
13303A52976l8654M6485c7071C85265A30514B2477b9489A53258j2342m9961J36356
13292B27311J90470Q1151F6073a49480D42748k05361a49961N7796j42308C83575
13281E8003a17043A24116B7532J05786e4685B13378O1275j17527C8134b3002A07582
$$ y = [456846, 62021, 303219, 234102, -2684, 54299, 301242, 305823, 10699, -8063, 261745, 186173, 185590, 104661, 241866, 487900, 290333, 249319, 247041, -71478, 60719, 16254, 86073, 5580, 309398, -126944, 153424, -234408, 255753, 336070, -49241, -60421, 37172, 141827, 210778, 205758, 106070, 85378, 198764, 69272, -29575, 11586, -28565, -26901, 311800, 205672, 272524, -162226, 116176, 143091, 121837, 80579, -184359, 237902, 254427, 152976, 114322, 160807, -37071, 385265, 130514, 22477, -29489, 153258, 140916, 90955, 227311, 417781, 498932, 66073, -149480, 442748, 237387, -149961, -92165, -234473, 383575, 58003, -117043, 124116, 27532, 133318, -54685, 213378, 274653, 157126, 38134, -23002, 107582]
13269B57797q2152K9992H519L09730a05879k9039H0017J8952f7097q2293I8655
13257C9776i0306a0597k61399f4999A83886L3406F2780i5109A08431B6517J41309
13246A67826J62072f5902b9642I5069f0903C09990R4635C2853L8739J40682l3626
13235A78648F8350F30c06299A81155R2528k3888Q2263i8208B2962L79992A14344
13223a0206A44528Q7701k9494c06770B35811i5782C95801A34044k0616d4313A84879
13211e4929B41365j11935J8503C3138M936J47713B5606K91239j11658B6786P7381
13200A04167Q6993a1450C53596b50092B31268a27661B37086m1919K88532B3669
13189B98730J59949f0185B00241e6541A34675A7863K22974N9551A1709N7286J36829
$$ y = [257797, 175645, 205637, 8519, 318249, -105879, -134918, 80017, 98969, -67097, -149390, 98655, 39776, -90306, -10597, -271996, -64999, 183886, 217292, 62780, -95109, 108431, 26517, 167826, 329898, -65902, -29642, 95069, -60903, 309990, 404625, 32853, 71592, 212274, 178648, 68350, 630, -306299, 181155, 273683, 249795, 332058, -98208, 22962, 402954, 114344, -10206, 144528, 232229, 202735, -306770, 235811, -95782, 395801, 134044, 113428, -44313, 184879, -54929, 241365, 129430, 147933, 33138, 38074, 185787, 25606, 316845, 205187, 26786, 104167, 191160, -11450, 353596, -250092, 231268, -127661, 237086, 195167, 483699, 23669, 298730, 458679, -60185, 200241, -56541, 134675, 17863, 240837, 300388, 11709, 68995, 205824]
13178B05824K57167E5440K8196c2632r7399n8158j1768B74989i6777A26853a84440
13166B20789B3901b01794A75245A4876K75124k4764r7856a61059A36509J7064
13156A53573D15Q8316K57802M5342b15542J00258D3375a05121A68235a0337j16978
13145a27315D85739B09965o2000g7484q4639L1137B82534J70110i5895E2934O6531
13134A19465R6124l8471h6088a1493j66419e1485A38438J56146a04786j29222
13124b34008D24908a17838D2919J81409f9360B27156b93348A56177k2844J63579
13114B96912b89168A40445h6694A03800b24384N3816A27644a05072E05506c3230
13103A33634n4391R5174E9226K6196I688a92939D0174d6293k30258A93635B9676
$$ y = [205824, 462991, 55440, 83636, -32632, -130031, -188189, -199957, 274989, -96777, 126853, -184440, 220789, 23901, -201794, 175245, 14876, 290000, 265236, 167380, -161059, 136509, 153573, 415, 88731, 346533, 391875, -215542, -115284, 43375, -105121, 168235, -10337, -127315, 485739, 209965, 147965, -77484, -162123, -130986, 282534, 452644, -95895, 52934, 119465, 215589, 177118, -86088, -11493, -177912, -51485, 138438, 294584, -104786, -234008, 424908, -117838, 42919, 224328, -69360, 227156, -293348, 156177, 133333, 296912, -289168, 140445, -86694, 103800, -224384, -170568, 127644, -105072, 505506, -33230, 133634, 79243, 174417, 59226, 85422, 9688, -192939, 40174, -46293, -276551, 193635, 29676]
13091h3656E9965k0128i0648C09898c1895A50125A1406i5149A86653L4937a14615
13079A03937K8550P6485a50968B00899J7242k9418m5442K8631e8241J9716B22941
13067B41409A1187d1550A17996i2310m0731A2122b09581a7765A65023a77295C9111
13055B05630i8847K7839m6969C7055l627J15746g7107C01841j33928N4571a3688
13043B11813F4731b22363E0807K1758J2412J60013i318l08640c736C81678A51242
13031h3434A99836a79863a4303B51444E9567J51165J5103K77301g0943B00363
13020B21518a70868H6232J86807d2138l22262J19182B88897m4090o0990a9974
13009b2629A23961a48370E20678E6002J98418P1164D1396K3293a89954H2402K20210
$$ y = [-83656, 59965, 39837, -90648, 309898, -31895, 150125, 11406, -95149, 186653, 221590, -114615, 103937, 132487, 208972, -150968, 200899, 218141, 188723, 143281, 171912, -58241, -38525, 222941, 241409, 11187, -41550, 117996, -92310, -133041, 12122, -209581, -17765, 165023, -177295, 39111, 205630, -98847, -71008, -117977, 37055, 33428, 149174, -77107, 301841, 167913, 222484, -13688, 211813, 64731, -222363, 50807, 72565, 84977, 244990, -9318, -317958, -3736, 381678, 151242, -83434, 199836, -179863, -14303, 251444, 59567, 210732, 225835, 503136, -70943, 200363, 221518, -170868, 86232, 273039, -42138, -364400, -245218, 288897, 244807, 183817, -19974, -22629, 123961, -148370, 520678, 56002, 254420, 325584, 41396, 64689, -189954, 82402, 302612]
12998C02612j37461d10592m4448a06676A97231C8890L55460j04080R068E9637
12987B05321n1857L37023j56163G2067J19271H808J34312C547M60587a52336B3537
12975A00484i4801C87434e3343k41744a31194f1524b5630k21763N5685c3694l1087
12964f4781l4770A22511a36602A8694J81443f9794A19278J27689A15203i3291
12953I5326j0944J68173E2874k4578c26317k22579a10618B45592f5918j16830
12943a82748B41888F031J70239B4957Q922m352h0201c2070H1721i1558k01050
12932b92608A4988J09260b01535C8786h57p4076A05538J57452F9020b5186D57984
12920b33310B67342E9477c02651h1663A63399J29195G997K19373b04986j19150
$$ y = [302612, 165151, -410592, -455040, -106676, 197231, 38890, 394350, 290270, 299338, 59637, 205321, 153464, 490487, 334324, 72067, 191338, 8808, 143120, 3547, 464134, -152336, 23537, 100484, -94801, 387434, -53343, -295087, -131194, -61524, -25630, -247393, -191708, -33694, -64781, -99551, 122511, -136602, 18694, 200137, -69794, 119278, 246967, 115203, -93291, 95326, 84382, 252555, 52874, 28296, -326317, -548896, -110618, 245592, -65918, -182748, 241888, 6031, 176270, 24957, 33879, 29527, -80201, -32070, 81721, -91558, -292608, 14988, 124248, -201535, 38786, -857, -74933, 105538, 262990, 69020, -25186, 457984, -233310, 267342, 59477, -302651, -81663, 163399, 292594, 7997, 227370, -204986, -324136]
12910c24136a51914A88656c485D1708K29537A15099b1248j44228B03016h894F6531
12898a43484J8794N9752A84791B6203a61558P975b0015A55062a4353l1956G9750
12886B3962K93607B3159Q9183k9272J11255D3403b93261A62334C1594K83946c44870
12874b37739C61225A26532n9156a02064D347a74173C15520A30393J9991i1225
12863a928j0972l2220D2411J42367a64093B08817a97563A46816C6573d2012k35273
12852b77285A68106a00592j97110A76250a46174n8392B10503b69431J5960A54188
12841h9659k4220a6622p3151j60142C5249h3641a1739j26196D0760c5557A12601
12829A55412K4235b9905m7775L2846B9166J41549g6235B46704j19439c40059D4572
$$ y = [-324136, -151914, 188656, -3485, 41708, 271245, 115099, -21248, -165476, 203016, -8894, 66531, -143484, -124690, -64938, 184791, 26203, -161558, -153583, -20015, 155062, -14353, -46309, 79750, 23962, 317569, 23159, 112342, 83070, 194325, 43403, -293261, 162334, 31594, 315540, -344870, -237739, 361225, 126532, 67376, -102064, 4347, -174173, 315520, 130393, 150384, -91225, -1928, -12900, -45120, 42411, 184778, -164093, 208817, -197563, 146816, 36573, -42012, -277285, 168106, -100592, -297702, 176250, -146174, -204566, 210503, -269431, -253471, 154188, -89659, -113879, -16622, -89773, -249915, 35249, -83641, -11739, -137935, 40760, -35557, 112601, 155412, 179647, -29905, -77680, -44834, 29166, 170715, -76235, 246704, 127265, -340059, 44572]
12817A3775b9779j42885j39311E2246a6379j90590L3797h3306L0976q8301E2174
12805A2351J56560o9583d6202G3131a6743j59136B75291r0850C9803a37139F8513
12793A70423a41008A06308C3168b87947B02613E4548a5386A3816J23766K14847
12783C52429j65431c650j5844j42093A1355J57111K07726e2018j56919A36750
12772e1781p6017j15825J03163A62588m4922a47277A75196M6267i0703a1661B48296
12760g724k368A13066K22545j57035B7094K11273b1351q111A16184P7938i9388
12748B35109a24083k4079d9891B35120j0358b91007B27627C7625d4127C2882J07873
12737A40755R3873a65101g1171C0072J160g77m9234A98342K3901o9383a33868
$$ y = [13775, -29779, -172664, -311975, 52246, -16379, -206969, -173172, -83306, -52330, -140631, 52174, 12351, 168911, 99328, -46202, 73131, -16743, -175879, 275291, 184441, 39803, -137139, 68513, 170423, -141008, 106308, 33168, -287947, 202613, 54548, -15386, 13816, 137582, 352429, 186998, -3650, -19494, -161587, 11355, 168466, 376192, -52018, -208937, 136750, -51781, -127798, -243623, -140460, 162588, 117666, -147277, 175196, 221463, -90703, -11661, 248296, -7724, -10092, 113066, 335611, 178576, 27094, 238367, -21351, -29462, 116184, 194122, -99388, 235109, -124083, -148162, -49891, 235120, 224762, -291007, 227627, 37625, -44127, 32882, 140755, 234628, -165101, -71171, 30072, 31232, -777, -50011, 198342, 222243, 152860, -133868]
12725e4632k21974G8312a92923O3264N1895I6475c74778g8455c0063A42518K0168
12714A62686A4897M1330M6050i3511G101a14591b1660A39370g70j91223C4198
12702a28501A71427p3956B1742d12329J33597A64743n8521g7206l0421A49998
12691b58507R5511A08242c2896B75242b57934P5788B93189j19900p0625f9751
12680A25917e4680f606k24533D5820P4574K43362a71714H3588b16619A01476b49765
12668a00070C63502B8249d32100A55846c4849C65280H1858O3892J07221B7795
12657c56272D29696b21441A44885C8848l141K7829K02897h3579d0823k01460e2746
12645f8221k19968B9893J03724m5756J52077b6286C88709A05875J42423G4724
$$ y = [-54632, -276606, 78312, -192923, -129659, -77764, 96475, -374778, -78455, -30063, 142518, 162686, 14897, 56227, 102277, -93511, 7101, -114591, -21660, 139370, -770, -191993, 34198, -128501, 171427, 97471, 21742, -412329, -278732, 164743, 106222, -77206, -107627, 149998, -258507, -162996, 108242, -32896, 275242, -257934, -182146, 293189, 173289, 102664, -69751, 125917, -54680, -6606, -231139, 45820, 120394, 363756, -171714, 83588, -216619, 101476, -249765, -100070, 363502, 28249, -432100, 155846, -34849, 365280, 81858, 145750, 252971, 27795, -356272, 429696, -221441, 144885, 38848, 35707, 63536, 266433, -83579, -40823, -242283, -52746, -68221, -288189, 29893, 133617, 87861, 239938, -26286, 388709, 105875, 248298, 74724]
12634A83883J8126b1953H4330k8008K15422m2275A09262a95707A04134J57375
12624B61509C4825b0891p1538L2627q7609q8332D6744K54633J71916E0276Q3067
12613A33343c55551A99619h9938j1174j3207A58610L7325F6193a05187B00126
12602B09890H9635K02109F1193j4410g6889C04965B675J76454a23479B99596r6531
12591B03065c8073j51740A88331a59345C7488a59449A71589Q762a15994b7516
12580B87597A16985L3244J05259G4990C2719a69051A44730l1365j3790c4249o9320
12569a03569j9887A19692a67342f8517A26403a04503B873c78702I3358K04264
12559B97622b32138a7210A02517K33134j64490m887A0298c82298I0034a79717
$$ y = [183883, 202009, -21953, 84330, 56322, 271744, 229469, 109262, -195707, 104134, 261509, 34825, -20891, -92429, -59802, -147411, -235743, 46744, 301377, 473293, 50276, 133343, -355551, 199619, -89938, -101112, -114319, 158610, 195935, 66193, -105187, 200126, 209890, 89635, 291744, 61193, 46783, -76889, 304965, 2675, 179129, -123479, 299596, 203065, -38073, -189813, 188331, -159345, 37488, -159449, 171589, 180351, -115994, -27516, 287597, 116985, 150229, 255488, 74990, 32719, -169051, 144730, 113365, 99575, -34249, -103569, -123456, 119692, -167342, -68517, 126403, -104503, 2873, -378702, 93358, 297622, -232138, -17210, 102517, 335651, 171161, 166274, 10298, -382298, 90034, -179717]
12548A37570a28815A94292q0602a04795G5132K54779A07235F073g7903F5930J6461
12537H2391l0629b9218j50330k3881q6389E37601I2103f0673E09753f4171H8051
12525e6961B55828f0090n7440o6009B35556i1695l2237b5148l12769A0604b41948
12513d17043B86950H2692a10791k47997E9812c10570A27551J06737c207I936J77688
12502A87624F5135N6440c41247k710A82285d8340p453j80470j5245L5081G2889
12490b35779k9087A0570j590d7003k68766B35745c86771C18241A33014a28740
12479e13799D36640G4888b39203B4443a201E4446a01622H7629J02997c60768A60856
12467a94751K9462f5527A8835a75812q4602I6354k8548g1154k89818R7806g1015
$$ y = [137570, -128815, 194292, 113690, -104795, 75132, 329911, 107235, 6073, -77903, 65930, 82391, 51762, -29218, -179548, -203429, -289818, 537601, 92103, -60673, 509753, -64171, 88051, -56961, 255828, -60090, -117530, -183539, 235556, -91695, -123932, -25148, -337917, 10604, -241948, -417043, 286950, 82692, -110791, -358788, 59812, -310570, 127551, 234288, -3207, 9936, 187624, 65135, 121575, -341247, -343957, 182285, -48340, -55793, -236263, -251508, -216427, 72889, -235779, -264866, 10570, 8980, -47003, -315769, 235745, -386771, 318241, 133014, -128740, -513799, 436640, 74888, -239203, 24443, -1201, 54446, -101622, 87629, 190626, -360768, 160856, -194751, -165289, -65527, 18835, -175812, -260414, 96354, 67806, -71154, -360972, -263166, -71015]
12455b38113h1367H2479E954R4924b44603J4658B64532c24303Q9888a14874C63012
12443A6842c3424I4755b98202a6564j08221B34262c23452B57258b14542P1300
12433a43242K6665k4161m7800i1411L3204j72942H5019b17698J5407A71845c76236
12421A65304G0072f7602A05449b5122G6301M7438a15539B9313a78599k5387j27424
12410c31410J37193L1340E9940b16674f9767r6634A98474c300o3438j41982D2896
12398g923B08099i5366e373H791a64406A23571f4496j39744B37731g9089D3177
12386b2031m48425c5239A52812H600a82739A57387C689a9553l2770E065h20A35988
12373a41127L4645d8689C42673b15367A11525O8865F9490M43872g8331C6375K27191
$$ y = [-238113, -81367, 82479, 5954, 100878, -244603, -229945, 264532, -324303, -234415, -114874, 363012, 16842, -33424, 94755, -298202, -16564, -124785, 234262, -323452, 257258, -214542, -143242, -116577, -140738, -188538, -91411, -58207, -231149, 85019, -217698, -202291, 171845, -376236, 165304, 70072, -67602, 105449, -25122, 76301, 123739, -115539, 29313, -178599, -203986, -331410, -194217, -162877, 59940, -216674, -69767, -166401, 198474, -3300, -66738, -208720, 42896, -7923, 208099, -95366, -5373, 8791, -164406, 123571, -64496, -204240, 237731, -79089, 43177, -22031, -470456, -35239, 152812, 8600, -182739, 157387, 3689, -19553, -52323, 5065, -820, 135988, -141127, -106482, -48689, 342673, -215367, 111525, 180390, 69490, 513362, -78331, 36375, 263566]
12362B63566A4661J48443G6563e08m334k1595H8302P8951a08947k3628d341o3813
12350f8154L1134j51935B60051I0702R0975b13874k93552J38916d2786D1217b37723
12338c0118F2847J9370c14869A40522B6928c23087a04256C2216K26086B5819P4338
12327A00157b16196f1671j72003H2950a02617D4269p625b3567A55418a13817A01398
12315B66571a21531A25100J7648O7898a9915o1048n1478d6474B58859j48c35311
12303b45210c597I6094J72707j21234m2580b23351N7602j1855g0311C54069H2152
12291B32851H9918Q5136a89194f7411B90987I7635a4055l4443k59644a51371A60958
12279D4432c01526A07222R5071l5808a06895B23270k9046c52902a0125B07336
$$ y = [263566, 14661, 163104, 76563, -508, -4842, -26437, 88302, 167253, -108947, -132575, -4341, -68154, -37020, -188955, 260051, 90702, 181677, -213874, -507426, -368510, -42786, 41217, -237723, -30118, 62847, 82217, -314869, 140522, 26928, -323087, -104256, 32216, 258302, 25819, 100157, -216196, -61671, -233674, 82950, -102617, 44269, 36644, -23567, 155418, -113817, 101398, 266571, -121531, 125100, 142748, 210646, -19915, -80963, -132441, -46474, 258859, 258711, -335311, -245210, -3597, 96094, 268801, 147567, 104987, -223351, -165749, -177604, -70311, 354069, 82152, 232851, 89918, 175054, -189194, -67411, 290987, 97635, -14055, -48498, -308142, -151371, 160958, 44432, -301526, 107222, 202293, 166485, -106895, 223270, 194224, -352902, -10125, 207336]
12268i150k70937C39075a73485k9256b176B3231J33569F8355c13483A88959G6097
12256g1083B24892b36431L9592P9749j6426A9112J43597C0897L9663M12993A12339
12244a5638o6924r1786G3476K87328j21427k3235C3271J48599k1830b11236E5090
12232i4641F1611R0934C1502J10172K03299A68572d0340j63689A62077M9564J2901
12221B24542G6914a14750c7875B84101A02295K06235o5515a7680A19122J69043
12211B88165J35314a93672C38636j9614D838e3832A24227R5686a33043D76126
12200F1165P0823J11430a33005C72094j31240A20073g8422e686j07838b472B51323
12188B38648k2401d9628F2449L3788b86514G2788a8614j37905j04396B49090D7614
$$ y = [-9150, -280087, 339075, -173485, -202741, -2176, 23231, 156800, 68355, -313483, 188959, 76097, -71083, 224892, -236431, -196839, -117090, -133516, 19112, 162709, 30897, 70560, 483553, 112339, -15638, -82562, -174348, 73476, 360804, 239377, 216142, 33271, 181870, 160040, -211236, 55090, -94641, 61611, 152545, 31502, 141674, 344973, 168572, -40340, -204029, 162077, 211641, 224542, 76914, -114750, -37875, 284101, 102295, 308530, 243015, -17680, 119122, 288165, 423479, -193672, 338636, 319022, 4838, -53832, 124227, 219913, -133043, 476126, 61165, 131988, 243418, -133005, 372094, 240854, 120073, -78422, -5686, -113524, -2472, 251323, 238648, 216247, -49628, 62449, 96237, -286514, 72788, -18614, -156519, -260915, 249090, 47614]
12176c87205A1664f4981I2689q881I250J15501J20838a87391A69091n1113P1080
12165A89058m0773P8702g9177J8467B25950I1663a0249l1038A50590h1241A7799
12153D19899a38659I7141b05917B8297L3282L6557c3067A53117k5130h8954A58524
12141A29728d3453E2290f0499A8392J55052a11589p9472E9252A7884b78956R2036
12130a86920O6074B87953I5960m0973b0109K378o3928a9942C0760d543F2612b72562
12117A22266M5840Q4794d60029a47561d5335I4226g2313L5003A19957J6776a48962
12105A76255G4481J5314N4088k6501a10572j60403i3564C76689H961K57397a55352
12093A28013A7809a96909O7940C5477a92963A19664g8132A83812a76529B25670
$$ y = [-387205, 11664, -64981, 92689, 83808, 9250, 124751, 245589, -187391, 169091, 117978, 189058, 148285, 226987, -79177, -60710, 225950, 91663, -10249, -41287, 150590, -81241, 17799, 419899, -138659, 97141, -205917, 28297, 61579, 98136, -33067, 153117, 127987, -88954, 158524, 129728, -43453, 52290, -60499, 18392, 173444, -111589, -191061, 59252, 17884, -278956, -186920, -120846, 287953, 95960, 54987, -20109, -17731, -81659, -19942, 30760, -4543, 62612, -272562, 122266, 168106, 252900, -460029, -147561, -45335, 94226, -72313, -37310, 119957, 136733, -148962, 176255, 74481, 89795, 143883, 117382, -110572, -270975, -93564, 376689, 8961, 266358, -155352, 128013, 17809, -196909, -128969, 35477, -192963, 119664, -78132, 183812, -176529, 225670]
12082F6849M2164R5145E3914L89120c12284A72688c7115A32380B1387J13010D0425
12070B51457f7006J3019A74701c40902A60575b71344A96631d272H9163B091M5613
12059D7704a96767D5771Q173a74496P1910L4712h015B27242a18857C35518a44508
12047b35882a3620B41186J031n4140C9642a91586N0081b3045l85012k18d4932
12035a00869C12747a65682f6539a737A8708J29801a62593N703H0800J47303J48705
12024C76808c3959k85118J42803D7778c3479A68002k8002i9690A58093a01149
12013a26235B15043I6423N7852M0197l1590F2301K4534f5983E421c50150b6361
12001b56857c2238k9995a961l101C6127d88492e6841A79796C9556a56074B0202
$$ y = [66849, 109013, 204158, 53914, 443034, -312284, 172688, -37115, 132380, 21387, 134397, 40425, 251457, -67006, -53987, 174701, -340902, 160575, -271344, 196631, -4272, 89163, 2091, 47704, -196767, 45771, 53944, -174496, -102586, -67874, -8015, 227242, -118857, 335518, -144508, -235882, -13620, 241186, 242217, 188077, 39642, -191586, -141505, -23045, -408057, -408275, -44932, -100869, 312747, -165682, -66539, -1737, 18708, 148509, -162593, -156890, 80800, 228103, 376808, -33959, -319077, -176274, 47778, -33479, 168002, 140000, -99690, 158093, -101149, -126235, 215043, 96423, 154275, 194472, 162882, 62301, 86835, -65983, 5421, -350150, -26361, -256857, -32238, -62233, -1961, -5062, 36127, -488492, -56841, 179796, 39556, -156074, 20202]
11989E4582a66687C2868e2537k2263A8494e3506C7534K42111c40576A35881c44474
11977h9171m8135n2941i4169c3858j66862C36303b83157e0422j62447G0459a6277
11965b6738p2677E0258N1433b83383g7926G9175K13058j4776a91280A01719K23501
11954C25220a82864j5713B64607e4857n2391m3553c9112n5370G9161M6278D8185
11942A07262J02910H3131R9579J9604e7454p921l895D3351l179b28418G249a35510
11929b24612I0851b70298J15077B63364M3265a17488c9683A30517C4574J38954
11919A73528m6689E9007b01833b7545D96892a18022N1465K7335A43512f5077A02373
11907b0777A54207O1633a52936E0037K52596f8022l6593f949F8382c196F1518
$$ y = [54582, -166687, 32868, -52537, -74800, 18494, -53506, 37534, 279645, -340576, 135881, -344474, -89171, -137306, -190247, -94169, -33858, -200720, 336303, -283157, -50422, -212869, 70459, -16277, -26738, -99415, 50258, 101691, -283383, -77926, 79175, 292233, 277457, -191280, 101719, 325220, -182864, -198577, 264607, -54857, -107248, -150801, -39112, -94482, 79161, 125439, 48185, 107262, 210172, 83131, 182710, 202314, -57454, -65375, -69270, 43351, 40172, -228418, 7249, -135510, -224612, 90851, -270298, -155221, 263364, 306629, -117488, -39683, 130517, 34574, 173528, 126839, 59007, -201833, -27545, 496892, -118022, -66557, -39222, 143512, -65077, 102373, -20777, 154207, 215840, -152936, 50037, 302633, -68022, -104615, -6949, 68382, -3196, 61518]
11895B00356c0634C34895i2108A1454b91996H3175j3933J7363C3386M9887a84951
11883A19305a57934C0004b55498B14900k3696a16353d6673f397j59465d8580j86298
11872b34878j19739A14522a12541I1122h2258C7917P0412b41979G9032n782b6399
11860b53586C474a5389j33268A31507Q010b05484a8947m33279f0456b1143j33823
11849a54966A70318J28746h8648k83070c1257a0656E4389a29712C50699h7230
11838A79541c64067c1358l53670d0700J2417k05752I6163e7163C05411c52767
11827a96709E3184j1301Q1147J3072d5475D532L866J81106k2132a0126l6005A65051
11814D7964B33J61721F488M5643b10768J8606G0057J168a52026O0636k1506O9
$$ y = [200356, -30634, 334895, -92108, 11454, -291996, 83175, 69242, 86605, 33386, 83273, -184951, 119305, -157934, 30004, -255498, 214900, 191204, -116353, -46673, -6397, -165862, -48580, -234878, -354617, 114522, -112541, 91122, -82258, 37917, 108329, -241979, 79032, 73250, -26399, -253586, 3474, -15389, -148657, 131507, 139517, -205484, -18947, -452226, -60456, -21143, -154966, 170318, 299064, -88648, -371718, -31257, -10656, 54389, -129712, 350699, -87230, 179541, -364067, -31358, -385028, -40700, -28283, -234035, 96163, -57163, 305411, -352767, -196709, 53184, 41883, 123030, 136102, -45475, 4532, 8398, 189504, 167372, -10126, -46131, 165051, 47964, 233, 161954, 6488, 52131, -210768, -192162, 70057, 71225, -152026, -91390, -112896, -112827]
11802a12827j83449g3170h428F062e2653A73387C7800b90636g6423j7570j30227
11791b24220R8741e0164j18120I5133g5067A60801f6984D2480a08036n1915H0339
11779A78543A9796L8516P3905a4196j30461j973B54646c20427J15073O2955A52672
11767D7324a32874b8050p8043p86j19043Q6401D8644b7203B61612E3419F345J4890
11755B1235a80982e4633l9348O847K370J9472I3132D6535a47886j42178D9926
11743A23023R6296o2773L8013B1400c52842a52884A69991a55068j34918j13758
11733d03744h8929A19557a2291k19253K9864G2082C2175J11211N6378e550r8068
11722a03618B90207c06558K3944P0600O5771d7984p4389E8255K39075a89378h963
$$ y = [-112827, -296276, -73170, -8428, 6062, -52653, 173387, 37800, -290636, -76423, -93993, -224220, -125479, -50164, -168284, 95133, -75067, 160801, -66984, 42480, -108036, -159951, 80339, 178543, 19796, 58312, 132217, -14196, -144657, -146630, 254646, -320427, -205354, -142399, 152672, 47324, -132874, -28050, -106093, -106879, -225922, -139521, 48644, -27203, 261612, 53419, 6345, 21235, -180982, -54633, -93981, -87134, -84764, -65292, 93132, 46535, -147886, -290064, 49926, 123023, 219319, 156546, 194559, 21400, -352842, -152884, 169991, -155068, -289986, -403744, -88929, 119557, -12291, -231544, -201680, 72082, 32175, 143386, 199764, -5550, -103618, 290207, -306558, -282614, -212014, -146243, -47984, -122373, 58255, 297330, -189378, -8963]
11710E2417a31352L4057q1743F6747a66447A30611B1583d9082j23086P5539j03157
11699a99786G716g441r6757k56516i2749c3071j78353C75506E6291K82877A06126
11687B07890b4468j8976C6987A4684K06542J65609O4822f4494D3366b36399A33076
11675g518G1968A0249b48969j531C87344A48259a55956A3451c40639e5310m0568
11664i5878a69A76294a79974A63986d8902D8264b1098H476J68704a24471F9985
11652B37086d08442J33722A2549Q9109K1211a24757A98850a8275o6499B28902
11641b1656j02294M5023J5497A0147a01124A1547i1506A30490Q8743L2019A2132
11629E3492b52703j24564B1833K11562g5426k6414k3944C19705a26372B41584
$$ y = [52417, -131352, -97295, -179038, 66747, -166447, 130611, 21583, -49082, -172168, -96629, -199786, 7716, -7441, -104198, -360714, -92749, -33071, -211424, 375506, 56291, 339168, 106126, 207890, -24468, -43444, 36987, 14684, 221226, 386835, 451657, -64494, 43366, -236399, 133076, -7518, 71968, 10249, -248969, -250500, 387344, 148259, -155956, 13451, -340639, -55310, -95878, -169, 176294, -179974, 163986, -48902, 48264, -21098, 8476, 177180, -124471, 69985, 237086, -408442, -274720, 12549, 101658, 122869, -124757, 198850, -18275, -84774, 228902, -21656, -123950, -78927, -63430, 10147, -101124, 11547, -91506, 130490, 219233, 251252, 12132, 53492, -252703, -377267, 21833, 233395, -75426, -101840, -125784, 319705, -126372, 241584]
11618B27006a56235d8882A15350b6845A44171d3992n1393E2795a7014H3948B0841
11606A5136O0281b7164n0660A63219l1913g8498E9734J31896D0693e8813K4171
11595c4642A26901a0381C0694L71311b15160f8811A0704a45819I5689B0847a63331
11583a25500G8699k16d34084a1941k50882A81860R3797E822K23689E6860j8268
11572C8592N4509b11656g36D44129A41076a83254A41646C9065K01356o2696F1171
11560a76326A41041h9756A04701b29346O3176A00775i5556c683C4134g5267B18264
11548f6873b7149k73463E5184h791A03033k3511k0387a8971o550j33444H0499
11536I6749m0442b95208R1526C4107K12909l0805e1998j12521J1694N1006H886
$$ y = [227006, -156235, -48882, 115350, -26845, 144171, -43992, -95385, 52795, -17014, 83948, 20841, 15136, 75417, -27164, -77824, 163219, 131306, -78498, 59734, 191630, 40693, -58813, -34642, 126901, -10381, 30694, 402005, -215160, -68811, 10704, -145819, 95689, 20847, -163331, -125500, 78699, 78483, -434084, -11941, -262823, 181860, 275657, 5822, 229511, 56860, 38592, 93101, -211656, -736, 444129, 141076, -183254, 141646, 39065, 240421, 177725, 61171, -176326, 141041, -89756, 104701, -229346, -166170, 100775, -95556, -3683, 34134, -75267, 218264, -66873, -27149, -300612, 55184, -8791, 103033, 79522, 59135, -18971, -25521, -158965, 80499, 96749, 56307, -295208, -203682, 34107, 247016, 216211, -51998, -164519, -152825, -101819, 8886]
11524B28859c0284C25194f9477J1820b3803B68436G9961a7493j69388C40356j14308
11513B26048l2182N17734B4055J2303J36138K1017a36921B1112J89905c29366
11502a27568B9625P5597a05513j838E3906A7445Q3707J38869m4545Q7280a19182
11490b02921A69211b6073j85802N1769D9848L5226b56971D0912O4956K5529Q5586
11479B16983d6114G6850J22982I4705J16316B9878R9781a75403B64241f3847j33370
11468a97217A51453M5512a2106A92469a32947C6327R4640n751f351C7862J31648
11457A69510a20307M8507k3296I9614b21368G7654a5706A47022P5017l3775n653
11446A82611a51625K0301i394l06694A15065B1962a16979J7476A25693d0336D4836
$$ y = [228859, -30284, 325194, -69477, -57657, -23803, 268436, 79961, -17493, -186881, 340356, 226048, 193866, 711600, 24055, 36358, 172496, 193513, -136921, 21112, 211017, -329366, -127568, 29625, 105222, -105513, -107351, 53906, 17445, 101152, 240021, 195476, 282756, -119182, -202921, 169211, -26073, -211875, -160106, 49848, 85074, -256971, 40912, 105868, 131397, 216983, -46114, 76850, 199832, 94705, 211021, 29878, 129659, -175403, 264241, -63847, -197217, 151453, 196965, -12106, 192469, -132947, 36327, 130967, 125216, -6351, 37862, 169510, -120307, -71800, -95096, 99614, -221368, 77654, -15706, 147022, 222039, 188264, 182611, -151625, -131324, -9394, -316088, 115065, 21962, -116979, -99503, 125693, -40336, 44836]
11434A66242a13413j97919J23501l0321c9579B0263r074c34553A33494b94852
11423C34431G4417j9518a99506R8766F5801c3483A99539i8562j38664D23251i1774
11411h2086B3829M8963a22712r6535B99104a10032E4728i0424A10143j8073c45216
11399f5231j28851j33113a8417j62495A43085k3998K4480B1395a31801k29305
11389c61106c7294r8543B36545B0449h3571b665A72407b13986j04289b9755B7485
11377F0567J15677c02086J17221Q7092A74763K48442j94461b81230J20338q8107
11367b48999M3629D7062J50227R1413L2964a40540A91907j0801a63459B52647
11356A1834l021a30077O2380q1420m288B3112A1361a16564p3039A2450O9230P0381
$$ y = [166242, -113413, -311332, -187831, -218152, -39579, 20263, 11189, -334553, 133494, -294852, 334431, 74417, 54899, -199506, -100740, 65801, -33483, 199539, -98562, -237226, 423251, -91774, -82086, 23829, 72792, -122712, -219247, 299104, -110032, 54728, -90424, 110143, 92070, -345216, -65231, -194082, -327195, -18417, -180912, 143085, 119087, 143567, 21395, -131801, -361106, -37294, -135837, 236545, 20449, -83571, -2665, 172407, -213986, -318275, -29755, 27485, 60567, 176244, -302086, -184865, -97773, 174763, 423205, 228744, -281230, -160892, -248999, -205370, 47062, 197289, 288702, 321666, -140540, 191907, 181106, -163459, 252647, 11834, 8813, -130077, -67697, -149117, -153405, 23112, 11361, -116564, -189603, 12450, 81680, 152061]
11344A52061K4239a02632G0321C0509K90713i6418C19403c7921k98574G9666e7674
11332C1534c30409I7084a57449P6815A34098e30535E4305b60406J6530A00436
11321a22013m0485E596i1522A76725L547p010a68776A53365b8002B10573F5316
11309a9618I6949b97747Q4217d1635R848j04558r9170r9386B71057e6545k49610
11298c06155G755K8050a76204L4775H9797D0090a19705B23945H7886J57601B0437
11286a03208a0774E5165R782a88891I648a88526H8060h2576n2229k25113a46659
11274c5386A5239F330K1795e8454A47715a72801l9963I3728J11260N2029G8757
11262G1511b35226A5621c49367k5911A43904C037a48946e2343R710j32397A45294
$$ y = [152061, 176300, -102632, 70321, 30509, 321222, -96418, 319403, -37921, -336495, 79666, -57674, 31534, -330409, 97084, -157449, -80634, 134098, -530535, 54305, -260406, -243876, 100436, -122013, -162498, 5596, -91522, 176725, 180272, 173262, -168776, 153365, -28002, 210573, 65316, -19618, 96949, -297747, -213530, -41635, -31787, -136345, -235515, -334901, 271057, -56545, -306155, 7755, 35805, -176204, -141429, 89797, 40090, -119705, 223945, 87886, 245487, 20437, -103208, -10774, 55165, 64947, -188891, 9648, -188526, 88060, -82576, -134805, -359918, -146659, -35386, 15239, 6330, 28125, -58454, 147715, -172801, -212764, 93728, 204988, 257017, 78757, 71511, -235226, 15621, -349367, -375278, 143904, 3037, -148946, -52343, -42633, -175030, 145294]
11250D54097b99203e3820m0050H6125a29630p483A57187h8170d0167l13684c6414
11238a40452C0061J81172a72495m6998a7839A30779b3962C0182b65719M9166Q6702
11227a29851B8884K2396M4721L180d2843l48967a12457J1815D7391b7020A65440
11215a74939n6610p3025M5980I8015a11922A11930a431A24302J2931a49833A00464
11203G4198L10662j3341G2619b26151o3927C94098a36377c2349B47916c5313j10508
11192a45821f639A20369D0686b0373H5927J85545p0145a6921j96121c6515F9951
11180A02788a2139c228k7511k5955j3293j36535F4485J51956a43574j61921A04852
11168a57321L4597k2865l7787k71924A31646I546a46868R916A46009d27665f5413
$$ y = [454097, -299203, -53820, -93870, 86125, -129630, -137113, 157187, -88170, -40167, -353851, -36414, -140452, 30061, 211233, -172495, -219493, -17839, 130779, -23962, 30182, -265719, -216553, -129851, 28884, 51280, 96001, 99181, -42843, -391810, -112457, -100642, 47391, -27020, 165440, -174939, -231549, -304574, -258594, 98015, -111922, 111930, -1431, 124302, 137233, -149833, 100464, 74198, 384860, 371519, 72619, -226151, -290078, 394098, -136377, -32349, 247916, -35313, -145821, -6639, 120369, 40686, -20373, 85927, 271472, 201327, -16921, -213042, -36515, 69951, 102788, -12139, -3228, -30739, -56694, -69987, -206522, 64485, 216441, -143574, -305495, 104852, -157321, -122724, -145589, -183376, -455300, 131646, 9546, -146868, -136952, 146009, -427665, -65413]
11156c551D8674B1793O1915a56333j7106m2788l9819a02258A17432n3157J10529
11145A74804b97662f1884F7075M5318a27256n0900B96028e1884j01694g123n8927
11134f6050B65754a15741n2105A49386d8095C5836b65677C6723e9217q1590A67177
11122b71715Q6775b8003B2434J65537A2093M23437I9831G625J31938l3476K13423
11111C19510r3682b6587A51853k7280K25053A48071j3390n0220k3224c4766k04101
11100b38867A47665l3082M3284n9427K89052n7722l5365B585K21555b06856D7234
11088d5116A60116a15812c4522j511E8627B1661b079B68339H5374J5349J63642
11077B64365F5246O8064b5904A36508L8116J07995D8230A5688d5491H8313M9267
$$ y = [-3551, 48674, 21793, 83708, -156333, -173439, -216227, -256046, -102258, 117432, 64275, 174804, -297662, -61884, 67075, 112393, -127256, -178156, 296028, -51884, -153578, -7123, -66050, 265754, -115741, -167846, 149386, -48095, 35836, -265677, 36723, -59217, -140807, 167177, -271715, -184940, -28003, 22434, 187971, 12093, 435530, 99831, 7625, 139563, 106087, 319510, 225828, -26587, 151853, 124573, 349626, 148071, 134681, 84461, 61237, -34766, -238867, 147665, 114583, 157867, 98440, 387492, 329770, 294405, 2585, 224140, -206856, 47234, -45116, 160116, -115812, -34522, -36033, 58627, 21661, -2079, 268339, 85374, 100723, 264365, 65246, 133310, -25904, 136508, 174624, 282619, 48230, 15688, -45491, 88313, 137580]
11066A37580L7283C4696Q6046K76806j05650A03493Q3544O9507J16212m4626i607
11054E29015j41535o2995O2948i7726B55557J8562J35775M9993j18311J80181
11044E21757A73612D3367N30970j78946k644j77678k135Q1520j01474O583d2843
11032A17126N0171K79357J64120k97027C7008L30612D7800M51172D3083L55235
11022C98318F9877K94524K49865B62913A29710J43422q5920a26868C72006j40998
11012B31008J70248N4262d7861A95775o0880N70886B54767R2796i5989B73443
11001B16847L56796k48880O0200q3838K43101k31784D2388J38625K77406A54391
10990I7589M10738o4242J18695k21643q1113M86599l22098K36758n1353j17659
$$ y = [137580, 174863, 34696, 120742, 397548, 291898, 103493, 187037, 256544, 372756, 328130, -9607, 529015, 387480, 324485, 387433, -97726, 255557, 274119, 409894, 459887, 341576, 521757, 173612, 43367, 574337, 395391, 392747, 215069, 212934, 294454, 192980, 199563, -42843, 117126, 167297, 446654, 610774, 313747, 37008, 367620, 47800, 498972, 43083, 398318, 69877, 364401, 614266, 262913, 129710, 273132, 187212, -126868, 372006, 231008, 401256, 455518, -47861, 195775, 134895, 705781, 254767, 347563, -95989, 273443, 216847, 573643, 324763, 384963, 301125, 544226, 312442, 42388, 181013, 458419, 154391, 97589, 508327, 444085, 562780, 341137, 260024, 746623, 424525, 661283, 609930, 492271]
10980D92271N0410J94025j30377M26267n07212O96261J83493k02264Q4029L20413
10970A607316o9106j29959j01692L6442k99827J77685L40200G52780P9065R4768
10960I26613j26453j75282K37751J40673J70602j88118M0277k11822P8168j16804
10950G75605p85j05616k45909j93534J57455c7115C64679A19886P4085q0281l0941
10939H2749k740L6835c0107l2590j2767A67017d8204A73580a71776k1106d4043
10927A63251a67031d1098A3925K59021q2134B7730b23925C26602h7068I8852b69692
10915B41840G4134b97589G8256J32460a06234A85351Q2373l0277r3505b74178
10904b78500G7362J73895H1751J916g7610j5763K2453A1380a03691l6330e9709
$$ y = [492271, 542681, 736706, 606329, 1032596, 525384, 1221645, 1405138, 1202874, 1286903, 1607316, 1538210, 1408251, 1306559, 1343001, 1043174, 1220859, 1561059, 752780, 831845, 926613, 800160, 624878, 862629, 1003302, 1173904, 985786, 1026063, 814241, 892409, 775605, 774820, 669204, 423295, 229761, 387216, -37115, 364679, 119886, 193971, 113690, 82749, 80009, 116844, -30107, -62697, -75464, 167017, -48204, 173580, -171776, -192882, -44043, 163251, -167031, -41098, 13925, 272946, 190812, 27730, -223925, 326602, -87068, 98852, -269692, 241840, 74134, -297589, 78256, 210716, -106234, 185351, 267724, 237447, 143942, -274178, -278500, 77362, 251257, 81751, 83667, -77610, -93373, -70920, 11380, -103691, -140021, -59709]
10892C1051M509J87811B1546c00105B35258C4366a38390A75469a21315q0082B42088
10880a42344O4109A72020q3606i8341b6382j10475L4299C4142J2915K92719j60704
10869A79072K94150a10226j59610N1341f206l3184j76565P9078o3415k0162b9395
10857a59178A50107B1251K22919e7847D7857a1220k19449B18287h037B6347i2359
10845b09344K1911A20464a04872b9809A38205a16200J1156B46922N6135A41500
10834h1264l00984B09882f4358A45782R6717H8447b5241k46404a33425A61095
10823a5154k17014B7969O0124h6514B18591F5362a64568j94127a32870O1787A37545
10811b74282g685H5815c19177B68270d69945a56408j54858g2059A21138d08217
$$ y = [31051, 35560, 223371, 21546, -300105, 235258, 34366, -138390, 175469, -121315, -201397, 242088, -142344, -78235, 172020, 88414, -98341, -26382, -136857, -102558, 34142, 47057, 339776, 179072, 473222, -110226, -269836, -218495, -6206, -39390, -215955, -136877, -200292, -220454, -29395, -159178, 150107, 21251, 244170, -57847, 47857, -11220, -230669, 218287, -8037, 26347, -92359, -209344, -187433, 120464, -104872, -29809, 138205, -116200, -105044, 246922, 303057, 141500, -81264, -382248, 209882, -64358, 145782, 242499, 88447, -25241, -271645, -133425, 161095, -15154, -232168, 27969, 88093, -86514, 218591, 65362, -164568, -358695, -132870, -71083, 137545, -274282, -7685, 85815, -319177, 268270, -469945, -156408, -311266, -72059, 121138, -408217]
10800B5298b07845E8661a06614J9408A27306J61158J06977c09641j94557G37b40150
10788A01742A6636b8668G4350O6337e5397q2174j14930i4079L9021E7656O9119
10777A26775f2180B54278f7565D0956K84935a85358B32652a15133o9976j26411
10767c11520C11844h3376C44170q9642A25089O724C9131N5618h4427r782k60401
10756c54610e6798j36620A5490a0484m1114k90761a3461j63394e8829A34012J2108
10745A46120a08883A57742a20298H2127k6278j2738b30482A03450c9657k63375
10735c03032A87467d3736l09932C09869b05279k41573g0669C6744f9597J2083
10725e7514k05218H6070J52495C3077a76664A85757o1795c8108n0761j45877c8578
$$ y = [25298, -207845, 58661, -106614, -87206, 127306, 288464, 395441, -309641, -504198, 737, -240150, 101742, 16636, -28668, 74350, 140687, -55397, -137571, -252501, -94079, -55058, 57656, 126775, -62180, 254278, -67565, 40956, 325891, -185358, 232652, -115133, -185109, -311520, 311844, -83376, 344170, 254528, 125089, 131813, 39131, 94749, -84427, -94209, -354610, -56798, -193418, 15490, -10484, -51598, -342359, -13461, -176855, -58829, 134012, 146120, -108883, 157742, -120298, 82127, 55849, 43111, -230482, 103450, -39657, -303032, 187467, -43736, -353668, 309869, -205279, -446852, -70669, 36744, -69597, -57514, -262732, 86070, 238565, 33077, -176664, 185757, 123962, -38108, -88869, -234746, -38578]
10713A10165a30409D0212c80433a79899B49455c40126J21935O3278D505a1892
10702g0814m32233C25784d1853k15414R4293O5887l85033J75435a05235A09806
10691g8024A97498c25428a54732A21975E0508b98441G1823J4079R4979a55808
10680a28859C64313A6545a88856H6342c44390A05208f3762A19959b25358e6699
10669a0615k66967J20383j06834G2880d0285j44237C9442Q8295h8791A7425J08198
10658A25623D7186b43096A1094i4743n7866A2515b50974r8915b1538k00650a05716
10646c79966a13456j53561j7086C28765c51673e7481l8306j59925c9658B65615
10635A32486J9589c74673g1539K5165m02013d4814j0891k53363B58872b75157
$$ y = [110165, -130409, 40212, -380433, -179899, 249455, -340126, -218191, -154913, 4505, -11892, -70814, -503047, 325784, -41853, -257267, -162974, -97087, -482120, -306685, -105235, 109806, -78024, 197498, -325428, -154732, 121975, 50508, -298441, 71823, 85902, 180881, -155808, -128859, 364313, 16545, -188856, 86342, -344390, 105208, -63762, 119959, -225358, -56699, -10615, -277582, -157199, -264033, 72880, -40285, -184522, 39442, 127737, -88791, 17425, 125623, 47186, -243096, 11094, -94743, -152609, 12515, -250974, -349889, -21538, -222188, -105716, -379966, -113456, -267017, -284103, 328765, -351673, -57481, -95787, -255712, -39658, 265615, 132486, 152075, -374673, -71539, -46374, -448387, -44814, -55705, -309068, 258872, -275157]
10624B67931e3672A10207c3156I077b51492f7092A78353e2290j5697k23502O6844
10613b24645b7186r8493o9674J0566Q9555A32164f1952a5049p8725j85047a27613
10601b74765G3411b99519I2723o078J3453j3834o003b48429I2143C9689e3599
10589A9444L07414c12467Q8049g0463j62355b0658C2950d0325k24613A01914a63686
10577a52822l21578E2289J70225p5562h9111l02440A62384b50879J06231a5936
10566a45327N4960H0506M9002d36495d6498j09389A20534c10950k6601p5716e985
10554b19232A15692J4043c001A26192c9670l9793A56127g045p8026I7227c565
10542f2320A55011a33605l6139I9498j3510a58005D5890d2394j58598a5747C7063
$$ y = [267931, -53672, 110207, -33156, 9077, -251492, -67092, 178353, -52290, -67987, -291489, -224645, -27186, -125679, -195353, -184787, -95232, 132164, -61952, -15049, -93774, -278821, -127613, -274765, 73411, -299519, 92723, 86645, 100098, 86264, 80261, -248429, 92143, 39689, -53599, 19444, 326858, -312467, -224418, -70463, -232818, -20658, 32950, -40325, -264938, 101914, -163686, -152822, -474400, 52289, 222514, 146952, -89111, -391551, 162384, -250879, -144648, -15936, -145327, -90367, 80506, 129508, -436495, -46498, -155887, 120534, -310950, -337551, -413267, -5985, -219232, 115692, 129735, -3001, 126192, -39670, -79463, 156127, -7045, -85071, 97227, -3565, -62320, 155011, -133605, -169744, 99498, 85988, -158005, 45890, -42394, -200992, -15747, 37063]
10530B06973a15247b5925j1084l69740C25406j52007c5453k76492B1210b0112
10519d44101E3089b48871e8150m02165f7162j3754j33143F66282d8856C5277b32848
10507A133N5712A6103b52728K2068A02333b9192B7214N9097b22795L6870f9483
10495a55643E2140c159r2946H4146A2250g8886L1519F2685a91545B29079f1466
10483A29224h5437C85275j30924F3902J08055g9978L2375p861N607A60516e8414
10471a93757A99297b69163g7182q3066A70714f4863A64862Q7149b08307c0662
10460a37879c7047B7675E064d0686m88126A26150J91189b19259M9975C28014D6008
10448F1422K61024b90185J27434c6168p2413C6756f965A16733J11294q1558a24498
$$ y = [206973, -115247, -25925, -37009, -406749, 325406, 173399, -35453, -311945, 21210, -20112, -444101, 53089, -248871, -58150, -460315, -67162, -80916, -214059, 666282, -48856, 35277, -232848, 1133, 56845, 16103, -252728, -230660, 102333, -29192, 27214, 86311, -222795, -185925, -69483, -155643, 52140, -3159, -96105, 84146, 12250, -78886, -47367, 62685, -191545, 229079, -61466, 129224, -85437, 385275, 254351, 63902, 171957, -79978, -47603, -55464, -49857, 160516, -58414, -193757, 199297, -269163, -77182, -160248, 170714, -64863, 164862, 252011, -208307, -30662, -137879, -37047, 27675, 5064, -40686, -528812, 126150, 317339, -219259, -169284, 328014, 46008, 61422, 322446, -290185, -162751, -36168, -108581, 36756, -6965, 116733, 228027, 146469, -124498]
10436a05792m1020e1804j3451A79401D0033f7669l1050l39528a54644n1419f4552
10424B5884K24743a92120h6648j30194B46313b53235C6993J12510f8142j6464
10414h4606j0133A10312d9353A93025b35845o8034j04234D8970L3151A347N4186
10403E5533L07096g2022a4737j70030d3909D8539c12086f6892j6033j558D0634
10391B2473L46355d5669l3786A57526g4820A61037a62370B31747j09068a29045
10380A80662o1746H784J44567K8868a31586H6803B6544K53713j4295e3207E4605
10368B04767A8168d8110C32405j05388h4722A32828a34762A5398J15089Q3011
10358B13498a33843F5095a58076B37800Q6495c01629B03658l9646L21694a5696
$$ y = [-105792, -146812, -51804, -65255, 179401, 40033, -67669, -98719, -438247, -154644, -206063, -64552, 25884, 250627, -192120, -86648, -216842, 246313, -253235, 36993, 149503, -68142, -84606, -94739, 110312, -49353, 193025, -235845, -303879, -408113, 48970, 82121, 1347, 55533, 362629, -72022, -14737, -184767, -43909, 48539, -312086, -66892, -82925, -84483, 40634, 22473, 368828, -45669, -79455, 157526, -74820, 161037, -162370, 231747, 122679, -129045, 180662, 118916, 8784, 153351, 182219, -131586, 86803, 26544, 280257, 265962, -53207, 54605, 204767, 18168, -48110, 332405, 227017, -84722, 132828, -134762, 15398, 130487, 213498, -133843, 65095, -158076, 237800, 324295, -301629, 203658, 164012, 485706, -15696]
10347B77333G1110L33588b827C79350D5482L36065A71915O563K77622A77905c0606
10335A62590E2658A444a15040B87320d7731B4248a4085k55724E38803e3592J7412
10324c6180C29424q8059I2883g543p793D7332a0513n1238k09791a5248k4555j14680
10312a54483A30658L25891B6711M00322b26556f4229A09172P5973o4299b30820
10301b28056a06250C5690L4566j2550b03423A38660a68144j27287a13770C2323
10290c27108A4653i9035j27488D6946c44618f5905k2500j91716A03579j4387d40894
10278a04965G1196k1831J1250a86897A27967c166k0791m7528A45098a08955A46168
10266B98479p9016m4201L3017o6636j5299G334f9556B05939M89K1485r4807Q8324
$$ y = [277333, 71110, 404698, -2827, 379350, 45482, 381547, 171915, 178478, 456100, 177905, -30606, 162590, 52658, 1444, -115040, 287320, -47731, 24248, -14085, -269809, 538803, -53592, -36180, 329424, 241365, 92883, -7543, -15336, 47332, -10513, -61751, -271542, -15248, -39803, -154483, 130658, 456549, 26711, 427033, -226556, -64229, 109172, 185145, 120846, -230820, -228056, -106250, 35690, 70256, 57706, -203423, 138660, -168144, -295431, -113770, 32323, -327108, 14653, -99035, -226523, 46946, -344618, -65905, -88405, -280121, 103579, 89192, -440894, -104965, 71196, 49365, 60615, -186897, 127967, -3166, -23957, -71485, 145098, -108955, 146168, 298479, 219463, 175262, 208279, 141643, 126344, 7334, -69556, 205939, 206428, 227913, 133106, 221430]
10254B21430C133a31815A91065I952i6305c7730k2451C3585a09181K2718I3213
10242F9173b87043A98854f0836G7588N3737R7501a43366i68C58210d927A91137
10230c42553e5718C1722a05960j26220N5370n8709d9414j39471k4452O8068L5484
10219a09785j08182a1651B9805a00413b0393A22067h5536A41807i3088J0566A7476
10207a52164e2283p6323A74669K58227A6585k109b54497h8496a1620l08910i4791
10195b11999A00617j5610J59674m8586a11367C56318c25236h7116A40538E196
10184a66920i752k48916b6549A64955c09948C2378a34747o3010A25489a55766
10173a85645j05434k8567o5259G4784F535a72419P7292L9939I0915K05802d4703
$$ y = [221430, 3133, -131815, 191065, 9952, -96305, -37730, -60181, 33585, -109181, -86463, 93213, 69173, -287043, 198854, -60836, 77588, 131325, 228826, -143366, -968, 358210, -4927, 191137, -342553, -55718, 31722, -105960, -232180, -176810, -235519, -49414, -188885, -213337, -145269, -109785, -217967, -11651, 29805, -100413, -20393, 122067, -85536, 141807, -93088, -82522, 17476, -152164, -52283, -128606, 174669, 432896, 16585, 14476, -254497, -88496, -11620, -320530, -94791, -211999, 100617, 85007, 244681, 196095, -111367, 356318, -325236, -87116, 140538, 5196, -166920, -9752, -258668, -26549, 164955, -309948, 32378, -134747, -197757, 125489, -155766, -185645, -291079, -319646, -384905, 74784, 6535, -172419, -95127, -55188, 90915, 296717, -44703]
10161a33937q821A13158c26836f3973E9990c4381o1974j18877K4003L1088A53524
10149a77604o1930D8818a55741C8321a09190B13545N7777j30170a15413E26121
10138a35094A5318M639d9575l5191@G8411a9621K174I8426a34098A0430a36199
10125a22023A91907e8917k056B63143L654b49419C14712e7491K4022D3573c0987
10113I1577L26304c3606k36784B3391M4355l0335c49926A01315a81644a3871j52371
10102a66242j9007f3476j8213r9576g5608j11858p2699C4712b69286j52990g7372
10090b4492l3862q9674j04082i612k56986g3311j6324j89934A9331b971D1020
10078a25663A10819a56552B12550j7920A4501M1014O1158d8563o7874b8052m7664
$$ y = [-133937, -142758, 113158, -326836, -63973, 59990, -34381, -96355, -215232, -191229, -160141, 153524, -177604, -239534, 48818, -155741, 38321, -109190, 213545, 271322, 141152, -115413, 526121, -135094, 15318, 19957, -49575, -84766, 0, 78411, -19621, -17447, 98426, -134098, 10430, -136199, -122023, 191907, -58917, -60973, 263143, 266797, -249419, 314712, -57491, -33469, 43573, -30987, 91577, 417881, -33606, -270390, 23391, 67746, 37411, -349926, 101315, -181644, -13871, -166242, -185249, -63476, -81689, -181265, -75608, -187466, -260165, 34712, -269286, -422276, -77372, -24492, -58354, -148028, -252110, -9612, -266598, -73311, -89635, -279569, 19331, -2971, 41020, -125663, 110819, -156552, 212550, 194630, 14501, 55515, 116673, -48563, -116437, -28052, -75716]
10067g5716K4003k71703J12210A15556B1231b0102q3443B24089a53981m0793h3921
10055B66359d67356A37543b05786A09942n0555a09436N3154k6511j63145E1592
10044a84188F8264h1170j75614R9537f596p2365m0378m180j6270e7873o4302j44003
10032b66178N8583g6230L1650C7123J28232k0938Q401p3867C167K15816g473j30759
10020a38232m3004h2807r2384G6787b94895a36512o2589M6660j9542a7169A98206
10008A71723d0407G5980e2998E2086h164C5684a73538k87306J41816P061A64539
9996a44007j39237O8948I8616A2290a77629I7344m4525e8684j07662b2479l03139
9985c25618b0366q1170D5564a45988E3575a16636A19539B4795a04284P225k22962
$$ y = [-75716, -51713, -323416, -211206, 115556, 21231, -20102, -103545, 224089, -153981, -194774, -83921, 266359, -467356, 137543, -205786, 109942, 59387, -109436, -56282, -82793, -245938, 51592, -184188, 68264, -81170, -256784, -157247, -6596, -78961, -119339, -123519, -139789, -57873, -122175, -266178, -207595, -76230, -44580, 37123, 165355, 144417, 152818, 78951, 3167, 218983, -7473, -138232, -181236, -82807, -175191, 76787, -294895, -136512, -199101, -152441, -171983, -17169, 198206, 171723, -40407, 75980, -52998, 52086, -8164, 35684, -173538, -460844, -319028, -311967, 164539, -144007, -283244, -214296, 98616, 12290, -177629, 97344, 52819, -58684, -166346, -22479, -325618, -20366, -101536, 45564, -145988, 53575, -116636, 119539, 24795, -104284, -97059, -320021]
9974c20021K1816H180b14829J02199K1359b8667k76596A81293J9783c23758j96
9963c23954e9096a9441c997l55908g5841A40755B2927c3453j02473C1151J05883
9952A37034c2096k50991C2238a31841L0030o543m8382e906j16072l25214F556
9940b05292Q3188A53372a67841A76742a29574C6838c3659l9771q6614r8711C62342
9928I4462b8774B15036m9312e9760j70838G6688b54991A5427b16423B35883D3949
9916a29008A41403C430b30552A57551d3966l6832G772L3252a25226A72004a14088
9904B63937e0841A10627b43334A93238o3558A8386b17098A15212J00454i6038
9893a43030G0909c39157b1306C00062k9006c11843G4948a81951j58760J52846
$$ y = [-320021, -298205, 8180, -214829, -112630, -91271, -28667, -305263, 181293, 201076, -323758, -323954, -59096, -19441, -3997, -359905, -75841, 140755, 22927, -33453, -135926, 31151, 137034, -32096, -283087, 32238, -131841, -101811, -108354, -156736, -5906, -121978, -447192, 6556, -205292, -122104, 153372, -167841, 176742, -129574, 36838, -33659, -73430, -160044, -258755, 362342, 94462, -28774, 215036, 165724, -59760, -230598, 76688, -254991, 15427, -216423, 235883, 43949, -129008, 141403, 3430, -230552, 157551, -43966, -80798, 7772, 41024, -125226, 172004, -114088, 263937, -50841, 110627, -243334, 193238, 129680, 18386, -217098, 115212, 215666, -96038, -143030, 70909, -339157, -21306, 300062, 271056, -311843, 74948, -181951, -340711, -187865]
9883a87865k0450h7856H3146A7643h4522A39869h3932j0041G6144d8338C2940
9871a66851r4418b1128j3020j0974n5733k36873A52749C9060K7489K09955A05573
9859B8988P0785b17548E3497h879n9349B80286G7681N6375r32h2592a7885q3029
9847a00914G2173c4946k62066a44479n4218e7672j85556a19529N3236A11219m2687
9836F8532J04359a87651G3066e5919j69325l7577P4422A28404J71840i5368l7958
9825a33326l37538F9943b3467A9919h4794j37235n6928A04356a28543b91E2133
9813F0049P4694R47A873i2082B09864a06227j26672e0033j16588A29212d63352
9801c74558a05569C32595A15804h7830F3451j4098d7748k4772G4586a90122c8512
$$ y = [-187865, -208315, -87856, 83146, 17643, -84522, 139869, -83932, -93973, 76144, -48338, 32940, -166851, -261269, -21128, -34148, -45122, -100855, -337728, 152749, 39060, 66549, 276504, 105573, 28988, 99773, -217548, 53497, -8879, -68228, 280286, 77681, 134056, 133124, -82592, -17885, -100914, 72173, -34946, -297012, -144479, -198697, -57672, -243228, -119529, -66293, 111219, 68532, 172891, -187651, 73066, -55919, -225244, -262821, -188399, 128404, 300244, -95368, -133326, -470864, 69943, -23467, 19919, -84794, -222029, -278957, 104356, -128543, -291, 52133, 60049, 134743, 135690, 1873, -92082, 209864, -106227, -232899, -50033, -166621, 129212, -463352, -374558, -105569, 332595, 115804, -87830, 63451, 49353, -47748, -72520, 74586, -190122, -38512]
9789B0858R2226C2404a12211M7135G434J73490B4189Q5687h3997p5333E8555b0027
9776c97381J98376j00m2350I7740b19581h141k401B9167b40405a19862A73228
9764b61569A2978a72866j02892Q1284A8415b310A74503c35259F7866b51656K289
9753b49367i4671d4988G5478g3675A11523a38378O4294r0499N3915r9209h2324
9741a59084A93864I3774l3072a46037e61p4807J5192r0524A1588c78525g4354
9729I4311a58985K7915d1640j66074j23318A06637k8840P9783o1502C2976M1577
9718G4553H475a5565l63187b510B18570o6814c6514A47431a53746g0660G9813
9706b21580c6373B3585d14A09N2553J63663b55361O5838C54138c20011f0527j94754
$$ y = [20858, 113084, 32404, -112211, -65076, 7434, 180924, 24189, 109876, -83997, -159330, 58555, -20027, -397381, -199005, -199105, -241455, 97740, -219581, -8141, -10542, 29167, -240405, -119862, 173228, -261569, 12978, -172866, -275758, -194474, 18415, -2310, 174503, -335259, 67866, -251656, -249367, -94671, -44988, 75478, -73675, 111523, -138378, -74084, -164583, -110668, -209877, -82324, -159084, 193864, 93774, 60702, -146037, -561, -75368, -60176, -150700, 11588, -378525, -74354, 94311, -158985, -131070, -41640, -207714, -331032, 106637, 77797, 157580, 96078, 32976, 74553, 8475, -15565, -378752, -2510, 218570, 151756, -36514, 147431, -153746, -70660, 79813, -221580, -36373, 23585, -414, 109, 52662, 216325, -255361, -189523, 354138, -320011, -60527, -255281]
9694b55281H1939a06016n0078f4713k68192f5737o3793D48008e1588k74225A15485
9682A6375b59837g246B9496b88119p5550h0747B6775J74120a10325A4965J79812
9671A94777F1523c88390e6196k39543k16727b37472a14828k85395I6947a22201
9660b8393B11090H6537c08669l5806d7862q6531b1450A11733a39638G177J93860
9649B01037b41668B4387A0168K15020a71190N8775C61785b6934B4985J67269d18423
9637c34289C7806Q8750J2912P7481g7942E6078K19663m3998b02505N3417A30944
9625B01553e1397j3760j91011h4516k13065a42766a1395k75948n9918B8960N2469
9614H1429A2738J89153F3302a47169J5094G0816R1657C5153E992b32666a6619
$$ y = [-255281, 81939, -106016, -156094, -64713, -332905, -65737, -129530, 448008, -51588, -325813, 115485, 16375, -259837, -7246, 29496, -288119, -363669, -80747, 26775, 200895, -110325, 14965, 194777, 61523, -388390, -56196, -295739, -512466, -237472, -114828, -400223, 96947, -122201, -28393, 211090, 86537, -308669, -344475, -47862, -134393, -21450, 111733, -139638, 7177, 201037, -241668, 24387, 10168, 225188, -171190, -112415, 361785, -26934, 24985, 192254, -418423, -334289, 37806, 126556, 139468, 216949, -77942, 56078, 275741, 231743, -202505, -149088, 130944, 201553, -51397, -65157, -256168, -84516, -297581, -142766, -11395, -287343, -347261, 28960, 81429, 12738, 201891, 63302, -147169, -132075, 70816, 162473, 35153, 5992, -232666, -16619]
9602b20447h6591A48591c86965E0683a66216k4854a2212r6176d9136h462k19807
9591b28269a1774A28145a25948j08954H1485j1950b755J218B07520B4488N8588
9580H3076b21319b7734m6684a5339A7925B449J32233d4719B16795H420c6177k6116
9568f2293j5378A289a81291j52951L586a30817q0183g5622l88694a65618l8869
9557b04487B32908g7351F4007J18863b34541I6247c9677A03474A4738d472j41589
9546a46061M4785j00226i7134J7396a5518k980j23781r9273H8479a74427H6538
9534a11930L7834r170D2908J98739B0853h3365n1801j57837G5527h7322c5657
9522b0385k09489D9544B1155K75787F3184b41751C739a89788a5900B26557A00449
$$ y = [-220447, -86591, 148591, -386965, 50683, -166216, -191070, -12212, -108388, -49136, -8462, -228269, -11774, 128145, -125948, -234902, 81485, 69535, -2755, -1537, 207520, 24488, 83076, -221319, -27734, -74418, -15339, 17925, 2449, 134682, -44719, 216795, 8420, -36177, -62293, -77671, 1289, -181291, -334242, -330656, -130817, -211000, -75622, -464316, -165618, -204487, 232908, -77351, 64007, 182870, -234541, 96247, -39677, 103474, 14738, -4472, -146061, -101276, -201502, -97134, -79738, -15518, -18498, -142279, -241552, 88479, -174427, 86538, -111930, -74096, -83266, 42908, 241647, 20853, -83365, -135166, -293003, 75527, -87322, -35657, -20385, -229874, 49544, 21155, 296942, 63184, -241751, 3739, -189788, -15900, 226557, 100449]
9510a4111j29122A9645J41702b59340Q4151f7687j07373D7481c6701k46394B51278
9498b07625k387p2869a5979n3250k06432e5098j01087p3980B8205c0156A54672
9486B5188a02830L1561j91857J18875f4023o2865d1785F5991b42692N9207F8977
9474a00731A49976b11714D582a59563K9366l3234D8458b92550C3653g4704j13249
9463a87953e7340k72186A59064b97694A1339b87548J15452E9529g3765q9363A76147
9451b93268c0258l0067a4465D8442b44890B31489a90720Q3816M4113j47021e9989
9439c0776H10c00579B11693a58663D706b7860k32408k6403C4519K3887A951b6754
9426A25918f3875A0173J42198r515a81933A86565a80724k34651G4205R6620D550
$$ y = [-14111, -143233, 19645, 161347, -259340, -175189, -67687, -175060, 47481, -36701, -283095, 251278, -207625, -210012, -282881, -15979, -69229, -275661, -55098, -156185, -230165, 28205, -30156, 154672, 25188, -102830, -71269, -263126, -144251, -64023, -126888, -41785, 65991, -242692, -183485, 68977, -100731, 149976, -211714, 4582, -159563, -130197, -163431, 48458, -292550, 33653, -74704, -187953, -57340, -329526, 159064, -297694, 11339, -287548, -172096, 59529, -73765, -163128, 176147, -293268, -30258, -60325, -14465, 48442, -244890, 231489, -190720, -106904, -62791, -209812, -59989, -30776, 810, -300579, 211693, -158663, 4706, -27860, -260268, -286671, 34519, 58406, 1951, -26754, 125918, -63875, 10173, 152371, 142856, -181933, 186565, -180724, -415375, 74205, 170825, 4550]
9414a3602A88285a54058k14937g9976j37345B73530G6880k2166b69446j08925
9404c78371B0947J69703d156k03077A44316i4662D5795b08514B20624j07016b57590
9392b6247A85643p9352A4129d21089b4643j51920j03652O7819P2488c6794k41604
9381b78398O3568P1589B51113b82663C49942A09271I731a72802J5228m0117Q7745
9370a09946C6889c94684a18673A41016l7657C5739a30822k07034C41223a11015
9359C54639a21612C02402a44933N5600L7449j50491D10562a86220A6188l834i4581
9347a22410a6525j80839C03050b52202J341J9999B30000C2072Q3157b93401Q6902
9336b06499g7697j42201J00690K356j38082B90429b3145a718j85073A47659o675
$$ y = [-13602, 188285, -154058, -368995, -79976, -217321, 273530, 76880, 54714, -269446, -378371, 20947, 190650, -4156, -207233, 144316, -94662, 45795, -208514, 220624, 113608, -257590, -26247, 185643, 106291, 14129, -421089, -24643, -176563, -280215, -212396, -139908, -36794, -278398, -214830, -143241, 251113, -282663, 349942, 109271, 9731, -172802, -157574, -197691, -109946, 36889, -394684, -118673, 141016, 103359, 35739, -130822, -337856, 341223, -111015, 354639, -121612, 302402, -144933, -89333, -51884, -202375, 410562, -186220, 16188, 12354, -94581, -122410, -16525, -197364, 303050, -252202, -250861, -230862, 230000, 32072, 115229, -293401, -206499, -77697, -219898, -119208, -116852, -254934, 290429, -23145, -1718, -186791, 147659, 140984]
9325A40984d82739A32742J55828j0694c65866a04169j31556A94983a88346G3927
9314b14960O9103O5309C0385R9870e8450a4727k43230g5520B5280K6324c4242
9302f4297l6289A29273A759e2458K0779C7312a58919A73339e7344E8782m294a91584
9289E5582h6500A25644b18861J6292k46320b15472B0576J732b48341A03152f8964
9277E1688f697l6262A60403C2069a33951A56327L4943h2433A1668a00161q8847
9266a89008C1299a65440c2600A20337N6685J0898J94978a73769A14854A1340f0338
9254b0914A06030c8641a6317A49707g8102j9276D69473A60728e0259j84907A21126
9242A93934c51740Q5755O8572e8361j56769m9724f3942R934A42131a74204B8423
$$ y = [140984, -482739, 132742, 288570, 277876, -365866, -104169, -235725, 194983, -188346, 73927, -214960, -145857, -80548, 30385, 130255, -58450, -14727, -257957, -75520, 25280, 51604, -34242, -64297, -100586, 129273, 1759, -52458, -31679, 37312, -158919, 173339, -57344, 58782, 54488, -191584, 55582, -86500, 125644, -218861, -202569, -448889, -215472, 20576, 22308, -248341, 103152, -68964, 51688, -6697, -42959, 160403, 32069, -133951, 156327, 191270, -82433, 11668, -100161, -189008, 31299, -165440, -32600, 120337, 177022, 187920, 382898, -173769, 114854, 11340, -60338, -20914, 106030, -38641, -16317, 149707, -78102, -97378, 469473, 160728, -50259, -235166, 121126, 193934, -351740, -265985, -197413, -58361, -215130, -264854, -63942, -54008, 142131, -174204, 28423]
9230F4950h4365A16992c83715N169m7773h4436A41836a55322d9500k36238E2207
9218a98535g264A94387g3782A16345Q8122o9092L6445b34826P3226D8581A8251
9206a41178a9760m7703A311f562K678I6565a11195C9568J74499m3158a97776P1285
9194a26491J4567q5427N1076A22129J7774P271e1375J9745j17374L7663E8731
9182h5958A26289H625f6535H0746e8442q7026k49649f0475j48995O1362M5124
9171a02984C8813a19783B17447b48092d8117A02909j6421C3247O0103C0736h1512
9159I2773J84315a19033E2182J20719A9323K44269i0118j46576G6688D078b61305
9147b13084A10933d1687D7053j630a42726D8137a34734F2047b09554i2803k5386
$$ y = [64950, -84365, 116992, -383715, -378546, -426319, -84436, 141836, -155322, -49500, -285738, 52207, -198535, -7264, 194387, -73782, 116345, 204467, 135375, 171820, -234826, -161600, 48581, 18251, -141178, -19760, -67463, 1311, -6562, -3884, 96565, -111195, 39568, 214067, 170909, -197776, -126491, -111924, -197351, -146275, 122129, 139903, 147174, -51375, -31630, -149004, -111341, 58731, -85958, 126289, 8625, -66535, 80746, -58442, -145468, -395117, -60475, -209470, -148108, -102984, 38813, -119783, 217447, -248092, -48117, 102909, 86488, 33247, 93350, 30736, -81512, 92773, 277088, -119033, 52182, 172901, 19323, 263592, -90118, -236694, 76688, 4078, -261305, -213084, 110933, -41687, 47053, 45423, -142726, 48137, -134734, 62047, -209554, -92803, -118189]
9136a18189B5744g064j06664B20568c6183H0965f5326k8197d1403E3276b18133
9124c29571a55299N4097A87333a89023B4525c24641n9501R7868A5129a56158N4293
9113a01865k26944d6695A13315b54341I6833a95521c0059A74811b16984I4808
9102A90078M7993o6653a13270j07283C7154a33169G0219b9012r2162j45749B80788
9090h8084d0550I8589K19398j41592H462c10657A14188c23136F2988a1453m0967
9079e2420B00679g3840B40444G1580d8043m7580o4795g3217A38322h5553c5568
9067a56214j83838J50117M3334n2077h1286H3983B8455g2176j44900A48244m7600
9056A00644b77262C0194O455h7401j3501B6167b38874m8330a056I6054b65833
$$ y = [-118189, 25744, -7064, -113728, 220568, -36183, 80965, -65326, -93523, -41403, 53276, -218133, -329571, -155299, -101202, 187333, -189023, 24525, -324641, -384142, -286274, 15129, -156158, -101865, -328809, -46695, 113315, -254341, 96833, -195521, -30059, 174811, -216984, 94808, 190078, 238071, 171418, -113270, -220553, 37154, -133169, 70219, -29012, -121174, -266923, 280788, -88084, -40550, 98589, 317987, 176395, 8462, -310657, 114188, -323136, 62988, -11453, -52420, 200679, -73840, 240444, 71580, -48043, -95623, -160418, -73217, 138322, -85553, -35568, -156214, -340052, -189935, -146601, -198678, -81286, 83983, 28455, -72176, -217076, 148244, 100644, -277262, 30194, 36649, -87401, -100902, 26167, -238874, -287204, -1056, 96054, -265833]
9044a20562g208a965H5191J0902a22907C26567A50179P6846e6640A52048K1878
9033A73926c22975J48717c6599E1704O8329l1212H163J46121k1348a3065e173
9021B04284I1539K74624d7471D1437h0629l4588F2603K4008b40092A56757i9769
9009c2347k2253j81005B59947f3159k08524d6231A18759d2380H0204E301K90564
8998B95865a72119D78265a40612M7498c0802F2751A1146d09053H6263N759a49194
8986A57984B3108a50355L4231B7071d73590e252G3831R6117b23904A34410a33751
8974a50413g0389k03976A5340g9247A67716H801c23816A87520b31889E7506i8651
8962f1289D9841M6180b01752a0686f43k59719j07616b9487A60161a54240K5142
$$ y = [-120562, -7208, -1965, 85191, 96093, -122907, 326567, 150179, 227025, -56640, 152048, 173926, -322975, -174258, -36599, 51704, 120033, 88821, 8163, 154284, 132936, -13065, -5173, 204284, 91539, 366163, -47471, 41437, -80629, -115217, 62603, 86611, -240092, 156757, -99769, -32347, -54600, -235605, 259947, -63159, -271683, -46231, 118759, -42380, 80204, 5301, 295865, -172119, 478265, -140612, -93114, -30802, 62751, 11146, -409053, 86263, 92022, -149194, 157984, 23108, -150355, -116124, 27071, -473590, -5252, 73831, 169948, -223904, 134410, -133751, -150413, -70389, -274365, 15340, -79247, 167716, 8801, -323816, 187520, -231889, 57506, -98651, -61289, 49841, 96021, -201752, -10686, -643, -260362, -367978, -29487, 160161, -154240, -129098]
8951a29098l28203A61893B272b15079A669O234d04690a38794B3785K99982j28470
8940A95297J33044A8273c1978p3831A04333C8341O6082K10691b37537o0784a03205
8928A11924b4917C3087K49231a11768C53871b0347C07469J326276G74238A69341
8917H1270J84787b94960C1221J70588o5538b76198F1145R8725a05985E760K60103
8906B65863C4395r636a99962a2686l17492A17417b55194M5244a1341j34745B51921
8894A81938J08872l8884i3342q6398k5278i6271B22702f8509B39245a49450P4424
8883g5026L4826l02753H8195N153J38025j1736H7980a51780B97012d3294j06450
8872a49744d4494A06392h7165k24139A5054L2476j1181a52205I8341a06403n21711
$$ y = [-129098, -457301, 161893, 2272, -215079, 1669, 7903, -404690, -138794, 23785, 323767, 195297, 328341, 18273, -31978, -105809, 104333, 38341, 104423, 315114, -237537, -298321, -103205, 111924, -24917, 33087, 282318, -111768, 353871, -20347, 307469, 1633745, 774238, 169341, 81270, 266057, -294960, 31221, 201809, 136271, -276198, 61145, 159870, -105985, 5760, 265863, 34395, 24759, -199962, -12686, -330178, 117417, -255194, -209950, -11341, -146086, 251921, 181938, 290810, 251926, -93342, -179740, -205018, -96271, 222702, -68509, 239245, -149450, -75026, -40200, -342953, 88195, 93348, 231373, 219637, 87980, -151780, 297012, -43294, -149744, -44494, 106392, -87165, -311304, 15054, 47530, 36349, -152205, 98341, -106403, -628114]
8861f28114b10194H6635d41493A8721F719a04754F3042J29356a12380A27115a62568
8849b8599j38683e5616r769j31058L2733j29409B21660F4297g3899A7260a81747
8837A20374J1075c515B01873K7310d4001j55250O3247j44155J16971d8720p5977
8826a24697e5050B28235c3660k17672g0041j76530O6702G7557e3686k2921B1554
$$ y = [-628114, -210194, 86635, -441493, 18721, 6719, -104754, 63042, 192398, -112380, 127115, -162568, -28599, -167282, -55616, -65385, -196443, -163710, -293119, 221660, 64297, -73899, 17260, -181747, 120374, 131449, -3515, 201873, 229183, -44001, -199251, -136004, -280159, -163188, -48720, -124697, -55050, 228235, -33660, -251332, -70041, -246571, -179869, 77557, -53686, -76607, 21554]
$$ [...]
##END NTUPLES=NMR SPECTRUM
##END=
