##TITLE=NES1006_50530289_9232656_fRCv0EkKs0
##JCAMPDX= 6.0         $$ Bruker NMR JCAMP-DX V2.0
##DATA TYPE= NMR SPECTRUM
##DATA CLASS= NTUPLES
##ORIGIN= BRUKER
##OWNER= Administrator
$$ 1.72 TOPSPIN		Version 2.1
$$ 2015-06-17 17:37:02.175 -0700  Administrator@X
$$ Compression mode = diff/dup
##.OBSERVE FREQUENCY= 400.02188249412
##.OBSERVE NUCLEUS= ^1H
##.ACQUISITION MODE= SIMULTANEOUS (DQD)
##.ACQUISITION SCHEME= undefined
##.AVERAGES= 64
##.DIGITISER RES= 22
##SPECTROMETER/DATA SYSTEM= spect
##.PULSE SEQUENCE= noesygpps1d.comp
##.SOLVENT NAME= COFFEE_meoh
##.SHIFT REFERENCE= INTERNAL, COFFEE_meoh, 1, 14.96137
##AUDIT TRAIL= $$ (NUMBER, WHEN, WHO, WHERE, PROCESS, VERSION, WHAT)
$$ ##TITLE= Audit trail, TOPSPIN		Version 2.1
$$ ##JCAMPDX= 5.01
$$ ##ORIGIN= Bruker BioSpin GmbH
$$ ##OWNER= Administrator
$$ $$ E:\/data/COFFEE/nmr/NES1006_50530289_9232656_fRCv0EkKs0/12/pdata/1/auditp.txt
$$ ##AUDIT TRAIL=  $$ (NUMBER, WHEN, WHO, WHERE, PROCESS, VERSION, WHAT)
(   1,<2015-06-17 17:36:56.597 -0700>,<Administrator>,<X>,<go>,<TOPSPIN 2.1>,
      <created by zg
	started at 2015-06-17 17:25:27.253 -0700,
	POWCHK enabled, PULCHK disabled,
       configuration hash MD5:
       21 0F 79 D6 B3 7B B4 F6 88 20 88 DB 03 48 BD 9F
       data hash MD5: 64K
       F1 6C 6A 58 38 37 CF EA 43 32 98 DC 93 0A BB BD>)
(   2,<2015-06-17 17:37:00.112 -0700>,<Administrator>,<X>,<proc1d>,<TOPSPIN 2.1>,
      <Start of raw data processing
       efp LB = 0.3 FT_mod = 6 PKNL = 1 PHC0 = 0 PHC1 = 0 SI = 128K 
       data hash MD5: 128K
       F3 32 22 96 D0 06 1F 41 34 1C 50 2F B4 51 65 0F>)
(   3,<2015-06-17 17:37:01.003 -0700>,<Administrator>,<X>,<proc1d>,<TOPSPIN 2.1>,
      <pk PHC0 = -84.41345 PHC1 = 0 
       data hash MD5: 128K
       4C D6 C3 83 F5 29 87 85 36 CF 14 C1 51 8F B5 59>)
(   4,<2015-06-17 17:37:01.378 -0700>,<Administrator>,<X>,<proc1d>,<TOPSPIN 2.1>,
      <abs ABSG = 1 
       data hash MD5: 128K
       82 F7 92 7E 6B BA 8C DD A4 97 23 27 8B 7B 67 84>)
(   5,<2015-06-17 17:37:01.456 -0700>,<Administrator>,<X>,<proc1d>,<TOPSPIN 2.1>,
      <abs ABSG = 2 
       data hash MD5: 128K
       19 4C CD 00 C4 F1 A3 98 54 06 F8 6D AE 13 EA 9E>)
(   6,<2015-06-17 17:37:01.550 -0700>,<Administrator>,<X>,<proc1d>,<TOPSPIN 2.1>,
      <abs ABSG = 3 
       data hash MD5: 128K
       6F DD C1 65 5B 93 E9 E0 1C E5 2E D6 1B 0B 61 2D>)
(   7,<2015-06-17 17:37:01.628 -0700>,<Administrator>,<X>,<proc1d>,<TOPSPIN 2.1>,
      <abs ABSG = 4 
       data hash MD5: 128K
       84 C1 CB 27 04 4A 23 E2 87 82 FD 96 EA 5C AC 72>)
(   8,<2015-06-17 17:37:01.722 -0700>,<Administrator>,<X>,<proc1d>,<TOPSPIN 2.1>,
      <abs ABSG = 5 
       data hash MD5: 128K
       16 E2 B3 13 4D 7F 71 70 9C 57 B4 9C 02 3E 78 01>)
$$ ##END=
$$ 
$$ $$ hash MD5
$$ $$ 01 66 82 EF 27 6F 68 0A A6 B5 EE BF 75 7C F4 C7
##$RELAX= 
##$RELAX= 
##$RELAX= 
##$RELAX= 
##$RELAX= 
##$RELAX= 
##$RELAX= 
##$RELAX= 
$$ Bruker specific parameters
$$ --------------------------
##$DU= <E:\>
##$EXPNO= 12
$$ [...]
##$TP07= 0
##$TPNAME0= <>
##$TPNAME1= <>
##$TPNAME2= <>
##$TPNAME3= <>
##$TPNAME4= <>
##$TPNAME5= <>
##$TPNAME6= <>
##$TPNAME7= <>
##$TPOAL= (0..7)
0.5 0.5 0.5 0.5 0.5 0.5 0.5 0.5
##$TPOFFS= (0..7)
0 0 0 0 0 0 0 0
##$TUNHIN= 0
##$TUNHOUT= 0
##$TUNXOUT= 0
##$USERA1= <user>
##$USERA2= <user>
##$USERA3= <user>
##$USERA4= <user>
##$USERA5= <user>
##$V9= 5
##$VALIST= <valist>
##$VCLIST= <CCCCCCCCCCCCCCC>
##$VD= 0
##$VDLIST= <DDDDDDDDDDDDDDD>
##$VPLIST= <PPPPPPPPPPPPPPP>
##$VTLIST= <TTTTTTTTTTTTTTT>
##$WBST= 2048
##$WBSW= 25
##$XGAIN= (0..3)
0 0 0 0
##$XL= 0
##$YL= 0
##$YMAX_a= 5223204
##$YMIN_a= -9158233
##$ZGOPTNS= <>
##$ZL1= 120
##$ZL2= 120
##$ZL3= 120
##$ZL4= 120
##$ABSF1= 14.96137
##$ABSF2= -5.596811
##$ABSG= 5
##$ABSL= 3
##$ALPHA= 0
##$AQORDER= 0
##$ASSFAC= 0
##$ASSFACI= 0
##$ASSFACX= 0
##$ASSWID= 0
##$AUNMP= <proc_prof1d_extract.lims>
##$AXLEFT= 0
##$AXNAME= <>
##$AXNUC= <1H>
##$AXRIGHT= 0
##$AXTYPE= 0
##$AXUNIT= <>
##$AZFE= 0.1
##$AZFW= 0.1
##$BCFW= 0
##$BC_mod= 0
##$BYTORDP= 0
##$COROFFS= 0
##$CY= 15
##$DATMOD= 1
##$DC= 0
##$DFILT= <>
##$DTYPP= 0
##$F1P= 0
##$F2P= 0
##$FCOR= 0.5
##$FTSIZE= 131072
##$FT_mod= 6
##$GAMMA= 0
##$GB= 0
##$INTBC= 1
##$INTSCL= 1
##$ISEN= 128
##$LB= 0.3
##$LEV0= 0
##$LPBIN= 0
##$MAXI= 10000
##$MC2= 0
##$MEAN= 0
##$ME_mod= 0
##$MI= 0
##$NCOEF= 0
##$NC_proc= -3
##$NLEV= 6
##$NOISF1= 0
##$NOISF2= 0
##$NSP= 0
##$NTH_PI= 0
##$NZP= 0
##$OFFSET= 14.96137
##$PC= 1
##$PHC0= -84.41345
##$PHC1= 0
##$PH_mod= 1
##$PKNL= yes
##$PPARMOD= 0
##$PPDIAG= 0
##$PPIPTYP= 0
##$PPMPNUM= 2147483647
##$PPRESOL= 1
##$PSCAL= 4
##$PSIGN= 0
##$PYNMP= <proc.py>
##$REVERSE= no
##$SF= 400.020009488213
##$SI= 131072
##$SIGF1= 0
##$SIGF2= 0
##$SINO= 400
##$SIOLD= 131072
##$SPECTYP= <>
##$SREGLST= <1H.CDCl3>
##$SSB= 0
##$STSI= 131072
##$STSR= 0
##$SW_p= 8223.68421052631
##$SYMM= 0
##$S_DEV= 0
##$TDeff= 65536
##$TDoff= 0
##$TI= <>
##$TILT= no
##$TM1= 0
##$TM2= 0
##$TOPLEV= 0
##$USERP1= <user>
##$USERP2= <user>
##$USERP3= <user>
##$USERP4= <user>
##$USERP5= <user>
##$WDW= 1
##$XDIM= 131072
##$YMAX_p= 537666364
##$YMIN_p= -22420
##$CURPLOT= <Network HP LaserJet P1505>
##$CURPRIN= <$Network HP LaserJet P1505>
##$DFORMAT= <normdp>
##$LAYOUT= <+/1D_H.xwp>
##$LFORMAT= <normlp>
##$PFORMAT= <normpl>
##$SURQMSG= 1
$$ End of Bruker specific parameters
$$ ---------------------------------
##NTUPLES= NMR SPECTRUM
##VAR_NAME=  FREQUENCY,     SPECTRUM/REAL,   SPECTRUM/IMAG
##SYMBOL=    X,             R,               I
##VAR_TYPE=  INDEPENDENT,   DEPENDENT,       DEPENDENT
##VAR_FORM=  AFFN,          ASDF,            ASDF
##VAR_DIM=   131072,        131072,          131072
##UNITS=     HZ,            ARBITRARY UNITS, ARBITRARY UNITS
##FACTOR=    0.0627417313425164, 1,          1
##FIRST=     8223.62146879497, 88,           -73550
##LAST=      0,             4180,            -73445
##MIN=       0,             -22420,          0
##MAX=       8223.62146879497, 537666364,    0
$$ Real data points
##PAGE= N=1
##DATA TABLE= (X++(R..R)), XYDATA
$$ [...]
$$ plain form
63453 292620 302101 312951 325004 337628 350175 362885 376610 391366 405944 419523 432993 447935
63441 447935 464959 483962 505393 530077 558012 588617 622043 658971 698952 740334 782310
63430 782310 825829 871743 918961 965182 1008468 1047139 1078943 1101827 1115650 1122244 1123620 1120642
63418 1120642 1113525 1103070 1091142 1080017 1071047 1063605 1055313 1043544 1026813 1004951 978489 948130
63406 948130 914430 877638 838036 796601 755003 714831 677149 642789 612278 585135 560121
63395 560121 536887 516741 501000 489141 479575 471918 467346 466635 468766 471842 474918 478804 485471
63382 485471 496607 512214 530487 549503 568995 590216 614354 641674 671941 704799 739582
63371 739582 775500 812405 850972 891765 934151 975911 1013658 1044061 1065483 1078554 1084809 1085055
$$ packed form
63453B92620R481J0850J2053J2624J2547J2710J3725J4756J4578J3579J3470J4942
63441D47935J7024J9003K1431K4684K7935L0605L3426L6928L9981M1382M1976
63430G82310M3519M5914M7218M6221M3286L8671L1804K2884J3823O594J376k978
63418A120642p117j0455j1928j1125q970p442q292j1769j6731k1862k6462l0359
63406I48130l3700l6792l9602m1435m1598m0172l7682l4360l0511k7143k5014
63395E60121k3234k0146j5741j1859r566p657m572p11K131L076L076L886O667
63382D85471J1136J5607J8273J9016J9492K1221K4138K7320L0267L2858L4783
63371G39582L5918L6905L8567M0793M2386M1760L7747L0403K1422J3071O255K46
$$ plain form
63359 1085055 1079654 1069926 1058018 1045279 1031784 1017639 1003538 989616 974856 958388 940381 920765
63347 920765 897980 870248 837784 802668 766773 730844 695432 661517 629778 600075 572131
63336 572131 546287 523145 502795 484696 468161 452820 438792 426515 416194 407401 399440 392105
63324 392105 385785 380739 376583 372561 368010 362432 355558 347742 340090 333662 328364 322888 316021 308108
63310 308108 301141 297173 296393 296751 295769 292915 290019 289086 289954 290534 289325 287065 285590 285656 286537 287529 288884
63293 288884 290984 293274 294564 294058 291697 287880 283387 279305 276253 273632 270306 266247 263001 262155 263670
63278 263670 265973 267524 268062 268487 269709 271611 273098 273276 272485 271916 272333 273619 275541 278309 282126 286741
63262 286741 291880 297661 304125 310693 316681 322187 327928 334354 341501 349596 358999 369322 379241 387717
$$ packed form
63359A085055n401r728j1908j2739j3495j4145j4101j3922j4760j6468j8007j9616
63347I20765k2785k7732l2464l5116l5895l5929l5412l3915l1739k9703k7944
63336E72131k5844k3142k0350j8099j6535j5341j4028j2277j0321q793p961p335
63324C92105o320n046m156m022m551n578o874p816p652o428n298n476o867p913
63310C08108o967l968p80L58r82k854k896r33Q68N80j209k260j475O6Q81R92J355
63293B88884K100K290J290n06k361l817m493m082l052k621l326m059l246q46J515
63278B63670K303J551N38M25J222J902J487J78p91n69M17J286J922K768L817M615
63262B86741N139N781O464O568N988N506N741O426P147Q095R403J0323R919Q476
$$ plain form
63248 387717 395190 403235 413209 425472 439670 455470 473020 492811 514846 537827 559707 579697
63236 579697 599512 621780 647032 673046 697585 720952 744989 770126 794751 817616 839593
63225 839593 862395 886457 911026 935771 961124 987021 1012151 1034732 1053506 1067896 1077727 1082933
63213 1082933 1083200 1077888 1066735 1050550 1030564 1007090 979627 948531 915818 883930 854333 827730
63201 827730 804779 785783 770156 757174 747129 741022 739279 741408 746859 755469 767031 781122
63189 781122 797591 816731 838721 863194 889537 917336 946459 976879 1008370 1040151 1071081
63178 1071081 1100565 1129033 1157041 1184186 1209664 1233679 1257181 1279907 1299666 1314167 1322822
63167 1322822 1326119 1323898 1315154 1299289 1276746 1248505 1215562 1178822 1138975 1096517 1052393 1008503
$$ packed form
63248C87717P473Q045R974J2263J4198J5800J7550J9791K2035K2981K1880J9990
63236E79697J9815K2268K5252K6014K4539K3367K4037K5137K4625K2865K1977
63225H39593K2802K4062K4569K4745K5353K5897K5130K2581J8774J4390R831N206
63213A082933K67n312j1153j6185j9986k3474k7463l1096l2713l1888k9597k6603
63201H27730k2951j8996j5627j2982j0045o107j743K129N451Q610J1562J4091
63189G81122J6469J9140K1990K4473K6343K7799K9123L0420L1491L1781L0930
63178A071081K9484K8468K8008K7145K5478K4015K3502K2726J9759J4501Q655
63167A322822L297k221q744j5865k2543k8241l2943l6740l9847m2458m4124m3890
$$ plain form
63155 1008503 966914 928516 892851 859201 827420 797884 771388 749129 731837 718508 706721
63144 706721 694793 683171 673180 664966 657473 650210 644107 640421 639392 640167 641551 642557 642651 641908 640844
63129 640844 639863 638942 637937 637045 636726 637280 638649 640547 642551 644080 644556 643853 642591 641791 642104 643408
63113 643408 645284 647713 650988 654862 658324 660684 662619 665553 669982 674981 679435 683160 686491 689334
63099 689334 691288 692471 693647 695520 698305 702004 706628 712036 717890 723978 730418 737387 744790 752326
63085 752326 759855 767609 776003 785191 794787 804149 812958 821290 829166 836433 843377 851059 860517 871874
63071 871874 884645 898690 914201 930913 948232 966304 986186 1008513 1032686 1057975 1084938
63060 1084938 1115042 1149037 1186289 1225679 1266755 1310004 1356249 1405650 1457147 1509162 1561127
$$ packed form
63155A008503m1589l8398l5665l3650l1781k9536k6496k2259j7292j3329j1787
63144G06721j1928j1622r991q214p493p263o103l686j029P75J384J006R4p43j064
63129F40844r81r21j005q92l19N54J369J898K004J529M76p03j262q00L13J304
63113F43408J876K429L275L874L462K360J935K934M429M999M454L725L331K843
63099F89334J954J183J176J873K785L699M624N408N854O088O440O969P403P536
63085G52326P529P754Q394R188R596R362Q809Q332P876P267O944P682R458J1357
63071H71874J2771J4045J5511J6712J7319J8072J9882K2327K4173K5289K6963
63060A084938L0104L3995L7252L9390M1076M3249M6245M9401N1497N2015N1965
$$ plain form
63049 1561127 1613881 1668056 1722551 1775447 1826298 1876530 1927420 1978679 2029500 2080164 2131752
63038 2131752 2184644 2238008 2290458 2340293 2385039 2421633 2447643 2462064 2464710 2455270 2433382 2399430
63026 2399430 2354783 2301261 2240686 2174967 2106181 2036295 1966959 1899770 1836621 1779535 1730055
63015 1730055 1688812 1655609 1629888 1611317 1600185 1597235 1602994 1617266 1639352 1668511 1703889 1744122
63003 1744122 1787563 1833178 1880914 1930956 1982899 2035883 2089227 2142442 2194772 2245289 2293654
62992 2293654 2340432 2386334 2431105 2473113 2509779 2538394 2556921 2564352 2560309 2544149 2514674 2471039
62980 2471039 2414003 2345979 2269700 2186942 2098637 2005895 1910519 1814551 1719770 1627794 1540284
62969 1540284 1458623 1383519 1315160 1253563 1198356 1148403 1102225 1058934 1018420 980682 945606
$$ packed form
63049A561127N2754N4175N4495N2896N0851N0232N0890N1259N0821N0664N1588
63038B131752N2892N3364N2450M9835M4746L6594K6010J4421K646r440k1888l3952
63026B399430m4647n3522o0575o5719o8786o9886o9336o7189o3149n7086m9480
63015A730055m1243l3203k5721j8571j1132k950N759J4272K2086K9159L5378M0233
63003A744122M3441M5615M7736N0042N1943N2984N3344N3215N2330N0517M8365
62992B293654M6778M5902M4771M2008L6666K8615J8527P431m043j6160k9475m3635
62980B471039n7036o8024p6279q2758q8305r2742r5376r5968r4781r1976q7510
62969A540284q1661p5104o8359o1597n5207m9953m6178m3291m0514l7738l5076
$$ plain form
62958 945606 913557 885416 861477 840763 821907 804225 787263 769842 750722 730228 710185
62947 710185 691881 674924 658534 643120 629743 618451 608045 597519 587119 577898 570611 565152
62935 565152 560760 556682 552826 549697 547503 545488 542539 538410 533879 529626 525424 520740 515831 511770
62921 511770 509404 508498 507955 506749 504541 501555 498079 494350 490782 487813 485204 481877 477092 471676 467430
62906 467430 465135 463750 461858 459249 456616 454300 452069 449739 447180 443948 439841 435794 433287 432648
62892 432648 432809 432917 433182 433695 433514 431882 429540 427714 426262 424101 421304 419444 419529 420595 420867 419583
62876 419583 417214 414492 411799 409189 406496 403473 399955 395800 390903 385784 381997 380994 382289 383493
62862 383493 382674 380131 377499 375824 375142 375219 375849 376747 377825 379228 380547 380586 378738 376093 374180 373085
$$ packed form
62958I45606l2049k8141k3939k0714j8856j7682j6962j7421j9120k0494k0043
62947G10185j8304j6957j6390j5414j3377j1292j0406j0526j0400r221p287n459
62935E65152m392m078l856l129k194k015k949m129m531m253m202m684m909m061
62921E11770k366r06n43j206k208k986l476l729l568k969k609l327m785n416m246
62906D67430k295j385j892k609k633k316k231k330k559l232m107m047k507o39
62892D32648J61J08K65N13j81j632k342j826j452k161k797j860Q5J066K72j284
62876D19583k369k722k693k610k693l023l518m155m897n119l787j003J295J204
62862C83493q19k543k632j675o82P7O30Q98J078J403J319L9j848k645j913j095
$$ plain form
62846 373085 372015 371307 372252 374787 377012 377642 377494 377634 377381 375572 372959 371724 372778 374891 376607 377913
62830 377913 379680 382399 385899 389674 393127 396000 398887 402859 408262 414247 419690 424133 427658 430541
62816 430541 433413 437029 441216 444692 446967 449979 456539 466974 478466 488202 496220 504503 514300 525521
62802 525521 538255 553409 571461 591487 612095 633082 655909 682608 714259 750284 789372
62791 789372 831293 877556 929834 988189 1051618 1120088 1194841 1276478 1363819 1455222 1550002
62780 1550002 1647678 1746323 1842486 1932502 2013386 2082953 2139744 2182606 2209981 2220193 2213029
62769 2213029 2190315 2154124 2105059 2043423 1971496 1893141 1811184 1726523 1639921 1553244 1468426
62758 1468426 1386331 1307270 1231741 1160117 1092467 1029267 971493 919384 871865 827924 787835
$$ packed form
62846C73085j070p08R45K535K225O30j48J40k53j809k613j235J054K113J716J306
62830C77913J767K719L500L775L453K873K887L972N403N985N443M443L525K883
62816D30541K872L616M187L476K275L012O560J0435J1492R736Q018Q283R797J1221
62802E25521J2734J5154J8052K0026K0608K0987K2827K6699L1651L6025L9088
62791G89372M1921M6263N2278N8355O3429O8470P4753Q1637Q7341R1403R4780
62780A550002R7676R8645R6163R0016Q0884O9567N6791M2862K7375J0212p164
62769B213029k2714l6191m9065o1636p1927p8355q1957q4661q6602q6677q4818
62758A468426q2095p9061p5529p1624o7650o3200n7774n2109m7519m3941m0089
$$ plain form
62747 787835 752227 720615 691851 665627 642465 622343 604279 587407 571832 558272 547313
62736 547313 539039 532937 528072 523695 519745 516674 514990 515155 517517 521814 526920 531650 535947 541081
62722 541081 548797 560318 575699 593650 612346 631086 651122 674421 701820 732949 767763 807331
62710 807331 852930 905002 963322 1027742 1098386 1175283 1258057 1346011 1438529 1535391 1636481
62699 1636481 1740817 1845925 1948423 2045177 2133708 2211629 2276120 2324141 2353268 2362612 2352988
62688 2352988 2325852 2281946 2221584 2146549 2060777 1968214 1870586 1768408 1663746 1560388 1461083
62677 1461083 1366161 1275631 1191294 1115405 1047828 985809 926693 870117 817586 770703 730061
62666 730061 695187 664917 637852 612826 589264 567189 546804 527891 509821 492410 476610
$$ packed form
62747G87835l5608l1612k8764k6224k3162k0122j8064j6872j5575j3560j0959
62736E47313q274o102m865m377l950l071j684J65K362M297N106M730M297N134
62722E41081P716J1521J5381J7951J8696J8740K0036K3299K7399L1129L4814L9568
62710H07331M5599N2072N8320O4420P0644P6897Q2774Q7954R2518R6862J01090
62699A636481J04336J05108J02498R6754Q8531P7921O4491M8021K9127R344r624
62688B352988k7136m3906o0362p5035q5772r2563r7628j02178j04662j03358r9305
62677A461083r4922r0530q4337p5889o7577o2019n9116n6576n2531m6883m0642
62666G30061l4874l0270k7065k5026k3562k2075k0385j8913j8070j7411j5800
$$ plain form
62655 476610 463731 453761 444977 435610 425585 416292 408891 403181 397973 392146 385447 378588 372623 368060
62641 368060 364639 361940 359852 358233 356533 354345 352139 350835 350540 350221 348902 346798 345031 344467 345219
62626 345219 347083 349866 353059 355587 356419 355627 354606 355089 357956 363009 369604 377261 385758 395017 405108
62611 405108 416329 429290 444830 463580 485357 509144 534025 560240 589162 622206 659770
62600 659770 701073 744745 789712 835657 882390 928610 971823 1010111 1043651 1073527 1099022
62589 1099022 1117101 1125038 1122907 1113052 1097654 1077317 1051523 1019872 983099 943284 902868 863121
62577 863121 823738 784073 744275 705066 667134 631341 598792 569897 543728 519185 496519
62566 496519 476806 460052 444798 429859 415679 403691 394831 388907 384893 381598 378426 375756 374338
$$ packed form
62655D76610j2879r970q784r367j0025r293p401n710n208n827o699o859n965m563
62641C68060l421k699k088j619j700k188k206j304k95l19j319k104j767n64P52
62626C45219J864K783L193K528Q32p92j021M83K867N053O595P657Q497R259J0091
62611D05108J1221J2961J5540J8750K1777K3787K4881K6215K8922L3044L7564
62600F59770M1303M3672M4967M5945M6733M6220M3213L8288L3540K9876K5495
62589A099022J8079P937k131r855j5398k0337k5794l1651l6773l9815m0416l9747
62577H63121l9383l9665l9798l9209l7932l5793l2549k8895k6169k4543k2666
62566D96519j9713j6754j5254j4939j4180j1988q860n924m014l295l172k670j418
$$ plain form
62553 374338 374275 374833 375211 375084 374495 373737 373371 373758 374368 374090 372479 370337 368870 368606 369251 370152 370835 371630
62535 371630 374015 379802 389583 402271 416333 431040 446447 462946 481348 502705 527290 554181
62523 554181 582688 613996 650575 693877 743191 796700 852926 910891 969467 1027028 1081638
62512 1081638 1131348 1174453 1209567 1235448 1250958 1255566 1249861 1235205 1212740 1182981 1146509 1104658
62500 1104658 1059239 1011617 962317 911592 860310 810265 763489 721089 682761 647583 615229
62489 615229 586296 561465 540661 523123 508018 494752 482765 471419 460273 449451 439536 430970
62477 430970 423532 416576 409841 403858 399370 396360 393942 391365 388929 387609 387697 388038 386913 383673 379285
62462 379285 375190 371902 368988 366305 364754 365589 369121 374254 379264 382959 385347 387484 390727 395894
$$ packed form
62553C74338o3N58L78j27n89p58l66L87O10k78j611k142j467k64O45R01O83P95
62535C71630K385N787R781J2688J4062J4707J5407J6499J8402K1357K4585K6891
62523E54181K8507L1308L6579M3302M9314N3509N6226N7965N8576N7561N4610
62512A081638M9710M3105L5114K5881J5510M608n705j4656k2465k9759l6472m1851
62500A104658m5419m7622m9300n0725n1282n0045m6776m2400l8328l5178l2354
62489F15229k8933k4831k0804j7538j5105j3266j1987j1346j1146j0822r915q566
62477D30970p438o956o735n983m488l010k418k577k436j320Q8L41j125l240m388
62462C79285m095l288k914k683j551Q35L532N133N010L695K388K137L243N167
$$ plain form
62448 395894 402852 410774 418895 427212 436437 447044 458267 468396 476262 482138 486773 489893 490268 487179
62434 487179 481123 473030 463527 453220 442972 433369 424333 415660 407537 400121 393122 386358 380347 375695
62420 375695 372133 368785 365271 361960 359217 356976 355062 353461 352242 351587 351794 352915 354491 356084 357942
62405 357942 360759 364908 370224 376234 382125 386930 390427 393623 397643 402443 407376 412581 418666 425365
62391 425365 431961 439032 448103 459089 469703 478294 485906 494370 503546 511822 518540 524427 530169 536124
62377 536124 543327 553368 567015 583839 603178 624604 647667 672484 700798 735232 776880 824397
62365 824397 875987 931602 992596 1059568 1131034 1203950 1275246 1342936 1405867 1462391 1509774
62354 1509774 1545614 1569689 1583705 1589230 1586733 1576619 1560014 1537861 1510004 1475943 1436040 1391388
$$ packed form
62448C95894O958P922Q121Q317R225J0607J1223J0129P866N876M635L120L75l089
62434D87179o056q093r503j0307j0248r603r036q673q123p416o999o764o011m652
62420C75695l562l348l514l311k743k241j914j601j219o55K07J121J576J593J858
62405C57942K817M149N316O010N891M805L497L196M020M800M933N205O085O699
62391D25365O596P071R071J0986J0614Q591P612Q464R176Q276O718N887N742N955
62377E36124P203J0041J3647J6824J9339K1426K3063K4817K8314L4434M1648M7517
62365H24397N1590N5615O0994O6972P1466P2916P1296O7690O2931N6524M7383
62354A509774L5840K4075J4016N525k497j0114j6605k2153k7857l4061l9903m4652
$$ plain form
62342 1391388 1342990 1291830 1239446 1187698 1137987 1091114 1047658 1007890 971445 937759 906856
62331 906856 879131 854305 831238 809017 787573 766784 745558 722716 698738 675784 655582
62320 655582 637764 620741 603723 587296 572372 559432 548695 540013 532392 524671 517226 511986
62308 511986 509881 509124 507265 504438 503189 505223 509685 514848 520109 525754 531848 538176 544620 550951
62294 550951 556709 561836 566964 572684 578929 585415 592175 599267 606376 613052 618947 623797 627900 632694
62280 632694 639863 649370 659349 668541 677825 688572 700573 712840 725769 741190 760571 784305
62268 784305 812471 845214 882537 924706 972646 1026930 1086503 1149322 1213958 1279525 1344328
62257 1344328 1405817 1461852 1510854 1550996 1580848 1601025 1613610 1619377 1616801 1604246 1581840 1550637
$$ packed form
62342A391388m8398n1160n2384n1748m9711m6873m3456l9768l6445l3686l0903
62331I06856k7725k4826k3067k2221k1444k0789k1226k2842k3978k2954k0202
62320F55582j7818j7023j7018j6427j4924j2940j0737q682p621p721p445n240
62308E11986k105p57j859k827j249K034M462N163N261N645O094O328O444O331
62294E50951N758N127N128N720O245O486O760P092P109O676N895M850M103M794
62280F32694P169R507R979R192R284J0747J2001J2267J2929J5421J9381K3734
62268G84305K8166L2743L7323M2169M7940N4284N9573O2819O4636O5567O4803
62257A344328O1489N6035M9002M0142K9852K0177J2585N767k576j2555k2406l1203
$$ plain form
62245 1550637 1511439 1465314 1414001 1358584 1298785 1234685 1168377 1102775 1039595 979662 924360
62234 924360 875145 831916 793392 759127 729874 705845 685842 668391 652802 638865 626485
62223 626485 615925 607509 600644 593942 586780 580068 574943 571370 568722 567223 567902 571090 575490 579002
62209 579002 580405 580448 581439 585424 592314 599795 605429 608864 611870 616295 622376 629232 636659 645766 657514
62194 657514 670991 683880 694930 705468 718010 733628 751124 768571 785036 800841 816827
62183 816827 833730 851925 871427 892229 914667 939236 966102 995249 1027200 1063099 1103819
62172 1103819 1149339 1199149 1252627 1308499 1364406 1417783 1467062 1511379 1549201 1578170 1596750
62161 1596750 1605631 1607051 1602934 1593827 1579216 1558292 1530524 1496081 1455999 1411772 1364658 1315489
$$ packed form
62245A550637l9198m6125n1313n5417n9799o4100o6308o5602o3180n9933n5302
62234I24360m9215m3229l8524l4265k9253k4029k0003j7451j5589j3937j2380
62223F26485j0560q416o865o702p162o712n125l573k648j499O79L188M400L512
62209E79002J403M3R91L985O890P481N634L435L006M425O081O856P427R107J1748
62194F57514J3477J2889J1050J0538J2542J5618J7496J7447J6465J5805J5986
62183H16827J6903J8195J9502K0802K2438K4569K6866K9147L1951L5899M0720
62172A103819M5520M9810N3478N5872N5907N3377M9279M4317L7822K8969J8580
62161A596750Q881J420m117r107j4611k0924k7768l4443m0082m4227m7114m9169
$$ plain form
62149 1315489 1265109 1214619 1165030 1117041 1071514 1029886 993412 961895 933826 908183 885588
62138 885588 867142 852480 839740 827334 814918 802552 789967 777218 765286 755106 746378 738128
62126 738128 730150 723050 717049 711725 706996 703486 701680 701611 703515 707725 713350 718169 720882 722865 726746
62111 726746 733601 742324 751191 759092 765713 771758 778881 788240 799079 809734 819856 830434 841752
62098 841752 852913 863726 875392 888621 902450 915863 929293 943536 958532 974396 992348
62087 992348 1012994 1034774 1055969 1077358 1100787 1125609 1149027 1170149 1191467 1215773 1243632
62076 1243632 1274605 1308813 1345942 1384443 1423494 1464694 1510123 1559301 1609445 1658159 1704378
62065 1704378 1746876 1783340 1811294 1829374 1837923 1839027 1835457 1828393 1816244 1796771 1770337 1739978
$$ packed form
62149A315489n0380n0490m9589m7989m5527m1628l6474l1517k8069k5643k2595
62138H85588j8446j4662j2740j2406j2416j2366j2585j2749j1932j0180q728q250
62126G38128p978p100o001n324m729l510j806o9J904M210N625M819K713J983L881
62111G26746O855Q723Q867P901O621O045P123R359J0839J0655J0122J0578J1318
62098H41752J1161J0813J1666J3229J3829J3413J3430J4243J4996J5864J7952
62087I92348K0646K1780K1195K1389K3429K4822K3418K1122K1318K4306K7859
62076A243632L0973L4208L7129L8501L9051M1200M5429M9178N0144M8714M6219
62065A704378M2498L6464K7954J8080Q549J104l570p064j2149j9473k6434l0359
$$ plain form
62053 1739978 1708056 1674043 1636140 1594114 1549627 1504322 1458714 1413130 1368953 1328252 1292279
62042 1292279 1260745 1232677 1207503 1184911 1164129 1144214 1125170 1107963 1093165 1080284 1068750
62031 1068750 1058748 1050404 1042813 1034738 1025942 1017079 1008607 1000572 993256 987167 982370 978442 975060 972112
62017 972112 969393 966703 964143 961802 959445 957137 955830 956424 958374 960054 960585 960552 961025 962735 966215
62002 966215 971688 978432 985070 990987 996832 1003216 1009407 1013766 1015239 1014260 1012385 1011021 1010152 1008424 1004913
61987 1004913 1000487 996827 994447 992667 991228 990610 990699 990534 989820 989343 989303 988519 986189 983353 981502 980712
61971 980712 980321 980685 982846 986865 991706 996603 1001396 1005719 1009027 1011501 1013925 1016550 1018961 1021092 1023387
61956 1023387 1025776 1027524 1028554 1030102 1033448 1038535 1044400 1050507 1057156 1064862 1073951 1084712 1097451
$$ packed form
62053A739978l1922l4013l7903m2026m4487m5305m5608m5584m4177m0701l5973
62042A292279l1534k8068k5174k2592k0782j9915j9044j7207j4798j2881j1534
62031A068750j0002q344p591q075q796q863q472q035p316o089m797l928l382k948
62017I72112k719k690k560k341k357k308j307N94J950J680N31l3M73J710L480
62002I66215N473O744O638N917N845O384O191M359J473r79j875j364q69j728l511
61987A004913m426l660k380j780j439o18Q9j65p14m77m0p84k330k836j851p90
61971I80712l91L64K161M019M841M897M793M323L308K474K424K625K411K131K295
61956A023387K389J748J030J548L346N087N865O107O649P706R089J0761J2739
$$ plain form
61943 1097451 1112165 1128312 1145082 1162041 1179572 1198605 1219752 1242609 1265828 1287845 1307795
61932 1307795 1326209 1344935 1365775 1388840 1412605 1435950 1459622 1485074 1512439 1540663 1569566
61921 1569566 1600688 1635805 1675424 1719161 1766892 1818908 1875345 1936113 2001356 2071665 2147953
61910 2147953 2231228 2322149 2420387 2524611 2633386 2746034 2862501 2982844 3107309 3236575
61900 3236575 3371059 3509696 3649837 3788595 3923960 4054426 4178020 4292201 4394294
61891 4394294 4481338 4549689 4595872 4618412 4618328 4597251 4555439 4492220 4408059 4305528 4188453
61880 4188453 4060728 3925745 3785894 3642393 3496304 3349845 3205902 3066110 2930474
61871 2930474 2799307 2674425 2557586 2448774 2347112 2252697 2166162 2086931 2013494 1945449
$$ packed form
61943A097451J4714J6147J6770J6959J7531J9033K1147K2857K3219K2017J9950
61932A307795J8414J8726K0840K3065K3765K3345K3672K5452K7365K8224K8903
61921A569566L1122L5117L9619M3737M7731N2016N6437O0768O5243P0309P6288
61910B147953Q3275R0921R8238J04224J08775J12648J16467J20343J24465J29266
61900C236575J34484J38637J40141J38758J35365J30466J23594J14181J02093
61891D394294Q7044O8351M6183K2540q4k1077m1812o3219q4161j02531j17075
61880D188453j27725j34983j39851j43501j46089j46459j43943j39792j35636
61871B930474j31167j24882j16839j08812j01662r4415q6535p9231p3437o8045
$$ plain form
61861 1945449 1883839 1829188 1780450 1736400 1696912 1662153 1631476 1604056 1580113 1560573 1545692
61850 1545692 1534636 1526249 1519633 1513987 1508357 1501721 1493271 1482779 1470821 1458390 1446040 1433538
61838 1433538 1420544 1407405 1395065 1384437 1376119 1370463 1367465 1366584 1367126 1369060 1373270 1380606 1390539
61825 1390539 1400953 1409630 1415874 1420315 1423163 1423464 1420585 1415749 1411123 1407595 1404308 1400305 1395747 1391481
61811 1391481 1388510 1388243 1392204 1400759 1412791 1427311 1444783 1466167 1491221 1518714 1548105 1580174
61799 1580174 1615960 1655648 1698560 1743803 1790976 1840571 1893673 1951089 2013072 2079973 2152519
61788 2152519 2230921 2314409 2402577 2496743 2598903 2709451 2827110 2951228 3083037 3224331
61778 3224331 3375960 3538197 3711557 3896344 4092077 4298443 4516407 4747224 4990174
$$ packed form
61861A945449o1610n4651m8738m4050l9488l4759l0677k7420k3943j9540j4881
61850A545692j1056q387o616n646n630o636q450j0492j1958j2431j2350j2502
61838A433538j2994j3139j2340j0628q318n656k998q81N42J934M210P336R933
61825A390539J0414Q677O244M441K848L01k879m836m626l528l287m003m558m266
61811A391481k971k67L961Q555J2032J4520J7472K1384K5054K7493K9391L2069
61799A580174L5786L9688M2912M5243M7173M9595N3102N7416O1983O6901P2546
61788B152519P8402Q3488Q8168R4166J02160J10548J17659J24118J31809J41294
61778C224331J51629J62237J73360J84787J95733K06366K17964K30817K42950
$$ plain form
61769 4990174 5242055 5499081 5758535 6018245 6275047 6524328 6760753 6978931 7173575
61760 7173575 7339671 7472862 7569639 7627240 7643678 7618101 7551130 7444876 7302803 7129511
61750 7129511 6930249 6710207 6474147 6226742 5972900 5717156 5462554 5210560 4962449
61741 4962449 4720621 4488110 4266816 4056757 3857327 3668933 3492787 3329092 3176091
61732 3176091 3031465 2894405 2765743 2646148 2534947 2431081 2334512 2245937 2165342 2091509
61722 2091509 2022929 1958666 1898328 1841737 1788748 1738991 1691765 1646640 1604110 1565015 1529199
61711 1529199 1495307 1462011 1428865 1395975 1363726 1333101 1305280 1280338 1257090 1234727 1213725
61700 1213725 1194458 1175985 1157343 1139196 1122799 1107839 1092772 1077001 1061265 1046015 1031101
$$ packed form
61769D990174K51881K57026K59454K59710K56802K49281K36425K18178J94644
61760G173575J66096J33191R6777N7601J6438k5577o6971j06254j42073j73292
61750G129511j99262k20042k36060k47405k53842k55744k54602k51994k48111
61741D962449k41828k32511k21294k10059j99430j88394j76146j63695j53001
61732C176091j44626j37060j28662j19595j11201j03866r6569q8575q0595p3833
61722B091509o8580o4263o0338n6591n2989m9757m7226m5125m2530l9095l5816
61711A529199l3892l3296l3146l2890l2249l0625k7821k4942k3248k2363k1002
61700A213725j9267j8473j8642j8147j6397j4960j5067j5771j5736j5250j4914
$$ plain form
61689 1031101 1017210 1005844 997122 988993 979507 968829 958204 948029 937942 928003 918708 910278
61677 910278 902666 895722 888696 880381 870582 860701 851967 843908 835720 828240 822873 818922 813906 806796
61663 806796 799436 794244 791726 790725 789941 788458 785668 781589 776807 771731 766485 761840 759301 759602 761756
61648 761756 764307 766829 769451 771515 771863 770346 768205 766851 766689 766963 766241 763279 758137 752445 748068
61633 748068 745502 743877 742114 739435 735144 729084 722557 717796 715865 715528 714638 712291 709206 706418 704200
61618 704200 702237 700368 698909 698329 698624 699063 698716 697271 695244 693330 691681 689840 687259 683807 679916
61603 679916 676192 672803 669311 665230 660615 655864 651097 646073 640748 635659 631765 630001 630668 632876
61589 632876 634914 635817 636376 637918 640327 642365 643965 646786 651796 657564 662160 665964 671140 678608 686909
$$ packed form
61689A031101j3891j1366q722q129r486j0678j0625j0175j0087r939r295q430
61677I10278p612o944p026q315r799r881q734q059q188p480n367l951n016p110
61663H06796p360n192k518j001p84j483k790m079m782n076n246m645k539L01K154
61648G61756K551K522K622K064L48j517k141j354j62K74p22k962n142n692m377
61633G48068k566j625j763k679m291o060o527m761j931l37q90k347l085k788k218
61618G04200j963j869j459n80K95M39l47j445k027j914j649j841k581l452l891
61603F79916l724l389l492m081m615m751m767n024n325n089l894j764O67K208
61589F32876K038R03N59J542K409K038J600K821N010N768M596L804N176P468Q301
$$ plain form
61574 686909 694308 700840 707905 716709 727689 740743 755278 770251 784748 798688 812948 828836
61562 828836 847230 867762 888815 908722 927117 944897 963013 981733 1000850 1019733 1037039
61551 1037039 1051246 1062058 1070759 1078740 1086194 1092661 1098169 1103037 1107046 1109824 1111875 1114230 1116894
61538 1116894 1118518 1118074 1116155 1114018 1111787 1108413 1103434 1098066 1094159 1092382 1091899 1091609 1091135 1090492 1089493
61523 1089493 1088132 1087221 1087877 1090379 1094235 1099533 1107363 1118414 1131870 1146501 1162522 1181535 1204726
61510 1204726 1231842 1262023 1294965 1331015 1370637 1414097 1461465 1512725 1568116 1628434 1694603
61499 1694603 1766710 1843731 1924529 2008860 2097000 2188446 2281480 2374206 2465631 2555180 2641257
61488 2641257 2720986 2791795 2852769 2903933 2944769 2974510 2993770 3004582 3008250 3004225 2991864 2972401
$$ packed form
61574F86909P399O532P065Q804J0980J3054J4535J4973J4497J3940J4260J5888
61562H28836J8394K0532K1053J9907J8395J7780J8116J8720J9117J8883J7306
61551A037039J4207J0812Q701P981P454O467N508M868M009K778K051K355K664
61538A116894J624m44j919k137k231l374m979n368l907j777m83k90m74o43r99
61523A089493j361r11O56K502L856N298P830J1051J3456J4631J6021J9013K3191
61510A204726K7116L0181L2942L6050L9622M3460M7368N1260N5391O0318O6169
61499A694603P2107P7021Q0798Q4331Q8140R1446R3034R2726R1425Q9549Q6077
61488B641257P9729P0809O0974N1164M0836K9741J9260J0812L668m025j2361j9463
$$ plain form
61476 2972401 2948196 2920760 2890744 2859232 2827501 2795612 2762859 2729852 2698668 2670303 2643226
61465 2643226 2615280 2586073 2556782 2528556 2501967 2477118 2453234 2428816 2403334 2378321 2355836
61454 2355836 2336351 2319224 2304748 2294236 2288255 2286393 2289146 2298578 2316210 2341153 2371087 2404458
61442 2404458 2440913 2480038 2520453 2560149 2597298 2630690 2659414 2681976 2696056 2700144 2695731 2687108
61430 2687108 2678367 2671141 2665617 2662676 2663689 2668623 2675847 2684266 2694761 2709089 2727885 2750040 2773324
61417 2773324 2795029 2812446 2823321 2825894 2818432 2799390 2768825 2729551 2686086 2642032 2598641 2555834
61405 2555834 2513943 2474035 2437087 2403604 2373914 2348082 2325228 2303602 2281921 2260480 2240656
61394 2240656 2223611 2209823 2199374 2191862 2186190 2181473 2178462 2179320 2185527 2196726 2212135 2232299 2258478
$$ packed form
61476B972401k4205k7436l0016l1512l1731l1889l2753l3007l1184k8365k7077
61465B643226k7946k9207k9291k8226k6589k4849k3884k4418k5482k5013k2485
61454B355836j9485j7127j4476j0512n981j862K753R432J7632K4943K9934L3371
61442B404458L6455L9125M0415L9696L7149L3392K8724K2562J4080M088m413q623
61430B687108q741p226n524k941J013M934P224Q419J0495J4328J8796K2155K3284
61417B773324K1705J7417J0875K573p462j9042l0565l9274m3465m4054m3391m2807
61405B555834m1891l9908l6948l3483k9690k5832k2854k1626k1681k1441j9824
61394B240656j7045j3788j0449p512n672m717l011Q58O207J1199J5409K0164K6179
$$ plain form
61381 2258478 2290761 2327938 2369248 2415271 2466931 2524535 2588033 2657256 2731325 2808591 2887797
61370 2887797 2968749 3051149 3133268 3212591 3287376 3356734 3419362 3473271 3516957 3550086 3572838
61359 3572838 3585248 3587310 3578907 3559281 3527317 3482939 3427713 3363678 3292167 3214347 3132117 3047506
61347 3047506 2961534 2874721 2788478 2704770 2624279 2546176 2470223 2398077 2331582 2270493 2212902
61336 2212902 2157690 2105699 2058678 2017865 1983555 1955101 1930989 1909582 1890269 1873770 1861199
61325 1861199 1853148 1849658 1850445 1854789 1861667 1870508 1881647 1895715 1912805 1932516 1954462 1978258 2003218
61312 2003218 2028550 2053824 2078695 2102179 2122753 2139444 2152514 2162994 2171821 2179555 2186463 2192555
61300 2192555 2197710 2201875 2204877 2205969 2204074 2198836 2191050 2181593 2170275 2156351 2139971 2122353 2104493
$$ packed form
61381B258478L2283L7177M1310M6023N1660N7604O3498O9223P4069P7266P9206
61370B887797Q0952Q2400Q2119P9323P4785O9358O2628N3909M3686L3129K2752
61359C572838J2410K062q403j9626l1964m4378n5226o4035p1511p7820q2230q4611
61347C047506q5972q6813q6243q3708q0491p8103p5953p2146o6495o1089n7591
61336B212902n5212n1991m7021m0813l4310k8454k4112k1407j9313j6499j2571
61325A861199q051l490P87M344O878Q841J1139J4068J7090J9711K1946K3796K4960
61312B003218K5332K5274K4871K3484K0574J6691J3070J0480Q827P734O908O092
61300B192555N155M165L002J092j895n238p786r457j1318j3924j6380j7618j7860
$$ plain form
61287 2104493 2086406 2067866 2049184 2030780 2012548 1994284 1976442 1959786 1944341 1929308 1914105
61276 1914105 1899001 1884548 1870831 1857553 1844553 1832003 1820324 1810211 1802423 1797061 1793032 1788614
61264 1788614 1782740 1775526 1767484 1758613 1748695 1738402 1729669 1724658 1724544 1729471 1739439 1754787 1775800
61251 1775800 1802388 1834476 1872468 1916983 1968332 2026494 2091292 2161968 2236641 2312661 2387433
61240 2387433 2458263 2521500 2573077 2610797 2635714 2650598 2657384 2656792 2649883 2638616 2624576 2608161
61228 2608161 2589632 2570284 2551919 2535541 2521158 2508608 2497929 2488810 2479984 2469072 2452985 2428929
61216 2428929 2395601 2353509 2304094 2249078 2191069 2133955 2081284 2033885 1989897 1947564 1907352
61205 1907352 1870956 1839009 1810606 1784689 1760898 1738905 1717703 1696078 1673470 1649957 1625569
$$ packed form
61287B104493j8087j8540j8682j8404j8232j8264j7842j6656j5445j5033j5203
61276A914105j5104j4453j3717j3278j3000j2550j1679j0113p788n362m029m418
61264A788614n874p214q042q871r918j0293q733n011j14M927R968J5348K1013
61251A775800K6588L2088L7992M4515N1349N8162O4798P0676P4673P6020P4772
61240B387433P0830O3237N1577L7720K4917J4884O786n92o909j1267j4040j6415
61228B608161j8529j9348j8365j6378j4383j2550j0679r119q826j0912j6087k4056
61216B428929l3328m2092m9415n5016n8009n7114n2671m7399m3988m2333m0212
61205A907352l6396l1947k8403k5917k3791k1993k1202k1625k2608k3513k4388
$$ plain form
61194 1625569 1600173 1574227 1549255 1526932 1507444 1489082 1469808 1449079 1427840 1406912 1385998
61183 1385998 1364367 1341918 1319243 1297015 1275686 1255547 1236739 1219287 1203219 1188317 1173698
61172 1173698 1158237 1141876 1125955 1111568 1098003 1083735 1068800 1055249 1045071 1038468 1034401 1032043
61160 1032043 1031177 1031710 1033290 1035093 1035742 1033938 1029609 1023999 1018289 1012588 1006668 1000928 995805 990686 984509
61145 984509 977426 970991 966527 964076 963148 963617 965336 967469 968915 969165 968321 966555 964119 961636 959647
61130 959647 957674 954401 949173 942920 937158 932214 927036 920839 914453 909743 908010 909242 912604 917101
61116 917101 921931 926926 932898 940948 950984 961211 969427 974533 976501 975402 971177 964144 954925 943718
61102 943718 930220 914455 897138 878906 859637 838984 817486 796703 778027 761305 744688
$$ packed form
61194A625569k5396k5946k4972k2323j9488j8362j9274k0729k1239k0928k0914
61183A385998k1631k2449k2675k2228k1329k0139j8808j7452j6068j4902j4619
61172A173698j5461j6361j5921j4387j3565j4268j4935j3551j0178o603m067k358
61160A032043q66N33J580J803O49j804m329n610n710n701n920n740n123n119o177
61145I84509p083o435m464k451r28M69J719K133J446K50q44j766k436k483j989
61130I59647j973l273n228o253n762m944n178o197o386m710j733J232L362M497
61116I17101M830M995N972Q050J0036J0227Q216N106J968j099m225p033r219j1207
61102I43718j3498j5765j7317j8232j9269k0653k1498k0783j8676j6722j6617
$$ plain form
61091 744688 726140 705434 684596 666135 650910 637948 626041 614869 604603 595208 586571 578807
61079 578807 571973 565752 559801 554287 549811 546914 545713 545669 545600 544390 542050 539780 538737 539161 540950
61064 540950 544362 549400 555011 559894 564058 568603 573869 578702 582033 584450 587597 592433 598661 605576
61050 605576 612815 620288 627929 635726 643679 651442 658105 662528 664101 663319 661622 660369 659735 658618 655761
61035 655761 650986 645262 639848 635653 633251 632841 633875 635175 636114 637665 641824 649908 661989 678177
61021 678177 699862 729024 766571 811705 862370 915166 964798 1004915 1030839 1041913 1041432 1034872
61009 1034872 1028232 1026692 1032913 1045447 1058754 1065228 1058165 1034255 994610 943880 888136 832958
60997 832958 782521 739076 702579 671329 643795 619861 600101 584348 571665 561352 553211 546945
$$ packed form
61091G44688j8548k0706k0838j8461j5225j2962j1907j1172j0266r395q637p764
61079E78807o834o221n951n514m476k897j201m4o9j210k340k270j043M24J789
61064E40950L412N038N611M883M164M545N266M833L331K417L147M836O228O915
61050F05576P239P473P641P797P953P763O663M423J573p82j697j253o34j117k857
61035F55761m775n724n414m195k402m10J034J300R39J551M159Q084J2081J6188
61021F78177K1685K9162L7547M5134N0665N2796M9632M0117K5924J1074m81o560
61009A034872o640j540O221J2534J3307O474p063k3910l9645n0730n5744n5178
60997H32958n0437m3445l6497l1250k7534k3934j9760j5753j2683j0313q141o266
$$ plain form
60985 546945 542065 538380 535918 534512 534168 535727 540106 546725 553701 560036 566699 574995 584685 594411
60971 594411 603300 611333 618653 625512 632691 641016 650308 659455 667734 675602 684017 693301 702925 712305
60957 712305 721573 731350 741585 750886 757497 760959 762316 762712 762463 761700 760858 759839 757442 752661 746118
60942 746118 739184 731787 722103 708632 691899 673953 656693 640797 625772 610886 596272 582981
60930 582981 571769 562277 553990 547490 543817 542860 543370 544446 545889 547163 547393 546795 546797 548013 549085 548393
60914 548393 546178 544169 543744 545183 547995 551038 552844 552935 552610 553592 555981 558264 559110 558460 557065 555814
60898 555814 555477 556313 557765 559034 559877 560472 560884 561326 562546 565059 568187 570803 572855 575147 577761 580009
60882 580009 582016 584862 588620 591619 592564 592281 592286 592539 591887 590229 588887 588892 589936 591071 591686 591689 591343 590865
$$ packed form
60985E46945m880l685k462j406l44J559M379O619O976O335O663Q296R690R726
60971E94411Q889Q033P320O859P179Q325R292R147Q279P868Q415R284R624R380
60957G12305R268R777J0235R301O611L462J357L96k49p63q42j019k397m781o543
60942G46118o934p397r684j3471j6733j7946j7260j5896j5025j4886j4614j3291
60930E82981j1212r492q287o500l673r57N10J076J443J274K30n98KJ216J072o92
60914E48393k215k009m25J439K812L043J806R1l25R82K389K283Q46o50j395j251
60898E55814l37Q36J452J269Q43N95M12M42J220K513L128K616K052K292K614K248
60882E80009K007K846L758K999R45k83NK53o52j658j342NJ044J135O15Ll46m78
$$ plain form
60864 590865 589680 586397 580339 572899 566398 561468 556526 549998 542115 534137 526864 520663 516194 514025
60850 514025 513772 514512 516028 518903 523281 528311 533150 537967 543422 549452 555240 560341 565225 570354 575241
60835 575241 579138 582445 586591 592167 597893 602148 605068 608229 612337 616260 618745 620282 622428 625677
60821 625677 628892 630915 632008 633237 634840 635827 635239 633291 630916 628410 625062 620168 614004 607436 600870
60806 600870 593940 586082 577049 566886 555808 544228 532734 522017 512798 505452 499356 492979 485235
60793 485235 476673 468779 462280 456801 452065 448357 445584 442887 439822 437108 435570 435023 434966 435710 437745
60778 437745 440400 442253 442935 443598 445506 448847 452995 457165 460719 463575 466621 471108 477407 484926 493433
60763 493433 503588 515670 528430 540029 549929 559205 569039 579459 589717 599572 609808 621403
$$ packed form
60864E90865j185l283o058p440o501m930m942o528p883p978p273o201m469k169
60850E14025k53P40J516K875M378N030M839M817N455O030N788N101M884N129M887
60835E75241L897L307M146N576N726M255K920L161M108L923K485J537K146L249
60821F25677L215K023J093J229J603R87n88j948k375k506l348m894o164o568o566
60806F00870o930p858r033j0163j1078j1580j1494j0717r219p346o096o377p744
60793D85235q562p894o499n479m736l708k773k697l065k714j538n47n7P44K035
60778D37745K655J853O82O63J908L341M148M170L554K856L046M487O299P519Q507
60763D93433J0155J2082J2760J1599R900R276R834J0420J0258R855J0236J1595
$$ plain form
60751 621403 634260 646918 657590 665337 670228 672845 674043 674799 675587 675889 674833 672270 668689 664320
60737 664320 659093 653394 647819 641973 634493 624725 613504 601794 589557 576653 563865 552062 541131
60724 541131 530887 522324 516551 512833 509123 504472 499548 494734 489373 483443 478489 475705 474036 471424
60710 471424 467554 464198 462910 463384 464347 465337 466961 469719 473229 476931 481058 486170 491729 496076 498476
60695 498476 500492 504326 510154 516239 521474 526304 530889 533958 534453 533125 531289 528784 524444 518078
60681 518078 510623 502597 493679 483879 473885 463975 453717 443211 433786 426849 422554 419933 417793 415205
60667 415205 411772 407955 404729 402533 400895 399306 397914 397009 396498 396427 397445 400051 403818 408007 412627
60652 412627 418148 424508 431191 437891 444064 448152 448765 446981 446067 448106 451864 454856 456463 457662 458464
$$ packed form
60751F21403J2857J2658J0672P747M891K617J198P56P88L02j056k563l581m369
60737F64320n227n699n575n846p480r768j1221j1710j2237j2904j2788j1803j0931
60724E41131j0244q563n773l718l710m651m924m814n361n930m954k784j669k612
60710D71424l870l356j288M74R63R90J624K758L510L702M127N112N559M347K400
60695D98476K016L834N828O085N235M830M585L069M95j328j836k505m340o366
60681E18078p455q026q918r800r994r910j0258j0506r425o937m295k621k140k588
60667D15205l433l817l226k196j638j589j392r05n11p1J018K606L767M189M620
60652D12627N521O360O683O700O173M088O13j784r14K039L758K992J607J199Q02
$$ plain form
60637 458464 457614 455104 453375 455009 460047 466405 472293 477398 482212 487346 493525 501277 510288 519643
60623 519643 528978 538841 549592 560529 570631 579761 588381 596172 601797 604389 604700 604142 602988 600214
60609 600214 595164 588638 581851 574867 566879 557955 549563 542936 537499 531562 524291 516419 509202 503406
60595 503406 499303 496844 495386 493789 491393 488778 487173 487191 488382 489860 491112 492314 494205 497624 502888
60580 502888 509548 516835 524228 531470 538222 544057 548742 552305 554905 556914 559086 562327 567150 573500
60566 573500 581041 589477 598735 609187 621687 637048 655427 676522 700476 728316 761403 800730
60554 800730 846874 900267 961126 1028952 1102021 1177278 1250796 1318533 1376548 1420497 1445671
60543 1445671 1448711 1429735 1392314 1341111 1279963 1212198 1141706 1072686 1008506 951240 901947
$$ packed form
60637D58464q50k510j729J634N038O358N888N105M814N134O179P752R011R355
60623E19643R335R863J0751J0937J0102R130Q620P791N625K592L11n58j154k774
60609F00214n050o526o787o984p988q924q392o627n437n937p271p872p217n796
60595E03406m103k459j458j597k396k615j605J8J191J478J252J202J891L419N264
60580E02888O660P287P393P242O752N835M685L563K600K009K172L241M823O350
60566E73500P541Q436R258J0452J2500J5361J8379K1095K3954K7840L3087L9327
60554H00730M6144N3393O0859O7826P3069P5257P3518O7737N8015M3949K5174
60543A445671L040j8976l7421n1203o1148o7765p0492o9020o4180n7266m9293
$$ plain form
60532 901947 860695 826581 798407 775358 756722 741443 728785 719231 713763 712272 713648 717668
60520 717668 725801 739662 759495 784866 816097 854149 899463 951824 1011231 1078083 1152406 1233401
60508 1233401 1319575 1408426 1495693 1575736 1643541 1696675 1735525 1762246 1779870 1791945 1802145
60497 1802145 1813588 1828146 1845769 1863757 1876638 1877614 1861289 1825687 1772010 1702985 1621918 1532981
60485 1532981 1441019 1349999 1261788 1177086 1097353 1024903 960913 904216 852721 805724 764317
60474 764317 729639 701127 676586 653859 632473 613538 597909 584681 571954 558855 546110
60463 546110 534745 525181 517704 512509 508554 503571 496377 488502 482398 478679 476345 474922 474519 473951
60449 473951 470892 464681 457506 452000 448722 446587 444561 442045 438701 435079 432759 432779 434308 435718 436491
$$ packed form
60532I01947m1252l4114k8174k3049j8636j5279j2658r554n468j491J376M020
60520G17668Q133J3861J9833K5371L1231L8052M5314N2361N9407O6852P4323Q0995
60508A233401Q6174Q8851Q7267Q0043O7805N3134L8850K6721J7624J2075J0200
60497A802145J1443J4558J7623J7988J2881R76j6325l5602n3677o9025q1067q8937
60485A532981r1962r1020q8211q4702p9733p2450o3990n6697n1495m6997m1407
60474G64317l4678k8512k4541k2727k1386j8935j5629j3228j2727j3099j2745
60463E46110j1365r564p477n195l955m983p194p875o104l719k334j423m03n68
60449D73951l059o211p175n506l278k135k026k516l344l622k320K0J529J410P73
$$ plain form
60434 436491 437291 438671 440629 443032 445620 447921 449933 452424 455731 458787 460457 461382 463176 465875 467483
60419 467483 466313 462786 458746 455935 455190 456102 457208 457496 458006 460964 467018 474351 480910 486438 491719
60404 491719 496978 502092 507614 514357 522137 529815 536635 543008 550020 558465 568198 578186 587447 596060
60390 596060 604847 613996 622700 630385 637421 644123 649896 654202 657688 661462 665750 670138 674676 679715
60376 679715 684943 689559 693253 696168 698158 699072 699686 701165 703522 705602 706856 708107 710128 712322 713409
60361 713409 712909 711506 710382 710479 711880 713463 713556 711265 707003 701741 696202 690798 685678 680523 674876
60346 674876 668928 663463 658818 654544 650381 646806 644130 641817 639368 637214 635862 634635 632239 628429
60332 628429 624224 620538 617465 614887 612742 610366 606459 600542 594034 589153 586726 585575 584075 581833
$$ packed form
60434D36491Q00J380J958K403K588K301K012K491L307L056J670R25J794K699J608
60419D67483j170l527m040k811p45R12J106K88N10K958O054P333O559N528N281
60404D91719N259N114N522O743P780P678O820O373P012Q445R733R988R261Q613
60390E96060Q787R149Q704P685P036O702N773M306L486L774M288M388M538N039
60376F79715N228M616L694K915J990R14O14J479K357K080J254J251K021K194J087
60361G13409n00j403j124R7J401J583R3k291m262n262n539n404n120n155n647
60346F74876n948n465m645m274m163l575k676k313k449k154j352j227k396l810
60332F28429m205l686l073k578k145k376l907n917o508m881k427j151j500k242
$$ plain form
60318 581833 579557 577810 576587 576122 577252 580356 584322 587470 589498 591905 596269 602716 610172 617312
60304 617312 622771 625124 623516 618171 609910 599451 587631 575806 565272 556392 548825 542433 537431
60291 537431 533767 530882 527996 524406 519967 515814 514001 515469 518739 521587 523683 526338 529857 532764
60277 532764 533969 534181 534503 535046 535948 538519 543927 551406 559030 565884 572320 578499 584030 588923 593687
60262 593687 598279 602082 605109 608341 612560 617583 622852 627947 632302 635306 637177 639064 641823 645306
60248 645306 649181 653752 659415 665920 672806 680039 687597 694975 701948 709520 719247 731627 745896 761405
60234 761405 778514 797944 819793 843584 869047 896656 927423 962089 1000420 1041467 1084752
60223 1084752 1130963 1181245 1236163 1295836 1360653 1431058 1506620 1586057 1668295 1752747 1838244
$$ packed form
60318E81833k276j747j223m65J130L104L966L148K028K407M364O447P456P140
60304F17312N459K353j608n345q261j0459j1820j1825j0534q880p567o392n002
60291E37431l664k885k886l590m439m153j813J468L270K848K096K655L519K907
60277E32764J205K12L22N43R02K571N408P479P624O854O436O179N531M893M764
60262E93687M592L803L027L232M219N023N269N095M355L004J871J887K759L483
60248F45306L875M571N663O505O886P233P558P378O973P572R727J2380J4269J5509
60234G61405J7109J9430K1849K3791K5463K7609L0767L4666L8331M1047M3285
60223A084752M6211N0282N4918N9673O4817P0405P5562P9437Q2238Q4452Q5497
$$ plain form
60212 1838244 1922278 2001864 2075031 2141304 2201040 2254484 2301220 2340299 2371004 2393433 2408075
60201 2408075 2414982 2413954 2405638 2391831 2374472 2354865 2334106 2313565 2294502 2277704 2264072 2255152
60189 2255152 2252609 2257512 2270457 2291900 2321887 2360080 2406695 2462849 2529049 2603696 2684003 2768110
60177 2768110 2855225 2943912 3031479 3115290 3193477 3263966 3323990 3371422 3405983 3428417 3438904
60166 3438904 3436862 3421817 3393777 3353085 3300624 3238227 3168495 3094219 3017973 2941881 2867523
60155 2867523 2796358 2730409 2672126 2623309 2584544 2555770 2536783 2526971 2525382 2531542 2545502 2566569
60143 2566569 2592921 2623113 2656885 2693249 2728702 2759005 2782328 2799097 2809204 2811650 2807228 2799183
60131 2799183 2789801 2777880 2761168 2740341 2719037 2700544 2686042 2675921 2671391 2674453 2687156 2711074
$$ packed form
60212A838244Q4034P9586P3167O6273N9736N3444M6736L9079L0705K2429J4642
60201B408075O907j028q316j3807j7359j9607k0759k0541j9063j6798j3632q920
60189B255152k543M903J2945K1443K9987L8193M6615N6154O6200P4647Q0307Q4107
60177B768110Q7115Q8687Q7567Q3811P8187P0489O0024M7432L4561K2434J0487
60166C438904k042j5045k8040m0692n2461o2397o9732p4276p6246p6092p4358
60155B867523p1165o5949n8283m8817l8765k8774j8987r812j589O160J3960K1067
60143B566569K6352L0192L3772L6364L5453L0303K3323J6769J0107K446m422q045
60131B799183r382j1921j6712k0827k1304j8493j4502j0121m530L062J2703K3918
$$ plain form
60119 2711074 2746848 2794075 2852273 2922083 3005040 3102106 3212889 3336252 3471294 3617757
60109 3617757 3775922 3945894 4126390 4314276 4505838 4698337 4889685 5076756 5254901
60100 5254901 5419255 5565790 5691146 5792450 5867717 5915701 5935074 5924633 5884799 5818055
60090 5818055 5727314 5614610 5482150 5333848 5174704 5009009 4840095 4671494 4507177 4350422
60080 4350422 4203191 4066666 3941690 3828678 3727877 3639917 3565495 3504349 3455232 3417084
60070 3417084 3389658 3372695 3365092 3365192 3371442 3382437 3396778 3413319 3431316 3450123 3468977 3487115
60058 3487115 3503625 3517096 3525924 3529147 3526375 3516825 3499261 3473308 3440017 3400456 3354469 3301511
60046 3301511 3242094 3177623 3109516 3039486 2969995 2903041 2838818 2777008 2719254 2668788 2627361
$$ packed form
60119B711074L5774M7227N8198O9810Q2957R7066J10783J23363J35042J46463
60109C617757J58165J69972J80496J87886J91562J92499J91348J87071J78145
60100E254901J64354J46535J25356J01304P5267M7984J9373j0441l9834o6744
60090E818055r0741j12704j32460j48302j59144j65695j68914j68601j64317j56755
60080D350422j47231j36525j24976j13012j00801q7960p4422o1146m9117l8148
60070C417084k7426j6963p603J00O250J0995J4341J6541J7997J8807J8854J8138
60058C487115J6510J3471Q828L223k772r550j7564k5953l3291l9561m5987n2958
60046C301511n9417o4471o8107p0030o9491o6954o4223o1810n7754n0466m1427
$$ plain form
60035 2627361 2594223 2568715 2552209 2546365 2550871 2564596 2588134 2623439 2671160 2730067 2799368 2880061
60023 2880061 2973030 3076512 3186136 3297140 3406192 3511435 3611245 3702907 3782508 3846424
60013 3846424 3892956 3922021 3933261 3925235 3896830 3848769 3783224 3702636 3609816 3508687 3403675
60002 3403675 3298014 3193472 3091937 2996450 2910008 2833901 2767956 2712062 2666772 2632612 2609777
59991 2609777 2598783 2600682 2616066 2644316 2684414 2736365 2801360 2880572 2974066 3080552 3197489
59980 3197489 3321393 3448671 3576520 3702624 3823730 3935132 4032283 4112864 4176774 4224157
59970 4224157 4254070 4265187 4257116 4230440 4185859 4124172 4047322 3958917 3863332 3764475 3665529
59959 3665529 3569381 3478645 3395400 3321442 3258717 3208835 3171961 3146943 3132886 3130033 3138734 3158438
$$ packed form
60035B627361l3138k5508j6506n844M506J3725K3538L5305M7721N8907O9301Q0693
60023B880061R2969J03482J09624J11004J09052J05243R9810R1662P9601O3916
60013C846424M6532K9065J1240q026k8405m8061o5545q0588r2820j01129j05012
60002C403675j05661j04542j01535r5487q6442p6107o5945n5894m5290l4160k2835
59991B609777j0994J899J5384K8250M0098N1951O4995P9212R3494J06486J16937
59980C197489J23904J27278J27849J26104J21106J11402R7151Q0581O3910M7383
59970D224157K9913J1117q071k6676m4581o1687p6850q8405r5585r8857r8946
59959C665529r6148r0736q3245p3958o2725m9882l6874k5018j4057k853Q701J9704
$$ plain form
59947 3158438 3188687 3230417 3284786 3350596 3424116 3501966 3583226 3668163 3755794 3843462 3928139
59936 3928139 4007260 4078816 4141767 4196368 4243364 4282792 4314125 4337497 4354295 4366676 4377155
59925 4377155 4388497 4403206 4422948 4449028 4483422 4528551 4585817 4655107 4736032 4828798 4933191
59914 4933191 5047198 5167495 5291198 5416471 5541376 5662651 5775867 5876546 5961013 6026437
59904 6026437 6070430 6090920 6086634 6057812 6006358 5935270 5847830 5747084 5635712 5516301 5391922
59893 5391922 5266388 5143534 5026006 4914991 4811254 4716158 4631371 4557994 4496502 4447588
59883 4447588 4412467 4391837 4384678 4388606 4401717 4423809 4455356 4495489 4541747 4592035 4646001 4703734
59871 4703734 4763756 4823280 4880008 4932289 4977470 5011777 5032720 5040559 5036372 5019659 4989155 4945429
$$ packed form
59947C158438L0249M1730N4369O5810P3520P7850Q1260Q4937Q7631Q7668Q4677
59936C928139P9121P1556O2951N4601M6996L9428L1333K3372J6798J2381J0479
59925D377155J1342J4709J9742K6080L4394M5129N7266O9290Q0925R2766J04393
59914D933191J14007J20297J23703J25273J24905J21275J13216J00679Q4467O5424
59904F026437M3993K0490m286k8822n1454p1088q7440j00746j11372j19411j24379
59893E391922j25534j22854j17528j11015j03737r5096q4787p3377o1492m8914
59883D447588l5121k0630p159L928J3111K2092L1547M0133M6258N0288N3966N7733
59871D703734O0022N9524N6728N2281M5181L4307K0943P839m187j6713l0504m3726
$$ plain form
59859 4945429 4890986 4827663 4755212 4672859 4581283 4482649 4379615 4274895 4170960 4069362
59849 4069362 3970666 3875607 3785827 3702852 3626677 3556002 3489666 3427232 3368508 3313352 3261992
59838 3261992 3214670 3170710 3128712 3088124 3050178 3016779 2988786 2965811 2947315 2933211 2923521
59827 2923521 2918078 2916715 2919314 2925542 2934965 2947531 2963434 2982121 3001859 3020814 3038296 3054350
59815 3054350 3068242 3078180 3082968 3083375 3081282 3077756 3072676 3066138 3059261 3053025 3046908 3039513 3030443 3020747
59801 3020747 3011446 3002501 2993689 2985620 2978947 2972928 2965841 2956861 2946588 2935535 2923131 2908817 2893318
59788 2893318 2877906 2862832 2847329 2831125 2815261 2801419 2790952 2784466 2781816 2782572 2787159 2797602
59776 2797602 2816527 2845161 2882702 2927836 2980596 3042766 3116997 3205652 3310015 3430353 3566950
$$ packed form
59859D945429n4443o3323p2451q2353r1576r8634j03034j04720j03935j01598
59849D069362r8696r5059q9780q2975p6175p0675o6336o2434n8724n5156n1360
59838C261992m7322m3960m1998m0588l7946l3399k7993k2975j8496j4104r690
59827B923521n443j363K599O228R423J2566J5903J8687J9738J8955J7482J6054
59815C054350J3892R938M788M07k093l526n080o538o877o236o117p395r070r696
59801C020747r301q945q812q069o673o019p087q980j0273j1053j2404j4314j5499
59788B893318j5412j5074j5503j6204j5864j3842j0467o486k650P56M587J0443
59776B797602J8925K8634L7541M5134N2760O2170P4231Q8655J04363J20338J36597
$$ plain form
59765 3566950 3721028 3894062 4085918 4293778 4512440 4734446 4949397 5143950 5303738
59756 5303738 5416017 5471586 5466199 5401977 5287651 5136558 4963464 4782147 4603953 4436648
59746 4436648 4284088 4147572 4027874 3925954 3842137 3775388 3723704 3685033 3658010 3642286
59736 3642286 3638065 3644891 3660982 3684417 3715147 3755273 3807028 3870855 3945756 4031010 4126956 4234182
59724 4234182 4352773 4482819 4625499 4783018 4957198 5148461 5356601 5582418 5828038
59715 5828038 6095528 6385503 6697102 7028634 7377868 7742140 8118582 8503834 8892969
59706 8892969 9278940 9653692 10009859 10341316 10642982 10911380 11145770 11348067 11521237
59697 11521237 11667970 11790849 11893070 11978267 12049578 12109084 12158206 12198524 12232066 12260614
$$ packed form
59765C566950J54078J73034J91856K07860K18662K22006K14951J94553J59788
59756E303738J12279N5569n387o4222j14326j51093j73094j81317j78194j67305
59746D436648j52560j36516j19698j01920q3817o6749n1684l8671k7023j5724
59736C642286m221O826J6091K3435L0730M0126N1755O3827P4901Q5254R5946J07226
59724D234182J18591J30046J42680J57519J74180J91263K08140K25817K45620
59715E828038K67490K89975L11599L31532L49234L64272L76442L85252L89135
59706H892969L85971L74752L56167L31457L01666K68398K34390K02297J73170
59697A1521237J46733J22879J02221Q5197P1311N9506M9122M0318L3542K8548
$$ plain form
59687 12260614 12284781 12304136 12318476 12328723 12336403 12342673 12348263 12354129 12361712 12372814 12389694 12415119
59675 12415119 12451751 12501390 12565058 12643588 12737833 12848707 12977755 13127409 13299717 13494381
59665 13494381 13708394 13937604 14178269 14427074 14680122 14931989 15175461 15402211 15604024
59656 15604024 15773314 15902463 15983586 16010065 15978254 15887078 15736437 15527301 15263549 14952768
59646 14952768 14604995 14231188 13842451 13449080 13059670 12681756 12323104 11990771 11687945
59637 11687945 11412357 11157704 10915032 10672164 10414003 10126237 9799911 9433149 9030526
59628 9030526 8602219 8162321 7725059 7301192 6897746 6519804 6170813 5851511 5560460
59619 5560460 5296313 5058704 4846822 4658378 4490467 4340632 4206601 4085853 3976168
$$ packed form
59687A2260614K4167J9355J4340J0247P680O270N590N866P583J1102J6880K5425
59675A2415119L6632M9639O3668P8530R4245J10874J29048J49654J72308J94664
59665A3494381K14013K29210K40665K48805K53048K51867K43472K26750K01813
59656A5604024J69290J29149Q1123K6479l1811r1176j50641k09136k63752l10781
59646A4952768l47773l73807l88737l93371l89410l77914l58652l32333l02826
59637A1687945k75588k54653k42672k42868k58161k87766l26326l66762m02623
59628I030526m28307m39898m37262m23867m03446l77942l48991l19302k91051
59619E560460k64147k37609k11882j88444j67911j49835j34031j20748j09685
$$ plain form
59610 3976168 3876234 3785159 3701545 3623476 3549529 3479718 3415330 3357546 3306159 3259866 3217676
59599 3217676 3179211 3143410 3108148 3072125 3036367 3002665 2971086 2940259 2909612 2879655 2850198
59588 2850198 2820080 2789181 2759072 2730915 2703948 2676903 2649889 2623943 2599668 2577291 2557335
59577 2557335 2540180 2525450 2512711 2502259 2494394 2488552 2484311 2482718 2485200 2491266 2498695 2506362 2515727
59564 2515727 2529028 2546989 2568937 2594342 2623279 2655821 2691922 2731871 2776163 2824829 2877529
59553 2877529 2934391 2996055 3062569 3132841 3205885 3282334 3364067 3452376 3547011 3646710 3749378
59542 3749378 3851104 3946049 4028849 4097715 4155006 4205065 4251860 4298038 4344729 4391342 4435756
59531 4435756 4475156 4506927 4529310 4541972 4545995 4542614 4531665 4511680 4481627 4442155 4395152 4342662
$$ packed form
59610C976168r9934r1075q3614p8069p3947o9811o4388n7784n1387m6293m2190
59599C217676l8465l5801l5262l6023l5758l3702l1579l0827l0647k9957k9457
59588B850198l0118l0899l0109k8157k6967k7045k7014k5946k4275k2377j9956
59577B557335j7155j4730j2739j0452p865n842m241j593K482O066P429P667R365
59564B515727J3301J7961K1948K5405K8937L2542L6101L9949M4292M8666N2700
59553B877529N6862O1664O6514P0272P3044P6449Q1733Q8309R4635R9699J02668
59542C749378J01726R4945Q2800O8866N7291N0059M6795M6178M6691M6613M4414
59531D435756L9400L1771K2383J2662M023l381j0949j9985l0053l9472m7003n2490
$$ plain form
59519 4342662 4286257 4226625 4163465 4096525 4027137 3958048 3891316 3827245 3766131 3710277 3663090
59508 3663090 3626308 3599107 3580084 3569409 3568764 3579624 3601911 3634372 3676335 3729052 3794822 3874702
59496 3874702 3967685 4072475 4189090 4317759 4456837 4602973 4752998 4904311 5053259 5194510
59486 5194510 5322717 5434162 5526354 5596829 5643039 5663051 5656000 5622457 5564786 5486688 5391818
59475 5391818 5283203 5164410 5040640 4917753 4800151 4689953 4587967 4494968 4412277 4341707
59465 4341707 4284710 4240882 4207367 4180525 4158390 4140855 4127400 4115622 4102573 4086823 4068298
59454 4068298 4046442 4019568 3986145 3945849 3898886 3844888 3783061 3713196 3635987 3552404 3463200
59443 3463200 3369194 3271763 3172853 3074454 2977906 2883532 2791042 2700595 2613422 2531109 2454213
$$ packed form
59519D342662n6405n9632o3160o6940o9388o9089o6732o4071o1114n5854m7187
59508C663090l6782k7201j9023j0675o45J0860K2287L2461M1963N2717O5770P9880
59496C874702R2983J04790J16615J28669J39078J46136J50025J51313J48948J41251
59486E194510J28207J11445R2192P0475M6210K0012p051l3543n7671p8098r4870
59475E391818j08615j18793j23770j22887j17602j10198j01986r2999q2691p0570
59465D341707n6997m3828l3515k6842k2135j7535j3455j1778j3049j5750j8525
59454D068298k1856k6874l3423m0296m6963n3998o1827o9865p7209q3583q9204
59443C463200r4006r7431r8910r8399r6548r4374r2490r0447q7173q2313p6896
$$ plain form
59432 2454213 2381888 2312989 2247343 2185804 2129357 2078455 2033025 1992810 1957739 1928218 1905166
59421 1905166 1889690 1882660 1884275 1893514 1907553 1921849 1931340 1932136 1922692 1904276 1880983 1858959 1844296
59408 1844296 1840333 1846391 1859156 1875303 1892625 1908691 1919140 1918530 1903701 1876318 1841791 1805773
59396 1805773 1771879 1742001 1717289 1698081 1683705 1673500 1667984 1668257 1674264 1684374 1696949 1711823
59384 1711823 1729958 1752077 1778117 1807812 1841333 1879125 1921222 1966980 2015733 2067719 2123988
59373 2123988 2185062 2249862 2316425 2383714 2452410 2523880 2598750 2676667 2757199 2840786 2928958
59362 2928958 3023742 3126726 3238722 3360561 3494153 3642249 3806867 3988242 4185580 4398673
59352 4398673 4628493 4876333 5142568 5426029 5724093 6033046 6348358 6664811 6976787
$$ packed form
59432B454213p2325o8899o5646o1539n6447n0902m5430m0215l5071k9521k3052
59421A905166j5476p030J615R239J4039J4296R491P96r444j8416k3293k2024j4663
59408A844296l963O058J2765J6147J7322J6066J0449o10j4829k7383l4527l6018
59396A805773l3894k9878k4712j9208j4376j0205n516K73O007J0110J2575J4874
59384A711823J8135K2119K6040K9695L3521L7792M2097M5758M8753N1986N6269
59373B123988O1074O4800O6563O7289O8696P1470P4870P7917Q0532Q3587Q8172
59362B928958R4784J02984J11996J21839J33592J48096J64618J81375J97338K13093
59352D398673K29820K47840K66235K83461K98064L08953L15312L16453L11976
$$ plain form
59343 6976787 7278989 7567101 7837542 8086594 8310163 8504707 8668096 8799304 8897652 8963013
59333 8963013 8996630 9000794 8977046 8924945 8843130 8731534 8592009 8426572 8235586 8018393
59323 8018393 7775845 7511733 7231578 6940478 6642538 6341883 6043115 5750394 5466541
59314 5466541 5193465 4933119 4687464 4457599 4243450 4044554 3860975 3693298 3541802
59305 3541802 3405693 3283165 3172177 3071221 2979512 2896764 2822989 2758208 2701857 2652402
59295 2652402 2607888 2567022 2529519 2495550 2465394 2439604 2418735 2402517 2389850 2380086 2373665 2371000
59283 2371000 2371420 2374093 2379519 2389028 2403099 2421156 2442708 2467385 2493926 2520823 2548374 2578581
59271 2578581 2612140 2646984 2680920 2714380 2748781 2782950 2813120 2836385 2852476 2862026 2864848 2860616
$$ packed form
59343F976787L02202K88112K70441K49052K23569J94544J63389J31208R8348O5361
59333H963013L3617M164k3748n2101q1815j11596j39525j65437j90986k17193
59323H018393k42548k64112k80155k91100k97940l00655k98768k92721k83853
59314E466541k73076k60346k45655k29865k14149j98896j83579j67677j51496
59305C541802j36109j22528j10988j00956r1709q2748p3775o4781n6351m9455
59295B652402m4514m0866l7503l3969l0156k5790k0869j6218j2667r764o421k665
59283B371000M20K673N426R509J4071J8057K1552K4677K6541K6897K7551L0207
59271B578581L3559L4844L3936L3460L4401L4169L0170K3265J6091R550K822m232
$$ plain form
59259 2860616 2849983 2834111 2813707 2788901 2759221 2723430 2680512 2631493 2579340 2526354 2472591
59248 2472591 2417599 2362536 2309205 2257799 2207137 2156921 2108339 2062465 2019324 1978675 1940541
59237 1940541 1904685 1870688 1838927 1810512 1785734 1763383 1742166 1722107 1704024 1688289 1674706
59226 1674706 1663128 1653571 1645991 1640488 1637483 1637310 1639839 1644779 1652119 1662071 1674834 1690562 1709288
59213 1709288 1730916 1755786 1785206 1820611 1862117 1908867 1961046 2020449 2088527 2165151 2250179
59202 2250179 2344972 2450999 2568008 2695374 2834570 2988130 3156096 3335349 3522779 3717147
59192 3717147 3916949 4118110 4315109 4503284 4678704 4836591 4971274 5077433 5150572 5187085
59182 5187085 5185524 5147802 5077786 4978348 4850954 4698566 4527726 4346563 4160988 3973648
$$ packed form
59259B860616j0633j5872k0404k4806k9680l5791m2918m9019n2153n2986n3763
59248B472591n4992n5063n3331n1406n0662n0216m8582m5874m3141m0649l8134
59237A940541l5856l3997l1761k8415k4778k2351k1217k0059j8083j5735j3583
59226A674706j1578r557p580n503l005j73K529M940P340R952J2763J5728J8726
59213A709288K1628K4870K9420L5405M1506M6750N2179N9403O8078P6624Q5028
59202B250179R4793J06027J17009J27366J39196J53560J67966J79253J87430J94368
59192C717147J99802K01161J96999J88175J75420J57887J34683J06159P3139L6513
59182E187085j561l7722p0016r9438j27394j52388j70840j81163j85575j87340
$$ plain form
59172 3973648 3786397 3602689 3426980 3262302 3109294 2967709 2838266 2722495 2621057
59163 2621057 2532720 2455154 2386359 2325343 2271806 2225504 2185788 2151593 2121953 2096509 2075309
59152 2075309 2058052 2043736 2031124 2019299 2007661 1995641 1982593 1967951 1951552 1934083 1917043
59141 1917043 1901752 1888311 1875888 1863888 1852121 1839918 1826385 1812248 1800369 1793056 1789333 1786227
59129 1786227 1782686 1780739 1782461 1787290 1793332 1800155 1808766 1819285 1830366 1841320 1853436 1868267 1885319
59116 1885319 1902512 1918598 1934072 1949562 1964352 1977096 1987469 1996503 2005435 2014665 2023627 2031259
59104 2031259 2036649 2039628 2040815 2041015 2040723 2040225 2039643 2038534 2035992 2031865 2027442 2024191 2022125 2020391 2019216
59089 2019216 2019901 2022726 2026317 2029913 2035164 2044531 2058405 2074693 2090913 2105970 2120322 2135275 2151904
$$ packed form
59172C973648j87251j83708j75709j64678j53008j41585j29443j15771j01438
59163B621057q8337p7566o8795o1016n3537m6302l9716l4195k9640k5444k1200
59152B075309j7257j4316j2612j1825j1638j2020j3048j4642j6399j7469j7040
59141A917043j5291j3441j2423j2000j1767j2203j3533j4137j1879p313l723l106
59129A786227l541j947J722M829O042O823Q611J0519J1081J0954J2116J4831J7052
59116A885319J7193J6086J5474J5490J4790J2744J0373R034Q932R230Q962P632
59104B031259N390K979J187K00k92m98n82j109k542m127m423l251k066j734j175
59089B019216O85K825L591L596N251R367J3874J6288J6220J5057J4352J4953J6629
$$ plain form
59076 2151904 2169940 2187894 2204708 2220857 2237090 2252661 2265839 2275890 2283395 2288603 2290684 2288821
59064 2288821 2283034 2273537 2260277 2243554 2224243 2202716 2178233 2150131 2119112 2086625 2053273 2018583
59052 2018583 1982251 1944979 1907975 1872041 1837302 1803495 1770306 1737508 1705082 1673464 1643620
59041 1643620 1616413 1591564 1567603 1543349 1519254 1496679 1476088 1456764 1438266 1421172 1406060
59030 1406060 1392697 1380792 1370765 1362985 1356771 1350952 1345155 1339892 1335608 1332202 1329175 1325547 1319936
59017 1319936 1311601 1301483 1291501 1282679 1274414 1265597 1255808 1245389 1235120 1226204 1220003 1217156 1216967
59004 1216967 1217949 1218876 1219332 1219520 1219787 1220280 1220993 1222139 1224342 1228162 1233534 1239999 1247429 1256094 1266002 1276814
58988 1276814 1288695 1302757 1320210 1341344 1365779 1393388 1424330 1458215 1493903 1530491 1568088
$$ packed form
59076B151904J8036J7954J6814J6149J6233J5571J3178J0051P505N208K081j863
59064B288821n787r497j3260j6723j9311k1527k4483k8102l1019l2487l3352l4690
59052B018583l6332l7272l7004l5934l4739l3807l3189l2798l2426l1618k9844
59041A643620k7207k4849k3961k4254k4095k2575k0591j9324j8498j7094j5112
59030A406060j3363j1905j0027p780o214n819n797n263m284l406l027l628n611
59017A319936q335j0118r982q822q265q817r789j0419j0269q916o201k847j89
59004A216967R82R27M56J88K67M93P13J146K203L820N372O465P430Q665R908J0812
58988A276814J1881J4062J7453K1134K4435K7609L0942L3885L5688L6588L7597
$$ plain form
58977 1568088 1607171 1647198 1686320 1722576 1755114 1784092 1809730 1831993 1851117 1867681 1881626
58966 1881626 1891651 1896399 1896241 1893304 1889531 1885253 1879822 1873017 1865292 1857112 1848694 1840196 1831489 1821824
58952 1821824 1810455 1797828 1785624 1775334 1767202 1760886 1756671 1755372 1757075 1760473 1763735 1765960 1767833
58939 1767833 1771081 1777329 1787171 1800062 1814947 1831060 1848283 1867001 1887713 1910550 1935060 1960656
58927 1960656 1987572 2017148 2050705 2088085 2127768 2168703 2211734 2258935 2311769 2370290 2433949
58916 2433949 2502583 2576332 2654943 2737536 2822897 2909570 2995592 3078626 3156815 3229453 3296512
58905 3296512 3357695 3412667 3462613 3510998 3562042 3618481 3681264 3751113 3829314 3916625 4012364
58894 4012364 4115496 4226266 4345875 4474554 4610778 4752668 4899676 5052525 5211867
$$ packed form
58977A568088L9083M0027L9122L6256L2538K8978K5638K2263J9124J6564J3945
58966A881626J0025M748j58k937l773m278n431o805p725q180q418q498q707r665
58952A821824j1369j2627j2204j0290q132o316m215j299J703L398L262K225J873
58939A767833L248O248R842J2891J4885J6113J7223J8718K0712K2837K4510K5596
58927A960656K6916K9576L3557L7380L9683M0935M3031M7201N2834N8521O3659
58916B433949O8634P3749P8611Q2593Q5361Q6673Q6022Q3034P8189P2638O7059
58905C296512O1183N4972M9946M8385N1044N6439O2783O9849P8201Q7311R5739
58894D012364J03132J10770J19609J28679J36224J41890J47008J52849J59342
$$ plain form
58885 5211867 5377396 5548058 5722503 5898850 6074006 6243598 6403045 6549005 6679853
58876 6679853 6794974 6893968 6976530 7042538 7091907 7124815 7142561 7147714 7142494 7126862 7098768
58865 7098768 7056404 6999760 6930037 6848315 6755200 6651327 6537678 6415578 6286590 6152322
58855 6152322 6014163 5873373 5731364 5589500 5448380 5307499 5165875 5023159 4880513
58846 4880513 4740692 4606771 4479997 4359010 4241889 4128808 4021762 3921732 3827461 3737442
58836 3737442 3651794 3571384 3496348 3426731 3363635 3308185 3259726 3216539 3178233 3146018 3120489
58825 3120489 3100462 3084434 3072107 3063891 3059784 3059416 3062637 3069414 3079494 3092613 3108884 3128663
58813 3128663 3152120 3178871 3207827 3237673 3268066 3300130 3335114 3372820 3412325 3454087 3500084
$$ packed form
58885E211867J65529J70662J74445J76347J75156J69592J59447J45960J30848
58876F679853J15121R8994Q2562O6008M9369L2908J7746N153n220j5632k8094
58865G098768m2364n6644o9723q1722r3115j03873j13649j22100j28988j34268
58855F152322j38159j40790j42009j41864j41120j40881j41624j42716j42646
58846D880513j39821j33921j26774j20987j17121j13081j07046j00030r4271r0019
58836C737442q5648q0410p5036o9617o3096n5450m8459m3187l8306l2215k5529
58825C120489k0027j6028j2327q216m107l68L221O777J0080J3119J6271J9779
58813C128663K3457K6751K8956K9846L0393L2064L4984L7706L9505M1762M5997
$$ plain form
58802 3500084 3551599 3608147 3669086 3735061 3807008 3884827 3968102 4057400 4153722 4257214 4367450
58791 4367450 4484509 4608750 4739846 4877071 5020107 5168464 5320380 5473611 5627297
58782 5627297 5781744 5936132 6087581 6232842 6369852 6497120 6612544 6713484 6797422 6862194
58772 6862194 6906386 6930070 6934455 6920126 6886147 6831514 6757013 6665035 6558109 6438355 6307878
58761 6307878 6168615 6021743 5867991 5708627 5545619 5380862 5215779 5051658 4889807
58752 4889807 4731248 4576716 4426947 4282470 4143227 4009122 3881104 3760830 3648836
58743 3648836 3543764 3444102 3350114 3263168 3183473 3109520 3039823 2974225 2913111 2856199 2802838
58732 2802838 2752906 2706442 2662598 2619797 2577123 2535020 2494523 2456375 2420987 2388709 2359875
$$ packed form
58802C500084N1515N6548O0939O5975P1947P7819Q3275Q9298R6322J03492J10236
58791D367450J17059J24241J31096J37225J43036J48357J51916J53231J53686
58782E627297J54447J54388J51449J45261J37010J27268J15424J00940Q3938O4772
58772F862194M4192K3684M385j4329l3979n4633p4501r1978j06926j19754j30477
58761F307878j39263j46872j53752j59364j63008j64757j65083j64121j61851
58752D889807j58559j54532j49769j44477j39243j34105j28018j20274j11994
58743C648836j05072r9662r3988q6946p9695p3953o9697o5598o1114n6912n3361
58732B802838m9932m6464m3844m2801m2674m2103m0497l8148l5388l2278k8834
$$ plain form
58721 2359875 2335090 2315657 2302992 2297119 2296097 2297300 2298723 2298646 2294814 2284849 2267108 2240466 2203910
58708 2203910 2157608 2104131 2047170 1988777 1928875 1867592 1806681 1748128 1692701 1640738 1593187
58697 1593187 1550620 1512033 1476174 1443788 1417141 1397202 1382458 1370950 1362620 1359159 1362027 1370977
58685 1370977 1384025 1398321 1411052 1419851 1422731 1418146 1405448 1385088 1358176 1326266 1291903 1258718
58673 1258718 1229875 1206139 1185926 1167335 1149861 1134417 1122290 1114097 1109218 1106110 1103416 1100563
58661 1100563 1097021 1091551 1082955 1071307 1057735 1043382 1029513 1017961 1009853 1003851 997320 989591 982507
58648 982507 977150 971965 965418 958926 955232 954641 954744 953535 951103 948383 946018 944755 945359 947457 949643
58633 949643 951509 954641 960792 969741 979819 990002 1000642 1012374 1025207 1038812 1053033 1067670
$$ packed form
58721B359875k4785j9433j2665n873j022J203J423p7l832r965j7741k6642l6556
58708B203910m6302n3477n6961n8393n9902o1283o0911n8553n5427n1963m7551
58697A593187m2567l8587l5859l2386k6647j9939j4744j1508q330l461K868Q950
58685A370977J3048J4296J2731Q799K880m585j2698k0360k6912l1910l4363l3185
58673A258718k8843k3736k0213j8591j7474j5444j2127q193m879l108k694k853
58661A100563l542n470q596j1648j3572j4353j3869j1552q108o002o531p729p084
58648I82507n357n185o547o492l694n91J03j209k432k720k365j263O04K098K186
58633I49643J866L132O151Q949J0078J0183J0640J1732J2833J3605J4221J4637
$$ plain form
58621 1067670 1081934 1094486 1104264 1111244 1116283 1120201 1123292 1125811 1128510 1132200 1137020 1142628 1148962
58608 1148962 1156276 1164665 1174349 1186481 1202636 1222906 1245220 1267382 1289524 1313776 1341585 1372237
58596 1372237 1404421 1438502 1476216 1518055 1561939 1605355 1648416 1693718 1743056 1795292 1847907
58585 1847907 1899521 1949897 1998324 2043543 2085165 2123735 2159031 2189317 2212681 2228416 2236888
58574 2236888 2238995 2236013 2229009 2217927 2202132 2182332 2160820 2139078 2116157 2090616 2063198 2036234
58562 2036234 2010768 1985776 1960190 1934416 1909571 1886316 1864786 1844670 1824741 1803023 1778228
58551 1778228 1750827 1722282 1693431 1663987 1633329 1601304 1568286 1534823 1501395 1468425 1436247
58540 1436247 1404977 1374572 1345319 1318111 1293729 1271709 1250493 1229103 1208216 1189103 1172038
$$ packed form
58621A067670J4264J2552R778O980N039L918L091K519K699L690M820N608O334
58608A148962P314Q389R684J2132J6155K0270K2314K2162K2142K4252K7809L0652
58596A372237L2184L4081L7714M1839M3884M3416M3061M5302M9338N2236N2615
58585A847907N1614N0376M8427M5219M1622L8570L5296L0286K3364J5735Q472
58574B236888K107k982p004j1082j5795j9800k1512k1742k2921k5541k7418k6964
58562B036234k5466k4992k5586k5774k4845k3255k1530k0116j9929k1718k4795
58551A778228k7401k8545k8851k9444l0658l2025l3018l3463l3428l2970l2178
58540A436247l1270l0405k9253k7208k4382k2020k1216k1390k0887j9113j7065
$$ plain form
58529 1172038 1156421 1142040 1129316 1118501 1109555 1102754 1098381 1095636 1092837 1089227 1085866 1084299 1084911
58516 1084911 1087063 1090125 1093668 1097072 1099759 1101705 1103210 1104240 1104432 1103682 1102274 1100409 1097863 1094164
58502 1094164 1089036 1082783 1076307 1070493 1065509 1061064 1057403 1055489 1055951 1058475 1062702 1069076 1077940 1088270
58488 1088270 1098417 1108052 1118344 1129909 1141554 1151636 1160014 1167902 1176083 1183942 1190234 1194258 1196163
58475 1196163 1196455 1195484 1193359 1190261 1186703 1183257 1179915 1176007 1171048 1165580 1160860 1157596 1155210 1152503
58461 1152503 1148951 1145270 1142664 1141516 1140722 1138383 1133428 1126712 1120309 1115468 1111398 1106416 1100185 1094276
58447 1094276 1090345 1088308 1086860 1085317 1084119 1083563 1083127 1082657 1083540 1087668 1095135 1103557 1110043 1113637 1115748
58432 1115748 1118409 1122408 1127075 1131583 1136040 1141097 1146831 1152655 1158412 1164835 1172391 1180189 1186882 1192499
$$ packed form
58529A172038j5617j4381j2724j0815q946o801m373k745k799l610l361j567O12
58516A084911K152L062L543L404K687J946J505J030J92p50j408j865k546l699
58502A094164n128o253o476n814m984m445l661j914M62K524M227O374Q864J0330
58488A088270J0147R635J0292J1565J1645J0082Q378P888Q181P859O292M024J905
58475A196163K92r71k125l098l558l446l342l908m959n468m720l264k386k707
58461A152503l552l681k606j148p94k339m955o716o403m841m070m982o231n909
58447A094276l931k037j448j543j198n56m36m70Q83M128P467Q422O486L594K111
58432A115748K661L999M667M508M457N057N734N824N757O423P556P798O693N617
$$ plain form
58418 1192499 1198461 1205606 1213083 1219812 1226341 1234340 1244393 1255231 1265433 1275224 1286015 1298510 1312006
58405 1312006 1325616 1339556 1354841 1372077 1391048 1411170 1431635 1451172 1468593 1484087 1499315
58394 1499315 1515500 1531767 1546079 1557500 1566662 1574085 1579135 1581072 1580305 1577954 1574602 1570127 1564575
58381 1564575 1558705 1553739 1550726 1549925 1550721 1552590 1556395 1564054 1576328 1591263 1605532 1617248 1627157
58368 1627157 1637428 1649806 1664570 1680480 1695769 1709735 1723334 1737817 1753280 1769240 1786034
58357 1786034 1804309 1823370 1841613 1858882 1876862 1896490 1916412 1935128 1953445 1973406 1995606
58346 1995606 2019018 2043000 2067843 2093345 2118335 2141994 2164661 2187086 2209732 2233081 2257700
58335 2257700 2283688 2310742 2338949 2368649 2399305 2429479 2458372 2486628 2515185 2544233 2573867
$$ packed form
58418A192499N962P145P477O729O529P999J0053J0838J0202R791J0791J2495J3496
58405A312006J3610J3940J5285J7236J8971K0122K0465J9537J7421J5494J5228
58394A499315J6185J6267J4312J1421R162P423N050J937p67k351l352m475n552
58381A564575n870m966l013q01P96J869L805P659J2274J4935J4269J1716R909
58368A627157J0271J2378J4764J5910J5289J3966J3599J4483J5463J5960J6794
58357A786034J8275J9061J8243J7269J7980J9628J9922J8716J8317J9961K2200
58346A995606K3412K3982K4843K5502K4990K3659K2667K2425K2646K3349K4619
58335B257700K5988K7054K8207K9700L0656L0174K8893K8256K8557K9048K9634
$$ plain form
58324 2573867 2604795 2637487 2671329 2705566 2740620 2777464 2816086 2855621 2895775 2937062 2979642
58313 2979642 3023050 3067237 3112799 3159731 3206926 3253694 3301131 3351006 3403570 3457345 3511201
58302 3511201 3565746 3622169 3680252 3738448 3796078 3854695 3916545 3981891 4048602 4114531 4179684
58291 4179684 4245725 4313995 4384747 4457975 4534104 4613674 4696790 4783038 4871602 4961531 5052426
58280 5052426 5145066 5240995 5341232 5445531 5552916 5662684 5774881 5890235 6009803 6134311
58270 6134311 6263609 6397006 6534373 6676680 6825194 6980204 7140757 7305547 7473959
58261 7473959 7646385 7823731 8006622 8195013 8388548 8587272 8791937 9003685 9223564
58252 9223564 9452235 9689823 9936081 10191114 10456188 10733621 11025639 11333433 11657401
$$ packed form
58324B573867L0928L2692L3842L4237L5054L6844L8622L9535M0154M1287M2580
58313B979642M3408M4187M5562M6932M7195M6768M7437M9875N2564N3775N3856
58302C511201N4545N6423N8083N8196N7630N8617O1850O5346O6711O5929O5153
58291D179684O6041O8270P0752P3228P6129P9570Q3116Q6248Q8564Q9929R0895
58280E052426R2640R5929J00237J04299J07385J09768J12197J15354J19568J24508
58270F134311J29298J33397J37367J42307J48514J55010J60553J64790J68412
58261G473959J72426J77346J82891J88391J93535J98724K04665K11748K19879
58252I223564K28671K37588K46258K55033K65074K77433K92018L07794L23968
$$ plain form
58243 11657401 11998090 12356652 12734545 13133176 13553991 13998676 14468952 14966091 15490840
58234 15490840 16044232 16628539 17247200 17903631 18600410 19339981 20126017 20963647 21858370
58225 21858370 22815175 23838874 24934956 26109991 27371751 28729513 30194285 31778455
58217 31778455 33495246 35358993 37386517 39598631 42020445 44680397 47609346 50840962
58209 50840962 54412774 58366555 62748593 67612727 73027591 79085017 85904384 93630788
58201 93630788 102429627 112481355 123978041 137121014 152118299 169180772 188516039
58194 188516039 210317921 234747222 261897469 291741128 324056791 358344179 393741364
58187 393741364 428969338 462338734 491852005 515414842 531137241 537666364 534461706
$$ packed form
58243A1657401L40689L58562L77893L98631M20815M44685M70276M97139N24749
58234A5490840N53392N84307O18661O56431O96779P39571P86036Q37630Q94723
58225B1858370R56805J023699J096082J175035J261760J357762J464772J584170
58217C1778455J716791J863747K027524K212114K421814K659952K928949L231616
58209E0840962L571812L953781M382038M864134N414864O057426O819367P726404
58201I3630788Q798839J0051728J1496686J3142973J4997285J7062473J9335267
58194A88516039K1801882K4429301K7150247K9843659L2315663L4287388L5397185
58187C93741364L5227974L3369396K9513271K3562837J5722399O529123l204658
$$ plain form
58180 534461706 521917402 501276446 474361325 443219872 409804531 375761362 342342428
58173 342342428 310412918 280511847 252929831 227779718 205051502 184653842 166445599
58166 166445599 150257513 135905158 123198328 111950931 101989768 93158327 85315962
58159 85315962 78336554 72108822 66536606 61537189 57038585 52977829 49300744 45961889
58151 45961889 42923501 40153527 37623713 35308619 33185730 31235938 29443211 27793101
58143 27793101 26271317 24864059 23559903 22350715 21229897 20189852 19221916 18318703
58135 18318703 17475318 16687595 15950023 15256498 14602809 13987333 13409085 12865756 12353808
58126 12353808 11869952 11412261 10980084 10572914 10189073 9825573 9479598 9149986 8836856
$$ packed form
58180E34461706j2544304k0640956k6915121l1141453l3415341l4043169l3418934
58173C42342428l1929510k9901071k7582016k5150113k2728216k0397660j8208243
58166A66445599j6188086j4352355j2706830j1247397r961163q831441p842365
58159H5315962o979408o227732n572216m999417m498604m060756l677085l338855
58151D5961889l038388k769974k529814k315094k122889j949792j792727j650110
58143B7793101j521784j407258j304156j209188j120818j040045r67936r03213
58135A8318703q43385p87723p37572o93525o53689o15476n78248n43329n11948
58126A2353808m83856m57691m32177m07170l83841l63500l45975l29612l13130
$$ plain form
58117 8836856 8540058 8258611 7991506 7738094 7497381 7267615 7046999 6834450 6629440
58108 6629440 6431702 6241467 6059444 5885891 5719934 5560281 5406432 5258823 5117992
58099 5117992 4983997 4856422 4734401 4616687 4502264 4391148 4284257 4182284 4084839 3990891
58089 3990891 3899867 3812106 3728284 3648674 3573113 3501344 3432876 3366456 3300253 3233167 3165777
58078 3165777 3099517 3034946 2971339 2908029 2845561 2785176 2727545 2672314 2618710 2566240 2514938
58067 2514938 2465185 2417238 2370886 2325791 2282222 2241030 2202644 2166451 2131498 2097419 2064208
58056 2064208 2031376 1998018 1963752 1929055 1894590 1860723 1827854 1796631 1767361 1739466 1712053
58045 1712053 1685054 1659488 1636494 1616141 1597183 1577855 1557170 1535733 1515344 1497490 1482040
$$ packed form
58117H836856k96798k81447k67105k53412k40713k29766k20616k12549k05010
58108F629440j97738j90235j82023j73553j65957j59653j53849j47609j40831
58099E117992j33995j27575j22021j17714j14423j11116j06891j01973r7445r3948
58089C990891r1024q7761q3822p9610p5561p1769o8468o6420o6203o7086o7390
58078C165777o6260o4571o3607o3310o2468o0385n7631n5231n3604n2470n1302
58067B514938m9753m7947m6352m5095m3569m1192l8386l6193l4953l4079l3211
58056B064208l2832l3358l4266l4697l4465l3867l2869l1223k9270k7895k7413
58045A712053k6999k5566k2994k0353j8958j9328k0685k1437k0389j7854j5450
$$ plain form
58034 1482040 1467411 1451995 1435336 1418079 1401232 1385541 1371083 1357032 1342073 1325595 1308489
58023 1308489 1292464 1278581 1266725 1256230 1246411 1236558 1226236 1215853 1206302 1197750 1189460 1181257
58011 1181257 1174332 1169709 1166418 1162297 1156488 1150250 1145303 1142279 1140901 1140567 1140350 1139221 1137024 1134767
57997 1134767 1133442 1132977 1132790 1132846 1133443 1134319 1134844 1135183 1136458 1139365 1143129 1146318 1148522 1150740 1154185 1159261
57981 1159261 1165956 1174620 1185722 1199118 1214565 1232886 1255417 1281681 1308773 1334205 1358615 1384179
57969 1384179 1410824 1435673 1456208 1472080 1483242 1488177 1485310 1474957 1458428 1436069 1407666 1374270
57957 1374270 1338053 1300458 1261793 1222692 1184726 1149207 1116308 1085636 1056987 1030377 1006074
57946 1006074 984768 966991 952206 939229 927702 918284 911034 904472 896803 887532 877438 867529
$$ packed form
58034A482040j4629j5416j6659j7257j6847j5691j4458j4051j4959j6478j7106
58023A308489j6025j3883j1856j0495r819r853j0322j0383r551q552q290q203
58011A181257o925m623l291m121n809o238m947l024j378l34k17j129k197k257
57997A134767j325m65j87N6N97Q76N25L39J275K907L764L189K204K218L445N076
57981A159261O695Q664J1102J3396J5447J8321K2531K6264K7092K5432K4410K5564
57969A384179K6645K4849K0535J5872J1162M935k867j0353j6529k2359k8403l3396
57957A374270l6217l7595l8665l9101l7966l5519l2899l0672k8649k6610k4303
57946A006074k1306j7777j4785j2977j1527r418p250o562p669r271j0094r909
$$ plain form
57934 867529 858490 850478 842717 833660 822316 809309 796207 784057 773004 762984 754090 746329 739637
57921 739637 734164 730218 728024 728046 731380 739062 750773 764737 779153 793318 807082 819788 830480
57908 830480 839129 847022 855446 863954 870184 871572 867374 858969 848257 836017 822004 806258 789764
57895 789764 773725 758638 744302 730334 716343 701932 687040 672174 657838 643741 629060
57884 629060 613633 598488 584969 573569 563739 554425 544607 533799 522596 512557 505023 500016
57872 500016 496615 494179 492653 491835 491163 490510 490536 491778 493892 496326 499343 503682 509230 514703 518782
57857 518782 521211 522618 523579 524005 523257 520825 517105 513401 510774 508849 506216 502137 497345 492815 488379
57842 488379 483300 477968 474056 472737 473424 474684 475801 476850 477726 477961 477488 476809 476265 475720 475120 474689
$$ packed form
57934H67529r039q012p761r057j1344j3007j3102j2150j1053j0020q894p761o692
57921G39637n473l946k194K2L334P682J1711J3964J4416J4165J3764J2706J0692
57908H30480Q649P893Q424Q508O230J388m198q405j0712j2240j4013j5746j6494
57895G89764j6039j5087j4336j3968j3991j4411j4892j4866j4336j4097j4681
57884F29060j5427j5145j3519j1400r830r314r818j0808j1203j0039p534n007
57872E00016l401k436j526q18o72o53K6J242K114K434L017M339N548N473M079
57857E18782K429J407R61M26p48k432l720l704k627j925k633m079m792m530m436
57842D88379n079n332l912j319O87J260J117J049Q76K35m73o79n44n45o00m31
$$ plain form
57826 474689 474307 473302 471267 468413 464688 459282 451909 443982 437499 432885 428903 424539 419960 415624
57812 415624 411689 408618 407242 407592 408576 409416 410596 412802 415929 420058 426510 436564 449546 463527
57798 463527 477786 493319 510897 529994 550084 571697 595143 618854 640042 657011 670139
57787 670139 680539 688303 692423 692215 688395 682552 675630 667141 655803 640762 622261 601600 580602
57774 580602 560666 541997 523966 506359 489759 474508 459950 445292 430689 416873 404250
57763 404250 393106 384151 377801 373200 369077 365396 362914 361166 358343 353725 348981 346299 346057 347101
57749 347101 348553 350463 353128 356604 360647 364638 367777 369735 370853 371454 371487 371148 371250 372513 374925
57734 374925 378160 381939 385605 388268 390119 392831 397758 404404 411618 419452 428450 437731 445567 451792
$$ packed form
57826D74689l82j005k035k854l725n406p373p927o483m614l982m364m579m336
57812D15624l935l071j376L50R84Q40J180K206L127M129O452J0054J2982J3981
57798D63527J4259J5533J7578J9097K0090K1613K3446K3711K1188J6969J3128
57787F70139J0400P764M120k08l820n843o922q489j1338j5041j8501k0661k0998
57774E80602j9936j8669j8031j7607j6600j5251j4558j4658j4603j3816j2623
57763D04250j1144q955o350m601m123l681k482j748k823m618m744k682k42J044
57749C47101J452J910K665L476M043L991L139J958J118O01L3l39J02J263K412
57734C74925L235L779L666K663J851K712M927O646P214P834Q998R281P836O225
$$ plain form
57720 451792 457871 464163 468773 469909 468101 465185 462195 459388 457501 457530 459369 461684 463242 463802 463902
57705 463902 464392 466102 469268 473183 476766 479501 481604 483586 486051 489593 494228 499184 503929 509237
57691 509237 516424 525548 535233 544475 553689 563606 574222 585785 600220 620325 647358 680166 717024
57678 717024 757903 804737 859878 924756 1000055 1086951 1188002 1306600 1445196 1603569 1777878
57667 1777878 1960170 2138039 2295307 2414869 2483273 2495177 2455611 2378760 2283207 2185673
57657 2185673 2096797 2021016 1958968 1909527 1870769 1840983 1819459 1805686 1797703 1792063 1785754 1777393
57645 1777393 1766299 1751553 1732698 1710350 1685074 1656373 1623927 1589204 1554401 1520065 1485220
57634 1485220 1449886 1415797 1384037 1353433 1322335 1290995 1261024 1233100 1206489 1180701 1156493
$$ packed form
57720D51792O079O292M610J136j808k916k990k807j887K9J839K315J558N60J00
57705D63902M90J710L166L915L583K735K103J982K465L542M635M956M745N308
57691E09237P187R124R685R242R214R917J0616J1563J4435K0105K7033L2808L6858
57678G17024M0879M6834N5141O4878P5299Q6896J01051J18598J38596J58373J74309
57667A777878J82292J77869J57268J19562O8404J1904l9566p6851r5553r7534
57657B185673q8876p5781o2048m9441l8758k9786k1524j3773p983n640o309q361
57645A777393j1094j4746j8855k2348k5276k8701l2446l4723l4803l4336l4845
57634A485220l5334l4089l1760l0604l1098l1340k9971k7924k6611k5788k4208
$$ plain form
57623 1156493 1134983 1116438 1100287 1085858 1072908 1061649 1052410 1045202 1039706 1035874 1034328 1035849
57611 1035849 1040542 1047868 1057356 1068931 1082604 1098331 1116257 1136652 1159502 1184597 1212086 1242303
57599 1242303 1274664 1307299 1338547 1368544 1398529 1428612 1457121 1482475 1504894 1525650 1545217
57588 1545217 1562864 1577509 1587970 1592642 1590172 1580787 1565996 1546686 1522464 1493336 1460859 1426602
57576 1426602 1390335 1351024 1309240 1267166 1226221 1185976 1145629 1105448 1066272 1028533 992377
57565 992377 958079 925691 894867 865577 838476 813946 791255 769386 748537 730011 714626
57554 714626 701808 690295 679246 668419 657707 646981 636516 627270 620327 615796 612480 608962
57542 608962 604973 601413 599133 598208 598434 599895 602673 606393 610426 614333 617840 620673 622720 624249 625767
$$ packed form
57623A156493k1510j8545j6151j4429j2950j1259r239p208n496l832j546J521
57611A035849M693P326R488J1575J3673J5727J7926K0395K2850K5095K7489L0217
57599A242303L2361L2635L1248K9997K9985L0083K8509K5354K2419K0756J9567
57588A545217J7647J4645J0461M672k470r385j4791j9310k4222k9128l2477l4257
57576A426602l6267l9311m1784m2074m0945m0245m0347m0181l9176l7739l6156
57565I92377l4298l2388l0824k9290k7101k4530k2691k1869k0849j8526j5385
57554G14626j2818j1513j1049j0827j0712j0726j0465r246o943m531l316l518
57542F08962l989l560k280r25K26J461K778L720M033L907L507K833K047J529J518
$$ plain form
57527 625767 627848 631237 636811 645011 655341 666661 678127 689816 702507 716772 732281 748239
57515 748239 764718 783104 804681 829030 854512 880145 906107 932336 957796 981800 1005351
57504 1005351 1030424 1058164 1088108 1118723 1148302 1175852 1201675 1226824 1251583 1274761 1294709
57493 1294709 1310508 1321765 1327857 1328163 1322819 1312705 1298752 1281622 1261810 1239746 1215973 1191378
57481 1191378 1166804 1142223 1116907 1090758 1064862 1040228 1016660 993535 971093 950088 930542
57470 930542 911769 893511 876346 861022 847964 837321 829031 822959 819231 818053 818901 820546 822444
57457 822444 825551 831061 838984 848732 860445 874671 891079 908592 926586 945060 963851 982764
57445 982764 1002343 1023526 1046609 1071288 1097475 1125101 1153311 1180885 1207329 1232639 1256252
$$ packed form
57527F25767K081L389N574Q200J0330J1320J1466J1689J2691J4265J5509J5958
57515G48239J6479J8386K1577K4349K5482K5633K5962K6229K5460K4004K3551
57504A005351K5073K7740K9944L0615K9579K7550K5823K5149K4759K3178J9948
57493A294709J5799J1257O092L06n344j0114j3953j7130j9812k2064k3773k4595
57481A191378k4574k4581k5316k6149k5896k4634k3568k3125k2442k1005j9546
57470I30542j8773j8258j7165j5324j3058j0643q290o072l728j178Q48J645J898
57457H22444L107N510P923R748J1713J4226J6408J7513J7994J8474J8791J8913
57445I82764J9579K1183K3083K4679K6187K7626K8210K7574K6444K5310K3613
$$ plain form
57434 1256252 1277258 1295313 1310138 1320513 1325326 1325412 1322569 1316621 1305396 1288130 1267060 1244622
57422 1244622 1220732 1194081 1164813 1134397 1103708 1072684 1041529 1010973 981426 952744 924840
57411 924840 898038 872860 849727 828596 808875 790294 773869 761046 751530 742981 733406 722968
57399 722968 712901 703674 695161 687694 681742 676916 672280 667419 662648 658483 655412 653583 652246 650274
57385 650274 647896 647025 648929 652353 655024 656336 657302 658479 659471 660285 661679 663940 666459 668790 671070
57370 671070 673188 674509 674869 675066 675921 677476 679482 682133 685874 690762 696337 701964 707147 711803 716387
57355 716387 721666 728180 735806 743717 750845 756776 762239 768367 775447 783004 791101 800507 811164 821631
57341 821631 831000 840510 851999 865343 878775 891410 903923 916707 928878 939703 949882 960684
$$ packed form
57434A256252K1006J8055J4825J0375M813Q6k843n948j1225j7266k1070k2438
57422A244622k3890k6651k9268l0416l0689l1024l1155l0556k9547k8682k7904
57411I24840k6802k5178k3133k1131j9721j8581j6425j2823r516q549r575j0438
57399G22968j0067r227q513p467n952m826m636m861m771m165l071j829j337j972
57385F50274k378q71J904L424K671J312R66J177R92Q14J394K261K519K331K280
57370F71070K118J321L60J97Q55J555K006K651L741M888N575N627N183M656M584
57355G16387N279O514P626P911P128N931N463O128P080P557Q097R406J0657J0467
57341H21631R369R510J1489J3344J3432J2635J2513J2784J2171J0825J0179J0802
$$ plain form
57329 960684 972491 984869 997631 1011211 1026297 1043482 1063008 1084440 1106633 1128394 1149341
57318 1149341 1170236 1192410 1216624 1242438 1269001 1296521 1326326 1359095 1393528 1427336 1459144
57307 1459144 1488953 1517244 1544389 1570558 1595439 1618271 1639021 1659261 1681037 1704953 1730114
57296 1730114 1755691 1781653 1808052 1834660 1861424 1888489 1915711 1942907 1970504 1998960 2027513
57285 2027513 2054571 2079601 2103572 2127042 2148798 2167185 2182277 2196072 2210643 2226365 2241765
57274 2241765 2255007 2265651 2274822 2283545 2291593 2298550 2305255 2312989 2321632 2329907 2337239 2343923 2349571
57261 2349571 2353304 2355969 2360340 2368036 2377469 2385902 2392562 2398706 2405597 2413571 2422440 2431664 2440524 2448961
57247 2448961 2457863 2467851 2478355 2488605 2498935 2510242 2522716 2535933 2549638 2563497 2576626 2588521
$$ packed form
57329I60684J1807J2378J2762J3580J5086J7185J9526K1432K2193K1761K0947
57318A149341K0895K2174K4214K5814K6563K7520K9805L2769L4433L3808L1808
57307A459144K9809K8291K7145K6169K4881K2832K0750K0240K1776K3916K5161
57296A730114K5577K5962K6399K6608K6764K7065K7222K7196K7597K8456K8553
57285B027513K7058K5030K3971K3470K1756J8387J5092J3795J4571J5722J5400
57274B241765J3242J0644R171Q723Q048O957O705P734Q643Q275P332O684N648
57261B349571L733K665M371P696R433Q433O660O144O891P974Q869R224Q860Q437
57247B448961Q902R988J0504J0250J0330J1307J2474J3217J3705J3859J3129J1895
$$ plain form
57235 2588521 2600176 2613225 2628000 2643301 2658031 2672285 2686937 2702827 2720266 2738661 2756722
57224 2756722 2773564 2789374 2804492 2818376 2830431 2841494 2853382 2867021 2882000 2897894 2914875
57213 2914875 2932739 2950467 2967270 2983311 2998869 3013541 3027005 3040022 3053785 3068296 3082094
57202 3082094 3093868 3104012 3114264 3125876 3138533 3151161 3163359 3175415 3187163 3197695 3206544
57191 3206544 3214389 3222082 3229567 3236358 3242472 3248100 3252832 3256164 3258540 3260919 3263312 3264715 3264613 3263753
57177 3263753 3263166 3263184 3263715 3264806 3266436 3268153 3269381 3269959 3270156 3270313 3270553 3270659 3270206 3268980 3267195 3265076
57161 3265076 3262433 3258965 3254837 3250623 3246864 3244076 3242752 3242633 3242223 3240042 3236531 3233837 3233368 3234321 3235109
57146 3235109 3235551 3236940 3240275 3245203 3250727 3256486 3263069 3271359 3281876 3294856 3310664 3329616 3351323
$$ packed form
57235B588521J1655J3049J4775J5301J4730J4254J4652J5890J7439J8395J8061
57224B756722J6842J5810J5118J3884J2055J1063J1888J3639J4979J5894J6981
57213B914875J7864J7728J6803J6041J5558J4672J3464J3017J3763J4511J3798
57202C082094J1774J0144J0252J1612J2657J2628J2198J2056J1748J0532Q849
57191C206544P845P693P485O791O114N628M732L332K376K379K393J403j02q60
57177C263753n87J8N31J091J630J717J228N78J97J57K40J06m53j226j785k119
57161C265076k643l468m128m214l759k788j324j19m10k181l511k694m69R53P88
57146C235109M42J389L335M928N524N759O583Q290J0517J2980J5808J8952K1707
$$ plain form
57133 3351323 3374884 3400196 3428542 3461144 3497392 3535493 3574888 3617176 3664368 3717022 3774497
57122 3774497 3836378 3902994 3974850 4052154 4134984 4223835 4320128 4426160 4544226 4675700 4821195
57111 4821195 4981576 5158406 5353559 5569110 5807855 6073549 6370578 6704007 7080146
57102 7080146 7506560 7991398 8543491 9173508 9894513 10721031 11667957 12750358 13983196
57093 13983196 15380018 16951673 18705972 20647144 22774046 25078300 27543764 30146550
57085 30146550 32854261 35625186 38408743 41146450 43772253 46213545 48395269 50246526
57077 50246526 51706581 52728550 53281792 53353912 52951514 52098920 50835240 49210597 47281881
57068 47281881 45108800 42751061 40266633 37710370 35132968 32580660 30094903 27710910
$$ packed form
57133C351323K3561K5312K8346L2602L6248L8101L9395M2288M7192N2654N7475
57122C774497O1881O6616P1856P7304Q2830Q8851R6293J06032J18066J31474J45495
57111D821195J60381J76830J95153K15551K38745K65694K97029L33429L76139
57102G080146M26414M84838N52093O30017P21005Q26518R46926J082401J232838
57093A3983196J396822J571655J754299J941172K126902K304254K465464K602786
57085C0146550K707711K770925K783557K737707K625803K441292K181724J851257
57077E0246526J460055J021969N53242P2120m02398q52594j263680j624643j928716
57068D7281881k173081k357739k484428k556263k577402k552308k485757k383993
$$ plain form
57060 27710910 25455578 23346894 21395459 19606298 17979379 16509562 15187512 14001656
57052 14001656 12939847 11989990 11140027 10378165 9693613 9077208 8521038 8017286 7557868
57043 7557868 7135863 6747262 6390636 6064714 5766616 5492648 5240308 5008884 4798022
57034 4798022 4606058 4429897 4266428 4113849 3971471 3838330 3712580 3592695 3478857
57025 3478857 3372204 3272582 3177946 3086546 2998956 2917079 2841522 2770859 2703338 2638339 2575976
57014 2575976 2516184 2458717 2403418 2349929 2297592 2246263 2196904 2150707 2107651 2066409 2025555
57003 2025555 1984420 1943007 1901904 1862360 1825647 1791824 1759540 1727373 1695027 1662995 1631745
56992 1631745 1601833 1574302 1549999 1528465 1508174 1487988 1467842 1448022 1428506 1409308 1390805
$$ packed form
57060B7710910k255332k108684j951435j789161j626919j469817j322050j185856
57052A4001656j061809r49857q49963p61862o84552o16405n56170n03752m59418
57043G557868m22005l88601l56626l25922k98098k73968k52340k31424k10862
57034D798022j91964j76161j63469j52579j42378j33141j25750j19885j13838
57025C478857j06653r9622r4636r1400q7590q1877p5557p0663o7521o4999o2363
57014B575976n9792n7467n5299n3489n2337n1329m9359m6197m3056m1242m0854
57003B025555m1135m1413m1103l9544l6713l3823l2284l2167l2346l2032l1250
56992A631745k9912k7531k4303k1534k0291k0186k0146j9820j9516j9198j8503
$$ plain form
56981 1390805 1373137 1355554 1336791 1315981 1292915 1267723 1240807 1213081 1185813 1159990 1135926
56970 1135926 1113459 1092416 1072902 1055291 1040059 1027520 1017747 1010661 1006019 1003275 1001681 1000806 1000734
56957 1000734 1001384 1001732 1000194 995984 989666 981960 972380 959740 943963 926605 909169 891606 873287
56944 873287 855007 838818 825708 814562 804149 795240 789700 787881 788087 788683 789795 792549 797343
56931 797343 803282 808890 812996 815143 815283 812889 806460 794356 776191 753011 726295 697486 668433
56918 668433 641147 616498 593766 571947 550922 531108 512922 497248 485419 477550 471460 464459
56906 464459 455916 446984 438145 428487 417646 407071 398668 392973 389270 386922 386122 387658 392199 399342
56892 399342 407236 413932 419402 425588 434073 444359 454807 464391 472777 479459 483963 486645 488324 489160
$$ packed form
56981A390805j7668j7583j8763k0810k3066k5192k6916k7726k7268k5823k4064
56970A135926k2467k1043j9514j7611j5232j2539r773p086m642k744j594q75p2
56957A000734O50L48j538m210o318p706r580j2640j5777j7358j7436j7563j8319
56944H73287j8280j6189j3110j1146j0413q909n540j819K06N96J112K754M794
56931G97343N939N608M106K147J40k394o429j2104j8165k3180k6716k8809k9053
56918F68433k7286k4649k2732k1819k1025j9814j8186j5674j1829p869o090p001
56906D64459q543q932q839r658j0841j0575q403n695l703k348q00J536M541P143
56892C99342P894O696N470O186Q485J0286J0448R584Q386O682M504K682J679Q36
$$ plain form
56878 489160 488703 486927 484340 480987 476355 470700 465730 463405 464501 468775 476016 486227 499054 513909
56864 513909 530805 550454 573193 598151 623823 649129 673522 696198 715723 730483 739148 740761
56852 740761 735189 724006 710458 697669 686794 677301 668874 662316 658643 658328 661845 670151 683977
56839 683977 703302 728230 759652 797756 840084 882455 922179 959342 994442 1025621 1048960
56828 1048960 1060854 1059610 1045644 1021357 990529 956610 921278 885245 850260 819255 794173
56817 794173 774629 759336 748276 742787 743880 751260 763970 781361 803222 829100 857495 885651
56805 885651 910352 929052 940119 942139 933877 915502 889222 857799 822672 784382 744631 706739
56793 706739 673731 646631 624831 607279 592950 581141 572128 567055 566502 569595 575077 582688 592660
$$ packed form
56878D89160m57j776k587l353m632n655m970k325J096M274P241J0211J2827J4855
56864E13909J6896J9649K2739K4958K5672K5306K4393K2676J9525J4760Q665J613
56852G40761n572j1183j3548j2789j0875r493q427o558l673l15L517Q306J3826
56839F83977J9325K4928L1422L8104M2328M2371L9724L7163L5100L1179K3339
56828A048960J1894j244j3966k4287l0828l3919l5332l6033l4985l1005k5082
56817G94173j9544j5293j1060n489J093P380J2710J7391K1861K5878K8395K8156
56805H85651K4701J8700J1067K020q262j8375k6280l1423l5127l8290l9751l7892
56793G06739l3008k7100k1800j7552j4329j1809r013n073n53L093N482P611R972
$$ plain form
56780 592660 604236 615620 625210 631886 634162 630147 618960 601630 580262 556637 531834 506635
56768 506635 481816 458072 435815 414949 395022 376007 358794 344381 332683 322821 314568 308594
56756 308594 304877 301713 296972 289892 281173 271917 263133 255701 249863 244992 240589 237238 235653 234957
56742 234957 233106 229371 225391 223136 222501 221706 219614 216807 214435 212787 211236 209118 206353 203481 201398
56727 201398 200883 202024 203979 205538 206121 206267 207004 208765 210996 212854 214040 214835 215470 215812 215621 214847
56711 214847 213500 211524 209097 207037 206550 208295 211642 215006 217042 217586 217457 217454 217624 217438 216484 214920
56695 214920 213396 212641 213080 214681 217095 219881 222597 224875 226702 228723 231896 236511 241627 245810 248539
56680 248539 250757 253906 258542 263979 269200 273963 278894 284595 290835 296773 301806 305943 309329 311756
$$ packed form
56780E92660J1576J1384R590O676K276m015j1187j7330k1368k3625k4803k5199
56768E06635k4819k3744k2257k0866j9927j9015j7213j4413j1698r862q253n974
56756C08594l717l164m741p080q719r256q784p432n838m871m403l351j585o96
56742B34957j851l735l980k255o35p95k092k807k372j648j551k118k765k872k083
56727B01398n15J141J955J559N83J46P37J761K231J858J186P95O35L42j91p74
56711B14847j347j976k427k060m87J745L347L364K036N44j29lJ70j86r54j564
56695B14920j524p55M39J601K414K786K716K278J827K021L173M615N116M183K729
56680B48539K218L149M636N437N221M763M931N701O240N938N033M137L386K427
$$ plain form
56666 311756 312908 312921 312410 311845 311083 309694 307775 306367 306732 308994 311703 313139 313014 312459 312343 312316 311877
56649 311877 311635 312671 314902 316909 317508 316850 315883 315300 315243 315534 315864 316058 316208 316237 315398 312937 309527 307262
56631 307262 307509 309179 309812 308077 304583 300567 296723 293283 290258 287215 283636 280094 278373 279626 282671
56616 282671 284932 285059 284005 283409 283633 283749 282947 281434 280122 279864 280891 282620 284037 284551 284461 284302 283888
56599 283888 282472 279927 277211 275354 274317 273279 271742 269968 268541 268020 268883 271110 273571 274398 272521
56584 272521 268818 265525 264513 266175 269670 273891 278141 282211 286056 289492 292211 294048 295179 296069
56570 296069 297271 299229 302053 305358 308439 310837 312849 315442 319491 325054 331361 337524 343092 347877
56556 347877 351632 354388 357004 360664 365502 370304 373945 376567 378806 380578 381670 383022 385929 389787
$$ packed form
56666C11756J152J3n11n65p62j389j919j408L65K262K709J436j25n55j16k7m39
56649C11877k42J036K231K007N99o58r67n83n7K91L30J94J50K9q39k461l410k265
56631C07262K47J670O33j735l494m016l844l440l025l043l579l542j721J253L045
56616B82671K261J27j054n96K24J16q02j513j312k58J027J729J417N14r0j59m14
56599B83888j416k545k716j857j037j038j537j774j427n21Q63K227K461Q27j877
56584B72521l703l293j012J662L495M221M250M070L845L436K719J837J131Q90
56570B96069J202J958K824L305L081K398K012K593M049N563O307O163N568M785
56556C47877L755K756K616L660M838M802L641K622K239J772J092J352K907L858
$$ plain form
56542 389787 392057 391156 388391 386152 385062 383820 381146 376667 370304 362171 353222 344934 337996 331990
56528 331990 326523 321884 318223 314810 310641 305438 299638 293689 287723 281803 276269 271829 269119 267898
56514 267898 266869 264879 262234 260257 259543 259427 259231 259007 258590 257043 254084 251377 251104 253381 256180 257880
56498 257880 258844 260252 262363 264484 265912 266229 265335 263967 263745 265642 268383 269308 267204 263681 261334
56483 261334 261015 261389 260687 258266 254768 251565 250118 251049 253497 255788 257059 257819 258762 259653 259847 259318
56467 259318 258592 258162 258608 260825 265199 270781 276228 281448 287317 293786 299389 302886 304352 304322 303053
56452 303053 301250 300331 300869 301574 300880 298991 297354 296646 296520 296905 298184 300100 301757 302943 304397 306471
56436 306471 308486 309717 310045 309333 307188 304012 301408 300595 300846 300280 297963 294656 291665 289628 288438
$$ packed form
56542C89787K270r01k765k239j090j242k674m479o363q133q949q288o938o006
56528C31990n467m639l661l413m169n203n800n949n966n920n534m440k710j221
56514B67898j029j990k645j977p14j16j96k24m17j547k959k707k73K277K799J700
56498B57880R64J408K111K121J428L17q94j368k22J897K741R25k104l523k347
56483B61334l19L74p02k421l498l203j447R31K448K291J271P60R43Q91J94n29
56467B59318p26m30M46K217M374N582N447N220N869O469N603L497J466l0j269
56452C03053j803r19N38P05o94j889j637p08j26L85J279J916J657J186J454K074
56436C06471K015J231L28p12k145l176k604q13K51n66k317l307k991k037j190
$$ plain form
56421 288438 287930 288332 290006 292657 295096 296203 296127 295952 296147 295912 294262 291187 287495 284176 282166 282001
56405 282001 283114 284044 283904 283186 282718 282577 282689 283744 286418 290075 293329 295715 297820 299902 301501 302628
56389 302628 304294 307373 311529 315621 318693 320416 321125 321685 322898 324852 327128 329527 332030 334286 336078
56374 336078 338340 342547 348616 354392 357931 359643 361305 363598 365569 366289 366049 365805 366088 366749 367447 368175
56358 368175 369246 370652 371562 371036 369402 368267 368706 370062 371165 372183 374347 378071 382276 385540 387259
56343 387259 387702 387735 388574 391033 394679 398220 400884 403018 405271 407719 409900 411257 411528 411182 411388 412974
56327 412974 415521 418228 421450 426185 431959 436706 439407 441456 444381 447466 449112 449730 451561 455920
56313 455920 462223 469653 478039 486738 494247 499738 504063 508574 513791 519699 526211 532598 537593 541092
$$ packed form
56421B88438n08M02J674K651K439J107p6j75J95k35j650l075l692l319k010j65
56405B82001J113R30j40p18m68j41J12J055K674L657L254K386K105K082J599J127
56389C02628J666L079M156M092L072J723P09N60J213J954K276K399K503K256J792
56374C36078K262M207O069N776L539J712J662K293J971P20k40k44K83O61O98P28
56358C68175J071J406R10n26j634j135M39J356J103J018K164L724M205L264J719
56343C87259M43L3Q39K459L646L541K664K134K253K448K181J357K71l46K06J586
56327D12974K547K707L222M735N774M747K701K049K925L085J646O18J831M359
56313D55920O303P430Q386Q699P509N491M325M511N217N908O512O387M995L499
$$ plain form
56299 541092 544962 550878 557941 563699 567213 569819 573104 577544 583295 590796 599860 609163 617539 625237
56285 625237 633273 641932 650562 658591 666262 674483 684213 695718 708217 720559 732433 744494 757125
56272 757125 769854 782475 796028 811779 829641 848541 868180 889607 914099 942385 975030
56261 975030 1012673 1055571 1103654 1157388 1217868 1285696 1360536 1442370 1532536 1632591 1742405
56250 1742405 1860191 1984337 2114499 2250771 2392380 2537327 2682802 2825665 2962804
56241 2962804 3091266 3208021 3309741 3393256 3456387 3498239 3518800 3518694 3499280 3462489 3410248
56230 3410248 3344388 3267167 3181235 3088648 2990356 2887162 2780874 2673749 2566969 2460487
56220 2460487 2354551 2250604 2150186 2053584 1960322 1870744 1786203 1707541 1634245 1565622 1502282
$$ packed form
56299E41092L870N916P063N758L514K606L285M440N751P501R064R303Q376P698
56285F25237Q036Q659Q630Q029P671Q221R730J1505J2499J2342J1874J2061J2631
56272G57125J2729J2621J3553J5751J7862J8900J9639K1427K4492K8286L2645
56261I75030L7643M2898M8083N3734O0480O7828P4840Q1834R0166J00055J09814
56250A742405J17786J24146J30162J36272J41609J44947J45475J42863J37139
56241B962804J28462J16755J01720Q3515O3131M1852K0561j06j9414l6791n2241
56230C410248o5860p7221q5932r2587r8292j03194j06288j07125j06780j06482
56220B460487j05936j03947j00418r6602r3262q9578q4541p8662p3296o8623o3340
$$ plain form
56209 1502282 1445588 1395695 1350966 1309681 1271709 1238015 1208969 1183926 1162254 1143770 1127926
56198 1127926 1113573 1100220 1088908 1080844 1075426 1070645 1065577 1061513 1060198 1061639 1064188 1066232 1067249
56185 1067249 1067708 1068677 1071235 1075508 1080303 1084304 1087548 1091143 1095735 1101061 1106987 1113940 1122010 1130616
56171 1130616 1139595 1149717 1161254 1172894 1183286 1193288 1205369 1220716 1238136 1256119 1274845
56160 1274845 1295460 1318379 1343298 1370412 1400606 1434532 1472467 1515154 1563960 1619797 1682577
56149 1682577 1752424 1831237 1922435 2028909 2151320 2288110 2436459 2592683 2751794 2907434
56139 2907434 3053005 3183483 3296721 3393654 3477538 3552560 3622089 3687353 3747275 3799302 3840232
56128 3840232 3866825 3876844 3870607 3851500 3824130 3791263 3752067 3702867 3639142 3557228 3455393
$$ packed form
56209A502282n6694m9893m4729m1285l7972l3694k9046k5043k1672j8484j5844
56198A127926j4353j3353j1312q064n418m781n068m064j315J441K549K044J017
56185A067249M59R69K558M273M795M001L244L595M592N326N926O953Q070Q606
56171A130616Q979J0122J1537J1640J0392J0002J2081J5347J7420J7983J8726
56160A274845K0615K2919K4919K7114L0194L3926L7935M2687M8806N5837O2780
56149A682577O9847P8813R1198J06474J22411J36790J48349J56224J59111J55640
56139B907434J45571J30478J13238R6933Q3884P5022O9529O5264N9922N2027M0930
56128C840232K6593J0019o237j9107k7370l2867l9196m9200o3725q1914j01835
$$ plain form
56117 3455393 3334665 3199268 3056124 2913363 2778366 2656153 2548905 2456799 2379220 2315251
56107 2315251 2263541 2222612 2191590 2169988 2156324 2147691 2141643 2138216 2139010 2144233 2151848 2160068 2169563
56094 2169563 2182171 2198089 2215553 2233119 2251131 2270750 2292431 2315745 2340056 2365052 2391139
56083 2391139 2419536 2451303 2485859 2521050 2555180 2588597 2622878 2659074 2697377 2737893 2780703
56072 2780703 2825314 2870962 2917530 2965444 3014503 3063483 3111007 3156366 3199615 3241749 3284826
56061 3284826 3330724 3379075 3427225 3473170 3518111 3565320 3616760 3671662 3728231 3785749 3844728
56050 3844728 3905909 3969804 4036793 4106996 4180035 4255411 4333224 4414153 4498455 4585291 4673465
56039 4673465 4762747 4854014 4947985 5044357 5142534 5242675 5345455 5451169 5559873 5672209
$$ packed form
56117C455393j20728j35397j43144j42761j34997j22213j07248r2106p7579o3969
56107B315251n1710m0929l1022k1602j3664q633o048l427P94N223P615Q220R495
56094B169563J2608J5918J7464J7566J8012J9619K1681K3314K4311K4996K6087
56083B391139K8397L1767L4556L5191L4130L3417L4281L6196L8303M0516M2810
56072B780703M4611M5648M6568M7914M9059M8980M7524M5359M3249M2134M3077
56061C284826M5898M8351M8150M5945M4941M7209N1440N4902N6569N7518N8979
56050C844728O1181O3895O6989P0203P3039P5376P7813Q0929Q4302Q6836Q8174
56039D673465Q9282R1267R3971R6372R8177J00141J02780J05714J08704J12336
$$ plain form
56029 5672209 5789138 5910841 6036879 6167728 6305071 6449886 6601095 6756907 6916881
56020 6916881 7081909 7252819 7430078 7614529 7807253 8008735 8219019 8438560 8668063
56011 8668063 8907533 9156545 9415536 9685919 9968747 10264232 10572733 10895215 11232440
56002 11232440 11584867 11954001 12342855 12754188 13188860 13646624 14127932 14634328 15167710
55993 15167710 15730127 16323882 16951131 17613905 18315344 19060435 19854595 20701914 21605900
55984 21605900 22571635 23605941 24715390 25905529 27182646 28555625 30035852 31636228
55976 31636228 33370764 35254583 37304157 39538575 41981512 44661953 47613224 50872582
55968 50872582 54483011 58495873 62972580 67985886 73622093 79983658 87190954 95383179
$$ packed form
56029E672209J16929J21703J26038J30849J37343J44815J51209J55812J59974
56020F916881J65028J70910J77259J84451J92724K01482K10284K19541K29503
56011H668063K39470K49012K58991K70383K82828K95485L08501L22482L37225
56002A1232440L52427L69134L88854M11333M34672M57764M81308N06396N33382
55993A5167710N62417N93755O27249O62774P01439P45091P94160Q47319R03986
55984B1605900R65735J034306J109449J190139J277117J372979J480227J600376
55976C1636228J734536J883819K049574K234418K442937K680441K951271L259358
55968E0872582L610429M012862M476707N013306N636207O361565P207296Q192225
$$ plain form
55960 95383179 104718916 115375347 127545088 141431629 157245143 175198192 195498082
55953 195498082 218331829 243839702 272073185 302934305 336097353 370921505 406373843
55946 406373843 440994296 472939441 500132623 520521446 532406120 534762914 527463138
55939 527463138 511303139 487824945 458992185 426838158 393190028 359515521 326882849
55932 326882849 295997293 267274404 240917469 216980863 195416513 176108957 158902642
55925 158902642 143621065 130078573 118088797 107472647 98064780 89716304 82294155
55918 82294155 75679750 69768576 64470157 59707085 55412950 51530367 48010062 44810307
55910 44810307 41895586 39234843 36800763 34570050 32522931 30641545 28909202 27311370
$$ packed form
55960I5383179R335737J0656431J2169741J3886541J5813514J7953049K0299890
55953A95498082K2833747K5507873K8233483L0861120L3163048L4824152L5452338
55946D06373843L4620453L1945145K7193182K0388823J1884674K356794p299776
55939E27463138j6159999k3478194k8832760l2154027l3648130l3674507l2632672
55932C26882849l0885556k8722889k6356935k3936606k1564350j9307556j7206315
55925A58902642j5281577j3542492j1989776j0616150r407867q348476p422149
55918H2294155o614405n911174n298419m763072m294135l882583l520305l199755
55910D4810307k914721k660743k434080k230713k047119j881386j732343j597832
$$ plain form
55902 27311370 25836236 24473168 23211148 22039688 20950691 19937905 18994664 18113687
55894 18113687 17289354 16518565 15798399 15123995 14489792 13892131 13329433 12800112 12301425
55885 12301425 11830449 11385322 10965118 10568816 10194495 9839304 9500228 9175225 8863649
55876 8863649 8565441 8280098 8006708 7744857 7494936 7257320 7031356 6815356 6607664
55867 6607664 6407707 6215956 6032856 5858001 5690574 5530226 5376897 5229865 5087772
55858 5087772 4949910 4816906 4689814 4569015 4454247 4344986 4240220 4138406 4038447 3940473
55848 3940473 3845220 3753065 3664142 3578811 3497181 3418596 3342492 3269441 3200366 3134972 3072038
55837 3072038 3011089 2952571 2896288 2841083 2786571 2733942 2684231 2636634 2589474 2542216 2495746
$$ packed form
55902B7311370j475134j363068j262020j171460j088997j012786r43241q80977
55894A8113687q24333p70789p20166o74404o34203n97661n62698n29321m98687
55885A2301425m70976m45127m20204l96302l74321l55191l39076l25003l11576
55876H863649k98208k85343k73390k61851k49921k37616k25964k16000k07692
55867F607664j99957j91751j83100j74855j67427j60348j53329j47032j42093
55858E087772j37862j33004j27092j20799j14768j09261j04766j01814r9959r7974
55848C940473r5253r2155q8923q5331q1630p8585p6104p3051o9075o5394o2934
55837C072038o0949n8518n6283n5205n4512n2629m9711m7597m7160m7258m6470
$$ plain form
55826 2495746 2451120 2408777 2368661 2330300 2292827 2255455 2217919 2180251 2142466 2104890 2068467
55815 2068467 2034333 2003174 1975148 1949899 1926390 1903349 1880438 1858507 1838203 1818966 1800043
55804 1800043 1781825 1765134 1749652 1734192 1718401 1703084 1688881 1675638 1663186 1651628 1640546
55793 1640546 1628946 1616370 1603156 1589010 1572092 1550212 1522539 1489854 1453907 1417154 1382351
55782 1382351 1351282 1323881 1299124 1276657 1257153 1241360 1229234 1219752 1211127 1201663 1191049 1180607
55770 1180607 1171655 1163848 1155720 1146555 1136883 1127265 1117513 1107341 1097082 1087446 1079064 1072312 1066956
55757 1066956 1061809 1055442 1047572 1039102 1030464 1020702 1008771 995019 980518 965364 948588 929535
55745 929535 908390 885365 860461 834400 808896 785327 763680 743354 724484 707621 692344
$$ packed form
55826B495746m4626m2343m0116l8361l7473l7372l7536l7668l7785l7576l6423
55815B068467l4134l1159k8026k5249k3509k3041k2911k1931k0304j9237j8923
55804A800043j8218j6691j5482j5460j5791j5317j4203j3243j2452j1558j1082
55793A640546j1600j2576j3214j4146j6918k1880k7673l2685l5947l6753l4803
55782A382351l1069k7401k4757k2467j9504j5793j2126r482q625r464j0614j0442
55770A180607q952p807q128r165r672r618r752j0172j0259r636q382o752n356
55757A066956n147o367p870q470q638r762j1931j3752j4501j5154j6776j9053
55745I29535k1145k3025k4904k6061k5504k3569k1647k0326j8870j6863j5277
$$ plain form
55734 692344 677297 661953 647535 635539 625806 616817 607680 598815 590484 581702 571438 560289 549878
55721 549878 540786 532181 523511 515276 507605 499350 489674 479658 470991 463653 456424 449403 444228 441388
55707 441388 438972 435051 430094 425954 423416 421874 420590 418884 415606 410026 403202 397089 392108 386813
55693 386813 380204 373066 366555 360713 355252 350815 348367 347872 348512 349792 351564 353313 354509 355644 357969
55678 357969 361931 366504 370267 372575 373417 372780 370718 367813 365112 363485 363184 363970 365532 367781 370687
55663 370687 373779 375983 376246 374453 371667 369338 368282 368265 368382 367839 366519 364896 363381 361855 359947
55648 359947 357707 355792 354851 354749 354481 353029 350422 347845 346450 346133 345922 345652 346714 350778 358057 367312
55632 367312 377239 387254 397034 406084 414055 421033 427163 432216 435804 437808 438350 437542 435593 433059
$$ packed form
55734F92344j5047j5344j4418j1996r733q989r137q865q331q782j0264j1149j0411
55721E49878r092q605q670q235p671q255r676j0016q667p338p229p021n175k840
55707D41388k416l921m957m140k538j542j284j706l278n580o824o113m981n295
55693C86813o609p138o511n842n461m437k448m95O40J280J772J749J196J135K325
55678C57969L962M573L763K308Q42o37k062k905k701j627l01P86J562K249K906
55663C70687L092K204K63j793k786k329j056j7J17n43j320j623j515j526j908
55648C59947k240j915r41j02k68j452k607k577j395l17k11k70J062M064P279R255
55632C67312R927J0015R780R050P971O978O130N053L588K004N42q08j949k534
$$ plain form
55618 433059 430587 428267 425477 421670 417206 413043 409552 406139 402498 399767 399457 400993 401245 397171 388553
55603 388553 377513 365901 354005 341573 328879 316425 304326 292456 280714 268855 256541
55592 256541 243937 231884 221166 211946 204115 197655 192205 186797 180839 175213 171681 171039 172310 173904
55578 173904 175103 176167 177449 178972 180790 183114 185624 186977 185624 181290 175277 169118 163300 157566
55564 157566 151829 146130 140116 133483 126941 121807 118432 115886 113500 111891 111827 112801 113467 113080 111863
55549 111863 110355 109105 108626 108937 109318 109235 109179 109856 110787 110846 110262 110930 114228 119284 124010 127224 129146
55532 129146 130303 130766 130434 129498 128374 127378 126472 125325 123702 121792 119910 117869 115050 111243 107088
55517 107088 103440 100679 98854 98035 98001 97959 97250 96228 95803 96005 95661 93869 91336 89790 90241 92260 94948
$$ packed form
55618D33059k472k320k790l807m464m163l491l413l641k731l10J536K52m074q618
55603C88553j1040j1612j1896j2432j2694j2454j2099j1870j1742j1859j2314
55592B56541j2604j2053j0718r220p831o460n450n408n958n626l532o42J271J594
55578A73904J199J064J282J523J818K324K510J353j353m334o013o159n818n734
55564A57566n737n699o014o633o542n134l375k546k386j609o4R74O66l87j217
55549A11863j508j250m79L11L81q3n6O77R31N9n84O68L298N056M726L214J922
55532A29146J157M63l32r36j124r96r06j147j623j910j882k041k819l807m155
55517A07088l648k761j825q19l4m2p09j022m25K02l44j792k533j546M51K019K688
$$ plain form
55500 94948 98125 102286 107632 113548 119123 123958 128306 132627 137369 142975 149685 157158 164728 172222
55486 172222 180037 188021 194736 198593 199602 199210 198334 196372 192522 187221 181528 175588 168637 160382 151501
55471 151501 142683 133964 125376 117574 111304 106576 102724 99035 95035 90593 86133 82390 79448 76294
55457 76294 71860 66385 61202 57301 54578 52402 50276 47805 44627 40712 36455 32411 29175 27394
55443 27394 27337 28380 29451 30123 30723 31297 31196 29982 28089 26132 24071 21601 18909 16521 14746 13631
55427 13631 13076 12620 11690 10562 10463 12023 14233 15755 16638 17672 18499 17778 15178 11914 9154 7047
55411 7047 5552 4930 4888 4427 3287 2545 2969 3693 3521 2758 2640 3540 4987 7114 10611 15037 18405
55394 18405 19131 17750 16213 15842 16315 16354 15041 12523 9629 6970 4685 3117 3173 5352 8582 10804
$$ packed form
55500I4948L177M161N346N916N575M835M348M321M742N606O710P473P570P494
55486A72222P815P984O715L857J009l92q76j962l850n301n693n940o951q255q881
55471A51501q818q719q588p802o270m728l852l689m000m442m460l743k942l154
55457G6294m434n475n183l901k723k176k126k471l178l915m257m044l236j781
55443B7394n7J043J071O72O00N74j01j214j893j957k061k470k692k388j775j115
55427A3631n55m56r30j128r9J560K210J522Q83J034Q27p21k600l264k760k107
55411G047j495o22m2m61j140p42M24P24j72p63j18R00J447K127L497M426L368
55394A8405P26j381j537l71M73L9j313k518k894k659k285j568N6K179L230K222
$$ plain form
55378 10804 10840 9235 7303 6022 5907 7047 8659 9289 8216 6423 5551 6088 7242 8378 9647 11043
55362 11043 11784 11315 10323 9920 10076 9747 8546 7281 6526 5616 3807 1779 912 1315 1654 1025 -43 -751
55344 -751 -1224 -1888 -2417 -2123 -974 515 2068 3572 4451 4006 2490 1141 907 1580 2258 2223 1335 82 -632
55324 -270 668 1140 785 77 -692 -1769 -2963 -3318 -2411 -1247 -989 -1334 -1235 -910 -1788 -4243 -6682 -7485 -6898
55305 -6898 -6113 -5225 -3245 123 3773 6289 6957 5640 2657 -910 -3704 -5359 -6583 -7548 -7144 -4705
55289 -4705 -1683 -344 -1166 -2634 -3384 -3354 -2851 -1980 -1366 -2048 -3939 -5453 -5379 -4208 -2775 -679 2768 6787
55271 6787 9605 10268 8872 5577 845 -3637 -5883 -5795 -5297 -5964 -7479 -8592 -8479 -6864 -3889 -457 2130
55253 3369 3722 3421 2145 183 -1247 -1557 -1585 -2101 -2498 -1995 -1169 -1061 -1401 -1067 28 748 322 -962 -2519
$$ packed form
55378A0804L6j605j932j281j15J140J612O30j073j793q72N37J154J136J269J396
55362A1043P41m69r92m03J56l29j201j265p55r10j809A779q67M03L39o29d3p08
55344g51m73o64n29K94i74E15J553J504Q79m45j516A141k34O73O78l5q88H2f32
55324b70F68M72l55G7f92j077j194l55R07J164K58l45R9L25q78k455k439q03N87
55305f898P85Q88J980A23L650K516O68j317B657i10k794j655j224r65M04K439
55289d705a683c44q22j468p50L0N03Q71O14o82j891j514P4J171J433f79B768M019
55271F787K818O63j396l295H45c637k246Q8M98o67j515j113J13J615K975d57B130
55253C369L53l01j276A83a247l10k8n16l97N03Q26J08l40L34B8P20C22i62j557
$$ plain form
55234 -2519 -3788 -3927 -2362 63 1530 1235 185 -293 -40 353 673 1129 1704 2022 1751 824 -638 -2424 -4369
55215 -4369 -6350 -7989 -8593 -7921 -6936 -7076 -8540 -9847 -9497 -7640 -5715 -4806 -4854 -5358 -6275 -7900 -10023
55198 -10023 -11578 -11426 -9460 -6618 -3823 -1370 472 1027 2 -1749 -3095 -3902 -4622 -4991 -4306 -2971 -2438
55181 -2438 -3188 -4002 -3839 -3272 -3113 -2586 -211 3879 7719 9596 9377 7778 5356 2601 290 -869 -809 -41
55162 820 1426 1838 2387 3209 3911 3925 3245 2511 2250 2164 1408 -389 -2531 -3797 -3663 -2795 -2262 -2505 -3221 -3898
55142 -3898 -3964 -2799 -371 2178 3505 3740 4280 5578 6228 4930 2437 458 -655 -1915 -3714 -5161 -5467
55125 -5467 -4880 -3928 -2606 -758 1377 3378 4929 5682 5292 3861 1990 208 -1231 -1975 -1545 -41 1634
55107 2647 3113 3808 5186 6895 8122 8256 7331 6004 5205 5790 8292 12462 16904 19822 20686 20818 21862
$$ packed form
55234b519j269j39J565F3J467k95A85b93d0C53L20M56N75L18k71H24f38j786j945
55215d369j981j639o04O72R85j40j464j307L50J857J925R09m8n04r17j625k123
55198a0023j555J52J966K842K795a370D72N55Ba749j346q07p20l69O85J335N33
55181b438p50q14J63N67J59N27b11C879L840J877k19j599k422B601B90h69O0d1
55162H20O06M12N49Q22P02J4o80p34k61q6p56c89k142j266J34Q68N33k43p16o77
55142c898o6J165c71B178J327K35N40J298O50j298B437D58f55j260j799j447l06
55125e467N87R52J322g58A377K001J551P53l90j431j871B08a231p44M30d1A634
55107B647M66O95J378J709J227J34r25j327p99N85K502M170M442K918Q64J32J044
$$ plain form
55090 21862 24078 26642 28999 30970 32043 31839 31121 31081 31627 31603 30749 29967 29335 27532 24037 20393 18210
55073 18210 17076 15755 14404 14125 14998 16016 16581 16738 16261 14811 12872 11290 10045 8634 7490 7618
55057 7618 8734 9232 8317 6927 5984 4916 2720 -241 -2309 -2059 538 3972 6000 5346 3018 1440
55040 2035 4194 6667 8951 10882 11980 12126 12225 13197 14693 15640 15865 16295 17590 19242 20185 19904 18947
55023 18947 18613 19990 22883 25713 26869 26169 24827 24040 23804 23059 20854 17403 13941 11499 10096 9470
55007 9470 10125 12724 16538 19737 21644 23598 26893 30861 33991 35989 37414 37954 36693 34042 31879
54992 31879 31408 32015 32667 33369 34589 36103 37206 37624 37523 36913 35695 34212 33340 33822 35510 37287 37906
54975 37906 37103 35660 34181 32391 30318 29508 31636 35818 38720 38022 34822 31914 30734 30914 31871 33259
$$ packed form
55090B1862K216K564K357J971J073k04p18m0N46k4q54p82o32j803l495l644k183
55073A8210j134j321j351k79Q73J018N65J57m77j450j939j582j245j411j144J28
55057G618J116M98r15j390r43j068k196b41k068K50E38L434K028o54k328A440
55040B035K159K473K284J931J098J46R9R72J496R47K25M30J295J652R43k81r57
55023A8947l34J377K893K830J156p00j342p87k36p45k205l451l462k442j403o26
55007I470O55K599L814L199J907J954L295L968L130J998J425N40j261k651k163
54992C1879m71O07O52P02J220J514J103M18j01o10j218j483q72M82J688J777O19
54975C7906q03j443j479j790k073q10K128M182K902o98l200k908j180J80R57J388
$$ plain form
54959 33259 34192 33619 31884 30859 31993 34869 38012 40462 42144 43332 44398 45696 47074 47714 46988
54944 46988 45432 44325 44279 44760 45207 46161 48830 53776 60473 68143 76696 86760 99102 114100 131471
54929 131471 150285 169349 187632 204069 217082 225009 227396 225387 220287 212207 200736 186460
54917 186460 170828 154768 138612 123510 111444 103141 96954 90739 84139 78067 72647 67007 60996
54904 60996 55895 53065 52642 53777 55489 57009 57961 58682 59997 62430 65966 70740 77406 86390 97112
54889 97112 108510 120221 132764 146540 160997 174931 187275 197292 204157 206899 205135 199613
54877 199613 191564 181526 169309 155203 140561 126796 114277 102722 92169 82889 74722 67345
54865 67345 61109 56714 53949 51515 48374 44683 41307 39055 38541 39896 42166 43694 43705 42958 42360 41625
$$ packed form
54959C3259R33n73j735j025J134K876L143K450J682J188J066J298J378O40p26
54944D6988j556j107m6M81M47R54K669M946O697P670Q553J0064J2342J4998J7371
54929A31471J8814J9064J8283J6437J3013P927K387k009n100q080j1471j4276
54917A86460j5632j6060j6156j5102j2066q303o187o215o600o072n420n640o011
54904F0996n101k830m23J135J712J520R52P21J315K433L536M774O666Q984J0722
54889I7112J1398J1711J2543J3776J4457J3934J2344J0017O865K742j764n522
54877A99613q049j0038j2217j4106j4642j3765j2519j1555j0553r280q167p377
54865F7345o236m395k765k434l141l691l376k252n14J355K270J528J1p47n98p35
$$ plain form
54849 41625 40074 38218 37496 38473 40082 40768 39876 37938 36196 35880 37357 39685 41259 41050 39182 36494
54833 36494 33905 32054 31102 30751 30663 30736 30763 30127 28381 25985 23888 22399 21010 19324 17588 16320 16012
54816 16012 17224 20051 23222 24634 23492 21335 20265 20696 21632 22685 24593 27600 30434 31589 31125
54801 31125 30571 31119 32359 32811 31516 29022 26906 26350 27166 28280 29078 30046 32042 35200 38864 42471
54785 42471 46082 49995 54308 59281 65841 74983 86529 99080 111601 124529 138699 153617 167754
54772 167754 180520 192792 204954 215219 220725 220008 213784 203710 191215 177495 163812 151353
54760 151353 141000 133146 127319 122100 116190 109834 104627 101602 100014 98510 96893 95980 95966 95908 95083
54745 95083 94062 93848 94490 95368 96676 99666 105091 112226 120212 129809 142708 159056 176854 194364
$$ packed form
54849D1625j551j856p22R77J609O86q92j938j742l16J477K328J574k09j868k688
54833C6494k589j851r52l51q8P3K7o36j746k396k097j489j389j686j736j268l08
54816A6012J212K827L171J412j142k157j070M31R36J053J908L007K834J155m64
54801C1125n54N48J240M52j295k494k116n56Q16J114P98R68J996L158L664L607
54785D2471L611L913M313M973O560R142J1546J2551J2521J2928J4170J4918J4137
54772A67754J2766J2272J2162J0265N506p17o224j0074j2495j3720j3683j2459
54760A51353j0353p854n827n219n910o356n207l025j588j504j617r13j4n8q25
54745I5083j021k14O42Q78J308K990N425P135P986R597J2899J6348J7798J7510
$$ plain form
54731 194364 212280 232479 254967 276919 294629 305636 309103 305317 295507 281577 265249 247369
54719 247369 228156 207902 187330 167475 149383 133629 120046 108113 97613 88553 80594 73201
54707 73201 66565 61728 59410 59132 59713 60188 59910 58412 55733 52572 49746 47767 46997 47408 47869 46722
54691 46722 43826 41076 39917 39380 37958 36426 36708 38354 38657 36627 34599 34822 36540 37940 39248
54676 39248 41860 45472 48270 49597 50510 51746 52973 54186 56055 58285 59236 58093 56255 55545 55875
54661 55875 55691 54054 51269 47972 44856 43079 43668 46116 48451 49235 48932 48886 49527 50328 51206 52962 55982
54644 55982 59232 61176 61471 61202 61601 63034 65102 67016 67807 67053 65918 66781 71076 77804 84763 90970
54628 90970 97211 104553 113309 123567 135834 150638 167806 186424 205267 223261 239787 254483
$$ packed form
54731A94364J7916K0199K2488K1952J7710J1007L467l786r810j3930j6328j7880
54719B47369j9213k0254k0572j9855j8092j5754j3583j1933j0500r060p959p393
54707G3201o636m837k318k78N81M75k78j498k679l161k826j979p70M11M61j147
54691D6722k896k750j159n37j422j532K82J646L03k030k028K23J718J400J308
54676C9248K612L612K798J327R13J236J227J213J869K230R51j143j838p10L30
54661E5875j84j637k785l297l116j777N89K448K335P84l03m6O41Q01Q78J756L020
54644E5982L250J944K95k69L99J433K068J914P91p54j135Q63M295O728O959O207
54628I0970O241P342Q756J0258J2267J4804J7168J8618J8843J7994J6526J4696
$$ plain form
54616 254483 266520 274372 276820 274026 266983 256249 242195 226305 210847 196704 182702 167813
54604 167813 153008 139887 128283 116629 104501 93593 85856 81458 78900 76634 74237 72217 70893
54591 70893 69596 67270 63890 60701 58684 57352 55740 54018 53183 53324 53207 51702 48807 45161 41385
54576 41385 38281 36929 37929 40796 44400 47712 49960 50603 49662 47946 46521 45855 45474 44374 41841
54561 41841 38188 34699 32608 32142 32708 33722 34756 35157 34484 33442 33552 35440 38134 40451 42346 44224
54545 44224 45612 45504 43786 41441 39403 38030 37761 39390 43123 47807 51617 53463 53576 52948 52415 52139
54529 52139 51694 50571 48588 45908 42856 39985 38155 38095 39729 42201 44827 47841 52021 57837 65234
54514 65234 74104 84359 95322 105541 113783 120153 125801 131459 136728 140837 143394 143966 141626 135990
$$ packed form
54616B54483J2037P852K448k794p043j0734j4054j5890j5458j4143j4002j4889
54604A67813j4805j3121j1604j1654j2128j0908p737m398k558k266k397k020j324
54591G0893j297k326l380l189k017j332j612j722q35J41j17j505k895l646l776
54576D1385l104j352J000K867L604L312K248O43r41j716j425o66l81j100k533
54561D1841l653l489k091m66N66J014J034M01o73j042J10J888K694K317J895J878
54545D4224J388j08j718k345k038j373k69J629L733M684L810J846J13o28n33k76
54529E2139m45j123j983k680l052k871j830o0J634K472K626L014M180N816P397
54514F5234Q870J0255J0963J0219Q242O370N648N658N269M109K557N72k340n636
$$ plain form
54500 135990 128503 121519 115689 109263 100759 91571 84755 81353 79067 74977 68689 62190 57278 54150
54486 54150 52348 51873 52664 53684 53617 52568 52171 53576 55897 57261 57056 56397 56440 57015 57184 56645 56171 56848
54468 56848 59021 61788 63499 63110 61112 58839 56951 55134 53237 51854 51375 51267 50906 50545 50706 51128
54452 51128 51184 51041 51417 52315 52929 53023 53501 55222 57808 59949 60494 59057 56067 52547 49500 47272 45682
54435 45682 44757 44904 46305 48592 51203 53523 54693 54098 52332 50858 50265 49657 48370 47448 48400 51018
54419 51018 53592 55089 56038 57194 58354 58842 58438 57530 56883 57335 59094 61196 62477 63263 65121 68572
54403 68572 72130 74338 75746 77748 80298 82243 83420 84744 86094 85936 83698 81067 79855 79670 78997
54388 78997 77787 77429 78348 79184 78726 77475 76704 76706 76636 75643 73660 71364 69767 69644 70989 73053 74967
$$ packed form
54500A35990p487o984n830o426q504r188o816l402k286m090o288o499m912l128
54486E4150j802m75P91J020o7j049l97J405K321J364k05o59M3N75J69n39m74O77
54468E6848K173K767J711l89j998k273j888j817j897j383m79j08l61l61J61M22
54452E1128N6j43L76Q98O14R4M78J721K586K141N45j437k990l520l047k228j590
54435D5682r25J47J401K287K611K320J170n95j766j474n93o08j287r22R52K618
54419E1018K574J497R49J156J160M88m04r08o47M52J759K102J281P86J858L451
54403F8572L558K208J408K002K550J945J177J324J350j58k238k631j212j85o73
54388G8997j210l58R19Q36m58j251p71Kp0r93j983k296j597j23J345K064J914
$$ plain form
54371 74967 76179 76375 75499 74003 72599 71514 70382 69091 68222 68286 68992 69646 69929 69900 69778 70161 71858
54354 71858 74715 77170 77935 77871 79060 82077 85294 87081 87536 87490 86903 85228 82786 80791 80176 80944 82464
54337 82464 83720 83516 81211 77386 73336 69856 66950 64625 63242 62760 62150 60189 56917 54001 53344
54322 53344 55253 58056 59730 59834 59493 59462 58887 56564 52981 50258 49960 51625 53623 54823 55128 54986
54306 54986 55013 55819 57587 59794 61628 62603 62642 61871 60757 60074 60102 59913 58227 55163 52489 51817 52963
54289 52963 54388 54759 53685 51478 48882 46843 45928 45980 46675 48033 49822 50936 50433 49179 49341 51795
54273 51795 54953 56616 56233 54735 53032 51632 51185 52144 53881 55114 55407 55593 56567 58237 59842 60815
54257 60815 61159 61354 61905 62599 62318 60173 56803 53959 52767 53088 54536 57032 59914 61525 60594 57661
$$ packed form
54371G4967J212J96q76j496j404j085j132j291q69O4P06O54K83k9j22L83J697
54354G1858K857K455P65o4J189L017L217J787M55m6n87j675k442j995o15P68J520
54337H2464J256k04k305l825m050l480k906k325j383m82o10j961l272k916o57
54322E3344J909K803J674J04l41l1n75k323l583k723k98J665J998J200L05j42
54306E4986K7Q06J768K207J834R75L9p71j114o83K8j89j686l064k674o72J146
54289E2963J425L71j074k207k596k039r15N2O95J358J789J114n03j254J62K454
54273E1795L158J663l83j498j703j400m47R59J737J233K93J86R74J670J605R73
54257F0815L44J95N51O94k81k145l370k844j192L21J448K496K882J611r31k933
$$ plain form
54241 57661 54474 52252 51043 50308 49452 47980 45834 43466 41139 38414 34987 31845 30715 32169 34800
54226 34800 36553 36484 35116 33559 32646 32681 33596 35159 37027 38668 39563 39664 39467 39397 39405 39471 40079 41545 43147
54207 43147 43759 43356 42991 43026 42375 40122 37141 35181 34828 35317 36105 37459 39275 40466 40251 39387 39276
54190 39276 40203 41298 42083 43096 44763 46469 47306 47305 47358 48186 49830 51880 53611 54049 52668 50193 48164
54173 48164 47498 47877 48694 50045 52349 55464 58657 61259 62903 63359 62636 61238 59872 58777 57580 55847
54157 55847 53511 50837 48262 46371 45713 46392 47831 48989 48851 47039 44282 42220 42293 44531 47515 49643
54141 49643 50337 50033 49312 48378 47331 46466 46022 45801 45439 45017 44948 45149 44903 43967 43271 43831 45322 46627
54123 46627 47636 49336 51921 54117 55109 56047 58516 62088 64655 64945 63641 62111 61075 60588 60325 59581
$$ packed form
54241E7661l187k222j209p35q56j472k146k368k327k725l427l142j130J454K631
54226C4800J753o9j368j557r13L5R15J563J868J641Q95J01j97p0QO6O08J466J602
54207D3147O12m03l65L5o51k253k981j960l53M89P88J354J816J191k15q64j11
54190C9276R27J095P85J013J667J706Q37jN3Q28J644K050J731M38j381k475k029
54173D8164o66L79Q17J351K304L115L193K602J644M56p23j398j366j095j197j733
54157E5847k336k674k575j891o58O79J439J158j38j812k757k062P3K238K984K128
54141D9643O94l04p21r34j047q65m44k21l62m22o9K01k46r36o96N60J491J305
54123D6627J009J700K585K196R92R38K469L572K567K90j304j530j036m87k63p44
$$ plain form
54107 59581 57887 55903 54881 54925 54649 53101 51246 50808 52181 54265 56020 57387 58765 60363 62090
54092 62090 63481 63619 61846 58951 57132 58058 60964 63224 63123 61606 60887 61640 62452 62145 61569 62293 64244
54075 64244 65877 66527 67287 69194 71717 73848 75879 78994 83433 88035 91620 93999 95441 95934 95516
54060 95516 94958 95529 97981 102015 106778 111661 116520 121408 126496 132306 139577 148482 158108 167138 175105
54045 175105 182630 190397 198355 206122 213743 221628 229874 237994 245314 251501 256664 261016 264432 266465
54031 266465 267028 266957 267371 268373 268791 267540 264799 261471 257795 253129 247023 239883 232375 224596 216220
54016 216220 207321 198643 190872 183830 176576 168406 159692 151749 145915 142591 140792 138545 134340 128674
54002 128674 123867 121704 121434 120733 118525 115944 114360 113521 112271 110358 108566 107410 106559 105541 104275
$$ packed form
54107E9581j694j984j022M4k76j548j855m38J373K084J755J367J378J598J727
54092F2090J391J38j773k895j819R26K906K260j01j517p19P53Q12l07n76P24J951
54075F4244J633O50P60J907K523K131K031L115M439M602L585K379J442M93m18
54060I5516n58N71K452M034M763M883M859M888N088N810P271Q905R626R030P967
54045A75105P525P767P958P767P621P885Q246Q120P320O187N163M352L416K033
54031B66465N63p1M14J002M18j251k741l328l676m666o106p140p508p779q376
54016B16220q899q678p771p042p254q170q714p943n834l324j799k247m205n666
54002A28674m807k163k70p01k208k581j584q39j250j913j792j156q51j018j266
$$ plain form
53987 104275 102825 101231 99852 99372 100109 101437 102216 101857 100913 100528 101203 102220 102439 101593 100463 99820 99695
53970 99695 99859 100468 101760 103481 105074 106315 107377 108438 109576 110926 112611 114626 116939 119486 121809
53955 121809 123228 123830 124929 127863 132585 138047 143700 149743 155930 161200 165012 168336 172777 179100
53941 179100 187031 196172 206426 217630 229369 241436 254209 268249 283554 299458 315439 331766
53929 331766 348965 366638 383274 397566 409633 420637 431415 441868 451508 460129 467903 474918
53917 474918 480642 483798 483257 479409 474185 469178 464114 457825 450326 442852 435897 428442 419559 409805
53903 409805 400260 390875 380580 368766 355994 343371 331746 321313 311442 300950 289162 276809
53891 276809 265525 256298 248678 241514 234132 226723 220004 214731 211181 208637 205527 200601 194142 187597
$$ packed form
53987A04275j450j594j379m80P37J328P79l59r44l85O75J017K19q46j130o43j25
53970I9695J64O09J292J721J593J241J062J061J138J350J685K015K313K547K323
53955A21809J419O02J099K934M722N462N653O043O187N270L812L324M441O323
53941A79100P931R141J0254J1204J1739J2067J2773J4040J5305J5904J5981J6327
53929C31766J7199J7673J6636J4292J2067J1004J0778J0453R640Q621P774P015
53917D74918N724L156n41l848n224n007n064o289p499p474o955p455q883r754
53903D09805r545r385j0295j1814j2772j2623j1625j0433r871j0492j1788j2353
53891B76809j1284r227p620p164p382p409o719n273l550k544l110m926o459o545
$$ plain form
53877 187597 181809 176093 169465 162375 156419 152452 149905 148142 147501 148311 149649 150118 149483 148571 147671 146069
53861 146069 143347 140205 137535 135250 132491 128712 124365 120930 120288 123332 128748 133676 136084 136236 135620
53846 135620 135033 134331 133607 133623 134892 136965 139009 140787 142658 144542 145337 143777 139972 135707 132839 131579
53830 131579 130701 129260 127535 126396 126420 127847 130724 134651 138819 142821 147137 152458 158729 165273 171693
53815 171693 178233 185290 192883 200635 208214 215882 224621 235350 247681 259668 269137 275246 278677
53802 278677 280563 281574 281943 281883 281624 281073 279626 276617 272030 266610 261103 255665 250180 244645 238696
53787 238696 231272 221815 211791 203874 199259 196625 194049 190894 187200 182490 176399 169882 164525 160830
53773 160830 158159 156058 154531 153148 151076 148192 145180 142290 139000 135273 132094 130193 129027 127795
$$ packed form
53877A87597n788n716o628p090n956l967k547j763o41Q10J338M69o35r12r00j602
53861A46069k722l142k670k285k759l779m347l435o42L044N416M928K408J52o16
53846A35620n87p02p24J6J269K073K044J778J871J884P95j560l805m265k868j260
53830A31579q78j441j725j139K4J427K877L927M168M002M316N321O271O544O420
53815A71693O540P057P593P752P579P668Q739J0729J2331J1987R469O109L431
53802B78677J886J011L69o0k59n51j447l009m587n420n507n438n485n535n949
53787B38696p424r457j0024p917m615k634k576l155l694m710o091o517n357l695
53773A60830k671k101j527j383k072k884l012k890l290l727l179j901j166j232
$$ plain form
53759 127795 126758 126642 127159 127178 126306 125255 124418 122963 119993 116032 112519 109996 107712 105207 103402 103439
53743 103439 104973 106554 107539 108630 110391 112250 113485 114325 115305 116145 116163 115511 115093 115400 116253 117603 119697
53726 119697 122299 124567 125964 126649 126725 125827 123922 121932 120961 121187 121976 122830 123856 125507 128251 132331
53710 132331 137394 142436 146468 149321 151621 154105 157179 160908 164919 168208 169576 168731 166841 165647
53696 165647 165997 167487 169407 171571 174019 176465 178652 180943 183939 187457 190591 192901 194897 197075
53682 197075 199112 200454 201098 201167 200186 197558 193645 189774 187215 186432 186911 187137 185229 180583 174940 171041
53666 171041 170150 171371 173159 174590 175248 175139 175110 176391 179039 181503 182317 181658 180588 179451 177853 175908
53650 175908 174512 174252 174742 175331 176076 177736 180861 185003 188827 191090 191626 191401 191509 192147 192530 191803 190085
$$ packed form
53759A27795j037j16N17J9q72j051q37j455k970l961l513k523k284k505j805L7
53743A03439J534J581R85J091J761J859J235Q40R80Q40J8o52m18L07Q53J350K094
53726A19697K602K268J397O85P6q98j905j990r71K26P89Q54J026J651K744M080
53710A32331N063N042M032K853K300K484L074L729M011L289J368q45j890j194
53696A65647L50J490J920K164K448K446K187K291K996L518L134K310J996K178
53682A97075K037J342O44O9r81k628l913l871k559p83M79K26j908m646n643l899
53666A71041q91J221J788J431O58j09k9J281K648K464Q14o59j070j137j598j945
53650A75908j396k60M90N89P45J660L125M142L824K263N36k25J08O38L83p27j718
$$ plain form
53633 190085 188691 189083 191522 194962 198382 201654 204759 206946 207656 207897 209433 212560 215869 218391 220776
53618 220776 223892 227543 231321 235569 240468 245079 248652 252252 257662 264758 271296 275470 277728 279909
53604 279909 283417 288468 294302 299685 303680 306328 308412 310486 312322 313112 311919 308393 303701 300387
53590 300387 300295 302591 304708 305272 305097 305158 304870 303209 300598 298530 297657 297216 296264 294612 292379 289369 285433
53573 285433 281146 277594 275317 273670 271511 268583 265891 264433 263817 262691 260535 258430 257784 258825 260766
53558 260766 262945 265160 267098 268268 268737 269393 271119 273940 277284 280781 284302 287315 288859 288593 287565
53543 287565 287398 288747 290957 293260 295704 298648 301930 305243 309097 314666 322536 332127 342491 353314
53529 353314 364811 376965 389207 400829 411577 421918 432767 444909 458645 473895 490334
$$ packed form
53633A90085j394L92K439L440L420L272L105K187P10K41J536L127L309K522K385
53618B20776L116L651L778M248M899M611L573L600N410P096O538M174K258K181
53604B79909L508N051N834N383L995K648K084K074J836P90j193l526m692l314
53590C00387r2K296K117N64j75O1k88j661k611k068q73m41r52j652k233l010l936
53573B85433m287l552k277j647k159k928k692j458o16j126k156k105o46J041J941
53558B60766K179K215J938J170M69O56J726K821L344L497L521L013J544k66j028
53543B87565j67J349K210K303K444K944L282L313L854N569P870R591J0364J0823
53529C53314J1497J2154J2242J1622J0748J0341J0849J2142J3736J5250J6439
$$ plain form
53518 490334 507207 523521 539048 555065 573348 594311 616675 639096 661453 684338 708162
53507 708162 733390 760889 790961 822181 852173 879711 905473 930623 955375 979202 1001903
53496 1001903 1023962 1046080 1068705 1091865 1115236 1138454 1161450 1184293 1206709 1228205 1248973
53485 1248973 1270292 1293425 1318113 1342548 1364990 1385181 1404206 1423307 1442992 1462920 1482179
53474 1482179 1499643 1514417 1526193 1535189 1541706 1545756 1547037 1545079 1539393 1529746 1516592 1501134 1484677
53461 1484677 1467827 1450562 1433074 1416153 1400398 1385343 1369884 1353484 1336360 1318407 1298766
53450 1298766 1277099 1254698 1233360 1213282 1193170 1172578 1152891 1135182 1118123 1099495 1079381
53439 1079381 1060367 1044464 1031318 1019981 1010993 1005477 1003102 1002402 1002712 1004436 1007517 1011034 1014629
$$ packed form
53518D90334J6873J6314J5527J6017J8283K0963K2364K2421K2357K2885K3824
53507G08162K5228K7499L0072L1220K9992K7538K5762K5150K4752K3827K2701
53496A001903K2059K2118K2625K3160K3371K3218K2996K2843K2416K1496K0768
53485A248973K1319K3133K4688K4435K2442K0191J9025J9101J9685J9928J9259
53474A482179J7464J4774J1776Q996O517M050J281j958n686r647j3154j5458j6457
53461A484677j6850j7265j7488j6921j5755j5055j5459j6400j7124j7953j9641
53450A298766k1667k2401k1338k0078k0112k0592j9687j7709j7059j8628k0114
53439A079381j9014j5903j3146j1337q988n516k375p00L10J724L081L517L595
$$ plain form
53426 1014629 1019094 1025053 1032115 1039964 1049292 1060734 1073666 1087159 1101712 1118819 1138937 1160870
53414 1160870 1183380 1206479 1230906 1257162 1285554 1316514 1350194 1385867 1422191 1458180 1493963
53403 1493963 1530933 1571141 1616016 1665318 1717485 1771137 1825900 1881810 1938604 1996035 2054339
53392 2054339 2113852 2174439 2235696 2297230 2358223 2417387 2474361 2530762 2588604 2647585 2705005
53381 2705005 2758566 2808110 2854193 2896365 2933908 2967255 2997181 3022877 3042282 3054571 3061342
53370 3061342 3064928 3066146 3063918 3056416 3042276 3021177 2993637 2960150 2920519 2874354 2822110 2765161
53358 2765161 2704896 2642365 2578710 2515137 2452204 2389898 2328717 2269887 2213998 2160094 2106793
53347 2106793 2053912 2002515 1953790 1908247 1865357 1823400 1780276 1735283 1689717 1645208 1602163
$$ packed form
53426A014629M465N959P062P849R328J1442J2932J3493J4553J7107K0118K1933
53414A160870K2510K3099K4427K6256K8392L0960L3680L5673L6324L5989L5783
53403A493963L6970M0208M4875M9302N2167N3652N4763N5910N6794N7431N8304
53392B054339N9513O0587O1257O1534O0993N9164N6974N6401N7842N8981N7420
53381B705005N3561M9544M6083M2172L7543L3347K9926K5696J9405J2289O771
53370C061342L586J218k228p502j4140k1099k7540l3487l9631m6165n2244n6949
53358B765161o0265o2531o3655o3573o2933o2306o1181n8830n5889n3904n3301
53347B106793n2881n1397m8725m5543m2890m1957m3124m4993m5566m4509m3045
$$ plain form
53336 1602163 1560701 1522099 1487729 1456897 1427508 1399096 1373541 1352266 1334172 1317218 1300827
53325 1300827 1285538 1271196 1256770 1241680 1226264 1211145 1196908 1184106 1172682 1161562 1149651
53314 1149651 1137240 1125737 1116145 1108566 1103028 1099823 1098835 1099404 1101239 1104770 1110279 1117297 1125378 1134893
53300 1134893 1146506 1160185 1175303 1191523 1209138 1228692 1250588 1274897 1301120 1328328 1355993
53289 1355993 1384614 1414989 1446795 1478367 1508070 1535557 1561522 1586541 1610519 1632963 1653282
53278 1653282 1670714 1684383 1693791 1699199 1701306 1700481 1696507 1689230 1679281 1667791 1655239 1640911 1623897
53265 1623897 1604484 1584007 1563120 1540811 1515629 1487642 1458498 1429489 1400290 1369929 1338405
53254 1338405 1306637 1275107 1243364 1210983 1178320 1146026 1114390 1083688 1054752 1028425 1004407
$$ packed form
53336A602163m1462l8602l4370l0832k9389k8412k5555k1275j8094j6954j6391
53325A300827j5289j4342j4426j5090j5416j5119j4237j2802j1424j1120j1911
53314A149651j2411j1503r592p579n538l205r88N69J835L531N509P018Q081R515
53300A134893J1613J3679J5118J6220J7615J9554K1896K4309K6223K7208K7665
53289A355993K8621L0375L1806L1572K9703K7487K5965K5019K3978K2444K0319
53278A653282J7432J3669R408N408K107q25l974p277r949j1490j2552j4328j7014
53265A623897j9413k0477k0887k2309k5182k7987k9144k9009k9199l0361l1524
53254A338405l1768l1530l1743l2381l2663l2294l1636l0702k8936k6327k4018
$$ plain form
53243 1004407 981171 957204 932027 906062 880117 855204 832219 811118 790674 769670 748262
53232 748262 727644 708488 690525 673875 659765 649120 640904 632777 623368 613143 603028 593096
53220 593096 583026 573054 563584 554024 542761 528649 512344 496006 481690 469829 459143 447972
53208 447972 435762 423248 411413 400532 390198 379847 369181 358502 348766 340857 334519 328471
53196 328471 321894 315332 309633 304492 298689 291548 283614 276149 270449 267231 265932 264840 262737 260119
53182 260119 257988 255887 252538 248362 245640 245532 246408 246296 245862 247476 251837 256948 260449 261864 262320
53167 262320 262957 264056 265295 266448 267741 269419 271072 271955 272286 273480 276441 280135 282679 283429 283133
53152 283133 282442 281495 280893 281796 284575 288224 291431 293507 294042 292713 290055 287599 286510 286570 287078 288065
$$ packed form
53243A004407k3236k3967k5177k5965k5945k4913k2985k1101k0444k1004k1408
53232G48262k0618j9156j7963j6650j4110j0645q216q127r409j0225j0115r932
53220E93096j0070r972r470r560j1263j4112j6305j6338j4316j1861j0686j1171
53208D47972j2210j2514j1835j0881j0334j0351j0666j0679r736p909o338o048
53196C28471o577o562n699n141n803p141p934p465n700l218j299j092k103k618
53182B60119k131k101l349m176k722j08Q76j12m34J614M361N111L501J415M56
53167B62320O37J099J239J153J293J678J653Q83L31J194K961L694K544P50k96
53152B83133o91r47o02R03K779L649L207K076N35j329k658k456j089O0N08R87
$$ plain form
53136 288065 289835 291813 292843 292466 291153 289373 287267 285320 284587 285750 288239 290509 291115 289620 286801
53121 286801 283871 281148 277594 272138 265405 259418 255385 252475 249153 245150 241362 238226 235171 231763
53107 231763 228499 225971 223843 221303 218213 215097 212141 209029 205918 203698 202667 201563 198822 194669
53093 194669 191082 189464 189041 187906 185192 181712 178891 177606 177852 178869 179549 179177 177950 176471 174758
53078 174758 172302 169259 166899 166315 166993 167460 167234 167352 168631 170143 170043 167594 163754 160016 157373 156355
53062 156355 157110 158958 160425 160315 158629 156152 153529 151107 149302 148421 148190 147890 146951 145145 142528 139774
53046 139774 138266 138897 140657 141219 139372 136339 134354 134485 136187 138251 139561 139457 138373 137909 139269
53031 139269 141473 142016 139770 136605 135506 137468 140896 143827 145816 147430 148811 149598 149923 150445 151119
$$ packed form
53136B88065J770J978J030l77j313j780k106j947p33J163K489K270O06j495k819
53121B86801k930k723l554n456o733n987m033k910l322m003l788l136l055l408
53107B31763l264k528k128k540l090l116k956l112l111k220j031j104k741m153
53093A94669l587j618m23j135k714l480k821j285K46J017O80l72j227j479j713
53078A74758k456l043k360n84O78M67k26J18J279J512j00k449l840l738k643j018
53062A56355P55J848J467j10j686k477k623k422j805q81k31l00r39j806k617k754
53046A39774j508O31J760N62j847l033j985J31J702K064J310j04j084m64J360
53031A39269K204N43k246l165j099J962L428K931J989J614J381P87L25N22O74
$$ plain form
53016 151119 150756 148490 145310 143398 143984 146333 148822 150372 150827 150635 150661 151814 154337 157583 160820 164016
53000 164016 167457 170787 172991 173496 172939 172595 173182 174484 176131 178390 181830 186263 190480 193359 194891
52985 194891 195713 196031 195707 195250 195793 197692 199814 200735 200182 198905 197569 196315 195100 193876 192442 190521
52969 190521 188026 185152 182380 180441 179860 180372 181175 181942 182968 184016 183826 181518 178010 175153 173757
52954 173757 173182 172594 171791 170936 170366 170697 172391 175098 177963 180472 182453 183499 183218 182003 180849 180431
52938 180431 180924 182303 183899 184127 182100 179335 178289 179071 179290 177469 174768 172519 170131 166878 164035
52923 164035 163263 163926 164043 163191 162492 162191 161501 160847 162070 165718 169865 172363 172916 172180 170291 167400 164661
52906 164661 163391 163609 164159 163838 161899 158243 154074 151771 152973 156861 161076 164190 166487 168527 169979
$$ packed form
53016A51119l63k266l180j912N86K349K489J550M55j92K6J153K523L246L237L196
53000A64016L441L330K204N05n57l44N87J302J647K259L440M433M217K879J532
52985A94891Q22L18l24m57N43J899K122R21n53j277j336j254j215j224j434j921
52969A90521k495k874k772j939n81N12Q03P67J026J048j90k308l508k857j396
52954A73757n75n88q03q55n70L31J694K707K865K509J981J046k81j215j154m18
52938A80431M93J379J596K28k027k765j046P82K19j821k701k249k388l253k843
52923A64035p72O63J17q52o99l01o90o54J223L648M147K498N53p36j889k891k739
52906A64661j270K18N50l21j939l656m169k303J202L888M215L114K297K040J452
$$ plain form
52891 169979 170159 168991 166965 164556 162094 159912 158199 156694 154922 152887 151305 150967 151921 153515 155170
52876 155170 156706 157900 158353 158252 158691 160467 162863 164488 165231 166357 168507 170645 171444 170792 169212 166595
52860 166595 162499 157332 152283 148170 145048 142825 141555 141003 140568 139855 138986 138277 137946 138192 139203 140911
52844 140911 142914 144815 146628 148903 152324 156941 161783 165574 167925 169476 170765 171597 171847 172169 173215
52829 173215 174477 174597 172704 169020 164489 160297 157278 155047 152031 147186 141495 136974 134442 133146
52815 133146 132216 131242 129441 125794 120629 115946 113392 112646 112349 111725 110494 108164 104677 101386 100192
52800 100192 101663 104698 107923 110609 112394 113193 113763 115446 118680 122136 123959 123716 122580 121669 120872
52785 120872 119632 118313 117894 118287 117869 115349 111613 108977 108792 110513 112844 114872 115974 115606 113717
$$ packed form
52891A69979J80j168k026k409k462k182j713j505j772k035j582l38R54J594J655
52876A55170J536J194M53j01M39J776K396J625P43J126K150K138P99o52j580k617
52860A66595m096n167n049m113l122k223j270n52m35p13q69p09l31K46J011J708
52844A40911K003J901J813K275L421M617M842L791K351J551J289Q32K50L22J046
52829A73215J262J20j893l684m531m192l019k231l016m845n691m521k532j296
52815A33146r30r74j801l647n165m683k554p46k97o24j231k330l487l291j194
52800A00192J471L035L225K686J785P99N70J683L234L456J823k43j136r11p97
52785A20872j240j319m19L93m18k520l736k636j85J721K331K028J102l68j889
$$ plain form
52770 113717 110830 107475 104188 102121 102525 105068 107703 109082 110227 112745 116153 118430 118862 118831 119572
52755 119572 120478 120147 118255 115855 114381 114707 116590 118636 119259 118021 115830 113737 112068 110823 110219
52740 110219 110456 111388 112838 114854 117373 119935 122085 123751 124970 125522 125283 124657 124294 124376 124455 123991 123007
52723 123007 122378 123501 127292 133215 139429 144121 146730 147908 148588 149227 149772 150143 150645 151816 153739 155770
52707 155770 157220 158025 158325 157694 155686 153106 151711 152219 153384 153677 153173 153057 153754 154518 154704 154603 154860
52690 154860 155614 156355 156283 154836 152301 149865 148640 148637 149006 149146 149121 149112 149133 149371 150165 151348 152083 151712 150418
52671 150418 148852 147545 147059 148137 150960 154358 156472 156482 155308 154459 154494 154733 154123 152151 149243 146693
52655 146693 145926 147205 149018 149237 147151 143998 141304 139161 136594 133260 130113 128362 128351 129611 131470
$$ packed form
52770A13717k887l355l287k067M04K543K635J379J145K518L408K277M32l1P41
52755A19572R06l31j892k400j474L26J883K046O23j238k191k093j669j245o04
52740A10219K37R32J450K016K519K562K150J666J219N52k39o26l63Q2P9m64r84
52723A23007o29J123L791N923O214M692K609J178O80O39N45L71N02J171J923K031
52707A55770J450Q05L00o31k008k580j395N08J165K93n04j16O97P64J86j01K57
52690A54860P54P41p2j447k535k436j225lL69J40k5rK1K38P94J183P35l71j294
52671A50418j566j307m86J078K823L398K114J0j174q49L5K39o10j972k908k550
52655A46693p67J279J813K19k086l153k694k143k567l334l147j751j1J260J859
$$ plain form
52640 131470 133311 134550 134866 134493 134084 134191 134832 135428 135185 133762 131681 129989 129424 129929 130884 131563 131498
52623 131498 130696 129630 128810 128379 128378 129292 131815 135908 140533 144598 147871 150750 153359 155131 155215 153296
52607 153296 150302 148206 148550 150946 153359 154024 152777 150625 148879 148838 151153 154630 156520 155196 152319
52592 152319 151268 153385 156640 158097 156960 155006 154607 156621 159851 162346 163336 163740 164754 166475 168299
52577 168299 169939 171185 171318 170129 169322 171338 176396 181914 185397 186819 187575 188280 188669 188782 188978 189113
52561 189113 188781 188268 188361 189195 189972 189868 188688 186700 184419 182532 181424 180658 179370 177258 174772 172355
52545 172355 170000 167688 165769 164583 163982 163441 162557 161301 159926 158720 157764 156857 155685 154001 151684
52530 151684 148889 146275 144838 145061 146212 146695 145255 141862 137663 134262 132848 133500 135090 135953 134943
$$ packed form
52640A31470J841J239L16l73m09J07O41N96k43j423k081j692n65N05R55O79o5
52623A31498q02j066q20m31jR14K523M093M625M065L273K879K609J772Q4j919
52607A53296k994k096L44K396K413O65j247k152j746m1K315L477J890j324k877
52592A52319j051K117L255J457j137j954l99K014L230K495R90M04J014J721J824
52577A68299J640J246J33j189q07K016N058N518L483J422P56P05L89J13J96J35
52561A89113l32n13R3Q34P77j04j180j988k281j887j108p66j288k112k486k417
52545A72355k355k312j919j186o01n41q84j256j375j206r56r07j172j684k317
52530A51684k795k614j437K23J151M83j440l393m199l401j414O52J590Q63j010
$$ plain form
52515 134943 132124 128687 126115 125193 125709 127074 128878 130551 130928 129190 126284 124394 124479 125141 124605 123053
52499 123053 122100 122522 123532 124067 123772 122858 121938 121959 123387 125384 126599 126737 126485 125995 124666 122588 120956
52482 120956 120534 120787 121142 122024 123841 125830 126905 127024 126865 126679 126355 126118 126225 126277 125769 125024 124800 125199
52464 125199 125777 126434 127411 128678 130110 131921 133972 135113 134459 133101 133134 134884 136469 136414 135307 134441
52448 134441 134175 134426 135473 137198 138430 138256 137493 137804 139690 142158 144051 144910 144872 144528 144632 145213 145268
52431 145268 144048 142304 141483 141979 143009 143956 144876 145885 147062 148942 151979 155302 157065 156459 154523
52416 154523 152559 150593 148125 145712 144849 146373 149595 153116 156133 158778 161302 163131 163125 160999 158121
52401 158121 156331 156162 156843 157949 160154 164051 168929 173197 175722 176630 177232 179235 183447 188953 194035
$$ packed form
52515A34943k819l437k572r22N16J365J804J673L77j738k906j890Q5O62n36j552
52499A23053r53M22J010N35k95r14r20K1J428J997J215J38k52m90j329k078j632
52482A20956m22K53L55Q82J817J989J075J19j59j86l24k37J07N2n08p45k24L99
52464A25199N78O57R77J267J432J811K051J141o54j358L3J750J585n5j107q66
52448A34441k66K51J047J725J232j74p63L11J886K468J893Q59l8l44J04N81N5
52431A45268j220j744q21M96J030R47R20J009J177J880L037L323J763o06j936
52416A54523j964j966k468k413q63J524L222L521L017K645K524J829ok126k878
52401A58121j790j69O81J106K205L897M878M268K525R08O02K003M212N506N082
$$ plain form
52386 194035 197878 200818 202970 203846 203718 204094 205912 208211 209720 210957 213275 216235 217702 216834 215567
52371 215567 216310 219107 221939 223243 223292 223302 223976 225042 225751 225623 224974 224896 226546 230252 235356 241054 247283
52354 247283 254438 262251 269564 275614 281058 287011 293461 299596 305612 312928 322186 332322 342568 354401
52340 354401 370080 389476 409591 427458 442847 458008 475464 496219 519452 543407 566634
52329 566634 588689 610015 631513 654057 677698 701214 723204 743862 764547 785124 803192
52318 803192 817101 828431 839706 850592 858605 863232 866837 871125 875061 877167 877776 877532 875434 870293
52304 870293 863165 856464 851098 845976 840081 833519 826504 818754 810383 802514 796494 792936 791734 792576
52290 792576 795198 799364 804856 811487 819264 828592 840075 853969 869934 887314 905258 922610 938339
$$ packed form
52386A94035L843K940K152Q76j28L76J818K299J509J237K318K960J467q68j267
52371B15567P43K797K832J304M9J0O74J066P09j28o49p8J650L706N104N698O229
52354B47283P155P813P313O050N444N953O450O135O016P316R258J0136J0246J1833
52340C54401J5679J9396K0115J7867J5389J5161J7456K0755K3233K3955K3227
52329E66634K2055K1326K1498K2544K3641K3516K1990K0658K0685K0577J8068
52318H03192J3909J1330J1275J0886Q013M627L605M288L936K106O09k44k098n141
52304H70293p128o701n366n122n895o562p015p750q371p869o020l558j202Q42
52290G92576K622M166N492O631P777R328J1483J3894J5965J7380J7944J7352J5729
$$ plain form
52277 938339 952396 965729 979259 993254 1007596 1021788 1034576 1044644 1052307 1059473 1067252 1074540
$$ packed form
52277I38339J4057J3333J3530J3995J4342J4192J2788J0068P663P166P779P288
$$ [...]
##END NTUPLES=NMR SPECTRUM
##END=
