##TITLE=NES1006_50530289_9232656_fRCv0EkKs0
##JCAMPDX= 6.0         $$ Bruker NMR JCAMP-DX V2.0
##DATA TYPE= NMR SPECTRUM
##DATA CLASS= NTUPLES
##ORIGIN= BRUKER
##OWNER= Administrator
$$ 1.72 TOPSPIN		Version 2.1
$$ 2015-08-24 16:14:35.670 -0700  Administrator@X
$$ Compression mode = diff/dup
##.OBSERVE FREQUENCY= 400.02188249412
##.OBSERVE NUCLEUS= ^1H
##.ACQUISITION MODE= SIMULTANEOUS (DQD)
##.ACQUISITION SCHEME= undefined
##.AVERAGES= 8
##.DIGITISER RES= 22
##SPECTROMETER/DATA SYSTEM= spect
##.PULSE SEQUENCE= zg30
##.SOLVENT NAME= COFFEE_meoh
##.SHIFT REFERENCE= INTERNAL, COFFEE_meoh, 1, 14.98509
##AUDIT TRAIL= $$ (NUMBER, WHEN, WHO, WHERE, PROCESS, VERSION, WHAT)
$$ ##TITLE= Audit trail, TOPSPIN		Version 2.1
$$ ##JCAMPDX= 5.01
$$ ##ORIGIN= Bruker BioSpin GmbH
$$ ##OWNER= Administrator
$$ $$ E:\/data/COFFEE/nmr/NES1006_50530289_9232656_fRCv0EkKs0/20/pdata/1/auditp.txt
$$ ##AUDIT TRAIL=  $$ (NUMBER, WHEN, WHO, WHERE, PROCESS, VERSION, WHAT)
(   1,<2015-08-24 16:14:28.342 -0700>,<Administrator>,<X>,<go>,<TOPSPIN 2.1>,
      <created by zg
	started at 2015-08-24 16:13:22.342 -0700,
	POWCHK enabled, PULCHK disabled,
       configuration hash MD5:
       21 0F 79 D6 B3 7B B4 F6 88 20 88 DB 03 48 BD 9F
       data hash MD5: 64K
       68 C7 37 1A 47 0C BC 8B F0 D5 3E 52 E0 63 85 33>)
(   2,<2015-08-24 16:14:31.545 -0700>,<Administrator>,<X>,<proc1d>,<TOPSPIN 2.1>,
      <Start of raw data processing
       efp LB = 0 FT_mod = 6 PKNL = 1 PHC0 = 0 PHC1 = 0 SI = 32K 
       data hash MD5: 32K
       93 5A 8E B0 AC D5 72 C3 52 74 8A 01 C4 73 B2 EA>)
(   3,<2015-08-24 16:14:31.826 -0700>,<Administrator>,<X>,<proc1d>,<TOPSPIN 2.1>,
      <pk PHC0 = 90.46692 PHC1 = 0 
       data hash MD5: 32K
       8B D1 E3 3E FF 07 70 2C FD 84 A9 79 BF DD 1E 67>)
(   4,<2015-08-24 16:14:31.936 -0700>,<Administrator>,<X>,<proc1d>,<TOPSPIN 2.1>,
      <abs ABSG = 1 
       data hash MD5: 32K
       8C 2E B7 63 CD 1E B5 E0 AB B0 09 45 1F 79 12 84>)
(   5,<2015-08-24 16:14:32.014 -0700>,<Administrator>,<X>,<proc1d>,<TOPSPIN 2.1>,
      <abs ABSG = 2 
       data hash MD5: 32K
       01 DC 43 25 79 DB B1 1B A6 79 88 25 2F 4E 5B AC>)
(   6,<2015-08-24 16:14:32.076 -0700>,<Administrator>,<X>,<proc1d>,<TOPSPIN 2.1>,
      <abs ABSG = 3 
       data hash MD5: 32K
       00 FC E6 3D 58 8C 78 76 F8 11 EF AD DE 27 3B 89>)
(   7,<2015-08-24 16:14:32.139 -0700>,<Administrator>,<X>,<proc1d>,<TOPSPIN 2.1>,
      <abs ABSG = 4 
       data hash MD5: 32K
       35 75 B2 AA B2 E9 5C 3A 70 D3 E4 7A 9F E5 71 5F>)
(   8,<2015-08-24 16:14:32.186 -0700>,<Administrator>,<X>,<proc1d>,<TOPSPIN 2.1>,
      <abs ABSG = 5 
       data hash MD5: 32K
       C4 BA 66 76 AE DE 50 94 F5 06 ED DC 95 EB 6E 96>)
$$ ##END=
$$ 
$$ $$ hash MD5
$$ $$ 30 2B B1 68 35 63 46 B2 B2 B6 57 23 0A C9 BA 84
##$RELAX= 
##$RELAX= 
##$RELAX= 
##$RELAX= 
##$RELAX= 
##$RELAX= 
##$RELAX= 
$$ Bruker specific parameters
$$ --------------------------
##$DU= <E:\>
##$EXPNO= 20
##$NAME= <NES1006_50530289_9232656_fRCv0EkKs0>
$$ [...]
150 150 150 150 150 150 150 150
##$TP07= 0
##$TPNAME0= <>
##$TPNAME1= <>
##$TPNAME2= <>
##$TPNAME3= <>
##$TPNAME4= <>
##$TPNAME5= <>
##$TPNAME6= <>
##$TPNAME7= <>
##$TPOAL= (0..7)
0.5 0.5 0.5 0.5 0.5 0.5 0.5 0.5
##$TPOFFS= (0..7)
0 0 0 0 0 0 0 0
##$TUNHIN= 0
##$TUNHOUT= 0
##$TUNXOUT= 0
##$USERA1= <user>
##$USERA2= <user>
##$USERA3= <user>
##$USERA4= <user>
##$USERA5= <user>
##$V9= 5
##$VALIST= <valist>
##$VCLIST= <CCCCCCCCCCCCCCC>
##$VD= 0
##$VDLIST= <DDDDDDDDDDDDDDD>
##$VPLIST= <PPPPPPPPPPPPPPP>
##$VTLIST= <TTTTTTTTTTTTTTT>
##$WBST= 2048
##$WBSW= 25
##$XGAIN= (0..3)
0 0 0 0
##$XL= 0
##$YL= 0
##$YMAX_a= 550515
##$YMIN_a= -472480
##$ZGOPTNS= <>
##$ZL1= 120
##$ZL2= 120
##$ZL3= 120
##$ZL4= 120
##$ABSF1= 14.98509
##$ABSF2= -5.573092
##$ABSG= 5
##$ABSL= 3
##$ALPHA= 0
##$AQORDER= 0
##$ASSFAC= 0
##$ASSFACI= 0
##$ASSFACX= 0
##$ASSWID= 0
##$AUNMP= <proc_prof1d_extract_pilot.lims>
##$AXLEFT= 0
##$AXNAME= <>
##$AXNUC= <1H>
##$AXRIGHT= 0
##$AXTYPE= 0
##$AXUNIT= <>
##$AZFE= 0.1
##$AZFW= 0.1
##$BCFW= 0
##$BC_mod= 0
##$BYTORDP= 0
##$COROFFS= 0
##$CY= 15
##$DATMOD= 1
##$DC= 0
##$DFILT= <>
##$DTYPP= 0
##$F1P= 0
##$F2P= 0
##$FCOR= 0.5
##$FTSIZE= 32768
##$FT_mod= 6
##$GAMMA= 0
##$GB= 0
##$INTBC= 1
##$INTSCL= 1
##$ISEN= 128
##$LB= 0
##$LEV0= 0
##$LPBIN= 0
##$MAXI= 10000
##$MC2= 0
##$MEAN= 0
##$ME_mod= 0
##$MI= 0
##$NCOEF= 0
##$NC_proc= -8
##$NLEV= 6
##$NOISF1= 0
##$NOISF2= 0
##$NSP= 0
##$NTH_PI= 0
##$NZP= 0
##$OFFSET= 14.98509
##$PC= 1
##$PHC0= 90.46692
##$PHC1= 0
##$PH_mod= 1
##$PKNL= yes
##$PPARMOD= 0
##$PPDIAG= 0
##$PPIPTYP= 0
##$PPMPNUM= 2147483647
##$PPRESOL= 1
##$PSCAL= 4
##$PSIGN= 0
##$PYNMP= <proc.py>
##$REVERSE= no
##$SF= 400.02
##$SI= 32768
##$SIGF1= 0
##$SIGF2= 0
##$SINO= 400
##$SIOLD= 32768
##$SPECTYP= <>
##$SREGLST= <1H.CDCl3>
##$SSB= 0
##$STSI= 32768
##$STSR= 0
##$SW_p= 8223.68421052631
##$SYMM= 0
##$S_DEV= 0
##$TDeff= 65536
##$TDoff= 0
##$TI= <>
##$TILT= no
##$TM1= 0
##$TM2= 0
##$TOPLEV= 0
##$USERP1= <user>
##$USERP2= <user>
##$USERP3= <user>
##$USERP4= <user>
##$USERP5= <user>
##$WDW= 1
##$XDIM= 32768
##$YMAX_p= 418671948
##$YMIN_p= -649381
##$CURPLOT= <Network HP LaserJet P1505>
##$CURPRIN= <$Network HP LaserJet P1505>
##$DFORMAT= <normdp>
##$LAYOUT= <+/1D_H.xwp>
##$LFORMAT= <normlp>
##$PFORMAT= <normpl>
##$SURQMSG= 1
$$ End of Bruker specific parameters
$$ ---------------------------------
##NTUPLES= NMR SPECTRUM
##VAR_NAME=  FREQUENCY,     SPECTRUM/REAL,   SPECTRUM/IMAG
##SYMBOL=    X,             R,               I
##VAR_TYPE=  INDEPENDENT,   DEPENDENT,       DEPENDENT
##VAR_FORM=  AFFN,          ASDF,            ASDF
##VAR_DIM=   32768,         32768,           32768
##UNITS=     HZ,            ARBITRARY UNITS, ARBITRARY UNITS
##FACTOR=    0.250966925370066, 1,           1
##FIRST=     8223.43324360094, -150488,      105815
##LAST=      0,             114886,          -88534
##MIN=       0,             -649381,         0
##MAX=       8223.43324360094, 418671948,    0
$$ Real data points
##PAGE= N=1
##DATA TABLE= (X++(R..R)), XYDATA
$$ [...]
19548A9172c14723P4801a2003o0555A5640O6860j9503c00089B02160i6682M12
19537i6270E4649a64695A13888a14602B78201b84054A33252a40428O6853r2917
19527a66492a683p995J377A18738a4383j77324A29097E9894B0960q990L1197O7974
19515A11141a99923d2596A7586R4969a59288A2981J74806c55881G489h0854j83763
19504b64617A65357j7095a87395D7719a69954I8364m7964J74606C3663j6402J03012
19493A20273b10653g8877g192A06231c65904h5r9834p0485A02255c51344a26750
19481e8710H001i9995r2602P4465A2414a19274K2126A74757a12881I3594b65171
19469i3311l838M5212l9185b4284j31526I4353j9637d3470j94836B94176i9128
$$ plain form
19548 19172 -314723 -239922 -12003 -72558 15640 82500 62997 -300089 202160 -96682 -96270
19537 -96270 54649 -164695 113888 -114602 278201 -284054 133252 -140428 -73575 -166492
19527 -166492 -1683 -9678 -8301 118738 -14383 -191707 129097 59894 20960 11970 43167 111141
19515 111141 -199923 -42596 17586 112555 -159288 12981 187787 -355881 7489 -80854 -264617
19504 -264617 165357 148262 -187395 47719 -169954 98364 50400 225006 33663 17261 120273
19493 120273 -210653 -78877 -7192 106231 -365904 -85 -99919 -170404 102255 -351344 -126750
19481 -58710 8001 -99995 -192597 -118132 12414 -119274 -97148 174757 -112881 93594 -265171
19469 -93311 -97149 -51937 -91122 -24284 -155810 94353 74716 -43470 -238306 294176 -99128
19457e990l94220J38125M983b6365B8088i2549A25528A212f2336A85540i1536
19445E5405p304L9926a0296A79690i0088A35077a34772j30227A77609c04637C2036
19433b51156d7147C57277A59004a55292b6934F8840a87795b576j14192A15103
19422c028j28792M2574k34925A50362b73548B49011D5006b38307n271R8409l71316
19411e16485a48486A79538c61522A82864E5329a47619A14196b30721A79929h492
19400b07572f876j93984l04354a90974D5098a01435B90601D4880J44366d4132
19389b32923A27970i8169B42652b4822k33981f5346m24j04972i588j92959J00304
19378a02243I2563c7651l6738J8747B73868E726f8227B56217c31671A58108i911
$$ plain form
19457 -5990 -400210 -262085 -257102 -26365 28088 -92549 125528 1212 -62336 185540 -91536
19445 55405 48101 88027 -10296 179690 -90088 135077 -134772 -264999 177609 -304637 32036
19433 -251156 -47147 357277 159004 -155292 -26934 68840 -187795 -2576 -116768 115103
19422 -3028 -131820 -89246 -324171 150362 -273548 249011 45006 -238307 -243578 -145169 -516485
19411 -516485 -148486 179538 -361522 182864 55329 -147619 114196 -230721 179929 -8492
19400 -207572 -6876 -200860 -505214 -190974 45098 -101435 290601 44880 189246 -44132
19389 -232923 127970 -98169 242652 -24822 -258803 -65346 -65770 -170742 -9588 -202547 -102243
19378 -102243 92563 -37651 -74389 -55642 273868 5726 -68227 256217 -331671 158108 -9911
19366C4083b42043k2835D0830a355j13582r8997L3532c3315k3001I8281l8933
19355E9348b2274A74131P17C9337A507M7583a15317I1781a46945j85193A16572
19343a03216D3690c77100J45214a13792b6192i957A95589b64759A47629c9395
19332A40324n6259p216P9427M7809h9389k12068P066k09494A7369J6920b7473
19320A76051J46314a97282a1814k30876A44381m4327e7666q1323O5212m9689B9309
19308b10404j59227g1566b06A5133a37253J2344A82891b04r1375A47787g8365
19296A89892B0792e06l92609a67527G9197c50675F1659c3114o1080j47506e0838
19284a02581L3469j92202P1757n5569J05818K3410a6907k82978I0581d12088d217
$$ plain form
19366 34083 -242043 -264878 40830 -1355 -114937 -213934 -180402 -33315 -56316 98281 59348
19355 59348 -22274 174131 174848 39337 1507 49090 -115317 91781 -146945 -332138 116572
19343 -103216 43690 -377100 -231886 -113792 -26192 -9957 195589 -264759 147629 -39395
19332 140324 84065 76849 156276 204085 -89389 -301457 -294391 -503885 17369 34289 -27473
19320 176051 322365 -197282 -11814 -242690 144381 100054 -57666 -138989 -73777 -123466 29309
19308 -210404 -369631 -71566 -206 15133 -137253 -124909 182891 -204 -91579 147787 -78365
19296 189892 20792 -506 -393115 -167527 79197 -350675 61659 -33114 -94194 -241700 -50838
19284 -102581 -69112 -261314 -189557 -245126 -139308 -115898 -16907 -299885 90581 -412088 -4217
19272F2779J6402b90555j34759a15930A0345N2234b115p5406c7212o6562m4810
19261a48584j59215D3860c50539E8300a15087L0556A19748l3039c30091C578h1899
19249c2282j44506d8317l39703A9125d7584B51820b11900B14943a46747P2459
19239g4288I2104b28804B7629A1073c6795A79253b30322B18445b96426O8197d291
19227g6459o9751m5479C08741A00024a72180A02926N0674d21693a69123m5784
19217b14907d157F8141a95126A18413J74365e8255b0328j43824L3450O659o1822
19206a85865K5840K5757j93299a14682A02078m5628b57791D8797J76880a50631
19195e0578J7792H415Q0104a50715a4930j08637q7593c9291B08158a9997r3751
$$ plain form
19272 62779 79181 -290555 -425314 -115930 10345 62579 -2115 -77521 -37212 -103774 -148584
19261 -148584 -307799 43860 -350539 58300 -115087 -84531 119748 86709 -330091 3578 -81899
19249 -32282 -176788 -48317 -388020 19125 -47584 251820 -211900 214943 -146747 -74288
19239 -74288 92104 -228804 27629 11073 -36795 179253 -230322 218445 -296426 -228229 -4291
19227 -76459 -146210 -191689 308741 100024 -172180 102926 153600 -421693 -169123 -214907
19217 -214907 -4157 68141 -195126 118413 292778 -58255 -20328 -164152 -130702 -124043 -185865
19206 -185865 -160025 -134268 -327567 -114682 102078 56450 -257791 48797 225677 -150631
19195 -50578 -32786 8415 88519 -150715 -14930 -123567 -211160 -39291 208158 -19997 -113748
19184a13748b0819E0223a3423A95903b66133b61k00234B1028i6731j78164i1473
19172C3209P6534f1486E6645i0900B7465O1153J1138a82455C30801b0690f589
19160h3096j84765k1401J39643A30320J96733g6n0858C61980C3452a39816A14015
19148c87691g1780j36479O2350k83666E0059j4271M154c17562a50624M4742D9074
19136D7079a52180A54377B5207e0350G3485c46909J38123b1038o7693A64722G6922
19124c2215k66136C02980j18505G8972b63970d0258n7970m7460b3929j98036d8219
19112I9268A8700f3300j0198A70722G2090a86181A77815B9934a4764B45751b61965
19100c06336j9871k2880B92211a05475J3829E0684b75088o8199C7537a19447J4550
$$ plain form
19184 -113748 -20819 50223 -13423 195903 -266133 -261 -200495 21028 -96731 -274895 -91473
19172 33209 109743 -61486 56645 -90900 27465 88618 99756 -182455 330801 -20690 -6589
19160 -83096 -267861 -289262 -149619 130320 327053 -76 -50934 361980 33452 -139816 114015
19148 -387691 -71780 -208259 -145909 -429575 50059 35788 39942 -317562 -150624 -105882 49074
19136 47079 -152180 154377 25207 -50350 73485 -346909 -208786 -21038 -88731 164722 76922
19124 -32215 -298351 302980 184475 78972 -263970 -40258 -98228 -145688 -23929 -221965 -48219
19112 99268 18700 -63300 -73498 170722 72090 -186181 177815 29934 -14764 245751 -261965
19100 -306336 -326207 -349087 292211 -105475 -91646 50684 -275088 -343287 37537 -119447 -104897
19089a04897M156F0483a28778e1746A19941c16787G8682b1115j96436c3012m7412
19078h0424B19246O7064g5580E1910O2252M0205b56031A03856a94137B1716a28508
19066d45350J19151A71226b28717E1319b56307k9356a30666A5333h3949q2782
19056a66731B46347a64009A63877l8550N999D486a03162D8210c78855A36584a17399
19044A41351a27890j0739C2941K1539h9612k9704L9861k07495H2358c93026J79775
19033b13251E0680J06678c22729B41427C7903J76575A05519b57953a2973B20626
19022a9218k82051I9402a70813e4124k26438a04508F2703J54368p6796h4104B92566
19010B69968I30h5952o2026q4433a3660l52422A3160c44291B01714J18177b58040
$$ plain form
19089 -104897 -100741 60483 -128778 -51746 119941 -316787 78682 -21115 -217551 -33012 -80424
19078 -80424 219246 286310 -75580 51910 114162 154367 -256031 103856 -194137 21716 -128508
19066 -445350 -326199 171226 -228717 51319 -256307 -285663 -130666 15333 -83949 -166731
19056 -166731 246347 -164009 163877 125327 131326 4486 -103162 48210 -378855 136584 -117399
19044 141351 -127890 -138629 32941 54480 -89612 -119316 -79455 -286950 82358 -393026 -213251
19033 -213251 50680 157358 -322729 241427 37903 214478 105519 -257953 -12973 220626
19022 -19218 -301269 99402 -170813 -54124 -280562 -104508 62703 217071 140275 -84104 292566
19010 269968 930 -85952 -147978 -232411 -13660 -366082 13160 -344291 201714 319891 -258040
18998B19423L7772p7821b32994J15209o2390F4337b81956a25870Q999D20071A77922
18986A48265N5274a27576B1774g2496A33433a85132E8476a28041L6957b8883l1033
18975e9916A11273a58396J5223k70550c4678j65177e1587j7148a6406q6588A3608
18963b43480G2781j8840i9723j32963A0419d84693f0876j63148e4218o0520F6622
18951A82888C2498b5516A79408c12245B45041j04905c14354d4371l3489k00411
18941b78271E2566g2961B82608M1560F2089i4330j22688d7064l5197C19486a11729
18929c02520J0313b3769K449l23417B6620b47617A73940c58522B16163a43441
18918B6287J965c36524A19436B4294J76228F2495f7958k742m2172H5556c2527
$$ plain form
18998 219423 257195 179374 -232994 -117785 -180175 64337 -281956 -125870 -116871 420071 177922
18986 148265 203539 -127576 21774 -72496 133433 -185132 58476 -128041 -91084 -28883 -59916
18975 -59916 111273 -158396 -143173 -413723 -34678 -199855 -51587 -68735 -16406 -102994 13608
18963 -243480 72781 53941 -99723 -232686 10419 -484693 -60876 -224024 -54218 -114738 66622
18951 182888 32498 -25516 179408 -312245 245041 140136 -314354 -44371 -77860 -278271
18941 -278271 52566 -72961 282608 324168 62089 -94330 -217018 -47064 -82261 319486 -111729
18929 -302520 -292207 -23769 -21320 -344737 26620 -247617 173940 -358522 216163 -143441
18918 26287 28252 -336524 119436 24294 200522 62495 -67958 -70700 -112872 85556 -32527
18906g2517j09979j70595o8353a54507K8803d4574r4440C9638c39051J53834D4284
18894b76378e0372A40607L5058F4870a38093G332b98153I8202K01778G3085f1239
18882a46736d1991B18971b06857a01681l4440p3443A61643b41446i468o7177q9284
18871a65929C5915d47564g4732l05833J49851A53377e4921J8052j38034a1951
18860H1603d7389m08257J96798C1911a0311k45182G8615b32989f7193N275k86044
18849c47962a02267B62579F4983A0127Q08b00527R9926a4780A54921d0581B64726
18837c17197g0227A67852j6736a65344K4967d0931j32892F2128B076b42139e2445
18825a89755A27475A072J79897q4007N3233a80494C9948B081d55285I6593a4097
$$ plain form
18906 -72517 -182496 -353091 -421444 -154507 -125704 -44574 -139014 39638 -339051 -185217 44284
18894 -276378 -50372 140607 175665 64870 -138093 7332 -298153 98202 299980 73085 -61239
18882 -146736 -41991 218971 -206857 -101681 -136121 -209564 161643 -241446 -9468 -76645 -165929
18871 -165929 35915 -447564 -74732 -380565 -230714 153377 -54921 -36869 -174903 -11951
18860 81603 -47389 -455646 -258848 31911 -10311 -255493 78615 -232989 -67193 -61918 -347962
18849 -347962 -102267 262579 64983 10127 10935 -200527 -100601 -14780 154921 -40581 264726
18837 -317197 -70227 167852 151116 -165344 -140377 -40931 -173823 62128 2076 -242139 -52445
18825 -189755 127475 1072 180969 96962 150195 -180494 39948 2081 -455285 96593 -14097
18813H8616J26111I2808a24098K2173A42096a42333q2540M6877j20416h4296l28356
18802d12652J85260Q7995i517D9859K14728F5852h5213m5833A84166c9337r7934
18791a37271j55106E8636J22236r0221b8579j01883G2561J9654k3842R2055L9590
18780B00018A0406J25077D4197g9630G2929J86791a58480b8853j21388r1957O675
18769b35523e7804H5518a39551C04270b04145g7340m5523I8575d1668I3424j3302
18758H0122A6685J4434J49156g4226j2986A40370a23223k7369j1855B440c57045
18746B764d9033A85443B1443E481a8828m5044p2499A22974a11324r376D0051A8090
18733A66826b66631E9289c10065A73684b67206C7003h098q9619A90516d4769A45727
$$ plain form
18813 88616 214727 92808 -124098 -101925 142096 -142333 -224873 -177996 -298412 -84296 -412652
18802 -412652 -227392 -139397 -9517 49859 264587 65852 -85213 -131046 184166 -39337 -137271
18791 -137271 -292377 58636 180872 90651 -28579 -130462 72561 92215 68373 160428 200018
18780 200018 10406 135483 44197 -79630 72929 259720 -158480 -28853 -150241 -242198 -235523
18769 -235523 -57804 85518 -139551 304270 -204145 -77340 -122863 98575 -41668 93424 80122
18758 80122 16685 31119 180275 -74226 -87212 140370 -123223 -150592 -162447 2440 -357045
18746 2764 -49033 185443 21443 5481 -18828 -63872 -136371 122974 -111324 -120700 40051 18090
18733 166826 -266631 59289 -310065 173684 -267206 37003 -8098 -97717 190516 -44769 145727
18721a76552e9346l32441J13396b2607p7817j95052A15884b28616B1150e4300
18710a94377b480n7799l9736B73314A16407h8692j00148r7114a12995j65906A5273
18698b01882H5687b403p2583A7472a10403c8255B1736c75193B64001q6342F1650
18686A69652b3976j36883C1247a29465A50320a06550B0730a43567e6294I1492
18675a37239e9887j73893c3806k78415A48272D5291J07062N8820C2708a9612p6267
18664i5879b763j01856b5515j60034G2306P747j9429j8052e7909l4807j53414
18653b46130f9386j16130H4384a52384F0275a16345o3528N4904e452E7479b58118
18641a30490A93126e25952D4719J98916a36058J1074L3704p8815a2117k24170
$$ plain form
18721 -176552 -59346 -391787 -278391 -22607 -100424 -295476 115884 -228616 21150 -54300
18710 -194377 -2480 -60279 -100015 273314 116407 -88692 -188840 -285954 -112995 -278901 15273
18698 -201882 85687 -2403 -74986 17472 -110403 -38255 21736 -375193 264001 177659 61650
18686 169652 -23976 -160859 31247 -129465 150320 -106550 20730 -143567 -56294 91492
18675 -137239 -59887 -233780 -33806 -312221 148272 45291 152353 211173 32708 -19612 -95879
18664 -95879 -2763 -104619 -25515 -185549 72306 80053 60624 42572 -57909 -92716 -246130
18653 -246130 -69386 -185516 84384 -152384 60275 -116345 -179873 -124969 -5452 57479 -258118
18641 -130490 193126 -525952 44719 243635 -136058 -124984 -91280 -170095 -12117 -236287
18631b36287F920g318A3864K5565b13430c1611I1804b05863m1680A95738a51818
18619f5051R216j72584k7038K2227j6662A64453a40740B88766A32207a6184j71758
18608a87942F9204O254J35193a14802k237a4971B1350L07699b92051j25527J13916
18597c03662C878J94988i6354L9685A25984b43587i1085I338h4978A78438a05947
18585a57752b5354D7938a16249d186A23847c14068b0646B5196J001f5622m22754
18574d88376A87521F4122a68733j17327a11872A59448F7618a82379B76897e1126
18563a57570K2587B53707c11630E2195N1864C5583J42401a24831r4933b4090B27272
18551a09520k5993M9939B46117a72719B5329K5624e7776b8425j91403h8042J6729
$$ plain form
18631 -236287 6920 -7318 13864 39429 -213430 -31611 91804 -205863 -247543 195738 -151818
18619 -65051 -55835 -228419 -255457 -233230 -249892 164453 -140740 288766 132207 -16184 -187942
18608 -187942 69204 75458 210651 -114802 -117039 -14971 21350 329049 -292051 -417578 -303662
18597 -303662 3878 198866 -96354 -56669 125984 -243587 -91085 9338 -84978 178438 -105947
18585 -157752 -25354 47938 -116249 -4186 123847 -314068 -20646 25196 26197 -65622 -488376
18574 -488376 187521 64122 -168733 -286060 -111872 159448 67618 -182379 276897 -51126
18563 -157570 -134983 253707 -311630 52195 104059 35583 177984 -124831 -219764 -24090 227272
18551 -109520 -135513 -85574 246117 -172719 25329 50953 -57776 -28425 -219828 -88042 -71313
18540g1313l92311J71713H3979C8617a74971G481b82484h8681A92869a12339D6215
18528d4795A05287b77569d3594A80861C2129a5019A86796B8221c8604D1773a52048
18516B23123H0696J1556M5500c6037C10926a69876Q4723j25780J4561K0278B6845
18504G3232k1673L26973F6900a75924k025A8092J51326f0156k5745b892j81831
18493a84723A91618a59361i837B2501a27092r811p4799f122K109B6889c87779
18481e2985k06244c5144A28027E9410J4830c12484J09451a00484j63461h6047
18470b05127C2202c2657G8261O4406b59246B84937A01066b50969Q2724g771A2187
18458b09391A03906c36031a19382j4056A18876a77871K8298r5164k64816a6147
$$ plain form
18540 -71313 -463624 -291911 83979 38617 -174971 7481 -282484 -88681 192869 -112339 46215
18528 -44795 105287 -277569 -43594 180861 32129 -15019 186796 28221 -38604 41773 -152048
18516 223123 80696 92252 137752 -36037 310926 -169876 -85153 -210933 -196372 -176094 26845
18504 73232 51559 378532 66900 -175924 -177949 18092 169418 -60156 -85901 -2892 -184723
18493 -184723 191618 -159361 -9837 22501 -127092 -136903 -211702 -6122 -4013 26889 -387779
18481 -52985 -259229 -35144 128027 59410 74240 -312484 -203033 -100484 -263945 -86047
18470 -205127 32202 -32657 78261 142667 -259246 284937 101066 -250969 -168245 -7771 12187
18458 -209391 103906 -336031 -119382 -133438 118876 -177871 -149573 -244737 -509553 -16147
18447c97315f2321a1615k36298C683O1068O2019M9903b14689l4934J10838K5979
18436a12806K1166M4431D58385b88912c8624B52889F4842K60608F3150a24361
18425f7736B26427G8765a88686g4205l58481A11531b13196G1564c3991j43589
18415a77580B90485A35476C0770J95107B0278N5242a98130l17079a26827e4109
18404A09957a1526r8612p8742e5705A55377F950b73614l5527G261c20556J22499
18393a98057D9797d7219j25060j5391J6155c8307o2754b9565p1601D522d04156
18381B3934J23008a58872g0389A11430f366k92577B7934a93957h9345r8457B62168
18369A98952f0108F4160a19214A01056b4007B6251L72515a44970A03141a12607
$$ plain form
18447 -397315 -62321 -11615 -247913 3683 64751 126770 176673 -214689 -249623 -138785 -112806
18436 -112806 -91640 -47209 458385 -288912 -38624 252889 64842 325450 63150 -124361
18425 -67736 226427 78765 -188686 -74205 -432686 111531 -213196 71564 -33991 -177580
18415 -177580 290485 135476 30770 225877 20278 75520 -198130 -515209 -126827 -54109
18404 109957 -11526 -110138 -188880 -55705 155377 6950 -273614 -309141 7261 -320556 -198057
18393 -198057 49797 -47219 -172279 -187670 -171515 -38307 -101061 -29565 -101166 4522 -404156
18381 23934 146942 -158872 -70389 111430 -6366 -298943 27934 -193957 -89345 -187802 262168
18369 198952 -60108 64160 -119214 101056 -24007 26251 398766 -144970 103141 -112607
18358e2565H6467a2407m8203I9571i9911I1002m964c5323n9720J9598k18892a04030
18345g1975H2225O4072a1336j2996A35255M5257a09955A86740D6255h0445o686
18334h7131B09762b06707j2157h4642B87256m1742b1262A07204A4875K2023a13497
18322c20521B25558q2088a50728a147A05654K53515A4325M3072c43885J03286
18312b40599B48095O7184b66363J33064d6802r1820C5901d8502g957p2486n7112
18301a37555F1510R410a39519B0827a30927B19045J2520M3707b75450d8279B47185
18289A15448J1814a890E3305H651g0501j168B10538c46220b1117k07864a11629
18277F2460b45777N1271N321p7666a14406I5307L7510f5761A76511k8528c69155
$$ plain form
18358 -52565 86467 -12407 -60610 99571 -99911 91002 86038 -35323 -95043 -75445 -294337 -104030
18345 -71975 82225 146297 -11336 -24332 135255 180512 -109955 186740 46255 -80445 -87131
18334 -87131 209762 -206707 -218864 -84642 287256 245514 -21262 107204 14875 36898 -113497
18322 -320521 225558 143470 -150728 -1147 105654 359169 14325 57397 -343885 -240599
18312 -240599 248095 315279 -266363 -133299 -46802 -138622 35901 -48502 -7957 -80443 -137555
18301 -137555 61510 70920 -139519 20827 -130927 219045 231565 275272 -275450 -48279 247185
18289 115448 127262 -1890 53305 8651 -70501 -71669 210538 -346220 -21117 -228981 -111629
18277 62460 -245777 -194506 -189185 -266851 -114406 95307 132817 -65761 176511 147983 -369155
18265f0182J553I1189a42437j01974A97176f0095D4834a40525j90231a24895A45173
18253A24250a29850j12132A62643K2332I1570b53216G4700J84490c50733B1371
18242b3025A48460J18247G4414K18795F5807J24223A5472J86682M9533b10388
18231a3323D1735i4068B41622i6340a431l5939H2476d9385l9444m1361j3871n2361
18219a96422I1512C8019f8832A96417H6723a22130J9200K1867A85542H4351b28007
18207e2164q3214r3649G6177J25770a27153j2157E6133c45818B78154g8139q7768
18196a65907J2310A60148F1246k8773L8609J96207b49056E0853N127J2042j5022
18185E3000a95815B0623P4088A2118D580a1236k44646C20476p8267a20820p4006
$$ plain form
18265 -60182 -58629 91189 -142437 -244411 197176 -60095 44834 -140525 -330756 -124895 145173
18253 124250 -129850 -241982 162643 184975 91570 -253216 74700 259190 -350733 21371
18242 -23025 148460 266707 74414 293209 65807 190030 15472 202154 251687 -210388
18231 -13323 41735 -94068 241622 -96340 -1431 -37370 82476 -49385 -88829 -130190 -144061 -196422
18219 -196422 91512 38019 -68832 196417 86723 -122130 -102930 -81063 185542 84351 -228007
18207 -52164 -135378 -229027 76177 201947 -127153 -139310 56133 -345818 278154 -78139 -165907
18196 -165907 -153597 160148 61246 32473 71082 267289 -249056 50853 55980 68022 53000
18185 53000 -195815 20623 94711 12118 4580 -11236 -255882 320476 242209 -120820 -194826
18174a94826j05105a13443C0378K64716D3896b92355C79103j69606d1014I3122
18163A29084a12450m0725b3082B51178b87475J30182c1617k53665K7614f5806
18152a8670A50583a15705p2189A50591a07786C31988c3181j13970l5625K4419
18142a58357G7998a24677A1766M616Q1439C802i0671A81570c4029a3341l82031
18131c95372g5440B74370b90102f6008A85469f942A39590a33989j40834i4003
18120A7640K13939g2485C2350Q6404b06506a8784G3507c4039A5071M8563e4155
18108C60946H4041g8759B93831G3531b47067c2919A4202b06150B874f6657a4997
18096E4356b16154r0600B45829b93240g3031n5995k5366M1556L5102n4176b996
$$ plain form
18174 -194826 -299931 -113443 30378 295094 43896 -292355 379103 209497 -41014 93122
18163 129084 -112450 -153175 -23082 251178 -287475 -157293 -31617 -285282 -257668 -65806
18152 -18670 150583 -115705 -187894 150591 -107786 331988 -33181 -147151 -182776 -158357
18142 -158357 77998 -124677 11766 16382 97821 3802 -90671 181570 -34029 -13341 -395372
18131 -395372 -75440 274370 -290102 -66008 185469 -6942 139590 -133989 -274823 -94003
18120 17640 231579 -72485 32350 118754 -206506 -18784 73507 -34039 15071 63634 -54155
18108 360946 84041 -78759 293831 73531 -247067 -32919 14202 -206150 2874 -66657 -14997
18096 54356 -216154 -306754 245829 -293240 -73031 -129026 -154392 -112836 -77734 -131910 -2996
18084i1684M1756L635R993b012F7722O4426a59457r2659d5116B5468P5920a85939
18071A4283a70933d3254j53029i4988L2903j3898F4743c3793k95222E2263d22093
18059d0289B00222c37558b9218a2037H3640a78978G1897k3542j3004K06468h7794
18047a95663O9729A07588C9565a88727A3238J23506O728J73091c3890j40500j04244
18036b78634A00047b17474A58735a97428D9650b12327A41045h7168H1638K41777
18026C23415P027e5741A92186d5945i137j40805C8183O5234a20367A77682M8972
18015B26654I1868l1892K189a29358B93849e1731G9517J1953a17287A91678a27237
18003A38368N1010L8215N8088n4004I3179J82663d1941l7603j10333B06497c7455
$$ plain form
18084 -91684 -49928 -46293 -36300 -2012 67722 132148 -159457 -252116 -45116 25468 101388 -185939
18071 14283 -170933 -43254 -196283 -94988 -62085 -75983 64743 -33793 -329015 52263 -422093
18059 -40289 200222 -337558 -29218 -12037 83640 -178978 71897 48355 35351 241819 -87794
18047 -195663 -125934 107588 39565 -188727 13238 136744 143472 316563 -33890 -174390 -278634
18036 -278634 100047 -217474 158735 -197428 49650 -212327 141045 -87168 81638 323415
18026 323415 330442 -55741 192186 -45945 -9137 -149942 38183 103417 -120367 177682 226654
18015 226654 91868 59976 62165 -129358 293849 -51731 79517 91470 -117287 191678 -127237
18003 138368 189378 227593 285681 231677 93179 275842 -41941 -79544 -189877 206497 -37455
17991B9763M9789A6701e4863j57417c0244j2836F9812E741b36688C35221C3637
17979a36464A9675N6566m55b71017h5755J6018A48600C7479K00514A7007P008
17968B4015b27985N3362j40661b5427B56364c5367C5879c49914d4655j37667C24585
17956f7479a8938k67446D2341b07671G4168a04009B43467H3577b6359A38018f7083
17944f1340b4074m11989b042r8337b9140G4465h3357B18445O2375A06037R0086
17933A96123B5786M1653M2564a08692A52994G4379j6104e4064k9744m0135G1901
17921a69374a8759q4438B87894b5544l59271A16662b4545A1191K655Q63L8597
17910E3306B1057b5119j66549k33203A05436J1822B7646b00123f6263B76028f5766
$$ plain form
17991 29763 79552 16701 -54863 -212280 -30244 -43080 69812 5741 -236688 335221 33637
17979 -136464 19675 76241 75786 -271017 -85755 -69737 148600 37479 237993 17007 24015
17968 24015 -227985 -174623 -315284 -25427 256364 -35367 35879 -349914 -44655 -182322 324585
17956 -67479 -18938 -286384 42341 -207671 74168 -104009 243467 83577 -26359 138018 -67083
17944 -61340 -24074 -436063 -2042 -100379 -29140 74465 -83357 218445 280820 106037 196123
17933 196123 25786 67439 110003 -108692 152994 74379 58275 -54064 -83808 -123943 71901
17921 -169374 -18759 -103197 287894 -25544 -384815 116662 -24545 11191 13846 14709 53306
17910 53306 21057 -25119 -191668 -424871 105436 117258 27646 -200123 -66263 276028 -65766
17898A66587d6698j44451A58599G742K44412a49914A9788b55778A87136a5893
17887b35013B00021m5339A3514a44825c9408k01786d4792A80425a59336l3506
17877a92842i4832m1999L616A68248l216K87564b64992k43686b00986i4866K7652
17866f7214l74496i140k5511B39082Q9399E7451j7258K29718D4861L4745L42919
17855D22525A78338a23496I3074M5959d8194l8620A88697J40115H4919c20063
17844B85372L9097D6801Q3949C9099b75310E3945b16200C81077A80817O6505b44968
17832B35333c02137R2777A36655J89832a65409a9552j45120B79764A36901c332
17821D1220b21090a05079a775r4694E01609G2642J0059J26694a15063j92950Q2719
$$ plain form
17898 166587 -46698 -191149 158599 7742 252154 -149914 19788 -255778 187136 -15893
17887 -235013 200021 154682 13514 -144825 -39408 -241194 -44792 180425 -159336 -192842
17877 -192842 -94832 -136831 -133215 168248 165032 452596 -264992 -508678 -200986 -94866 -67214
17866 -67214 -441710 -9140 -34651 239082 328481 57451 40193 269911 44861 79606 422525
17855 422525 178338 -123496 93074 139033 -48194 -86814 188697 328812 84919 -320063
17844 285372 324469 46801 130750 39099 -275310 53945 -216200 381077 180817 247322 -244968
17832 235333 -302137 -209360 136655 326487 -165409 -19552 -164672 279764 136901 -3332
17821 41220 -221090 -105079 -1775 -96469 501609 72642 82701 209395 -115063 -308013 -225294
17810b25294C8042L3019a72330C51905d7183a1318m7586F7630K50768a45112A67464
17798A44281c59653g37F0913K96074j39096E8378N2792b50457F0375g2157l26844
17787c99001A46050D8859b28900g7851D0117C544R5085M9985a9490l6399j43967
17776a99856P4859n8626o1978B02095L8290k012h0027l9621R034A9038K4545J30730
17764A74313g6198D9443K17716C5980P753b0597F5347a91094e9819A78605b81465
17752a05674A47007e6552p1833k228E6258N1768m7593L3151f9649m093A48888
17740a1240j83494f9651A07233a78344B10849p7966R3291e850k32099G8600J3410
17729I2010g2009l27397g4362j38422J03391B7095O1362b55467B55557C6790J39683
$$ plain form
17810 -225294 38042 71061 -172330 351905 -47183 -11318 -58904 67630 318398 -145112 167464
17798 144281 -359653 -737 60913 356987 217891 58378 111170 -250457 60375 -72157 -399001
17787 -399001 146050 48859 -228900 -77851 40117 3544 98629 148614 -19490 -55889 -199856
17776 -199856 -124997 -183623 -245601 202095 240385 238373 -80027 -119648 -110614 19038 43583 174313
17764 174313 -76198 49443 267159 35980 43733 -20597 65347 -191094 -59819 178605 -281465
17752 -105674 147007 -56552 -128385 -130613 56258 108026 60433 93584 -69649 -73742 148888
17740 -11240 -194734 -69651 107233 -178344 210849 132883 226174 -5850 -237949 78600 92010
17729 92010 -72009 -399406 -74362 -212784 -109393 27095 88457 -255467 255557 36790 176473
17718A76473A5431a44135a6324A38513a5675A04837l4885M03394A98046e3395
17707B24941J35826j01055J0179a80842p709B57976A6620d4022a3061l6865A43835
17695A26957C9634l778b06728A61310a16625B26316A7830J97504C8719J11551
17685A50270h8580A2218J80117a54374A88408i7994B6440b28261e797C14495j50544
17674A63951E3252K86990A57472C0207K95039A51114R3390c13827N3160b0948
17663c3720C01132j04029H3286a95006c5883A54698n9169A0137H43J25761E7465
17651G1966a13099r1323A15350n0744j2871h906A15037c7596A13801k1005G436
17639G8179a01724k85831g5411G1381d4775j18160F4317a23641o919A88089N3363
$$ plain form
17718 176473 15431 -144135 -16324 138513 -15675 104837 69952 473346 198046 -53395
17707 224941 360767 259712 269891 -180842 -188551 257976 16620 -44022 -13061 -49926 143835
17695 126957 39634 35856 -206728 161310 -116625 226316 17830 215334 38719 150270
17685 150270 -88580 12218 192335 -154374 188408 -97994 26440 -228261 -5797 314495 163951
17674 163951 53252 340242 157472 30207 325246 151114 244504 -313827 -260667 -20948
17663 -33720 301132 197103 83286 -195006 -35883 154698 95529 10137 843 126604 57465
17651 71966 -113099 -204422 115350 64606 51735 -8906 115037 -37596 113801 92796 7436
17639 78179 -101724 -387555 -75411 71381 -44775 -162935 64317 -123641 -130560 188089 241452
17628B41452a66712C70128A42634C5423b72216A45646J46825D1257d1965m2089
17618h4054C45454g1618m268A06849J1607B9109K69309f3650E4759L5821i7685
17606D28113j18362j52158e9208A4418c12430J53901B59489h180k9155D8724L38232
17595C86956j44049A5265n348P0600J24434c8627J7055B90456Q588a53580p3221
17584b26801A47225i2296A95976E306a07038f239C9629L2114b32977A598K02242
17573B03840a83018B38302d4941j67466h4753H0507c9666B87028H7672a02454
17562D99744A00732M4221C9412K9310K41355a92695h4342e819A02633L07718D1570
17550a98348B33326k5326J24267a09579C50236b53478B06977j2138I6901L34780
$$ plain form
17628 241452 -166712 370128 142634 35423 -272216 145646 292471 41257 -41965 -84054
17618 -84054 345454 -71618 -75886 106849 118456 29109 298418 -63650 54759 90580 -97685
17606 428113 309751 157593 -59208 14418 -312430 -158529 259489 -8180 -37335 48724 386956
17595 386956 242907 15265 9917 80517 204951 -38627 -21572 290456 299044 -153580 -226801
17584 -226801 147225 -92296 195976 5306 -107038 -6239 39629 71743 -232977 1598 203840
17573 203840 -183018 238302 -44941 -212407 -84753 80507 -39666 287028 87672 -102454
17562 499744 100732 144953 39412 68722 310077 -192695 -84342 -5819 102633 410351 41570
17550 -198348 233326 208000 332267 -109579 350236 -253478 206977 194839 96901 431681
17540D31681j89020Q8912C4433L15485j14301a70491B05395l4881a10157A05696
17529B12064F8548J28926b04420G76J39203e4853E6778J47226R1005p4583j02333
17518A18093K03401M8387A39184k9364A585L02164i1330E31503d4989C8613I087
17506G349Q1480L65848B12328K44022B18479K23023A44353a27108B04629a97193
17495A52225J75772B1113i1661B27804I2836K62071I4082J1518K48296f8633A60087
17483a1978r3642C21433i4349I9232a06688m0251G2286j2932K50894A45277K90077
17472D35354j55844I5365L1985b38405F7758j9990Q956c46117B4935K81888h8128
17460A12031P3026o2903J52209p9666E1923J47552b2993B46237C9327O439k0591
$$ plain form
17540 431681 242661 331573 34433 349918 235617 -170491 205395 170514 -110157 105696
17529 212064 68548 197474 -204420 776 139979 -54853 56778 204004 295009 220426 118093
17518 118093 321494 369881 139184 109820 1585 303749 -91330 531503 -44989 38613 9087
17506 7349 88829 454677 212328 456350 218479 441502 144353 -127108 204629 -197193
17495 152225 327997 21113 -91661 227804 92836 354907 94082 105600 353896 -68633 160087
17483 -11978 -105620 321433 -94349 99232 -106688 -146939 72286 59354 310248 145277 435354
17472 435354 279510 95365 127350 -238405 67758 47768 56724 -346117 24935 306823 -88128
17460 112031 185057 122154 274363 194697 51923 199475 -22993 246237 39327 45766 25175
17449B5175J34225k6730K26981A77859n9794J22464E9602i8369D6975e5221C88930
17437a7436A13074J00770J36472H3934B9000K12807B5755l687J85240H7593J12513
17426B00106F0995P8718J16535j11647Q4227O9146b0550A57141C7850K44357a35311
17414C13307A13164D8292L00085b0216B14660p840I2462L8084P1832F6335J65206
17403B31541m2710b0832A17513K78419c1464A70345a79330B42486a43737A87429
17392h5752j18635A84584q3221L16016A23555R920P792K51966K8036A57846c33750
17380D2822a75369B13135M3441a38424C38508G2835Q6754a40702O83A55369B2249
17368C2609K11895q5536G2824h7755J4192A12346d7874B8522J73431E1590g4000
$$ plain form
17449 25175 159400 132670 359651 177859 118065 240529 59602 -98369 46975 -55221 388930
17437 -17436 113074 213844 350316 83934 29000 241807 25755 22068 207308 87593 200106
17426 200106 60995 139713 256248 144601 228828 297974 -20550 157141 37850 282207 -135311
17414 313307 113164 48292 348377 -20216 214660 206820 92462 130546 202378 66335 231541
17403 231541 188831 -20832 117513 395932 -31464 170345 -179330 242486 -143737 187429
17392 -85752 -204387 184584 101363 417379 123555 133475 141267 393233 421269 157846 -333750
17380 42822 -175369 213135 256576 -138424 338508 72835 159589 -140702 -140019 155369 22249
17368 32609 244504 158968 72824 -87755 -73563 112346 -47874 28522 201953 51590 -74000
17356A94771d7096A30999J68825j42227b48601E6250K40683g8624D0128B558N7821
17345F0379J08989K17972j43901N3253r1083p8016K9505b02723h3857B40929L2898
17334B73827A35054e6944C681K32875L4578N6298n7730r0145D3065O5427M3974
17323A52466n5878J8210a47842c5884H77R8311J35133m8589g3023E8809a47196
17311A76044k9313j5935h0834C54065b85496A0619K07187b2235I4070c19350A80014
17299g5360B00160d9979a2651A54265M5250J35721B1707M88347A61326K19337
17289C80663J49822B64380C553M4480J98735l3070C3687J15602m0465D7087K5593
17278G2680l3394J44033C4337O7579g061A17682b9669A89259f8643G7349R3148
$$ plain form
17356 194771 -47096 130999 299824 157597 -248601 56250 296933 -78624 40128 2558 60379
17345 60379 169368 387340 243439 296692 205609 127593 157098 -202723 -83857 240929 273827
17334 273827 135054 -56944 3681 236556 271134 327432 269702 179557 43065 108492 152466
17323 152466 96588 114798 -147842 -35884 877 99188 234321 185732 -73023 58809 -147196
17311 176044 146731 130796 -80834 354065 -285496 10619 217806 -22235 94070 -319350 180014
17299 -75360 200160 -49979 -12651 154265 199515 335236 21707 510054 161326 380663
17289 380663 530485 264380 3553 48033 246768 213698 33687 149289 108824 47087 72680
17278 72680 39286 183319 34337 101916 -7061 117682 -29669 189259 -68643 77349 170497
17267A70497l8163h398p2176A21076K9847J54215a11528B55626M2546A27623h6986
17255A47704J28117L9762H5508O1550b9718G7878R2426J31722I8595J04739P1019
17244B74353r3565p751q2017K31696n0803o7053j8349J12225p4410F5890J04195
17233A70085J39382F3892J27477D5939O4366L0553C7936a304C2847K39427C3509
17221B53713j15207l0661M4375C5765J16448N7081g4797C90476n5164d7891f565
17209B29182f6896G636J64974B2642K31639P1227b5674B72088j07405g2267A51340
17197A40598M1433B1917L85222p4192j28106J56209j44048R1127i2193D26292
17186F7185L13675b969B74280J04194b44857H4543P9845l9254N7394J95306D6461
$$ plain form
17267 170497 132334 -8398 -80574 121076 150923 305138 -111528 255626 298172 127623 -86986
17255 147704 275821 315583 85508 147058 -29718 77878 170304 302026 98595 203334 274353
17244 274353 180788 173037 91020 322716 271913 204860 186511 298736 224326 65890 170085
17233 170085 309467 63892 191369 45939 110305 140858 37936 -1304 32847 272274 33509
17221 253713 138506 107845 152220 35765 152213 209294 -74797 390476 335312 -47891 -6565
17209 229182 -66896 7636 172610 22642 254281 325508 -25674 272088 164683 -72267 151340
17197 140598 182031 21917 407139 332947 204841 361050 217002 308129 -92193 426292
17186 67185 380860 -2969 274280 378474 -244857 84543 164388 125134 182528 377834 46461
17174A14242J37K34904E8366L87322J2656E2187L07408I0133K86106b07099b3341
17162A51792G5412a53788B02724k3754K07090j80164P0456J9759K3643F0674K65600
17151C26274J46285B13214n4974L53892A14387J56176G0217J75346P6611K0375
17141C42549n4577O5788j45549o7717Q6884K84660b1293C951a82229E52931n0998
17130E01933A83928j4309o1614M06680A83152L44444k58250p2096K3945p6576
17120A44619L96842G2291K83234o5179B4900j911R7268K9809J46868r0214J58901
17109C65621a07274D67899J26011j68373E6402J12879J83999J9061A23290J72862
17099B96152J25175B10135Q3305N0651m1355a4586C11535H0705J81450m7525b7305
$$ plain form
17174 114242 114379 349283 58366 445688 458344 52187 359595 90133 376239 -207099 -23341
17162 151792 75412 -153788 202724 178970 386060 205896 276352 296111 319754 60674 326274
17151 326274 472559 213214 158240 512132 114387 270563 70217 245563 322174 342549
17141 342549 287972 353760 208211 140494 227378 512038 -21293 3951 -182229 552931 501933
17130 501933 183928 169619 108005 514685 183152 527596 269346 197250 221195 144619
17120 144619 541461 72291 355525 290346 24900 22989 120257 150066 296934 206720 365621
17109 365621 -107274 467899 593910 425537 56402 169281 353280 372341 123290 296152
17099 296152 421327 210135 293440 344091 302736 -14586 311535 80705 262155 214630 -27305
17087B78086g6476A75741M8615o8097K01050n3197K00606A59769K66642l2817
17077C93594q4962K47219F2464M64648j79941m0046A49948K37762N7268L25777
17067G70755l41912J2695J12298j51868H8011K00266J30834J28035k43191J51095
17057D55050j70603L8200R6533K851n9747A54585M12791p918Q6449l10434n4907
17046B80566o182l9108K98688j75825L5242k3764j29434L5351L80357k61202J90906
17035E85595B89775K45764j99973J98859j07049K72354k15767L08543C17315L18984
17025F36299q559k06889k3009J54887K09974l51269j6801L23963l05861J98860
17015F11595k58309K59195m5370j17435K97853k65537R325J10924J65210k30644
$$ plain form
17087 278086 -76476 175741 224356 156259 357309 304112 504718 159769 426411 393594
17077 393594 308632 555851 62464 527112 347171 307125 149948 387710 444978 770755
17067 770755 428843 441538 553836 401968 88011 288277 419111 547146 303955 455050
17057 455050 284447 322647 419180 422031 362284 154585 567376 559458 645907 335473 280566
17046 280566 274384 235276 533964 358139 393381 369617 240183 275534 655891 394689 585595
17035 585595 289775 535539 335566 534425 427376 699730 483963 792506 317315 636299
17025 636299 627740 420851 397842 552729 762703 411434 394633 718596 412735 611595
17015 611595 353286 612481 567111 449676 747529 481992 491317 602241 767451 536807
17005E36807B06159K23069J94940j47236K79381C45435M76917J3175q3007k793
16995G49727k86926K39501J27298C39249N95641j07933K9062C04190N85472n3160
16985H36502R3018k78348M0810K21930k76719J63750M4528n6373k6393j65988
16975E96717P3335P3359J61352n1408m05636L47155N2603m4975m3478n0667j08759
16964E99598K31725l3675n208M4535j13211L5879K3023N3675D01957Q16634E97985
16952A077978j72542j66250M0168K32367j87883R0690j81415L82973q2008J44439
16942A178517j30892q5890p0255Q9595p3844j76346L97699J62622m69448L9559
16932H61317L86111k04613j967o5926K30769R9243j3314J35672o18200N38330
$$ plain form
17005 536807 206159 429228 624168 476932 756313 345435 822352 835527 752520 749727
16995 749727 462801 702302 829600 339249 934890 826957 856019 304190 889662 836502
16985 836502 929520 651172 691982 913912 637193 800943 845471 789098 762705 596717
16975 596717 670052 743411 904763 853355 447719 794874 847477 802502 759024 708357 599598
16964 599598 831323 797648 792440 836975 723764 759643 782666 836341 401957 1218591 597985
16952 1077978 905436 739186 779354 1011721 823838 914528 733113 1116086 1034078 1178517
16942 1178517 1047625 961735 891480 981075 907231 730885 1128584 1291206 821758 861317
16932 861317 1247428 1042815 1040848 974922 1205691 1304934 1291620 1427292 809092 1347422
16922A347422j0511k04739L15880j70578j4054O5151P292p1642J27254K30628
16912A622103m50372L97477l2647l1052K7197k87493J60118k02177K09860P293
16902A420307p9012L59465l97100K55472K11318q53108Q45102k20094M40201m47160
16892A535391L55320k66026K95656m04241M74784l15879J21097L01036J89237
16883B286375k29108k19993J06120J82475k9898p7909r3267J3263K00044P4405
16873B212507K56321k45577K92715J51072k88099N59617n83339l259O6723J169
16863B419850L7179K36589J77983l05431P82024k81415m51517K63301J17253Q0806
16853C076622J51035k53160L98910j94326K38200m167O6288L04924P3681k05006
$$ plain form
16922 1347422 1336911 1132172 1448052 1277474 1263420 1328571 1335863 1264221 1391475 1622103
16912 1622103 1171731 1569208 1536561 1505509 1532706 1245213 1405331 1203154 1413014 1420307
16902 1420307 1341295 1700760 1303660 1559132 1770450 917342 1762444 1542350 1982551 1535391
16892 1535391 1890711 1624685 1920341 1516100 1990884 1675005 1796102 2097138 2286375
16883 2286375 2057267 1837274 1943394 2125869 2095971 2018062 1924795 1938058 2138102 2212507
16873 2212507 2468828 2223251 2515966 2667038 2378939 2938556 2355217 2351958 2418681 2419850
16863 2419850 2457029 2693618 2871601 2566170 3348194 3066779 2615262 2878563 2995816 3076622
16853 3076622 3227657 2974497 3373407 3179081 3417281 3413114 3479402 3784326 3858007 3653001
16843C653001J6582K41384j95655M36691j32121L1305K06961K38964J51014r4238
16833D553888k58501M65378J02196L53887p2198J56937m8430J15541K12649j57579
16823E423768K76148Q0278L35488L75431o9194L4493j506K04972L88193N83716
16813G631787k01527M39339r5070J45689P54298k44036M14800n2067M29694K49722
16803I472629L20256J40195M26048L10033Q1310P77520L90127j81162M18127M46982
16793A2602065M97349N03649L09868N29414L99939N24300M29868O81666N28980
16784A7007098O47607N57291Q83260L68458R26028O67082Q77001R42858L68111
16775B3244794J273248J078240P28656J541940O24119J614402J011638J288700
$$ plain form
16843 3653001 3669583 3910967 3715312 4152003 4019882 4051187 4258148 4497112 4648126 4553888
16833 4553888 4295387 4760765 4862961 5216848 5144650 5301587 5253157 5368698 5581347 5423768
16823 5423768 5699916 5780194 6115682 6491113 6421919 6456412 6454906 6659878 7048071 7631787
16813 7631787 7430260 7869599 7774529 7920218 8674516 8430480 8845280 8793213 9222907 9472629
16803 9472629 9792885 9933080 10359128 10669161 10750471 11527991 11918118 11736956 12155083 12602065
16793 12602065 13099414 13603063 13912931 14442345 14842284 15366584 15796452 16478118 17007098
16784 17007098 17654705 18211996 19095256 19463714 20389742 21056824 21933825 22876683 23244794
16775 23244794 24518042 25596282 26324938 27866878 28490997 30105399 31117037 32405737
16767C2405737J391608J639646J710598J352642J698659J927279J721979K287905
16759D6136053K237486K206569K131343K698112K646805K810338K783516L108094
16751F6758316K819136L626880L339706L565376L562834L637119M000701L874208
16743I5184276M067111L766342L840671L457499L696792L245274K991389K612923
16735A22862277K448001K133829J491380R93316Q91836O4348k82054j085777r65257
16726A28551899j981481j928810k841241k701240l408675l068840l746778l030465
16718A05844369l806796m124159l499221l570359l514283l461271l398552l328882
16710G7140846l238183l336720k543785l192427k786328k638953k327764k023928
$$ plain form
16767 32405737 33797345 35436991 37147589 38500231 40198890 42126169 43848148 46136053
16759 46136053 48373539 50580108 52711451 55409563 58056368 60866706 63650222 66758316
16751 66758316 69577452 73204332 76544038 80109414 83672248 87309367 91310068 95184276
16743 95184276 99251387 103017729 106858400 110315899 114012691 117257965 120249354 122862277
16735 122862277 125310278 127444107 128935487 129928803 130820639 130884987 130602933 129517156 128551899
16726 128551899 126570418 124641608 121800367 119099127 115690452 112621612 108874834 105844369
16718 105844369 102037573 97913414 94414193 90843834 87329551 83868280 80469728 77140846
16710 77140846 73902663 70565943 68022158 64829731 62043403 59404450 57076686 55052758
16702E5052758k552598k411020j700648j806814k308976j588004j765897j536706
16694C9382095j317713j737152j220969j698420r51344r35244j274047j005605
16686B9241601j327409o67698r33638j170303q43085p37364p79567p24984m04264
16677B1653289r35754m38225j116606n02874p05535n83784q0088n67826n49112
16668A6173485p36134j86849o13864j86650m48363o09463J67756n44412n17286
16659A2498220l38942J17662r36317l34472l00855l9855j24174m91104k5928l50251
16649I673984k69130k35498N6542l54151m06922j5085l28603k00742R3003n70421
16639G442977K38001n18053M9623k24040m85293L73671n80347K9113o604j12197
$$ plain form
16702 55052758 52500160 50089140 48388492 46581678 44272702 42684698 40918801 39382095
16694 39382095 38064382 36327230 35106261 33407841 32456497 31521253 30247206 29241601
16686 29241601 27914192 27246494 26312856 25142553 24299468 23562104 22782537 22057553 21653289
16677 21653289 20717535 20279310 19162704 18659830 17954295 17370511 17290423 16722597 16173485
16668 16173485 15437351 15250502 14636638 14449988 14001625 13392162 13559918 13015506 12498220
16659 12498220 12159278 12276940 11340623 11006151 10705296 10665441 10541267 10050163 10024235 9673984
16649 9673984 9404854 9169356 9225898 8871747 8464825 8449740 8121137 7920395 8013398 7442977
16639 7442977 7680978 7162925 7212548 6988508 6503215 6876886 6296539 6325652 6319048 6206851
16629F206851l36484k77916K54057l42138M8903P3647m03608l25950K89696l16259
16619D870799r0745K70037n27537O7657k4986J7188p75829L43787N8216j85696
16609D022891k24400o3247J16711J22626j52974J48654m7755j64702L6245k01472
16599C592577j03464P1328n5880j93361j08097M903J44151k04574m55031M07056
16589C099608p0716k12148J57286Q896j50610L3086j87767o8552M16395l65112
16579B660366k9227n724n19454N78095k82672L8180k18178J13075P6709k06752
16569B204418K11929j13116q5132K3656o0457l93493K91465N5312k36802J54691
16559B052471l6795j83809o764K64121n01054N34685j58348j72842k44648K09421
$$ plain form
16629 6206851 5870367 5592451 5846508 5504370 5553273 5626920 5223312 4897362 5187058 4870799
16619 4870799 4780054 5050091 4522554 4590211 4565225 4582413 3806584 4150371 4208587 4022891
16609 4022891 3798491 3735244 3851955 3974581 3821607 3970261 3922506 3757804 3794049 3592577
16599 3592577 3489113 3560441 3504561 3311200 3203103 3208006 3352157 3147583 2692552 3099608
16589 3099608 3028892 2816744 2974030 2982926 2832316 2865402 2677635 2609083 3025478 2660366
16579 2660366 2631139 2625415 2105961 2684056 2401384 2439564 2221386 2334461 2411170 2204418
16569 2204418 2416347 2303231 2218099 2241755 2181298 1787805 2079270 2134582 1897780 2052471
16559 2052471 2015676 1831867 1825103 2089224 1588170 2122855 1964507 1791665 1547017 1756438
16549A756438j35945K82198k10246o2790j95356L54425l10515k00675L40442J23735
16539A741711k3763k33489l81413N27287r4029r3916l3442m3931K8881j31674
16529A262222J93527j99357L64019l0970l67353l05513Q38000o20531K78542j006
16519A411580j74593J5029j46578N12031l30708L58622l32064J78413j87619k77690
16509A026423J26319r6400K77410m3121R0249k78527p4995J88970o2263k64077
16499H89988N80563j72517k7035J14875o0355j37629k16332K28490r4306J11333
16489A217075l65602L69049J22063j16631R6321j45245J12121l65194J23932L49177
16479A397066k25237J31572n56835N38620k99495Q524J20449m4607m4415k50771
$$ plain form
16549 1756438 1620493 1902691 1692445 1629655 1434299 1788724 1478209 1277534 1617976 1741711
16539 1741711 1717948 1484459 1103046 1630333 1536304 1442388 1408946 1365015 1393896 1262222
16529 1262222 1455749 1256392 1620411 1589441 1222088 916575 1754575 1134044 1412586 1411580
16519 1411580 1236987 1252016 1105438 1617469 1286761 1645383 1313319 1491732 1304113 1026423
16509 1026423 1152742 1056342 1333752 1290631 1380880 1102353 1027358 1216328 1154065 889988
16499 889988 1470551 1298034 1270999 1385874 1325519 1187890 971558 1200048 1105742 1217075
16489 1217075 851473 1220522 1342585 1225954 1322275 1177030 1289151 923957 1047889 1397066
16479 1397066 1171829 1303401 746566 1285186 985691 994215 1114664 1070057 1025642 774871
16469G74871M33786q4498m45230L44155K5380K37065l61975l3278J98366l60774
16459G27868L21345l2897k26043J93240O0371K4052m0692M9186k7708k53913J96113
16448I90922L34484F35642M82408j25069l8769j02709q6788L18075o7982M4644
16438A059452n2136r2718k80805K19013L362M64717n37885K27613l48713N34009
16428A195909l39463p0997L19603k56250K2323l16854M09493j49680O0185K25459
16418A099728o5196r5812Q1372j91932P3813J86k23062j9764J61284R4201j61761
16407G53057L75308k08889k22984K22372N1598m3381k65221J50205k04068L53384
16397I61381N1895r3140j62079K3528j83073M31234l19918j32644P31748F44038
$$ plain form
16469 774871 1208657 1124159 678929 1023084 1048464 1285529 923554 890276 1088642 727868
16459 727868 1049213 1016316 790273 983513 1043884 1067936 1027244 1076430 1048722 794809 990922
16448 990922 1325406 635642 1118050 992981 954212 851503 764715 1082790 1014808 1059452
16438 1059452 1007316 914598 633793 852806 856168 1320885 783000 1010613 661900 1195909
16428 1195909 856446 785449 1105052 848802 871125 554271 963764 814084 874269 1099728
16418 1099728 1034532 938720 1020092 828160 901973 902159 679097 659333 820617 914818 753057
16407 753057 1128365 919476 696492 918864 970462 927081 661860 812065 607997 961381
16397 961381 1013276 920136 758057 781585 598512 1029746 709828 577184 1308932 644038
16386I51785J07566r5997l61963M07895K14486j21994k30823j47508L23142l39646
16376G06943K71547k84360J95745Q9285o5976o1444n9485K36622k15126K81194
16366A094945k72215k6589o5093J59690M03898n43055K2991K74777q3110K48910
16356A215149j20261k13551L53263k98832M7617K67364l00794K32218r3137j62431
16346I26605J5m6279K05083o4195p8376l7203J2308n727K44005r5198J86207j47855
16334A099390j39868J67014l5814q6595N424j57869R5648P3665N5494L42249j89013
16323A229725k19755R967j48430L12339j0395l17636N4320K76999k70166J80349
16313A097317r0684j33975L37333m03994J77615L36215k04938J84692m94066J87192
$$ plain form
16386 951785 1059351 963354 601391 1009286 1223772 1101778 870955 723447 1046589 706943
16376 706943 978490 694130 889875 979160 913184 851740 792255 1028877 813751 1094945
16366 1094945 822730 796141 731048 890738 1294636 751581 774572 1049349 966239 1215149
16356 1215149 1094888 881337 1234600 935768 983385 1250749 949955 1182173 1089036 926605
16346 926605 926620 880341 1085424 1021229 942853 905650 917958 912231 1156236 1061038 1247245 1099390
16334 1099390 959522 1126536 1090722 1004127 1009551 851682 947330 1020995 1076489 1418738 1229725
16323 1229725 1009970 1019937 871507 1183846 1173451 855815 910135 1187134 916968 1097317
16313 1097317 1006633 872658 1209991 805997 983612 1319827 1114889 1299581 805515 992707
16303I92707J53805J98627l57647K5389j6519j05588j51205j18618L32260j6323
16293I36888M09081n34913M60903o16959N57086k48002K03013q545k05003L45403
16283A298952n08497K79258j83569J86062k8664j64689J15323L31679l29773L23505
16273A319587J11279G13638M27124j19787J16584j43810K16666k52065Q0428r6649
16263I42129K45956J0145n3033K0336j23087m063P9037j02008r0106J61329j75220
16252I11415j13173N49590l02277k77322N04983k2577j48410P8976q3867p8974
16242A018364K28013k95694j95047K81192l9291p619J40212k76367K41971j9901
16232A075833j71260k25808K14703N3805j30538j30159J55734j71719L06207p2871
$$ plain form
16303 992707 1146512 1345139 987492 1012881 996362 890774 739569 620951 953211 936888
16293 936888 1345969 811056 1271959 655000 1212086 964084 1167097 1158552 953549 1298952
16283 1298952 790455 1069713 886144 1072206 1043542 878853 994176 1325855 996082 1319587
16273 1319587 1430866 713638 1140762 1020975 1137559 993749 1210415 958350 1038778 942129
16263 942129 1188085 1198230 1145197 1165533 1042446 1038383 1117420 1015412 925306 1086635 911415
16252 911415 798242 1347832 1045555 768233 1273216 1250639 1102229 1181205 1097338 1018364
16242 1018364 1246377 950683 755636 1036828 997537 989918 1130130 853763 1095734 1075833
16232 1075833 904573 678765 893468 947273 816735 686576 842310 670591 976798 903927
16222I03927J21371r0607N6849m9937O2752D83292L65180m4791K46908k54289
16212G96300l8951k07575N55983j83718l12288K49644j9936Q2729j13021q6416
16202G22751L37353l87428N37557j33331j88370K9076r1167r5655l4366J06796
16192H03216m8928r5785M1231m9996j29462K71464m0679k03163L45999k55791
16182F38106n9180j25202j32016J95688J37526j47258J59591l3068L45287k60203
16172G19271k13096L52759L7818m26370k11831J37043A47794J16392P2969K42711
16162E79866M5999o9210A84118L70392k01871J14524N5073m4703j6864J98428
16152F59097B12173L3781K22735K18024A91076J90738K3198Q9882j7409k17681
$$ plain form
16222 903927 1025298 934691 991540 941603 1004355 483292 848472 803681 1050589 796300
16212 796300 757349 549774 1105757 922039 609751 859395 839459 922188 809167 722751
16202 722751 1060104 672676 1210233 1076902 888532 917608 826441 730786 696420 803216
16192 803216 754288 658503 699734 649738 520276 791740 751061 547898 893897 638106
16182 638106 578926 453724 321708 517396 654922 507664 667255 634187 979474 719271
16172 719271 506175 858934 896752 470382 258551 395594 147794 264186 337155 579866
16162 579866 625865 556655 184118 554510 352639 467163 522236 477533 460669 659097
16152 659097 212173 245954 468689 686713 191076 381814 405012 494894 477485 259804
16142B59804I5139J20337L72731K0223l4535B64933H0731L50409n3031M3367H5829
16130B78702R0014j65246Q854L55922j13162j9514A30236K64010J38226k06775
16120C25697l8405J17723A29517L72706C0131N41573k06372A48946J45357J39814
16110D34117I7875J65746r070j08935O5860P3573G5824J46302g3275B06817O1975
16099B68792K5247J40362j95773F3454R1476J05069a16531B74807J3789j07951
16089A80645a4021H4197d6664o3020B57054r6961H634M75032a03886A29711M2066
16078A71777Q233H8369q221J82403G4386C3107d38A06727J85442b6115B99784
16066D6533r61K9114J49375l2594n469A0762L06948J8479A43171K11908a5363
$$ plain form
16142 259804 95139 215476 588207 608430 573895 264933 80731 431140 378109 421476 85829
16130 278702 368716 203470 212324 568246 455084 435570 130236 394246 532472 325697
16120 325697 287292 405015 129517 502223 30131 571704 365332 148946 294303 434117
16110 434117 97875 263621 254551 145616 211476 285049 75824 222126 -73275 206817 268792
16099 268792 294039 434401 238628 63454 154930 259999 -116531 274807 288596 180645
16089 180645 -14021 84197 -46664 -109684 257054 160093 8634 483666 -103886 129711 171777
16078 171777 180010 88369 80148 262551 74386 33107 -438 106727 292169 -26115 299784
16066 46533 45572 74686 224061 191467 185998 10762 317710 336189 143171 355079 -15363
16054i3116A06303b8557n3428I453K93645A1317j344a1662o8945A94825b06594
16042B04545F5795a34836E7572a49780f921k28079B6439K44244b7378B98421A6822
16030D8142l754J01835L8361J2970C6319a57030A13320K21943b41405E1236N7644
16019A08880K00515a47684A43796k9306K0849a16019A59832b63967A61939R9079
16009B61018b87973d1932A83065J3866L31294a47555q0244L1425c139C36845A08489
15997C0427J99874a7164E6871A0108a31525C275K8230J1864J46304K09251p9897
15986C19027j56584J58090K51714F1928L82270D8854J08893E4132a33412m7580
15976a80992P7104B94175H5025a34436N1150A86263b52603G1306J30853A4499
$$ plain form
16054 -93116 106303 -28557 -81985 9453 303098 11317 9973 -11662 -80607 194825 -206594
16042 204545 65795 -134836 57572 -149780 -6921 -235000 26439 270683 -27378 298421 16822
16030 48142 44388 146223 184584 197554 36319 -157030 113320 335263 -241405 51236 108880
16019 108880 309395 -147684 143796 114490 135339 -116019 159832 -263967 161939 261018
16009 261018 -287973 -41932 183065 196931 528225 -147555 -227799 -196374 -3139 336845 108489
15997 30427 230301 -17164 56871 10108 -131525 3275 31505 43369 189673 398924 319027
15986 319027 162443 320533 572247 61928 444198 48854 157747 54132 -133412 -180992
15976 -180992 -103888 294175 85025 -134436 -83286 186263 -252603 71306 202159 14499
15965A51676o3946i9319j87715B03143a00804M0294D08465i4787B50464b69962
15954a2529C63559a7188m9111D9868J12849J11209I4192M8979a99534B92334D2767
15942e5577B2346b43270A28745k0204A8451i77l15121L3555B6019M4584e492j33593
15930a39085K1161c5799B76030c1446F2474a38048N310E4182K0805l3060J21103
15919A63030l2721l8719K3867a66473m6130A92729N202a06153m1165C17094B37
15907F6255a13995J7939j92257b8181p4624A2999a54605D28744a28268r2534M302
15896b16500i0783A67228C4660N096J17853j2472b63345N888a0147A03152i5684
15884b29158c5563k76943J01251O3448B47602b18695J02996O345D4543h1259J6766
$$ plain form
15965 151676 87730 -99319 -287034 203143 -100804 -60510 408465 -94787 250464 -269962
15954 -12529 363559 -17188 -66299 49868 162717 273926 94192 143171 -199534 292334 42767
15942 -55577 22346 -243270 128745 108541 18451 -977 -316098 -282543 26019 70603 -5492 -139085
15930 -139085 -117924 -35799 276030 -31446 62474 -138048 -132738 54182 74987 41927 163030
15919 163030 130309 91590 115457 -166473 -212603 192729 197931 -106153 -147318 317094 237
15907 66255 -113995 -96056 -288313 -28181 -102805 12999 -154605 428744 -128268 -220802 -216500
15896 -216500 -90783 167228 34660 39756 157609 145137 -263345 -257457 -10147 103152 -95684
15884 -229158 -35563 -312506 -211255 -147807 247602 -218695 -115699 -109354 44543 -81259 -64493
15873f4493j10766I0506A7209K979M5044L0082h2830k67556A47559a3858m2443
15862e6301k26597a371A49388J48715A04493a36692B5910d87176A6203L6847b88797
15850I9401B8204a34778B64754C90L02489a23393b2774q60B58490J27749A53656
15838a46602j42292g5028D1470a90259R3079m1467A69K05705E8578A9425c83017
15826a14547b1820j82431g9296B95287H4432e5320j69226J3907h1630A9650e104
15814a06163k0578a2302C24029A04859a52372K0189j17601D1419c65574A20658
15803b82807A9491b98289a3479k70138J37253A67602b27153C11250f2841A81334
15792b7274q4169D76b78441E507c59233a51383L8779l51088J91686a0893j97073
$$ plain form
15873 -64493 -175259 90506 17209 20188 65232 95314 -82830 -350386 147559 -13858 -56301
15862 -56301 -282898 -1371 149388 298103 104493 -136692 25910 -487176 16203 53050 -288797
15850 99401 28204 -134778 264754 390 302879 -123393 -22774 -23634 258490 386239 153656
15838 -146602 -288894 -75028 41470 -190259 -97180 -138647 169 205874 58578 19425 -383017
15826 -114547 -21820 -204251 -79296 295287 84432 -55320 -224546 -210639 -81630 19650 -5104
15814 -106163 -126741 -12302 324029 104859 -152372 -132183 -249784 41419 -365574 120658
15803 -282807 19491 -298289 -13479 -283617 -146364 167602 -227153 311250 -62841 181334
15792 -27274 -111443 476 -278441 5507 -359233 -151383 -112604 -463692 -272006 -10893 -207966
15781b07966i308C5168b29744f9199r4311B82519A35912c62580J56435J9858I2398
15769d2690k03821i4453n6527c2195B2356i7056K7399H4261c22358b7645B85149
15757E8881c62063A12283J4363b3991D8498h0755A7609h8858j61514B7561P1486
15746I9047K3181D0098O9686k3024O1270e9415C6439r490b10160l11031d1928
15734a43625D8582o690a4334F7896g1447j66257A4300a95719F626b5472k20385
15723b45857P7232a9685A57860a48980C9791a71938b658A11938K51056I1553a4221
15711a3450F881R5822b61109C46337C1347j0915i1874m380B3044J43600a61671
15699c6854o4039d9383l8522I1500h7842C6550N895P7823l3698J96582j16051
$$ plain form
15781 -207966 -9308 35168 -229744 -69199 -163510 282519 135912 -362580 -206145 -186287 92398
15769 -42690 -246511 -94453 -150980 -32195 22356 -97056 -69657 84261 -322358 -27645 285149
15757 58881 -362063 112283 126646 -23991 48498 -80755 17609 -88858 -250372 27561 99047
15746 99047 122228 40098 109784 86760 148030 -59415 36439 26949 -210160 -521191 -41928
15734 -143625 48582 41892 -14334 67896 -71447 -237704 14300 -195719 6626 -25472 -245857
15723 -245857 -168625 -19685 157860 -148980 39791 -171938 -2658 111938 362994 91553 -14221
15711 -13450 6881 102703 -261109 346337 31347 20432 -91874 -96254 23044 166644 -161671
15699 -36854 -100893 -49383 -87905 91500 -87842 36550 42445 120268 86570 283152 167101
15688A67101d1686H3682b47473B32900A07257a37104I3070C2241a05387a0865
15677A18932i3061k19245A57153e9164P37o2117b7847F7994J92396a59087B08476
15665a53629e5444A366e6428j89626a7749A357M5753J52397l9047g239l96655
15654d03894E8923b86098H6037a27726M9016A60186m688J43600b16572O0881L99
15643a55292a7835H7591h0223p7125g1444E765k675a37422f4641A66056j127c05939
15630d95435A27854a31245j05623j43822J35500J03400B00742J7851B8718d19393
15619I4325a71613K884C6798e6506n7632Q108o8435F393L22150D5338j5476a25434
15606D2577e7803k2668p5369k557A49109b91137A36584G310c62480a73285b8614
$$ plain form
15688 167101 -41686 83682 -247473 232900 107257 -137104 93070 32241 -105387 -10865
15677 118932 -93061 -312306 157153 -59164 -58427 -120544 -27847 67994 260390 -159087 208476
15665 -153629 -55444 1366 -56428 -246054 -17749 1357 47110 199507 160460 -7239 -403894
15654 -403894 58923 -286098 86037 -127726 -78710 160186 155498 299098 -216572 -155691 -155292
15643 -155292 -17835 87591 -80223 -157348 -71444 5765 3090 -137422 -64641 166056 164929 -305939
15630 -495435 127854 -131245 -236868 -380690 -245190 -141790 200742 218593 28718 -419393
15619 94325 -171613 -168729 36798 -56506 -114138 -106030 -174465 6393 328543 45338 29862 -125434
15606 42577 -57803 -80471 -155840 -158397 149109 -291137 136584 7310 -362480 -173285 -28614
15594A55449a74518j58204a1554q0296O858g407j9180G6060b40889A39124F3451
15582A78930C3157L09056a85626c0355o0357j29648b8684l8388k51978C1668c02308
15570F488c9174B16105i1879J3727A11275e546A44617g161k72895a11666c4828
15558D3382a06149j40787A42117J00344i079G0581a15072d107H6428J79984D1411
15546A91322p2042d2334B60206j11253B3060a55304K2996K1463B06328q9444l4131
15535H2753D232L22260H71L8421c09830N1854G5487a2636G739h2717j2997k12082
15523c07796F0460a73714e4946A21678R8246E0758k2563d7498k92188a54879e3304
15511c9216k765B2750J35873a65308o1831h9696A81508c57188B4913e2150k2011
$$ plain form
15594 155449 -174518 -332722 -11554 -91850 -84992 -7407 -26587 76060 -240889 139124 63451
15582 178930 33157 342213 -185626 -30355 -90712 -220360 -28684 -67072 -319050 31668 -302308
15570 6488 -39174 216105 -91879 -78152 111275 -5546 144617 -7161 -280056 -111666 -34828
15558 43382 -106149 -246936 142117 242461 -9079 70581 -115072 -4107 86428 266412 41411
15546 191322 119280 -42334 260206 148953 23060 -155304 -132308 -110845 206328 116884 82753
15535 82753 4232 326492 871 39292 -309830 -257976 75487 -12636 7739 -82717 -95714 -307796
15523 -307796 60460 -173714 -54946 121678 219924 50758 28195 -47498 -339686 -154879 -53304
15511 -39216 -41981 22750 158623 -165308 -227139 -89696 181508 -357188 24913 -52150 -74161
15500g4161D3918K01650I2127B4038Q2322l1146a65697A73257H6202B5171J6010
15489D1181J81056f959A8326b15687M7994A83575c50104i4541B15099a53003A10211
15477A17502n5542h9980c8411k90087A95972o2302j5442B9771K07529n2909n0569
15466A33822K11338i8725D0346Q9571g8750D0377b2888m9172B08479a72054F2419
15454H0106a05486d5588C18650a53053j15288d8208q3507c5186B78299g4433o6786
15443a41219B67557j01666Q2432L7304H8348e0396P64k0064D0661M5332L62240
15432D48233g1350c0333B19144r4207c4317l11006B27812c33559C16308p2758
15422B43550G2217O9282K878a25080q779B55410D9823c9024K284j29867A59978
$$ plain form
15500 -74161 43918 245568 92127 24038 106360 75214 -165697 173257 86202 25171 41181
15489 41181 222237 -6959 18326 -215687 -167693 183575 -350104 -94541 215099 -153003 110211
15477 117502 61960 -89980 -38411 -328498 195972 133670 118228 29771 237300 184391 133822
15466 133822 345160 -98725 40346 129917 -78750 40377 -22888 -72060 208479 -172054 62419
15454 80106 -105486 -45588 318650 -153053 -268341 -48208 -131715 -35186 278299 -74433 -141219
15443 -141219 267557 165891 248323 285627 88348 -50396 -49632 -69696 40661 85993 448233
15432 448233 -71350 -30333 219144 124937 -34317 -345323 227812 -333559 316308 243550
15422 243550 72217 141499 144377 -125080 -133859 255410 49823 -39024 -36740 -166607 159978
15410a13862j49026h7823C8186K84946B2939J28207j3888B4246g9648A84578a22272
15398E0075f7566K560k61590f3704M270j6073o5526A41385F8707a22844I6344
15386c7250m36187B7518M19038G3647b90296A09785a13999B03672F3162A2638
15375D4091a83212d0658A46866B9955c567B1041a24585L6365C10816A06890d3672
15363h8645k4961D5094a3052C08249j52125l3226d4962B91171r3340k3972b30996
15351E330J01561a0667j3470F7475J82495a9877H8343e3505j8755A9366h0351
15339B01033a44440A97936p0158n2672a43360k63273F470h2136e006C02354E9965
15327c0143C86008b24764d0820H0707n452a8883r2923k4544a6517D9788J17742
$$ plain form
15410 -113862 -262888 -87823 38186 323132 22939 151146 137258 24246 -79648 184578 -122272
15398 50075 -67566 -65006 -326596 -63704 -59434 -75507 -141033 141385 68707 -122844 96344
15386 -37250 -473437 27518 446556 73647 -290296 109785 -113999 203672 63162 12638
15375 44091 -183212 -40658 146866 29955 -3567 21041 -124585 -88220 310816 106890 -43672
15363 -88645 -113606 45094 -13052 308249 156124 122898 -44962 291171 197831 173859 -230996
15351 5330 106891 -10667 -24137 67475 249970 -19877 88343 -53505 -72260 19366 -80351
15339 201033 -144440 197936 127778 75106 -143360 -406633 6470 -82136 -5006 302354 59965
15327 -30143 386008 -224764 -40820 80707 75255 -18883 -111806 -136350 -16517 49788 167530
15316A67530R2681o2075C5393i3524C8316K24201E7817e0235A69863n556m0734
15305A23573L37I401N0547O9550g6529n20847b82708b2172A21919E0670B453c27904
15292B6071b4453l3407O389I0153L502a44782C67084c50073a57645f5227k11703
15281b76930B15041F6305K1144f7897j62244B7919a05987D31876E2916R9652F4656
15269I3706N6294j2828E4387E291M1143a05424B1861J41567a74664A04871b41146
15257C45565d6325B23364a24366c1894B23059a3718k736j141A16512B5767g5432
15245c7534p1917B21794J20946G4928e5504D229K861e3670B9147R2724B5751c44265
15232b18805i8580k31428C31569r5643r7395a04153M5836b2494A82654b5548m1920
$$ plain form
15316 167530 260211 198136 35393 -93524 38316 262517 57817 -50235 169863 164307 123573
15305 123573 123910 9401 59948 129498 -76529 -597376 -282708 -22172 121919 50670 2453 -327904
15292 26071 -24453 -57860 -51471 90153 93655 -144782 367084 -350073 -157645 -65227 -276930
15281 -276930 215041 66305 87449 -67897 -230141 27919 -105987 431876 52916 152568 64656
15269 93706 150000 137172 54387 5291 46434 -105424 21861 163428 -174664 104871 -241146
15257 345565 -46325 223364 -124366 -31894 223059 -13718 -16454 -17595 116512 25767 -75432
15245 -37534 -109451 221794 342740 74928 -55504 4229 7090 -53670 29147 121871 25751 -344265
15232 -218805 -98580 -330008 331569 235926 138531 -104153 -58317 -22494 182654 -25548 -67468
15221f7468A07479e8877C62645a1489p7892K7379p7927A09069k1151J36050P3366
15210B97334a90230c2921C0018c6523j73364B3260a83983A43958a38462B34538
15199B98132D7610M1683J00278a35146A75228k0586o6887D2199a99351A03549
15188A08629m6868g0472A35834b2965r8582q2480D0066b11894D26378A30290b54988
15176b08148G0382J60382a89442J2348A31213k5638J45940e8538a8538k16840
15166b35378b4985H9780M5343m4203P6518e549j17429C1045K83572b10087E0553
15154g1698b3500A17385k5970p135a47870G0393K46929b18311A61368a5247p1573
15143h6820A43182P0875f56A04868B783J4546J39414J52258E7521b05793G710
$$ plain form
15221 -67468 107479 -58877 362645 -11489 -89381 -62002 -139929 109069 87918 223968 297334
15210 297334 -190230 -32921 30018 -36523 -209887 23260 -183983 143958 -138462 234538
15199 298132 47610 89293 189571 -135146 175228 154642 87755 42199 -199351 103549
15188 108629 61761 -70472 135834 -22965 -121547 -204027 40066 -211894 426378 130290 -254988
15176 -208148 70382 230764 -189442 -177094 131213 105575 251515 -58538 -18538 -235378
15166 -235378 -24985 89780 135123 90920 167438 -5549 -122978 31045 314617 -210087 50553
15154 -71698 -23500 117385 91415 84280 -147870 70393 317322 -218311 161368 -15247 -86820
15143 -86820 143182 214057 -656 104868 2783 17329 156743 309001 57521 -205793 7710
15131f4206j62571D49923c7338A99997i449B14885j00610P2282K33100A30500
15120f18I5887b14947A28398K25237g8610A68605a14661E9437j7957d9638l1625
15109h1263G9221f1855E07847k31711F6803J10076k8024j0320b66566J04286D1144
15097B31145L3845g6382o8100q3506C29628j59267F5967K14346j34316E031L45970
15086C51001j30678K5781J62775A22422a91417e0935j67202h2865c0123G5586
15075A33510m7252e2490F4217j150b63627g0068j4075B58211j09562N1874H5787
15063C53723H5061P3251k4822d3129k307D31837b4366B1748b14363A8313N5221
15052G3534a0197n0165A37690a4123A67144O3602K2094b16B7842L47369r6162
$$ plain form
15131 -64206 -226777 449923 -37338 199997 -9449 214885 114275 186557 419657 130500
15120 -618 95887 -214947 128398 353635 -78610 168605 -114661 59437 41480 -49638 -81263
15109 -81263 79221 -61855 507847 276136 66803 176879 148855 138535 -266566 -162280 41144
15097 231145 264990 -76382 -144482 -227988 329628 170361 65967 280313 145997 5031 351001
15086 351001 220323 246104 408879 122422 -191417 -50935 -218137 -82865 -30123 75586
15075 133510 86258 -52490 64217 63067 -263627 -70068 -84143 258211 148649 200523 85787
15063 353723 85061 158312 133490 -43129 -45436 431837 -24366 21748 -214363 18313 73534
15052 73534 -10197 -60362 137690 -14123 167144 230746 252840 -216 27842 375211 279049
15041B79049H9188N3669J40423b6793A36898a68406A00459N2103K66976j09324
15031C10214c3988C69655j55619L5779p9172H3483R2177J7663O2433G6379J96779
15020B73158o9364d1345C77084K21445c5210B58079L3206O0930j32460D005J14451
15009A18456j8313Q6951J32977m0523q7248F8786C0573L01715D0143K01718n8518
14998A83343J3021d2904A97014J29278p4529P4486a5319E26391j04602A47371
14987C57994A12370N5979J32501j41750J48857r6836L5698P3041E3607a33744
14976b7604C80487Q9364J15531j66358j53403K65857N5239B67823O0105K2669
14966C50597p6182O5948G173N32129k06302J45129j05808j19786d1572B94294
$$ plain form
15041 279049 89188 142857 283280 -26793 136898 -168406 100459 152562 419538 310214
15031 310214 -33988 369655 214036 249815 170643 83483 175660 193323 255756 76379 273158
15020 273158 203794 -41345 377084 598529 -35210 258079 291285 352215 219755 4005 118456
15009 118456 100143 187094 320071 279548 192300 68786 30573 332288 40143 241861 183343
14998 183343 196364 -42904 197014 326292 251763 326249 -15319 526391 421789 147371
14987 357994 112370 168349 300850 159100 307957 211121 246819 319860 53607 -133744
14976 -27604 380487 469851 585382 419024 265621 531478 586717 267823 327928 350597
14966 350597 274415 340363 7173 539302 333000 478129 372321 252535 -41572 294294
14955E4771d3354j86080E03394G9835B328L49941a1622C97986A44741P2539K56224
14944D73504q5973l0602D3253J96678M9031n9290M0904K1140g1698D09640B00681
14932A86531J35801l9587j01931R6088j5796J73204F2757J98560M1050L21165
14922F23532q8345Q4882B74723M58589B46871L69721B85898N22740j80699J25408
14912G53347r0470r5418P1335j29846O0257M1897B93732q8638O4618J17603H7743
14900B00193I8172N8274K92747I0765K45496k179j55940J04534l918P3304b7490
14888A05995J6512J83471J20771L8263A28915L96219k35807j24336N26600B56566
14877A89801N360O7536p1100H6169k606J73163J61671l5783J27995k34146K48718
$$ plain form
14955 54771 -43354 -229434 503394 79835 2328 352269 -11622 397986 144741 217280 473504
14944 473504 387531 356929 43253 239931 288962 229672 270576 291716 -71698 409640 200681
14932 186531 322332 282745 180814 276902 261106 434310 62757 261317 302367 623532
14922 623532 535187 620069 274723 733312 246871 616592 285898 808638 627939 753347
14912 753347 662877 567459 638794 508948 569205 611102 293732 205094 269712 387315 87743
14900 200193 98172 156446 449193 90765 336261 334082 178142 282676 278758 352062 -27490
14888 105995 122507 305978 426749 465012 128915 525134 289327 164991 691591 256566
14877 189801 195161 262697 191597 86169 83563 256726 418397 382614 510609 276463 525181
14866E25181P5074B74821J14140m096r8575m0675l8289J87165I00K2264M57628
14855D80792A85683K73181j3788j0136J3572B7088K84311K27732A16869K65725
14845C82594A275K48154P5047O7052P2844J86791k66156N583R1956A97416K76197
14834D73613L98360G7263M49088J86022k28354B36854J3966o2651J66351J12059
14824D66579L984J25001C7894N53941k62198N2930R1565I1833b4254B13493K59817
14813D73310J98342l5358j49424J20377j03215j03966j09195j39877K18385p7362
14803B92017K07113q2943A10926L55963A96733K37756p7871j4889j24716L08663
14793E25676j76689K92101P2866k86300j06183m3988K30952J96545k19060m4320
$$ plain form
14866 525181 600255 274821 388961 384865 286290 245615 207326 394491 900 23164 480792
14855 480792 185683 458864 445076 434940 448512 27088 311399 539131 116869 382594
14845 382594 1275 249429 324476 391528 464372 651163 385007 390590 482546 197416 473613
14834 473613 871973 77263 526351 712373 484019 236854 250820 188169 354520 466579
14824 466579 470563 595564 37894 591835 329637 382567 474132 91833 -24254 213493 473310
14813 473310 671652 636294 486870 607247 504032 400066 290871 150994 369379 292017
14803 292017 499130 416187 110926 466889 196733 434489 356618 341729 217013 525676
14793 525676 348987 641088 713954 427654 321471 277483 508435 704980 485920 441600
14783D41600N3213j06705J33228n8722K32690j46012k63092K57530j49041R7866
14773D92555j73016K01117j06499k05375L03994p5822J3181J34183M9898k92101
14763C42115k5133N8181L38410k35795J50724n7983j43500K16326p656j03015
14753E32674J3089j82593O6996L83153k48943R3178k16998M15084l69180k36226
14743B50234q056L48583j60112J57033N8231k32371J30234k17346K46307J7227
14733E89964J99126J78432l26243j28646j08944j36681M36140j12083J90744J2168
14723G93977Q0183k82152L67015l84766j76481L72019O2321l04952J18261K53618
14713H99043q7324k62504K87332K5637k51680k31628M22524j75199K88410k68750
$$ plain form
14783 441600 494813 388108 521336 462614 695304 549292 286200 543730 394689 492555
14773 492555 319539 520656 414157 208782 512776 436954 450135 584318 634216 342115
14763 342115 316982 375163 713573 477778 628502 570519 427019 643345 635689 532674
14753 532674 545763 363170 430166 813319 564376 657554 440556 855640 486460 250234
14743 250234 242178 590761 430649 587682 645913 413542 543776 326430 572737 589964
14733 589964 789090 967522 641279 512633 403689 267008 703148 591065 781809 793977
14723 793977 874160 592008 959023 574257 397776 769795 832116 527164 645425 899043
14713 899043 811719 549215 836547 862184 610504 378876 801400 626201 914611 645861
14703F45861p263M6115N5170j89272L57133k21898L8021P8107q7102j21979J77382
14692G70275r7612J36657j01728Q4502J82237l87497J8742M14430m47780P3068
14682F45294K27182j33544K67695k81147n4535J80367j08094r0219P7745Q6484
14672H17228j00311K045L22571m4608j94192o4204j6198r3113J88346J1680j6505
14661H12739L25823j89710j87788N6517P4513L2775N0949P7974E08345O17686
14651A126031j81114j20899j54j64580M03059j6072l78825O4934K56512l03985
14641F84907M35043o2751j17938O7874R3318J52951j01449k64285J21472Q686
14631A017828l77051M60868O7256J27834j77001K19027j97096M7255j02451k37329
$$ plain form
14703 645861 638598 684713 739883 550611 907744 685846 723867 801974 714872 592893 770275
14692 770275 672663 809320 707592 792094 974331 586834 605576 1020006 572226 645294
14682 645294 872476 738932 1006627 725480 670945 851312 743218 652999 730744 817228
14672 817228 716917 718962 1041533 996925 802733 738529 722331 629218 817564 829244 812739
14661 812739 1138562 948852 761064 817581 892094 924869 975818 1053792 508345 1126031
14651 1126031 944917 824018 823864 659284 1062343 1046271 667446 732380 988892 684907
14641 684907 1119950 1057199 939261 1007135 1100453 1253404 1151955 887670 1009142 1017828
14631 1017828 640777 1101645 1168901 1296735 1119734 1338761 1141665 1188920 1086469 849140
14621H49140K43161j90621J40655n9563L75445m35440K73381j63403J64276l6305
14611A160726j02825J65060j96442K2476O4910j13719K37098j19480k47484L72340
14601A242660P4999J12941l1952K9935l7052j00328K84144o9684j12440J31691
14591A524914q4722Q9905P011j35889L5346R9349L56284l11285j7503j97039J30693
14580A497064R2311j29602J57105j82830J75984J38968j57901P6795r3953L22903
14570A896844p8256j79646J78879K79073m13323J27766q6059j8893P39400m71867
14560A973918J3300L63644O0941K21902K90376n7884L26980N55743M27404Q12837
14550D989161J306030K553910L506025O112934O475017j602931q030610o903453
$$ plain form
14621 849140 1092301 901680 1042335 982772 1358217 922777 1196158 1032755 1197031 1160726
14611 1160726 1057901 1222961 1026519 1048995 1113905 1000186 1237284 1117804 870320 1242660
14601 1242660 1317659 1430600 1398648 1428583 1391531 1291203 1575347 1505663 1393223 1524914
14591 1524914 1440192 1530097 1537108 1401219 1436565 1535914 1892198 1580913 1563410 1366371 1497064
14580 1497064 1589375 1459773 1616878 1434048 1610032 1749000 1591099 1667894 1573941 1896844
14570 1896844 1818588 1638942 1817821 2096894 1683571 1811337 1725278 1706385 2445785 1973918
14560 1973918 1987218 2350862 2411803 2633705 2924081 2866197 3193177 3748920 4176324 4989161
14550 4989161 6295191 8849101 12355126 18468060 24943077 23340146 15309536 8406083
14542H406083k918685j516944j011272m33809l3358l41258r520J01531j88634
14533B054134j7116r7394Q4662K21875j34368l00015o4269J665O2345J88170k51373
14522A748316N61457m89192K38423j23355o8383P7157K47399j18664K23123j50456
14512B145825P2564l83385K65925k8883J35589n4071K64335J19241j83627J86410
14502B539923p0542K6560Q1416P7146j13244N963J1742j69655J89512n8191L96667
14491B917297k47856K59908j16670l06134J76847J84075J65826n7534J42401j23018
14481B995142k39310O95820l63305j8972J76401k62693M44733j79027J35027k7435
14471C356381L0212J25126n860r104Q2871R3217K4082M2046J92146p5848o916
$$ plain form
14542 8406083 5487398 3970454 2959182 2525373 2492015 2150757 2141237 2242768 2054134
14533 2054134 2037018 1939624 2024286 2246161 2111793 1811778 1747509 1749174 1811519 1999689 1748316
14522 1748316 2309773 1820581 2059004 1935649 1867266 1944423 2191822 2073158 2296281 2145825
14512 2145825 2218389 1835004 2100929 2072046 2207635 2153564 2417899 2537140 2353513 2539923
14502 2539923 2469381 2495941 2577357 2654503 2541259 2547222 2558964 2389309 2578821 2520630 2917297
14491 2917297 2669441 2929349 2812679 2506545 2683392 2867467 3033293 2975759 3118160 2995142
14481 2995142 2755832 3451652 3088347 3069375 3245776 2983083 3427816 3248789 3383816 3356381
14471 3356381 3386593 3511719 3505859 3496755 3579626 3672843 3696925 3738971 3931117 3855269 3848353
14460C848353J89118j94474k3107J89685n7804K4414J80713j56067K09523K07290
14450D417644J57832k38460J33845N4617J15105Q6404J01713k84761K74055K05206
14440E023200p1905k7173M26623k00631K32490o9811j3506J55465J7595K80310
14430E752657r0244o0401J40226J30633j99603J17466N5474O9510M39430L74136
14420F729284k12367k32020K51885J17604M5866J40592J79445R5254O4673J60668
14410G340884J62984K26903j92802K74249o219j03343K44455L65183J18155j44216
14400H286233J40335M91761l5749J31209K76407j44771L47881L54414J63948n3168
14390I958500L52541k23730P92454k61742K15466O11022l8926J56467K5803K48363
$$ plain form
14460 3848353 4037471 3842997 3819890 4009575 3951771 3976185 4156898 4000831 4210354 4417644
14450 4417644 4575476 4337016 4470861 4525478 4640583 4726987 4828700 4543939 4817994 5023200
14440 5023200 4951295 4924122 5350745 5150114 5382604 5312793 5299287 5454752 5472347 5752657
14430 5752657 5662413 5602012 5742238 5872871 5673268 5790734 5846208 5915718 6355148 6729284
14420 6729284 6516917 6284897 6536782 6654386 6700252 6840844 7020289 7115543 7180216 7340884
14410 7340884 7503868 7730771 7537969 7812218 7805999 7702656 7947111 8312294 8430449 8286233
14400 8286233 8426568 8918329 8882580 9013789 9290196 9145425 9493306 9847720 10011668 9958500
14390 9958500 10311041 10087311 10879765 10618023 10833489 11444511 11405585 11562052 11587855 11836218
14380A1836218L71121K72505M66286r9N3223K00808O48453K87542L05838R1073
14370A4532968J09815M67866M14201L32376R4212M67923M40315L79862M76720
14361A7716258L19432L50099J33339Q80962Q4858K95764O87647N50853N52400
14352B1571612L74567O57369Q91340J63036N24998J170487J52468Q20751Q99180
14343B7225808N13350P27947P90812J098122M88282J346797O30567Q16892J292573
14334C4931150J023325J166514Q67956J451955J243826R01318J856517J458859
14326D4901420J240669J785061J522771K147716J440341J842747K101673J818303
14318E8800701K332267K484440K191231K520173K977324K489531L136014L548063
$$ plain form
14380 11836218 12207339 12479844 12946130 12946031 12999254 13200062 13848515 14136057 14441895 14532968
14370 14532968 14642783 15110649 15524850 15857226 15951438 16419361 16859676 17239538 17716258
14361 17716258 18035690 18385789 18519128 19400090 19484948 19780712 20468359 21019212 21571612
14352 21571612 21946179 22603548 23494888 23657924 24182922 25353409 25505877 26326628 27225808
14343 27225808 27739158 28467105 29257917 30356039 30844321 32191118 32821685 33638577 34931150
14334 34931150 35954475 37120989 37988945 39440900 40684726 41586044 43442561 44901420
14326 44901420 46142089 47927150 49449921 51597637 53037978 54880725 56982398 58800701
14318 58800701 61132968 63617408 65808639 68328812 71306136 73795667 76931681 80479744
14310H0479744L103663L644300L698689M172817M173392M346785M808986M795956
14302A13224332N681825N504271O268532O318827O742292P416195P840900Q249037
14294A67246211Q657591R543905R273263J0616371J0991068J1240202J2221110
14287B39789721J2606069J2693229J3796880J3798960J3536685J4354036J4006284
14280C34581864J3758923J3108541J2571963J1565400J0437143Q482535P082010
14273D11588379M999976J748356L35237j284833k329716l406395n322725p565219
14265C98763060r632588j1343117j2548078j3586863j3923465j4095047j4745732
14258C08888170j3935212j4033261j3706209j2866535j2761023j2372335j1826728
$$ plain form
14310 80479744 83583407 87227707 90926396 95099213 99272605 103619390 108428376 113224332
14302 113224332 118906157 124410428 130678960 136997787 143740079 151156274 158997174 167246211
14294 167246211 175903802 185447707 194720970 205337341 216328409 227568611 239789721
14287 239789721 252395790 265089019 278885899 292684859 306221544 320575580 334581864
14280 334581864 348340787 361449328 374021291 385586691 396023834 404506369 411588379
14273 411588379 416588355 418336711 418671948 417387115 415057399 411651004 406328279 398763060
14265 398763060 389130472 377787355 365239277 351652414 337728949 323633902 308888170
14258 308888170 294952958 280919697 267213488 254346953 241585930 229213595 217386867
14251B17386867j1138436j0303021r950408r564913r023009p945143q264381p243847
14243A43953709o619291o492172o577046n905478n486422m902423m746076m329996
14235I8894805m340573m195500l740282l620843l524740k969137l381903k808273
14227G0313554k806815k242187k624921k560333k262686j833542j658688k270135
14219E2054247j687237j467949k164003j466808j193269j672809j440866j237107
14211C9724199j366780j085405q99450r95113q40543j309765r85851p03251j246787
14202C0291254k85490q78977p32976q88322r42815m42203q73488n91897k21443
14193B4433643r96883k00015p58340n18110m91390p18481n62191n7028l83239
$$ plain form
14251 217386867 206248431 195945410 185995002 176430089 167407080 159461937 151197556 143953709
14243 143953709 137334418 130842246 124265200 118359722 112873300 107970877 103224801 98894805
14235 98894805 94554232 90358732 86618450 82997607 79472867 76503730 73121827 70313554
14227 70313554 67506739 65264552 62639631 60079298 57816612 55983070 54324382 52054247
14219 52054247 50367010 48899061 46735058 45268250 44074981 42402172 40961306 39724199
14211 39724199 38357419 37272014 36372564 35377451 34536908 33227143 32241292 31538041 30291254
14202 30291254 30005764 29126787 28393811 27505489 26562674 26120471 25246983 24655086 24433643
14193 24433643 23436760 23236745 22478405 21960295 21468905 20750424 20188233 20131205 19747966
14184A9747966q27019k73514l48796k95381p19618j12377l39577m37726m58461
14175A5935497l06980l34990m80787N3209n45585j21909k94722l44748j99727
14166A3359258m73655M0804r5078p59360r9138j64194j44369k11637J60634n55919
14156A1057346j8604o06958k13118K22019m83578Q9185j977l77638q9596j20154
14146I456927m69459q6820K34741m29085o973l75987j63748K18678j22158n02091
14136G754025J27851p884j90226J22768l26621L5592m45907p8027J34156l73644
14126F752083l6666j10740N1835o8487k05029r4418L30013j65378l93033K79342
14116F339522l32461m82475J49275P359k18753l46186J22827J26632J52768O1940
$$ plain form
14184 19747966 18920947 18647433 18298637 18003256 17283638 17171261 16831684 16393958 15935497
14175 15935497 15628517 15293527 14812740 14865949 14320364 14198455 13903733 13558985 13359258
14166 13359258 12885603 12926407 12831329 12071969 11972831 11808637 11664268 11452631 11613265 11057346
14156 11057346 11038742 10431784 10218666 10440685 9957107 10046292 10044315 9666677 9577081 9456927
14146 9456927 8987468 8900648 9135389 8706304 8699331 8323344 8159596 8378274 8256116 7754025
14136 7754025 7881876 7873992 7683766 7806534 7479913 7515505 7069598 6991571 7125727 6752083
14126 6752083 6715417 6604677 6656512 6588025 6382996 6288578 6618591 6453213 6060180 6339522
14116 6339522 6007061 5524586 5673861 5681220 5462467 5116281 5239108 5365740 5518508 5580448
14106E580448l28245k28093k8497m4902J27648q8358m796k92373J9585k80467
14096D431950N58433o99605J77771j2982k19526M73024m06809j04777K84150l73535
14086D108094K20277m34479K32634k29565J89725k17671j47484J03325j57131
14077C667725N5298J98786m47442L32844n15362K6406O53763k30284k03947O230
14067C544017j72746j72099J28235N1158n2951j10716N9215k94702k9551Q6943
14057C036803K74974k10780j80252N0604O6194m693o29206M37487J36409O3133
14047C040673L0714m44220M04964l34563k25420n5251K75948k77198l80405Q63303
14037B898545k55925j49390q4913L13471j08301l88888J66625m9555j15418M0655
$$ plain form
14106 5580448 5252203 5024110 4995613 4950711 5078359 4990001 4985205 4692832 4712417 4431950
14096 4431950 4990383 4290778 4468549 4455567 4236041 4709065 4302256 4197479 4481629 4108094
14086 4108094 4328371 3893892 4126526 3896961 4086686 3869015 3721531 3824856 3667725
14077 3667725 3723023 3921809 3474367 3807211 3291849 3318255 3972018 3741734 3537787 3544017
14067 3544017 3371271 3199172 3327407 3378565 3325614 3214898 3274113 2979411 2949860 3036803
14057 3036803 3311777 3100997 2920745 2971349 3037543 3032850 2403644 2841131 2977540 3040673
14047 3040673 3071387 2627167 3032131 2697568 2472148 2416897 2692845 2415647 2035242 2898545
14037 2898545 2642620 2493230 2408317 2721788 2613487 2224599 2391224 2341669 2226251 2266906
14027B266906k64632N37455k78667P38L17917o47983K21693j49192r2174K87155
14017B199216j15381K25296j67218j09179K88682l09243m28774R0700K80324m1703
14007A912720M8018K77148o6267j79012J05333l46086l14785Q82220m90162j58868
13997A670259K74739k53744N14560k7293L50597J82191K49312J008607J380987
13988E350215L467899N799399P571340K564946o225082o525909l561746k364611
13980F076451j246164p61867n44541p75522K84265n86368j43640L5878K02408
13971B540900l73989K266M30518m03584j62122k6201l4778k0286k0021n6266k11138
13960A665299R7134P0568m5381j8939k71986J03128n289P1594K97212l83370K36578
$$ plain form
14027 2266906 2002274 2539729 2261062 2261800 2579717 1931734 2153427 2004235 1912061 2199216
14017 2199216 2083835 2309131 2141913 2032734 2321416 2012173 1583399 1674099 1954423 1912720
14007 1912720 1960738 2237886 2171619 1992607 2097940 1751854 1437069 2319289 1829127 1670259
13997 1670259 1944998 1691254 2205814 2178521 2529118 2711309 2960621 3969228 5350215
13988 5350215 8818114 14617513 22188853 24753799 18528717 12002808 8441062 6076451
13980 6076451 4830287 4068420 3523879 2748357 3032622 2446254 2302614 2338492 2540900
13971 2540900 2166911 2169177 2599695 2196111 2033989 2007788 1973010 1952724 1932703 1876437 1665299
13960 1665299 1762433 1833001 1787620 1768681 1496695 1599823 1594534 1666128 1963340 1579970 1816548
13949A816548n12206K83192j33956L32562k63037j12445L99921o3001k78244M299
13939A473633j36921J25326p8901J13628k36378K54413j03143l20713q4710M68061
13929A474295n16089M95124j89048L55095n12729R5817M35751k66168l9556n5325
13919A277167o3765j34146K83547J19375j06821j13170j32093j16986K08596J14525
13909A336229j62828l65742L07614P5857m6012L26108m48970J62908j01878K04258
13899A287544l37174k2094K16243Q7568m6038P4501j15886J72813j52053n4210
13889A111214j71994j00746K46355k18418L589J98454n5978o0505O0249J05616
13879A117836J58931k96384J5495j04228q554k35094M45062m40519M05823n03076
$$ plain form
13949 1816548 1304342 1587534 1453578 1786140 1523103 1410658 1810579 1747578 1469334 1473633
13939 1473633 1336712 1462038 1383137 1496765 1260387 1514800 1411657 1090944 1006234 1474295
13929 1474295 958206 1453330 1264282 1619377 1106648 1202465 1638216 1372048 1332492 1277167
13919 1277167 1213402 1079256 1362803 1482178 1375357 1262187 1130094 1013108 1221704 1336229
13909 1336229 1173401 807659 1115273 1191130 1145118 1471226 1022256 1185164 1083286 1287544
13899 1287544 950370 928276 1144519 1232087 1186049 1260550 1144664 1317477 1165424 1111214
13889 1111214 939220 838474 1084829 866411 870000 1068454 1012476 951971 1012220 1117836
13879 1117836 1276767 980383 995878 891650 883096 648002 1093064 652545 1058368 555292
13869E55292L45661j94699L55654l13151k1011K23862O1649m91753L05866k76728
13859E50642M72494k07725p2745o0669O8434J45581o0621j38886K35722R4989
13849A027216p2545j54129J30386Q5543l85210K7970O1348J12003l6149Q8001
13839H84434j94932K8388J87888J0434l75433J93596j24320K55800J65290D29379
13828E32880J85570J27074k30378L59645l03945J13169j9019L2792j03621l05235
13818C88932L08924j10619J44426R4271k65386L29297k91466L57340j53829j53956
13808F47934j84037J16421L14937l33443L10594k1193j70405J40583k10601M1927
13798F52717P4734J43176J37857m10866j13536M94917l83862J94521k84613K22403
$$ plain form
13869 555292 900953 706254 1061908 748757 727746 951608 1013257 521504 827370 550642
13859 550642 1023136 815411 742666 681997 750431 896012 835391 696505 932227 1027216
13849 1027216 954671 800542 930928 1016471 631261 659231 720579 832582 796433 884434
13839 884434 689502 717890 905778 916212 540779 734375 610055 865855 1031145 429379
13828 532880 718450 845524 615146 974791 670846 784015 764996 797788 694167 388932
13818 388932 697856 587237 731663 825934 560548 889845 598379 955719 801890 647934
13808 647934 463897 580318 895255 561812 872406 851213 680808 821391 610790 652717
13798 652717 727451 870627 1008484 597618 484082 978999 595137 789658 505045 727448
13788G27448q4864n8479N5734o0343k8811K62201j04367l13299K29574j85689
13778D39105L374P6827K33634l21885J40313j49237k0791M51426j08026A69266
13767E87337J4659j21930O6347J70466B72735O02170j22147l13474K45621k7089
13757F57816J1061J24840Q0951l69925Q2219O7465k00966K20212J9103J94171
13747H86947D36269K70268J41723m16072L3138p8612J07681q7683R6740R2843
13737E96295J44425k81753j05960N558A41324N28894J98077B72113K50107K7356
13727E49576J41748l8361C11965K68806k19167A48438K73181q0693J96707m8526
13717D89107j90246j4514J38866j37494K46229j53705j46714J1463H6637M55830
$$ plain form
13788 727448 642584 584105 639839 579496 550685 812886 708519 395220 624794 439105
13778 439105 442479 519306 752940 431055 571368 422131 401340 852766 744740 169266
13767 587337 601996 480066 546413 716879 272735 874905 752758 439284 684905 657816
13757 657816 668877 793717 874668 504743 586962 654427 453461 673673 692776 886947
13747 886947 436269 706537 848260 432188 465326 386714 494395 406712 503452 596295
13737 596295 740720 458967 353007 358565 141324 670218 868295 272113 522220 549576
13727 549576 691324 652963 311965 580771 361604 148438 421619 340926 537633 489107
13717 489107 298861 284347 423213 285719 531948 378243 231529 242992 86637 542467
13707E42467R0144j42375j74243H5773L21297J8028l639j19065R4287n4481r6878
13696B45322J14491J57286A63188J77994j56227L44888r9231j27464J06782j03505
13686C06425L41490k04198A65932L29264J5237k6607r4990K19208j52899j17929
13676C37216J69337J11861B99296o2675O2855K03934j10018L9474J29497j11355
13666D51008j60756J23543J7600j10232K79304k26317J30523q9178A73783K47608
13656D21391K70200A76517J78711J97022j3782A57051J28656Q7796o0314A15587
13645B28832K01431A15674K16882A32580J50207J16942F2435K76578j41851J26796
13635C23958A14299L95425A20690K39845L7021j03709A32189L93653p7329k09485
$$ plain form
13707 542467 632611 490236 315993 85773 407070 425098 421459 302394 396681 342200 245322
13696 245322 359813 517099 163188 341182 184955 529843 430612 303148 409930 306425
13686 306425 647915 443717 165932 495196 510433 483826 388836 608044 455145 337216
13676 337216 506553 618414 299296 236621 299476 503410 393392 432866 562363 451008
13666 451008 290252 413795 431395 321163 600467 374150 504673 415495 173783 421391
13656 421391 691591 176517 355228 552250 538468 157051 285707 373503 313189 115587
13645 228832 430263 115674 332556 132580 282787 399729 62435 339013 197162 323958
13635 323958 114299 509724 120690 360535 397556 293847 132189 525842 448513 239028
13625B39028L7717j7821Q6088Q0735k02805F8672O2161K66036K31774j58970B27909
13613B97323E4595O14668k24081A97343g721C26033J14993j47407j10969E2756
13602C57848J74543B40096L35268k32421A41899n0617b15577B66592l5057o0563
13592A70972J7403K91703j88856O6764M9963J535A53070K91274A75639K90559
13582D66198N5399A68304L14016j44250j14351j4832Q3541J32569F2590K27948
13572B90538K31541I7169J09496G4262K94866J00793j4869q4946n6436j00032
13562B13638k5012H1575J72571n447J05437M5545L4869A79815o3609L14584A62385
13550H6559C0817K71129j7692J34687A20954K50524K4958A64887a64755B36310
$$ plain form
13625 239028 276745 258924 345012 425747 222942 68672 130833 396869 628643 469673 227909
13613 297323 54595 669263 445182 197343 -7721 326033 441026 293619 182650 52756
13602 357848 532391 240096 575364 342943 141899 91282 -215577 266592 231535 170972
13592 170972 188375 480078 291222 357986 407949 409484 153070 444344 175639 466198
13582 466198 521597 168304 482320 338070 223719 208887 292428 424997 62590 290538
13572 290538 522079 97169 206665 74262 369128 469921 455052 370106 313670 213638
13562 213638 188626 81575 254146 248699 354136 399681 434550 179815 116206 430790 162385
13550 86559 30817 301946 284254 418941 120954 371478 396436 164887 -164755 236310
13539A61369B1239K69025K6637J90779j30121C4302D698b3815A33834J11114R7407
13528C42355j10999o3797k273k9671K06424Q4122F0382K13925D5885J45256J46585
13517C37726A43013M4781m7878P2949a3431E15897q0486E8317K61886A3965M88435
13506E02400A00999K80627A65453h0836C8167J90189j4471F5173J94064I2802
13495A73902P5284J00517G6078J58919r6169J93618o7259L82878H7195Q7098L1265
13484B05558p4430K2096e764A88440P8168l0177O4199j44175J48054K3985F1911
13472C86284A47443d1535F6940L3194K46343c5135B7222J43296q4752A0112J77105
13461A87217J55625j03005r8335O3802r7056K38963D6146N8340B3705J8523J45282
$$ plain form
13539 161369 21239 290264 316901 507680 377559 34302 4698 -23815 133834 244948 342355
13528 342355 231356 167559 165286 135615 342039 426161 60382 274307 45885 191141 337726
13517 337726 143013 187794 139916 212865 -13431 515897 435411 58317 320203 13965 502400
13506 502400 100999 381626 165453 -80836 38167 228356 213885 65173 259237 92802
13495 173902 249186 349703 76078 234997 138828 332446 265187 648065 87195 174293 205558
13484 205558 131128 153224 -5764 188440 266608 236431 300630 156455 304509 328494 61911
13472 386284 147443 -41535 66940 100134 346477 -35135 27222 170518 85766 10112 187217
13461 187217 342842 239837 141502 205304 108248 347211 46146 104486 23705 42228 187510
13450A87510o4322J98257n6033P832j06592c2402j96607A78546L20290B6706P3747
13439A00453d8101B07250J11533G3633J0425J32908P6066k21a51329A33455K02845
13428C36300E0202d235C07890b46661D38395B6545c8761B75488j7686b34579B33841
13416D0050a98345B27180l7630c6325B55179a22318C06028K11584j78260A36326
13405B07630K36377A17449J6149E1673J78003F1348L73490B9974Q8412P3495f432
13393B06388N8403M1J65947B0915J85512J37302A828J64123B9861c6940l8057
13382g4997C20989J82516C9875h7840C0703e8023E36348B62052Q5392q0089D3452
13370h6213A6209J57739Q7290M6128b85791B64740j10080J43351l3477a43282
$$ plain form
13450 187510 123188 321445 265412 273244 166652 -32402 -229009 178546 498836 26706 100453
13439 100453 -48101 207250 318783 73633 84058 216966 293032 292811 -151329 133455 336300
13428 336300 50202 -4235 307890 -246661 438395 26545 -38761 275488 257802 -234579 233841
13416 40050 -198345 227180 189550 -36325 255179 -122318 306028 517612 339352 136326
13405 207630 444007 117449 133598 51673 229676 61348 434838 29974 118386 191881 -6432
13393 206388 264791 264832 430779 20915 206427 343729 1828 165951 29861 -36940 -74997
13382 -74997 320989 503505 39875 -87840 30703 -58023 536348 262052 347444 267355 43452
13370 -86213 16209 173948 261238 307366 -285791 264740 154660 298011 264534 -143282
13359A98070c6160A33055R7770K15332B05840B1394j0554g9393B37916m09J40190
13348C77697c6718C25156r2414I4564B0931g6360B13604a33281B52528C308K04398
13337B07706K18447j47046K6147A41433B5917J84099J53286D3389g0911I3547
13326D45801C2833K97067a92208B76797J14526j2935G1288J85268A00654K8619
13316A29273K21954A20862K95293F291K3577K72771r3290d2930F56J20559L60591
13305D81806E3632O1817A8197a51313D97362A95204j7210K34957j15888A07027
13294B06615D3164K93392b78748D8250J25152G5208P8365a00472B2211J13014
13284A35225m435K04930D0836o46K08837a34105A2011K30020G0371O6284K11J66815
$$ plain form
13359 198070 -36160 133055 230825 446157 205840 21394 10840 -79393 237916 237507 377697
13348 377697 -36718 325156 232742 94564 20931 -76360 213604 -133281 252528 3308 207706
13337 207706 426153 279107 305254 141433 25917 210016 363302 43389 -70911 93547
13326 445801 32833 329900 -192208 276797 391323 378388 71288 256556 100654 129273
13316 129273 351227 120862 416155 6291 29868 302639 209349 -42930 656 121215 481806
13305 481806 53632 115449 18197 -151313 497362 195204 177994 412951 297063 107027
13294 206615 43164 336556 -278748 48250 173402 75208 153573 -100472 22211 135225
13284 135225 130790 335720 40836 40190 249027 -134105 12011 242031 70371 136655 136866 303681
13272C03681J11130A33208b30819A38774b7672J3179D47830j68692I3986a27335
13261H8244a32328C57876G2344J67429j08932K63703K472C5854K805L66921A71525
13249B18995J69962A47914E4945J04671E7857R8121F1432K60371J148D508P1953
13238G6461a65220B32230h257C6865M30708E0947J86168g352j87677c3933r7287
13227a31220B91606D1916L10588O5395A28592g6723c1074A46585a31113A14035
13216B17788E1509K69975H2638e3058j1993B20697a25375G8661K50635j2194b8443
13204b20994B48949N870j26336J71384d3891C05633b3480j3878A4941J43811h485
13192A33099M6461D0438J04330J30473N6885a52578q6939a2912l02657A00851
$$ plain form
13272 303681 414811 133208 -230819 138774 -27672 -14493 447830 279138 93986 -127335
13261 88244 -132328 357876 72344 239773 130841 394544 397016 35854 38659 405580 171525
13249 218995 388957 147914 54945 159616 57857 155978 61432 321803 322951 4508 76461
13238 76461 -165220 232230 -8257 36865 467573 50947 237115 -7352 -195029 -33933 -131220
13227 -131220 291606 41916 352504 417899 128592 -76723 -31074 146585 -131113 114035
13216 217788 51509 321484 82638 -53058 -65051 220697 -125375 78661 329296 317102 -28443
13204 -220994 248949 254819 128483 299867 -43891 305633 -23480 -37358 14941 158752 -8485
13192 133099 179560 40438 144768 275241 332126 -152578 -239517 -12912 -315569 100851
13181e9106G0673a09223j05111I7214J76981H7924l2298J37331B5046P0280b18001
13169f463l3307A68359J54040b10272b6079B3444K56430A7324P3031J46467b34837
13157C6361e5562o1492e4191p3456F006M21927b0047A9568a26611c7057E9629
13145B7736A2185a10668k73125D2343c3916h824B366P3469b0358B19410N1193
13134B70603C5721a02197A44570n7002M4634J49373r3961G185c4917R851B17911
13122c4550A2674J3099g045I4541d3051A59662o6561a57468C05114F9641J41129
13111B10770q6186J97522j920h5326B65341b2832G8866J12031b6135j14401e8370
13099c5021A47586K5775M8885O5353b70C4812J25591a27977I9885c157o2251b3203
$$ plain form
13181 -59106 70673 -109223 -214334 97214 274195 87924 55626 192957 25046 95326 -218001
13169 -6463 -39770 168359 322399 -210272 -26079 23444 279874 17324 90355 236822 -234837
13157 36361 -55562 -117054 -54191 -127647 6006 427933 -20047 19568 -126611 -37057 59629
13145 27736 12185 -110668 -383793 42343 -33916 -8824 2366 75835 -20358 219410 270603
13134 270603 35721 -102197 144570 87568 132202 281575 187614 7185 -34917 -25066 217911
13122 -34550 12674 25773 -7045 94541 -43051 159662 93101 -157468 305114 69641 210770
13111 210770 124584 322106 320186 -85326 265341 -22832 78866 190897 -26135 -140536 -58370
13099 -35021 147586 173361 222246 287599 -270 34812 160403 -127977 99885 -3157 -65408 -23203
13086h1588H1148K21138C416M81142j78453c1929C82052A06341b61640A17799
13075a2405q5503j1541A3581a07976D51774A74103k1940c8171A13006M2f6450
13063B43136c2279B27135p1388C9645J85564I9084M7828K3273b62274c8943A875
13051F6497J43456F4340i276i72j35394D276f9227A33197h4818A9420J22586l8728
13039A03278J8408d1437l06088A4096e9019P739A25951O9906c37860i9016A58797
13027g09j99933f9537D7347J77815F7278j8659d4076B17743a8688B67165n1065
13016B16100B7276a35141q986k6779c2174m4213H3835g7280j56382B18597a32372
13004b2482j9271A52983l6706K09038L2003r2029a70280a4544I8831b9640A15722
$$ plain form
13086 -81588 81148 302286 3416 484558 306105 -31929 382052 106341 -261640 117799
13075 -12405 -97908 -109449 13581 -107976 451774 174103 152163 -38171 113006 113048 -66450
13063 243136 -32279 227135 155747 39645 225209 99084 146912 170185 -262274 -38943 1875
13051 66497 209953 64340 -9276 -972 -136366 4276 -69227 133197 -84818 19420 142006 103278
13039 103278 121686 -41437 -347525 14096 -59019 -51280 125951 195857 -337860 -99016 158797
13027 -709 -200642 -69537 47347 225162 67278 48619 -44076 217743 -18688 267165 216100
13016 216100 27276 -135141 -144127 -170906 -32174 -76387 83835 -77280 -233662 218597 -132372
13004 -22482 -41753 152983 116277 325315 357318 265289 -170280 -14544 98831 -29640 115722
12992E772J64940L0692e8593I0602b0810B08137j7285i298j16253A1906e6581
12980D1168j8303J31597c44999D1446h5151d1533j38390A78662b36503G7465h9279
12968B976J73864n7745e0711B92108D2589A5512J35034J68412j09521g2748I9488
12956c71402a85495A03440j8557a03741C05770r7515j3112q7111O6206d5395A01884
12944a41326o4626d1543a603H6397a19167A21504b29364C15239b15826A49444
12933E4809O1976n4353J42231b170j86319A13158a70726D4834b7677A09245f5431
12921E2635a9401G598d0818a1578B71459P9613E2915a037j20498G9464K32601
12910C12065j00705G3287a29938a7738j5467m0629B26522I0202J28473e7633r6021
$$ plain form
12992 5772 170712 201404 -58593 90602 -20810 208137 190852 -9298 -125551 11906 -56581
12980 41168 22865 154462 -344999 41446 -85151 -41533 -179923 178662 -236503 77465 -89279
12968 2976 176840 119095 -50711 292108 42589 15512 150546 318958 209437 -72748 99488
12956 -371402 -185495 103440 84883 -103741 305770 208255 195143 108032 174238 -45395 101884
12944 -141326 -205952 -41543 -1603 86397 -119167 121504 -229364 315239 -215826 149444
12933 54809 116785 62432 204663 -2170 -188489 113158 -170726 44834 -27677 109245 -65431
12921 52635 -19401 7598 -40818 -11578 271459 351072 52915 -1037 -121535 79464 312065
12910 312065 211360 73287 -129938 -17738 -33205 -73834 226522 90202 218675 -57633 -153654
12899a53654A1326a16622A89650l1476f9363g698A90893d9267j03207N1828l7749
12888a38395D6050K76812H5305a36506C8981j2444M04533A98763B5530a25407
12877b31689i5869a5014A23351Q3814J21009j24324b33771K9045j40290F3823
12866a54146F53261a42960A66618C9438J14077K3629A1738J83959D9140B1775
12855b45802g4896G9213a3948j0522D2620a00151B11340h7980k05150o5400C20613
12843c4976r9254B51691H0232a42545A8389M6515J58825e15103h4870A2203J28539
12832A40742i5413B02856c08697a6692k01036d632k65936M7408F8329a80663E9930
12820D2938b3844F3171a62547A1272K82387A44598a57724K1525C70b12812M0331
$$ plain form
12899 -153654 11326 -116622 189650 158174 -69363 -7698 190893 -49267 -152474 -100646 -138395
12888 -138395 46050 322862 85305 -136506 38981 26537 431070 198763 25530 -125407
12877 -231689 -95869 -15014 123351 207165 328174 203850 -233771 -204726 -345016 63823
12866 -154146 653261 -142960 166618 39438 153515 177144 11738 195697 49140 21775
12855 -245802 -74896 79213 -13948 -24470 42620 -100151 211340 -87980 -293130 -358530 320613
12843 -34976 -134230 251691 80232 -142545 18389 64904 223729 -515103 -84870 12203 140742
12832 140742 -95413 202856 -308697 -16692 -217728 -4632 -270568 -223160 68329 -180663 59930
12820 42938 -23844 63171 -162547 11272 293659 144598 -157724 -136199 370 -212812 -172481
12809a72481E2278b6350r0883H5412e6410E2383J58757H7529b3976p7912B3167
12797A69324m6958L3777O4361a34098M3545C02378g3227k70056g3863j26879A08920
12785C8299b09706B00447a38640B29178B4305L6273f8170E9635K11950a42480
12774A73395a20292B50456i5794J0822J9582B46366a75330A813i3908F2348i5176
12762a07415q8715H3429a22945C34337H545Q2367d04763B32306j13870b05743
12751E9989a05168A3040c461k28698m8093e5062A07253b50708C80140F7530j8188
12740D9342K6454C5574K94068r0941b73475E079c026A79746D5917J07957a73173
12728A47158p1913c15564e2020m6592n1638B70830e2673C93043F3655a18513L7342
$$ plain form
12809 -172481 52278 -26350 -117233 85412 -56410 52383 211140 87529 -23976 -101888 23167
12797 169324 122366 156143 220504 -134098 -90553 302378 -73227 -343283 -73863 -200742 108920
12785 38299 -209706 200447 -138640 229178 24305 60578 -68170 59635 271585 -142480
12774 173395 -120292 250456 -95794 -84972 -65390 246366 -175330 1813 -93908 62348 -95176
12762 -107415 -196130 83429 -122945 334337 8545 90912 -404763 232306 118436 -205743
12751 59989 -105168 13040 -3461 -232159 -280252 -55062 107253 -250708 380140 67530 49342
12740 49342 75796 35574 329642 238701 -273475 5079 -3026 179746 45917 153874 -173173
12728 147158 75245 -315564 -52020 -98612 -150250 270830 -52673 393043 63655 -118513 -81171
12717h1171b7580k09280e2211J4879k10691J17843o73A2231M53256f6987K8278
12706c8709G7620J7341l9862O308J40026I927b95666C7031K01393b39027i161
12694F5654b7387A81930o5783k6447M2113a18265p7321R3970A84451b26527A8725
12682C9775Q5644N671K64123b28850B0411J13688I522J47260f5566A94577a32206
12670B22476p3808a66823A03407j3775P8132o6871J26485c51006F224J51841K4263
12659A82328c15999G2831E904M6819a19128N5518B72384A16629a05890n4479l3577
12648a93946A3558b1121o0530A30469E5332R5766b52349f5667I1589a10685j4765
12637a25450G3300a95589i3308b2869k40032A16599J64464A25678Q0127a7474
$$ plain form
12717 -81171 -27580 -236860 -52211 -37332 -248023 -130180 -130853 12231 465487 -66987 -38709
12706 -38709 77620 94961 55099 61407 201433 9927 -295666 37031 238424 -239027 -9161
12694 65654 -27387 181930 116147 89700 131813 -118265 -195586 -101616 184451 -226527 18725
12682 39775 125419 131090 395213 -228850 20411 134099 9522 156782 -65566 194577 -132206
12670 222476 148668 -166823 103407 89632 167764 100893 227378 -351006 6224 158065 182328
12659 182328 -315999 72831 5904 52723 -119128 -63610 272384 116629 -105890 -160369 -193946
12648 -193946 13558 -21121 -81651 130469 55332 151098 -252349 -65667 91589 -110685 -125450
12637 -125450 73300 -195589 -93308 -22869 -262901 116599 281063 125678 205805 -17474
12626a19309I7944p441j2668J71648j01804d6083j96628F9205K53696c87285J32549
12615b54736D79070a01940k2933A40898f9299A55R3195f4254A9636b0497B07307
12603C49609j67878E0694m270c6553C37790j24346a44590B8888J60878f2834r0300
12592a53134B05100r1001a21059E4682J76888d0829D17750C1823J07175n608L1634
12581A65024k210L6655b24741B74165i4737p3935n2416j13590a13844A7141b20158
12569D4547a16354p2390C7592J13727e8576H6340Q4149c6238A53920C3969a7162
12557a58191e8986j52549E08b2538A76721j068b61625f8611A56872b28966N9216
12546a69750r1115F280a32388A93938a9k6504j38522K64a6328A07123b5457A01290
$$ plain form
12626 -119309 97944 90503 77835 249483 147679 -46083 -242711 69205 322901 -387285 -254736
12615 -254736 479070 -101940 -124873 140898 -69299 155 93350 -64254 19636 -20497 207307
12603 349609 181731 50694 46424 -36553 337790 213444 -144590 28888 189766 -62834 -153134
12592 -153134 205100 114099 -121059 54682 231570 -40829 417750 31823 138998 133390 165024
12581 165024 162814 199469 -224741 274165 -94737 -168672 -221088 -334678 -113844 17141 -220158
12569 44547 -116354 -188744 37592 151319 -58576 86340 170489 -36238 153920 33969 -17162
12557 -158191 -58986 -211535 508 -22538 176721 175653 -261625 -68611 156872 -228966 -169750
12546 -169750 -260865 6280 -132388 193938 -19 -26523 -165045 -164781 -16328 107123 -25457 101290
12533b03401c6046n1461I14a46174I5383a85176I9529g091j34656B05398F3729
12521b77431e6034r3425L3561A49743d4678A1416O3227M1435J54269c1333A12849
12509f128n9686F2057N3303J21805C7374J41934E0001h9418D79964A46170c54212
12497b26820N0365F3390Q318N1386c19701A38246c80897b5641C18772C5571f898
12485G0057J74724e2615A29675m1297m3259e0468b4909B22291a9193B30912K0202
12474B51114q2158o9120c86063J58756A22142b90261B02623l9168g4277A6089
12463a46437B20077a34930c4970j3656q1646C6362N4800a07660K2533k72001h4514
12451C09855A51574c84378C8678N9077J98315a32431e8444a8568A47974E4903
$$ plain form
12533 -203401 -36046 -87507 914 -146174 95383 -185176 99529 -7091 -141747 205398 63729
12521 -277431 -56034 -149459 -115898 149743 -44678 11416 74643 116078 270347 -31333 112849
12509 -6128 -65814 62057 115360 237165 37374 179308 50001 -89418 479964 146170 -354212
12497 -226820 -176455 63390 71708 123094 -319701 138246 -380897 -25641 318772 35571 -6898
12485 70057 244781 -52615 129675 88378 45119 -50468 -24909 222291 -19193 230912 251114
12474 251114 168956 99836 -386063 -227307 122142 -290261 202623 163455 -74277 16089
12463 -146437 220077 -134930 -34970 -48626 -130272 36362 91162 -107660 -85127 -357128 -84514
12451 309855 151574 -384378 38678 97755 296070 -132431 -58444 -18568 147974 54903
12440b0270D4852J73250g429k1451m8300B39253b98p4873A25190f0021A03142
12428D6873e2104J4241A2038b00544M210c9717A42244A8360J53516B7567K60356
12417B87923a61727K8535A68881K41969A67430b70140B32864c7100G3952a6124
12406d8470H3437K7704a91681m677A34587A0525B557e3667d630j55992j54939
12395c15561N2090c1650I3295B5857d58039a07664c240C57016e2647h442B01034
12383a02281k75748A36758F7313a60294A55346a2914l19672a46756o7572L1147
12373a83181g8948A46520n1666l4846Q2732J10905a46839E2446I116J11310k5870
12362I4556a965k887n3108G0311J02581c21067A08207E0262K18474f8406B52807
$$ plain form
12440 -20270 44852 218102 -7429 -28880 -77180 239253 -298 -75171 125190 -60021 103142
12428 46873 -52104 -37863 12038 -200544 -196334 -39717 142244 18360 171876 27567 287923
12417 287923 -161727 -133192 168881 410850 167430 -270140 232864 -37100 73952 -16124
12406 -48470 83437 111141 -191681 -196358 134587 10525 2557 -53667 -4630 -160622 -315561
12395 -315561 -263471 -31650 93295 25857 -458039 -107664 -3240 357016 -52647 -8442 201034
12383 -102281 -378029 136758 67313 -160294 155346 -12914 -332586 -146756 -214328 -183181
12373 -183181 -78948 146520 94854 60008 142740 253645 -146839 52446 9116 120426 94556
12362 94556 -1965 -4852 -57960 70311 172892 -321067 108207 50262 268736 -68406 252807
12350a86899P7355B96186f9109B4666c44251B47763A03868c7441D4723a73203
12339G603K1460Q5922d3260P289A16647b25172J11776d6264E0134j0726d1955
12327a68997q5729d3694j13815K5111A11561b24495b6379j54128B7368a1282l5944
12316d7226A53543b3272m4397a2242l62D9218k2700R8705O0669a58721A61170
12304a54455P4550A88884F8258b16591G6963J11431b01705A11739E350J52422
12294A57772a15768E4455K17151a75656b3738B65544A5797f7976m7781A10802
12283B16122A839K6701d8184B08623k4784c07117I902K23296E9965h6117c8697
12271A28969K34525B2150c5696E3664N8651K0663l9097b62997A23785f8608A05030
$$ plain form
12350 -186899 -109544 296186 -69109 24666 -344251 247763 103868 -37441 44723 -173203
12339 7603 29063 114985 -43260 -35971 116647 -225172 -113396 -46264 50134 39408 -41955
12327 -168997 -254726 -43694 -157509 -132398 111561 -224495 -26379 -180507 27368 -11282 -47226
12316 -47226 153543 -23272 -67669 -12242 -12604 49218 26518 125223 185892 -158721 161170
12304 -154455 -79905 188884 68258 -216591 76963 188394 -201705 111739 5350 157772
12294 157772 -115768 54455 271606 -175656 -23738 265544 15797 -67976 -115757 110802
12283 216122 1839 28540 -48184 208623 183839 -307117 9902 233198 59965 -86117 -38697
12271 128969 363494 22150 -35696 53664 112315 132978 93881 -262997 123785 -68608 105030
12259B0426R3086k6287m1663J82105J35342E2609a07752G315K865L8438a95737
12247A13447J69626o6236l1983a811A97286k3623a9406j02537K8872h808j537
12236a0345A11356c25892b6199B21341c9496B82995n2411A7518J5118P8954l7934
12225G3656J25030J82075j1528j15973H9739a29886F9955c96140c9838A21830
12214B89155C9566a26721J7659A49102d3995o2815M0482B44967f6809C52735D3732
12202a5660o682B12763C0330K77298O787o7356A00243J6928k2555c852k08145
12191b11997d0577A84986L284i8577B91188f0815n785E1203a81053A10892a78856
12179a75036A14372K5566J03399j12359a56153A50702L9862a58683C4457J77744
$$ plain form
12259 20426 113512 87225 45562 227667 363009 52609 -107752 7315 10180 48618 -195737
12247 113447 283073 216837 184854 -1811 197286 173663 -19406 -121943 -93071 -8808 -10345
12236 -10345 111356 -325892 -26199 221341 -39496 282995 230584 17518 32636 111590 73656
12225 73656 198686 380761 369233 253260 89739 -129886 69955 -396140 -39838 121830
12214 289155 39566 -126721 -109062 149102 -43995 -106810 -66328 244967 -66809 352735 43732
12202 -15660 -22342 212763 30330 307628 314415 247059 100243 117171 94616 -3852 -211997
12191 -211997 -40577 184986 188270 -98577 291188 -60815 -66600 51203 -181053 110892 -178856
12179 -175036 114372 139938 243337 130978 -156153 150702 190564 -158683 34457 212201
12169B12201e9530C0036a02928B1878J53321h933p3797I7992K2542h7395j69836
12158b57231H3165L8799d2617A72227J06100H47N8360a69008g5608j62048K5132
12147b12524p1799A25692D3877b83198o4532d8306A36056c827j49202b0966A84900
12135a73456b8273r6721A09215l0632O3241O9742g5317k1670M6224j3063C13908
12123h0226K8372B50604b23633A14618J06061b44561J10024r4542J05541A32565
12112b9696A31755L089J43027a36886A04066J55501m7032f3383G643P2141d4217
12100A38415F6405b4688j21112A10187a14404a5865D1694a04052B0823K6502g5066
12088A62721b91469A55261A6853K68458Q4563o9971a17675C68017A1876J15691
$$ plain form
12169 212201 -59530 30036 -102928 21878 175199 -8933 -82730 97992 120534 -87395 -257231
12158 -257231 83165 121964 -42617 172227 278327 847 59207 -169008 -75608 -237656 -212524
12147 -212524 -284323 125692 43877 -283198 -347730 -48306 136056 -3827 -153029 -20966 184900
12135 -173456 -28273 -124994 109215 78583 141824 211566 -75317 -96987 -50763 -63826 313908
12123 -80226 -51854 250604 -223633 114618 220679 -244561 -134537 -229079 -123538 132565
12112 -29696 131755 134844 277871 -136886 104066 259567 212535 -63383 7643 79784 -44217
12100 138415 66405 -24688 -145800 110187 -114404 -15865 41694 -104052 20823 47325 -75066
12088 162721 -291469 155261 16853 285311 369874 299903 -117675 368017 11876 127567
12078A27567b08959L9835B5524L22731A18414a44373C3793c5364q7390c4282A7607
12066h8254A59474a05089j26021i3822D6468g0011A98884d4598n8745a1535H1130
12054A6455J43895b31834A7089J15569b21628G5012a80704a1357C63449A07970
12043a23966j08631B4442d8772k01474b5221A02770j095b88593c365o4504k23457
12032b91326A37354M8014c35894J07772H629O43014D829c0909A50840a68173D4675
12020E6326d1210D3530K69531a02279d7457j32354b5382o819I14K35256a76162
12008a74333D1891a05162l5982A9657e5077B776i8774a548k22320Q4878B13162
11996A10474a71786N5414D684a49734F1923b87100O107J22221f4834B62861F0873
$$ plain form
12078 127567 -208959 -169124 25524 348255 118414 -144373 33793 -35364 -122754 -34282 17607
12066 -88254 159474 -105089 -231110 -93822 46468 -70011 198884 -44598 -103343 -11535 81130
12054 16455 160350 -231834 17089 132658 -221628 75012 -180704 -11357 363449 107970
12043 -123966 -232597 24442 -48772 -250246 -25221 102770 101675 -288593 -3365 -67869 -291326
12032 -291326 137354 185368 -335894 -228122 8629 651643 4829 -30909 150840 -168173 44675
12020 56326 -41210 43530 313061 -102279 -47457 -179811 -25382 -32201 914 236170 -176162
12008 -174333 41891 -105162 -141144 19657 -55077 2776 -98774 -1548 -223868 -138990 213162
11996 110474 -171786 -116372 4684 -149734 61923 -287100 -280993 -158772 -64834 262861 60873
11984i5153d7463k59223i0779l10422C15658I815a82B32391F5305A6732a8693
11972B61763j22416i4546j01778a7492B06583h0493I7999O8674b36988i8476K4074
11961g4402H4566K8609A9832a44891A41454a91082q0532O8359A03902f2235A29044
11949E993c43945I4652B9702J14509J32366D5779a09393A75035b28222B40678
11938B20471n6377o1418f2329k32319j64687a5077B18478H4103C0418e3334o1722
11927a15056C67610A4443J15076h6556m1665k17907f1006k09054f2925j73608
11917b36533E7185a02874L7447j62009K7103A36654E6923a58048G914L9688i9280
11905A33535a24923F8985M9777m4360B7761a56797A82129L3a39276e0626n5810
$$ plain form
11984 -95153 -47463 -306686 -90779 -401201 315658 9815 -182 232391 65305 16732 -18693
11972 261763 139347 -94546 -196324 -17492 206583 -80493 97999 166673 -236988 -98476 -74402
11961 -74402 84566 113175 19832 -144891 141454 -191082 -271614 -203255 103902 -62235 129044
11949 5993 -343945 94652 29702 144211 276577 45779 -109393 175035 -228222 240678
11938 220471 164094 102676 -62329 -294648 -459335 -15077 218478 84103 30418 -53334 -115056
11927 -115056 367610 14443 129519 -86556 -128221 -346128 -61006 -270060 -62925 -236533
11917 -236533 57185 -102874 -65427 -227436 -200333 136654 56923 -158048 7914 47602 -99280
11905 133535 -124923 68985 118762 74402 27761 -156797 182129 182162 -139276 -50626 -106436
11894a06436B34855a14235j21203B58418b27752e0197B59157f5000A26581a50703
11883B48152d37942N5432C55014c6189k63820a04450G2677A9787O8995a01580
11872a78171q0465P1616L0903D5249k0339d6110I5559G74g1319E4724a37978m6777
11860a84755A12042b71823J19719A59501a44023l6671G0268A9404a52030k2549
11850a74579l3200M4940E1015c2738m2050J598j03047A62052a67801j12120Q6429
11839a93492j38264A2630g1843H6580N7441A5688L57805b44748n395B09922m9792
11828A60130B7106a40405b7029o5141j32462h638n0595m2924k04527I5170b91721
11816C3296K36376A26878J62624c0103I4381a04089j28726Q4759B28169b13844
$$ plain form
11894 -106436 234855 -114235 -235438 258418 -227752 -50197 259157 -65000 126581 -150703
11883 248152 -437942 -382510 355014 -36189 -300009 -104450 72677 19787 88782 -101580
11872 -178171 -258636 -187020 -156117 45249 24910 -46110 95559 774 -71319 54724 -137978 -184755
11860 -184755 112042 -271823 -152104 159501 -144023 -180694 70268 19404 -152030 -174579
11850 -174579 -207779 -162839 51015 -32738 -74788 -73190 -176237 162052 -167801 -279921 -193492
11839 -193492 -331756 12630 -71843 86580 144021 15688 373493 -244748 -250143 209922 160130
11828 160130 27106 -140405 -27029 -92170 -224632 -8638 -59233 -102157 -306684 95170 -291721
11816 33296 269672 126878 289502 -30103 94381 -104089 -232815 -148056 228169 -213844
11805A76490C9893r746c40859D7964B686i4715A5187g7448I7028c34760a64564
11793E8741J96692A5022c32453A69028c46096A01989C0567a47162C8158M3482
11783H1640J74632E2610J23446C2164b57843A35014k1435D1031L5428B1826a10568
11771b80794e6693A36792d16185K03229B82885j29941M5639E5470J02051d52835
11760c35344B5771M39569A42220D1468a34457f4173D9576d0666A18788n2758d0854
11748g2406A29874k0473I173J58153a15603p7806l7044J02755D9242c04606A36691
11736A97036J33982G6494J16476C640f6838a1826A51655B5360L78664h1657I965
11724B14030e268A06196J07438a03286j59837B01537C5773J63216d8261F9790
$$ plain form
11805 176490 39893 30147 -340859 47964 2686 -94715 15187 -77448 97028 -334760 -164564
11793 58741 255433 15022 -332453 169028 -346096 101989 30567 -147162 38158 81640
11783 81640 256272 52610 176056 32164 -257843 135014 113579 41031 76459 21826 -110568
11771 -280794 -56693 136792 -416185 -212956 282885 152944 198583 55470 157521 -452835
11760 -335344 25771 465340 142220 41468 -134457 -64173 49576 -40666 118788 66030 -40854
11748 -72406 129874 109401 9173 167326 -115603 -193409 -230453 -127698 49242 -304606 136691
11736 197036 331018 76494 192970 3640 -66838 -11826 151655 25360 404024 -81657 9965
11724 214030 -5268 106196 213634 -103286 -263123 201537 35773 198989 -48261 69790
11713B7541g2682p955A66918L9403D5180c67583A28451b94027k8696a43852H9624
11701a4382k37039B29939a481j14368E6849M7953K9892b43168N4822I5385J30295
11690B25680b14292j00186B22462e9334l1397j46357Q8907A95967a11461k7463
11680a38924o257C24107B3640Q5168h0814j52858A39261B0059J5034a16250a2780
11668h9505D1844i4504A23323c23206f1835A7890R3672a05248A58169O322b48370
11656a0049j37669H8614L0625C4056d92680d5062j66706A79444a54425A97119
11645b3116j80796A07850O8407g8541C8466d3987m557e674k80170D1737M7281
11634H9018d0564n4840n3012j43316g6041G6328P3394a93132B02518m4458d8088
$$ plain form
11713 27541 -72682 -80637 166918 206321 45180 -367583 128451 -294027 -322723 -143852 89624
11701 -14382 -251421 229939 -1481 -115849 56849 104802 134694 -243168 -188346 95385 225680
11690 225680 -214292 -314478 222462 -59334 -90731 -237088 -148181 195967 -111461 -138924
11680 -138924 -145181 324107 23640 108808 -80814 -233672 139261 20059 35093 -116250 -12780
11668 -89505 41844 -94504 123323 -323206 -61835 17890 111562 -105248 158169 164491 -248370
11656 -10049 -147718 88614 119239 34056 -492680 -45062 -211768 179444 -154425 197119
11645 -23116 -203912 107850 176257 -78541 38466 -43987 -48544 -5674 -285844 41737 89018
11634 89018 -40564 -95404 -148416 -291732 -76041 76328 149722 -193132 202518 158060 -48088
11622G5354L650M2494B477a24114B54676a365G2843k2313A4873a86898R2239E7712
11609B55354c97176i8951I3926B1564b21954f7397l8146C24206g2678k1608K7808
11598f6478A70385C1884b35606R271j68930F9878r838c3911i560k54254J06689
11587a57125A6736K7641P7217J00939C8860a04255j27652A15290l7702b46009
11576D7105h9062E6863e0675A88138r0372c5416A71947b59037B95907A32670a05045
11564C77289K9438j85573A00448g6838B37807A00764M3147F9619i4918j54215
11554b49133b29o8727j7885E3128b86528C21158K04554A00693a4011C41872e81216
11542B83510a24717A6350O919J81128E5431i3106b2062H8445b71910A39687J24336
$$ plain form
11622 75354 79004 121498 2477 -124114 254676 -1365 72843 50530 14873 -186898 -94659 57712
11609 255354 -397176 -98951 93926 21564 -221954 -67397 -105543 324206 -72678 -94286 -66478
11598 -66478 170385 31884 -235606 -226335 -395265 69878 60040 -33911 -9560 -263814 -157125
11587 -157125 16736 44377 121594 222533 38860 -104255 -231907 115290 77588 -246009
11576 47105 -89062 56863 -50675 188138 97766 -35416 171947 -259037 295907 132670 -105045
11564 377289 406727 221154 100448 -76838 237807 100764 143911 69619 -94918 -249133
11554 -249133 -229 -68956 -86841 53128 -286528 321158 525712 100693 -14011 341872 -581216
11542 283510 -124717 16350 23269 204397 55431 -93106 -22062 88445 -271910 139687 264023
11531B64023H9327b9716A82527j3971c094n9397C10125j00272a16627C9198a24131
11519b44229d9488p3206j65772D2762N4038C1857j2055g7434A77488b7121B26321
11507D7882J94645b30772E5147M3100a46941e0081B6313J82709J56979a23928
11496E8238a17109j26297B21014d4495A49215k2433b16315B47528a2021o767j12636
11485a31424A02842b38489B34829a87938B53691A4784Q5795O6129b40629C058
11474b6307B68245A29005a70449j92588i9449l7921m0420p6501F0407R4381F0696
11462A02822D7754a73759k7686L1196k88293g344A52074f8344F0113d62065a12345
11450C0115a53167r2694K5302f2881o0998B10524O0665H4557Q9877F4897J2608
$$ plain form
11531 264023 89327 -29716 182527 168556 -3094 -62491 310125 209853 -116627 39198 -124131
11519 -244229 -49488 -122694 -288466 42762 96800 31857 19802 -77434 177488 -27121 226321
11507 47882 242527 -230772 55147 98247 -146941 -50081 26313 209022 366001 -123928
11496 58238 -117109 -243406 221014 -44495 149215 126782 -216315 247528 -12021 -18788 -131424
11485 -131424 102842 -238489 234829 -187938 253691 14784 100579 166708 -240629 3058
11474 -26307 268245 129005 -170449 -363037 -99449 -137370 -177790 -254291 60407 154788 60696
11462 102822 47754 -173759 -201445 -170249 -458542 -7344 152074 -68344 60113 -462065 -112345
11450 30115 -153167 -245861 -220559 -62881 -123879 210524 271189 84557 174434 64897 77505
11439G7505b1265k1471A03058c17704e295A28148a66220l9253L1322A9216d1321
11427a29137C6239J26077M2497d1167j32186N6525N7540D9313O5898N4076o1433
11416A07854D1308f1040k74092B50895A24627D7245J03947p0490c42111P4221
11406b67890C35608L5170A07297d3224P500o8066B4538f3000C88368c71447A9644
11394A5509P4923b65228B9882K5337K02800a55258j46982a29866j71963F5619
11383A6205b41904c0321c630n4786j10313q1921L6296K6703A1043J4190R5213
11372A20446K3978a37082B5140a52016k3327J9008P3971p1761I6406g3033C83378
11360a75990B94145A02028a33662C12286K0580A15395a54478k00152E687J52961
$$ plain form
11439 77505 -21265 -42736 103058 -317704 -5295 128148 -166220 -205473 -174151 19216 -41321
11427 -129137 36239 162316 204813 -41167 -173353 -116828 -59288 49313 115211 169287 107854
11416 107854 41308 -61040 -335132 250895 124627 47245 151192 80702 -342111 -267890
11406 -267890 335608 370778 107297 -43224 -35724 -103790 24538 -63000 388368 -371447 19644
11394 15509 90432 -265228 29882 55219 258019 -155258 -302240 -129866 -301829 65619
11383 16205 -241904 -30321 -3630 -58416 -168729 -250650 -214354 -187651 11043 25233 120446
11372 120446 144424 -137082 25140 -152016 -175343 -156335 -82364 -154125 96406 -73033 383378
11360 -175990 294145 102028 -133662 312286 332866 115395 -154478 -354630 5687 158648
11350A58648a33515k22598J45995E0648b81077A1780c9664B00912i1417f761B8212
11338E9682J19853n5003Q5012b453k10645d1174A38795J2367b77133P5551g9466
11326d0426A16132d7291i408D2795K04613b26688h4026j17542A54324a50426q5947
11315b36373i0144F1348a91688M950C0996f4312l9402C4270b76804J36762c5527
11303A37843E5271a86348M6883k62339a44545M4934A93355f1716j8847J6356H9729
11291B89810b43285P3943B01979b30117j9986g7206I7640J22701a55208p6642
11281b31850D5429a04066l32029A11480f2654B9936a62257F6096R9422a4459j9055
11270c3514h420l57926D28603a24297A52114J1065a96498m4484b5621j76645k24134
$$ plain form
11350 158648 -133515 -356113 -210118 50648 -281077 11780 -39664 200912 -91417 -6761 28212
11338 59682 179535 124532 209544 -2453 -213098 -41174 138795 151162 -277133 -201582 -79466
11326 -40426 116132 -47291 -9408 42795 247408 -226688 -84026 -201568 154324 -150426 -236373
11315 -236373 -90144 61348 -191688 -186738 30996 -64312 -103714 34270 -276804 -140042 -35527
11303 137843 55271 -186348 -139465 -401804 -144545 -99611 193355 -61716 -80563 -64207 89729
11291 289810 -243285 -169342 201979 -230117 -250103 -77206 97640 220341 -155208 -231850
11281 -231850 45429 -104066 -436095 111480 -62654 29936 -162257 66096 165518 -14459 -33514
11270 -33514 -8420 -366346 428603 -124297 152114 163179 -196498 -240982 -25621 -202266 -426400
11259d26400B34919a32094A63824O6652p8007l0898C6191J90244A11258b76042
11248G6089g6388K1479a023A59451a25857J9894j84539a02014r3568B32253D3438
11236a2648l82167a9980r6909j8520D2479c11470p4156B11645J63267a66598A69503
11224C48202D090c87746B4098a36903m9119A98173a71627O9438A57555a89378
11213I4346c06642J44672B77060a26898j4675N1016E9447A3895P0507b39537D8694
11201A48050m2083b62444A43659E4500Q3394a26714J3046A54870m9943a28616
11190A77585E2484L5716a05871j25695e6902j47676e1054k5218F0139b97045c8696
11178b00436A6372O5229B6934K07162a83806c8865I1608a72333A21186a5226B41898
$$ plain form
11259 -426400 234919 -132094 163824 230476 152469 121571 36191 226435 111258 -276042
11248 76089 -76388 -54909 -1023 159451 -125857 -105963 -290502 -102014 -195582 232253 43438
11236 -12648 -394815 -19980 -116889 -135409 42479 -311470 -385626 211645 374912 -166598 169503
11224 348202 4090 -387746 24098 -136903 -186022 198173 -171627 -102189 157555 -189378
11213 94346 -306642 -161970 277060 -126898 -141573 -90557 59447 13895 84402 -239537 48694
11201 148050 105967 -262444 143659 54500 137894 -126714 -113668 154870 104927 -128616
11190 177585 52484 88200 -105871 -231566 -56902 -204578 -51054 -76272 60139 -297045 -38696
11178 -200436 16372 81601 26934 234096 -183806 -38865 91608 -172333 121186 -15226 241898
11166a46772I3097a24579E9220R5024C3769b8774J748r8025D628a75524A4536
11154a42255e6288l532A24049O5322C6719L5315o130H364i0060D39928I0111b07901
11141h9245j0015A0250i7267G0198a36491F9075o700i9959B41061C08J07952a58881
11128b49706b7510l31911h5561b8275q9243B6633b00903B70347D4312J01830l6534
11117A09608A7320N4823c31845C9566f2592k3948D1757J95338b40716B11460D6988
11105b04202H8745L18610I7285K7850G866c8087F2781R7065B7181O0586L1229
11094A18996b05435A47816H702a35160N6149I397N9640P4441a23877A06334N3779
11083A60113P1296G0294A1921J62275Q611d3842A41088l00l9885e9506A81111
$$ plain form
11166 -146772 93097 -124579 59220 154244 33769 -28774 -27026 -125051 4628 -175524 14536
11154 -142255 -56288 -59820 124049 189371 36719 72034 65904 8364 -90060 439928 90111 -207901
11141 -89245 -99260 10250 -97267 70198 -136491 69075 62375 -99959 241061 308 108260 -158881
11128 -249706 -27510 -359421 -85561 -28275 -117518 26633 -200903 270347 44312 146142 109608
11117 109608 17320 72143 -331845 39566 -62592 -86540 41757 237095 -240716 211460 46988
11105 -204202 88745 407355 97285 125135 7866 -38087 62781 159846 27181 87767 118996
11094 118996 -205435 147816 8702 -135160 -79011 9397 69037 143478 -123877 106334 160113
11083 160113 231409 70294 11921 174196 182807 -43842 141088 140788 100903 -59506 181111
11071B94655C5176K38428j19775J71479B21P7751l6080K55436J04042A83101O4403
11060B47504L67909A22006K34719j22045J02319J36541A25987B6318K55529M2122
11050C23969c7294C77772j44530G9441c5509C37986J71060b4668A64419K79030
11040D43449A482M83382r0116j22543l6519L4140J00117J77442B56303o486r0233
11029A59584J36851K8375N0474K07650I6223L59828l4999A66194H2215Q4643F0411
11017A76205K79210b36672D0936L05106j10715r1649J61642Q2070e818D81117
11006C52295q7524Q9660K00551K4971B54567J9719q165m0484r7490L30724o8818
10995C90053j62219J21068A30090J54707J5687J24319F6068K36024p6348K72921
$$ plain form
11071 294655 35176 273604 153829 325308 221 77972 41892 297328 401370 183101 247504
11060 247504 615413 122006 356725 234680 336999 473540 125987 26318 281847 323969
11050 323969 -37294 377772 233242 79441 -35509 337986 509046 -24668 164419 443449
11040 443449 1482 484864 394748 272205 235686 269826 369943 547385 256303 249817 159584
11029 159584 296435 324810 375284 582934 96223 456051 421052 166194 82215 166858 60411
11017 176205 455415 -236672 40936 346042 235327 143678 305320 387390 -5818 481117
11006 352295 264771 354431 554982 579953 254567 274286 266121 225637 128147 458871 390053
10995 390053 227834 348902 130090 284797 300484 424803 66068 302092 225744 498665
10985D98665L5459j48826K28851M2393j67645L52562j76361J21232J54090O9200
10975A009620L26104k49366K57719J93551k93188j81849J37470k9628j48903n224
10965A016306k3883o9708l34637L82835m5585q7521K92812k94149k4956J65374
10955I76888j75090j96055r5782L6224K7119j68610b4416D56405A75395n5209
10945A20186R0985k0440k7095h3938B09684i3484D5146O8059J19801b02745I6237
10933h1425B15916c63816C5840A3956J96623B7305b40885A71151a55819F7939
10922f995A2709a69747M0840l2761O7014A12526i8457H4654e317A42902F4086
10910e5827J8502p6264F7887b13461h2746c5902I9994c962k6489I2028a03330
$$ plain form
10985 498665 534124 385298 614149 656542 488897 841459 665098 786330 940420 1009620
10975 1009620 1335724 1086358 1344077 1537628 1244440 1062591 1200061 1170433 1021530 1016306
10965 1016306 992423 922715 588078 970913 925328 837807 1130619 836470 811514 976888
10955 976888 801798 605743 509961 546185 573304 404694 -24416 456405 175395 120186
10945 120186 211171 190731 163636 -83938 209684 -93484 45146 113205 233006 -202745 96237
10933 -81425 215916 -363816 35840 13956 210579 27305 -240885 171151 -155819 67939
10922 -6995 12709 -169747 -128907 -161668 -94654 112526 -98457 84654 -5317 142902 64086
10910 -55827 -37325 -113589 67887 -213461 -82746 -35902 99994 -3962 -30451 92028 -103330
10898f993A3588c55234B88761i7486b6183k07725I2766a56897G1055A5795J61584
10887A77379F7033b06811f9935c293j25938j42009A31943M8309a35014k086A25393
10875e914j63665K5870A20259h8181p5805A10500k4690a22358E645O729a69105
10863a91053D0093N1325K53255j60871c02278d9569A08817B4059J17805b47093
10852a06679a2966A66325k9504a39143B64653A07436h2705n1999A54827a75652
10841b69216C97114j16500p612a45915B36819b43542h5059q1242A0332g9215D9141
10829C38578h7397K4093A29598c02221B04705c39844J63242l2185P3822I6517
10818b45160B03934c80988h5640j47147B84993B5767d624B38710r3732L7708M2532
$$ plain form
10898 -6993 13588 -355234 288761 -97486 -26183 -233908 92766 -156897 71055 15795 177379
10887 177379 67033 -206811 -69935 -3293 -129231 -271240 131943 180252 -135014 -137100 125393
10875 -5914 -169579 -143709 120259 -88181 -163986 110500 85810 -122358 5645 12374 -169105
10863 -191053 40093 91418 344673 183802 -302278 -49569 108817 24059 141864 -247093
10852 -106679 -12966 166325 136821 -139143 264653 107436 -82705 -134704 154827 -175652
10841 -269216 397114 280614 273002 -145915 236819 -243542 -85059 -166301 10332 -79215 49141
10829 338578 -87397 -63304 129598 -302221 204705 -339844 -176602 -208787 -134965 96517
10818 -245160 203934 -380988 -85640 -232787 284993 25767 -4624 238710 144978 182686 225218
10807B25218d10669e0973B55651d8711G9496a26954j4814K9088k24014d8127B15514
10795F2159a8979B9931J87002a44879F7845L2648a57569L1252e0873m00868a68456
10783e7328k87495h709G8822k1365j059a52927L5592c5528o1431B20594N6159
10772B76753a33185G2327a31479C9198c71121A1134k91b32639D1286J76266A2930
10760A8627b37028i1597j47910m737A59122B2012d9382o9254k4109o9986q0670
10749b93401d9415j5465H5812h4692j18338L8962k18809d3470j3520A77458J6401
10738A93859g0131c0168A33131A4362d10290b03904B27633g6372A89519H3437
10727B20764a54508A78885e802p8817A92565q7177b93723i6509G0113L06830a01932
$$ plain form
10807 225218 -410669 -50973 255651 -48711 79496 -126954 -141768 -112680 -336694 -48127 215514
10795 62159 -18979 29931 216933 -144879 67845 100493 -157569 -126317 -50873 -451741 -168456
10783 -57328 -344823 -8709 78822 57457 56398 -152927 -117335 -35528 -96959 220594 276753
10772 276753 -133185 72327 -131479 39198 -371121 11134 10843 -232639 41286 217552 12930
10760 18627 -237028 -91597 -239507 -244244 159122 22012 -49382 -118636 -142745 -212731 -293401
10749 -293401 -49415 -64880 85812 -84692 -203030 -164068 -382877 -43470 -56990 177458 193859
10738 193859 -70131 -30168 133131 14362 -410290 -203904 227633 -76372 189519 83437
10727 220764 -154508 178885 -5802 -84619 192565 105388 -293723 -96509 70113 376943 -101932
10715b6988j25457H0601O9334a7185p2132C19880c12649A66458R80a01197J2961
10704h8236j14521f2427k15541B81750A29163P7494B5574b34507o1979D8437c29730
10692a50188R826d4989k62954B61014A582c2238A49445c0548C0191a56379f0229
10680c28973O3900a22522A32284O013F3305J45980D2626i4885c5402j54555E1733
10668D6166a9864l20926A00065a49969C8164b19363l185a0476H0022b1118l91402
10657d12520H100a78663B00660b26734C38486a97957B0573a20559K7413p8481
10647a71627j09548C06613E0142a39571j17857J25851e4842C7810b70081b6195
10636C0432a73008G8190k9085c2908j5991j8317j19025j59707a43456A607b89666
$$ plain form
10715 -26988 -152445 80601 149935 -17185 -89317 319880 -312649 166458 167438 -101197 -88236
10704 -88236 -202757 -62427 -277968 281750 129163 206657 25574 -234507 -296486 48437 -329730
10692 -150188 -140362 -44989 -307943 261014 1582 -32238 149445 -30548 30191 -156379 -60229
10680 -328973 -265073 -122522 132284 138297 63305 209285 42626 -94885 -35402 -189957 51733
10668 46166 -19864 -340790 100065 -149969 38164 -219363 -222548 -10476 80022 -21118 -412520
10657 -412520 8100 -178663 200660 -226734 338486 -197957 20573 -120559 -93146 -171627
10647 -171627 -281175 306613 50142 -139571 -257428 -131577 -54842 37810 -270081 -26195
10636 30432 -173008 78190 49105 -32908 -48899 -67216 -186241 -345948 -143456 1607 -289666
10624i8238K5103G4857a61768A6732g388j34664A24278c05020E2664b70373M9626
10613b20747H6699a52284B11385I1289D1533a15994H774a69162F0893K35567G5455
10601A80703C0486i2282c217j93465I657a01304l49665G908K4059a08666C7663
10589C34085b00532c8031G1113a69102o9863b223I2696L69657b70861A59160G3357
10577I178c78711J23755c8453o0454r1678B10708a53220B33976b2936A06464h4246
10565h3831J1912A71612h9561a4561B85994a5823o7263g631A68316e2122A92105
10553E6152N295a21480D07463A43262D1053b67604h6023b8729B07515g1407B42477
10541a77548P6935c366l558p4827j07590B9425L23086a29090l1164k2020A78418
$$ plain form
10624 -98238 -73135 74857 -161768 16732 -7388 -142052 124278 -305020 52664 -270373 -220747
10613 -220747 86699 -152284 211385 91289 41533 -115994 8774 -169162 60893 296460 75455
10601 180703 30486 -92282 -3217 -196682 9657 -101304 -450969 7908 31967 -108666 37663
10589 334085 -200532 -38031 71113 -169102 -238965 -2223 92696 462353 -270861 159160 73357
10577 9178 -378711 -254956 -38453 -98907 -190585 210708 -153220 233976 -22936 106464 -84246
10565 -83831 -71919 171612 -89561 -14561 285994 -15823 -83086 -7631 168316 -52122 192105
10553 56152 61447 -121480 407463 143262 41053 -267604 -86023 -28729 207515 -71407 242477
10541 -177548 -100613 -3366 -6924 -81751 -189341 29425 352511 -129090 -160254 -182274 178418
10529A40543b88953K1215A24615b13985g9163F9934J60051b7082A0268O8503d5923
10517b04550B28370c4135G7616L0723i275j04745A83873H7841m0756a8295p3289
10506i1584I1384a32835a3785G4053c74362a72847k9519B46377H4138a98516J1320
10495a87196E3329g4945k52691B08481b97184H5076k7718a4289l1204C40318A03315
10483C98552a23038A63059p2621J78752j1142L6393D1240a47192L6928p1665A35241
10471A12632N9276b78193O7903d0674o9245M0180A76270E2773b38064B91279a19982
10459a27079B9599a1917G9110b09363i4363o7673e1905O60A60744b8850j40415
10448a69265Q991A37403M1035a86032m9692B04381J17998b53056b1190D7521L08874
$$ plain form
10529 140543 -288953 -267738 124615 -213985 -79163 69934 229985 -27082 10268 78771 -45923
10517 -204550 228370 -34135 77616 108339 -9275 -114020 183873 87841 47085 -18295 -91584
10506 -91584 91384 -132835 -13785 74053 -374362 -172847 -202366 246377 84138 -198516 -187196
10495 -187196 53329 -74945 -327636 208481 -297184 85076 57358 -14289 -45493 340318 103315
10483 398552 -123038 163059 90438 269190 258048 294441 41240 -147192 -110264 -181929 135241
10471 112632 171908 -278193 -210290 -40674 -109919 -69739 176270 52773 -238064 291279 -119982
10459 -127079 29599 -11917 79110 -209363 -94363 -162036 -51905 -51245 160744 -28850 -169265
10448 -169265 -160274 137403 178438 -186032 -235724 204381 322379 -253056 -21190 47521 356395
10437C56395C6389c57619L4380B49660f7126k0887R103A36834a07271C4238A2599
10425a24193j0323A04961k9300a17145j6144J2234k7784A55927a36130j26014
10415b62144k27605E5730J8095N9548G849M5429J92843a52205l09858C21629A44077
10403F8948a72192q7294A38495a2354D7576J64914b114E5303L274O3461D6919
10391A68140J01372g2507H6656i1019D463i0589B02231e34883D791K15286a71442
10379E238a73234A78899K6971J14027h6024B58049b15431B59357b4744j65434
10369a90178I6137O08172B27190K05669j56107i9801D58541A69525c994j05596
10359a09590A81854o5615L3437K55074c3756m101C00835H2472a7957B38826J18777
$$ plain form
10437 356395 36389 -357619 -323239 249660 -67126 -88013 -78910 136834 -107271 34238 12599
10425 -124193 -134516 104961 75661 -117145 -133289 -121055 -148839 155927 -136130 -262144
10415 -262144 -489749 55730 73825 133373 7849 53278 246121 -152205 -462063 321629 144077
10403 68948 -172192 -259486 138495 -12354 47576 212490 -2114 55303 58577 122038 46919
10391 168140 269512 -72507 86656 -91019 4463 -90589 202231 -534883 4791 220077 -171442
10379 5238 -173234 178899 205870 319897 -86024 258049 -215431 259357 -24744 -190178
10369 -190178 96137 704309 227190 432859 276752 -99801 458541 169525 -3994 -109590
10359 -109590 181854 116239 149676 404750 -33756 -37857 300835 82472 -17957 238826 357603
10348C57603H8480J16540a94588B45565q8076G2030B3839J45149a58063C42306
10337C51250a59879B02347G3056B5655a17969B08422C2237d6323A90111B2134
10326a20809d0867A18687b6437G9609b93538c9069a6553k00698Q2699j3620a2160
10314a39601C6104P1549e6211A69169b56063B52830D4572f5318b620G2391g6086
10302C14607a19294B05836N3205E4380a2602m35718d2531j36126k44986b0677
10291c4278G3502n818a41835J5929N0201I741a59895A33912a32123D4615L08212
10280C52827e9961C1685b78761a13436d5251j73042b2646k21298q7146i8635a5611
10268a88899B4898A0310N3505K99721j30587l0333C386K79708b770B01366R3424
$$ plain form
10348 357603 88480 205020 -194588 245565 157489 72030 23839 168988 -158063 342306
10337 351250 -159879 202347 73056 25655 -117969 208422 32237 -46323 190111 22134
10326 -120809 -40867 118687 -26437 79609 -293538 -39069 -16553 -217251 -134552 -148172 -12160
10314 -139601 36104 107653 -56211 169169 -256063 252830 44572 -65318 -2620 72391 -76086
10302 314607 -119294 205836 259041 54380 -12602 -448320 -42531 -178657 -423643 -20677
10291 -34278 73502 67684 -141835 -125906 -75705 9741 -159895 133912 -132123 44615 352827
10280 352827 -59961 31685 -278761 -113436 -45251 -218293 -22646 -243944 -331090 -98635 -15611
10268 -188899 24898 10310 63815 363536 232949 202616 3386 283094 -2770 201366 294790
10257B94790B5825a29719B33023m7334a2544k5014C5979Q4088d36122A52315n516
10246A46799g9358j31875J9961c0787F4863d61628h7748j87719a7591n4412E2594
10234F8236J63125J9710C971i1779A2197J57087B5347b72638A46905a0511j36747
10223a47258C02385c07831P3620J08394E4911c11250K7023C8930G473a27653k25255
10212c52908e9985j52243B3241a01475A39968a32227e9452a8139k42337B09540
10201a86263G3884j8734c32823A00302K00299b88821D620f7796n6825C36963b10715
10189g1549c3989r0061e5114n3803A26971O8012c31889J26766G738a40213B53734
10177I2422b23185M1846B22991a41560A30218e0575A44892D9393a10366B1597
$$ plain form
10257 294790 25825 -129719 233023 185689 -12544 -37558 35979 120067 -436122 152315 146799
10246 146799 -79358 -211233 -191272 -30787 64863 -461628 -87748 -275467 -17591 -72003 52594
10234 68236 231361 251071 3971 -91779 12197 169284 25347 -272638 146905 -10511 -147258
10223 -147258 302385 -307831 -234211 -125817 54911 -311250 -284227 38930 7473 -127653 -352908
10212 -352908 -59985 -212228 23241 -101475 139968 -132227 -59452 -18139 -260476 209540
10201 -186263 73884 55150 -332823 100302 300601 -288821 4620 -67796 -124621 336963 -210715
10189 -71549 -33989 -124050 -55114 -108917 126971 194983 -331889 -205123 7738 -140213 253734
10177 92422 -223185 -181339 222991 -141560 130218 -50575 144892 49393 -110366 21597
10166a78952A00044m2546a01850A33456b09692D9527e4666l315J9172E3503e597
10154A48550B5027d11613f8407A70922D5055a285m0121k56137C8197a16597b2051
10142E2147J42115b69622A26197b35936q5451Q5796B54097j19722b4382A54242
10131d5783J3675J3814B24458i8610L9801k3084A3546b28935B8904J4145a66236
10119A80793h4405j01821i0887c2736j87385o5496A27376b39899q4934Q926h3648
10107a63039P6314D3741a93775m6509b912j41760C85409b26238h3253j11941A08736
10095A49042G2360e7745A03645A3181a70803d9405N499l71781a83712E6912Q0846
10084A37758a47726q6500p0833a38073j92965a6068r2471q1546B11193I6206a14632
$$ plain form
10166 -178952 100044 57498 -101850 133456 -209692 49527 -54666 -57981 -38809 53503 -5597
10154 148550 25027 -411613 -68407 170922 45055 -1285 -41406 -297543 38197 -116597 -22051
10142 52147 194262 -269622 126197 -235936 -321387 -235591 254097 134375 -24382 154242
10131 -45783 -32108 -18294 224458 -98610 -58809 -81893 13546 -228935 28904 43049 -166236
10119 180793 -84405 -186226 -90887 -32736 -220121 -285617 127376 -239899 -324833 -315907 -83648
10107 -163039 -86725 43741 -193775 -240284 -2912 -144672 385409 -226238 -83253 -195194 108736
10095 149042 72360 -57745 103645 13181 -170803 -49405 -43906 -415687 -183712 56912 137758
10084 137758 -147726 -234226 -305059 -138073 -331038 -16068 -108539 -190085 211193 96206 -114632
10072b0008n7391k08409Q0411j01496a27432j31347a8913A00893J8258i2416q4794
10061a77210m8369I3806D4845d8816B3042f6941F5945J15326a21523J5431k40645
10050c46737B13159H0078A8211a25502J5372B01638e5110l9426D2779b18512c6205
10038b33674e5952G6633J2881a98561E4172c01149J29690b1838j82991c1085j50732
10027a81817B15174a39734O3818j84161J16753b7527l5043K5394k041p5195k7835
10016a42247a3238n2367a1973I3448c9291k33809g4173b5297j55729f1012K4588
10005c6424R534k954F0406b85075A04800e9379I5904g1320A02055b68867J11596
9994a57271A75997b0990C04627C2746J02943i696A3762R9966b07230R0322A15716
$$ plain form
10072 -20008 -77399 -285808 -205397 -306893 -127432 -258779 -18913 100893 119151 -92416 -177210
10061 -177210 -225579 93806 44845 -48816 23042 -66941 65945 181271 -121523 -106092 -346737
10050 -346737 213159 80078 18211 -125502 -110130 201638 -55110 -94536 42779 -218512 -36205
10038 -233674 -55952 76633 89514 -198561 54172 -301149 -171459 -21838 -204829 -31085 -181817
10027 -181817 215174 -139734 -75916 -260077 -143324 -27527 -62570 -37176 -39217 -114412 -142247
10016 -142247 -13238 -65605 -11973 93448 -39291 -273100 -74173 -25297 -181026 -61012 -36424
10005 -36424 -26890 -29844 60406 -285075 104800 -59379 95904 -71320 102055 -268867 -157271
9994 -157271 175997 -20990 304627 32746 135689 -9696 13762 113728 -207230 -116908 115716
9982a18882q615M0392K9316p1766j4348A29410k6268L2916a67868E8614K88672
9971C47286b72073M4948L5936A56028b07989q6775a8693A60131a68560H7001c33338
9959c12419c1920j5410p3085j06388a11990A08893c14939Q3779c2056A34340J44210
9948B78550A6921b31942q9968A33171k204a41671A5687K31215C5385b9375H5007
9936A31263g7224I5283m6101a54256A35579Q03a15026I614M5461a31251A87047
9924a11441a9387k31842a17273A57602c36926c2148o4124m110I3346a28860M9773
9913g9087k06399A96739b20108J02652k72789a69680O0213C13610e5362A07563
9902b29856f7455H815J35175f5459A55739b80325a11857L7229n3579C40166g3233
$$ plain form
9982 -118882 -127497 -87105 -57789 -129555 -143903 129410 103142 136058 -167868 58614 347286
9971 347286 -272073 -227125 -191189 156028 -207989 -294764 -18693 160131 -168560 87001 -333338
9959 -312419 -31920 -47330 -120415 -226803 -111990 108893 -314939 -231160 -32056 134340 278550
9948 278550 16921 -231942 -321910 133171 130967 -141671 15687 246902 35385 -29375 85007
9936 131263 -77224 95283 49182 -154256 135579 136382 -115026 9614 55075 -131251 187047
9924 -111441 -19387 -251229 -117273 157602 -336926 -32148 -96272 -100382 93346 -128860 -79087
9913 -79087 -285486 196739 -220108 -117456 -390245 -169680 -109467 313610 -55362 107563
9902 -229856 -67455 8815 143990 -65459 155739 -280325 -111857 -74628 -128207 340166 -73233
9890b5386l09729J42072K4951n9675A13352c39979e4333D02300g4123j67810f557
9878A56657p4012a22473c5425J6176j3428N706l1930j79655b3641k0301j35900
9867a79842M0692j5459k12856F9022d3149B9125I722f461q4491H3785L6123n0979
9855F8929g4528A35319e6012l981j34594A5231b37797A55681K3903a76926O4999
9844a11927B26583i7836A2633R2039a75674c5300R214k30073b3232a0611n8695
9833f9306j01749M99a9064A11998a94304D1677a6236K813l03202L9777P0811G0838
9820B8681b31634i8232q2952L650K7907B16354b39543f770E2795J4155J02791
9809A69741b25286I8019c92006A36197j089D3062g4011j01516e016l1349B52870
$$ plain form
9890 -25386 -335115 -193043 -168092 -227767 113352 -339979 -54333 402300 -74123 -241933 -6557
9878 156657 82645 -122473 -35425 -19249 -32677 -26971 -58901 -238556 -23641 -43942 -179842
9867 -179842 -139150 -154609 -367465 69022 -43149 29125 9722 -6461 -90952 83785 119908 68929
9855 68929 -74528 135319 -56012 -59993 -194587 15231 -237797 155681 179584 -176926 -111927
9844 -111927 226583 -97836 12633 104672 -175674 -35300 -26086 -256159 -23232 -10611 -69306
9833 -69306 -171055 -170556 -19064 111998 -194304 41677 -16236 -13423 -316625 -276848 -206037 70838
9820 28681 -231634 -98232 -181184 -177534 -149627 216354 -239543 -6770 52795 66950 169741
9809 169741 -225286 98019 -392006 136197 135108 43062 -74011 -175527 -5016 -36365 252870
9797b80260R4831k925G0783l2732a98936j77031D9095N7422e42822h2755K9709
9786e3046o4816j22572a4723A17253e4227B3511h7628j30545q414a5131A66209
9774b05049Q5947A13729C3453g9342j85798L554h6113o8354G0843R0241Q6935
9763B48019C6451f8831l8115j833j4881N4261k2505j34913F1027B1037e3489C03498
9750I6925f8366j5027i602o6708q0938P0924J6561E3711e21680a42451A31203
9738B81651a68342j49802J17658A31565a13055B05091a87802C879a68504j90008
9728c58512J73273D3988c3284n2139B59409a24871A37805g5196r2789l48A71285
9716i6647G4744L26700E6474N4628i3342B2662h6400m9210A26425b15093M8303
$$ plain form
9797 -280260 -185429 -188354 70783 38051 -198936 -375967 49095 106517 -542822 -82755 -53046
9786 -53046 -117862 -240434 -14723 117253 -54227 23511 -87628 -218173 -226587 -15131 166209
9774 -205049 -119102 113729 33453 -79342 -265140 -261586 -86113 -154467 70843 161084 248019
9763 248019 36451 -68831 -106946 -108779 -123660 -69399 -91904 -226817 61027 21037 -53489 303498
9750 96925 -68366 -83393 -9602 -76310 -157248 -86324 -69763 53711 -521680 -142451 131203
9738 281651 -168342 -318144 -200486 131565 -113055 205091 -187802 3879 -168504 -358512
9728 -358512 -185239 43988 -33284 -85423 259409 -124871 137805 -75196 -167985 -168333 171285
9716 -96647 74744 401444 56474 111102 -93342 22662 -86400 -135610 126425 -215093 -166790
9705a66790k50314A52036J80767c4766q1047k71578A96058b74569H2624l5457
9695D7167a23452M1250J5213D6579h3253b4424p007D63138I0459a59781k3077
9684a82858j29478J24120l620d0479B5972b11680G7487a00596o2886c2970j9950
9673e2920F5037d1761D2669a46296J2285E315b73535a34928d3203k31291g9446
9661a25008j03342b8911A7483a34500C48513g8396f612j99777F8170d7254H2336
9649b09169h9856C8248j2094J78941a09860N1276A06849a82106f5875B6565K41204
9638B67769J34014a57396N6643k82435I9203a03131G6777b74746A65305b06307
9627b97985J18859J5425i135B10471b51669g6328I6431c74704F8612a35898A73081
$$ plain form
9705 -166790 -417104 152036 332803 -34766 -115813 -387391 196058 -274569 82624 47167
9695 47167 -123452 -82202 -66989 46579 -83253 -24424 -31431 463138 90459 -159781 -182858
9684 -182858 -312336 -188216 -191836 -40479 25972 -211680 77487 -100596 -163482 -32970 -52920
9673 -52920 65037 -41761 42669 -146296 -134011 5315 -273535 -134928 -43203 -274494 -79446
9661 -125008 -228350 -28911 17483 -134500 348513 -78396 -6612 -206389 68170 -47254 82336
9649 -209169 -89856 38248 26154 205095 -109860 -58584 106849 -182106 -65875 26565 267769
9638 267769 401783 -157396 -100753 -383188 99203 -103131 76777 -274746 165305 -206307
9627 -297985 -179126 -163701 -9135 210471 -251669 -76328 96431 -374704 68612 -135898 173081
9615A60109a48558m4092b7221k2363o0316j90466H8023j2545i8726A7079a51179
9603F2151L0817b73087g4670n4389N9948m6567j22216C11867c1723h478A56935
9591B26377g5945E0295h769E5824B5138O8628b62814J30607j71864h6845A66183
9579B03080b67529e1712A68148e2731J8738g594q9486A13332O8503F920c64744
9567A23718b37453I7864f7060p0217f2133B76490a2761H3553b28269J11793I3573
9555c42364c3863k13594q202i591j15462D7160a20441A91306p4488C20Q7726b35583
9542H8387c05168D4557M2462m110K73529a07648q531e4068q6526n4511b7901B28307
9529b94308J26893H5858b37022A15583B8365a5756n0283j8788j0802b2505j33595
$$ plain form
9615 160109 -148558 -192650 -27221 -49584 -109900 -300366 88023 75478 -98726 17079 -151179
9603 62151 92968 -273087 -74670 -129059 -69111 -115678 -237894 311867 -31723 -8478 156935
9591 226377 -75945 50295 -8769 55824 25138 93766 -262814 -132207 -304071 -86845 166183
9579 203080 -267529 -51712 168148 -52731 -33993 -7594 -97080 113332 181835 6920 -364744
9567 123718 -237453 97864 -67060 -137277 -62133 276490 -12761 83553 -228269 -116476 93573
9555 -342364 -33863 -247457 -255659 -9591 -125053 47160 -120441 191306 116818 320 88046 -235583
9542 88387 -305168 44557 87019 82909 356438 -107648 -116179 -54068 -140594 -195105 -27901 228307
9529 -294308 -167415 85858 -237022 115583 28365 -15756 -66039 -84827 -95629 -22505 -156100
9518a56100P3050K6725p6139A5271K64784a69614n3343n8384f329A10948a35855
9506d302G5362J05283D0377K816a79279j3570L4654j99267d1624J0565j65166
9495a96225j8049M0231G9821B4879e9125F0829M1857a76009f9049l03835a75946
9483H285J2642J36556f3173J4641q6339F1630a01097k5908N215o9613B2446a72830
9470a09773K7236b3918j89300d9780C1151M4388i8032n8541q6612E6665c3518
9458b2246j93759r6560C1803e9757O421k64143a42588d2560A09782K06162g311
9446b80678J28446m4918j60008h5297o659E5676c7498k16731A53115M9813b52805
9434a47873c418m8187C3256M0950g9213C7589l329a87628d8820A72604P5338b56190
$$ plain form
9518 -156100 -83050 -56325 -132464 15271 280055 -169614 -222957 -281341 -6329 110948 -135855
9506 -4302 75362 180645 40377 43193 -179279 -192849 -158195 -357462 -41624 -31059 -196225
9495 -196225 -214274 -174043 79821 24879 -59125 60829 102686 -176009 -69049 -372884 -175946
9483 8285 20927 157483 -63173 -48532 -134871 61630 -101097 -127005 -121790 -191403 22446 -172830
9470 -109773 -82537 -23918 -213218 -49780 31151 75539 -98032 -156573 -243185 56665 -33518
9458 -22246 -216005 -312565 31803 -59757 -53336 -317479 -142588 -42560 109782 315944 -7311
9446 -280678 -152232 -197150 -357158 -85297 -91956 55676 -37498 -254229 153115 202928 -252805
9434 -147873 -3418 -51605 33256 74206 -79213 37589 34260 -187628 -48820 172604 247942 -256190
9421b48334D4567h5279o6976e0079I9014h9299H9800J62401a81311B92113A40151
9409a02564B10902a05670o8550C4555a35858e0026K4456j46419M8379c7463m9688
9398h7151h184B290N8591K70782a05339B22051I7739K3141g8685A5381R0916b5278
9385e28258b04869Q2091j75803d6923C4413P7074b42915a06492j44657B74574
9374h0671A23569a45200e2736A00181a09912c8369A61746c24211M0970L0148D6507
9362C04337c68208E2593K30549a66340A444b10022a7440j18610j0469k5877E3525
9350C4860J32241a94107n3681J5874A46565b71015A3767g3589q387A5802h3936
9338a05421F39N4299J23467b75620A39994a06767B25737c6090j74274B1879b39464
$$ plain form
9421 -248334 44567 -85279 -152255 -50079 99014 -89299 89800 252201 -181311 292113 140151
9409 -102564 210902 -105670 -174220 34555 -135858 -50026 -25570 -171989 -123610 -37463 -87151
9398 -87151 -8184 2290 60881 331663 -105339 222051 97739 120880 -78685 15381 106297 -25278
9385 -528258 -204869 -122778 -298581 -46923 34413 111487 -242915 -106492 -251149 274574
9374 -80671 123569 -145200 -52736 100181 -109912 -38369 161746 -324211 -283241 -253093 46507
9362 304337 -368208 52593 283142 -166340 1444 -210022 -17440 -136050 -146519 -172396 53525
9350 34860 167101 -194107 -247788 -231914 146565 -271015 13767 -73589 -81976 15802 -83936
9338 -105421 639 54938 178405 -275620 139994 -106767 225737 -36090 -210364 21879 -239464
9326H0671N5599a17456G9346a53974n2414a1658F5584c20342J48483M5008A73226
9314A8809Q3508K004d7584j75264A62934l0655c02326H696Q3106A4978c75699
9302a59704k26068c5684A28157a72012M3636K1747r5967A17551a90374C55226
9291C2080a20219b5172k31271j911b6507k49582J21806m075A45741c69227A75420
9279a90237e2913j47707B06190b90160C22041j53444a73513d6818A5512J16049
9269A31561b4642A08725l6725E306R5829J33699h6664q4970d2998A17047E5461
9257C21208J20020A69108i4782k3565j5782A23083b36313J7491k7020q6544A55219
9245b70451L536C3036b24343d9690E5178a18733B817R389P9698B5358g0211B31998
$$ plain form
9326 80671 136270 -117456 79346 -153974 -206388 -11658 65584 -320342 -171859 -126851 173226
9314 18809 102317 104321 -47584 -222848 162934 132279 -302326 8696 91802 14978 -375699
9302 -159704 -385772 -35684 128157 -172012 -128376 -106629 -202596 117551 -190374 355226
9291 32080 -120219 -25172 -256443 -258354 -26507 -276089 -154283 -158358 145741 -369227 175420
9279 -190237 -52913 -200620 206190 -290160 322041 168597 -173513 -46818 15512 131561
9269 131561 -24642 108725 72000 5306 101135 234834 -86664 -171634 -42998 117047 55461
9257 321208 441228 169108 -94782 -118347 -134129 123083 -236313 -218822 -245842 -332386 155219
9245 -270451 -266915 33036 -224343 -49690 55178 -118733 2817 12206 91904 25358 -70211 231998
9232b2629i027r4914A93447C4743A1709c33042B06599b88660a03229d7071B02899
9220A73035a20141k17930i1896n7804c0180B8699n952O3400J5536d59090a07554
9208H3330A4451a75163g2004A94221C7466a2919n9239k1264A78853a77323I9280
9196b72558C1719b03921j63575a56054A14408n3287b16759p6764a486k9316A17035
9184h811A21957d3291j95937j59254J93859A21732P7860h0229C5816a3026D1030
9172A31444h9928a947l6198E1726a64707K8559B3709h4141o0293L8673F0824J13313
9160A74137J36281b20194A66944a84508a9678A36357A41K77493G2210J04403J9730
9149A96343a85715A58440a0516k67941A62589J55418e0937m37116i5030O310j28176
$$ plain form
9232 -22629 -9027 -103941 193447 34743 11709 -333042 206599 -288660 -103229 -47071 202899
9220 173035 -120141 -338071 -91896 -149700 -30180 28699 22747 86147 101683 -459090 -107554
9208 83330 14451 -175163 -72004 194221 37466 -12919 -72158 -93422 178853 -177323 99280
9196 -272558 31719 -203921 -367496 -156054 114408 61121 -216759 -293523 -1486 -30802 117035
9184 -8811 121957 -43291 -239228 -398482 -204623 121732 199592 -80229 35816 -13026 41030
9172 131444 -89928 -1947 -38145 51726 -164707 -136148 23709 -84141 -144434 -105761 60824 174137
9160 174137 310418 -220194 166944 -184508 -19678 136357 141 277634 72210 176613 196343
9149 196343 -185715 158440 -10516 -278457 162589 318007 -50937 -488053 -95030 -88720 -216896
9138b16896d2960F8957J1468c05898B01111L9014a36362m2150A27501f2802C2466
9126a74884L1895k49912D3018J79505h4585j33538E5457R2725l9237a35030j42667
9115b77697A54867P6060A6630L08610B7357c2823G3550a41886O1402A8702a87835
9103A09717L6634b51646l4234b6739j5668l11859J60991A50353a39668O5180K4630
9092d9858J9618H9264A5890a41011C1821h3261r142H7798c5269r3635i7C1716
9079c1541J0374A52261b50481A72038b93829f3203A9696K8437h100k1814l06390
9068c36304B19937a18454N4963j33982A16776a00227D0128i3541n028J3163j01926
9057a87332j9959J8033j22026J52827m3883a6944q5661c5008h510H6556K24265
$$ plain form
9138 -216896 -42960 68957 80425 -305898 201111 240125 -136362 -178512 127501 -62802 32466
9126 -174884 -142989 -392901 43018 222523 -84585 -218123 55457 148182 108945 -135030 -277697
9115 -277697 154867 230927 16630 325240 27357 -32823 73550 -141886 -80484 18702 -187835
9103 109717 146351 -251646 -285880 -26739 -42407 -354266 -193275 150353 -139668 -74488 -49858
9092 -49858 -30240 89264 15890 -141011 31821 -83261 -92403 87798 -35269 -128904 -97 31716
9079 -31541 -21167 152261 -250481 172038 -293829 -63203 19696 48133 -8100 -29914 -336304
9068 -336304 219937 -118454 -63491 -197473 116776 -100227 40128 -93541 -98569 -85406 -187332
9057 -187332 -207291 -189258 -311284 -158457 -202340 -16944 -102605 -35008 -8510 86556 310821
9046C10821j32453b99211N8141i9129l25851A48801k9512b51875F9020m766M2071
9035A06325b18970J3711K6755a8826j152j88279a447m3827f897B20069a20425
9023h1019j79353A69030n0118a4876l6761l05102c0180j31322H2809a12926l9151
9012a52077p1587A04594a03295O65k07975J36404b284j35710B4738a05607o3890
9001a69497b834l42624D0118P301f2458d644A05865c53501A74621a66301E7482
8989F3619b09861B2171a85479F2575a17830k4431f2418B14022a19395A37767a40368
8977A67270A459N9748a5011k08186f5639E2716a27190M985C9034i947F8687b24256
8964a00521F7395c05552A7957b81302a22442E2545a7864G5347d6202R998o7789
$$ plain form
9046 310821 178368 -299211 -241070 -99129 -424980 148801 119289 -251875 69020 64254 106325
9035 106325 -218970 -205259 -178504 -18826 -19978 -208257 -1447 -45274 -6897 220069 -120425
9023 -81019 -260372 169030 118912 -14876 -51637 -356739 -30180 -161502 82809 -112926 -152077
9012 -152077 -223664 104594 -103295 -102630 -310605 -174201 -2284 -137994 24738 -105607 -169497
9001 -169497 -2834 -345458 40118 47419 -62458 -4644 105865 -353501 174621 -166301 57482
8989 63619 -209861 22171 -185479 62575 -117830 -142261 -62418 214022 -119395 137767 -140368
8977 167270 1459 61207 -15011 -223197 -65639 52716 -127190 -122205 39034 -9947 68687 -224256
8964 -100521 67395 -305552 17957 -281302 -122442 52545 -17864 75347 -46202 -36204 -103993
8953a03993A87025H6536b72476n834b6638k56528R5913B23437c8183A1486b4586
8941f3179A17374a8027k0394l26566A81472B1608e7144A79000a75224c3390A3901
8929a6278B57339A8362R2667K49296a04299A08498N23933N47631L755573A864113
8918G40216E8451a88665A12703j6139b77078A55011a88327F5641b71125J35153
8908a35972B43443a11621j25827H771J09688a94937A54809C8604N387a88382P0596
8897a17786H5331P327a92569n2277I5295b17274A48949c02494C1256b74925c8067
8885a51962L8014l9202g2215l0823k25996d1248p1972o0990A09621C2491J95063
8874B27554A11956k7825a19665j34593E0336e8473o0930L6345h769A7117b78301
$$ plain form
8953 -103993 187025 86536 -272476 -278310 -26638 -283166 -187253 223437 -38183 11486 -24586
8941 -63179 117374 -18027 -38421 -364987 181472 21608 -57144 179000 -175224 -33390 13901
8929 -16278 257339 18362 111029 360325 -104299 108498 632431 1180062 4935635 1864113
8918 740216 58451 -188665 112703 96564 -277078 155011 -188327 65641 -271125 -135972
8908 -135972 243443 -111621 -237448 8771 118459 -194937 154809 38604 43991 -188382 -117786
8897 -117786 85331 92658 -192569 -244846 95295 -217274 148949 -302494 31256 -274925 -38067
8885 -151962 -113948 -153150 -72215 -103038 -329034 -41248 -113220 -174210 109621 32491 227554
8874 227554 111956 84131 -119665 -254258 50336 -58473 -119403 -83058 -8769 17117 -278301
8862a14558A6598c9354o8510a5941G9567b06295A32036a87365h9787G7077b39025
8850c72535a68489k24584J77241j48154A70609d8323J1358A26610b51184a17570
8839C21184b17649b6180m8206p7726A79941b0528K832C5797K1172A6204L4551
8828E0755h1676b2577B26972a08309b4365j89890A95001F7262N7172J21240J4615
$$ plain form
8862 -114558 16598 -39354 -107864 -15941 79567 -206295 132036 -187365 -89787 77077 -239025
8850 -372535 -168489 -393073 -215832 -363986 170609 -48323 -36965 126610 -251184 -117570
8839 321184 -217649 -26180 -74386 -152112 179941 -20528 -17696 35797 56969 16204 50755
8828 50755 -81676 -22577 226972 -108309 -24365 -214255 195001 67262 124434 245674 260289
$$ [...]
##END NTUPLES=NMR SPECTRUM
##END=
