##TITLE=NES1007_929159_9232788_6avWAGcTBk
##JCAMPDX= 6.0         $$ Bruker NMR JCAMP-DX V2.0
##DATA TYPE= NMR SPECTRUM
##DATA CLASS= NTUPLES
##ORIGIN= BRUKER
##OWNER= Administrator
$$ 1.72 TOPSPIN		Version 2.1
$$ 2015-06-17 16:11:29.550 -0700  Administrator@X
$$ Compression mode = diff/dup
##.OBSERVE FREQUENCY= 400.02188249412
##.OBSERVE NUCLEUS= ^1H
##.ACQUISITION MODE= SIMULTANEOUS (DQD)
##.ACQUISITION SCHEME= undefined
##.AVERAGES= 8
##.DIGITISER RES= 22
##SPECTROMETER/DATA SYSTEM= spect
##.PULSE SEQUENCE= zg30
##.SOLVENT NAME= COFFEE_meoh
##.SHIFT REFERENCE= INTERNAL, COFFEE_meoh, 1, 14.98509
##AUDIT TRAIL= $$ (NUMBER, WHEN, WHO, WHERE, PROCESS, VERSION, WHAT)
$$ ##TITLE= Audit trail, TOPSPIN		Version 2.1
$$ ##JCAMPDX= 5.01
$$ ##ORIGIN= Bruker BioSpin GmbH
$$ ##OWNER= Administrator
$$ $$ E:\/data/COFFEE/nmr/NES1007_929159_9232788_6avWAGcTBk/10/pdata/1/auditp.txt
$$ ##AUDIT TRAIL=  $$ (NUMBER, WHEN, WHO, WHERE, PROCESS, VERSION, WHAT)
(   1,<2015-06-17 16:11:22.206 -0700>,<Administrator>,<X>,<go>,<TOPSPIN 2.1>,
      <created by zg
	started at 2015-06-17 16:10:16.284 -0700,
	POWCHK enabled, PULCHK disabled,
       configuration hash MD5:
       21 0F 79 D6 B3 7B B4 F6 88 20 88 DB 03 48 BD 9F
       data hash MD5: 64K
       01 D5 FB 8C 71 8F 69 5E 99 22 01 C2 A7 65 90 DC>)
(   2,<2015-06-17 16:11:25.519 -0700>,<Administrator>,<X>,<proc1d>,<TOPSPIN 2.1>,
      <Start of raw data processing
       efp LB = 0 FT_mod = 6 PKNL = 1 PHC0 = 0 PHC1 = 0 SI = 32K 
       data hash MD5: 32K
       7D 3E 1D E7 41 B7 2E 2D DD 3C E6 B7 77 DE 18 87>)
(   3,<2015-06-17 16:11:25.816 -0700>,<Administrator>,<X>,<proc1d>,<TOPSPIN 2.1>,
      <pk PHC0 = 93.26843 PHC1 = 0 
       data hash MD5: 32K
       99 76 20 E0 28 AA 15 F2 3F 9B 42 D9 F2 C2 7D C2>)
(   4,<2015-06-17 16:11:25.925 -0700>,<Administrator>,<X>,<proc1d>,<TOPSPIN 2.1>,
      <abs ABSG = 1 
       data hash MD5: 32K
       38 8D CA 4C 82 A2 98 E4 DE F9 13 6C 7E 8A AC 33>)
(   5,<2015-06-17 16:11:25.987 -0700>,<Administrator>,<X>,<proc1d>,<TOPSPIN 2.1>,
      <abs ABSG = 2 
       data hash MD5: 32K
       73 F3 34 44 8B 7E 7C 2D BD 05 3F 9D 81 AC 5E 4B>)
(   6,<2015-06-17 16:11:26.034 -0700>,<Administrator>,<X>,<proc1d>,<TOPSPIN 2.1>,
      <abs ABSG = 3 
       data hash MD5: 32K
       87 D6 B9 B9 25 CD 05 27 42 DD 0E F0 64 23 85 69>)
(   7,<2015-06-17 16:11:26.097 -0700>,<Administrator>,<X>,<proc1d>,<TOPSPIN 2.1>,
      <abs ABSG = 4 
       data hash MD5: 32K
       B6 B6 C4 16 AB DD CB B7 F6 39 29 94 58 90 9F 79>)
(   8,<2015-06-17 16:11:26.159 -0700>,<Administrator>,<X>,<proc1d>,<TOPSPIN 2.1>,
      <abs ABSG = 5 
       data hash MD5: 32K
       FF F0 CA E3 B5 11 F6 92 7C 41 AC 1E BF 4E C8 DA>)
$$ ##END=
$$ 
$$ $$ hash MD5
$$ $$ 2A A8 D7 93 75 81 23 8C A6 D2 C8 4B 5E 07 1D 3A
##$RELAX= 
##$RELAX= 
##$RELAX= 
##$RELAX= 
##$RELAX= 
##$RELAX= 
##$RELAX= 
$$ Bruker specific parameters
$$ --------------------------
##$DU= <E:\>
##$EXPNO= 10
##$NAME= <NES1007_929159_9232788_6avWAGcTBk>
##$PROCNO= 1
$$ [...]
##$TP= (0..7)
150 150 150 150 150 150 150 150
##$TP07= 0
##$TPNAME0= <>
##$TPNAME1= <>
##$TPNAME2= <>
##$TPNAME3= <>
##$TPNAME4= <>
##$TPNAME5= <>
##$TPNAME6= <>
##$TPNAME7= <>
##$TPOAL= (0..7)
0.5 0.5 0.5 0.5 0.5 0.5 0.5 0.5
##$TPOFFS= (0..7)
0 0 0 0 0 0 0 0
##$TUNHIN= 0
##$TUNHOUT= 0
##$TUNXOUT= 0
##$USERA1= <user>
##$USERA2= <user>
##$USERA3= <user>
##$USERA4= <user>
##$USERA5= <user>
##$V9= 5
##$VALIST= <valist>
##$VCLIST= <CCCCCCCCCCCCCCC>
##$VD= 0
##$VDLIST= <DDDDDDDDDDDDDDD>
##$VPLIST= <PPPPPPPPPPPPPPP>
##$VTLIST= <TTTTTTTTTTTTTTT>
##$WBST= 2048
##$WBSW= 25
##$XGAIN= (0..3)
0 0 0 0
##$XL= 0
##$YL= 0
##$YMAX_a= 618647
##$YMIN_a= -519148
##$ZGOPTNS= <>
##$ZL1= 120
##$ZL2= 120
##$ZL3= 120
##$ZL4= 120
##$ABSF1= 14.98509
##$ABSF2= -5.573092
##$ABSG= 5
##$ABSL= 3
##$ALPHA= 0
##$AQORDER= 0
##$ASSFAC= 0
##$ASSFACI= 0
##$ASSFACX= 0
##$ASSWID= 0
##$AUNMP= <proc_prof1d_extract_pilot.lims>
##$AXLEFT= 0
##$AXNAME= <>
##$AXNUC= <1H>
##$AXRIGHT= 0
##$AXTYPE= 0
##$AXUNIT= <>
##$AZFE= 0.1
##$AZFW= 0.1
##$BCFW= 0
##$BC_mod= 0
##$BYTORDP= 0
##$COROFFS= 0
##$CY= 15
##$DATMOD= 1
##$DC= 0
##$DFILT= <>
##$DTYPP= 0
##$F1P= 0
##$F2P= 0
##$FCOR= 0.5
##$FTSIZE= 32768
##$FT_mod= 6
##$GAMMA= 0
##$GB= 0
##$INTBC= 1
##$INTSCL= 1
##$ISEN= 128
##$LB= 0
##$LEV0= 0
##$LPBIN= 0
##$MAXI= 10000
##$MC2= 0
##$MEAN= 0
##$ME_mod= 0
##$MI= 0
##$NCOEF= 0
##$NC_proc= -8
##$NLEV= 6
##$NOISF1= 0
##$NOISF2= 0
##$NSP= 0
##$NTH_PI= 0
##$NZP= 0
##$OFFSET= 14.98509
##$PC= 1
##$PHC0= 93.26843
##$PHC1= 0
##$PH_mod= 1
##$PKNL= yes
##$PPARMOD= 0
##$PPDIAG= 0
##$PPIPTYP= 0
##$PPMPNUM= 2147483647
##$PPRESOL= 1
##$PSCAL= 4
##$PSIGN= 0
##$PYNMP= <proc.py>
##$REVERSE= no
##$SF= 400.02
##$SI= 32768
##$SIGF1= 0
##$SIGF2= 0
##$SINO= 400
##$SIOLD= 32768
##$SPECTYP= <>
##$SREGLST= <1H.CDCl3>
##$SSB= 0
##$STSI= 32768
##$STSR= 0
##$SW_p= 8223.68421052631
##$SYMM= 0
##$S_DEV= 0
##$TDeff= 65536
##$TDoff= 0
##$TI= <>
##$TILT= no
##$TM1= 0
##$TM2= 0
##$TOPLEV= 0
##$USERP1= <user>
##$USERP2= <user>
##$USERP3= <user>
##$USERP4= <user>
##$USERP5= <user>
##$WDW= 1
##$XDIM= 32768
##$YMAX_p= 440988125
##$YMIN_p= -748267
##$CURPLOT= <Network HP LaserJet P1505>
##$CURPRIN= <$Network HP LaserJet P1505>
##$DFORMAT= <normdp>
##$LAYOUT= <+/1D_H.xwp>
##$LFORMAT= <normlp>
##$PFORMAT= <normpl>
##$SURQMSG= 1
$$ End of Bruker specific parameters
$$ ---------------------------------
##NTUPLES= NMR SPECTRUM
##VAR_NAME=  FREQUENCY,     SPECTRUM/REAL,   SPECTRUM/IMAG
##SYMBOL=    X,             R,               I
##VAR_TYPE=  INDEPENDENT,   DEPENDENT,       DEPENDENT
##VAR_FORM=  AFFN,          ASDF,            ASDF
##VAR_DIM=   32768,         32768,           32768
##UNITS=     HZ,            ARBITRARY UNITS, ARBITRARY UNITS
##FACTOR=    0.250966925370066, 1,           1
##FIRST=     8223.43324360094, -80705,       -45863
##LAST=      0,             -174159,         59034
##MIN=       0,             -748267,         0
##MAX=       8223.43324360094, 440988125,    0
$$ Real data points
##PAGE= N=1
##DATA TABLE= (X++(R..R)), XYDATA
$$ [...]
19481a05388k95489e8549B23348D8614a63374D5829N7899Q8455a48071e6314j29000
19470a85314C04098j41692b14243i9561N970A61920i0670H5942J1621a16645c2512
19458a02255j42177a9657o2704E2076N9348b18500J3254g6866K7581j85231H7632
19446A04731c60777R2900a10438I3636b54686h1151j42969l3848P9315C7245a34039
19434A38491i4843k06097C8501L961e8320m47969i2381b0870n8469D02623l3688
19423C68935A11913b03154g7975j04885B33822C068J0026J21253b81764J00174
19413a81590r7523D0403g4334r9331f3342b3573p7930j48501a0351m48430E3298
19401H413b49260J09614F9051Q4683a95001m2392r1290K5310e3586A04259J1486
$$ plain form
19481 -105388 -400877 -58549 223348 48614 -163374 45829 103728 192183 -148071 -56314 -185314
19470 -185314 304098 162406 -214243 -99561 -93591 161920 -90670 85942 97563 -116645 -32512
19458 -102255 -244432 -19657 -82361 52076 111424 -218500 -205246 -76866 -49285 -234516 87632
19446 104731 -360777 -267877 -110438 93636 -254686 -81151 -224120 -257968 -178653 37245 -134039
19434 138491 -94843 -300940 38501 42462 -58320 -506289 -92381 -20870 -79339 402623 368935
19423 368935 111913 -203154 -77975 -182860 233822 3068 13094 134347 -281764 -181590
19413 -181590 -279113 40403 -74334 -173665 -63342 -23573 -101503 -250004 -10351 -458781 53298
19401 8413 -249260 -139646 69051 153734 -195001 -237393 -328683 -303373 -53586 104259 115745
19390A15745a09986A3153c69452a15429o5084L0901A10057K0119a27253l7773
19380a65026g6642j97808a02393G4848f5581e476k99689E9712J7506J19605a42197
19368b44577e6321k06526i3792A43028r123a61059k99591J86566E6027K3046d0927
19356C05187G9822c5846j35558L8265j73897e4839A01641K22719a46325n9725
19346b06050e2181k58669I8964b24365j37020A00628m5465K70536b7573j34158
19336a61731I120R3879J91124b38885A68603a93634h0010A20985c34164g0888
19325A88148E0454b60836B04208I6370J79889a12512e5653o1251e6140e553q774
19314a4327E6394a13377B2756c60206B82929C2730K7045J6784f2979j03843Q0852
$$ plain form
19390 115745 -109986 13153 -369452 -115429 -180513 -149612 110057 130176 -127253 -165026
19380 -165026 -76642 -274450 -102393 74848 -65581 -5476 -305165 59712 77218 196823 -142197
19368 -244577 -56321 -262847 -93792 143028 133905 -161059 -460650 -274084 56027 79073 -40927
19356 305187 79822 -35846 -171404 -133139 -307036 -54839 101641 324360 -146325 -206050
19346 -206050 -52181 -310850 98964 -224365 -361385 100628 55163 325699 -27573 -161731
19336 -161731 9120 102999 294123 -238885 168603 -193634 -80010 120985 -334164 -70888
19325 188148 50454 -260836 204208 96370 276259 -112512 -55653 -116904 -56140 -5553 -14327
19314 -14327 56394 -113377 22756 -360206 282929 32730 59775 76559 -62979 -166822 -85970
19303h5970j23633R5956A32821f6780m05013A53937b32379I3401i3658I1418C6046
19291i4143K6394p3371l0444C92957A05633M3556a08978J9816J7397i055F2071
19279a51791B24100f201j68083f0805j15983g8044G3581K01595C6589K7885R387
19268G3861b52881k76705J32031D7652e790n3167B85136b32341E4118c8045q949
19257d6994j46588A12778k0443j8040a55760c1227m1724M831r496j03475j39152
19246c20243L0218A63680a55399k18810a16267j1287k07756B99529A48683a15960
19235C9626A7514a50585B8716R9927a27530F1558M5655f0793j11960q1415B4377
19223c00933B13126a95097j64382D8109A3585a7481l74591B6744e2692j8738n9068
$$ plain form
19303 -85970 -209603 -113647 132821 -66780 -471793 153937 -232379 93401 -93658 91418 36046
19291 -94143 -67749 -141120 -171564 392957 105633 149189 -108978 -89162 -71765 -9055 62071
19279 -151791 224100 -6201 -174284 -60805 -176788 -78044 73581 275176 36589 64474 73861
19268 73861 -252881 -529586 -397555 47652 -5790 -58957 285136 -232341 54118 -38045 -46994
19257 -46994 -193582 112778 92335 74295 -155760 -31227 -72951 -68120 -77616 -181091 -320243
19246 -320243 -290025 163680 -155399 -374209 -116267 -127554 -335310 299529 148683 -115960
19235 39626 17514 -150585 28716 128643 -127530 61558 107213 -60793 -172753 -254168 24377
19223 -300933 213126 -195097 -359479 48109 13585 -17481 -392072 26744 -52692 -71430 -130498
19212a30498j7890k9683d3636D24046e0598l00474J20009J13349C10189E6386
19201e9889k1382D59K53278a11716M5724l34061B5266J58557a02892J7188k931
19190h8635j42286G6222a11217M2785k40667i6823C0072a8169j72999j7059R9992
19179a08235H7616c03234P8677f9984C86280A10345D8764h4718F7597c25100G8526
19167c11525J26861b6488j03403k19550J6425K9870d5821f588j38276d7720a916
19155a73673H1805f3382B6944a81288h0966B7649O3359g7708k35652q922g1722
19143c4931l58351f7637p2755E5708P8989a63921c1288A07748A1003g4625n3882
19132a28507A22963n4629c26517i1062j59769o0242a44842C9030K042A1079J42772
$$ plain form
19212 -130498 -148388 -178071 -43636 424046 -50598 -351072 -231063 -117714 310189 56386
19201 -59889 -81271 459 253737 -111716 -65992 -400053 25266 183823 -102892 -85704 -88635
19190 -88635 -230921 76222 -111217 -68432 -309099 -96823 30072 -18169 -191168 -208227 -108235
19179 -108235 87616 -303234 -224557 -69984 386280 110345 48764 -84718 67597 -325100 78526
19167 -311525 -184664 -26488 -129891 -349441 -333016 -303146 -45821 -6588 -144864 -47720 -1916
19155 -173673 81805 -63382 26944 -181288 -80966 27649 91008 -77708 -313360 -322282 -71722
19143 -34931 -393282 -67637 -140392 55708 134697 -163921 -31288 107748 11003 -74625 -128507
19132 -128507 122963 68334 -326517 -91062 -250831 -311073 -144842 39030 41072 11079 153851
19121A53851L8711H0450h4539r1103k7188i8426a1330j14930q5044A85253a81152
19109E4416a80325n7025C4036a78623D2299b23364j1259e2891j70363E0363M0670
19098I1033j866j4460J2282c70967A75125a81680D9728B216c06488a22681p3215
19087a95896c4237B00800a11020M8496A01007b28905a02624l7582b454q7540L1875
19076e8119k94293A09784b93506a02971A90605P7252j12462Q2136D8320K3679
19066G1999g7822j20072A6864a34592B19936a02416o1689P3006j6255E4718i1110
19054A52279a10644A8606L5839J0952p73J55303H0586J41347b68405B5878a91060
19042E4670F013a23391E2099d77739e0948K0145A5675L09608b09872L8505A7318
$$ plain form
19121 153851 192562 80450 -84539 -175642 -202830 -98426 -11330 -126260 -211304 185253 -181152
19109 54416 -180325 -237350 34036 -178623 42299 -223364 -234623 -52891 -223254 50363 91033
19098 91033 89167 74707 86989 -370967 175125 -181680 49728 2216 -306488 -122681 -195896
19087 -195896 -34237 200800 -111020 -62524 101007 -228905 -102624 -140206 -2454 -89994 -58119
19076 -58119 -352412 109784 -293506 -102971 190605 267857 155395 237531 48320 71999
19066 71999 -77822 -197894 16864 -134592 219936 -102416 -164105 -91099 -107354 54718 -91110
19054 152279 -110644 18606 54445 65397 64624 219927 80586 221933 -268405 25878 -191060
19042 54670 6013 -123391 52099 -477739 -50948 -30803 15675 325283 -209872 -171367 17318
19030b3275o9524L8255l938H3538K748N3418m0352J4102J94589H833O6545b37544
19017H462a89689N5802n5067A21192m1253k6333c76150B4627c6658A17340d9622
19005b13990A40221d5098A2478R8632O4228a70550k5626F8632b83977g6475C37830
18993d5953A21810J53766B6864a73896a2336b659E5333K12614n179a1922l76454
18982c88376a90661P7007q3622j63500a22553j19371c3073I4924L0857K05799
18972C31580J90259N7048m4081i7951F5141K8349i1517K1019B57101c95765a19558
18960A04499e7835p5474J9930I0929b24488e3679k8417G8272a62025k7892e2906
18948b22481C5116d51876c2426G0865d4166j02033L2410p6098j32774D8715h5336
$$ plain form
19030 -23275 -92799 -54544 -58482 83538 86286 139704 99352 113454 308043 8833 75378 -237544
19017 8462 -189689 -133887 -188954 121192 79939 53606 -376150 24627 -36658 117340 -49622
19005 -213990 140221 -45098 12478 111110 175338 -170550 -196176 68632 -283977 -76475 337830
18993 -45953 121810 275576 26864 -173896 -12336 -2659 55333 267947 262768 -11922 -388376
18982 -388376 -190661 -113654 -197276 -360776 -122553 -241924 -33073 94924 125781 331580
18972 331580 521839 578887 534806 -97951 65141 93490 -91517 -70498 257101 -395765 -119558
18960 104499 -57835 -133309 -113379 90929 -224488 -53679 -82096 78272 -162025 -189917 -52906
18948 -222481 35116 -451876 -32426 70865 -44166 -146199 -113789 -189887 -322661 48715 -85336
18936F0650a55756q5071J4075A95723l2991b7651E0180b87826E0903j007a20672
18924b8874j0074j22184B99720b77494H9133a93835M9846G3029L3393f9138j75609
18913b44747g460j62417A9046J97075K870K47968B05457P3131a22582I2552a9004
18901D78896k38191F558K09029i4360k5471G2860a64607K9677B0109b13073O5833
18890a47240n7471B01821a44049A44110a74896r6006A69028b56515C9457b91926
18879c39423J14077B57731b73670J06338L4352C7163K9052C615K90460b50239
18868B08011a60693r4106A40495a09749C30902c15551m560a17715q7343C8000
18857A22525g2033l5017l2020j87634H6786a17776e5590K6576a2726r3754E03874
$$ plain form
18936 60650 -155756 -240827 -226752 195723 162732 -27651 50180 -287826 50903 49896 -120672
18924 -28874 -38948 -161132 299720 -277494 89133 -193835 -143989 73029 106422 -69138 -244747
18913 -244747 -7460 -169877 19046 216121 218991 466959 205457 278588 -122582 92552 -19004
18901 478896 240705 6558 215587 -94360 -119831 72860 -164607 -134930 20109 -213073 -147240
18890 -147240 -204711 201821 -144049 144110 -174896 -270902 169028 -256515 39457 -291926
18879 -339423 -225346 257731 -273670 -167332 -132980 37163 66215 3615 294075 -250239
18868 208011 -160693 -254799 140495 -109749 330902 -315551 -320111 -117715 -205058 38000
18857 122525 -72033 -107050 -139070 -326704 86786 -117776 -55590 -29014 -12726 -106480 503874
18845B6417R3394J40824I4751a00822k73486h9937r6310m8337J13234p1410A06470
18833d4625A14415H394M0922K697a91950R4535r0594I1132b79929A5372a34315
18821a02332F8892a05992A82660e8972H1978K4682K36788A18587L687a46168i887
18809c07600J41745b4966A18028L11867a81481A12037c47187A40886c15992d8352
18798a29965C30715H6771b46972k1148L5972Q6899f5848k24193J21252Q1187b0095
18786E0178a41885c1530e904p2163p410F5858b75413H8329A0397B196g9902F5653
18773b09143r2939J01465B03904a51755N8074M6552B51570c84086m9680G7365
18762a61303g1170A40157b23342A09472B6991c2679A09616l952n2776k6437a43123
$$ plain form
18845 26417 119811 260635 94751 -100822 -374308 -89937 -186247 -234584 -121350 -192760 106470
18833 -44625 114415 8394 49316 52013 -191950 -97415 -188009 91132 -279929 15372 -134315
18821 -102332 68892 -105992 182660 -58972 81978 106660 343448 118587 122274 -146168 -9887
18809 -307600 -165855 -24966 118028 429895 -181481 112037 -347187 140886 -315992 -48352
18798 -129965 330715 86771 -246972 -268120 -232148 -145249 -65848 -290041 -168789 -87602 -20095
18786 50178 -141885 -31530 -5904 -78067 -85477 65858 -275413 88329 10397 2196 -79902 65653
18773 -209143 -302082 -200617 203904 -151755 -93681 -47129 251570 -384086 -433766 77365
18762 -161303 -71170 140157 -223342 109472 26991 -32679 109616 105664 52888 26451 -143123
18750f7012k99388A24654K5195D9203a50293M0487k57368e3584k66376c6601a0385
18738b72978d9626j65168h4885A12053k0149K1629a15413r4812A15724b32898
18727e3823D9113K19221a18595A58a50226r9887d5563q2798m1585B07016r5014
18716A12002a31352A93514h8584A08065b12117J3650j9289E3026b49929B103a12993
18704i0848K8477k7139j8393k1882c7845j34593O5498C4926a34617L3049k37059
18693c38627A39377d76946a85462o1100f2217A7183b1349j95802L2809i577j28610
18682a38187C10863a94808j383A58305Q3841a02002M2148A48712n1456h7265j08697
18671a95962C02448j26357d2151k56862A33545J49231G3600b7053j91598J08786
$$ plain form
18750 -67012 -366400 124654 149849 49203 -150293 -109806 -367174 -53584 -319960 -36601 -10385
18738 -272978 -49626 -214794 -84885 112053 91904 113533 -115413 -210225 115724 -232898
18727 -53823 49113 268334 -118595 158 -150226 -250113 -45563 -128361 -169946 207016 112002
18716 112002 -131352 193514 -88584 108065 -212117 -198467 -217756 53026 -249929 2103 -112993
18704 -90848 -62371 -89510 -107903 -129785 -37845 -172438 -106940 34926 -134617 -101568 -338627
18693 -338627 139377 -476946 -185462 -246562 -62217 17183 -21349 -217151 -184342 -9577 -138187
18682 -138187 310863 -194808 -196191 158305 242146 -102002 -59854 148712 97256 -87265 -195962
18671 -195962 302448 176091 -42151 -299013 133545 282776 73600 -27053 -218651 -109865
18661a09865j77160A66885g7461F8087a19140H7780c92238Q9956O1157f5857B26621
18649A56619F2250a47196K8585A90867E1213b92776A93381a24906K3687j92446
18639b93665O9794A47837c8572H0193d32964D6728J72876I82L44487c05638g646
18627c09224a11707p255A41425e8512A06079d9047E9784d9161k0914C32197d3266
18615c01006C36137H4530P3266c03999R9928A37678Q7777J16425d8213A03989
18604A57377p0966m2062a38502k02945p6976A28943a26627G9367J220c0656O971
18593b3685B60115a25692a246m48707B79703A01681c58959c6539a8139p1889m22200
18582e12228J60893K6103d1535A31654i9655j91076K1613C59273A4525J86631
$$ plain form
18661 -109865 -287025 166885 -77461 68087 -119140 87780 -392238 -302282 -241125 -65857 226621
18649 156619 62250 -147196 -118611 190867 51213 -292776 193381 -124906 -101219 -293665
18639 -293665 -223871 147837 -38572 80193 -432964 46728 219604 982 345469 -305638 -7646
18627 -309224 -111707 -118962 141425 -58512 106079 -49047 59784 -49161 -70075 332197 -43266
18615 -301006 336137 84530 157796 -303999 -204071 137678 225455 341880 -48213 103989
18604 157377 86411 44349 -138502 -341447 -418423 128943 -126627 79367 80587 -30656 -23685
18593 -23685 260115 -125692 -1246 -449953 279703 101681 -358959 -36539 -18139 -90028 -512228
18582 -512228 -351335 -325232 -41535 131654 -99655 -290731 -269118 359273 14525 201156
18572B01156a59132d1534j03741K5451c4295k84685L5626f2342B86129a4680j99570
18561b14250G2497b19524R5702E2916a08681A9902L3777g987q175m48587A49852
18549c56221A92206e82773J09632d5671o2915j97936p243L160A86477b41020J08290
18538a32730a8908j37645l228k13137A93376B2578b07994Q5641A47277a9408j89356
18527b08764J4439a6499m759f173A5068a57944A3028a45786O909F9191b81721
18515i882j50948c0472H3186a39449n679L6145j7770C65450A55659c3475p9051
18504a12526c1045G754M725h3978l1838J9918E3752a69642l373j48403J233A58295
18491a44358k13472D29692b4627p3581B40333a01869A39129J90399c56561b6604
$$ plain form
18572 201156 -159132 -41534 -145275 -119824 -34295 -318980 -283354 -62342 286129 -14680 -214250
18561 -214250 72497 -219524 -123822 52916 -108681 19902 53679 -7987 -16162 -464749 149852
18549 -356221 192206 -582773 -473141 -45671 -108586 -306522 -313765 -310605 186477 -241020 -132730
18538 -132730 -18908 -156553 -159781 -372918 193376 22578 -207994 -122353 147277 -19408 -208764
18527 -208764 -194325 -16499 -21258 -6173 15068 -157944 13028 -145786 -138877 69191 -281721
18515 -9882 -160830 -30472 83186 -139449 -145128 -108983 -126753 365450 155659 -33475 -112526
18504 -112526 -31045 7754 12479 -83978 -115816 -95898 53752 -169642 -173015 -321418 -320185 158295
18491 -144358 -357830 429692 -24627 -98208 240333 -101869 139129 329528 -356561 -26604
18480E6815e3112D7603i8670A16209B1541b26225G8149k1338N0352c41438A01733
18468H6088D1706b86987c0488B52265j09289D91b81749A02676a26321J2462B36914
18456a52883m8831B89029F942J53615m3636j8558A7400Q5454b3385n8238A14346
18444a13243m93188a60262A85683B7555b28385e2709k9143C28285a7360j47031
18434a64391A35033h8583D6751J04422o2524b66428C47655d7289k76145i9025
18423a08534A69378a30776k89484F1388a5539l21777A27387J43694I9194c73590
18412I2934h200q6468l9811n9324J6599j28200B46615a19306K9599A84124d4878
18400c6373B33533E1362d401A72956c36749C62345o5078I5153f8187D2584d5388
$$ plain form
18480 56815 -53112 47603 -98670 116209 21541 -226225 78149 56811 107163 -341438 101733
18468 86088 41706 -286987 -30488 252265 142976 491 -281749 102676 -126321 -113859 236914
18456 -152883 -201714 289029 6942 160557 116921 98363 17400 102854 -23385 -81623 114346
18444 -113243 -606431 -160262 185683 27555 -228385 -52709 -81852 328285 -17360 -164391
18434 -164391 135033 -88583 46751 151173 88649 -266428 347655 -47289 -323434 -99025
18423 -108534 169378 -130776 -420260 61388 -15539 -337316 127387 271081 99194 -373590
18412 92934 -8200 -94668 -134479 -193803 -177204 -305404 246615 -119306 -89707 184124 -44878
18400 -36373 233533 51362 -4401 172956 -336749 362345 297267 95153 -68187 42584 -45388
18388G6917M7264a86717J2897m07561H5652a27568A54506g7948B80616K7720C8330
18376d4120G3508b34969j17189j44111g6761j79993D4010d6513j08266k6179c4327
18364a39366A81230a52010a1709N209C07237a05559B1982Q3900k3492J36672a12919
18352b04756b6376p2203k0522B17380O3476a07309k33420h436j94949K0926f2039
18340C8587c44631m6852J36352C33634H0466M0105b7808j92083A26090b83935
18329C9958b2288j45348O9116D2827a4596A66947b39171D7206b24870k6881B16997
18317B1028a24691L0399m0698j297d8242J3645A96721a80801K9876a9687B09869
18305a88948B4213c39055J69123q4933i7903D758d7493A3746a93928B66028b36024
$$ plain form
18388 76917 124181 -186717 -173820 -581381 85652 -127568 154506 -77948 280616 308336 38330
18376 -44120 73508 -234969 -352158 -496269 -76761 -256754 44010 -46513 -154779 -180958 -34327
18364 -139366 181230 -152010 -11709 -6500 307237 -105559 21982 105882 82390 219062 -112919
18352 -204756 -26376 -98579 -119101 217380 280856 -107309 -340729 -8436 -203385 -182459 -62039
18340 38587 -344631 -391483 -255131 333634 80466 120571 -27808 -219891 126090 -283935
18329 39958 -22288 -167636 -98520 42827 -14596 166947 -239171 47206 -224870 -251751 216997
18317 21028 -124691 -94292 -134990 -136287 -48242 -34597 196721 -180801 -150925 -19687 209869
18305 -188948 24213 -339055 -169932 -254865 -97903 4758 -47493 13746 -193928 266028 -236024
18293A26150E7925Q6203i7202l17771P0890B3112K60882D7064P6950a6854k21517
18282b38371d0536l6585j15912B87160g231A43895a40077M9351O844F8888A8581
18270A07727b22923D20316e0546i080j2968B00800D6235a16664m145A17743a90677
18258B8031e9290A24851a52148B1066f9783a6665k02587B3052K5017a8993m4491
18247f3484k8095j52624c9938r839E3768J68363a1961a026G9681c23814J55330
18236a68484C35310e0722f342j44742p5746d2028A7513K74223B2191R9911b1459
18224h9477L9053K0127B11433c70724J84108g9720A34784K4017J00044r1548b5140
18212A20607A6178i9573K4090D5055b29940a2287A75153E7290j7412J57552b37021
$$ plain form
18293 126150 57925 144128 -97202 -414973 -344083 23112 283994 47064 124014 -16854 -238371
18282 -238371 -40536 -77121 -193033 287160 -7231 143895 -140077 -90726 -83882 68888 18581
18270 107727 -222923 420316 -50546 -9080 -22048 200800 46235 -116664 -120809 117743 -190677
18258 28031 -59290 124851 -152148 21066 -69783 -16665 -219252 23052 48069 -18993 -63484
18247 -63484 -91579 -244203 -39938 -49777 53768 222131 -11961 -1026 79681 -323814 -168484
18236 -168484 335310 -50722 -6342 -151084 -226830 -42028 17513 291736 22191 122102 -21459
18224 -89477 -50424 -30297 211433 -370724 -186616 -79720 134784 158801 258845 167297 -25140
18212 120607 16178 -99573 -75483 45055 -229940 -12287 175153 57290 39878 197430 -237021
18200D23669b878I814a58029A15821A4292J61132b04590D0039l02M1017k6570
18189E4184b0369B13286B2984b0009k15495d3539C5897a05879a2680P63A39054
18177a65794Q2553D5164a03463J9091p6058e1023B3853J3153A41K03755I7503
18165a08116k04358a25278j21300J04031A40007A5365J0879M1666P6231a76340
18154d1269B92656h5444K700l01688A51741d32372J11353B79360D9342a35732
18143B40760g449A7246K21743D5480b2430j47720G7840c19938a37913k3478A07023
18131H2035g1866j90250a05122I7989M7927b18805e5043k03960E8440d3515B8492
18119F8368a56888O2392A16237h5422B33682c2831k44053g0371n7750F8972P744
$$ plain form
18200 423669 -2878 9814 -158029 115821 14292 175424 -204590 40039 39737 80754 54184
18189 54184 -20369 213286 22984 -20009 -235504 -43539 35897 -105879 -12680 -11917 139054
18177 -165794 -83241 45164 -103463 -84372 -160430 -51023 23853 37006 141 203896 97503
18165 -108116 -312474 -125278 -246578 -142547 140007 15365 26244 67910 144141 -176340
18154 -41269 292656 -85444 -82744 -384432 151741 -432372 -321019 279360 49342 -135732
18143 240760 -7449 17246 238989 45480 -22430 -170150 77840 -319938 -137913 -161391 107023
18131 82035 -71866 -262116 -105122 97989 145916 -218805 -55043 -259003 58440 -43515 28492
18119 68368 -156888 -94496 116237 -85422 233682 -32831 -276884 -70371 -128121 68972 76716
18108G6716b04802d6102j66909H2159c0830j3778A61177g8991c1060j63546f3121
18096a57440P3664H777L8678A7346a51913C0807J79748b7169p0607K1178B86276
18084B79407m194C513J29888a0258C2461a41486A38012m2036d51927h0179m2423
18073a22602G1857L5221H439d9983I3356c40413I5468j3522O8625b43667P4086
18062a69581A82854n9114m8948i35j481A79563d9237l18153J41819J12689A21141
18050A02135a37247I5537c93027A02551b97321A54437a00083A19318B7914J44644
18040A72558a10879c7771D3742O4142a26124I5691q060P3260l7559a33425A51965
18028c09699a17603C78261b06945F5355b38964f7194k39796L3826L901A7318L10545
$$ plain form
18108 76716 -204802 -46102 -213011 82159 -30830 -44608 161177 -78991 -31060 -194606 -63121
18096 -157440 -83776 8777 47455 17346 -151913 30807 210555 -27169 -97776 -76598 286276
18084 279407 275213 3513 133401 -10258 32461 -141486 138012 95976 -451927 -80179 -122602
18073 -122602 71857 107078 8439 -49983 93356 -340413 95468 81946 150571 -243667 -169581
18062 -169581 182854 123740 74792 -935 -2416 179563 -49237 -367390 -225571 -112882 121141
18050 102135 -137247 95537 -393027 102551 -297321 154437 -100083 119318 27914 172558
18040 172558 -110879 -37771 43742 107884 -126124 95691 87631 160891 123332 -133425 151965
18028 -309699 -117603 378261 -206945 65355 -238964 -67194 -306990 -273164 -269263 17318 327863
18017C27863D5922a8528q5890k2578e5277C38272j45382a98224P3509e3585A68558
18005g7395C78709c5338k98554e6002H0979a10638a6480r0215A8046b08062g8921
17993D01342r4581G959a37617N5704A82083a91245N2981c722l81690M4742B08907
17981d8853q6679E3100a20455M7890k74504a04886A05995K3843b73439I0349B7233
17969C8696b40630A8002J45612n7475g2075p2492A08017J83786c1261B22457p4499
17958A47958J66050a1405D6555a07524G4017a17701B6830K39938d07755b3867
17947c54050B10494m1133D9369J83490j12737c9770o4671l0133c6304n3287j23113
17936b12704i8981J6230J4709A43168M3342L6822a47953A591h5422b4835o3951
$$ plain form
18017 327863 45922 -18528 -104418 -126996 -55277 338272 192890 -198224 -124715 -53585 168558
18005 -77395 378709 -35338 -333892 -56002 80979 -110638 -16480 -106695 18046 -208062 -78921
17993 401342 306761 7959 -137617 -81913 182083 -191245 -138264 -3722 -385412 -340670 208907
17981 -48853 -135532 53100 -120455 -72565 -347069 -104886 105995 129838 -273439 90349 27233
17969 38696 -240630 18002 163614 106139 -72075 -144567 108017 291803 -31261 222457 147958
17958 147958 314008 -11405 46555 -107524 74017 -117701 26830 266768 -407755 -23867
17947 -354050 210494 169361 49369 232859 120122 -39770 -104441 -134574 -36304 -89591 -212704
17936 -212704 -98981 -82751 -68042 143168 186510 223332 -147953 1591 -85422 -24835 -88786
17925h8786c7178D8573K00918I9408c69012B82453a30419B8483P7391K3435H888
17913b38165L1490N7612A46389d59011A70358f0970C78559A51549a45215N1821
17903i3394G8255f7567o6237E0804p693b19725e5994H0965J62274b283k22354
17892b24637E46806d5800J5307j58730A56282K01390a352p2663C3726L07042B6116
17880f6414A20641b97421A02293J69659a6265C6633a78954A32644J62824a6140
17869G8598B0195i2591k32173C4580c4580G7265f5444G0249C0060b010D5828L30045
17857C75873b81034B27025g9217k6767K9105c0756m8567A56022a07295L811E4994
17845b02851C82991a32834L5706B61686D5945n835g749I1233j5391a174B73998
$$ plain form
17925 -88786 -37178 48573 249491 99408 -369012 282453 -130419 28483 105874 129309 8888
17913 -238165 -206675 -149063 146389 -459011 170358 -60970 378559 151549 -145215 -93394
17903 -93394 78255 -67567 -133804 50804 43111 -219725 -55994 80965 243239 -2283 -224637
17892 -224637 546806 -45800 -30493 -189223 156282 357672 -1352 -74015 33726 340768 26116
17880 -66414 120641 -297421 102293 271952 -16265 36633 -178954 132644 295468 -16140
17869 78598 20195 -92591 -324764 34580 -34580 77265 -65444 70249 30060 -2010 45828 375873
17857 375873 -281034 227025 -79217 -105984 -76879 -30756 -79323 156022 -107295 -103484 54994
17845 -202851 382991 -132834 -97128 261686 45945 40110 -7749 91233 75842 -1174 273998
17833D1008J04782L84500B3661K26171B9941K29616J5519G7800J16580I2014B7214
17821A01300a84400g5723D61377b4813j36237A76936J82475a12323a1012A78820
17810f848A9901J10268m8480k4389b84015b1081A98414A1555J34372i1695B21457
17798A6078a87498p5426I0667L4912b8131C55008o238q4339a1307M141B7927L3069
17786F0996K4569b96446B57070a52317M019H317K08521A124J54364E0194i9146
17774I8944k6687K19090O2947A3989b35578e101k07475A38904B0265J01619C718
17762C98396P0288j26667A29550E5460K01586B8377K72733E8442a2790j5408o0805
17751h9003A65545E9015K72445A02946f126I1870J16591e2669B34021J1222J01843
$$ plain form
17833 41008 145790 530290 23661 249832 29941 259557 275076 77800 194380 92014 27214
17821 101300 -184400 -75723 461377 -24813 -161050 176936 359411 -112323 -11012 178820
17810 -6848 19901 130169 81689 57300 -284015 -21081 198414 11555 145927 -91695 221457
17798 16078 -187498 -262924 90667 125579 -28131 355008 348770 264431 -11307 -7166 27927 60996
17786 60996 85565 -296446 257070 -152317 -148298 8317 216838 1124 155488 50194 -99146
17774 98944 72257 291347 354294 13989 -235578 -5101 -212576 138904 20265 121884 3718
17762 398396 468684 342017 129550 55460 257046 28377 301110 58442 -12790 -28198 -89003
17751 -89003 165545 59015 331460 102946 -6126 91870 208461 -52669 234021 245243 347086
17740C47086d4255k96158A8912L66033A86976e3650A34903C4386c770C19331r0488
17729B28843b27644J8365Q4405B37229F5399R2781b16557F2799K64037D1505P9818
17718A21323i8645C71482H3585J70873a82608a6286A04655L37852k14903q3915
17708A43689N0039j1398a61282D03638j62517p3151l2653L1113a96705B0915J65207
17697A86122a1905B69893b9781m2110k286A02113G695a35349C96011a60487A16288
17685D0158L1868b19359p4129A97476o1570f2061H3091a9806A7535i4963A62754
17673a28774p9662G1016b07722B17744g2091F4139J55521h1078H3978P6773J13754
17662B74505j29236m5846a56375I6293A5254K53547a75725C05299I5288M8735
$$ plain form
17740 347086 -44255 -340413 18912 384945 186976 -53650 134903 34386 -3770 319331 228843
17729 228843 -227644 -209279 -124874 237229 65399 158180 -216557 62799 326836 41505 121323
17718 121323 -98645 371482 83585 254458 -182608 -16286 104655 442507 227604 143689
17708 143689 193728 182330 -161282 403638 241121 167970 135317 166430 -196705 20915 186122
17697 186122 -11905 269893 -29781 -71891 -74177 102113 7695 -135349 396011 -160487 116288
17685 40158 72026 -219359 -293488 197476 135906 -62061 83091 -19806 17535 -94963 162754
17673 -128774 -208436 71016 -207722 217744 -72091 64139 219660 -81078 83978 160751 274505
17662 274505 145269 99423 -156375 96293 15254 268801 -175725 305299 95288 144023
17652A44023l4810J78483D1611D91a00406H9717l4270K40320C5588p716r691R2182
17640A10363K378J06393G8701N4549R7157A09373h673A7103J09575J41270a39587
17628A32802Q4263l6207B0001C293M29778j31789F2691L7066d6468H0919R9468
17617A80387a09427K0621B07623L0728o1963L06941g5345E4331O1890k9315J26567
17606B13473K10015A31609O2991i6943F0005a79081e1859B45491n4019c358B6773
17594A89484a9679A87490J27381j40468p1719K87627a09536B21403m1896G0934
17583a40794E6536J8413f5316A65712k7179C4798J83145I7258L3693L13896a6470
17571A63619l7333E3050K48484M962l2486G1568j9075M0486a95339G5643K31660
$$ plain form
17652 144023 109213 287696 41611 491 -100406 89717 55447 295767 35588 27872 18181 110363
17640 110363 112741 219134 78701 133250 230407 109373 -8673 17103 126678 267948 -139587
17628 132802 217065 180858 20001 3293 433071 301282 62691 99757 -46468 80919 180387
17617 180387 -109427 -88806 207623 238351 176388 483329 -75345 54331 116221 86906 213473
17606 213473 423488 131609 194600 -96943 60005 -179081 -51859 245491 191472 -3358 26773
17594 189484 -19679 187490 314871 174403 102684 390311 -109536 221403 179507 70934
17583 -140794 56536 74949 -65316 165712 138533 34798 217943 97258 130951 444847 -16470
17571 163619 126286 53050 301534 306496 274010 71568 52493 92979 -195339 75643 307303
17560C07303A43372n4429m2432K27372i7977B61784A25195K40151J28962B34607
17549A20543K6407O6291m6664J19480j9106O8849K13215d3539A55880J26007N2445
17538C34332C976L31939j51438K50556O1082j29689p7845J8314K47311j55419
17528C98787H1108L21864N20677j44057R0976L42446k18925l53024A40539K43072
17518C83611N1621F9123K16762L17547k6819k88003J57995K46233M10182j73973
17508I29047L28854k71794j01048C47797N7087R3803k24111p6971J90518j43528
17498B44595J15038k3683p1876o4752K3164L29648A47197J69738A24442K67537
17488C91979A33196J95046N4317J16868j63515L9168G1981J14080l8675J98856
$$ plain form
17560 307303 143372 88943 46511 273883 -97977 261784 125195 365346 494308 234607
17549 120543 146950 213241 166577 286057 266951 335800 549015 -43539 155880 281887 334332
17538 334332 3976 335915 184477 435033 496115 366426 288581 306895 554206 398787
17528 398787 81108 402972 923649 779592 870568 1213014 994089 641065 140539 383611
17518 383611 435232 69123 285885 603432 576613 288610 446605 692838 1103020 929047
17508 929047 1257901 986107 885059 347797 404884 498687 274576 197605 388123 244595
17498 244595 359633 335950 264074 199322 222486 552134 147197 316935 124442 391979
17488 391979 133196 328242 382559 499427 335912 375080 71981 186061 147386 346242
17478C46242J74289B24079G0045l3742J54934O0518J2362m2342E8391L21751I1100
17466C66048j66537N0918J1361K6039M54142l38305D4841L99763Q3090m9325c6892
17454D67744j35925A50502a88240B90596j02966L85925j53731l6532j9022j12392
17444B51878N466K78246d8871D12344Q930J49531A93552o9090L02958J95718B3118
17432C36607K02253d4882A45159A7597K14221n2977J98387j33244j08594L0021
17422A65411Q0226r1871K1068L11180K56628C32793l5070J51894A16802Q6279
17412B03081M21195k33821k1472J84308j10137A63950N21787M013B82771e8563
17401A65599P8229J16767q0090j706p204j3501e0120B78551B8987M2171L31690
$$ plain form
17478 346242 520531 224079 70045 36303 191237 251755 264117 221775 58391 380142 91100
17466 366048 199511 250429 261790 287829 741971 403666 44841 444604 527694 478369 -36892
17454 467744 331819 150502 -188240 290596 187630 573555 419824 383292 364270 251878
17444 251878 257344 535590 -48871 412344 421274 570805 193552 124462 427420 623138 23118
17432 336607 538860 -44882 145159 17597 231818 178841 377228 243984 135390 165411
17422 165411 245637 153766 174834 486014 742642 332793 297723 449617 116802 203081
17412 203081 624276 390455 368983 553291 443154 163950 685737 689750 282771 -58563
17401 165599 243828 360595 280505 278799 271595 258094 -50120 278551 28987 71158 402848
17390D02848A794M20958j88833I392L06421j45107a3457A12152J78371l7166J3
17379B53370J306L8591a9790A58348A0920J77565A2714a56085B40249K8090K23460
17368D91799J1682G1493K89733A76933A1235H25J00123C6823N43300B22477L25184
17357E47661f336B78921K96092G5626L72832j74588l508K8961D680K94477d2059
17345C46722J93099A07802J69622J05373J23338B13468M0146K66564j99129G6133
17334D28203g7532D23065A72331K61110A62570J33552q7886K27876A53959L1652
17324A85611m2471R4994K80294q4011N6043M9250B52712j9294I9586K24415j29736
17313A94265Q3557M00459B69949J81525A8900J45549K20132Q3986A75746K53207
$$ plain form
17390 402848 1794 422752 233919 9392 315813 170706 -13457 112152 290523 253357 253370
17379 253370 254676 293267 -19790 158348 10920 188485 12714 -156085 240249 268339 491799
17368 491799 503481 71493 361226 176933 11235 825 100948 36823 580123 222477 547661
17357 547661 -6336 278921 575013 75626 448458 273870 270362 299323 4680 299157 -42059
17345 346722 539821 107802 277424 382797 506135 213468 253614 520178 321049 76133
17334 428203 -77532 423065 172331 433441 162570 296122 208236 436112 153959 185611
17324 185611 143140 238134 518428 434417 490460 539710 252712 233418 99586 324001 194265
17313 194265 277822 678281 269949 451474 18900 164449 384581 468567 175746 428953
17303D28953D3693P6279K26993r7996J52622K3693a0978B38158O2530K38279B14537
17291G3985R1921L68046B39820O416a15974D06451A26610J35262K34378H9825
17280B67697L71507b7321D61566o3203A66153R6542Q0972O3491J70536B09271
17269D8608J65832J23536J43195J38718k26596P6975F0248K44118P1023L32920
17259G08309C40731N6408n4819K40119j21221j49663l1514J53093j10648J86578
17249E09064c8883E60364k30652j30076J77808I5559L90979K7690l8110j32264
17239C43854K6112j06440Q268K074L0549K34285l9603P5713k84129J53083K1929
17228D65695B11326N0771O40R3117K20825r7788Q8899q8077r9202R7734r269N9024
$$ plain form
17303 428953 43693 119972 346965 248969 401591 425284 -10978 238158 300688 538967 214537
17291 73985 165906 533952 239820 246236 -115974 406451 126610 261872 496250 89825
17280 267697 639204 -27321 461566 398363 166153 262695 343667 407158 577694 209271
17269 48608 214440 337976 481171 619889 393293 470268 60248 304366 375389 708309
17259 708309 340731 397139 342320 582439 461218 311555 280041 433134 322486 509064
17249 509064 -38883 560364 329712 199636 377444 95559 486538 514228 476118 343854
17239 343854 369966 263526 271794 273868 304417 538702 499099 574812 290683 443766 465695
17228 465695 211326 262097 262737 355854 576679 478891 567790 479713 380511 478245 468976 528000
17216E28000j11017j19954n6452J8550J74447j89032K20426k06592m8811N05636
17206G15201k11077j83529p5360L57186j11711j68341J8311K29979B72192Q1371
17196C53563J15605Q2532Q6977K5844r6599k11538J21065j93149J00845J22755
17186E07900K88617l38499K65809j26717A52444N15360k32647J4177j20r6124
17176C53090M35202B75953K51817l8326j28150J86911j46368M58256l68428j96127
17166B95538K84504k77582J27967K88089j2401j14837A98473L32109J0650J57390
17156F98622k23833j71065P9511Q2774K29511j70350J43111A69581K02211K73723
17146F45515M91218D88265J50985K6283k18451K40316j60279L1385j82855J08946
$$ plain form
17216 528000 416983 297029 240577 259127 433574 244542 464968 258376 209565 715201
17206 715201 504124 320595 245235 602421 490710 322369 340680 570659 272192 353563
17196 353563 469168 551700 638677 664521 567922 356384 477449 284300 385145 507900
17186 507900 796517 458018 723827 597110 152444 667804 435157 449334 449214 353090
17176 353090 788292 275953 527770 489444 361294 548205 401837 860093 491665 295538
17166 295538 580042 302460 430427 718516 706115 591278 198473 530582 541232 698622
17156 698622 474789 303724 383235 466009 695520 525170 668281 169581 371792 645515
17146 645515 1136733 488265 639250 665533 447082 687398 527119 558504 375649 484595
17136D84595R4496j57693K85154q4679K23120I7808L73544k9300N13710D73487
17125F07578J04645n578r9100O8943j71032K67392j22493K2611j5226J17000K2075
17114G96815J9495J61869j20746j5433q6078j12616J53858j25433m196j04710
17104E62825J3603O6314p677k74394J98456J47759R4485k87931K28931J6792k7700
17093G31463o8072J72577j7874k03847L15371J622l32739J09177k12324M2045
17083E37399L02315j25348K38150q6480l6987l4165j23504J07206L7458O7026
17073H83070K27047l34439j662J06296J9230J96344j42331j19750J86687q5162
17063I35330N0825k36521L1868j51828L08435o4642R0258j04873k6638K18343
$$ plain form
17136 484595 579091 421398 706552 621873 844993 97808 471352 442052 955762 473487
17125 607578 712223 706645 607545 676488 505456 772848 650355 672966 657740 774740 796815
17114 796815 816310 978179 857433 842000 755922 643306 797164 671731 667535 562825
17104 562825 576428 642742 635065 360671 559127 706886 801371 513440 742371 759163 731463
17093 731463 663391 835968 818094 614247 929618 931240 598501 707678 495354 537399
17083 537399 839714 714366 952516 866036 829049 794884 671380 778586 816044 883070
17073 883070 1110117 775678 774016 880312 899542 1095886 953555 833805 1020492 935330
17063 935330 986155 749634 781502 629674 938109 873467 963725 858852 832214 1050557
17053A050557K50144j52077n6552j21427p6122j00766L89944k10819K28008m4099
17043A156791j84245k47866L87393k72209L31940r9224L11112k92100J74713k34082
17033A032223k8411J25930K054k54771J16559K08561j58285J1873O8644P0235
17023A194612J2691k39907M86356n77976K94345L7920J21888q686k23552L7984
17013A135675J50248O5474j63817K24823j94953L65390n74585L4804L72490r5389
17003A320160J0774Q5313l3173j62351J10054J17464J59763n29707M18547j76408
16993A320436Q9974P8505J51298j08574k31053J17073p396J14747l16684M83098
16983A691424l22528K43432j1596K30164k15529K12840l8701l26334l6259J62254
$$ plain form
17053 1050557 1300701 1148624 1092072 970645 894523 793757 1183701 972882 1200890 1156791
17043 1156791 972546 724680 1112073 839864 1171804 1072580 1383692 1091592 1266305 1032223
17033 1032223 1003812 1129742 1131796 877025 993584 1202145 1043860 1055733 1124377 1194612
17023 1194612 1207303 967396 1453752 875776 1170121 1208041 1329929 1321243 1097691 1135675
17013 1135675 1285923 1351397 1187580 1412403 1217450 1582840 1008255 1043059 1415549 1320160
17003 1320160 1330934 1416247 1383074 1220723 1330777 1448241 1608004 1078297 1496844 1320436
16993 1320436 1410410 1488915 1640213 1531639 1300586 1417659 1410263 1525010 1208326 1691424
16983 1691424 1368896 1612328 1600732 1830896 1615367 1828207 1789506 1463172 1426913 1589167
16973A589167j54168J75869K62891j60200l07340K09406k01812P2408K51334R2286
16963A829841j06888M40835n28235O88625m02723m6269l5117O4689K10599l4099
16953B081258K5309N3542j79860R9082J05325j56232J034P5312L05940j50336
16943B260374J77589p8243j97325O9745O1596R3114k03489J06718Q1737K08J0689
16932B382713J13971k6738j7592M77718l76068j05643m5294J75700K23224L72907
16922C174898l67673j6994l57862N15418n21882K38811K94968l40057J01892K11463
16912B932982K83123m90573J00745R9843L13207m64413P65804o70502N01327L9208
16902C410751j98031m2118J32531L91163k48782o7794j16109N73386m18140L92421
$$ plain form
16973 1589167 1434999 1610868 1873759 1713559 1406219 1615625 1413813 1486221 1737555 1829841
16963 1829841 1722953 2163788 1635553 2324178 1921455 1875186 1840069 1904758 2115357 2081258
16953 2081258 2106567 2160109 1980249 2079331 2184656 2028424 2029458 2104770 2410710 2260374
16943 2260374 2437963 2359720 2162395 2232140 2293736 2386850 2183361 2290079 2371816 2372024 2382713
16932 2382713 2496684 2469946 2452354 2930072 2554004 2448361 2403067 2578767 2801991 3174898
16922 3174898 2807225 2790231 2432369 2947787 2425905 2664716 2959684 2619627 2721519 2932982
16912 2932982 3216105 2725532 2826277 2926120 3239327 2774914 3540718 2870216 3371543 3410751
16902 3410751 3212720 3170602 3303133 3694296 3445514 3377720 3261611 3834997 3416857 3809278
16892C809278M2800k26597Q7659K90760J1653k94165J22653J41333L24871k97032
16882D013213K79719L18905l27422l08733N78207m64791J1335L97968j14209N08389
16872D892581k87954K43514j76763M22028R3991k38001L67175J72318n61359L50078
16862E277608K95072j36189J2384M48210r9367J87021J33408r0131N7235p9810
16852F005441j567N30418l48109L63854K83415L4223J82025l34243J84885J93590
16842G093932p7229M34697q2142m3317K50663M68162J6283M4315j7449M76568
16832H564483K874M67133j23022N7466K14488M52671q0204M10653N4541J26052
16822A0147135L18342j5064M81301K96426j34450K78121R4861K71787L35606N72873
$$ plain form
16892 3809278 3852078 3625481 3713140 4003900 4015553 3721388 3844041 3985374 4310245 4013213
16882 4013213 4292932 4611837 4284415 3975682 4553889 4089098 4100433 4498401 4384192 4892581
16872 4892581 4604627 4848141 4671378 5093406 5187397 4949396 5316571 5488889 4927530 5277608
16862 5277608 5572680 5436491 5448875 5897085 5797718 5984739 6118147 6028016 6085251 6005441
16852 6005441 6003874 6534292 6186183 6550037 6833452 6867675 7049700 6715457 6900342 7093932
16842 7093932 7016703 7451400 7369258 7325941 7576604 8044766 8061049 8105364 8087915 8564483
16832 8564483 8567357 9034490 8911468 8968934 9183422 9636093 9555889 9966542 10021083 10147135
16822 10147135 10465477 10450413 10931714 11228140 11093690 11371811 11466672 11738459 12074065 12646938
16812A2646938P8028n2791M23540J73545M36372L59465K08636K07074M38315J56576
16802A5075698K01252O04971L60970N31114N11120n1839M44734L60081N46846
16793A8584947M77468Q54083K32540O18923O16668M30480K97771R02751P30601
16784B3746232O44110M95421O02115L55634J053216P64208J081298L70377O19785
16775B9732396J415842N59100P77624R95602J184427J118437R03450J145470J151561
16766C8983909J345726J142237J185948J389697J575992J234499J337432J474190
16758D9669630J786114J430137J600189J857501J780373J453784J941546K236801
16750F3756075J877779J701409K021428K020722K096199J930781J914538K177951
$$ plain form
16812 12646938 12724966 12672175 13095715 13269260 13705632 14065097 14273733 14480807 14919122 15075698
16802 15075698 15276950 15881921 16242891 16774005 17285125 17233286 17678020 18038101 18584947
16793 18584947 19062415 19916498 20149038 20767961 21384629 21815109 22112880 23015631 23746232
16784 23746232 24390342 24885763 25487878 25843512 26896728 27660936 28742234 29112611 29732396
16775 29732396 31148238 31707338 32484962 33480564 34664991 35783428 36686878 37832348 38983909
16766 38983909 40329635 41471872 42657820 44047517 45623509 46858008 48195440 49669630
16758 49669630 51455744 52885881 54486070 56343571 58123944 59577728 61519274 63756075
16750 63756075 65633854 67335263 69356691 71377413 73473612 75404393 77318931 79496882
16742G9496882J956002K043632J796537J850672J768296J822548J542959J691430
16734I3968958J099595J289595J413242J236630M07576N85276O09268L06476M7081
16725A00963697j91200n47041n52881m06266r58978j209392j115319j150758j568572
16716I3263290j332576k067023j544987j947294j811961j923072j967153k011375
16708G8657849k247671j970233j904632k354126k120440j679733k124355j576292
16700F2680367k093339j612714j920018k012398j681152j466923j521588j835814
16692D8536421j210253j668327j395735j179799j347857j313051j024798j635877
16684C7760724j013319q52419j275219r77377r52935j322282l31028q52163j086531
$$ plain form
16742 79496882 81452884 83496516 85293053 87143725 88912021 90734569 92277528 93968958
16734 93968958 95068553 96358148 97771390 99008020 99415596 100000872 100610140 100916616 100963697
16725 100963697 100772497 100225456 99672575 99266309 98307331 97097939 95982620 94831862 93263290
16716 93263290 91930714 89863691 88318704 86371410 84559449 82636377 80669224 78657849
16708 78657849 76410178 74439945 72535313 70181187 68060747 66381014 64256659 62680367
16700 62680367 60587028 58974314 57054296 55041898 53360746 51893823 50372235 48536421
16692 48536421 47326168 45657841 44262106 43082307 41734450 40421399 39396601 37760724
16684 37760724 36747405 35894986 34619767 33642390 32689455 31367173 31036145 30183982 29097451
16675B9097451n97847n54940j130206p22426r31773l19466j047124n15639n11626
16666B2766404o46461o37610l5856j073209n08716n78476j35750p49513k86692
16657A8114121m91969j44314o26694m04261o26844o0317k69452k73151l78611
16648A4838508o81447k35467o5920n01251k03156k66547k35673l71627j75439
16639A2101981k04951m44317l31827J23595j46205k24476k35409k52995l90466
16630I994930j82302K23175k86312l66498K8887l41075j35522j44597K7641n49601
16620H268726q1359K71385l41969l66512j61945J1610J20644k14728k75143l9719
16610G190990q6475k33327m53602L38798m44843K13414j88157j03093p847k43931
$$ plain form
16675 29097451 28499604 27944664 26814458 26092032 25160259 24840793 23793669 23278030 22766404
16666 22766404 22119943 21482333 21446477 20373268 19864552 19286076 19150326 18400813 18114121
16657 18114121 17622152 17477838 16851144 16446883 15820039 15759722 15490270 15217119 14838508
16648 14838508 14157061 13921594 13855674 13354423 13151267 12884720 12649047 12277420 12101981
16639 12101981 11897030 11452713 11120886 11244481 11098276 10873800 10638391 10385396 9994930
16630 9994930 9812628 10035803 9749491 9382993 9411880 9070805 8935283 8790686 8818327 8268726
16620 8268726 8187367 8458752 8116783 7750271 7588326 7599936 7720580 7505852 7230709 7190990
16610 7190990 7104515 6871188 6417586 6756384 6311541 6524955 6336798 6233705 6225858 5981927
16600E981927K39863n34196m6066J53563J47376o08005M09865o26471l6450J47386
16590E228792j13391R8745j7550l34333r772N5043k23251j01656N1387n1919K7435
16579D609530j7570j71179J48464j14958J2703j97354R7901k24966j51712p071
16569C983788r7757r1700N00879l25286r0425p045j94266j79772J69438n61887
16559C105967L54113j8878q3231K637j06987M4829k60463K88937m3740j27814
16549C155370J89339j29744k22992P709j21373N603K05182m53667K44280N09323
16539C389030o57489l57638J58081K54439j66403j99211M19160j69034o2960n8216
16529B549759j38962L11231l24751R5638j75976L73R1632n3165l45353K69441
$$ plain form
16600 5981927 6221790 5687594 5641528 5795091 5942467 5334462 5744327 5117856 5081406 5228792
16590 5228792 5115401 5214146 5196596 4862263 4852491 4907534 4684283 4582627 4634014 4582095 4609530
16579 4609530 4591960 4420781 4569245 4454287 4466990 4269636 4367537 4142571 3990859 3983788
16569 3983788 3886031 3794331 4295210 3969924 3879499 3872454 3678188 3498416 3667854 3105967
16559 3105967 3460080 3441202 3357971 3360608 3253621 3298450 3037987 3326924 3283184 3155370
16549 3155370 3344709 3214965 2991973 2999682 2878309 2883912 3089094 2635427 2879707 3389030
16539 3389030 2731541 2373903 2531984 2786423 2620020 2420809 2839969 2670935 2607975 2549759
16529 2549759 2410797 2722028 2397277 2492915 2316939 2317312 2408944 2355779 2010426 2279867
16519B279867l4269J03009Q4348l23388M139K48238j54754P3128k25311N7772
16509B112779k0264l004k79055K50575K19478k05404j03347l3430j56449L83293
16499B165172k03863K1533j93238J52748l5424l83307J31982J95293O6876m17259
16489A500513J48502R099o4867J94991j50858M921M266r2291J63998k3753j77838
16478A516683J02273k37911j0431L66327j04827j48584j6683Q9433j23161J22302
16468A555421j06081K88744o4750j27528j57981l8988R8742k08455L58924m33283
16458A164765Q4054L43117k90414k06506K56814J49296j45993j46991K17605l43671
16448A082076l9557J52298K17699n06427K94427J17943j88864J03096l6290M3710
$$ plain form
16519 2279867 2245598 2348607 2432955 2109567 2113706 2361944 2207190 2280318 2055007 2112779
16509 2112779 2092515 2089511 1810456 2061031 2280509 2075105 1971758 1938328 1781879 2165172
16499 2165172 1961309 1982842 1789604 1942352 1906928 1523621 1655603 1850896 1917772 1500513
16489 1500513 1649015 1658114 1593247 1788238 1637380 1642301 1646567 1554276 1718274 1694521 1516683
16478 1516683 1618956 1381045 1370614 1736941 1632114 1483530 1466847 1556280 1433119 1555421
16468 1555421 1449340 1738084 1673334 1545806 1387825 1348837 1447579 1239124 1598048 1164765
16458 1164765 1248819 1591936 1301522 1095016 1351830 1501126 1355133 1208142 1425747 1082076
16448 1082076 1042519 1194817 1412516 906089 1200516 1318459 1129595 1232691 1196401 1240111
16438A240111J22133l2524r751k77572j4148J07873R46k6868j55406J71041L2692
16427A158527p7941m7539J6158J86988j78631K08680m68870M06730j20811k65456
16417H17835L29831l09198J93305R1807p8391J75628k2075k81037o1993l503J60494
16406A012703J17735j49105j39853j18372L79420l03991M93488l11573j3329k88731
16396F78392P333K98690J3559k14363K11828L0555j47470N666D23095N40188M9718
16385A013001m26702L36479k40394M40719k99716R7816D21211L20934K27965o0183
16375I09927k12214j79629L06777l63511J13511K51788l05745K68986J60318l25370
16365F24838K98644l3141k6023m1893l04941J23740j74709J2234l519J73079J17299
$$ plain form
16438 1240111 1362244 1329720 1319969 1042397 1028249 1136122 1137068 1110200 954794 1125835 1158527
16427 1158527 1080586 1033047 1049205 1236193 1057562 1266242 797372 1204102 1083291 817835
16417 817835 1147666 838468 1031773 1123580 1045189 1220817 1198742 917705 855712 852209 1012703
16406 1012703 1130438 981333 841480 723108 1102528 798537 1292025 980452 967123 678392
16396 678392 685725 984415 997974 783611 995439 1025994 878524 884190 423095 963283 1013001
16385 1013001 586299 922778 682384 1123103 823387 921203 421211 742145 970110 909927
16375 909927 697713 518084 824861 461350 574861 826649 520904 789890 950208 624838
16365 624838 923482 890341 864318 822425 517484 641224 466515 478749 475230 648309 765608
16354G65608n7345o60O4310J03483k5213m17169L03515j38311K45880j35640q3502
16343F24956j70139Q2110k6389K08340k10820L17093C52909K6159L72209k9612
16333G21665j04115l03316K75596m2039K03655B01929L08669K0825B59404L04174
16323E63578B46268L66230J2675M8883r8476K34636j95270B98123K60502j25813
16313D32812R2176J68040k63369L4681O5137m8198P8067J9957M8519k90965o7507
16302B69350k0948m230M64903j05009r185P7281j99222o0040P3115M8001k09467
16291C24549m5861J45427K4861J87046j77833K69905K5547l26184P2487J00449
16281F00393k95979R930J80046j52182K15850A76193K33337K04773j71902J04763
$$ plain form
16354 765608 708263 707603 771913 875396 850183 433014 736529 598218 844098 708458 624956
16343 624956 454817 536927 510538 718878 508058 825151 352909 379068 751277 721665
16333 721665 617550 314234 589830 547791 751446 201929 510598 531423 259404 563578
16323 563578 246268 612498 625173 674056 575580 810216 614946 298123 558625 432812
16313 432812 524988 693028 429659 464340 529477 481279 559346 579303 627822 336857 269350
16302 269350 248402 244172 709075 604066 594881 672162 472940 412900 486015 534016 324549
16291 324549 278688 424115 448976 636022 458189 728094 753641 427457 499944 600393
16281 600393 304414 314344 494390 342208 558058 176193 409530 614303 442401 547164
16271E47164k17432J12418K0951B15286P1541L87667C16257r8513p0703N43148
16261F90189C33742j04224D4110M07706n9763P8275J1967N7381j21604A65820
16250E18484j37685j8282j36537m6541O9016G9396M15671j14955j4634J10749
16240D76227A15459M4003K09149n0331j05353L28232k56859Q952r3413L18504
16230E18343p1844j73073L49028a11543B80321j2061R9330J1225j31070I9802
16219D10429A02004L38144A24720L44479B21841O0790A09244J18987o6554K7661
16209A89338J40116m0830A10471B9357L12855q6209e2408A51201N46129C19467
16198D29407j94139j02745M31500k01949k7941a91498F69589j80029A59368M894
$$ plain form
16271 547164 329732 442150 463101 215286 286827 674494 316257 217744 147041 690189
16261 690189 333742 229518 44110 451816 392053 470328 482295 539676 418072 165820
16250 518484 380799 362517 225980 179439 248455 79396 495067 380112 365478 476227
16240 476227 115459 159462 368611 318280 212927 541159 284300 293252 199839 518343
16230 518343 446499 273426 622454 -111543 280321 268260 367590 378815 247745 99802
16219 410429 102004 440148 124720 469199 221841 282631 109244 228231 161677 189338
16209 189338 329454 288624 110471 29357 342212 256003 -52408 151201 697330 319467
16198 429407 235268 132523 564023 362074 334133 -191498 669589 489560 159368 164262
16188A64262k4722F1982M07026H4199R5156O8961A11166J06042m898J07752J95026
16177E15088j57677j77791L12946o147G0907M56571L885k42760L9697j27584l7361
16166A63355P8907o1768C8346M58416k09720o802a20735B59819L49637B50331
16155A93393K2431R6734J80116k10053p4222o5294a98305d1972A23730N6915a09761
16143b3558B10195o4870J34778J0866j31118b5427B1624L18534a45084A61164
16132B80157l8944l184D3321K83160A21714R7049J04066j57309K48686A67636
16121F6876j0857Q7261b63491B28276g0151A18224L45875b6990A93773p9343e0213
16109a25087A16339J20855r1148L4347k5135G275c8436C38880G3031K15394C5071
$$ plain form
16188 164262 139540 61982 469008 84199 179355 248316 111166 217208 212310 320062 515088
16177 515088 357411 179620 492566 486419 70907 527478 531363 288603 328300 200716 163355
16166 163355 242262 180494 38346 496762 287042 280240 -120735 259819 609456 250331
16155 193393 215824 312558 492674 282621 208399 143105 -198305 -41972 123730 180645 -109761
16143 -23558 210195 145325 280103 290969 159851 -25427 21624 340158 -145084 161164
16132 280157 241213 238029 43321 326481 121714 218763 322829 165520 414206 167636
16121 66876 56019 143280 -263491 228276 -70151 118224 464099 -26990 193773 114430 -50213
16109 -125087 116339 237194 146046 180393 155258 7275 -38436 338880 73031 288425 35071
16097H0744M1635N7343l6110O1423f8672A69742e0115K798G0939K24744A3976
16085A84149F2028K96854j26769J15009b06307d9317A55365k6130K65614A4991
16074C03684i2227A97874a07428H2769a1454A71610g0857K7223A6097e8646a8168
16062A33554K7314a3238A21908L36359A47478B4855J3961L30037J76093A5873
16051a09431C34405c4550I349K979K8999O4704b34248C8234M004J5715J07864
16040A65817E5463R9854J04039o1419K0915b49852C12277F520K74567j04154a71837
16028B30324A09260D9819R2073K40258A34635F4582a01593A07104K24271B2142
16017a86792A96711g8992b5063B61314a07126C22243n5080A18753k4305P2063
$$ plain form
16097 80744 122379 179722 143612 205035 -68672 169742 -50115 -47317 70939 295683 13976
16085 184149 62028 358882 232113 347122 -206307 -49317 155365 129235 394849 14991
16074 303684 -92227 197874 -107428 82769 -11454 171610 -70857 -43634 16097 -58646 -18168
16062 133554 160868 -13238 121908 458267 147478 24855 38816 368853 544946 15873
16051 -109431 334405 -34550 9349 12328 41327 106031 -234248 38234 42238 57953 165817
16040 165817 55463 155317 259356 197937 218852 -249852 312277 6520 281087 176933 -171837
16028 230324 109260 49819 141892 382150 134635 64582 -101593 107104 331375 22142
16017 -186792 196711 -78992 -25063 261314 -107126 322243 267163 118753 94448 166511
16007A66511K30306a688E0245J45289C9270c9675o2633p8286j40880A4950K63006
15996B77956j08818E5180c17701A32331F5149J65107K36976J60617o1367J18296
15986F84778N15922p3050K72380o06117j47962j60789B31993q9145m5296R2725
15976A90277L0448h8523o3209f6820A38010d0158B44656c6150A56255a4332A2297
15964i0928A32180a91545K705d3149q3515A15310r507K68171H8726a65786j5506
15953a81292E9337F620b75465B48324F5993b2295A5490a2462j90089B20673M6267
15942B66940C3616D7J15574n6967J9997i0136b9723k02800C23788A01887a03456
15930A4128J50855a23442A24280P6471a49807f2897B18868d164D2746j4848e4506
$$ plain form
16007 166511 396817 -1688 50245 195534 39270 -39675 -102308 -180594 -321474 14950 277956
15996 277956 169138 55180 -317701 132331 65149 230256 467232 627849 566482 684778
15986 684778 1200700 1127650 1400030 793913 645951 485162 231993 142848 97552 190277
15976 190277 220725 -88523 -151732 -66820 138010 -40158 244656 -36150 156255 -14332 12297
15964 -90928 132180 -191545 -188840 -43149 -126664 115310 105803 373974 88726 -165786 -181292
15953 -181292 59337 6620 -275465 248324 65993 -22295 15490 -12462 -202551 220673 266940
15942 266940 33616 47 115621 58654 78651 -90136 -29723 -232523 323788 101887 -103456
15930 14128 164983 -123442 124280 200751 -149807 -62897 218868 -4164 42746 27898 -54506
15918a7203C20949j19597J69691r0943C9522a71240C8230L95370A24704b61661
15907B2310a21530d6065B80136O180h685j35881k4349B93317a73282B44606a32157
15895E3607a26967B41751e76576F2780h9655A55933i2562a1624m209A71930a13446
15883a97508B1809f6356n6053A32631C9658J85240l4626f7604n4542A0986J39262
15872A50248O0436a55627E9231K00639a17901F0214M3573a74696A07927a43377
15861i3959F2955J09829a22155c1176k50091g952E168b36363g3279B88685j37849
15850A50836a98545b9812o5498L0873b2051n8403H3080j395K17586d3133j59633
15839b02766c2403B32135O4097a14951A98894R783d39770a55551P1379A25469
$$ plain form
15918 -17203 320949 201352 371043 280100 39522 -171240 38230 433600 124704 -261661
15907 22310 -121530 -46065 280136 286316 -8685 -144566 -168915 293317 -173282 244606 -132157
15895 53607 -126967 241751 -576576 62780 -89655 155933 -92562 -11624 -15833 171930 -113446
15883 -197508 21809 -66356 -122409 132631 39658 224898 190272 -67604 -122146 10986 150248
15872 150248 210684 -155627 59231 259870 -117901 60214 103787 -174696 107927 -143377
15861 -93959 62955 172784 -122155 -31176 -281267 -7952 5168 -236363 -73279 288685 150836
15850 150836 -198545 -29812 -95310 -64437 -22051 -80454 83080 81685 299271 -43133 -202766
15839 -202766 -32403 232135 296232 -114951 198894 208677 -439770 -155551 -84172 125469
15828a18591m41182g1920G4097a19089D9794a06500f620A4556j137d55102A46618
15816B19328d16257E2223c4215A6562l662i608A41024J16441A9451a51085B72254
15804a25350C7526N4368c03733B26025a06306G6849A7698b98122C49855A02309
15793a33325A4736a10072c0151m4272B9534c7918j01431j72930A28993a55083
15782A702P3247A4824J17702a3184E3384P8246L0976a78508C98579b6820C2393
15770A71680F2706j2002J68974G8620d34122J75575F5948J15724J0097P0608c3673
15758A19614a19543l3303G9410M7369J5701k468b64924B20971a88289Q9684k14972
15747c13577n0107a58284j35876B86152j7990A17151a02471q8122A55596n2196
$$ plain form
15828 -118591 -559773 -71920 74097 -119089 49794 -106500 -6620 14556 13419 -455102 146618
15816 219328 -416257 52223 -34215 16562 12900 -9608 141024 257465 19451 -151085 272254
15804 -125350 37526 91894 -303733 226025 -106306 76849 17698 -298122 349855 102309
15793 -133325 14736 -110072 -30151 -74423 29534 -37918 -139349 -312279 128993 -155083
15782 1702 74949 14824 132526 -13184 53384 131630 162606 -178508 398579 -26820 32393
15770 171680 62706 50704 219678 78620 -434122 -258547 65948 181672 191769 262377 -33673
15758 119614 -119543 -152846 79410 126779 142480 140012 -264924 220971 -188289 -98605 -313577
15747 -313577 -363684 -158284 -294160 286152 268162 117151 -102471 -190593 155596 103400
15737A03400a29866B20617H388d5713k62243C17751A09911a6254B56723A16251
15726g4464H4665K769a03294o7661F4725a49940C24894e4374G6331K95541a00692
15714a26630o1134A06707a74788F3294K3150n449K0320a68294A8051a03935N689
15703i8246a8629m46374b9799C58422b72408b3512o8780F8823b92855A43301a58705
15691A19519b09271j25509E9460b90862j799A86365L6138a38982m9365o6031o4776
15680c19154M1062b462o4371k71716H5238B169J9332r428J49360J42198F3701
15668B02527A9466c83855F2266A9888b25443N8252B92663b3244C02292b76737
15657b8457B2306J21130G795Q1959J33234c38556c0527Q866l88406K01235j5947
$$ plain form
15737 103400 -129866 220617 8388 -45713 -307956 317751 109911 -16254 256723 116251
15726 -74464 84665 87434 -103294 -170955 64725 -149940 324894 -54374 76331 371872 -100692
15714 -126630 -187764 106707 -174788 63294 86444 80995 101315 -168294 18051 -103935 -98246
15703 -98246 -18629 -465003 -29799 358422 -272408 -23512 -92292 68823 -292855 143301 -158705
15691 119519 -209271 -334780 59460 -290862 -292661 186365 222503 -138982 -188347 -254378 -319154
15680 -319154 -278092 -2462 -66833 -338549 85238 2169 21501 12073 161433 303631 63701
15668 202527 19466 -383855 62266 19888 -225443 -167191 292663 -23244 302292 -276737
15657 -28457 22306 143436 7795 89754 222988 -338556 -30527 -21661 -410067 -208832 -224779
15646b24779N8129e054j0800A07619O3365i1553q6881E0197K182b58304N2428
15635b05876B53328H8696F608b12416A17150a24833E8927j4700h2691M0737C5159
15623A38611b86630A13307A3321M01333c4619f856k21735g881l2798J5808B86917
15611h683A4118a22425E6016M5268b68958m1951M5454D5014N9808l3336N4032
15600A25518C0648C507J68834b8738C1675b55704b4701A83622r0481a89502K0470
15589a69032A78093H2348K41409H2702b10387h0679l96H4306J82396A0677Q9044
15578I9721J93201b71592E4664a54894h005k34225B7341a98782O8346B08328c45971
15566D9398b4930p5312K0854A01888b061k6264A51744L8073E9676a09246m4807
$$ plain form
15646 -224779 -166650 -5054 -15854 107619 170984 -91553 -178434 50197 52379 -258304 -205876
15635 -205876 253328 88696 6608 -212416 117150 -124833 58927 44227 -82691 -41954 35159
15623 138611 -286630 113307 13321 414654 -34619 -6856 -228591 -7881 -40679 -24871 286917
15611 -8683 14118 -122425 56016 101284 -268958 -310909 -265455 45014 104822 71486 125518
15600 125518 30648 3507 172341 -28738 31675 -255704 -24701 183622 93141 -189502 -169032
15589 -169032 178093 82348 323757 82702 -210387 -80679 -81075 84306 266702 10677 99721
15578 99721 292922 -271592 54664 -154894 -8005 -242230 27341 -198782 -130436 208328 -345971
15566 49398 -24930 -100242 -79388 101888 -2061 -28325 151744 189817 59676 -109246 -154053
15555a54053E4304J16618c5253l9044B17543n5475h3581n8314H9679K2057m9921
15544F1815k5844i366A6233b27546Q7543H6593J98316g5116G5476k6525B2045
15532A7196O5334A1913a23493n7089A9104P093d7060D8401M09861B6063f4348
15520B45629J01505E5375k3867a10962C07265a4863B52188A24005R7995n8126
15510A63874O7023I2197K60221j64247c2874B58348J04826M7215A10603N8321
15500A68924B7664J35559J7834Q9316J37108a0662I405K241K50657G6545K8878
15489A05423a59029I2590b64194C74763a20037b484A07097a45343b7173A5727
15478A58710A0573J4548J35846L80063J60227k15603j84636j00700e3797A88269
$$ plain form
15555 -154053 54304 170922 -35253 -74297 217543 162068 -83581 -141895 89679 111736 61815
15544 61815 35971 -9366 16233 -227546 -140003 86593 284909 -75116 75476 48951 22045
15532 17196 82530 11913 -123493 -180582 19104 26197 -47060 48401 458262 26063 -64348
15520 245629 347134 55375 31508 -110962 307265 -14863 252188 124005 222000 163874
15510 163874 230897 92197 352418 188171 -32874 258348 363174 410389 110603 168924
15500 168924 27664 163223 181057 270373 407481 -10662 9405 11646 262303 76545 105423
15489 105423 -159029 92590 -264194 374763 -120037 -2484 107097 -145343 -27173 15727
15478 158710 10573 25121 160967 541030 701257 485654 301018 200318 -53797 188269
15467c96314J49245I4536J3684P2249g2427b2286I0882C1224i0141A46837m7977
15456I8860J40368j0000A5925a5602k35588A3080b78505b2491E374J62798m7077
15445A21095A7977K51804O51108j98667M90556l00194m14391J29032G246J51044
15435A58290a10308d5863A13413d928B86717a27707E7849R2741C5092O6813e886
15423C53661i1919A99348C9590b84769d9878j35126H2641b24249M7932D5493a2389
15411a72590A98919l0407b7393k18031B80440a1105D84370B15654D5339P0349
15401A15688J28150p2000J08009c1093B30916D6081d5434I6165A8680N3979b03081
15389F5501j4608i5578A50426c3013j75726A62493M00848G7380Q8892K0722o1695
$$ plain form
15467 -396314 -247069 94536 108220 180469 -72427 -22286 90882 31224 -90141 146837 98860
15456 98860 239228 229228 15925 -15602 -251190 13080 -278505 -22491 5374 168172 121095
15445 121095 17977 269781 920889 722222 1212778 912584 498193 627225 7246 158290
15435 158290 -110308 -45863 113413 -4928 286717 -127707 57849 150590 35092 101905 -5886
15423 353661 -91919 199348 39590 -284769 -49878 -185004 82641 -224249 -176317 45493 -12389
15411 -172590 198919 168512 -27393 -245424 280440 -11105 484370 215654 45339 115688
15401 115688 243838 171838 279847 -31093 230916 46081 -45434 96165 18680 72659 -203081
15389 65501 50893 -95578 150426 -33013 -208739 162493 563341 77380 166272 186994 125299
15378A25299R5746q2466J42023q0576J7835p3499e4850B38129J26012I7226D2275
15366A24732A2347J9327J20989K28637m4436C3216J84232a34628B11085K1706
15356B32791r749l1155A6238J65772J55693E6740K34315A02453h4832C52670B8960
15344B23889A11252K62138I8009K87810A2423L28956P8940b3988I984K51065I8348
15332D47107a4362A58977J66779G1320L59756A61861a33843c6772B11707e6023
15321B32336R4930a20186B79879a4288k83054B07004A6046c24068A65935J71561
15311C37496A07050L44758B22871D6060P7649K6727J82964b50722A62078b9068
15300A11813a45188j24619F8663b8978A00958a44114B22562p7384l0199a65456
$$ plain form
15378 125299 221045 138579 280602 200026 217861 144362 -54850 238129 364141 97226 42275
15366 124732 12347 31674 152663 381300 336864 33216 217448 -134628 211085 232791
15356 232791 223042 191887 16238 182010 337703 56740 291055 102453 -84832 352670 28960
15344 223889 111252 373390 98009 385819 12423 341379 420319 -23988 9984 261049 98348
15332 447107 -14362 158977 325756 71320 431076 161861 -133843 -36772 211707 -56023
15321 232336 327266 -120186 279879 -14288 -297342 207004 16046 -324068 165935 337496
15311 337496 107050 451808 222871 46060 123709 150436 333400 -250722 162078 -29068
15300 111813 -145188 -269807 68663 -28978 100958 -144114 222562 145178 114979 -165456
15289d4256A6601J4250J47413b70066B67330n0125F2462A1922a4315C40301r7004
15278B43297c3515c496j04522b7415A15583J06797K5d9367I0001F472J14314c97441
15265A5315J33846F5694K29666j22674m0774C3598L6308a74561K0707q0134A4739
15253a02179B25410G845J60108m5555i962j34886M7121j1210b725B30278J98795
15242D29073O76217J026373o18187O64284m97620D81315A00768M35849A11681
15232A06607O2073J79584a55026b4033A27288K09908I514L28922f0027A92859
15221a2409k06353K1771d9952J2572j82188B41687p3586C5423a18288C0362J62371
15210A92733l4503J95422G8280a7292B17287d45436G0112J63304A11799a50811
$$ plain form
15289 -44256 16601 30851 178264 -270066 267330 217205 62462 11922 -14315 340301 243297
15278 243297 -33515 -3496 -108018 -27415 115583 222380 222405 -49367 90001 6472 120786 -397441
15265 15315 149161 65694 295360 172686 131912 33598 69906 -174561 -153854 -233988 14739
15253 -102179 225410 7845 167953 122398 -9962 -144848 -97727 -108937 -2725 230278 429073
15242 429073 1105290 2131663 1513476 2177760 1680140 481315 100768 536617 111681
15232 106607 168680 348264 -155026 -24033 127288 337196 9514 338436 -60027 192859
15221 -12409 -218762 -196991 -49952 -37380 -219568 241687 168101 35423 -118288 30362 192733
15210 192733 158230 353652 78280 -17292 217287 -445436 70112 233416 111799 -150811
15199E19166D0671K89215D7101J8304N9671J42897C5588J27423f2076C27234g0395
15187f9399J1907C4261O9999A337K84812A9425J10615B962a86436M1036I5863
15175A33629N733J99381A21287J49730B1007K45611a7723o3610D2219J03558j4333
15164A31444Q5915q6804a78530C67562A07647J07757m9648j533K19114c61810
15153b0545E0794k1062a28710C64422A63303N7366c8112A83325J94976A02638
15142C6663a81452B38582m9483a70669A77533e5196j7826j54627E8425b82385
15131H9409a60724e0430B81318I6907j8358K91650j24554r348G3250J27903K04100
15120D05253d1743B10445B5815K02602F2749J15535H5842K06791A14877J3064
$$ plain form
15199 519166 40671 329886 47101 65405 125076 267973 35588 163011 -62076 327234 -70395
15187 -69399 -57492 34261 104260 1337 286149 19425 130040 2962 -186436 -145400 95863
15175 133629 139362 338743 121287 271017 21007 266618 -17723 -81333 42219 145777 131444
15164 131444 217359 130555 -178530 367562 107647 215404 165756 164223 383337 -361810
15153 -20545 50794 29732 -128710 364422 163303 220669 -38112 183325 378301 102638
15142 36663 -181452 238582 189099 -170669 177533 -55196 -73022 -227649 58425 -282385
15131 89409 -160724 -50430 281318 96907 78549 370199 245645 236297 73250 201153 405253
15120 405253 -41743 210445 25815 228417 62749 178284 85842 292633 114877 127941
15110A27941k9090J1603f2499o9407p2481C98288A65228M1731f6217B25876H0771
15098D4062a95578B84270E435J82396q355q5306k0971K02222q747b74200B61822
15086a00098h939B3085J00931J12760A9561K91684J88370A4215K07648e9070J7456
15075d1614j2310K1092B91216A26463m03J22255d6408B81312n4460J36823o6095
15064B97580b79863H7165O7462A8769d5004C99432J14764m3748B31679L09632
15054E41311r160k55093J48122b576D75255B23853J22218j20738R4343j13973
15044B05703E6631J69106e3710B2601L69262Q0120N2935J6619B09238M67434B26825
15032B43758L54587p9525L51682K21550l76504r5292B94587Q5696j12782L93073
$$ plain form
15110 127941 98851 110454 -62499 -131906 -204387 398288 165228 206959 -66217 225876 80771
15098 44062 -195578 284270 5435 187831 179476 94170 73199 275421 266674 -274200 261822
15086 -100098 -8939 23085 124016 236776 19561 311245 499615 14215 221863 -59070 -41614
15075 -41614 -53924 -32832 291216 126463 126060 248315 -46408 281312 226852 363675 297580
15064 297580 -279863 87165 154627 18769 -45004 399432 514196 470448 231679 541311
15054 541311 532151 277058 425180 -2576 475255 223853 346071 225333 319676 205703
15044 205703 56631 225737 -53710 22601 391863 471983 524918 541537 209238 676672 226825
15032 243758 598345 518820 870502 1092052 715548 620256 294587 380283 267501 660574
15022F60574B63068l1260J44948K41133j83341J11211j82409L5103J25096j83749
15012C39800p8830J96827o8352K26087K1338B66468j18220J69759M6011j45251
15002B18767J80426J6007j41828J06456M62889A46560K44292o4838N3088A80175
14991E76825j57913j43618K83677j26156n5412N428j60563M58705k36358L99762
14981H44377L01531l26547j73264l18524m1861L70935p5034L1336k48715K26137
14971E90371J55983J52945l56986B3845L12009H9746Q0044J13748K47672r6412
14961D34798j86064k1767j9480K91516A69381J30304J03023j40395Q4304J27599
14951D74216p7712l4413n3497k923m626r9311J67542J78565m4362J92294L7993
$$ plain form
15022 660574 263068 231808 376756 617889 434548 545759 363350 398453 523549 339800
15012 339800 260970 457797 389445 615532 636870 266468 148248 318007 364018 218767
15002 218767 399193 415200 273372 379828 842717 146560 390852 326014 379102 180175
14991 576825 418912 275294 558971 432815 377403 382831 222268 680973 444615 844377
14981 844377 1145908 819361 646097 327573 285712 656647 581613 612949 364234 590371
14971 590371 746354 899299 542313 23845 335854 89746 169790 283538 531210 434798
14961 434798 248734 226967 207487 499003 169381 299685 402708 262313 346617 474216
14951 474216 396504 362091 308594 305671 301045 201734 369276 547841 503479 695773 733766
14940G33766C23178K63243J27608k27990m5960B13262L88565L6313j27110L80556
14930H91586K2297p4628L47595J37670m8991N62501o06593K2941j2954j3842L15322
14919A542904O3747M98102J88247k55211m60451k69170l22430J45012M8555k69357
14909I09948k64534k20762M1772A87317M98807j86331j63426J22114j09885m2969
14899C05627j44386p3971M17435I5406L06849k8296J42166l6627m9080J1583Q4998
14888E26999K19692k19538Q9131P9676O435j0984K93795j63715p8712M500M12055
14877A159334E21385j40812K17078k25137L15118j8755A65039R1600K18411J39457
14867F14507L52652m48604M2073L06859k24521A59875n9030M49918j48019j93490
$$ plain form
14940 733766 323178 586421 714029 486039 440079 213262 601827 638140 511030 891586
14930 891586 913883 839255 1186850 1324520 1275529 1838030 1231437 1254378 1241424 1227582 1542904
14919 1542904 1606651 2104753 2293000 2037789 1577338 1308168 985738 1130750 1179305 909948
14909 909948 645414 424652 466424 187317 686124 499793 336367 458481 348596 305627
14899 305627 161241 87270 504705 95406 402255 373959 516125 479498 430418 442001 526999
14888 526999 746691 527153 616284 695960 702395 691411 985206 821491 742779 747279 1159334
14877 1159334 521385 380573 597651 372514 687632 668877 165039 256639 475050 614507
14867 614507 967159 518555 560628 867487 642966 159875 100845 550763 402744 209254
14857B09254M53101j22213K10877j36068j74999K70488l50046n0347m7731K31123
14847D93439P9084j39020L50216K76925r856L05267j33496k99182m7124k10752
14837F65501J55678k93091q1266K1169q8714j46207J64970J58962Q2669j11095
14827E28576R3005J67234C77295K28934J90707k26183J39696k53106O6526J60990
14817F84859p5933K74834J28134m89882K15530J38840k8664k22452K62210l74376
14807E13100K36609j1922K43693l25939J32181C19758L95977k13070N8546K60995
14797H22206k17303j87058A82438N65125C37195K47884j13561R9881K28855k82404
14787E17850K3199K76016k24619O3804k31263L15973k81108R9373K25472k52216
$$ plain form
14857 209254 662355 540142 751019 614951 439952 710440 360394 310047 262316 493439
14847 493439 572523 433503 783719 1060644 1050788 1356055 1222559 923377 876253 665501
14837 665501 821179 528088 446822 467991 379277 233070 398040 557002 639671 528576
14827 528576 621581 788815 377295 606229 796936 570753 710449 457343 523869 684859
14817 684859 608926 883760 1011894 522012 737542 876382 847718 625266 887476 513100
14807 513100 749709 737787 981480 655541 787722 319758 715735 502665 561211 822206
14797 822206 604903 417845 182438 747563 337195 585079 471518 571399 800254 517850
14787 517850 541049 817065 592446 656250 424987 740960 459852 559225 784697 532481
14777E32481O85835k35859j65313J67231k32375m3169J14038k15700o561Q4866
14767F85474k31031K00917L667k51089N91803D02641J45279P4623K15679l24872
14757E13350m7981K72195R5897C81272K06561j902r5541P6252j79829K20534j53977
14746D53370Q8092Q5992K30756j35519k66751j61469K56469J94997k1010M9682
14736G74609C09463M04184L18039q9962j07242N71868j12601J39353P1732m4877
14726A459957L09401j72664m27069J77855n07828l7980L5698K0782K41111l46991
14716G52272J46091J6830k06547J7721K23481j25957r2483K81317j19229K08914
14706A102410J5367j410K54902M6959M01852L3083N5439m16878l74431q9582j47598
$$ plain form
14777 532481 1218316 982457 817144 984375 752000 708831 822869 607169 600608 685474
14767 685474 454443 655360 659027 407938 999741 402641 547920 622543 838222 513350
14757 513350 465369 737564 833461 381272 587833 585931 490390 566642 386813 607347 453370
14746 453370 541462 627454 858210 722691 455940 294471 550940 745937 724927 774609
14736 774609 309463 713647 1031686 941724 834482 1406350 1293749 1433102 1504834 1459957
14726 1459957 1769358 1596694 1169625 1347480 839652 801672 837370 858152 1099263 752272
14716 752272 898363 915193 708646 726367 949848 823891 731408 1012725 893496 1102410
14706 1102410 1117777 1116367 1371269 1418228 1820080 1853163 1908602 1491724 1117293 1027711 880113
14695H80113R9038l25752M29315j15299l13389M05124l19578J62744J21758k82135
14685G41939j41314K74209L55736k68164k5273k00409J72051J6670l9426n2790
14675H33229J86109o3858j87888k96551L74339L03476r597l14283M25708j76594
14665A074090j55533J38158k38860J75428j19523L1810J84255K58730n23485k4691
14655H00379L87401k2358k59323L06543k29796K08240p7477K43794l04887N9121
14645A111637J64881k55805M47622n25275K76669m35433M08433J03363k82474
14636A013618k27975J02265K05242j58580M21989k50306o1793j4179M33868J4018
14626A478167k42382l6456l725n7065K42576l243O3272k11669K02197k00887j29026
$$ plain form
14695 880113 979151 653399 1082714 967415 654026 1059150 739572 902316 1024074 741939
14685 741939 600625 874834 1230570 962406 937133 736724 908775 925445 886019 833229
14675 833229 1019338 955480 767592 471041 845380 1148856 1139259 824976 1250684 1074090
14665 1074090 918557 1056715 817855 993283 873760 905570 1089825 1348555 825070 800379
14655 800379 1187780 1165422 906099 1212642 982846 1191086 1113609 1357403 1052516 1111637
14645 1111637 1276518 1020713 1468335 943060 1219729 784296 1192729 1296092 1013618
14636 1013618 785643 887908 1093150 934570 1356559 1106253 1044460 1030281 1464149 1478167
14626 1478167 1235785 1199329 1195604 1138539 1381115 1377872 1441144 1229475 1431672 1230785 1101759
14615A101759K16824j8421j77247J09662L7087K24821r6235q6896K07662J28898
14605A647914k99726K88282j83889q4698N8611J3832j28084K60587J07544j64812
14595A515561j27150J65844J63611l40660K35943m835n4332O1925m7047M83791
14585B052651m66736J39441o8112L51817k20283k82160M17620n9495O5450j02511
14575A827682r7159J80150J16778N447j84103L8598L65894l12115K88334M3905
14565B273411P6765j74715K66487k14425K37749k02162K84393k4902L55745J32940
14555C011286M2081L48622K16385J80288K10910J555076J450322L696403R374366
14546B0085739J6515738J0118582A7336535F156994k652282r95741m28669M41660
$$ plain form
14615 1101759 1318583 1300162 1122915 1232577 1269664 1494485 1398250 1311354 1519016 1647914
14605 1647914 1348188 1636470 1452581 1367883 1426494 1440326 1312242 1572829 1680373 1515561
14595 1515561 1388411 1554255 1717866 1377206 1613149 1608314 1553982 1615907 1568860 2052651
14585 2052651 1585915 1725356 1657244 2009061 1788778 1506618 1924238 1864743 1930193 1827682
14575 1827682 1730523 1910673 2027451 2032898 1848795 1887393 2253287 1941172 2229506 2273411
14565 2273411 2350176 2175461 2441948 2227523 2465272 2263110 2547503 2522601 2878346 3011286
14555 3011286 3053367 3401989 3618374 3798662 4009572 5564648 7014970 10711373 20085739
14546 20085739 36601477 46720059 17336535 6156994 3504712 2508971 2080302 2521962
14538B521962M91879K253401l30558k168297o54460m26095K79456K40878k84198
14529A923968J02015j35419k8271M20455r3495J81636P1075k04558k4526J89887
14519B402767j80186M37767j52019Q3001k37608m7981J36208o4140N46299j99743
14509B724365Q2439j06678o4611P0567K54440k29718K09885M0913j92250J5418
14499B804770n0041N11961k66398q0245M70911m6667M9165l31152M24945k02015
14489C285234P4062K11988k13029j97814K93851K77804k17041n2468L26544k82990
14479C506141L3093M76040l76907L73503j58424L24056k618k97636j1814k1601
14469C843833L49833j27696K17643p7100j36317N85949j44178j7081J12457j42953
$$ plain form
14538 2521962 3013841 5267242 4936684 2768387 2113927 1687832 1967288 2208166 1923968
14529 1923968 2025983 1890564 1862293 2282748 2189253 2370889 2441964 2237406 2212880 2402767
14519 2402767 2222581 2660348 2508329 2591330 2353722 2305741 2441949 2377809 2924108 2724365
14509 2724365 2806804 2700126 2635515 2706082 2960522 2730804 2940689 2981602 2789352 2804770
14499 2804770 2754729 3266690 3000292 2920047 3390958 3344291 3393456 3062304 3487249 3285234
14489 3285234 3359296 3571284 3358255 3160441 3454292 3732096 3515055 3462587 3789131 3506141
14479 3506141 3539234 4015274 3638367 4011870 3853446 4177502 4174884 3877248 3865434 3843833
14469 3843833 4193666 4065970 4283613 4206513 4070196 4656145 4511967 4494886 4607343 4464390
14459D464390J35353j47667N29465k51593R8884J16919j55429j31250J68570J25056
14449D952698K22883J60785j95685J31584K80919n03083N39222o2194J09127M18805
14439F055061p4866k28406M19612k34859L74536l38042J08136K96509K37862P4671
14429F690214K288q691p5399J21577l1213M70212K6931N55640j881q0228j46108
14418G523342L64149j56059L79017k70780J71563J62789L29521J40135k53275
14409H390402K53823L26053K59706K77195j85501K80938j99454L55398j04248
14400I654312O03781k42846O6213K65682J12079K53316L18088L05782l09127P76961
14390A1804241j89685L75234J19995J97438l1528N81926J70621N04821J85367
$$ plain form
14459 4464390 4599743 4452076 4981541 4729948 4828832 4945751 4790322 4659072 4827642 4952698
14449 4952698 5175581 5336366 5140681 5272265 5553184 5050101 5589323 5527129 5636256 6055061
14439 6055061 5980195 5751789 6171401 5936542 6311078 5973036 6081172 6377681 6615543 6690214
14429 6690214 6692502 6683811 6608412 6729989 6698776 7168988 7195919 7751559 7749678 7669450 7523342
14418 7523342 7887491 7731432 8110449 7839669 8011232 8174021 8503542 8643677 8390402
14409 8390402 8644225 8970278 9229984 9507179 9321678 9602616 9403162 9758560 9654312
14400 9654312 10258093 10015247 10081460 10347142 10459221 10712537 11030625 11336407 11027280 11804241
14390 11804241 11614556 11989790 12109785 12307223 12275695 12857621 13028242 13533063 13718430
14381A3718430K35262O2530J76769J50454L71583M33841J08235M32390N2787M12377
14371A6154658K92959J28836N22891M02476M96344N61258K80386L36941J28295
14362A9305044M69533J22094R03961L9863P06666L59631O13857O18582M51658
14353B3590889J58751P30730O97668M31691Q91425P02361Q31312P99179M55685
14344B9289691N63324J232910P85559P32270R40452N88252J149694J057969R00708
14335C7240829J435974R49406J063730J246227J433716J277449J718401J510724
14327D7876456J225175J517793J838215J627680K047527J811204J630835K528038
14319F2102923K194680K007674K190404K611986K712544K752177L003031L301038
$$ plain form
14381 13718430 13953692 14016222 14192991 14343445 14715028 15148869 15257104 15689494 15742281 16154658
14371 16154658 16447617 16576453 17099344 17501820 17998164 18559422 18839808 19176749 19305044
14362 19305044 19774577 19896671 20800632 20840495 21547161 21906792 22520649 23139231 23590889
14353 23590889 23749640 24480370 25178038 25609729 26501154 27203515 28034827 28834006 29289691
14344 29289691 29853015 31085925 31871484 32603754 33544206 34132458 35282152 36340121 37240829
14335 37240829 38676803 39626209 40689939 41936166 43369882 44647331 46365732 47876456
14327 47876456 49101631 50619424 52457639 54085319 56132846 57944050 59574885 62102923
14319 62102923 64297603 66305277 68495681 71107667 73820211 76572388 79575419 82876457
14311H2876457L106532L415887L809371L938554L747950M467611M709467M891789
14303A14963618M878760N874428N790101O159129O555563P058990P176587P671678
14295A66128854Q206268Q619160R203213R676095J0284336J1037875J0905486
14288B34061287J1875201J2564713J2335295J2872787J3291688J3667414J3987397
14281C24655782J4142176J3912102J4084478J3318884J2799103J2072163J1010574
14274D15995262R369244P421217M090367J313720K33018K565297j174787j680141
14266D38133197m964872q228015j0352629j1699843j3007663j4013666j4248403
14259C61618106j4888340j5045002j4898464j4652838j4664057j3770180j3299257
$$ plain form
14311 82876457 85982989 89398876 93208247 97146801 100894751 105362362 110071829 114963618
14303 114963618 119842378 125716806 131506907 137666036 144221599 151280589 158457176 166128854
14295 166128854 174335122 182954282 192157495 201833590 212117926 223155801 234061287
14288 234061287 245936488 258501201 270836496 283709283 297000971 310668385 324655782
14281 324655782 338797958 352710060 366794538 380113422 392912525 404984688 415995262
14274 415995262 425364506 432785723 436876090 438189810 438422828 440988125 439813338 438133197
14266 438133197 433168325 424940310 414587681 402887838 389880175 375866509 361618106
14259 361618106 346729766 331684764 316786300 302133462 287469405 273699225 260399968
14252B60399968j2758705j2465533j2044637j1259316j0379070q348945r799640
14245A83344122q779849q012192q001863p878484p266953o676364o024434o084007
14237A24619976m887723n466020n443592m351644m448983l964657l023716m281397
14229H8752244l629224l382626l375609k880909k920056k678681k596498k503480
14221F4785161k178628j669237k370578j698595k250140j784502j962703j149776
14213D9721002j357895j426092k123816j158980j250848j276042p96315r28576
14205C9402438j387780j153542j070358m54493j171687n28774j105271r76330
14197C1554203o84936r41569q85276n67084o48090o91268o49057o87818o58243
$$ plain form
14252 260399968 247641263 235175730 223131093 211871777 201492707 193143762 183344122
14245 183344122 174564273 166552081 158550218 150671734 143404781 136728417 130703983 124619976
14237 124619976 119732253 114266233 108822641 104470997 100022014 96057357 93033641 88752244
14229 88752244 85123020 81740394 78364785 75483876 72563820 69885139 67288641 64785161
14221 64785161 62606533 60937296 58566718 56868123 54617983 52833481 50870778 49721002
14213 49721002 48363107 46937015 44813199 43654219 42403371 41127329 40331014 39402438
14205 39402438 38014658 36861116 35790758 35336265 34164578 33635804 32530533 31554203
14197 31554203 30869267 29927698 29042422 28475338 27827248 27135980 26486923 25799105 25140862
14188B5140862p32986m30189n79605p38068k98973n36834l08717l04239n08233
14179B0703018n33885o01966o5578p52713Q8816r07301k03362r0421n67879m09022
14169A6659707O5327n94385R5765n45961l40541r6594m49439r1387k25610n57075
14159A3919807j68110j30607m06857m56022j2693K11703o26524r2761m95376R1
14149A1742651m73567J90558m60672k24937K52514k57293j69961j89204j95716
14140A0214373k97882n9388N9418j08764l94973n64135L52099J3997j79691k66558
14130H768496l24268K04349l73274j38556J70557k16435k796L3913l51032J26345
14120G897299q5627k13606o906m84632J11827p7438r6077j52293j42243j18209
$$ plain form
14188 25140862 24407876 23977687 23398082 22660014 22361041 21824207 21515490 21211251 20703018
14179 20703018 20169133 19567167 19501589 18748876 18837692 17930391 17727029 17636608 17068729 16659707
14169 16659707 16725034 16130649 16226414 15680453 15339912 15243318 14793879 14702492 14476882 13919807
14159 13919807 13751697 13621090 13214233 12758211 12745518 12957221 12330697 12237936 11742560 11742651
14149 11742651 11269084 11459642 10998970 10774033 11026547 10769254 10599293 10410089 10214373
14140 10214373 9916491 9857103 9916521 9807757 9412784 8848649 9200748 9214745 9035054 8768496
14130 8768496 8444228 8648577 8275303 8136747 8307304 8090869 8088073 8121986 7770954 7897299
14120 7897299 7811672 7598066 7591160 7106528 7218355 7140917 7044840 6892547 6750304 6632095
14110F632095k81979K95908l06470J4167K15187m70837R6009j11228j81042J84486
14100F086296j15199j82702j99127Q1429j48954p0908j55634J82217k07173J71269
14090E441514l25821j56188L694K525K76138j96425j35491k02424M7482n2003
14080D703001p2492j46749K58926k42394k9913p8351J3933J8297l2513j93864
14070D197881j79946L05431l50281M12779j65202k98789j89208J04700K81901
14061D119266M3849j30528J78946k35644j36975n9733k91297K50560l96186j72102
14051C170156L97817j04828Q6736j81948N8370m42161J65340J15232k49270L56968
14041C372412j60302K14395k87607j95681K2127J26281k91331J43255J17098N0997
$$ plain form
14110 6632095 6350116 6646024 6339554 6353721 6568908 6098071 6194080 6082852 5901810 6086296
14100 6086296 5971097 5788395 5589268 5670697 5521743 5450835 5295201 5477418 5270245 5441514
14090 5441514 5115693 4959505 4963199 4965724 5241862 5045437 4909946 4707522 4755004 4703001
14080 4703001 4630509 4483760 4742686 4500292 4470379 4392028 4405961 4424258 4391745 4197881
14070 4197881 4017935 4323366 3973085 4385864 4220662 3921873 3732665 3837365 4119266
14061 4119266 4163115 4032587 4211533 3975889 3838914 3779181 3487884 3738444 3342258 3170156
14051 3170156 3567973 3463145 3549881 3367933 3426303 2984142 3149482 3264714 3015444 3372412
14041 3372412 3212110 3426505 3138898 2943217 2965344 3091625 2800294 2943549 3060647 3111644
14031C111644L57543n50033Q9898J97088j88869r1182j3123m6667l32215J48805
14021B682889k81341K04110k09492K80501j72633q1947j01584K84025l72826J02132
14011B333834M6753j75557p7336N74170m13399j15327J12106j60497J47697k65480
14001B006964j48581L36570j28828R0058Q3945l01848l12996N06854k01593N63661
13991B494206j00575k5656O37081K660362O559851J5870390K1628558k2828397
13983B6895820A2413341n035200k115177o38090p71056l95852j89549k08250L05113
13974C365280p14353k02689O0950p2943j8295q9371J62283n0454j97279m9216
13964B193913K74593k67236j52598j67705N7409K21554R6034j61078M8773k43567
$$ plain form
14031 3111644 3469187 2919154 3009052 3206140 3017271 2926089 2912966 2866299 2534084 2682889
14021 2682889 2401548 2605658 2396166 2676667 2504034 2422087 2320503 2604528 2231702 2333834
14011 2333834 2380587 2205030 2127694 2701864 2288465 2173138 2285244 2124747 2272444 2006964
14001 2006964 1858383 2194953 2066125 2156183 2240128 1938280 1625284 2132138 1930545 2494206
13991 2494206 2393631 2367975 3005056 5665418 12225269 28095659 49724217 26895820
13983 26895820 12413341 7378141 5262964 4624874 3853818 3457966 3268417 3060167 3365280
13974 3365280 2650927 2448238 2509188 2436245 2417950 2328579 2490862 2440408 2243129 2193913
13964 2193913 2468506 2201270 2048672 1880967 1938376 2159930 2255964 2094886 2143659 1900092
13954A900092q3760O8844K31557m45773J6040K0159L21909j33059j74570N5688
13944A777127o2334L7686K81568m46997r5345J78117J80398K78788n99148K80831
13934A810691j46735O0092K1588k1626o1445r7304k10986R4851p036j9608J79937
13923A602419l31667J38498J57955k96090K40374j56255J56773j56671M38066
13914A793402k13184n38863M81414j6809j48778M4899n804J40355J66159j55754
13904A547037k81160k5232P9757j31301K0257J46191k230J17509m41920K23361
13894A252269j2257j06847k81065L16820j64886L55839j36933J76663l94338L41913
13884A347178k97631J7412L38024l75092J06978K81258m60944J498M51557l29589
$$ plain form
13954 1900092 1816332 1885176 2116733 1670960 1687000 1707159 2029068 1896009 1721439 1777127
13944 1777127 1714793 1752479 2034047 1587050 1491705 1669822 1850220 2129008 1529860 1810691
13934 1810691 1663956 1724048 1745636 1724010 1662565 1565261 1354275 1449126 1442090 1422482 1602419
13923 1602419 1270752 1409250 1567205 1271115 1511489 1355234 1512007 1355336 1793402
13914 1793402 1580218 1041355 1522769 1505960 1357182 1402081 1396277 1536632 1702791 1547037
13904 1547037 1265877 1240645 1320402 1189101 1209358 1355549 1353319 1470828 1028908 1252269
13894 1252269 1240012 1133165 852100 1168920 1004034 1359873 1222940 1399603 1005265 1347178
13884 1347178 1049547 1066959 1404983 1029891 1136869 1418127 957183 958681 1410238 1080649
13874A080649j02239o7326k18680K08281J82333N2879j1247j10706q9424K9024
13864I53544J78596o2325o7537Q0869K88635l40337O013J24397j57704M7958J6900
13853A069009j20899P9473j92585R6365J72230j82810j99302L29857m8855k83074
13843G19409J74215K17492p294l82506j21357K88507P3277j98393J86255J32091
13833A081696m47034L55252Q9408M5974k60890k40228K97534K4572k69041K08344
13823H85587k39852K98266k39172K67947k31453J01324K92741l50133k5721K26209
13813I85743k6457j24981k59418K12465k42497K51590Q7869l05029K50936J17871
13803I48092j90680j11455N13676E66368M7205M01789j90908k08758L2727n1057
$$ plain form
13874 1080649 978410 911084 692404 900685 1083018 1135897 1124650 1013944 924520 953544
13864 953544 1132140 1069815 1002278 1083147 1371782 1031445 1037458 1161855 1004151 1052109 1069009
13853 1069009 948110 1027583 834998 931363 1103593 920783 721481 1051338 1002483 719409
13843 719409 893624 1111116 1103822 721316 599959 888466 961743 763350 949605 1081696
13833 1081696 634662 989914 1079322 1125296 864406 624178 921712 946284 677243 885587
13823 885587 645735 944001 704829 972776 741323 842647 1135388 785255 759534 985743
13813 985743 959286 834305 574887 787352 544855 796445 884314 579285 830221 948092
13803 948092 757412 645957 1159633 566368 613573 1015362 824454 615696 648423 597366
13793E97366K49049j95061k6262M1732j20593j01248J72325j48723L01118m8915
13783G20788J13961J39944m38127j42486K76535j5536n591j51073K67551k65706
13773E00260K66145L0770j66093J94011k1006n897l24702J08803J18O4291K03559
13762H50259p6901k07947K05066l41712K51488K48887q8479C33492M85365m820
13752H14037J36819D18267J7307J74474k14852K04934L80110l58020N1613C26407
13741E06801J60257l29621L43967C34272R5345L75529C91380L85886k69467j88632
13731C19167O2789j2861m770N39191l46410J6934L00633l56154j96700K4976M6303
13720C93098Q526o749J82880B23276n062M00354J59038p6704A26950L61814L27015
$$ plain form
13793 597366 846415 651354 625092 666824 546231 444983 617308 468585 769703 720788
13783 720788 834749 974693 536566 394080 670615 655079 649488 498415 765966 500260
13773 500260 766405 797175 631082 825093 804087 798190 473488 582291 582409 646700 850259
13762 850259 773358 565411 770477 428765 680253 929140 840661 333492 818857 814037
13752 814037 950856 418267 435574 610048 395196 600130 980240 622220 673833 326407
13741 506801 667058 337437 681404 334272 429617 805146 391380 777266 507799 319167
13731 319167 381956 369095 364325 903516 557106 574040 874673 518519 321819 346795 393098
13720 393098 401624 394875 577755 223276 218214 618568 777606 700902 126950 488764 815779
13709H15779l945C97993J79607J38549j63573k28813M26811j69909J7271B93273
13698E75738k1675m5542j28150K17689k83006j2947L15780j50653J38493j06149
13688D99578O8621L1968N9065j63765J36346O1446G9553M65590L07238k91862
13678E60519J03337R9643C53419m2983M14495j48528k21259N8321J72242o3161
13668E22546N2474K57915C11709K62866k45031q035J04939Q0728j6654K062j45841
13657C46743J76673O21j89147Q4638A16649K99077K97836B64267J1877n020J68756
13646D39880j92983Q9986K06340B51475L51627K7398n3321P3003J11912B46092
13635A50160K26266A31947M64852k82722J70721O1543j44925J39875B29629M7268
$$ plain form
13709 815779 811834 397993 577600 716149 552576 323763 750574 580665 597936 293273
13698 575738 554063 508521 380371 598060 315054 302107 617887 467234 605727 499578
13688 499578 568199 600167 659232 495467 631813 693259 79553 545143 852381 560519
13678 560519 663856 763499 353419 310436 724931 576403 355144 413465 585707 522546
13668 522546 575020 832935 311709 574575 329544 321509 426448 507176 490522 492584 346743
13657 346743 523416 524037 334890 419528 116649 415726 713562 264267 276144 271124 439880
13646 439880 246897 336883 543223 251475 603102 630500 577179 650182 762094 246092
13635 150160 376426 131947 596799 314077 484798 546341 401416 541291 229629 276897
13625B76897L35232k75790j10337A02623P2713L37088j35922Q9977j05652o9842
13615B90985J55905J40189G8515J25075K4223N67752j39584B82508a4809C07016
13604D53370o1657A52931J45262P2855M6407P4175A14137J75795J12009I9499
13593a3657F76960A27115J87837H2980L21787J90009B87247r8910K49361A08905
13582B89422A41303L24975L9873B28398K9147J15328M887L7144A10757K3796L33329
13571D67882E0619K34415j37567N02284j36592J20952B25464M2404J93030N1204
13561E12102k20253k2771O9336N2682A07816K88356L16529j56072F4497J51105
13551B15602J45510Q3827n3960j39195J09957A67265j5562o0360J26887g0351
$$ plain form
13625 276897 612129 336339 226002 102623 175336 512424 376502 466479 360827 290985
13615 290985 446890 587079 78515 203590 227813 795565 655981 282508 -14809 307016
13604 453370 391713 152931 298193 371048 417455 491630 114137 289932 401941 99499
13593 -13657 676960 127115 314952 82980 404767 594776 287247 188337 437698 108905
13582 289422 141303 466278 506151 228398 257545 372873 377760 414904 110757 134553 467882
13571 467882 50619 285034 147467 649751 513159 634111 225464 267868 460898 512102
13561 512102 291849 269078 338414 391096 107816 396172 712701 556629 64497 215602
13551 215602 361112 444939 390979 251784 361741 167265 151703 91343 218230 -70351
13540f839E42357A41082O4787N4063n0347I5682P0408G2465K22663k174r193p2953
13528B10808J80657m7623a24391A83102K22442j86215R7799l9077J16252h2614
13517E11956k17238j03211J36336D1160A6025K64707l0757A154K42555K45075
13507D88784A25056J67613k9709C6930i3292C91175L562A33395K33370A39264
13496C81257o7595j26898J15254J63396A15530m1497L2716O6363K7819E9475L72200
13485D31675A27292K6969J3470J07345J30035B01075B7707P3461K33977E3933
13474A59232o6898J13096m1211H0562o152h5327j5057E5041R5980a62962A32577
13462c9911j0709A54907E9997R7065O1083K41568B17303H9816k301K10145J27942
$$ plain form
13540 -6839 542357 141082 205869 259932 209585 95682 166090 72465 295128 292954 283761 210808
13528 210808 391465 343842 -124391 183102 405544 219329 317128 278051 394303 -82614
13517 511956 294718 191507 327843 41160 16025 280732 249975 1154 243709 488784
13507 488784 125056 292669 262960 36930 -93292 391175 394737 133395 366765 139264
13496 381257 313662 186764 302018 465414 115530 74033 106749 173112 200931 59475 431675
13485 431675 127292 154261 167731 275076 405111 201075 27707 101168 335145 53933
13474 159232 92334 205430 164219 80562 74410 -85327 -100384 55041 151021 -162962 132577
13462 -39911 -50620 154907 59997 157062 218145 459713 217303 89816 87515 297660 425602
13451D25602j04668a24425C33337n1684A14886J90341N9953E4334k0933J05628
13441A39029j2178m2856J78855K89231a46684I0284m4524J25527J27001k4319
13431B73969A32783J09168I0363J0409J9589j2832J35872p2453a09416F20617
13420G2366a8213B64532i2964B46143m9541K56369a1160A15241a00519A66864
13409B27889K0415P5581K40614A24072R1267F0165J97346b582H6199R6674D5965
13397G7041J77218K2795f5695A68742J30417a7879C30700l8933b472A59433M187
13386A63620i4879B33904L04854k53718n5568E6185B6041J97015J16026J13745
13376D52827o6296m2336p2582b69626A89709J59095j02330L2539p5157M9907A01668
$$ plain form
13451 425602 320934 -124425 333337 281653 114886 305227 365180 54334 33401 139029
13441 139029 126851 83995 262850 552081 -146684 90284 45760 171287 298288 273969
13431 273969 132783 241951 90363 100772 120361 107529 243401 170948 -109416 620617
13420 72366 -18213 264532 -92964 246143 196602 452971 -11160 115241 -100519 166864
13409 227889 248304 323885 564499 124072 215339 60165 257511 -2582 86199 182873 45965
13397 77041 254259 277054 -65695 168742 299159 -17879 330700 291767 -2472 159433 163620
13386 163620 -94879 233904 538758 285040 229472 56185 26041 223056 339082 452827
13376 452827 386531 344195 271613 -269626 189709 348804 246474 279013 203856 253763 101668
13364B15926q9912K42130D5693K08404C9339L46879A49942J01005n0317G6771
13353B99738J45583G6043K959K45611O5589j17461J0595q1797C1464J98562R5306
13342C25332e3489K1350C05327n8015m8141L18863A47033N3234o0350R05Q184
13331A49006M81738A39656J83508G307O04968G3908O6870J05094A6003J94322
13321B10325I2016B9372K66661K9919j56091N9800k0477a5460B58146J64478j91582
13310B31042J46861I0795L70920A42353K21835B4299M94633B26771e685B0717
13299C37419j06173A0767a80909H6298L749c6331B41964O8568G3826M8211D8447
13287B37080K6132E6025p226N6179J88641A13293J38687a5913k67302A3143K89339
$$ plain form
13364 215926 126014 368144 45693 254097 39339 386218 149942 250947 200630 76771
13353 299738 445321 76043 79002 324613 390202 272741 283336 201539 31464 230026 325332
13342 325332 -53489 -32139 305327 247312 199171 518034 147033 200267 139917 140822 149006
13331 149006 630744 139656 323164 7307 612275 73908 140778 245872 16003 210325
13321 210325 92016 29372 296033 325952 169861 229661 209184 -15460 258146 422624 231042
13310 231042 377903 90795 461715 142353 364188 24299 518932 226771 -5685 20717
13299 337419 231246 10767 -180909 86298 90047 -36331 241964 310532 73826 122037 48447
13287 237080 263212 56025 48799 104978 293619 113293 251980 -15913 -283215 13143 302482
13276C02482j41121K05461d4624B13491J47071J6145j42477g1611l9684E3223
13265B06899J91704a449A18072K05557c5297E3119K17397e5113B15872B4099L35104
13254C59203F7075J49952m2102D9718K14643j7253f8989A10793j9750a60962C34597
13242C29242A29613M8105f1184C54854a56644a5733A36268l4552J68390h3844
13231a7332B12612I2649Q530R5181A8347J205a0352C31767C7688Q4502k2398M22141
13219E21933F4023k3263M9328c09457e9434o204C4278J86430a32489B0128J71436
13208A91564J29444h7294G1104J39075c34670J05476F888J71002D1480R4148a4134
13196D2963J48423j273J9245a8377B6141M8266N1096K22630A25720j3370a31799
$$ plain form
13276 302482 161361 366822 -44624 213491 360562 376707 234230 -71611 -111295 53223
13265 206899 398603 -1449 118072 323629 -35297 53119 270516 -55113 215872 24099 359203
13254 359203 67075 217027 174925 49718 264361 247108 -68989 110793 91043 -160962 334597
13242 329242 129613 177718 -61184 354854 -156644 -15733 136268 101716 270106 -83844
13231 -17332 212612 92649 101179 196360 18347 19552 -10352 331767 37688 122190 99792 521933
13219 521933 64023 40760 90088 -309457 -59434 -65638 34278 220708 -132489 20128 191564
13208 191564 321008 -87294 71104 210179 -334670 -229194 6888 177890 41480 135628 -14134
13196 42963 191386 190113 209358 -18377 26141 74407 125503 348133 125720 112350 -131799
13184A88359G9536J09871B6411P7754L5997b7441J2958k43581G9576g9676J2671
13173f7005C11804A2779b126j73965A02357L8551K96654b69249H8607C2193L8185
13162G0378a53374I8765J83018b37986B92094j24954n5812J12856q3243R934c71424
13150g000o5674i016A08873b60777a20842J0934E221b6250l15202C50481A04042
13138b44006H5449a79642B53724p2781D9844A4897K880c1234A91316Q2692a68111
13126c34778A2867g0341C1154K6412j8687K6520P2685L37424b54397A34878R9996
13115B34874d778o2134A7591d0422k58334c9111D27819A44354C5726f06C01559
13103B06157I2420b9381B161K40919c4221A45087J30868d00126E36946E6411j8600
$$ plain form
13184 188359 79536 189407 26411 104165 140162 -27441 -14483 -258064 79576 -79676 -67005
13173 -67005 311804 12779 -2126 -176091 102357 140908 437562 -269249 88607 32193 70378
13162 70378 -153374 98765 281783 -237986 292094 167140 111328 224184 140941 150875 -371424
13150 -7000 -72674 -9016 108873 -260777 -120842 -109908 5221 -26250 -341452 350481 104042
13138 -244006 85449 -179642 253724 180943 49844 14897 17777 -31234 191316 274008 -168111
13126 -334778 12867 -70341 31154 57566 38879 65399 138084 475508 -254397 134878 234874
13115 234874 -4778 -66912 17591 -40422 -298756 -39111 427819 144354 35726 -606 301559
13103 206157 92420 -29381 2161 243080 -34221 145087 275955 -400126 536946 56411 37811
13092C7811f9419B1006a21403k48d6932A5077g8331m1826M6726r4726M3405B3200
13079H5515a9770D8790e6176B79368d6405H6047P3498A466N5108I439J48133Q2924
13067B40496j04157N3446p2662B5460a77186D18766k04225G5089L72254h8851
13056A02697D4939c16150A08059K22929n0212A9069L67182j4864I9165L4551n1972
13045H1744J48928j07937a22277A91056G1516J43693h8073B59723f727A75263
13034C84843j64631C9055K49670A20449e0882k6496B92424b3243F7747R2063D3646
13022I1886j7680b15292F6749N8764J70355a93438I7985J49906M24F8677K708
13011G1385a00068A66015j2108a7566A41064L01457A06953A7709E196K76153a74967
$$ plain form
13092 37811 -69419 21006 -121403 -121651 -46932 15077 -78331 -120157 -73431 -168157 -124752 23200
13079 85515 -19770 48790 -56176 279368 -46405 86047 159545 1466 56574 9439 157572 240496
13067 240496 136339 189785 117123 25460 -177186 418766 214541 75089 447343 -88851
13056 102697 44939 -316150 108059 330988 280776 19069 386251 371387 99165 133716 81744
13045 81744 230672 122735 -122277 191056 71516 215209 -88073 259723 -6727 175263
13034 384843 220212 39055 288725 120449 -50882 -77378 292424 -23243 67747 159810 43646
13022 91886 74206 -215292 66749 125513 295868 -193438 97985 247891 248315 68677 71385
13011 71385 -100068 166015 153907 -17566 141064 442521 106953 17709 5196 281349 -174967
12999c4263A78859D9782L9398B4280J53953E1491e8463F5032i7074A24162J21704
12988B45866e2550G3083b12913e4764C88093J69329h0506b0590I3211d4078A14792
12976A55785b1806A71244a2701l7045H7620a33822M6511c0662B0684M01082a1803
12964c0272m3729C19679l6999N9679F2080a81369b7701H5453a28290D6442d437
12952a80637D7170a00324j01683B16644G0299f730b717A00212J19631a40537A11787
12940a008H6837a08109e0311j71716B20727a56190j82767a10961J5202M1338G3015
12928b25160B934J99196h9265j79995n529p3889A4787P8393N6890b52618a8660
12916i7304G618L40952j27147G4979b81423a17251c1318f837F0591E915O4082
$$ plain form
12999 -34263 178859 49782 89180 24280 178233 51491 -58463 65032 -97074 124162 245866
12988 245866 -52550 73083 -212913 -54764 388093 557422 -80506 -20590 93211 -44078 114792
12976 155785 -21806 171244 -12701 -49746 87620 -133822 -87311 -30662 20684 421766 -11803
12964 -30272 -74001 319679 282680 342359 62080 -181369 -27701 85453 -128290 46442 -4437
12952 -180637 47170 -100324 -202007 216644 70299 -6730 -2717 100212 219843 -140537 111787
12940 -1008 86837 -108109 -50311 -222027 220727 -156190 -338957 -110961 -95759 -54421 73015
12928 -225160 2934 202130 -89265 -269260 -274789 -348678 14787 93180 150070 -252618 -18660
12916 -97304 7618 348570 221423 74979 -281423 -117251 -31318 -6837 60591 5915 69997
12905F9997M17888A9776M0556b95401a04268j83857D8256L7793L35993A13238
12894C3098a45493b7328E5349j3936a35038J2982k9147A42950J10848g6071B18354
12882c45903E0679D827K91818C6083J13990B6182c25178A7385J14437a80309p3698
12871b54007A05423K0842R6495D8772h2585q5230L421f0102A00135a071o495D26083
12858A71472a17278a8045j8750E9923a39442p6890L9683A10561D7190b8959q4265
12847a13224H9664L29194A03787a7402B39930A12595f137l9040r4428K9183j63472
12836b73894A54717a19497c4960A78577B6253a18141p1975d5986B46535K06178
12826D52713H1239J56723a56597A68640b68380Q1831A33377a70687o1070A06548
$$ plain form
12905 69997 487885 19776 60332 -295401 -104268 -288125 48256 86049 422042 113238
12894 33098 -145493 -27328 55349 41413 -135038 -122056 -151203 142950 253798 -76071 218354
12882 -345903 50679 4827 296645 36083 150073 26182 -325178 17385 131822 -180309 -254007
12871 -254007 105423 126265 222760 48772 -82585 -167815 -164394 -60102 100135 -1071 -7566 426083
12858 171472 -117278 -18045 -36795 59923 -139442 -216332 -176649 110561 47190 -28959 -113224
12847 -113224 89664 418858 103787 -17402 239930 112595 -6137 -45177 -139605 -110422 -273894
12836 -273894 154717 -119497 -34960 178577 26253 -118141 -190116 -45986 246535 452713
12826 452713 81239 237962 -156597 168640 -268380 -186549 133377 -170687 -231757 106548
12815C43045b07057J4200I1757P9176a6096C1660M79044a01832B41691D24N772
12804F196b27633f0343q1185B14552q0342d9236B10228b09559j19361J48296B8953
12792b04630f4983A09663K4347k5373O2982b01914e9009I7668C5552J7371K8760
12781H1683a19398d0409a4362l06272D34676A90455f1611B04365G6733I596b33975
12769c01775c9393D9824K44149I7348a19848j28579J17470A13428a23879j42374
12759b66253C58926j14967G1025Q0378a84896J8313B83084q7242a93845h0173
12748f9359E0327c13441a29612k0436D5301N6045c0448J022B7784g8008j214j08276
12736a87498D9675L8052J5149J52927c2453D5367e2737H111a39793B45777a5867
$$ plain form
12815 343045 -207057 -192857 91757 170933 -16096 31660 510704 -101832 241691 424 6196
12804 6196 -227633 -60343 -141528 214552 134210 -49236 210228 -209559 -328920 -180624 28953
12792 -204630 -64983 109663 134010 108637 171619 -201914 -59009 97668 35552 52923 81683
12781 81683 -119398 -40409 -14362 -320634 434676 190455 -61611 204365 76733 9596 -233975
12769 -301775 -39393 49824 293973 97348 -119848 -248427 -130957 113428 -123879 -266253
12759 -266253 358926 243959 71025 151403 -184896 -166583 283084 195842 -193845 -80173
12748 -69359 50327 -313441 -129612 -150048 45301 101346 -30448 -29426 27784 -78008 -79222 -187498
12736 -187498 49675 87727 102876 255803 -32453 45367 -52737 8111 -139793 245777 -15867
12724C6432R5045a1524r2096B92302c15101h2213J555B19687H8697F401J64712
12713A71113C3548a29171B54409F8321J99335D3749b1412A78587e5139A67552
12702A35947J0277J868a69318H5834b9598A60105a8972A64307i9233F4244a603
12690c06520M3297G8400i5012b8503j75514a929A62579J12474E538f4602A1404
12678a9286H4022a7409E9219b60752Q7938L9831D85907b8351C24821q2552b6539
12666c9237o7772E333a22070A29984a7319o5763b9852A1932J09817J39343b662
12654C26387a49684B19893q3884C148N9237R1670f1972C05960J18691C8804j920
12643C6884a0911A51066a63713B99305G7393r706C2003A5978J87024q7797d5501
$$ plain form
12724 36432 131477 -11524 -103620 292302 -315101 -82213 -80658 219687 88697 6401 171113
12713 171113 33548 -129171 254409 68321 267656 43749 -21412 178587 -55139 167552
12702 135947 146224 148092 -169318 85834 -29598 160105 -18972 164307 -99233 64244 -1603
12690 -306520 -263223 78400 -95012 -28503 -204017 -1929 162579 275053 5538 -64602 11404
12678 -19286 84022 -17409 59219 -260752 -172814 -132983 485907 -28351 324821 242269 -26539
12666 -39237 -107009 5333 -122070 129984 -17319 -83082 -29852 11932 121749 261092 -2662
12654 326387 -149684 219893 136009 3148 62385 154055 -61972 305960 424651 38804 36884
12643 36884 -10911 151066 -163713 299305 77393 67687 32003 15978 203002 115205 -45501
12631A96722a01066B81159I9972J97353E3751N0780a95004E9920N0587a00292
12620a0733C05579j28218a54228D04418h7273c0081A36572A8624d6975A35985
12609e03782b8585j47599A31689L7042B2664a92711e1674A66316D8624a60401
12598A06305m1886M5706i4268n4738C47133a4992m23174K04329A46581h8013m3375
12587a31388F496a85987c3296G3816Q5337b9707k18966h0883a5379j37136d0657
12575b1744A58494B8023K1234b60379I5896b76378J25488d3470A14398J02424
12565B16822a05976k7348A96351D3882Q5022B4473b28390R6443C04377f1529K9643
12554c1886H2534i8774A33435D7708J64589a45820K3425A14161a67461a7589J574
$$ plain form
12631 196722 -101066 281159 99972 297325 53751 104531 -195004 59920 110507 -100292
12620 -10733 305579 177361 -154228 404418 -87273 -30081 136572 18624 -46975 135985
12609 -503782 -28585 -176184 131689 168731 22664 -192711 -51674 166316 48624 -160401
12598 106305 64419 110125 -94268 -149006 347133 -14992 -438166 -233837 146581 -88013 -131388
12587 -131388 6496 -185987 -33296 73816 159153 -29707 -248673 -80883 -15379 -152515 -40657
12575 -21744 158494 28023 49257 -260379 95896 -276378 -150890 -43470 114398 216822
12565 216822 -105976 -133324 196351 43882 128904 24473 -228390 -131947 304377 -61529 -31886
12554 -31886 82534 -98774 133435 47708 212297 -145820 -122395 114161 -167461 -17589 -16015
12543a6015G7810b28693B12353d2621q7475m7391C5432O6012m8588i2293j49220
12532b41513F9004f9899J9233c71k6419k30598G2471d25185h7506D06366a99314
12520B60547a07516o0357o3186D1807J2792a0589B14626d4994j53112b058A79736
12508A08489K7723b20505b0914j0675p375j01782D97419A90217l7889B6596J83340
12497B09936b93078a04663p4899A11662A3720c90187f7597k93967M755H3413a8628
12485D0242O7806r498o290f2711n6872A69411a72824H9083a98522B65028f8085
12473a27667B51121F0279Q5379g8741D36257j68553A8238J07626b04804G2959
12462b28663I6212a35883j04753A18056c9015j2190F5796G766a15451j09987f7892
$$ plain form
12543 -16015 77810 -228693 212353 -42621 -130096 -177487 35432 101444 52856 -92293 -241513
12532 -241513 69004 -69899 -50666 -371 -26790 -257388 72471 -425185 -87506 406366 -199314
12520 260547 -107516 -167873 -231059 41807 54599 -10589 214626 -44994 -198106 -2058 179736
12508 108489 136212 -220505 -20914 -31589 -38964 -140746 497419 190217 152328 26596 209936
12497 209936 -293078 -104663 -179562 111662 13720 -390187 -67597 -361564 -356809 83413 -18628
12485 40242 108048 98550 92260 -62711 -119583 169411 -172824 89083 -198522 265028 -68085
12473 -127667 251121 60279 145658 -78741 436257 267704 18238 125864 -204804 72959
12462 -228663 96212 -135883 -240636 118056 -39015 -51205 65796 7766 -115451 -225438 -67892
12450c88241i3479B51460a71178A27047L5475f7225l0563m6853C63268b83884
12439F6469M3520g3227j23966A41826J19231J9485b81156f9497b2482j40878l3389
12428a96749E5613e857k81219h2766C8568g234j3562A00951J5438Q5497a83582
12416A1865b41007O3899B0542c43030C1867L661a61073A62620a61930C1266a07654
12404C8382f3810A07659K54853a12087G0977b9342j48464a5926j22071C06271
12393b45817Q5912B91389a62367P8031A87834A0734J71072F980J4466J06094M0715
12382A68255a82365A32429R6746k4942L521g9161L4331C67426A78682P748C7476
12370f1151j74139A58756b5478k45838h5303A43157b60822i9532o3774N9795D1013
$$ plain form
12450 -388241 -93479 251460 -171178 127047 162522 -67225 -97788 -144641 363268 -283884
12439 66469 109989 -73227 -197193 141826 261057 280542 -281156 -69497 -22482 -163360 -196749
12428 -196749 55613 -5857 -287076 -82766 38568 -7234 -20796 100951 116389 201886 -183582
12416 11865 -241007 -177108 20542 -343030 31867 35528 -161073 162620 -161930 31266 -107654
12404 38382 -63810 107659 362512 -112087 70977 -29342 -177806 -15926 -137997 306271
12393 -245817 -159905 291389 -162367 -84336 187834 10734 181806 6980 21446 127540 168255
12382 168255 -182365 132429 229175 204233 207754 -79161 -44830 367426 178682 186430 37476
12370 -61151 -235290 158756 -25478 -271316 -85303 143157 -260822 -99532 -163306 -103511 41013
12358A3641a60213Q901D43018A59185E955R5940b50117A27743L1698b678A26006
12346a50907A66290g8127D55047B20945G1598a0783m31C0943A989N4402a55637
12334b3826B72106k1085n4787a95656A17998R153C0302O4276J31698O6800c0634
12322I3689J00780I2639R7737A5442O5314J16544J85186E4564J94003c4646c081
12310D3464L36270Q7702j78626a33403e8968j27294r0022b3992B70169c23219
12299I8958O1883m8663M5349p7437J17760b88292A40854e6869B49077j15418E5984
12287a3626I6904J67375C0911K23411k63A4573J53193J14727A2404e7555A9606
12275D5684d748k33740C23559q9783C304a49906C17973H0337a89683A84331c436
$$ plain form
12358 13641 -160213 -151312 443018 159185 5955 101895 -250117 127743 159441 -2678 126006
12346 -150907 166290 -78127 455047 220945 71598 -10783 -11214 30943 1989 56391 -155637
12334 -23826 272106 251021 196234 -195656 117998 127151 30302 94578 226276 293076 -30634
12322 93689 194469 92639 190376 15442 80756 197300 382486 54564 248567 -34646 -3081
12310 43464 379734 467436 288810 -133403 -58968 -186262 -276284 -23992 270169 -323219
12299 98958 160841 112178 157527 80090 197850 -288292 140854 -56869 249077 133659 55984
12287 -13626 96904 264279 30911 254322 254059 14573 167766 282493 12404 -57555 19606
12275 45684 -4748 -238488 323559 233776 3304 -149906 317973 80337 -189683 184331 -3436
12263C95553A34557J16683N7430J3051b19190F4368J55383j07330a28247B33352
12252A45446b8291B28311K07021A56697J3445k9167l0886K28657a19552K9138
12242i0414c7411q4204G3139a09910A03136b7848F52087A51705b27990E21522
12231c37483c562C67479A66057F7974K78395a00333B56265J19351e1906p3305
12221a25211N6933B57828a06844B52178Q5387j52522o7531C5518M4232J79078
12211B58828n0012M2875i9089K5068B99737j02538O4686j15820n7830J8604K78680
12200C85519j87892q2766J72681E9950J72720A0447K42680n1544k8584j5754K17888
12189C75133C0138g379A40766K99955H855f1337j19906f7697L1442G9139L48604
$$ plain form
12263 395553 134557 251240 308670 321721 -219190 64368 219751 112421 -128247 233352
12252 145446 -28291 228311 435332 156697 170142 140975 110089 338746 -119552 -90414
12242 -90414 -37411 -121615 73139 -109910 103136 -27848 652087 151705 -227990 521522
12231 -337483 -3562 367479 166057 67974 346369 -100333 256265 375616 -51906 -125211
12221 -125211 -68278 257828 -106844 252178 337565 185043 117512 35518 79750 258828
12211 258828 208816 251691 -99089 -74021 299737 197199 261885 146065 88235 106839 385519
12200 385519 197627 114861 287542 59950 232670 10447 253127 201583 172999 157245 375133
12189 375133 30138 -7379 140766 440721 8855 -61337 -181243 -67697 -36255 79139 427743
12178D27743A1888J24091k7662N6509Q5797q9227F4672C018J6220a02807c3511
12166E1737J30529K65812j05840o564J060A3772J66684M7129N7087A39549D2533
12154F5611a39192B41382L3238k9053b18040B82532d4426m3183j4891A92948k887
12143A90061A7698d6797q4932A43719b69119A0495L11347A15355b1363A65714
12132G0822a21917A70473J27740B6943L24904A22038a5379A8072J14325G681J16389
12121A24070J7033J97824A52337C5577M28074H0390K92246p4666A02241K75484
12111C77725j77036K24454B10516a4387j71286j813n8304B73249B1465d9535A08122
12099A82471d4736k48528f5773B01224f0087p3595D48540I7461J08865f7450B28540
$$ plain form
12178 427743 11888 135979 108317 164826 250623 161396 64672 3018 19238 -102807 -33511
12166 51737 182266 448078 342238 335674 336734 13772 180456 227585 284672 139549 42533
12154 65611 -139192 241382 274620 245567 -218040 282532 -44426 -87609 -102500 192948 190061
12143 190061 17698 -46797 -131729 143719 -269119 10495 321842 115355 -21363 165714
12132 70822 -121917 170473 298213 26943 351847 122038 -15379 18072 132397 7681 124070
12121 124070 141103 338927 152337 35577 463651 80390 372636 297970 102241 377725
12111 377725 200689 425143 210516 -14387 -185673 -187486 -245790 273249 21465 -49535 108122
12099 182471 -44736 -293264 -65773 201224 -60087 -133682 448540 97461 206326 -67450 228540
12087C60770I6176a6613B84319I0088Q730P9208j1937J90592c9553m4441C79799
12075a11402B09609a26136B68095n5953K36346j23394j59142L71300A33038a6865
12064A25629N0144L1056e0915A34542a7810j20594E5999b21010e1914l1286j61401
12053b44601p8388A06844c02341E05521A40725A9431J12324g9097n745J7575q2097
12042a49364q2167f3202l69504d5100A16545c01866h1966H3167a24903A47139
12031a0922A58842J68294G952K21361r8121J38895D1638J32792P4632e2163A57306
12019I6102a65774B27676J0988b80721C25584A35898g739B16833b78230C33006
12008A06217h0702A38408J49717A30373D5474J02435D1853K79415m6609i7667
$$ plain form
12087 360770 96176 -16613 284319 90088 98818 178026 166089 356681 -39553 -83994 379799
12075 -111402 209609 -126136 268095 212142 448488 325094 165952 537252 133038 -16865
12064 125629 175773 206829 -50915 134542 -17810 -138404 55999 -221010 -51914 -83200 -244601
12053 -244601 -322989 106844 -302341 505521 140725 19431 131755 -79097 -84842 -67267 -149364
12042 -149364 -231531 -63202 -432706 -45100 116545 -301866 -81966 83167 -124903 147139
12031 -10922 158842 327136 7952 229313 131192 270087 41638 174430 249062 -52163 157306
12019 96102 -165774 227676 238664 -280721 325584 135898 -7739 216833 -278230 333006
12008 106217 -80702 138408 288125 130373 45474 147909 41853 321268 274659 -97667
11997C10378m9741c05549f6466A51297b18867d3111A73516K9595m2872k4077a27298
11985c84153a62068A49125e0020a4967A2965L18137h8995L1983n8308c6974n3283
11974i0257G941J6384N2584J64960B3968b12710G5778a15775d1401B15267b68675
11962a67592D102a68127C5404i210H5168c48700a37611j5359j37980a05472B66549
11950A48395m8937J10874l9155B3380J58160b88967m445d8792o5269C34302b28385
11938B94122g3913B38068A1239J52090p413j9467K696M3503c87865b2771k02364
11927b25135J05665D2205Q8075D2847a49938M7074A152a67665A28517a4410j24809
11916a39219q051j36762J33297C52457c4929j07863F5132a99762B25706H0069
$$ plain form
11997 310378 260637 -305549 -66466 151297 -218867 -43111 173516 203111 160239 136162 -127298
11985 -384153 -162068 149125 -50020 -14967 12965 331102 -88995 -57012 -115320 -36974 -90257
11974 -90257 7941 24325 76909 241869 23968 -212710 75778 -115775 -41401 215267 -268675
11962 -167592 4102 -168127 35404 -9210 85168 -348700 -137611 -152970 -290950 -105472 266549
11950 148395 99458 210332 171177 23380 181540 -288967 -293412 -48792 -114061 334302 -228385
11938 294122 -73913 238068 11239 163329 155916 136449 139145 182648 -387865 -22771 -225135
11927 -225135 -119470 42205 130280 42847 -149938 -102864 1152 -167665 128517 -14410 -139219
11916 -139219 -147270 -284032 -150735 352457 -34929 -142792 65132 -199762 225706 80069
11905G4024J87364b17158e7462q710a1031A42368c67035H6382a47309b0534j42909
11894a63443M2597b5509j65570j97097G4359c35328h4229A56042c44613d7256
11883a33034N5405k64623A01687j5888R9359a5065a662C73878b76423a32989H4355
11871A09687a73692C00264A20581d5217H0879a94380K669j17711J27206M0854
11861a41362F1610e531j79012A46324b01155j37825J08332j38561o9459a19601
11850A24538J7726c35898A03311a03553C40813j47169H6648b20751B1370L8427
11840E9797B7063D825c46022a2397A43414J1807k9024c83713A12586b8742n7889
11829h6631A62109B3156d0585j84026o7815d2697j72546B9997b90943f4594A57997
$$ plain form
11905 74024 261388 -217158 -57462 -66172 -11031 142368 -367035 86382 -147309 -20534 -163443
11894 -163443 -120846 -25509 -191079 -388176 74359 -335328 -84229 156042 -344613 -47256
11883 -133034 -77629 -342252 101687 85799 185158 -15065 -1662 373878 -276423 -132989 84355
11871 109687 -173692 300264 120581 -45217 80879 -194380 -191711 -309422 -182216 -141362
11861 -141362 61610 -5531 -184543 146324 -201155 -338980 -230648 -369209 -438668 -119601
11850 124538 142264 -335898 103311 -103553 340813 193644 86648 -220751 21370 59797
11840 59797 27063 4825 -346022 -12397 143414 155221 126197 -383713 112586 -28742 -86631
11829 -86631 162109 23156 -40585 -224611 -292426 -42697 -215243 29997 -290943 -64594 157997
11817E5142i1697L6295q3320A76640d44707A62521c24735i0601L4980A78186a59515
11805g3845D92761i0444A10393a60045G6993a78077f8571A3716a0989I1275J00634
11794A91909a38058a0524k5227j4894l79018a52026d121E9857a84806E5408O9938
11783A25346L8035L4392C6964J82197r0213j2311a47736a5836k54925B98725j46434
11772A52291p0055c68883F3157f2459B69487f7532A11501J02787c8516e60j5464
11761a6024l9702o9877H3621a78856A43399c7276A48340g3209B14212b27206i4508
11749a69163Q911E4818i2913A47689b00205c3860A98459e03093C96323b28933
11738c8478q8026b5144A56735B6735i7039E08919a84189A34258a05216A01811
$$ plain form
11817 55142 -91697 -55402 -138722 176640 -444707 162521 -324735 -90601 -55621 178186 -159515
11805 -73845 492761 -90444 110393 -160045 76993 -178077 -68571 13716 -10989 91275 191909
11794 191909 -138058 -10524 -35751 -50645 -429663 -152026 -4121 59857 -184806 55408 125346
11783 125346 163381 197773 36964 219161 128948 116637 -147736 -15836 -270761 298725 152291
11772 152291 82236 -368883 63157 -62459 269487 -67532 111501 214288 -38516 -560 -16024
11761 -16024 -55726 -125603 83621 -178856 143399 -37276 148340 -73209 214212 -227206 -94508
11749 -169163 -160252 54818 -92913 147689 -200205 -33860 198459 -503093 396323 -228933
11738 -38478 -126504 -25144 156735 26735 -97039 508919 -184189 134258 -105216 101811
11727H2465b35666A09297l9163d4700l4080o7649l4051o0318J00078a8955j5168
11716c4123F9035K5194J5960L20671A98318O0675B1324g905p6399F2676B2094
11704A22796a7858p5455j56286F9082a5300D78622B0062L18292a3264q8861p3221
11693a75346B20596B9965i9068a5248B75638h9583a4573B9871g4780F724K36944
11682B43668d5482l4083K6445H7143a934A74573b1426A3723L6765L9443g6343
11670B82249J78403a76740b824j8936D2224f5799o0889d7365j41126e8265B34554
11658a09190r3304P0198A85667G0768b81047K7464N5247A45432P6241D9216N467
11647E4683L96819B9006J25584a28924a3627A7860P0695a59983C505b83012f4294
$$ plain form
11727 82465 -235666 109297 70134 -44700 -78780 -146429 -180480 -240798 -140720 -18955 -34123
11716 -34123 69035 94229 110189 430860 198318 258993 21324 -7905 -84304 62676 22094
11704 122796 -17858 -93313 -249599 69082 -15300 478622 20062 338354 -13264 -102125 -175346
11693 -175346 220596 29965 -99068 -15248 275638 -89583 -14573 29871 -74780 6724 243668
11682 243668 -45482 -79565 -53120 87143 -1934 174573 -21426 13723 50488 89931 -76343
11670 282249 460652 -176740 -2824 -21760 42224 -65799 -126688 -47365 -188491 -58265 234554
11658 -109190 -202494 -132296 185667 70768 -281047 -253583 -198336 145432 221673 49216 54683
11647 54683 451502 29006 154590 -128924 -13627 17860 88555 -159983 3505 -283012 -64294
11635b14022B06667J36073d155H3844c63382E6123M5956i2385m4805I3282J6953
11624A10235L7574D0706K96382a28637B289P1949J5026P6033b45734B90379A34498
11612A66453c66742C39206j36807E4434P6644B2874b8319B05170c7603B79160
11601a30712k25942b5819A84329m6127D1155j4608i4523b7359j13113a0387j12832
11590a23219A9692a03363o7028A10133L1555a1156B45549G6651C685c20491D09229
11578a33184J3819B80433l1802f1924D41661a83156J2656I7500L8265a93833d2894
11566A78441p5765P0961a6670C78092g414r2783A72806b1633n01C22752H1144
11554B9867N947N8530M7579J4061j833d0899H6533b71788a5198j1053B39326A07771
$$ plain form
11635 -214022 206667 342740 -4155 83844 -363382 56123 102079 -92385 -137190 93282 110235
11624 110235 147809 40706 337088 -128637 2289 74238 89264 165297 -245734 290379 134498
11612 166453 -366742 339206 202399 54434 131078 22874 -28319 205170 -37603 279160
11601 -130712 -356654 -25819 184329 138202 41155 26547 -94523 -27359 -140472 -10387 -123219
11590 -123219 19692 -103363 -170391 110133 141688 -11156 245549 76651 3685 -320491 409229
11578 -133184 -119365 280433 248631 -61924 441661 -183156 -170500 97500 135765 -193833 -42894
11566 178441 102676 173637 -16670 378092 -7414 -100197 172806 -21633 -22134 322752 81144
11554 29867 35814 94344 141923 155984 154151 -40899 86533 -271788 -15198 -26251 239326 107771
11541C03406J49523b28197N7487A00194C8460g0617j49574G8765r871N5797b25596
11529E4734a20781B54783a80122A41502q808p713L7752D4147A2356b5365B17030
11517B71277E5453Q9697D0383J04503b04089E51997B73414F4188J45569o8755
11507A41002c1462A27466K90587i7634j35558A88578E8324e1357A47340a09405
11496f1854A99426b1279o5902m4522B36446P9840e5424C56063l804j24128e8297
11484C43665j18523D2906J04163g8335A32827Q133b41296B89324a07785B10360
11473E5633j1393a43330L2245a9401j28079e9839A02689J60746E4704J51264R5910
11462C01878D6149f4962A56462j4363h6409B02153F425h8584j55927A17728O8539
$$ plain form
11541 303406 452929 -228197 -170710 100194 38460 -70617 -220191 78765 68894 124691 -225596
11529 54734 -120781 254783 -180122 141502 132694 124981 162733 44147 12356 -25365 217030
11517 271277 55453 145150 40383 144886 -204089 551997 273414 64188 209757 141002
11507 141002 -31462 127466 418053 -97634 -233192 188578 58324 -51357 147340 -109405
11496 -61854 199426 -21279 -87181 -131703 236446 316286 -55424 356063 352259 228131 -58297
11484 343665 225142 42906 147069 -78335 132827 140960 -241296 289324 -107785 210360
11473 55633 44240 -143330 -111085 -19401 -147480 -59839 102689 263435 54704 205968 301878
11462 301878 46149 -64962 156462 142099 -86409 202153 6425 -88584 -244511 117728 186267
11451A86267o7905n8084M2700A257a6076o4235G9467M3537f9040K3003d79j05764
11439a06243B37649A02163f972I4524C196K2163a65702B54852r7847A2106L46348
11428C58454g7366D5596Q6688J99684a75163C5433a22150J6178E1600f0196D4123
11416D1266O6988a59538C0659a34774F1483a68963B96550a36021A7132L9145a82137
11404d9934a1536k39779I7116J50341h4759A75609R6394j34231j1211Q8635H1596
11392F6356K24955q5090a76772B63810n7117Q7983C0810a07712A23763c96636
11381b676B4637a95120a1326j31985o2814E270K8449K84575a35909G1334i2316
11369A75830J9956a30021F312J4421K18369a40201n908G4700f4060C4373f5753
$$ plain form
11451 186267 118362 60278 102978 1257 -16076 -80311 79467 123004 -69040 -46037 -479 -106243
11439 -106243 237649 102163 -6972 94524 3196 25359 -165702 254852 157005 12106 358454
11428 358454 -77366 45596 132284 331968 -175163 35433 -122150 -105972 51600 -60196 44123
11416 41266 108254 -159538 30659 -134774 61483 -168963 296550 -136021 17132 56277 -182137
11404 -49934 -11536 -251315 97116 247457 -84759 175609 272003 137772 126561 215196 81596
11392 66356 291311 206221 -176772 263810 206693 294676 30810 -107712 123763 -396636
11381 -2676 24637 -195120 -11326 -143311 -206125 5270 33719 318294 -135909 71334 -92316
11369 175830 195786 -130021 6312 20733 239102 -140201 -146109 74700 -64060 34373 -65753
11357d1079G9988f8115l6484A67017f6336K0132L45r5269k5423L8347A41449a08867
11344a95643K9629j36583a48421e6944C3646a25554C23692c31514a7189r0800
11334a07989K1699p5507K9766d9736n6129F0995K13361E6309a1022j38005j28794
11323b77821A71834j0721J47730o7560e4706A84907b59916A7468d2132A53959
11312e6900k36858B03492b38929n0229k6486j16788a60686A86553J40083D4517
11301c6344B31702h971H3862K4648J79983E271g2188A8131b05072b2450B25351
11289A92518F8603e4147p434a8322l1807n8228l4907F36J16312m8861b45598E23066
11276b49456a01475j08027B56371c2185C09242b52181d2694A50949b6532m2482
$$ plain form
11357 -41079 79988 -68115 -104599 167017 -66336 -46204 -45859 -141128 -166551 -128204 141449 -108867
11344 -195643 -166014 -302597 -148421 -56944 33646 -125554 323692 -331514 -17189 -107989
11334 -107989 -86290 -161797 -132031 -49736 -105865 60995 274356 56309 -11022 -149027 -277821
11323 -277821 171834 161113 308843 241283 -54706 184907 -259916 17468 -42132 153959
11312 -56900 -293758 203492 -238929 -289158 -315644 -432432 -160686 186553 326636 44517
11301 -36344 231702 -8971 83862 108510 288493 5271 -72188 18131 -205072 -22450 225351
11289 192518 68603 -54147 -61581 -18322 -50129 -108357 -143264 636 116948 68087 -245598 523066
11276 -249456 -101475 -209502 256371 -32185 309242 -252181 -42694 150949 -26532 -69014
11266f9014j45566a01546l3653E3416a30816A34053b4042j17533B45671m2932
11256B02739a48668A24466O3060a97194A96362d3902D0612f1484j68256L3301
11246a96439j5267j45659C11089a88963B12871A0704J00415l7094L1059O5282
11236A70366b41500b4895n8317A27586e4565B79217C2255a09500m5223j42356
11226b97079A80254q2439J16235j0710J00541A7469a13849b5207k14975g7370
11215b64483d4181F9983c3433k14859K1788B02948a40432k42595a09675c2187
11204a14581A27434n4395b36719E9652K63986d1111A99703a66770E1441g653A92311
11192a02197F0793a5964E9239h814p1578j61826j67517L2947H5398J04536e4260
$$ plain form
11266 -69014 -214580 -101546 -135199 53416 -130816 134053 -24042 -141575 245671 202739
11256 202739 -148668 124466 187526 -197194 196362 -43902 40612 -61484 -229740 -196439
11246 -196439 -211706 -357365 311089 -188963 212871 10704 111119 74025 105084 170366
11236 170366 -241500 -24895 -83212 127586 -54565 279217 32255 -109500 -154723 -297079
11226 -297079 180254 97815 214050 203340 303881 17469 -113849 -25207 -240182 -77370
11215 -264483 -44181 69983 -33433 -248292 -226504 202948 -140432 -383027 -109675 -32187
11204 -114581 127434 73039 -236719 59652 323638 -41111 199703 -166770 51441 -7653 192311
11192 -102197 60793 -15964 59239 -8814 -80392 -242218 -409735 -376788 85398 189934 -54260
11180G7801a19992L8011m5615A9516g0048A77350e3717k8587A13859a9262n5839
11169g5101j23776a6584C02436a57433A72404a61800J9249f6397k15658F3619
11158C2201K83680B8900b26270E5792k3433a10580G2528c28262a19078b2335C3645
11146C02372a50370D5741b07082E5757H888K9584a03973l3377e5731j1046l28103
11135c94880C30323k8511F6652a17931A99399d7314A31617E2416h7773k64663
11125c52436F7494K17975i5802p7486N2007j20615A40559g679n8167A2526L12227
11114C24753j40266n0257c1884j07340D2986A9794d30730D5742b65449E1404N1435
11103A02839j0262L7818M81293d0260A90917l5594K10773j09190J57659A92141
$$ plain form
11180 77801 -119992 -81981 -127596 19516 -70048 177350 -53717 -82304 113859 -19262 -75101
11169 -75101 -198877 -16584 302436 -157433 172404 -161800 -142551 -66397 -282055 63619
11158 32201 315881 28900 -226270 55792 32359 -110580 72528 -328262 -119078 -22335 33645
11146 302372 -150370 45741 -207082 55757 8888 38472 -103973 -137350 -55731 -66777 -394880
11135 -394880 330323 301812 66652 -117931 199399 -47314 131617 52416 -87773 -352436
11125 -352436 67494 285469 -95802 -173288 -121281 -241896 140559 -7679 -65846 12526 324753
11114 324753 184487 134230 -31884 -139224 42986 19794 -430730 45742 -265449 51404 102839
11103 102839 92577 130395 611688 -40260 190917 155323 366096 256906 414565 192141
11092h101A71712L7874a03991B7939J36684L6013R352H3088J94281m3165C6628
11080a5209B75837H7234R6905M9369c8436B70451D4494L5194K49983O3285A95187
11068D50240j76613c4161B71455l0626K12442j45416A51278L479E9469N05972
11058E65441G2077L72018K80366o6515N5299j69274k49439K15718B02649m8582
11048A54067K16758K34019j89723J74172M07003l40256K91346l87597R3002J82811
11038H35602j69808J57659J45412C71165K69124j28436j3090J10132R7349j32386
11028E73858k26639J14627J85476K32549l15670K02193O5441j32899Q8059j96565
11018E90430N0609p9337K6218k78041M46244l14527J14848K829l7421P7762r7094
$$ plain form
11092 -8101 171712 209586 -103991 27939 164623 200636 209988 83088 277369 234204 36628
11080 -15209 275837 87234 184139 233508 -38436 270451 44494 79688 329671 392956 195187
11068 450240 273627 -34161 271455 240829 453271 307855 151278 154757 59469 565441
11058 565441 72077 444095 724461 657946 713245 543971 294532 510250 202649 154067
11048 154067 370825 604844 415121 589293 996296 656040 947386 559789 652791 835602
11038 835602 665794 823453 968865 371165 640289 511853 498763 608895 706244 573858
11028 573858 347219 461846 647322 879871 564201 766394 831835 698936 786995 590430
11018 590430 641039 561702 587920 309879 756123 441596 556444 559273 521852 599614 502520
11007E02520B36859M59930k8143J9190l25386M85176D04628L09469M9294C42036
10996C72486L08389B51946L77740r889N1705k86301L18793q4000L18000j93914
10986G44080j88784Q8213J27360J77880j83428j29960K0971L64939D73710M75000
10976I48710N30352n29542J16938M51774O0820j40761L97510r7855L42324K14724
10966B294994K26915j06083J84281o8161m49933J29698j75945j47650j80421m82072
10956A225623K06831K58068p7367K37536p1545J4727l3971k11988k15507j87371
10946A145036J3390L9842m67867C31070m4408K88215p3014r2681a70779D02524
10935C27017e1505H048Q0617L1616d2836A14249c3387G5205M3755A5921K7598
$$ plain form
11007 502520 236859 696789 668646 687836 362450 847626 404628 714097 763391 342036
10996 372486 680875 251946 629686 619797 671502 385201 703994 619994 937994 744080
10986 744080 555296 643509 770869 948749 765321 635361 656332 1021271 473710 948710
10976 948710 1479062 949520 1066458 1518232 1579052 1438291 1835801 1737946 2080270 2294994
10966 2294994 2521909 2415826 2600107 2531946 2082013 2211711 2035766 1888116 1707695 1225623
10956 1225623 1432454 1690522 1613155 1850691 1779146 1793873 1759902 1547914 1332407 1145036
10946 1145036 1158426 1198268 730401 331070 286662 574877 501863 409182 -170779 402524
10935 327017 -51505 8048 88665 120281 -42836 114249 -33387 75205 118960 15921 43519
10924D3519O1511a47688N7500j48481D469K6131c00656f1209B14456F9389b17044
10912d0106A07175f8440j49240B26044b26077F8310J13039p5416a00278r979k31970
10901c42227a45936B993f1601D39142a31302a3759p811j68014F9789j6785P8151
10890A31155D7147a04174B07357c3055B1931Q0998C9422j2780J14895m5380O0444
10879A56601a81895F5224O0274e1610B71894a27098r1283m8070g2779A88900E569
10867E2403f4017q9764b8063A02158b85117a05017j90118J20515A73502I086P4441
10856H3527k4473R4712a31377H0047M042i5726j26134B7518d4147A33387a17736
10844g7585l43858B2272a81413r6690B17433d2865H3432d0249k06133g3975j69674
$$ plain form
10924 43519 105030 -147688 -90188 -238669 4469 30600 -300656 -61209 214456 69389 -217044
10912 -40106 107175 -68440 -217680 226044 -226077 68310 181349 105933 -100278 -110257 -342227
10901 -342227 -145936 2993 -61601 439142 -131302 -13759 -21570 -189584 69789 53004 131155
10890 131155 47147 -104174 207357 -33055 21931 102929 39422 26642 141537 96157 156601
10879 156601 -181895 65224 125498 -51610 271894 -127098 -218381 -266451 -72779 188900 5569
10867 52403 -64017 -153781 -28063 102158 -285117 -105017 -295135 -174620 173502 9086 83527
10856 83527 59054 153766 -131377 80047 84089 -95726 -221860 27518 -44147 133387 -117736
10844 -77585 -421443 22272 -181413 -278103 217433 -42865 83432 -40249 -246382 -73975 -243649
10833b43649F7116b20228E1136b45903B45188I1061k6469a5278m7073k32109n2901
10822c47361B72200c43037a03381a0174n7076b4190k00756r7470a27025I818f8005
10810G7499a18053A76849b6518B09969b01373L3306G5649c27544J38095D3230
10799d66149G0779g9346B5796c72150a29218e0037F9444b21362B72859E1617d9568
10787a85941K2938M3312q3471l06895g2554n8216j54725i5384I20P8447g7982
10775h3289j33001P8570o4184a0731j10969G5676i9252A78259a13378A41324K10160
10764C51484b43779L0136H1993b8293p6866r6191O3762C2600m687M1843a03686
10752C7446c71427A17724a10413A8561a19535q0696E1806c50901A24040K7911
$$ plain form
10833 -243649 67116 -220228 51136 -245903 245188 91061 64592 -15278 -62351 -294460 -347361
10822 -347361 272200 -343037 -103381 -10174 -67250 -24190 -224946 -322416 -127025 9818 -68005
10810 77499 -118053 176849 -26518 209969 -201373 -168067 75649 -327544 -189449 43230
10799 -466149 70779 -79346 25796 -372150 -129218 -50037 69444 -221362 272859 51617 -49568
10787 -185941 -163003 -119691 -203162 -510057 -72554 -130770 -285495 -95384 920 79367 -77982
10775 -83289 -216290 -137720 -201904 -10731 -121700 75676 -99252 178259 -113378 141324 351484
10764 351484 -243779 -213643 81993 -28293 -105159 -201350 -137588 32600 27913 69756 -103686
10752 37446 -371427 117724 -110413 18561 -119535 -200231 51806 -350901 124040 151951
10742A51951m8582a38595N6239j95321J26492j09068A35572a70562h1346j41310
10732b22656B30438a25161c5006F6310a49767a5391A96918a95309C17613d8500
10721a92681d6206B31671E3727b27562B66921a93105o5527a6933n8814l5519J6930
10710i4336j05134E8149k4800J50940b42187J07947f346m3508j62249R5615A0666
10698a74574e187A24106c27429B14009A01317b85648e5438E5483L86337a76714
10687B25327a38594B01966c33023a64558k2673A31174d06556Q0367J10748C31252
10676D5557P1338a96549j85311a20750B34480f2212C28029B5000b08750H9253
10665e8452A86265G412M6231c940q6411A19544m5941B8680a70332A11232a78755
$$ plain form
10742 151951 103369 -138595 -82356 -277677 -151185 -260253 135572 -170562 -81346 -222656
10732 -222656 230438 -125161 -35006 66310 -149767 -15391 196918 -195309 317613 -48500
10721 -192681 -46206 231671 53727 -227562 266921 -193105 -258632 -16933 -75747 -111266 -94336
10710 -94336 -199470 58149 33349 184289 -242187 -134240 -6346 -49854 -212103 -116488 10666
10698 -174574 -5187 124106 -327429 214009 101317 -285648 -55438 55483 441820 -176714
10687 225327 -138594 201966 -333023 -164558 -187231 131174 -406556 -326189 -215441 331252
10676 45557 116895 -196549 -381860 -120750 234480 -62212 328029 25000 -208750 89253
10665 -58452 186265 7412 53643 -3940 -90351 119544 73603 28680 -170332 111232 -178755
10653a94688b4194F0841a30887m8837g4568G7989J45031c59261K5925b2382o1743
10642h4125c096j62215q2218H6774c7335B1450b75034L6842B7023K0321b32485
10630A30583E6343M7934m4667a00986H731b64517B16494F1321N1646c3764j43379
10619a77143p0664E3734b78412I7155K3780J10347a71674k02136E2620c2148k9629
10608f1777K4578B81586f3467c0405B6639e4851r8447K5572G8381P0346a52168
10596B41121B0033a61484n6292A19499f16731A10477c4714C3656M6157d77689
10585b2277F8310B4037j0205g7929L0927k2645B11398a05883J7528M2687p3310
10574a18978K1114j6579j37566c1821A8910b84582c8076q9444n5326K8100j10220
$$ plain form
10653 -194688 -24194 60841 -130887 -179724 -74568 77989 223020 -359261 -333336 -22382 -84125
10642 -84125 -3096 -165311 -247529 86774 -37335 21450 -275034 -238192 27023 47344 -232485
10630 130583 56343 104277 59610 -100986 8731 -264517 216494 61321 112967 -33764 -177143
10619 -177143 -247807 53734 -278412 97155 120935 231282 -171674 -373810 52620 -32148 -61777
10608 -61777 -37199 281586 -63467 -30405 26639 -54851 -153298 -127726 78381 148727 -152168
10596 241121 20033 -161484 -217776 119499 -616731 110477 -34714 33656 79813 -477689
10585 -22277 68310 24037 13832 -77929 -47002 -69647 211398 -105883 -88355 -45668 -118978
10574 -118978 -97864 -114443 -252009 -31821 18910 -284582 -38076 -127520 -182846 -154746 -264966
10563b64966D1321A1022g7652j32602k4990a12934j37622M6833A92180K9252A6962
10551d8146k4727q3090d1610A1928J89409o4877h750c463E446b11959d1391A73
10538h8263j80616B92f79945i2664j94133C512Q9948a0769A59056a01392H4776
10526b79503F3077a40325e7275I1818C6391a3429j68537C05064I715J32836a35724
10514a07893k71028e8235p7742O0336A15234J83419h8948B7042b21834G8100a88055
10502b28036A52356a85727k2938B7209P1324c49277G5094a61473e9919j89696
10492b49615K8280q0081G1640J61334K3118b11555E3898a36847A65905O7191a51802
10480e6988B9030b15199c4064B04754K93529A24854J62210j14746N05208k12830
$$ plain form
10563 -264966 41321 11022 -77652 -210254 -235244 -112934 -250556 -203723 192180 221432 16962
10551 -48146 -72873 -155963 -41610 11928 201337 136460 -8750 -3463 5446 -211959 -41391 173
10538 -88263 -268879 292 -679945 -92664 -286797 3512 93460 -10769 159056 -101392 84776
10526 -279503 63077 -140325 -57275 91818 36391 -13429 -181966 305064 9715 142551 -135724
10514 -107893 -378921 -58235 -135977 -75641 115234 298653 -88948 27042 -221834 78100 -188055
10502 -228036 152356 -185727 -208665 27209 98533 -349277 75094 -161473 -59919 -249615
10492 -249615 -221335 -301416 71640 232974 256092 -211555 53898 -136847 165905 233096 -151802
10480 -56988 29030 -215199 -34064 204754 498283 124854 287064 172318 677526 464696
10470D64696M801j58722d4358F2176O1800n3113a79559e6576B10017D2079a36744
10458a0216B59473B789a52374j24196d0474j21413Q0920G1181a1091j25276g943
10446B99N6370a47209B26247E7908h8518D821a48463l5266c5655n2871k918m66055
10434e57499e8606a5320H5483K25456i7752C23325a42495n5785D0846b95316B22465
10422I0659i7684B03811a83227i301F4706J3483K70939F7048j1130Q1072c12505
10410d5130A73449a66146P5162c2309n3967G9117a54182l2542r0928a28561L3181
10399i5380C465M4036A3257c32288a48643B9762N997M2825d0609j33127D8801
10387A28968a24161j10801P7559A897J40884K50421e5507B579K05873g0832C18204
$$ plain form
10470 464696 469497 310775 -44358 62176 123976 70863 -179559 -56576 210017 42079 -136744
10458 -10216 259473 2789 -152374 -276570 -40474 -161887 -80967 71181 -11091 -136367 -7943
10446 299 56669 -147209 226247 57908 -88518 4821 -148463 -183729 -35655 -88526 -91444 -557499
10434 -557499 -58606 -15320 85483 310939 -97752 323325 -142495 -198280 40846 -295316 222465
10422 90659 -97684 203811 -183227 -9301 64706 78189 349128 67048 55918 136990 -312505
10410 -45130 173449 -166146 -90984 -32309 -86276 79117 -154182 -186724 -277652 -128561 -95380
10399 -95380 3465 47501 13257 -332288 -148643 29762 35759 78584 -40609 -173736 48801
10387 128968 -124161 -234962 -157403 1897 142781 393202 -55507 2579 208452 -70832 318204
10375b25320B3586J86654N8765b2085B19651J01555J82264j08446H8698O9213
10365A57911J73856M6587p6140K40708j55298l6026Q2030I0404B1573L91496i2575
10353C42947a67848B6000L28345p9765J73040m7180p5772J64562H8370K01951
10343B90321A3855L13757J8588J40325m6520m0493j0415A29444c7038a0227C79489
10331A37280J25923a70294h2523C33106j44921k0169b2452k03965g8641A16668
10320B67543j01172K66836r8089I8155k3778b3184H4928K39483F0609k804J33407
10309A91212l6693d2295H4165j0803f7176B72254G5125k6418M3566d2205J6979
10298b5226C4095j0595g176F457a53142F7006J73777c2893D5233c8165j82184
$$ plain form
10375 -225320 23586 210240 269005 -22085 219651 321206 503470 395024 88698 157911
10365 157911 331767 378354 302214 542922 387624 351598 433628 90404 21573 413069 -92575
10353 342947 -167848 26000 354345 274580 447620 400440 324668 489230 88370 290321
10343 290321 13855 327612 346200 486525 440005 399512 389097 129444 -37038 -10227 379489
10331 137280 263203 -170294 -82523 333106 188185 168016 -22452 -226417 -78641 116668
10320 267543 166371 433207 335118 98155 74377 -23184 84928 324411 60609 57805 191212
10309 191212 154519 -42295 84165 73362 -67176 272254 75125 48707 92273 -42205 -25226
10298 -25226 34095 23500 -7176 6457 -153142 67006 240783 -32893 45233 -38165 -220349
10287b20349A16885l5210b11295I377a93351a2404l58680J03239C3155a05002
10276a13980l05005a1835j9043k58662a37720B07003c1453j13349A20716J5555
10266A36271c61263a16849d01j59414A89591d4830l3246n8948C4559b126B89736
10254c09790D5057M2209K68859I6493P7509P4392J02835B2527a21791A6727L7503
10243E4230e50916B56382C178g2051q3880M6201M6330j47451G7385C7072J48719
10232A85791b35575d7182C84826c68307B39721h0864B4948L8284b26682Q8596
10222a38086p554a9497j2557p0558o8440J8825d4647j56723H330a99684L0472
10211a69212J3032P7337A8422i0198A09976J49464a47096A53508a73903M6521
$$ plain form
10287 -220349 116885 81675 -211295 9377 -193351 -12404 -371084 -267845 33155 -105002
10276 -113980 -418985 -11835 -30878 -289540 -137720 207003 -31453 -144802 120716 136271
10266 136271 -361263 -116849 -401 -159815 189591 -44830 -78076 -137024 34559 -2126 289736
10254 -309790 45057 87266 356125 96493 174002 248394 351229 22527 -121791 16727 54230
10243 54230 -550916 256382 3178 -72051 -155931 -109730 -63400 -210851 77385 37072 185791
10232 185791 -235575 -47182 384826 -368307 239721 -80864 24948 63232 -226682 -138086
10222 -138086 -145640 -19497 -32054 -102612 -171052 -152227 -44647 -201370 8330 -199684 -169212
10211 -169212 -156180 -78843 18422 -90198 109976 259440 -147096 153508 -173903 -127382
10201a27382N6927b9601m8296j23665L8836l3966G2464b52227R9025C0590c87768
10189b30125D13558H0785b63923E5820a00818j28183E8120a4312j27650H6197
10178e5756b512k30327A400a89482A78611b46757E6822i7577D8998d506l7283
10167d1789A68905c9703l58288J20912g1167K325A768J27781a43445A56966E9128
10155a35486r8799d8502A37820D5794b36094i9835E7760A9731a98122Q9041A45936
10143c3870j05070I019c52973A3804J53968c85006a4431k17236B35087d02446
10132A87047a15037c5982j88899g2058q5013B01956d7514a1550k77102J30915
10122a57737A77575k0877J5287c7711k00516A46689R242f5799p5310d9115A90388
$$ plain form
10201 -127382 -70455 -29601 -77897 -201562 -162726 -196692 72464 -252227 -153202 30590 -387768
10189 -230125 413558 80785 -263923 55820 -100818 -229001 58120 -14312 -141962 86197
10178 -55756 -2512 -232839 1400 -189482 178611 -246757 56822 -97577 48998 -4506 -41789
10167 -41789 168905 -39703 -397991 -277079 -71167 -68842 1768 129549 -143445 156966 59128
10155 -135486 -234285 -48502 137820 45794 -236094 -99835 57760 19731 -198122 -109081 145936
10143 -33870 -138940 9019 -352973 13804 167772 -385006 -14431 -231667 235087 -402446
10132 187047 -115037 -35982 -224881 -72058 -157071 201956 -47514 -11550 -288652 -157737
10122 -157737 177575 156698 171985 -37711 -238227 146689 155931 -65799 -141109 -49115 190388
10110a62077m196A10225b74791N4965o284B5557c10945c7129k41641A57582g9270
10098A16618b31929o0465J42386H6303d2042k70113A55533b9484E784J05719P2961
10087A84464c88953j92898i0573A31671f1811A5993Q5944a6939j42319J862J0175
10076a47221j02757r314R8279d2377C23511a61244I4708b71236A75998b72816
10065A20238a85620m5796a7911k44134a27381b4472j66798d8008A12587b62075
10054F5739a55048k48550a95567j11810a17469a5505k44369A35044c71402R8601
10044b72801B31781a77505j10481H5711c4728C7816J85922g767B65955O237A128
10032I2292g4644B22692c12851B1884a4902j27618I2582M4000F4643b40824D5446
$$ plain form
10110 -162077 -166273 110225 -274791 -219826 -226110 25557 -310945 -37129 -278770 157582 -79270
10098 116618 -231929 -292394 -150008 86303 -42042 -312155 155533 -29484 5784 111503 184464
10087 184464 -388953 -581851 -90573 131671 -61811 15993 101937 -16939 -159258 -157396 -147221
10076 -147221 -249978 -259292 -161013 -42377 323511 -161244 94708 -271236 175998 -272816
10065 120238 -185620 -231416 -17911 -262045 -127381 -24472 -191270 -48008 112587 -262075
10054 65739 -155048 -403598 -195567 -307377 -117469 -15505 -259874 135044 -371402 -272801
10044 -272801 231781 -177505 -287986 85711 -34728 37816 223738 -7767 265955 272192 1128
10032 92292 -74644 222692 -312851 21884 -14902 -142520 92582 136582 64643 -240824 45446
10020A2293a04627C0799R8085L25379B7899b56592o0559B28492a83428a8632k19120
10009b37752c5002j74999F9173c68089J17226n8510K4972F682N317b12205c5143
9997b49748E5817J70680a77113f1561k92912Q8711i3084N788r5967c090k82532
9986b85622C75022a43404e0782k7959A11364g6096L5204A28182C7675M03365e7086
9974b39468h9995o9447B15020a80104B5437a79142A22551c29274J04242a02667
9963F6847e4085k59123e4968j17351G170h446l67011J61511l885d9143o1944a0983
9950A69476b24680f4174E262a73176A58095c77018a88228k87277i4970F9448a70329
9938A74623I970R891a9803k65996B27976a51903k1701B77610g2760k43456k6927
$$ plain form
10020 12293 -104627 30799 128884 454263 27899 -256592 -317151 228492 -183428 -18632 -237752
10009 -237752 -35002 -210001 69173 -368089 -250863 -309373 -284401 6682 11999 -212205 -35143
9997 -249748 55817 226497 -177113 -61561 -354473 -265762 -93084 -87296 -183263 -3090 -285622
9986 -285622 375022 -143404 -50782 -78741 111364 -76096 -40892 128182 37675 441040 -57086
9974 -239468 -89995 -159442 215020 -180104 25437 -179142 122551 -329274 -225032 -102667
9963 66847 -54085 -313208 -54968 -172319 7170 -8446 -375457 -213946 -217831 -49143 -111087 -10983
9950 169476 -224680 -64174 5262 -173176 158095 -377018 -188228 -475505 -94970 69448 -170329
9938 174623 9970 19861 -19803 -285799 227976 -151903 -173604 277610 -72760 -316216 -343143
9927c43143a16930e4830I1110b63989H140c56513C6705J9046c25148e8433q564
9916f6997B01148j1117I920e7508C43861c20768C54835i8334J3662L0535A01541
9904b19585j24594e9756l5466F0409c10346J01141o6997E2980a62233B3546K85654
9893C09200a72434a8813j20390M3909r4906n6095i0166j57590e5903E9932i8319
9881a52947e3216A08994d23379g3897j00945C42501I0711J31345a92844d6789
9870a09822G4609a43327a9490j67334Q2420j92235A19142l0992d913j11289o8884
9859a85086b0899k53781A16588D2019P1382a49946c7505k56550c2185A9815Q8083
9848A07898L9716C8211c3671f751C72921e8490o5817g691m9730E2218c10733a07638
$$ plain form
9927 -343143 -116930 -54830 91110 -263989 8140 -356513 36705 55751 -325148 -58433 -66997
9916 -66997 201148 190031 9920 -57508 343861 -320768 354835 -98334 -84672 -54137 101541
9904 -219585 -344179 -59756 -95222 60409 -310346 -209205 -276202 52980 -162233 23546 309200
9893 309200 -172434 -18813 -139203 -95294 -190200 -246295 -90166 -247756 -55903 59932 -98319
9881 -152947 -53216 108994 -423379 -73897 -174842 342501 90711 222056 -192844 -46789
9870 -109822 74609 -143327 -19490 -186824 -104404 -296639 119142 88150 -4913 -116202 -185086
9859 -185086 -20899 -274680 116588 42019 113401 -149946 -37505 -294055 -32185 19815 107898
9848 107898 147614 38211 -33671 -6751 372921 -58490 -124307 -7691 -57421 52218 -310733 -107638
9835B08592e38889i7108A0676b55004Q5856R906A69945a53356k43182A00142a06588
9823D9357b35594J7101a07992k62198D80581a03841A06287N949K8302N6200a56342
9811b54679a01863k8784b8791j51809d4181E543a83975A25515a75960C9914N1448
9800I1362a22168H3673C7797J98024c77088h9401o1011B06139b3155C41541b60111
9788a29684P549B16086b63705E163J84017D096a93886N9505m3547p8823G8856
9776A79800E8697i0334A06135d47354G2343i7235D067b80617A86351a22708A14303
9764c16892A61646D4270b98650A49876b70444B54436d69406c5205K237j39292
9754a72260k90245B8940c9557j52782B65131a60699C37808B164a44018n0992F8794
$$ plain form
9835 208592 -538889 -97108 10676 -255004 -169148 -159242 169945 -153356 -396538 100142 -106588
9823 49357 -235594 -218493 -107992 -370190 480581 -103841 106287 112236 140538 196738 -156342
9811 -254679 -101863 -130647 -28791 -180600 -44181 5543 -183975 125515 -175960 39914 91362
9800 91362 -122168 83673 37797 235821 -377088 -89401 -150412 206139 -23155 341541 -260111
9788 -129684 -122135 216086 -263705 5163 189180 4096 -193886 -134381 -177928 -256751 78856
9776 179800 58697 -90334 106135 -447354 72343 -97235 4067 -280617 186351 -122708 114303
9764 -316892 161646 44270 -298650 149876 -270444 254436 -469406 -35205 -32968 -172260
9754 -172260 -462505 28940 -39557 -192339 265131 -160699 337808 2164 -144018 -195010 68794
9742b9847k50020a17676D285c21765f5080j61237R0238k45423a38131b7543k2260
9731d9803k87404e5838A43589b84946a33731b9636H9580c08309O171B28241E1736
9719a4986q5239k04398a33874C6410L853a50828j54484C37481A25182a07541q5808
9708a93349f9054j43800j08932a8426k46844h7442d1503A86111p1123a23019l20689
9697d43708E8341A4940M4832b10749D4619L0840c57487f5195J4708C7328a06519
9685a37684L3741l43110h2681A66828c27609l4673d6427A24864a15151A51915
9674a9541C37584a30326D5669J68152F9892b48423i560F1531c47970M9039F9608
9662a81339j13437J00369D7913K2924J07056a37547B9746b45D6421b04130A57032
$$ plain form
9742 -29847 -279867 -117676 4285 -321765 -65080 -226317 -136079 -381502 -138131 -27543 -49803
9731 -49803 -337207 -55838 143589 -284946 -133731 -29636 89580 -308309 -302138 228241 51736
9719 -14986 -100225 -304623 -133874 36410 40263 -150828 -305312 337481 125182 -107541 -193349
9708 -193349 -69054 -212854 -321786 -18426 -265270 -87442 -41503 186111 114988 -123019 -443708
9697 -443708 58341 14940 59772 -210749 44619 75459 -357487 -65195 -50487 37328 -106519
9685 -137684 -103943 -447053 -82681 166828 -327609 -362282 -46427 124864 -115151 151915
9674 -19541 337584 -130326 45669 213821 69892 -248423 -9560 61531 -347970 -298931 69608
9662 -181339 -294776 -194407 47913 70837 177893 -137547 29746 -245 46421 -204130 157032
9650C26919a47196K5170j33672J02140d7929j38501h4146E7601h9122a618m2424
9639d4042p7545G7702K48591a72115l9167E8642a20316A00673R7551H4175b06319
9627B4925i7151j1506G357b49098l6274i8160j71005A02449a62938B132b04859
9615b57120I6837e7576H8233m583c10093a01366K8215n6973j14888N8058M1192
9604a45762a3232n5059a8841j84856C56988g4164k44136M0533a17806N2213k04738
9593b70331a14127P969l4814A25694f7352B6413a53155C18958a9004l03676J32180
9582a90500B00241a00316B28365H4003e4544A6875a3589k38529A94492q1586c17554
9570b55995J9045C04853E3838A0444N4336N649J71979a27425A50839a564j86629
$$ plain form
9650 326919 -147196 -122026 -255698 -153558 -47929 -186430 -84146 57601 -89122 -1618 -44042
9639 -44042 -121587 77702 326293 -172115 -211282 58642 -120316 100673 198224 84175 -206319
9627 24925 -97151 -108657 7357 -249098 -285372 -98160 -269165 102449 -162938 2132 -204859
9615 -257120 96837 -57576 88233 83650 -310093 -101366 -73151 -130124 -245012 -186954 -145762
9604 -145762 -13232 -68291 -18841 -203697 356988 -74164 -318300 -277767 -117806 -65593 -270331
9593 -270331 -114127 -106158 -140972 125694 -67352 26413 -153155 318958 -19004 -322680 -190500
9582 -190500 200241 -100316 228365 84003 -54544 16875 -13589 -252118 194492 112906 -317554
9570 -255995 -236950 304853 53838 10444 64780 70429 242408 -127425 150839 -1564 -188193
9559a88193B9090a43765A11744b60989n5389a34022G0460a23040A86588e5423
9548b00681h9617L873l2423B3275a23644k7440j59166J26152K1153f7480G3912
9536F9032c26253E4074b62650A00287N033j558a97835g6046j31450e183m0667
9525d5850j47796B90416b11430a3906B02865c64305c8231l4926C296a80681G6647
9513b46564A36095e2719I0704a91560A00400D7562B2641a44262m02754I3231g8620
9501C300a44325m4321A66982b86889a25635n4912A3826b37886B4258b0075p2691
9490i2766M2464j53151A05811j7525c1302A56664f5413J4757j51617h9340m902
9479i4242H2978B4220b61263j68222A11075A4338J25992b47843P7160k9733j8902
$$ plain form
9559 -188193 29090 -143765 111744 -260989 -316378 -134022 70460 -123040 186588 -55423
9548 -200681 -89617 -85744 -118167 23275 -123644 -151084 -310250 -184098 -162945 -67480 73912
9536 69032 -326253 54074 -262650 100287 105320 103762 -197835 -76046 -207496 -5183 -45850
9525 -45850 -193646 290416 -211430 -13906 202865 -364305 -38231 -73157 3296 -180681 76647
9513 -246564 136095 -52719 90704 -191560 100400 47562 22641 -144262 -547016 93231 -78620
9501 3300 -144325 -188646 166982 -286889 -125635 -180547 13826 -237886 24258 -20075 -92766
9490 -92766 -50302 -203453 105811 88286 -31302 156664 -65413 -50656 -202273 -89340 -94242
9479 -94242 82978 24220 -261263 -429485 111075 14338 140330 -247843 -170683 -200416 -219318
9468b19318A83695a42047A67366G7313K6459a72006A70253b94106J22950p4860
9458b46016e9353j15331B57295a23818A86855D8131i890k15764j83374B1878a00326
9446e6742l6625l0875k2627A15875B5932a40526j48918L3936e4050r9025K3683
9435a29392A75516c8742I0523a19746j34041D85871A13163d1517k09778A19431
9424b34587j41892h5440H6150a84757h1944L9493A32353b80214A5375b36244e2802
9412d9659n1050j39380E4258K92423c3611A4133a32567b8989l90861R1990A79271
9400b98941A26601h7699o2566k8057g2856k62350F5681N0890d36333a28104A40133
9388A14589A1343a65443c5114B04643a90257h9188j19447E2299i5101A71662a6565
$$ plain form
9468 -219318 183695 -142047 167366 77313 103772 -172006 170253 -294106 -171156 -246016
9458 -246016 -59353 -174684 257295 -123818 186855 48131 -9890 -225654 -409028 21878 -100326
9446 -56742 -93367 -124242 -146869 115875 25932 -140526 -289444 -255508 -54050 -153075 -129392
9435 -129392 175516 -38742 90523 -119746 -253787 485871 113163 -41517 -251295 119431
9424 -234587 -376479 -85440 86150 -184757 -81944 -42451 132353 -280214 15375 -236244 -52802
9412 -49659 -100709 -240089 54258 346681 -33611 14133 -132567 -28989 -419850 -327860 179271
9400 -298941 126601 -87699 -150265 -178322 -72856 -335206 65681 116571 -436333 -128104 140133
9388 114589 11343 -165443 -35114 204643 -190257 -89188 -208635 52299 -95101 171662 -16565
9376A53204b62338m1801P2604A965L2614a77r0301d2065k18602i8230k5328A12354
9363a10646a6529l25995a25865B4745i8106A04821b20901G2835e23114K32520
9353b90594B15929a028A619P0893J1147f1744a1125r5513B14570J41085d67051
9341C15174g0157c0596A48692i9532p4686A380a84048A91978m7664Q6103A13375
9329b12619G3874c9298B18959b69035r6378J60323E3981a05323c4402m3670K9933
9318d8139k0362C8798O4202c4320j53929L7311N8464q3938G9316a02965M1337
9307f1628m3212K7935C44172a00642l3673H2424j4867a42480h637j53653r5053
9296b57343J12319C23175C4350a84974K3750H6946b07578O3734J6517A25863d0879
$$ plain form
9376 153204 -262338 -304139 -231535 1965 34579 -177 -90478 -42065 -260667 -98230 -123558 112354
9363 -110646 -16529 -342524 -125865 24745 -98106 104821 -220901 72835 -523114 -290594
9353 -290594 215929 -1028 1619 72512 83659 -61744 -11125 -106638 214570 355655 -467051
9341 315174 -70157 -30596 148692 -99532 -174218 1380 -184048 191978 144314 230417 113375
9329 -212619 73874 -39298 218959 -269035 -365413 -205090 53981 -105323 -34402 -78072 -48139
9318 -48139 -68501 38798 103000 -34320 -188249 -150938 -92474 -176412 79316 -102965 -61628
9307 -61628 -104840 -76905 344172 -100642 -134315 82424 67557 -142480 -8637 -162290 -257343
9296 -257343 -145024 323175 34350 -184974 -161224 86946 -207578 -143844 -127327 125863 -40879
9284c7442C5215a9855j12640j41735k04018h9458a9829k71266h0189J7429A57444
9272A71703c49894J45426f8465F2313b0439A75579a74640L9076b8819q5684n276
9261a19779A79224c0761k8870j84298J18202D5921a10534e4439L453A18218c54040
9249c55948J51833C9611a57880d6338A5999b72559M0140A33444C3472h1600E1933
9237D4851a06623k5343k1196k79531B7325J20550b51861g9767k07216a16B4392
9225b16628c8656j83748b3316m8840A38035a18126n7654A85393b01362A39326
9214d25102c7609j4811n1849k82357i9669B24096b34833j9496c3618j92381r48
9203b26947c1378E9683a90670A29611L5110k9473h6468k5321D8583J0481a7613
$$ plain form
9284 -37442 35215 -19855 -132495 -274230 -478248 -89458 -19829 -291095 -80189 -62760 157444
9272 171703 -349894 -204468 -68465 62313 -20439 175579 -174640 -135564 -28819 -114503 -119779
9261 -119779 179224 -30761 -59631 -243929 -125727 45921 -110534 -54439 -50986 118218 -354040
9249 -355948 -204115 39611 -157880 -46338 15999 -272559 -232419 133444 33472 -81600 51933
9237 44851 -106623 -131966 -153162 -432693 27325 147875 -251861 -79767 -286983 -116 24392
9225 -216628 -38656 -222404 -23316 -72156 138035 -118126 -175780 185393 -201362 139326
9214 -425102 -37609 -52420 -104269 -386626 -99669 224096 -234833 -254329 -33618 -225999 -226947
9203 -226947 -31378 59683 -190670 129611 164721 135248 -86468 -111789 48583 59064 -17613
9191b98409b8363A96595I0508C1503e24069R9078i3569J8780j19160C13917h2073
9179f2734k62335a26601c9062A17652a08036j15019i7231o0013e1811A96476H3422
9167a39397o9621L3310E8187k7421a82711B0680b22419j80307f747j62395o3223
9156b32365B8805g4271m11807b33501i7085l51408A78887b11783j27040d8327
9145A23386M2069c08485k5561i5553A06688a86426G8384c4910j45069K9604F0267
9133A54091J381b274m104o8186j66490O5868p0159Q9189C9604Q2371b01738C9085
9120A3225b36154A29822b4318m0162D6011Q7893h0230A00672c27798f6760j46808
9109b13568N0984B17031b11252d724I285Q1646a65862p0214B36992a75400e681
$$ plain form
9191 -298409 -28363 196595 90508 31503 -524069 -424991 -93569 -74789 -193949 313917 -82073
9179 -62734 -325069 -126601 -39062 117652 -108036 -223055 -97231 -157244 -51811 196476 83422
9167 -139397 -209018 -175708 58187 30766 -182711 20680 -222419 -402726 -6747 -169142 -232365
9156 -232365 28805 -74271 -486078 -233501 -97085 -448493 178887 -211783 -338823 -48327
9145 123386 165455 -308485 -334046 -95553 106688 -186426 78384 -34910 -179979 -150375 60267
9133 154091 155472 -2274 -6378 -74564 -241054 -175186 -245345 -156156 39604 121975 -201738 39085
9120 13225 -236154 129822 -24318 -64480 46011 133904 -80230 100672 -327798 -66760 -213568
9109 -213568 -162584 217031 -211252 -4724 9285 90931 -165862 -236076 236992 -175400 -5681
9097A59783E717K42939l4827F1147o784a19533H0938L09692A3139d55391a74852
9085a87343P7838M0144E5558a81460k92662c7125Q605I1934K33365b8961H4834
9073H3375c0857l90705A27386k9558N7491c45381A11938a20854C8760b32790g8729
9061c3693A9837d2042k04264J20029c7751j19005j31587J36986I5634a14429j8459
9050a32888a0205j71721J9442j34374J16096N0361r9113B60586a21057i176p7704
9039h6880A63945f8686B24184m6192b33628C19642q8308k5805a12898d9492q8832
9028a38324B43202F3735P7535F7237c00697J25957L0870f0446r5976E4935a83904
9016a31180N0010j25884k48783f5625l31651h4288E6930b27215J01048D3521a30841
$$ plain form
9097 159783 5717 248656 213829 61147 54363 -119533 80938 390630 13139 -455391 -174852
9085 -187343 -109505 -69361 55558 -181460 -474122 -37125 -28520 91934 325299 -28961 84834
9073 83375 -30857 -421562 127386 97828 155319 -345381 111938 -120854 38760 -232790 -78729
9061 -33693 19837 -42042 -246306 -126277 -37751 -156756 -288343 -151357 95634 -114429 -132888
9050 -132888 -10205 -181926 -162484 -296858 -180762 -130401 -229514 260586 -121057 -9176 -86880
9039 -86880 163945 -68686 224184 177992 -233628 319642 231334 205529 -112898 -49492 -138324
9028 -138324 243202 63735 141270 67237 -300697 -174740 -143870 -60446 -156422 54935 -183904
9016 -131180 -81170 -207054 -455837 -65625 -397276 -84288 56930 -227215 -126167 43521 -130841
9004b2386A34354D4765b16848Q8904A31532a55834A92184a85091B48982E1612
8993I2416b95802O5446B08247A4462b56748i6579a7888p1401c2487o596l40944
8982c80027A1800b48998o457a09455l50026f6049B4851b50579N8630a912j61588
8971a63500A09680b65776a28982l9412B90710q9818b76435c2446n1215j77405
8961b61066B30809l3652r2124B5212a01194F851a96047E2578b69279k81009A30906
8949A57785b80934M8579k1970k76A27332h2815H460P6104o247e7594n5901D4482
8936A52497J00143F1556C80c03410l6929P6838j57724h8629I6184J10285c2302
8924B64552A13690E2275J14586B5067J46686L32501J101620B22198C2533a39515
$$ plain form
9004 -22386 134354 44765 -216848 -127944 131532 -155834 192184 -185091 248982 51612
8993 92416 -295802 -230356 208247 14462 -256748 -96579 -17888 -89289 -32487 -39083 -380027
8982 -380027 11800 -248998 -255455 -109455 -459481 -66049 24851 -250579 -191949 -1912 -163500
8971 -163500 109680 -265776 -128982 -168394 290710 200892 -276435 -32446 -83661 -261066
8961 -261066 230809 197157 105033 25212 -101194 6851 -196047 52578 -269279 -550288 130906
8949 157785 -280934 -232355 -254325 -254601 127332 -82815 8460 84564 78317 -57594 -113495 44482
8936 152497 252640 61556 380 -303410 -340339 -263501 -421225 -88629 96184 206469 -32302
8924 264552 113690 52275 166861 25067 171753 504254 1605874 222198 32533 -139515
8913c99316a10497A52137b46050J2637A64263M6897d6819A71046h6190A6067c23149
8901C71359A43190b2414r1406k25577a13981A50428p3183h2212C61698j79019
8891A82679c63758o4085f4127A14183b59696e912k9956A76913C302h9685G975
8879i7030k49592a37573j97348D4421a30104A52119J91608c46663g7039l4123
8869a11162a6166l24232a30953O5157j17481k9607l5100A07514O5988b01428A58518
$$ plain form
8913 -399316 -110497 152137 -246050 -233413 164263 211160 -46819 171046 -86190 16067 -323149
8901 371359 143190 -22414 -113820 -339397 -113981 150428 77245 -82212 361698 182679
8891 182679 -363758 -427843 -64127 114183 -259696 -5912 -35868 176913 3302 -89685 7975
8879 -97030 -346622 -137573 -334921 44421 -130104 152119 343727 -346663 -77039 -111162
8869 -111162 -16166 -340398 -130953 -65796 -183277 -212884 -247984 107514 173502 -201428 158518
$$ [...]
##END NTUPLES=NMR SPECTRUM
##END=
