##TITLE=NES1007_929159_9232788_6avWAGcTBk
##JCAMPDX= 6.0         $$ Bruker NMR JCAMP-DX V2.0
##DATA TYPE= NMR SPECTRUM
##DATA CLASS= NTUPLES
##ORIGIN= BRUKER
##OWNER= Administrator
$$ 1.72 TOPSPIN		Version 2.1
$$ 2015-06-17 16:24:34.347 -0700  Administrator@X
$$ Compression mode = diff/dup
##.OBSERVE FREQUENCY= 400.02188249412
##.OBSERVE NUCLEUS= ^1H
##.ACQUISITION MODE= SIMULTANEOUS (DQD)
##.ACQUISITION SCHEME= undefined
##.AVERAGES= 64
##.DIGITISER RES= 22
##SPECTROMETER/DATA SYSTEM= spect
##.PULSE SEQUENCE= noesygpps1d.comp
##.SOLVENT NAME= COFFEE_meoh
##.SHIFT REFERENCE= INTERNAL, COFFEE_meoh, 1, 14.96289
##AUDIT TRAIL= $$ (NUMBER, WHEN, WHO, WHERE, PROCESS, VERSION, WHAT)
$$ ##TITLE= Audit trail, TOPSPIN		Version 2.1
$$ ##JCAMPDX= 5.01
$$ ##ORIGIN= Bruker BioSpin GmbH
$$ ##OWNER= Administrator
$$ $$ E:\/data/COFFEE/nmr/NES1007_929159_9232788_6avWAGcTBk/12/pdata/1/auditp.txt
$$ ##AUDIT TRAIL=  $$ (NUMBER, WHEN, WHO, WHERE, PROCESS, VERSION, WHAT)
(   1,<2015-06-17 16:24:28.956 -0700>,<Administrator>,<X>,<go>,<TOPSPIN 2.1>,
      <created by zg
	started at 2015-06-17 16:12:58.769 -0700,
	POWCHK enabled, PULCHK disabled,
       configuration hash MD5:
       21 0F 79 D6 B3 7B B4 F6 88 20 88 DB 03 48 BD 9F
       data hash MD5: 64K
       76 69 B8 2B E7 61 24 E5 4A 83 1C C9 C4 45 41 B7>)
(   2,<2015-06-17 16:24:32.284 -0700>,<Administrator>,<X>,<proc1d>,<TOPSPIN 2.1>,
      <Start of raw data processing
       efp LB = 0.3 FT_mod = 6 PKNL = 1 PHC0 = 0 PHC1 = 0 SI = 128K 
       data hash MD5: 128K
       D0 D9 4A 35 7A 53 7D 55 F3 4B B3 4D 6C 1B 73 00>)
(   3,<2015-06-17 16:24:33.144 -0700>,<Administrator>,<X>,<proc1d>,<TOPSPIN 2.1>,
      <pk PHC0 = -84.14978 PHC1 = 0 
       data hash MD5: 128K
       31 70 41 F5 2D F1 26 82 37 52 46 D1 81 58 A9 54>)
(   4,<2015-06-17 16:24:33.534 -0700>,<Administrator>,<X>,<proc1d>,<TOPSPIN 2.1>,
      <abs ABSG = 1 
       data hash MD5: 128K
       6A 3A 6D D1 47 B7 8E 6F 3F 29 3F A1 E3 F6 31 BD>)
(   5,<2015-06-17 16:24:33.628 -0700>,<Administrator>,<X>,<proc1d>,<TOPSPIN 2.1>,
      <abs ABSG = 2 
       data hash MD5: 128K
       12 FE 96 08 23 7B F9 30 95 A8 36 CC AC 5D 93 46>)
(   6,<2015-06-17 16:24:33.722 -0700>,<Administrator>,<X>,<proc1d>,<TOPSPIN 2.1>,
      <abs ABSG = 3 
       data hash MD5: 128K
       5D 52 F3 32 C4 49 5F 35 DD 00 AB D4 D7 7F DC A5>)
(   7,<2015-06-17 16:24:33.816 -0700>,<Administrator>,<X>,<proc1d>,<TOPSPIN 2.1>,
      <abs ABSG = 4 
       data hash MD5: 128K
       A6 28 65 A8 76 DC E3 4C F2 4A 0D 07 8B 29 A2 5F>)
(   8,<2015-06-17 16:24:33.941 -0700>,<Administrator>,<X>,<proc1d>,<TOPSPIN 2.1>,
      <abs ABSG = 5 
       data hash MD5: 128K
       65 2D CE 15 FB 04 3D FA 95 57 C7 B8 5C 86 67 2D>)
$$ ##END=
$$ 
$$ $$ hash MD5
$$ $$ 83 1D 62 E3 3F 28 43 66 CF B4 A8 96 3A 67 CF 81
##$RELAX= 
##$RELAX= 
##$RELAX= 
##$RELAX= 
##$RELAX= 
##$RELAX= 
##$RELAX= 
##$RELAX= 
$$ Bruker specific parameters
$$ --------------------------
##$DU= <E:\>
##$EXPNO= 12
$$ [...]
##$TP07= 0
##$TPNAME0= <>
##$TPNAME1= <>
##$TPNAME2= <>
##$TPNAME3= <>
##$TPNAME4= <>
##$TPNAME5= <>
##$TPNAME6= <>
##$TPNAME7= <>
##$TPOAL= (0..7)
0.5 0.5 0.5 0.5 0.5 0.5 0.5 0.5
##$TPOFFS= (0..7)
0 0 0 0 0 0 0 0
##$TUNHIN= 0
##$TUNHOUT= 0
##$TUNXOUT= 0
##$USERA1= <user>
##$USERA2= <user>
##$USERA3= <user>
##$USERA4= <user>
##$USERA5= <user>
##$V9= 5
##$VALIST= <valist>
##$VCLIST= <CCCCCCCCCCCCCCC>
##$VD= 0
##$VDLIST= <DDDDDDDDDDDDDDD>
##$VPLIST= <PPPPPPPPPPPPPPP>
##$VTLIST= <TTTTTTTTTTTTTTT>
##$WBST= 2048
##$WBSW= 25
##$XGAIN= (0..3)
0 0 0 0
##$XL= 0
##$YL= 0
##$YMAX_a= 7956887
##$YMIN_a= -17234590
##$ZGOPTNS= <>
##$ZL1= 120
##$ZL2= 120
##$ZL3= 120
##$ZL4= 120
##$ABSF1= 14.96289
##$ABSF2= -5.595292
##$ABSG= 5
##$ABSL= 3
##$ALPHA= 0
##$AQORDER= 0
##$ASSFAC= 0
##$ASSFACI= 0
##$ASSFACX= 0
##$ASSWID= 0
##$AUNMP= <proc_prof1d_extract.lims>
##$AXLEFT= 0
##$AXNAME= <>
##$AXNUC= <1H>
##$AXRIGHT= 0
##$AXTYPE= 0
##$AXUNIT= <>
##$AZFE= 0.1
##$AZFW= 0.1
##$BCFW= 0
##$BC_mod= 0
##$BYTORDP= 0
##$COROFFS= 0
##$CY= 15
##$DATMOD= 1
##$DC= 0
##$DFILT= <>
##$DTYPP= 0
##$F1P= 0
##$F2P= 0
##$FCOR= 0.5
##$FTSIZE= 131072
##$FT_mod= 6
##$GAMMA= 0
##$GB= 0
##$INTBC= 1
##$INTSCL= 1
##$ISEN= 128
##$LB= 0.3
##$LEV0= 0
##$LPBIN= 0
##$MAXI= 10000
##$MC2= 0
##$MEAN= 0
##$ME_mod= 0
##$MI= 0
##$NCOEF= 0
##$NC_proc= -2
##$NLEV= 6
##$NOISF1= 0
##$NOISF2= 0
##$NSP= 0
##$NTH_PI= 0
##$NZP= 0
##$OFFSET= 14.96289
##$PC= 1
##$PHC0= -84.14978
##$PHC1= 0
##$PH_mod= 1
##$PKNL= yes
##$PPARMOD= 0
##$PPDIAG= 0
##$PPIPTYP= 0
##$PPMPNUM= 2147483647
##$PPRESOL= 1
##$PSCAL= 4
##$PSIGN= 0
##$PYNMP= <proc.py>
##$REVERSE= no
##$SF= 400.020008881873
##$SI= 131072
##$SIGF1= 0
##$SIGF2= 0
##$SINO= 400
##$SIOLD= 131072
##$SPECTYP= <>
##$SREGLST= <1H.CDCl3>
##$SSB= 0
##$STSI= 131072
##$STSR= 0
##$SW_p= 8223.68421052631
##$SYMM= 0
##$S_DEV= 0
##$TDeff= 65536
##$TDoff= 0
##$TI= <>
##$TILT= no
##$TM1= 0
##$TM2= 0
##$TOPLEV= 0
##$USERP1= <user>
##$USERP2= <user>
##$USERP3= <user>
##$USERP4= <user>
##$USERP5= <user>
##$WDW= 1
##$XDIM= 131072
##$YMAX_p= 452871193
##$YMIN_p= -12971
##$CURPLOT= <Network HP LaserJet P1505>
##$CURPRIN= <$Network HP LaserJet P1505>
##$DFORMAT= <normdp>
##$LAYOUT= <+/1D_H.xwp>
##$LFORMAT= <normlp>
##$PFORMAT= <normpl>
##$SURQMSG= 1
$$ End of Bruker specific parameters
$$ ---------------------------------
##NTUPLES= NMR SPECTRUM
##VAR_NAME=  FREQUENCY,     SPECTRUM/REAL,   SPECTRUM/IMAG
##SYMBOL=    X,             R,               I
##VAR_TYPE=  INDEPENDENT,   DEPENDENT,       DEPENDENT
##VAR_FORM=  AFFN,          ASDF,            ASDF
##VAR_DIM=   131072,        131072,          131072
##UNITS=     HZ,            ARBITRARY UNITS, ARBITRARY UNITS
##FACTOR=    0.0627417313425164, 1,          1
##FIRST=     8223.62146879497, 1159,         -55380
##LAST=      0,             2482,            -55757
##MIN=       0,             -12971,          0
##MAX=       8223.62146879497, 452871193,    0
$$ Real data points
##PAGE= N=1
##DATA TABLE= (X++(R..R)), XYDATA
$$ [...]
60942F871842q07982o68804n54708m61695l87128l29166k84995k50902k23833
60933B902629k01840j83273j66593j51072j36750j23419j10302r7030q4389p3722
60923A574239o5779o0383n6920n4797n3513n2511n1133m8768m5158m0595l5785
60912A008897l1438k7964k5399k3418k1452j9108j6645j4908j4447j4762j4694
60901G84662j3683j2301j1289j0422q921o819n095m201l193j035J734L556L912
60888G16905L911M641N777O338O118N725N519N154M147K490O45p57j340j311j322
60873G62640j813k703l843n342p167q689r264r070q834q844q760q376p921p525
60859F64489o969o139n214m225k911j304O4R06J659K820M176N255O217P697R870
$$ y = [6871842, 6063860, 5395056, 4840348, 4378653, 3991525, 3662359, 3377364, 3126462, 2902629, 2700789, 2517516, 2350923, 2199851, 2063101, 1939682, 1829380, 1732350, 1647961, 1574239, 1508460, 1448077, 1391157, 1336360, 1282847, 1230336, 1179203, 1130435, 1085277, 1044682, 1008897, 977459, 949495, 924096, 900678, 879226, 860118, 843473, 828565, 814118, 799356, 784662, 770979, 758678, 747389, 736967, 728046, 721227, 716132, 711931, 708738, 707703, 709437, 712993, 716905, 720816, 725457, 731234, 737572, 743690, 749415, 754934, 760088, 764235, 766725, 767370, 766613, 765273, 763962, 762640, 760827, 758124, 754281, 748939, 741772, 733083, 723819, 714749, 705915, 697071, 688311, 679935, 672014, 664489, 657520, 651381, 646167, 641942, 639031, 637727, 637791, 638697, 640356, 643176, 647352, 652607, 658824, 666521, 676391]
60844F76391J2214J4132J5424J6161J6557J6899J7234J7147J6261J4869J3626
60833H46915J2696J1805J1107J1224J2090J2514J1458R279P116N430L843K180
60821I57657Q81K59k7m71j110j641j919k127k623l711n423p415r248j0775j2123
60806I00184j3275j3997j4260j4434j4789j5097j4920j4177j3128j1866j0187
60795G50054q045n942m525l849l141j540R58L414M947N612O131O863P376P074
60781G65387N958M596L568L075K920K756K425K169K348K986L773M519N252N818
60767H17550N828N329N070N676O761P433P551P856Q827R993J0546J0243R409Q451
60753I26523P695P486P958Q679Q925Q376P393O498N757M818L510K133J091M41
$$ y = [676391, 688605, 702737, 718161, 734322, 750879, 767778, 785012, 802159, 818420, 833289, 846915, 859611, 871416, 882523, 893747, 905837, 918351, 929809, 939088, 946204, 951634, 955477, 957657, 958538, 958797, 958770, 958299, 957189, 955548, 953629, 951502, 948879, 945168, 939745, 932330, 923082, 912307, 900184, 886909, 872912, 858652, 844218, 829429, 814332, 799412, 785235, 772107, 760241, 750054, 742009, 736067, 731542, 727693, 724552, 723012, 723970, 727384, 732331, 737943, 744074, 750937, 758313, 765387, 771345, 775941, 779509, 782584, 785504, 788260, 790685, 792854, 795202, 798188, 801961, 806480, 811732, 817550, 823378, 828707, 833777, 839453, 846214, 853647, 861198, 869054, 877881, 887874, 898420, 908663, 918072, 926523, 934218, 941704, 949662, 958341, 967266, 975642, 983035, 989533, 995290, 1000108, 1003618, 1005751, 1006842, 1007283]
60739A007283n7n08q48j196j860k838l726m376n314p057r208j0794j1446j1756
60725I36299j2365j3241j3929j4165j3994j3662j3597j4113j4885j5080j4297
60714G82971j3083j2178j1587j0828r812q917q324p757o931n789m239k062O59
60701F82123L367N521P100Q415R600J0480J0878J0833J0473R785Q552O540L719
60688G87386M03k921n819q066r690j0949j2177j3507j4718j5458j5588j5241j4523
60675F49132j3329j1535r302p138n547m629m015l238k112p71N85J833K814L343
60661E96091L390L079K442J403K11m46j25P06J131R59J020K060L771N177N727
60646F26596N621N177M472L668L221L412L938M351M709N402O445P505Q598J0166
$$ y = [1007283, 1007226, 1006718, 1005870, 1004674, 1002814, 999976, 996250, 991874, 986560, 979503, 970295, 959501, 948055, 936299, 923934, 910693, 896764, 882599, 868605, 854943, 841346, 827233, 812348, 797268, 782971, 769888, 757710, 746123, 735295, 725483, 716566, 708242, 700485, 693554, 687765, 683526, 681464, 682123, 685490, 691011, 698111, 706526, 716126, 726606, 737484, 748317, 758790, 768575, 777127, 783667, 787386, 787789, 784868, 779049, 770983, 761293, 750344, 738167, 724660, 709942, 694484, 678896, 663655, 649132, 635803, 624268, 614966, 607828, 602281, 597652, 593637, 590399, 588287, 587516, 588101, 589934, 592748, 596091, 599481, 602560, 605002, 606405, 606616, 606170, 606045, 606751, 607882, 608841, 609861, 611921, 615692, 620869, 626596, 632217, 637394, 641866, 645534, 648755, 652167, 656105, 660456, 665165, 670567, 677012, 684517, 693115, 703281]
60632G03281J2121J3496J3561J2940J2869J3551J4070J3881J3577J3889J4557
60621H51793J4738J4024J2637J0931R105P231N226K954N83j411k826l987n160
60608I15838o119o624o901p170p173o710o250o263o338n787m914m728n439o130
60594H29292o124n726n405n045m441l787l244k576j707j040q08o19r8M95P38O55
60578G90560L90j40p67q96l87q8o70j503j604j252j588k819m034m740n487o639
60562G58336p664q042q013p928p634o975o218n387l845j229J650L606M394M647
60548G09698M929N481O649Q613J0906J2881J4729J7313K0978K5215K9654L4603
60536I01649M0302M6136N1048N4173N4771N1912M4915L3987K0195M955j0189k3579
$$ y = [703281, 715402, 728898, 742459, 755399, 768268, 781819, 795889, 809770, 823347, 837236, 851793, 866531, 880555, 893192, 904123, 913228, 920459, 925685, 928639, 929222, 927811, 924985, 920998, 915838, 909719, 903095, 896194, 889024, 881851, 875141, 868891, 862628, 856290, 850503, 845589, 840861, 835422, 829292, 823168, 817442, 812037, 806992, 802551, 798764, 795520, 792944, 791237, 790197, 789389, 788770, 788672, 789167, 789905, 790560, 790950, 790810, 790043, 789147, 788760, 788672, 788002, 786499, 784895, 783643, 782055, 779236, 775202, 770462, 764975, 758336, 750672, 742630, 734617, 726689, 719055, 712080, 705862, 700475, 696630, 695401, 697051, 700657, 705051, 709698, 714627, 720108, 726757, 735370, 746276, 759157, 773886, 791199, 812177, 837392, 867046, 901649, 941951, 988087, 1039135, 1093308, 1148079, 1199991, 1244906, 1278893, 1299088, 1304043, 1293854, 1270275]
60524A270275l3758l9905m1925m0312l6138l0767k5108j9136j2532n696L05M792
60512I90095Q022J0502J2181J2631J1896J0790J0323J0915J2209J3706J5556J8608
60500A137434K3589L0448L8702M8153N8850P0614Q3260R7347J13913J33047J53351
60489A988708J73375J93162K13814K35950K59390K83996L09390L32999L48772
60480D339556L48628L25670K76656K02573J08109Q55j09506k12335k97637l58037
60470D624532l90447l96641l82278l54785l20946k85342k50358k17378j87584
60461A838773j61588j38911j18665j00758q5877p4223o4902n6828m9729m3892
60451I43400l9322l5524l1963k8342k4681k1403j9171j8193j7772j6807j4805
$$ y = [1270275, 1236517, 1196612, 1154687, 1114375, 1078237, 1047470, 1022362, 1003226, 990694, 984998, 985303, 990095, 998117, 1008619, 1020800, 1033431, 1045327, 1056117, 1066440, 1077355, 1089564, 1103270, 1118826, 1137434, 1161023, 1191471, 1230173, 1278326, 1337176, 1407790, 1491050, 1588397, 1702310, 1835357, 1988708, 2162083, 2355245, 2569059, 2805009, 3064399, 3348395, 3657785, 3990784, 4339556, 4688184, 5013854, 5290510, 5493083, 5601192, 5602047, 5492541, 5280206, 4982569, 4624532, 4234085, 3837444, 3455166, 3100381, 2779435, 2494093, 2243735, 2026357, 1838773, 1677185, 1538274, 1419609, 1318851, 1232974, 1158751, 1093849, 1037021, 987292, 943400, 904078, 868554, 836591, 808249, 783568, 762165, 742994, 724801, 707029, 690222, 675417]
60440F75417j2211r892q404p658p134o508o079o312o907o783n349l368k143k036
60426E84633k308k212j714j181q33p04o81m98J06J129K347L511M366M628M281
60411E94870L782L627L791L977M277N037O118O777O555N845N405N617O318P079
60397F69075P518P591P627P849P871P143N786M554L843L299K596K071K207K830
60383G41860L273L017K012N58r31k295l834n720p262p403o168m886m420l990k445
60368G01366j07J584J949J558R91J54j007j985k274j932j265m93Q1J16k33k41
60352F98262N78J863K889L349L467L642M092M687M916M366L349K666K579K456
60338G43161J629K59r76j692j926j716j036J0J214K374L230L510L367L390L857
$$ y = [675417, 663206, 653314, 644910, 637252, 630118, 623610, 617531, 611219, 604312, 597529, 592180, 588812, 586669, 584633, 582325, 580113, 578399, 577218, 576385, 575681, 575000, 574502, 574608, 575737, 578084, 581595, 585961, 590589, 594870, 598652, 602279, 606070, 610047, 614324, 619361, 625479, 632256, 638811, 644656, 650061, 655678, 661996, 669075, 676593, 684184, 691811, 699660, 707531, 714674, 720460, 725014, 728857, 732156, 734752, 736823, 739030, 741860, 745133, 748150, 750162, 750720, 749789, 747494, 743660, 737940, 730678, 723275, 717107, 712221, 707801, 703811, 701366, 701259, 702843, 704792, 706350, 707341, 707495, 706488, 704503, 702229, 700297, 699032, 698539, 698620, 698736, 698503, 698262, 698840, 700703, 703592, 706941, 710408, 714050, 718142, 722829, 727745, 732111, 735460, 738126, 740705, 743161, 744790, 745049, 744073, 742381, 740455, 738739, 737703, 737713, 738927, 741301, 744531, 748041, 751408, 754798, 758655]
60323G58655M236L917L136K578K218J336k99j870k514k325k072k170k348k190
60309G60288j633j014p82j126j789k257k221j857j599j698j947j787p95P62K010
60294G42555K272J733J126P87N00J20j07l1R9J31M49J412K673L490L728M086N219
60277G70242O869Q129Q444Q228Q426R483J0896J1843J2162J2375J2926J3788J4919
60264I08730J6531J8560K0320K1257K1783K2784K4445K6152K7626K9520L2549
60253A170257L6512M0519M4032M7417N1530N6907O3279O9840P6064Q2299Q9236
60242A827892R6887J04331J10613J15574J19547J22522J23899J22991J19509J13594
60232B977359J05570R5726Q4221P1176N6752M1222K5067R098n749j8976l0708
$$ y = [758655, 762891, 766808, 769944, 772522, 774740, 776076, 775777, 773907, 771393, 769068, 766996, 764826, 762478, 760288, 758655, 757641, 756859, 755733, 753944, 751687, 749466, 747609, 746010, 744312, 742365, 740578, 739783, 740545, 742555, 744827, 746560, 747686, 748473, 748973, 749093, 748986, 748955, 749054, 749185, 749634, 751046, 753719, 757209, 760937, 765023, 770242, 777111, 785240, 793684, 801912, 810338, 819821, 830717, 842560, 854722, 867097, 880023, 893811, 908730, 925261, 943821, 964141, 985398, 1007181, 1029965, 1054410, 1080562, 1108188, 1137708, 1170257, 1206769, 1247288, 1291320, 1338737, 1390267, 1447174, 1510453, 1580293, 1656357, 1738656, 1827892, 1924779, 2029110, 2139723, 2255297, 2374844, 2497366, 2621265, 2744256, 2863765, 2977359, 3082929, 3178655, 3262876, 3334052, 3390804, 3432026, 3457093, 3466191, 3460442, 3441466, 3410758]
60221C410758m0974m8910n3291n3831n1449m7065m0725l2289k2304j1649n69J1177
60209C018879K3446L5626M7458N9355P1708Q4307R6553J07859J17626J25146J29868
60198C917831J31591J30210J25395J16688J03997Q7908O9509M9825K9375Q308
60188D770637j3105l4323n4793p3898r0437j02760j10050j13172j13583j11483
60178C953033j05779r5928q2984o8647n3900l9009k4115r173O330K2743L9422
60167C541993N4950O8217P8836Q6567R0732R0442Q5230P5479O2371M7316L1342
60156D313475J4978j236j6460k9927m1257n0073n5598n7148n4831m9241m0515
60145C932167k8432j3489K776J9049L5402N2826P1947R2632J14610J37859J62299
$$ y = [3410758, 3369784, 3320874, 3267583, 3213752, 3162303, 3115238, 3074513, 3042224, 3019920, 3008271, 3007702, 3018879, 3042325, 3077951, 3125409, 3184764, 3256472, 3340779, 3437332, 3545191, 3662817, 3787963, 3917831, 4049422, 4179632, 4305027, 4421715, 4525712, 4613620, 4683129, 4732954, 4762329, 4770637, 4757532, 4723209, 4668416, 4594518, 4504081, 4401321, 4291271, 4178099, 4064516, 3953033, 3847254, 3751326, 3668342, 3599695, 3545795, 3506786, 3482671, 3473498, 3479828, 3502571, 3541993, 3596943, 3665160, 3743996, 3830563, 3921295, 4011737, 4096967, 4172446, 4234817, 4282133, 4313475, 4328453, 4327217, 4310757, 4280830, 4239573, 4189500, 4133902, 4076754, 4021923, 3972682, 3932167, 3903735, 3890246, 3893022, 3912071, 3947473, 4000299, 4072246, 4164878, 4279488, 4417347, 4579646]
60134D579646J87595K13434K39783K66637K93636L20033L44885L67115L85437
60125G198201L98424M04829M03887L95308L78964L54775L23035K84755K41286
60116A0383464J93454J41403Q5552K7322l1570r0223j48165k03878k54499k97429
60106I805431l31572l56485l70999l73721l64789l46317l20984k90738k56904
60097F792922k20636j82863j44253j05630o8032l2102K123L4411O3835Q9387J10547
60086F339709J26773J36884J39714J35160J23903J06430Q3158N5486K5857l448
60076G269626l1127n6547p9397r9852j18418j35184j49682j61558j70911j77798
60066F089152j82036j83685j82995j79634j72690j62008j48851j34602j19436
$$ y = [4579646, 4767241, 4980675, 5220458, 5487095, 5780731, 6100764, 6445649, 6812764, 7198201, 7596625, 8001454, 8405341, 8800649, 9179613, 9534388, 9857423, 10142178, 10383464, 10576918, 10718321, 10803873, 10831195, 10799625, 10709402, 10561237, 10357359, 10102860, 9805431, 9473859, 9117374, 8746375, 8372654, 8007865, 7661548, 7340564, 7049826, 6792922, 6572286, 6389423, 6245170, 6139540, 6071508, 6039406, 6041529, 6075940, 6139775, 6229162, 6339709, 6466482, 6603366, 6743080, 6878240, 7002143, 7108573, 7191731, 7247217, 7273074, 7269626, 7238499, 7181952, 7102555, 7002703, 6884285, 6749101, 6599419, 6437861, 6266950, 6089152, 5907116, 5723431, 5540436, 5360802, 5188112, 5026104, 4877253, 4742651, 4623215]
60057D623215j02946q5495o7895n0123l1397j1535Q720K8749M8570O8070Q6595
60046D514528J03607J18954J32088J41633J46307J45857J40585J30484J15412
60037E689455R5784P2469M6190J7725j1474l9600o5700q9905j12149j31221j45588
60026E325986j54819j59611j60517j57353j50023j39349j26565j12331r6698p9937
60016C988783o2772m5716k8644j1286O296K3969M1970O0682Q0119R9913J19641
60005D272955J38865J56877J72682J85138J93067J95469J91968J82885J68575
59996E858481J48960J24195R5611O5315L4704L925k7132n7792q6796j13000j35555
59985E910916j53669j66625j73857j74829j69208j57470j41096j21786j00669
$$ y = [4623215, 4520269, 4434774, 4366879, 4316756, 4285359, 4273824, 4282544, 4311293, 4359863, 4427933, 4514528, 4618135, 4737089, 4869177, 5010810, 5157117, 5302974, 5443559, 5574043, 5689455, 5785239, 5857708, 5903898, 5921623, 5910149, 5870549, 5804849, 5714944, 5602795, 5471574, 5325986, 5171167, 5011556, 4851039, 4693686, 4543663, 4404314, 4277749, 4165418, 4068720, 3988783, 3926011, 3880295, 3851651, 3840365, 3846661, 3870630, 3912600, 3973282, 4053401, 4153314, 4272955, 4411820, 4568697, 4741379, 4926517, 5119584, 5315053, 5507021, 5689906, 5858481, 6007441, 6131636, 6227247, 6292562, 6327266, 6331191, 6304059, 6246267, 6159471, 6046471, 5910916, 5757247, 5590622, 5416765, 5241936, 5072728, 4915258, 4774162, 4652376, 4551707]
59976D551707p8514n6368l5363j5936K299J9774L6475N2269O7241Q1367R4113
59965D719064J04722J12881J18729J22163J22392J18591J10926J00604Q8734P5415
59955E794221O0387M4319K8903J5478M118n556j3075j7162j6869j2076k832J1128
59943E890984K9976N3256Q0154J10234J43531J79953K18847K59273L00502L41872
59933G608582L82089M18916M49756M72269M84032M81864M62314M23311L64943
59924A1548076K88625J96482R2368j7197j24432k22921l08391l77502m27499m57674
59914A0189935m70021m67532m52449m26809l93701l56649l17771k77541k36236
59905F791226j94807j54200j14653p6004l8157j161L4755O9124J01698J32800
$$ y = [4551707, 4473193, 4416825, 4381462, 4365526, 4367825, 4387599, 4424074, 4476343, 4543584, 4624951, 4719064, 4823786, 4936667, 5055396, 5177559, 5299951, 5418542, 5529468, 5630072, 5718806, 5794221, 5854608, 5898927, 5927830, 5943308, 5947426, 5941870, 5928795, 5911633, 5894764, 5882688, 5879856, 5890984, 5920960, 5974216, 6054370, 6164604, 6308135, 6488088, 6706935, 6966208, 7266710, 7608582, 7990671, 8409587, 8859343, 9331612, 9815644, 10297508, 10759822, 11183133, 11548076, 11836701, 12033183, 12125551, 12108354, 11983922, 11761001, 11452610, 11075108, 10647609, 10189935, 9719914, 9252382, 8799933, 8373124, 7979423, 7622774, 7305003, 7027462, 6791226, 6596419, 6442219, 6327566, 6251562, 6213405, 6212244, 6246999, 6316123, 6417821, 6550621]
59895F550621J62590J89909K12544K28707K37504K37845K27901K06284J73038
59886H426943J29074P5389J3743n2467j18870j81458k36844k81910l14375l33748
59876G125477l41070l37859l25880l07514k85242k60549k34097k06894j80493
59867D645879j55922j33417j13452r7161q5231p7075p1539o7770o4865o1396n6041
59856C662010m8486l9178k8526j6808m591P317J8194K7261L3419L5516L2861K5254
59844C704243J2888l319k1495l9359n5121o7850p7384q4125q8598r0773r0131
59833C098976q6624q1122p4453o6513n6998m6577l6406k6669j6529n554N738J6901
59821B624170K8234L9847N0794N9667O5774O9224P0292O9277O6757O3401N9360
$$ y = [6550621, 6713211, 6903120, 7115664, 7344371, 7581875, 7819720, 8047621, 8253905, 8426943, 8556017, 8631406, 8645149, 8592682, 8473812, 8292354, 8055510, 7773600, 7459225, 7125477, 6784407, 6446548, 6120668, 5813154, 5527912, 5267363, 5033266, 4826372, 4645879, 4489957, 4356540, 4243088, 4145927, 4060696, 3983621, 3912082, 3844312, 3779447, 3718051, 3662010, 3613524, 3574346, 3545820, 3529012, 3524421, 3531738, 3549932, 3577193, 3610612, 3646128, 3678989, 3704243, 3717131, 3713812, 3692317, 3652958, 3597837, 3529987, 3452603, 3368478, 3279880, 3189107, 3098976, 3012352, 2931230, 2856777, 2790264, 2733266, 2686689, 2650283, 2623614, 2607085, 2601531, 2607269, 2624170, 2652404, 2692251, 2743045, 2802712, 2868486, 2937710, 3008002, 3077279, 3144036, 3207437, 3266797]
59810C266797N4177M7331L8655K8239J6295L414r042j9089k4976k6172k3512j8325
59798C333792j1418k911P238J8924L2082M6893O3607Q2362J03237J26393J52083
59787C952282J80574K12084K46685K84091L23441L62986L99656M28694M43550
59778F834043M36294L99115L27423K23448R7657l3832j54459k51774l19355l56595
59768G201965l67344l57885l34739l03279k67569k30727j95075j61969j31780
59759D851598j04260p9172n6628l6785j9187k768J3284K8914M3681N7625P1268
59748D767570Q5031R9065J13590J28960J45400J63029J82057K02631K24663K48242
59738F360238K74045L02771L34284L67850M03251M40864M80402N20234N58258
$$ y = [3266797, 3320974, 3368305, 3406960, 3435199, 3451494, 3454908, 3445866, 3426777, 3401801, 3375629, 3352117, 3333792, 3322374, 3319463, 3326701, 3345625, 3377707, 3424600, 3488207, 3570569, 3673806, 3800199, 3952282, 4132856, 4344940, 4591625, 4875716, 5199157, 5562143, 5961799, 6390493, 6834043, 7270337, 7669452, 7996875, 8220323, 8317980, 8284148, 8129689, 7877915, 7558560, 7201965, 6834621, 6476736, 6141997, 5838718, 5571149, 5340422, 5145347, 4983378, 4851598, 4747338, 4668166, 4611538, 4574753, 4555566, 4552798, 4566082, 4594996, 4638677, 4696302, 4767570, 4852601, 4951666, 5065256, 5194216, 5339616, 5502645, 5684702, 5887333, 6111996, 6360238, 6634283, 6937054, 7271338, 7639188, 8042439, 8483303, 8963705, 9483939, 10042197]
59729A0042197N92873O22564O44926O56745O55181O39004O09084N68221N20535
59720A5551330M70917M24784L87636L63938L56082L64477L88387M25972M73658
59711A9207181N26326N78587O25487O61973O82624O82585O58539O08736N33149
59702B4765187M34484L18704J93752O7697n1933j58083k44800l08271l46887l60544
59692B4309306l50270l18378k68187k03256j26760m1166N2030J52085K58164L68789
59682B3832357M82459N98364P15743Q32271R43174J041498J118665J164954J170285
59673C1899770J125224J022018Q56239O29438L51348L9630k83009n92509q66790
59664C4181359j088732j248346j343118j376597j356547j293619j200232j089481
$$ y = [10042197, 10635070, 11257634, 11902560, 12559305, 13214486, 13853490, 14462574, 15030795, 15551330, 16022247, 16447031, 16834667, 17198605, 17554687, 17919164, 18307551, 18733523, 19207181, 19733507, 20312094, 20937581, 21599554, 22282178, 22964763, 23623302, 24232038, 24765187, 25199671, 25518375, 25712127, 25779824, 25727891, 25569808, 25325008, 25016737, 24669850, 24309306, 23959036, 23640658, 23372471, 23169215, 23042455, 23001289, 23053319, 23205404, 23463568, 23832357, 24314816, 24913180, 25628923, 26461194, 27404368, 28445866, 29564531, 30729485, 31899770, 33024994, 34047012, 34903251, 35532689, 35884037, 35923667, 35640658, 35048149, 34181359, 33092627, 31844281, 30501163, 29124566, 27768019, 26474400, 25274168, 24184687]
59656B4184687r74500q68383p83796p31468p17527p40647p90936q52358r08253
59647A6816819r46441r60905r50568r18005q68749q09737p46780o83304o21260
59638I311070n62292n07475m56739m09618l66385l27739k93488k62386k33426
59629E891522k06674j82502j60578j40136j20945j03391q7699p3616o1058n0509
59619D704414m2418l6568l2569l0780l2076l6633m3484n1538o0537p0625q1227
59608D185959r0853r7993j02025j03286j02457r9850r5295q8771q1029p3117o5329
59597C185954n7178m8574m0294l2902k5851j8406j0919m343J212O535J1952J6886
59585B984072K0899K4323K7395K9536L0039K9139K7822K6804K6141K5852K6421
$$ y = [24184687, 23210187, 22341804, 21558008, 20826540, 20109013, 19368366, 18577430, 17725072, 16816819, 15870378, 14909473, 13958905, 13040900, 12172151, 11362414, 10615634, 9932330, 9311070, 8748778, 8241303, 7784564, 7374946, 7008561, 6680822, 6387334, 6124948, 5891522, 5684848, 5502346, 5341768, 5201632, 5080687, 4977296, 4889597, 4815981, 4754923, 4704414, 4661996, 4625428, 4592859, 4562079, 4530003, 4493370, 4449886, 4398348, 4337811, 4267186, 4185959, 4095106, 3997113, 3895088, 3791802, 3689345, 3589495, 3494200, 3405429, 3324400, 3251283, 3185954, 3128776, 3080202, 3039908, 3007006, 2981155, 2962749, 2951830, 2947487, 2948699, 2955234, 2967186, 2984072, 3004971, 3029294, 3056689, 3086225, 3116264, 3145403, 3173225, 3200029, 3226170, 3252022, 3278443]
59574C278443K8488L2172L6945M2247M8089N4830O2492P0633P9039Q8167R8687
59563C920232J10861J24566J39570J55589J72367J90006K08758K28163K46881
59554E496993K63923K79549K94189L06947L16072L20630L20828L16843L08393
59545H224367K95578K79252K60274K39225K17059J95233J74785J55760J37628
59536A0179161J19697J01305Q2786O6722N7175N6861O5337P9933R7445J14507
59526A1020929J27562J33644J30765J17058R0361M9764k869o3817j29497j96837
59516A1277063k62335l22191l73490m14516m44044m61414m67374m63947m53042
59507G614710m35779m13226l86930l58372l28392k97607k66919k37293k09307
$$ y = [3278443, 3306931, 3339103, 3376048, 3418295, 3466384, 3521214, 3583706, 3654339, 3733378, 3821545, 3920232, 4031093, 4155659, 4295229, 4450818, 4623185, 4813191, 5021949, 5250112, 5496993, 5760916, 6040465, 6334654, 6641601, 6957673, 7278303, 7599131, 7915974, 8224367, 8519945, 8799197, 9059471, 9298696, 9515755, 9710988, 9885773, 10041533, 10179161, 10298858, 10400163, 10482949, 10549671, 10606846, 10663707, 10729044, 10808977, 10906422, 11020929, 11148491, 11282135, 11412900, 11529958, 11620319, 11670083, 11667214, 11603397, 11473900, 11277063, 11014728, 10692537, 10319047, 9904531, 9460487, 8999073, 8531699, 8067752, 7614710, 7178931, 6765705, 6378775, 6020403, 5692011, 5394404, 5127485, 4890192, 4680885]
59498D680885j83178j59032j36945j16891r8673q1812o5578m9509l3828j8998
59488C736441m904R102K3457L8156N3362O9587Q6998J05078J23321J41871J61153
59477D543622J81155K01446K21560K40963K58813K74088K85669K91907K90417
59468F789640K79032K57097K25361J84626J35126P7669J4848m9390j11304j68108
59458G634597k17663k58262k88974l09703l20806l23055l18122l08301k95193
59449D994518k79060k60024k39418k19203k00342j82538j65484j49429j34432
59440C164588j20104j06448r4098q3250p3101o2991n3360m4881l7262k9785k2529
59429B436779j6127j0507m951O74N637R474J2518J5122J7173J8770K0631K3352
$$ y = [4680885, 4497707, 4338675, 4201730, 4084839, 3986166, 3904354, 3838776, 3789267, 3755439, 3736441, 3731537, 3740639, 3764096, 3802252, 3855614, 3925201, 4012199, 4117277, 4240598, 4382469, 4543622, 4724777, 4926223, 5147783, 5388746, 5647559, 5921647, 6207316, 6499223, 6789640, 7068672, 7325769, 7551130, 7735756, 7870882, 7948551, 7963399, 7914009, 7802705, 7634597, 7416934, 7158672, 6869698, 6559995, 6239189, 5916134, 5598012, 5289711, 4994518, 4715458, 4455434, 4216016, 3996813, 3796471, 3613933, 3448449, 3299020, 3164588, 3044484, 2938036, 2843938, 2760688, 2687587, 2624596, 2571236, 2526355, 2489093, 2459308, 2436779, 2420652, 2410145, 2405194, 2405868, 2411505, 2420979, 2433497, 2448619, 2465792, 2484562, 2505193, 2528545]
59417B528545K6737L0369L4406L9215M4396M8598N0337M8888M4889M0466L8492
59406B975338M1020M8202N8823P1788Q6831J03838J21927J39441J54823J67600
59396C969631J78876J91032K06783K28078K55470K88241L25014L64422M05459
59387F413006M47325M88883N28184N62503N88907O04867O08511N98623N74873
59378A1415682N38307M91602M38571L83160L28660K77434K30900J89475J52596
59369A4446387J18868Q6268N2483J5574k5409p0524j19523j71896k25925k77976
59359A3828327l23280l57690l78867l86383l81464l66915l46823l25695l07429
59350A0653781k94745k89155k91082k99822l13459l29097l43701l55029l61849
$$ y = [2528545, 2555282, 2585651, 2620057, 2659272, 2703668, 2752266, 2802603, 2851491, 2896380, 2936846, 2975338, 3016358, 3064560, 3123383, 3195171, 3282002, 3385840, 3507767, 3647208, 3802031, 3969631, 4148507, 4339539, 4546322, 4774400, 5029870, 5318111, 5643125, 6007547, 6413006, 6860331, 7349214, 7877398, 8439901, 9028808, 9633675, 10242186, 10840809, 11415682, 11953989, 12445591, 12884162, 13267322, 13595982, 13873416, 14104316, 14293791, 14446387, 14565255, 14651523, 14704006, 14719580, 14694171, 14623647, 14504124, 14332228, 14106303, 13828327, 13505047, 13147357, 12768490, 12382107, 12000643, 11633728, 11286905, 10961210, 10653781, 10359036, 10069881, 9778799, 9478977, 9165518, 8836421, 8492720, 8137691, 7775842]
59341G775842l63468l59430l49924l36027l19169l00320k79913k58312k36015
59332D973264k13494j91240j69838j49691j30722j12692r5756q0259o6090n2738
59322C710744m0055k8475j8191q650Q82J0645K0598L0877M1565N2265O2438P2040
59310C906683Q1348R0171R7705J03187J06339J07089J05397J01412R5417Q7293
59300D882041P6516O3070M8035L2864J8343M831o685j4635j8241j8156j5394j0053
59288E042536j614R935K3867L9415N6017P2900Q9027J03637J16382J26745J33764
59277E812611J36445J34149J26396J12901R4131P1558M6989K1888k498k4808m4076
59266F485686o0498p5088q8287r9044j05368j05713r9970q9338p5485n9848m3621
$$ y = [7775842, 7412374, 7052944, 6703020, 6366993, 6047824, 5747504, 5467591, 5209279, 4973264, 4759770, 4568530, 4398692, 4249001, 4118279, 4005587, 3909831, 3829572, 3763482, 3710744, 3670689, 3642214, 3624023, 3615373, 3616255, 3626900, 3647498, 3678375, 3719940, 3772205, 3834643, 3906683, 3988031, 4078202, 4175907, 4279094, 4385433, 4492522, 4597919, 4699331, 4794748, 4882041, 4958557, 5021627, 5069662, 5102526, 5120869, 5125700, 5119015, 5104380, 5086139, 5067983, 5052589, 5042536, 5040922, 5050857, 5074724, 5114139, 5170156, 5243056, 5332083, 5435720, 5552102, 5678847, 5812611, 5949056, 6083205, 6209601, 6322502, 6416633, 6488191, 6535180, 6557068, 6554570, 6529762, 6485686, 6425188, 6350100, 6261813, 6162769, 6057401, 5951688, 5851718, 5762380, 5686895, 5627047, 5583426]
59255E583426k7999j4046k352O838J3169J6350J6820J5728J3989J1839R589Q267
59243E651618R067J2559J8996K9042M3525O2655Q6045J13419J44815J80041K18309
59232F570091K58244K97851L34578L65859L89363M02414M01597L83882L48225
59223I752104K95590K27656J46328N4572m3163j41657k35620l19840l89804m42803
59213H903363m78123m96097m97707m85377m63147m35199m04475l72846l41850
59204D928542l12476k84842k58849k34795k12789j92116j72125j53358j36861
59195B970331j22541j09282r6656q5452p6292o8700o2011n6269n1570m7239m2462
59184B151857l7347l2557k8189k3767j9167j4805j0859p013l083P22M387Q280
$$ y = [5583426, 5555427, 5541381, 5539029, 5545867, 5559036, 5575386, 5592206, 5607934, 5621923, 5633762, 5643351, 5651618, 5660685, 5673244, 5692240, 5721282, 5764807, 5827462, 5913507, 6026926, 6171741, 6351782, 6570091, 6828335, 7126186, 7460764, 7826623, 8215986, 8618400, 9019997, 9403879, 9752104, 10047694, 10275350, 10421678, 10476250, 10433087, 10291430, 10055810, 9735970, 9346166, 8903363, 8425240, 7929143, 7431436, 6946059, 6482912, 6047713, 5643238, 5270392, 4928542, 4616066, 4331224, 4072375, 3837580, 3624791, 3432675, 3260550, 3107192, 2970331, 2847790, 2738508, 2641852, 2556400, 2480108, 2411408, 2349397, 2293128, 2241558, 2194319, 2151857, 2114510, 2081953, 2053764, 2029997, 2010830, 1996025, 1985166, 1978153, 1975070, 1975792, 1980179, 1988459]
59172A988459J2509J6619K0346K4156K8463L2768L6227L8926M1839M5590M9851
59161B335753N4100N8327O2783O7566P2716P8348Q4382R0523R6683J02956J08940
59150C213077J13557J15933J16088J14310J10318J03516R3771Q1399O6734N0390
59140D179093L3581J7487K377j1920k4892l5445m3102m8109n0300m8918m4035
59129C925817l7108k9366k0321q734N492K1223L7704N5186P3972R3710J13938
59118D231513J34679J56024J77451J97998K17033K34551K50678K64942K75942
59109F140811K81613K79872K69158K48512K17509J76504J27159P2551J6612l6774
59099G793527q4375j23923j54392j76104j90451j99314k04621k08088k10885k13353
$$ y = [1988459, 2000968, 2017587, 2037933, 2062089, 2090552, 2123320, 2159547, 2198473, 2240312, 2285902, 2335753, 2389853, 2448180, 2510963, 2578529, 2651245, 2729593, 2813975, 2904498, 3001181, 3104137, 3213077, 3326634, 3442567, 3558655, 3672965, 3783283, 3886799, 3980570, 4061969, 4128703, 4179093, 4212674, 4230161, 4232538, 4220618, 4195726, 4160281, 4117179, 4069070, 4018770, 3969852, 3925817, 3888709, 3859343, 3839022, 3830288, 3835780, 3857003, 3894707, 3949893, 4023865, 4117575, 4231513, 4366192, 4522216, 4699667, 4897665, 5114698, 5349249, 5599927, 5864869, 6140811, 6422424, 6702296, 6971454, 7219966, 7437475, 7613979, 7741138, 7813689, 7830301, 7793527, 7709152, 7585229, 7430837, 7254733, 7064282, 6864968, 6660347, 6452259, 6241374, 6028021]
59089F028021k15290k16713k18089k19565k20286k19022k15421k10174k03985
59080D089476j96959j89080j80678j72009j62890j53166j43179j33350j23726
59071B634439j14350j05660r7962r0802q3512p6155o9287o3012n6981n1202m6065
59060A779451m1563l7270l3190k9802k7189k4846k2634k1101k0441j9896j8694
59049A482825j6953j5103j2989j0180o835l568p45J544L114L981M813O462R072
59036A445438J2257J5972K0421K5025K8365K9512K8855K7076K3935J8766J1850
59025A687472M480k407q845j4839j9484k1822k2069k1264j9834j7356j3747r831
59013A520454o360l212m4K924N299P166Q633R209Q400O573M477K256k36k464l612
$$ y = [6028021, 5812731, 5596018, 5377929, 5158364, 4938078, 4719056, 4503635, 4293461, 4089476, 3892517, 3703437, 3522759, 3350750, 3187860, 3034694, 2891515, 2758165, 2634439, 2520089, 2414429, 2316467, 2225665, 2142153, 2065998, 1996711, 1933699, 1876718, 1825516, 1779451, 1737888, 1700618, 1667428, 1637626, 1610437, 1585591, 1562957, 1541856, 1521415, 1501519, 1482825, 1465872, 1450769, 1437780, 1427600, 1420765, 1417197, 1416452, 1417996, 1421110, 1425091, 1429904, 1436366, 1445438, 1457695, 1473667, 1494088, 1519113, 1547478, 1576990, 1605845, 1632921, 1656856, 1675622, 1687472, 1691952, 1689545, 1680700, 1665861, 1646377, 1624555, 1602486, 1581222, 1561388, 1544032, 1530285, 1520454, 1514094, 1510882, 1510838, 1513762, 1519061, 1526227, 1534860, 1544069, 1552469, 1559042, 1563519, 1565775, 1565539, 1563075, 1559463]
58998A559463l930m506n573o069n167l281j155J049L225M782N404N716O435P329
58984A563722P752P773Q105R086J0377J1439J1954J1973J2052J3033J5189J7835
58972A700290K0139K2055K4146K6769K9788L2900L5885L8753M1803M5216M8412
58961B066156N0326N0607N0004M9250M8225M6691M5218M4656M5172M6585M9166
58950B592056N3352N8930O5259P2066P9381Q7012R4840J03324J12779J22322J30543
58939C571864J37293J43919J51682J60784J71222J83611J98747K16847K37738
58930E173707K61316K87509L16253L47777L82524M20461M60860N03103N47385
58921H700895N94178O43051O92295P39579P82641Q19167Q45986Q58482Q51071
$$ y = [1559463, 1555533, 1551027, 1545454, 1539385, 1534218, 1530937, 1529782, 1530831, 1534056, 1538838, 1544242, 1549958, 1556393, 1563722, 1571474, 1579247, 1587352, 1596438, 1606815, 1618254, 1630208, 1642181, 1654233, 1667266, 1682455, 1700290, 1720429, 1742484, 1766630, 1793399, 1823187, 1856087, 1891972, 1930725, 1972528, 2017744, 2066156, 2116482, 2167089, 2217093, 2266343, 2314568, 2361259, 2406477, 2451133, 2496305, 2542890, 2592056, 2645408, 2704338, 2769597, 2841663, 2921044, 3008056, 3102896, 3206220, 3318999, 3441321, 3571864, 3709157, 3853076, 4004758, 4165542, 4336764, 4520375, 4719122, 4935969, 5173707, 5435023, 5722532, 6038785, 6386562, 6769086, 7189547, 7650407, 8153510, 8700895, 9295073, 9938124, 10630419, 11369998, 12152639, 12971806, 13817792, 14676274, 15527345]
58912A5527345Q18705P58268O68837N51267M08249K44939O9149j09555k81354
58903A8655850m37453n70947o77429p55371q05985q32337q37983q26160q00109
58894A2112076p63721p21038o74908o26624n77132n27959m80646m35915l94099
58885F910034l55964l22418k93547k68663k47122k28482k12004j96721j82202
58876D602911j68760j56712j45762j35273j24893j14818j05501r7057q8970q0626
58866C384539p2156o4319n7439n1028m4719l8845l3618k8499k3033j7629j2609
58855B940645p140l53O940J2948J7389K1958K8085L5285M2146M8027N3366N8924
58843C258220O5249P2404P9925Q7463R5501J04948J15968J27842J40051J52773
$$ y = [15527345, 16346050, 17104318, 17773155, 18324422, 18732671, 18977610, 19046759, 18937204, 18655850, 18218397, 17647450, 16970021, 16214650, 15408665, 14576328, 13738345, 12912185, 12112076, 11348355, 10627317, 9952409, 9325785, 8748653, 8220694, 7740048, 7304133, 6910034, 6554070, 6231652, 5938105, 5669442, 5422320, 5193838, 4981834, 4785113, 4602911, 4434151, 4277439, 4131677, 3996404, 3871511, 3756693, 3651192, 3554135, 3465165, 3384539, 3312383, 3248064, 3190625, 3139597, 3094878, 3056033, 3022415, 2993916, 2970883, 2953254, 2940645, 2933505, 2933152, 2940092, 2953040, 2970429, 2992387, 3020472, 3055757, 3097903, 3145930, 3199296, 3258220, 3323469, 3395873, 3475798, 3563261, 3658762, 3763710, 3879678, 4007520, 4147571, 4300344]
58833D300344J66190J80120J94612K10290K27703K46946K68103K91529L17388
58824F403225L45555L76324M10635M49204M91707N37110N84299O32084O78974
58815A0909117P22999P61393P90322Q05496Q02962P78963P29428O51102N43794
58806A7495576M10954K57978R1113q1685k50451m05490n39987o50096p33612p89847
58796A4804453q20503q29356q20669p98155p65149p24787o79903o33015n86292
58787H146624n41029m97421m55420m15753l79545l47056l17348k89393k63073
58778D640586k39012k17688j98972j82425j67971j56029j46778j39401j32472
58769C059838j25193j17757j10436j02930r4913q6668p8721p1213o4072n7393
$$ y = [4300344, 4466534, 4646654, 4841266, 5051556, 5279259, 5526205, 5794308, 6085837, 6403225, 6748780, 7125104, 7535739, 7984943, 8476650, 9013760, 9598059, 10230143, 10909117, 11632116, 12393509, 13183831, 13989327, 14792289, 15571252, 16300680, 16951782, 17495576, 17906530, 18164508, 18255621, 18173936, 17923485, 17517995, 16978008, 16327912, 15594300, 14804453, 13983950, 13154594, 12333925, 11535770, 10770621, 10045834, 9365931, 8732916, 8146624, 7605595, 7108174, 6652754, 6237001, 5857456, 5510400, 5193052, 4903659, 4640586, 4401574, 4183886, 3984914, 3802489, 3634518, 3478489, 3331711, 3192310, 3059838, 2934645, 2816888, 2706452, 2603522, 2508609, 2421941, 2343220, 2272007, 2207935, 2150542]
58759B150542n1146m4870l8175l1288k4671j8452j2719p990m604j911J196M917
58747A920829Q316J0519J1517J1572J0422P376J951n755j5002k4455l2535l8066
58735A866689m0821m1419m0783l9567l8043l6423l5150l4654l4867l5260l5393
58724A454309l5203l4627l3368l1305k8849k6542k4369k1748j8256j4202j0543
58713A175297q242p646q431j0102j2298j4529j6035j6469j6439j6657j6667j5284
58701A016498j2436r587q001p411o983o696o970p538p773p802q398r796j1445
58688I05662j2838j3867j4324j3783j2277j0483q993p675n993l629o79K471N276
58675H08868P231Q084P847O670M849K827J015k39m80P51L310O091P759P805O658
$$ y = [2150542, 2099396, 2054526, 2016351, 1985063, 1960392, 1941940, 1929221, 1921231, 1916627, 1914716, 1915912, 1920829, 1929145, 1939664, 1951181, 1962753, 1973175, 1980551, 1982502, 1976747, 1961745, 1937290, 1904755, 1866689, 1825868, 1784449, 1743666, 1704099, 1666056, 1629633, 1594483, 1559829, 1524962, 1489702, 1454309, 1419106, 1384479, 1351111, 1319806, 1290957, 1264415, 1240046, 1218298, 1200042, 1185840, 1175297, 1167055, 1159409, 1150978, 1140876, 1128578, 1114049, 1098014, 1081545, 1065106, 1048449, 1031782, 1016498, 1004062, 994475, 986474, 979063, 972080, 965384, 958414, 950876, 943103, 935301, 926903, 917107, 905662, 892824, 878957, 864633, 850850, 838573, 828090, 819097, 811422, 805429, 801800, 801121, 803592, 808868, 816099, 824183, 832030, 838700, 843549, 846376, 847391, 847152, 846672, 847423, 850733, 856824, 864583, 872388, 879046]
58660H79046M875K711M30j454k524k807k507j623JK255M673O804Q644J0509J2558
58645I21591J4594J6465J8329K0325K2204K3750K5391K7896L1433L5415L9348
58634A196741M3402M7955N3081N8729O5024P2106Q0014Q8963R9424J11759J25938
58623B043136J41802J59152J77545J96352K15119K33351K49680K61768K67250
58614C945155K64367K51439K26659J89141J40037Q2316J9858m2903j01158j50697
58604D824214j88978k15232k29873k34270k30670k21664k09458j95668j81433
58595B916968j67380j53676j40502j28224j16945j06254r5711q5373p5510o6195
58585A781198n7411m9244m1727l4784k8611k3621j9788j6641j4170j3077j3658
$$ y = [879046, 883921, 886632, 887062, 885608, 883084, 880277, 877770, 876147, 876148, 878403, 883076, 889880, 898524, 909033, 921591, 936185, 952650, 970979, 991304, 1013508, 1037258, 1062649, 1090545, 1121978, 1157393, 1196741, 1240143, 1288098, 1341179, 1399908, 1464932, 1537038, 1617052, 1706015, 1805439, 1917198, 2043136, 2184938, 2344090, 2521635, 2717987, 2933106, 3166457, 3416137, 3677905, 3945155, 4209522, 4460961, 4687620, 4876761, 5016798, 5099114, 5118972, 5076069, 4974911, 4824214, 4635236, 4420004, 4190131, 3955861, 3725191, 3503527, 3294069, 3098401, 2916968, 2749588, 2595912, 2455410, 2327186, 2210241, 2103987, 2008276, 1922903, 1847393, 1781198, 1723787, 1674543, 1632816, 1598032, 1569421, 1545800, 1526012, 1509371, 1495201, 1482124, 1468466]
58574A468466j4953j5592j4977j3119j0016n869j482K291N103O510N387Q34o509
58561A406074j4796k2494k8912l3601l6066l6135l4139l0757k7021k3920k1534
58550A096699j8909j5368j1589q727p017n971n472n693o353p041q070j0006j2454
58537I74029j4275j5002j5163j5252j5293j5385j5716j5919j5275j3822j2419
58526H10508j1553j0835r877q913q218p514o422n040l754k752k001j442j110j147
58512G29930j660k414k887k841k567k315j848r22K16J348K746M544O140P032P794
58497G42296R332J1508J3430J4849J6153J7181J7168J5989J4445J3065J1507R454
58485I06377P298N596M424L488K430R35j010k866m089m863n894p524r553j1751
$$ y = [1468466, 1453513, 1437921, 1422944, 1409825, 1399809, 1393940, 1392458, 1394749, 1399852, 1406362, 1411749, 1412583, 1406074, 1391278, 1368784, 1339872, 1306271, 1270205, 1234070, 1199931, 1169174, 1142153, 1118233, 1096699, 1077790, 1062422, 1050833, 1042106, 1035089, 1029118, 1023646, 1017953, 1011600, 1004559, 996489, 986483, 974029, 959754, 944752, 929589, 914337, 899044, 883659, 867943, 852024, 836749, 822927, 810508, 798955, 788120, 778243, 769330, 761112, 753598, 747176, 742136, 738382, 735630, 733629, 732187, 731077, 729930, 728270, 725856, 722969, 720128, 717561, 715246, 713398, 712476, 712692, 714040, 716786, 721330, 727470, 734502, 742296, 751628, 763136, 776566, 791415, 807568, 824749, 841917, 857906, 872351, 885416, 896923, 906377, 913675, 919271, 923695, 927183, 929613, 930548, 929538, 926672, 922583, 917720, 911826, 904302, 894749, 882998]
58471H82998j3965j5843j7077j7700j7802j7189j5966j4912j4539j4184j2903
58460G10918j0875r029p682o614o033o220o493n846m499l565l253k728j732r60
58446F35389o28o3R73J852K370L222M728O156O816O863O610N935M831L704K766
58431F91524J869J219J390K421L705M917O207P455Q303Q987R955J0654R905P735
58417G76246N519M068K868J498M31k2l05o28o13m07q71k108l093l363l766m880
58401G70574n985o402o566o931o965o120m802l523k186r32o16j490k484k703k642
58386G10227l097l822m116l705k222J051N929J0827J4411J6735J7908J7070J3995
58373G91191J0482Q572Q104P503O264N136M465L869L325L254L610L908M030M156
$$ y = [882998, 869033, 853190, 836113, 818413, 800611, 783422, 767456, 752544, 738005, 723821, 710918, 700043, 691014, 683332, 676718, 670685, 664465, 657972, 652126, 647627, 644062, 640809, 638081, 636349, 635389, 634761, 634698, 635671, 637523, 639893, 643115, 647843, 653999, 660815, 667678, 674288, 680223, 685054, 688758, 691524, 693393, 694612, 696002, 698423, 702128, 707045, 713252, 720707, 729010, 737997, 747952, 758606, 768511, 776246, 781765, 785833, 788701, 790199, 790630, 790608, 790303, 789675, 789062, 788655, 787784, 785676, 782583, 779220, 775454, 770574, 764589, 758187, 751621, 744690, 737725, 731605, 726803, 723280, 721094, 720162, 719546, 718056, 715572, 712869, 710227, 707130, 703308, 699192, 695487, 693265, 694316, 700245, 711072, 725483, 742218, 760126, 777196, 791191, 801673, 810245, 818349, 825852, 832116, 837252, 841717, 845586, 848911, 852165, 855775, 859683, 863713, 867869]
58359H67869M168L955M004M809N999O748O787O427N904N278M612L826K841K200
58345I35427K801M563O212O893P141P717Q444Q881R205R658J0000J0225J0895
58332A038062J2005J2584J2182J1685J1780J1735J0686R114Q001P553P687Q745
58320A161819J0577J2058J2632J3283J4750J5976J5647J4173J2719J1292R463
58309A304389P976P895Q793R464R843J0658J1739J2339J2708J3785J5633J7574
58297A442796J9526K1838K4142K5741K6878K8319K9881L0674L0688L1014L2456
58286A743953L4747L7056L8678L9563M0666M3302M7715N2832N7627O1756O4592
58275B262487O5024O2709N8256N1738M2819L2818K4579J9371J5962J3673J3883
$$ y = [867869, 872037, 875992, 879996, 884805, 890804, 897552, 904339, 910766, 916670, 921948, 926560, 930386, 933227, 935427, 938228, 942791, 949003, 955896, 963037, 970754, 979198, 988079, 997284, 1006942, 1016942, 1027167, 1038062, 1050067, 1062651, 1074833, 1086518, 1098298, 1110033, 1120719, 1129833, 1137834, 1145387, 1153074, 1161819, 1172396, 1184454, 1197086, 1210369, 1225119, 1241095, 1256742, 1270915, 1283634, 1294926, 1304389, 1312365, 1320260, 1329053, 1338517, 1348360, 1359018, 1370757, 1383096, 1395804, 1409589, 1425222, 1442796, 1462322, 1484160, 1508302, 1534043, 1560921, 1589240, 1619121, 1649795, 1680483, 1711497, 1743953, 1778700, 1815756, 1854434, 1893997, 1934663, 1977965, 2025680, 2078512, 2136139, 2197895, 2262487, 2327511, 2390220, 2448476, 2500214, 2543033, 2575851, 2600430, 2619801, 2635763, 2649436, 2663319]
58264B663319J7134K1442K5307K9907L6160M2184M6287N0041N5450O1261O5298
58253C113790O8521P3307P9214Q4014Q7683R1882R6427R9792J02431J06263J11457
58242D114781J16747J22225J28852J35948J42337J49063J57929J68210J78064
58233E414156J88196K00669K15080K29453K44013K60430K78201K95657L13738
58224G639593L34802L58520L83045M09287M39835M74497N11597N52570O00384
58215A1704130O54342P12041P75695Q50465R36988J032242J138084J261967J408656
58206B0474610J578801J777380K016178K306225K656313L082866L613845M279331
58198D1785549N106318O126798P381317Q910487J0760345J3014376J5811489J9309323
$$ y = [2663319, 2680453, 2701895, 2727202, 2757109, 2793269, 2835453, 2881740, 2931781, 2987231, 3048492, 3113790, 3182311, 3255618, 3334832, 3418846, 3506529, 3598411, 3694838, 3794630, 3897061, 4003324, 4114781, 4231528, 4353753, 4482605, 4618553, 4760890, 4909953, 5067882, 5236092, 5414156, 5602352, 5803021, 6018101, 6247554, 6491567, 6751997, 7030198, 7325855, 7639593, 7974395, 8332915, 8715960, 9125247, 9565082, 10039579, 10551176, 11103746, 11704130, 12358472, 13070513, 13846208, 14696673, 15633661, 16665903, 17803987, 19065954, 20474610, 22053411, 23830791, 25846969, 28153194, 30809507, 33892373, 37506218, 41785549, 46891867, 53018665, 60399982, 69310469, 80070814, 93085190, 108896679, 128206002]
58190A28206002K3622916K8781894L4633946M0555427M5053520M5736460M0154602
58183C86744767K7339104Q981324j0880590k7708819l8572216m3046290m2566686
58176B60290594l9125267l4357125k9312473k4573632k0394178j6818069j3805067
58169H1904783j1307183r267298p605624o242900n123191m201517l428522k761889
58161C1966659k177654j657019j173459p00862k20168K90767Q59875J505149K225210
58152C0918498K991850L700359M101979L847336K705089P99162j381335l244985
58144D4437953m412425m838019m708225m266782l704369l135355k616110k167232
58136A4589436j789766j476737j220276j013351q47774p13518o01874n08572m32430
$$ y = [128206002, 151828918, 180610812, 215244758, 255800185, 300853705, 346590165, 386744767, 414083871, 423065195, 412184605, 384475786, 345903570, 302857280, 260290594, 221165327, 186808202, 157495729, 132922097, 112527919, 95709850, 81904783, 70597600, 61330302, 53724678, 47481778, 42358587, 38157070, 34728548, 31966659, 29789005, 28131986, 26958527, 26257665, 26037497, 26328264, 27188139, 28693288, 30918498, 33910348, 37610707, 41712686, 45560022, 48265111, 49064273, 47682938, 44437953, 40025528, 35187509, 30479284, 26212502, 22508133, 19372778, 16756668, 14589436, 12799670, 11322933, 10102657, 9089306, 8241532, 7528014, 6926140, 6417568, 5985138]
58127E985138l71958l24790k89008k62690k43008k27666k16230k08011j99962
58118C641815j89065j75643j61838j47939j32972j17766j04300r2520q0826o9662
58108B369284o1846n9120o0617o4617o9583p3467p4319p2039o8068o3509n9025
58097A643074n5948n5311n5908n5145n1887m7037m1827l7156l4199l3601l4121
58086A140934l3620l1388k8248k4947k1896j9885j9327j9117j7923j6167j5140
58075H93276j4759j3946j2764j2244j2372j2144j1436j1048j1017j0612r932r816
58063G51186j0168j0047r369q968q910q357p233o517o704p237p622p871p854p336
58049F36993o644o244n778m621l068j867r28K56J333J628J641K485M010M982M946
$$ y = [5985138, 5613180, 5288390, 4999382, 4736692, 4493684, 4266018, 4049788, 3841777, 3641815, 3452750, 3277107, 3115269, 2967330, 2834358, 2716592, 2612292, 2519772, 2438946, 2369284, 2307438, 2248318, 2187701, 2123084, 2053501, 1980034, 1905715, 1833676, 1765608, 1702099, 1643074, 1587126, 1531815, 1475907, 1420762, 1368875, 1321838, 1280011, 1242855, 1208656, 1175055, 1140934, 1107314, 1075926, 1047678, 1022731, 1000835, 980950, 961623, 942506, 924583, 908416, 893276, 878517, 864571, 851807, 839563, 827191, 815047, 803611, 792563, 781546, 770934, 761002, 751186, 741018, 730971, 721602, 712634, 703724, 695367, 688134, 681617, 674913, 667676, 660054, 652183, 644329, 636993, 630349, 624105, 618327, 613706, 610638, 608771, 607843, 608099, 609432, 611060, 612701, 615186, 619196, 624178, 629124]
58034F29124M589M397M280M390M876N018M054K661K180K484K206J022Q9Q1K65
58019F71716j07q40j472j790j491l93J010K128L293N134P317R148J0995J3555
58005G18203J5981J6585J5319J3732J2322R698M883j186o978j1828j5584j8054
57993G53093j9277j9263j7338j3003p505l124o57Q94K006J785k3j978k787k812
57979F70011k843k687j958j160r27j056j070j043j133j161j143j487k102k110
57965F48131j040O13K435M798P884J1010J3615J6089J8902K1598K3240K3193K1078
57952H11546J6850J1497O757L456Q57j723l618l921l141k654l090m148n717q194
57938H14757j1804j6214k0800k4924k8004k9704k9980k8927k6811k4270k2016
$$ y = [629124, 633713, 638110, 642390, 646780, 651656, 656674, 660728, 663389, 665569, 668053, 670259, 671281, 671370, 671451, 671716, 671609, 670769, 669297, 667507, 666016, 665623, 666633, 668761, 672054, 677188, 684505, 693653, 704648, 718203, 734184, 750769, 766088, 779820, 792142, 801840, 806723, 805537, 798559, 786731, 771147, 753093, 733816, 714553, 697215, 684212, 676707, 673583, 672926, 673820, 675826, 677611, 677588, 675610, 672823, 670011, 667168, 664481, 662523, 661363, 660436, 659380, 658310, 657267, 656134, 654973, 653830, 652343, 650241, 648131, 647091, 647704, 650139, 654937, 662821, 673831, 687446, 703535, 722437, 744035, 767275, 790468, 811546, 828396, 839893, 846650, 850106, 850963, 849240, 845622, 841701, 838560, 835906, 832816, 828668, 822951, 814757, 802953, 786739, 765939, 741015, 713011, 683307, 653327, 624400, 597589, 573319, 551303]
57927E51303k0205j8450j6495j4428j2251r885p578n688m028k104l3J553K531
57914D44242L380M251M868N409O482P949Q886Q980Q925R021Q499O857M808L206
57900E35763J886K67j608l357m928o287p144p514p980q760r200q781p980p581
57886D56796p637p731p644p137n761l509j226L69J506K716L907M730N319O013
57872D40711O785P539Q494R646J0275R749Q421P153O265N484M601L607K449J131
57858E32310k12j608l215m726n460n434n630o602p521p401o564o086o198o224
57844D59429n777n073m251l268k448k276k537k440j738j199j656l009m416n252
57830D14089n631o071o784p532q103q640r198r315q585p462o835o854o886o586
$$ y = [551303, 531098, 512648, 496153, 481725, 469474, 459589, 452011, 446323, 442295, 440191, 440158, 441711, 444242, 447622, 451873, 456741, 462150, 468632, 476581, 485467, 494447, 503372, 512393, 520892, 527749, 532557, 535763, 537649, 537916, 536308, 532951, 528023, 521736, 514592, 507078, 499098, 490338, 481138, 472357, 464377, 456796, 449159, 441428, 433784, 426647, 420886, 417377, 416151, 416520, 418026, 420742, 424649, 429379, 434698, 440711, 447496, 455035, 463529, 473175, 483450, 493199, 501620, 508773, 515038, 520522, 525123, 528730, 531179, 532310, 532098, 530490, 527275, 522549, 517089, 511655, 506025, 499423, 491902, 484501, 477937, 471851, 465653, 459429, 453652, 448579, 444328, 441060, 438612, 436336, 433799, 431359, 429621, 428422, 426766, 423757, 419341, 414089, 408458, 402387, 395603, 388071, 379968, 371328, 362130, 352815, 344230, 336768, 329933, 323079, 316193, 309607]
57816C09607o231n880n157m089l192k436j143O45J792J622R41P57R89J269K054
57801B91548L847O104Q029R816J1952J3921J4946J5577J7160J9661K1349K0797
57789D54707J8243J4851J1546Q836O943N750N036M938N655O698P012N953L701
57776E59869P39k617o148r685j3138j6173j8010j8094j6887j5456j4254j2824
57764D17322j0735q203n711l442j372M29J831K818L474L828L772L142J994P69
57750D09916m5l64m11k46K29Q09J138J338J835K459K516K093K322L850N782O848
57734D40069O855O393N807N333N545O713Q109Q904R304J0029J1095J2117J3325
57721E49598J5144J7101J8290J8859J9913K1882K4064K5863K7481K9153L0648
$$ y = [309607, 303376, 297496, 292339, 288250, 285058, 282622, 281479, 282124, 283916, 285538, 286479, 287236, 288225, 289494, 291548, 295395, 301499, 309528, 319344, 331296, 345217, 360163, 375740, 392900, 412561, 433910, 454707, 472950, 487801, 499347, 508183, 515126, 520876, 525912, 530850, 536505, 543203, 550215, 556168, 559869, 560608, 557991, 551843, 542158, 529020, 512847, 494837, 476743, 459856, 444400, 430146, 417322, 406587, 398384, 392673, 389231, 387859, 388288, 390119, 392937, 396411, 400239, 404011, 407153, 409147, 409916, 409871, 409507, 409096, 408850, 409079, 409888, 411026, 412364, 414199, 416658, 419174, 421267, 423589, 427439, 433221, 440069, 446924, 453317, 459124, 464457, 470002, 476715, 484824, 493728, 503032, 513061, 524156, 536273, 549598, 564742, 581843, 600133, 618992, 638905, 660787, 684851, 710714, 738195, 767348, 797996]
57710G97996L1878L3358L5729L9229M3809M9278N5316O1826O9239P8035Q8102
57699A383795R9064J10971J24067J38106J52714J68198J85091K02899K20131K35399
57689C020435K47512K54464K53312K41445K17375J80576J31890P4656J4529m2651
57679D593543r2675j32902j61456j77292j80604j72648j55113j29735r8107o1698
57669C231313k2285J7423N3216P8765Q5541O5560J7130n0976j22140j79997k15202
57658B958348k26685k19114j99589j74618j48172j22114r8044p7521o0483m5205
57648A586803l0629j7580o845K612J2362K2451L2033M1302N1359O2552P4383Q6927
57636A917730J01031J16948J33850J50881J67743J83988J98535K10116K17513
$$ y = [797996, 829874, 863232, 898961, 938190, 981999, 1031277, 1086593, 1148419, 1217658, 1295693, 1383795, 1482859, 1593830, 1717897, 1856003, 2008717, 2176915, 2362006, 2564905, 2785036, 3020435, 3267947, 3522411, 3775723, 4017168, 4234543, 4415119, 4547009, 4621665, 4636194, 4593543, 4500868, 4367966, 4206510, 4029218, 3848614, 3675966, 3520853, 3391118, 3293011, 3231313, 3209028, 3226451, 3279667, 3358432, 3443973, 3509533, 3526663, 3475687, 3353547, 3173550, 2958348, 2731663, 2512549, 2312960, 2138342, 1990170, 1868056, 1770012, 1692491, 1632008, 1586803, 1556174, 1538594, 1531749, 1534361, 1546723, 1569174, 1601207, 1642509, 1693868, 1756420, 1830803, 1917730, 2018761, 2135709, 2269559, 2420440, 2588183, 2772171, 2970706, 3180822, 3398335]
57627C398335K18951K12015J94723J66476J27886Q0355K6366l0190q4667j32965
57617D177285j72338k01387k19861k28474k28659k22212k11112j97427j82910
57608B312905j68418j53843j38920j24156j10672r9125q9100p9803p0950o2779
57598A215139n5479m9099m3841l9810l6503l3099k9426k6176k3955k2450k0860
57587H34441j8887j6943j5539j4623j3690j2424j1124j0316r943r308q075o921
57575F86648o668o995o568m530j371J681L715M600M865N282O227P430Q538R768
57561G12622J1485J3375J4700J5393J6230J7789J9922K2419K5483K9152L2928
57550I31498L6447M0111M4588M9969N5850O2005O8639P6185Q5017R5321J06909
$$ y = [3398335, 3617286, 3829301, 4024024, 4190500, 4318386, 4398741, 4425107, 4394917, 4310250, 4177285, 4004947, 3803560, 3583699, 3355225, 3126566, 2904354, 2693242, 2495815, 2312905, 2144487, 1990644, 1851724, 1727568, 1616896, 1517771, 1428671, 1348868, 1277918, 1215139, 1159660, 1110561, 1066720, 1026910, 990407, 957308, 927882, 901706, 877751, 855301, 834441, 815554, 798611, 783072, 768449, 754759, 742335, 731211, 720895, 710952, 701644, 693569, 686648, 679980, 672985, 666417, 661887, 660516, 662197, 665912, 670512, 675377, 680659, 686886, 694316, 702854, 712622, 724107, 737482, 752182, 767575, 783805, 801594, 821516, 843935, 869418, 898570, 931498, 967945, 1008056, 1052644, 1102613, 1158463, 1220468, 1289107, 1365292, 1450309, 1545630, 1652539]
57539A652539J19280J31902J44258J55767J65833J73781J78380J77615J69480
57530C068835J52988J28010R4653N3811Q389l7156p8956j14882j43659j64030
57520B968003j75504j79011j76125j68196j56674j43490j30212j17230j04428
57511A617133r2185q1085p1128o2020n3826m6711m0339l4290k8769k4090j9803
57500A062887j5146j0272o104k976j96K939O365R709J2968J6430K0296K4572K9201
57487A150673L4152L9527M5566N2412O0000O8320P7585Q7896R9029J10713J22901
57476A948774J35349J47252J57568J65415J69640J68278J59070J40628J12923
57467C304897P6980L4741j0885n6368r8236j33523j60106j77284j85892j87473
$$ y = [1652539, 1771819, 1903721, 2047979, 2203746, 2369579, 2543360, 2721740, 2899355, 3068835, 3221823, 3349833, 3444486, 3498297, 3506686, 3469530, 3390574, 3275692, 3132033, 2968003, 2792499, 2613488, 2437363, 2269167, 2112493, 1969003, 1838791, 1721561, 1617133, 1524948, 1443863, 1372735, 1310715, 1256889, 1210178, 1169839, 1135549, 1106780, 1082690, 1062887, 1047741, 1037469, 1031365, 1028389, 1028193, 1031132, 1037497, 1047206, 1060174, 1076604, 1096900, 1121472, 1150673, 1184825, 1224352, 1269918, 1322330, 1382330, 1450650, 1528235, 1616131, 1715160, 1825873, 1948774, 2084123, 2231375, 2388943, 2554358, 2723998, 2892276, 3051346, 3191974, 3304897, 3381877, 3416618, 3405733, 3349365, 3251129, 3117606, 2957500, 2780216, 2594324, 2406851]
57457B406851j83346j74750j63328j50663j37405j23572j09696r6945q6030p6670
57447A104446o8357o0995n4517m8520m2753l7619l3610l0433k7210k3648k0530
57436F56254j8785j8182j7380j5397j2762j0806j0001r600q912q186p828p477
57424E10938o578n419m788m758m647m118l630l625l909m025l695k829j549l55
57410D57013J89Q8j36j76j07J66R04J835K197J901J877K773L860M065L564L424
57394D83437L925M166L457K295J593J649K201K952L551L571L019K558K676K922
57380E23972K570J827J589K073K501K387K261K710L422L781L866M098M353M250
57366E65660M096M633N872O958P326P336P549Q084Q767R400R674R389Q909Q805
$$ y = [2406851, 2223505, 2048755, 1885427, 1734764, 1597359, 1473787, 1364091, 1267146, 1181116, 1104446, 1036089, 975094, 920577, 872057, 829304, 791685, 758075, 727642, 700432, 676784, 656254, 637469, 619287, 601907, 586510, 573748, 562942, 552941, 543341, 534429, 526243, 518415, 510938, 504360, 498941, 494153, 489395, 484748, 480630, 477000, 473375, 469466, 465441, 461746, 458917, 457368, 457013, 457202, 457290, 457154, 456978, 456871, 457037, 457941, 459776, 461973, 463874, 465751, 468524, 472384, 476449, 480013, 483437, 487362, 491528, 494985, 497280, 498873, 500522, 502723, 505675, 509226, 512797, 515816, 518374, 521050, 523972, 526542, 528369, 529958, 532031, 534532, 536919, 539180, 541890, 545312, 549093, 552959, 557057, 561410, 565660, 569756, 574389, 580261, 587219, 594545, 601881, 609430, 617514, 626281, 635681, 645355, 654744, 663653, 672458]
57352F72458R003Q940Q641Q829R633J0138R686Q847Q492Q633Q835R119R627J0009
57338H00890R930R842J0350J1193J1618J1497J1266J1046J0683J0476J0906J1758
57326I31455J2363J2705J3375J4407J5067J5030J4949J5487J6399J6978J6932
57315A095147J6484J6081J6236J7269J8901K0371K1205K1609K2037K2648K3302
57304A311290K3793K4073K4449K5527K7629L0256L2502L3988L5040L6058L7201
57293A641806L8573M0174M1582M2279M2383M2537M2959M3138M2616M1473L9759
57282B099279L7015L2832K7467K1550J5555R865N084J722l57j837l245m487m993
57269B235450m232k215M55L041N186O978Q667J0528J2742J5143J7273J9049K1096
$$ y = [672458, 681461, 690401, 699042, 707871, 717504, 727642, 737328, 746175, 754667, 763300, 772135, 781254, 790881, 800890, 810820, 820662, 831012, 842205, 853823, 865320, 876586, 887632, 898315, 908791, 919697, 931455, 943818, 956523, 969898, 984305, 999372, 1014402, 1029351, 1044838, 1061237, 1078215, 1095147, 1111631, 1127712, 1143948, 1161217, 1180118, 1200489, 1221694, 1243303, 1265340, 1287988, 1311290, 1335083, 1359156, 1383605, 1409132, 1436761, 1467017, 1499519, 1533507, 1568547, 1604605, 1641806, 1680379, 1720553, 1762135, 1804414, 1846797, 1889334, 1932293, 1975431, 2018047, 2059520, 2099279, 2136294, 2169126, 2196593, 2218143, 2233698, 2243563, 2248647, 2250369, 2250012, 2248175, 2244930, 2240443, 2235450, 2231218, 2229003, 2229458, 2232499, 2237685, 2244663, 2253330, 2263858, 2276600, 2291743, 2309016, 2328065, 2349161]
57256B349161K3814K6393K7574K7407K7410K8659L0565L1928L2463L2649L2731
57245B670754L2655L2743L3533L4977L6335L6998L7014L6854L6991L7742L9110
57234C065706M0681M1939M2780M3532M4485M5587M6705M7887M9220N0490N1217
57223C570229N1096N0307M9336M8421M7457M6358M5365M4653M3861M2457M0555
57212D080095L9022L8547L8954L9642M0449M1723M3662M5997M8328N0515N2578
57201D559512N4434N5917N7100N8349N9937O1703O3202O4160O4627O4645O4091
57190E227677O2843O0937N8385N5175N1654M8628M6683M5512M4358M3100M2462
57179E787414M2986M4176M4997M5189M5685M7584N0900N4571N7714O0361O2769
$$ y = [2349161, 2372975, 2399368, 2426942, 2454349, 2481759, 2510418, 2540983, 2572911, 2605374, 2638023, 2670754, 2703409, 2736152, 2769685, 2804662, 2840997, 2877995, 2915009, 2951863, 2988854, 3026596, 3065706, 3106387, 3148326, 3191106, 3234638, 3279123, 3324710, 3371415, 3419302, 3468522, 3519012, 3570229, 3621325, 3671632, 3720968, 3769389, 3816846, 3863204, 3908569, 3953222, 3997083, 4039540, 4080095, 4119117, 4157664, 4196618, 4236260, 4276709, 4318432, 4362094, 4408091, 4456419, 4506934, 4559512, 4613946, 4669863, 4726963, 4785312, 4845249, 4906952, 4970154, 5034314, 5098941, 5163586, 5227677, 5290520, 5351457, 5409842, 5465017, 5516671, 5565299, 5611982, 5657494, 5701852, 5744952, 5787414, 5830400, 5874576, 5919573, 5964762, 6010447, 6058031, 6108931, 6163502, 6221216, 6281577, 6344346]
57168F344346O4411O4336O2459N9833N7428N5202N2596M9403M5770M1824L7734
57157F935342L3813L0151K6431K2511J8700J5119J1245O590J326m392j1177j9430
57145G066229k7701l3009l3132k8183j9958j0437r85P693J5295K1465K5475K6588
57133G009340K4763K0827J5986J1340P643N107L547K974L908O716J0815J5046
57121G138012J8815K2555K7063L2661L9016M5654N2725O1308P2725Q7576J05803
57110G703913J27585J53597J84441K20702K63755L15740L78643M54382N46102
57101A0348860O58539P97019R67447J177540J436591J753544K136203K591284
57093B1867027L121481L721209M377696N076670N803072O535203P243607P896835
$$ y = [6344346, 6408757, 6473093, 6535552, 6595385, 6652813, 6708015, 6760611, 6810014, 6855784, 6897608, 6935342, 6969155, 6999306, 7025737, 7048248, 7066948, 7082067, 7093312, 7099902, 7101228, 7096836, 7085659, 7066229, 7038528, 7005519, 6972387, 6944204, 6924246, 6913809, 6912824, 6920517, 6935812, 6957277, 6982752, 7009340, 7034103, 7054930, 7070916, 7082256, 7089899, 7095006, 7098553, 7101527, 7105435, 7112151, 7122966, 7138012, 7156827, 7179382, 7206445, 7239106, 7278122, 7323776, 7376501, 7437809, 7510534, 7598110, 7703913, 7831498, 7985095, 8169536, 8390238, 8653993, 8969733, 9348376, 9802758, 10348860, 11007399, 11804418, 12771865, 13949405, 15385996, 17139540, 19275743, 21867027, 24988508, 28709717, 33087413, 38164083, 43967155, 50502358, 57745965, 65642800]
57085F5642800Q456558Q854899Q982258Q717637P986643O797131N230534L415300
57077A24083760J507018l36764j999100l435526m658703n688463o519357p131675
57069I5821190p519108p697069p689983p519327p203841o765609o233518n642013
57061C9550722n026401m417365l838132l305027k828402k412237k054575j750321
57053A3918262j493907j279586j100779r50769q24129p17145o27124n51577m87754
57044E885492m32872l85001l43442l07702k76463k48285k22927k01003j82498
57035C285299j66498j52239j39435j27786j17099j07774j00148r3484q6672p9749
57025B114415p3670o8700o4167n9743n5719n2097m8575m5400m3019m0892l7990
$$ y = [65642800, 74099358, 82954257, 91936515, 100654152, 108640795, 115437926, 120668460, 124083760, 125590778, 125254014, 123254914, 119819388, 115160685, 109472222, 102952865, 95821190, 88302082, 80605013, 72915030, 65395703, 58191862, 51426253, 45192735, 39550722, 34524321, 30106956, 26268824, 22963797, 20135395, 17723158, 15668583, 13918262, 12424355, 11144769, 10043990, 9093221, 8269092, 7551947, 6924823, 6373246, 5885492, 5452620, 5067619, 4724177, 4416475, 4140012, 3891727, 3668800, 3467797, 3285299, 3118801, 2966562, 2827127, 2699341, 2582242, 2474468, 2374320, 2280836, 2194164, 2114415, 2040745, 1972045, 1907878, 1848135, 1792416, 1740319, 1691744, 1646344, 1603325, 1562433, 1524443]
57014A524443l4511l1777l0225k8800k6520k3306j9098j3550o945j4P613J7462
57002A334772L0385M6071O4746Q7800J16137J49158J85033K18579K37243K22815
56992B692739J63006O3878n0047j49302k14671k42714k41083k20612j90423j57221
56982A453550j26348j01768q5009p4946o9181o5329o1262n5311m7126l7905k9206
56971G00159k1778j5783j1394q595o794n193l366j187J411M323P396J0872J5312
56958F65383K0771K6376L0631L1608K7124J6123M33j5672k8329l6085l9211l8393
56946F60759l4774l0081k5544k1122j6441j1826p735l816N29N260J0054J5105
56934E40368K0818K7152L3845M0567M5923M6871M0392K5912N890j5477l3832m5993
$$ y = [1524443, 1489932, 1458155, 1427930, 1399130, 1372610, 1349304, 1330206, 1316656, 1309711, 1309697, 1317310, 1334772, 1365157, 1411228, 1475974, 1563774, 1679911, 1829069, 2014102, 2232681, 2469924, 2692739, 2855745, 2919623, 2869576, 2720274, 2505603, 2262889, 2021806, 1801194, 1610771, 1453550, 1327202, 1225434, 1140425, 1065479, 996298, 930969, 869707, 814396, 767270, 729365, 700159, 678381, 662598, 651204, 642609, 635815, 630622, 627256, 626069, 627480, 631803, 639199, 650071, 665383, 686154, 712530, 743161, 774769, 801893, 818016, 818449, 802777, 774448, 738363, 699152, 660759, 625985, 595904, 570360, 549238, 532797, 520971, 513236, 509420, 509949, 515209, 525263, 540368, 561186, 588338, 622183, 662750, 708673, 755544, 795936, 821848, 827738, 812261, 778429, 732436]
56922G32436n1201n1064m7778m2645l6543l0776k6259k2506j8583j4774j2164
56911C78143j0869r861q469o958n651m465l464k935k729k293j470n76L50J650
56897C20403L258M572N296N837O716Q107J0137J2994J6626K0682K4840K8687L1231
56884D99386L1051K7162J9559R193k158j2133j8796k1760k2083k0978j8943j6008
56872D53492j2316q281m352o49L281Q084J3747J9544K5130L1197L8524M6819N5000
56859F69220O1826O5133O1308M7439K4618j883k6083m4271n4963n7892n4272m6953
56847F43227l8800l0884k2780j4203n545K930J1482K0351K9493L9012M9474O1496
56835G45253P5089Q9251J01606J08137J03731Q4260M9505M892l9975p5582r6727
$$ y = [732436, 681235, 630171, 582393, 539748, 503205, 472429, 446170, 423664, 405081, 390307, 378143, 367274, 357413, 348944, 341986, 336335, 331870, 328406, 325471, 322742, 320449, 318979, 318403, 318753, 320403, 323661, 328233, 333529, 339366, 346082, 354189, 364326, 377320, 393946, 414628, 439468, 468155, 499386, 530437, 557599, 577158, 586351, 584193, 572060, 553264, 531504, 509421, 488443, 469500, 453492, 441176, 432895, 428543, 427894, 431175, 439259, 453006, 472550, 497680, 528877, 567401, 614220, 669220, 731046, 796179, 857487, 904926, 929544, 927661, 901578, 857307, 802344, 744452, 690180, 643227, 604427, 573543, 550763, 536560, 531015, 533945, 545427, 565778, 595271, 634283, 683757, 745253, 820342, 909593, 1011199, 1119336, 1223067, 1307327, 1356832, 1361724, 1321749, 1246167, 1149440]
56824A149440j03676j00173r0567p8205o5185n2567m0611k9169j8173p897J363
56813E64580R868J8566K8362L9353N1015O2896P4227Q2454Q2924P1220M6435J2513
56801A144413k3305n3483p3063q1251q0721p5019o6474n6356m6036l6880k9168
56790E22657k2159j5403r166l465K447R110J6118K2859K9383L5819M0974M2216
56778F71390L6951K4334O028j4284l2276m4717n0562n0770m7222m1734l5657k9940
56766C91541k5111k1168j7686j4352j1382r185p671o344n121m512m693m891m230
56753B55195k855j664j129r80r55j166j699k336k847l212l434l425l166k721k129
56738B21477j535j300j692k471l110l310l069k419j499p39m71m59k48J00J45j22
$$ y = [1149440, 1045764, 945591, 855024, 776819, 711634, 659067, 618456, 589287, 571114, 563217, 564580, 574448, 593014, 621376, 660729, 711744, 774640, 848867, 931321, 1014245, 1085465, 1131900, 1144413, 1121108, 1067625, 994562, 913311, 832590, 757571, 691097, 634741, 588705, 551825, 522657, 500498, 485095, 475929, 472464, 474911, 484021, 500139, 522998, 552381, 588200, 629174, 671390, 708341, 732675, 738703, 724419, 692143, 647426, 596864, 546094, 498872, 457138, 421481, 391541, 366430, 345262, 327576, 313224, 301842, 292657, 284986, 278642, 273521, 269009, 264316, 259425, 255195, 252340, 250676, 249547, 248567, 247612, 246446, 244747, 242411, 239564, 236352, 232918, 229493, 226327, 223606, 221477, 219942, 218642, 216950, 214479, 211369, 208059, 204990, 202571, 201072, 200333, 199862, 199403, 199155, 199255, 199400, 199278]
56722A99278j40L79J000J101N66j90n67j56Q96J907K289K115J809J510J101O98
56706B13596N33M61K17pK38Q53J225J110Q63P57P12P34R11R25L31m77m91M23J157
56687B24071R98Q09J721L257L782K627Q87K9L37R53J023M66k69r02j616k565l386
56670B32222l518k993k441k259k170j808j302r92r04q30p22p07q24r70j008q21
56654B07953m02rL3k67n47n76n04n15n04k77J22M46M96K53j09l43l90m76p64j028
56634B02592r43n45j40J33K62J30k43m40k26j52q67j972k418j997j482j171m91
56617A90030O32J214O92j4J56Q39J039P87R00J431J641J329J164J471J721J436
56601B06468R04N93M93K92j03n63q72q06k78M91J193J793K332K476J798N30m49
$$ y = [199278, 199138, 199517, 200517, 201618, 202184, 201994, 201427, 201271, 202167, 204074, 206363, 208478, 210287, 211797, 212898, 213596, 214129, 214590, 214807, 214800, 215038, 215891, 217116, 218226, 219089, 219846, 220558, 221292, 222203, 223128, 223459, 222982, 222491, 222914, 224071, 225069, 225878, 227599, 230856, 234638, 237265, 238152, 238181, 238518, 239471, 240494, 240960, 240691, 239789, 238173, 235608, 232222, 228704, 225711, 223270, 221011, 218841, 217033, 215731, 214739, 213835, 213005, 212283, 211576, 210752, 209782, 208774, 207953, 207551, 207542, 207575, 207308, 206761, 206185, 205681, 205166, 204662, 204385, 204507, 204953, 205449, 205702, 205593, 205250, 204860, 204384, 203620, 202592, 201649, 201104, 200964, 201097, 201359, 201489, 201246, 200806, 200580, 200428, 199561, 197589, 195171, 193174, 191692, 190521, 190030, 190662, 191876, 192568, 192554, 192710, 193549, 194588, 195375, 196275, 197706, 199347, 200676, 201840, 203311, 205032, 206468, 207372, 207965, 208458, 208750, 208647, 208084, 207212, 206406, 206128, 206619, 207812, 209605, 211937, 214413, 216211, 216741, 216292]
56584B16292n90j94K41O68J193J583J634J763K589L885M603M142L200K934L590
56569B47533M409M775M894N221N772O298O827P575Q438R053R266R239R043Q522
56555C46865P645O666N828N051M080K792J306j40j418k607l800m866n628o272
56541C55502p125p963q042p185o276o154o590o935p242p797q072p279n837n002
56527B58003m992m675l404j980j392j658k392l457m406m365l329k608l086l808
56513B12451l376k006j075j046j137p96l98m03q01j439k134k380j764o84j6M3
56497A93039J07N13Q20N63m0l52P0J204K488L076K646J945J970K669L055K597
56481B16370J789J278J172J469K338L490L962L214K034J619K060K430K238K006
$$ y = [216292, 215702, 215508, 215749, 216417, 217610, 219193, 220827, 222590, 225179, 229064, 233667, 237809, 241009, 243943, 247533, 251942, 256717, 261611, 266832, 272604, 278902, 285729, 293304, 301742, 310795, 320061, 329300, 338343, 346865, 354510, 361176, 367004, 372055, 376135, 378927, 380233, 380093, 378675, 376068, 372268, 367402, 361774, 355502, 348377, 340414, 332372, 325187, 318911, 312757, 306167, 299232, 291990, 284193, 276121, 268842, 263005, 258003, 253011, 248336, 244932, 242952, 241560, 239902, 237510, 234053, 229647, 225282, 221953, 219345, 216259, 212451, 209075, 207069, 205994, 204948, 203811, 203015, 202617, 202214, 201413, 199974, 197840, 195460, 193696, 193012, 192996, 193039, 193146, 193659, 194479, 195042, 195002, 194650, 194720, 195924, 198412, 201488, 204134, 206079, 208049, 210718, 213773, 216370, 218159, 219437, 220609, 222078, 224416, 227906, 231868, 235082, 237116, 238735, 240795, 243225, 245463, 247469]
56467B47469K248K615K507K007J662J593J437J192J422K370L301L266K272J178
56453B76539N32O5n66j066r06j01P48J080Q81N69N51Q62J167J173Q94M93j0o35
56435B82270j294j990k943m117m875m644l796l189k946k470j720j492k135k874
56421B41785k867k273j670j118m32J44K51L4k53q01j780k599k474j508n99k80
56405B23560k78j51J85N64P58O35L63L96Q68J297J227R53J099J672K093J988J532
56388B38761J096J041J645K704L356K922J871J337J682K130J952J399J135J257
56374B64288J359J334J532K095K489K093J117M53M94O02J10n79o01K2M72N12O96
56357B78488J198J438J249J286J782J932J261O37R90J830K021J501J132J390K135
$$ y = [247469, 249717, 252332, 254839, 256846, 258508, 260101, 261538, 262730, 264152, 266522, 269823, 273089, 275361, 276539, 277071, 277136, 276570, 275504, 274598, 274497, 275245, 276325, 277206, 277775, 278326, 279188, 280355, 281528, 282422, 282915, 282905, 282270, 280976, 278986, 276043, 271926, 267051, 262407, 258611, 255422, 252476, 250006, 248286, 246794, 244659, 241785, 238918, 236645, 234975, 233857, 233425, 233569, 233820, 233854, 233601, 232800, 231020, 228421, 225947, 224439, 223840, 223560, 223282, 223131, 223316, 223880, 224638, 225273, 225636, 226032, 226900, 228197, 229424, 230377, 231476, 233148, 235241, 237229, 238761, 239857, 240898, 242543, 245247, 248603, 251525, 253396, 254733, 256415, 258545, 260497, 261896, 263031, 264288, 265647, 266981, 268513, 270608, 273097, 275190, 276307, 276760, 277254, 277856, 277966, 277387, 276786, 276808, 277280, 277792, 278488, 279686, 281124, 282373, 283659, 285441, 287373, 288634, 289271, 290261, 292091, 294112, 295613, 296745, 298135, 300270]
56342C00270L294M688N617N620N370N743O330O047N011M529N145N969O214O220
56328C76067O478O610N996M846M004M025M710N359N327M615L894L681L634L029
56314D42275J729J85j298k634l461l316k367j361p73m89k59J5L91Q28J114J232
56298D31811J638K621L750M471M905N447N946O129O423P479R081J0474J1517J2586
56284E24278J3562J4044J4415J5566J7519J9447K1084K2973K5212K7150K8639
56273G43889L0486L3278L6771M0806M5739N1497N7208O2466O8126P5243Q3852
56262A329361R3375J03522J14261J25338J36327J46753J55900J63025J68026J71301
56252B707189J72731J71245J65660J55462J40778J22347J01582P9901N7794L5343
$$ y = [300270, 303564, 308252, 313869, 319489, 324859, 330602, 336932, 342979, 347990, 352519, 357664, 363633, 369847, 376067, 382545, 389155, 395151, 399997, 404001, 408026, 412736, 418095, 423422, 428037, 431931, 435612, 439246, 442275, 444004, 444189, 442891, 440257, 436796, 433480, 431113, 429752, 428979, 428490, 428231, 428246, 428637, 429465, 430579, 431811, 433449, 436070, 439820, 444291, 449196, 454643, 460589, 466718, 473141, 480620, 489701, 500175, 511692, 524278, 537840, 551884, 566299, 581865, 599384, 618831, 639915, 662888, 688100, 715250, 743889, 774375, 807653, 844424, 885230, 930969, 982466, 1039674, 1102140, 1170266, 1245509, 1329361, 1422736, 1526258, 1640519, 1765857, 1902184, 2048937, 2204837, 2367862, 2535888, 2707189, 2879920, 3051165, 3216825, 3372287, 3513065, 3635412, 3736994, 3816895, 3874689, 3910032]
56242C910032J3631n393k0770l3138m3204n0761n5807n9493o3025o6460o9497
56231C456115p2736p7184q2964q9433r6266j03423j10315j15820j19356j21332
56221B467286j22395j22579j21348j18336j13860j08622j02950r6636q9740q3060
56211A387760p7245p1797o5765n9178n2953m7485m2302l7228l2899k9751k7326
56200H43831k4956k2441j9822j7074j4439j2403j1106j0169r168p898o218m362
56188F83775l149l066l255k379m35J358K379L132L915M320M339M638N358N786
56174G06716N679N709O111O138N341M265L357K270R28R0K31Q73J564K501L616
56159G55389M317M708N836Q035J0257J1765J3218J5205J7101J8405J9953K2700
$$ y = [3910032, 3923663, 3918270, 3897500, 3864362, 3821158, 3770397, 3714590, 3655097, 3592072, 3525612, 3456115, 3383379, 3306195, 3223231, 3133798, 3037532, 2934109, 2823794, 2707974, 2588618, 2467286, 2344891, 2222312, 2100964, 1982628, 1868768, 1760146, 1657196, 1560560, 1470820, 1387760, 1310515, 1238718, 1172953, 1113775, 1060822, 1013337, 971035, 933807, 900908, 871157, 843831, 818875, 796434, 776612, 759538, 745099, 732696, 721590, 711421, 702253, 694355, 688137, 683775, 680626, 677560, 674305, 671926, 671491, 672849, 675228, 678360, 682275, 686595, 690934, 695572, 700930, 706716, 712395, 718104, 724215, 730353, 735694, 739959, 743316, 745586, 746514, 746604, 746835, 747708, 749272, 751773, 755389, 759706, 764414, 770250, 778285, 788542, 800307, 813525, 828730, 845831, 864236, 884189, 906889]
56147I06889K6385L0579L5968M3397N2678O3592P7142R4496J15352J38367J62151
56136A746996J84637K02391K12194K12877K04698J88052J64370J37607J13041
56127C366863R4399Q2704P6874P3888O9081N8287M0515J8182m790k4557l8414
56116C813032m6348n1738n9388p2549r1815j15782j41359j64128j80064j87403
56106B702458j86528j78692j65689j50050j34141j18947j04378r0447p7522o5945
56096A430119n6109m8388m2373l6839l1090k5632k1008j6945j3349j0871r540
56085A117975q072n668l378k337j795m12J531K821L382L993M659M952N363O655
56071A129669Q288R072R058R317J0188J1117J1853J2522J2919J2969J3407J4725
$$ y = [906889, 933274, 963853, 999821, 1043218, 1095896, 1159488, 1236630, 1331126, 1446478, 1584845, 1746996, 1931633, 2134024, 2346218, 2559095, 2763793, 2951845, 3116215, 3253822, 3366863, 3461262, 3543966, 3620840, 3694728, 3763809, 3822096, 3862611, 3880793, 3876003, 3851446, 3813032, 3766684, 3714946, 3655558, 3583009, 3491194, 3375412, 3234053, 3069925, 2889861, 2702458, 2515930, 2337238, 2171549, 2021499, 1887358, 1768411, 1664033, 1573586, 1496064, 1430119, 1374010, 1325622, 1283249, 1246410, 1215320, 1189688, 1168680, 1151735, 1138386, 1127515, 1117975, 1109903, 1104235, 1100857, 1098520, 1096725, 1096313, 1097844, 1100665, 1104047, 1108040, 1112699, 1117651, 1123014, 1129669, 1137957, 1147029, 1156087, 1165404, 1175592, 1186709, 1198562, 1211084, 1224003, 1236972, 1250379, 1265104]
56059A265104J6055J6437J6547J7694J9712K1350K2281K3195K4334K5354K6337
56048A494400K7616K8967L0142L1549L3288L4299L3874L3210L3956L5982L7951
56037A855234L9352M0459M1153M1228M1043M0470L8399L4783L1875L1643L3271
56026B268910L5089L7392M1022M4775M7016M8701N1862N5989N8911O0519O2623
56015B812809O5685O8672P1737P6020Q0973Q4857Q7780R1467R6199J00744J05100
56004C742043J10439J16477J21842J26898J33317J40969J48217J55094J63207
55995D958503J72561J81656J90686K01470K14099K26832K39427K53340K68703
55986F907277K84402L01298L21797L45968L71581L98324M28404M62683M99975
$$ y = [1265104, 1281159, 1297596, 1314143, 1331837, 1351549, 1372899, 1395180, 1418375, 1442709, 1468063, 1494400, 1522016, 1550983, 1581125, 1612674, 1645962, 1680261, 1714135, 1747345, 1781301, 1817283, 1855234, 1894586, 1935045, 1976198, 2017426, 2058469, 2098939, 2137338, 2172121, 2203996, 2235639, 2268910, 2303999, 2341391, 2382413, 2427188, 2474204, 2522905, 2574767, 2630756, 2689667, 2750186, 2812809, 2878494, 2947166, 3018903, 3094923, 3175896, 3260753, 3348533, 3440000, 3536199, 3636943, 3742043, 3852482, 3968959, 4090801, 4217699, 4351016, 4491985, 4640202, 4795296, 4958503, 5131064, 5312720, 5503406, 5704876, 5918975, 6145807, 6385234, 6638574, 6907277, 7191679, 7492977, 7814774, 8160742, 8532323, 8930647, 9359051, 9821734, 10321709]
55977A0321709N40657N87222O40537O99386P64481Q39089R24713J020106J125976
55968A7463876J247068J388399J553098J745744J974616K249168K578921K977668
55960C3178558L467231M075807M835093N780520O951609Q389314J0137365J2257990
55952H9073487J4855758J8080867K2091574K6994910L2780000L9165660M5257474
55945B88299730M9173862M8199266L9936599K4045197L216539j7717108l4126734
55938D01027351m3659082m6638340m4957624m0701447l5427283l0093471k5199642
55931A34350462k0923804j7269138j4194947j1659407r598880p929380o578320
55924D6196586n492980m622291l914895l335501k864419k480462k159132j885998
$$ y = [10321709, 10862366, 11449588, 12090125, 12789511, 13553992, 14393081, 15317794, 16337900, 17463876, 18710944, 20099343, 21652441, 23398185, 25372801, 27621969, 30200890, 33178558, 36645789, 40721596, 45556689, 51337209, 58288818, 66678132, 76815497, 89073487, 103929245, 122010112, 144101686, 171096596, 203876596, 243042256, 288299730, 337473592, 385672858, 425609457, 449654654, 452871193, 435154085, 401027351, 357368269, 310729929, 265772305, 225070858, 189643575, 159550104, 134350462, 113426658, 96157520, 81962573, 70303166, 60704286, 52774906, 46196586, 40703606, 36081315, 32166420, 28830919, 25966500, 23486038, 21326906, 19440908]
55916A9440908j656772j463938j295666j147262j021373r16263q24323p42228
55908A0373083o72437o13963n60862n10773m66594m28725l93375l59562l30573
55899F036219l07078k85301k63338k43486k27045k12191j97996j85696j75029
55890C939059j63962j52764j43929j37464j30555j22336j14827j08771j02666
55881B761785r6377r1510q7742q2813p6673p1815o8781o5245o0236n5599n2434
55870A952560m9623m6844m5672m6623m8004m8579m8627m7941m5638m2462m0355
55859A442192l9161l6737l2711k8974k5730k0275j0927M71J0799J7742J8927J2226
55847A307842j278j6841k9895l8812m3482m3941m1482l8705l6841l4814l1777
$$ y = [19440908, 17784136, 16320198, 15024532, 13877270, 12855897, 11939634, 11115311, 10373083, 9700646, 9086683, 8525821, 8015048, 7548454, 7119729, 6726354, 6366792, 6036219, 5729141, 5443840, 5180502, 4937016, 4709971, 4497780, 4299784, 4114088, 3939059, 3775097, 3622333, 3478404, 3340940, 3210385, 3088049, 2973222, 2864451, 2761785, 2665408, 2573898, 2486156, 2403343, 2326670, 2254855, 2186074, 2120829, 2060593, 2004994, 1952560, 1902937, 1856093, 1810421, 1763798, 1715794, 1667215, 1618588, 1570647, 1525009, 1482547, 1442192, 1403031, 1366294, 1333583, 1304609, 1278879, 1258604, 1247677, 1248148, 1258947, 1276689, 1295616, 1307842, 1306564, 1289723, 1259828, 1221016, 1177534, 1133593, 1092111, 1053406, 1016565, 981751, 949974]
55836I49974k8675k6217k3491j9899j6623j4823j3896j2739j1340j0052q659p182
55824G56378o317o266o265n997o135o844p132o376n161l983k490o98L95K45m35
55809F92919r78j743l166m966o803q615r895r841q641p365o374n150l895l679
55795F11808m649n762o711q246j0040j0260q304o169n770o470o606o062n805n879
55781E15075n481m379l082k101k006l636p226j1739j5710j8352j9481j9145j7890
55768C84847j6601j5522j4058j2008j0086q798p717o422n283m726m548m474m528
55755B70076m417l549k140j237r50J68L157O947R511R883Q253N024Q47l021n509
55740B93043o660p200p544p628p242o151m406k779k128k138j715q39q26k225l685
$$ y = [949974, 921299, 895082, 871591, 851692, 835069, 820246, 806350, 793611, 782271, 772219, 763560, 756378, 750061, 743795, 737530, 731533, 725398, 718554, 711422, 705046, 699885, 695902, 693412, 692714, 693109, 693354, 692919, 691941, 690198, 687032, 682066, 675263, 666648, 656753, 646912, 638271, 630906, 624532, 619382, 615487, 611808, 607159, 601397, 594686, 586440, 576400, 566140, 557836, 551667, 545897, 539427, 532821, 526759, 520954, 515075, 509594, 505215, 502133, 500032, 498026, 494390, 487164, 475425, 459715, 441363, 421882, 402737, 384847, 368246, 352724, 338666, 326658, 316572, 307774, 300057, 293635, 288352, 283626, 279078, 274604, 270076, 265659, 262110, 259970, 258733, 257783, 257951, 261108, 268055, 277566, 287449, 295702, 300726, 301573, 298552, 293043, 286383, 279183, 271639, 264011, 256769, 250618, 246212, 243433, 241305, 239167, 237452, 236613, 235787, 233562, 229877]
55725B29877l854l209l034l508l875l804l504l089k749k914l454l371k166p68
55711A86578k31j61N44K012L534M862O170P143P161O349N452M781L994K853J457
55696B42498j22j815l323m362n009n371n320m864m305l562k035K55K166K826K856
55681B10513L370M326M922N068N355N887O280O609P271P958P863O970O228O267
55667B94887O756P137P218O896O038M809L576K285N36j580l315m082m015l556
55653C23590k960k436k349k954m080n218n904o078o181o732p742q677r169r463
55639B43647r930j0455j0611j0234r498q673q002p575p075o035m651l778l797
55626A43333l934l320k269j844k375l125l270k671j792j314j697k641l219k889
$$ y = [229877, 226023, 222814, 219780, 216272, 212397, 208593, 205089, 202000, 199251, 196337, 192883, 189512, 187346, 186578, 186347, 186186, 186730, 188742, 192276, 197138, 203308, 210451, 217612, 223961, 229413, 234194, 238188, 241041, 242498, 242376, 240561, 237238, 232876, 227867, 222496, 217176, 212312, 208007, 204445, 202410, 202665, 204831, 207657, 210513, 213883, 218209, 223131, 228199, 233554, 239441, 245721, 252330, 259601, 267559, 275422, 282392, 288620, 294887, 301643, 308780, 315998, 322894, 328932, 333741, 337317, 339602, 340138, 338558, 335243, 331161, 327146, 323590, 320630, 318194, 315845, 312891, 308811, 303593, 297689, 291611, 285430, 278698, 270956, 262279, 253110, 243647, 233717, 223262, 212651, 202417, 192919, 184246, 176244, 168669, 161594, 155559, 150908, 147130, 143333, 139399, 136079, 133810, 131966, 129591, 126466, 123196, 120525, 118733, 117419, 115722, 113081, 109862, 106973]
55612A06973k187j873j869j643j224j043r43l47O33J067M40o90j489j662j320
55597I2823n96K70Q90J080R57O21P7m69o28l49m1k2j82l34n32q12r37o74j64K12
55577I1190K43K4j23J47R50J955K578K573K417K907M338O069P114P147O783O646
55561A42958O406N192K970Q40l68j177k590m519n781n609m472l326k588k140j814
55546A23982j547j183n38M05J437K304K875L170L280L259L127K920K663K349K028
55531A50531J971K476L396M081L974L122J997R89K54j57l02m80j078k214l638
55516A64922n044o372p681q744q967q006o433n395n374n631n239m305l638l461
55502H0632l215k609k111k151k481k638k554k377k094j641j104n56m3J78j99r84
$$ y = [106973, 104786, 102913, 101044, 99401, 98177, 97134, 96191, 95844, 96477, 97544, 97984, 97294, 95805, 94143, 92823, 92227, 92497, 93387, 94467, 95424, 96045, 96122, 95653, 95025, 94676, 94635, 94613, 94431, 94097, 93565, 92753, 91816, 91142, 90978, 91190, 91433, 91457, 91334, 91481, 92431, 94386, 96964, 99537, 101954, 104861, 109199, 115268, 122382, 129529, 136312, 142958, 149364, 154556, 157526, 158366, 157998, 156821, 154231, 149712, 143931, 138322, 133850, 130524, 127936, 125796, 123982, 122435, 121252, 120714, 121119, 122556, 124860, 127735, 130905, 134185, 137444, 140571, 143491, 146154, 148503, 150531, 152502, 154978, 158374, 162455, 166429, 169551, 171548, 172537, 172791, 172634, 172332, 171852, 170774, 168560, 164922, 159878, 153506, 145825, 137081, 128114, 120108, 113675, 108280, 102906, 97275, 92036, 87731, 84093, 80632, 77417, 74808, 72697, 70546, 68065, 65427, 62873, 60496, 58402, 56761, 55657, 55101, 55058, 55236, 55037, 54053]
55486E4053j510j399r58o38o49j057j708j860p54J119K082J142p82k027j994j255
55470D1805n51l25p91j632k006j431m19K69N45O10L13m00q40l55N64P97J27o02
55452C5678p26l86L2K55O4m86p57j76Q85J484J345R68O21L4q32j505j674j484
55434C3340j063m04K17L76K69O29J595K317K020R25j68p61p70k43O08J335J566
55417D1788J266O12j29n51l30L54R44J186J363J724K064K123K024J988J911J471
55401E9808O07l79j168j718k190k585k588j871o52L32N41J48l39p25j096j415
55385D4710j567j600j542j174l87M09O87N58N32O76N05k19j083j561j504j074
55369C6366n09j19j25l71m68k68N0L06M89N56M23J30j85m41n92n70m41m04m03
$$ y = [54053, 52543, 51144, 50186, 49548, 48899, 47842, 46134, 44274, 43520, 44639, 46721, 47863, 47081, 45054, 43060, 41805, 41254, 40929, 40138, 38506, 36500, 35069, 34650, 34919, 35464, 36074, 36387, 35987, 35147, 34792, 35356, 36153, 36280, 35678, 34952, 34566, 34598, 34853, 34917, 34431, 33674, 33498, 34383, 35867, 37212, 38180, 38801, 38835, 38003, 36498, 34824, 33340, 32277, 31873, 32090, 32466, 32735, 33364, 34959, 37276, 39296, 40221, 40053, 39292, 38522, 38279, 38887, 40222, 41788, 43054, 43666, 43537, 42986, 42656, 43010, 43954, 45140, 46503, 48227, 50291, 52414, 54438, 56426, 58337, 59808, 60415, 60036, 58868, 57150, 54960, 52375, 49787, 47916, 47264, 47596, 48137, 48285, 47946, 47221, 46125, 44710, 43143, 41543, 40001, 38827, 38440, 38849, 39536, 40094, 40626, 41302, 41807, 41588, 40505, 38944, 37440, 36366, 35857, 35738, 35613, 35242, 34774, 34506, 34556, 34862, 35351, 35907, 36330, 36460, 36275, 35834, 35242, 34672, 34231, 33827, 33424]
55350C3424k8P73J330J022R5q11j536k124k056q16R42J758J152J66q5L37P02O35
55332C4880K21l88r82j292j268j089p36K7J089J844J778J008N9n28m09L09R74
55315C5497R90N30K57L12J88m05j078j340j102n28J06L63P5k02J89R11R88L19
55297C6070q7L23P76M49k60m38k6K94J52k49o56r54r93o70j33L51N86M40m1m27
55277C4507k58K92N84M77M86P61P27Q2n77o99o38r51j330j086k54M64O67N06K22
55258C3982k5k7K14L36J16j21p7o9m59q79p25k05r1m80n90R7J060J399Q56ll94
55237C3915J6Q31J284R47N4q51j355j166j95J068J619Q88n19j394j135j73O15
55220C4449O65J48j28M25J296J319K51p71p49j10J51k6m9Q0j38n33l69L77Q25
$$ y = [33424, 33396, 34169, 35499, 36521, 36616, 35805, 34269, 32145, 30089, 29273, 30215, 31973, 33125, 33291, 33206, 33543, 34245, 34880, 35101, 34713, 33731, 32439, 31171, 30082, 29346, 29373, 30462, 32306, 34084, 35092, 35151, 34623, 34214, 34523, 35497, 36487, 37017, 37274, 37586, 37774, 37369, 36291, 34951, 33849, 33321, 33427, 33790, 33865, 33663, 33852, 34763, 35751, 36070, 35983, 36306, 37082, 37531, 37271, 36833, 36807, 37101, 37253, 37004, 36348, 35394, 34401, 33731, 33598, 33949, 34535, 34975, 34934, 34507, 34249, 34541, 35125, 35602, 36088, 36849, 37576, 37658, 37081, 36382, 35744, 34793, 33463, 32377, 32123, 32587, 33254, 33760, 33982, 33957, 33930, 34144, 34480, 34596, 34475, 34398, 34329, 33870, 32991, 32266, 32061, 31970, 31490, 30900, 30997, 32057, 33456, 34312, 34309, 33915, 33931, 34762, 36046, 36993, 37047, 36196, 34841, 33675, 33480, 34548, 36167, 37055, 36536, 35142, 34007, 33834, 34449, 35114, 35262, 35134, 35559, 36855, 38174, 38425, 37654, 36905, 36795, 36946, 36920, 36871, 36951, 36813, 36280, 35911, 36288, 37113]
55201C7113N25M9QK56M43N64N99K18n70j064o86J73O68N47K17ok07n05q04r48
55181C6590q54m79N9L45j7q50j384j006jP43P04K47K1J00L3l85q35r93r18p53
55161C0367m24Q1M67N03M49P36J355J880J932J369K74r08j405q37J98O92L92O
55143C7127J91P38R42M41m65j158j191n82K51Q67J095R99P28N03N67R25J304J448
55125D4730J363J103O27Q5r7K10M25m8q92j172n72K11M08L2l81n55o42q34j038
55106D2963r32l11O24J353J484J102N89J95p2k53l11k17J0K89M85N46N81O56O34
55087D9415M97P34J749K871K800J364K0n9M37J98o12p13J68R38R15O71P61Q24
55069F2978M39m9k38l68o40o12j1M73Q0p38q84j88M77N42L13J38j91q29j366j317
$$ y = [37113, 37638, 37687, 37695, 37951, 38394, 38958, 39557, 39775, 39205, 38141, 37455, 37628, 38296, 38843, 39060, 39054, 38847, 38342, 37538, 36590, 35736, 35257, 35316, 35661, 35644, 34794, 33410, 32404, 32403, 33146, 33850, 34097, 34118, 34218, 34251, 33866, 33031, 32038, 31120, 30367, 29943, 30024, 30491, 30994, 31443, 32179, 33534, 35414, 37346, 38715, 38989, 38081, 36676, 35839, 36037, 36729, 37121, 37127, 37318, 38056, 38998, 39439, 38974, 37816, 36625, 36043, 36294, 37161, 38256, 39255, 39983, 40486, 41053, 41978, 43282, 44730, 46093, 47196, 47823, 47908, 47811, 48021, 48446, 48398, 47506, 46334, 45762, 45973, 46381, 46413, 46032, 45477, 44835, 44001, 42963, 42031, 41720, 42344, 43697, 45181, 46283, 46872, 47067, 46995, 46742, 46431, 46214, 46224, 46513, 46998, 47544, 48125, 48781, 49415, 49912, 50646, 52395, 55266, 58066, 59430, 59450, 59391, 59828, 60026, 59414, 58701, 58869, 59807, 60722, 61393, 62154, 62978, 63417, 63368, 63130, 62762, 62122, 61510, 61499, 61972, 62052, 61314, 60430, 60242, 60719, 61261, 61574, 61712, 61521, 60692, 59326, 58009]
55049E8009p67j64K27L48J58j73j82M12J137J203N21j42j39K68M13J72jJ69M31
55030F1900M60K61N2kK10O92J193J348J072O17J72k44m67k12L74O57L22k03m79
55011F7723p22j267j776j648r54l15J0K37M15L60K14L42N94L40n13j193j063m21
54993F0363L4Q1j6j3J86O04J066J196R13P06J041J671J902J476Q70O48Q61J196
54975G4785J534K010K605K943K816K625K943L730M410M855N641P063Q588R758
54961A36306J1112J3346J5966J7711J8269J8530J8996J8851J7046J3550R037L947
54949C12667j532o917j1476j4809j6950j8039j8141j7388j6058j4491j2960j1517
54937A52389j0054q608p452o643n674m097k322j211r09p00j05N90J078J670K758
$$ y = [58009, 57242, 57078, 57305, 57653, 57811, 57638, 57456, 57868, 59005, 60208, 60729, 60587, 60448, 60716, 61129, 61301, 61300, 61469, 61900, 62360, 62621, 62673, 62671, 62881, 63573, 64766, 66114, 67186, 67803, 67975, 67731, 67264, 67052, 67426, 68083, 68405, 68202, 67723, 67001, 65734, 63958, 62310, 61356, 61041, 61051, 61288, 61703, 62063, 62277, 62619, 63213, 63553, 63040, 61847, 60784, 60363, 60397, 60478, 60462, 60449, 60635, 61239, 62305, 63501, 64414, 65120, 66161, 67832, 69734, 71210, 72080, 72728, 73589, 74785, 76319, 78329, 80934, 83877, 86693, 89318, 92261, 95991, 100401, 105256, 110897, 117960, 126548, 136306, 147418, 160764, 176730, 194441, 212710, 231240, 250236, 269087, 286133, 299683, 308720, 312667, 311135, 304218, 292742, 277933, 260983, 242944, 224803, 207415, 191357, 176866, 163906, 152389, 142335, 133727, 126275, 119632, 113958, 109861, 107539, 106328, 105419, 104719, 104614, 105204, 106282, 107952, 110710]
54922A10710M192N580O805P856Q639R287J0297J1936J3882J5679J7094J7748J6921
54909B56626J4289J0372N844Q06m701r975j4157j7039j8786j9212j8164j6347
54897A69556j4776j3452j1523q858o559n554n441n232m592l782k848j618l20M28
54883H5429L38k32p64j047j017o07j7J53m67j328j420n92Q1l70j506k063j632
54866G2939j073j242j967k482k362j665o81J13K40k50o71m45K66Q84J040O32k60
54849F3016j113j174l71K97k2q02q26R1R15Q97M22J50P6j07l13k11J81N50Q11
54830F2467J135J546J794J714J504J487J667J670J181L92j18oN54J209J849K535
54814H2580L221L758M135M545N253O448Q052R675J0981J2160J3687J5518J7007
$$ y = [110710, 114902, 120482, 127287, 135143, 143782, 153069, 163366, 175302, 189184, 204863, 221957, 239705, 256626, 270915, 281287, 287131, 287937, 283236, 273261, 259104, 242065, 223279, 204067, 185903, 169556, 154780, 141328, 129805, 120947, 114388, 108834, 103393, 98161, 93569, 89787, 86939, 85321, 85001, 85429, 85767, 85535, 84771, 83724, 82707, 82100, 82083, 82236, 81769, 80441, 79021, 78429, 78510, 78140, 76634, 74571, 72939, 71866, 70624, 68657, 66175, 63813, 62148, 61467, 61580, 61820, 61570, 60899, 60454, 60720, 61604, 62644, 63276, 63016, 61903, 60729, 60358, 60655, 60633, 59831, 59005, 59096, 60011, 60908, 61330, 61480, 61556, 61449, 61136, 60925, 61106, 61656, 62467, 63602, 65148, 66942, 68656, 70160, 71647, 73314, 74984, 76165, 76557, 76439, 76433, 76987, 78196, 80045, 82580, 85801, 89559, 93694, 98239, 103492, 109940, 117992, 127667, 138648, 150808, 164495, 180013, 197020]
54801A97020J7791J8209J8383J7446J4395R456L876j436o383j0784j3975j5496
54789B48502j5592j4818j3587j2315j1362j0584r432p799o286n321m562l510k333
54776A31001j550j273j239j269j222p35M17J881L154M324N818P507Q791R650J0823
54761A76078J2685J4587J5877J6918J8362J9658J9290J6566J2457Q345M573P22
54749C36118l153o345q416r706j0811j1974j3072j3875j4130j3714j2886j2150
54737B05886j1733j1390j0849j0211r707r273q611p571o298n074m093l308k501
54724A05267j656j197j489k196k551k359k196k425k592k188j433p34M0J075J818
54709H5184J558O33N6L5k24j026j545j070j00N22Q71J536K357K467J580M34j96
$$ y = [197020, 214811, 233020, 251403, 268849, 283244, 292700, 296576, 295140, 288757, 277973, 263998, 248502, 232910, 218092, 204505, 192190, 180828, 170244, 160812, 153013, 146727, 141406, 136844, 133334, 131001, 129451, 128178, 126939, 125670, 124448, 123713, 124130, 126011, 129165, 133489, 139307, 146814, 155605, 165255, 176078, 188763, 203350, 219227, 236145, 254507, 274165, 293455, 310021, 322478, 330823, 335396, 336118, 332965, 326620, 318204, 308498, 297687, 285713, 272641, 258766, 244636, 230922, 218036, 205886, 194153, 182763, 171914, 161703, 151996, 142723, 134112, 126541, 120243, 115169, 111076, 107768, 105267, 103611, 102414, 100925, 98729, 96178, 93819, 91623, 89198, 86606, 84418, 82985, 82251, 82291, 83366, 85184, 86742, 87375, 87431, 87466, 87242, 86216, 84671, 83601, 83501, 84023, 84894, 86430, 88787, 91254, 92834, 93268, 93072]
54692I3072l83n75p57n18J63O26K83o18j151o85N05J580J933J556Q64L85M66R77
54674I7723J375J269Q85P36R71J423K082L015L846L966L514L504M488N609N598
54659A40004M441L355L132L239K814K016J820K660L781M073L374K580K581L320
54645A83190M079M460M775N546O914Q665J0435J1762J2311J2195J1795J0882Q499
54632B95508M194r26n198q315j1318j4571j6828j6925j5538j4264j3441j2105
54620A70273r971q184p614p455o287l958j615j73M13N62M88L47L17M29O10R92
54604A29174J709K380K275J248Np10q67q98j029j245j620k299l179l864l918l283
54588A13879k449k168k613l012k541j521j117j758k575k686k287j979j695j100
$$ y = [93072, 92689, 92114, 91357, 90839, 91002, 91628, 91911, 91293, 90142, 89457, 89962, 91542, 93475, 95031, 95895, 96280, 96746, 97723, 99098, 100367, 101252, 101988, 102959, 104382, 106464, 109479, 113325, 117291, 120805, 124309, 128797, 134406, 140004, 144445, 147800, 150932, 154171, 156985, 159001, 160821, 163481, 167262, 171335, 174709, 177289, 179870, 183190, 187269, 191729, 196504, 202050, 208964, 217629, 228064, 239826, 252137, 264332, 276127, 287009, 295508, 299702, 298776, 293578, 285263, 273945, 259374, 242546, 225621, 210083, 195819, 182378, 170273, 160302, 152118, 144504, 137049, 130762, 126804, 125189, 125016, 125429, 125991, 126479, 126826, 127143, 127572, 128182, 129174, 130883, 133263, 135538, 136786, 136791, 136081, 135214, 134316, 133287, 132042, 130422, 128123, 124944, 121080, 117162, 113879, 111430, 109262, 106649, 103637, 101096, 99575, 98458, 96700, 94125, 91439, 89152, 87173, 85478, 84378]
54574H4378n13n53j072j278q94m17k36j38Q8K44J57J8K8P1n9l07m37l23q9o2m27
54553G8179q22n68L68J038O85l8J68J392K337K095J295J040J465J964K293K766
54537I5657L482M006L907L369L102L683M938O075O487O316O000N598M943M151
54523A61714L358K110j25k866m865n675o041o436o249n081l913m002n064n655
54509A11210n091m015l180k579j981j514j350j311j119p68m15k07k66n89q51o26
54493H5348J20R50J492J742J799J560Q78r1r03j138o99J77J067J584J481P20m17
54476I5670j294j365p10M8M55O29P58O12o5r11j171o15J62L87j14r17j399j192
54458H8968m23L05L90k25r98j388j364j224j095p88l00j00o32j504j672o69O71
$$ y = [84378, 83865, 83312, 82240, 80962, 80068, 79651, 79415, 79277, 79365, 79609, 79766, 79784, 79812, 79883, 79824, 79517, 79080, 78757, 78668, 78606, 78179, 77357, 76789, 77157, 78195, 78880, 78842, 79010, 80402, 82739, 84834, 86129, 87169, 88634, 90598, 92891, 95657, 99139, 103145, 107052, 110421, 113523, 117206, 122144, 128219, 134706, 141022, 147022, 152620, 157563, 161714, 165072, 167182, 167057, 164191, 159326, 153651, 147610, 141174, 134925, 129844, 125931, 121929, 116865, 111210, 106119, 102104, 98924, 96345, 94364, 92850, 91500, 90189, 89070, 88302, 87887, 87680, 87414, 86825, 85974, 85348, 85468, 86418, 87910, 89652, 91451, 93011, 93889, 93798, 92895, 91757, 91058, 91235, 92302, 93886, 95367, 96087, 95670, 94376, 93011, 92301, 92349, 92804, 93433, 94191, 94803, 94738, 93827, 92656, 92041, 92203, 92590, 92476, 91559, 90160, 88968, 88545, 88850, 89240, 89015, 88017, 86629, 85265, 84041, 82946, 82158, 81858, 81758, 81126, 79622, 77950, 77281, 77952]
54441G7952J197Q26M26M32L81r3n74n15jN33Q27P09K9q27j012l33K27k04j061
54422G8919j159m25J62J65J68N94J055J111R25P97P57Q91J416K096K235J619R68
54405I2294R72J454J857K109K453K820K980L005L136L340L452L549L781M012M042
54390A35256L999M063L939L136J692K26p59j277j544j680j779j939k131k267k402
54375A36533k671l020l246l318l333l210k754k057j535j441j630j928k343k748
54361A01299k678j862p46r2p7k03n3K11L12M42J007J885K364J988J166P68J206
54344A06937K176L170L930M327M208L645L111L069L351L331K740K010J653J516
54330A49174R71j95j477k265k529k648k796k840k838l227m251n410n824n115l757
$$ y = [77952, 79149, 79975, 80401, 80833, 81214, 81121, 80547, 80032, 80031, 80564, 81391, 82100, 82129, 81302, 80290, 79957, 80184, 79980, 78919, 77760, 77335, 77497, 77662, 77830, 78424, 79479, 80590, 81515, 82312, 83069, 83960, 85376, 87472, 89707, 91326, 92294, 93266, 94720, 96577, 98686, 101139, 103959, 106939, 109944, 113080, 116420, 119872, 123421, 127202, 131214, 135256, 139255, 143318, 147257, 150393, 152085, 152311, 151552, 150275, 148731, 147051, 145272, 143333, 141202, 138935, 136533, 133862, 130842, 127596, 124278, 120945, 117735, 114981, 112924, 111389, 109948, 108318, 106390, 104047, 101299, 98621, 96759, 96013, 95921, 95844, 95641, 95588, 95799, 96111, 96553, 97560, 99445, 101809, 103797, 104963, 105731, 106937, 109113, 112283, 116213, 120540, 124748, 128393, 131504, 134573, 137924, 141255, 143995, 146005, 147658, 149174, 150145, 149950, 148473, 146208, 143679, 141031, 138235, 135395, 132557, 129330, 125079, 119669, 113845, 108730, 104973]
54315A04973k548j957j972k272k453k271j878j654j750j946k041k119k229k153
54301G5730j790j505j608j715j194k09L66K66L05J111J970J706L50q11q88l70
54285G1714k27o11r33q79q08j131j587j393j54J475K249J617L47l79k43J39L04
54268F9500M15O27N88K9o31p24j81M57P51P29O53P31R60J103Q79L65k0q7q5j64
54248G5895m8M04P22N24K51N30J045Q96op32o75k61j06j94k89m46p41r22q31o91
54228G4325o65n49k83k42o01q77o19r1K39M19N98L82n32j473j417m38L80N08M74
54209F9538O43M92l07r07l61Q46J248M00n14l42N00P36Q0m35k6P99J079O99K28
54190G4396j24n60q50m12O11J160O54j67k86K56P02P57O60M18j40p56r75r30j151
$$ y = [104973, 102425, 100468, 98496, 96224, 93771, 91500, 89622, 87968, 86218, 84272, 82231, 80112, 77883, 75730, 73940, 72435, 70827, 69112, 67918, 67709, 68075, 68341, 68646, 69757, 71727, 73433, 73783, 72972, 72084, 71714, 71487, 70876, 69943, 69064, 68256, 67125, 65538, 64145, 63991, 65466, 67715, 69332, 69679, 69300, 69057, 69196, 69500, 69915, 70542, 71130, 71159, 70528, 69804, 69623, 70080, 70831, 71560, 72213, 72944, 73904, 75007, 75886, 76251, 76231, 76144, 76059, 75895, 75847, 76251, 76973, 77497, 77748, 78278, 79323, 80219, 80213, 79481, 78806, 78545, 78439, 78245, 77956, 77510, 76769, 75847, 75016, 74325, 73660, 73111, 72828, 72586, 71985, 71108, 70489, 70398, 70637, 71056, 71654, 72036, 71504, 70031, 68614, 68176, 68556, 69064, 69538, 70181, 70673, 70366, 69459, 69098, 69944, 71192, 71592, 71078, 70736, 71236, 71972, 72052, 71617, 71591, 72390, 73469, 74168, 74396, 74272, 73712, 72862, 72450, 73061, 74221, 74875, 74708, 74422, 74678, 75380, 76137, 76797, 77215, 77075, 76319, 75344, 74414, 73263]
54171G3263j628j703j057j05O71J160J264P78l9l68K36J187J557J143N75N28J042
54154G8504J461J040k30j374j428o14m6k51n94l72K25N87N48L02r4n60p31m39
54136G5934j83m86r80q24P3Q08O50j75r85j421j452j056l77J06m7o55j105j094
54118F6731q77o40r7R44J847J658L64q74j054m67n5j28k48j62j16k24k50j82l93
54099F5777r56j297r15m9O45Q41O68M21L72O23Q90P30Q7n97j024j295j405j017
54081F2499j24N99N94J93Q3L50N91O44O02L61j68n72l40L00O07L63Q2J74N61J100
54061F8499J739K135J857J181J019J635K135J631M83k44j31L36N79M82J87o6K6
54044H3483N65J208J508J494J608K082K678L047L128L061L043L258L711M065L934
$$ y = [73263, 71635, 69932, 68875, 68770, 69441, 70601, 71865, 72643, 72604, 72236, 72472, 73659, 75216, 76359, 76934, 77462, 78504, 79965, 81005, 80775, 79401, 77973, 77359, 77313, 77062, 76468, 76096, 76321, 76908, 77456, 77758, 77664, 77104, 76373, 75934, 75751, 75265, 74285, 73461, 73534, 74342, 74992, 74817, 73832, 72411, 70959, 69903, 69526, 69632, 69585, 68930, 67825, 66731, 65854, 65214, 65117, 66061, 67908, 69566, 69930, 69056, 68002, 67535, 67480, 67352, 67104, 66942, 66826, 66602, 66352, 66170, 65777, 64821, 63524, 62609, 62560, 63205, 64046, 64714, 65135, 65507, 66130, 67020, 67750, 67837, 67240, 66216, 64921, 63516, 62499, 62375, 62974, 63568, 63761, 63844, 64194, 64785, 65429, 66031, 66392, 66224, 65652, 65312, 65612, 66219, 66582, 66664, 66838, 67399, 68499, 70238, 72373, 74230, 75411, 76430, 78065, 80200, 81831, 82314, 82070, 81939, 82275, 82854, 83336, 83523, 83457, 83483, 84048, 85256, 86764, 88258, 89866, 91948, 94626, 97673, 100801, 103862, 106905, 110163, 113874, 117939, 121873]
54029A21873L463L362M134N433O424O655O399O133O036O006N901N568M834L722
54015A95943K632K000J793J596J203Q55P61P84P74R12J260J261K75j457k882l306
53999B04404k987k408j648q04n05j229k382k806k229j537j507j915k214k444k916
53984A74873l428l482l189l222l784m144l602k453j618j489j557j231o15l37p37
53969A39985j449j796j503r40o26o23n08P9J042J959K487K521K136J517Q84M10
53953A45575J73K14N25R47J283J598K134K919L617M024M396N006N616N754N402
53938A89183M996M832M895N202N822O440O386N333L661J908K36j428l004m292
53924B30170n093n136m233k759j567r97l40J247L481N169N511M755L648K796K625
$$ y = [121873, 125336, 128698, 132832, 138265, 144689, 151344, 157743, 163876, 169912, 175918, 181819, 187387, 192221, 195943, 198575, 200575, 202368, 203964, 205167, 206022, 206783, 207567, 208341, 209253, 210513, 211774, 212049, 210592, 207710, 204404, 201417, 199009, 197361, 196557, 196052, 194823, 192441, 189635, 187406, 185869, 184362, 182447, 180233, 177789, 174873, 171445, 167963, 164774, 161552, 157768, 153624, 150022, 147569, 145951, 144462, 142905, 141674, 141059, 140722, 139985, 138536, 136740, 135237, 134297, 133671, 133048, 132540, 132619, 133661, 135620, 138107, 140628, 142764, 144281, 145165, 145575, 145748, 145962, 146487, 147434, 148717, 150315, 152449, 155368, 158985, 163009, 167405, 172411, 178027, 183781, 189183, 194179, 199011, 203906, 209108, 214930, 221370, 227756, 233089, 236750, 238658, 238894, 237466, 234462, 230170, 225077, 219941, 215708, 212949, 211382, 210385, 210045, 211292, 214773, 219942, 225453, 230208, 233856, 236652, 239277]
53909B39277L329M557N555N890N868O058O588P058O946N943M168K197P40%m56
53894C03718j068j719j992j816j521j408j548j992k813l868m779n341n745o293
53880B61815o968p501p686p464o810n822m919m645n056n557n531m997m449m102
53866A80308l660k907k230k285l204m294m641m001l032k562k753l034k895k431
53852A36379j980j599j248j223j871k899l479l196k462j791j196n84k64n23r65
53837A11099q67j46N30N95K13j05q6J98N28O56M05j20n21m63n4K06o9p34j207
53818A10058j094o08k93k85j76L59J038J351J272J269J690K363K879L012K819
53803A25654K495K210K088K276K879L655L938L309K401K529M137O069O808O185
$$ y = [239277, 242606, 247163, 252718, 258608, 264476, 270534, 277122, 284180, 291126, 297069, 301237, 303434, 304174, 304174, 303718, 302650, 300931, 298939, 297123, 295602, 294194, 292646, 290654, 287841, 283973, 279194, 273853, 268108, 261815, 254847, 247346, 239660, 232196, 225386, 219564, 214645, 210000, 204944, 199387, 193856, 188859, 184410, 180308, 176648, 173741, 171511, 169226, 166022, 161728, 157087, 153086, 150054, 147492, 144739, 141705, 138810, 136379, 134399, 132800, 131552, 130329, 128458, 125559, 122080, 118884, 116422, 114631, 113435, 112851, 112587, 112064, 111099, 110232, 110086, 110616, 111211, 111424, 111319, 111233, 111431, 111959, 112615, 113020, 112900, 112379, 111916, 111862, 112068, 111999, 111265, 110058, 108964, 108356, 108063, 107778, 107602, 107961, 108999, 110350, 111622, 112891, 114581, 116944, 119823, 122835, 125654, 128149, 130359, 132447, 134723, 137602, 141257, 145195, 148504, 150905, 153434, 157571, 163640, 170448, 176633]
53789A76633N263M814M611M189L528K750J758O64J07O27J844K693K476J487N64
53774B14008J91J05k25r34j684k228k658k972k759j821p92n66j197j902k216k402
53758A89948k680k753k507k504l196m058m145l257k066j190p46p11j195k169l249
53743A53522l905l741k682j092L23R93R45O02K36j66n45o22k28M36R91J238J243
53726A47548J209J326J649K070K432K663K761K726K580K381K148J816J325O70
53712A75304j93j300k428l072k908k157j283n45p1j43r15j854j973q55Q42K057
53696A58506K338K033J739J798K136K383K135J368N23J28L31R09J558K114K516
53681A82515K780K972L100L036K683K214K030K373L033L519L527L182K848K758
$$ y = [176633, 181896, 186710, 191321, 195510, 199038, 201788, 203546, 204210, 204317, 204944, 206788, 209481, 211957, 213444, 214008, 214199, 214304, 214079, 213145, 211461, 209233, 206575, 203603, 200844, 199023, 198231, 197665, 196468, 194566, 192350, 189948, 187268, 184515, 182008, 179504, 176308, 172250, 168105, 164848, 162782, 161592, 160846, 160135, 158940, 156771, 153522, 149617, 145876, 143194, 142102, 142425, 143418, 144363, 144965, 145201, 145035, 144490, 143868, 143640, 144076, 145067, 146305, 147548, 148757, 150083, 151732, 153802, 156234, 158897, 161658, 164384, 166964, 169345, 171493, 173309, 174634, 175304, 175111, 173811, 171383, 168311, 165403, 163246, 161963, 161418, 161347, 161204, 160289, 158435, 156462, 155607, 156449, 158506, 160844, 162877, 164616, 166414, 168550, 170933, 173068, 174436, 174959, 175087, 175418, 176327, 177885, 179999, 182515, 185295, 188267, 191367, 194403, 197086, 199300, 201330, 203703, 206736, 210255, 213782, 216964, 219812, 222570]
53667B22570K878L098L374L619L530K791J479R4r17j516j900k160k278k313k341
53652B30008k250j861j265q01o62p38r41j339j796j812j102j77O1o43j604k035
53636B11043j822j388j072q78o63l15K01P49J078J111J064J140J185Q91K96j71
53620B12449j88J30M51O33P87J019J247J345J418J762K432K892K529J597J308
53605B31811K477M353N304M702L553L125L514L944M009L930L878L748L663M062
53591B86073M953N588N290M372L766L913M451M875N010M804M158L242K581K501
53577C45577K757K957L037L091K970K551K089J876J715J262P33O52R91J240J316
53562C74814J660K247K431K123K180L004L609K993J720J122J353J445J067J004
$$ y = [222570, 225448, 228546, 231920, 235539, 239069, 241860, 243339, 243433, 242516, 241000, 239100, 236940, 234662, 232349, 230008, 227758, 225897, 224632, 223831, 223169, 222431, 221490, 220151, 218355, 216543, 215441, 215264, 215325, 214682, 213078, 211043, 209221, 207833, 206761, 205883, 205220, 204905, 205106, 205855, 206933, 208044, 209108, 210248, 211433, 212324, 212620, 212449, 212261, 212391, 212842, 213475, 214262, 215281, 216528, 217873, 219291, 221053, 223485, 226377, 228906, 230503, 231811, 234288, 238641, 243945, 248647, 252200, 255325, 258839, 262783, 266792, 270722, 274600, 278348, 282011, 286073, 291026, 296614, 301904, 306276, 310042, 313955, 318406, 323281, 328291, 333095, 337253, 340495, 343076, 345577, 348334, 351291, 354328, 357419, 360389, 362940, 365029, 366905, 368620, 369882, 370615, 371267, 372258, 373498, 374814, 376474, 378721, 381152, 383275, 385455, 388459, 392068, 395061, 396781, 397903, 399256, 400701, 401768, 402772]
53548D02772J696K472K616K306K030J826J647J773K343K874K863K463K145K045
53534D33871K072K281K611K594J862Q08K82P11J807K971L728L935L918M248N051
53519D72750N730N735N338N296N858O550O937P151P598Q449R538J0548J1318J1966
53505E80762J2786J3900J5141J6237J7004J7364J7524J8048J9363K1043K2126
53494G71298K2359K2558K3424K4545K5201K5492K5950K6373K6013K4909K4098
53483A042220K4275K4931K5158K4762K4231K3925K3686K3186K2450K1962K2159
53472A302945K2803K3187K3075K3029K3343K3250K1826J9461J7530J6693J6336
53461A533478J5669J4583J3232J1619R855Q179O431M245J997P15N26N9j909m875
$$ y = [402772, 404468, 406940, 409556, 411862, 413892, 415718, 417365, 419138, 421481, 424355, 427218, 429681, 431826, 433871, 435943, 438224, 440835, 443429, 445291, 446099, 446381, 447092, 448899, 451870, 455598, 459533, 463451, 467699, 472750, 478480, 484215, 489553, 494849, 500707, 507257, 514194, 521345, 528943, 537392, 546930, 557478, 568796, 580762, 593548, 607448, 622589, 638826, 655830, 673194, 690718, 708766, 728129, 749172, 771298, 793657, 816215, 839639, 864184, 889385, 914877, 940827, 967200, 993213, 1018122, 1042220, 1066495, 1091426, 1116584, 1141346, 1165577, 1189502, 1213188, 1236374, 1258824, 1280786, 1302945, 1325748, 1348935, 1372010, 1395039, 1418382, 1441632, 1463458, 1482919, 1500449, 1517142, 1533478, 1549147, 1563730, 1576962, 1588581, 1598436, 1606615, 1613046, 1617291, 1619288, 1620003, 1620529, 1620588, 1618679, 1613804]
53447A613804p439r146j0548j1948j3069j3893j4840j5991j6961j7692j8689k0179
53435A443409k1633k2452k2705k2868k3143k3387k3465k3437k3406k3319k2899
53424A190695k1896k0493j9258j8418j7407j5594j3320j1606j0809j0185r043
53413A022666p677o737o201n468m181k414l27J817L483M303M724N671P535R854
53399A027048J2117J4340J6635J8665J9958K0591K1143K2112K3565K5314K7122
53388A248610K8769L0158L1405L2715L4196L5835L7592L9373M1055M2661M4425
53377A646794M6454M8461N0055N1201N2048N2455N2148N1380N0830N0701N0354
53366B202881M9312M8063M7323M6758M5223M2258L8673L5359L2151K8351K4037
$$ y = [1613804, 1606365, 1597219, 1586671, 1574723, 1561654, 1547761, 1532921, 1516930, 1499969, 1482277, 1463588, 1443409, 1421776, 1399324, 1376619, 1353751, 1330608, 1307221, 1283756, 1260319, 1236913, 1213594, 1190695, 1168799, 1148306, 1129048, 1110630, 1093223, 1077629, 1064309, 1052703, 1041894, 1031709, 1022666, 1014989, 1008252, 1002051, 996583, 992402, 989988, 989661, 991478, 994961, 999264, 1003988, 1009659, 1017194, 1027048, 1039165, 1053505, 1070140, 1088805, 1108763, 1129354, 1150497, 1172609, 1196174, 1221488, 1248610, 1277379, 1307537, 1338942, 1371657, 1405853, 1441688, 1479280, 1518653, 1559708, 1602369, 1646794, 1693248, 1741709, 1791764, 1842965, 1895013, 1947468, 1999616, 2050996, 2101826, 2152527, 2202881, 2252193, 2300256, 2347579, 2394337, 2439560, 2481818, 2520491, 2555850, 2588001, 2616352, 2640389]
53355B640389K0133J7164J4411J0668N629K56m224p474j0155j3048j6302j9523
53343B637924k2378k4970k7721l1008l4886l9030m2922m6107m8244m9095m8662
53332B222901m7410m6056m4965m3960m2875m1998m1717m1880m1931m1583m1012
53321A747514m0391l9564l8200l6088l3367l0699k8925k8048k6814k3959j9984
53310A401475j6849j5690j5592j5107j4247j4155j5155j6117j5797j4089j1823
53299A236854r762q114o649n083l449k112j259m63Q84K702M210M861M983N290
53285A222893O111P262Q464R556J0529J1603J3134J5215J7444J9258K0460K1289
53273A383218K2007K2665K3194K3487K3406K2902K2198K1635K1254K0634J9364
$$ y = [2640389, 2660522, 2677686, 2692097, 2702765, 2708394, 2708650, 2704426, 2696952, 2686797, 2673749, 2657447, 2637924, 2615546, 2590576, 2562855, 2531847, 2496961, 2457931, 2415009, 2368902, 2320658, 2271563, 2222901, 2175491, 2129435, 2084470, 2040510, 1997635, 1955637, 1913920, 1872040, 1830109, 1788526, 1747514, 1707123, 1667559, 1629359, 1593271, 1559904, 1529205, 1500280, 1472232, 1445418, 1421459, 1401475, 1384626, 1368936, 1353344, 1338237, 1323990, 1309835, 1294680, 1278563, 1262766, 1248677, 1236854, 1227092, 1218978, 1212329, 1207246, 1203797, 1201685, 1200426, 1199963, 1200847, 1203549, 1207759, 1212620, 1217603, 1222893, 1229004, 1236266, 1244730, 1254286, 1264815, 1276418, 1289552, 1304767, 1322211, 1341469, 1361929, 1383218, 1405225, 1427890, 1451084, 1474571, 1497977, 1520879, 1543077, 1564712, 1585966, 1606600, 1625964]
53262A625964J7529J5575J3752J1891R872Q054O912O321N453L626J033j548l633
53249A720801n321o775p890q646r479j0879j2752j4521j5911j7291j9101k1187
53237A571048k2922k3885k4213k4252k4081k3521k2525k1450k0857k1007k1547
53226A320788k1799k1348k0311j9034j7745j6582j5831j5728j6059j6209j5838
53215A124304j5241j4864j4614j3989j2881j1886j1661j2111j2491j2247j1522
53204I80797j0845j0544j0702j1489j3184j5609j7834j8836j8454j7475j6692
53193H19133j6191j5699j5246j5119j5285j5324j4957j4341j3796j3519j3599
53182F56057j4029j4533j4703j4531j4576j5320j6494j7255j7017j5926j4585
$$ y = [1625964, 1643493, 1659068, 1672820, 1684711, 1694583, 1702637, 1709549, 1715870, 1721323, 1724949, 1725982, 1724434, 1720801, 1715480, 1708705, 1700815, 1692169, 1682690, 1671811, 1659059, 1644538, 1628627, 1611336, 1592235, 1571048, 1548126, 1524241, 1500028, 1475776, 1451695, 1428174, 1405649, 1384199, 1363342, 1342335, 1320788, 1298989, 1277641, 1257330, 1238296, 1220551, 1203969, 1188138, 1172410, 1156351, 1140142, 1124304, 1109063, 1094199, 1079585, 1065596, 1052715, 1040829, 1029168, 1017057, 1004566, 992319, 980797, 969952, 959408, 948706, 937217, 924033, 908424, 890590, 871754, 853300, 835825, 819133, 802942, 787243, 771997, 756878, 741593, 726269, 711312, 696971, 683175, 669656, 656057, 642028, 627495, 612792, 598261, 583685, 568365, 551871, 534616, 517599, 501673, 487088]
53171D87088j3516j2828j2272j1575j0822j0411j0502j0586r863q058n776m084
53159C66795l779m907o686p953p950o844n414m294l605l240l090k999k782k486
53145C00766k371k477k448k022j428j037p87l31L60Q92J027J033J325J946K494
53130B96942K444J540P5j283k134k742l494m130m028l292k836l130l511l292l003
53115B64126l732n418o736o700n658m548l865l650l848m233m421m330m324m472
53101A98191m183l036j608r01j078j455j524j413j326j172r22q40j129j682k335
53086A73587k920l058k332r94k1j13q83j398j285r35q27j034j317j385j075n81
53070A53429m19q61j486j600j143p05o55o76m00p8k08p05j009q99p51q21p83l06
$$ y = [487088, 473572, 460744, 448472, 436897, 426075, 415664, 405162, 394576, 384713, 376655, 370879, 366795, 363016, 358109, 351423, 343470, 335520, 328676, 323262, 318968, 315363, 312123, 309033, 306034, 303252, 300766, 298395, 295918, 293470, 291448, 290020, 288983, 288196, 287865, 288225, 289117, 290144, 291177, 292502, 294448, 296942, 299386, 300926, 301001, 299718, 297584, 294842, 291348, 287218, 283190, 279898, 277062, 273932, 270421, 267129, 264126, 260394, 254976, 248240, 241540, 235882, 231334, 227469, 223819, 219971, 215738, 211317, 206987, 202663, 198191, 194008, 190972, 189364, 188463, 187385, 185930, 184406, 182993, 181667, 180495, 179573, 178733, 177604, 175922, 173587, 170667, 167609, 165277, 164283, 164262, 164149, 163266, 161868, 160583, 159648, 158821, 157787, 156470, 155085, 154010, 153429, 153010, 152149, 150663, 149063, 147920, 147215, 146560, 145884, 145484, 145406, 145198, 144493, 143484, 142585, 141834, 141013, 140230, 139924]
53052A39924K64K79l10q45p90k83K18M25K51k89r19j109o36P4M33M15M74Q16J125
53033A39517J008N01kj23K05P00R64Q66O05K96k36j010j480j096j72L37L5m09
53015A40506k64K88N47L58K09M07O69O59N25O76J199J753J988J890J652J371R84
52998A55417N00J64L26J169K546L952M722M544L865L559L988M569M526L825L077
52983B00749K645K269J579N79m66j376k108k666l025l093k778k204j712j404r71
52968A86018k44K67j31j327k448k873k721k326j801j276j071j247j424j213n99
52953A65584J73P55P14m8q15n95O17J689J748J172P83P24O33M10J78q3l11r1P53
52934A73990J603J707J179P39O86P46P40Q12J039J314J587J754J500P33k2k12
$$ y = [139924, 140188, 140467, 140157, 139312, 138522, 138239, 138457, 138882, 139133, 138844, 137925, 136816, 136180, 136254, 136687, 137102, 137576, 138392, 139517, 140525, 141026, 141024, 140901, 141106, 141806, 142770, 143636, 144241, 144537, 144301, 143291, 141811, 140715, 140543, 140880, 140915, 140506, 140242, 140530, 141077, 141435, 141644, 142051, 142720, 143379, 143904, 144580, 145779, 147532, 149520, 151410, 153062, 154433, 155417, 155917, 156081, 156407, 157576, 160122, 164074, 168796, 173340, 177205, 180764, 184752, 189321, 193847, 197672, 200749, 203394, 205663, 207242, 207821, 207355, 205979, 203871, 201205, 198180, 195087, 192309, 190105, 188393, 186989, 186018, 185774, 186041, 185910, 184583, 182135, 179262, 176541, 174215, 172414, 171138, 170067, 168820, 167396, 166183, 165584, 165757, 166512, 167226, 167178, 166363, 165768, 166385, 168074, 169822, 170994, 171777, 172501, 173134, 173544, 173722, 173639, 173328, 173237, 173990, 175593, 177300, 178479, 179218, 179904, 180650, 181390, 182202, 183241, 184555, 186142, 187896, 189396, 190129, 190107, 189895]
52918A89895k2j1j86j09K31L76J75q7l51p82j132q42JN54L08k58m28r9L76P17
52898A88326P84N81L93N17Q20R07Q43J033J426J467J042P06P74Q88Q59J065J625
52881B04056J852J235L03j74k24k11J19J196K594L357L250K877K626K257J643
52866B26756J192J261J709K175K487K663K768K844K746K181J158J81l30o05j051
52851B48135j450j294p49o09j210k011k380k244j817j274q35p36q67r21j011j607
52835B27120k611l184k818k053j680j716j693j613j864k439k835k751k397k076
52821A95390j855j683j475j075m01L19O94N89J20n69j315j764j660j298j272j689
52805A81056j988j716j084n86l67k41j17j25l59p35r75q31l90k45r34k095k587
$$ y = [189895, 189873, 189862, 189676, 189567, 189798, 190174, 190349, 190262, 189911, 189129, 187997, 187155, 187156, 187710, 188018, 187760, 187332, 187233, 187609, 188326, 189110, 189691, 190084, 190601, 191421, 192328, 193171, 194204, 195630, 197097, 198139, 198845, 199619, 200507, 201366, 202431, 204056, 205908, 207143, 207446, 207272, 207048, 206837, 206956, 208152, 210746, 214103, 217353, 220230, 222856, 225113, 226756, 227948, 229209, 230918, 233093, 235580, 238243, 241011, 243855, 246601, 248782, 249940, 250121, 249791, 249186, 248135, 246685, 245391, 244642, 244033, 242823, 240812, 238432, 236188, 234371, 233097, 232262, 231526, 230659, 229738, 228727, 227120, 224509, 221325, 218507, 216454, 214774, 213058, 211365, 209752, 207888, 205449, 202614, 199863, 197466, 195390, 193535, 191852, 190377, 189302, 188901, 189220, 189914, 190503, 190623, 190054, 188739, 186975, 185315, 184017, 182745, 181056, 179068, 177352, 176268, 175682, 175315, 175074, 174957, 174832, 174473, 173738, 172763, 171932, 171542, 171297, 170363, 168268, 165681]
52788A65681j830p32p17j958l084k831j456k76j48p53j293j394j229r86o44k38
52772A46112r9m67j035j179p48k39m4L9K35J42p55k103k916k786k305k094k020
52755A27738j678j149q51r28j204j519j723j506o71M18J002O18n03j681k270k033
52739A12060j250m80p8j1j22l26m57k14M65J206J614J686J622J468J290J373J860
52722A21706K368K418K071J742J509J201J007J412K383L157L000J829O0j723k852
52707A41288k961k503k403k885l190k740k118k256l027l385k808j941j571j604
52693A05896j455j047q98j259j731j895j886k028k117j658p10M4J71n8l09o83
52677H8377j249j551j216o53m81n67l46R7J14l72p09o19o03r35j076o47j62k36
$$ y = [165681, 163851, 163119, 162402, 160444, 157360, 154529, 153073, 152797, 152649, 151896, 150603, 149209, 147980, 146994, 146350, 146112, 146013, 145546, 144511, 143332, 142584, 142345, 142301, 142340, 142575, 142717, 141962, 139859, 136943, 134157, 131852, 129758, 127738, 126060, 124911, 124060, 123132, 121928, 120409, 118686, 117180, 116509, 116927, 117929, 118547, 118044, 116363, 114093, 112060, 110810, 110330, 110252, 110241, 110119, 109793, 109336, 109122, 109587, 110793, 112407, 114093, 115715, 117183, 118473, 119846, 121706, 124074, 126492, 128563, 130305, 131814, 133015, 134022, 135434, 137817, 140974, 143974, 145803, 145863, 144140, 141288, 138327, 135824, 133421, 130536, 127346, 124606, 122488, 120232, 117205, 113820, 111012, 109071, 107500, 105896, 104441, 103394, 102496, 101237, 99506, 97611, 95725, 93697, 91580, 89922, 89212, 89256, 89427, 89369, 89060, 88377, 87128, 85577, 84361, 83708, 83227, 82660, 82314, 82411, 82525, 82153, 81444, 80825, 80222, 79287, 78211, 77564, 77402, 77166]
52659G7166n68m83J5L90N22P26R55P36j0o79p68m56k42k93m21m22k18K70J074
52640G7294J925K255J693N91j68p5M51O56L72k2l29o77r74q54l34P7J70L33P67
52621H3151J009P03K78K87M65J84m97q87o42q1L80N22J98n15j083j027o26n13
52603H1306o36l08O62J579J830J558J131N58r5l18K21R72J136P36M90O65P01K20
52585I2408k41R0J089J784J465M40m20n74j20N13R10Q93O12N04Q95J626K173K195
52567A06242J860J566J482J422J156Q20Q54J446K093K091J488J080J240J281M92
52552A26613o33r72l10N34J003J375J874K163K016J778J685J433Q75N34Q70J472
52536A42310J558Q66j80r12p39L61J454J397L31l59NM58N0o09m79J29K12j34l1
$$ y = [77166, 76598, 76115, 76130, 76520, 77042, 77768, 78723, 79459, 79449, 78770, 78002, 77546, 77304, 77011, 76590, 76168, 75950, 76220, 77294, 79219, 81474, 83167, 83758, 83590, 83515, 83966, 84622, 84994, 84972, 84643, 83966, 82992, 82138, 81804, 81881, 82051, 82384, 83151, 84160, 84863, 85141, 85428, 85893, 86077, 85580, 84693, 84051, 83970, 84350, 84872, 85070, 84555, 83472, 82445, 81819, 81306, 80670, 80362, 81024, 82603, 84433, 85991, 87122, 87680, 87585, 87267, 87488, 88460, 89596, 90332, 90822, 91487, 92188, 92408, 92167, 92257, 93346, 95130, 96595, 97035, 96615, 96041, 95921, 96434, 97344, 98237, 98849, 99353, 100248, 101874, 104047, 106242, 108102, 109668, 111150, 112572, 113728, 114548, 115402, 116848, 118941, 121032, 122520, 123600, 124840, 126121, 126613, 125980, 125008, 124698, 125232, 126235, 127610, 129484, 131647, 133663, 135441, 137126, 138559, 139434, 139968, 140838, 142310, 143868, 144734, 144554, 143642, 142903, 143264, 144718, 146115, 146446, 146087, 146092, 146550, 146600, 145991, 145512, 145641, 145853, 145719, 145688]
52517A45688M20J82q63j522j010L9P14Q69P49M03k1j53kr7o82j260j290q12k39
52498A41113O8q9o05r44o54K8N52Q99J366J699J330M42j09n4K7j77k87j22l0n1
52478A44402K45P74Q17K92J34P99J538J695J706J960J838Q67l1K34J146J316N30
52461A60262j47j48k6k74n84m64J14R05J606J861J574J182J151J287J090O47N21
52444A70557Q84J405J909K539L141L218K646J961J712J908K155K045J358K85o06
52429A97117r36r78j267j781k008j734j391j472j994k626l053l192l173l204l284
52414A65024l237l056l045l326l505l138k362j704j377j133o95m9O25J111J285
52399A41418J217J038O89J39j93J98J000J220N82mJ75N67M30J48M94J137J125
$$ y = [145688, 146108, 146290, 145427, 143905, 142895, 142934, 143648, 144517, 145266, 145669, 145648, 145495, 145493, 145396, 144714, 143454, 142164, 141352, 141113, 141181, 141092, 140487, 139543, 138889, 138917, 139469, 140368, 141734, 143433, 144763, 145205, 145096, 145042, 145069, 144892, 144605, 144483, 144453, 144402, 144647, 145421, 146238, 146530, 146664, 147463, 149001, 150696, 152402, 154362, 156200, 157067, 157036, 157270, 158416, 159732, 160262, 160115, 159967, 159941, 159667, 159083, 158619, 158733, 159638, 161244, 163105, 164679, 165861, 167012, 168299, 169389, 170036, 170557, 171441, 172846, 174755, 177294, 180435, 183653, 186299, 188260, 189972, 191880, 194035, 196080, 197438, 197723, 197117, 196181, 195203, 193936, 192155, 190147, 188413, 187022, 185550, 183556, 180930, 177877, 174685, 171512, 168308, 165024, 161787, 158731, 155686, 152360, 148855, 145717, 143355, 141651, 140274, 139141, 138446, 138397, 139022, 140133, 141418, 142635, 143673, 144362, 144501, 144308, 144506, 145506, 146726, 147308, 147304, 147479, 148046, 148476, 148624, 149118, 150255, 151380]
52382A51380N21L06P35R83O12K43M64R56J167J106J026R55R26J144J546J670J288
52365A67028Q42R72J833K972L636L284K218J577K160L379M010L757L285K819J841
52350B05613L98l66L86K033L280L587L257K751K406K477K806K816K222J443J027
52335B36136J017J191J466J734J745J496J371J510J567J412J536K228K912K936
52321B60257K619K751L337L586L082K321K006K300K831L183L272L452M147N264
52307C04408O129O230N789N456N642O379P453Q350Q500P947P564Q127R438J0740
52293D08152J1724J2584J3293J3476J3076J2657J2819J3604J4616J5492J6186
52282E57679J6861J7585J8185J8453J8454J8431J8443J8367J8257J8236J8040
$$ y = [151380, 151901, 152207, 152942, 153925, 154537, 154780, 155244, 156200, 157367, 158473, 159499, 160454, 161380, 162524, 164070, 165740, 167028, 167870, 168842, 170675, 173647, 177283, 180567, 182785, 184362, 186522, 189901, 193911, 197668, 200953, 203772, 205613, 206011, 205645, 206031, 208064, 211344, 214931, 218188, 220939, 223345, 225822, 228628, 231444, 233666, 235109, 236136, 237153, 238344, 239810, 241544, 243289, 244785, 246156, 247666, 249233, 250645, 252181, 254409, 257321, 260257, 262876, 265627, 268964, 272550, 275632, 277953, 279959, 282259, 285090, 288273, 291545, 294997, 299144, 304408, 310537, 316767, 322556, 328012, 333654, 340033, 347486, 355836, 364336, 372283, 379847, 387974, 397412, 408152, 419876, 432460, 445753, 459229, 472305, 484962, 497781, 511385, 526001, 541493, 557679, 574540, 592125, 610310, 628763, 647217, 665648, 684091, 702458, 720715, 738951, 756991]
52271G56991J7143J5532J3896J2803J2188J1820J1696J1605J0935R499P985P075
52259H99168O558N932N327N069M767L735K124Q07K18R8K15N26O72J70p51j289
52243I33346j146p96n30m8Q13J683K312K988L973N033N934O844P891Q771R225
52228I86293R558J0282J1422J2535J3216J3383J3181J2835J2463J2003J1424J0892
52216A129487J0457R795Q704P701P427P524O852N070L176K086J441L22j409l126
52202A195507m348n103n658o370p561r054j0134j0407j0291j0275j0134r449q535
52189A088188q110q289q632q939r260r252q407o973n852n381m983m226l529l414
52175I92941l717l986m166m358m315l705k714j841j321j060j040j338j831k229
$$ y = [756991, 774134, 789666, 803562, 816365, 828553, 840373, 852069, 863674, 874609, 884108, 892093, 899168, 905726, 911658, 916985, 922054, 926821, 930556, 932680, 933487, 933705, 933803, 934018, 934544, 935216, 935386, 934635, 933346, 932200, 931404, 930874, 930826, 931639, 933322, 935634, 938622, 942595, 947628, 953562, 960406, 968297, 977068, 986293, 995851, 1006133, 1017555, 1030090, 1043306, 1056689, 1069870, 1082705, 1095168, 1107171, 1118595, 1129487, 1139944, 1149739, 1158443, 1166144, 1173571, 1181095, 1187947, 1193017, 1196193, 1198279, 1199720, 1200042, 1198633, 1195507, 1191159, 1186056, 1180398, 1174028, 1166467, 1157413, 1147279, 1136872, 1126581, 1116306, 1106172, 1096723, 1088188, 1080078, 1071789, 1063157, 1054218, 1044958, 1035706, 1027299, 1020326, 1014474, 1009093, 1004110, 999884, 996355, 992941, 989224, 985238, 981072, 976714, 972399, 968694, 965980, 964139, 962818, 961758, 960718, 959380, 957549, 955320]
52161I55320k348k153j639j092j163k219l648m322l872l037k685k928l441m063
52147I16710m736n204n275n200n282n302m860m228m197m991n841n973n484m998
52133H45139m782m718m763m914m921m546m065l976m251m384m214m041l842l094
52119G84628j794r70j520k865l589l161k339j902j733j431j065q43n16L19J460
52104G62679K212K222J903K020L029M793O630P728P818P433P366P860Q663R690
52090H42046J1149J2967J4648J5960J7224J8595J9520J9522J9159J9392K0167
52079A030349K0457J9842J9188J9329J9819J9682J8859J8098J7607J6698J4911
52068A234839J2786J1152J0203R537Q731P506N667L366J248p5q06j781l436n278
$$ y = [955320, 952972, 950819, 949180, 948088, 946925, 944706, 941058, 936736, 932864, 929827, 927142, 924214, 920773, 916710, 911974, 906770, 901495, 896295, 891013, 885711, 880851, 876623, 872426, 867435, 861594, 855621, 850137, 845139, 840357, 835639, 830876, 825962, 821041, 816495, 812430, 808454, 804203, 799819, 795605, 791564, 787722, 784628, 782834, 781864, 780344, 777479, 773890, 770729, 768390, 766488, 764755, 763324, 762259, 761416, 760900, 761219, 762679, 764891, 767113, 769016, 771036, 774065, 778858, 785488, 793216, 801034, 808467, 815833, 823693, 832356, 842046, 853195, 866162, 880810, 896770, 913994, 932589, 952109, 971631, 990790, 1010182, 1030349, 1050806, 1070648, 1089836, 1109165, 1128984, 1148666, 1167525, 1185623, 1203230, 1219928, 1234839, 1247625, 1258777, 1268980, 1278517, 1287248, 1294754, 1300421, 1303787, 1305035, 1304960, 1304154, 1302373, 1298937, 1293659]
52054A293659o551p172p720q614r607j0166j0103r653r081q511q016p653p340
52041A183472o955o597o456o376n797m436k815j783j597j780j760j325m60Q93
52027A136228K651M427N741O363O436O310O302O446O512O260N737N137M563L989
52013A213102L458L034K615J989J097Q6q70j681k357l126m401o296q338j0011
51999A188301j1462j3178j5076j6588j7687j9126k1312k3572k5010k5609k5970
51988I73711k6365k6591k6537k6307k5931k5454k5170k5323k5630k5545k4944
51977F89914k4112k3178k1939k0354j8775j7564j6783j6201j5440j4205j2665
51966D88698j1451j0991j0973j0828j0499j0217r774q771p452o579o307n977n224
$$ y = [1293659, 1287108, 1279936, 1272216, 1263602, 1253995, 1243829, 1233726, 1224073, 1214992, 1206481, 1198465, 1190812, 1183472, 1176517, 1169920, 1163464, 1157088, 1151291, 1146855, 1144040, 1142257, 1140660, 1138880, 1137120, 1135795, 1135335, 1136228, 1138879, 1143306, 1149047, 1155410, 1161846, 1168156, 1174458, 1180904, 1187416, 1193676, 1199413, 1204550, 1209113, 1213102, 1216560, 1219594, 1222209, 1224198, 1225295, 1225381, 1224511, 1222830, 1220473, 1217347, 1212946, 1206650, 1198312, 1188301, 1176839, 1163661, 1148585, 1131997, 1114310, 1095184, 1073872, 1050300, 1025290, 999681, 973711, 947346, 920755, 894218, 867911, 841980, 816526, 791356, 766033, 740403, 714858, 689914, 665802, 642624, 620685, 600331, 581556, 563992, 547209, 531008, 515568, 501363, 488698, 477247, 466256, 455283, 444455, 433956, 423739, 413965, 405194, 397742, 391163, 384856, 378879, 373655]
51953C73655m549m419m498m298l982l902l834l362k698k423k559k612k445k474
51939C25600k874l173k892k225j759j827k266k722k958k910k606k084j486j127
51925B92691j262j683j832j413p61l91m72r28j708k586k979k476j448o69l28O6
51909B71821P48J187O97p05k293l212l106k370j917k304l073l256k540j589j100
51894B46988j015r04o51m64m86p27j145j563j721j570j285q62j48N91P02J52j51
51877B35741L75R83O90n7K0J048J790J564J135J237J353P96J4j88n9l73q97o24
51859B44548N44J542J723J609J756J878J668J533J860K139J743J035Q48J211J440
51844B67077J378J541K020K168J645J046J056J557K033K321K528K566K304J912
$$ y = [373655, 369106, 364687, 360189, 355891, 351909, 348007, 344173, 340811, 338113, 335690, 333131, 330519, 328074, 325600, 322726, 319553, 316661, 314436, 312677, 310850, 308584, 305862, 302904, 299994, 297388, 295304, 293818, 292691, 291429, 289746, 287914, 286501, 285740, 285349, 284877, 283949, 282241, 279655, 276676, 274200, 272752, 272083, 271755, 271821, 272569, 273756, 274453, 273748, 271455, 268243, 265137, 262767, 260850, 258546, 255473, 252217, 249677, 248088, 246988, 245973, 245069, 244418, 243954, 243468, 242741, 241596, 240033, 238312, 236742, 235457, 234595, 234447, 235038, 235740, 235892, 235741, 236116, 237099, 237789, 237732, 237752, 238800, 240590, 242154, 243289, 244526, 245879, 246675, 246689, 246501, 246442, 246069, 245172, 244548, 245092, 246634, 248357, 249966, 251722, 253600, 255268, 256801, 258661, 260800, 262543, 263578, 264426, 265637, 267077, 268455, 269996, 272016, 274184, 275829, 276875, 277931, 279488, 281521, 283842, 286370, 288936, 291240, 293152]
51830B93152J626J346Q72L55K3l65j200k230k608j958r70o13r88j304q89k8L86
51813B84607k5o16n25J64M94Nn23p5J237K390K766K630K393K121J833J710J757
51796C02343J688J366R08L10n48j354j419o24K45M60J85j9QJ70N60J172J526J241
51778C08218P29O42R41J069Q38M58j16j001j712j577q68o19j088j282l95J028
51762C05265J888J869J364P21J02j98j2L33M09L47O03J245J808J845J301M78j08
51745C19260j3P74J871L026M335N749O932P800Q675R390Q872O372K684o72l187
51730C81868n309p000p585p096o594o659o571n627m357l631l282k473j153j50
51716C14381J5l24o55q98j245j803k478k957k924k543k528l243m016l923l101
$$ y = [293152, 294778, 296124, 296996, 297351, 297374, 297009, 295809, 293579, 290971, 289013, 288043, 287430, 286442, 285138, 284249, 284221, 284607, 284582, 283966, 283441, 283605, 284099, 284104, 283581, 283506, 284743, 287133, 289899, 292529, 294922, 297043, 298876, 300586, 302343, 304031, 305397, 306305, 306615, 306067, 304713, 303294, 302670, 302915, 303375, 303560, 303541, 303549, 303719, 304279, 305451, 306977, 308218, 308947, 309589, 310530, 311599, 312437, 312895, 312779, 311778, 310066, 308489, 307621, 307002, 305914, 304632, 304237, 305265, 307153, 309022, 310386, 311107, 311209, 311011, 310999, 311332, 311741, 312088, 312691, 313936, 315744, 317589, 318890, 319368, 319260, 319247, 320021, 321892, 324918, 329253, 335002, 341934, 349734, 358409, 367799, 376671, 383043, 385727, 385055, 381868, 376559, 369559, 361974, 354878, 348284, 341625, 335054, 329427, 325070, 321439, 318157, 315684, 314531, 314381, 314396, 314072, 313417, 312519, 311274, 309471, 306993, 304036, 301112, 298569, 296041, 292798, 288782, 284859, 281758]
51701B81758k604k958l556l683l395l034k546j802j111q54q72p60n29n17p41q83
51685B51913p92n36J0J063K329L049K848K108J353N85m09j492k254k465k143j447
51669B53720p49n14p07n56N20J961K657K483K502L415M575M953M577M317M617
51654B87771N151N511N547M994L585J746N23L57M24l22j851l269m075m553m994
51639B96545n260n302n491o029o385n876m673l715l635m088m328m075l652l417
51625B30619l371l294l049k672k306k042j791j356o86n9J68m7m00o20o97p25o87
51608B06985o11o93j082j553j658j194l76M69J160J622J798J642J154L72m92r42
51592B06601n05O80J805K147J813J479J551J843K090K396L012L899M699N114N148
$$ y = [281758, 279154, 276196, 272640, 268957, 265562, 262528, 259982, 258180, 257069, 256215, 255343, 254583, 254054, 253537, 252796, 251913, 251121, 250585, 250595, 251658, 253987, 257036, 259884, 261992, 263345, 263930, 263521, 262029, 259775, 257310, 255167, 253720, 252971, 252457, 251750, 251194, 251714, 253675, 256332, 258815, 261317, 264732, 269307, 274260, 278837, 283154, 287771, 292922, 298433, 303980, 308974, 312559, 314305, 314828, 315185, 315609, 315287, 313436, 310167, 306092, 301539, 296545, 291285, 285983, 280492, 274463, 268078, 262202, 257529, 253814, 250179, 246091, 241763, 237688, 234036, 230619, 227248, 223954, 220905, 218233, 215927, 213885, 212094, 210738, 210052, 209993, 210161, 210114, 209714, 209094, 208397, 207672, 206985, 206374, 205681, 204599, 203046, 201388, 200194, 199818, 200287, 201447, 203069, 204867, 206509, 207663, 208035, 207543, 206601, 206096, 206776, 208581, 210728, 212541, 214020, 215571, 217414, 219504, 221900, 224912, 228811, 233510, 238624, 243772]
51577B43772N012M896M850M806M739M861N513O782Q187R013Q933Q216P288O292
51563C33160N216M208L405K545J147q25k732l915m358m501m597m508m071l315
51549C16859k379j410n66Q4P39J690K995M427N767O852P430P336O885O708O999
51534C70416P298P189O889O708O324N185L469K065J510J373R18n8j199k045k259
51519D13783j756r20m89q11j328j108R8J586K415K180J148p6r48j388j882k988
51503D07516m624o051o703o740o638o522o227n823n597n550n331m789m240l960
51489C28721l787l470l152l079l005k464j547r61j104j477j330n87J94N69N87
51474C04108N01M75N78Q02R34O97Q1n60q20n97q3N13J134J873K797L728M308M370
$$ y = [243772, 248784, 253680, 258530, 263336, 268075, 272936, 278449, 285231, 293418, 302431, 311364, 319580, 326868, 333160, 338376, 342584, 345989, 348534, 349681, 348856, 346124, 342209, 337851, 333350, 328753, 324245, 320174, 316859, 314480, 313070, 312504, 312588, 313327, 315017, 318012, 322439, 328206, 335058, 342488, 349824, 356709, 363417, 370416, 377714, 384903, 391792, 398500, 404824, 410009, 413478, 415543, 417053, 418426, 419344, 419286, 418087, 416042, 413783, 412027, 411107, 410618, 409807, 408479, 407371, 407469, 409055, 411470, 413650, 414798, 414722, 413774, 412386, 410504, 407516, 402892, 396841, 390138, 383398, 376760, 370238, 364011, 358188, 352591, 347041, 341710, 336921, 332681, 328721, 324934, 321464, 318312, 315233, 312228, 309764, 308217, 307256, 306152, 304675, 303345, 302758, 302952, 303521, 304108, 304609, 305084, 305662, 306464, 307398, 308095, 308176, 307616, 306796, 306199, 306116, 306629, 307763, 309636, 312433, 316161, 320469, 324839]
51456C24839M220M323M717M984M882M725M984N687O477P087P450P428O761N388
51442D03952L679K129J005L20j8k36p25j714k812l175k361r69k07p07j913k702
51426C93546k535j855j500j844k665l645m811o287p786q620q388p545o987p137
51412C21941p634p968q067q080p862p023n509l776k427j763j680j774j583r36
51398B55859q7O44J289K012K652K826K569K432K862L791M934O041O622O031M246
51383C04723K178O73m99k118m161n766o487o862p500q256q697q839q931q824q161
51368B22473p044o005n333m797m176l677l623l954m190l908l128k278j791j759
51354A66810j890j886j770j770j937j993j616q22K0M84M11L5j77P2N40N84j14
$$ y = [324839, 329059, 333382, 338099, 343083, 347965, 352690, 357674, 363361, 369838, 376925, 384375, 391803, 398564, 403952, 407631, 409760, 410765, 411085, 411067, 410831, 410106, 408392, 405580, 402405, 400044, 399075, 398868, 398161, 396248, 393546, 391011, 389156, 387656, 385812, 383147, 379502, 374691, 368404, 360618, 351998, 343610, 336065, 329078, 321941, 314307, 306339, 298272, 290192, 282330, 275307, 269798, 266022, 263595, 261832, 260152, 258378, 256795, 255859, 255772, 256416, 257705, 259717, 262369, 265195, 267764, 270196, 273058, 276849, 281783, 287824, 294446, 300477, 304723, 306901, 307574, 307075, 304957, 300796, 295030, 288543, 281681, 274181, 265925, 257228, 248389, 239458, 230634, 222473, 215429, 209424, 204091, 199294, 195118, 191441, 187818, 183864, 179674, 175766, 172638, 170360, 168569, 166810, 164920, 163034, 161264, 159494, 157557, 155564, 153948, 153126, 153146, 153630, 154041, 154076, 153899, 153971, 154511, 155095, 154981]
51337A54981j088j555j343r52o92k15O75J282P69n12j219o81L95J077J356J653
51321A53931J882J755J558J885K721L526M049M403M525M269M021M381N236N878
51307B04020O084O275O484O184N391M930N078M892L610J868O74j67j536l430m987
51292B45370n809o238o435o172n591n241n293n386n369n440n513n165m438l905
51278A69375l814l787l553l280k968k210r75K5J63l30p85q95p83p02q97j396j772
51261A41416j604j191j259j757j716o53O69J345J501J691J828J505R41P79J165
51246A44660J694K043K053J513M90l05j55P05J406J468R83P1j104j934j781q70
51230A50937p1J72J51J13l1k04j00J71P0m76p74l53L27N28K00j29o5L35P90R77
$$ y = [154981, 153893, 152338, 150995, 150043, 149351, 149136, 149811, 151093, 151862, 151350, 150131, 149450, 149845, 150922, 152278, 153931, 155813, 157568, 159126, 161011, 163732, 167258, 171307, 175710, 180235, 184504, 188525, 192906, 198142, 204020, 210104, 216379, 222863, 229047, 234438, 239368, 244446, 249338, 252948, 254816, 255490, 255323, 253787, 250357, 245370, 239561, 233323, 226888, 220716, 215125, 209884, 204591, 199205, 193836, 188396, 182883, 177718, 173280, 169375, 165561, 161774, 158221, 154941, 151973, 149763, 148788, 148813, 148976, 148646, 147861, 146966, 146183, 145481, 144584, 143188, 141416, 139812, 138621, 137362, 135605, 133889, 133236, 133905, 135250, 136751, 138442, 140270, 141775, 142716, 143495, 144660, 146354, 148397, 150450, 151963, 152453, 152148, 151993, 152698, 154104, 155572, 156555, 156626, 155522, 153588, 151807, 150937, 150866, 151038, 151189, 151302, 151271, 151067, 150967, 151138, 151208, 150732, 149958, 149605, 149932, 150460, 150660, 150531, 150466, 150801, 151591, 152568]
51210A52568P06Q9n52r96j247j324j210j002p92m54J31O80P87N98O35R67J066
51193A50650P25M74P67J260J270O42k45j071j740k151k114j514m98M02N06l22
51177A47041j236j231m31Q6j58m39j64J08l66j125j055LJ071J400J246J127J031
51160A46908O53L8l59j85L85P79O98M66N01M61m72k290l799l995l262k598k180
51143A31749j533p27m25p60j053p82j16O37J365J796J530P24J84M09J060J615
51127A35673K013K272K056J245N21P36J871L078L636L452K803K030J433J119Q46
51112A64784L49k82p57j087j546k154k570k555k250j842j273m45M40J023J133
51097A50968Q84N05K40L48R15J630J978J752J238P23J03p65j498j499q63m40p50
$$ y = [152568, 153274, 153363, 152811, 151815, 150568, 149244, 148034, 147032, 146240, 145786, 145917, 146597, 147384, 147982, 148617, 149584, 150650, 151375, 151849, 152616, 153876, 155146, 155788, 155543, 154472, 152732, 150581, 148467, 146953, 146455, 146857, 147363, 147041, 145805, 144574, 144143, 144229, 144071, 143632, 143468, 143576, 143210, 142085, 141030, 141033, 142104, 143504, 144750, 145877, 146908, 147561, 147599, 147240, 147055, 147440, 148219, 148917, 149383, 149884, 150345, 149873, 147583, 143784, 139789, 136527, 133929, 131749, 130216, 129489, 129064, 128304, 127251, 126469, 126353, 126990, 128355, 130151, 131681, 132405, 132589, 132998, 134058, 135673, 137686, 139958, 142014, 143259, 143780, 144516, 146387, 149465, 153101, 156553, 159356, 161386, 162819, 163938, 164784, 165133, 164851, 164094, 163007, 161461, 159307, 156737, 154182, 151932, 150090, 148817, 148372, 148812, 149835, 150968, 151852, 152357, 152597, 152945, 153860, 155490, 157468, 159220, 160458, 161181, 161284, 160519, 159021, 157522, 156659, 156219, 155469]
51080A55469j277j185l83O28J573K392K699K017P18j18RM83O46O22O55L82m98
51063A64832j356j397r03q19j216j234n69N1K04M74J193J450L43j328j768m21
51047A57536J423K337K256K010K077K256K216J973J904K361L173L582L022J877
51033A90003J142J269J817K177K124J618P02j97m83j85%j37P5R52J561R17m09
51016B02946r47l42L73M62M31R49J766K231K218K076K042K196K630L280L789L869
51000B29969L632L450L665M450N632O527O472N722N382O158P586Q805R654J0516
50986C17620J1449J2042J2160J2371J3479J5703J8345K0378K1504K2527K4410
50975E01988K7111K9894L2651L6098M0475M4932M8641N1836N5113N8340O1027
$$ y = [155469, 154192, 153007, 152624, 153252, 154825, 157217, 159916, 161933, 162651, 162533, 162542, 163025, 163671, 164293, 164948, 165330, 164832, 163476, 162079, 161176, 160357, 159141, 157907, 157338, 157389, 157593, 158067, 159260, 160710, 161053, 159725, 157957, 157536, 158959, 161296, 163552, 165562, 167639, 169895, 172111, 174084, 175988, 178349, 181522, 185104, 188126, 190003, 191145, 192414, 194231, 196408, 198532, 200150, 200852, 200655, 200172, 199987, 199987, 199850, 199925, 200877, 202438, 203355, 202946, 201999, 201657, 202030, 202492, 202923, 203872, 205638, 207869, 210087, 212163, 214205, 216401, 219031, 222311, 226100, 229969, 233601, 237051, 240716, 245166, 250798, 257325, 263797, 269519, 274901, 281059, 288645, 297450, 307104, 317620, 329069, 341111, 353271, 365642, 379121, 394824, 413169, 433547, 455051, 477578, 501988, 529099, 558993, 591644, 627742, 668217, 713149, 761790, 813626, 868739, 927079, 988106]
50964I88106O3240O5283O6698O6530O4553O1471N7856N3479M7894M1128L3686
50953A609924K6283J9572J3750Q336K764k787p403j0337j1572j1511j0492q795
50941A617732o855n281m554m669n232o136q069j1813j7003k2220k6641l0869l5748
50928A432642m1031m5913n0132n3747n6331n7397n7305n6714n5452n2924m9481
50917H56215m6174m3187l9692l5446l1350k8081k5154k1902j8496j5503j3059
50906E38171j1096r664q599p388n838m383l384k620j823j104m54M89J712K436
50892D86455K104J299J049J589K348K902L298L690M095M584N299O229P169P866
50878E39976Q206Q391Q832R689J0615J1343J2283J3946J5986J7583J8694K0045
$$ y = [988106, 1051346, 1116629, 1183327, 1249857, 1314410, 1375881, 1433737, 1487216, 1535110, 1576238, 1609924, 1636207, 1655779, 1669529, 1677865, 1680629, 1677842, 1670439, 1660102, 1648530, 1637019, 1626527, 1617732, 1610877, 1605596, 1601042, 1596373, 1591141, 1585005, 1576936, 1565123, 1548120, 1525900, 1499259, 1468390, 1432642, 1391611, 1345698, 1295566, 1241819, 1185488, 1128091, 1070786, 1014072, 958620, 905696, 856215, 810041, 766854, 727162, 691716, 660366, 632285, 607131, 585229, 566733, 551230, 538171, 527075, 517411, 508812, 501424, 495586, 491203, 487819, 485199, 483376, 482272, 481818, 482307, 484019, 486455, 488559, 489858, 490907, 492496, 494844, 497746, 501044, 504734, 508829, 513413, 518712, 524941, 532110, 539976, 548182, 556573, 565405, 575094, 585709, 597052, 609335, 623281, 639267, 656850, 675544, 695589]
50866F95589K1866K3731K5754K8804L3049L7465M1506M6130N2358N9732O7163
50855A133147P4532Q2372R0707R9257J08201J17646J26768J34616J41310J47274
50845B255830J51640J52742J50087J44575J36615J25336J10018R1339P0806M9677
50835C438665K8948R658p224k1053l1456l8354m1930m2260l9152l2791k4299j5098
50823C183654o079J925P263Q213M501k862j3169k6310m1538n7186p2100q6332
50811B899980r9981j12325j22570j30540j36003j38153j36539j31878j25281j17196
50801A649514j07721r7452q7272p7625o8553o0124n2224m4379l6410k8967k2885
50790I65902j8141j4084j0323o914l829r26J572L131L491K914J874Q39J66k33
$$ y = [695589, 717455, 741186, 766940, 795744, 828793, 866258, 907764, 953894, 1006252, 1065984, 1133147, 1207679, 1290051, 1380758, 1480015, 1588216, 1705862, 1832630, 1967246, 2108556, 2255830, 2407470, 2560212, 2710299, 2854874, 2991489, 3116825, 3226843, 3318182, 3388988, 3438665, 3467613, 3477271, 3470047, 3448994, 3417538, 3379184, 3337254, 3294994, 3255842, 3223051, 3198752, 3183654, 3177575, 3179500, 3186763, 3194976, 3199477, 3196615, 3183446, 3157136, 3115598, 3058412, 2986312, 2899980, 2799999, 2687674, 2565104, 2434564, 2298561, 2160408, 2023869, 1891991, 1766710, 1649514, 1541793, 1444341, 1357069, 1279444, 1210891, 1150767, 1098543, 1054164, 1017754, 988787, 965902, 947761, 933677, 923354, 916440, 912611, 911685, 913257, 916388, 919879, 922793, 924667, 925506, 925672, 925439]
50776I25439r69k475m316n605o125o579p690r399j1084j2236j2756j2802j2475
50763H20928j1769j0767r818r257q784p536n052j975O00K310L712N420P528R893
50749G85433J2511J5421J8587K2034K5857K9935L3932L7730M1678M6134N1020
50738A120272N6071O1349O7170P3484P9723Q5292Q9987R3749R6299R7259R6486
50727B017141R4065Q9882Q3474P4345O2421M8137L2250J5605j003j6786l0853
50716B468678m2261n0306n4746n5699n3458m8566m1863l4169k6004j7857j0574
50705B033175m980j311N26K19k893q907j7212k7317l8982n1194o2017p0091p5696
50692A673320p9576q1390q0328p6751p2088o7190o1775n5542m8941m2556l6522
$$ y = [925439, 924470, 921995, 917679, 912074, 905949, 899370, 891680, 882281, 871197, 858961, 846205, 833403, 820928, 809159, 798392, 788574, 779317, 770533, 762997, 757945, 755970, 756570, 758880, 762592, 768012, 775540, 785433, 797944, 813365, 831952, 853986, 879843, 909778, 943710, 981440, 1023118, 1069252, 1120272, 1176343, 1237692, 1304862, 1378346, 1458069, 1543361, 1633348, 1727097, 1823396, 1920655, 2017141, 2111206, 2201088, 2284562, 2358907, 2421328, 2469465, 2501715, 2517320, 2516317, 2499531, 2468678, 2426417, 2376111, 2321365, 2265666, 2212208, 2163642, 2121779, 2087610, 2061606, 2043749, 2033175, 2028195, 2026884, 2027410, 2027629, 2024736, 2015829, 1998617, 1971300, 1932318, 1881124, 1819107, 1749016, 1673320, 1593744, 1512354, 1432026, 1355275, 1283187, 1215997, 1154222, 1098680, 1049739, 1007183, 970661]
50681I70661l0779k5362k0224j5288j0732o756l044J022N535J0067J4331J8251
50669I07682K1424K3389K4473K5516K6567K6738K5613K3826K1970J9841J7325
50658A164364J5059J3479J1990R933P750O361N842N605N510N886O681P478Q311
50645A274249R743J2064J5073J8672K3040K8123L3375L8203M2308M5535M7703
50634A588088M8673M8294M6381M2905L8175L2600K6404J9852J3540Q090L609k32
50622A916379l537n833o480n305k884k26J981L865N913Q041R442R456Q086N576
50608A944474K092j853n303p838j0134j2965j6071j8876k1866k6218l2075l8216
50596A755151m3631m8557n3489n7926o0821o1869o1739o1100n9923n7766n4471
$$ y = [970661, 939882, 914520, 894296, 879008, 868276, 861520, 858476, 859498, 865033, 875100, 889431, 907682, 929106, 952495, 976968, 1002484, 1029051, 1055789, 1081402, 1105228, 1127198, 1147039, 1164364, 1179423, 1192902, 1204892, 1214825, 1222575, 1228936, 1234778, 1240383, 1245893, 1251779, 1258460, 1265938, 1274249, 1283992, 1296056, 1311129, 1329801, 1352841, 1380964, 1414339, 1452542, 1494850, 1540385, 1588088, 1636761, 1685055, 1731436, 1774341, 1812516, 1845116, 1871520, 1891372, 1904912, 1913002, 1916611, 1916379, 1912842, 1907009, 1900529, 1895224, 1892340, 1892114, 1894095, 1897960, 1903873, 1911914, 1921356, 1930812, 1938898, 1944474, 1946566, 1944713, 1939410, 1931572, 1921438, 1908473, 1892402, 1873526, 1851660, 1825442, 1793367, 1755151, 1711520, 1662963, 1609474, 1551548, 1490727, 1428858, 1367119, 1306019, 1246096, 1188330, 1133859]
50585A133859n0359m6049m2099l8792l5984l3139k9757k5916k2212j9012j5989
50574G74551j2724r512o942m847k413M78K902M273N296P000R384J1768J3907J5930
50560H09051J7644J8783J9788K1404K3582K5657K7514K9702L2243L4324L5429
50549A095121L6054L6800L7398L7103L5721L3806L2122L1084L0564L0099K9579
50538A465451K9712L1317L4040L6503L7952L9191M1417M4712M8298N1938N6196
50527A916727O1366O6908P2132P6922Q1400Q5229Q7673Q8236Q6873Q3535P7974
50516B784975P0106O0294M9022L6526K3050R148m703j8640l2935m6963n9323o9167
50504B801390p6750q2412q5720q6098q3698p8970p1898o2470n1510m0211k8982
$$ y = [1133859, 1083500, 1037451, 995352, 956560, 920576, 887437, 857680, 831764, 809552, 790540, 774551, 761827, 752315, 745373, 740526, 738113, 738591, 741493, 745766, 751062, 758062, 767446, 779214, 793121, 809051, 826695, 845478, 865266, 886670, 910252, 935909, 963423, 993125, 1025368, 1059692, 1095121, 1131175, 1167975, 1205373, 1242476, 1278197, 1312003, 1344125, 1375209, 1405773, 1435872, 1465451, 1495163, 1526480, 1560520, 1597023, 1634975, 1674166, 1715583, 1760295, 1808593, 1860531, 1916727, 1978093, 2045001, 2117133, 2194055, 2275455, 2360684, 2448357, 2536593, 2623466, 2707001, 2784975, 2855081, 2915375, 2964397, 3000923, 3023973, 3033121, 3028418, 3009778, 2976843, 2929880, 2870557, 2801390, 2724640, 2642228, 2556508, 2470410, 2386712, 2307742, 2235844, 2173374, 2121864, 2081653, 2052671]
50493B052671j7675o806K353R128J4121J8320K2040K4882K6109K4777K0121J2091
50481B202132J219j2112k7643m4340o0163p3217q2751q8788r1412r0887q8158
50470A543880q4499q0642p6479p1568o5708n9138n2425m6113m0447l5409l0878
50459I00574k6613k2263j7753j3585j0361p946n557k743J34K468M088N263O456
50446H12162Q147J0499J3028J4963J6070J6780J7461J8110J8858K0140K2002K3795
50434A012015K4985K5865K6961K8106K8645K8416K7935K7620K7297K6657K5837
50423A310339K5244K4856K4148K2895K1826K2009K3497K5187K6264K7223K8922
50412A582410L1245L3454L5415L7398L8923L9036L7854L6525L5348L3110K8950
$$ y = [2052671, 2034996, 2028190, 2030543, 2039671, 2053792, 2072112, 2094152, 2119034, 2145143, 2169920, 2190041, 2202132, 2203351, 2191239, 2163596, 2119256, 2059093, 1985876, 1903125, 1814337, 1722925, 1632038, 1543880, 1459381, 1378739, 1302260, 1230692, 1164984, 1105846, 1053421, 1007308, 966861, 931452, 900574, 873961, 851698, 833945, 820360, 809999, 802053, 796496, 793753, 793887, 796355, 800443, 805706, 812162, 820309, 830808, 843836, 858799, 874869, 891649, 909110, 927220, 946078, 966218, 988220, 1012015, 1037000, 1062865, 1089826, 1117932, 1146577, 1174993, 1202928, 1230548, 1257845, 1284502, 1310339, 1335583, 1360439, 1384587, 1407482, 1429308, 1451317, 1474814, 1500001, 1526265, 1553488, 1582410, 1613655, 1647109, 1682524, 1719922, 1758845, 1797881, 1835735, 1872260, 1907608, 1940718, 1969668]
50401A969668K3702J8492J2967O098j835r434j6218k3312l1833m1426n0688n8555
50389A797626o4896p0022p3879p5840p5312p2448o7971o2331n5498m7743l9972
50378A091714l2857k6119j9138j1921m951J481P305J2331J6460J9918K2679K3811
50366A100713K2094J7291J0394K718m851j1882j8199k3724k8240l1469l3470l4614
50354I66761l4882l3747l1229k8457k6430k4722k2327j9423j7191j6004j4967
50343F97382j3467j2084j1436j0998r809p804n781m323l333k367j079O67K667
50330F18235M399N446N918O373P268Q565R846J0846J1751J2837J3828J4008J3243
50317G42563J2471J2840J4465J6525J8308J9690K0625K0847K0225J9057J7813
$$ y = [1969668, 1993370, 2011862, 2024829, 2030927, 2029092, 2019658, 2003440, 1980128, 1948295, 1906869, 1856181, 1797626, 1732730, 1662708, 1588829, 1512989, 1437677, 1365229, 1297258, 1234927, 1179429, 1131686, 1091714, 1058857, 1032738, 1013600, 1001679, 996728, 998209, 1005514, 1017845, 1034305, 1054223, 1076902, 1100713, 1122807, 1140098, 1150492, 1153210, 1148359, 1136477, 1118278, 1094554, 1066314, 1034845, 1001375, 966761, 931879, 898132, 866903, 838446, 812016, 787294, 764967, 745544, 728353, 712349, 697382, 683915, 671831, 660395, 649397, 639588, 631784, 626003, 621680, 618347, 615980, 614901, 615568, 618235, 622634, 628080, 633998, 640371, 647639, 656204, 666050, 676896, 688647, 701484, 715312, 729320, 742563, 755034, 767874, 782339, 798864, 817172, 836862, 857487, 878334, 898559, 917616, 935429]
50306I35429J6764J5820J4602J2769J0616R065Q631Q632P930O363M705L383J980
50293A056689K13j476k706l843n357p048q538j0216j2937j6735k0398k2548k2871
50280I22229k2152k1346k0812k0417k0018j9561j8864j7713j6365j5517j5427
50269G14037j5340j4282j2301j0400r355q974q581p811o819o032n712n549m813
50256E98068l221j494n90n23m37K22J248K292L320M297N057N667O370P039P219
50241F34534O949O877P289P608P191O195N211M457L693K638J161o35k277l251
50227F87640l650m094m818n373n487n555n841n907n342m642m550m981n285n229
50213F16886n001m416l058j174L22R18J055J414K136K941L644M271M877N444N836
$$ y = [935429, 952193, 968013, 982615, 995384, 1006000, 1015065, 1023696, 1032328, 1040258, 1046621, 1051326, 1054709, 1056689, 1056902, 1055426, 1052720, 1048877, 1043520, 1036472, 1027934, 1017718, 1004781, 988046, 967648, 945100, 922229, 900077, 878731, 857919, 837502, 817484, 797923, 779059, 761346, 744981, 729464, 714037, 698697, 684415, 672114, 661714, 652359, 643385, 634804, 626993, 620174, 614142, 608430, 602881, 598068, 594847, 593353, 592763, 592240, 591803, 592025, 593273, 595565, 598885, 603182, 608239, 613906, 620276, 627315, 634534, 641483, 648360, 655649, 663257, 670448, 676643, 681854, 686311, 690004, 692642, 693803, 693168, 690891, 687640, 683990, 679896, 675078, 669705, 664218, 658663, 652822, 646915, 641573, 636931, 632381, 627400, 622115, 616886, 611885, 607469, 604411, 603237, 603559, 604477, 605532, 606946, 609082, 612023, 615667, 619938, 624815, 630259, 636095]
50198F36095N917N773N673N631N257M264K960J825Q37l42j635k602l203l959n198
50183F57293o540p452p945q520r508j0708j1571j1674j1049j0068r036p913o553
50170E38756n015l574k519k067k216k530k375j732j516k578m513n888n763m516
50156D91954l210k525k485k807l206l513l630l457k973k513k698l695m710m710
50142D45822l689k740k748l407l734l215k211j490j526k036k106j082O11J800
50128D18249J867J387J337K052L192M336N192N563N524N499N762N952N536M661
50114D76109M112M323M759M585L675K765K543K885L009K371J193P2o96j208j483
50099E09014j376r95p79r32j044o39J67Q91J398J978K734L376L694L959M580N647
$$ y = [636095, 642012, 647785, 653458, 659089, 664346, 668610, 671570, 673395, 674232, 673890, 672255, 669653, 666450, 662491, 657293, 650753, 643301, 635356, 626836, 617328, 606620, 595049, 583375, 572326, 562258, 553222, 545309, 538756, 533741, 530167, 527648, 525581, 523365, 520835, 518460, 516728, 515212, 512634, 508121, 502233, 496470, 491954, 488744, 486219, 483734, 480927, 477721, 474208, 470578, 467121, 464148, 461635, 458937, 455242, 450532, 445822, 442133, 439393, 436645, 433238, 429504, 426289, 424078, 422588, 421062, 419026, 416920, 415838, 416449, 418249, 420116, 421503, 422840, 424892, 428084, 432420, 437612, 443175, 448699, 454198, 459960, 465912, 471448, 476109, 480221, 484544, 489303, 493888, 497563, 500328, 502871, 505756, 508765, 511136, 512329, 512401, 511705, 510497, 509014, 507638, 506643, 505864, 504932, 503888, 503249, 503416, 504307, 505705, 507683, 510417, 513793, 517487, 521446, 526026, 531673]
50083E31673O921Q144R201J0021J0488J0529J0331J0371J1138J2659J4400J5662
50071F61538J6048J5538J4413J3282J2812J2967J2779J1399R283P801P628Q121
50059H03609Q402Q327Q083P545O558N467M759M407M100L818L731L773L876M321
50045H80776N204N889N697M941M450M222L587K658K356K753K618J304m7j24O48
50030I26932Q94L58r0j12k85q76j337j191n32N01J940L554M997O555Q960J2311
50014I62579J5976J9773K4359L0035L6025M1346M5640M8700M9939M9052M6483
50003A369907M2635L7215L0245K3098J7538J4067J2141J1635J2951J5642J8029
49992A605103J8505J6451J1758M268n853j7837l0711m3500n4845o3172o7874o9791
$$ y = [531673, 538594, 546738, 555939, 565960, 576448, 586977, 597308, 607679, 618817, 631476, 645876, 661538, 677586, 693124, 707537, 720819, 733631, 746598, 759377, 770776, 780059, 787860, 795488, 803609, 812011, 820338, 828421, 835966, 842524, 847991, 852750, 857157, 861257, 865075, 868806, 872579, 876455, 880776, 885980, 891869, 897566, 902507, 906957, 911179, 914766, 917424, 919780, 922533, 925151, 926455, 926408, 926284, 926932, 927826, 928184, 928094, 927982, 927697, 926821, 925484, 924293, 923761, 924262, 926202, 929756, 934753, 941308, 950268, 962579, 978555, 998328, 1022687, 1052722, 1088747, 1130093, 1175733, 1224433, 1274372, 1323424, 1369907, 1412542, 1449757, 1480002, 1503100, 1520638, 1534705, 1546846, 1558481, 1571432, 1587074, 1605103, 1623608, 1640059, 1651817, 1656085, 1650232, 1632395, 1601684, 1558184, 1503339, 1440167, 1372293, 1302502]
49980A302502p0000o8557o5038n9941n4692n0248m6353m2320l8009l3738k9715
49969G43891k5973k2660k0012j8029j6423j4893j3344j1843j0504r385q437p507
49957E64881o538n684n123m712m181l639l565m093m618m463l736l118k971l168
49943E05272l585m201m623m263l200k230j769j300l79M57N39K71O61J887L140
49928D86677L877M315M662M698M464M571N357O270O579O314O093O264O670O977
49914E63788O893O265N434N251O306Q153R732J0572J1194J2371J4342J6878J9709
49901F96888K2636K5483K8334L1721L6325M2307M9081N5830O2114O7846P2699
49890A191264P5833P6367P4047O9400O3315N6694N0388M5091M1142L8566L7452
$$ y = [1302502, 1232502, 1163945, 1098907, 1038966, 984274, 934026, 887673, 845353, 807344, 773606, 743891, 717918, 695258, 675246, 657217, 640794, 625901, 612557, 600714, 590210, 580825, 572388, 564881, 558343, 552659, 547536, 542824, 538643, 535004, 531439, 527346, 522728, 518265, 514529, 511411, 508440, 505272, 501687, 497486, 492863, 488600, 485400, 483170, 481401, 480101, 479722, 480179, 480718, 480989, 481650, 483537, 486677, 490554, 494869, 499531, 504229, 508693, 513264, 518621, 524891, 531470, 537784, 543877, 550141, 556811, 563788, 570681, 576946, 582380, 587631, 593937, 602090, 611822, 622394, 633588, 645959, 660301, 677179, 696888, 719524, 745007, 773341, 805062, 841387, 883694, 932775, 988605, 1050719, 1118565, 1191264, 1267097, 1343464, 1417511, 1486911, 1550226, 1606920, 1657308, 1702399, 1743541, 1782107, 1819559]
49879A819559L8035M0117M2493M3289M1013L5216K6164J4170m14j6604l2595m6502
49867B003941n7327o5127p0430p3755p5561p6238p5892p4389p1876o8997o6359
49856A227990o3924o1217n7967n4261n0248m6075m2073l8494l5100l1393k7379
49845G19859k3659k0659j8222j6149j4662j3866j3225j2117j0752r957j0103j0730
49833E45758j1253j1572j1794j1810j1394j0535r374q040o707n691n164m884m368
49820D33172l388k139j013l19j82m58p98q97p41m45O7R31J911K408K143J552J248
49803D33052J285J300J166J141J340J482J359J143J099J182J143Q95O20O26J243
49788D50076K663M630O426P415P640P756Q369R580J1118J2779J4728J7263K0420
$$ y = [1819559, 1857594, 1897711, 1940204, 1983493, 2024506, 2059722, 2085886, 2100056, 2099642, 2083038, 2050443, 2003941, 1946614, 1881487, 1811057, 1737302, 1661741, 1585503, 1509611, 1435222, 1363346, 1294349, 1227990, 1164066, 1102849, 1044882, 990621, 940373, 894298, 852225, 813731, 778631, 747238, 719859, 696200, 675541, 657319, 641170, 626508, 612642, 599417, 587300, 576548, 566591, 556488, 545758, 534505, 522933, 511139, 499329, 487935, 477400, 468026, 459986, 453279, 447588, 442424, 437540, 433172, 429784, 427645, 426632, 426313, 426131, 425673, 424875, 423978, 423237, 422792, 422859, 423790, 425701, 428109, 430252, 431804, 433052, 434337, 435637, 436803, 437944, 439284, 440766, 442125, 443268, 444367, 445549, 446692, 447587, 448207, 448833, 450076, 452739, 457369, 463795, 471210, 478850, 486606, 494975, 504555, 515673, 528452, 543180, 560443, 580863]
49775E80863K3856K7326L1192L6091M2065M8236N3428N6837N8031N6787N3270
49764A067982M8070M1756L4580K6945J9886J4627J1795J1337J3013J6390K0440
49753A326821K3562K4229K1512J5161N603o248j9456l3293m6741n8030o5359o8165
49741A119596o7388o4416o0178n5163m9742m4191l8712l3616k9224k5538k2317
49730F29111j9431j6899j4574j2263j0175q740p905p131o186n432n090m764m043
49717E06478l171k690k663k595k033j023j09Q8n16j249j402j062q27p67l95K91
49701D86355N43j4p46r05n06J27R79J899K254J758J129J149J531J606J567K029
49685E00755K652K453J420P17J024J731K044K002J906J610R19J15m97j087j840
$$ y = [580863, 604719, 632045, 663237, 699328, 741393, 789629, 843057, 899894, 957925, 1014712, 1067982, 1116052, 1157808, 1192388, 1219333, 1239219, 1253846, 1265641, 1276978, 1289991, 1306381, 1326821, 1350383, 1374612, 1396124, 1411285, 1416888, 1410640, 1391184, 1357891, 1311150, 1253120, 1187761, 1119596, 1052208, 987792, 927614, 872451, 822709, 778518, 739806, 706190, 676966, 651428, 629111, 609680, 592781, 578207, 565944, 555769, 547029, 539124, 531993, 525807, 520375, 515285, 510521, 506478, 503307, 500617, 497954, 495359, 493326, 492303, 492194, 492282, 491766, 490517, 489115, 488053, 487226, 486459, 486064, 486355, 486898, 486884, 486138, 485233, 484727, 484854, 485833, 487732, 489986, 491744, 492873, 494022, 495553, 497159, 498726, 500755, 503407, 505860, 507280, 507997, 509021, 510752, 512796, 514798, 516704, 518314, 519233, 519348, 518851, 517764, 515924]
49670E15924k357k064r82K62J044J118O33N3j87j10o9j19P4N35P21L36r0Q1O36
49651E15439Q86P34P29J044J117M75n80j386j738j893j966j730j026j28M69N31
49635E10977K25j89n40o37k22O95J656K150K173K106K096J946J657J641K153K867
$$ y = [515924, 513567, 511503, 510521, 510783, 511827, 512945, 513578, 513631, 513444, 513334, 513265, 513146, 513220, 513755, 514476, 514812, 514722, 514803, 515439, 516325, 517059, 517788, 518832, 519949, 520424, 519844, 518458, 516720, 514827, 512861, 511131, 510105, 509977, 510446, 510977, 511202, 511013, 510473, 509836, 509614, 510309, 511965, 514115, 516288, 518394, 520490, 522436, 524093, 525734, 527887, 530754]
$$ [...]
##END NTUPLES=NMR SPECTRUM
##END=
