##TITLE=NES1007_929159_9232788_6avWAGcTBk
##JCAMPDX= 6.0         $$ Bruker NMR JCAMP-DX V2.0
##DATA TYPE= NMR SPECTRUM
##DATA CLASS= NTUPLES
##ORIGIN= BRUKER
##OWNER= Administrator
$$ 1.72 TOPSPIN		Version 2.1
$$ 2015-08-24 15:38:35.076 -0700  Administrator@X
$$ Compression mode = diff/dup
##.OBSERVE FREQUENCY= 400.02188249412
##.OBSERVE NUCLEUS= ^1H
##.ACQUISITION MODE= SIMULTANEOUS (DQD)
##.ACQUISITION SCHEME= undefined
##.AVERAGES= 8
##.DIGITISER RES= 22
##SPECTROMETER/DATA SYSTEM= spect
##.PULSE SEQUENCE= zg30
##.SOLVENT NAME= COFFEE_meoh
##.SHIFT REFERENCE= INTERNAL, COFFEE_meoh, 1, 14.98509
##AUDIT TRAIL= $$ (NUMBER, WHEN, WHO, WHERE, PROCESS, VERSION, WHAT)
$$ ##TITLE= Audit trail, TOPSPIN		Version 2.1
$$ ##JCAMPDX= 5.01
$$ ##ORIGIN= Bruker BioSpin GmbH
$$ ##OWNER= Administrator
$$ $$ E:\/data/COFFEE/nmr/NES1007_929159_9232788_6avWAGcTBk/20/pdata/1/auditp.txt
$$ ##AUDIT TRAIL=  $$ (NUMBER, WHEN, WHO, WHERE, PROCESS, VERSION, WHAT)
(   1,<2015-08-24 15:38:27.639 -0700>,<Administrator>,<X>,<go>,<TOPSPIN 2.1>,
      <created by zg
	started at 2015-08-24 15:37:21.655 -0700,
	POWCHK enabled, PULCHK disabled,
       configuration hash MD5:
       21 0F 79 D6 B3 7B B4 F6 88 20 88 DB 03 48 BD 9F
       data hash MD5: 64K
       23 B0 2B F0 B6 EE 42 4F 7B 13 41 CB 27 ED 53 20>)
(   2,<2015-08-24 15:38:31.014 -0700>,<Administrator>,<X>,<proc1d>,<TOPSPIN 2.1>,
      <Start of raw data processing
       efp LB = 0 FT_mod = 6 PKNL = 1 PHC0 = 0 PHC1 = 0 SI = 32K 
       data hash MD5: 32K
       B6 63 D9 F6 A1 3A EF AF 9A D5 FE 4C 40 C9 2E DB>)
(   3,<2015-08-24 15:38:31.295 -0700>,<Administrator>,<X>,<proc1d>,<TOPSPIN 2.1>,
      <pk PHC0 = 91.04919 PHC1 = 0 
       data hash MD5: 32K
       0A BB 00 BD E6 75 73 DE 96 BC 75 1D 14 48 7B 9F>)
(   4,<2015-08-24 15:38:31.389 -0700>,<Administrator>,<X>,<proc1d>,<TOPSPIN 2.1>,
      <abs ABSG = 1 
       data hash MD5: 32K
       D0 27 98 4A 42 61 04 DE E6 E2 F5 86 8D 33 93 B0>)
(   5,<2015-08-24 15:38:31.451 -0700>,<Administrator>,<X>,<proc1d>,<TOPSPIN 2.1>,
      <abs ABSG = 2 
       data hash MD5: 32K
       69 D5 5F A6 DF 50 C7 9C C3 5F E4 E3 22 3E FD A3>)
(   6,<2015-08-24 15:38:31.514 -0700>,<Administrator>,<X>,<proc1d>,<TOPSPIN 2.1>,
      <abs ABSG = 3 
       data hash MD5: 32K
       89 34 C8 4F 0B 56 71 91 AB F0 1A AF 76 5D AD B9>)
(   7,<2015-08-24 15:38:31.576 -0700>,<Administrator>,<X>,<proc1d>,<TOPSPIN 2.1>,
      <abs ABSG = 4 
       data hash MD5: 32K
       10 64 E5 83 A9 A3 29 C9 77 3E 43 D6 EF 63 F1 12>)
(   8,<2015-08-24 15:38:31.623 -0700>,<Administrator>,<X>,<proc1d>,<TOPSPIN 2.1>,
      <abs ABSG = 5 
       data hash MD5: 32K
       E0 D0 EF 4C F3 2C 4E 95 10 89 9A C5 FE FF 48 70>)
$$ ##END=
$$ 
$$ $$ hash MD5
$$ $$ 0A 63 E6 64 CA 18 C1 93 E5 32 62 B5 F1 2F 0E 50
##$RELAX= 
##$RELAX= 
##$RELAX= 
##$RELAX= 
##$RELAX= 
##$RELAX= 
##$RELAX= 
$$ Bruker specific parameters
$$ --------------------------
##$DU= <E:\>
##$EXPNO= 20
##$NAME= <NES1007_929159_9232788_6avWAGcTBk>
##$PROCNO= 1
$$ [...]
##$TP= (0..7)
150 150 150 150 150 150 150 150
##$TP07= 0
##$TPNAME0= <>
##$TPNAME1= <>
##$TPNAME2= <>
##$TPNAME3= <>
##$TPNAME4= <>
##$TPNAME5= <>
##$TPNAME6= <>
##$TPNAME7= <>
##$TPOAL= (0..7)
0.5 0.5 0.5 0.5 0.5 0.5 0.5 0.5
##$TPOFFS= (0..7)
0 0 0 0 0 0 0 0
##$TUNHIN= 0
##$TUNHOUT= 0
##$TUNXOUT= 0
##$USERA1= <user>
##$USERA2= <user>
##$USERA3= <user>
##$USERA4= <user>
##$USERA5= <user>
##$V9= 5
##$VALIST= <valist>
##$VCLIST= <CCCCCCCCCCCCCCC>
##$VD= 0
##$VDLIST= <DDDDDDDDDDDDDDD>
##$VPLIST= <PPPPPPPPPPPPPPP>
##$VTLIST= <TTTTTTTTTTTTTTT>
##$WBST= 2048
##$WBSW= 25
##$XGAIN= (0..3)
0 0 0 0
##$XL= 0
##$YL= 0
##$YMAX_a= 574668
##$YMIN_a= -480529
##$ZGOPTNS= <>
##$ZL1= 120
##$ZL2= 120
##$ZL3= 120
##$ZL4= 120
##$ABSF1= 14.98509
##$ABSF2= -5.573092
##$ABSG= 5
##$ABSL= 3
##$ALPHA= 0
##$AQORDER= 0
##$ASSFAC= 0
##$ASSFACI= 0
##$ASSFACX= 0
##$ASSWID= 0
##$AUNMP= <proc_prof1d_extract_pilot.lims>
##$AXLEFT= 0
##$AXNAME= <>
##$AXNUC= <1H>
##$AXRIGHT= 0
##$AXTYPE= 0
##$AXUNIT= <>
##$AZFE= 0.1
##$AZFW= 0.1
##$BCFW= 0
##$BC_mod= 0
##$BYTORDP= 0
##$COROFFS= 0
##$CY= 15
##$DATMOD= 1
##$DC= 0
##$DFILT= <>
##$DTYPP= 0
##$F1P= 0
##$F2P= 0
##$FCOR= 0.5
##$FTSIZE= 32768
##$FT_mod= 6
##$GAMMA= 0
##$GB= 0
##$INTBC= 1
##$INTSCL= 1
##$ISEN= 128
##$LB= 0
##$LEV0= 0
##$LPBIN= 0
##$MAXI= 10000
##$MC2= 0
##$MEAN= 0
##$ME_mod= 0
##$MI= 0
##$NCOEF= 0
##$NC_proc= -8
##$NLEV= 6
##$NOISF1= 0
##$NOISF2= 0
##$NSP= 0
##$NTH_PI= 0
##$NZP= 0
##$OFFSET= 14.98509
##$PC= 1
##$PHC0= 91.04919
##$PHC1= 0
##$PH_mod= 1
##$PKNL= yes
##$PPARMOD= 0
##$PPDIAG= 0
##$PPIPTYP= 0
##$PPMPNUM= 2147483647
##$PPRESOL= 1
##$PSCAL= 4
##$PSIGN= 0
##$PYNMP= <proc.py>
##$REVERSE= no
##$SF= 400.02
##$SI= 32768
##$SIGF1= 0
##$SIGF2= 0
##$SINO= 400
##$SIOLD= 32768
##$SPECTYP= <>
##$SREGLST= <1H.CDCl3>
##$SSB= 0
##$STSI= 32768
##$STSR= 0
##$SW_p= 8223.68421052631
##$SYMM= 0
##$S_DEV= 0
##$TDeff= 65536
##$TDoff= 0
##$TI= <>
##$TILT= no
##$TM1= 0
##$TM2= 0
##$TOPLEV= 0
##$USERP1= <user>
##$USERP2= <user>
##$USERP3= <user>
##$USERP4= <user>
##$USERP5= <user>
##$WDW= 1
##$XDIM= 32768
##$YMAX_p= 428867149
##$YMIN_p= -670286
##$CURPLOT= <Network HP LaserJet P1505>
##$CURPRIN= <$Network HP LaserJet P1505>
##$DFORMAT= <normdp>
##$LAYOUT= <+/1D_H.xwp>
##$LFORMAT= <normlp>
##$PFORMAT= <normpl>
##$SURQMSG= 1
$$ End of Bruker specific parameters
$$ ---------------------------------
##NTUPLES= NMR SPECTRUM
##VAR_NAME=  FREQUENCY,     SPECTRUM/REAL,   SPECTRUM/IMAG
##SYMBOL=    X,             R,               I
##VAR_TYPE=  INDEPENDENT,   DEPENDENT,       DEPENDENT
##VAR_FORM=  AFFN,          ASDF,            ASDF
##VAR_DIM=   32768,         32768,           32768
##UNITS=     HZ,            ARBITRARY UNITS, ARBITRARY UNITS
##FACTOR=    0.250966925370066, 1,           1
##FIRST=     8223.43324360094, -96897,       -55415
##LAST=      0,             -33592,          64387
##MIN=       0,             -670286,         0
##MAX=       8223.43324360094, 428867149,    0
$$ Real data points
##PAGE= N=1
##DATA TABLE= (X++(R..R)), XYDATA
$$ [...]
19507A38175a65136f5349D3519j8774b0731A95134g9944q4549C3973g2741A01889
19495b36346n896j03427B21444a60227j65313A0877K62670d26918e2280j60898
19485b13178j32580K4919j00717D2760a54073N5723k18487J2120a18644I388D285
19473e7545D8791M1588a58789A98079e5244a9001G3255J1831a71364B52160b30852
19461a66523o6563i1187k88718Q6383D0958M3779g0547J5132j32304B73085c2539
19449d9401q3125o0780B0261b8027A30005A747M2964a77660O2495F5233c91020
19437a25261A04205f1763A20444l7202b58714Q1666j02117N1992g9209G8023i1913
19425I037c5223j86243c1759C2402c46566f8877B5748P2462b68914c0761o5796
$$ y = [138175, -165136, -65349, 43519, 24745, -20731, 195134, -79944, -164493, 33973, -72741, 101889, -236346, -242242, -345669, 221444, -160227, -325540, 10877, 273547, -426918, -52280, -213178, -345758, -320839, -421556, 42760, -154073, -98350, -316837, -304717, -118644, 9388, 4285, -57545, 48791, 90379, -158789, 198079, -55244, -19001, 73255, 85086, -171364, 252160, -230852, -166523, -233086, -91187, -379905, -293522, 40958, 84737, -70547, -55415, -187719, 273085, -32539, -49401, -132526, -193306, 20261, -28027, 130005, 1747, 44711, -177660, -115165, 65233, -391020, -125261, 104205, -61763, 120444, 83242, -258714, -177048, -279165, -227173, -79209, 78023, -91913, 9037, -35223, -221466, -31759, 32402, -346566, -68877, 25748, 98210, -268914, -30761, -96557]
19414i6557H1564c29354a43755n5309f4475K0264j89255c5946E1022d23081E0142
19402a571r6722p4834A06222b2328l5058j64057H938a53007j34451J41484B30503
19390h5433c158H9383b28413R7449F9080J19283f5972k59081M1801h3478A29730
19378c0072A58183i1371c5093p7138N4232G8781e0667b4117B54639A00711j9349
19367H1362J03126F2711j1576O0581b57851J01685j01930A9662J4154e7731r3080
19356a50811f7804l32607a32192A54171O3670b34790P8730J1941C1114L0141a05883
19344B02608b79220Q588b4992F0484M2200e4487A82700n9591J25272A4466a21789
19332d0051r5911K915L2016I7971l2633a56121j69824J45133p1069j92195A01591
$$ y = [-96557, 81564, -329354, -143755, -199064, -64475, -44211, -233466, -35946, 51022, -423081, 50142, -1571, -98293, -173127, 106222, -22328, -57386, -221443, 8938, -153007, -287458, -145974, 230503, -85433, -3158, 89383, -228413, -130964, 69080, 188363, -65972, -325053, -283252, -83478, 129730, -30072, 158183, -91371, -35093, -112231, -57999, 78781, -50667, -24117, 254639, 100711, 81362, 184488, 62711, 51135, 111716, -257851, -156166, -258096, 19662, 33816, -57731, -150811, -67804, -400411, -132192, 154171, 217841, -234790, -156060, -144119, 31114, 61255, -105883, 202608, -279220, -270632, -24992, 60484, 102684, -54487, 182700, 123109, 248381, 14466, -121789, -40051, -135962, -133047, -101031, 97971, 65338, -156121, -325945, -180812, -251881, -444076, 101591]
19320b59865A4919b65792e8540E5469h4642j05122C30026i7990A43109B583d57477
19308A04704c28625a2765k99680b1432l40332A74144c12617i2699n8291P0760
19298h0230D9886O9000a249j72725D1270d5496p1434B6600a13073A8678K02708
19287B21386a80931Q4022k43623a21484E2691b2693q7196j34046d9110p4454C6113
19275c60780I3031A6111N586k332k047J7604F104L58963j73611a07854a4419k33564
19263b47983J08568L3490L7899a8571H1158f8179r2946P4338k40290J29898L250
19252a93929G8231b49104b6011F2215G934M08845b14439j67158J54774g4146c5324
19240B25311D270p16a31179A59390n2717b65961R1463l2165E8288h9907q093j8525
$$ y = [-259865, 14919, -265792, -58540, 55469, -84642, -189764, 330026, -97990, 143109, 2583, -457477, 104704, -328625, -12765, -312445, -21432, -361764, 174144, -312617, -92699, -150990, -80230, 49886, 118886, -1249, -173974, 41270, -45496, -116930, 26600, -113073, 18678, 221386, -180931, -96909, -340532, -121484, 52691, -22693, -109889, -243935, -49110, -123564, 36113, -360780, 93031, 16111, 21697, 19365, 17318, 34922, 6104, 365067, 191456, -107854, -14419, -247983, -139415, -105925, -68026, -18571, 81158, -68179, -161125, -86787, -327077, -197179, -193929, 78231, -249104, -26011, 62215, 7934, 416779, -214439, -381597, -226823, -74146, -35324, 225311, 4270, 3554, -131179, 159390, 106673, -265961, -174498, -206663, 58288, -89907, -98000, -116525]
19228a16525A37703a31591A14244b23288e6851p9288J075A94500a89181A00110
19217D2939c2613j76570A60612a64889j23482D2224P6904C7663a56431g6449A24537
19205i7627j4959b7510J1846j29365o6051m903L6424f0928A20685m0721a10637
19193E2065a42042d0463j99115a06602j9323K671p704d6007j98761a01300F8078
19181b60721A19929a68725A47698a71687C9562f3443o3314B5287K799a43311d2551
19169B6853j898c08907A5457c47193n3614g1750I6586a25379r7803A67007n5167
19158A11840b120j71005A26119g5673k98509A33378h7117K1165j05587I7671d4043
19146b03606c0916j1768D7299a6052A72531b0963l41783a9205k00788D3530f21196
$$ y = [-116525, 137703, -131591, 114244, -223288, -56851, -136139, -135064, 194500, -189181, 100110, 42939, -32613, -209183, 160612, -164889, -288371, 42224, 119128, 37663, -156431, -76449, 124537, -97627, -112586, -27510, -15664, -145029, -211080, -215983, -179559, -60928, 120685, 79964, -110637, 52065, -142042, -40463, -239578, -106602, -125925, -123254, -130958, -46007, -244768, -101300, 68078, -260721, 119929, -168725, 147698, -171687, 39562, -63443, -126757, 25287, 28086, -143311, -42551, 26853, 24955, -308907, 15457, -347193, -400807, -71750, 96586, -125379, -223182, 167007, 111840, -2120, -173125, 126119, -75673, -374182, 133378, -87117, -65952, -171539, 97671, -44043, -203606, -30916, -42684, 47299, -16052, 172531, -20963, -362746, -19205, -219993, 43530, -621196]
19134d4392F4598b1542A06901a72221M2208A0824P6205C4391b2342a0826B842
19122b6885l4532k76560G5302b12979O1038k0882O7418A43752f5341A51898J1208
19111A63106c8000j47611h0921j83071J19363P039j03185g0255m33254K26837
19101b76672J26149k75474b3807G1216f3164k80811B37900b14633C83165r9780
19091B83385B3239b08961M1631a9768o6802d1636q7718J9333j20569B39343a43206
19079A59556R5090j13347B4112R783g4875l4078n7644A43645n7530M3802a46904
19067a85060C7203K2107b07110a5852k23372i4872C4269P0796N23111G4968p869
19056F7099H665Q8536B9904d04105B4307J04810b33066n6414g6371E685f956C58668
$$ y = [-44392, 64598, -21542, 106901, -172221, -130013, 10824, 87029, 34391, -22342, -10826, 2842, -26885, -61417, -337977, 75302, -212979, -151941, -172823, -105405, 143752, -65341, 151898, 163106, -38000, -185611, -80921, -263992, -144629, -137590, -240775, -70255, -503509, -276672, -150523, -425997, -23807, 71216, -63164, -343975, 237900, -214633, 383165, 283385, 23239, -208961, -167330, -19768, -86570, -41636, -129354, -110021, -230590, 239343, -143206, 159556, 254646, 141299, 24112, 33895, -74875, -108953, -166597, 143645, 86115, 129917, -146904, -185060, 37203, 59310, -207110, -15852, -239224, -94872, 34269, 105065, 628176, 74968, 67099, 8665, 97201, 29904, -404105, 24307, 129117, -233066, -289480, -76371, 5685, -6956, 358668]
19043b23269o0794A3778b19421A33327a45087c9935j67444A40231a74075A09373
19032A07938a11486l35794B22590a8953D3248N2123e0613A49178A8230N2275a55600
19020H5106k992O635g370j1340j6329L042B6321a32487l1745D4509e5008k3609
19008g8617r6266c4295j02401C7733a23486A86080M5718L0837a88562f20j05490
18997a06110a1604A40218M7560a46037d5336B63385a99128L2078k00808i670A17155
18985C4896R413J64428a44798A29661a30658B42864a15764n3812l5031I2846i508
18973B1036O3755J24324K77749j54473A15650i1310R468A91763H046R9034j0287
18962I6793d7126k83873i3298H4407a51099e5459j09750n3508J0475P2399k9673
$$ y = [-223269, -284063, 13778, -219421, 133327, -145087, -39935, -207379, 140231, -174075, 109373, 107938, -111486, -447280, 222590, -18953, 43248, 95371, -50613, 149178, 18230, 70505, -155600, 85106, 82114, 88749, -7370, -18710, -35039, -31997, 26321, -132487, -164232, 44509, -55008, -78617, -174883, -34295, -136696, 37733, -123486, 186080, 231798, 262635, -188562, -620, -106110, -11604, 140218, 187778, -146037, -45336, 263385, -199128, -167050, -367858, -9670, 117155, 34896, 44309, 208737, -144798, 129661, -130658, 242864, -115764, -169576, -204607, 92846, -9508, 21036, 84791, 209115, 486864, 332391, 115650, -91310, -81842, 191763, 8046, 107080, 96793, -47126, -330999, -93298, 84407, -151099, -55459, -165209, -218717, -208242, -135843, -165516]
18951a65516A10639c39950D5989a98279f1108k78154B79743a15847A75580b53999
18940A71702g0404k6922A31976m3609q442a99554j5885B277K3739a16240K0146
18929i6094C11246b02650k4455A06084b7715A59779b4578k8597j23047j87218
18919c63440a78243M2896O2330q0887M0968j21044c1141C7741J17159K26275H4611
18907C85090J78047A09545M5220a27479M6647k51861B60067A04170a21192l49203
18897d70395B25952o0750g6256m0743A37698a64167L6432M2276j43652j34527
18887c63638d1057j40593k2806A20549a76231P5963l45135I3152a49275K2392
18877a26883p0043G499f7159k53794j15114D7005d26710Q1798A79404F0167c25481
$$ y = [-165516, 110639, -339950, 45989, -198279, -61108, -339262, 279743, -115847, 175580, -253999, 171702, -70404, -97326, 131976, 88367, 79925, -199554, -215439, 2277, 26016, -116240, -96094, 311246, -202650, -227105, 106084, -27715, 159779, -24578, -53175, -176222, -363440, -178243, -135347, -73017, -153904, -112936, -233980, -31141, 37741, 154900, 381175, 84611, 385090, 563137, 109545, 154765, -127479, -80832, -332693, 260067, 104170, -121192, -470395, 225952, 165202, -76256, -116999, 137698, -164167, -127735, -85459, -229111, -363638, -41057, -181650, -204456, 120549, -176231, -100268, -445403, 93152, -149275, -126883, -196926, 7499, -67159, -320953, -436067, 47005, -426710, -344912, 179404, 60167, -325481]
18865a75599K4239g5669A42156a53469N4026A93173b15831F6522L840O1395E262
18853A84527i3347k93976A84832d18440A9938M1103f106k07827A34597g2203A26635
18841C5950j2988c1736j02182K5423N1562m1612I4717J40916I4317Q2330F7630
18829A59951a124A25524d151j06833J1890F185P3313n470j5926B0213K6875f1334
18816a14806N4428C6018J14289K5806J11129g1118B70295I8585M0746a61013F5950
18804A21867a31628j89171b8512k17318B37943b730I7260Q5468D6207k1222c6162
18792A81516a00706L3935P643o9940D7373d26249D9806c2258a952A51434c50710
18780H2566e62406c3475F5800J09518h9384A27560O8952M6572C7294Q8614l797
$$ y = [-175599, -151360, -75669, 142156, -153469, -99443, 193173, -215831, 66522, 70362, 131757, 5262, 184527, -93347, -387323, 184832, -418440, 19938, 61041, -6106, -213933, 134597, -72203, 126635, 35950, 22962, -31736, -133918, -108495, -56933, -98545, 94717, 235633, 94317, 176647, 67630, 159951, -1124, 125524, -4151, -110984, -99094, 6185, 79498, 74028, 58102, 20213, 47088, -61334, -114806, -60378, 36018, 150307, 176113, 287242, -71118, 270295, 98585, 139331, -161013, 65950, 121867, -131628, -320799, -28512, -245830, 237943, -2730, 97260, 182728, 46207, 24985, -36162, 181516, -100706, -66771, -59128, -129068, 47373, -426249, 49806, -32258, -1952, 151434, -350710, 82566, -562406, -33475, 65800, 175318, -89384, 127560, 196512, 243084, 37294, 125908, 122111]
18769A22111e1160G2417h7835A46565a07346Q343l32929a67331D5855a12914m6896
18758a59810F1811c73779c6697C16479l636C9637Q4868a64722A59868C2321i2820
18746d8181J2047o5312M55p3092p7614h169k3531F2718e0923G2632a31356A10674
18733a33929k264k01051k45485B4644K96649i9978L1024j78298a6384j56575c4124
18721a72840e4487A33786b79638a33190k44189J80425p1608B25913a8623j40225
18711a58848f30k34380P1626E1755g5525j48197J7646J00218k37070G1310J03072
18700A74382c6062E002K9848N6246l8365b14427h1838n3649M3484j02987h4616
18688a40124C4574K88d47511A19611a05010B9307b37145A6792L6105c2969l8113
$$ y = [122111, -51160, 72417, -87835, 146565, -107346, -99003, -431932, -167331, 45855, -112914, -159810, 61811, -373779, -36697, 316479, 312843, 39637, 124505, -164722, 159868, 32321, -92820, -48181, -36134, -101446, -100991, -174083, -251697, -8169, -31700, 62718, -50923, 72632, -131356, 110674, -133929, -136193, -337244, -582729, 24644, 321293, -99978, -68954, -247252, -16384, -172959, -34124, -172840, -54487, 133786, -279638, -133190, -377379, -196954, -268562, 225913, -18623, -158848, -630, -235010, -163384, 51755, -75525, -223722, -206076, -105858, -342928, 71310, 174382, -36062, 5002, 34850, 91096, 52731, -214427, -81838, -135487, -92003, -194990, -84616, -140124, 34574, 34862, -447511, 119611, -105010, 29307, -237145, 16792, 52897, -32969, -71082]
18677g1082j13575P6780l7767M3673k3566I4691a1000j78324A67284a93617C40222
18665a91036h2857L0001a7928j90888f542j19034B52514a99385Q5254j76954j2129
18654c03214B8260b24765R9329M1717r6113E3737a62800B06629a66736M8199d1193
18642b44325j75883B5280N0588c51848d2314b0917B7684b23644R1701l47662a81575
18630B20226c23973B06525b20755a08573G0631b6582j80796h5859A10097n0332
18620E9765J19106i0604A32636d3581b14m889k94343A90967m0283c2428F8189
18608a07441c4573j64651P8756k24838B07188d6621A9375f8513l4042A51363E2730
18596a01710k83243a54894D38588H2825a9492J234j93783d3815G0728b32681p7232
$$ y = [-71082, -184657, -107877, -145644, -101971, -125537, 94691, -11000, -189324, 167284, -193617, 340222, -191036, -82857, -52856, -17928, -208816, -6542, -125576, 252514, -199385, -114131, -291085, -303214, 28260, -224765, -125436, -83719, -179832, 53737, -162800, 206629, -166736, -118537, -41193, -244325, -420208, 25280, 75868, -351848, -42314, -20917, 27684, -223644, -131943, -479605, -181575, 220226, -323973, 206525, -220755, -108573, 70631, -26582, -207378, -85859, 110097, 59765, 178871, -90604, 132636, -43581, -214, -5103, -299446, 190967, 150684, -32428, 68189, -107441, -34573, -199224, -120468, -345306, 207188, -46621, 19375, -68513, -102555, 151363, 52730, -101710, -384953, -154894, 438588, 82825, -19492, -18258, -212041, -43815, 70728, -232681, -309913]
18585c09913F8409a66303A5437K75310c49165r3069f5054o2781b4477B817f5038
18573c25166a24314q2708g6351j80189C1681f380B62554a4989n1510j24525K2389
18562a68635K9909N2710l62123A599a05322q0928B23938a1602j6776A43571e7779
18550A32447J3695p0444e13002F3727J69141A11892b65867A25694A7783a92917
18539E5756i4542F6497d93058A73699c6226J3238j53846q3276F820K14029b85146
18527c2151k57373a34598A96548b6094F3691a06312D2873g2004C44117a92939
18516b13165B6066L4988c3879j90209D7167J75868b51739H1953h2194K0022E90
18504b909l25300f6453p4088B132a58790J7389f0474A12383a08521m343A04760
$$ y = [-309913, 68409, -166303, 15437, 290747, -349165, -442234, -65054, -127835, -24477, 2817, -65038, -325166, -124314, -207022, -76351, -256540, 31681, -6380, 262554, -14989, -66499, -191024, -168635, -138726, -86016, -448139, 1599, -105322, -186250, 223938, -11602, -28378, 143571, -57779, 132447, 146142, 75698, -513002, 63727, 232868, 111892, -265867, 125694, 17783, -192917, 55756, -94542, 66497, -493058, 173699, -36226, -22988, -176834, -260110, 6820, 220849, -285146, -32151, -289524, -134598, 196548, -26094, 63691, -106312, 42873, -72004, 344117, -192939, -213165, 26066, 61054, -33879, -224088, 47167, 223035, -251739, 81953, -82194, -62172, 590, -2909, -328209, -66453, -140541, 2132, -158790, -141401, -60474, 112383, -108521, -112864, 104760]
18492D1127a28073A94887a17814L2266j97606D2589b63357J2890B2328m853b8835
18480h778j59238O0705c2014A51832d13059b06392I0237c10474O2045L3660b9704
18468I2364a21478A24022Q1882d39953J98796A03620B170a86402B5557M0400h9240
18456h5743A10159J17795P927A13508b59544g1668j47866b3684q2973B2451g4604
18444b67957r0584A18685a53976P5175A14431K5927L96691g0427A2744a09882
18433E9451i9020c8432j95488C99b76452E7469a38053L6300B06226I1771l570
18422H8201J14421a60992M6514k54413D3990b7939l43955a71612H9979j8739L1003
18411A02243h5258A11442c32986L1222a317l5822B0434h7340j8255I4753O3059
$$ y = [41127, -128073, 194887, -117814, -85548, -283154, 42589, -263357, -250467, 22328, 17475, -28835, -8778, -168016, -107311, -32014, 151832, -413059, -206392, 90237, -310474, -248429, -214769, -29704, 92364, -121478, 124022, 205904, -439953, -241157, 103620, 2170, -186402, 25557, 65957, -89240, -85743, 110159, 227954, 235881, 113508, -259544, -71668, -219534, -23684, -106657, 22451, -74604, -267957, -358541, 118685, -153976, -78801, 114431, 140358, 537049, -70427, 12744, -109882, 59451, -99020, -38432, -233920, 399, -276452, 57469, -138053, -101753, 206226, 91771, 88201, 202622, -160992, -114478, -368891, 43990, -27939, -371894, -171612, 89979, 71240, 102243, -85258, 111442, -332986, -301764, -1317, -37139, 20434, -87340, -105595, 94753, 157812]
18400A57812J42681b05661H5511b57041C5735b7931A95676J19346A2753D992a02998
18388a83515i940m59990a87724A27128a14382n0655H2670g5197l5468A67838B5222
18376C1798J04329E7339g7027n4637C56122g069n2412E1403P0018a87703h8527
18364a5731M265I2767b15346K352A3794K5339d5853I7051j1831a59551A18142
18352G8811O912h7553p5558h0948q7413N645n3158k602c9491k7708a200A48028
18339A39043b8852o855G4951c52625f6012j30284l2768a13410B1137b65102I6054
18327A84782F4926M2499b05050p7968A03646d80727F6272c0793C0213L16933A50038
18315B26287B3948J28463B3927J99333H0522b06232a8627D7377c29033D403L2634
$$ y = [157812, 300493, -205661, 85511, -257041, 35735, -27931, 195676, 315022, 12753, 4992, -102998, -183515, -9940, -469930, -187724, 127128, -114382, -165037, 82670, -75197, -110665, 167838, 25222, 31798, 136127, 57339, -77027, -131664, 356122, -7069, -59481, 51403, 121421, -187703, -88527, -15731, -11466, 92767, -215346, -212994, 13794, 39133, -45853, 97051, 85220, -159551, 118142, 78811, 85723, -87553, -163111, -80948, -168361, -162716, -215874, -218476, -39491, -67199, -1200, 148028, 139043, -28852, -35707, 74951, -352625, -66012, -196296, -229064, -113410, 21137, -265102, 96054, 184782, 64926, 107425, -205050, -283018, 103646, -480727, 66272, -30793, 30213, 347146, 150038, 226287, 23948, 152411, 23927, 223260, 80522, -206232, -18627, 47377, -329033, 4403, 37037]
18304C7037P4824J7605J89659C1335K8882c4269G5289a41743A9950J6006L1881
18293F7837i307A00577h4360j90873E6814a99839g8063c8768D1484h8628O668
18282h1960B4656d52334c684k64641g9721A33408a0310n7482n9247A3483a01211
18270H5725J45348F2222k4480j1570h7899j7585M5903K8372j73209c0755A5749
18258B3842M4753a34135d4762A66866o573a74914D25121a52804d344A39193d4546
18246G8914N2325e0088E6608c2832A36757b48659h8742d792p4243k23592J9153
18235b83474F0364a951A38977c71n0134B40564b00451E130L5179A5708L6994g1760
18222E3413a36649M7030A16188g3561A56338c39098C5463P9048a45574G4260J16929
$$ y = [37037, 111861, 129466, 319125, 31335, 60217, -34269, 75289, -141743, 19950, 35956, 67837, -9307, 100577, -84360, -275233, 56814, -199839, -78063, -38768, 41484, -88628, -81960, 24656, -452334, -3684, -268325, -79721, 133408, -10310, -67792, -127039, 13483, -101211, 85725, 231073, 62222, 37742, 26172, -87899, -105484, -59581, -31209, -204418, -30755, 15749, 23842, 68595, -134135, -44762, 166866, 160293, -174914, 425121, -152804, -4344, 139193, -44546, 78914, 131239, -50088, 56608, -32832, 136757, -248659, -88742, -4792, -79035, -302627, -283474, 60364, -1951, 138977, -371, -50505, 240564, -200451, 5130, 40309, 15708, 52702, -71760, 53413, -136649, -89619, 116188, -73561, 156338, -339098, 35463, 114511, -145574, 74260, 191189]
18211A91189l161J19461i442j5135e046k47810c2439B91247F8483a07082K3146
18200h3936m7046A72574K5708m7897c9816j46412j2941i6179J4017A30861E3590
18188b42413A31694h0420b2856i377D87444F2569b52996B41689a60623K3238C56628
18176a5621I4086a7380j05800e325k1370B19078a26602m7194p9154J25372j0841
18165a38419l3386D6226R480b5273p0660r54j16516I1435h7587a682j40806K1806
18153a20682G0822a858j68797e4295E865P7092J00193k1542L8806C5521L2194
18142F7715P1061f1992L0211A32283i430C84126F676a72203n3610L2773A95764
18130A69850F2463a55549D9254M868e20425g3763j27244h2884C7244n485K21171
$$ y = [191189, 188028, 307489, -9442, -24577, -5046, -252856, -32439, 291247, 68483, -107082, -83936, -130982, 172574, 198282, 150385, -39816, -186228, -199169, -96179, -82162, 130861, 53590, -242413, 131694, -80420, -22856, -9377, 487444, 62569, -252996, 241689, -160623, -137385, 356628, -15621, 94086, -17380, -123180, -5325, -26695, 219078, -126602, -173796, -252950, -127578, -138419, -171805, 46226, 55706, -25273, -95933, -96887, -213403, 91435, -87587, -1682, -142488, -120682, 70822, -1858, -170655, -54295, 5865, 82957, 183150, 161608, 200414, 35521, 67715, 138776, -61992, -31781, 132283, -9430, 384126, 6676, -172203, -225813, -193040, 195764, 169850, 62463, -155549, 49254, 54122, -520425, -73763, -201007, -82884, 37244, 31759, 252930]
18119B52930h43k97282h7803C2879b07623A40215f7663D9449e1690A32351F2187
18107h6589F9519a73887A25431Q7889i557k63836d4779F4978i8476j52521f5191
18095a28305b7429B3243O6593Q508a44609B58644C8253e13j65627r9251b3681
18083B2048J88861e7946A18248B5072b3796H503J3977b8962q7413G4623a98277
18071a75864B0738b61726A19412K30279G6028k9827L4517a01721j14043M5634
18061a70130f6421A43299o8566c0372k04977D9385d591j01766a0710p648A76711
18049a13404b820k7284I5202b8240H0687K0256g518A15371R3614d5173A2382a16588
18036A92001b38963B8414N5557g7330F8216C0620E267M087P9098b61698h3005
$$ y = [252930, -843, -298125, -87803, 32879, -207623, 140215, -67663, 49449, -51690, 132351, 62187, -86589, 69519, -173887, 125431, 213320, -9557, -273393, -44779, 64978, -98476, -250997, -65191, -128305, -27429, 23243, 89836, 98344, -144609, 258644, 38253, -513, -166140, -265391, -23681, 22048, 210909, -57946, 118248, 25072, -23796, 8503, 22480, -28962, -116375, 74623, -198277, -175864, 20738, -261726, 119412, 349691, 76028, 46201, 80718, -101721, -215764, -170130, -66421, 143299, 74733, -30372, -235349, 49385, -4591, -106357, -10710, -18358, 176711, -113404, -2820, -30104, 95202, -28240, 80687, 100943, -7518, 115371, 208985, -45173, 12382, -116588, 192001, -238963, 28414, 83971, -77330, 68216, 30620, 5267, 9354, 88452, -261698, -83005]
18024b13481P6547A72444C7159a56895k47921B53849a73369h1177o4734J0925
18014a34986E2873N3241L466J88032h1817A270g6593o710j72010A71643B7566
18002d6445p8354B7877Q2950f1004q3469D7063Q1049e7197o2210J8461D5237b43454
17989b34675B20491a06934H4192e0573A85100c14786b513l73544E9885N3626j3929
17978I9582A8924h0832A02740a63403D70721A05623b43433A54057o7248R1956
17968A78765K46455A09922b07400j20170J52929A32175D2816i0528E2834D694
17957B41063f8189A96262M9685c3613A27466a59517A23587b709j81136B8456a4722
17945B9796b31484F7988J5002B9973a84763j08574J26223B1748e2017F9811K30344
$$ y = [-213481, -136934, 172444, 37159, -156895, -404816, 253849, -173369, -81177, -145911, -134986, 52873, 106114, 109580, 297612, -81817, 1270, -76593, -83303, -255313, 171643, 27566, -46445, -124799, 27877, 110827, -61004, -144473, 47063, 128112, -57197, -119407, -100946, 45237, -243454, -234675, 220491, -106934, 84192, -50573, 185100, -314786, -2513, -376057, 59885, 113511, 99582, 18924, -80832, 102740, -163403, 470721, 105623, -243433, 154057, 86809, 178765, 425220, 109922, -207400, -327570, -174641, 132175, 42816, -90528, 52834, 4694, 241063, -68189, 196262, 245947, -33613, 127466, -159517, 123587, -2709, -183845, 28456, -14722, 29796, -231484, 67988, 82990, 29973, -184763, -293337, -167114, 21748, -52017, 69811, 300155]
17934C00155r6155b04260I3282K47398A1624P7554K7691N5781g7543B38393M2119
17923B80512c401C21214j43900F4916B3107J80120j0431N227E2857J39737a38151
17911e2820B1228J03929R2329I7943a2813A40432q351A1506J70708b57829d0725
17899d9510j2390F2521J22356e4940E3554a63287o6791f5274n1335a7972m3218
17888f1190j82999f071B8469b43563A12742l4440a5422o9308b4866l71491G1124
17876a31692A16807h8897G379a71709B02358m5224B9486K63956J82160A10715
17865a59698A65869D3751O3882c2138n3707M058A18586m7612g9677q7526a3072
17853I3129K25806a29563J5798F532a69267b2439l6496l95490B84667i3010b5087
$$ y = [300155, 204000, -204260, 93282, 340680, 11624, 89178, 116869, 172650, -77543, 238393, 280512, -3401, 321214, 177314, 64916, 23107, 203227, 192796, 198023, 52857, 192594, -138151, -52820, 21228, 125157, 217486, 97943, -12813, 140432, 132081, 11506, 182214, -257829, -40725, -49510, -61900, 62521, 184877, -54940, 53554, -163287, -230078, -65274, -116609, -17972, -61190, -244189, -6071, 28469, -243563, 112742, 78302, -15422, -84730, -24866, -396357, 71124, -131692, 116807, -88897, 7379, -171709, 202358, 157134, 29486, 293442, 475602, 110715, -159698, 165869, 43751, 107633, -32138, -85845, -81787, 118586, 70974, -79677, -167203, -13072, 93129, 318935, -129563, -113765, 6532, -169267, -22439, -58935, -454425, 284667, -93010, -25087]
17841A91283L1236e5400A51015c4844B33700a68838h000F620K10517c0574G2670
17829B3916R0321C0785e5116D61g5026L4841B07151A9757J95797h6122A12912
17817d7113B03231a47239c2448m24787A75781n0400J05829G3763J20546G911J99526
17806B07437H0611J51256c4108j03329C1741N4022f0306H3610K05301B1725c45863
17794D5132b45141e1647a9993A91175q2489d4129B24761o7272a4537A90073j9919
17783A70154f1108b6777j09190I5176C4447L38880A26137M8271a01854A04295
17772A47116K06813b58585e4687r0334H2213J99733A22352O861J05976c8747p2808
17761a11555C49296m9494A47684H846b29329C4706b99915a00033J5243A09268
$$ y = [191283, 222519, -55400, 151015, -34844, 233700, -168838, -8000, 6620, 217137, -30574, 72670, 23916, 114237, 30785, -55116, 461, -75026, -40185, 207151, 19757, 215554, -86122, 112912, -47113, 203231, -147239, -32448, -457235, 175781, 125381, 231210, 73763, 194309, 7911, 207437, 80611, 231867, -34108, -137437, 31741, 85763, -60306, 83610, 288911, 21725, -345863, 45132, -245141, -51647, -19993, 191175, 108686, -44129, 224761, 157489, -14537, 190073, 170154, -61108, -26777, -135967, 95176, 34447, 373327, 126137, 174408, -101854, 104295, 147116, 353929, -258585, -54687, -145021, 82213, 281946, 122352, 129213, 235189, -38747, -111555, 349296, 299802, 147684, 8846, -229329, 34706, -299915, -100033, -84790, 109268]
17750d2302A12264c1926B02213K5542b16059R9426E9900L64396j53934E2714c4160
17738B48769H8347J36346H9337J94953j24128j2354n1090a26224G4801J17703
17728A92504a87393E4424d2717n4773A28906b03030A94624b81603O6687A28644
17717a4521B33778p2837B7768L12473f584c216j9947C80352C8583N9704a04380
17705F1039K7230c5032k38896C05241g9151B50202j9290F3928I126J13470b33740
17693E5843J83248C9566M6745a54894I1009a5886A53528J00817a75407C9727a06780
17681C82990A31372j7194D8668a31791K8288C03894D2708N4420K19904a2764B06324
17669d9143A72460k2545o0961J95030a68774A01687a83614C43246e847p1047G2468
$$ y = [-42302, 112264, -31926, 202213, 227755, -216059, -116633, 59900, 424296, 270362, 52714, -34160, 248769, 88347, 224693, 89337, 284290, 160162, 147808, 96718, -126224, 74801, 192504, -187393, 54424, -42717, -97490, 128906, -203030, 194624, -281603, -214916, 128644, -14521, 233778, 160941, 27768, 340241, -6584, -3216, -23163, 380352, 38583, 98287, -104380, 61039, 88269, -35032, -273928, 305241, -79151, 250202, 230912, 63928, 9126, 122596, -233740, 55843, 239091, 39566, 86311, -154894, 91009, -15886, 153528, 254345, -175407, 39727, -106780, 382990, 131372, 114178, 48668, -131791, -103503, 303894, 42708, 97128, 317032, -12764, 206324, -49143, 172460, 149915, 88954, 283984, -168774, 101687, -183614, 343246, -5847, -76894, 72468]
17657a64249B09711F5370c814A7378K0198M6220J55383A3644Q1820k6943L38772
17646D07293j58618q4891P1685h292r7679B37505G18a9926A8514K33836j06563
17635A45787n5910a36962A24401P6863n2086L301j0431l7083J3240J9252m0441
17624I7016R8220J58488B579P6525K38715a82515A58020C7228K34433O8659a07601
17612A57123a67858A36957E1179J41381K96896A23428j1013P2014o5886A6663
17601A81580R8969E0173a5702B67716B305J18518a90400F2372a31263C82307H8067
17589A04528N2327o8235B022a07290q0880h3534C66895B8210K56242I6912J50009
17578B46921o6447n1786J75207q9127H0772h7108F6276K2918J97145a61292F6132
$$ y = [-164249, 209711, 65370, -3814, 17378, 37576, 83796, 239179, 13644, 95464, 68521, 407293, 248675, 163784, 235469, -8292, -105971, 237505, 718, -19926, 18514, 252350, 145787, 89877, -136962, 124401, 201264, 149178, 152479, 142048, 104965, 118205, 137457, 97016, 195236, 353724, 2579, 79104, 317819, -182515, 158020, 37228, 271661, 340320, -107601, 157123, -167858, 136957, 51179, 192560, 489456, 123428, 112415, 184429, 118543, 16663, 181580, 280549, 50173, -15702, 267716, 2305, 120823, -190400, 62372, -131263, 382307, 88067, 104528, 156855, 88620, 2022, -107290, -188170, -83534, 366895, 28210, 284452, 96912, 246921, 180474, 128688, 303895, 214768, 80772, -87108, 66276, 89194, 286339, -161292, 66132]
17566D0633K15719l8833k9011O1175m0893J1988m6803G1028K39582p4971g6684
17554A23455J12367l4402i5266A49799N2937p4062K71028j51408J13587I6111
17543A43432J47109b08198A24251K80818A62603K76095G3653L48688A72753j6808
17533A55945k8648K28907j8734j16350K7825K78568j25210N45409j40294M25696
17523A233114j99359m19894R5998J89657l24008k21679J75603j53854m0222O0188
17513C95544q2587O07673C93920L29815N45754E73725K02745j54596j57457L5562
17503D99979j40090j30432J76113A29680J24888p627J72391A96178J72800E7590
17492C44671i3456B68848o2090E9865K38994K0194o3630K04561B06942d7730I3867
$$ y = [40633, 256352, 217519, 188508, 249683, 208790, 220778, 173975, 71028, 310610, 235639, -76684, 123455, 235822, 201420, -95266, 149799, 202736, 128674, 399702, 248294, 361881, 96111, 143432, 290541, -208198, 124251, 405069, 162603, 438698, 73653, 422341, 172753, 155945, 127297, 356204, 337470, 221120, 248945, 527513, 402303, 947712, 807418, 1233114, 1033755, 613861, 709859, 899516, 575508, 353829, 529432, 375578, 335356, 395544, 312957, 920630, 393920, 723735, 1269489, 573725, 776470, 621874, 464417, 499979, 359889, 229457, 405570, 129680, 254568, 246941, 419332, 196178, 368978, 57590, 344671, -93456, 268848, 206758, 59865, 298859, 319053, 255423, 459984, 206942, -47730, 93867]
17480C10639j52402o2082K26221r7925o0319a60840e8604C8899K14753J42723
17470C96375r8310a02087C39986j67870M02164H7536K18861j53189l9872J97245
17460C10581D5486e3294B23199J87003b8782G8647J28175m5002k1697C5081M84688
17449E19769p205B35867J8330N59978l23375K24199l07442o3301J05908j54341
17439B95823n2227K32914b0785H6985M03184J8537j28154A20616J59278p0780
17429B09114r57D0609K78493K43785k45446I1658M76514j99953n5333J09353J79888
17418F02127B03689L67211j78433h0623B43613J46264o3928J3040A02852k0146
17408H2706J98427l0169L11884j29759J0158j47298J314J6247n6949J40954O7560
$$ y = [310639, 158237, 96155, 322376, 224451, 164132, -160840, -58604, 38899, 253652, 396375, 298065, -102087, 339986, 172116, 574280, 87536, 306397, 153208, 113336, 310581, 45486, -53294, 223199, 410202, -28782, 78647, 206822, 161820, 140123, 35081, 519769, 512564, 235867, 254197, 814175, 490800, 714999, 407557, 344256, 450164, 295823, 243596, 476510, -20785, 86985, 490169, 508706, 380552, 120616, 279894, 209114, 208157, 40609, 319102, 562887, 317441, 91658, 568172, 368219, 312886, 422239, 602127, 203689, 570900, 392467, -80623, 243613, 389877, 325949, 338989, 102852, 82706, 281133, 250964, 562848, 433089, 443247, 295949, 297263, 313510, 256561, 397515, 465075]
17397D65075j22113A7259L84062n9363j54357K1587P7360D4825Q0327J81196J88341
17386D94689Q1984k06354A52214n697J10121Q4543b4904A44974K60715j19009
17376B86680j27175N7631I8008L10840F7707e634B63591j19858K2194M3682N4932
17365B64541l3481J25996c0493D02431J32930A8290K33577J26203j67096H5223
17354B70707q6817O8602o1737J75481j47213m1562N2039J0608K80895J4454k04405
17343C31052n4205A26832E182J38232o9162P1882J40664J49409q6973d7433E44079
17331A16165D0757K31981J88695A35243N9744J72413j21545F3192L22858j5177
17321C70873j1572p783A61174o8266J46212c9123A52163K56706j85216L92330
$$ y = [465075, 342962, 17259, 401321, 341958, 187601, 209188, 286548, 44825, 125152, 306348, 494689, 576673, 370319, 152214, 146517, 256638, 341181, -24904, 144974, 405689, 286680, 159505, 217136, 98008, 408848, 67707, -5634, 263591, 143733, 165927, 209609, 264541, 231060, 357056, -30493, 402431, 535361, 18290, 251867, 378070, 210974, 85223, 270707, 183890, 252492, 190755, 366236, 219023, 177461, 229500, 240108, 521003, 535457, 331052, 276847, 126832, 5182, 143414, 74252, 146134, 286798, 436207, 349234, -47433, 544079, 116165, 40757, 272738, 461433, 135243, 194987, 367400, 245855, 63192, 386050, 370873, 359301, 351518, 161174, 92908, 239120, -39123, 152163, 408869, 223653, 615983]
17311F15983D3678K78319A06617M06210k49289J81216j39591L0219A9029L06365
17301C25394j01604m7482G4749K43405I0203M51068j42482A39491J12574M8894
17291C00959j12483H9704J50462j2298K92220p4874A86109M81232l03963j43794
17281B19584r0439J85479N9119J24684B21542j05775K28314J81345r7297n5240
17271C72889j78672r632O7157q9384N33988j19857k08792p1033j06344L21725
17261E12045J8733B16446j4398m8441J26710N3482P0810L43465A51847J07911
17251B59758A08198D4248J82513m0081L26461B54993p6803J83746J33023j44152
17241C50807K25770j40812j54584k6238K27292j90549R660j44382L20074N3072
$$ y = [615983, 43678, 321997, 106617, 512827, 263538, 444754, 305163, 335382, 19029, 325394, 223790, 176308, 74749, 318154, 90203, 541271, 398789, 139491, 252065, 300959, 188476, 89704, 240166, 227868, 520088, 445214, 186109, 667341, 363378, 219584, 129145, 314624, 373743, 498427, 221542, 115767, 344081, 525426, 428129, 372889, 194217, 184585, 251742, 162358, 696346, 576489, 367697, 296664, 190320, 512045, 530778, 216446, 202048, 153607, 280317, 333799, 404609, 748074, 151847, 259758, 108198, 44248, 226761, 186680, 513141, 254993, 178190, 361936, 494959, 350807, 576577, 435765, 281181, 254943, 482235, 291686, 301346, 156964, 477038, 530110]
17231E30110j71250J629J7676L0269k01540K07709k0444e3733E4724K04406o160
17220B52970L36353B83170n7353J56132R7000j62476m5046M66544C35902r6179
17210B39723N84683k53627J69444j60066j57420A63123K46751J4715k3727o7762
17200C33100J60988A51173h5930C65076k0570J74083B00041M28117B96400N9564
17190C55964K94720k110k26215J71311A80309K32128J97649j05600M4978k26812
17180C22652I8293O8625L60841k34479K37137k08787K4014Q4370Q337K35061j58556
17169E14856F7218M13537j01364N3190j92576M75379A30127L48956r1708M66849
17159H54224C34757K90063J20345l47164M90948D01258k7995K82944Q9980l02601
$$ y = [530110, 358860, 360489, 378165, 408434, 206894, 414603, 394159, -53733, 54724, 259130, 252970, 589323, 283170, 225817, 381949, 478949, 316473, 271427, 737971, 335902, 239723, 824406, 570779, 740223, 580157, 422737, 163123, 409874, 424589, 400862, 333100, 494088, 151173, -85930, 365076, 344506, 518589, 200041, 628158, 296400, 355964, 650684, 648574, 422359, 593670, 180309, 412437, 610086, 504486, 549464, 322652, 98293, 166918, 527759, 293280, 530417, 321630, 345644, 430014, 438351, 673412, 514856, 67218, 480755, 379391, 432581, 240005, 715384, 130127, 479083, 387375, 854224, 334757, 624820, 745165, 398001, 888949, 401258, 373263, 656207, 746187, 443586]
17149D43586j6744K73995k44392j13181J7293K18744N4383r9967J0789K49334
17139G93840j63204k08j17152J4971M920R9796k39572k4173L85762B40853M72438
17128G13291C17380J85825N3438J0452j59091L06728J43100j1816l42858q4459
17118D18699p4828M09688j40438J93481l11275K22697j84817O8835Q3257k51742
17108D33557L08892l05294P0406j98567L51402K43969o5612j11301j21294j95572
17098D10586o7517K91557J22643j66057K5439K78164k92534j06363K16767j65906
17088E46779L0719k85300L53555J57663m8105o8455M41948m87546J66176P9513
17078H86947k08428J48361j89109J01954R6393L2002J70708m52543L81345j6589
$$ y = [443586, 426842, 700837, 456445, 343264, 360557, 579301, 633684, 533717, 544506, 793840, 630636, 630428, 513276, 528247, 533167, 632963, 393391, 369218, 754980, 240853, 713291, 317380, 503205, 556643, 567095, 408004, 714732, 857832, 846016, 503158, 418699, 343871, 753559, 613121, 806602, 495327, 718024, 533207, 602042, 685299, 433557, 742449, 437155, 507561, 308994, 660396, 904365, 838753, 727452, 606158, 410586, 343069, 634626, 757269, 591212, 616651, 894815, 602281, 495918, 712685, 546779, 577498, 292198, 645753, 803416, 755311, 686856, 1128804, 641258, 807434, 886947, 678519, 826880, 637771, 739725, 836118, 868120, 1038828, 586285, 967630, 951041]
17068I51041L06699n22138Q4390j00294J32195Q6250k60013K3770M95300k25559
17058I71641L8677l49459M75056l52898o1435J14213R9469k6656J05725m12671
17048F01662J52979J13111K98992j06901k77795K52733l6626k2444j57520J39155
17038I57346l60498J68114M35213O0550m22386Q2184j47652M24195j3282m676
17028A179108m54898M16623L03219m75001K3569J29282J20461m79k24514K12457
17018A229827k02671J29476q7660K96989O2293k72452K49385l19199l98144L56936
17008A044780n940P4269N7021J85140l8722M7719k02628J41390J55666l75921
16998A082774M88898k90124j67508j01387J72092L88742o53131N10135M4595j95125
$$ y = [951041, 1257740, 735602, 819992, 719698, 851893, 938143, 678130, 701900, 1197200, 971641, 1010318, 660859, 1135915, 783017, 721582, 835795, 935264, 908608, 1014333, 601662, 754641, 867752, 1166744, 1059843, 782048, 1034781, 998155, 975711, 818191, 957346, 596848, 764962, 1200175, 1260725, 838339, 920523, 772871, 1197066, 1183784, 1179108, 724210, 1140833, 1444052, 969051, 992620, 1121902, 1242363, 1241884, 1017370, 1229827, 1027156, 1156632, 1068972, 1365961, 1428254, 1155802, 1405187, 1085988, 687844, 1044780, 1038840, 1113109, 1170130, 1355270, 1316548, 1364267, 1161639, 1303029, 1458695, 1082774, 1571672, 1281548, 1114040, 1012653, 1184745, 1573487, 920356, 1430491, 1475086, 1279961]
16988A279961J16319m9034o269J99023l0544p9947o6859j50274J58839J39212
16978A510427K16430k49410N8075k73028M55457j95618L1679k1162K69536k53715
16968A548671K76302r154j93957P8598j28805L13252k63197K71496Q0692l00502
16958A673396j00007K25599L5465k22528L51639l71102L80430L0477N2863j57820
16948A898412q7685J94416j14803M030J44696m46936L68947K61534Q9022m59074
16938A852559K41802K16053k10287O0110J29759p7187L2185m9364p3219q8918
16928B033493J93369J14136J93379l2790n3065j4872Q0885j59956J50087m4764
16918B459902J91856k18541K49483l05451K95654J40542q4664Q920j94798n3124
$$ y = [1279961, 1396280, 1347246, 1340977, 1540000, 1509456, 1429509, 1362650, 1212376, 1371215, 1510427, 1726857, 1477447, 1535522, 1262494, 1717951, 1522333, 1554012, 1532850, 1802386, 1548671, 1824973, 1815819, 1621862, 1700460, 1571655, 1884907, 1621710, 1893206, 1973898, 1673396, 1573389, 1798988, 1834453, 1611925, 1963564, 1592462, 1972892, 2003369, 2056232, 1898412, 1810727, 2005143, 1890340, 1894370, 2039066, 1592130, 1961077, 2222611, 2311633, 1852559, 2094361, 2310414, 2100127, 2160237, 2289996, 2212809, 2244994, 2195630, 2122411, 2033493, 2226862, 2340998, 2534377, 2501587, 2448522, 2433650, 2514535, 2354579, 2504666, 2459902, 2651758, 2433217, 2682700, 2377249, 2672903, 2813445, 2728781, 2737701, 2542903, 2489779]
16908B489779L11745K81551k48615J70910j9672K06118j09920j45576J52863k55444
16898B833739O08033n62648K20308N7271K30595o235r7546J74316j06895j18507
16888C232431J17272L50560p3426O4728m6674K7248K40360l26485M1543L96351
16878D023908M3626j33598L22527q8190k68868K54368K27357k2781l2018J50646
16868D476977p2982J61802J04473L957L18910l99279L34116q343j04611L21100
16858E136120K83915n46173K59829J309J00965M04811L2275J5632Q5411j0103
16848E763991J89216j1347p3702M42631P0948k23551K11069L22264l38712M54682
16838F807489J77311j20529L75410J05488j24944q9235N20426j85343M09371J21286
$$ y = [2489779, 2801524, 3083075, 2834460, 3005370, 2985698, 3191816, 3081896, 2936320, 3089183, 2833739, 3441772, 2879124, 3099432, 3156703, 3387298, 3381063, 3283517, 3457833, 3350938, 3232431, 3349703, 3700263, 3626837, 3691565, 3644891, 3672139, 3912499, 3586014, 3627557, 4023908, 4067534, 3933936, 4256463, 4168273, 3899405, 4153773, 4381130, 4358349, 4326331, 4476977, 4403995, 4565797, 4670270, 4674227, 4993137, 4593858, 4927974, 4919631, 4815020, 5136120, 5420035, 4873862, 5133691, 5135000, 5235965, 5640776, 5673051, 5688683, 5774094, 5763991, 5953207, 5941860, 5868158, 6310789, 6381737, 6158186, 6369255, 6691519, 6352807, 6807489, 6984800, 6864271, 7239681, 7345169, 7220225, 7130990, 7651416, 7466073, 7875444, 7996730]
16828G996730M8455K86997L65023n5069M6069J58302K70779J21662J33119N68364
16818I940431m25865N95373j56254L48047K97168M1241J86616Q8113M78741j14993
16808A1278618N92071l2598O00133p1527N78245J65634K96795J03703K49957L60236
16798A4121267M29876M08836M48835K78917L46460M0206L99597R40860j34509
16789A7280345P22646N91207J67671N28029K56659O12605P43133L56629O49656
16780B1908580L62784J137069L35648K50064P56763Q88691P57059P86375M76859
16771B7659892P40876R11796Q43144J243176P26669R49686Q00354J014124Q07208
16762C5696925J305447R26647J264664J541112Q82672Q94038J695574J568902
$$ y = [7996730, 8045185, 8332182, 8697205, 8642136, 8688205, 8846507, 9117286, 9238948, 9372067, 9940431, 9514566, 10109939, 9953685, 10301732, 10598900, 10640141, 10826757, 10914870, 11393611, 11278618, 11870689, 11838091, 12438224, 12366697, 12944942, 13110576, 13407371, 13511074, 13761031, 14121267, 14551143, 14959979, 15408814, 15687731, 16034191, 16074397, 16473994, 17414854, 17280345, 18002991, 18594198, 18761869, 19289898, 19546557, 20159162, 20902295, 21258924, 21908580, 22271364, 23408433, 23744081, 23994145, 24750908, 25639599, 26396658, 27183033, 27659892, 28400768, 29312564, 30155708, 31398884, 32125553, 33075239, 33875593, 34889717, 35696925, 37002372, 37929019, 39193683, 40734795, 41617467, 42511505, 44207079, 45775981]
16754D5775981J589435J337471J264720J744495J465586J638533J772104J688316
16746E8276641J518473J964472J951594J710026J707959K119780J916698J641225
16738G2806868J937554J626659J767370J888116J730027J407993J611570J804738
16730H6580895J303234J360437J335692Q77519P71921R27959N13007Q8529N80003
16721I4339196l90578J18869k77380m97413o02744r89185q87312j151697j130561
16712H8531195j568839j182109j519121j974641j762854j860496j313011j966725
16704G5383399k112344k043706j710542j808803k004038j703431j706633k004642
16696F0289260j875300j780439j321121k092399j654210j474029j432171j510335
$$ y = [45775981, 47365416, 48702887, 49967607, 51712102, 53177688, 54816221, 56588325, 58276641, 59795114, 61759586, 63711180, 65421206, 67129165, 69248945, 71165643, 72806868, 74744422, 76371081, 78138451, 80026567, 81756594, 83164587, 84776157, 86580895, 87884129, 89244566, 90580258, 91457777, 92229698, 93157657, 93670664, 93759193, 94339196, 93948618, 94067487, 93790107, 93292694, 92689950, 91700765, 90813453, 89661756, 88531195, 86962356, 85780247, 84261126, 82286485, 80523631, 78663135, 77350124, 75383399, 73271055, 71227349, 69516807, 67708004, 65703966, 64000535, 62293902, 60289260, 58413960, 56633521, 55312400, 53220001, 51565791, 50091762, 48659591, 47149256]
16688D7149256j459043j382412j323053j066541j403896j154018j447839j174366
16680C6738088j212967j003562r12029j030132r80128r42444q50684q40300p80015
16671B8185827q02702p01958r03453q79755l57640p38618m89955p09220r11240
16662B1691286j80529q61519l13653l56502p08991o70049m31360l51961k12289
16653A7604433o47934o72116L7228m66688j47299n41776o97168m4493m44883J04009
16643A4083313p41426k02694M6108n48972j16792k03469n80062j66951k01325
16634A1367730j08939l96509l5461o23071o7676r5165k38222l04698l799m43825
16624I050365N0369O0090k80893m9945j56774n48744j1616R8107k68326l32622
$$ y = [47149256, 45690213, 44307801, 42984748, 41918207, 40514311, 39360293, 37912454, 36738088, 35525121, 34521559, 33609530, 32579398, 31599270, 30656826, 29806142, 28965842, 28185827, 27383125, 26681167, 25777714, 24897959, 24540319, 23801701, 23311746, 22602526, 21691286, 21510757, 20649238, 20335585, 19979083, 19270092, 18600043, 18168683, 17816722, 17604433, 16956499, 16284383, 16321611, 15854923, 15707624, 15165848, 14468680, 14424187, 13979304, 14083313, 13341887, 13139193, 13185301, 12636329, 12519537, 12316068, 11736006, 11569055, 11367730, 11258791, 10862282, 10826821, 10203750, 10136074, 10040909, 9802687, 9497989, 9494190, 9050365, 9100734, 9160824, 8879931, 8829986, 8673212, 8124468, 8112852, 8210959, 7942633, 7610011]
16614G610011J89621m63799J87352q8073m19715J47553r5332l91363j16545j2977
16604F546733k41461L88600l95274j90390j73436r2486O1849p1533N311p5360
16594E762553l85678N7463J05486n03505J19226j05008J37280k51754K71M7710
16584D984044k46482j51528k16916M86462k54097R6825k91509j67844R2119m2462
16574D288612K16831n51429Q7088M5969j95304J0436j06545j37056p2087J56183
16564C742698J31315k81112J32066k11863n34664N49903J48092j84981l25284
16555C166170K00206K1705l9775j26091k35266o9063Q7640J0891M1386j63817
16545B893986L034R9265n1717J12820m02766J32826l33031J07547J88970j06455
$$ y = [7610011, 7799632, 7335833, 7523185, 7435112, 7015397, 7162950, 7067618, 6676255, 6559710, 6546733, 6305272, 6693872, 6298598, 6108208, 5934772, 5842286, 5904135, 5832602, 5837913, 5762553, 5376875, 5434338, 5539824, 5036319, 5155545, 5050537, 5187817, 4936063, 4936334, 4984044, 4737562, 4586034, 4369118, 4855580, 4601483, 4698308, 4406799, 4238955, 4331074, 4288612, 4505443, 3954014, 4041102, 4087071, 3891767, 3902203, 3795658, 3658602, 3586515, 3742698, 3874013, 3592901, 3724967, 3513104, 2978440, 3528343, 3676435, 3491454, 3166170, 3366376, 3388081, 3348306, 3222215, 2986949, 2917886, 3005526, 3016417, 3057803, 2893986, 2897020, 2996285, 2944568, 3057388, 2654622, 2787448, 2454417, 2561964, 2750934, 2644479]
16535B644479J64028l97816P4661j43481K4953K1722K77369k17350L9715m3488
16525B444792M5652O8382k80636l03422K10975j1178J7215p7719O59643m83781
16515B289923m6437n57756L66494O9455K68163k39635p2747k07051K14596J04380
16505B189385k71981J32362l30241L69271m80836L69228j20650j51222L47041
16496B052357j40659q2024k3993P519Q1202l27501L61471o53609L60377R785j65815
16485A479110L56303l43062k202q9378m8248J63946K47019k38262K49441p3966
16475A700701j03732P9170o9409o4082J03314n08923L97680n04496L07676r105
16465A328794j33206K06075L7786j40427o360r8895j74433K60295j41116M59669
$$ y = [2644479, 2808507, 2410691, 2485352, 2341871, 2366824, 2388546, 2665915, 2448565, 2488280, 2444792, 2490444, 2558826, 2278190, 1974768, 2185743, 2174565, 2191780, 2114061, 2773704, 2289923, 2243486, 1685730, 2052224, 2121679, 2389842, 2150207, 2077460, 1870409, 2085005, 2189385, 1917404, 2049766, 1719525, 2088796, 1607960, 1977188, 1856538, 1705316, 2052357, 1911698, 1829674, 1805681, 1813200, 1894402, 1566901, 1928372, 1274763, 1635140, 1644925, 1479110, 1835413, 1492351, 1490149, 1400771, 1352523, 1516469, 1763488, 1525226, 1774667, 1700701, 1596969, 1676139, 1606730, 1542648, 1645962, 1137039, 1534719, 1030223, 1337899, 1328794, 1195588, 1401663, 1439449, 1299022, 1292662, 1193767, 1019334, 1279629, 1138513, 1598182]
16455A598182k97465j60910N16545n49388M236J45920n3131j85698N76856k66568
16445A328579l14056L31011j17310p0338l75474M39747q5581j13634j46831J70466
16435A046579P6247N041k96983K56813j82012K06772J0115l07347J09239M3706
16425I68170J9473j20814J63989K95489o23063L44486k66154J62191j74729L90573
16415A159611j43353n9040j00840R0342j73109J28520J99062j02766k76000R1674
16405H14101P38j19111K79767k08383J49997k70990N74030l32404k96424J8658
16395F09979j9706J99949j5217l4826L42216n16156J72555K46962l96226K88065
16385H77595K02004j93248N2113j45247j11920j55898J26812Q2433L14872l01662
$$ y = [1598182, 1300717, 1139807, 1656352, 1106964, 1111200, 1257120, 1203989, 1018291, 1595147, 1328579, 1014523, 1345534, 1228224, 1157886, 782412, 1222159, 1136578, 1022944, 876113, 1046579, 1122826, 1127867, 830884, 1087697, 905685, 1112457, 1122572, 815225, 924464, 968170, 987643, 866829, 1030818, 1326307, 703244, 1047730, 781576, 943767, 769038, 1159611, 1016258, 957218, 856378, 946720, 773611, 902131, 1101193, 998427, 722427, 814101, 814839, 695728, 975495, 767112, 917109, 646119, 1220149, 887745, 591321, 609979, 590273, 790222, 775005, 740179, 1082395, 566239, 738794, 985756, 589530, 877595, 1079599, 886351, 938464, 793217, 681297, 525399, 652211, 734644, 1049516, 747854]
16375G47854m7793q7280J08620k36527M23407l43027L31266k24839B51537L79401
16365F30938j34558J51867o8464j06744J70256j81526J71554K00687q4791l27553
16355D21666J06800L81478k09626k4167P6077j24920Q3764o2243N1242m4885k74439
16344C80747Q2345Q2789J50977j80805q3170K51538j39595K30800l12953K2852
16334D85525J77196n7436n9447j90643r1936J37787k6433K32510j92424Q6700
16324E01399q1256p2166n4199K47528j82963J54692J41710B63810j05525K86246
16314D44531J70540J9454j84121q754j04558J00174j26339j03353N37242A97025
16303D94816j15727a31838E75350m7967B08925J73741k8280J18133L82749l84081
$$ y = [747854, 700061, 612781, 721401, 484874, 908281, 565254, 896520, 671681, 251537, 630938, 496380, 648247, 579783, 473039, 643295, 461769, 633323, 834010, 749219, 421666, 528466, 909944, 700318, 676151, 752228, 627308, 711072, 648829, 700071, 655186, 380747, 463092, 545881, 696858, 516053, 432883, 684421, 544826, 775626, 462673, 485525, 662721, 605285, 545838, 355195, 263259, 401046, 374613, 607123, 414699, 501399, 420143, 347977, 293778, 541306, 358343, 513035, 654745, 263810, 158285, 444531, 615071, 634525, 450404, 441650, 337092, 437266, 310927, 207574, 744816, 197025, 494816, 379089, -131838, 575350, 527383, 208925, 382666, 354386, 472519, 855268, 471187]
16293D71187j59343p371r5239q1038J34611q5579A7989L15975A61257K15257F2288
16281D85313o923A94403J78460M96906C52348m6202L37256k91254P7756j84152
16271B45752r3321J23617m809K39979r8090k3312A07272M45149q4797p536k23469
16260B36619K01749J17622j63456j21343P4309J9478H0053J31792L00729A85154
16249A75975Q9577n2802J57292j6091k4298n6436K2027j02309k4569L27798j55733
16238C40431A65977J87759j70466L7602J66481J5638h8785D89865J48623C18558
16227B23092l2953J63637p3743a642A8967L77170r722n0393A22207J32911M3422
16216B98540A31145M9417K05613o4379j27414K01026k485l775r0093I6694N10417
$$ y = [471187, 311844, 304473, 209234, 128196, 262807, 177228, 17989, 333964, 161257, 376514, 62288, 485313, 478390, 194403, 372863, 869769, 352348, 306146, 643402, 352148, 429904, 245752, 152431, 276048, 271239, 511218, 413128, 389816, 107272, 552421, 467624, 460088, 236619, 438368, 555990, 392534, 271191, 345500, 364978, 80053, 211845, 512574, 185154, 175975, 265552, 212750, 370042, 353951, 329653, 273217, 295244, 192935, 168366, 496164, 340431, 165977, 353736, 183270, 220872, 387353, 402991, -88785, 489865, 638488, 318558, 223092, 190139, 353776, 280033, -1642, 18967, 396137, 386415, 336022, 122207, 255118, 298540, 131145, 180562, 386175, 321796, 194382, 395408, 392923, 389148, 299055, 96694, 607111]
16205F07111j19208B9896K33425J83101A75465J24835M7511A55871c6786a6823
16194C27393j42864K48968c3885B23992k476J19807P750J60571b83576A36303
16183b8525A51270O6466Q3218a04139A67906m2936n6716Q2605J15228J01335n1671
16172C15751A37451L9232E1704K61270p9489q6510N1837K59576A95926D171L42666
16161C46837r2856J96217p5270a6379A52351O4936J30701q0489q991j12793D5177
16149C87550q6017D2515K81430A46068K22630B0790L37726j33254K28706e6937
16138D2171h947p9240A21225C8462c2850A48315N924L79903F6486e3055A14726
16126B10071o2755m1002B7122K4736a9281G752b8652A99524l9649J38093J4345
$$ y = [607111, 487903, 29896, 263321, 446422, 175465, 300300, 347811, 155871, -36786, -16823, 327393, 184529, 433497, -33885, 223992, 221516, 341323, 349073, 509644, -283576, 136303, -28525, 151270, 217736, 300954, -104139, 167906, 124970, 68254, 150859, 266087, 367422, 315751, 137451, 176683, 51704, 312974, 233485, 146975, 198812, 458388, 195926, 4171, 346837, 253981, 450198, 374928, -16379, 152351, 217287, 347988, 267499, 258508, 145715, 45177, 387550, 301533, 42515, 323945, 146068, 368698, 20790, 358516, 225262, 453968, -56937, 42171, -8947, -88187, 121225, 38462, -32850, 148315, 154239, 534142, 66486, -53055, 114726, 210071, 147316, 106314, 27122, 51858, -19281, 7752, -28652, 199524, 159875, 297968, 312313]
16115C12313j8146o9807I1665j7647J26811f1802A13108J53636C6502i6515a5422
16103A30403a95670A35281K05692A34455c3987C78255j28974j05362c32503C00342
16092B27209D2186Q7651j4050D7030a6095A91624a4C20814H7548A2400a7495p284
16080b4779E18994i3899B23249I9573m6985L9317a97224A07231L38814j01643
16070C44402a06864c5285A62866l0195K21617d9902A66223c02970h9161D60108
16059D45734a10506A44633b6040I8022G996O5759N5182a53817A47713F6460c4435
16047F4282a66582A52032n9482e434a043p5010c7019A29019J0059N9897G3008
16035H4649e472C7247J87850i1624E2548J89376n560h576C12925l0609E2000Q2430
$$ y = [312313, 294167, 224360, 91665, 74018, 200829, -61802, 113108, 266744, 36502, -96515, -15422, 130403, -195670, 135281, 340973, 134455, -33987, 378255, 249281, 143919, -332503, 300342, 227209, 42186, 129837, 115787, 47030, -16095, 191624, -14, 320814, 87548, 12400, -17495, -24779, 518994, -93899, 223249, 99573, 52588, 91905, -197224, 107231, 446045, 344402, -106864, -35285, 162866, 132671, 354288, -49902, 166223, -302970, -89161, 460108, 445734, -110506, 144633, -26040, 98022, 7996, 73755, 128937, -153817, 147713, 66460, -34435, 64282, -166582, 152032, 92550, -5434, -1043, -76053, -37019, 129019, 139078, 198975, 73008, 84649, -5472, 37247, 225097, -91624, 52548, 241924, 236364, -8576, 312925, 282316, 52000, 134430]
16023A34430b07882E4237e2755m5508j3007E2727J21912c8170J7332I3108p009
16012H6099C7649R1862J25492B4078a21626C16441r3088D0217A3412g8848A50047
16000B4668P1667l1011a45073M229B46448K00145A33065k4945J60956q5238J54244
15989C38082J86822j79690O59143N7263j22978K09801K18128o44772k64232m3652
15979D13915D0102K49693J25589A79131A7609P3350a10368d2297r5317B17411
15968a74779c4168p6122l640a2823j76892o5024B41737N57b35344R6545b5873
15956I431P7693O1912j1947d49089A03762b28068m4445c2090q9181a3681B2818
15944A47934A9885K29698p9032a80330A73450d10811j5658g0346j26582D3521
$$ y = [134430, -207882, 54237, -52755, -98263, -111270, 52727, 174639, -38170, -20838, 93108, 86099, 37649, 129511, 255003, 24078, -121626, 316441, 223353, 40217, 13412, -78848, 150047, 24668, 96335, 65324, -145073, -140844, 246448, 446593, 133065, 108120, 269076, 183838, 338082, 524904, 345214, 1004357, 1061620, 938642, 1148443, 1366571, 721799, 457567, 413915, 40102, 289795, 415384, 179131, 17609, 90959, -110368, -42297, -137614, 217411, -174779, -34168, -110290, -113930, -12823, -189715, -254739, 241737, 242294, -235344, -138799, -25873, 9431, 87124, 149036, 137089, -449089, 103762, -228068, -272513, -32090, -121271, -13681, 22818, 147934, 19885, 249583, 170551, -180330, 173450, -410811, -426469, -70346, -196928, 43521]
15933b57710A9751c2208k5684B59206C3353Q3481O8087L0286c59100E2204b6144
15921A26996b1788E0375Q9664M2232n33Q6050a16272A34939Q3067a20521b6917
15909C35322f0666C82276e41540c4741j71095F5913b31601B3911d6299I9674K23456
15898C23130b0864A42054q716b07912b3094r6659A13167N9235c707l16601f825
15886B02821o395a59744O6019l1478B2852b15664a8708D7671P9799I633O03829
15875F13462b20932i2025A0921J88487a70517a3514B76920A31291c0767D935b6773
15863a25122A71309F0722a75183J7107C47627j69275a34259A67411o6600e3212
15852e2432A62971a03139A39370Q4307c80175A34682J98197n7209c7535A67224
$$ y = [-257710, 19751, -32208, -57892, 259206, 33353, 116834, 184921, 215207, -359100, 52204, -26144, 126996, -21788, 50375, 140039, 182271, 181738, 267788, -116272, 134939, 218006, -120521, -26917, 335322, -60666, 382276, -541540, -34741, -205836, 65913, -231601, 23911, -46299, 99674, 323130, -20864, 142054, 133338, -207912, -23094, -119753, 113167, 172402, -3707, -320308, -6825, 202821, 196426, -159744, -93725, -125203, 22852, -215664, -18708, 47671, 127470, 9633, 613462, -220932, -92025, 10921, 199408, -170517, -13514, 276920, 131291, -30767, 4935, -26773, -125122, 171309, 60722, -175183, -158076, 347627, 178352, -134259, 167411, 100811, -53212, -52432, 162971, -103139, 139370, 223677, -380175, 134682, 332879, 275670, -37535, 167224]
15841F8263J92683b27953F3706k7649M0542a85972G3921L78200a87415f4441A23708
15829A58386b7121j36982f9912C1724a91906h5045D04440b77793a18660q83j22655
15818b42198A29635M3489e5299q718A00036b58236B44570b56848B52444a52612
15807a10512m651r463L4570n7437C8139J17557b30130A95088C8852J4107K4874
15796G7833B4486J56689a98851B75505M7D7473A225a30539G8579p193b7562l08707
15784c36269g1107L2602j05241q4538a01307b6588C12732A18318C9558N4673B817
15772g6003B9384h3735A83824b49835a22536B36154j7401H0388e7528C06633C8821
15760h84F1345A1415b23610b4941A19286P309R1628a67611K0903A45941O6779
$$ y = [68263, 260946, -227953, 63706, 36057, 76599, -185972, 73921, 452121, -187415, -64441, 123708, 158386, -27121, -164103, -69912, 31724, -191906, -85045, 404440, -277793, -118660, -119543, -242198, 129635, 173124, -55299, -64017, 100036, -258236, 244570, -256848, 252444, -152612, -110512, -115163, -124626, -90056, -147493, 38139, 155696, -230130, 195088, 38852, 52959, 77833, 24486, 181175, -198851, 275505, 275552, 47473, 1225, -130539, 78579, 71386, -27562, -336269, -71107, -38505, -143746, -228284, -101307, -26588, 312732, 118318, 39558, 94231, 2817, -76003, 29384, -83735, 183824, -249835, -122536, 236154, 218753, 80388, -57528, 306633, 38821, -884, 61345, 11415, -223610, -24941, 119286, 126595, 218223, -167611, -146708, 145941, 212720]
15749B12720F208J7300g7721H4154B7852J68865n047a57623K1419C49988a7221
15737H6614a14801C5848b66770J30600o0301O4769D0030B512J42287a4697p7279
15726i1976l13847f966j53443A69763n3951n6195J98843a78915F5570a92289j5100
15715b07389H7653J7643D7530c17948d6243G9107b68427C4643N5966k0318R5764
15704A66055a15046p185n8702F3067b05097C16071d37727B4392B834J52035C5798
15692B57554a69297A42771K46187d3823E4947M7382J49176a25527e9138r9491
15682a58629d7603A51205K46843a91964j55148i4687A98797c3491D0120P1123
15672A11243A2616L8151B638a43709j2246H1826a10597A58574H597K8320b9176
$$ y = [212720, 6208, 23508, -77721, 84154, 27852, 196717, 191670, -157623, -136204, 349988, -17221, 86614, -114801, 35848, -266770, -136170, -196471, -131702, 40030, 2512, 144799, -14697, -91976, -405823, -6966, -160409, 169763, 115812, 59617, 258460, -178915, 65570, -192289, -207389, 87653, 105296, 47530, -317948, -46243, 79107, -268427, 34643, 90609, 70291, 166055, -115046, -122231, -180933, 63067, -205097, 316071, -437727, 24392, 2834, 154869, 35798, 257554, -169297, 142771, 388958, -43823, 54947, 102329, 251505, -125527, -59138, -158629, -47603, 151205, 398048, -191964, -347112, -94687, 198797, -33491, 40120, 111243, 12616, 50767, 2638, -143709, -155955, 81826, -110597, 158574, 8597, 36917, -29176]
15660A55299a54451j5832f8251D4092a8248A87337b87267A85291g9492B23980
15649b58585i1625F8052d5199j20522D8108M2548M0172N2500a0515E7898e8887
15637a82238H6272a13767B32196n3941M6964b65420J27296j49299a9861l4521
15627e4382n1029r9936A2771J61755A2930R7649O9459b32289k4342B19582f979
15615B3787Q1821a8283I8366e7816F6495a87300C4038C932K75618a80097B8082
15603A14104a27276A10658j5995h2517r0894j87287J49811J04611J6429M850l66137
15592d51134b3331D4139L02692A63011a98562m4292I2857c5072p3133A06673d57535
15580h1063l329A89922a39396c3154B52195C5903a29302A64974a4527H8582M8180
$$ y = [155299, -154451, -170283, -68251, 44092, -18248, 187337, -287267, 185291, -79492, 223980, -258585, -91625, 68052, -45199, -165721, 48108, 90656, 130828, 183328, -10515, 57898, -58887, -182238, 86272, -113767, 232196, 178255, 225219, -265420, -138124, -287423, -19861, -54382, -105411, -205347, 12771, 174526, 12930, 110579, 180038, -232289, -256631, 219582, -6979, 23787, 105608, -18283, 98366, -57816, 66495, -187300, 34038, 3932, 279550, -180097, 28082, 114104, -127276, 110658, 94663, -82517, -173411, -360698, -210887, -106276, -89847, -84997, -451134, -23331, 44139, 346831, 163011, -198562, -242854, 92857, -35072, -108205, 106673, -457535, -81063, -84392, 189922, -139396, -33154, 252195, 35903, -129302, 164974, -14527, 88582, 136762]
15569A36762L9497b03749H5361J42461I4814C2207h6304B73514H0568d1515M3
15558d1472j08521j28591d9293A33151b43311C05089G6413b38565A27433A8680
15547C12678G7821a8275O070A0248R0370c17916A5964N5656J5119g4727K4262
15536e0465D3664c9921A07854n2748a58381L6294j11271G8535b4769A91838a24771
15524A8323J50141o8645J04311f0021F7026h082C69216A56303a35120j4377K5113
15513a24384B17727m4846R4146A4642O4191D801K10608G1359a14178A20217c3663
15501a8183C09699A38323A5786K67438F5938B2112J68554c7111F3989M38869D8138
15489a51353H1736O3346J39249i1094B46862D7196q930K32582n7498l2781j8201
$$ y = [136762, 176259, -203749, 85361, 227822, 94814, 32207, -86304, 273514, 80568, -41515, -41472, -149993, -278584, -49293, 133151, -243311, 305089, 76413, -238565, 127433, 18680, 312678, 77821, -18275, -12205, 10248, 100618, -317916, 15964, 71620, 86739, -74727, -50465, 43664, -39921, 107854, 55106, -158381, -122087, -233358, 78535, -24769, 191838, -124771, 18323, 168464, 99819, 204130, -60021, 67026, -8082, 369216, 156303, -135120, -149497, -124384, 217727, 172881, 267027, 14642, 78833, 4801, 215409, 71359, -114178, 120217, -33663, -18183, 309699, 138323, 15786, 283224, 65938, 22112, 190666, -37111, 63989, 502858, 48138, -151353, 81736, 145082, 284331, -91094, 246862, 47196, 38266, 270848, 213350, 180569, 162368]
15478A62368P9421q7318M44227l5052L88694j88983j19753A80733N9326k0414
15468B19645L1506B9706K5639h7124d1206B46771b06434Q33A25625e170k27173
15457b32343m6262i1886C9104M8234D281d13797a15422H9887J16049B8534K3574
15446E2108O5357Q6934N4179L12106L21057J17735k26292l04982o6200m3907q4063
15435B84032C3788b25772H1833b43301K9877A28158a75348A09233E0034j4472
15425C5562a06217a2871H605J24543a40807A72284l3850a89586g2277E914R66
15414F880a89204D95292B6478a9370A26264c77298L0911A65996f1146A14090K37372
15403C51462G9907b26611B64913I7425c1634m9053o8829H5330a96554f2927n770
$$ y = [162368, 241789, 154471, 598698, 563646, 952340, 763357, 643604, 180733, 240059, 219645, 251151, 29706, 55345, -87124, -41206, 246771, -206434, -205601, 125625, -5170, -232343, -278605, -91886, 39104, 87338, 4281, -413797, -115422, 89887, 205936, 28534, 52108, 117465, 204399, 258578, 570684, 891741, 1009476, 783184, 478202, 412002, 368095, 284032, 33788, -225772, 81833, -243301, -213424, 128158, -175348, 109233, 50034, 35562, -106217, -12871, 8605, 133148, -140807, 172284, 138434, -189586, -72277, 5914, 6880, -189204, 495292, 26478, -19370, 126264, -377298, -346387, 165996, -61146, 114090, 351462, 79907, -226611, 264913, 97425, -31634, -80687, -149516, 85330, -196554, -62927, -68697]
15392f8697A20435J7822J02200k4361r3793E3737B6852a38483E6521g5798G5055
15380c3473H0346j2591a13710A20293b44281E193a48486c2654A27998L80876H5905
15368c10135A51166p391D0991j7757K48050O9181r2067D8048L78865E4394J8905
15357G3299e2094D0121q800N3344k124L9905B4358K59434I7481i9316J1704G032
15344A64644C0749N85375B31372K58204q0478c8317B95423J9741a75093E431K57166
15333B62597j25425A0162J12570J60814F7939J92775J78136H5018M50567f1348
15322B08698J9480M8234l5721I9787J17191A05087a20549E3464a7856j33445c6000
15310A09961b3197I8391m824K10950C638J80426o1293a96908O1340j53545A10989
$$ y = [-68697, 120435, 138257, 240457, 216096, 122303, 53737, 26852, -138483, 56521, -75798, 75055, -33473, 80346, 67755, -113710, 120293, -244281, 5193, -148486, -32654, 127998, 508874, 85905, -310135, 151166, 143775, 40991, 23234, 271284, 340465, 248398, 48048, 426913, 54394, 73299, -52094, 40121, 31321, 84665, 82541, 122446, 24358, 283792, 97481, -99316, -87612, 7032, 164644, 30749, 616124, 231372, 489576, 409098, -38317, 295423, 315164, -175093, 5431, 262597, 137172, 10162, 122732, 283546, 67939, 260714, 438850, 85018, 535585, -61348, 208698, 228178, 276412, 240691, 99787, 216978, 105087, -120549, 53464, -17856, -151301, -36000, 109961, -23197, 98391, 93567, 304517, 3638, 184064, 122771, -196908, -135568, -289113, 110989]
15298D24818j49756j21890k4632P4420p7377M6704d779r9208D79101g7432I0200
15286a58384C05827k4691A33039b23727j01361E186c3020J4851C5930b68671C05598
15274G5694J31841a49997l4830I1023J59285I231a18346M13A06387m3652R7628
15263A60363c916I4302d6882I8394g9411K2033B19151F5504K37207a184A58532
15251C86806a84932h388A75362m6802a69674E3136J40181K36229K01828P05259
15241A336633N76835q36385P36710p57862m94743D3268g5881j42312i050A80563
15230B84642A887K68693a09471C61421a71171A67063K30541G0918N7467C3300
15219A28656L3100b64833C27783a17407q2639A16301E7979b52805A29543g5938
$$ y = [424818, 275062, 153172, 128540, 202960, 125583, 172287, -4779, -103987, 479101, -77432, 90200, -158384, 305827, 281136, 133039, -223727, -325088, 5186, -33020, -18169, 35930, -268671, 305598, 75694, 207535, -149997, -184827, 91023, 250308, 9231, -118346, -117933, 106387, 62735, 160363, -3916, 94302, -46882, 98394, -79411, -57378, 219151, 65504, 302711, -1184, 158532, 386806, -184932, -8388, 175362, 128560, -169674, 53136, 193317, 429546, 631374, 1336633, 1913468, 1077083, 1813793, 1055931, 561188, 43268, -75881, -218193, -9050, 180563, 284642, 1887, 270580, -109471, 361421, -171171, 167063, 397604, 70918, 128385, 33300, 128656, 161756, -264833, 327783, -117407, -200046, 116301, 57979, -252805, 129543, -75938]
15208H9773N278b09977g4503D8448K58925I519N8783L48272A50363O9200B4825
15196c8749A56891a72883A80091M8633J7747J73618j56935g8116B60071I0084
15185B30114B5213f7666B64024h4947D72992a94029D53543I7405K00459a5307
15174C7473A6681b38730a9899l8522G0071a4520A48955a13841E843a56655A7486
15162c3892j62364B14913g7880A88930e0144A10399e6636K253A16674c9111J2049
15151b7062E42354q3099a24070b8556k3629A29768L55561E5855B042a09943G160
15139A15039L23180j54962j26077D1250a64012C01636p5593L10060A43636l0553
15129A13083A5001b74261B45880j10365a03676B06433j03052d0306A79967K91268
$$ y = [89773, 95051, -209977, -74503, 48448, 307373, 9519, 68302, 416574, 150363, 219563, 24825, -38749, 156891, -172883, 180091, 228724, 246471, 420089, 263154, -78116, 260071, 90084, 230114, 25213, -67666, 264024, -84947, 472992, -194029, 453543, 97405, 297864, -15307, 37473, 16681, -238730, -19899, -58421, 70071, -14520, 148955, -113841, 5843, -156655, 17486, -33892, -196256, 214913, -77880, 188930, -50144, 110399, -56636, -54383, 116674, -39111, -27062, 542354, 459255, -124070, -28556, -52185, 129768, 485329, 55855, 2042, -109943, 7160, 115039, 438219, 283257, 157180, 41250, -164012, 301636, 226043, 536103, 143636, 113083, 15001, -274261, 245880, 135515, -103676, 206433, 103381, -40306, 179967, 471235]
15119D71235A05856K29813A59849p7590R3218A9632R8164b06282H6444Q8187M8197
15108B22828a18301A14113e6514q5904H6336P328b5688A66025K67352j74240F9288
15096a05667l2501A76448K3551N8626J9031A20687k1271K2390K83071c88k9801
15085c0189o7259A99102j7633a95320A66263n8158K1187N547d7539A7216J42162
15074A59378O7062g6145j85934D9050J04532N31759G342L33282A66222C7301a00048
15062I1155L9227J45794J24623b7718A10585K08086J1434j47626J48409e0439
15051B29888J06849b9246C48944K6412A38561M94276j17813B28662h0945B17991
15040A50558M16862G7551J67986q4659p6237P7339F6969N20722A74556K75682
$$ y = [471235, 105856, 335669, 159849, 82259, 175477, 19632, 117796, -206282, 86444, 174631, 222828, -118301, 114113, -56514, -142418, 86336, 93664, -25688, 166025, 433377, 259137, 69288, -105667, -138168, 176448, 199999, 258625, 277656, 120687, 99416, 121806, 404877, -388, -30189, -97448, 199102, 181469, -195320, 166263, 108105, 129292, 134839, -47539, 17216, 159378, 226440, -76145, -262079, 49050, 153582, 685341, 7342, 340624, 166222, 37301, -100048, 91155, 130382, 276176, 400799, -27718, 110585, 318671, 330105, 182479, 330888, -50439, 229888, 336737, -29246, 348944, 375356, 138561, 632837, 515024, 228662, -80945, 217991, 150558, 567420, 77551, 245537, 160878, 84641, 161980, 66969, 587691, 174556, 450238]
15030D50238J20760J01832O161k46929A63563k662J98713A64322L99351k66294
15020B97379M88628k85751o5461K38347l16023M22258C67910A70094G0624L24883
15010C95507J71647j13495p5665n1954J53965k05308A11307K33438K99832k07837
15000D36740j55986J76802r9726Q2248j49694M34696B18948J08257K42198k998
14990E66405k15760r9422M1628J22299M0824j46274K51829Q6372K14851P8224
14980I40976j44024Q0170B16727K25439j34417m70P2538K38332J10293k59004
14970D69438J08477k00620R8560H4899L93666B03803F5781M74763j00802n0737
14960C89005j19280j28615M21034B29591r3230K15482k8869A18352M54683r8815
$$ y = [450238, 570998, 672830, 678991, 432062, 163563, 160901, 359614, 164322, 563673, 297379, 786007, 500256, 434795, 673142, 357119, 779377, 367910, 170094, 70624, 395507, 567154, 453659, 377994, 326040, 480005, 274697, 111307, 344745, 644577, 436740, 280754, 457556, 357830, 440078, 290384, 725080, 218948, 327205, 569403, 566405, 350645, 251223, 292851, 415150, 455974, 309700, 561529, 647901, 862752, 940976, 796952, 877122, 216727, 442166, 307749, 307279, 379817, 618149, 728442, 469438, 577915, 377295, 475855, 84899, 478565, 203803, 65781, 540544, 439742, 389005, 269725, 141110, 562144, 229591, 136361, 351843, 322974, 118352, 573035, 474220]
14950D74220j06981a28298C31072L06463B57501J39650p7322L06360j52087n5096
14940D19006m8554j02531K44781r5172R1130j0012J48778k69206K18945M84109
14930A081274k58386J2389Q6330K00220L76366Q4133k7862l96905K77596j31394
14920A303761J35041K77821O7656J64855O329m06996m03831Q3817m99033M6086
14910G75506k93127j2955k07710L9861O673P943J18830m6181n6888K860n2865
14899B81947j7096J34622j80853p5326J55731q0177E0198L49586j95449J46942
14889C51277A40123L45388L09899j7178p552O094q5352k67134L27330J60183k38037
14878F73764j6014A92204J23478J03078o7032l0439j00875m2357M25724j91968
$$ y = [474220, 367239, -128298, 331072, 637535, 257501, 397151, 319829, 626189, 474102, 419006, 370452, 267921, 512702, 417530, 508660, 498648, 647426, 378220, 597165, 1081274, 822888, 835277, 921607, 1121827, 1498193, 1582326, 1554464, 1157559, 1435155, 1303761, 1438802, 1716623, 1784279, 1949134, 1955463, 1548467, 1144636, 1228453, 729420, 775506, 482379, 469424, 261714, 301575, 308248, 316191, 435021, 388840, 331952, 334812, 281947, 264851, 399473, 218620, 143294, 299025, 218848, 50198, 399784, 204335, 351277, 140123, 485511, 795410, 778232, 770680, 776774, 691422, 424288, 751618, 911801, 673764, 657750, 192204, 315682, 418760, 351728, 321289, 220414, 178057, 603781, 411813]
14868D11813l0032K88136j31961j12941K26100j19180j28078J62821k39778J54954
14858D81854N6355J94632k75960A63391O0528l8890L8567K51226j032m8036O987
14847D32741M49441R6691k3139J2720M4937j28984J17626l750l82959J58096p141
14836G66279k67695j21321K71512j39965n1628j12099J15472J26143j36439O3985
14826E14244J3600B40583L45037r9994L7195r8108L63157j97943J57344l3503
14816G13768J14758k48950O6143Q732B75983N47415o7852C36330J12644M22057
14806H71031n1815j06024J43143L34021E31718j06382K79914B79869J79519R1068
14796E50456J26581k27544m5130A68118K84192J66398j49894j83113K66851O1336
$$ y = [411813, 381781, 669917, 537956, 425015, 651115, 531935, 403857, 566678, 326900, 481854, 538209, 732841, 456881, 163391, 223919, 185029, 223596, 474822, 473790, 425754, 432741, 882182, 978873, 955734, 968454, 1013391, 884407, 1002033, 998283, 615324, 773420, 766279, 498584, 377263, 648775, 508810, 457182, 345083, 460555, 586698, 450259, 514244, 527844, 240583, 585620, 485626, 522821, 424713, 787870, 589927, 747271, 713768, 828526, 579576, 645719, 654451, 275983, 823398, 755546, 336330, 448974, 871031, 819216, 713192, 856335, 1190356, 531718, 425336, 705250, 279869, 459388, 550456, 677037, 449493, 404363, 168118, 452310, 618708, 468814, 285701, 552552, 613888]
14786F13888m1626J06705j42108l4067o0801M10547k73425r2669J94472k2364
14776F58552J49087P4612p1850K44147k41032k06023k76318N19166j86990M0174
14766G03525j67151k00667M47103C66786K010K02846k74272M20437L5707j03024
14756F50490j59067j4725L45602j45235J39300l85160J4819N82147l15928j5625
14746F96618j50055J22280k08159K03834k95531K96111k3513J50024k36344M1301
14736E96566K69479n5748k21254J31783J14787K08529K57166j18309K28124o0847
14726A350276j86847N15j80835r7323j29054j06367O640K27437n4530J44960m08759
14715E66113J73870k3165J45192k58382K86441k98372M19406D28836K56268K89257
$$ y = [613888, 572262, 678967, 536859, 502792, 441991, 852538, 579113, 486444, 680916, 658552, 807639, 882251, 810401, 1054548, 813516, 607493, 331175, 850341, 663351, 703525, 536374, 335707, 782810, 366786, 368796, 571642, 297370, 717807, 753514, 650490, 491423, 476698, 822300, 677065, 816365, 431205, 446024, 1028171, 712243, 696618, 546563, 668843, 460684, 664518, 368987, 665098, 641585, 791609, 555265, 596566, 866045, 810297, 589043, 720826, 835613, 1044142, 1301308, 1182999, 1411123, 1350276, 1163429, 1163944, 983109, 885786, 756732, 650365, 657005, 884442, 829912, 974872, 566113, 739983, 716818, 862010, 603628, 890069, 591697, 1011103, 428836, 685104, 974361]
14705I74361K08908p0006L18766L98720k04165k20407k34165m13561L01508l91472
14695F68487Q2779N8926n212j88039K03329l25933j7947J31049K61783j0108J55143
14684A014257k29329O5695K07566r5025j41347N6630k05438N2480p3498L48463
14674A000454l81923O537M76918l17780O7603j52531K09238r3422P7134J6404
14664I08632m8433k22704J56335K85954n23282K37039J56735L5028k11477J44095
14654I17922R0326J25792J22720J93494m04071m1491n6694q398k23860J71972
14644H87712J29279r5548N8829j00824L81169j81234J10754p8287n6103N28682
14634A584429l93334j89782k83252M37670j74534j28461M70915j91255j54901
$$ y = [974361, 1183269, 1113263, 1432029, 1830749, 1626584, 1406177, 1172012, 758451, 1059959, 668487, 751266, 810192, 804980, 616941, 820270, 494337, 476390, 607439, 869222, 859114, 1014257, 784928, 850623, 1058189, 963164, 821817, 878447, 673009, 725489, 651991, 1000454, 618531, 625068, 1101986, 784206, 851809, 699278, 908516, 815094, 892228, 908632, 860199, 637495, 793830, 1079784, 556502, 793541, 950276, 985304, 773827, 917922, 1008248, 1134040, 1256760, 1450254, 1046183, 1004692, 947998, 939600, 715740, 887712, 1016991, 921443, 980272, 879448, 1260617, 1079383, 1190137, 1111850, 1055747, 1584429, 1191095, 1001313, 718061, 1155731, 981197, 852736, 1323651, 1132396, 977495]
14625I77495L90012k65476J54058j6960j15249j27573L67386l72199J59520l21667
14615H29347M98264m04376O6645L03243k33837J69251j48592J06027K20047q4124
14605A321895J62506p2381P021j60758N7112Q4575k21916L32349j28378j96395
14595A185630J74251O455M11J4042j45029R5856K8559J47548O4999M4504N7674
14584A674900j020O3376q7651l0748m5859K27926k57757R7223K36544r3828j31658
14573A651448j48726J89619l2669J19136K33823l68526L10071J24980k16211K7010
14563A889955M81932k36926L53005n22827M87377N12365n23560J28771K50103
14554B820195j17396O46197p6638P87036R24744K286556L665439Q395769J9405583
$$ y = [977495, 1367507, 1102031, 1256089, 1239129, 1123880, 996307, 1363693, 991494, 1151014, 829347, 1327611, 923235, 989880, 1293123, 1059286, 1228537, 1079945, 1185972, 1406019, 1321895, 1484401, 1412020, 1419041, 1258283, 1315395, 1399970, 1178054, 1510403, 1382025, 1185630, 1359881, 1366336, 1366747, 1380789, 1235760, 1331616, 1360175, 1507723, 1572722, 1617226, 1674900, 1673880, 1737256, 1649605, 1618857, 1572998, 1800924, 1543167, 1640390, 1876934, 1783106, 1651448, 1502722, 1692341, 1659672, 1778808, 2012631, 1644105, 1954176, 2079156, 1862945, 1889955, 2371887, 2134961, 2487966, 1965139, 2452516, 2964881, 2441321, 2570092, 2820195, 2702799, 3348996, 3272358, 4059394, 4984138, 7270694, 10936133, 19331902, 38737485]
14545C8737485l002295A5738900F761959l002383j529065k77316M83439R81675
14537C418309J195816j563952j123591k19044p1708J44713J64331K8225l03617
14528A669482L60633k18306P5753M7055o0886K65202j55527o1637l4413K58784
14518B146140k21085K46200J67542l39288J19352N46113l64990j34421L51508
14509B517071n6378j51048L67006k41171K99584j73882j23439L41960k11451K89590
14499B857842k43882n6845r0304N59079l86318k6606K05772Q3403M00627k75009
14489C027759K1040j06537m9348K15887K99701m58539K32890J6033K50086m26104
14479C022868q1315M28859J77711l3891k15509J93962J46014j3383L48748j99978
$$ y = [38737485, 35735190, 15738900, 6761959, 3759576, 2230511, 1953195, 2436634, 3418309, 4614125, 3050173, 1926582, 1707538, 1635830, 1780543, 1944874, 1973099, 1669482, 2030115, 1811809, 1887562, 1934617, 1873731, 2138933, 1983406, 1921769, 1887356, 2146140, 1925055, 2171255, 2338797, 1999509, 2118861, 2664974, 2299984, 2165563, 2517071, 2460693, 2309645, 2676651, 2435480, 2735064, 2561182, 2437743, 2779703, 2568252, 2857842, 2613960, 2557115, 2466811, 3025890, 2639572, 2612966, 2818738, 2902141, 3302768, 3027759, 3048799, 2942262, 2892914, 3108801, 3408502, 2949963, 3182853, 3198886, 3448972, 3022868, 2941553, 3370412, 3548123, 3514232, 3298723, 3492685, 3638699, 3625316, 3974064, 3774086]
14469C774086K1650J24414k15492J49886o162J26793J9251n63p3833L57077k42438
14458D034669J65098J41588j60894P8927N3266R2751J39856Q6643m8022K40471
14448D824353J00817j43320K67074l61222L75301m5181K35224L2918J2838j22254
14438E176548N5552L09425j14677L79426j49870J38400j54802M29471k72664K75422
14428F072231K70L35869J26468r8806L44028l3504K92430M29760n13292O4645
14418G020099J93106j4243N05815k50277k3083L28297O1576J07770J46111N62668
14408H637839j03063J61263N9918k40568L62629l47680J60044K95362N1782L50660
14398I388186R7607o5655J56997K64187L50190k04040L25508J18627N23967o9239
$$ y = [3774086, 3795736, 3920150, 3704658, 3854544, 3848382, 3975175, 3994426, 3993863, 3920030, 4277107, 4034669, 4199767, 4341355, 4180461, 4259388, 4312654, 4405405, 4545261, 4631904, 4583882, 4824353, 4925170, 4781850, 5048924, 4687702, 5063003, 5017822, 5253046, 5285964, 5298802, 5176548, 5232100, 5541525, 5426848, 5806274, 5656404, 5794804, 5640002, 6069473, 5796809, 6072231, 6072501, 6408370, 6534838, 6436032, 6780060, 6746556, 7038986, 7468746, 6955454, 7020099, 7213205, 7198962, 7704777, 7454500, 7431417, 7759714, 7821290, 7929060, 8075171, 8637839, 8534776, 8696039, 8755957, 8515389, 8878018, 8530338, 8690382, 8985744, 9037526, 9388186, 9485793, 9420138, 9577135, 9841322, 10191512, 9987472, 10312980, 10431607, 10955574, 10886335]
14388A0886335M91119J53747P8333K78248M16314K16963J36185Q1611K6458J13754
14378A2879067M53599L26017J49199K36854L79298P3832M37873J2523P60960M47017
14368A6156239L64549K78755K18255J18434M49279p2785J85597J054221J41640
14359A8894184O84902L16131O69053K71156K20390O43309M23878Q63931M37568
14350B3424502M48247P59140O97963K15759R21311Q37252P69299L97528O92863
14341B9163864J043041Q07497R66379N17723J002025J191515J039504J185186
14333C6916734J173685Q92360J127480J440819J274506J120141J721030J485259
14325D7152014J396522J739857J834966J673317K053158J936523J952917K107809
$$ y = [10886335, 11377454, 11531201, 11609534, 11887782, 12304096, 12521059, 12657244, 12738855, 12765313, 12879067, 13332666, 13658683, 13807882, 14044736, 14424034, 14497866, 14935739, 14948262, 15709222, 16156239, 16520788, 16799543, 17017798, 17136232, 17585511, 17512726, 17698323, 18752544, 18894184, 19579086, 19895217, 20564270, 20835426, 21055816, 21699125, 22123003, 22986934, 23424502, 23872749, 24631889, 25329852, 25545611, 26466922, 27304174, 28073473, 28471001, 29163864, 30206905, 31014402, 31980781, 32498504, 33500529, 34692044, 35731548, 36916734, 38090419, 38982779, 40110259, 41551078, 42825584, 43945725, 45666755, 47152014, 48548536, 50288393, 52123359, 53796676, 55849834, 57786357, 59739274, 61847083]
14317F1847083K352639K160493K665444K652286K978844L081956L192531L251503
14309H4182779L774678L350965M102082M318995M505921M580108N045123N100554
14301A18961205N907919N962906O600805O516198P148286P537722Q211840Q701795
14293A75548676R094565R613904J0431324J0414118J1622561J1949207J2247039
14286B50921394J2723724J3763731J3836841J4272565J4480713J4730289J4791481
14279C49520738J4564777J3812636J3192336J2040346J0694576Q459518M169410
14272D26454337M50467R61213J001132k372563l689270l914825m436214q657392
14264D05796885j1183421j3624626j4306729j5310235j5641375j5387622j5560734
$$ y = [61847083, 64199722, 66360215, 69025659, 71677945, 74656789, 77738745, 80931276, 84182779, 87957457, 91308422, 95410504, 99729499, 104235420, 108815528, 113860651, 118961205, 124869124, 130832030, 137432835, 143949033, 151097319, 158635041, 166846881, 175548676, 184643241, 194257145, 204688469, 215102587, 226725148, 238674355, 250921394, 263645118, 277408849, 291245690, 305518255, 319998968, 334729257, 349520738, 364085515, 377898151, 391090487, 403130833, 413825409, 422284927, 426454337, 426904804, 427866017, 428867149, 426494586, 422805316, 418890491, 414454277, 405796885, 394613464, 380988838, 366682109, 351371874, 335730499, 320342877, 304782143]
14257C04782143j5048740j4865204j4095857j3597394j2726465j2748323j1336313
14250B10363847j1563642j0290340q706815q453808q815584q219692p529943o935883
14242A39848140p111956o641058n505145n692861m893723m669215m898520m506003
14234I5929659m240784l759711l507622l168384l723062k790411k963796k636148
14226F9139741l154816k042380k624843j634874k815093j672231j718592j806364
14218E1670548j797251k071244j707109r83066j558148j109180j143340j762133
14210C9539077r70007j057619j167711m23016j227907j333164r04978j187828
14202C1266847m85213n27960j101765n31035o65589j072555o10604p40974m91138
$$ y = [304782143, 289733403, 274868199, 260772342, 247174948, 234448483, 221700160, 210363847, 198800205, 188509865, 179803050, 171349242, 162533658, 154313966, 146784023, 139848140, 132736184, 126095126, 120589981, 114897120, 110003397, 105334182, 100435662, 95929659, 91688875, 87929164, 84421542, 81253158, 77530096, 74739685, 71775889, 69139741, 65984925, 63942545, 61317702, 59682828, 56867735, 55195504, 53476912, 51670548, 49873297, 47802053, 46094944, 45111878, 43553730, 42444550, 41301210, 39539077, 38569070, 37511451, 36343740, 35920724, 34692817, 33359653, 32454675, 31266847, 30781634, 30253674, 29151909, 28620874, 27955285, 26882730, 26272126, 25531152, 25040014]
14193B5040014l54856r45727l29103n83477p65179l66960o61437m75052k94624
14184B0263599o08563l14011o74486j20381n03489j93791l80891m84834l84917
14175A6598236j86977l47425l49363n60188j52027r8583p10932j25598j61663
14166A3905480k99713k11471m47194R0399k22056m07777j22562k90627m87043
14157A1507436j04982n8868k33133M3118j73694o51328j1505J0412l20060k80577
14147I726819o472l27235r3379K44391k36933m61567j69696K72600j74102m04504
14137H369922j84130j8050o917k91039O9575j01531m16643J61907N5696l74602
14127G264188K03993p17450L79980k52106j92524M15089o79099N6946J08499n12145
$$ y = [25040014, 24685158, 23739431, 23410328, 22826851, 22061672, 21694712, 21033275, 20558223, 20263599, 19655036, 19341025, 18666539, 18546158, 18042669, 17848878, 17467987, 16983153, 16598236, 16411259, 16063834, 15714471, 15154283, 15002256, 14903673, 14192741, 14067143, 13905480, 13605767, 13394296, 12947102, 13037501, 12815445, 12407668, 12285106, 11994479, 11507436, 11402454, 11343586, 11110453, 11153571, 10979877, 10328549, 10317044, 10327456, 10007396, 9726819, 9720347, 9393112, 9299733, 9544124, 9307191, 8845624, 8675928, 8948528, 8774426, 8369922, 8185792, 8167742, 8160825, 7869786, 7939361, 7837830, 7421187, 7583094, 7638790, 7264188, 7468181, 6750731, 7130711, 6878605, 6686081, 7101170, 6422071, 6479017, 6587516, 6075371]
14117F075371L28048J26301k91738k46054o9771K0192r3633l652K50686k02437
14107E893313j10512l22123j17604K5742k60435k5886N9141J22214k1889j33288
14097E108673j9557k62175j68231J30136j16140j64213J49329m0984L68813n08294
14087D477357o0586j61926j5806Q5048l59050K19726L4936l16095J92145k30904
14077C864845L18721k25872J4005J00462O0937k99651j39960K8316K85814k76684
14067C730933J33175j74432k19566M8411M25390l07433J58114k01075k07241J9910
14057C406186k70642K27398j27869p5497Q5154Q1993l09612K00609m1525k18639
14047B957556q9625k1318L33672k55121j29437j06855K65922p4235q4543J22747
$$ y = [6075371, 6403419, 6529720, 6237982, 5991928, 5922157, 5942349, 5848716, 5845064, 6095750, 5893313, 5782801, 5460678, 5343074, 5368816, 5108381, 5082495, 5141636, 5263850, 5241961, 5108673, 5089116, 4826941, 4658710, 4788846, 4672706, 4508493, 4657822, 4616838, 4985651, 4477357, 4416771, 4254845, 4239039, 4324087, 3965037, 4184763, 4219699, 3903604, 4095749, 3864845, 4183566, 3957694, 3971699, 4072161, 4133098, 3833447, 3693487, 3721803, 4007617, 3730933, 3864108, 3689676, 3470110, 3518521, 3943911, 3636478, 3794592, 3593517, 3386276, 3406186, 3135544, 3362942, 3235073, 3159576, 3244730, 3326723, 3017111, 3217720, 3176195, 2957556, 2867931, 2846613, 3180285, 2925164, 2795727, 2688872, 2954794, 2880559, 2796016, 2918763]
14037B918763k72767N6492J04296k00556K09348L1805k85166j81279K84336q8064
14027B577208O9446k17052m7403o6320K15621l43482K87637k91123K57293m55633
14017A986192J08762J48723O8785l21443J83154p1130o2480J51767q1201J14554
14007B225683k50726J74752k31339O9212k2678q6126l3522j75877J11153K67972
13997B048504n2964j34335J70871k20965Q8786J04471o2848L91813R66586K864048
13987F163967O264867J8174027Q670057j6417132j0706964m997589k484165o19673
13979D047395q66555l97030k00651l24551j1930j40307l8608L7682J13658k46330
13969A972773J58138j52116P9209J24503k35593l8990j31680L68615k45932j3824
$$ y = [2918763, 2645996, 2702488, 2806784, 2606228, 2815576, 2847381, 2562215, 2380936, 2665272, 2577208, 2646654, 2429602, 2382199, 2315879, 2531500, 2188018, 2475655, 2184532, 2441825, 1986192, 2094954, 2243677, 2312462, 1991019, 2174173, 2103043, 2040563, 2192330, 2111129, 2225683, 1974957, 2149709, 1918370, 1987582, 1964904, 1878778, 1845256, 1669379, 1780532, 2048504, 1995540, 1861205, 2032076, 1811111, 1899897, 2004368, 1941520, 2333333, 3299919, 6163967, 12428834, 30602861, 39272918, 22855786, 12148822, 7151233, 4667068, 4047395, 3180840, 2783810, 2583159, 2258608, 2246678, 2106371, 2067763, 2105445, 2219103, 1972773, 2130911, 1978795, 2058004, 2182507, 1946914, 1907924, 1776244, 2144859, 1898927, 1885103]
13959A885103l44007J14855l79699N99054j92946k89067L82556K0653o6657l38898
13949A390947K71812J22398k01358J92463j91427j96466K00934l76366L85174
13940A598111n5226r7247J39503M0099l29628L65501j21258J24242k35573r6724
13930A331800o6566J31169M8391k8863j24856O1286j08855j0966j99581O2701
13920A095660n2277J10152R3585K17127l52952P9802K68464k45225K09291q8052
13910A335575l2455j81940K2994k1892M72925l81885l44726J80017K07867j90123
13900A066357K29785j6808j54892K36122k99614K49836m64332L37191j31508Q7979
13890A140116L04641l14027p4852r4979L21387L7431l07171N1733k68867L65769
$$ y = [1885103, 1541096, 1655951, 1276252, 1875306, 1682360, 1393293, 1775849, 1796502, 1729845, 1390947, 1662759, 1785157, 1583799, 1776262, 1584835, 1388369, 1589303, 1212937, 1598111, 1542885, 1445638, 1585141, 1625240, 1295612, 1661113, 1539855, 1664097, 1428524, 1331800, 1265234, 1396403, 1444794, 1415931, 1291075, 1352361, 1243506, 1232540, 1032959, 1095660, 1043383, 1153535, 1247120, 1464247, 1111295, 1191097, 1459561, 1214336, 1423627, 1335575, 1303120, 1121180, 1144174, 1122282, 1595207, 1213322, 868596, 1048613, 1256480, 1066357, 1296142, 1279334, 1124442, 1360564, 1060950, 1310786, 846454, 1183645, 1052137, 1140116, 1444757, 1130730, 1055878, 960899, 1282286, 1319717, 1012546, 1064279, 795412, 1161181]
13880A161181o0884k09956K61480j45148J56111j77699J20061r0826M1702n5428
13870A000594J43738M9011l88338N5224j71157L15685j13098k41354K54436m4760
13860H59981J41514k59339j14542L79669j85872K59981k32117l2389J29407L1116
13850I77409k693m37045L48421J38337m47231K77129k82062j43916N44568R0826
13840A063743j74266Q533O9995n0179k4922k10819J63890J78209k94723p6488
13830F52973J47492J22697k14923L47459j41020j09570J19274j38990k00603L59644
13820I44433k44043k80178L65930j89524J35365J05782q5758N5193j10612R1308
13810G87896k84126K08198J73449k02249N1985k11009J41839j35609K3640k4850
$$ y = [1161181, 1100297, 890341, 1151821, 1006673, 1162784, 985085, 1105146, 1014320, 1056022, 1000594, 1144332, 1193343, 805005, 860229, 689072, 1004757, 891659, 650305, 904741, 859981, 1001495, 742156, 627614, 1007283, 821411, 1081392, 849275, 816886, 946293, 977409, 974716, 537671, 886092, 1024429, 577198, 854327, 572265, 428349, 972917, 1063743, 889477, 898010, 968005, 917826, 892904, 682085, 845975, 1024184, 729461, 652973, 800465, 923162, 708239, 1055698, 914678, 805108, 924382, 785392, 584789, 944433, 700390, 420212, 786142, 596618, 731983, 837765, 752007, 807200, 696588, 787896, 503770, 711968, 885417, 683168, 735153, 524144, 665983, 530374, 554014, 529164]
13800E29164L37970C97553M82372l24575j32272L30608M0393l38279M29124q0873
13790H04051j3212l8979K49650l76089P5660N8198N1632j05632J3902j27743k65134
13779C26304J80867J86005K4440j72828j51326M74925k62626o8102Q0161J75209
13769G93029J70901k89952J408j44228j01272M66536D34531L1187K1230k213K13210
13758F97945C44517J04017M51155j04948j35872K3064l09109L87818l06256j63671
13748B90715N3926K82850r321J7763J13652C65728N6684K42899k26049L20043
13738G59305R6203l57673A30229K39358M5029K44412J18385l63363N16248C84329
13727G73043k24231p6711k23115L66649K60006C38771j26080Q9004K32186j03495
$$ y = [529164, 867134, 397553, 879925, 555350, 423078, 753686, 794079, 455800, 884924, 804051, 790839, 751860, 1001510, 625421, 701081, 759279, 810911, 705279, 719181, 591438, 326304, 507171, 693176, 717616, 544788, 393462, 868387, 605761, 537659, 617820, 793029, 963930, 673978, 675386, 531158, 429886, 896422, 434531, 465718, 486948, 484735, 697945, 344517, 448534, 899689, 794741, 658869, 681933, 372824, 760642, 454386, 290715, 344641, 627491, 618170, 635933, 749585, 365728, 422412, 665311, 439262, 759305, 855508, 497835, 130229, 369587, 414616, 659028, 777413, 414050, 930298, 384329, 773043, 548812, 472101, 248986, 615635, 875641, 338771, 212691, 301695, 533881, 430386]
13717D30386r2792K64583j65849J5686K0177R6582r3123J16133k72000l6115p5449
13706B08219K84284M8415N1125J1609r7360B53134M32135k94330Q8395J82925
13696F62259k75383R0505k17944K60610A12855L85206k560Q1717B08125L14459
13686E22584A85328M11374A80558K45319K7569n6776K93306l01900P9288r6202
13676C71162J2713j69888N00661j87580A95498Q2764J77701L6423j17959r2170
13666B82257P7644L7809q150l9004J56515N062L392A70665J09298J93302k36571
13655B36694J80787A81016K55819k2339q4147m4316r8425O3266A11273K05846
13645C17119Q2561m2196n212K2192A35201d9684B51330K65049j80879J53293L0897
$$ y = [430386, 337594, 602177, 436328, 452014, 472191, 568773, 475650, 591783, 319783, 283668, 208219, 492503, 540918, 592043, 603652, 506292, 253134, 685269, 390939, 479334, 662259, 386876, 477381, 259437, 520047, 112855, 498061, 495501, 577218, 208125, 522584, 185328, 596702, 180558, 425877, 453446, 396670, 689976, 388076, 467364, 371162, 383875, 213987, 714648, 527068, 195498, 278262, 455963, 492386, 374427, 282257, 359901, 397710, 389560, 350556, 507071, 512133, 515525, 170665, 279963, 473265, 236694, 417481, 181016, 436835, 414496, 330349, 286033, 187608, 250874, 111273, 317119, 399680, 357484, 352272, 374464, 135201, -49684, 251330, 516379, 335500, 488793, 519690]
13634E19690A92552M38812n4711B31224k125K91942A33895L51154j57628J10517
13624D37938J05485B13998J95810q1798e2988B12819l5698L48607A88414J11955
13614C00369H0380M3944J12032L34191l6003k60275k317M2679n8128F5539K40103
13603C05642k8104k8432a73606A71366o3309O7509J80802P2578A64710M24L84606
13592E49740k15404H4090L31271Q8925p1441Q1845A47357J83908A42402J12362
13582B54764r5463C7950J0726B4172M37840B01013J99018H6461K27498q7700a20523
13570F11815B31879j00241C904L14079L7506C1031N44722B87498m4446L42786
13560E85838m941k15986j6409K3823q6416O1206r8570C650J89501R8297a9699
$$ y = [519690, 192552, 631364, 576653, 231224, 229099, 521041, 133895, 485049, 327421, 437938, 543423, 213998, 409808, 328010, -52988, 212819, 177121, 525728, 188414, 300369, 80380, 124324, 236356, 570547, 534544, 274269, 271952, 314631, 256503, 65539, 305642, 277538, 249106, -173606, 171366, 108057, 175566, 356368, 428946, 164710, 165134, 549740, 334336, 84090, 415361, 504286, 432845, 514690, 147357, 331265, 142402, 254764, 159301, 37950, 48676, 24172, 462012, 201013, 400031, 86461, 313959, 226259, -120523, 611815, 231879, 131638, 3904, 317983, 355489, 31031, 575753, 287498, 243052, 585838, 580897, 364911, 348502, 372325, 285909, 347115, 248545, 3650, 193151, 291448, -19699]
13548C60403a55170c2277D20408A29729J99004q4894q5634n3029L0754b08646
13537D25444A93832q0484J35745n9769K22124q5977A09794K65927J78979A6314
13526D70729A31844h0907A21750L63043A87303K7233N4755a64108F1017A8283
13515a71729D67139b1719G6721K00424N624A28939L5688D6101M62560a4615B69934
13503A57188L8555f1281A69648D9137K48764q0189j2291L06219k54272L4927k0016
13492B72279n2349n280n8295a51193C9024M05040k19912q9281M21135j96003A04671
13480A68214J14171l3309R416A18102J70200j8863A27013P0898K21718A79440
13469h5556C37653R0375A80857b30603A64563K25938J12145A39638Q0462n3119
$$ y = [360403, -155170, -32277, 420408, 129729, 328733, 243839, 158205, 105176, 135930, -208646, 425444, 193832, 113348, 249093, 189324, 411448, 325471, 109794, 375721, 554700, 16314, 470729, 131844, -80907, 121750, 484793, 187303, 214536, 269291, -164108, 61017, 18283, -171729, 467139, -21719, 76721, 277145, 282769, 128939, 164627, 46101, 508661, -14615, 269934, 157188, 195743, -61281, 169648, 49137, 297901, 217712, 205421, 511640, 257368, 292295, 272279, 219930, 214650, 156355, -151193, 39024, 444064, 224152, 134871, 556006, 360003, 104671, 168214, 282385, 249076, 258492, 118102, 288302, 269439, 127013, 197911, 419629, 179440, -85556, 337653, 428028, 180857, -230603, 164563, 390501, 502646, 139638, 220100, 166981]
13459A66981l275J27142I7779J11528o8342F5452M18775K2027B49755K26226G191
13447A42875P7100Q9138D0656b5227k66336d8807A93564H2834J77553M2387n325
13436B97449G1478R7284F9325k6873J93629K3017q6899J35792K7643j28833g0512
13424a60719E9987J02925K92681A96597m4716K28653C412a49372A55819J84024
13414C39843c0106r5738C41524j35084a3768E7075J49997a1406A39287h9426B27459
13402E43236A60380d9178F460K26953G5987h7910A32274e9459A53219F1353O4143
13391A25496h3772L7885C75765B1152M49598A40568n4055H779K96570K3250B8466
13379G7413M8263b65033A88265q7456a16031A29817J63937l456N8674q8656C7616
$$ y = [166981, 163706, 290848, 97779, 209307, 140965, 65452, 484227, 506254, 249755, 475981, 7191, 142875, 219975, 309113, 40656, -25227, -291563, -48807, 193564, 82834, 260387, 302774, 297449, 71478, 168762, 69325, 42452, 236081, 259098, 172199, 307991, 335634, 206801, -70512, -160719, 59987, 162912, 455593, 196597, 151881, 380534, 3412, -149372, 155819, 339843, -30106, -125844, 341524, 206440, -13768, 57075, 207072, -11406, 139287, -89426, 227459, 543236, 160380, -49178, 6460, 233413, 75987, -87910, 132274, -59459, 153219, 61353, 125496, -83772, -45887, 375765, 21152, 470750, 140568, 86513, 8779, 305349, 328599, 28466, 77413, 125676, -265033, 188265, 100809, -116031, 129817, 293754, 290298, 348972, 260316, 37616]
13367B78747A7671P5755j3628N17093B38344J20165l6379E4867K51763b05561
13356E900K4322K99527h9248C41290O0540A73059J36027P7886j88729q25A206
13344A4137K81131j44581K55026r5944m6195J84324E0244L18982K8440A24803
13333A87797P3724E6427J65161J779j04742b593C47783A73726D8836e0355b4608
13321B56005l5597L3133K46718D7175K58793J03008j17260b33005D31534D1616
13310A46856P0028G5207N05726k36542A59101p88p5615L75498e4003l5627a3713
13298A92924F6791R4868E7318e9650B81925j33039n5369a61775B98747j44928
13288A53819c66043A07959D3961a1365E0971K16873q2208E9663g3879B5103Q8045
$$ y = [278747, 17671, 93426, 79798, 596891, 238344, 358509, 322130, 54867, 306630, -205561, 5900, 30222, 329749, -89248, 341290, 401830, 173059, 309086, 386972, 198243, 197418, 1206, 14137, 295268, 150687, 405713, 309769, 263574, 447898, 50244, 369226, 397666, 124803, 187797, 261521, 56427, 221588, 223367, 118625, -2593, 347783, 173726, 48836, -50355, -24608, 256005, 220408, 253541, 500259, 47175, 305968, 408976, 291716, -233005, 431534, 41616, 146856, 216884, 75207, 580933, 344391, 159101, 158313, 82698, 458196, -54003, -89630, -13713, 192924, 66791, 161659, 57318, -59650, 281925, 148886, 93517, -161775, 298747, 153819, -366043, 107959, 43961, -11365, 50971, 267844, 185636, 59663, -73879, 25103, 113148]
13277A13148a81205B95887j16322b87736C06057A43754J39839j37698J06393H3322
13266i5827A85239A0526J38098e5845J8914C37180a26066G758M99L37334D8738
13254B3326L28359B3582m146J83499a10282E69620a15194B1559J56693d0259C49058
13242g5645A21682b0044C6607e6273D31493a4476H7332l5046h3430B46232I9994
13230e1156E7403J42399a38599b2893B7063Q883K18601j00297a89190k211A68834
13218A9429O458K56538k9722B6301Q4485n4314L36036j39246a55949A63274o5713
13207I7561d0785A12600J43866C8635K4748J1666J70151b97106D300c01910A19668
13195A63863a7113B09226b8105A29793J73884f78B45569f5035A61174D3073j1620
$$ y = [113148, -181205, 295887, 179565, -287736, 306057, 143754, 283593, 145895, 252288, 83322, -95827, 185239, 10526, 148624, -55845, -36931, 337180, -126066, 7758, 8257, 345591, 48738, 23326, 351685, 23582, 19436, 202935, -110282, 569620, -115194, 21559, 178252, -40259, 349058, -75645, 121682, -20044, 36607, -56273, 431493, -14476, 87332, 52286, -83430, 246232, 99994, -51156, 57403, 199802, -138599, -22893, 27063, 35946, 254547, 154250, -189190, -191401, 168834, 19429, 25887, 282425, 252703, 26301, 110786, 56472, 392508, 253262, -155949, 163274, 97561, -40785, 112600, 256466, 38635, 63383, 75049, 245200, -297106, 4300, -301910, 119668, 163863, -17113, 209226, -28105, 129793, 303677, -678, 245569, -65035, 161174, 43073, 31453]
13184C1453J44825a81482H2287f0938n4395C46891j1420j42726k8289M55972d0033
13172A70901J13756A20337J77738D7493a6493M828A13538K09076D866J72519a68083
13160H7994a8933j3008k9634A13428L21138a20814K961K9235A52177e474I9750
13148d6093C95686A83175q3096e9496q0694B91245p6094E8492a88992B0498O8142
13137H8640e1537B49800a12536b6465j31590A36695c10367G8376b28258O9439
13127a58819E5677a06999n1858c8830j1146O522A91463M1826F8535J73215F9626
13115c5844j71568C34148E2464K1922K18081A4843a65978H4099L8341C939P0376
13104G4315K11788r5638a46477B81989A16749f9283J881b9046j56698b9278E3111
$$ y = [31453, 176278, -181482, 82287, -60938, -115333, 346891, 335471, 192745, 164456, 620428, -40033, 170901, 284657, 120337, 298075, 47493, -16493, -11665, 113538, 322614, 4866, 177385, -168083, 87994, -18933, -31941, -61575, 113428, 434566, -120814, -117853, -88618, 152177, -5474, 99750, -46093, 395686, 183175, 100079, -59496, -140190, 291245, 215151, 58492, -188992, 20498, 88640, -51537, 249800, -112536, -26465, -158055, 136695, -310367, 78376, -228258, -158819, 55677, -106999, -158857, -38830, -49976, -43454, 191463, 233289, 68535, 241750, 69626, -35844, -207412, 334148, 52464, 74386, 292467, 14843, -165978, 84099, 122440, 3939, 74315, 286103, 190465, -146477, 281989, 116749, -69283, -67402, -29046, -185744, -29278, 53111]
13092B16476A0171J71577b27232Q4544D609K28185A11181D7288j6600K88598b4095
13080B4490K29775A10487n4434r498K08834O6652A4758a53971M7088c8471A24169
13068B08763k2503q4484E869M0262c7504H6443F164K39600j08432d3714k18492
13057b62206A12438e2622E1494e0724j63272c0268B44937q2775J41750j23508
13047A80404q730l5451d4833j5436l9864G9320a66971c0332l1896a9165o2906
13036h2071C4964g0888A32056b14319D2528a12323A32632C1713e8896J5819A95687
13024a44053I5187h0213B52398f0155A3740M1506a4282A8109L43008A48591m688
13013A43903J31353b5651A87702D3474a71446j47314H2324A3747O0085b41020
$$ y = [216476, 10171, 181748, -227232, -142688, 4609, 232794, 111181, 47288, 30688, 319286, -24095, 24490, 254265, 110487, 56053, 46555, 255389, 322041, 14758, -153971, -106883, -38471, 124169, 208763, 186260, 101776, 5869, 46131, -37504, 86443, 6164, 245764, 137332, -43714, -262206, 112438, -52622, 51494, -50724, -213996, -30268, 244937, 162162, 303912, 180404, 171674, 136223, -44833, -60269, -100133, 79320, -166971, -30332, -62228, -19165, -82071, 34964, -70888, 132056, -214319, 42528, -112323, 132632, 31713, -58896, -43077, 195687, -144053, 95187, -80213, 252398, -60155, 13740, 55246, -14282, 18109, 361117, 148591, 143903, 275256, -25651, 187702, 43474, -171446, -318760, 82324, 13747, 73832, -241020]
13002C22852a16415b9736B00640L3954h9626E7078b43826E1862d3883B93111A22537
12990g7505j41592H3162J19982e8312B1086Q2543c2981q836A08889n3937J5016
12979F9968a93591B72033C0637K7222Q7862c9026G131R0460M4540a9245i439m9575
12967e9014E3540P0444K22678a00359j53679A62325J3298a01536k7053M5031H8637
12955f5165c1004n859D2755J01395b35677j56926A75899O6310a52044A47911M4550
12944A92461K16388f1255E7358f7158j3751D9532O827b55174A38956a4730B1665
12932F1609e2593j02096M7398c4373k51583l399H0391A1196g7619j83737B43385
12920a85562A39103A1256N1008j3653J57983J02779r2152g8660k4368j01149B85139
$$ y = [322852, -116415, -29736, 200640, 234594, -89626, 57078, -243826, 51862, -43883, 293111, 122537, -77505, -219097, 83162, 203144, -58312, 21086, 103629, -32981, -41817, 108889, 54952, 69968, -193591, 272033, 30637, 57859, 145721, -39026, 7131, 97591, 142131, -19245, -9439, -59014, 53540, 123984, 346662, -100359, -254038, 162325, 175623, -101536, -128589, -83558, 88637, -65165, -31004, -36863, 42755, 144150, -235677, -392603, 175899, 242209, -152044, 147911, 192461, 408849, -61255, 57358, -67158, -80909, 49532, 56359, -255174, 138956, -14730, 21665, 61609, -52593, -154689, -107291, -34373, -285956, -289355, 80391, 11196, -77619, -261356, 243385, -185562, 139103, 11256, 62264, 48611, 206594, 309373, 217221, -78660, -103028, -204177, 285139]
12908A46804d9903j01097B38503A08342d7915A76075a60236B28592q6393K6998
12898A69197b017A59291a30658p5961B05100d5050k84176a43542B7822j2078g2946
12886a79446B09410F8219P6131c4756B70831c1533k68018C9982L89885h6096A26193
12874e7294A03549b81536Q5366a9459k85519a44210H3949C0071J25738a18031
12863c43493C19798a29022j84860B71571a14203j19833A20092a55304A92555A834
12852B99467a76883Q8302C2957J80390H3424c88657a5225A29933b35602A48022
12841H5509a09491E3503k4176a20667I2354j7820K67911I5621a89856R2674p9213
12830a76395f5760A87428G994J32749D3207M6024a02077B20480j3707a58537O762
$$ y = [146804, -49903, -151000, 238503, 108342, -47915, 176075, -160236, 228592, 142199, 169197, -2017, 159291, -130658, -206619, 205100, -45050, -329226, -143542, 27822, 15744, -72946, -179446, 209410, 68219, 144350, -34756, 270831, -31533, -299551, 39982, 429867, -86096, 126193, -57294, 103549, -281536, -196170, -19459, -304978, -144210, 83949, 30071, 155809, -118031, -343493, 319798, -129022, -313882, 271571, -114203, -234036, 120092, -155304, 192555, 1834, 299467, -176883, -88581, 32957, 213347, 83424, -388657, -15225, 129933, -235602, 148022, 85509, -109491, 53503, 29327, -120667, 92354, 74534, 342445, 95621, -189856, -97182, -176395, -65760, 187428, 7994, 140743, 43207, 89231, -102077, 220480, 206773, -158537, -151775]
12819a51775A26441c411q5617o2402B8591f842A67945a50005N773k0181A67410
12807F7481J82272b68230A30618f2797F0289P5263b83832g6141A1359O0251b4620
12795f0069b7968I68g737A0310J60302E5404p057a09628o7672M711K8372c3636
12782A64122K4945i088k64029E594c05416H7147c6897j7791B91454e8080j54357
12771b12437P2150c5002k64721M0460g9070A00701M6848G214K75098C7509b070
12759a6426A61408i260B45810c8326j88793q0099B29131J5899J24199B0693b81554
12747b68485J15020G2167k2257r041b4329A19863a57301e489p8566j42768a6847
12735A2421O0727a20237N9699A475K06099R2955A15180h4900K213F899a17441
$$ y = [-151775, 126441, -3411, -89028, -151430, 28591, -6842, 167945, -150005, -144232, -164413, 167410, 67481, 249753, -268230, 130618, -62797, 60289, 135552, -283832, -76141, 11359, 71610, -24620, -60069, -27968, 968, -7737, 10310, 170612, 55404, 48347, -109628, -177300, -172589, -144217, -33636, 164122, 189067, -9088, -273117, 5594, -305416, 87147, -36897, -54688, 291454, -58080, -212437, -140287, -35002, -299723, -259263, -79070, 100701, 147549, 7214, 282312, 37509, -2070, -16426, 161408, -9260, 245810, -38326, -227119, -307218, 229131, 245030, 369229, 20693, -281554, -268485, -153465, 72167, 49910, 40869, -24329, 119863, -157301, -5489, -84055, -226823, -16847, 12421, 73148, -120237, -60538, 1475, 207574, 300529, 115180, -84900, -82687, 6899, -117441]
12723a20148C37222i2768E7670a20905A14372a37597H6565B1159J55806b2223
12712B00157F0155K2611h0428B12292r2989J50012J61835a08234a3276C27864
12701F7457e3440G6917b56914C9683c941D1184b77121h0539l0149L9550m33k02620
12689b74191A11686a73854O2324B78833D5362J396J28111b85614G0367a54754
12678D2760i3241k1272A68571J20600a29424B78966GJ186a19909L3356C5978L57671
12666C93649j07050j10553J17402a82870e855D0072A4932a00673D16385h2458
12655i8261B38496f2784C09274k4859e8567A96603C492J37772J77332j34606f7164
12643e4354B13742b5269m09778c1146j08178B34327A13932N0629J47656I9291
$$ y = [-120148, 337222, -92768, 57670, -120905, 114372, -137597, 86565, 21159, 176965, -22223, 200157, 60155, 82766, -80428, 212292, 119303, 269315, 431150, -108234, -13276, 327864, 67457, -53440, 76917, -256914, 39683, -3941, 41184, -277121, -80539, -110688, -71138, -71571, -274191, 111686, -173854, -111530, 278833, 45362, 46758, 174869, -285614, 70367, -154754, 42760, -93241, -114513, 168571, 289171, -129424, 278966, 7, 1193, -119909, -86553, 35978, 393649, 286599, 176046, 293448, -182870, -5855, 40072, 14932, -100673, 416385, -82458, -98261, 238496, -62784, 309274, 284415, -58567, 196603, 3492, 141264, 318596, 183990, -67164, -54354, 213742, -25269, -435047, -31146, -139324, 234327, 113932, 164561, 312217, 99291]
12632d6670A11067J53560m330H0041J31632A7417M0596J06169a00923A47562g0713
12620A70803a11144E9016K0845a8882l1992C33344A40686b08125A56936K08621
12610C65557A08971c38921f0926B77554b9852l3315A07214E2509A9653J54966
12600A74619L0105c673j14350e4886B44845A12196h6472q0548G7703a5114m4204
12589e9318B99090j30120A4779N7936L1488d1524p6380K1677j99355B87893C4466
12577C74969c30912a3127B71748N0219j54569c01875N3272F0644Q2570a60328
12566H5219a07523D2513J76832a35558M1737l4149N5088j39199F0348K3348a22506
12554C1689J69595a83937I1846a37751J5902A69431b8892m8132b3426l5204q1391
$$ y = [-46670, 111067, 264627, 260297, 80041, 211673, 17417, 58013, 164182, -100923, 147562, -70713, 170803, -111144, 59016, 79861, -18882, -50874, 333344, 140686, -208125, 156936, 365557, 108971, -338921, -60926, 277554, -29852, -63167, 107214, 52509, 19653, 174619, 204724, -3673, -118023, -54886, 244845, 112196, -86472, -167020, 77703, -15114, -59318, 299090, 168970, 14779, 72715, 104203, -41524, -117904, -96227, -295582, 287893, 34466, 374969, -330912, -13127, 271748, 321967, 167398, -301875, -248603, 60644, 143214, -160328, 85219, -107523, 42513, 219345, -135558, -93821, -127970, -72882, -212081, 60348, 83696, -122506, 31689, 201284, -183937, 91846, -137751, -121849, 169431, -28892, -77024, -23426, -58630, -140021]
12543a40021k93093g5119k8098j18398L7218h4341B42558q0781b18804J06511
12533a12293A9471K2300L9899a20669A10050J1578a15165j35746A29889d7228
12522b66953F2592h5223j42704A3459m308P8384J83375h417A70669q3863m83b43904
12509A46348j787J91695j09900p9631N338R1977f211A98330b0894H3429L9599
12498A23028a56871l9539F497b92945B2014j995N7789f2297D1459a25325N3622
12487g1703j06622O2677e2219m8527A33019n2137L9177E9613d3846C07002j28155
12476A78847c1542B59744o5285b16910C3634c47042A03601a17552c878A76512
12465B65819A4032J09199e9754D1897a70022c6250B76747f9395j55393B74765
$$ y = [-140021, -433114, -75119, -103217, -221615, -184397, -84341, 242558, 161777, -218804, -112293, 19471, 41771, 81670, -120669, 110050, 121628, -115165, -250911, 129889, -47228, -266953, 62592, -85223, -227927, 13459, 9151, 87535, 270910, -8417, 170669, 86806, 86323, -243904, 146348, 144561, 336256, 226356, 146725, 152063, 244040, -6211, 198330, -20894, 83429, 123028, -156871, -196410, 6497, -292945, 22014, 20019, 77808, -62297, 41459, -125325, -71703, -178325, -115648, -52219, -100746, 133019, 80882, 120059, 59613, -43846, 307002, 178847, -31542, 259744, 194459, -216910, 33634, -347042, 103601, -117552, -3878, 176512, 265819, 14032, 123231, -59754, 41897, -170022, -36250, 276747, -69395, -224788, 274765]
12454D0247L2565j1090a1315n4800B08552K31345k13655l6406J86635A06533a14977
12442d5811k00688H9556k299c7566A03937f2120l2647K622b3759n5660o6906k3389
12430a69714k8365K9095f3965r6737A52899J12705b83214L6395d0143I7613J35027
12419B32640g1131l6142l8144j10446O1740G940b370B7947a06851j899A85919
12407A63956a44308e8338G1922c1741j57573B63458a1886A25179K0959f353q7879
12396i4232J4960B12719J90189j78451A8797J18815f8413j8069d2101C89214H1824
12384a67398C49888A06661a00214R149L3580n9470A39345K14225b831A30311J66451
12373B96762C8149l689N1624A2878J01215J54876i1962j17406p8533C21Q4217
$$ y = [40247, 72812, 61722, -11315, -66115, 208552, 439897, 226242, 189836, 376471, 106533, -114977, -45811, -246499, 89556, 87257, -37566, 103937, -62120, -94767, -92145, -23759, -79419, -146325, -169714, -198079, -168984, -63965, -160702, 152899, 265604, -283214, -246819, -40143, 97613, 232640, -71131, -107273, -145417, -255863, -194123, 7940, -2370, 27947, -106851, -108750, 185919, 163956, -144308, -58338, 71922, -31741, -189314, 263458, -11886, 125179, 146138, -6353, -94232, -79272, 212719, 402908, 224457, 18797, 137612, -68413, -86482, -42101, 389214, 81824, -167398, 349888, 106661, -100214, -91065, -57485, -116955, 139345, 353570, -2831, 130311, 296762, 38149, 34460, 86084, 12878, 114093, 268969, -91962, -209368, -287901, 321, 84538]
12362H4538a3847j23744O8546b4230R009l41003c3466B35895A8464M08764A9372
12350a1841j2247k2867K0191n6043A02778L9982b8661A29975J55683h6345b2740
12338C8115F078L12273a76936B33956R6642A42711M8983Q9771j32501i4957G2410
12326C7343e6496A60376a9166o9696K6039R961F0660J39717C8010r61j475J14724
12314A50298L5387K1027c45581A92346A4767M7953a50308e5625A00015l1569B1338
12302E1632f6643B96209D3011b09885E8825A2946a18385A71827K40453D9017J95277
12291B44294h3277K6794B8978c94820G1152k2250b21801B62612g6560k38960D43373
12279A93069Q750P8260F1906g9969A1696a891D01149A50463D6747J63685J2820
$$ y = [84538, -13847, -137591, -69045, -24230, -15221, -356224, -33466, 235895, 18464, 427228, 19372, -11841, -24088, -46955, -26764, -82807, 102778, 142760, -28661, 129975, 285658, -86345, -22740, 38115, 6078, 318351, -176936, 233956, 330598, 142711, 191694, 281465, 148964, -94957, 72410, 37343, -56496, 160376, -19166, -88862, -62823, -52862, 60660, 200377, 38010, 37049, 35574, 150298, 185685, 206712, -345581, 192346, 14767, 62720, -150308, -55625, 100015, 68446, 21338, 51632, -66643, 296209, 43011, -209885, 58825, 12946, -118385, 171827, 412280, 49017, 244294, -83277, -56483, 28978, -394820, 71152, 48902, -221801, 262612, -76560, -315520, 443373, 193069, 201819, 280079, 61906, -79969, 11696, -1891, 401149, 150463, 46747, 210432, 223252]
12268B23252L65790B10446I7029e0172p1282B32005H1113a5826B97021C4645K67833
12257C02478A22880m7489R8123G6659K71815A32368P1605J36548C0434O1814a22536
12245A83033J38999j30724q4950a54097C1808b4633C30263A12462O0500Q5680
12235B58642i5734j60324A88420a8775A70846k2858b4993j1490m2432A2878Q6923
12224I9801a2864C64751j67016r5076K33130A65277r368L56141A24011M78943
12214F02954B55719K64415k18919n1200K55915L2743G7435K70864K01678k71891
12204B78086L8531j40557F9162c05209d6936B71580j34203g2120D98099j80480
12194C17619j57332D4746K41931j31209L93374j81219A61944M2976F0606J44993
$$ y = [223252, 589042, 210446, 97029, -50172, -121454, 232005, 81113, -15826, 297021, 34645, 302478, 122880, 75391, 173514, 76659, 348474, 132368, 203973, 340521, 30434, 92248, -122536, 183033, 322032, 191308, 106358, -154097, 31808, -24633, 330263, 112462, 172962, 258642, -95734, -256058, 188420, -18775, 170846, 147988, -24993, -36483, -78915, 12878, 99801, -12864, 364751, 197735, 102659, 335789, 165277, 155909, 512050, 124011, 602954, 255719, 520134, 301215, 250015, 505930, 538673, 77435, 348299, 549977, 278086, 316617, 176060, 69162, -305209, -46936, 271580, 137377, -72120, 498099, 317619, 160287, 44746, 286677, 155468, 548842, 367623, 161944, 204920, 60606, 205599]
12184B05599Q2718K16042P8302j65194A31471k9380a82572A76015J24274n7305
12174B42984m8371P4906q7010k8671M2233b0211D43480j72560K567K40194m7689
12163D65992B06274J58987A35411F1189K32071j970G157K37391a65759B83699
12152C4935a24515A56102n2837A8654P0859P8498c59671G5194a45944H7094Q7897
12141A74991A2924L62877j24997A2319P6034K28471G3321i0759B99195L5374G3938
12129e1477j20454C31161E8173e7098D30043q3689j49568K10235j81623a49460
12118A31178J27162a8505A17074j5420a98343f2087A71718O2152P9741A53182
12107A42091B562M6798a66635C3672J0648I599a36436F7949l0772J94333F5387
$$ y = [205599, 288317, 504359, 582661, 417467, 131471, 102091, -182572, 176015, 300289, 242984, 194613, 269519, 182509, 153838, 196071, -20211, 443480, 270920, 273487, 513681, 465992, 206274, 365261, 135411, 61189, 293260, 291290, 7157, 244548, -165759, 283699, 34935, -124515, 156102, 103265, 18654, 89513, 168011, -359671, 75194, -145944, 87094, 174991, 12924, 375801, 250804, 12319, 88353, 316824, 73321, -90759, 299195, 334569, 73938, -51477, -171931, 331161, 58173, -57098, 430043, 346354, 196786, 407021, 225398, -149460, 131178, 258340, -18505, 117074, 101654, -198343, -62087, 171718, 233870, 313611, 153182, 142091, 2562, 49360, -166635, 33672, 44320, 9599, -136436, 67949, 37177, 231510, 65387]
12095C5046d3317F5494L327P3462h7132C97821A02309D2013J39600k63q7084m867
12083H9399P6228a76695A83211L0119J68214C2383q12L86932A13226J47351A09423
12071A51546o0401a97452A07815e8925A62032p596P1818J12158a29243G2791J31286
12060B04077E667b8590D42457i2302C47257a09079H434a5905A66985c64116a72082
12048a27946j80379J21497c3378B66422J14436a19686D3703a15308e1435B0594
12037B3264g4406A16405b2389j51317b363B53698a45060A85250J3881r2831b11531
12025A13224c03767b0982j93966C4728N5572J72607b03041a5738p6621F649e9774
12013b47936i542n0846A87834b95361A14630N6585a90766M1126A68374B8581g5205
$$ y = [35046, -43317, 65494, 68821, 142283, -87132, 397821, 102309, 42013, 181613, 181350, 94266, 89399, 165627, -176695, 183211, 213330, 381544, 32383, 31571, 418503, 113226, 260577, 109423, 151546, 91145, -197452, 107815, -58925, 162032, 154436, 226254, 338412, -129243, 72791, 204077, 5667, -28590, 442457, -92302, 347257, -109079, 8434, -15905, 166985, -364116, -172082, -127946, -308325, -186828, -33378, 266422, 380858, -119686, 43703, -115308, -51435, 20594, 23264, -74406, 116405, -22389, -173706, -2363, 253698, -145060, 185250, 199131, 106300, -211531, 113224, -303767, -20982, -214948, 34728, 90300, 262907, -203041, -15738, -92359, 6649, -59774, -247936, -9542, -60388, 187834, -295361, 114630, 171215, -190766, -149640, 168374, 28581, -75205]
12001e2506A5091e9776A11566R4270b2482j57129A21858i200C68472a24134H613
11989d22348a02284A78142r287q3523B2515J21496A5350b24856N2645j4661j24552
11978c11424b3989A35590F6281b14340J3414h2328l80509a13952b9196p0157a0710
11966i0259D3635J26133h2496j47906E9499c2152r570B26186K3764c9062a0312
11954a43571H1770h8419B92493E1110J61277n6510n0001P703f100A15479g2703
11942B28182A03267c4425a5208j63371A14018N2775F248K65301A07282A459J00101
11931A01560b6786B01068c9838J4487k37536J27288B0954e3846F6152g1368j92211
11920b63579d6187q1531f1695D4753D678f115j8217C12242A21157n4740f47k8484
$$ y = [-52506, 15091, -59776, 111566, 205836, -22482, -179611, 121858, -9200, 368472, -124134, 8613, -422348, -102284, 178142, 168855, 85332, 22515, 144011, 15350, -224856, -172211, -186872, -311424, -23989, 135590, 66281, -214340, -200926, -82328, -462837, -113952, -29196, -99353, -10710, -90259, 43635, 169768, -82496, -230402, 59499, -32152, -41722, 226186, 249950, -39062, -10312, -143571, 81770, -88419, 292493, 51110, 212387, 155877, 105876, 113579, -6100, 115479, -72703, 228182, 103267, -34425, -15208, -178579, 114018, 166793, 6248, 271549, 107282, 1459, 101560, -26786, 201068, -39838, -25351, -262887, -135599, 20954, -53846, 66152, -71368, -263579, -46187, -127718, -61695, 44753, 4678, -6115, -24332, 312242, 121157, 66417, -647, -29131]
11908b9131k15366R1698K8454d0245C06757b2857k11391D5951a93772Q7113l6605
11897a43264n4403H8145K993C3763a12049f03D8174B153c556C3587c27354A08113
11884g2405A04049a4343H7502c61395B78910f7702A47141b84166J08269Q3207
11874i2690L4423E6853h4221d0386j91838K600B02379b15172d5662A9869K3070
11863D2939b46746j06087L0695B42030a43508C1093c76566A34703a05619A1808
11852B3841K52945B1780b5892p5528d1510A66481a89464Q9622O723A52546b12572
11840d5083k39433B94280b09074N4352q458A92667h2779m06381A38839A5620J91841
11829B07461H7859a16609M9156j83723p8990h1419K4034j85596F103O5999b32169
$$ y = [-29131, -244497, -152799, -124345, -40245, 306757, -22857, -234248, 45951, -193772, -106659, -143264, -197667, 88145, 91138, 33763, -112049, -603, 48174, 2153, -3556, 33587, -327354, 108113, -72405, 104049, -14343, 87502, -361395, 278910, -67702, 147141, -284166, -175897, -92690, -58267, 56853, -84221, -40386, -232224, -229624, 202379, -215172, -45662, 19869, 42939, -246746, -352833, -322138, 242030, -143508, 31093, -376566, 134703, -105619, 11808, 23841, 276786, 21780, -25892, -101420, -41510, 166481, -189464, -99842, -93119, 152546, -212572, -45083, -284516, 294280, -209074, -154722, -163180, 192667, -82779, -489160, 138839, 15620, 207461, 87859, -116609, -67453, -251176, -330166, -81419, -57385, -242981, 6103, 72102, -232169]
11817a15253A34207L9306f7429k98553a42548k75956J98486j15442A26146a93163
11806b28087C8624J34297C7541P8001D5026c32758e4860A05836c6615H7892b43756
11794a21810C8263J60178c01303a07667I0201a9391j17883j30825B09978B8973
11783A17929b75352k2986i2147A5807c3897n6487A17039a0624A50615i6781l2918
11772a29699D5996c8161j5990K3123j90080C61738G650J64513e7848q2920O2225
11761g8543l7113I4225b46685O7684f4890c1643q5249J0524A49208C7578O994
11750D4572L35040a10267M3480G4885a6221m7234K7779C59614A0514a72642e1037
11738F4653h1859A27216a27247A17317p452B2279K87174c86764J70605p7775F9323
$$ y = [-115253, 134207, 173513, -67429, -365982, -142548, -418504, -220018, -335460, 126146, -193163, -228087, 38624, 172921, 37541, 115542, 45026, -332758, -54860, 105836, -36615, 87892, -243756, -121810, 38263, 198441, -301303, -107667, 90201, -19391, -137274, -268099, 209978, 28973, 117929, -275352, -298338, -92147, 15807, -33897, -90384, 117039, -10624, 150615, -96781, -129699, 45996, -38161, -54151, -31028, -221108, 361738, 7650, 172163, -57848, -140768, -78543, -115656, 94225, -246685, -179001, -64890, -31643, -116892, -106368, 149208, 37578, 44572, 379612, -110267, -66787, 74885, -16221, -63455, -35676, 359614, 10514, -172642, -51037, 64653, -81859, 127216, -127247, 117317, 109865, 22279, 309453, -386764, -216159, -293934, 69323]
11726b86113F787Q7623N6352B2620K00263i4111m1588A810a77465f8480j30982
11715a99462C2859P5823J23061d7152q242C62198b58576J5539B78591j37113d4108
11703C51649g2984p1233C65818C9276A6981n223a6334l579B51121e9440B20383
11691A19828A2001e2856j03253j450k7351B91771o8158g5695j9177B49093B63
11679b8038D0891a94823B92415d824k41711G9071i5684B65920g9243m1785f305
11667d1477j13132j11372B1633e7588j6309j21520k13166e0649a5012C5600f723
11655B36408q3663P4025C1688f9515B04126Q2875a07017G3814E470f9703M590
11644f5113a1862j15887b6525j4889o4830L2720C69894b40671A06050b03073f0509
$$ y = [-286113, 6787, 94410, 150762, 22620, 222883, -94111, -135699, 1810, -177465, -68480, -199462, 32859, 108682, 231743, -47152, -55394, 362198, -258576, -243037, 278591, 141478, -44108, 351649, -72984, -144217, 365818, 39276, 16981, 11758, -16334, -19913, 251121, -59440, 220383, 119828, 12001, -52856, -156109, -157559, -184910, 291771, 223613, -75695, -94872, 249093, 263, -28038, 40891, -194823, 292415, -4824, -246535, 79071, -95684, 265920, -79243, -121028, -6305, -41477, -154609, -265981, 21633, -57588, -73897, -195417, -408583, -50649, -15012, 35600, -6723, 236408, 152745, 226770, 31688, -69515, 204126, 287001, -107017, 73814, 5470, -69703, -65113, -11862, -127749, -26525, -41414, -106244, -73524, 369894, -240671, 106050, -203073, -60509]
11632a59450B7764j0952J64289H8175f7653k2302A93657c013m1007j99969a14804
11620G2223j3899J58814e0849A83051G3630K42205F4622j8804a04314c9578o089
11609d5667B08468K10705D9254B2030K7586b7401A22286J43632j00068a67486
11598C75K67222j25047a55615C9971L85630g7248b7875l8507l2861b125j12047
11587a14172a5795m6602o6634H7484c4409j30639d0164C2330L8657a05641A94056
11575A63523o1524O5233a90607B13963F0812k7857J70604f7677C6239J43560m5985
11564A33814l5139r03j8471J79133d6432J3863G9917a52607B35190B2187J19708
11553A41895h6403B19321K56709A11549a83399i845D8334J46857g6715A49228
$$ y = [-159450, 27764, 16812, 181101, 88175, -67653, -89955, 193657, -3013, -44020, -243989, -114804, 72223, 58324, 217138, -50849, 183051, 73630, 315835, 64622, 45818, -104314, -39578, -45667, 208468, 419173, 49254, 22030, 49616, -27401, 122286, 265918, 165850, -167486, 375, 267597, 142550, -155615, 39971, 425601, -77248, -27875, -66382, -99243, -2125, -114172, -15795, -62397, -129031, 87484, -34409, -165048, -40164, 32330, 70987, -105641, 194056, 163523, 101999, 167232, -190607, 213963, 60812, 32955, 203559, -67677, 36239, 179799, 133814, 98675, 97772, 79301, 258434, -46432, -32569, 79917, -152607, 235190, 22187, 141895, -86403, 219321, 476030, 111549, -183399, -9845, 48334, 195191, -76715, 149228]
11542C03408C2576K87129a50630G8853B5454J3912A3532K49589G6639L61818a30936
11530H1480O2786o8219J03896D2560g3475C53936c2196M324B64197o6603p2946
11519A24648M1863P9075l8276o2061G0797A8367g2007C61462g7881B01306l855
11508A97451i2595M5178B93561B7150a9072A44491J66547A01114L44961e4307
11497A98177E9777A7220N4220l0200a46943C09424r7997J33631A71317d7339C59330
11485a66595C11963f7866D0977J46909H7368q078L43218A88122b5943p5072C8181
11473a4194C1298K4027b43829B07643n4473b34420C63499A48740l8307L64529
11463D74962k17808M4258a34602F4927P2948A8148K498P9538J28483J05453o7422
$$ y = [303408, 32576, 319705, -150630, 78853, 25454, 39366, 13532, 263121, 76639, 438457, -130936, 81480, 144266, 76047, 179943, 42560, -73475, 353936, -32196, -27872, 264197, 197594, 124648, 166511, 245586, 207310, 145249, 70797, 18367, -72007, 361462, -77881, 201306, 197451, -92595, -47417, 293561, 27150, -19072, 144491, 311038, 101114, 446075, -54307, 198177, 59777, 17220, 71440, 41240, -146943, 309424, 211427, 345058, 171317, -47339, 359330, -166595, 311963, -67866, 40977, 187886, 87368, 79290, 422508, 188122, -25943, -101015, 38181, -14194, 31298, 55325, -243829, 207643, 153170, -234420, 363499, 148740, 110433, 474962, 257154, 301412, -134602, 64927, 137875, 18148, 20646, 100184, 228667, 334120, 266698]
11452B66698i099A46438a77499A98259c8703j41064g9979p6370n7580R6297C24993
11440C55805b0130H1361Q4595G7371J97787a33269B57210A13920b07304E1379
11429B25475a22969A38832J33799j03951a33688m7446G4140g0169c3335A29046
11418f4364l7598k28397M0818F6270K53204A5280J49550k1567h2235A20078J5647
11407A35725J31545g751k82816J15935B16599o3234a06051j4908j31040P5591
11397a76408F9065R3485B0959J2837b26412N0620E265J06106M4609n6724J26897
11386B26153G2925h9007A24652g7742L4314M780n5393A98701b37567a81j06720
11375a06901A5689K15787B6335A649P1702J22602A3448d7316l3455A33533b11854
$$ y = [266698, -9099, 146438, -177499, 198259, -38703, -179767, -79979, -156349, -213929, -117632, 324993, 355805, -20130, 81361, 165956, 77371, 275158, -133269, 257210, 113920, -207304, 51379, 225475, -122969, 138832, 272631, 168680, -133688, -181134, 74140, -70169, -33335, 129046, -64364, -101962, -330359, -289541, 66270, 319474, 15280, 164830, 143263, -82235, 120078, 135725, 267270, -7751, -290567, -174632, 216599, 153365, -106051, -120959, -251999, -176408, 69065, 162550, 20959, 33796, -226412, -175792, 5265, 111371, 155980, 99256, 226153, 72925, -89007, 124652, -77742, -43428, -38648, -94041, 198701, -237567, -181, -106901, 15689, 231476, 26335, 1649, 73351, 195953, 13448, -47316, -80771, 133533, -211854]
11363B6106h0291l04793A12404b47227d6214F7465J071B834e4731j67913G9359
11351b36944p5685B77527h2505c9277B53538a77723j40447B15420o038C3420a71035
11339c18385J25574b5878k31132a06241n724n9354h5483A22795G899L9745d00239
11327B09330a31683a9648A18596d2209n0211n1229K4685j07215C09790a4237C35134
11315f9812B12267a9302B36148I3972b18369Q5565m5192A07887Q2434i4820M3876
11304e0944l2298A11511h1557j28038J0533O5435d320r9474j49495Q727B42150
11292b18131d7813A72250p2051D8218P585K42362h5795B5803c96152J52430M0617
11281b03105g6457m019J569A2347a3339k7348k63194A56243b7412G0373d3807
$$ y = [26106, -80291, -385084, 112404, -247227, -46214, 67465, 68536, 2834, -54731, -222644, 79359, -236944, -312629, 277527, -82505, -39277, 253538, -177723, -318170, 215420, 209382, 33420, -171035, -318385, -192811, -25878, -257010, -106241, -111965, -171319, -85483, 122795, 7899, 47644, -400239, 209330, -131683, -19648, 118596, -42209, -92420, -143649, -118964, -226179, 309790, -14237, 335134, -69812, 212267, -19302, 236148, 93972, -218369, -132804, -177996, 107887, 190321, -94820, -50944, -83242, 111511, -81557, -209595, -199062, -133627, -4320, -103794, -253289, -244562, 242150, -218131, -47813, 172250, 100199, 48218, 55803, 298165, -85795, 25803, -396152, -243722, -203105, -76457, -80476, -78907, 12347, -13339, -40687, -303881, 156243, -27412, 70373, -43807]
11269A22315f2962q3193O8194A62069l0955a76821j92598f7926A4234c768k43416
11258b47184J6963A32207A8144a56411n5223A6463Q1094J09397e9203j58456l2418
11247b50077d7634A97721e8890n4368P746A55946e4207j95809A78217A931a13982
11235A12345b1616B08176c3846l3799o2960A8705J38704A7679J57739J09997a29609
11223b62146M1676k404R6734q9638a7370A01272a69590o0890o2608E4828e0423
11211a52160j53161A72648g9553n1643E1629A8867g5816A85676a19332I1575a41831
11199A20539j6263g5669k25033g6523A20824e4630A79317f2040p4929K3615F3015
11187E8292b00357B8288J86650g9843D0074b21443E6185M4698J53155A5684J98771
$$ y = [122315, -62962, -146155, -77961, 162069, 131114, -176821, -369419, -67926, 14234, -3768, -247184, -230221, 132207, 18144, -156411, -211634, 16463, 97557, 206954, -59203, -217659, -250077, -47634, 197721, -58890, -113258, -105512, 155946, -54207, -250016, 178217, 1931, -113982, 112345, -21616, 208176, -33846, -67645, -130605, 18705, 157409, 17679, 175418, 285415, -129609, -262146, -220470, -222874, -126140, -215778, -17370, 101272, -169590, -230480, -293088, 54828, -50423, -152160, -305321, 172648, -79553, -131196, 51629, 18867, -75816, 185676, -119332, 91575, -141831, 120539, 104276, -75669, -300702, -76523, 120824, -54630, 179317, -62040, -136969, -113354, 63015, 58292, -200357, 28288, 214938, -79843, 40074, -221443, 56185, 100883, 254038, 15684, 214455]
11176B14455g2360k83288a35837B57504g0115B99634A4406b54752N3925m9070
11166b49897g5571j31092m2753B03272a99821j4238q9148f8918A55116b3430I0009
11154G7598i5479B12987i0961l3426C6793a76782m8674K7384C21774j05637b64948
11142a00729o6459A32346D6015i7378k30231A55351a5568G5010A3581c7713o3987
11131a01700b1327H7293c44235Q3547A72015L36114A85947g0646K518B73377j03340
11120A70037J13471f868A14903N9248A2384a1125D5654J4007D832g5166F8609
11108A32973a17641G777a7239j71617o7896a19845a1611j59909B35990J73478
11098D09468A2461J32542K81114b4305E75217J18185C27481F9015J42754I3949
$$ y = [214455, -72360, -355648, -135837, 257504, -70115, 299634, 14406, -254752, -200827, -249897, -75571, -206663, -249416, 203272, -199821, -214059, -303207, -68918, 155116, -23430, 90009, 77598, -95479, 212987, -90961, -124387, 36793, -176782, -225456, -198072, 321774, 216137, -264948, -100729, -167188, 132346, 46015, -97378, -327609, 155351, -15568, 75010, 13581, -37713, -101700, -21327, 87293, -344235, -260688, 172015, 508129, 185947, -70646, -68128, 273377, 170037, 283508, -6868, 114903, 174151, 12384, -11125, 45654, 59661, 4832, -75166, 68609, 132973, -117641, 7777, -17239, -188856, -256752, -119845, -11611, -171520, 235990, 409468, 12461, 145003, 426117, -24305, 575217, 693402, 327481, 69015, 211769, 93949]
11087D80829j63869Q2623A28389M5834L25222A59249J03710j06778d104C49228
11076C20862R246B7041a0889B0831L78190j02937o7918j13203L43214L2476o0063
11065D30590J19608l7218J0178j96041R9175j83755L32844o1430j41788M00217
11055G72380j60908J87301l88258J24935M8565j76548K64998j19606J64607l50640
11045C66826M33174N0229k45505k0492N03735E17569L28210L28716j95008m48199
11035E31288K79918o755J20509k32513K53232j59589k56766j48608N69420k20868
11025G29268K47315j82104K10482j49250k48132J35888q2837m4578K38142j51400
11015G02794p8562n4140k60313M23253j56602O0473l8798K3349P0376j39679M51557
$$ y = [480829, 316960, 399583, 128389, 174223, 499445, 159249, 262959, 156181, -4104, 349228, 320862, 330108, 27041, -10889, 20831, 399021, 296084, 228166, 114963, 458177, 490653, 430590, 550198, 512980, 523158, 327117, 426292, 242537, 575381, 513951, 372163, 772380, 611472, 798773, 410515, 535450, 584015, 407467, 672465, 552859, 717466, 366826, 800000, 850229, 604724, 584232, 1087967, 517569, 845779, 1174495, 979487, 531288, 811206, 804451, 924960, 692447, 945679, 786090, 529324, 380716, 950136, 729268, 976583, 794479, 1004961, 855711, 607579, 743467, 660630, 616052, 854194, 702794, 624232, 570092, 309779, 733032, 576430, 636903, 598105, 621454, 691830, 552151, 1003708]
11004A003708m41557Q0249k8050K02577p8933k01883P0764k39415K65639J83529
10994H16628k41229K84756k14668M175J35153j75786J67155N2406J89088k47499
10984G70179j54821J44445k16769L59919K03286m52355N45027R137K70722j83801
10974A294969k88673P42950R556Q4746L29274J77491K21925M24230O159O0275
10964C062902j51991K70866n5265l11908k44876m61162l47485Q2639k66444j2445
10954A564831o1431P1536M27484n38654r0195J92544m21489M1591o4492k73565
10944H48160k68767j19452R5284J87940l66932L0872j12252n7923A0320M11047
10934D21367j78652J4767R2671j34583J09759B6597J27446J50654C0317q915K33406
$$ y = [1003708, 562151, 642400, 614350, 816927, 737994, 536111, 606875, 367460, 633099, 816628, 575399, 860155, 645487, 649662, 784815, 609029, 776184, 828590, 1017678, 770179, 615358, 759803, 543034, 902953, 1106239, 653884, 1198911, 1208048, 1478770, 1294969, 1006296, 1749246, 1758802, 1843548, 2172822, 2350313, 2572238, 2996468, 3002627, 3062902, 2910911, 3181777, 3126512, 2814604, 2569728, 2108566, 1761081, 1843720, 1577276, 1564831, 1503400, 1574936, 2002420, 1463766, 1373571, 1566115, 1144626, 1186217, 1121725, 848160, 579393, 459941, 555225, 743165, 376233, 407105, 294853, 236930, 10320, 421367, 242715, 257482, 350153, 215570, 325329, 26597, 154043, 304697, 30317, 21402, 254808]
10923B54808E0392O1286b73683A4983L63345G6814H645b60921J15665k7377G0813
10911A30254C1294P4174b47933a08268k68206d9882G5748b10333L5716h576q5330
10900i3906B77136b15735d293H9195b47029j34159J35793F9119M754i4378j00037
10889a94415k5104A38160f8975G4047L472a04020A58864b62678a4750H1126i3251
10877C73302a82773B58120M607C5056b91864J33855H3765f8448p0620A48734a62675
10865h6075j33353H0798a62433I9983D219c17880A30232k8566A6390K10525a5719
10853a00184b5706A8818a69671g2343J975q9814L0245l1318a5276A40636e1143
10841d04041B07656P3317m9669o4246J60523A56177j5253m6458b08082q27A60671
$$ y = [254808, 50392, 111678, -273683, 14983, 378328, 76814, 8645, -260921, -145256, -172633, 70813, 130254, 31294, 105468, -247933, -108268, -376474, -49882, 75748, -210333, -174617, -8576, -93906, 277136, -215735, -4293, 89195, -247029, -381188, -245395, 69119, 73873, -94378, -194415, -219519, 138160, -68975, 74047, 77519, -104020, 158864, -262678, -14750, 81126, -93251, 373302, -182773, 258120, 262727, 35056, -291864, -158009, 83765, -68448, -139068, 148734, -162675, -86075, -219428, 80798, -162433, 99983, 4219, -317880, 130232, 101666, 16390, 226915, -15719, -100184, -25706, 18818, -169671, -72343, -70368, -160182, -129937, -161255, -15276, 140636, -51143, -404041, 207656, 280973, 231304, 167058, 327581, 156177, 140924, 94466, -208082, -208909, 160671]
10829d09649f9148I0041i4900n8738m9732c3503r9372d5102A25298J25179c3552
10817A89032a41029A7558c18760J53925J4695c7293j35200G8585a93828r1928
10807b85756A23808a01263A01440a09686A92551b38937J0841A90683C5380L0925
10797F6305B3826b2680B0809A44e1608A07312a93228A38046b0813j35103L1290
10786a24626l5960G2971E601b89103e9605m5442m6170K7636f027A06630g7392
10774a22517j72255J12295D7479c27823C43989f8086l32207P0525B57834O8915
10764C26749C5060a25768l8997Q0440L7017A14159K32974i7839B8385A566K8948
10753C0514K5314a1390k60357A3242a72313I8019I862i7366G0876b1081A08760
$$ y = [-409649, -69148, 90041, -94900, -153638, -203370, -33503, -132875, -45102, 125298, 250477, -33552, 189032, -141029, 17558, -318760, -164835, -150140, -37293, -172493, 78585, -193828, -285756, 123808, -101263, 101440, -109686, 192551, -238937, -228096, 190683, 35380, 66305, 23826, -22680, 20809, 144, -51608, 107312, -193228, 138046, -20813, -155916, -124626, -160586, 72971, 5601, -289103, -59605, -105047, -151217, -123581, -6027, 106630, -77392, -122517, -294772, -182477, 47479, -327823, 343989, -68086, -400293, -329768, 257834, 326749, 35060, -125768, -164765, -84325, -47308, 114159, 347133, -97839, 28385, 1566, 30514, 55828, -11390, -271747, 13242, -172313, 98019, 9862, -97366, 70876, -21081, 108760]
10741a01198j48884c7558n6364k24532A86248o5482f9699b7805C836a36667A92832
10729d5095B2020d7387k7884q3208B87564b48896A9689a60072a7786m28476a02870
10717c59344I7729d4937l05874A69426d5443k33985A8476P4518a43116A18930
10706C41945A31357E3579d517k5633r9991D9984d2790E1762N1307Q6726n748H8195
10693a53027A05364B4654A1391M6313K19063A38174a36151A50798J2136o9731
10683I3203c91409A98472A9091K4800c885l1600A98619I2328a16680l5745P0329
10672h2096l14907A37797a1453D02132G3373c63053a53121F6472a26615d1133
10661a2742B70209a22580A3141k967f8627E442c4820A46148G1243h2615F5213
$$ y = [-101198, -250082, -37558, -93922, -318454, 186248, 120766, -69699, -27805, 3836, -136667, 192832, -45095, 22020, -47387, -75271, -158479, 287564, -248896, 19689, -160072, -17786, -446262, -102870, -359344, 97729, -44937, -350811, 169426, -45443, -279428, 18476, 92994, -143116, 118930, 341945, 131357, 53579, -4517, -30150, -130141, 49984, -42790, 51762, 103069, 189795, 184047, 88195, -153027, 105364, 24654, 11391, 57704, 276767, 138174, -136151, 150798, 162934, 93203, -391409, 198472, 19091, 43891, -3885, -35485, 198619, 92328, -116680, -152425, -82096, -397003, 137797, -11453, 402132, 73373, -363053, -153121, 66472, -126615, -41133, -12742, 270209, -122580, 13141, 10174, -68627, 5442, -34820, 146148, 71243, -82615, 65213]
10649a88766A7878P3359h3241r6838A038b55916a6816C45a00816q7762E927J56894
10637A62821q810a13804H5453K8131a24834A30391F1561c44656a41529C0461h5993
10625c21479a24689F314a87326B64374b21498f335k35455O0071r0582C0912J09051
10614A39963a23719j12508d0158B46304d4442j99801i0813l07357e1376J1242
10604d0134A08J37966g5391o8293F2701B6507J71387F1766c2342j19974Q778n1255
10592a94793P6248j952c0880k42480J8946A1149b57236A50401a30610j29069e0351
10580a97628h3779j24967c1661j14468B0052b73656a1803B23730c2418A06218
10569a96545B7922A2542L1076K18219h8998C1815c0495A32975A739i5825I4725
$$ y = [-188766, 17878, 91237, -83241, -180079, 1038, -255916, -16816, 345, -100816, -188578, 5927, 162821, 154011, -113804, 85453, 113584, -124834, 130391, 61561, -344656, -141529, 30461, -85993, -321479, -124689, 6314, -187326, 264374, -221498, -6335, -241790, -181719, -272301, 30912, 139963, -123719, -236227, -40158, 246304, -44442, -244243, -90813, -398170, -51376, -40134, 108, 138074, -75391, -143684, 62701, 26507, 197894, 61766, -32342, -152316, -143538, -194793, -118545, -120497, -30880, -273360, -254414, 11149, -257236, 150401, -130610, -259679, -50351, -197628, -83779, -208746, -31661, -146129, 20052, -273656, -11803, 223730, -32418, 106218, -196545, 27922, 12542, 43618, 261837, -88998, 31815, -30495, 132975, 1739, -95825, 94725]
10557e60303i6314I6261K8548P9531k6760a07165G9248a11083N884b5172j61204
10546a86376A7280b73838O9175A61310a47524e0893j7080M60B10515G1548P0908
10535A42456a0179m4718E1468b31518C11385F0255b50639c6611J1174j73579g9892
10523a52444j26722e372l29020G7099A687c09437A48663h712A98456a95263B45757
10511b74947A46530K64483c46385f1604j60159G386M1201g1044A0652a89518a8889
10499B4493b02109e870C0887b9543k8319l35422a2724p3496A16799n5566M0656
10488A01889P6584Q5276B3168h5143A12874L3655q828J71054j04121q2831b10526
10476d4297C67463j0580r2655K17145p5052j95669A6017K64585H4373J11281H9320
$$ y = [-560303, -96314, 96261, 124809, 204340, 177580, -107165, 79248, -111083, -105199, -25172, -186376, 17280, -273838, -204663, 161310, -147524, -50893, -67973, -67513, 210515, 71548, 142456, -10179, -54897, 51468, -231518, 311385, 60255, -250639, -36611, -25437, -199016, -79892, -152444, -279166, -5372, -334392, 77099, 1687, -309437, 148663, -8712, 198456, -195263, 245757, -274947, 146530, 411013, -346385, -61604, -221763, 7386, 48587, -71044, 10652, -189518, -18889, 24493, -202109, -5870, 30887, -29543, -57862, -393284, -12724, -86220, 116799, 61233, 101889, 178473, 263749, 23168, -85143, 112874, 146529, 137701, 308755, 204634, 121803, -210526, -44297, 367463, 356883, 264228, 481373, 406321, 210652, 16017, 280602, 84373, 195654, 89320]
10464F8191J61362i4967k06797J43982D6649a97624i7730p5952A37189i7031C1497
10452a56430N4560o7235e8662K978C18945b2884o1537q0733A35459e42127b38157
10440c4966A95207a00110a7066J175M445j89655P1384r3093E4084c4042m16291
10429d50333J80805O2925Q1644B07641A8485b55291F8406M8755J79602A0302J51117
10418A61419b93804a11780n3519A0479e3394J352I2235L8395D3130a79840j10218
10407b90058G8399O275J8826a8594C1128b2002B86L4129e12538C11574a82963
10395A48308E4335a23749D03639A27948i1298J264C2202P2699k1733J42490L7566
10384B63224A6499L31727P1864n6886G410c05030A50060N5009K4712K7r1071L69444
$$ y = [68191, 229553, -94967, -301764, -157782, 46649, -197624, -97730, -173682, 137189, -97031, 31497, -156430, -101870, -169105, -58662, -55684, 318945, -22884, -84421, -165154, 135459, -542127, -238157, -34966, 195207, -100110, -17066, -15891, -11446, -201101, -129717, -222810, 54084, -34042, -450333, -269528, -206603, -124959, 207641, 18485, -255291, 68406, 117161, 296763, 10302, 161419, -293804, -111780, -165299, 10479, -53394, -52042, 92235, 130630, 43130, -179840, -290058, 78399, 84674, 103500, -18594, 31128, -22002, 286, 34415, -512538, 311574, -182963, 148308, 54335, -123749, 403639, 127948, -91298, -90034, 32202, 104901, 83168, 225658, 263224, 16499, 348226, 420090, 363204, 7410, -305030, 150060, 205069, 229781, 229808, 138737, 508181]
10372E08181o7034j12744N2359p6025D5798L78850A03350J71651K15859j80526
10362C10334q6644J68724L4272q6900q2925o2110n8154l441F3155K82802P0123
10351D16080j51436q895m6555Q6639J30766J33465j47059J33987m6769j76269
10341C23954A34380n7347l3359J36412J22334m4656h5821A86890l0282F3018a06359
10329I9855J73358c13070D37273I0402N276C7647K00166C0967M06038k11598F2624
10317B31097p1701e5217A14959O0176o9387Q0865J82063j70307J55883a0225A62116
10305A7046a5166p1546j72177a04067B53259j07210j2323a3063l03585n0048G597
10293c19072a21659K1026L1792I3614b8672j84770B9199N1168b8305n22898a70220
$$ y = [508181, 441147, 328403, 380762, 304737, 45798, 424648, 103350, 275001, 490860, 310334, 223690, 392414, 426686, 339786, 256861, 194751, 136597, 133156, 63155, 345957, 416080, 264644, 255749, 209194, 295833, 426599, 560064, 413005, 546992, 500223, 323954, 134380, 77033, 43674, 180086, 302420, 257764, -85821, 186890, 156608, 63018, -106359, 99855, 273213, -313070, 437273, 90402, 95678, 37647, 237813, 30967, 437005, 225407, 62624, 231097, 159396, -55217, 114959, 175135, 105748, 186613, 368676, 198369, 354252, -10225, 162116, 17046, -15166, -86712, -258889, -104067, 253259, 146049, 133726, -13063, -316648, -366696, 7597, -319072, -121659, -100633, -68841, 93614, -28672, -213442, 29199, 80367, -28305, -551203, -170220]
10281B50608B7394b68984A2103c40489b1212q0597m0690c9120j11378k9010I6785
10269h9064B50989a95957P1486A6862J96998b23410j2337J07568r5321M6590A2232
10257i5484B22998e7268j16681B12731R966e0994D35197p9578j73892J32919o401
10246C08245F6873L6823K64894g7350l8564f55C8840d92052G6053N330L8677j7198
10234A02862b74065A4260P8631c4595q0610B79168i4574A14712K2716e3702l35430
10223c89132a87745p7534e4697l3947C2319a00980o4877P834A07064c63081c7048
10211a940C6834A6807a515A74868c58824J00585K7824C9503a9331D3383a06751
10199A275e167l35603a09079l1637A00598J0491I676M2030K39755g3699k13100
$$ y = [250608, 27394, -268984, 12103, -340489, -21212, -101809, -142499, -39120, -150498, -179508, 96785, -89064, 250989, -195957, -124471, 16862, 213860, -223410, -235747, -128179, -223500, -176910, 12232, -95484, 222998, -57268, -173949, 212731, 222697, -50994, 435197, 355619, 181727, 314646, 308245, 66873, 103696, 368590, -77350, -115914, -655, 38840, -492052, 76053, 81383, 120060, 102862, -274065, 14260, 92891, -34595, -115205, 279168, -94574, 114712, 137428, -53702, -389132, -187745, -265279, -54697, -88644, 32319, -100980, -165857, -158023, 107064, -363081, -37048, -1940, 36834, 16807, -1515, 174868, -358824, -258239, -230415, 39503, -19331, 43383, -106751, 1275, -5167, -340770, -109079, -140716, 100598, 111089, 9676, 51706, 291461, -73699, -286799]
10188b86799A05334b46270M6182G3885b9759k07324a945l78702c0405j1578C4533
10176d6744e309B99037c01561a4146F966J79566D2559b77558P9238G3787a86041
10164f655k79090m6734B10419o4103a0710k85404a01074k59068E0153e3113k6270
10153g9383C6060a61641g5211j82221B4746a57932B76398I6947b24556a09160
10142c12586B18978b67505c3932k55868m9101a24935j74664G156b62148a6093
10131a45279l4630A12444l6470b56396A84469g9021I3230L8805a30370G2439A5654
10119C9506E732a55497N2795K7805B72791f8449J6877p2488j22921D0686k147
10108C8539K07187b93479P7046b5155I2634a39014A72778h2815A26471c1171m7172
$$ y = [-286799, 105334, -246270, -200088, 73885, -29759, -237083, -1945, -380647, -30405, -41983, 34533, -46744, -5309, 299037, -301561, -14146, 6966, 186532, 42559, -277558, -198320, 73787, -186041, -6655, -285745, -332479, 210419, 146316, -10710, -296114, -101074, -360142, 50153, -53113, -79383, 36060, -161641, -75211, -257432, 24746, -157932, 276398, 96947, -224556, -109160, -312586, 218978, -267505, -33932, -289800, -338901, -124935, -299599, 7156, -262148, -16093, -145279, -179909, 112444, 75974, -256396, 184469, -79021, 93230, 132035, -130370, 72439, 15654, 39506, 5732, -155497, -102702, -74897, 272791, -68449, -51572, -124060, -246981, 40686, 38539, 245726, -293479, -216433, -25155, 92634, -139014, 172778, -82815, 126471, -31171, -78343]
10097g8343A76888a94582H8804K5756a59175A18400c48687h0745K6582k4371K3433
10086e5101K6808p9213G2752a40140m4350E1966b93939D646O4770C162h8119A16346
10073B34129F2856b78393a06357k7125A5892J04569D6848b11103A69440b81416
10062a54161j378p8788G9085J05225a5844A86635o1996J3193m3189R7722m2369
10051A49996b86266H0547a10885l3061r2611a5787G1339b52962B7062j0905f8976
10039h9427j15802L5819A11679b34001E1152a3153j44483P1460o7307I7247d26418
10027a20583N8903l3167q2819f6641h68B350a21377j03841I3910h9797n0075A72007
10014B20871b24021O1138B3774J04837c138j96238a3996j20791f6035l642B02842
$$ y = [-78343, 176888, -194582, 88804, 114560, -159175, 118400, -348687, -80745, -54163, -78534, -55101, -28293, -107506, 72752, -140140, -184490, 51966, -293939, 4646, 69416, 3162, -88119, 116346, 234129, 62856, -278393, -106357, -133482, 15892, 120461, 46848, -211103, 169440, -281416, -154161, -155539, -234327, 79085, 184310, -15844, 186635, 124639, 137832, 94643, 192365, 149996, -286266, 80547, -110885, -143946, -236557, -15787, 71339, -252962, 27062, 16157, -68976, -89427, -205229, -169410, 111679, -234001, 51152, -13153, -157636, -86176, -153483, 97247, -426418, -120583, -61680, -94847, -177666, -66641, -868, 2350, -121377, -225218, 93910, -89797, -139872, 172007, 220871, -224021, -162883, 23774, 128611, -3138, -199376, -13996, -134787, -66035, -69677, 202842]
10002I7036A6697a65861C7384m845h5196l57401A33583n9542b8820j14999I6054
9990F3292L37492B3499K3956B860f6429A1232i7005M5181A16015a06471B03236
9978f0413b2025j59222e908A84731e3092A01775B9674c03966E027a36494c2976
9966a38459K356m4425Q3713M7437j53258A89401m2639j9558a39660a7215k01878
9955b19093Q1718k33219a36579N9101b2909p0401D9713a28404K931j5936n7252
9944a98661l840B63673c023j6086A10526l6096e5566A37311j6824K4109c79528
9932A47542C6757g2212k2957A14593a43889d7682A815J96287k9521a5863j57792
9921a73655A57251c00782J40758m437j9906A33127d15306a0620B00000c0009B5210
$$ y = [97036, 16697, -165861, 37384, 32539, -85196, -442597, 133583, 74041, -28820, -143819, 96054, 63292, 400784, 23499, 47455, 2860, -66429, 11232, -97005, -51824, 116015, -106471, 203236, -60413, -22025, -181247, -5908, 184731, -53092, 101775, 29674, -303966, 5027, -136494, -32976, -138459, -136103, -180528, -96815, -49378, -202636, 189401, 146762, 127204, -139660, -17215, -219093, -137375, -370594, -136579, -77478, -22909, -93310, 49713, -128404, -125473, -141409, -198661, -202501, 263673, -3023, -19109, 110526, 74430, -55566, 137311, 120487, 144596, -379528, 147542, 36757, -72212, -95169, 114593, -143889, -47682, 1815, 198102, 168581, -15863, -173655, 157251, -300782, -160024, -164461, -184367, 133127, -415306, -10620, 200000, -30009, 25210]
9909a34189j3798M1154b7548A51966b41628D7628a92570c6020j60887E4146B070
9897B01690d64933a70548j13366k06501a03777A80611g0380E9221O5125l8007
9887H6339b7290p6844j18344p871J12251J6561j85816N4198G0581b88638A5673
9875D0256c5709G3193R6242B0209R4288J8203c03427d7786H594J12027a98844
9863B4906L4187c85019A14052b86429i7755A59790b00195j82179A52025K4751
9853A76776b69797A63463g3355A72470f5945A32084J40924b12102h8136A37792
9842b34196g6917C4951b04131Q123B285J12070a42547H643K924R9355b82183A37690
9829i3440q7685i228p4934I0913e44075b46613j8521B51898b37637c740p2935
$$ y = [-134189, -147987, -106833, -27548, 151966, -241628, 47628, -192570, -36020, -196907, 54146, 2070, 201690, -464933, -170548, -283914, -490415, -103777, 180611, -70380, 59221, 124346, 86339, -27290, -104134, -222478, -230349, -118098, -101537, -287353, -233155, 70581, -288638, 15673, 40256, -35709, 73193, 169435, 20209, 114497, 132700, -303427, -47786, 8594, 120621, -198844, 24906, 59093, -385019, 114052, -286429, -97755, 159790, -200195, -382374, 152025, 176776, -269797, 163463, -73355, 172470, -65945, 132084, 273008, -212102, -88136, 137792, -234196, -76917, 34951, -204131, -196008, 2285, 114355, -142547, 8643, 11567, 110922, -282183, 137690, -93440, -181125, -9228, -84162, 90913, -544075, -246613, -265134, 251898, -237637, -3740, -76675]
9818g6675A14412c59227a37759k4672j34779J31271B4496b2896j22341A27064
9807D787a29149a7962A74723h9100A63223f1990A09314c9196m4847k1919m61774
9796e67736c8439E6021a64422P7257A00933c222j689r8998e0482B03029m5207
9785A57822F7160B277i2899A1801c3665k76887A0696N4078J19832p1842b952n3458
9773e6410r954A49541c45699a1418I8557l6512L0873a36684B23140g3810c0887
9761a51166B3302i1090H6054a915k7294q2666n1324C5304b56305c7138H7224B0765
9748b66752J27800B09907A03935O4890p0953D2421h7679d1457j47844j09991e9671
9736c5842B3907K6516n74b84869a11124o2990B24913a74767A59828a4269r9693
$$ y = [-76675, 114412, -359227, -137759, -162431, -297210, -165939, 24496, -22896, -145237, 127064, 4787, -129149, -17962, 174723, -89100, 163223, -61990, 109314, -39196, -84043, -105962, -567736, -38439, 56021, -164422, -87165, 100933, -3222, -4911, -103909, -50482, 203029, 157822, 67160, 2277, -92899, 11801, -33665, -310552, 10696, 64774, 184606, 112764, -2952, -56410, -66364, 149541, -345699, -11418, 98557, 62045, 92918, -136684, 223140, -73810, -30887, -151166, 23302, -91090, 86054, -1915, -29209, -111875, -163199, 35304, -256305, -37138, 87224, 20765, -266752, -138952, 209907, 103935, 168825, 97872, 42421, -87679, -41457, -189301, -299292, -59671, -35842, 23907, 50423, 49849, -284869, -111124, -174114, 224913, -174767, 159828, -14269, -113962]
9725a13962D8501O8582c22530E3827h4888m3536A98428e3076J6052j8098B71960
9713b00767g7053N295A49496a01470A78520e3868k2568o3223O1859J2638j03992
9702a69154D2303g8m2525j7258j04796e4464A03107a20376H9940A2441a68247
9690H1421b45970l0571N179G2003B266b73500A52934b17773c5264C24114a31503
9678b46394f7192J5213l0349r1289p3102A64143b27863p7007a19093N0767K8932
9667c9394n1082c1589J1786A69687q718a0858j25590A03109d6760k7907J2615
9656f2052A6873c72316h1530q8377H0817J49262G7060a37089m4395A40291A4741
9644B7632a85180A86680a07691C8599e557q5273k2967c4323p055k98966A76095
$$ y = [-113962, 48501, 117083, -322530, 53827, -84888, -128424, 198428, -53076, -37024, -55122, 271960, -200767, -77053, -71758, 149496, -101470, 178520, -53868, -76436, -139659, -77800, -65162, -169154, 42303, -78, -42603, -59861, -164657, -54464, 103107, -120376, 89940, 12441, -168247, 81421, -245970, -276541, -271362, 72003, 2266, -273500, 152934, -217773, -35264, 324114, -131503, -246394, -67192, -51979, -82328, -173617, -246719, 164143, -227863, -304870, -119093, -68326, -39394, -90476, -31589, -19803, 169687, 160969, -10858, -136448, 103109, -46760, -74667, -62052, 16873, -372316, -81530, -169907, 80817, 230079, 77060, -137089, -181484, 140291, 14741, 27632, -185180, 186680, -107691, 38599, -5557, -90830, -113797, -34323, -41378, -340344, 176095]
9632a36256f2263k17244B0213a20461A9169Q8138a07353d4197m6179d1826j20344
9621a62170M9325n6684C6319a6057m245G5657c28133a6314j94960g1557P367j30389
9609a94579B21108I6535a41452j97022F8227J1015K5448a91578j53295A72713
9598c39002m2404e4035C5440i2899L2675j32434a9441A00970a52232A73488a29163
9586a92918Q7814A62890C7876c1320j43245k9351A83581j9955g7544J1019C51713
9574G174d0588F8625a97982m3384r0274A08715c03389a32575A10202f0656r9076
9563a59732j84571a02218j46722A03747b75060h0185c4908l12585E417a85740
9552B26634F8655B3071a43963A18168f7936q7424M2918A88172a67542A0662b56315
$$ y = [-136256, -62263, -279507, 20213, -120461, 19169, 107307, -107353, -44197, -90376, -41826, -162170, -112845, -169529, 36319, -16057, -20302, 75657, -328133, -16314, -211274, -71557, -64190, -194579, 221108, 96535, -141452, -338474, 68227, 79242, 104690, -191578, -344873, 172713, -339002, -381406, -54035, 35440, -92899, -60224, -192658, -19441, 100970, -152232, 173488, -129163, -192918, -105104, 162890, 37876, -31320, -174565, -203916, 183581, 163626, -77544, -66525, 351713, 7174, -40588, 68625, -197982, -241366, -331640, 108715, -303389, -132575, 110202, -60656, -159732, -344303, -102218, -248940, 103747, -275060, -80185, -34908, -347493, 5417, -185740, 226634, 68655, 23071, -143963, 118168, -67936, -155360, -112442, 188172, -167542, 10662, -256315]
9540i3384H4302C4189b01279m698P8604A2125a3262j37017E8853b06469J3729
9529a92740P7795L0291j78916A1868O1469a15110N0580A39792a44798r6928B32083
9517C6175a84278A62154b74858o9130g7300q1883A7840d6724D8415J21779i2799
9505d3643l5172b0436j65997o2055P6856B6553J03112f5154H2650a54864n3050
9494b07914A70587b33843Q0159P0723k71618A26652C3399l532b2477F0042L92986
9483D53028i3997A65706b9145l9666J6122j8316A39152D7281a37714H1678a60499
9471D0800b52220g9586F3802b52262r632N4485M4252A0167J41469I511e1844k43548
9459b95392a43059k3376a3331l04950a19419p0831k7982a02357A77151p0855j2551
$$ y = [-93384, 84302, 34189, -201279, -205977, -127373, 12125, -13262, -150279, 58853, -206469, -192740, -114945, -84654, -263570, 11868, 73337, -115110, -64530, 139792, -144798, -241726, 232083, 36175, -184278, 162154, -274858, -343988, -77300, -159183, 17840, -46724, 48415, 170194, -92799, -43643, -78815, -20436, -186433, -248488, -171632, 26553, 129665, -65154, 82650, -154864, -207914, 170587, -233843, -153684, -82961, -354579, 126652, 33399, 29867, -22477, 60042, 453028, -93997, 165706, -29145, -68811, -52689, -71005, 139152, 47281, -137714, 81678, -160499, 40800, -252220, -79586, 63802, -252262, -261894, -207409, -163157, 10167, 151636, 9511, -51844, -295392, -143059, -166435, -13331, -318281, -119419, -190250, -218232, -102357, 177151, 106296, 93745]
9448I3745a93787p4659J18073A05805J72590H687L2347A6216d78247h5158F7003
9436A1682a77186E0392a97755F1606k6902a28598A06929J2672O089l4973c24135
9424I0961a40738K1479M4863b7085o7737m5294d2992j7775O833K323E9478c40271
9411b1490j85796A4112J07916b2719E2176D791L9977Q5819l3182f4899j47717
9400b12616C2403a81451I3211b13034O9824D0772a60081b8371j69021c600l63540
9389c67140b100r8638a4894j63532p3367B15746c30143A48245N8686h8249j9760
9378a08009M0229b5313l4204D3341a42299C42837h9043F237K94061A07093J88153
9367B95246H3135J05671a57377E912d5732n1514c5101m11707J72431A42615c85072
$$ y = [93745, -193787, -268446, -150373, 105805, 278395, 8687, 41034, 16216, -478247, -85158, 67003, 11682, -177186, 50392, -197755, 61606, 34704, -128598, 106929, 119601, 125690, 90717, -324135, 90961, -140738, -119259, -74396, -27085, -94822, -140116, -42992, -60767, -53934, -51611, 59478, -340271, -21490, -207286, 14112, 122028, -22719, 52176, 4791, 44768, 130587, 97405, -64899, -212616, 32403, -181451, 93211, -213034, -143210, 40772, -160081, -28371, -197392, -3600, -367140, -2100, -100738, -14894, -178426, -251793, 215746, -330143, 148245, 206931, -88249, -108009, -67780, -25313, -59517, 43341, -142299, 342837, -89043, 6237, 300298, 107093, 295246, 83135, 188806, -157377, 5912, -45732, -97246, -35101, -446808, -274377, 142615, -385072]
9355H7296A8454a17045J1944b3689K294j81908B06609c855o0619F6087j5651a08338
9342b12684b3609j64198J6011Q2207n241A6338a1668j41301b2529p6933F0277
9330i8970j53351a4450j1405d61A24448b03157e9939E6414a63710d1708k36587
9319b78295o0523B6514b84509a14952o3993B26161c23632R7667R3005k53919A37868
9307D9636a71099A2206b71057i7238p2026N3046A90947b55541l3211D5518J7012
9296F2530d2746A76624d71571a3083j57693j26995J36741g5380l20187g6541E4287
9284f6213F245a69838o155k8163a2993p0678r1579E0979c5787j57716B62541e5320
9271b37373f4627A6835c97059B2656j0932c50265Q0204b563l952k11925e18l35789
$$ y = [87296, 18454, -117045, -105101, -23689, -21395, -203303, 206609, -3855, -64474, 66087, 50436, -108338, -212684, -23609, -187807, -171796, -89589, -94830, 16338, -11668, -152969, -22529, -99462, 60277, -98970, -252321, -14450, -25855, -461, 124448, -203157, -59939, 56414, -163710, -41708, -278295, -338818, 26514, -284509, -114952, -178945, 226161, -323632, -225965, -132960, -386879, 137868, 49636, -171099, 12206, -271057, -97238, -169264, -116218, 190947, -255541, -288752, 45518, 62530, -42746, 176624, -471571, -13083, -170776, -297771, -161030, -75380, -395567, -76541, 54287, -66213, 6245, -169838, -175993, -204156, -12993, -83671, -175250, 50979, -35787, -193503, 262541, -55320, -237373, -64627, 16835, -397059, 22656, 11724, -350265, -270061, -2563, -6515, -218440, -518, -336307]
9259c36307j14668b9353j95450K6279D9792k928d61727a5419k8236A93001b61981
9247c19143g8432j29880e2102A83773b07996B96992a77426j62446A16625n0858
9237F5767c9755P530p0497B12506b62955R3577I8004c53154a12377j12730a04852
9225E569b07407b7907r9732r050A324J85271b71122K9670A11733c8375k75477
9214c13852a27934A96249d6423A04496a06933b6867A17442m6217a41751J0384
9204a31367j88290N4173Q5875j1916J4386C1706B563a945j75097H3906M8578c09730
9191f5292j36172A92811O3727b99049C0549a32561m1967N1050L217A40807h7606
9179F7639K29547g0235L1549B9977g8615l9285l6910k46324b1526G4352r976J79359
$$ y = [-336307, -450975, -29353, -224803, -198524, 49792, 46864, -461727, -15419, -43655, 193001, -261981, -319143, -78432, -208312, -52102, 183773, -207996, 296992, -177426, -339872, 116625, 65767, -39755, -32225, -102722, 212506, -262955, -169378, 98004, -353154, -112377, -225107, -104852, 5569, -207407, -27907, -127639, -136689, 1324, 186595, -271122, -241452, 111733, -38375, -313852, -127934, 196249, -46423, 104496, -106933, -26867, 117442, 71225, -141751, -131367, -319657, -265484, -179609, -191525, -177139, 31706, 2563, -1945, -177042, 83906, 132484, -309730, -65292, -201464, 192811, 256538, -299049, 30549, -132561, -174528, -123478, -120261, 140807, -87606, 67639, 297186, -70235, -38686, 29977, -78615, -117900, -154810, -401134, -21526, 74352, 64376, 243735]
9167B43735N0338A06928l1055J10993C2980g7356b2726m0753j36081A62685b44839
9155A5069a3806F3807c3167l5589j3584j274E3291i1451j06023n852K9058B49095
9142B2138L17351b57231L2818L6920j9093k0997a2839j51701P3537B87557G3709
9130c5948j52791a1011k69689B35072b00028k12214a86414E1055L9a0059L688
9119f371B3754c26839i4399b5457A31743E5627L1576p180b88893K6041C5274b42873
9106b57634J28135l1227J6375m1635d0279A73184o7977b75327A16327a46779J3708
9095a33071B84683A06363b5943C3845K53005C6066a15897A68205g4200K0411R662
9084d4127l2634B08395d17452a17005o5605m2082B22300b58539m7693c9224A85557
$$ y = [243735, 294073, 106928, 75873, 186866, 32980, -77356, -22726, -63479, -199560, 162685, -244839, 15069, -13806, 63807, -33167, -68756, -82340, -83614, 53291, -91451, -197474, -203326, -174268, 249095, 22138, 339489, -257231, -224413, -187493, -206586, -227583, -12839, -164540, -91003, 287557, 73709, -35948, -188739, -11011, -280700, 235072, -200028, -412242, -186414, 51055, 51094, -10059, -6371, 23754, -326839, -94399, -25457, 131743, 55627, 87203, 80023, -288893, -262852, 35274, -242873, -257634, -129499, -160726, -144351, -185986, -40279, 173184, 105207, -275327, 116327, -146779, -133071, 284683, 106363, -25943, 33845, 286850, 36066, -115897, 168205, -74200, -53789, -44127, -76761, 208395, -417452, -117005, -182610, -224692, 222300, -258539, -306232, -39224, 185557]
9072I2808L4753a0601B56851a06529l5135p6135j406L0392O617j94483J09595
9061b67084J18192N3009A3537M31680i1558D8444g2478J6600j69155C527c97047
9049G858L5939d7656o3181k3325A52049A4767N0714O2102a75653N0867A69684
9037D0267j1969a74017H8379g4940c1313m43434B36205q2304b01099q2151a0724
9025b32038J08484j09256h8078A13907O3414a67601b4960m8011L3933j45783j15299
9014c00120Q3868P9621I604f8028j84305J11415b1017B35122E381c5042k08098
9003b43140d3948j1727j88598p555d6170q549E0103c2528O827j71613a3081o6322
8991g9403o5049f8467j00484k4240I822a27367h534A82389b23060a01647J0990
$$ y = [92808, 127561, -10601, 256851, -106529, -141664, -217799, -219205, -188813, -182196, -376679, -267084, -148892, -95883, 13537, 445217, -91558, 48444, -72478, -55878, -225033, 3527, -397047, 7858, 43797, -47656, -110837, -134162, 152049, 14767, 65481, 127583, -175653, -124786, 169684, 40267, 28298, -174017, 88379, -74940, -31313, -474747, 236205, 153901, -201099, -283250, -10724, -232038, -123554, -232810, -88078, 113907, 177321, -167601, -24960, -72971, -39038, -184821, -300120, -216252, -136631, 9604, -68028, -252333, -140918, -21017, 235122, 5381, -35042, -243140, -43948, -55675, -244273, -251828, -46170, -54719, 50103, -32528, -25701, -197314, -13081, -79403, -144452, -68467, -168951, -193191, 9822, -127367, -8534, 182389, -223060, -101647, -90657]
8980i0657j52992H0486d81083i1137B2098J32138m8583J59058A8666a98891R3395
8969a05496O956m5243E5073k0141J35315a66282k4481p7299a11231n6558P2060
8958i5729A27664B7470a30075j51863F8561c94159J66169E6897a65446B19846
8947a15492D32397c8461j30516B0727b6556p7731j11261i5703a125A1475c2881
8935b726A48357Q8295J95483f0476B40941m0891k8568b09874B13183r5420D762
8923c09846A98019a85760C23704L83943J873206O08765H57998G6325A6233a60267
8912b0837o3437j90200C73203G910R2610a89981A65485b68573j0044D4523L25712
8901C70235b73061D2484d6470A79874J13242C6351i0254k9839C0863b73672J02724
$$ y = [-90657, -243649, 80486, -481083, -91137, 22098, 154236, 105653, 264711, 18666, -198891, -105496, -98540, -143783, 55073, 34932, 170247, -166282, -190763, -268062, -111231, -167789, -95729, 127664, 27470, -130075, -281938, 68561, -394159, -227990, 56897, -165446, 219846, -115492, 432397, -38461, -168977, 20727, -26556, -104287, -215548, -95703, -1125, 11475, -32881, -2726, 148357, 236652, 432135, -60476, 240941, 200050, 171482, -209874, 213183, 117763, 4762, -309846, 198019, -185760, 323704, 707647, 2580853, 3189618, 857998, 76325, 16233, -160267, -20837, -84274, -274474, 373203, 7910, 100520, -189981, 165485, -268573, -278617, 44523, 370235, -273061, 42484, -46470, 179874, 293116, 36351, -90254, -120093, 30863, -273672, -170948]
8890a70948Q2923j5410b042j3777k6987j63197a923E325b14247H0054g9209d422
8877b94787a07633k7488A25246h5717n2057I3889d3741E4710a25029e4626k53616
8866c08242N8936c3203A77160B6515d7344B00183o7493a89144A38430P628c7139
8854d7771k44737k6706j25898a93760C33910C954J14758h4039j5755k2600A87684
8842a84882k7660n2371Q3582m4433a5901n2622q8582A4734a83809b3298a546E926
$$ y = [-170948, -88025, -103435, -2042, -15819, -42806, -206003, -1923, 5325, -214247, 80054, -79209, -4422, -294787, -107633, -135121, 125246, -85717, -137774, 93889, -43741, 54710, -125029, -54626, -308242, -249306, -33203, 177160, 26515, -47344, 200183, 132690, -189144, 138430, 146058, -37139, -47771, -292508, -319214, -445112, -193760, 333910, 3954, 118712, -84039, -99794, -122394, 187684, -184882, -212542, -264913, -181331, -225764, -15901, -68523, -157105, 14734, -183809, -23298, -1546, 5926]
$$ [...]
##END NTUPLES=NMR SPECTRUM
##END=
