##TITLE=NES1007_929159_9232788_6avWAGcTBk
##JCAMPDX= 6.0         $$ Bruker NMR JCAMP-DX V2.0
##DATA TYPE= NMR SPECTRUM
##DATA CLASS= NTUPLES
##ORIGIN= BRUKER
##OWNER= Administrator
$$ 1.72 TOPSPIN		Version 2.1
$$ 2015-08-24 15:51:38.983 -0700  Administrator@X
$$ Compression mode = diff/dup
##.OBSERVE FREQUENCY= 400.02188249412
##.OBSERVE NUCLEUS= ^1H
##.ACQUISITION MODE= SIMULTANEOUS (DQD)
##.ACQUISITION SCHEME= undefined
##.AVERAGES= 64
##.DIGITISER RES= 22
##SPECTROMETER/DATA SYSTEM= spect
##.PULSE SEQUENCE= noesygpps1d.comp
##.SOLVENT NAME= COFFEE_meoh
##.SHIFT REFERENCE= INTERNAL, COFFEE_meoh, 1, 14.96288
##AUDIT TRAIL= $$ (NUMBER, WHEN, WHO, WHERE, PROCESS, VERSION, WHAT)
$$ ##TITLE= Audit trail, TOPSPIN		Version 2.1
$$ ##JCAMPDX= 5.01
$$ ##ORIGIN= Bruker BioSpin GmbH
$$ ##OWNER= Administrator
$$ $$ E:\/data/COFFEE/nmr/NES1007_929159_9232788_6avWAGcTBk/22/pdata/1/auditp.txt
$$ ##AUDIT TRAIL=  $$ (NUMBER, WHEN, WHO, WHERE, PROCESS, VERSION, WHAT)
(   1,<2015-08-24 15:51:33.280 -0700>,<Administrator>,<X>,<go>,<TOPSPIN 2.1>,
      <created by zg
	started at 2015-08-24 15:40:03.467 -0700,
	POWCHK enabled, PULCHK disabled,
       configuration hash MD5:
       21 0F 79 D6 B3 7B B4 F6 88 20 88 DB 03 48 BD 9F
       data hash MD5: 64K
       93 2C 3B A9 58 ED AB 13 25 4E D2 E0 F0 25 94 B3>)
(   2,<2015-08-24 15:51:36.764 -0700>,<Administrator>,<X>,<proc1d>,<TOPSPIN 2.1>,
      <Start of raw data processing
       efp LB = 0.3 FT_mod = 6 PKNL = 1 PHC0 = 0 PHC1 = 0 SI = 128K 
       data hash MD5: 128K
       4F 2F 81 06 53 C2 67 D8 8C A4 25 84 E8 5A 75 77>)
(   3,<2015-08-24 15:51:37.701 -0700>,<Administrator>,<X>,<proc1d>,<TOPSPIN 2.1>,
      <pk PHC0 = -85.55054 PHC1 = 0 
       data hash MD5: 128K
       DD 87 2D AC F3 DB 80 9D 58 CB BB E7 09 6F 7C 9F>)
(   4,<2015-08-24 15:51:38.108 -0700>,<Administrator>,<X>,<proc1d>,<TOPSPIN 2.1>,
      <abs ABSG = 1 
       data hash MD5: 128K
       0F AE E7 2E 33 B0 59 7C AF 2A 84 D9 2B B9 D2 6C>)
(   5,<2015-08-24 15:51:38.201 -0700>,<Administrator>,<X>,<proc1d>,<TOPSPIN 2.1>,
      <abs ABSG = 2 
       data hash MD5: 128K
       ED C8 1E 75 04 56 C3 88 91 BA 8B 83 1D 3A DB 8A>)
(   6,<2015-08-24 15:51:38.280 -0700>,<Administrator>,<X>,<proc1d>,<TOPSPIN 2.1>,
      <abs ABSG = 3 
       data hash MD5: 128K
       26 C7 A9 EC 90 CC AE 3B 52 2A 0A 23 88 F1 31 46>)
(   7,<2015-08-24 15:51:38.373 -0700>,<Administrator>,<X>,<proc1d>,<TOPSPIN 2.1>,
      <abs ABSG = 4 
       data hash MD5: 128K
       9F 44 E4 45 D2 07 F2 02 8E E6 44 A6 88 D8 74 0C>)
(   8,<2015-08-24 15:51:38.483 -0700>,<Administrator>,<X>,<proc1d>,<TOPSPIN 2.1>,
      <abs ABSG = 5 
       data hash MD5: 128K
       70 04 2F 61 AD 6F BF DD 6D 2C 14 7B AD FC DD C0>)
$$ ##END=
$$ 
$$ $$ hash MD5
$$ $$ 36 E2 84 1E D6 E1 78 6C CE 03 09 FF 60 4D D3 BB
##$RELAX= 
##$RELAX= 
##$RELAX= 
##$RELAX= 
##$RELAX= 
##$RELAX= 
##$RELAX= 
##$RELAX= 
$$ Bruker specific parameters
$$ --------------------------
##$DU= <E:\>
##$EXPNO= 22
$$ [...]
##$TP07= 0
##$TPNAME0= <>
##$TPNAME1= <>
##$TPNAME2= <>
##$TPNAME3= <>
##$TPNAME4= <>
##$TPNAME5= <>
##$TPNAME6= <>
##$TPNAME7= <>
##$TPOAL= (0..7)
0.5 0.5 0.5 0.5 0.5 0.5 0.5 0.5
##$TPOFFS= (0..7)
0 0 0 0 0 0 0 0
##$TUNHIN= 0
##$TUNHOUT= 0
##$TUNXOUT= 0
##$USERA1= <user>
##$USERA2= <user>
##$USERA3= <user>
##$USERA4= <user>
##$USERA5= <user>
##$V9= 5
##$VALIST= <valist>
##$VCLIST= <CCCCCCCCCCCCCCC>
##$VD= 0
##$VDLIST= <DDDDDDDDDDDDDDD>
##$VPLIST= <PPPPPPPPPPPPPPP>
##$VTLIST= <TTTTTTTTTTTTTTT>
##$WBST= 2048
##$WBSW= 25
##$XGAIN= (0..3)
0 0 0 0
##$XL= 0
##$YL= 0
##$YMAX_a= 8121732
##$YMIN_a= -17197551
##$ZGOPTNS= <>
##$ZL1= 120
##$ZL2= 120
##$ZL3= 120
##$ZL4= 120
##$ABSF1= 14.96288
##$ABSF2= -5.595302
##$ABSG= 5
##$ABSL= 3
##$ALPHA= 0
##$AQORDER= 0
##$ASSFAC= 0
##$ASSFACI= 0
##$ASSFACX= 0
##$ASSWID= 0
##$AUNMP= <proc_prof1d_extract.lims>
##$AXLEFT= 0
##$AXNAME= <>
##$AXNUC= <1H>
##$AXRIGHT= 0
##$AXTYPE= 0
##$AXUNIT= <>
##$AZFE= 0.1
##$AZFW= 0.1
##$BCFW= 0
##$BC_mod= 0
##$BYTORDP= 0
##$COROFFS= 0
##$CY= 15
##$DATMOD= 1
##$DC= 0
##$DFILT= <>
##$DTYPP= 0
##$F1P= 0
##$F2P= 0
##$FCOR= 0.5
##$FTSIZE= 131072
##$FT_mod= 6
##$GAMMA= 0
##$GB= 0
##$INTBC= 1
##$INTSCL= 1
##$ISEN= 128
##$LB= 0.3
##$LEV0= 0
##$LPBIN= 0
##$MAXI= 10000
##$MC2= 0
##$MEAN= 0
##$ME_mod= 0
##$MI= 0
##$NCOEF= 0
##$NC_proc= -2
##$NLEV= 6
##$NOISF1= 0
##$NOISF2= 0
##$NSP= 0
##$NTH_PI= 0
##$NZP= 0
##$OFFSET= 14.96288
##$PC= 1
##$PHC0= -85.55054
##$PHC1= 0
##$PH_mod= 1
##$PKNL= yes
##$PPARMOD= 0
##$PPDIAG= 0
##$PPIPTYP= 0
##$PPMPNUM= 2147483647
##$PPRESOL= 1
##$PSCAL= 4
##$PSIGN= 0
##$PYNMP= <proc.py>
##$REVERSE= no
##$SF= 400.020008883833
##$SI= 131072
##$SIGF1= 0
##$SIGF2= 0
##$SINO= 400
##$SIOLD= 131072
##$SPECTYP= <>
##$SREGLST= <1H.CDCl3>
##$SSB= 0
##$STSI= 131072
##$STSR= 0
##$SW_p= 8223.68421052631
##$SYMM= 0
##$S_DEV= 0
##$TDeff= 65536
##$TDoff= 0
##$TI= <>
##$TILT= no
##$TM1= 0
##$TM2= 0
##$TOPLEV= 0
##$USERP1= <user>
##$USERP2= <user>
##$USERP3= <user>
##$USERP4= <user>
##$USERP5= <user>
##$WDW= 1
##$XDIM= 131072
##$YMAX_p= 405897180
##$YMIN_p= -11967
##$CURPLOT= <Network HP LaserJet P1505>
##$CURPRIN= <$Network HP LaserJet P1505>
##$DFORMAT= <normdp>
##$LAYOUT= <+/1D_H.xwp>
##$LFORMAT= <normlp>
##$PFORMAT= <normpl>
##$SURQMSG= 1
$$ End of Bruker specific parameters
$$ ---------------------------------
##NTUPLES= NMR SPECTRUM
##VAR_NAME=  FREQUENCY,     SPECTRUM/REAL,   SPECTRUM/IMAG
##SYMBOL=    X,             R,               I
##VAR_TYPE=  INDEPENDENT,   DEPENDENT,       DEPENDENT
##VAR_FORM=  AFFN,          ASDF,            ASDF
##VAR_DIM=   131072,        131072,          131072
##UNITS=     HZ,            ARBITRARY UNITS, ARBITRARY UNITS
##FACTOR=    0.0627417313425164, 1,          1
##FIRST=     8223.62146879497, 1203,         -64207
##LAST=      0,             3943,            -64061
##MIN=       0,             -11967,          0
##MAX=       8223.62146879497, 405897180,    0
$$ Real data points
##PAGE= N=1
##DATA TABLE= (X++(R..R)), XYDATA
$$ [...]
63227F21897K2079K2968K3034K2264K1264K0530J9972J9281J8574J8336J8674
63216H48873J9000J8766J8286J8374J9111J9525J8635J6355J3030Q711L422k189
63204A019899p274j1753j6203k0738k4617k7100k8187k8344k7971k7297k6309
63193G74106k4558k1541j7599j3999j1606r781p178l489J99K861M722O684R032
63180F87853J1281J3087J4623J5980J6878J7304J7902J9099K0291K0586K0107
63169H74991J9762J9800J9546J8621J7468J6350J4799J2536J0065P671M678N05
63157A036792m158q167j1484j4952j8833k2510k5430k7446k8337k7854k6365k4636
63145G96620k2977k1194j9319j7719j6419j5067j3577j2204j0944r523q027o917
$$ plain form
63227 621897 643976 666944 689978 712242 733506 754036 774008 793289 811863 830199 848873
63216 848873 867873 886639 904925 923299 942410 961935 980570 996925 1009955 1018666 1022088 1019899
63204 1019899 1012625 1000872 984669 963931 939314 912214 884027 855683 827712 800415 774106
63193 774106 749548 728007 710408 696409 684803 675022 667844 664355 664554 667415 672137 678821 687853
63180 687853 699134 712221 726844 742824 759702 777006 794908 814007 834298 854884 874991
63169 874991 894753 914553 934099 952720 970188 986538 1001337 1013873 1023938 1031609 1036287 1036792
63157 1036792 1032634 1024467 1012983 998031 979198 956688 931258 903812 875475 847621 821256 796620
63145 796620 773643 752449 733130 715411 698992 683925 670348 658144 647200 637677 629650 622733
63133F22733o322n932n586n381n081m187k756j591j252j402j317p52k8M23N30
63118E82099P20J544K927M030M268M144M524N367N928O025O260O909P399P131
63104F49275O261N456N271N812O592O802O126N232M925N045M824M129L601L656
63090G23007M091M627N050M888L841K498J838J936K059J945K072K541K807K706
63076G65906K768L130L169K606K022J890J966K145K967M692O661Q164R255J0222
63062H27563J1046J1936J3561J6132J8891K1173K3276K5633K7946K9901L2100
63051A059158L5276L9081M2533M5296M7683M9692N1004N1844N2881N4190N4928
63040A583566N4282N2302M9680M7115M5069M3770M3234M3216M3179M2514M0941
$$ plain form
63133 622733 616411 610479 604893 599512 594431 590244 587488 585897 584645 583243 581926 581174 581146 581569 582099
63118 582099 582819 584363 587290 591320 595588 599732 604256 609623 615551 621576 627836 634745 642144 649275
63104 649275 655536 660992 666263 672075 678667 685469 691595 696827 701752 706797 711621 715750 719351 723007
63090 723007 727098 731725 736775 741663 745504 748002 749840 751776 753835 755780 757852 760393 763200 765906
63076 765906 768674 771804 774973 777579 779601 781491 783457 785602 788569 793261 799922 808086 817341 827563
63062 827563 838609 850545 864106 880238 899129 920302 943578 969211 997157 1027058 1059158
63051 1059158 1094434 1133515 1176048 1221344 1269027 1318719 1369723 1421567 1474448 1528638 1583566
63040 1583566 1637848 1690150 1739830 1786945 1832014 1875784 1919018 1962234 2005413 2047927 2088868
63029B088868L8620L5673L1718K6258J9357J1452K662p093j7384k7370l6649m5285
63017B120827n2931n8747o2383o4233o4477o2793n9335n5071n0655m5771m0099
63006A504332l4073k8068k1713j4698p575j001N165J1174J6523K0667K4105K7794
62994A502632L1741L5097L7376L8802L9581L9647L9078L8165L7007L5473L3510
62983A908109L1168K8460K5427K2050J7881J2180M774l651j2366k1177k9897l8004
62971A944954m5266n2013n8147o2697o5091o6120o6658o6183o3717n9681n5496
62960A283885n1599m7279m2482l8330l5504l3245l0582k7604k4917k2535k0067
62949I09741j7609j5781j4937j4794j4759j4342j3251j1461r368p740p202p613
$$ plain form
63029 2088868 2127488 2163161 2194879 2221137 2240494 2251946 2254608 2247515 2230131 2202761 2166112 2120827
63017 2120827 2067896 2009149 1946766 1882533 1818056 1755263 1695928 1640857 1590202 1544431 1504332
63006 1504332 1470259 1442191 1420478 1405780 1398205 1397204 1402369 1413543 1430066 1450733 1474838 1502632
62994 1502632 1534373 1569470 1606846 1645648 1685229 1724876 1763954 1802119 1839126 1874599 1908109
62983 1908109 1939277 1967737 1993164 2015214 2033095 2045275 2050049 2046398 2034032 2012855 1982958 1944954
62971 1944954 1899688 1847675 1789528 1726831 1661740 1595620 1528962 1462779 1399062 1339381 1283885
62960 1283885 1232286 1185007 1142525 1104195 1068691 1035446 1004864 977260 952343 929808 909741
62949 909741 892132 876351 861414 846620 831861 817519 804268 792807 783439 775699 768497 760884
62937G60884q128q060p538p040o555n799n079n160o067o801o556n617m703m114
62923F73667l897m167m750n100n110n372o123o656o422o046o306o785o503n459
62909E94971m483l846l136k328j929j994j930j486j091j093j388j866k540l125
62895E62736l196k953l098l806m483m726m919n448n966n875n115m070k926j636
62881E04519l51N08O94M60K94M29O29N65K72J04K73O17Q61R09Q79R99J419J944
62863E16024K071J685J414J827K394K090R71L05Q69J950K413J973R81k74j519
62848E35174k365k766l046l114k409j028p1k51r51j332j540j986k341k212k121
62833E07641k726l624m018m008m204m474m304l935m027m412m326l731l291l221
$$ plain form
62937 760884 752756 744696 737158 730118 723563 717764 712685 707525 701458 694657 688101 682484 677781 673667
62923 673667 669770 665603 660853 655753 650643 645271 639148 632492 626070 620024 613718 606933 600430 594971
62909 594971 590488 586642 583506 581178 579249 577255 575325 573839 572748 571655 570267 568401 565861 562736
62895 562736 559540 556587 553489 549683 545200 540474 535555 530107 524141 518266 513151 509081 506155 504519
62881 504519 504168 504676 505370 505830 506124 506553 507182 507747 508019 508123 508396 509013 509874 510783 511662 512661 514080 516024
62863 516024 518095 519780 521194 523021 525415 527505 528476 528781 529650 531600 534013 535986 536967 536693 535174
62848 535174 532809 530043 526997 523883 521474 520446 520375 520124 519173 517841 516301 514315 511974 509762 507641
62833 507641 504915 501291 497273 493265 489061 484587 480283 476348 472321 467909 463583 459852 456561 453340
62819D53340l177l104l144k866j685j2J092J328J274J232J097J245K264L725M422
62804D57031M099L793M218M954N549O299P362Q184Q496Q971J0214J1697J2492
62791E53359J2671J3233J4846J7205J9597K1771K4072K6804K9646L2042L4196
62780G99442L7073M1103M5504M9413N3130N7420O2187O6686P0635P4066P6449
62769A433108P7103P6259P4589P1760O6656N9050M9926L9958K8800J6203K770
62758A996182j0713k3808l5987m6548n5318o2740o8973p3646p6612p8165p8367
62747A385305p6945p4088p0523o6623o2231n7487n3005m9011m5134m1254l7706
62736G51298l4557l1516k8690k6474k4583k2213j9411j7159j5760j4319j2219
$$ plain form
62819 453340 450163 447059 443915 441049 439364 439352 440444 441772 443046 444278 445375 446620 448884 452609 457031
62804 457031 461130 464923 469141 474095 479644 485943 493305 501489 509985 518956 529170 540867 553359
62791 553359 566030 579263 594109 611314 630911 652682 676754 703558 733204 765246 799442
62780 799442 836515 877618 923122 972535 1025665 1083085 1145272 1211958 1282593 1356659 1433108
62769 1433108 1510211 1586470 1661059 1732819 1799475 1858525 1908451 1948409 1977209 1993412 1996182
62758 1996182 1985469 1961661 1925674 1879126 1823808 1761068 1692095 1618449 1541837 1463672 1385305
62747 1385305 1308360 1234272 1163749 1097126 1034895 977408 924403 875392 830258 789004 751298
62736 751298 716741 685225 656535 630061 605478 583265 563854 546695 530935 516616 504397
62725E04397j0016q341o982n662m707m224l514k129o62K36R68K243L878N108N701
62710D76294O108O849Q215J0151J2167J3783J5364J7832K1256K4566K7068K9447
62698F69100L2670L6678M0781M4727M8676N2602N6383O0049O3441O6037O7429
62687A238573O7469O5722O1559N5174M7671L9644L0504J9759Q020l932j6103k8379
62675A585681l9537m8290n4783n9961o3932o6066o6380o5694o4439o2328n9259
62664I35012n5731n2162m8415m4239l9769l5485l1912k9304k7408k5634k3587
62653E21366k1327j9026j6785j4826j3405j2349j1227j0104r473r258q720p682
62641C67184o955p005p063o358n413n228n731n958n419m361l066j754r54j070
$$ plain form
62725 504397 494381 486040 479058 473396 468689 464465 460951 458822 458160 458396 459364 461607 465485 470593 476294
62710 476294 482402 489251 497466 507617 519784 533567 548931 566763 588019 612585 639653 669100
62698 669100 701770 738448 779229 823956 872632 925234 981617 1041666 1105107 1171144 1238573
62687 1238573 1306042 1371764 1433323 1488497 1536168 1575812 1606316 1626075 1634095 1630163 1614060 1585681
62675 1585681 1546144 1497854 1443071 1383110 1319178 1253112 1186732 1121038 1056599 994271 935012
62664 935012 879281 827119 778704 734465 694696 659211 627299 597995 570587 544953 521366
62653 521366 500039 481013 464228 449402 435997 423648 412421 402317 392844 383586 374866 367184
62641 367184 360229 353224 346161 339803 334390 329162 323431 317473 312054 307693 304627 302873 301919 300849
62627C00849j640j769j239o38m51o09p80n48M28J913K870K433J018n9j3Q09J677
62610C04251K270K708L254M091N202O346P272P862Q125Q331R087J0796J2992J4753
62596D07340J5888J7171J9236K1939K5019K8590L2450L5748L7895L9264M0367
62585G20907M0939M0484L9093L7041L4061K9734K4237J8111J1632M983j511p779
62573I91932j4084k0152k4919k7871k9925l2103l4035l4739l4297l3537l2496
62562F73774l0558k7902k5577k4011k2541k0670j8830j7603j6904j6296j5586
62551D37296j4821j4082j3392j2564j1306r754q562q016p481o260m643l453k917
62538C20045k727k789k993k606r59J305K788L095L124L503L876L971M276N166
$$ plain form
62627 300849 299209 297440 296201 295563 295112 294503 293723 293175 293603 295516 298386 300819 301837 301778 301765 302574 304251
62610 304251 306521 309229 312483 316574 321776 328122 335394 343256 351381 359712 368799 379595 392587 407340
62596 407340 423228 440399 459635 481574 506593 535183 567633 603381 641276 680540 720907
62585 720907 761846 802330 841423 878464 912525 942259 966496 984607 996239 1001222 999711 991932
62573 991932 977848 957696 932777 904906 874981 842878 808843 774104 739807 706270 673774
62562 673774 643216 615314 589737 565726 543185 522515 503685 486082 469178 452882 437296
62551 437296 422475 408393 395001 382437 371131 361377 352815 344799 337318 331058 326415 322962 320045
62538 320045 317318 314529 311536 308930 307971 309276 312064 315159 318283 321786 325662 329633 333909 339075
62524C39075O190O843P398Q314R370J0068J0573J1565J3254J5146J6904J8937
62512D73637K1825K5294K8300L0270L1876L4091L6708L8476L8691L7850L6442
62501H33460L4024L0057K5001J9725J4259P991Q66o384j3088j9027k4093k8130
62489H74661l1154l3196l4087l3750l2597l1077k9143k6652k4005k1791j9968
62478E57241j8052j5964j4086j2517j0992r427p989o659n275m008l260l042k885
62465D43085k399j520l48R47K106L006L799M572N188N694O411P307P768P440O796
62450D99852O412O132N586M797L687J663j455m648o800q061r224j0330j1010j1548
62436D65053j2367j2825j2010j0432r420q983p865n849m284l871l530k234n70
$$ plain form
62524 339075 345265 352108 359506 367820 377190 387258 397831 409396 422650 437796 454700 473637
62512 473637 495462 520756 549056 579326 611202 645293 682001 720477 759168 797018 833460
62501 833460 867484 897541 922542 942267 956526 964517 965383 958999 945911 926884 902791 874661
62489 874661 843507 810311 776224 742474 709877 678800 649657 623005 599000 577209 557241
62478 557241 539189 523225 509139 496622 485630 476203 468214 461555 456280 452272 449012 445970 443085
62465 443085 440686 439166 438818 439765 441871 444877 448676 453248 458436 464130 470541 477848 485616 493056 499852
62450 499852 506264 512396 517982 522779 526466 528129 526674 522026 515226 507165 497941 487611 476601 465053
62436 465053 452686 439861 427851 417419 407999 399016 391151 385302 381018 377147 373617 371383 370813
62423C70813M32J011K112L844N479O587P383Q180R043R874J0446J0550J0278R891
62409D65923R430Q778Q008P187N887L621P93j563k979l868m573m976n204n783
62395D80681o758p366p027n990m794l757l211l370l607k765o85J342K281K767
62381D37741M130O613R342J1641J3657J5843J8531K1817K5390K8515L0657L2130
62369F56007L3766L5906L7946L8941L8616L7656L6924L6386L5148L2651K9270
62358A049217K5350K0356J3808O628M08m496r078j3853j8060k0958k2782k3999
62346A002541k4618k4783k5169k6091k6983k7323k7381k7330k6457k4105k0905
62335G21396j8199j6519j5453j4618j3954j3146j1675r545p438n959n126m648
$$ plain form
62423 370813 371245 372256 374368 378212 383691 390278 397661 405841 414884 424758 435204 445754 456032 465923
62409 465923 475353 484131 492139 499326 505213 508834 509627 508064 505085 501217 496644 491668 486464 480681
62395 480681 473923 466557 459530 453540 448746 444989 441778 438408 434801 432036 431351 432693 434974 437741
62381 437741 441871 448484 457826 469467 483124 498967 517498 539315 564705 593220 623877 656007
62369 656007 689773 725679 763625 802566 841182 878838 915762 952148 987296 1019947 1049217
62358 1049217 1074567 1094923 1108731 1115359 1115767 1111271 1102193 1088340 1070280 1049322 1026540 1002541
62346 1002541 977923 953140 927971 901880 874897 847574 820193 792863 766406 742301 721396
62335 721396 703197 686678 671225 656607 642653 629507 617832 608287 600849 594890 589764 585116
62323E85116m321m022l662l298l139l329l768m277m879n830p178q408q831q447
62309E11727q039q163q420q151p421o712o001m912l578k502j648n47O94J377J387
62294D49091J466K051K718L126L683M751N858O345O268O199O405O748P035P083
62280E18827O799O412O389O863P531Q183Q883R539R957J0483J1885J4218J6594
62267F42563J8451K0407K3258K6704K9834L2421L5049L8024M0754M2227M1837
62256I91529L9809L6900L3461K8775K1772J2592K921n504j2328j8197k3533k8144
62244A080053l1730l4264l5920l6912l7236l6533l4467l1358k8144k5521k3418
62233G24550k1357j9029j6458j3941j1905j0420q998p267n693m984m952m727m009
$$ plain form
62323 585116 580795 576773 573111 569813 566674 563345 559577 555300 550421 544591 537413 529005 520174 511727
62309 511727 503688 495525 487105 478954 471533 464821 458820 453908 450330 447828 446180 445633 446327 447704 449091
62294 449091 450557 452608 455326 458452 462135 466886 472744 479089 485357 491556 497961 504709 511744 518827
62280 518827 525626 532038 538427 545290 552821 561004 569887 579426 589383 599866 611751 625969 642563
62267 642563 661014 681421 704679 731383 761217 793638 828687 866711 907465 949692 991529
62256 991529 1031338 1068238 1101699 1130474 1152246 1164838 1167759 1162255 1149927 1131730 1108197 1080053
62244 1080053 1048323 1014059 978139 941227 903991 867458 832991 801633 773489 747968 724550
62233 724550 703193 684164 667706 653765 641860 631440 622442 615175 609482 604498 599546 594819 590810
62220E90810l255k577j509n8J073J659K321L265L775L583L723N104P015Q083Q155
62205F31167Q224Q903R909J0910J2052J3579J5482J7597J9697K1611K3436K5402
62193H17969K7392K8896K9586K9499K8675K7118K5158K3111K0478J6421J1305
62182A085608O748L713J533o32k390k980k482j236J075M700Q821J2416J5552J8767
62168A149213K1646K3166K3069K1824J9506J5954J1803Q185N308K373r67m004
62156A297076o088p498q930j0686j2621j4399j5654j6228j6324j6142j5497j4183
62144A142826j2493j0999r948r324r089q988q381o914n071l525k198o37J037K303
62130A058599L175M155N401O612P738R063J0629J2238J3949J5883J7559J8272
$$ plain form
62220 590810 587555 584978 583469 583411 584484 586143 588464 591729 595504 599087 602810 607914 614929 623012 631167
62205 631167 639391 648294 658203 669113 681165 694744 710226 727823 747520 769131 792567 817969
62193 817969 845361 874257 903843 933342 962017 989135 1014293 1037404 1057882 1074303 1085608
62182 1085608 1092356 1096069 1097602 1096970 1094580 1091600 1089118 1087882 1088957 1093657 1102478 1114894 1130446 1149213
62168 1149213 1170859 1194025 1217094 1238918 1258424 1274378 1286181 1294366 1299674 1302047 1301080 1297076
62156 1297076 1290988 1283490 1274560 1263874 1251253 1236854 1221200 1204972 1188648 1172506 1157009 1142826
62144 1142826 1130333 1119334 1109386 1100062 1090973 1081985 1073604 1066690 1061619 1058094 1055896 1055259 1056296 1058599
62130 1058599 1061774 1065929 1071330 1077942 1085680 1094743 1105372 1117610 1131559 1147442 1165001 1183273
62118A183273J8189J8360J9393K0782K1774K2326K2835K3416K3891K4286K4986
62107A423511K6353K8271L0141L1451L2315L3237L4358L5388L6393L8011M0563
62096A789992M3541M6417M9358N2485N5072N6341N6595N6647N6446N5327N3424
62085B371645N1745N0839N0400N0282N0746N1279N0296M6782M1625L6640L2806
62074B885085L0046K8318K7946K8818K9970L0331K9652K8471K7284K6008K4330
62063C196259K2293K0376J9045J8411J8305J8448J8599J8755J9193J9985K0594
62052C410263K0367J9326J8024J6657J5029J3370J2328J1881J1156R788Q591Q241
62040C575021Q118P212N585L959K426N61j543l373n022p110r706j2153j4017j5462
$$ plain form
62118 1183273 1201462 1219822 1239215 1259997 1281771 1304097 1326932 1350348 1374239 1398525 1423511
62107 1423511 1449864 1478135 1508276 1539727 1572042 1605279 1639637 1675025 1711418 1749429 1789992
62096 1789992 1833533 1879950 1929308 1981793 2036865 2093206 2149801 2206448 2262894 2318221 2371645
62085 2371645 2423390 2474229 2524629 2574911 2625657 2676936 2727232 2774014 2815639 2852279 2885085
62074 2885085 2915131 2943449 2971395 3000213 3030183 3060514 3090166 3118637 3145921 3171929 3196259
62063 3196259 3218552 3238928 3257973 3276384 3294689 3313137 3331736 3350491 3369684 3389669 3410263
62052 3410263 3430630 3449956 3467980 3484637 3499666 3513036 3525364 3537245 3548401 3558189 3566780 3575021
62040 3575021 3583139 3590351 3595936 3599895 3602321 3602882 3601339 3597966 3592944 3585834 3576128 3563975 3549958 3534496
62026C534496j6677j7553j8106j8577j8940j8796j7856j6175j3880j1077q000
62015C358859m933j961R69L891P000J0750J5416K0673K5920L0723L4770L7708
62003C539785L9434M0117L9636L7348L2853K6523J8902J0239J081p380j4387k0412
61991C743739k6042l0651l3236l4089l4490l4952l4973l4437l4099l4442l5075
61980C377253l5571l6123l7034l8139l9029l9385l9064l8247l7486l7177l7007
61969B962991l6406l5339l4119l2705l0873k8912k7380k6243k4917k3189k1378
61958B641530j9646j7698j5269j2380r186n950k968j47L042O730J0198J2894J5294
61945B606444J7990K0463K1891K2632K3754K5324K6424K6799K7188K7960K8610
$$ plain form
62026 3534496 3517819 3500266 3482160 3463583 3444643 3425847 3407991 3391816 3377936 3366859 3358859
62015 3358859 3353926 3351965 3352934 3356825 3363825 3374575 3389991 3410664 3436584 3467307 3502077 3539785
62003 3539785 3579219 3619336 3658972 3696320 3729173 3755696 3774598 3784837 3785918 3778538 3764151 3743739
61991 3743739 3717697 3687046 3653810 3619721 3585231 3550279 3515306 3480869 3446770 3412328 3377253
61980 3377253 3341682 3305559 3268525 3230386 3191357 3151972 3112908 3074661 3037175 2999998 2962991
61969 2962991 2926585 2891246 2857127 2824422 2793549 2764637 2737257 2711014 2686097 2662908 2641530
61958 2641530 2621884 2604186 2588917 2576537 2567351 2561401 2558433 2558286 2561328 2568058 2578256 2591150 2606444
61945 2606444 2624434 2644897 2666788 2689420 2713174 2738498 2764922 2791721 2818909 2846869 2875479
61934B875479K8809K8923K9118K8981K8323K7623K7451K8135L0107L3895L9626
61923C206470M7244N7040O9297Q3636R9678J18060J39683J64099J89928K16886
61913D392021K46057K78123L12756L50036L90847M35282M81892N29021N75332
61904G991367O17779O49798O62343O46314N94266N01963L70633K08193K7870j54623
61894A2115903l23702m66449n75070o47582o86208o95515o81730o52028o12812
61885F774807n68407n21440m73762m26823l81911l40438l03309k69915k38864
61876C249938k10066j84909j63928j45617j28356j12347r8500q6496p5205o4326
61866A980188n4306m5176l6582k8557k1226j4060o497J009P513J2919J7849K2393
$$ plain form
61934 2875479 2904288 2933211 2962329 2991310 3019633 3047256 3074707 3102842 3132949 3166844 3206470
61923 3206470 3253714 3310754 3380051 3463687 3563365 3681425 3821108 3985207 4175135 4392021
61913 4392021 4638078 4916201 5228957 5578993 5969840 6405122 6887014 7416035 7991367
61904 7991367 8609146 9258944 9921287 10567601 11161867 11663830 12034463 12242656 12270526 12115903
61894 12115903 11792201 11325752 10750682 10103100 9416892 8721377 8039647 7387619 6774807
61885 6774807 6206400 5684960 5211198 4784375 4402464 4062026 3758717 3488802 3249938
61876 3249938 3039872 2854963 2691035 2545418 2417062 2304715 2206215 2119719 2044514 1980188
61866 1980188 1925882 1880706 1844124 1815567 1794341 1780281 1773784 1774793 1782306 1795225 1813074 1835467
61854A835467K6004K8501L0273L1337L1066K9033K5562K1260J6469J1298N914
61843B092184P44l534o320p587p707o643l910L16M630P584R080R923J0320R553
61829B108633O927K427l501j0180j6730k2389k6919l0438l2913l4071l3712l1855
61817A875279k8695k4685k0361j5863j0862n219N60N879J0830J6014K1798K7977
61805A852652L4138M0061M5853N1795N8018O4413P0995P8217Q6479R5641J05592
61794B583854J17073J31049J47208J64174J81628K01220K24878K53040K85182
61785D289306L21280L61893M07417M58202N15017N78646O49211P26365Q09675
61776I117012Q97924R88115J075346J152735J210363J234597J209937J122896
$$ plain form
61854 1835467 1861471 1889972 1920245 1951582 1982648 2011681 2037243 2058503 2074972 2086270 2092184
61843 2092184 2092928 2089394 2083074 2075487 2067780 2061137 2057227 2057543 2062173 2069757 2078837 2088760 2099080 2108633
61829 2108633 2115560 2117987 2114486 2104306 2087576 2065187 2038268 2007830 1974917 1940846 1907134 1875279
61817 1875279 1846584 1821899 1801538 1785675 1774813 1769594 1770154 1776033 1786863 1802877 1824675 1852652
61805 1852652 1886790 1926851 1972704 2024499 2082517 2146930 2217925 2296142 2382621 2478262 2583854
61794 2583854 2700927 2831976 2979184 3143358 3324986 3526206 3751084 4004124 4289306
61785 4289306 4610586 4972479 5379896 5838098 6353115 6931761 7580972 8307337 9117012
61776 9117012 10014936 11003051 12078397 13231132 14441495 15676092 16886029 18008925
61768A8008925R65721P39141M54374J33085j96392n05577p71462r79158j122251
61759A6726406j202169j226613j207033j155865j084371j001486r13698q25634
61751H109537p40673o61124n88230n22357m63253m10402l63424l22233k86535
61742C751306k55276k27092k01390j78498j58682j41518j26256j12238r8922q6154
61732B165280p4552o4940n7218n0513m4563m0074l7381l5821l4837l4712l5471
61721A655198l6084l5663l4603l3581l2156k9524k6119k3268k1459k0005j8278
61710A344458j6368j4596j3244j2665j2907j3309j3215j2962j3352j4303j4851
61699A192686j4572j4156j4310j4813j4899j4227j3128j2217j1890j2054j2297
$$ plain form
61768 18008925 18974646 19713787 20168161 20301246 20104854 19599277 18827815 17848657 16726406
61759 16726406 15524237 14297624 13090591 11934726 10850355 9848869 8935171 8109537
61751 8109537 7368864 6707740 6119510 5597153 5133900 4723498 4360074 4037841 3751306
61742 3751306 3496030 3268938 3067548 2889050 2730368 2588850 2462594 2350356 2251434 2165280
61732 2165280 2090728 2025788 1968570 1918057 1873494 1833420 1796039 1760218 1725381 1690669 1655198
61721 1655198 1619114 1583451 1548848 1515267 1483111 1453587 1427468 1404200 1382741 1362736 1344458
61710 1344458 1328090 1313494 1300250 1287585 1274678 1261369 1248154 1235192 1221840 1207537 1192686
61699 1192686 1178114 1163958 1149648 1134835 1119936 1105709 1092581 1080364 1068474 1056420 1044123
61688A044123j2343j2172j1727j0908j0007r619r783r732q951p826o774n401l321
61675I25559j300n14q88j152m96O09J317J403J207J183J620K425L079L179K980
61660I40211L015L298L358K939K263J589R47L09l00q45j252j473j721k376l448
61645I46514m465n065n323n252m538l142j539Q2K193N013P843J0090J2251J4931
61631I69593J7504J8787J8773J8400J7803J5970J2324P647L096q40m133o618q155
61618A080151q930r338r680j0040j0195r781q857q122q178q725q991q767q516
61605I62031q597q948r481j0181j0777j0817j0141r042p949p218p025p154p094
61592H47607o648o135n677m807l243j569m92K35J393L158N073O925Q834J0664
$$ plain form
61688 1044123 1031780 1019608 1007881 996973 986966 977347 967564 957832 948881 941055 934281 928880 925559
61675 925559 924259 923745 922857 921705 921209 921818 923135 924538 925745 926928 928548 930973 934052 937231 940211
61660 940211 943226 946524 949882 952821 955084 956673 957620 957929 957629 956784 955532 954059 952338 949962 946514
61645 946514 942049 936984 931661 926409 921871 918729 917190 917272 919465 924478 932321 942411 954662 969593
61631 969593 987097 1005884 1024657 1043057 1060860 1076830 1089154 1096801 1099897 1099057 1094924 1088306 1080151
61618 1080151 1071221 1061883 1052203 1042163 1031968 1022187 1013330 1005208 997030 988305 979314 970547 962031
61605 962031 953434 944486 935005 924824 914047 903230 893089 884047 876098 868880 861855 854701 847607
61592 847607 840959 834824 829147 824340 821097 819528 819036 819271 820664 823822 828895 835820 844654 855318
61578H55318J2198J3742J5813J8227K0325K2039K3979K6294K8208K8934K8538
61567A093615K7640K6697K5776K4759K3603K2529K1838K1443K0920K0203J9765
61556A348788J9775J9645J8977J8413J8687J9318J9106J7692J5795J3944J1835
61545A541975Q885M814k89n884j1086j5319j8713k1438k3150k3666k3619k3600
61533A388910k3145k1476j8903j6379j4055j1413q563o182m219j864J128M280
61521A268119P600J1713J6551K1212K5414K9996L5492M1348M7129N3468O1104
61510A619146O9838P9121Q9055R9991J11773J24064J37147J51701J67931J85237
61500B835004K02522K18483K31784K41169K45338K42708K31651K11129J81057
$$ plain form
61578 855318 867516 881258 897071 915298 935623 957662 981641 1007935 1036143 1065077 1093615
61567 1093615 1121255 1147952 1173728 1198487 1222090 1244619 1266457 1287900 1308820 1329023 1348788
61556 1348788 1368563 1388208 1407185 1425598 1444285 1463603 1482709 1500401 1516196 1530140 1541975
61545 1541975 1550860 1555674 1555385 1549501 1538415 1523096 1504383 1482945 1459795 1436129 1412510 1388910
61533 1388910 1365765 1344289 1325386 1309007 1294952 1283539 1274976 1268794 1264575 1262711 1263839 1268119
61521 1268119 1275719 1287432 1303983 1325195 1350609 1380605 1416097 1457445 1504574 1558042 1619146
61510 1619146 1688984 1768105 1857160 1957151 2068924 2192988 2330135 2481836 2649767 2835004
61500 2835004 3037526 3256009 3487793 3728962 3974300 4217008 4448659 4659788 4840845
61491D840845J42324R7020M8518O53m3557q2269j14295j38855j55830j65674j68957
61480D259923j66434j59488j49855j38809j26974j14767j02428q9719p6352o2809
61470C072288n0207l9284l0030k2186j5504r511l676K132P844J3647J9688K5446
61458B970647L0057L3263L5450L6959L7983L8865L9706L9911L9020L7859L7872
61447C377592L9422M1632M3817M5998M7978M9132M9339M9241M9174M8643M7095
61436C889063M4441M0736L6041L0692K4893J8005R226r49j0867j9501k7118l4074
61424D000588l9961m4317m7257m9068m9973n0472n1054n1270m9983m6751m2242
61413C478240l7077l1236k4825j8445j2547p102k171J983N414Q220R782R329P205
$$ plain form
61491 4840845 4983169 5080189 5128707 5129360 5085803 5003534 4889239 4750384 4594554 4428880 4259923
61480 4259923 4093489 3934001 3784146 3645337 3518363 3403596 3301168 3211449 3135097 3072288
61470 3072288 3022081 2982797 2952767 2930581 2915077 2905566 2901890 2904022 2911866 2925513 2945201 2970647
61458 2970647 3000704 3033967 3069417 3106376 3144359 3183224 3222930 3262841 3301861 3339720 3377592
61447 3377592 3417014 3458646 3502463 3548461 3596439 3645571 3694910 3744151 3793325 3841968 3889063
61436 3889063 3933504 3974240 4010281 4040973 4065866 4083871 4093097 4092148 4081281 4061780 4034662 4000588
61424 4000588 3960627 3916310 3869053 3819985 3770012 3719540 3668486 3617216 3567233 3520482 3478240
61413 3478240 3441163 3409927 3385102 3366657 3354110 3347008 3344837 3346820 3352234 3360454 3370236 3379565 3386770
61400C386770M486J417k418o387q880r431r100q225n427L16Q207J7164K7471L9816
61386C435779N3864O8992Q5426J03545J22831J42532J62601J83049K03083K21663
61376D783365K38167K51642K60250K62219K56555K42200K17676J82853J40312
61367F835239R3916M6592K47m3202q2144j16093j45248j69679j89690k06231k19939
61356E803768k30324k36803k39704k39378k35321k27386k17047k06047j94366
61347C777392j80931j65838j50408j35372j20462j05718r1812p8959o6615n4452
61337B626825m2719l1637k1277j1981m087K788R437J6048K2198K7628L2359L6206
61325B661788L8998M1075M2830M3928M3724M2318M0419L8354L5994L3500L1260
$$ plain form
61400 3386770 3391256 3392673 3390255 3383868 3374988 3365557 3356457 3348232 3342805 3343121 3351328 3368492 3395963 3435779
61386 3435779 3489643 3558635 3644061 3747606 3870437 4012969 4175570 4358619 4561702 4783365
61376 4783365 5021532 5273174 5533424 5795643 6052198 6294398 6512074 6694927 6835239
61367 6835239 6929155 6975747 6975994 6932792 6850648 6734555 6589307 6419628 6229938 6023707 5803768
61356 5803768 5573444 5336641 5096937 4857559 4622238 4394852 4177805 3971758 3777392
61347 3777392 3596461 3430623 3280215 3144843 3024381 2918663 2826851 2747892 2681277 2626825
61337 2626825 2584106 2552469 2531192 2519211 2515124 2517912 2527349 2543397 2565595 2593223 2625582 2661788
61325 2661788 2700786 2741861 2784691 2828619 2872343 2914661 2955080 2993434 3029428 3062928 3094188
61314C094188K9137K6535K3356K0210J7562J5169J2401Q881M877J346q33j949
61302C250880l395o119r737j3571j7818k2916k8397l3324l7454m1097m4221m6541
61290B946290m8128m9043m8744m6715m3410l9677l5563l0592k4907j9162j3567
61279B546782p981k750J564N114Q420J1245J2792J2911J2083J0270O811J560m745
61266B614076j1365j7869k3585k7596k9508k9467k7343k2693j5603o858K858J3318
61254B418365K4332L5764M7911O1101P4852Q8091J00231J11238J20593J26988
61244C209466J29326J27240J20512J08659R1400O9040M2239J1922k0475n3030
61234C836299q3666j10217j30653j43924j50561j51785j48250j40354j29355j17236
$$ plain form
61314 3094188 3123325 3149860 3173216 3193426 3210988 3226157 3238558 3247439 3252316 3253662 3252829 3250880
61302 3250880 3247485 3241366 3231629 3218058 3200240 3177324 3148927 3115603 3078149 3037052 2992831 2946290
61290 2946290 2898162 2849119 2800375 2753660 2710250 2670573 2635010 2604418 2579511 2560349 2546782
61279 2546782 2538801 2536051 2537615 2542729 2551149 2562394 2575186 2588097 2600180 2610450 2617261 2618821 2614076
61266 2614076 2602711 2584842 2561257 2533661 2504153 2474686 2447343 2424650 2409047 2402189 2405047 2418365
61254 2418365 2442697 2478461 2526372 2587473 2662325 2750416 2850647 2961885 3082478 3209466
61244 3209466 3338792 3466032 3586544 3695203 3786603 3855643 3897882 3909804 3889329 3836299
61234 3836299 3752633 3642416 3511763 3367839 3217278 3065493 2917243 2776889 2647534 2530298
61224B530298j05422r4515q5125p7893p2565o7989o3455n9184n5304n1122m5888
61213A751836l9650l3019k6577k0665j5258r905m244J306N878R170J1490J2886
61201A643248J2985J1818R997P909N458K856Q47k01q62j826l112m428n863p791
61187A671035j0353j3368j6515j9466k2077k4588k7276k9907l1815l2569l2287
61176A410814l1321l0008k8667k7421k6014k4156k2031k0133j8749j7907j7504
61165A146903j7102j5978j4056j2345j1713j1643j1126j0485j1125j3518j6582
61154A001230j9239k1520k3711k5450k6129k5586k3985k1588j8935j6613j4612
61143G63862j2402r813p225m897k760r81K05J262L000N250O856P401P831Q891
$$ plain form
61224 2530298 2424876 2330361 2245236 2167343 2094778 2026789 1963334 1904150 1848846 1797724 1751836
61213 1751836 1712186 1679167 1652590 1631925 1616667 1606762 1602518 1603824 1609702 1618872 1630362 1643248
61201 1643248 1656233 1668051 1678048 1685957 1691415 1694271 1695118 1694917 1694055 1692229 1689117 1684689 1678826 1671035
61187 1671035 1660682 1647314 1630799 1611333 1589256 1564668 1537392 1507485 1475670 1443101 1410814
61176 1410814 1379493 1349485 1320818 1293397 1267383 1243227 1221196 1201063 1182314 1164407 1146903
61165 1146903 1129801 1113823 1099767 1087422 1075709 1064066 1052940 1042455 1031330 1017812 1001230
61154 1001230 981991 960471 936760 911310 885181 859595 835610 814022 795087 778474 763862
61143 763862 751460 741647 734422 729525 726765 725784 725989 727251 730251 735501 742357 749758 757589 766480
61129G66480R961J0187R904J0056J0802J1547J1924J2030J2033J2196J2919J4158
61117I04197J5129J5155J4432J3493J2286J0427P985N355K595m62l555o022p508
61104I83507q241q682r247j0213j1498j2635j3294j3699j4221j4792j5005j4744
61092H37236j4304j4020j4000j4167j4297j4174j3774j3224j2520j1501j0259
61081F90996r172q343p346n851m099k502j118J39J091J591J927K476L107L381
61067F66277L147K547J665O29o0M0O58J094J171J336J756J988J747J470J651K111
61051F89227K364K442K839L820N198O757Q416J0046J1393J2277J2575J2116J1024
61038G90494J0049J0054J0963J1686J1371J0360R578R352R247Q821Q068P311O969
$$ plain form
61129 766480 776441 786628 796532 806588 817390 828937 840861 852891 864924 877120 890039 904197
61117 904197 919326 934481 948913 962406 974692 985119 993104 998459 1001054 1000592 997037 991015 983507
61104 983507 975266 966584 957337 947124 935626 922991 909697 895998 881777 866985 851980 837236
61092 837236 822932 808912 794912 780745 766448 752274 738500 725276 712756 701255 690996
61081 690996 681824 673481 666135 660284 656185 653683 652565 652704 653795 655386 657313 659789 662896 666277
61067 666277 669424 671971 673636 674265 674205 674245 674903 675997 677168 678504 680260 682248 683995 685465 687116 689227
61051 689227 691591 694033 696872 700692 705890 712647 721063 731109 742502 754779 767354 779470 790494
61038 790494 800543 810597 821560 833246 844617 854977 864555 873907 883154 891975 900043 907354 914323
61025I14323P373Q408R432R880R864R928J0374J1165J2192J3320J4340J5310J6701
61012A062610J8798K1178K3297K5324K7829L0880L4112L7553M1715M6879N2772
61001A422947N8793O4127O8040P0767P3693P8053Q3832R0734R9501J11033J24687
60990B346207J38821J52815J67422J83791K03689K30218K66554L14020L72784
60981D376321M43321N25401O17544P21354Q45674J002511J200309J446227J749267
60972A2927929K101460K442425K653833K615006K281653J715264J043603M04240
60964B8185413q0871l15709k64600K161L11674M66276L43025o1062o55950j312639
60954B6617718j901524k316274k500178k465447k280294k026163j760285j509506
$$ plain form
61025 914323 921696 930104 939536 949416 959280 969208 979582 990747 1002939 1016259 1030599 1045909 1062610
61012 1062610 1081408 1102586 1125883 1151207 1179036 1209916 1244028 1281581 1323296 1370175 1422947
61001 1422947 1481740 1545867 1613907 1684674 1758367 1836420 1920252 2010986 2110487 2221520 2346207
60990 2346207 2485028 2637843 2805265 2989056 3192745 3422963 3689517 4003537 4376321
60981 4376321 4819642 5345043 5962587 6683941 7529615 8532126 9732435 11178662 12927929
60972 12927929 15029389 17471814 20125647 22740653 25022306 26737570 27781173 28185413
60964 28185413 28104542 27788833 27524233 27526394 27838068 28304344 28647369 28586307 27930357 26617718
60954 26617718 24716194 22399920 19899742 17434295 15154001 13127838 11367553 9858047
60946I858047j284337j088788r21115p75970o50014n43218m55059l83064l25265
60937C431217k80632k46452k18344j93669j72491j54712j38831j24056j10987
60928A791043r9457q8125p7051o8192o2411n8183n4345n1736n0852m9971m7294
60917A083426m3256l9227l5450l1579k7928k4810k1803j8794j6646j5761j5151
60906G93021j3885j2352j1169j0100q912q053p582o637m939l443k648j587M20
60893G02134K472L708M817O596Q270Q728Q317P955P424O029M130K563J165p52
60879G73556l024m954o393p520q160q331q781r902j0823j0719j0213j0339j0813
60866F63584j0573r477q203o973n582m311l618l225k505j423k04J441L760O009
$$ plain form
60946 9858047 8573710 7484922 6563807 5787837 5137823 4594605 4139546 3756482 3431217
60937 3431217 3150585 2904133 2685789 2492120 2319629 2164917 2026086 1902030 1791043
60928 1791043 1691586 1603461 1526410 1458218 1395807 1337624 1283279 1231543 1180691 1130720 1083426
60917 1083426 1040170 1000943 965493 933914 905986 881176 859373 840579 823933 808172 793021
60906 793021 779136 766784 755615 745515 736603 728550 720968 714331 709392 705949 703301 701714 702134
60893 702134 704606 708314 713131 719727 727997 736725 745042 752997 760421 766450 770580 773143 774308 773556
60879 773556 770532 765578 759185 751665 743505 735174 726393 716491 705668 694949 684736 674397 663584
60866 663584 653011 643534 635331 628358 622776 618465 614847 611622 609117 607694 607490 608931 612691 618700
60852F18700P130P156P123P880R690J2483J5659J8039J8913J8898J9046J9467
60840G80184J9514J8838J7518J5628J3415J1505J0272R406Q603Q001P496O427
60828I26807M695L290K786K215N67j461k444k431k696l745m879n685o665q231
60814I02123r978j1298j2073j2656j3454j4584j5560j5614j4537j2956j1539j0353
60802G47521r156p777o026l903k033j157r78l89R15K115K751L327M000M085L447
60787G36742L040L263L129J950N10m11j224k181k239p07J267K304K812L906N332
60772G57493O130O510P417Q901J0322J1594J2813J3354J2676J1505J0849J0594
60760H80158J0154R681R331Q392O587N217N307N701M816L276K810L358L518L159
$$ plain form
60852 618700 625830 632986 640109 647989 657679 670162 685821 703860 722773 741671 760717 780184
60840 780184 799698 818536 836054 851682 865097 876602 886874 896280 904883 912884 920380 926807
60828 926807 931502 934792 937578 939793 940360 938899 936455 934024 931328 927583 922704 917019 910354 902123
60814 902123 892145 880847 868774 856118 842664 828080 812520 796906 782369 769413 757874 747521
60802 747521 738365 730588 724562 720659 718626 717469 716491 716102 717017 719132 721883 725210 729210 733295 736742
60787 736742 739782 743045 746174 748124 748634 748223 746999 744818 742579 741872 743139 745443 748255 752161 757493
60772 757493 763623 770133 777550 786451 796773 808367 821180 834534 847210 858715 869564 880158
60760 880158 890312 899993 909324 917716 924303 929520 934827 940528 945344 948620 951430 954788 958306 961465
60746I61465L295L668K898R11r42k214l659n231n882n680o004p276q379q839r724
60731I08407j1747j3989j5276j5563j5460j5476j5933j6577j6277j4345j2007
60720G45757j1137j1572j1400r815p995o925o230n461m866m284k971j039M56J306
60706F63824K483M212N371N496N671O626P532P583P377P619P676O608M586K280
60692G44944l01l292o116q109r488j0902j2481j3910j4924j5261j4681j3480j2399
60679F09600j1724j1015r963q768p513n951m193k731j533L4K024L534L992L966
60665E59759M306N094N872O234N935M987L844L011K378J628J116J528K714L889
60651F12295M890O164P512Q034P541O884O610O416O190O449P327Q191Q596Q823
$$ plain form
60746 961465 964760 968428 971326 972237 971295 969081 965422 960191 954309 948629 942625 935349 926970 918131 908407
60731 908407 896660 882671 867395 851832 836372 820896 804963 788386 772109 757764 745757
60720 745757 734620 723048 711648 701833 693838 686913 680683 675222 670356 666072 663101 662062 662518 663824
60706 663824 666307 670519 675890 681386 687057 693683 701215 708798 716175 723794 731470 738078 742664 744944
60692 744944 744643 741351 735235 727126 717638 706736 694255 680345 665421 650160 635479 621999 609600
60679 609600 597876 586861 576898 568130 560617 554666 550473 547742 546209 546243 548267 551801 555793 559759
60665 559759 564065 569159 575031 581265 587200 592187 596031 599042 601420 603048 604164 605692 608406 612295
60651 612295 617185 623349 630861 638895 646436 653320 659930 666346 672536 678985 686312 694503 703099 711922
60637G11922R098R288R494J0010J0550J0511J0134J0179J0381R588P748O323O213
60624H31439O552O209N255M263L167J575n19k858n028o318o354o025o643q025
60610H16690q675q055p246o988o651n716m714l932k638n03J502K552L087L573
60596G72286L457K390J268R20Q17K57j75M02J525K070J976K026K370K358J604
60581G95551L84q05j504j481j228j743l339n255o835q294r822j0819j0803j0333
60567G23674j0276j0653j0897j0669r861q475o921n915n496m838l393j465N90
60554F35405K814M861N928O020O216P066P838Q109Q804J0722J3127J4945J6434
60541G48289J8576K1611K5298K9832L5281M0801M5309M8486N0069M8884M3764
$$ plain form
60637 711922 721020 730308 739802 749812 760362 770873 781007 791186 801567 811155 818903 825226 831439
60624 831439 837991 844200 849455 853718 856885 858460 857941 855083 850055 843737 837383 831358 824715 816690
60610 816690 808015 799960 792714 785726 779075 773359 768645 764713 762075 761572 763074 765626 768713 772286
60596 772286 775743 778133 779401 780321 781138 781395 781220 781622 783147 785217 787193 789219 791589 793947 795551
60581 795551 795935 795130 793626 792145 790917 789174 785835 780580 773745 765451 755629 744810 734007 723674
60567 723674 713398 702745 691848 681179 671318 662843 655922 650007 644511 639673 636280 634815 635405
60554 635405 638219 643080 649008 655028 661244 668310 676148 684257 693061 703783 716910 731855 748289
60541 748289 766865 788476 813774 843606 878887 919688 964997 1013483 1063552 1112436 1156200
60530A156200L5053K4299J2809J272r726j9650k8011l3834l5804l3703k9094k3850
60518A015961j8657j3554q913m966j203K670N903P856R138J0500J1390J0945R844
60505A036914R822J1657J4861J8997K4107L0052L6619M4191N3354O4036P5854
60494A420464Q9023J03909J19991J36317J52746J69817J87557K05547K24084K44103
60484C053558K65535K86087L01547L06640K96078K65958K14984J44763N9563l3677
60474E161036j25937k08124k73401l18122l41600l45764l34624l13028k85500
60465B614936k55780k26547j99025j73345j49785j29122j11701r7000q4520p4177
60455A113934o5458n7357m9749m3679l9427l5562l0890k6211k2862k0609j8336
$$ plain form
60530 1156200 1191253 1215552 1228361 1229633 1219907 1200257 1172246 1138412 1102608 1068905 1039811 1015961
60518 1015961 997304 983750 974837 969871 968668 971338 977241 985097 994235 1004735 1016125 1027070 1036914
60505 1036914 1046736 1058393 1073254 1092251 1116358 1146410 1183029 1227220 1280574 1344610 1420464
60494 1420464 1509487 1613396 1733387 1869704 2022450 2192267 2379824 2585371 2809455 3053558
60484 3053558 3319093 3605180 3906727 4213367 4509445 4775403 4990387 5135150 5194713 5161036
60474 5161036 5035099 4826975 4553574 4235452 3893852 3548088 3213464 2900436 2614936
60465 2614936 2359156 2132609 1933584 1760239 1610454 1481332 1369631 1272631 1188111 1113934
60455 1113934 1048476 991119 941370 897691 858264 822702 791812 765601 742739 722130 703794
60444G03794j5956j4093j2640j1089r809r439r498r021q172p725p362o080m142
60431E78768l005l183l600l231k203j129l91k16m67m20M10J319J353R15J296K705
60415E68921M026M559M700M802M626M221M219M782N211N036M720M879N458O048
60401F36208O473O738O910P119P305P011N959M729M253M667N236N317M816L891
60387G16632K793J978J682J503Q89j19j175k302l577m504m513l913l480l320k951
60372F95623k379k182k499k802k732k404j917j171l59R7P4k09o45j214j598j375
60356F72308n04O90J792K325K000J327J447K752M326N296N943O712O979N993M324
60341G23710L158K542J657N10n0J65M18K49r7m59q55q62M4J455K344K425K337
$$ plain form
60444 703794 687838 673745 661105 650016 640207 630768 621270 612249 604077 596352 588990 582910 578768
60431 578768 575763 572580 568980 565749 563546 562417 562026 561810 561343 560923 561333 562652 564005 564920 566216 568921
60415 568921 572947 577506 582206 587008 591634 595855 600074 604856 610067 615103 619823 624702 630160 636208
60401 636208 642681 649419 656329 663448 670753 677764 683723 688452 692705 697372 702608 707925 712741 716632
60387 716632 719425 721403 723085 724588 725477 725358 724183 721881 718304 713800 709287 705374 701894 698574 695623
60372 695623 693244 691062 688563 685761 683029 680625 678708 677537 677178 677275 677349 677140 676495 675281 673683 672308
60356 672308 671804 672494 674286 676611 678611 679938 681385 684137 688463 693759 699702 706414 713393 719386 723710
60341 723710 726868 729410 731067 731577 731527 731692 732110 732359 732262 731803 730948 730086 730130 731585 733929 736354 738691
60324G38691K480K617K527K161J223m50k138k857k571k025j540j015q19j484k563
60309G32237k969k452j721j170o32l40p95j649j889j351q29n69Q4J267K121K170
60293G21513K010K114K020J298M54K10N67J129J696K181K446K667L280M355N490
60278G53430O461P417Q396R197R861J0605J1315J1716J2030J2795J4059J5434
60266H82716J6840J8413J9820K0657K1391K2958K5317K7463K8991L0631L3041
60255A148238L5996L9123M2534M6409N0602N4953N9404O3767O8036P2842P8818
60244A760722Q5507R1797R7382J02792J07921J11532J12597J11237J08088J03511
60234B793086R7608R0244Q0913O9277N5952M2100K8230J4189K53j2666k3845l2912
$$ plain form
60324 738691 741171 743788 746315 748476 749699 749249 747111 744254 741683 739658 738118 737103 736284 734800 732237
60309 732237 729268 726816 725095 723925 723293 722953 722158 720509 718620 717269 716440 715871 715955 717222 719343 721513
60293 721513 723523 725637 727657 728955 729409 729619 730186 731315 733011 735192 737638 740305 743585 747940 753430
60278 753430 759891 767308 775704 784901 794762 805367 816682 828398 840428 853223 867282 882716
60266 882716 899556 917969 937789 958446 979837 1002795 1028112 1055575 1084566 1115197 1148238
60255 1148238 1184234 1223357 1265891 1312300 1362902 1417855 1477259 1541026 1609062 1681904 1760722
60244 1760722 1846229 1938026 2035408 2138200 2246121 2357653 2470250 2581487 2689575 2793086
60234 2793086 2890694 2980938 3061851 3131128 3187080 3229180 3257410 3271599 3271852 3259186 3235341 3202429
60222C202429l9326m2728m3775m3466m1633l7205l0169k1974j3658m724N636J7223
60210B906630K9197M0956N2230O3017P3773Q4910R5928J05576J12961J17802J19712
60199C802692J18266J13679J06512R6685Q3849O8564N1971L4348J5304m604k3878
60188D463388m1832n8738p4007q5853r3415r7614r9205r7569r2353q4842p6437
60177C561523o6851n5077m1350k6897j2332K553J7664L2209M5409N6989O7054
60166C580894P5581Q1808Q4192Q1628P4715O5103N3573L9802K4016P779p368k1002
60154D140721l3075m3052n0252n4224n4412n0331m2518l2498k1278q689N570K1237
60142C777199L8103N6260P5299R4410J13746J34565J57418J81298K05257K29613
$$ plain form
60222 3202429 3163103 3120375 3076600 3033134 2991501 2954296 2924127 2902153 2888495 2883771 2889407 2906630
60210 2906630 2935827 2976783 3029013 3092030 3165803 3250713 3346641 3452217 3565178 3682980 3802692
60199 3802692 3920958 4034637 4141149 4237834 4321683 4390247 4442218 4476566 4491870 4487266 4463388
60188 4463388 4421556 4362818 4288811 4202958 4109543 4011929 3912724 3815155 3722802 3637960 3561523
60177 3561523 3494672 3439595 3398245 3371348 3359016 3361569 3379233 3411442 3456851 3513840 3580894
60166 3580894 3656475 3738283 3822475 3904103 3978818 4043921 4097494 4137296 4161312 4169091 4161723 4140721
60154 4140721 4107646 4064594 4014342 3960118 3905706 3855375 3812857 3780359 3759081 3750392 3755962 3777199
60142 3777199 3815302 3871562 3946861 4041271 4155017 4289582 4447000 4628298 4833555 5063168
60132E063168K54653K79215L01596L21094L37677L50753L59130L61757L57804
60123G986847L46691L28666L04799K75770K41269K01221J56868J09945O1349J1325
60113A0024750l9496q9964j38833j84785k26306k61969k90616l11123l22576l24860
60103G834222l18581l04377k83112k56643k27228j95852j62191j26546r0671n6231
60093E812790k3570P466L6550O3229Q7078J06807J20357J26809J27205J22660
60083F587381J12695R6426P4487M8825K1260o743l3635n8279q0564j00776j18722
60072F542355j34072j46955j57523j65361j70008j71691j70921j67795j62122
60063E095907j53926j43443j31070j17464j03159q8056p1910n5282l9011k2779
$$ plain form
60132 5063168 5317821 5597036 5898632 6219726 6557403 6908156 7267286 7629043 7986847
60123 7986847 8333538 8662204 8967003 9242773 9484042 9685263 9842131 9952076 10013425 10024750
60113 10024750 9985254 9895290 9756457 9571672 9345366 9083397 8792781 8481658 8159082 7834222
60103 7834222 7515641 7211264 6928152 6671509 6444281 6248429 6086238 5959692 5869021 5812790
60093 5812790 5789220 5796686 5833236 5896465 5983543 6090350 6210707 6337516 6464721 6587381
60083 6587381 6700076 6796502 6870989 6919814 6941074 6934331 6900696 6842417 6761853 6661077 6542355
60072 6542355 6408283 6261328 6103805 5938444 5768436 5596745 5425824 5258029 5095907
60063 5095907 4941981 4798538 4667468 4550004 4446845 4358789 4286879 4231597 4192586 4169807
60053D169807n384J3305L2022M9962O7490Q4414R9127J10378J18539J24080J25968
60042D989708J22796J14580J02341Q6624O7511M5549K1703l128k7993n1796p3908
60031E393987r4190j12113j26561j36944j43442j45947j43945j37936j29582j19777
60021D103550j07823r3210p6900o0060m2904k5652r160O478K2584L9954N7569
60010C814426P4378R1011J08363J25640J41289J54804J66156J74327J77852J76125
60000E204371J69048J56336J38340J16680R2821O6935L9212J1023j6453m3569
59990E934744p0618r6115j18172j36473j51105j60549j62906j58483j49309j36645
59980D594369j20797j02720q3867o4631m4671k4567n642J1688K7909M3036N6611
$$ plain form
60053 4169807 4164423 4177728 4209750 4259712 4327202 4411616 4510743 4621121 4739660 4863740 4989708
60042 4989708 5112504 5227084 5329425 5416049 5483560 5529109 5550812 5547684 5519691 5467895 5393987
60031 5393987 5299797 5187684 5061123 4924179 4780737 4634790 4490845 4352909 4223327 4103550
60021 4103550 3995727 3902517 3825617 3765557 3722653 3697001 3687841 3694319 3716903 3756857 3814426
60010 3814426 3888804 3979815 4088178 4213818 4355107 4509911 4676067 4850394 5028246 5204371
60000 5204371 5373419 5529755 5668095 5784775 5877596 5944531 5983743 5994766 5978313 5934744
59990 5934744 5864126 5768011 5649839 5513366 5362261 5201712 5038806 4880323 4731014 4594369
59980 4594369 4473572 4370852 4286985 4222354 4177683 4153116 4147474 4159162 4187071 4230107 4286718
59969D286718O8753P9881Q9699R7630J03779J08195J09786J07395J01388R2907
59959E246131Q2294O9766N6764M4700L3020K0446P758k615r532j3716j5539j4109
59947E505368q651R58J5054L3929N6686Q1902J09447J40086J73467K08199K43790
59936F560235K80589L17685L52690L83772M10017M29442M38592M34753M16889
59927A0024664L83907L33965K66731J85149R4139j332r6161j84645k61688l24303
59917A0420426l71382m02587m18216m19684m09387l89955l63610l32036k96687
59908G016882k59228k21335j83813j46532j09591p3859l9794o665K6170N8047
59898F060282Q8072J16469J43516J67855J87340K00993K08648K09203K00841J82640
$$ plain form
59969 4286718 4355471 4435352 4525051 4622681 4726460 4834655 4944441 5051836 5153224 5246131
59959 5246131 5328425 5398191 5454955 5499655 5532675 5553121 5560879 5558264 5548732 5535016 5519477 5505368
59947 5505368 5496717 5497675 5512729 5546658 5603344 5685246 5794693 5934779 6108246 6316445 6560235
59936 6560235 6840824 7158509 7511199 7894971 8304988 8734430 9173022 9607775 10024664
59927 10024664 10408571 10742536 11009267 11194416 11288555 11287223 11191062 11006417 10744729 10420426
59917 10420426 10049044 9646457 9228241 8808557 8399170 8009215 7645605 7313569 7016882
59908 7016882 6757654 6536319 6352506 6205974 6096383 6022524 5982730 5976065 6002235 6060282
59898 6060282 6148354 6264823 6408339 6576194 6763534 6964527 7173175 7382378 7583219 7765859
59888G765859J54462J15846O7060J1137m7024j03825j57714k06876k48145k78781
59878G071999k98002l06461l05469k96949k82815k64018k41242k16404j92158
59869D668481j69881j49539j31467j16689j05320r6260q8786q2934p8113p2862
59859C576630o6457n9349n1566m2100l0402j7380m413P582J7787K5349K9931L1433
59847C417045K9119K2146J1041k519j7307l2612m6877n8080o5724p0979p4588
59836C110665p6103p5426p3341p0073o4960n8051n0478m2607l3437k2526j1015
59825B532648K9J0899K2013L2691M2113N0251N7045O1681O3607O3377O1735N8761
59813C056850N4415M8968M2354L4071K4326J4317M921l875j1770j7528k0107j9474
$$ plain form
59888 7765859 7920321 8036167 8103227 8114364 8067340 7963515 7805801 7598925 7350780 7071999
59878 7071999 6773997 6467536 6162067 5865118 5582303 5318285 5077043 4860639 4668481
59869 4668481 4498600 4349061 4217594 4100905 3995585 3899325 3810539 3727605 3649492 3576630
59859 3576630 3510173 3450824 3399258 3357158 3326756 3309376 3304963 3312545 3330332 3355681 3385612 3417045
59847 3417045 3446164 3468310 3479351 3476832 3459525 3426913 3380036 3321956 3256232 3185253 3110665
59836 3110665 3034562 2959136 2885795 2815722 2750762 2692711 2642233 2599626 2566189 2543663 2532648
59825 2532648 2532677 2543576 2565589 2598280 2640393 2690644 2747689 2809370 2872977 2936354 2998089 3056850
59813 3056850 3111265 3160233 3202587 3236658 3260984 3275301 3280222 3276347 3264577 3247049 3226942 3207468
59801C207468j5853r254k44J0075K1422L4683N0340O7721Q6307J06562J28858
59790C688085J52791J78279K06194K37050K70049L03916L37285L67035L87050
59781F127734L89781L69013L21490K47799J53321M7779n7391j51810k27425k79401
59771F940890l07274l14632l06663k87952k62320k33203k03126j73451j45151
59762D707118j19188r5758p4170n4016l5632j9044l462J1612K5796L8946N1861
59751D434063O5228P8815R2384J06566J22041J38632J55868J73865J93040K13581
59741E774083K35670K59671K85734L13701L43508L75040M07587M40285M72879
59732H908158N04842N33824N56428N70642N76014N71348N54415N24979M86606
$$ plain form
59801 3207468 3191615 3182361 3182117 3192192 3213614 3248297 3298637 3366358 3452665 3559227 3688085
59790 3688085 3840876 4019155 4225349 4462399 4732448 5036364 5373649 5740684 6127734
59781 6127734 6517515 6886528 7208018 7455817 7609138 7656917 7599526 7447716 7220291 6940890
59771 6940890 6633616 6318984 6012321 5724369 5462049 5228846 5025720 4852269 4707118
59762 4707118 4587930 4492172 4418002 4363986 4328354 4309310 4305848 4317460 4343256 4382202 4434063
59751 4434063 4499291 4578106 4670490 4777056 4899097 5037729 5193597 5367462 5560502 5774083
59741 5774083 6009753 6269424 6555158 6868859 7212367 7587407 7994994 8435279 8908158
59732 8908158 9413000 9946824 10503252 11073894 11649908 12221256 12775671 13300650 13787256
59723A3787256M44478M02709L64635L34131L14923L09147L17421L39404L73383
59714A6987487M16098M63871N13473N61389O03071O33618O48554O43857O16527
59705B2087945N65947M94017M03797K99202J86334P3370l1981j24301j99619k54435
59695B3500276k86551k95820k83382k51163k02392j40948o9228J2125J01858J97188
59685B2281963K96012L98233N03662O10058P14403Q14240R05890R82435J034975
59676B8541871J054959J034207R64558Q40295O61516M34847J72373j08965l88708
59667C3206953o46772q67340j039634j157310j219398j231114j201662j141055
59659B4702668j059841r70691q87738q23268p84928p74659p88561q17984q52434
$$ plain form
59723 13787256 14231734 14634443 14999078 15333209 15648132 15957279 16274700 16614104 16987487
59714 16987487 17403585 17867456 18380929 18942318 19545389 20179007 20827561 21471418 22087945
59705 22087945 22653892 23147909 23551706 23850908 24037242 24110612 24078631 23954330 23754711 23500276
59695 23500276 23213725 22917905 22634523 22383360 22180968 22040020 21970792 21982917 22084775 22281963
59685 22281963 22577975 22976208 23479870 24089928 24804331 25618571 26524461 27506896 28541871
59676 28541871 29596830 30631037 31595595 32435890 33097406 33532253 33704626 33595661 33206953
59667 33206953 32560181 31692841 30653207 29495897 28276499 27045385 25843723 24702668
59659 24702668 23642827 22672136 21784398 20961130 20176202 19401543 18612982 17794998 16942564
59650A6942564q82439r00554r01751q84734q52290q08926p58242p03068o46696
59641I603864n92121n40427m91325m45037m02375l63473l27787k95157k65599
59632E880563k38342k12286j87468j64896j44920j26714j09434r3080p8100o4807
59622D460516n3344m3833l6484l1619k9326k9208l0972l5130m2157n1008n9724
59611D017711o7627p5513q3247q8974r1494r1818r1173q9024q4412p7991p1182
59600C105256o4364n7294n0323m3713l6672k8585k0410j3442p393j163N189J0698
59588B797784J5109J8849K1912K4067K5583K6603K6476K4980K3393K2993K3314
59577C051063K3355K3662K5516K8782L2426L6662M2636N0193N7843O5013P2692
$$ plain form
59650 16942564 16060125 15159571 14257820 13373086 12520796 11711870 10953628 10250560 9603864
59641 9603864 9011743 8471316 7979991 7534954 7132579 6769106 6441319 6146162 5880563
59632 5880563 5642221 5429935 5242467 5077571 4932651 4805937 4696503 4603423 4525323 4460516
59622 4460516 4407172 4363339 4326855 4295236 4265910 4236702 4205730 4170600 4128443 4077435 4017711
59611 4017711 3950084 3874571 3791324 3702350 3610856 3519038 3427865 3338841 3254429 3176438 3105256
59600 3105256 3040892 2983598 2933275 2889562 2852890 2824305 2803895 2790453 2783060 2781897 2787086 2797784
59588 2797784 2812893 2831742 2853654 2877721 2903304 2929907 2956383 2981363 3004756 3027749 3051063
59577 3051063 3074418 3098080 3123596 3152378 3184804 3221466 3264102 3314295 3372138 3437151 3509843
59566C509843Q1748R2063J03538J16554J31096J46469J62203J78404J95186K12394
59556D929498K29760K46662K62006K75132K86342K95756L02187L04141L01437
59547G432921K94872K84790K71113K54410K35950K16940J98400J81102J64696
59538I535194J47668J29179J10524R3921Q0829P2379P0138P4680Q4016R4811J04538
59527A0597877J11039J11094J01536Q1559N2208J3940l3430q8504j47711k07248
59517A0592360k64187l15804l59369l93201m17016m31140m36142m33041m22938
59508G119522m06589l85038l60141l33586l05945k77581k49730k23512j98660
59499D378740j74539j51703j31086j12275r4223p7065o1587m7360l3069j8456
$$ plain form
59566 3509843 3591591 3683654 3787192 3903746 4034842 4181311 4343514 4521918 4717104 4929498
59556 4929498 5159258 5405920 5667926 5943058 6229400 6525156 6827343 7131484 7432921
59547 7432921 7727793 8012583 8283696 8538106 8774056 8990996 9189396 9370498 9535194
59538 9535194 9682862 9812041 9922565 10016486 10097315 10169694 10239832 10314512 10398528 10493339 10597877
59527 10597877 10708916 10820010 10921546 11003105 11055313 11069253 11035823 10947319 10799608 10592360
59517 10592360 10328173 10012369 9653000 9259799 8842783 8411643 7975501 7542460 7119522
59508 7119522 6712933 6327895 5967754 5634168 5328223 5050642 4800912 4577400 4378740
59499 4378740 4204201 4052498 3921412 3809137 3714914 3637849 3576262 3528902 3495833 3477377
59489C477377m327R225K3102L7810N3050O8556Q4205R9652J15005J31355J49356
59478D244366J67870J85364K01940K18461K34328K47753K57592K63099K62494
59469F283267K53663K36050K10115J75511J31881Q1088K6607k9149q4898j38189
59459G145946j85367k24151k54362k76051k88912k93715k92372k86089k75148
59450D769779k60596k44422k27763k10663j93637j77625j62229j46107j29533
59441C017204j14645j02523r1836q1050p0238o0077n0653m2060l4781k8633k2490
59430B318218j5746r069l327J285M893P737J0482J3593J6427J8092J9084K0780
59418B402449K3594K7026L1179L6377M1416M4182M4219M3092M2111M1656M2695
$$ plain form
59489 3477377 3473050 3482275 3505377 3543187 3596237 3664793 3748998 3848650 3963655 4095010 4244366
59478 4244366 4412236 4597600 4799540 5018001 5252329 5500082 5757674 6020773 6283267
59469 6283267 6536930 6772980 6983095 7158606 7290487 7371575 7398182 7369033 7284135 7145946
59459 7145946 6960579 6736428 6482066 6206015 5917103 5623388 5331016 5044927 4769779
59450 4769779 4509183 4264761 4036998 3826335 3632698 3455073 3292844 3146737 3017204
59441 3017204 2902559 2800036 2708200 2627150 2556912 2496835 2446182 2404122 2369341 2340708 2318218
59430 2318218 2302472 2293403 2290076 2291361 2296254 2303991 2314473 2328066 2344493 2362585 2381669 2402449
59418 2402449 2426043 2453069 2484248 2520625 2562041 2606223 2650442 2693534 2735645 2777301 2819996
59407B819996M6839N4418O4327P6164R0518J06761J22665J36912J50240J63519
59397C832359J76800J91019K08616K31207K58102K88019L20769L56307L93633
59388F256831M31469M68701N03299N32094N52482N63165N62824N49783N23906
59379A0944554M87628M44251L96432L46722K97931K51868K08839J68918J32394
59370A3679537R8365O4513K9111q066m7472r0630j37999j87281k34898k78058
59360A2887122l14463l41440l56857l60423l53376l37813l17002k95274k76478
59351I933996k62885k55780k55945k62850k74374k87997l01641l13244l20823
59342G398457l23529l21705l15507l04580k89485k72073k53861k34992k15243
$$ plain form
59407 2819996 2866835 2921253 2985580 3061744 3152262 3259023 3381688 3518600 3668840 3832359
59397 3832359 4009159 4200178 4408794 4640001 4898103 5186122 5506891 5863198 6256831
59388 6256831 6688300 7157001 7660300 8192394 8744876 9308041 9870865 10420648 10944554
59379 10944554 11432182 11876433 12272865 12619587 12917518 13169386 13378225 13547143 13679537
59370 13679537 13777902 13842415 13871526 13863460 13815988 13725358 13587359 13400078 13165180 12887122
59360 12887122 12572659 12231219 11874362 11513939 11160563 10822750 10505748 10210474 9933996
59351 9933996 9671111 9415331 9159386 8896536 8622162 8334165 8032524 7719280 7398457
59342 7398457 7074928 6753223 6437716 6133136 5843651 5571578 5317717 5082725 4867482
59333D867482j94901j74279j53619j33811j15982r9890q4086o8044n2838l9264
59323C750768k6710j4440k615Q671K0033L1776M3304N4015O3766P2153P8596Q3378
59311D162695Q7162Q9301Q8139Q3261P5809O6307N4065L9272K3698Q652n990j9924
59299D752447l1508l9681m5034m7959m7468m3020l5891k7456j7446n079R320K4943
59287D446168M1583N9072P6585R3302J08867J22780J34376J43646J50654J53993
59277E531026J51591J43412J31462J16737R8383P6555N3754L2134J1525q643k7501
59266F310435m4027n8272o9832p7006p8902p6856p2541o6455n9463n3772n0642
59255E602667m8879m7157m6197m7046m8885n0264n0975n0937m8838m3649l6154
$$ plain form
59333 4867482 4672581 4498302 4344683 4210872 4094890 3995000 3910914 3842870 3790032 3750768
59323 3750768 3724058 3709618 3707003 3715674 3735707 3767483 3810787 3864802 3928568 4000721 4079317 4162695
59311 4162695 4249857 4339158 4427297 4510558 4586367 4652674 4706739 4746011 4769709 4778361 4772371 4752447
59299 4752447 4720939 4681258 4636224 4588265 4540797 4497777 4461886 4434430 4416984 4411905 4421225 4446168
59287 4446168 4487751 4546823 4623408 4716710 4825577 4948357 5082733 5226379 5377033 5531026
59277 5531026 5682617 5826029 5957491 6074228 6172611 6249166 6302920 6335054 6346579 6337936 6310435
59266 6310435 6266408 6208136 6138304 6061298 5982396 5905540 5832999 5766544 5707081 5653309 5602667
59255 5602667 5553788 5506631 5460434 5413388 5364503 5314239 5263264 5212327 5163489 5119840 5083686
59244E083686k7125j5317R67K1489M4982P1222J00558J32420J65917K00868K36852
59233F016519K72306L05746L36433L62434L79631L84289L75249L52250L14017
59224I098874K60038J92747J15860L1918n6541j44816k27399l00582l61860m08265
59214H199974m37746m51377m52016m41587m21631l95398l66791l37727l08514
59205D587187k80217k54440k31314k09823j89777j71664j54953j38572j22702
59196B833725j08429r5984q4869p5231o7408o0664n4051m7989m3349l9554l5304
59185B120893l0563k6142k1845j6841j1405o522k194K241O522R982J3163J7251
59173B054540K2150K6751L0740L4624L8416M1848M5498N0178N5449O0269O4723
$$ plain form
59244 5083686 5056561 5041244 5042211 5063700 5108682 5179904 5280462 5412882 5578799 5779667 6016519
59233 6016519 6288825 6594571 6931004 7293438 7673069 8057358 8432607 8784857 9098874
59224 9098874 9358912 9551659 9667519 9699437 9642896 9498080 9270681 8970099 8608239 8199974
59214 8199974 7762228 7310851 6858835 6417248 5995617 5600219 5233428 4895701 4587187
59205 4587187 4306970 4052530 3821216 3611393 3421616 3249952 3094999 2956427 2833725
59196 2833725 2725296 2629312 2544443 2469212 2401804 2341140 2287089 2239100 2195751 2156197 2120893
59185 2120893 2090330 2064188 2042343 2025502 2014097 2007575 2005381 2007622 2014144 2024126 2037289 2054540
59173 2054540 2076690 2103441 2134181 2168805 2207221 2249069 2294567 2344745 2400194 2460463 2525186
59162B525186O9720P5329Q0861Q6172R1524R6464J00208J02708J04154J03866
59152C436192J00912R5287Q7393P7110O4524N0711L6501K1437N298j0315k3471
59141C941579l3962m2387m8312n1147n1770n1290m8983m3467l5238k6052j6402
59130C492569n474O871J9948L3634M8231O3333P8536R4582J12298J30919J49153
59119D224600J67132J85686K04460K22478K39685K56102K70255K80232K85494
59110F336124K85650K78418K60975K32788J95327J49946R8267M3701r843o0341
59100G811012j06820j47174j79406k04307k24438k40784k52796k60949k66594
59091E927744k69626k69012k65353k60423k54346k45772k34670k22413k09363
$$ plain form
59162 2525186 2594906 2670235 2751096 2837268 2928792 3025256 3125464 3228172 3332326 3436192
59152 3436192 3537104 3632391 3719784 3796894 3861418 3912129 3948630 3970067 3975365 3965050 3941579
59141 3941579 3907617 3865230 3816918 3765771 3714001 3662711 3613728 3570261 3535023 3508971 3492569
59130 3492569 3487095 3493966 3513914 3547548 3595779 3659112 3737648 3832230 3944528 4075447 4224600
59119 4224600 4391732 4577418 4781878 5004356 5244041 5500143 5770398 6050630 6336124
59110 6336124 6621774 6900192 7161167 7393955 7589282 7739228 7837495 7881196 7871353 7811012
59100 7811012 7704192 7557018 7377612 7173305 6948867 6708083 6455287 6194338 5927744
59091 5927744 5658118 5389106 5123753 4863330 4608984 4363212 4128542 3906129 3696766
59082C696766j94990j80294j67323j56162j45083j33753j23639j15037j06492
59073B373993r7616q9723q3110p6241o8488o1222n5351m9982m4449l9555l5911
59062A672345l2812k9591k6510k3755k1043j8645j7215j6381j5043j3189j1697
59051A446464j0363q024m665j506J019L356N025M935L646L010L468L950M683P497
59037A462495J2864J8968K4354K9266L3773L6873L8155L8194L6625L1970K4176
59026A787713J5240O691j570r284j5034j8231j9873k0481j9315j6446j3401j0825
59014A665184p518k945J369M129O030P953R087Q279N845K823l98l744o823r494
59000A679777j2053j4300j5505j5623j5323j4531j2450r261o238l911j753J38
$$ plain form
59082 3696766 3501776 3321482 3154159 2997997 2852914 2719161 2595522 2480485 2373993
59073 2373993 2276377 2186654 2103544 2027303 1958815 1897593 1842242 1792260 1747811 1708256 1672345
59062 1672345 1639533 1609942 1583432 1559677 1538634 1519989 1502774 1486393 1471350 1458161 1446464
59051 1446464 1436101 1428077 1423412 1421906 1422925 1426281 1431306 1436241 1439887 1442897 1446365 1450315 1454998 1462495
59037 1462495 1475359 1494327 1518681 1547947 1581720 1618593 1656748 1694942 1731567 1763537 1787713
59026 1787713 1802953 1809644 1808074 1798790 1783756 1765525 1745652 1725171 1705856 1689410 1676009 1665184
59014 1665184 1657666 1654721 1656090 1660219 1666249 1674202 1683289 1691568 1697413 1700236 1699838 1696094 1689271 1679777
59000 1679777 1667724 1653424 1637919 1622296 1606973 1592442 1579992 1570731 1564493 1560582 1558829 1558967
58988A558967R84J191K276M437O150O789P583R313J1063J2104J3105J4570J5840
58975A664372J6541J7404J8858K0455K2319K5420K9660L3482L6154L8672M1716
58964A965053M4456M6223M7499M8397M8010M6187M4279M3167M2269M1379M1779
58953B458698M4430M8632N3476N9124O5706P2526P9275Q6684R4990J03186J10580
58942C277307J17755J25235J32608J39670J47170J55890J66304J79463J96574
58933D637976K17264K39906K64053K90822L20653L52686L86797M24000M64096
58924G598253N05153N46121N87920O30881O73020P11700P44970P70110P82723
58915A3550851P78474P54338P07665O35999N38974M18979K79718J26151l3778
$$ plain form
58988 1558967 1559951 1561142 1563418 1567855 1574005 1580794 1588377 1597690 1608753 1620857 1633962 1648532 1664372
58975 1664372 1680913 1698317 1717175 1737630 1759949 1785369 1815029 1848511 1884665 1923337 1965053
58964 1965053 2009509 2055732 2103231 2151628 2199638 2245825 2290104 2333271 2375540 2416919 2458698
58953 2458698 2503128 2551760 2605236 2664360 2730066 2802592 2881867 2968551 3063541 3166727 3277307
58942 3277307 3395062 3520297 3652905 3792575 3939745 4095635 4261939 4441402 4637976
58933 4637976 4855240 5095146 5359199 5650021 5970674 6323360 6710157 7134157 7598253
58924 7598253 8103406 8649527 9237447 9868328 10541348 11253048 11998018 12768128 13550851
58915 13550851 14329325 15083663 15791328 16427327 16966301 17385280 17664998 17791149 17757371
58906A7757371j90033l34506m62525n70238o53621p11479p46841p63655p63974
58897A2560499p49612p24034o90765o51660o08349n63500n19125m75387m32610
58888G145457l92661l56908l24563k94617k67749k44823k25153k07735j92558
58879D638690j79320j66542j53426j41115j30680j21377j12206j03517r5797q8385
58869C346325q0791p3685o7365o0867n3760m7083m1373l5580k9166k3267j8517
58858B814871j3640p714j817L048P783J3380J9082K4031K8905L4429L9985M5285
58846C007628N1557N9450O7555P4680Q1834R0343R9712J09024J18736J29468J40738
58835D030725J52371J65398J80090J95063K09985K26990K47634K70515K93919
$$ plain form
58906 17757371 17567338 17232832 16770307 16200069 15546448 14834969 14088128 13324473 12560499
58897 12560499 11810887 11086853 10396088 9744428 9136079 8572579 8053454 7578067 7145457
58888 7145457 6752796 6395888 6071325 5776708 5508959 5264136 5038983 4831248 4638690
58879 4638690 4459370 4292828 4139402 3998287 3867607 3746230 3634024 3530507 3434710 3346325
58869 3346325 3265534 3191849 3124484 3063617 3009857 2962774 2921401 2885821 2856655 2833388 2814871
58858 2814871 2801231 2793517 2791700 2794748 2802531 2815911 2834993 2859024 2887929 2922358 2962343 3007628
58846 3007628 3059185 3118635 3186190 3260870 3342704 3433047 3532759 3641783 3760519 3889987 4030725
58835 4030725 4183096 4348494 4528584 4723647 4933632 5160622 5408256 5678771 5972690
58826E972690L18786L46868L77904M10915M46537M85663N27130N68872O10027
58817A0065392O49802O85497P13449P30603P33602P18055O80736O21044N38831
58808A6137011M33032L04851J60626R217j42105k87358m19710n32731o23081o90124
58798A4349628p34060p56374p60607p50527p28457o96837o59664o20314n79520
58789H063268n37372m95614m56002m18268l81902l48181l18193k90581k63751
58780D553404k38627k16818j97743j80143j64784j52892j43360j34216j25678
58771B999143j19001j13494j07371j00574r4221q8139q1385p4216o7284n9924
58761B093534n1467m3133l6373l0474k3984j7323j1740p009k405J472M152P056
$$ plain form
58826 5972690 6291476 6638344 7016248 7427163 7873700 8359363 8886493 9455365 10065392
58817 10065392 10715194 11400691 12114140 12844743 13578345 14296400 14977136 15598180 16137011
58808 16137011 16570043 16874894 17035520 17044737 16902632 16615274 16195564 15662833 15039752 14349628
58798 14349628 13615568 12859194 12098587 11348060 10619603 9922766 9263102 8642788 8063268
58789 8063268 7525896 7030282 6574280 6156012 5774110 5425929 5107736 4817155 4553404
58780 4553404 4314777 4097959 3900216 3720073 3555289 3402397 3259037 3124821 2999143
58771 2999143 2880142 2766648 2659277 2558703 2464482 2376343 2294958 2220742 2153458 2093534
58761 2093534 2042067 1998934 1962561 1932087 1908103 1890780 1879040 1872031 1869626 1871098 1875250 1882306
58749A882306J1373J5626J7862J8673J9271J8128J2668L175p769j8733k9477l8669
58737A904434m4589m7518m8779m8309m5662m2332m0361l9412l7896l5995l5035
58726A438546l4736l3787l2263l0932k9151k6010k2634k0663j9459j7316j4473
58715A157122j2356j0973r718r532j1488j4253j5731j6113j6645j6664j4843j2166
58703I96640j0566r691q058o301o052o683o429n828o760q907j0444j1404j3055
58690H86462j4711j4556j2995j1895j1106r078o250m457l449j356J784M243N871
58677H08507P929J0155J1118J1024J1062J0614Q421N759N078O007O214N641O265
58664I13794Q039Q732P615N847L510k67m404o615o918p101p065n154j812P33K283
$$ plain form
58749 1882306 1893679 1909305 1927167 1945840 1965111 1983239 1995907 1999082 1991313 1972580 1943103 1904434
58737 1904434 1859845 1812327 1763548 1715239 1669577 1627245 1586884 1547472 1509576 1473581 1438546
58726 1438546 1403810 1370023 1337760 1306828 1277677 1251667 1229033 1208370 1188911 1171595 1157122
58715 1157122 1144766 1133793 1124075 1114543 1103055 1088802 1073071 1056958 1040313 1023649 1008806 996640
58703 996640 986074 976383 968325 962024 955972 949289 942860 937032 930272 921365 910921 899517 886462
58690 886462 871751 857195 844200 832305 821199 812121 805871 801414 797965 796609 798393 802636 808507
58677 808507 816436 826591 837709 848733 859795 870409 878830 884589 889667 895674 901888 907529 913794
58664 913794 921833 930565 938180 944027 947537 947270 942866 936251 929333 922232 915167 910013 908201 908934 911217
58649I11217M618P863J0402J2243J4897J8077K0030K1085K3223K6358K8732L0773
58637A129518L4766M0605M5843N0050N5329O2321O9481P6641Q5513R6319J07544
58626A853930J19292J33279J49265J65058J80310J96570K13317K27553K37529
58617C476103K43136K42581K32466K11562J80924J40581R0292L3648k2912p5552
58607D752829j23541j64548j94397k12237k21302k23681k18763k07588j94018
58598B992754j80241j65369j49669j35694j24018j12210r9487q8223p9386p0768
58588A787689o1209n2472m5309l7869k9697k3229j9552j6572j3087j0755j0256
58577A467682r429o983m346k037J943Q241J4456J9019K3047K6579K6976K3078
$$ plain form
58649 911217 915835 923698 934100 946343 961240 979317 999347 1020432 1043655 1070013 1098745 1129518
58637 1129518 1164284 1204889 1250732 1300782 1356111 1418432 1487913 1564554 1650067 1746386 1853930
58626 1853930 1973222 2106501 2255766 2420824 2601134 2797704 3011021 3238574 3476103
58617 3476103 3719239 3961820 4194286 4405848 4586772 4727353 4817645 4851293 4828381 4752829
58607 4752829 4629288 4464740 4270343 4058106 3836804 3613123 3394360 3186772 2992754
58598 2992754 2812513 2647144 2497475 2361781 2237763 2125553 2026066 1937843 1858457 1787689
58588 1787689 1726480 1674008 1628699 1590830 1561133 1537904 1518352 1501780 1488693 1477938 1467682
58577 1467682 1458253 1451270 1446924 1444887 1446830 1455071 1469527 1488546 1511593 1538172 1565148 1588226
58565A588226J7101J0425J306j0972k3365l2916l9928m5159m7351m5989m3276
58554A328102m1027l8450l4982l2159l0745k9175k6823k5606k6319k6622k4791
58543I91403k2389k1099j9971j7921j6002j5021j3762j1602j0195j0603j1334
58532H21504j0964j0107r356q045o401n990o807o768n248l982l543k442o85l59
58518G40807j453j182J104K356R33p93p63j90j96N46K781M929O379Q811J2472
58503G76541J4912J5345J6320J9174K1876K3284K5368K8914L1259L0629K8736
58492A032358K6820K3174J7044J0815N896M69o259j1749j4696j7619k2217k6154
58480A017882k7314k7211k7401k6438k3290j9959j7958j5909j3150j1774j2598
$$ plain form
58565 1588226 1605327 1615752 1617058 1606086 1582721 1549805 1509877 1464718 1417367 1371378 1328102
58554 1328102 1287075 1248625 1213643 1181484 1150739 1121564 1094741 1069135 1042816 1016194 991403
58543 991403 969014 947915 927944 910023 894021 879000 865238 853636 843441 832838 821504
58532 821504 810540 800433 791077 783032 776631 770641 763834 757066 751818 747836 744293 741851 741166 740807
58518 740807 739354 738172 739276 741632 742565 741772 741009 740819 740623 741169 743950 748879 755258 764069 776541
58503 776541 791453 806798 823118 842292 864168 887452 912820 941734 972993 1003622 1032358
58492 1032358 1059178 1082352 1099396 1110211 1116107 1116576 1110317 1098568 1083872 1066253 1044036 1017882
58480 1017882 990568 963357 935956 909518 886228 866269 848311 832402 819252 807478 794880
58469G94880j3153j2182j1970j3624j4539j3110j1577j1370j0286p167m693m439
58457F66770l862j363M62m5p2K498N216O010P212J0853J4603J6472J8837K3678
58443G67269K8288K9853K9979L0544K9458K4806J8888J3971Q303M68o746j0954
58431I64127j4212j8306k0692j9393j7263j6915j6105j2766r734r551r328n911
58419G93951j573N87K374O313J0190J1204J1408J3634J6121J6258J5469J5221
58407I11157J2790O342l35l638o097j0881j5180j5171j3026j2650j2759j0534
58395H30018p917p824q069n526k432k136k547j90L114M034M228O606R076Q501
58381H28936O909P282P312M048M70M98J701J71j687L30L997M774M194O346R664
$$ plain form
58469 794880 781727 769545 757575 743951 729412 716302 704725 693355 683069 675902 671209 666770
58457 666770 662908 661545 662007 661962 661890 664388 669604 675614 682826 693679 708282 724754 743591 767269
58443 767269 795557 825410 855389 885933 915391 940197 959085 973056 981359 981827 975081 964127
58431 964127 949915 931609 910917 891524 874261 857346 841241 828475 818741 809190 799862 793951
58419 793951 792378 792965 795339 801652 811842 823046 834454 848088 864209 880467 895936 911157
58407 911157 923947 930289 929954 926316 920219 909338 894158 878987 865961 853311 840552 830018
58395 830018 822101 814277 806208 800682 798250 796114 793567 793377 796491 800525 804753 811359 820435 828936
58381 828936 835845 843127 850439 854487 854957 855455 857156 857327 855640 855970 859967 864741 868935 875281 884945
58366H84945J0131R225J0754J3102J2533J0956J2556J5862J6870J6820J8994K1091
58354A053839J8806J3868J0691Q219L022k849n167n405p400r487q018n128m799
58341A060192m946j690K316K611J855N059R856J0864R841J1802J4808J3695J0462
58328A146725J0780J3406J3294J1989J4563J9309K0901K0789K3886K8030K7516
58317A351188K4016K3107K3056J8229J0753P215O588L022k086k680m5k25j908
58304A460230R19O704Q934Q677J2087J7732J9140J7658J9892K4540K4913K2370
58292A643796K3894K8379K8926K6791K9087L4590L6049L4740L8226M5406M8575
58281B018459M8723N3584O1884O4967O2796O2836O4299N9538M9935M4041M1039
$$ plain form
58366 884945 895076 904301 915055 928157 940690 951646 964202 980064 996934 1013754 1032748 1053839
58354 1053839 1072645 1086513 1097204 1105423 1108445 1105596 1100429 1095024 1087624 1078137 1070119 1064991 1060192
58341 1060192 1055246 1053556 1055872 1058483 1060338 1065397 1075253 1086117 1095958 1107760 1122568 1136263 1146725
58328 1146725 1157505 1170911 1184205 1196194 1210757 1230066 1250967 1271756 1295642 1323672 1351188
58317 1351188 1375204 1398311 1421367 1439596 1450349 1457564 1464152 1467174 1465088 1462408 1462363 1462138 1460230
58304 1460230 1461149 1467853 1476787 1485464 1497551 1515283 1534423 1552081 1571973 1596513 1621426 1643796
58292 1643796 1667690 1696069 1724995 1751786 1780873 1815463 1851512 1886252 1924478 1969884 2018459
58281 2018459 2067182 2120766 2182650 2247617 2310413 2373249 2437548 2497086 2547021 2591062 2632101
58270B632101L2713K0858J5546J6807J5546J1942J4941K3838K8744K9301L4422
58259B876759M3585M7386M6632N1357O0790O4289O2380O6287P6167Q0972Q0393
58248C556997Q5197R5094R8787R7004J02277J14599J21057J21047J27381J40676
58238D660116J48027J49057J57166J72743J82031J84930J96002K15445K28103
58229F293620K33804K48460K72197K88276K96783L16043L47115L71838L89887
58220I058023M20787M64930N01831N31964N78827O43924P03856P58450Q34724
58211A4497316R35918J037192J140440J279156J459332J654211J869358K149898
58203B6022821K511087K932274L435350M091188M926485N904389P016572Q304821
$$ plain form
58270 2632101 2664814 2685672 2701218 2718025 2733571 2745513 2760454 2784292 2813036 2842337 2876759
58259 2876759 2920344 2967730 3014362 3065719 3126509 3190798 3253178 3319465 3395632 3476604 3556997
58248 3556997 3642194 3737288 3836075 3933079 4035356 4149955 4271012 4392059 4519440 4660116
58238 4660116 4808143 4957200 5114366 5287109 5469140 5654070 5850072 6065517 6293620
58229 6293620 6527424 6775884 7048081 7336357 7633140 7949183 8296298 8668136 9058023
58220 9058023 9478810 9943740 10445571 10977535 11556362 12200286 12904142 13662592 14497316
58211 14497316 15433234 16470426 17610866 18890022 20349354 22003565 23872923 26022821
58203 26022821 28533908 31466182 34901532 38992720 43919205 49823594 56840166 65144987
58195F5144987R781373J1452598J3454849J6032514J9346241K3453608K8438330
58188A87104500L4127865L9359202M1817658L9201267L0800165J7890181K773043
58181C93073881j2217926k4971212l3740254l7745189l7608306l4863482l0965223
58174A80962289k6790937k2801307j9255697j6210296j3566415j1254901r294838
58167F1787898p671834o294789n103185m105554l285635k571679j923138j353412
58159B9478672q43175l19878K55872Q71277J540517K287437K995782L373766L153956
58150D2794226K297243R75729n65264k068951l275242l994784m203608m028794
58142B7930555l640618l173710k715080k308155j957335j652269j391470j175463
$$ plain form
58195 65144987 74926360 86378958 99833807 115866321 135212562 158666170 187104500
58188 187104500 221232365 260591567 302409225 341610492 372410657 390300838 393073881
58181 393073881 380855955 355884743 322144489 284399300 246790994 211927512 180962289
58174 180962289 154171352 131370045 112114348 95904052 82337637 71082736 61787898
58167 61787898 54116064 47821275 42718090 38612536 35326901 32755222 30832084 29478672
58159 29478672 28635497 28315619 28571491 29442768 30983285 33270722 36266504 39640270 42794226
58150 42794226 45091469 46067198 45501934 43432983 40157741 36162957 31959349 27930555
58142 27930555 24289937 21116227 18401147 16092992 14135657 12483388 11091918 9916455
58134I916455r93384q34234o99942n93150n04927m27583l65969l23465k90735
58125D883066k60167k37217k25755k16640k02208j87945j78730j67635j49429
58116C057340j31366j19562j07993r1553p6916p0069o5725n9103n5680n9294o2860
58105B157219o0570n7527n7979n5928m6803l6939l2252k8715k2998k1136k7401
58094A708971l5249l8464m0962m6888n1423n0253m8201m9703n0322m6104m1768
58083A209634m1320m0042l4151k9074k9602l0843k7418k2943k1991k1145j6524
58072H94581j2050j2000j2882j0652q465r598j0271p131m392n910p573n132k338
58059G86187l643n895n036m099o831r905r164p396q482r855q086n896o499o922
$$ plain form
58134 9916455 8923071 8088837 7388895 6795745 6290818 5863235 5497266 5173801 4883066
58125 4883066 4622899 4385682 4159927 3943287 3741079 3553134 3374404 3206769 3057340
58116 3057340 2925974 2806412 2698419 2606866 2529950 2459881 2394156 2335053 2279373 2220079 2157219
58105 2157219 2096649 2039122 1981143 1925215 1878412 1841473 1809221 1780506 1757508 1736372 1708971
58094 1708971 1673722 1635258 1594296 1547408 1495985 1445732 1397531 1347828 1297506 1251402 1209634
58083 1209634 1168314 1128272 1094121 1065047 1035445 1004602 977184 954241 932250 911105 894581
58072 894581 882531 870531 857649 846997 838532 828934 818663 811532 807140 801230 793657 788525 786187
58059 786187 782544 776649 771613 767514 760683 750778 741614 734218 725736 715881 707795 701899 695400 688478
58045F88478m011j191k154l643j624J114O62l72J884M994N186M682O903R244P837
58030G17989N014M958O218N238L256L167L615K394J598L411M985L468J721L082
58016G70114N018M177L191N902J0127J1732J1919J3952J6530J6822J6421J7758
58004I03663J8177J3972P065J487l453j0339j7391k1301k3296k6253k8788k8175
57992G85368k6178k5894k5754k2593j7878j4881j2422p545j827J054J737L325
57980F36512N319N189L886M175N363N102M330N257O517N604L953M429N979N959
57966G07574N486P177R830J0782J1286J4091J7733J8800J7855J7608J7063J3307
57954H68592P457L208Q26j926m314l730j142J5n04l92q7k219o549j0440j3660
$$ plain form
58045 688478 684467 683276 681122 677479 675855 676969 677631 677259 679143 684137 689323 694005 700908 710152 717989
58030 717989 723003 727961 734179 739417 742673 745840 749455 751849 753447 756858 761843 765311 767032 770114
58016 770114 775132 779309 782500 788402 798529 810261 822180 836132 852662 869484 885905 903663
58004 903663 921840 935812 942877 944364 940911 930572 913181 891880 868584 842331 813543 785368
57992 785368 759190 733296 707542 684949 667071 652190 639768 632223 630396 631450 633187 636512
57980 636512 641831 647020 650906 655081 660444 665546 669876 675133 681650 687254 691207 695636 701615 707574
57966 707574 713060 720237 730067 740849 752135 766226 783959 802759 820614 838222 855285 868592
57954 868592 876049 879257 880083 878157 873843 870113 868971 868986 868482 868090 868003 865784 859235 848795 835135
57939H35135j7933k2555k5197k6349k8284l0350k9934k7341k5215k3732k0895
57928E57350j6884j3741j1372q099m459k315j037J220L414L106J200P88K071K738
57914E13980K582L368M746M772L998M825P150Q587Q503P959O459K827j406l489
57900E74861l716m253m753l320j010r04l140n069n864o807p634o868n372n315
57886E10836n998m890k351j114j395r00O26J094L35L83J605K427K909M541O690
57871E14798P224O482O647P417O487M080K747K792K183Q64P79J567P12j755l083
57856E59941k628k504l074k381n55k66j900k713j750j314k373k717j135M59N36
57841E35626O5j16p21j655j615j018k014m683o579o899p578r334j0322r791r496
$$ plain form
57939 835135 817202 794647 769450 743101 714817 684467 654533 627192 601977 578245 557350
57928 557350 540466 526725 515353 507254 502795 500480 499443 500663 504077 507183 508383 509171 511242 513980
57914 513980 516562 519930 524676 529448 533446 538271 545421 554008 562511 570470 576929 579756 578350 574861
57900 574861 571145 566892 562139 558819 557809 556905 553765 548696 542832 536025 528391 521523 516151 510836
57886 510836 504838 499948 497597 496483 495088 494188 494814 495908 496243 496626 498231 500658 503567 508108 514798
57871 514798 522022 528504 535151 542568 549055 553135 555882 558674 560857 561721 562500 564067 564779 563024 559941
57856 559941 557313 554809 551735 549354 548799 548533 546633 543920 542170 540856 538483 535766 534631 535090 535626
57841 535626 535691 535575 534854 533199 531584 530566 528552 523869 517290 510391 502813 493479 483157 473366 463870
57826D63870j0204j0245q933q001q277q154o798n719n730n451m193l341l493l158
57812C72173j686o19p57o52O17J896K426L219M684N623N733O494Q423J0136J1141
57797D28851J2798J5449J7422J8022J8636J9700J9493J7241J4633J2946J1427
57786F06618R640Q602Q324P204N061L694L131O77m601r693j2092j3241j5355j7612
57772E80357j8128j7265j6326j4912j2110q670n919l854k064r70n56M08K355L850
57758D86196L942L726M121M112K842J523J393J541O48o34q51J4J045J947K707
57743E14272K940K742L041M033M635M345M147M759N555O041O729P768Q494R075
57729E88576J0598J2802J3900J3563J3708J5299J6720J6685J6405J7345J9000
$$ plain form
57826 463870 453666 443421 434488 426487 418210 410056 403258 397539 391809 386358 382165 378824 375331 372173
57812 372173 370487 369868 369111 368459 369076 370972 373398 376617 381301 386924 392657 399151 407574 417710 428851
57797 428851 441649 457098 474520 492542 511178 530878 550371 567612 582245 595191 606618
57786 606618 616258 624860 633184 640388 645449 649143 652274 652951 648350 638657 626565 613324 597969 580357
57772 580357 562229 544964 528638 513726 501616 492946 487027 483173 481109 480139 479583 479991 482346 486196
57758 486196 490138 493864 497985 502097 504939 506462 507855 509396 510044 509410 508559 508573 509618 511565 514272
57743 514272 517212 519954 522995 527028 531663 536008 540155 544914 550469 556510 563239 571007 579501 588576
57729 588576 599174 611976 625876 639439 653147 668446 685166 701851 718256 735601 754601
57718G54601K0474K2219K4618K6740K8063K9662L2277L5081L7644M1133M6187
57707A098699N1694N7176O4191P3688Q4057R3678J03487J15114J28352J42291
57697B012427J57283J73778J90661K06496K20925K33186K40749K41027K32897
57688C909429K15283J86179J45051R4842M0167j4934o6337j09398j41321j62481
57678D096480j73788j74693j65338j48469j26893j00756o9319l3777L470L9827
57668C146744P0128Q5367P7625M6267k106n8254j12849j56915j84114j93403j87960
57657B530530j72002j49836j26121j04194q4392o5777m8667l3913k0934q652K702
57646A718744J2722K2671L3921M5617N6109O6015P7530R1326J06206J21377J36991
$$ plain form
57718 754601 775075 797294 821912 848652 876715 906377 938654 973735 1011379 1052512 1098699
57707 1098699 1150393 1207569 1271760 1345448 1429505 1523183 1626670 1741784 1870136 2012427
57697 2012427 2169710 2343488 2534149 2740645 2961570 3194756 3435505 3676532 3909429
57688 3909429 4124712 4310891 4455942 4550784 4590951 4576017 4509680 4400282 4258961 4096480
57678 4096480 3922692 3747999 3582661 3434192 3307299 3206543 3137224 3103447 3106917 3146744
57668 3146744 3216872 3302239 3379864 3426131 3424025 3365771 3252922 3096007 2911893 2718490 2530530
57657 2530530 2358528 2208692 2082571 1978377 1893985 1828208 1779541 1745628 1724694 1716042 1718744
57646 1718744 1731466 1754137 1788058 1833675 1889784 1955799 2033329 2124655 2230861 2352238 2489229
57635B489229J52769J67924J82042J94499K03462K06819K03365J91795J69936
57626D161840J36852R4830M7528k699n3782j01761j42215j73312j95499k08962
57616C562820k13685k11300k04468j94609j82088j68011j53838j39839j25812
57607A969170j12745j01730r1927q1783p1782o3735n7784n2365m6833m1884l7573
57596A209029l3127k8766k5596k3591k1515j8988j6834j5343j3899j2386j1311
57585I87673j0511r229p610o648o596o668o244n291l822k072p49n5R18K752M526
57570I30374N326N864P124Q541R316J0249J2282J4350J5007J5180J6763J9302
57558A069678K0889K1796K4183K8368L2294L5074L8297M3208M8996N4681O0598
$$ plain form
57635 2489229 2641998 2809922 2991964 3186463 3389925 3596744 3800109 3991904 4161840
57626 4161840 4298692 4393522 4441050 4438351 4384569 4282808 4140593 3967281 3771782 3562820
57616 3562820 3349135 3137835 2933367 2738758 2556670 2388659 2234821 2094982 1969170
57607 1969170 1856425 1754695 1662768 1580985 1509203 1445468 1387684 1335319 1288486 1246602 1209029
57596 1209029 1175902 1147136 1121540 1097949 1076434 1057446 1040612 1025269 1011370 998984 987673
57585 987673 977162 967933 960323 953675 947079 940411 934167 928876 925054 922982 922233 922178 923096 925848 930374
57570 930374 935700 941564 948688 957229 966545 976794 989076 1003426 1018433 1033613 1050376 1069678
57558 1069678 1090567 1112363 1136546 1164914 1197208 1232282 1270579 1313787 1362783 1417464 1478062
57547A478062O7238P4456Q2475R2024J02907J13955J24722J35782J47046J57261
57537B575928J65370J70767J72074J67201J54870J34849J06905P1380L0773j1014
57527C739103n1084q7813j19000j42047j56233j63018j63887j59589j51512j41683
57517B403237j31007j19219j06821r5222q4693p4205o3631n4220m6483l9493l2848
57506A555395k7340k3118j9030j4413r876n676j121L692P408R468J1152J3738
57494A500279J7111K0875K5338L0575L5895M1043M6716N3336O0513O8235P7188
57483A977104Q7388R7824J08006J18514J29565J40370J50302J59054J65101J65562
57473C298790J58382J43429J21001R0959N4101J3061k8982o9346j05234j33818
$$ plain form
57547 1478062 1545300 1619756 1702231 1794255 1897162 2011117 2135839 2271621 2418667 2575928
57537 2575928 2741298 2912065 3084139 3251340 3406210 3541059 3647964 3719344 3750117 3739103
57527 3739103 3688019 3600206 3481206 3339159 3182926 3019908 2856021 2696432 2544920 2403237
57517 2403237 2272230 2153011 2046190 1950968 1866275 1792070 1728439 1674219 1627736 1588243 1555395
57506 1555395 1528055 1504937 1485907 1471494 1461618 1455942 1454821 1458513 1465921 1475389 1486541 1500279
57494 1500279 1517390 1538265 1563603 1594178 1630073 1671116 1717832 1771168 1831681 1899916 1977104
57483 1977104 2064492 2162316 2270322 2388836 2518401 2658771 2809073 2968127 3133228 3298790
57473 3298790 3457172 3600601 3721602 3812561 3866662 3879723 3850741 3781395 3676161 3542343
57463C542343j53934j66536j72732j72610j66584j56602j44982j33006j21166
57454B154191j09745r8606q7470p6815o7550n9633n2217m5216l9265l4090k8733
57443A454851k3576k0168j8477j6448j3109j0086q898q615p588n829m295l111
57431A314651j901q70j96O52J967L018L190K970L039L370L893M937O228O687O042
57416A357677N492N951O840P349P677Q138Q387Q401Q983J0352J1476J1679J1625
57403A470027J1822J1633J0839J0572J1493J2358J1931J1026J1124J2053J2602
57392A597480J2575J2639J2821J2613J2141J2002J2346J3008J3999J5086J5618
57381A742328J5555J5856J7016J8116J8239J7803J7589J7479J7213J7314J8104
$$ plain form
57463 3542343 3388409 3221873 3049141 2876531 2709947 2553345 2408363 2275357 2154191
57454 2154191 2044446 1945840 1858370 1781555 1714005 1654372 1602155 1556939 1517674 1483584 1454851
57443 1454851 1431275 1411107 1392630 1376182 1363073 1352987 1344089 1335474 1327886 1322057 1317762 1314651
57431 1314651 1312750 1311880 1311684 1312336 1314303 1317321 1320511 1323481 1326520 1329890 1333783 1338720 1344948 1351635 1357677
57416 1357677 1363169 1369120 1375960 1383309 1390986 1399124 1407511 1415912 1424895 1435247 1446723 1458402 1470027
57403 1470027 1481849 1493482 1504321 1514893 1526386 1538744 1550675 1561701 1572825 1584878 1597480
57392 1597480 1610055 1622694 1635515 1648128 1660269 1672271 1684617 1697625 1711624 1726710 1742328
57381 1742328 1757883 1773739 1790755 1808871 1827110 1844913 1862502 1879981 1897194 1914508 1932612
57370A932612J8768J8596J8314J8963K0242K1147K1450K1425K0979K0295K0516
57359B153307K2438K5112K6950K7631K7835K7815K7407K6936K6854K6926K6725
57348B445936K6511K6668K6897K6804K6646K6584K5979K4439K2825K2120K1979
57337B723388K1471K0572J9865J9424J9085J9244K0251K1460K1977K1925K2132
57326B950794K2974K4295K5884K7375K8315K8934L0102L1977L3655L4718L5851
57315C274874L7151L7461L6433L5771L6893L8740L9566L9684M0535M2037M2909
57304C702054M2976M3287M4252M5449M6903M8946N0999N2153N2694N3707N5330
57293D238750N6801N7940N9223O0552O1261O1241O0892O0148N8616N6414N3817
$$ plain form
57370 1932612 1951380 1969976 1988290 2007253 2027495 2048642 2070092 2091517 2112496 2132791 2153307
57359 2153307 2175745 2200857 2227807 2255438 2283273 2311088 2338495 2365431 2392285 2419211 2445936
57348 2445936 2472447 2499115 2526012 2552816 2579462 2606046 2632025 2656464 2679289 2701409 2723388
57337 2723388 2744859 2765431 2785296 2804720 2823805 2843049 2863300 2884760 2906737 2928662 2950794
57326 2950794 2973768 2998063 3023947 3051322 3079637 3108571 3138673 3170650 3204305 3239023 3274874
57315 3274874 3312025 3349486 3385919 3421690 3458583 3497323 3536889 3576573 3617108 3659145 3702054
57304 3702054 3745030 3788317 3832569 3878018 3924921 3973867 4024866 4077019 4129713 4183420 4238750
57293 4238750 4295551 4353491 4412714 4473266 4534527 4595768 4656660 4716808 4775424 4831838 4885655
57282D885655N0504M6170M1417L6924L2345K7251K2509J9303J7342J5496J3806
57271E208722J3240J3788J4457J5131J6841J9996K3684K6872K9336L1290L3073
57260E446430L5208L7852M0282M1720M2437M3321M4672M6175M7518M8234M7573
57249E921422M5571M3619M2831M2503M1277L9156L7121L5428L3679L2090L1291
57238F345988L1174L1147L1152L1391L1584L1628L2295L4105L6212L7643L8753
57227F713072M0171M1264M1334M1379M2739M4683M5355M4583M3801M3616M3409
57216G185406M3017M2754M1994L9767L6683L4418L3216L1809K9695K7640K5922
57205G572321K3991K1967K0585J9596J8001J6028J5019J5120J4960J3885J2720
$$ plain form
57282 4885655 4936159 4982329 5023746 5060670 5093015 5120266 5142775 5162078 5179420 5194916 5208722
57271 5208722 5221962 5235750 5250207 5265338 5282179 5302175 5325859 5352731 5382067 5413357 5446430
57260 5446430 5481638 5519490 5559772 5601492 5643929 5687250 5731922 5778097 5825615 5873849 5921422
57249 5921422 5966993 6010612 6053443 6095946 6137223 6176379 6213500 6248928 6282607 6314697 6345988
57238 6345988 6377162 6408309 6439461 6470852 6502436 6534064 6566359 6600464 6636676 6674319 6713072
57227 6713072 6753243 6794507 6835841 6877220 6919959 6964642 7009997 7054580 7098381 7141997 7185406
57216 7185406 7228423 7271177 7313171 7352938 7389621 7424039 7457255 7489064 7518759 7546399 7572321
57205 7572321 7596312 7618279 7638864 7658460 7676461 7692489 7707508 7722628 7737588 7751473 7764193
57194G764193J1925J0843R326Q353Q427Q706Q426P835P218O295N106M465M932
57181G866050O168P462Q224Q031P110O569P177Q211Q602Q605R069R619R140P654
57167G977691O054M345J754j740n686j0608j7287k4926l1857l7872m4004n0221
57155G765643n5336n9053o2087o4296o4643o3003o0149n6033n0076m2965l6140
57144G151862k9600k2325j4814r006n704m230m630p810j3330j9398k5308l1740
57132F963967l8387m3550m6300m6823m4680l9092l1206k3670j7701j2796r339
57121F610423q727j0639j2777j3732j3616j1634n846M030J6127K9232M3658N9180
57109F685679P4919R1873J12879J39635J72157K11409K59868L19638L93089M85390
$$ plain form
57194 7764193 7776118 7786961 7796287 7804640 7813067 7821773 7830199 7838034 7845252 7851547 7856653 7861118 7866050
57181 7866050 7872218 7879680 7887904 7895935 7903045 7909614 7916791 7925002 7933604 7942209 7951278 7960897 7970037 7977691
57167 7977691 7983745 7988090 7989844 7988104 7982418 7971810 7954523 7929597 7897740 7859868 7815864 7765643
57155 7765643 7710307 7651254 7589167 7524871 7460228 7397225 7337076 7281043 7230967 7188002 7151862
57144 7151862 7122262 7099937 7085123 7076117 7070413 7066183 7061553 7053743 7040413 7021015 6995707 6963967
57132 6963967 6925580 6882030 6835730 6788907 6744227 6705135 6673929 6650259 6632558 6619762 6610423
57121 6610423 6601696 6591057 6578280 6564548 6550932 6539298 6533452 6537482 6553609 6582841 6626499 6685679
57109 6685679 6760598 6852471 6965350 7104985 7277142 7488551 7748419 8068057 8461146 8946536
57099H946536O03284P51248R31883J149461J409100J712569K058957K449154K884515
57090B2896707L359966L861914M371741M864564N301895N630251N792697N750036
57082F1829771N506331N123682M694734M266060L774382L078455K078375Q09585
57074I1161375n76432j906472l056028l961598m612346n043965n317655n482592
57066F1204287n554604n527321n392496n148187m802438m380399l922279l465902
57058B3010661l032307k629691k264121j940556j658403j413316j202303j023490
57050G846474q73178p46925o41916n55514m83389m21753l69574l26321k89569
57041C138335k57016k28740k05196j84799j65712j48216j33196j19908j07215
$$ plain form
57099 8946536 9549820 10301068 11232951 12382412 13791512 15504081 17563038 20012192 22896707
57090 22896707 26256673 30118587 34490328 39354892 44656787 50287038 56079735 61829771
57082 61829771 67336102 72459784 77154518 81420578 85194960 88273415 90351790 91161375
57074 91161375 90584943 88678471 85622443 81660845 77048499 72004534 66686879 61204287
57066 61204287 55649683 50122362 44729866 39581679 34779241 30398842 26476563 23010661
57058 23010661 19978354 17348663 15084542 13143986 11485583 10072267 8869964 7846474
57050 7846474 6973296 6226371 5584455 5028941 4545552 4123799 3754225 3427904 3138335
57041 3138335 2881319 2652579 2447383 2262584 2096872 1948656 1815460 1695552 1588337
57032A588337r5585q5913p7699p0072o3385n8230n3989m9741m5530m1646l7798
57021I08749l3910l0540k7708k4607k1075j7944j5383j2523r136n978k943J140
57009G08142O479J2147J8305K6288L5996M5875N6252O9815Q7857J09079J33216
56998A309451J61566J90847K09560K04623J70915J12629L8212m1980j14906j67702
56988B073215j94149j97244j84947j64762j41894j19872j01015q6601p7039p1737
56978G33955o9002o6723o3301n7998n0944m3126l5742k9201k3232j7983j3974
56967B62729j0800p144k617J661M918Q004J2043J7053K2615K8695L4522L7637
56955D09316L5496K7730J6141L081r428j9680k6564k9867k9988k7599k3725j9407
$$ plain form
57032 1588337 1492752 1406839 1329140 1259068 1195683 1137453 1083464 1033723 988193 946547 908749
57021 908749 874839 844299 816591 791984 770909 752965 737582 725059 715923 709945 707002 708142
57009 708142 714621 726768 745073 771361 807357 853232 909484 979299 1067156 1176235 1309451
56998 1309451 1471017 1661864 1871424 2076047 2246962 2359591 2397803 2355823 2240917 2073215
56988 2073215 1879066 1681822 1496875 1332113 1190219 1070347 969332 882731 805692 733955
56978 733955 664953 598230 534929 476931 425987 382861 347119 317918 294686 276703 262729
56967 262729 251929 244785 242168 243829 248747 256751 268794 285847 308462 337157 371679 409316
56955 409316 444812 472542 488683 491764 482336 462656 436092 406225 376237 348638 324913 305506
56943C05506j4982j0297n697j977Q87L900P652J1760J6026K1074K7252L3691L8940
56930D33735M1545L9926L2769K0300M562j1851k6589l7340m2480m2515l9775l6161
56918C36126l2033k7433k3006j9220j5904j3086j1192r998q507o411m487l155
56906A61694j915n82K13L24N73J340J956K082K421L419M467N107N826O986Q160
56891B02071R238J0965J3723J6819J9632K2200K4008K3482J9538J2741M324m739
56879C74002j3138j9117k1875k2173k0910j8162j4107r615n248p36L926Q157J2039
56866B53043J6587K2138K7829L3391L9967M8158N6298O1412O0949N3323L8422
56855G11517J8542k295k0738l5030m3854m6286m3443l8158l2065k4683j5994p786
$$ plain form
56943 305506 290524 280227 274530 272553 273440 277340 284992 296752 312778 333852 361104 394795 433735
56930 433735 475280 515206 547975 568275 572837 560986 534397 497057 454577 412062 372287 336126
56918 336126 304093 276660 253654 234434 218530 205444 194252 184254 175747 169336 164849 161694
56906 161694 159779 159197 159410 159734 160307 161647 163603 165685 168106 171525 175992 181099 186925 193911 202071
56891 202071 211309 222274 235997 252816 272448 294648 318656 342138 361676 374417 378741 374002
56879 374002 360864 341747 319872 297699 276789 258627 244520 234905 229657 228921 232847 241004 253043
56866 253043 269630 291768 319597 352988 392955 441113 497411 558823 619772 673095 711517
56855 711517 730059 727764 707026 671996 628142 581856 538413 500255 468190 443507 427513 419727
56843D19727j236M893J2170K0272K8336L7006M7629O0527P4993Q9344R9656J00311
56831I93628Q7788O3252L0722n522m0577o8590q5557r1855r0360q3219p1953n9054
56819E78703m6974l6070k5382j4937n505L202J2276K1957L1805M2255N4296O7327
56807F82953P8159Q2196P5562N7237L0165j98k8991n3224p0504p8800p8537p3116
56795F22902o5939n7985m9162m0164l1645k3159j4586p110j337M215J1055J8628
56783C65713K5771L2656L9231M3055M1013L2437J9041K818j4067k8521l8019m2512
56771D78616m3400m1466l7283l2419k8270k4480k0280j6443j4099j2629j0741
56760A97106q731p593o786n061k931k070k644l240l173k924k631k009j493j809
$$ plain form
56843 419727 418491 423384 435554 455826 484162 521168 568797 629324 704317 793661 893317 993628
56831 993628 1081416 1144668 1175390 1169868 1129291 1060701 975144 883289 792929 709710 637757 578703
56819 578703 531729 495659 470277 455340 449835 453037 465313 487270 519075 561330 615626 682953
56807 682953 761112 843308 918870 976107 1006272 1006074 977083 923859 853355 774555 696018 622902
56795 622902 556963 498978 449816 409652 378007 354848 340262 333152 331815 336030 347085 365713
56783 365713 391484 424140 463371 506426 547439 579876 598917 601735 587668 559147 521128 478616
56771 478616 435216 393750 356467 324048 295778 271298 251018 234575 220476 207847 197106
56760 197106 188375 180782 173996 168935 166004 163934 161290 158050 154877 151953 149322 147313 145820 144011
56746A44011k603k973k975l100k957k016r84p90q75k96K96l58j739k202j544r60
56730A17935q80p54o26r81j320q18o4l21j237j219O6J419K171K732L148K853K006
56713A24110J487J565J747J822J839J441N28L0O48J436J137K08p7J28k38j003
56697A36808j050l49P4l5n6J98N54J292K419K793J697M80Q09K100K622K268K061
56680A54685J745K79j770k779k665k662k842k244j119p46j099j023n41p17j374
56665A35128j277m95k91p12n53K79O51M64P19J325J146L24K46R76J051N4p99q91
56647A37345q58q32k29N38L26n06l58R04J660J216N88L15k16j000j129o78p92
56630A36294j509j622r48n86p10l35M55L82n97j043o15m82q08l20J071J722J112
$$ plain form
56746 144011 141408 138435 135460 132360 129403 127387 126403 125613 124738 124442 124738 124380 122641 120439 118895 117935
56730 117935 117055 116301 115675 114694 113374 112556 112492 112171 110934 109715 109781 111200 113371 116103 119251 122104 124110
56713 124110 125597 127162 128909 130731 132570 134011 134539 134569 135217 136653 137790 137998 137921 138049 137811 136808
56697 136808 135758 135409 135483 135448 135392 135590 136144 137436 139855 142648 144345 144825 145634 147734 150356 152624 154685
56680 154685 156430 156709 154939 152160 149495 146833 143991 141747 140628 139882 138783 137760 137219 136502 135128
56665 135128 133851 133356 133065 132353 131800 132079 132730 133194 133913 135238 136384 136708 136954 137930 138981 139035 138236 137345
56647 137345 136487 135655 135426 135964 136290 135784 135426 136330 137990 139206 139794 140109 139893 138893 137764 137086 136294
56630 136294 134785 133163 132215 131629 130919 130584 131039 131421 130824 129781 129166 128684 127876 127556 128627 130349 131461
56613A31461Q08J710K658K652K304K180J788J079R65J456J326L22k13L01P72N96
56597A52165O19J148J096R6n94k35K55K32L96J065J263O03K53R68J872K101K062
56580A65365K238K335K331K713L142K582J354J196K648M243M831M825M662M098
56566B08563L597M314N969O819O425O316P235Q010P924P896Q323Q072O652N246
56552C01361M485L347J419L6r1k85j577k988l509l949n364p232q531r201r448
56537B58473r023q112p541p341o657n521n009n098m442k879j989k445k950k651
56523A86815k418k820l047k765k928l765m105l598l397l745l259j610n83j218
56509A47557k197k193j659j197m26N17N96n2L1Q84Q15l66p09K70M98p86j377N6
$$ plain form
56613 131461 132269 133979 136637 139289 141593 143773 145561 146640 147605 149061 150387 150709 150496 150797 151569 152165
56597 152165 152784 153932 155028 155124 154530 154295 154550 154782 155178 156243 157506 158109 158362 159330 161202 163303 165365
56580 165365 167603 169938 172269 174982 178124 180706 182060 183256 185904 190147 194978 199803 204465 208563
56566 208563 212160 216474 222443 229262 235687 242003 249238 257248 265172 273068 281391 289463 296115 301361
56552 301361 305846 309193 310612 310648 310557 310272 308695 305707 302198 298249 292885 285653 277122 267921 258473
56537 258473 249450 241338 233797 226456 219799 214278 209269 204171 199729 196850 194861 192416 189466 186815
56523 186815 184397 181577 178530 175765 172837 169072 164967 161369 157972 154227 150968 149358 148775 147557
56509 147557 145360 143167 141508 140311 139885 140402 140998 140946 140977 141861 142676 142310 141601 141871 142369 141583 140206 140262
56491A40262J591J524J146J897K637K164J736K586L380K706J787K200K964K530
56477A71110J671J888K697K895K855L286L445K703K230L020L957L801L267L219
56463B12044K756J208L1N18J428J141K78L5j77j171j920j389o15p48p95L42J470
56446B14436J139K96N02J164J005O33J102J482M04j325k054j931j984k005j547
56431B11317j562k811l969l585k480k146k250j834j492k041k513j724m60q0k68
56416A82102k08m01j321j847j074j41k82o82k26M25L89M00J104J480Q84O08J398
56399A82608J727O30j62P71J894J537Q57J240J382l1j236k19J636K012J637K367
56383A98650L386K853J585J533K187J857J076J343J997J616J009J647K545J989
$$ plain form
56491 140262 141853 143377 144523 146420 149057 151221 152957 155543 158923 161629 163416 165616 168580 171110
56477 171110 172781 174669 177366 180261 183116 186402 189847 192550 194780 197800 201757 205558 208825 212044
56463 212044 214800 216008 216039 216557 217985 219126 219404 219439 219262 218091 216171 214782 214167 213419 212624 212966 214436
56446 214436 215575 215871 216373 217537 218542 219175 220277 221759 222163 220838 218784 216853 214869 212864 211317
56431 211317 209755 206944 202975 199390 196910 194764 192514 190680 189188 187147 184634 182910 182450 182370 182102
56416 182102 181894 181493 180172 178325 177251 177110 176828 176146 175920 176345 176734 177134 178238 179718 180602 181210 182608
56399 182608 184335 184965 184803 185574 187468 189005 189862 191102 192484 192453 191217 190998 192634 194646 196283 198650
56383 198650 202036 204889 206474 208007 210194 212051 213127 214470 216467 218083 219092 220739 223284 225273
56369B25273Q40R12J611J348P82J311K002J316K66N52J193M90m14M57K023K005
56353B41967J112J529K724K694K006K589L682L093J481J373K750L467L341L932
56339B77740N001M946M215M710O332P390P761Q384Q645P515O174O240O684N829
56325C67566M892N818P132N986K985R75K52q74k022j535l09n57j656j474p31j638
56309C84810l237k646k72Q43K91L78J477J796J446K299M027M560M182M990O598
56294D11542O723N620N694O992P424P110Q222J0709J2385J3028J4229J5665J5787
56281E41130J5703J7966K1902K4562K5758K7723L0447L2073L3424L7122M2557
56270H50367M6723M9856N5165O3006P0495P6985Q4821R4322J03097J10783J19551
$$ plain form
56369 225273 226113 227025 228636 229984 230766 232077 234079 235395 235661 236213 237406 237896 237482 237939 239962 241967
56353 241967 243079 244608 247332 250026 252032 254621 258303 261396 262877 264250 267000 270467 273808 277740
56339 277740 282741 287687 291902 296612 302944 310334 318095 326479 335124 342639 348813 355053 361737 367566
56325 367566 372458 378276 385408 391394 394379 395354 395606 394732 392710 391175 390866 390309 388653 387179 386448 384810
56309 384810 381573 378927 378655 379498 379789 380167 381644 383440 384886 387185 391212 395772 399954 404944 411542
56294 411542 418265 423885 429579 436571 443995 451105 459327 470036 482421 495449 509678 525343 541130
56281 541130 556833 574799 596701 621263 647021 674744 705191 737264 770688 807810 850367
56270 850367 897090 946946 1002111 1065117 1135612 1212597 1297418 1391740 1494837 1605620 1725171
56259A725171J29404J37727J43993J50177J56048J58667J57001J52587J45403
56250C056178J33792J18581J02566Q5808O6260M5071K6145J0295n023j9938l1457
56239C588278l9027m5449n1720n6103n8887o2838o8262p2732p6233q1432q8468
56228B887127r4661r9870j06599j14291j19115j20148j20252j20145j17350j11756
56218A762940j06478j02149r6155q8389q2019p7424p1343o3131n6047n1106m5569
56207I23130l8761l3456l0096k5679j9867j6129j5290j3956j0974r310r898r761
56195F89953q062p803r565r766p185n133m966l711k80K028J706J663L334M115
56181F46328L035L017N030N929M520L920N433O046M402L344M075L801J641Q68
$$ plain form
56259 1725171 1854575 1992302 2136295 2286472 2442520 2601187 2758188 2910775 3056178
56250 3056178 3189970 3308551 3411117 3496925 3563185 3608256 3634401 3644696 3639673 3619735 3588278
56239 3588278 3549251 3503802 3452082 3395979 3337092 3274254 3205992 3133260 3057027 2975595 2887127
56228 2887127 2792466 2692596 2585997 2471706 2352591 2232443 2112191 1992046 1874696 1762940
56218 1762940 1656462 1554313 1458158 1369769 1287750 1210326 1138983 1075852 1019805 968699 923130
56207 923130 884369 850913 820817 795138 775271 759142 743852 729896 718922 709612 699714 689953
56195 689953 681891 674088 664523 654757 647572 642439 637473 633762 633482 635510 637216 638879 642213 646328
56181 646328 649363 652380 657410 663339 667859 671779 677212 683258 687660 691004 695079 698880 700521 701389
56167G01389K722L959L053K852M646N643M891N473Q358J0216R875J0715J4137
56154G87929J6964J7771J9446K3112K6044K8016L2827M1160M8897N4969O3660
56143A160795P6451Q9180J00148J13348J30335J46527J58806J68982J76377J75139
56133B496088J63217J46391J29604J11873R3506P9856P3050O7589N8742M7991
56123C467907L6289K0284R4j7221k7209l3723m0900m7592n4376o7290q8742j12319
56111C035202j31925j48373j62127j68176j64105j55306j46352j34879j19299
56102A704660j04245r2705q0968o7110n6000n0157m4355l5293k7771k5096k2477
56091A098483j6443j1668j1523j1123o810l340m313m763p91K707J673R23M592
$$ plain form
56167 701389 704111 708070 711123 713975 718621 724264 729155 734628 742986 753202 763077 773792 787929
56154 787929 804893 822664 842110 865222 891266 919282 952109 993269 1042166 1097135 1160795
56143 1160795 1237246 1326426 1426574 1539922 1670257 1816784 1975590 2144572 2320949 2496088
56133 2496088 2659305 2805696 2935300 3047173 3140679 3220535 3293585 3361174 3419916 3467907
56123 3467907 3504196 3524480 3524574 3507353 3480144 3446421 3405521 3357929 3303553 3236263 3147521 3035202
56111 3035202 2903277 2754904 2592777 2424601 2260496 2105190 1958838 1823959 1704660
56102 1704660 1600415 1507710 1426742 1359632 1303632 1253475 1209120 1173827 1146056 1120960 1098483
56091 1098483 1082040 1070372 1058849 1047726 1040916 1037576 1033263 1028500 1027709 1030416 1032089 1033012 1037604
56078A037604P850O365M757P365R857Q372P603J1222J3873J1401R299J2055J4213
56065A161836J1366R627J4192J8782J6961J3887J6001J9040J7387J5489J8578
56054A333146K1684J9419J7128K0685K4780K3068K0325K2673K5446K2900K0119
56043A571373K2993K6202K3598K0522K3237K6416K3960K1705K6275L2093L2784
56032A851158L4244M2555N0497N0519M9296N4466N9126N5200M9900N2424N6564
56021B405949N3638N0241N5398O2366O1584N9453O5466P3087P2757P1354P8728
56010C110021Q7603Q7458Q5565R2980J02656J03467J02724J11959J23788J26338
56000D134559J27071J37922J50798J53056J53044J64103J77870J80734J81712
$$ plain form
56078 1037604 1045454 1051819 1056576 1063941 1073798 1082170 1089773 1100995 1114868 1126269 1135568 1147623 1161836
56065 1161836 1173202 1182829 1197021 1215803 1232764 1246651 1262652 1281692 1299079 1314568 1333146
56054 1333146 1354830 1374249 1391377 1412062 1436842 1459910 1480235 1502908 1528354 1551254 1571373
56043 1571373 1594366 1620568 1644166 1664688 1687925 1714341 1738301 1760006 1786281 1818374 1851158
56032 1851158 1885402 1927957 1978454 2028973 2078269 2132735 2191861 2247061 2296961 2349385 2405949
56021 2405949 2459587 2509828 2565226 2627592 2689176 2748629 2814095 2887182 2959939 3031293 3110021
56010 3110021 3197624 3285082 3370647 3463627 3566283 3669750 3772474 3884433 4008221 4134559
56000 4134559 4261630 4399552 4550350 4703406 4856450 5020553 5198423 5379157 5560869
55991E560869J95500K13325K20296K25813K45567K69921K82682K94335L22226
55982G830534L55397L75435L94141M32113M78655N13545N49145O07678O76843
55973A2213486P34115P94367Q84364R91874J092842J206275J365376J558380J759943
55964B2601022J996153K311906K701934L149264L703248M435068N342098O383521
55956E2624214P577235Q966912J0546700J2350678J4573842J7458718K1117758
55949A45216057K5622356L1071467L7069737M1991573M3246805L8810104K8586014
55942C91614113J4283067j693768j6962233k9295199l7012773l9735780l8548786
55935B42648641l5162460l0934859k6616526k2608400j9108685j6103201j3482848
$$ plain form
55991 5560869 5756369 5969694 6189990 6415803 6661370 6931291 7213973 7508308 7830534
55982 7830534 8185931 8561366 8955507 9387620 9866275 10379820 10928965 11536643 12213486
55973 12213486 12947601 13741968 14626332 15618206 16711048 17917323 19282699 20841079 22601022
55964 22601022 24597175 26909081 29611015 32760279 36463527 40898595 46240693 52624214
55956 52624214 60201449 69168361 79715061 92065739 106639581 124098299 145216057
55949 145216057 170838413 201909880 238979617 280971190 324217995 363028099 391614113
55942 391614113 405897180 404203412 387241179 357945980 320933207 281197427 242648641
55935 242648641 207486181 176551322 149934796 127326396 108217711 92114510 78631662
55928G8631662j1217171r333638p791086o496707n413674m548295l859866l276851
55920B6694374k780182k388545k081076j808839j564651j372423j222459j080206
55912A2395993r45023q41317p63375o83534o03663n47013n08922m64095m13609
55903F625442l78911l57513l28223k92804k70845k59994k40724k14425j99154
55894D082849j93198j79005j58131j47508j45641j35908j19269j11636j12370
55885B780183j06319r3803q8868r0737q5746p4802p1271p4082o9769n8930n4613
55874A911243n6606n2738m3706m1771m6425m5477l8948l8371m3500m2640l5338
55863A425723l2477l4323l0106j9150j1611q495j100J0022J5148J4005J5150J7499
$$ plain form
55928 78631662 67414491 58080853 50289767 43793060 38379386 33831091 29971225 26694374
55920 26694374 23914192 21525647 19444571 17635732 16071081 14698658 13476199 12395993
55912 12395993 11450970 10609653 9846278 9162744 8559081 8012068 7503146 7039051 6625442
55903 6625442 6246531 5889018 5560795 5267991 4997146 4737152 4496428 4282003 4082849
55894 4082849 3889651 3710646 3552515 3405007 3259366 3123458 3004189 2892553 2780183
55885 2780183 2673864 2580061 2491193 2400456 2314710 2239908 2168637 2094555 2024786 1965856 1911243
55874 1911243 1854637 1801899 1758193 1716422 1669997 1624520 1585572 1547201 1503701 1461061 1425723
55863 1425723 1393246 1358923 1328817 1309667 1298056 1289561 1288461 1298483 1313631 1327636 1342786 1360285
55851A360285J1465j952j1983j7469k7008m0204m7304m7414m9087n2733n0229
55840A026367m2223l8154l8636l5103k7324k4053k5607k3060j5719j2522j4659
55829G29307j3516p574m954p174o459j461k5l706m676q51N88k481l465n11K20
55814F73262k599k796M49L86m043n901l729m296r159j1396q782p530r738r535
55800E94593n131k693m681n811l960l881o806p459m672m103p286q626o365n880
55786E17239q919j0107p378n655o857o457l305k820o970j0682j1500j3312j7377
55773D05900j9069j6896j5538j6737j6235j2679j0507j1062r937o132m687p083
55761B59338q070n317l294m320m548k227j280l243m034k101j540l786m527k082
$$ plain form
55851 1360285 1371750 1369798 1357815 1340346 1313338 1273134 1225830 1178416 1129329 1076596 1026367
55840 1026367 984144 945990 907354 872251 844927 820874 795267 772207 756488 743966 729307
55829 729307 715791 708217 703263 696089 689630 688169 688144 684438 679762 678911 679499 677018 673553 673042 673262
55814 673262 670663 667867 668316 668702 664659 658758 655029 650733 641574 630178 621396 613866 604128 594593
55800 594593 589462 586769 582088 576277 572317 568436 561630 554171 549499 545396 538110 529484 523119 517239
55786 517239 508320 498213 490835 485180 478323 471866 468561 465741 458771 448089 436589 423277 405900
55773 405900 386831 369935 354397 337660 321425 308746 298239 287177 277240 271108 266421 259338
55761 259338 251268 245951 242657 238337 233789 231562 230282 227039 223005 220904 219364 215578 211051 208969
55747B08969o76k158k640o06p5k407l151n47R52r01k211r29p23l193m186j786
55731A83732k64k035l213j210M58r04k467k028k056l840m318k386j663l458l720
55716A50628n56K103J785J583L410M168K423J899M465O349N313M800O881P860
55702B03111N229K433K261J780j542m722m870m247n306o134m979l997m473l657
55688A70887k41K424K330K636N703Q848R696J0223J1798J1822R188P440Q532R023
55674B70309O419L741L695L960K464J802L936N790M659K845K655J766j903n705
55660C06433o994p595r340r975p834n742n987o173m204k581l362l856j864l30
55646B30596k119m795n335n454p474r293q443o967p486q374p504o704p804q336
$$ plain form
55747 208969 208293 206135 203495 202889 202814 200407 197256 196709 197661 196760 194549 193620 192897 189704 185518 183732
55731 183732 183468 181433 178220 177010 177468 176564 174097 172069 170013 166173 161855 159469 157806 154348 150628
55716 150628 150072 152175 153960 155543 158953 163121 165544 167443 171908 178257 183570 188370 195251 203111
55702 203111 208340 210773 213034 214814 213272 208550 203680 199433 194127 187993 183014 179017 174544 170887
55688 170887 170646 173070 175400 178036 183739 192587 202283 212506 224304 236126 245314 252754 261286 270309
55674 270309 276728 280469 284164 288124 290588 292390 296326 302116 306775 309620 312275 314041 312138 306433
55660 306433 299439 291844 282504 272529 264695 258953 252966 246793 242589 240008 236646 232790 230926 230596
55646 230596 228477 223682 218347 212893 205419 196126 187683 180716 173230 164856 157352 150648 142844 134508
55632A34508n923l118l068m187l791l182m340n310l774j741j830k416j136J74
55618I0866j060l057k872j586j633k029q83L22l96j341l06J010K72q45J32J587
55602G8181P94r14p01O29N73l93n04n71j903k764j264O31K15j237j032P4j84j121
55584F8509q43k18r63j882j050L38K18m44J97J064L48p77m31K51n57j575p79P32
55566F2138Q70L38O05P09l95q81P83K410J645K18O62J718J144K97J389K852K099
55549G8601N73J261L373M040L416L500L804K703J359J895L220K992J983K419L679
55534A18818L822L556M517N391M004J627R89J628J326M44P04J314M20j263k136
55519A45161l181n674p633o824n184n828p657p605o213o122o774n736l784l596
$$ plain form
55632 134508 128585 125467 122399 118212 114421 111239 106899 101589 97815 96074 94244 91828 90692 90866
55618 90866 89806 86749 83877 82291 80658 78629 77746 78068 77672 76331 76025 77035 77307 76462 76594 78181
55602 78181 78975 78061 77360 77989 78562 78169 77665 77094 75191 72427 71163 71794 72009 70772 69740 69814 69630 68509
55584 68509 67666 67448 66485 64603 63553 63891 64109 63665 63862 64926 65274 64497 64066 64317 63760 62185 61406 62138
55566 62138 63008 63346 63951 64660 64265 63384 64167 66577 68222 68440 69102 70820 71964 72261 73650 76502 78601
55549 78601 79174 80435 83808 87848 91264 94764 98568 101271 102630 104525 107745 110737 112720 115139 118818
55534 118818 122640 126196 130713 136104 140108 141735 142724 144352 145678 146122 146826 148140 148560 147297 145161
55519 145161 141980 136306 128673 121849 116665 110837 103180 95575 89362 83240 76466 70730 66946 63350
55505F3350m597m113k469k081k581j788n10j289l190k901n58N21m54j084n97p06
55489C4953j603j534m04J38J08Q65J765R70q86j596j280j581j929n80J334J172
55473B9912n53j101l32l27r65l25J023P48o45n47P92O06j198j874q02j60m56P1
55455B3867J358J278j58n53M89Q17q9m49lm21j534j220N04J245M90K48J022J078
55437B7969J43j20L06m19k079k279p36K02j24J95J545J826M90l11L52Q33L94N32
55419B8719J736K264J219j67j052j797j900l40J702J853N66O22K267K766J302
55404C9760K92R25J276Q7j201j456j481j555o52P55M98j539k641j479J04N12M63
55387C2668N25k04j640k002q59p4o13j171r73j034j598j241L43J432J172P25P20
$$ plain form
55505 63350 58753 54640 52171 50090 47509 45721 45211 43922 40732 37831 37273 37794 37340 36256 35659 34953
55489 34953 33350 31816 31412 31550 31658 32523 34288 35258 34372 32776 31496 29915 27986 27406 28740 29912
55473 29912 29359 28258 27926 27599 26634 26309 27332 28080 27435 26888 27680 28286 27088 25214 24412 24252 23796 23867
55455 23867 25225 26503 26345 25792 26281 27098 27009 26560 26557 26136 24602 23382 23886 25131 25621 25869 26891 27969
55437 27969 28112 27992 28298 27879 25800 23521 22785 22987 22863 23058 24603 26429 26919 26608 26960 27793 28187 28719
55419 28719 30455 32719 33938 33771 32719 30922 29022 28682 30384 32237 32803 33425 35692 38458 39760
55404 39760 40052 40977 42253 42340 41139 39683 38202 36647 35995 36750 37248 35709 33068 31589 31693 32205 32668
55387 32668 33193 32989 31349 29347 28488 28414 27801 26630 25657 24623 23025 21784 22127 23559 24731 25456 26176
55370B6176K99n55n71J83R2r16j059j24J7r87j160J30R91N47L02Q12M28j254k056
55351B1295r09K18k83j164r46k78n9K56R35R99K72P7O87O01n77j163l77L02q4
55332A9802n42n31j016j953j594M39K076K073J649J672J106m34j363q66k80m08
55316A9830j39R52J398O03L7L39J16j063j410k51M79k74p00M46J362M03r93q74
55298B0261Q6L07N8K94O43M65K77L64j26j324j749o47P12J310J732K164J447m70
55280B5804j636j121n23j000j404q46m72r68r28L84J250M98k33O91K114K255J497
55263B5362R37K48r70j670j145m31l12P9J116J486P49N57J537J680j17j673j081
55246B6352M5l92j287o49O10M46n97o03K12K86k25o0M59P8q25q46p6K88J50K71
$$ plain form
55370 26176 26475 25920 25349 25532 25624 24708 23649 23525 23542 22555 21395 21525 22516 23063 23365 24177 24605 23351 21295
55351 21295 20386 20604 20321 19157 18211 17933 17874 18130 19065 20064 20336 20413 21100 21701 21124 19961 19584 19886 19802
55332 19802 19260 18729 17713 15760 14166 14605 16681 18754 20403 22075 23181 22747 21384 20518 20238 19830
55316 19830 19691 20643 22041 22644 22681 23020 23136 22073 20663 20412 20891 20617 19917 20363 21725 22128 21135 20261
55298 20261 20347 20654 20712 21006 21649 22114 22391 22755 22629 21305 19556 18909 19621 20931 22663 24827 26274 25804
55280 25804 24168 23047 22524 21524 20120 19274 18802 17834 16906 17290 18540 19038 18805 19496 21610 23865 25362
55263 25362 26299 26547 25577 23907 22762 22331 22019 22098 23214 24700 25449 26006 27543 29223 29106 27433 26352
55246 26352 26397 26005 24718 24069 24679 25125 24528 23925 24137 24423 24198 24138 24597 24675 23850 23004 22928 23216 23366 23637
55226B3637N08K48j08J23M39O4n01l31L18P08R29J225J096K89l71l26k03l09K15
55207B7650J565K280J475L28K2r3p90j219n66K20K7n98p26o04n37jQ17N36r21
55188B8865j478j69J025M68m46M6R99Q45L70R21J567Q08m42l87M89M98k27l92
55170C3360j35m62r62n24M63P65L70L3l31j003j309q00m10p89r62k84k0j035j797
55151B4168q57M56L12l82K39J554J646O93L57P06N31r3j52J40j08m14K48J336
55133C0380J641J427J560J504M08q01p44M2K20J01N89R29K9j060o39N83O69k29
55115C6609l94K03O7r25j410j060p55n73P1O88L44l73j69P16J097J017J194J149
55097C7496J91n77K58J732J818P42L87R53J033M80N20J161J160M40J13K41o0n54
$$ plain form
55226 23637 24145 24393 24285 24408 24847 24911 24410 24079 24397 25105 26034 27259 28355 28644 28273 27947 27744 27435 27650
55207 27650 29215 31495 32970 33298 33320 33227 32437 31218 30652 30872 30899 30301 29575 28971 28434 28433 29250 29786 28865
55188 28865 27387 27218 28243 28711 28265 28311 29310 30155 30525 31446 33013 33821 33379 32992 33481 33979 33752 33360
55170 33360 33225 32763 31801 31277 31740 32505 32875 32908 32577 31574 30265 29465 29055 28266 27304 27020 27000 25965 24168
55151 24168 23311 23767 24079 23697 23936 25490 27136 27829 28186 28892 29423 29330 29178 29318 29210 28796 29044 30380
55133 30380 32021 33448 35008 36512 36920 36119 35375 35417 35637 35738 36327 37256 37285 36225 35586 36169 36838 36609
55115 36609 36215 36418 36485 35560 34150 33090 32335 31762 31833 32521 32865 32492 32323 33039 34136 35153 36347 37496
55097 37496 37687 37110 37368 39100 40918 41660 42047 43000 44033 44513 45033 46194 47354 47794 47907 48148 48088 47534
55079D7534k48M64L80j29K70J261J312M80K08N83L97k37M9J148J415M41m66p20
55061E4142r59j107l10R92J305N59J31L63K43l42l48K62L81p0j3N97O61J81L66
55042E7034J275J584Q80J63k03q53j579j322k19M29M55R33J826J789O37k39k33
55025F2357k23n31l48L89O30J31j88j65o34j479j545q19n92j074r90oN39k6o43
55006E4783m71p2k3n5r8n02q83l97N14M22p22j359p51J57N99Q27Q80L88r4N43
54986E3686J899K321J532J046J656K440K687K788K827K295J614J962L098L361
54972H5212K422J911K794M093M921N755O993Q095Q962J0390J2468J4206J5309
54959A83531J6564J7972J8277J6918J4606J1537O965J174m100p916j0992j3784
$$ plain form
55079 47534 47286 47750 48130 48001 48271 49532 50844 51324 51532 52115 52512 52275 52324 53472 54887 55328 54862 54142
55061 54142 53183 52076 51766 52758 54063 54622 54753 55116 55359 55017 54669 54931 55312 55242 55229 55826 56487 56668 57034
55042 57034 58309 59893 60773 60936 60733 59880 58301 56979 56760 57189 57644 58577 60403 62192 62829 62590 62357
55025 62357 62134 61603 61255 61644 62274 62405 62217 62052 61418 59939 58394 57575 56983 55909 54919 54913 55452 55426 54783
55006 54783 54312 54240 54217 54162 54064 53562 52679 52282 52796 53218 52496 51137 50386 50543 51142 51969 52849 53237 53143 53686
54986 53686 55585 57906 59438 60484 62140 64580 67267 70055 72882 75177 76791 78753 81851 85212
54972 85212 87634 89545 92339 96432 101353 107108 114101 122196 131158 141548 154016 168222 183531
54959 183531 200095 218067 236344 253262 267868 279405 286370 287544 283444 275528 264536 250752
54947B50752j5585j6168j6359j6346j5305j3343j1768j0845r355p078n477n071
54935A08052m363k511q25m29m58O5N40L86N15J689K997L502L896N134O816Q246
54919A33252R797J1907J3861J4832J5083J5030J4273J2472J0122P492M020m52
54907B61689m937q676j1918j4627j5868j5375j4383j3879j3374j2233j0854r577
54895A15988p882n732m318m292m507l673k145r83l77j02m06j376k258k485k452
54880G3000k565k431j781j204j130j084o90m38p36j168j325j409j465j033j22
54865E4419M88L98Qm37j078j478r33M0Q3q13j101k44N02L26O4K82J45p64j324
54846D8583p45O3K47M93J480K272J717K60q42j138q22j0Q76J074O16M72R56J258
$$ plain form
54947 250752 235167 218999 202640 186294 170989 157646 145878 135033 125678 118600 113123 108052
54935 108052 103689 101178 100353 99924 99466 99531 100071 100457 100972 102661 105658 109160 113056 118190 125006 133252
54919 133252 143049 154956 168817 183649 198732 213762 228035 240507 250629 258121 262141 261689
54907 261689 256752 248076 236158 221531 205663 190288 175905 162026 148652 136419 125565 115988
54895 115988 108106 102374 98056 93764 89257 85584 83439 82456 82079 81977 81571 80195 77937 75452 73000
54880 73000 70435 68004 66223 65019 63889 62805 62115 61677 60941 59773 58448 57039 55574 54541 54419
54865 54419 54907 55305 55313 54876 53798 52320 51387 51427 51510 50697 49596 49352 49854 50180 50244 50526 50671 49907 48583
54846 48583 47838 47901 48148 48641 50121 52393 54110 54370 53528 52390 51568 51558 52434 53508 54124 54596 55552 56810
54828E6810J138J495K516K966K205J326J302J565J490J631K368K906K825L054
54814H5597M160N186N451N944P609R717J1345J2955J5052J6698J6952J6489J6263
54801B29418J5707J3768J0599O871K487k577p213j0397j2508j4155j4838j4108
54789B03054j2878j2158j1501j0102q425p345o618n565m422l659k885j617l25
54776A15554M50J025J681J955J896K664M644O338O530O320P400R521J1289J2499
54762A89766J3957J5726J7121J7826J7750J6392J3571J0105O792L456j80l724
54750C18558o986j0341j3375j4755j4438j4343j5480j6210j4968j2908j1953j1797
54738A61004j1011r735r072q787p789o100m503k991j385n56j179k253k604k787
$$ plain form
54828 56810 57948 59443 61959 64925 67130 68456 69758 71323 72813 74444 76812 79718 82543 85597
54814 85597 89757 94943 100394 106338 113947 123664 135009 147964 163016 179714 196666 213155 229418
54801 229418 245125 258893 269492 276363 278850 276273 269060 258663 246155 232000 217162 203054
54789 203054 190176 178018 166517 156415 147990 140645 134027 128462 124040 120381 117496 115879 115554
54776 115554 116004 117029 118710 120665 122561 125225 129869 136207 142737 149057 156457 165978 177267 189766
54762 189766 203723 219449 236570 254396 272146 288538 302109 312214 319006 322462 322282 318558
54750 318558 311572 301231 287856 273101 258663 244320 228840 212630 197662 184754 172801 161004
54738 161004 149993 140258 131186 122399 114610 108510 104007 101016 99631 99075 97896 95643 93039 90252
54724I0252l568l824k219jM75o72j191k48Q37J129J017O44m03j608j737p12L13
54707G8484Q18J289J737J522P19J51L0j27l07o8L29J92l64o92q39j225j467r38
54689G9244j47o1l18L17J854K854K390J015j94n46J35J335J995J739J444J801
54673I4857K170J870J610K255L133L156K865L598N226O384O534O198N573M531
54659A49960L570L259L148K616K223K723L439L288K742L025L980M575N011O315
54645A99874Q238R526J0031J0570J0927R965P610M895K092j331n015p866r871
54632B49645j1918j3772j4192j3114j1933j1312j0517r149p852o963o005m889
54620A28029m136l703k893j673q02n38l74m2L25Q78J684K078J621J169J549J859
$$ plain form
54724 90252 86684 82860 80641 80640 81115 80443 79252 79004 79841 80970 81987 82631 82228 80620 78883 78171 78484
54707 78484 79302 80591 82328 83850 84569 84720 84750 84623 84316 84248 84577 84769 84405 83713 82874 81649 80182 79244
54689 79244 79097 79036 78718 79035 80889 83743 86133 87148 86954 86408 86543 87878 89873 91612 93056 94857
54673 94857 97027 98897 100507 102762 105895 109051 111916 115514 120740 127124 133658 139856 145429 149960
54659 149960 153530 156789 159937 162553 164776 167499 170938 174226 176968 179993 183973 188548 193559 199874
54645 199874 208112 217638 227669 238239 249166 259131 266741 271636 273728 272397 267382 259516 249645
54632 249645 237727 223955 209763 196649 184716 173404 162887 153738 145886 138923 132918 128029
54620 128029 123893 120190 117297 115624 114822 114284 113910 113868 114193 115071 116755 118833 120454 121623 123172 125031
54604A25031Q46p20j054k40R6m11p23q83k066l940m535l277j908j695j933j898
54588A00690k181l091l639l141k314j870j518j100j236k029k519k152j546j139
54574G1215m48O72J356J055L79l3l41p01p51m47l16m10j29N87R93Q24O50O75M52
54555G5282O5K54R89J287Q28M61O99R59Q19P10R11J064J115J599K544L283L642
54538I6511M138M773M918M665M922N842O491O370N933N223L568J049j147k383
54524A50873l201l949m240m217m773n882o282n414m318l828l416k547j827j848
54510I5131k137k042j618r99k0R20Q35k98j174r71m11l26l93o1M02N54N05L97
54492H8294Q9j31L86J382J692R45J28j13l41r34j197p14k32l72n53j62L08K32
$$ plain form
54604 125031 125877 125157 124103 123863 123959 123548 122825 121942 119876 115936 111401 108124 106216 104521 102588 100690
54588 100690 98509 95418 91779 88638 86324 84454 82936 81836 80600 78571 76052 73900 72354 71215
54574 71215 70767 71439 72795 73850 74229 74196 73855 73154 72403 71956 71640 71230 71101 71688 72681 73505 74155 74830 75282
54555 75282 75347 75601 76590 77877 78705 79166 79865 80824 81643 82353 83264 84328 85443 87042 89586 92869 96511
54538 96511 100649 105422 110340 115005 119927 125769 132260 138630 144563 149786 153354 154403 153256 150873
54524 150873 147672 143723 139483 135266 130493 124611 118329 112915 108597 104769 101353 98806 96979 95131
54510 95131 92994 90952 89334 88335 88315 89235 90070 89772 88598 87627 87216 86890 86497 86436 86838 87392 87897 88294
54492 88294 88383 88252 88638 90020 91712 92657 92785 92672 92331 91397 90200 89486 89254 88882 88329 88167 88475 88707
54474H8707m8K1J39k35q99j276j150o30k2Nr60k151k260j241l32p8K49R96J373
54455H0208R29L18nn02j243j332m21N02O66N44N60J82p81j298o68K14K81r6J2
54436G8070N03O85N22M02K83k4k85k76k36k82r5L76O09L65P7P0J87M48J059J536
54416H3994J063m2m83P5N86N30P01J518K138K011J843K195K504K352K366K952
54400A06303L408L218K968L216L566L689L962M383M180L242K556K452J923N06
54386A49572p76j256j765k822l404k770j978k155k750k931l180l967m233k941
54372A12644j092m49j129j907k088j764j027k07r1p88j284j040q31j111j011j54
54356I6671K05o35j146R3J902K340J803K055L093L244J964N05P6Q98K674M598
$$ plain form
54474 88707 88659 88680 88819 88584 87685 86409 85259 84629 84607 84612 83652 81501 79241 78000 77668 77590 77839 78835 80208
54455 80208 81137 81455 81450 80948 79705 78373 77952 78454 79120 79664 80224 80406 79625 78327 77659 77873 78154 78058 78070
54436 78070 78573 79258 79780 80182 80465 80441 80156 79880 79644 79362 79267 79643 80252 80617 80694 80764 80951 81399 82458 83994
54416 83994 85057 85015 84532 84607 85193 85723 86424 87942 90080 92091 93934 96129 98633 100985 103351 106303
54400 106303 109711 112929 115897 119113 122679 126368 130330 134713 138893 142135 144691 147143 149066 149572
54386 149572 148796 147540 145775 142953 139549 136779 134801 132646 129896 126965 123785 119818 115585 112644
54372 112644 111552 111103 109974 108067 105979 104215 103188 102981 102890 102102 100818 99778 98947 97836 96825 96671
54356 96671 96876 96241 95095 95188 97090 99430 101233 103288 106381 109625 111589 112094 112170 113068 115742 120340
54340A20340N366M584L524L313L246K238Q38J14l53j526k861l170k764k762k989
54325A27138k532j832k052k917l221l057l436m030l545k231j746k453k929k469
54311H8688k009k157k160j480p51n69o54o98q29r17n80j40m17j270j591r88l20
54294G1158k81n67p41q98j130j203j096j093j169r87n83l32k91k15j21r8J26P72
54276F1251J404J492J238J034O49j87q31n14L72Q07O09L74L27K81L46O17O16K8
54258F9913m85k14L28K41k73m67m24n74n04L21J238J241O93O38R03N61k24n51
54240G2361n58j019j487q17O08J181O31L03P34R28L86p4l0j78p78j016n75l31
54222G0269p88j212j005o66p04q10o48m82m36j79K54L62K42O26J464J698R01m6
$$ plain form
54340 120340 125706 130290 133814 137127 140373 142611 143449 143563 143210 141684 138823 135653 132889 130127 127138
54325 127138 124606 122774 120722 117805 114584 111527 108091 104061 100516 98285 96539 94086 91157 88688
54311 88688 86679 84522 82362 80882 80131 79562 78908 78210 77381 76464 75884 75744 75327 74057 72466 71478 71158
54294 71158 70877 70310 69569 68671 67541 66338 65242 64149 62980 61993 61410 61078 60787 60572 60451 60353 60479 61251
54276 61251 62655 64147 65385 66419 67068 66881 66050 65536 65908 66715 67324 67698 68025 68306 68652 69269 69885 69913
54258 69913 69428 69214 69542 69783 69510 69043 68619 68045 67541 67862 69100 70341 71034 71672 72575 73136 72912 72361
54240 72361 71803 70784 69297 68480 69088 70269 70900 71203 71937 72865 73251 73177 73147 72969 72191 71175 70600 70269
54222 70269 69481 68269 67264 66598 65894 65084 64436 63954 63518 63339 63593 63955 64197 64823 66287 67985 68886 68840
54204F8840l64l37k93J45J103J756J353K61o40r64q35m80k18k41l11j60j93q68
54186F7554j653j556p25k64m42l60L66Q83N66m1k79l06l93k78J73M52J53m28q27
54167F2595q92n00M15J294J278L97l17k39J66L42M98R56J416J415J013N98L59
54150G0794K40Q2k33n66n38n0M81P86J077J273P10o02j306m89O65M77o47r09j2
54131G1233N27j30j139j614j608j232l67M33K91m61n49J39L34m58j134q61j88
54114F3216K37O10R78P77j8n21l38j08j41J24P40Q15O6n35m36l97r73j439j154
54095F1503o57n38l91K03P32P01M40K19l29j125j244m11K87J48kN97J187R05N05
54076F2730J178K502K998K138O12q86j947k082j188o5M38M98P37J140J295J227
$$ plain form
54204 68840 68476 68139 67846 67991 69094 70850 72203 72464 71824 70860 70025 69545 69327 69086 68775 68615 68422 67554
54186 67554 65901 64345 63620 63356 62914 62554 62920 63803 64369 64328 64049 63743 63350 63072 63245 63697 63850 63422 62595
54167 62595 61703 61203 61618 62912 64190 64587 64270 64031 64197 64539 65037 65993 67409 68824 69837 70435 70794
54150 70794 71034 71116 70883 70317 69779 69729 70210 70996 72073 73346 74056 73454 72148 71659 72324 72801 72154 71245 71233
54131 71233 71760 71630 70491 68877 67269 66037 65670 66103 66394 65933 65384 65523 65857 65399 64265 63404 63216
54114 63216 63453 64063 65041 65818 65800 65279 64941 64833 64692 64816 65556 66371 66437 65902 65466 65069 64096 62657 61503
54095 61503 60846 60308 59917 60120 60852 61553 61993 62212 61883 60758 59514 59103 59390 59538 59536 60133 61320 62225 62730
54076 62730 63908 66410 69408 71546 72158 71272 69325 67243 66055 65990 66428 66926 67663 68803 70098 71325
54060G1325J141Q53K18l04k34K56P76J284J674J516Q78O35J195J752J585J315
54044H5865J843K703K689J714R15J139K145L188L655L306K547K219K690L435L957
54029A24010M567N705O972P563P303O667O058N561N139M690M184L941M240M586
54015B01186M100K897K149K361K620K045J069M15j35j096k142k627k693k929l389
54000B03831l784m195m790n345n611n719n608m781l318k379k742l539l446k559
53986A46015j990k077k162j901j648j544j207n02J40L04j6n53r11p27r8L31Q8
53969A31542n57j042j110o79L34J600K299K109J747K011K682L021K898K687K434
53954A51976J886J124N30K50K09M58J011J604J988K241K440K350J893J576J964
$$ plain form
54060 71325 72466 73319 73537 73233 72999 73255 74031 75315 76989 78505 79383 80018 81213 82965 84550 85865
54044 85865 87708 90411 93100 94814 95729 96868 99013 102201 105856 109162 111709 113928 116618 120053 124010
54029 124010 128577 134282 141254 148817 156120 162787 168845 174406 179545 184235 188419 192360 196600 201186
54015 201186 205286 208183 210332 212693 215313 217358 218427 218842 218707 217611 215469 212842 210149 207220 203831
54000 203831 200047 195852 191062 185717 180106 174387 168779 163998 160680 158301 155559 152020 148574 146015
53986 146015 144025 141948 139786 137885 136237 134693 133486 132984 133124 133428 133412 132859 131948 131221 131123 131454 131542
53969 131542 130985 129943 128833 128154 128488 130088 132387 134496 136243 138254 140936 143957 146855 149542 151976
53954 151976 153862 154986 155516 155766 155975 156433 157444 159048 161036 163277 165717 168067 169960 171536 173500
53939A73500K976M089M913N243M943M124L160K178R24n90j800k292k364k438k410
53924A94156j929j033p6O58J081J346J881K961M196M876M873M638M408M086L857
53909B29979M105M685N149N620O453P123O685N453M726M660L930K023K21l76l85
53894B90051p58j291j531j838k504k940k848l092m280n558n987o038o479o874
53880B38033o522n985o171o669o424n475m701m344m008l658l485l301l042l246
53866A71002m027m368l572k581k665l552m106m103l961l519k520j606j432j391
53852A27599p23q0m56j228j100l64l92j246j764j721j890k134j495l18j90j347
53836A11151k067j265j5L37Jj72j55l65o75p20n00j41L79Q75R06M49O1J15M43
$$ plain form
53939 173500 176476 180565 185478 190721 195664 199788 202948 205126 206050 205460 203660 201368 199004 196566 194156
53924 194156 192227 191194 191118 191776 192857 194203 196084 199045 203241 208117 212990 217628 222036 226122 229979
53909 229979 234084 238769 243918 249538 255991 263114 269799 275252 279978 284638 288568 290591 290812 290436 290051
53894 290051 289293 288002 286471 284633 282129 279189 276341 273249 268969 263411 257424 251386 244907 238033
53880 238033 231511 225526 219355 212686 206262 200787 196086 191742 187734 184076 180591 177290 174248 171002
53866 171002 166975 162607 159035 156454 153789 150237 146131 142028 138067 134548 132028 130422 128990 127599
53852 127599 126876 126796 126340 125112 124012 123648 123256 122010 120246 118525 116635 114501 113006 112688 112498 111151
53836 111151 109084 107819 107804 108141 108142 107970 107815 107450 106775 106055 105555 105414 105793 106668 107574 108023 108084 108199 108642
53817A08642Q42J319J753J911J857J778J502Q12J02J1M42P89R63J424K226K829
53801A29202K942K846K957L504M470N362N404M567L875L983M182L675L095L451
53787A83515M295M326L450K652K205J532O96M14O27N24R2J07N58N55m8m99p36
53770B04265j499k602k808j945j526k535m037m756m626m089l118j926j433k017
53756A65348k694k460j642j077p84l85m9j40l93l02R9M85Q41J221J329R36L62
53739A60695R7J95M01M86K92j78n34l20K49M68R1m28p22q66q77o40m43p58j284
53720A55924j155l39Q0n52j498j704j083k20M56O85K63n22q58l55M93J147J656
53703A52418K127K209J733J248J336J816K178K402K826L454L927M005L750L390
$$ plain form
53817 108642 109484 110803 112556 114467 116324 118102 119604 120416 120518 120529 120971 121760 122723 124147 126373 129202
53801 129202 132144 134990 137947 141451 145921 151283 156687 161254 165129 169112 173294 176969 180064 183515
53787 183515 187810 192136 195586 198238 200443 201975 202671 203085 203712 204236 204328 204435 204993 205548 205500 205001 204265
53770 204265 202766 200164 197356 195411 193885 191350 187313 182557 177931 173842 170724 168798 167365 165348
53756 165348 162654 160194 158552 157475 156691 156306 156257 156117 155724 155422 155521 156006 156847 158068 159397 160333 160695
53739 160695 160792 160987 161388 161874 162166 161988 161454 161134 161383 161851 161942 161514 160792 159926 159049 158409 157966 157208 155924
53720 155924 154769 154430 154510 153958 152460 150756 149673 149453 149909 150594 150857 150335 149477 149122 149615 150762 152418
53703 152418 154545 156754 158487 159735 161071 162887 165065 167467 170293 173747 177674 181679 185429 188819
53689A88819L220L397L710L815L756L902M341M720M814M824M929N001M904M671
53675B48823M327L782L030K136J194M70K97M74J39j060k164k056j053l94m52n55
53659B56938m42o24j190j499j332j272j593j792j579j377j441j372r67o86q19
53644B38953j005r36p91o05j02N00M06n12j263j045k52L74P17Q69N51k65q27n13
53626B34254K65P32Q46J017J169Q59J61k80p3N42J155J643K080K427K484K230
53610B51511K126K689L702M300M168M066M627N230M922M011L654M199M963N490
53596C09658N923O155N836N313N401O107O569O399O084N910N638N370N650O419
53582C92432O964P036P013O875O220N405N368O086O546O435O424O491N652L834
$$ plain form
53689 188819 192039 195436 199146 202961 206717 210619 214960 219680 224494 229318 234247 239248 244152 248823
53675 248823 253150 256932 259962 262098 263292 263762 264059 264533 264672 263612 261448 259392 258339 257945 257493 256938
53659 256938 256496 255872 254682 253183 251851 250579 248986 247194 245615 244238 242797 241425 240458 239772 238953
53644 238953 237948 237012 236221 235616 235514 236014 236420 235908 234645 233600 233348 233722 234439 235308 235859 235594 234767 234254
53626 234254 234519 235251 236097 237114 238283 239142 239303 239023 238950 239492 240647 242290 244370 246797 249281 251511
53610 251511 253637 256326 260028 264328 268496 272562 277189 282419 287341 291352 295006 299205 304168 309658
53596 309658 315581 321736 327572 332885 338286 344393 350962 357361 363445 369355 374993 380363 386013 392432
53582 392432 399396 406432 413445 420320 426540 431945 437313 443399 449945 456380 462804 469295 474947 478781
53568D78781K387K044J960J515J393J967K232J549Q56Q93O84o79k094k025r51
53553D90512m61p41p63m07o24j598k367k308j816j396j129r74q82o83m38o08j223
53536D72094j456p48J91L33j79m25m3O94J649K693L279L104K804L071L535L486
53520D94082L275L860N288O696P603Q241Q831R444J0412J1879J3167J3530J3416
53507F09724J3992J5435J6707J7044J6827J6858J7589J9081K1054K2880K4124
53496H11315K5167K6641K8303K9140K8744K8003K8125K9308L0603L1005L0577
53485A126931L0418L1324L2680L3144L2375L1322L0768L0473L0113L0067L0634
53474A470249L1372L1897L2505L3260L3246L1732K9423K7570K6353K5125K3689
$$ plain form
53568 478781 481168 483212 485172 486687 488080 490047 492279 493828 494684 495577 496261 495582 493488 491463 490512
53553 490512 490051 489310 488547 488140 487516 485918 483551 481243 479427 478031 476902 475928 475046 474363 473925 473317 472094
53536 472094 470638 469890 470081 470414 470235 469810 469767 470461 472110 474803 478082 481186 483990 487061 490596 494082
53520 494082 497357 501217 506505 513201 520804 529045 537876 547320 557732 569611 582778 596308 609724
53507 609724 623716 639151 655858 672902 689729 706587 724176 743257 764311 787191 811315
53496 811315 836482 863123 891426 920566 949310 977313 1005438 1034746 1065349 1096354 1126931
53485 1126931 1157349 1188673 1221353 1254497 1286872 1318194 1348962 1379435 1409548 1439615 1470249
53474 1470249 1501621 1533518 1566023 1599283 1632529 1664261 1693684 1721254 1747607 1772732 1796421
53463A796421K2290K0694J8434J5807J3703J2487J1864J1601J1575J1334J0390
53452A956600Q851P165N464L692J990L40j768m570p455r864j2172j4848j7366
53439A916059j9043k0422k2528k5166k7189k8288k9156k9982l0207k9939l0289
53428A623850l1825l3674l4612l4251l2864l0853k8807k7456k6913k6421k5201
53417A290973k3294k1383j9934j8729j7124j4768j2043r641p688n672l302q33
53405A136562J635M444P506R951J1334J2469J4411J7122J9906K2491K4831K6530
53393A309192K7448K8349K9942L1815L3234L4501L6380L8802M1237M3877M7031
53382A701808M9824N1121N1551N2984N5936N9031O1240O3151O5532O8028O9971
$$ plain form
53463 1796421 1818711 1839405 1857839 1873646 1887349 1899836 1911700 1923301 1934876 1946210 1956600
53452 1956600 1965451 1972616 1978080 1981772 1983762 1984102 1982334 1977764 1970309 1960445 1948273 1933425 1916059
53439 1916059 1897016 1876594 1854066 1828900 1801711 1773423 1744267 1714285 1684078 1654139 1623850
53428 1623850 1592025 1558351 1523739 1489488 1456624 1425771 1396964 1369508 1342595 1316174 1290973
53417 1290973 1267679 1246296 1226362 1207633 1190509 1175741 1163698 1154057 1146369 1140697 1137395 1136562
53405 1136562 1138197 1142641 1150147 1160098 1171432 1183901 1198312 1215434 1235340 1257831 1282662 1309192
53393 1309192 1336640 1364989 1394931 1426746 1459980 1494481 1530861 1569663 1610900 1654777 1701808
53382 1701808 1751632 1802753 1854304 1907288 1963224 2022255 2083495 2146646 2212178 2280206 2350177
53371B350177P1390P2522P3215P3393P3412P3398P2841P1329O9094O6531O3741
53360C131043O0801N7840N4557N0345M5347M0759L7583L5422L2923K9163K4332
53349C600115J9272J4565J0017N033n44o254j1953j8388k6332l5459m4685n3290
53337C452097o1056o7598p2332p5096p6209p6030p4962p3559p2115p0476o8764
53326B663900o7784o7910o8242o7734o6660o5855o5087o3473o1100n8821n6637
53315A954597n3751n0232m7071m4415m1228l7118l3083k9963k7439k5075k3179
53304A542043k1898k0544j8576j6364j4343j2324j0205q532p558o524m686k527
53292A397962j078m78QP85J508J829K005K645M061O040Q111J0057J1963J3869
$$ plain form
53371 2350177 2421567 2494089 2567304 2640697 2714109 2787507 2860348 2931677 3000771 3067302 3131043
53360 3131043 3191844 3249684 3304241 3354586 3399933 3440692 3478275 3513697 3546620 3575783 3600115
53349 3600115 3619387 3633952 3643969 3649002 3648458 3642204 3630251 3611863 3585531 3550072 3505387 3452097
53337 3452097 3391041 3323443 3251111 3176015 3099806 3023776 2948814 2875255 2803140 2732664 2663900
53326 2663900 2596116 2528206 2459964 2392230 2325570 2259715 2194628 2131155 2070055 2011234 1954597
53315 1954597 1900846 1850614 1803543 1759128 1717900 1680782 1647699 1617736 1590297 1565222 1542043
53304 1542043 1520145 1499601 1481025 1464661 1450318 1437994 1427789 1419257 1411699 1405175 1400489 1397962
53292 1397962 1396884 1396406 1396414 1397199 1398707 1400536 1402541 1405186 1409247 1415287 1423398 1433455 1445418 1459287
53278A459287J5719J7812K0744K4469K7925L0187L1482L2409L2791L2282L1529
53267A756636L1553L2205L2447L1985L1442L0947K9905K8213K6515K5041K3407
53256B080296K1685K0543J9978J9089J7363J5073J2245Q477M131L41k627n774
53244B210820r620j3371j6490j9765k3851k7917l0783l2587l4288l6205l7977
53233A927966l9340m0191m0307l9781l9151l8586l7572l5948l4470l3700l3144
53222A515776l2237l1434l1360l1584l1340l0891l1120l2012l2594l2258l1299
53211A167647l0071k8460k6340k4027k2085k0881k0419k0401k0518k0670k0812
53200I12963k0653j9944j9047j8703j9090j9599j9662j9295j8681j7850j6931
$$ plain form
53278 1459287 1475006 1492818 1513562 1538031 1565956 1596143 1627625 1660034 1692825 1725107 1756636
53267 1756636 1788189 1820394 1852841 1884826 1916268 1947215 1977120 2005333 2031848 2056889 2080296
53256 2080296 2101981 2122524 2142502 2161591 2178954 2194027 2206272 2214749 2218880 2219221 2216594 2210820
53244 2210820 2201200 2187829 2171339 2151574 2127723 2099806 2069023 2036436 2002148 1965943 1927966
53233 1927966 1888626 1848435 1808128 1768347 1729196 1690610 1653038 1617090 1582620 1548920 1515776
53222 1515776 1483539 1452105 1420745 1389161 1357821 1326930 1295810 1263798 1231204 1198946 1167647
53211 1167647 1137576 1109116 1082776 1058749 1036664 1015783 995364 974963 954445 933775 912963
53200 912963 892310 872366 853319 834616 815526 795927 776265 756970 738289 720439 703508
53189G03508j6224j5795j5467j5249j5273j5321j5123j5038j5600j6410j6440
53178E31568j5584j4761j4351j3729j2711j2134j2385j2508j1659j0313r326q678
53166C83429q111q035q716r313q765p234n723m778m355m439m911n194m847m149
53152B94859l500k758j789j105j177j633j807j605j221o40l9K7m18l59P41J832
53136B79408J706Q31N43R29Q36k09j393j887j697j220q53j087k124l385m084m177
53120B62137m096l848l202k576k731l638m437m598m336l969l589l354l377l281
53106B11105k670j962j982k677l046k539j776j658k324l192l571l128k196j651
53092A76733k086k999l267k440j121j32K29M0n17j137j482j441j158q49p82j178
$$ plain form
53189 703508 687284 671489 656022 640773 625500 610179 595056 580018 564418 548008 531568
53178 531568 515984 501223 486872 473143 460432 448298 435913 423405 411746 401433 392107 383429
53166 383429 375318 367283 358567 349254 340489 333255 327532 322754 318399 313960 309049 303855 299008 294859
53152 294859 291359 288601 286812 285707 284530 282897 281090 279485 278264 277624 277585 277612 277194 276835 277576 279408
53136 279408 281114 281945 282488 283417 284253 284044 282651 280764 279067 277847 276994 275907 273783 270398 266314 262137
53120 262137 258041 254193 250991 248415 245684 242046 237609 233011 228675 224706 221117 217763 214386 211105
53106 211105 208435 206473 204491 201814 198768 196229 194453 192795 190471 187279 183708 180580 178384 176733
53092 176733 174647 171648 168381 165941 164820 164688 164917 164957 164440 163303 161821 160380 159222 158373 157591 156413
53076A56413j833k096j675j153j181j480j294n73LJ39K08L63J72n28j120r87m46
53059A42932l93j132j918j765n50Q00J322J043P30P50P61N35M52P25Q27K73n02
53042A44890p11l93k47m88o01k00M99J066J271J075N53j9l86n01m59l82n23j053
53024A43391j517j045L89J546J434O85O17J297J600R85J52j26R5M74R27J344J410
53007A53658J092P78O66N43L07K18L68M51L59N26J267K212K739K754K642K720
52991A73300L050L626M283M549L980K710J408N50j1o25j169j213p77n35j014j930
52975A90182k642k994l207l203k649j719j114j190j566j772j737j476r12k74n5
52960A63672k57k65J99O08N35L99P19J200J191O98J86j64m11l37K77J058J363
$$ plain form
53076 156413 154580 152484 150809 149656 148475 146995 145701 145128 145131 145270 145478 145841 146013 145485 144365 143378 142932
53059 142932 142539 141407 139489 137724 137174 137974 139296 140339 141069 141819 142580 143115 143567 144292 145119 145392 144890
53042 144890 144179 143786 143539 143051 142450 142250 142749 143815 145086 146161 146714 146695 146309 145808 145349 144967 144444 143391
53024 143391 141874 140829 141218 142764 144198 144883 145500 146797 148397 149382 149534 149408 149503 149977 150904 152248 153658
53007 153658 154750 155528 156194 156737 157044 157262 157630 158081 158440 158966 160233 162445 165184 167938 170580 173300
52991 173300 176350 179976 184259 188808 192788 195498 196906 197456 197445 196820 195651 194438 193661 193126 192112 190182
52975 190182 187540 184546 181339 178136 175487 173768 172654 171464 169898 168126 166389 164913 164001 163727 163672
52960 163672 163415 163150 163349 163957 164492 164891 165610 166810 168001 168699 168885 168721 168310 167973 168250 169308 170671
52943A70671J083N82P6m20o72l46M62J254J667J640J278Q59P47R76J106Q25L50
52926A82138o6n62j215j615j421r68p31o46m60l33m52m42R6P74Q84M58J56K62
52908A75857M85N75N38L80J85K63P28J132J058P26M62R4m85o44J49J205J386Q22
52890A84916O97J426K087J890J204Q10R09J217J437J334Q10J62j19J28P00J480
52874B01088K404L171L411L179K789K347J909J865K494L314L489K860J948J129
52860B37397M01j56m46p42j301j804j792j505j509j657j356p31n02p53q13m81
52844B22250l53p31j106j109j033j123j096q18p52j227j877k200k201k143k125
52829B02356k169k331k457k264j834j563j518j345r92r52j527k288k565k113j211
$$ plain form
52943 170671 171754 172336 172412 171992 171320 170974 171436 172690 174357 175997 177275 178134 178881 179857 180963 181788 182138
52926 182138 182072 181510 180295 178680 177259 176291 175560 174914 174454 174121 173669 173227 173323 174097 174981 175439 175595 175857
52908 175857 176342 176917 177455 177835 178020 178283 179011 180143 181201 181927 182389 182483 181998 181354 181503 182708 184094 184916
52890 184916 185613 187039 189126 191016 192220 193030 193939 195156 196593 197927 198737 198899 198780 198908 199608 201088
52874 201088 203492 206663 210074 213253 216042 218389 220298 222163 224657 227971 231460 234320 236268 237397
52860 237397 237798 237642 237196 236454 235153 233349 231557 230052 228543 226886 225530 224799 224297 223544 222731 222250
52844 222250 221897 221166 220060 218951 217918 216795 215699 214881 214129 212902 211025 208825 206624 204481 202356
52829 202356 200187 197856 195399 193135 191301 189738 188220 186875 185883 184931 183404 181116 178551 176438 175227
52814A75227m28l05q85j492j464j017q60j044q70l5Q33J049O57Q7m44q62j069
52797A67078j084j062j020q38o18o56r99j352j497j429j196r31r27j268j518j242
52781A49441o92m18m37m80p44j652k853l322k571j130K04R70R72L02m74q17r41
52764A35358j360j898j896j410j250j703k128k008j619j382j250j032p18l46l6
52749A15322j84r71j784j869j435j257j251o17N77J154N38l94o70m57l59l05J07
52732A06145P61J160J024M63j39k52L07J023J275J236J482J928J979J699J727
52717A21818K049J961J353Q45M99l41j552j992j293o74j218k414l132l107k704
52702A10098k133j619j548j869j987j760j686j789j387m42M9l82q96q45p83j076
$$ plain form
52814 175227 174799 174494 173609 172117 170653 169636 168776 167732 166862 166827 167660 168709 169366 169453 169009 168147 167078
52797 167078 165994 164932 163912 163074 162456 161800 160801 159449 157952 156523 155327 154396 153469 152201 150683 149441
52781 149441 148749 148331 147894 147414 146670 145018 142165 138843 136272 135142 135346 136316 137288 137590 137116 136299 135358
52764 135358 133998 132100 130204 128794 127544 125841 123713 121705 120086 118704 117454 116422 115704 115358 115322
52749 115322 115138 114167 112383 110514 109079 107822 106571 105954 106531 107685 108223 107829 107159 106702 106343 106038 106145
52732 106145 106906 108066 109090 109553 109414 109162 109469 110492 111767 113003 114485 116413 118392 120091 121818
52717 121818 123867 125828 127181 128026 128525 128184 126632 124640 123347 122673 121455 119041 115909 112802 110098
52702 110098 107965 106346 104798 102929 100942 99182 97496 95707 94320 93878 93927 93545 92649 91804 91021 89945
52686H9945q91L13J421J156p8j032j475j791j685p81J26l2q12q74j22K08n10j547
52668H1539k049j924j432q58o17q98j253j150p40m12p4L82M88k6l67K44J096R02
52650G2851j51o51j38L90K24j21l7L16O73J125J538J447R24P43J204J588J200
52633H3125K74n45r79r76m36M20R20O87J97J63O08R50P53J10n73r41r24p87q46
52614H1200j119j317j192p66k30K42O19R91J391J607J370Q00L43J93J47J45M53
52597H4877J053J389J110O11L79L44L47P26J683K490K221J102K96M08Q80R49N17
52580A01382l3l79l64Q1R23K000K955L201K372J010L11P82J628J880J624J501
52564A20874J518J246Q21P78J037R71N10K88N53P46M34L1J69Q26J449J628J404
$$ plain form
52686 89945 89054 89367 90788 91944 91866 90834 89359 87568 85883 85102 85228 85196 84384 83510 83388 83596 83086 81539
52668 81539 79490 77566 76134 75276 74659 73761 72508 71358 70618 70206 70132 70514 71002 70976 70609 70853 71949 72851
52650 72851 72700 72049 71911 72301 72525 72404 72367 72683 73356 74481 76019 77466 78390 79133 80337 81925 83125
52633 83125 83399 82854 81875 80899 80463 80883 81803 82490 82687 82850 83458 84408 85161 85271 84698 83757 82833 82046 81200
52614 81200 80081 78764 77572 76806 76576 76818 77437 78428 79819 81426 82796 83596 83939 84132 84279 84424 84877
52597 84877 85930 87319 88429 89040 89419 89763 90110 90836 92519 95009 97230 98332 98628 99036 99916 100865 101382
52580 101382 101349 100970 100606 100687 101610 103610 106565 109766 112138 113148 113459 114241 115869 117749 119373 120874
52564 120874 122392 123638 124459 125237 126274 127245 127755 128043 128596 129342 129776 129807 129976 130802 132251 133879 135283
52547A35283J103J002J097J153R95O77K78k07o49p31l70J73O99J238J528R59n32
52530A43696j944k196j275J4R75J203M88p50j415r21o3J02k00j1P05J090R16Q23
52512A41237R39M92p86j904j870r33o8K17P7j89l30j29L76Q34J008J064J229J356
52494A42620J106M37k23l58J06P07R47Q63P91O80J52o43q75j30R01J300J060P49
52476A50190N86M28L63N74Q83J025J109J249J125N38Q8N17J632K604L059L140
52460A69110K851K163J525J397J472J204Q56J082J683J811J216L38p24k153l395
52445A80436l464k456j619j646j984k172k619l500l995l353j975p59n9J38k63
52430A50710j154j918k132k085k156k091j473m92K61N09L37r4n24n28K5O50P65
$$ plain form
52547 135283 136386 137388 138485 139638 140633 141310 141588 141381 140732 140001 139631 139804 140503 141741 143269 144228 143696
52530 143696 141752 139556 138281 138295 139270 140473 140961 140211 138796 137875 137812 137914 137714 137703 138408 139498 140414 141237
52512 141237 142176 142668 141882 139978 138108 137175 137107 137324 137401 137212 136882 136753 137129 137963 138971 140035 141264 142620
52494 142620 143726 144163 143940 143582 143688 144395 145342 146205 146996 147676 147828 147185 146310 146180 147081 148381 149441 150190
52476 150190 150776 151204 151567 152141 153024 154049 155158 156407 157532 158070 158158 158675 160307 162911 165970 169110
52460 169110 171961 174124 175649 177046 178518 179722 180578 181660 183343 185154 186370 186708 185984 183831 180436
52445 180436 176972 174516 172897 171251 169267 167095 164476 160976 156981 153628 151653 150894 150835 150973 150710
52430 150710 149556 147638 145506 143421 141265 139174 137701 137209 137470 137979 138316 138222 137698 137170 137195 137845 138610
52413A38610L91O6J38M00L75j24o63n93J30O90L72m61p91k52N41Q83O71K15j18
52394A40480JN89J180J330J249J365J496J163O55Q10J717K439K267J511P62J99
52378A59213p6K27J060J796J970J791J648J662J893K425K957K908K318J936K114
52363A85842K253J753R72P18J184J895K322K197J598J026J049J584J955J897J892
52348B10137K292K645K432J907J724K040K505K750K587K066J648J926K792L282
52334B42733K723J626J022J209J687K024K260K545K772K701K211J468Q72P01Q46
52319B69400J074J504K356L359L901L835L632L670L873M214M825N562O027O267
52305C23499O845P974R229J0273J1222J1983J2125J1742J1634J2060J2175J1323
$$ plain form
52413 138610 139001 139067 139205 139605 139980 139856 139193 138600 138730 139420 139792 139331 138540 138288 138829 139712 140383 140598 140480
52394 140480 140481 141070 142250 143580 144829 146194 147690 148853 149508 150318 152035 154474 156741 158252 159014 159213
52378 159213 159137 159364 160424 162220 164190 165981 167629 169291 171184 173609 176566 179474 181792 183728 185842
52363 185842 188095 189848 190820 191538 192722 194617 196939 199136 200734 201760 202809 204393 206348 208245 210137
52348 210137 212429 215074 217506 219413 221137 223177 225682 228432 231019 233085 234733 236659 239451 242733
52334 242733 245456 247082 248104 249313 251000 253024 255284 257829 260601 263302 265513 266981 267853 268554 269400
52319 269400 270474 271978 274334 277693 281594 285429 289061 292731 296604 300818 305643 311205 317232 323499
52305 323499 330344 338318 347547 357820 369042 381025 393150 404892 416526 428586 440761 452084
52293D52084J0174R755J0036J0318J0490J0931J1566J1973J2255J2870J3676J4039
52281E90167J3823J3535J3410J3139J2674J2565J3191J4151J4758J4814J4667
52270G40894J4659J4734J4505J3679J2455J1365J0628R923Q968Q032P454O915
52258H74211N833M403L603L884M402M001K706J679J636J897J333n5j086r41j06
52243I07400M00K48j84n76p84m76O39K269L794N056O302P414P933Q026Q604J0128
52227I66193J1868J2817J2864J2621J2491J2411J2262J2032J1644J0943R922Q834
52215A106902Q082P902P973P551O285M713L527K602J321k45j311j605j818k571
52201A149308l669m729n856p155q170q371p938p520p491p750q010p995p541o751
$$ plain form
52293 452084 462258 472013 482049 492367 502857 513788 525354 537327 549582 562452 576128 590167
52281 590167 603990 617525 630935 644074 656748 669313 682504 696655 711413 726227 740894
52270 740894 755553 770287 784792 798471 810926 822291 832919 842842 851810 859842 867296 874211
52258 874211 880044 884447 888050 891934 896336 900337 903043 904722 906358 908255 909588 909533 908447 907506 907400
52243 907400 907800 908048 907864 907288 906504 906028 906667 908936 912730 917786 924088 931502 939435 947461 956065 966193
52227 966193 978061 990878 1003742 1016363 1028854 1041265 1053527 1065559 1077203 1088146 1098068 1106902
52215 1106902 1114984 1122886 1130859 1138410 1144695 1149408 1152935 1155537 1156858 1156613 1155302 1153697 1151879 1149308
52201 1149308 1145639 1140910 1135054 1127899 1119729 1111358 1103420 1095900 1088409 1080659 1072649 1064654 1057113 1050362
52187A050362n903n148m544m274m356m261l485k474k279l069l856l949l785l986
52173I94993m347m443m473m774m995m545l606k989l165l925m779n266n080m303
52159I34303l441k975k940l109l255l241l066k964l052k997k489j973k135k778
52145H93888l026k775k881l664m319m301m173m411m448l812l239l629m553m948
52131H39709m733m631m702m284l292k539k644l324l912m038l778l489l536l881
$$ plain form
52187 1050362 1044459 1039311 1034767 1030493 1026137 1021876 1018391 1015917 1013638 1010569 1006713 1002764 998979 994993
52173 994993 990646 986203 981730 976956 971961 967416 963810 960821 957656 953731 948952 943686 938606 934303
52159 934303 930862 927887 924947 921838 918583 915342 912276 909312 906260 903263 900774 898801 896666 893888
52145 893888 890862 888087 885206 881542 877223 872922 868749 864338 859890 856078 852839 849210 844657 839709
52131 839709 834976 830345 825643 821359 818067 815528 812884 809560 805648 801610 797832 794343 790807 786926
$$ [...]
##END NTUPLES=NMR SPECTRUM
##END=
