##TITLE=NES1008_LH_9233092_lStpFqmLiy
##JCAMPDX= 6.0         $$ Bruker NMR JCAMP-DX V2.0
##DATA TYPE= NMR SPECTRUM
##DATA CLASS= NTUPLES
##ORIGIN= BRUKER
##OWNER= Administrator
$$ 1.72 TOPSPIN		Version 2.1
$$ 2015-06-17 19:49:11.941 -0700  Administrator@X
$$ Compression mode = diff/dup
##.OBSERVE FREQUENCY= 400.02188249412
##.OBSERVE NUCLEUS= ^1H
##.ACQUISITION MODE= SIMULTANEOUS (DQD)
##.ACQUISITION SCHEME= undefined
##.AVERAGES= 8
##.DIGITISER RES= 22
##SPECTROMETER/DATA SYSTEM= spect
##.PULSE SEQUENCE= zg30
##.SOLVENT NAME= COFFEE_meoh
##.SHIFT REFERENCE= INTERNAL, COFFEE_meoh, 1, 14.98509
##AUDIT TRAIL= $$ (NUMBER, WHEN, WHO, WHERE, PROCESS, VERSION, WHAT)
$$ ##TITLE= Audit trail, TOPSPIN		Version 2.1
$$ ##JCAMPDX= 5.01
$$ ##ORIGIN= Bruker BioSpin GmbH
$$ ##OWNER= Administrator
$$ $$ E:\/data/COFFEE/nmr/NES1008_LH_9233092_lStpFqmLiy/10/pdata/1/auditp.txt
$$ ##AUDIT TRAIL=  $$ (NUMBER, WHEN, WHO, WHERE, PROCESS, VERSION, WHAT)
(   1,<2015-06-17 19:49:04.722 -0700>,<Administrator>,<X>,<go>,<TOPSPIN 2.1>,
      <created by zg
	started at 2015-06-17 19:47:58.941 -0700,
	POWCHK enabled, PULCHK disabled,
       configuration hash MD5:
       21 0F 79 D6 B3 7B B4 F6 88 20 88 DB 03 48 BD 9F
       data hash MD5: 64K
       06 C0 3A 4F 08 13 D0 53 32 83 75 9E 96 35 06 80>)
(   2,<2015-06-17 19:49:07.909 -0700>,<Administrator>,<X>,<proc1d>,<TOPSPIN 2.1>,
      <Start of raw data processing
       efp LB = 0 FT_mod = 6 PKNL = 1 PHC0 = 0 PHC1 = 0 SI = 32K 
       data hash MD5: 32K
       23 A1 0C A1 4E B5 97 41 92 8F FF 1B 6E CA 68 C0>)
(   3,<2015-06-17 19:49:08.191 -0700>,<Administrator>,<X>,<proc1d>,<TOPSPIN 2.1>,
      <pk PHC0 = 93.78479 PHC1 = 0 
       data hash MD5: 32K
       68 32 C5 7C B7 75 9E 7C B8 10 E4 31 A2 9B 5D E3>)
(   4,<2015-06-17 19:49:08.316 -0700>,<Administrator>,<X>,<proc1d>,<TOPSPIN 2.1>,
      <abs ABSG = 1 
       data hash MD5: 32K
       3F F6 22 CD 3A 98 D6 D7 79 AE 14 CC 8E 93 B7 39>)
(   5,<2015-06-17 19:49:08.378 -0700>,<Administrator>,<X>,<proc1d>,<TOPSPIN 2.1>,
      <abs ABSG = 2 
       data hash MD5: 32K
       02 EE 6F C6 D0 01 C3 F0 4C 1D 4B 46 38 B4 EE 37>)
(   6,<2015-06-17 19:49:08.456 -0700>,<Administrator>,<X>,<proc1d>,<TOPSPIN 2.1>,
      <abs ABSG = 3 
       data hash MD5: 32K
       8E 1A F8 E1 B6 DF 74 73 3C 34 EF 2F 0A A0 CC 11>)
(   7,<2015-06-17 19:49:08.519 -0700>,<Administrator>,<X>,<proc1d>,<TOPSPIN 2.1>,
      <abs ABSG = 4 
       data hash MD5: 32K
       F1 C3 42 CE 70 D9 AA 94 E2 9B 15 6C D9 15 86 04>)
(   8,<2015-06-17 19:49:08.581 -0700>,<Administrator>,<X>,<proc1d>,<TOPSPIN 2.1>,
      <abs ABSG = 5 
       data hash MD5: 32K
       D4 AE 15 C6 8A 6C 84 6D 12 F6 E0 EF FE 4C 8F 48>)
$$ ##END=
$$ 
$$ $$ hash MD5
$$ $$ 25 8F 30 F4 EE 3A F8 57 0A 32 BA DE 2F 7D E0 47
##$RELAX= 
##$RELAX= 
##$RELAX= 
##$RELAX= 
##$RELAX= 
##$RELAX= 
##$RELAX= 
$$ Bruker specific parameters
$$ --------------------------
##$DU= <E:\>
##$EXPNO= 10
##$NAME= <NES1008_LH_9233092_lStpFqmLiy>
##$PROCNO= 1
$$ [...]
150 150 150 150 150 150 150 150
##$TP07= 0
##$TPNAME0= <>
##$TPNAME1= <>
##$TPNAME2= <>
##$TPNAME3= <>
##$TPNAME4= <>
##$TPNAME5= <>
##$TPNAME6= <>
##$TPNAME7= <>
##$TPOAL= (0..7)
0.5 0.5 0.5 0.5 0.5 0.5 0.5 0.5
##$TPOFFS= (0..7)
0 0 0 0 0 0 0 0
##$TUNHIN= 0
##$TUNHOUT= 0
##$TUNXOUT= 0
##$USERA1= <user>
##$USERA2= <user>
##$USERA3= <user>
##$USERA4= <user>
##$USERA5= <user>
##$V9= 5
##$VALIST= <valist>
##$VCLIST= <CCCCCCCCCCCCCCC>
##$VD= 0
##$VDLIST= <DDDDDDDDDDDDDDD>
##$VPLIST= <PPPPPPPPPPPPPPP>
##$VTLIST= <TTTTTTTTTTTTTTT>
##$WBST= 2048
##$WBSW= 25
##$XGAIN= (0..3)
0 0 0 0
##$XL= 0
##$YL= 0
##$YMAX_a= 592944
##$YMIN_a= -496763
##$ZGOPTNS= <>
##$ZL1= 120
##$ZL2= 120
##$ZL3= 120
##$ZL4= 120
##$ABSF1= 14.98509
##$ABSF2= -5.573092
##$ABSG= 5
##$ABSL= 3
##$ALPHA= 0
##$AQORDER= 0
##$ASSFAC= 0
##$ASSFACI= 0
##$ASSFACX= 0
##$ASSWID= 0
##$AUNMP= <proc_prof1d_extract_pilot.lims>
##$AXLEFT= 0
##$AXNAME= <>
##$AXNUC= <1H>
##$AXRIGHT= 0
##$AXTYPE= 0
##$AXUNIT= <>
##$AZFE= 0.1
##$AZFW= 0.1
##$BCFW= 0
##$BC_mod= 0
##$BYTORDP= 0
##$COROFFS= 0
##$CY= 15
##$DATMOD= 1
##$DC= 0
##$DFILT= <>
##$DTYPP= 0
##$F1P= 0
##$F2P= 0
##$FCOR= 0.5
##$FTSIZE= 32768
##$FT_mod= 6
##$GAMMA= 0
##$GB= 0
##$INTBC= 1
##$INTSCL= 1
##$ISEN= 128
##$LB= 0
##$LEV0= 0
##$LPBIN= 0
##$MAXI= 10000
##$MC2= 0
##$MEAN= 0
##$ME_mod= 0
##$MI= 0
##$NCOEF= 0
##$NC_proc= -8
##$NLEV= 6
##$NOISF1= 0
##$NOISF2= 0
##$NSP= 0
##$NTH_PI= 0
##$NZP= 0
##$OFFSET= 14.98509
##$PC= 1
##$PHC0= 93.78479
##$PHC1= 0
##$PH_mod= 1
##$PKNL= yes
##$PPARMOD= 0
##$PPDIAG= 0
##$PPIPTYP= 0
##$PPMPNUM= 2147483647
##$PPRESOL= 1
##$PSCAL= 4
##$PSIGN= 0
##$PYNMP= <proc.py>
##$REVERSE= no
##$SF= 400.02
##$SI= 32768
##$SIGF1= 0
##$SIGF2= 0
##$SINO= 400
##$SIOLD= 32768
##$SPECTYP= <>
##$SREGLST= <1H.CDCl3>
##$SSB= 0
##$STSI= 32768
##$STSR= 0
##$SW_p= 8223.68421052631
##$SYMM= 0
##$S_DEV= 0
##$TDeff= 65536
##$TDoff= 0
##$TI= <>
##$TILT= no
##$TM1= 0
##$TM2= 0
##$TOPLEV= 0
##$USERP1= <user>
##$USERP2= <user>
##$USERP3= <user>
##$USERP4= <user>
##$USERP5= <user>
##$WDW= 1
##$XDIM= 32768
##$YMAX_p= 444034888
##$YMIN_p= -675027
##$CURPLOT= <Network HP LaserJet P1505>
##$CURPRIN= <$Network HP LaserJet P1505>
##$DFORMAT= <normdp>
##$LAYOUT= <+/1D_H.xwp>
##$LFORMAT= <normlp>
##$PFORMAT= <normpl>
##$SURQMSG= 1
$$ End of Bruker specific parameters
$$ ---------------------------------
##NTUPLES= NMR SPECTRUM
##VAR_NAME=  FREQUENCY,     SPECTRUM/REAL,   SPECTRUM/IMAG
##SYMBOL=    X,             R,               I
##VAR_TYPE=  INDEPENDENT,   DEPENDENT,       DEPENDENT
##VAR_FORM=  AFFN,          ASDF,            ASDF
##VAR_DIM=   32768,         32768,           32768
##UNITS=     HZ,            ARBITRARY UNITS, ARBITRARY UNITS
##FACTOR=    0.250966925370066, 1,           1
##FIRST=     8223.43324360094, -96002,       -205817
##LAST=      0,             -7391,           -117117
##MIN=       0,             -675027,         0
##MAX=       8223.43324360094, 444034888,    0
$$ Real data points
##PAGE= N=1
##DATA TABLE= (X++(R..R)), XYDATA
$$ [...]
19482A6456b98245I7729b4952j74386L9478a0736j67065A04476D6599b18552c9470
$$ 16456 -298245 97729 -24952 -199338 -159860 -10736 -177801 104476 46599 -218552 -39470
19470C4717i4924a0662l1946C4520a6305A99420c23100j79754A45760a41078r3256
$$ 34717 -94924 -10662 -42608 34520 -16305 199420 -323100 -502854 145760 -141078 -234334
19459b34334m95A60489a99695C669R3360C0557c00480a09175A85778j2263L5940
$$ -234334 -234829 160489 -199695 3669 97029 30557 -300480 -109175 185778 173515 209455
19448B09455o2552E1894a30007R384j75005K3508C2004a54326B04452b8052l06334
$$ 209455 146903 51894 -130007 -120623 -295628 -272120 32004 -154326 204452 -28052 -334386
19437c34386F4903e6896j98011O5111o4221b611k04435B20615l4813B8979d5663
$$ -334386 64903 -56896 -254907 -189796 -254017 -2611 -207046 220615 185802 28979 -45663
19425B8216a06258J4842p5087A67403h9542q3526P1339B70273a4029j40548j0494
$$ 28216 -106258 -91416 -166503 167403 -89542 -173068 -101729 270273 -14029 -154577 -165071
19414a65071g8727l18730A01659h0898A9513b55588A09209J34580b2625H3827
$$ -165071 -78727 -397457 101659 -80898 19513 -255588 109209 243789 -22625 83827
19403c9766D5692B1771b83473A47907g4364j4361j44412A50570D8576b40627B75468
$$ -39766 45692 21771 -283473 147907 -74364 -88725 -233137 150570 48576 -240627 275468
19391i0150A84358C0087c42089K1205a40040r2393l9725F0883J02601J82060A1306
$$ -90150 184358 30087 -342089 -320884 -140040 -232433 -272158 60883 163484 345544 11306
19379i630B87770b29699n4053H025a64126l3303o5502b4006R467p3798m8738A72529
$$ -9630 287770 -229699 -283752 8025 -164126 -197429 -262931 -24006 -14539 -88337 -137075 172529
19366A86934C2884e5297k49659P4480O9204n8675A4242J06195h7038j8928K5948
$$ 186934 32884 -55297 -304956 -230476 -161272 -219947 14242 120437 -87038 -105966 -80018
19355h0018q0380c5577p899l04094c0199n6764c2841j93418g5812C0308A0425
$$ -80018 -160398 -35577 -43476 -347570 -30199 -86963 -32841 -226259 -75812 30308 10425
19343A74938g9933c056m1762j16681L690N4184L9740j61659A23494f7420c821
$$ 174938 -79933 -3056 -44818 -161499 -157809 -103625 -63885 -225544 123494 -67420 -3821
19331A8716F108c40717c5548j2989B487h997G1602a75678k25253b1504c61o7379
$$ 18716 6108 -340717 -35548 -48537 2487 -8997 71602 -175678 -400931 -21504 -361 -67740
19319f7740A68392a30787E0752Q1814J97402E2255B3546b59311D0797a63378a8108
$$ -67740 168392 -130787 50752 132566 329968 52255 23546 -259311 40797 -163378 -18108
19307f24466a15577L8984C7273c5438F4033a73216D5909K3900b28025i2401B66061
$$ -624466 -115577 -76593 37273 -35438 64033 -173216 45909 69809 -228025 -92401 266061
19295b24801c5116A08748o845b88000j14403A42397c32191A61603P4084a65639
$$ -224801 -35116 108748 101903 -288000 -402403 142397 -332191 161603 235687 -165639
19284F5139b30810h9836n5479J1272J8192e936k14825j3176A3060b9196A82123
$$ 65139 -230810 -89836 -145315 -134043 -115851 -5936 -220761 -233937 13060 -29196 182123
19272A17483b03331N1535j7079q5370g4468R728a1125j02981n3036A59758a91853
$$ 117483 -203331 -151796 -168875 -254245 -74468 -64740 -11125 -114106 -167142 159758 -191853
19260I383R4232J50477b67994C3933J33540l4014k7010c38328a31330M8862J4137
$$ 9383 103615 254092 -267994 33933 167473 133459 106449 -338328 -131330 -82468 -68331
19249f8331a3410l5902j78968c5794e940D08210a10833l16063E006J01629a42835
$$ -68331 -13410 -49312 -228280 -35794 -5940 408210 -110833 -426896 5006 106635 -142835
19237b48491A37479c54943A4268a15144C7762b2787H7435a61961F617Q7055M9878
$$ -248491 137479 -354943 14268 -115144 37762 -22787 87435 -161961 6617 93672 143550
19226A43550i8367A29977a8292k19504k18933F49b86157P5764b877j82141J6041
$$ 143550 -98367 129977 -18292 -237796 -456729 649 -286157 -210393 -2877 -185018 -168977
19215a68977g6517k4728C0756a44226o207M2314A82c28392A84051a11315B30410
$$ -168977 -76517 -101245 30756 -144226 -150433 -108119 182 -328392 184051 -111315 230410
19203B73615a53413m61466E5966c11621H6801a01315j01826C22175A44408C9997
$$ 273615 -153413 -614879 55966 -311621 86801 -101315 -203141 322175 144408 39997
19192A28496a58792L7206A5028a9801A73988D9132a4010F431a22700M6239K8552
$$ 128496 -158792 -121586 15028 -19801 173988 49132 -14010 6431 -122700 -76461 -47909
19181d7909l4008F2463c65542J28982B0129b36343A33943a2779k65848J7875A26900
$$ -47909 -81917 62463 -365542 -236560 20129 -236343 133943 -12779 -278627 -260752 126900
19169C2036a01297n8648k6849M6118M1157j64398A19783a85327m5675f9199r3195
$$ 32036 -101297 -159945 -186794 -140676 -99519 -263917 119783 -185327 -231002 -69199 -162394
19158a62394j05740A48002i5045A28326g2802B5153a66848B5986g1266K2492n45835
$$ -162394 -268134 148002 -95045 128326 -72802 25153 -166848 25986 -71266 -48774 -594609
19147e94609b02176N8833q6420O8172j06909J14985n1661p0041A64666n9252c41972
$$ -594609 -202176 -143343 -229763 -161591 -268500 -153515 -205176 -275217 164666 105414 -341972
19135g5165a2742k614j49323A4565d02489J52149i1594F8783O636c2026C65764
$$ -75165 -12742 -15356 -164679 14565 -402489 -250340 -91594 68783 75419 -32026 365764
19123A00929K6567g5059B6718h1197E3250I930g977C9361J0776R7664f9400j10027
$$ 100929 127496 -75059 26718 -81197 53250 9930 -7977 39361 50137 147801 -69400 -179427
19111a79427D7667a10221H6848e2865o9249A09108H16Q3771a99614d5825m4793
$$ -179427 47667 -110221 86848 -52865 -122114 109108 816 84587 -199614 -45825 -90618
19100i0618K3110l02360J47512C17401d6437k76121G4296J38037a43444A09610
$$ -90618 -67508 -369868 -222356 317401 -46437 -322558 74296 212333 -143444 109610
19089b373o007k62175a0173j0974j29923A53575a51601A69191q0323b1276j76382
$$ -2373 -8380 -270555 -10173 -21147 -151070 153575 -151601 169191 88868 -21276 -197658
19078a97658C5971a89090C06419a60884I1622K6830i0151B3806b54962i8347j84092
$$ -197658 35971 -189090 306419 -160884 91622 118452 -90151 23806 -254962 -98347 -282439
19067b82439D3867b06619l90821a07892L6870K6235k5412l2657B36201b77363
$$ -282439 43867 -206619 -597440 -107892 -71022 -44787 -70199 -102856 236201 -277363
19056g2160e274j76006B54992b63608e520n0915j89342Q6270A32406a23506H3236
$$ -72160 -5274 -181280 254992 -263608 -5520 -56435 -245777 -159507 132406 -123506 83236
19044h5374k66585a21005D0593c74657a26874e7529p1002p6771h8499b4996B22391
$$ -85374 -351959 -121005 40593 -374657 -126874 -57529 -128531 -205302 -88499 -24996 222391
19032a09616k9050n6133L7265a1367A50269b0356p3720O570I066K39584b16104
$$ -109616 -138666 -194799 -157534 -11367 150269 -20356 -94076 -87506 9066 248650 -216104
19020g6180C3061c12783a50452d6527k1728k64397E2104a26192d3537B68612a77573
$$ -76180 33061 -312783 -150452 -46527 -68255 -332652 52104 -126192 -43537 268612 -177573
19008i2912k00110a43284d4098j8567K2973E5437b62399a0617m8408B29552C5700
$$ -92912 -293022 -143284 -44098 -62665 -39692 55437 -262399 -10617 -59025 229552 35700
18996b15248e4082G2603K8035b33276m4221a8059r0131N3851j990A45219a01582
$$ -215248 -54082 72603 100638 -233276 -277497 -18059 -108190 -54339 -56329 145219 -101582
18984a57800f5445j6381c9590J7455a0911k37688A18244J06807N6800j588K027
$$ -157800 -65445 -81826 -39590 -22135 -10911 -248599 118244 225051 281851 280263 282290
18973B82290j24441N56056l09068A07503i3112E0854b97592D80165c30652g1573
$$ 282290 157849 713905 404837 107503 -93112 50854 -297592 480165 -330652 -71573
18962C8618J1337a88632A44662E2990d00291P7655J14168F981M3060O663B4755
$$ 38618 49955 -188632 144662 52990 -400291 -322636 -208468 6981 50041 56704 24755
18950A24977J30910F5107c763q077A89595j7167n1798D332J47822b44215A92384
$$ 124977 255887 65107 -3763 -11840 189595 172428 120630 4332 152154 -244215 192384
18938e9034a7251j10736r749m5862P3145I2574R4378G7169A162a31909j35675
$$ -59034 -17251 -127987 -137736 -183598 -110453 92574 186952 77169 1162 -131909 -267584
18927b67584A27214a30478J390l04284J73248e6921e001G2233B2508J25278o1692
$$ -267584 127214 -130478 -129088 -433372 -260124 -56921 -5001 72233 22508 147786 86094
18916H6094a13396A7473d3420A24946B0599a7991C68064O4811l0476o3367r050
$$ 86094 -113396 17473 -43420 124946 20599 -17991 368064 432875 402399 339032 329982
18905C29982a63950r2920R087C3384a27130l2420P7080F6370a13450j6358g163
$$ 329982 -163950 -256870 -247783 33384 -127130 -159550 -82470 66370 -113450 -129808 -7163
18893h685j63504j79287L4041g0797D744K9096c64408D6887a53810j18336N4889
$$ -8685 -172189 -351476 -317435 -70797 4744 33840 -364408 46887 -153810 -272146 -217257
18882b17257C6858i7806j7334k73714f9965b7882j62208j73292m0877E388J16721
$$ -217257 36858 -97806 -115140 -388854 -69965 -27882 -190090 -363382 -404259 5388 122109
18871A22109a17599l0686A24948b86765c5107q382A16054m6494M6272a57268A878
$$ 122109 -117599 -148285 124948 -286765 -35107 -43489 116054 69560 115832 -157268 1878
18859E4140e1841g301D6498a88537k3420D182K38385f2036j66046c6432I8373
$$ 54140 -51841 -7301 46498 -188537 -211957 4182 242567 -62036 -228082 -36432 98373
18847e8735F5961b60820K3911K9835B60102a36509D107i0573D3134a05196m5295
$$ -58735 65961 -260820 -236909 -207074 260102 -136509 4107 -90573 43134 -105196 -150491
18836a50491j94047J8542e1319A04164A0786c3333l8369C31194l9557c51138h2745
$$ -150491 -344538 -325996 -51319 104164 10786 -33333 -71702 331194 291637 -351138 -82745
18824b25797e3528I253c57721c0966a675k05465i5927j2263d4735A43877d50766
$$ -225797 -53528 9253 -357721 -30966 -1675 -207140 -95927 -108190 -44735 143877 -450766
18812c17004G9016a16674A29112a2412A28574b05159A61977o5418J67072H7503
$$ -317004 79016 -116674 129112 -12412 128574 -205159 161977 96559 263631 87503
18801B17673c3660D5949c09873J03453c3645j46782P4321B1992O4335a74894j17371
$$ 217673 -33660 45949 -309873 -206420 -33645 -180427 -106106 21992 86327 -174894 -292265
18790b92265c0999E7927J56548g7060l84559b3786A74843a19068D833J64064b7493
$$ -292265 -30999 57927 214475 -77060 -461619 -23786 174843 -119068 4833 168897 -27493
18778B1280e6052m1688C7701h1948j4592K4430j2911L4866C9866R4664a31108
$$ 21280 -56052 -97740 37701 -81948 -96540 -72110 -85021 -50155 39866 134530 -131108
18766C7950O9279L7110b33173J10562j09049C42471e9205H3839a35228M7215l9131
$$ 37950 107229 144339 -233173 -122611 -231660 342471 -59205 83839 -135228 -88013 -127144
18755a27144j37720F0383a52322C12298a42571d0324r3617n2708B37743b2881
$$ -127144 -264864 60383 -152322 312298 -142571 -40324 -133941 -186649 237743 -22881
18744f1583m2021r5130A20398c77344A96658b42796B40599p1454a6639m6529B67239
$$ -61583 -103604 -198734 120398 -377344 196658 -242796 240599 169145 -16639 -63168 267239
18732E5682a84014c289j77168F3c17292A03014B6337a20351d7176p681A93683
$$ 55682 -184014 -3289 -180457 63 -317292 103014 26337 -120351 -47176 -54857 193683
18720a95877A40402f1679l00593g1239k46920G2035f303k63833B7408e2961p2590
$$ -195877 140402 -61679 -362272 -71239 -318159 72035 -6303 -270136 27408 -52961 -125551
18709a25551A40536k7843e17262a48275A21752A1104f8766A57643n7023C363M8114
$$ -125551 140536 112693 -517262 -148275 121752 11104 -68766 157643 100620 3363 51477
18698E1477a30912A27019a63590p3672L6000C7994b9520j01977O4323k26710B91698
$$ 51477 -130912 127019 -163590 -237262 -201262 37994 -29520 -131497 -67174 -293884 291698
18686i2760M3183G5469n953D730b48640E3705J62310h4800c1183l0650a9851j20088
$$ -92760 -49577 75469 69516 4730 -248640 53705 216015 -84800 -31183 -61833 -19851 -139939
18674a39939c2609a405k2246n2406A0703L3860h4416F6577P1259d8334n712m26
$$ -139939 -32609 -1405 -23651 -76057 10703 44563 -84416 66577 137836 -48334 -54046 -54472
18662e4472b5858E1883a02798J3639k50383h7081k35990E2290e2425k3193H9561
$$ -54472 -25858 51883 -102798 -89159 -339542 -87081 -323071 52290 -52425 -75618 89561
18650g6484j92059A08960J77557Q0229b41954f1424D8356d807j02152M7303D32430
$$ -76484 -268543 108960 286517 366746 -241954 -61424 48356 -4807 -106959 -59656 432430
18638a26896k54376H3370c1670k1872a4243A31216f0418I024b71025b1009P232
$$ -126896 -381272 83370 -31670 -53542 -14243 131216 -60418 9024 -271025 -21009 -13777
18627a3777A59813c05720H5609a60265j61570M9245H9192J27041C5947c56207
$$ -13777 159813 -305720 85609 -160265 -321835 -272590 89192 216233 35947 -356207
18616a55083o5677l4489b3253F9326Q9052a16562M0817k0073j82609l3211f5016
$$ -155083 -220760 -255249 -23253 69326 158378 -116562 -75745 -95818 -278427 -311638 -65016
18604a00527A89575a94514j21191g4476k42110g7606B24753e1636A55974a42217
$$ -100527 189575 -194514 -315705 -74476 -316586 -77606 224753 -51636 155974 -142217
18593G7520b53808h2854A58942a97704P3634B01127B8974a41684M2875a2199k82436
$$ 77520 -253808 -82854 158942 -197704 -124070 201127 28974 -141684 -98809 -12199 -294635
18582b94635J20230C8269a88161A2283e1038j43231A89157A1729b20337O4751
$$ -294635 -174405 38269 -188161 12283 -51038 -194269 189157 11729 -220337 -155586
18572a55586f0091D291g2557H7496M9746a27122A75190n0160J23781C977g9743
$$ -155586 -60091 4291 -72557 87496 137242 -127122 175190 125030 248811 3977 -79743
18560E7539a49073j98943J14882A60478G6141a89656R2190B16116M6741b60513
$$ 57539 -149073 -348016 -233134 160478 76141 -189656 -97466 216116 262857 -260513
18549b14026A83804a32968N6987k64914J58530l9929A42751A6800i689k02654
$$ -214026 183804 -132968 -75981 -340895 -182365 -222294 142751 16800 -9689 -212343
18539b12343A87993J29351c54689a12689J018o787k4518K3090b4306B17536f328
$$ -212343 187993 317344 -354689 -112689 -111671 -118458 -142976 -119886 -24306 217536 -6328
18527c11366a18504A09721d6540m4170a641q757I0086f6292B42546J9356j27049
$$ -311366 -118504 109721 -46540 -90710 -1641 -10398 90086 -66292 242546 261902 134853
18516A34853g3037A46354a83908i271p1659B8013J06298B4187b27076H0832a7047
$$ 134853 -73037 146354 -183908 -9271 -80930 28013 134311 24187 -227076 80832 -17047
18504E4246b43711L3665i6747j06856R1825I4857a02912A5839J8641b8126k13399
$$ 54246 -243711 -210046 -96747 -203603 -111778 94857 -102912 15839 34480 -28126 -241525
18493b41525a18G2620a68613B31317r812r2042a9126j92872j3444j27573a43834
$$ -241525 -118 72620 -168613 231317 221505 129463 -19126 -211998 -225442 -353015 -143834
18481A15769k2179J7369a83406b8714I9187f2707H3222a53540N8799j67668F6204
$$ 115769 93590 110959 -183406 -28714 99187 -62707 83222 -153540 -94741 -262409 66204
18469g932m5565k041D8935a50935j2671g7135A08331N4571i3931j45205B37115
$$ -7932 -53497 -55538 48935 -150935 -163606 -77135 108331 162902 -93931 -239136 237115
18457C7299a51428N7029I0817b7256A41556b28362j74916B09081E1485b6729j94119
$$ 37299 -151428 -94399 90817 -27256 141556 -228362 -403278 209081 51485 -26729 -220848
18446b20848a4096r4459n5671A86104g5598k6992G288J39792l4900b6645A53824
$$ -220848 -14096 -108555 -164226 186104 -75598 -102590 7288 147080 112180 -26645 153824
18434a74552A02233a12665j46339B4529Q162a40055C5045j5075i0118K2491E7675
$$ -174552 102233 -112665 -259004 24529 32691 -140055 35045 19970 -90118 -67627 57675
18422a15810l5360j01291A45195c4418J2458A97889c05306b6499l17640R3196
$$ -115810 -151170 -252461 145195 -34418 -21960 197889 -305306 -26499 -344139 -250943
18412b50943A2025a23430j38805E9080L4042b40413A09054d4389k38004B94982
$$ -250943 12025 -123430 -262235 59080 93122 -240413 109054 -44389 -282393 294982
18401c014l46918h8551B50079a28580E2824P1469g9750m5446p46A30629a06931
$$ -3014 -349932 -88551 250079 -128580 52824 124293 -79750 -125196 -125942 130629 -106931
18389A78274a12559B25618e2614j81873H8369B5032i6071L7606k20896g4882A66420
$$ 178274 -112559 225618 -52614 -234487 88369 25032 -96071 -58465 -279361 -74882 166420
18377B9270b84452d8854c310k7869D755N3676d17224F9289a66707p613Q3895A60376
$$ 29270 -284452 -48854 -3310 -31179 4755 58431 -417224 69289 -166707 -174320 -90425 160376
18364b09406a781j44875A09067J10848F3368g6787j493l1052G3722K71516f586
$$ -209406 -1781 -146656 109067 219915 63368 -76787 -78280 -109332 73722 345238 -6586
18352f2362A31301k4250K21795e11856C8601b53551A35251E2727J60446I9076
$$ -62362 131301 107051 328846 -511856 38601 -253551 135251 52727 213173 99076
18341A26523K6831K61507g2636L5276l543j24442r8506k6901g2305D3261a77602
$$ 126523 153354 414861 -72636 -37360 -40903 -165345 -263851 -290752 -72305 43261 -177602
18329b79364g8655C2493f7820l29312f5966j6195F3945h2944E2073J54878J83422
$$ -279364 -78655 32493 -67820 -397132 -65966 -82161 63945 -82944 52073 206951 390373
18318C90373a24999G494h748I4629c65455n3595a11794j43361a27433B0151b34936
$$ 390373 -124999 7494 -8748 94629 -365455 -419050 -111794 -255155 -127433 20151 -234936
18306e5438A18591K27925o0160a25818n999p5857j43361i1679j61884j25375J74663
$$ -55438 118591 346516 286356 -125818 -131817 -207674 -351035 -91679 -253563 -378938 -204275
18295b04275L4380Q3227A51755b77711f5124A58721C7608L94629a02111G7867
$$ -204275 -169895 -86668 151755 -277711 -65124 158721 37608 432237 -102111 77867
18284b48198c625r0008j5804M0528k60819n8582A3542a56545f9111b2768r7827
$$ -248198 -3625 -93633 -109437 -68909 -329728 -388310 13542 -156545 -69111 -22768 -120595
18273a20595e4098j67395A48988B8490b50272G3726b02124j69057K7268A94839
$$ -120595 -54098 -221493 148988 28490 -250272 73726 -202124 -371181 -343913 194839
18262g7539A13265a24514D5615K65905A043K48835b29846i3936j79365e3971A23755
$$ -77539 113265 -124514 45615 311520 1043 249878 -229846 -93936 -273301 -53971 123755
18250A31889a14328C1477a89159J0726G804Q9406J04187a77859F4614J74209d2921
$$ 131889 -114328 31477 -189159 -178433 7804 97210 201397 -177859 64614 238823 -42921
18238B02582p6483a43230E3012B5771b50628O2543L4691C4944a49480G4531a44503
$$ 202582 126099 -143230 53012 25771 -250628 -188085 -153394 34944 -149480 74531 -144503
18226f6058j24399A12468B9531Q2314r175a18025L6625A09971a31033A26211Q4638
$$ -66058 -190457 112468 29531 111845 102670 -118025 -81400 109971 -131033 126211 210849
18215B10849P7425o1453L70i3064A34791o0360i9877j90717A02886b89544A26314
$$ 210849 288274 226821 227191 -93064 134791 74431 -99877 -290594 102886 -289544 126314
18203d6257A10240l979N0986F2463E492a56212a967B00589a48662E1812J61160
$$ -46257 110240 106261 157247 62463 5492 -156212 -1967 200589 -148662 51812 212972
18192B12972a38488I8434d3993l46430g0413o3254B81874A1377J1814P3049h5606
$$ 212972 -138488 98434 -43993 -390423 -70413 -133667 281874 11377 23191 96240 -85606
18180E0856P7993F751J94034h4003B01004J20100a63162P616C7504H995P3678
$$ 50856 128849 6751 200785 -84003 201004 321104 -163162 -155546 37504 8995 82673
18169H2673a06623J3984A30931a08641I9607I316O7368j4829a60319B08053B3808
$$ 82673 -106623 -92639 130931 -108641 99607 9316 76684 61855 -160319 208053 23808
18157D280i7B4241a71269G3635O282J70654h9463p5365K2837B70739a94966R0691
$$ 4280 -97 24241 -171269 73635 79917 250571 -89463 -164828 -141991 270739 -194966 -104275
18145a04275B29039a06640A37109a03303A29886J23054A13139C597d8640j54652
$$ -104275 229039 -106640 137109 -103303 129886 252940 113139 3597 -48640 -203292
18135b03292N3755B63694b01855R3115I3715l8578b50251B4842K36955r5137M8417
$$ -203292 -149537 263694 -201855 -108740 93715 55137 -250251 24842 261797 166660 215077
18124B15077q6557M6184E4034Q942F087a27026A46132c9411B21333q0868k784
$$ 215077 128520 174704 54034 62976 6087 -127026 146132 -39411 221333 140465 137681
18113A37681a9339j02084F5816a393A86041A7148i4352k03349A4507a97505l12844
$$ 137681 -19339 -121423 65816 -1393 186041 17148 -94352 -297701 14507 -197505 -510349
18102e10349I9954m4124O6617a06979j46472A85933e9054I4943o284K27911A30746
$$ -510349 99954 55830 122447 -106979 -253451 185933 -59054 94943 88659 316570 130746
18090c17935B23515d01908a15120A78879b5149J384l8171e75H556M690J83105
$$ -317935 223515 -401908 -115120 178879 -25149 -23765 -61936 -575 8556 13246 196351
18079A96351F4631a24524C5550A4898D813b45293d5414I2058B6684K49562a92471
$$ 196351 64631 -124524 35550 14898 4813 -245293 -45414 92058 26684 276246 -192471
18067b5878m9027D7098a46589G9729a88698G7142O6349h9091A79630L9048a73525
$$ -25878 -74905 47098 -146589 79729 -188698 77142 143491 -89091 179630 218678 -173525
18055G3138J82602a44403A11163a9602C58820A19517c18861e3217A95065D1232
$$ 73138 255740 -144403 111163 -19602 358820 119517 -318861 -53217 195065 41232
18044A06188i9876d9195A66363f0171N428j0586l34521l1322d1529k3662L171
$$ 106188 -99876 -49195 166363 -60171 -54743 -65329 -399850 -431172 -41529 -65191 -62020
18033f2020B03696p6393d04225D27252a9145p8638B73387a89274A18379B5979
$$ -62020 203696 127303 -404225 427252 -19145 -97783 273387 -189274 118379 25979
18022A33750B8709K239a16735e0136j37005j05844c5321A27933b52848f8324j42822
$$ 133750 28709 30948 -116735 -50136 -187141 -292985 -35321 127933 -252848 -68324 -211146
18011b11146Q8655B1659e6729j80345k98232B42305m2258r8692J86736e507G3893
$$ -211146 -122491 21659 -56729 -237074 -535306 242305 200047 101355 288091 -5507 73893
17999b30406n4833A14446D9018b53759i7657G370b18218H7466J46071J66686A11730
$$ -230406 -285239 114446 49018 -253759 -97657 7370 -218218 87466 233537 400223 111730
17987E6982a94377A6107F20N2963k4597a93812R3611g466j24344j7642I4892J438
$$ 56982 -194377 16107 620 53583 28986 -193812 -100201 -7466 -131810 -149452 94892 96330
17975I6330K6147i5128b9511j37207r1853H9772A4543N9411A1832c61817J40969
$$ 96330 122477 -95128 -29511 -166718 -258571 89772 14543 73954 11832 -361817 -220848
17964b20848O6335A47103B9808a15571m3729C2620f7215m8601l28658H9318i8251
$$ -220848 -154513 147103 29808 -115571 -159300 32620 -67215 -115816 -444474 89318 -98251
17952A51418c9539R052k22143d3025B53185N5736a43568H3854b39244h9521B22526
$$ 151418 -39539 -30487 -252630 -43025 253185 308921 -143568 83854 -239244 -89521 222526
17940A94506r151b50759K5222d5481G4636J9878B6827L5228L7416A0212i968C8605
$$ 194506 185355 -250759 -225537 -45481 74636 94514 26827 62055 99471 10212 -9968 38605
17927B1141d4044m7046F2830j5316P822K70667G5326a28970j3893g251j69042
$$ 21141 -44044 -91090 62830 47514 55336 326003 75326 -128970 -142863 -7251 -176293
17916a76293B02070G3265b61054J06782N4395a949H567M55223A7833J35182A8179
$$ -176293 202070 73265 -261054 -154272 -99877 -1949 8567 463790 17833 153015 18179
17904F8771b78662B31931B4679R4162J80236H2730l3721B2319g7978K4356A6956
$$ 68771 -278662 231931 24679 118841 299077 82730 49009 22319 -77978 -53622 16956
17892H9381c8444d052C60005b6751A93650h7835C62212d2519A55288l4803G619
$$ 89381 -38444 -4052 360005 -26751 193650 -87835 362212 -42519 155288 120485 7619
17880A01230K0082a52172c5240E4833K33815B5673K30007q2663n6731D1762P3387
$$ 101230 121312 -152172 -35240 54833 288648 25673 255680 173017 116286 41762 115149
17869A15149L3433K56916A41743g7025C46282b3221C1993a11123C06965b05444
$$ 115149 148582 405498 141743 -77025 346282 -23221 31993 -111123 306965 -205444
17858a82973k03083f5473G8132J13774c4836r2814f997A35530J68271q4426j4383
$$ -182973 -386056 -65473 78132 191906 -34836 -127650 -6997 135530 303801 219375 204992
17847B04992j01803a31984B30910D2464b71533P4477A92063G0700C954K82173
$$ 204992 103189 -131984 230910 42464 -271533 -197056 192063 70700 3954 286127
17837B86127c2236A21781B1372M15339A87225M9971j08629j791C1223d2499B59102
$$ 286127 -32236 121781 21372 436711 187225 237196 128567 126776 31223 -42499 259102
17825B17935E1522a47782f693A51314b98751K7053I3464Q8533f5448k2189L3348
$$ 217935 51522 -147782 -6693 151314 -298751 -271698 93464 181997 -65448 -87637 -54289
17814e4289F6372J05247e019k69315m4053B23255b33883C16479g2156B77044j17569
$$ -54289 66372 171619 -5019 -274334 -318387 223255 -233883 316479 -72156 277044 159475
17803A59475J05606p0761a50948A07079D375d56703H3808a93337C00773a7225
$$ 159475 265081 194320 -150948 107079 4375 -456703 83808 -193337 300773 -17225
17792C63712j05532j10025k8113l8310J10845f9329C0546M3068l4979j6698J81956
$$ 363712 258180 148155 120042 81732 192577 -69329 30546 73614 38635 21937 203893
17781B03893m6264N4504o3871n2565C5820D677Q3234D3823L4913a99744D09526
$$ 203893 157629 212133 148262 95697 35820 4677 87911 43823 78736 -199744 409526
17769b38317j96353I2915a46226j65975E2945a37908a6327B20024A08903j0854
$$ -238317 -434670 92915 -146226 -312201 52945 -137908 -16327 220024 108903 98049
17759I8049e7443A93552j5235f4668I7589c81184a12367A84108L129i7166k0691
$$ 98049 -57443 193552 178317 -64668 97589 -381184 -112367 184108 187237 -97166 -117857
17748a17857B86413l8832g9544l49782D22511r8638a61196A43438D2163L4520
$$ -117857 286413 247581 -79544 -429326 422511 323873 -161196 143438 42163 76683
17738G6683Q7821M7030h4470j37137B46977a6925p5621A37334B9225K38612I2834
$$ 76683 164504 211534 -84470 -221607 246977 -16925 -92546 137334 29225 267837 92834
17726A1485d9339I5809O7378F5843L3663d7559F6238a1069k2123A89028J0844
$$ 11485 -49339 95809 163187 65843 99506 -47559 66238 -11069 -33192 189028 199872
17715A99872i837G93K43498h310k68844A11668a77683C2891J36700l0940J2276
$$ 199872 -9837 793 244291 -8310 -277154 111668 -177683 32891 169591 138651 150927
17704A50927a83694B14188E5590J48306H5788K08293a65625A13139d0196k98483
$$ 150927 -183694 214188 55590 203896 85788 294081 -165625 113139 -40196 -338679
17694c38679F9236d5224B65272a38334D2370C118J92756M3339e6671A07120J26071
$$ -338679 69236 -45224 265272 -138334 42370 3118 195874 239213 -56671 107120 233191
17683B33191c14360A76320a8951A49330c33308G7077L2232h7523A76222R0598
$$ 233191 -314360 176320 -18951 149330 -333308 77077 109309 -87523 176222 266820
17673B66820j27263e8422B62801A25990c1004G9053K97719E4114J23184G1362
$$ 266820 139557 -58422 262801 125990 -31004 79053 376772 54114 177298 71362
17662A09143e3789A01796J12385A109L0379R6144C420K16749M7901H4007J33633
$$ 109143 -53789 101796 214181 1109 31488 127632 3420 220169 268070 84007 217640
17651B17640r8474A3676g4458B55942b44414A92667b1891j87152A63995O8855
$$ 217640 119166 13676 -74458 255942 -244414 192667 -21891 -209043 163995 232850
17641B32850b68643I1632i9605A50961a28974A47180d4221j68862K0419B46160
$$ 232850 -268643 91632 -99605 150961 -128974 147180 -44221 -213083 -192664 246160
17630A78666q449D8455R5653a39839E3584K369A0222K54790a54100A75356N7827
$$ 178666 170217 48455 144108 -139839 53584 55953 10222 265012 -154100 175356 233183
17619B33183J68810A68788c9631F1280O8434b3447l5880I9132a16506A15736e1239
$$ 233183 401993 168788 -39631 61280 129714 -23447 -59327 99132 -116506 115736 -51239
17607a97896F2215K05411A18141f3992B34234g6061B38759K9349a99551B07618
$$ -197896 62215 267626 118141 -63992 234234 -76061 238759 268108 -199551 207618
17596H8249N4088c947D89K57889b6771B07790r0642a43737A66527F5394b04823
$$ 88249 142337 -3947 489 258378 -26771 207790 117148 -143737 166527 65394 -204823
17584E8145J48886J26189E7347O6873L673d9729B1298R8539B7013L21867b87858
$$ 58145 207031 333220 57347 124220 127893 -49729 21298 119837 27013 348880 -287858
17572B22728O4257h5817A7903c3469j14114B58673d0835l8810A19879L35563F9082
$$ 222728 286985 -85817 17903 -33469 -147583 258673 -40835 -79645 119879 455442 69082
17560i469A89751f971A12791B9735h2811A67657a53801a0875B15679J24356a45502
$$ -9469 189751 -6971 112791 29735 -82811 167657 -153801 -10875 215679 340035 -145502
17548C46273f197B74481A10599N9778L54497A63176P7267A11294K47918C69K42962
$$ 346273 -6197 274481 110599 170377 524874 163176 240443 111294 359212 369 243331
17537B43331J07059C9649L91386G930L08794L36116B32739j04036M732J04745
$$ 243331 350390 39649 431035 7930 316724 652840 232739 128703 133435 238180
17527B38180R6006J68964O3174J90281K39991l15737K73650m52039J50927l05624
$$ 238180 334186 503150 566324 756605 996596 680859 954509 502470 653397 347773
17517C47773J5314M8906J20549B55300K23509J55873C13924J76708L333M42970
$$ 347773 363087 411993 532542 255300 478809 634682 313924 490632 493965 936935
17507I36935j04575P5831j42464l16004k09527K08718J99166A79391M8433L6969
$$ 936935 832360 908191 765727 449723 240196 448914 648080 179391 227824 264793
17497B64793I9551d8718A82487K79121A46836M27253m0997j27273K5880j38871
$$ 264793 99551 -48718 182487 461608 146836 574089 533092 405819 431699 292828
17487B92828n402K10806p2465J20064j46943j16627p9F7302a8954B25918C8581
$$ 292828 287426 498232 425767 545831 398888 282261 282182 67302 -18954 225918 38581
17475A05657L0410J97127j49417K72354B04283B2004K09541q6767J59224r9189
$$ 105657 136067 333194 183777 456131 204283 22004 231545 144778 304002 204813
17465B04813b5206E34282j90529j49371K4242b8168C36955j54613L06363i4835
$$ 204813 -25206 534282 343753 194382 218624 -28168 336955 182342 488705 -94835
17454B88917J62047j7426h4876D22677J24774j88162J39783q6683A57544K8688
$$ 288917 450964 433538 -84876 422677 547451 359289 499072 412389 157544 186232
17444A86232j3537J63020J32057q0800A71692R4900E809J86219Q8194N6323n7787
$$ 186232 172695 335715 467772 386972 171692 266592 5809 192028 280222 336545 278758
17433B78758K7152j24508K18439r3847J7310j18126m9560c7451C24667j24841
$$ 278758 305910 181402 399841 305994 323304 205178 155618 -37451 324667 199826
17423A99826J39042L0506J69746A91069N9308n556K95071p2431p8966n9780A64153
$$ 199826 338868 369374 539120 191069 250377 244821 539892 467461 388495 328715 164153
17411F16111k27338L0047B05831J8183J57832j9419J9963j62668J89177A82505
$$ 616111 388773 418820 205831 224014 381846 362427 382390 219722 408899 182505
17400B5807J69882q9746L88710K4716k21500e6332C38335A43343L07310A52318
$$ 25807 195689 105943 494653 519369 297869 -56332 338335 143343 450653 152318
17389E2238d9075C25624g6404A86377K95723j53775N1429a41852A72970a08608
$$ 52238 -49075 325624 -76404 186377 482100 328325 379754 -141852 172970 -108608
17378B26948r4855m8212L97499B28630B2562K53211A30535M948L13846j58163
$$ 226948 132093 83881 481380 228630 22562 275773 130535 135483 449329 291166
17368B91166l5796K55038o8797n3648J48p5114G5924J24614K08272D311M12643
$$ 291166 255370 510408 441611 387963 388111 312997 75924 200538 408810 4311 416954
17357D16954A6479K39330F0711b0028B87258Q1629J07249r7331H7364K55487J46077
$$ 416954 16479 255809 60711 -20028 287258 368887 476136 378805 87364 342851 488928
17346D88928j88025A08993l3311g4022E28979k57721n3265C8622J90947J49968
$$ 488928 300903 108993 75682 -74022 528979 271258 217993 38622 229569 379537
17336C79537D4522J45008a47960b7056C88976j24771M72934A89519D3106L08014
$$ 379537 44522 189530 -147960 -27056 388976 264205 737139 189519 43106 351120
17326C51120j25405j3900L30001A02273L36383q9366q0609p891J38299A67896
$$ 351120 225715 211815 541816 102273 438656 349290 268681 260790 399089 167896
17315E41470B05152L39999B26098p6766K39670l2482A61413L4041k8882L1289
$$ 541470 205152 545151 226098 149332 389002 356520 161413 195454 166572 197861
17305A97861K89158j89014A8191J44595K6611K66282r5665A41984L16182j3441
$$ 197861 487019 298005 18191 162786 189397 455679 360014 141984 458166 444725
17295D44725j8079C7719M28182F0653Q9163K34934j1585L1181A92044q5284J12952
$$ 444725 426646 37719 465901 60653 149816 384750 373165 404346 192044 106760 219712
17284B19712I2587J01132L22328A65989K40461a18152C03377j12249O6852L4752
$$ 219712 92587 193719 516047 165989 406450 -118152 303377 191128 257980 292732
17274B92732K17002k47758N1299Q9095j94654k2387J51375C0268J63614l0505
$$ 292732 509734 261976 313275 402370 207716 185329 336704 30268 193882 163377
17264A63377J71463j09454g7812C15909J31781n7213o6240m0804J93360A55184
$$ 163377 334840 225386 -77812 315909 447690 390477 324237 283433 476793 155184
17253E29697A66394K2256L26848l0808M5807J01361Q5081j36966A09517L8865
$$ 529697 166394 188650 515498 484690 530497 631858 716939 579973 109517 148382
17243A48382K02461O6149j18814B1187O0170O8769K50873A97392o4694J64331
$$ 148382 350843 416992 298178 21187 81357 150126 400999 197392 132698 297029
17233B97029j42619L13430j69980J91379K90809n5100A75946q4199M64614B49798
$$ 297029 154410 467840 297860 489239 780048 724948 175946 91747 556361 249798
17222C95071n2407K95095B00041J04459J36415J23624j92605j24752N8328J2985
$$ 395071 342664 637759 200041 304500 440915 564539 371934 247182 305510 318495
17212C18495r6325J05267r513L75074B82450J06009Q3790J01449n1105j87088
$$ 318495 222170 327437 317924 692998 282450 388459 472249 573698 522593 335505
17202C35505m1579M33283j70171p7130L36175B26829L34658j30579A3781N80308
$$ 335505 293926 727209 557038 479908 816083 226829 561487 430908 13781 594089
17192E94089J85117j34718l06131k5351k3242J92595A40455M05636K5008k0476
$$ 594089 779206 644488 338357 313006 289764 482359 140455 546091 571099 550623
17182E50623m8469P1182L0018M5973B66996K89946A66386K54478L076j46751J70731
$$ 550623 502154 573336 603354 649327 266996 556942 166386 420864 423940 277189 447920
17171D47920m7459R6591J33345j84776R5203j09869j0425J13750M8575O390B75200
$$ 447920 400461 497052 630397 445621 540824 430955 420530 534280 582855 589245 275200
17159E79692M6116p2132M4291M680q7620A65659L06807j01721K14116k42141Q0359
$$ 579692 625808 553676 597967 602647 515027 165659 472466 370745 584861 342720 423079
17148D23079L72021l9776j77461k4239J10236N8175k24450A99731L37142n8094
$$ 423079 795100 755324 577863 553624 663860 722035 497585 199731 536873 478779
17138D78779J07384J03727j58308J21350n2000j62458K05726j12248P3184k11512
$$ 478779 586163 689890 531582 652932 600932 438474 644200 531952 605136 393624
17128C93624L02836C10523J25670K09612r7196J28929p0395k33443M0608A21527
$$ 393624 696460 310523 436193 645805 548609 677538 607143 373700 414308 121527
17117F33446J10660R5046j54052K1163r7520p4659J15055q38r8222K38494A61024
$$ 633446 744106 839152 685100 706263 608743 534084 649139 648301 550079 788573 161024
17105E45276K30719B96562J99230J01676J66180k98836L45936J79677k23360j81817
$$ 545276 775995 296562 495792 597468 763648 464812 810748 990425 767065 585248
17095E85248K92606k73960J98659j91799O7665J782j90741N32731k17182j07460
$$ 585248 877854 603894 802553 610754 678419 680201 489460 1022191 805009 697549
17085F97549K11710j76509Q3254j99907K30857l04977M13049m06093L06619J74256
$$ 697549 909259 732750 816004 616097 846954 541977 955026 548933 855552 1029808
17075A029808l68644L5055k77433M56328j20088q2078J16506L08818l37817K6182
$$ 1029808 661164 696219 418786 875114 755026 672948 789454 1098272 760455 786637
17065G86637K33080j11003P6281k16582j03603L59921l4552j97927q5915L70044
$$ 786637 1019717 908714 984995 768413 664810 1024731 990179 792252 706337 1076381
17055A076381l28767J91193p2494J24996P2443k88829N44863l68130k68854J61757
$$ 1076381 747614 938807 866313 991309 1063752 774923 1319786 951656 682802 844559
17045H44559J80000J85776l53948J22724J3230j8579J41554l2887j29717N4674
$$ 844559 1024559 1210335 856387 979111 992341 973762 1115316 1082429 952712 1007386
17035A007386J3585O7820k83923M06236k89029M30052k46087K43422k79762j27483
$$ 1007386 1020971 1088791 804868 1211104 922075 1352127 1106040 1349462 1069700 942217
17025I42217J54902L3661j45370Q8242M7030J50667k29283Q0413M8089j50598
$$ 942217 1097119 1130780 985410 1073652 1120682 1271349 1042066 1122479 1170568 1019970
17015A019970N15924m22102P2316o5974K58281j95684J13216M9811m9699Q0257
$$ 1019970 1535894 1113792 1186108 1120134 1378415 1182731 1295947 1345758 1296059 1376316
17005A376316J11564k90574n4529q4581L88984n55712O01005K02671l19446l97592
$$ 1376316 1487880 1197306 1142777 1058196 1447180 891468 1492473 1695144 1375698 978106
16995I78106K52535J07131j83132l166J89423J37800j29109R1278J00267m3818
$$ 978106 1230641 1337772 1154640 1151474 1340897 1478697 1349588 1440866 1541133 1497315
16985A497315j01241j89748M12019P156r9163k09149o2025L03131R8467r6023
$$ 1497315 1396074 1206326 1618345 1625501 1526338 1317189 1255164 1558295 1656762 1560739
16975A560739K60592m21230J77282J9446j22979K47416j46833j12727M23664l45526
$$ 1560739 1821331 1400101 1577383 1596829 1473850 1721266 1574433 1461706 1885370 1539844
16965A539844J25073M68884j92491k72857K68546l25934M03765R7460l26474r996
$$ 1539844 1664917 2133801 1941310 1668453 1936999 1611065 2014830 2112290 1785816 1775820
16955A775820k58547L70711k12978P6844K32010j37757N13698l80016k87716K91510
$$ 1775820 1517273 1887984 1675006 1751850 1983860 1846103 2359801 1979785 1692069 1983579
16945A983579K97344k87081K61601j29704M047L34439j72657o5698O7255l1673
$$ 1983579 2280923 1993842 2255443 2125739 2129786 2464225 2291568 2225870 2293125 2261452
16935B261452o6523L26388j41344J09584n0827q4453M15257n46179M03848K37577
$$ 2261452 2194929 2521317 2379973 2489557 2438730 2354277 2769534 2223355 2627203 2864780
16925B864780l34688m7429q5284J03952L03722q7850K39397l57112N59216J4114
$$ 2864780 2530092 2482663 2397379 2501331 2805053 2717203 2956600 2599488 3158704 3172818
16915C172818n73449P7224J87079k15053K67678K23103j71567M31028l63568O4640
$$ 3172818 2599369 2676593 2863672 2648619 2916297 3139400 2967833 3398861 3035293 3099933
16905C099933R2429k5701M7547n4528m2161K62090j81607L28463j18389K87434
$$ 3099933 3192362 3166661 3214208 3159680 3117519 3379609 3198002 3526465 3408076 3695510
16895C695510j67631J55874M8719j64945J19570P5022R4873J33132J4653j87652
$$ 3695510 3527879 3683753 3732472 3567527 3687097 3762119 3856992 3990124 4004777 3817125
16885C817125J97433n2747J62508J06929r4024J61189K32681k90310K89609o5034
$$ 3817125 4014558 3961811 4124319 4231248 4137224 4298413 4531094 4240784 4530393 4465359
16875D465359K71517r8045J73220k20748N22580k87934J19516L34140m13687K4751
$$ 4465359 4736876 4638831 4812051 4591303 5113883 4825949 4945465 5279605 4865918 4890669
16865D890669K28216M76017j13153j01124K81034P2295o2468J90160j15677k5471
$$ 4890669 5118885 5594902 5481749 5380625 5661659 5733954 5671486 5861646 5745969 5720498
16855E720498O51336k1984j37588J36541P868M1507M40280M6380M6392J73833
$$ 5720498 6371834 6349850 6212262 6348803 6356671 6398178 6838458 6884838 6931230 7105063
16845G105063J29103J00364j27392K18429M20242l04987P39349k85167J74180
$$ 7105063 7234166 7334530 7207138 7425567 7845809 7540822 8280171 7995004 8169184
16836H169184K7769L3671K97921K49680K09751O6924n354K0480M76353K64100
$$ 8169184 8196953 8230624 8528545 8778225 8987976 9054900 9049546 9070026 9546379 9810479
16826I810479Q3424M01547k68465L38406L52019J15704N80327M2618p0343K57957
$$ 9810479 9893903 10295450 10026985 10365391 10717410 10833114 11413441 11456059 11385716 11643673
16816A1643673L78791J32654M43043M94123m50562N39373L69251L82440M78427
$$ 11643673 12022464 12155118 12598161 13092284 12641722 13181095 13550346 13932786 14411213
16807A4411213N1139M17939M59712L28736O0796M86976J63694O22677M62707M42614
$$ 14411213 14462352 14880291 15340003 15668739 15729535 16216511 16380205 17002882 17465589 17908203
16797A7908203M26413K79277N73039N18584K12308R62064K68716P37877L80775
$$ 17908203 18334616 18613893 19186932 19705516 19917824 20879888 21148604 21886481 22267256
16788B2267256O37846N59097N29004Q68124N56508N83773N87205J039512O96845
$$ 22267256 22905102 23464199 23993203 24861327 25417835 26001608 26588813 27628325 28325170
16779B8325170O17829J200716P05060R10575N27313Q87957J053256J006426J141407
$$ 28325170 28942999 30143715 30848775 31759350 32286663 33174620 34227876 35234302 36375709
16770C6375709R14488J369489R58180J243473J017267J260618J486523J541197
$$ 36375709 37290197 38659686 39617866 40861339 41878606 43139224 44625747 46166944
16762D6166944J215937J117365J469926J193658J656823J424925J676483J324250
$$ 46166944 47382881 48500246 49970172 51163830 52820653 54245578 55922061 57246311
16754E7246311J838501J594693J326576J893456J542385J604905K019216J671859
$$ 57246311 59084812 60679505 62006081 63899537 65441922 67046827 69066043 70737902
16746G0737902J217323J940071J609856J319861J728749J186130J566084J186292
$$ 70737902 71955225 73895296 75505152 76825013 78553762 79739892 81305976 82492268
16738H2492268J743594J077637J016426O30346O31106P00512M93484O99495m8632
$$ 82492268 84235862 85313499 86329925 86960271 87591377 88291889 88785373 89484868 89436236
16729H9436236J10672K20467l55568k05516o51594m85997q76933p25491j099467
$$ 89436236 89546908 89767375 89411807 89206291 88554697 88068700 87191767 86466276 85366809
16720H5366809j246823j234845r96756j208793j451612j605010j280912j562179
$$ 85366809 84119986 82885141 81888385 80679592 79227980 77622970 76342058 74779879
16712G4779879j841107j670759j516701j582075j511442j954983j380902j761213
$$ 74779879 72938772 71268013 69751312 68169237 66657795 64702812 63321910 61560697
16704F1560697j538474j742360j453598j319483j451546j769607j157354j511836
$$ 61560697 60022223 58279863 56826265 55506782 54055236 52285629 51128275 49616439
16696D9616439j362230j263922j313765j622639j150709j489768n70005j264960
$$ 49616439 48254209 46990287 45676522 44053883 42903174 41413406 40843401 39578441
16688C9578441j315718j096398p42603j210989r18622q38924r28739q62837n83362
$$ 39578441 38262723 37166325 36423722 35212733 34294111 33455187 32526448 31663611 31080249
16679C1080249j046705o27854r24404q81180o89815n23055m26097r51786p83438
$$ 31080249 30033544 29405690 28481286 27600106 26910291 26387236 25961139 25009353 24225915
16670B4225915l38300k90579r54705l63218p29288m01751n00292m26625k76449
$$ 24225915 23887615 23597036 22642331 22279113 21549825 21148074 20647782 20221157 19944708
16661A9944708p40140n23850l13412n84323j07570n08783l32324j30730m35390
$$ 19944708 19204568 18680718 18367306 17782983 17675413 17166630 16834306 16703576 16268186
16652A6268186m47507j74623o43314j85817l22687j96983j68259n96843j51100
$$ 16268186 15820679 15646056 15002742 14816925 14494238 14297255 14128996 13532153 13381053
16643A3381053j7555m53909m43651j0665o59696J84967m53378K2984p4298k18194
$$ 13381053 13363498 12909589 12465938 12455273 11795577 11980544 11527166 11550150 11475852 11257658
16633A1257658j75476k14696l65744k29986J87284n59207k7884m2495m26019k4929
$$ 11257658 11082182 10867486 10501742 10271756 10459040 9899833 9871949 9829454 9403435 9378506
16623I378506O5010m50110j59956k52999J78934j74291l53251k1696k70195J23231
$$ 9378506 9443516 8993406 8833450 8580451 8759385 8585094 8231843 8210147 7939952 8063183
16613H063183l71572M7470J90225m20486o3868j03352k14865J01347l93782K95728
$$ 8063183 7691611 7739081 7929306 7508820 7444952 7341600 7126735 7228082 6834300 7130028
16603G130028k02437j4305j47840m40724l47783O73925m37614o6911j52591J02912
$$ 7130028 6927591 6913286 6765446 6324722 5976939 6650864 6213250 6146339 5993748 6096660
16593F096660m19533N88829l74478k27600Q9254l77910l472Q4274J59242n52620
$$ 6096660 5677127 6265956 5891478 5663878 5753132 5375222 5371750 5456024 5615266 5062646
16583E062646J10806l1047j00971K71506n19528M61872m90452j19248R3952k1393
$$ 5062646 5173452 5142405 5041434 5312940 4793412 5255284 4764832 4645584 4739536 4718143
16573D718143J48633l84674k87022N71026n53473j39752O76794m32330J92287
$$ 4718143 4866776 4482102 4195080 4766106 4212633 4072881 4749675 4317345 4509632
16564D509632o16792L58279k49792j59801K27774l65000L26703l11612O47490
$$ 4509632 3892840 4251119 4001327 3841526 4069300 3704300 4031003 3719391 4366881
16555D366881n41252m7585j0437M07143n12106k45602O1927k04966r2532J59348
$$ 4366881 3825629 3778044 3767607 4174750 3662644 3417042 3478969 3274003 3181471 3340819
16545C340819J24247j59115J42404k96700J90716j2325K49870n94061k6949L82655
$$ 3340819 3465066 3305951 3448355 3151655 3342371 3330046 3579916 2985855 2958906 3341561
16535C341561m07210j3446K73861m18323L72080k6935l98819J63056K26379j68263
$$ 3341561 2934351 2920905 3194766 2776443 3148523 3121588 2722769 2885825 3112204 2943941
16525B943941j64002J43481J53242n56131K33611j56781k16180M38888l332l54830
$$ 2943941 2779939 2923420 3076662 2520531 2754142 2597361 2381181 2820069 2816737 2461907
16515B461907k39442K27139K33846m36983o4137O67730j79759n12494K95667j79842
$$ 2461907 2222465 2449604 2683450 2246467 2182330 2850060 2670301 2157807 2453474 2273632
16505B273632m8285K36072k34567M74881l92316K3381j60228L74673l91999J63352
$$ 2273632 2225347 2461419 2226852 2701733 2309417 2332798 2172570 2547243 2155244 2318596
16495B318596K1478j63635P1576r9216L4226n5038j4327l87910K32697J17704
$$ 2318596 2340074 2176439 2248015 2148799 2183025 2127987 2113660 1725750 1958447 2076151
16485B076151J24951j21640J53381j70632J86413k90749j69208n3952K63075l08027
$$ 2076151 2201102 2079462 2232843 2062211 2248624 1957875 1788667 1734715 1997790 1689763
16475A689763L56154n1545q9378J65042n23578N71335k37598j9941l49394K61507
$$ 1689763 2045917 1994372 1904994 2070036 1546458 2117793 1880195 1860254 1510860 1772367
16465A772367J70394l56893L78217m60178L18071R107j21884J97341k05626O8832
$$ 1772367 1942761 1585868 1964085 1503907 1821978 1831085 1709201 1906542 1700916 1769748
16455A769748l04318N12361l05335K41240m22748J93714k39255J56052K17502
$$ 1769748 1465430 1977791 1672456 1913696 1490948 1684662 1445407 1601459 1818961
16446A818961l4059j47208q1580p7872K05332n84844L27467J53142J01059n21682
$$ 1818961 1784902 1637694 1556114 1478242 1683574 1098730 1426197 1579339 1680398 1158716
16436A158716N2960k03095N31896k59351j095R9693K76528j05960R8195j92348
$$ 1158716 1211676 1008581 1540477 1281126 1280031 1379724 1656252 1550292 1648487 1456139
16426A456139J95134k76744q7900Q2304K69105o61133L75195M8023n89928N68610
$$ 1456139 1651273 1374529 1286629 1368933 1638038 976905 1352100 1400123 810195 1378805
16416A378805k0916j96078J37294j2800p1046J98430l57745j82903J87766J32353
$$ 1378805 1357889 1161811 1299105 1286305 1215259 1413689 1055944 873041 1060807 1193160
16406A193160k16674J35527J44917o0990O152j56179Q9733j37119L71443j42563
$$ 1193160 976486 1112013 1256930 1195940 1202092 1045913 1135646 998527 1369970 1227407
16396A227407m8505m4472J12069J57740k99629j60774J37453J4644J88186j19516
$$ 1227407 1178902 1134430 1246499 1404239 1104610 943836 1081289 1095933 1284119 1164603
16386A164603O8582k27874J58031r9789p3089M38743k37980k24407k01136L06074
$$ 1164603 1233185 1005311 1163342 1063553 990464 1429207 1191227 966820 765684 1071758
16376A071758J56299l92917K32052l29427M77040l84318O8281J40944K39941n27303
$$ 1071758 1228057 835140 1067192 737765 1214805 830487 898768 1039712 1279653 752350
16366G52350L40551j98835Q1111L22716l51344L46031n80755L7169L76630j94423
$$ 752350 1092901 894066 975177 1297893 946549 1292580 711825 748994 1125624 931201
16356I31201k17779L31974p4583k96103J71101l01477K23671Q7897K77252l40057
$$ 931201 713422 1045396 970813 674710 845811 544334 768005 855902 1133154 793097
16346G93097J55354l0921r5106K76036l52186N3312K03261m06063L39815j59229
$$ 793097 948451 917530 822424 1098460 746274 799586 1002847 596784 936599 777370
16336G77370K6004K73593o1199l54211K98883j22777j14315K7723L58957m50562
$$ 777370 803374 1076967 1015768 661557 960440 837663 723348 751071 1110028 659466
16326F59466M22769l20583j4796j63967Q4403J64352j02530M70606E32368K56726
$$ 659466 1082235 761652 746856 582889 667292 831644 729114 1199720 532368 789094
16316G89094J5003p6034J31856k04604O0421m0514J14902j08103R2404r3852k28165
$$ 789094 804097 728063 859919 655315 715736 675222 790124 682021 774425 680573 452408
16305D52408J68430j53439L47069p2262Q3366l40468j69357O51527m41473k02221
$$ 452408 620838 467399 814468 742206 825572 485104 315747 967274 525801 323580
16295C23580L07389P3544L04588m91609J9233k2451L55482j83909k10274J04417
$$ 323580 630969 704513 1009101 517492 536725 514274 869756 685847 475573 579990
16285E79990j58149L24113J82840m41154J21467K06539k04030j25503J55962N9338
$$ 579990 421841 745954 928794 487640 609107 815646 611616 486113 642075 701413
16275G01413l6116l31768J46544L06325p3639k05106L84658j82712q6662L6367
$$ 701413 665297 333529 480073 786398 712759 507653 892311 709599 622937 659304
16265F59304k60856K68360j27046J82752n5691Q271p1239M3080k3915N0777q8841
$$ 659304 398448 666808 539762 722514 666823 675094 603855 646935 623020 673797 584956
16254E84956k26796j66963K93642J54714L3405Q3624k49889j7178J70384l5042
$$ 584956 358160 191197 484839 639553 672958 756582 506693 489515 659899 624857
16244F24857J9810k96236K19502k47248L9400K39328k42398I3852K74959K37361
$$ 624857 644667 348431 567933 320685 360085 599413 357015 93852 368811 606172
16234F06172j02042j07291k2453L47999l14599J42586J9030N0404o5089p7971
$$ 606172 504130 396839 374386 722385 407786 550372 569402 619806 554717 476746
16224D76746A61949J41408K84533B72437L70174l6864m8208n8719Q1038k13520
$$ 476746 161949 303357 587890 272437 642611 605747 557539 498820 579858 366338
16214C66338J80573Q2936k35919k7026R9821K60928l06585q5159j53203L80307
$$ 366338 546911 629847 393928 366902 466723 727651 421066 335907 182704 563011
16204E63011j23282o5035M87897m04668m7727p4387r8436J70826j76588n5753
$$ 563011 439729 374694 862591 457923 410196 335809 237373 408199 231611 175858
16194A75858J47248K79099k72117A02298M92815k83751k4754q569M37270j61657
$$ 175858 323106 602205 330088 102298 595113 311362 286608 278039 715309 553652
16184E53652A54827J69573R9067M2522A78039J95788j27084J59870j35258J7851
$$ 553652 154827 324400 423467 465989 178039 373827 246743 406613 271355 289206
16174B89206J71564A73772K13969n0845R2944q3784J69964j96276D4242K19798
$$ 289206 460770 173772 387741 336896 429840 346056 516020 319744 44242 264040
16164B64040J32333F0972O0802L01679j61547n5110K39485E8802J47483L12582
$$ 264040 396373 60972 121774 423453 261906 206796 446281 58802 206285 518867
16154E18867B49883L31359J09964A70858n4700K54221A17266J76900P3901C1998
$$ 518867 249883 581242 691206 170858 116158 370379 117266 294166 368067 31998
16143B24691m9076K88506B14993M2118K29454H8405J80099M3641A02079L76468
$$ 224691 175615 464121 214993 257111 486565 88405 268504 312145 102079 478547
16133D78547h903C44344F6663J46225J94556r9342p4947L6768j9786J5473F0937
$$ 478547 -8903 344344 66663 212888 407444 308102 233155 269923 250137 265610 60937
16121A59872J46596H1586J26431K28955d7605E67790A91866J73517m3065J25344
$$ 159872 306468 81586 208017 436972 -47605 567790 191866 365383 322318 447662
16111D47662j55871J48721F1312r237M06687A03968j4760c6137J2853C24390h5168
$$ 447662 291791 440512 61312 52075 458762 103968 89208 -36137 -23284 324390 -85168
16099A24362J5131L65331e967j5215G2622L96735k08180A28591n1284k0950N4940
$$ 124362 139493 504824 -5967 -21182 72622 469357 261177 128591 77307 56357 111297
16088A11297J27273J0334b33683D21212a31673D39203j20850A1802J86483a05980
$$ 111297 238570 248904 -233683 421212 -131673 439203 318353 11802 198285 -105980
16077A86420p1857L58201d6391r8234G61893A07360a89423A66287J89627H5897
$$ 186420 114563 472764 -46391 -144625 761893 107360 -189423 166287 355914 85897
16066C98673A85996J45899n9059M0209r9068C5147L43772j34305j04182K48973
$$ 398673 185996 331895 272836 313045 213977 35147 378919 244614 140432 389405
16056C89405c4705A9308J56903q0808K36212b17624A61569a35274F0845R9590
$$ 389405 -34705 19308 176211 95403 331615 -217624 161569 -135274 60845 160435
16046A60435p743K09859j13286a4591B49974n4647a0805A82905J67584b14897
$$ 160435 152692 362551 249265 -14591 249974 195327 -10805 182905 350489 -214897
16035B28332J72954d1867q6886A52720Q6886L047I0409a32347A3290K02790P2318
$$ 228332 401286 -41867 -128753 152720 239606 242653 90409 -132347 13290 216080 288398
16024B88398A4717J22587n2347H852J32108A5542L275J90677H3848L90388k18678
$$ 288398 14717 137304 84957 8852 140960 15542 18817 209494 83848 474236 255558
16013B55558a3399j8656j61176i3972j11606b4362C25974q7021c421C23990d0882
$$ 255558 -13399 -32055 -193231 -93972 -205578 -24362 325974 238953 -3421 323990 -40882
16001B15705M3968c3356A22126O3795a84266Q2111C10564d0441B86425D6895f8058
$$ 215705 259673 -33356 122126 185921 -184266 -102155 310564 -40441 286425 46895 -68058
15989D13968n2137Q1544K14364K36511K03023l16029k7184k48960J4088B36149
$$ 413968 361831 443375 657739 894250 1097273 781244 754060 505100 519188 236149
15978A23726J14984C5966Q660j2007e3229B89044p9497a58677D30091h9486A64830
$$ 123726 238710 35966 44626 32619 -53229 289044 209547 -158677 430091 -89486 164830
15966C66117b09935C14588c4270o6414A32354j0486a67625B89502K56856c9151
$$ 366117 -209935 314588 -34270 -100684 132354 121868 -167625 289502 546358 -39151
15955A15480b2398M84B66070M8700D9806M04590b45913A3301J98340a41652G4712
$$ 115480 -22398 -21914 266070 314770 49806 454396 -245913 13301 211641 -141652 74712
15943f6867f820C0713d4626B6206K52985H433c43l505k09586q569h3868A13743
$$ -66867 -6820 30713 -44626 26206 279191 8433 -343 -3848 -213434 -222003 -83868 113743
15930A25648a79328P009A64352i7829A93897r3400k2461K64863G7126a29929c5108
$$ 125648 -179328 -172319 164352 -97829 193897 100497 78036 342899 77126 -129929 -35108
15918B83291Q893e184p0267c6129j8995A53984c5396I5281m167J28449a12754
$$ 283291 292184 -5184 -75451 -36129 -55124 153984 -35396 95281 91114 219563 -112754
15906B90245c4765j94401R4501C1135J71116K02455b15330A95829Q8300A5288
$$ 290245 -34765 -229166 -134665 31135 202251 404706 -215330 195829 284129 15288
15895g804A317Q4272a38821c4366F4781L48670E985a23345B85753h9307b9142
$$ -7804 1317 85589 -138821 -34366 64781 413451 5985 -123345 285753 -89307 -29142
15883D7026h1834k09561D5910P0662D7427L3094G401g4698B5361M0800b05091
$$ 47026 -81834 -291395 45910 116572 47427 80521 7401 -74698 25361 66161 -205091
15871i215A61526A4727p00f6662G5940B3013M3102K2341a86471D72309a32692
$$ -9215 161526 14727 14027 -66662 75940 23013 66115 88456 -186471 472309 -132692
15859A4050b04800g845l42995J49493A9651K5575b095p8366c6945j60060e3720
$$ 14050 -204800 -7845 -350840 -201347 19651 45226 -2095 -80461 -36945 -197005 -53720
15847A25982a80992B33971b41515a00211a3004F2745J62438F4219J8647J8585
$$ 125982 -180992 233971 -241515 -100211 -13004 62745 225183 64219 82866 101451
15837A01451Q6204h4449r0274H8180K43566c1740H4983L9811C1553K24689a88626
$$ 101451 187655 -84449 -174723 88180 331746 -31740 84983 124794 31553 256242 -188626
15825A17360K25976a19405L439b2661B73395a01002j39481N7090A82771b7798
$$ 117360 343336 -119405 -115966 -22661 273395 -101002 -240483 -183393 182771 -27798
15814A34425e2170B25081j02971g7359C0124b02721o5132P9121a7601n2019A03703
$$ 134425 -52170 225081 122110 -77359 30124 -202721 -267853 -188732 -17601 -69620 103703
15802B4328h3368E0183g0318m8595b9937A79480b19128B58818I4739f5797n24781
$$ 24328 -83368 50183 -70318 -118913 -29937 179480 -219128 258818 94739 -65797 -590578
15791e90578c1669I9597a40630I7886a34814d7638r9149E2787b87312A13898a23354
$$ -590578 -31669 99597 -140630 97886 -134814 -47638 -146787 52787 -287312 113898 -123354
15779b22472d1788B64632b8390k8083k36388i3143o7286B29231C2788J72878C4826
$$ -222472 -41788 264632 -28390 -56473 -292861 -93143 -160429 229231 32788 205666 34826
15767B71626a18541j14618h0719f764m6021A51476l2412N7828H7264J33589O3049
$$ 271626 -118541 -233159 -80719 -6764 -52785 151476 119064 176892 87264 220853 283902
15756B83902a56024B35531b44866j11695B18233k7955A8798a02229A71195E2891
$$ 283902 -156024 235531 -244866 -356561 218233 190278 18798 -102229 171195 52891
15745A99638a10736B18334E6411O5188c17223A76018e2586a7751G7436K8301n1863
$$ 199638 -110736 218334 56411 121599 -317223 176018 -52586 -17751 77436 105737 53874
15734E3874N2268b65678f512j73481N9421E7971d10520A93531J86024b953j64465
$$ 53874 106142 -265678 -6512 -179993 -120572 57971 -410520 193531 379555 -2953 -167418
15723a67418n2918H080J63376J44989p5689p8205E7525J2479K71256a50431b8414
$$ -167418 -220336 8080 171456 316445 240756 162551 57525 70004 341260 -150431 -28414
15711A31089a57876a6537j84761A2338J55665c0024B5444J62022a071j99706C9711
$$ 131089 -157876 -16537 -201298 12338 168003 -30024 25444 187466 -1071 -200777 39711
15699D07330A03075e7184A34808n889Q2232a078A62828f404C0240R1268a3441
$$ 407330 103075 -57184 134808 128919 211151 -1078 162828 -6404 30240 121508 -13441
15687B75299N15B2243J5267J61410a78836J158B14111b40064e2032o6889l28496
$$ 275299 275814 22243 37510 198920 -178836 -177678 214111 -240064 -52032 -118921 -447417
15676d47417D5176a25408A68374k3788b63332F4477b7970B25536B1h4191m2877
$$ -447417 45176 -125408 168374 144586 -263332 64477 -27970 225536 21 -84191 -127068
15665a27068d2566k35283i521q4184B33172a09508B6397b11955O9768f9427A22886
$$ -127068 -42566 -277849 -9521 -93705 233172 -109508 26397 -211955 -142187 -69427 122886
15653e5101q5055H1126i0851E0965A6625K6915R9595F3727a04006A33805J5519
$$ -55101 -140156 81126 -90851 50965 16625 43540 143135 63727 -104006 133805 149324
15642A49324i8542q1237Q3375a2479l5961G9530a57802A26104a9877I0217B0990
$$ 149324 -98542 -179779 -96404 -12479 -48440 79530 -157802 126104 -19877 90217 20990
15630c49364J36468A92332b57520B20798H2269g172k18631d2528m6636b092m18825
$$ -349364 -212896 192332 -257520 220798 82269 -7172 -225803 -42528 -89164 -2092 -420917
15619d20917a52878j4414C9816g1062l292o2953f4349B2661P0154a94542H2895
$$ -420917 -152878 -167292 39816 -71062 -74354 -137307 -64349 22661 92815 -194542 82895
15607A04546a49263l27957b8915A43869M2545d39630a73987A8302i7359d3292
$$ 104546 -149263 -477220 -28915 143869 186414 -439630 -173987 18302 -97359 -43292
15596i8605j04574A19707b96457H5121f9607c1113f567C09961a30638A8244J03871
$$ -98605 -203179 119707 -296457 85121 -69607 -31113 -6567 309961 -130638 18244 122115
15585A22115n688b41215h4581a9916j70195f6381C6324A4792b03773b2292A05276
$$ 122115 116427 -241215 -84581 -19916 -190111 -66381 36324 14792 -203773 -22292 105276
15573A27259i0924F9305N3809P9372E785N0184j8345c86512E9072D741J29251
$$ 127259 -90924 69305 123114 202486 5785 55969 37624 -386512 59072 4741 133992
15562A33992a05589A57710b32239D6956b09499i1731a1256A58197D0921i6783
$$ 133992 -105589 157710 -232239 46956 -209499 -91731 -11256 158197 40921 -96783
15551a90517J9250m1399C78233C6759I024M29736c8291A91194K4708I988J93460
$$ -190517 -171267 -212666 378233 36759 9024 438760 -38291 191194 215902 9988 203448
15540B03448o8030J10342o9791F8097a29312e794F3497J21748a2746k39625Q794
$$ 203448 135418 245760 175969 68097 -129312 -5794 63497 185245 -12746 -252371 -243577
15529b43577B24244Q3877q3232H3710e268j05228C5254a66469f9971D3415L8204
$$ -243577 224244 308121 224889 83710 -5268 -110496 35254 -166469 -69971 43415 81619
15518H1619e3560C2649R6299l2406O759E1269P074f3624A92651j7321j1223L0188
$$ 81619 -53560 32649 128948 96542 103301 51269 58343 -63624 192651 175330 164107 194295
15506A94295m9525a80143d8161b1364E2798M51690F9389A8689N5148J28907K59155
$$ 194295 144770 -180143 -48161 -21364 52798 504488 69389 18689 73837 202744 461899
15495D61899b79569B39684K26470b65602c8668B60203i3399B38327h6849A27957
$$ 461899 -279569 239684 466154 -265602 -38668 260203 -93399 238327 -86849 127957
15484h435D9397d1124Q77I1806h3595B52090P0903O5052r4629O31719C48599P7895
$$ -8435 49397 -41124 -40247 91806 -83595 252090 322993 388045 293416 925135 348599 426494
15472D26494A77262D1208a0718H4629b54017C37961G6171h4263A14145c8236G660
$$ 426494 177262 41208 -10718 84629 -254017 337961 76171 -84263 114145 -38236 7660
15460G5497c43952B08429N9107H7345a84919E8961c11872A06740b9438B37817
$$ 75497 -343952 208429 267536 87345 -184919 58961 -311872 106740 -29438 237817
15449i2864A92527J12896F5460M00342L82680j47767O03268P1281D37991L12299
$$ -92864 192527 305423 65460 465802 848482 700715 1303983 1375264 437991 750290
15439G50290C23343f3000D00104A09904f1260C19660a51288C74907b90419A35973
$$ 750290 323343 -63000 400104 109904 -61260 319660 -151288 374907 -290419 135973
15428e8445C3944a37957q1280d7841K0190B19523m0082F71d7003l16256J73319
$$ -58445 33944 -137957 -219237 -47841 -27651 219523 179441 671 -47003 -363259 -189940
15417a89940G6700a45323c1172A11934e29131b902A01587h1915A12501K6138F4313
$$ -189940 76700 -145323 -31172 111934 -529131 -2902 101587 -81915 112501 138639 64313
15405a92058H1707b9588o3404A50556B4595M5621i1418K2371b4205Q53A08649
$$ -192058 81707 -29588 -92992 150556 24595 70216 -91418 -69047 -24205 -23352 108649
15393b35298C9275g2756C78061i8004H3617Q1494C4940A5757J30770d2478l19411
$$ -235298 39275 -72756 378061 -98004 83617 165111 34940 15757 146527 -42478 -361889
15382c61889J08666c5434A66263g049B97717d2830I5232g1576D01780j80291c2640
$$ -361889 -253223 -35434 166263 -7049 297717 -42830 95232 -71576 401780 221489 -32640
15370E48878H0075L41565A69510d5167A95180J32415M4107k2244P2315j93064
$$ 548878 80075 421640 169510 -45167 195180 327595 371702 349458 421773 228709
15360B28709b8882B25124j01757i4181m0300m3438A95430B7170c1570B20194j1544
$$ 228709 -28882 225124 123367 -94181 -134481 -177919 195430 27170 -31570 220194 208650
15349B08650l7743L7962l8889C1282M9627K15033J33371O0840k41628K7839A16690
$$ 208650 170907 208869 169980 31282 80909 295942 429313 490153 248525 276364 116690
15337A14015K16231b8787l8828D0340K15240A25259K28035a16140A93659a84923
$$ 114015 330246 -28787 -67615 40340 255580 125259 353294 -116140 193659 -184923
15326A29039m7261Q3666j6908K1290h8222A92566a36268b7818A90195q821J529
$$ 129039 81778 165444 148536 169826 -88222 192566 -136268 -27818 190195 181374 182903
15315A82903H8305P552J00279K04239A69397L44592A03646J42341B7010K59887
$$ 182903 88305 95857 196136 400375 169397 513989 103646 245987 27010 286897
15305B86897C1285i3744p6335D9078j2284J27534m0519a93332B04230a61211A35569
$$ 286897 31285 -93744 -170079 49078 36794 164328 123809 -193332 204230 -161211 135569
15293I5258K2736L14453E7367c3899k06967G6691N093L8268K7999i4895B329e1998
$$ 95258 117994 432447 57367 -33899 -240866 76691 81784 120052 148051 -94895 2329 -51998
15280a89387f1198k9859B73616a06265B23332a84673A37518b7630A97708I302
$$ -189387 -61198 -91057 273616 -106265 223332 -184673 137518 -27630 197708 9302
15269a98747C57705e3068B88001b91664A49268a62246G8760J16746N8530J94559
$$ -198747 357705 -53068 288001 -291664 149268 -162246 78760 195506 254036 448595
15259D48595b08103a9009A76909n5497J32616r0099J46412a68138C3403k226b08216
$$ 448595 -208103 -19009 176909 121412 254028 163929 310341 -168138 33403 31177 -208216
15247A82988F2903L11869H8214L39590M91008Q53289n60296L4308R0719C81983
$$ 182988 62903 374772 88214 427804 918812 1772101 1211805 1246113 1336832 381983
15236C64357E6473K54213j25449a57824A39193b38166L1805B6307N61b08759D4194
$$ 364357 56473 310686 185237 -157824 139193 -238166 -206361 26307 26868 -208759 44194
15224A52657a95888F6068R2072R0939b9127l40970B97757C0983G322M8974B4416
$$ 152657 -195888 66068 158140 249079 -29127 -370097 297757 30983 7322 56296 24416
15212H1394g3937F0199P1922A0838h8696A23056J04766K9532k691F4358k4553
$$ 81394 -73937 60199 132121 10838 -88696 123056 227822 257354 254663 64358 39805
15201C9805a8066H858J36589b76225A57437b71498i4368A3907j044i6151a2931
$$ 39805 -18066 8858 145447 -276225 157437 -271498 -94368 13907 12863 -96151 -12931
15189C36311D8689M7056a22263N616b0583h410c87j28921A78176p9973a94958
$$ 336311 48689 95745 -122263 -116647 -20583 -8410 -387 -129308 178176 98203 -194958
15177I7105P9330o8197o078M969a68603b9553D10195j8844a01782B21263D6458
$$ 97105 176435 108238 102160 107129 -168603 -29553 410195 391351 -101782 221263 46458
15165C8471I913K76953H0312f4815b7674n4523j76517O4292D52593H440i1960
$$ 38471 9913 286866 80312 -64815 -27674 -82197 -258714 -194422 452593 8440 -91960
15153b6130B78774J36621I9801K08049j4681a72083r4074e7907C0437N1563H681
$$ -26130 278774 415395 99801 307850 293169 -172083 -266157 -57907 30437 82000 8681
15141a46609D218J45947j6015f0297D0406a33223A97167F1885J12000J21275j06816
$$ -146609 4218 150165 134150 -60297 40406 -133223 197167 61885 173885 295160 188344
15130A88344b65784A68613d4941C6484a2550C7252O8806Q545M1503J61044A7387
$$ 188344 -265784 168613 -44941 36484 -12550 37252 106058 114603 156106 317150 17387
15118C30324R0874j77465k1639P6252A04672a19033A09395O2543N4688b97702
$$ 330324 421198 243733 222094 298346 104672 -119033 109395 171938 226626 -297702
15107B31753D3854j0507J20046p3355a43795G6131J01160i864A09145b43267A99431
$$ 231753 43854 33347 153393 80038 -143795 76131 177291 -9864 109145 -243267 199431
15095A59544a22935A08698i460B10612J7386i6650A09409n4373L7930J44480G5372
$$ 159544 -122935 108698 -9460 210612 227998 -96650 109409 55036 92966 237446 75372
15083e4782A05347h4036B58228K0171J58560b89593c7777D2729a34385M6065D9016
$$ -54782 105347 -84036 258228 278399 436959 -289593 -37777 42729 -134385 -88320 49016
15071e7918j54940C8622J27201J36933l520H6092f54C88765f9407B9576K60382
$$ -57918 -212858 38622 165823 302756 299236 86092 -654 388765 -69407 29576 289958
15060B89958A622e1747j095A02822a5093C91682L0998E3605P5918N7297D1484
$$ 289958 1622 -51747 -52842 102822 -15093 391682 422680 53605 129523 186820 41484
15048E12602j06490j86754k2676K5634M93444B56590J43616c2985B33970G0208
$$ 512602 406112 219358 196682 222316 715760 256590 400206 -32985 233970 70208
15037E45797e3560D7369M72711G1460K387O20875A25711P16470C34209K86855
$$ 545797 -53560 47369 520080 71460 73847 694722 125711 842181 334209 621064
15027F21064Q3218B87291L20188B84543L26519A14359M01195j82875J39044q0394
$$ 621064 704282 287291 607479 284543 611062 114359 515554 332679 471723 391329
15017C91329J85847B65625R910k0786L24989A61469L26400A25328M03659p0283
$$ 391329 577176 265625 275535 254749 579738 161469 487869 125328 528987 458704
15007D58704j17342o1365A0167L87528p6713j34421J37259j33442Q0707M07419
$$ 458704 341362 279997 10167 397695 320982 186561 323820 190378 271085 678504
14997F78504B75035J77148J7171j09754h3631B47836K1820N6086o9963K99187
$$ 678504 275035 452183 469354 359600 -83631 247836 269656 325742 255779 554966
14987E54966k49059J88087J01362j60163j24457L42432J97476L01601r2318m52312
$$ 554966 305907 493994 595356 435193 310736 653168 850644 1152245 1059927 607615
14977F07615j85434k0508A80463O18860B38608K56358j89004J42859q0610K0343
$$ 607615 422181 401673 180463 799323 238608 494966 305962 448821 368211 388554
14967C88554N7687o2998A58391M31062A52862K22421j58782O7728R1040k1080
$$ 388554 446241 383243 158391 589453 152862 375283 216501 284229 375269 354189
14957C54189l5430p2574J34194A61053K00850G421L35580J74534j96763J32660
$$ 354189 318759 246185 380379 161053 361903 7421 343001 517535 320772 453432
14947D53432n6780K02945M4543k17370J81967l1352L3427B86757J63986J99637
$$ 453432 396652 599597 644140 426770 608737 577385 610812 286757 450743 650380
14937F50380k76900A53315N40783m1199K0352K33483J40180k09847K5695L06418
$$ 650380 373480 153315 694098 652899 673251 906734 1046914 837067 862762 1169180
14927A169180J91438J62698k0438j87427k93479J78934l23673R13540J93796K15363
$$ 1169180 1360618 1523316 1502878 1315451 1021972 1200906 877233 1790773 1984569 2199932
14917B199932j31882l92296m03189j90072k59100J80047m05858K51456D24506
$$ 2199932 2068050 1675754 1272565 1082493 823393 1003440 597582 849038 424506
14907A20587K86511j65953J16154j01484O3313j28905L16130j2394A34203K65352
$$ 120587 407098 241145 357299 255815 319128 190223 506353 493959 134203 399555
14897C99555A96279j6411J4242M2308J05946K68603j31864K94678k13806j7524
$$ 399555 196279 179868 194110 236418 342364 610967 479103 773781 559975 542451
14887E42451j18227M26973Q772l3283p263q7628l08058K55280Q718r9899M34665
$$ 542451 424224 851197 859969 826686 819423 731795 423737 679017 687735 587836 1022501
14876A022501C00605K34941j05160Q5358A97270K11373N8246J80990N4709j0824
$$ 1022501 300605 535546 430386 515744 197270 408643 466889 647879 702588 691764
14866F91764j32324L8000B86795K12886a8384E06062j89061l8672j03530c4869
$$ 691764 559440 597440 286795 499681 -18384 506062 317001 278329 174799 -34869
14855A43588Q6943L26436m9777A62002J90913O3890J5848L04297B36230L50797
$$ 143588 230531 556967 507190 162002 352915 416805 432653 736950 236230 587027
14845E87027N15994k41846L74982k97264L03976P6111l73140K6611k7137l62230
$$ 587027 1103021 861175 1236157 938893 1242869 1318980 945840 972451 945314 583084
14835E83084J5850n8805j26458J26974n5634j626J1072J3943n69J34241C20290
$$ 583084 598934 540129 413671 540645 485011 483385 494457 508400 507831 642072 320290
14823D00246K26730J07519n389k26012r1435L31187j6951k23338K60581l69578
$$ 400246 626976 734495 729106 503094 411659 742846 725895 502557 763138 393560
14813C93560j07893J54209K33048J90950C04588K58469K15295L40841k94622J22471
$$ 393560 285667 439876 672924 863874 304588 563057 778352 1119193 824571 947042
14803I47042l05173J0723j66780p9950K05862k16834K09160j24125K03291j05681
$$ 947042 641869 652592 485812 405862 611724 394890 604050 479925 683216 577535
14793E77535n2218K19533C61952K3306R8591R9944j34490L11326l25681Q1503
$$ 577535 525317 744850 361952 385258 483849 583793 449303 760629 434948 516451
14783E16451L14371n1150k61966M0043J50423j09335r938j37528P19312m25670
$$ 516451 830822 779672 517706 557749 708172 598837 588899 451371 1170683 745013
14773G45013p4763L6261J4634q7268A37109M18169R7991B95783K64527k21632
$$ 745013 670250 706511 721145 633877 137109 555278 653269 295783 560310 338678
14763C38678N35458q1087r3934j06887J92808j53908j81391j21712N8453L1845
$$ 338678 874136 793049 699115 592228 785036 631128 449737 328025 386478 418323
14753D18323j46244R1329K68203L8724k52894o789K01337k98527M33640l39401
$$ 418323 272079 363408 631611 670335 417441 410652 611989 313462 747102 407701
14743D07701L8854N9572J67487r3923P5339R736r6547j05050L35559J70115k45935
$$ 407701 446555 506127 673614 579691 655030 664766 568219 463169 798728 968843 722908
14732G22908L99029E21921K12807M7752N00717k8091M61911j29442k37898r4288
$$ 722908 1121937 521921 734728 782480 1283197 1255106 1717017 1587575 1349677 1255389
14722A255389j79920L09222j99176n41596o5247J89111K22200D74605K03345M0811
$$ 1255389 1075469 1384691 1185515 643919 578672 767783 989983 474605 677950 718761
14712G18761K33394l22382L27335l9479R7988o5273p8569J67949j66192J82172
$$ 718761 952155 629773 957108 917629 1015617 950344 871775 1039724 873532 1055704
14702A055704K68840K28453N8693l24497j26281j24489l36517L44123j18762q9741
$$ 1055704 1324544 1552997 1611690 1287193 1160912 1036423 699906 1044029 925267 835526
14692H35526l22621M78129j27838j24807Q5961j15956K42412M4564m60242N8928
$$ 835526 512905 991034 863196 738389 824350 708394 950806 995370 535128 594056
14682E94056j10791M16795k13909P608j22189O4125J51522n4335J29546r4966
$$ 594056 483265 900060 686151 693759 571570 635695 787217 732882 862428 767462
14672G67462o5360L82440j50388k40473K76140k90251k316J83545j57849J51225
$$ 767462 702102 1084542 934154 693681 969821 679570 677254 860799 702950 854175
14662H54175n8726J32886M1446m2205J41224j09715m18620L84992J9751O1128
$$ 854175 795449 928335 969781 927576 1068800 959085 540465 925457 945208 1006336
14652A006336K06744j7917j81654L43624m23515P4478k9684R1615k87771R9146
$$ 1006336 1213080 1195163 1013509 1357133 933618 1008096 978412 1070027 782256 881402
14642H81402o6634J1232J01950N5391j39887R7502k7999J32952O7354l12842M58444
$$ 881402 814768 826000 927950 983341 843454 940956 912957 1045909 1113263 800421 1258865
14631A258865l81954J40505r2293K16966k19757N860K97736K746l28289J92576
$$ 1258865 876911 1017416 925123 1142089 922332 928192 1225928 1228674 900385 1092961
14621A092961J24870K11834o0262k90953J71123l7706Q3183k3596j26415K32336
$$ 1092961 1217831 1429665 1369403 1078450 1249573 1211867 1295050 1271454 1145039 1377375
14611A377375J9295l53468M32286k53969J29965k4182m7032K47826k01484J30535
$$ 1377375 1396670 1043202 1475488 1221519 1351484 1327302 1280270 1528096 1326612 1457147
14601A457147k77256k8007L08694l42297K96982J58652l01792m564Q5509K42556
$$ 1457147 1179891 1151884 1460578 1118281 1415263 1573915 1272123 1267559 1353068 1595624
14591A595624j00652j06390j4521O19j32625N34521k11520J04108K86386n93624
$$ 1595624 1494972 1388582 1374061 1374680 1242055 1776576 1565056 1669164 1955550 1361926
14581A361926K82013q0477R2376k06298J10902J55288n4642P8891n9152k08682
$$ 1361926 1643939 1563462 1655838 1449540 1560442 1715730 1661088 1739979 1680827 1472145
14571A472145O33474m45862K70304j47173J05350J90747j85029L11815j77552
$$ 1472145 2105619 1659757 1930061 1782888 1888238 2078985 1893956 2205771 2028219
14562B028219l8769K46552j84050M28644j60617R3803J15574L01231j52727J92298
$$ 2028219 1989450 2236002 2051952 2480596 2319979 2413782 2529356 2830587 2677860 2870158
14552B870158L02497Q13552L07946J261658L325512P560594K0885377O401347
$$ 2870158 3172655 3986207 4294153 5555811 8881323 16441917 37327294 43728641
14544D3728641A7474823G191605l365211j290886M64399P96135J469327k614988
$$ 43728641 17474823 7191605 3826394 2535508 2999907 3796042 5265369 2650381
14536B650381p79059k2492o8521j97869k5788L30372l13168L45225l03224k44233
$$ 2650381 1871322 1848830 1780309 1582440 1556652 1887024 1573856 1919081 1615857 1371624
14526A371624L93721J52500k32657J69690M0678J79155J13608k03892N9479Q9796
$$ 1371624 1765345 1917845 1685188 1854878 1895556 2074711 2188319 1984427 2043906 2133702
14516B133702j90718L51617n2975j73562L17801J04061l68603L00185K40099k83468
$$ 2133702 1942984 2294601 2241626 2068064 2385865 2489926 2121323 2421508 2661607 2378139
14506B378139j9375J48420j66487J06804Q7374R0397J64674m50837M32720J40970
$$ 2378139 2358764 2507184 2340697 2447501 2534875 2625272 2789946 2339109 2771829 2912799
14496B912799l55075M4391j21131M42145l3474j87719J60623q9938L29933k59020
$$ 2912799 2557724 2602115 2480984 2923129 2889655 2701936 2862559 2772621 3102554 2843534
14486B843534Q6900L07483m4964l3202p2506L6030J63678j41967J07449k52063
$$ 2843534 2930434 3237917 3192953 3159751 3087245 3123275 3286953 3144986 3252435 3000372
14476C000372N17049l3062K69269j35171o4997L0548j42156j068L02079L4001
$$ 3000372 3517421 3484359 3753628 3618457 3553460 3584008 3441852 3440784 3742863 3776864
14466C776864m4776j19850O58879j19802p1126j03765n2897K69023J56328Q1614
$$ 3776864 3732088 3612238 4271117 4151315 4080189 3976424 3923527 4192550 4348878 4430492
14456D430492J79747m08180J3264L58542r952m40930N84190j62788J95882k22490
$$ 4430492 4610239 4202059 4215323 4573865 4563913 4122983 4707173 4544385 4740267 4517777
14446D517777K46902j22079N8868J59685K44505l58301M46628L63662m79622M96251
$$ 4517777 4764679 4642600 4701468 4861153 5105658 4747357 5193985 5557647 5078025 5574276
14436E574276n56791K57978M09766j99102r253K97061j07312K89959k6845P3638
$$ 5574276 5017485 5275463 5685229 5486127 5476874 5773935 5666623 5956582 5929737 6003375
14426F003375P7930J017L70706K24291J98097k78346K63250J65176J30808k23678
$$ 6003375 6081305 6082322 6453028 6677319 6875416 6597070 6860320 7025496 7156304 6932626
14416F932626L69891J66214o2179K78496m11319O23965k50392L30168L59873k83252
$$ 6932626 7302517 7468731 7406552 7685048 7273729 7897694 7647302 7977470 8337343 8054091
14406H054091M31455Q5128k31575R1522J23569K31817K59113n08883N68351J55476
$$ 8054091 8485546 8570674 8339099 8430621 8554190 8786007 9045120 8536237 9104588 9260064
14396I260064J70985K26663P8654J05198M22273J13701j37811K15722J05070N54497
$$ 9260064 9431049 9657712 9736366 9841564 10263837 10377538 10239727 10455449 10560519 11115016
14386A1115016K44669M4424M21144L13797l7177O92020j42638K78162k7417K85032
$$ 11115016 11359685 11404109 11825253 12139050 12101873 12793893 12651255 12929417 12902000 13187032
14376A3187032P7876L19782J56812J88170N42985J18903O58298K713O58643k71
$$ 13187032 13264908 13584690 13741502 13929672 14472657 14591560 15249858 15252571 15911214 15910943
14366A5910943M27786L32163K07934L61488k12674J008371K93418M85085m4287
$$ 15910943 16338729 16670892 16878826 17240314 17027640 18036011 18329429 18814514 18770227
14357A8770227O30942L34841P41373L31978M52079O02172K89297O74830P16419
$$ 18770227 19401169 19736010 20477383 20809361 21261440 21863612 22152909 22827739 23544158
14348B3544158N59801O90821P54452O22570M67439O81652L00514J839304L22324
$$ 23544158 24103959 24794780 25549232 26171802 26639241 27320893 27621407 29460711 29783035
14339B9783035M12303J064710R95400Q10591R23031J022813J409141Q14755J726523
$$ 29783035 30195338 31260048 32255448 33066039 33989070 35011883 36421024 37235779 38962302
14330C8962302Q21727J249971J272656J579501J096851J701040J662622J694387
$$ 38962302 39784029 41034000 42306656 43886157 44983008 46684048 48346670 50041057
14322E0041057J607335J781020K033780J522864K410070K164603J949570K531613
$$ 50041057 51648392 53429412 55463192 56986056 59396126 61560729 63510299 66041912
14314F6041912K818443K670496K763962L017640L409737L064176L810637L738612
$$ 66041912 68860355 71530851 74294813 77312453 80722190 83786366 87597003 91335615
14306I1335615M193286M689697M456759M873029N521888N301727O061486N849972
$$ 91335615 95528901 100218598 104675357 109548386 115070274 120372001 126433487 132283459
14298A32283459O533984O813844P186115Q232691Q467456Q780576R482885J0071857
$$ 132283459 138817443 145631287 152817402 161050093 169517549 178298125 187781010 197852867
14290A97852867J0607042J1120191J1930994J2585159J2690909J3804804J3956650
$$ 197852867 208459909 219580100 231511094 244096253 256787162 270591966 284548616
14283B84548616J4739990J4532722J4969576J5176088J5828940J4958103J4615781
$$ 284548616 299288606 313821328 328790904 343966992 359795932 374754035 389369816
14276C89369816J3811039J2765225J1376340R234229N106943J453947O79774K37575
$$ 389369816 403180855 415946080 427322420 436556649 441663592 443117539 443797313 444034888
14268D44034888m208733k481522m219195r400042j1471378j2642000j3257159
$$ 444034888 439826155 437344633 433125438 423725396 412254018 399612018 386354859
14261C86354859j3947563j4981613j5058503j5441191j5523460j4953681j5029965
$$ 386354859 372407296 357425683 342367180 326925989 311402529 296448848 281418883
14254B81418883j4112069j3847867j2940926j2748710j2176071r954440j0281722
$$ 281418883 267306814 253458947 240518021 227769311 215593240 205638800 195357078
14247A95357078j0074721r433838q850058q227753p868785p367045p111363o950784
$$ 195357078 185282357 175848519 166998461 158770708 150901923 143534878 136423515 129472731
14239A29472731n792509n460332m935293n508714m811941m805483m297804l935097
$$ 129472731 123680222 118219890 113284597 107775883 102963942 98158459 93860655 89925558
14231H9925558l100903l690796l767884l007868l204783k836524k805021k543790
$$ 89925558 86824655 83133859 79365975 76358107 73153324 70316800 67511779 64967989
14223F4967989k646594k041193j950051k099395j955684j988594j924527j592916
$$ 64967989 62321395 60280202 58330151 56230756 54275072 52286478 50361951 48769035
14215D8769035j477683j290246j314305j510519j737522j287344j104468j105871
$$ 48769035 47291352 46001106 44686801 43176282 41438760 40151416 39046948 37941077
14207C7941077n83724r98274j458695p05039j225227p51068p71964n57127j176740
$$ 37941077 37357353 36359079 34900384 34195345 32970118 32219050 31447086 30889959 29713219
14198B9713219p15630p42667q04112p48283m70146n34402q73600o34060m89889
$$ 29713219 28997589 28254922 27450810 26702527 26232381 25697979 24824379 24190319 23700430
14189B3700430o71476l04170p32355m67493l88316n92220n65541k63321n72066
$$ 23700430 23028954 22724784 21992429 21524936 21136620 20544400 19978859 19715538 19143472
14180A9143472l10148l67185n56518n05037k64682k57592k35311k8118n95210
$$ 19143472 18833324 18466139 17909621 17404584 17139902 16882310 16646999 16618881 16023671
14171A6023671j87613l09340l25009m85889l20504k63495j33449j39858o44115
$$ 16023671 15836058 15526718 15201709 14715820 14395316 14131821 13998372 13858514 13214399
14162A3214399J64434l99321j24584l90242m3426m42826j70692l41342n0481o6707
$$ 13214399 13378833 12979512 12854928 12464686 12421260 11978434 11807742 11466400 11415919 11349212
14152A1349212l24850l0154m04083K37175l80190j98155q1173m61208j41536o4437
$$ 11349212 11024362 10994208 10590125 10827300 10447110 10248955 10167782 9706574 9565038 9500601
14142I500601k31376p0091l6057k24487J78310m05295j36496L72575n13436K04224
$$ 9500601 9269225 9199134 9163077 8938590 9116900 8711605 8575109 8947684 8434248 8638472
14132H638472m39622l34279l56442K81631K28245o65637J02782j02412j5986R9320
$$ 8638472 8198850 7864571 7508129 7789760 8018005 7352368 7455150 7352738 7336752 7436072
14122G436072k71497l28956j02038J51360j66279J32595l97694J42545m37077
$$ 7436072 7164575 6835619 6733581 6884941 6718662 6851257 6453563 6596108 6159031
14113F159031K14633k32281K07484k93853J15498m19919Q0514J88500m67883j48047
$$ 6159031 6373664 6141383 6348867 6055014 6170512 5750593 5831107 6019607 5551724 5403677
14103E403677n3160K72463k99971L83400l26180j99442j13076j82282M33942k44902
$$ 5403677 5350517 5622980 5323009 5706409 5380229 5180787 5067711 4885429 5319371 5074469
14093E074469k82008J80519K3882j08686j23447j7930q1513j23332k16365j06050
$$ 5074469 4792461 4972980 4996862 4888176 4764729 4746799 4665286 4541954 4325589 4219539
14083D219539K62075k35892J6491k77509J67354K3507l3012j93982J54405j84473
$$ 4219539 4481614 4245722 4262213 3984704 4152058 4175565 4142553 3948571 4102976 3918503
14073C918503K19113n15607k2202o5029j13430M08808J40500q16868N30483J30981
$$ 3918503 4137616 3622009 3599807 3534778 3421348 3830156 3970656 3153788 3684271 3815252
14063C815252j81248l36565K64680J08337r1920j60468j85400K08845m97163Q4506
$$ 3815252 3634004 3297439 3562119 3670456 3578536 3418068 3232668 3441513 2944350 3028856
14053C028856M66722l77895L04853l81444J80877k29760O1409j14219j20968l9964
$$ 3028856 3495578 3117683 3422536 3041092 3221969 2992209 3053618 2939399 2818431 2778467
14043B778467J27538m5665K84019n66450J62556J81692k57807r5257K98982q7457
$$ 2778467 2906005 2860340 3144359 2577909 2740465 2922157 2664350 2569093 2868075 2780618
14033B780618J75130J6541l52514K69607k83796J01543R90J33267j43923n47267
$$ 2780618 2955748 2972289 2619775 2889382 2605586 2707129 2708119 2841386 2697463 2150196
14023B150196M37699k28618J65748m8605k93681K72244j28842k16875P641j61129
$$ 2150196 2587895 2359277 2525025 2476420 2182739 2454983 2326141 2109266 2116907 1955778
14013A955778K14955j66330p2998L44738n6495K09265j85230j44341k6557n7588
$$ 1955778 2170733 2004403 1931405 2276143 2219648 2428913 2243683 2099342 2072785 2015197
14003B015197j03031J0326j42154K64053j04135j83157K47666k18948J42467j17561
$$ 2015197 1912166 1922492 1780338 2044391 1940256 1757099 2004765 1785817 1928284 1810723
13993A810723Q8963k22890M27146j5777L06310J626801N202043J6877035K1839872
$$ 1810723 1899686 1676796 2103942 2088165 2394475 4021276 9223319 26100354 47940226
13984D7940226k1001606A3071699n729877k202336n31160j065866l95370l85224
$$ 47940226 26938620 13071699 7341822 5139486 4608326 3542460 3147090 2761866
13976B761866j13944J41846m94029K29231l01255j4307P7478m03582L10206j45756
$$ 2761866 2647922 2789768 2295739 2524970 2223715 2209408 2286886 1883304 2193510 2047754
13966B047754J379J04133j11637n8632M66137m22415j18827K48962j54240n6045
$$ 2047754 2049133 2153266 2041629 1982997 2449134 2026719 1907892 2156854 2002614 1946569
13956A946569P0049p1153O8725j79842o6369k9069K18048l30373j641o3963J29769
$$ 1946569 2016618 1945465 2014190 1834348 1767979 1738910 1956958 1626585 1624944 1560981 1690750
13945A690750J84691p5852k08023j45517K34622l31615J47803L4891J29460l06974
$$ 1690750 1875441 1799589 1591566 1446049 1680671 1349056 1496859 1531750 1661210 1354236
13935A354236j30076J02244J91992n7590J76386m91581M09758k59098K05201J33435
$$ 1354236 1224160 1326404 1518396 1460806 1637192 1145611 1555369 1296271 1501472 1634907
13925A634907k95424N5012M6431j57403Q2284J44382m6120j39292L30553o14586
$$ 1634907 1339483 1394495 1440926 1283523 1365807 1510189 1464069 1324777 1655330 1040744
13915A040744L70891p1841j94117N6329q5496K00810Q7572k96954K30127K5084
$$ 1040744 1411635 1339794 1145677 1202006 1116510 1317320 1404892 1107938 1338065 1363149
13905A363149k10742k88965L92930P5077O4058j73058J19502k95078n3520J79463
$$ 1363149 1152407 863442 1256372 1331449 1395507 1222449 1341951 1046873 993353 1172816
13895A172816J1607n9234n7434J68551j54281J67064l14704p2790L25627r3081
$$ 1172816 1184423 1125189 1067755 1236306 1082025 1249089 934385 861595 1187222 1094141
13885A094141J814j45230K91201j7376j20764M8821m5392l06994O02372k31454
$$ 1094141 1095955 950725 1241926 1224550 1103786 1152607 1107215 800221 1402593 1171139
13875A171139l76708L07188l08592M19437j16957r4571J18626j37792j30326L46911
$$ 1171139 794431 1101619 793027 1212464 1095507 1000936 1119562 981770 851444 1198355
13865A198355j17287j53062j8747N9751J34107j88601L02233k38622j04452J73654
$$ 1198355 1081068 928006 909259 969010 1103117 914516 1216749 978127 873675 1047329
13855A047329j22541O550J95581l56544M37361l35255j41101J64644p3311N23424
$$ 1047329 924788 931338 1126919 770375 1207736 872481 731380 896024 822713 1346137
13845A346137n26519Q9417o8136K8169j3314J6884J5828k2959K70186m13748K35314
$$ 1346137 819618 909035 840899 869068 855754 872638 888466 865507 1135693 721945 957259
13834I57259j27986C57122N64124o5484l2200j49332J17912j50896L44426k65249
$$ 957259 829273 357122 921246 855762 823562 674230 792142 641246 985672 720423
13824G20423J37805K09612j63353j58257N5597J19370K50841m51587L35356l97763
$$ 720423 858228 1067840 904487 746230 801827 921197 1172038 720451 1055807 658044
13814F58044j7933L12480l0151j77818J88061q323j0191j91067K90253j28559
$$ 658044 640111 952591 922440 744622 932683 924360 914169 723102 1013355 884796
13804H84796k81836J6848J98959k1914k28039K33279r0369j22706M15565k49198
$$ 884796 602960 619808 818767 796853 568814 802093 711724 589018 1004583 755385
13794G55385j8555m1552k23092j57420J74523J07662J50046l20531K32173J35934
$$ 755385 736830 695278 472186 314766 489289 596951 746997 426466 658639 794573
13784G94573k68093J49884R7617C17703L6642K51848R1o8644L41348j92093K7239
$$ 794573 526480 676364 773981 317703 354345 606193 606284 537640 878988 686895 714134
13773G14134r5066o9765J50310j58847L32129m14540L1001l7207M95878C74649
$$ 714134 619068 549303 699613 540766 872895 458355 489356 452149 948027 374649
13762E21957K09046j04952m2425j99803L36165k63758K2706J94570B30594K14129
$$ 521957 731003 626051 583626 383823 719988 456230 478936 673506 230594 444723
13752D44723P2079J1864A69925M73521j64895j34789M48250C53301M03595k48751
$$ 444723 516802 528666 169925 643446 478551 343762 792012 353301 756896 508145
13742E08145k6756J51976M9085j18923K34330j81263p3321B24489M14192A98387
$$ 508145 481389 633365 682450 563527 797857 616594 543273 224489 638681 198387
13731G96647k53918j41026K63876m7610k20587p2503L4851K10720L1629K06153
$$ 796647 542729 401703 665579 617969 397382 324879 359730 570450 602079 808232
13721H08232r4708j29798j46482j05974l9228K64610J37682l07406L7033R9255
$$ 808232 713524 583726 437244 331270 292042 556652 694334 386928 423961 523216
13711E23216B03268M67096j96030K36128K9502l04596J6033J5220l9158j26210
$$ 523216 203268 670364 474334 710462 739964 435368 451401 466621 427463 301253
13701C01253j4480K20103J28342B99047J2855K06429q45j39236N3182J53769B13652
$$ 301253 286773 506876 635218 299047 311902 518331 517486 378250 431432 585201 213652
13689G46509B64824j057K97359K3895k48l8097j28983J14260J03195k51423L63189
$$ 746509 264824 263767 561126 585021 584773 546676 417693 531953 635148 383725 746914
13678G46914A60971J11389L592J20693J20102k06119l1615L00562B39401K45795
$$ 746914 160971 272360 275952 396645 516747 310628 279013 579575 239401 485196
13668D85196J9836B43254N1186L992M4226K18831k41395J9852q313J50366o1197
$$ 485196 505032 243254 294440 298432 342658 561489 320094 339946 331633 481999 420802
13657D20802O7690J73198j4655j72450J17915q5162j97729j6551O8608k2083M9847
$$ 420802 488492 661690 647035 474585 592500 507338 309609 293058 361666 339583 389430
13646C89430L46038B2095O15257j40749E5628K81767K06804j74748m2773K1064
$$ 389430 735468 22095 637352 496603 55628 337395 544199 369451 326678 347742
13636C47742p6788l6131N946J95783j83615J70793J79140P2245I3424K57629c5820
$$ 347742 270954 234823 240769 436552 252937 423730 602870 675115 93424 351053 -35820
13624C38558A6751O10274A18418O2817L30233q5977q7057j7829A51014L77056
$$ 338558 16751 627025 118418 181235 511468 425491 338434 320605 151014 528070
13614E28070A44350o9765J74157O2503p0311J93096j08755A16569P0562N5584
$$ 528070 144350 74585 248742 311245 240934 434030 325275 116569 187131 242715
13604B42715K16799j69843J30136o8627J11143k22088r192K75280O3018k06746
$$ 242715 459514 289671 419807 351180 462323 240235 231043 506323 569341 362595
13594C62595g6432D44974B20699L24177n7777A93431L2041J62790J97769B77269
$$ 362595 -76432 444974 220699 544876 487099 193431 225472 388262 586031 277269
13583E40440j19443G2905M33023A44583K60716j59861o3077k0077n5501J57265
$$ 540440 420997 72905 505928 144583 405299 245438 182361 162284 106783 264048
13573B64048J43588r9641K02680k18660J05195j32368m3142J09598p0832R5282
$$ 264048 407636 307995 510675 292015 397210 264842 221700 331298 260466 355748
13563C55748p998K18702A15740L6123J99682m3050K02379I022M00650G5798J49055
$$ 355748 347750 566452 115740 151863 351545 308495 510874 9022 409672 75798 224853
13552B24853F1569L41535K04665a3127B50190J82201h0783E13361j95345Q4476
$$ 224853 61569 403104 607769 -13127 250190 432391 -80783 513361 318016 402492
13542D02492j9482c2354B47500b19969J05043B81985n3873L34779j69328n6104
$$ 402492 383010 -32354 247500 -219969 -114926 281985 228112 562891 393563 337459
13532C37459j27381a43983B01470o5634J0295J5729J62690q762q8942k153D1641
$$ 337459 210078 -143983 201470 135836 146131 161860 324550 315788 226846 224693 41641
13520c96481B74674k398K97817A84048M5195R4209E7647K31304J3230R6040k966
$$ -396481 274674 272276 570093 184048 229243 323452 57647 288951 302181 398221 395255
13509C95255A63117N9285p3898K90088k4228o2033K08099k20302A49096N2145
$$ 395255 163117 222402 148504 438592 414364 352331 560430 340128 149096 201241
13499B01241k6475K42094j1763k00940Q9078p686P864L16558O8297b6516k93254
$$ 201241 174766 416860 405097 204157 293235 285549 293413 609971 678268 -26516 -319770
13488c19770A24202Q9041K60301J5328j42060P7863k4892a8098F1243J55708r2089
$$ -319770 124202 213243 473544 488872 346812 424675 399783 -18098 61243 216951 124862
13477A24862M5966q5021P7533p0507M23015k23418M188I3675L68792B27932p6748
$$ 124862 170828 85807 163340 92833 515848 292430 296618 93675 462467 227932 151184
13466A51184L2874N7745k2897L21607B37324I9998K56506m8002J21292H6421J677
$$ 151184 184058 241803 218906 540513 237324 99998 356504 308502 429794 86421 88098
13455H8098L19919j66135n2672K29717c8792k2779B8901L21769A20241E8555c357
$$ 88098 408017 241882 189210 418927 -38792 -61571 28901 350670 120241 58555 -3357
13443A97992i698B81155c6549B46815o4538A7584J42719J32829g1542B15347p2633
$$ 197992 -9698 281155 -36549 246815 182277 17584 160303 293132 -71542 215347 142714
13432A42714h7759A76102a6088B03789F8845J13135p4224O0147c9299I9210a10846
$$ 142714 -87759 176102 -16088 203789 68845 181980 107756 167903 -39299 99210 -110846
13420H174J45705k688b77112D73637A00534J96325J39044j23598o905A23384L5097
$$ 8174 153879 151191 -277112 473637 100534 296859 435903 312305 305400 123384 158481
13409A58481L7805h1385C96287A35389J7621o81b59206E5766c36082I1550M03659
$$ 158481 196286 -81385 396287 135389 153010 152329 -259206 55766 -336082 91550 495209
13398D95209p3305h9853a4680A44244K88422k12267P6292n3591n6547n7566a3115
$$ 495209 421904 -89853 -14680 144244 432666 220399 296691 243100 186553 128987 -13115
13386B82727A37107K54898A53948g6315A19659K1449g933B95213b356j75597A69395
$$ 282727 137107 392005 153948 -76315 119659 141108 -7933 295213 -2356 -177953 169395
13374B20552J44360a9548A91182I3523L90214d1485B65879I4270C8706J03228
$$ 220552 364912 -19548 191182 93523 483737 -41485 265879 94270 38706 141934
13364A41934E5673b48714A91716A2566J34504F9641J29705K24814j15769a2984
$$ 141934 55673 -248714 191716 12566 147070 69641 199346 424160 308391 -12984
13353A88521K0732a00094D93658A88948J76427A29312Q97R5482K12156A80233
$$ 188521 209253 -100094 493658 188948 365375 129312 130209 225691 437847 180233
13342C37130N6656a32920C30218j07755m8653J44788Q8390A21941a2443C32180
$$ 337130 393786 -132920 330218 222463 173810 318598 406988 121941 -12443 332180
13331c3841C77645A48886M26950B42974i16A7734h3517B05854r413e3314B28905
$$ -33841 377645 148886 575836 242974 -916 17734 -83517 205854 196441 -53314 228905
13319B79442L6618a9732E6794J84657J47017G6719J84457Q5405A49831L11782
$$ 279442 316060 -19732 56794 241451 388468 76719 261176 346581 149831 461613
13309D61613j12161A2255K38393o4879a49020A056M7755J6550a80803A59489m5129
$$ 461613 349452 12255 250648 185769 -149020 1056 48811 65361 -180803 159489 114360
13298A14360M7411a01778B76866q9069M1575J49721A52477D7183J99132n4763
$$ 114360 161771 -101778 276866 187797 229372 379093 152477 47183 246315 191552
13288A91552o2353c66439A29469Q7484a90285f5840I5504d3388A64242F2074O1887
$$ 191552 129199 -366439 129469 216953 -190285 -65840 95504 -43388 164242 62074 123961
13277A23961f8838j23184B37515d7139B53585c0946A66269K3081C9423b0684n5072
$$ 123961 -68838 -192022 237515 -47139 253585 -30946 166269 189350 39423 -20684 -75756
13266g5756F9567a23481f1015C95502A9699J49277j1102l9188J20195I3064B1114
$$ -75756 69567 -123481 -61015 395502 19699 168976 157874 118686 238881 93064 21114
13254A575J68726L35416D7388J57824k8058k6256P3604C2056J6833i7831k6525
$$ 1575 170301 505717 47388 205212 177154 150898 224502 32056 48889 -97831 -124356
13243a24356B32209L0192A3487L3928h1310j31115c0279J0828E1913K56645j728
$$ -124356 232209 262401 13487 47415 -81310 -212425 -30279 -19451 51913 308558 306830
13232C06830C484K24319D8827d0666r9241b0572B10008a68796A54213b95948C07324
$$ 306830 3484 227803 48827 -40666 -139907 -20572 210008 -168796 154213 -295948 307324
13220B33729G1627K2947a94253A4106K61768C3751K1166R6188d9095H7993K91589
$$ 233729 71627 94574 -194253 14106 275874 33751 54917 151105 -49095 87993 379582
13209C79582j39407q1850A2478J30503R5392e506r436p9526H7004J23968c19729
$$ 379582 240175 158325 12478 142981 238373 -5506 -14942 -94468 87004 210972 -319729
13197B55296E7281i8773A90001a90746B30672J03396c9356A06411L5643C6403
$$ 255296 57281 -98773 190001 -190746 230672 334068 -39356 106411 142054 36403
13186A37231h8173A70191D379f1976A99809E3985a18514B77832G5926b20188I0647
$$ 137231 -88173 170191 4379 -61976 199809 53985 -118514 277832 75926 -220188 90647
13174E1459L2473C6966J14543E4002Q9577a01593I2640J67810a50193B9768k968
$$ 51459 83932 36966 151509 54002 143579 -101593 92640 260450 -150193 29768 26800
13163B6800J02116k4181A9514Q8962n086J24291l0991K6023c2857A72550q072
$$ 26800 128916 104735 19514 108476 103390 227681 196690 222713 -32857 172550 164478
13152A64478j5006C1673J850J23724a2584A92203C6886a5876A30654m0926K1656
$$ 164478 149472 31673 33523 157247 -12584 192203 36886 -15876 130654 89728 111384
13141A11384K1479J01211g9890A13157P2813C7118j0107d36956B27744N05K610
$$ 111384 132863 234074 -79890 113157 185970 37118 27011 -436956 227744 228249 230859
13130B30859a15985B75931H6412B0247H29b47985j77753g3110j0475I9359a5475
$$ 230859 -115985 275931 86412 20247 829 -247985 -425738 -73110 -83585 99359 -15475
13118A43505o6259B378P3558G307O4109a40449N117E28382b3015o4258q2737N4005
$$ 143505 77246 2378 75936 7307 71416 -140449 -135332 528382 -23015 -87273 -170010 -116005
13106a16005A7285b73167A52376J49809j07184C7686L8649J73150c0339G2266
$$ -116005 17285 -273167 152376 302185 195001 37686 76335 249485 -30339 72266
13095E6502R4528b3138m0551l7997B86993a83431C29491a50095C58034j19815
$$ 56502 151030 -23138 -63689 -101686 286993 -183431 329491 -150095 358034 238219
13085B38219f813C1589p268N7869a5453G8425h8244H4306l7422c04224B87916
$$ 238219 -6813 31589 24321 82190 -15453 78425 -88244 84306 46884 -304224 287916
13073A03994P374j1238a7637I5052Q9327L5678f5992c600A60128L548B3882J9342
$$ 103994 111368 100130 -17637 95052 184379 220057 -65992 -3600 160128 163676 23882 43224
13061D3224a01366F1186L4862l3530h2569G9106j1384A996J32493j4799J63865
$$ 43224 -101366 61186 96048 62518 -82569 79106 67722 1996 134489 119690 283555
13050B83555o1513m5001b42355B16676n723H9808k5997K33033A43180L3849G7601
$$ 283555 222042 177041 -242355 216676 210953 89808 63811 296844 143180 177029 77601
13038C57354A37865a79785B4629c27453B5592J58187E6128g7748A72611J71463
$$ 357354 137865 -179785 24629 -327453 25592 183779 56128 -77748 172611 344074
13028C44074j20482b68429C68884a19957B13756a02855A38808J14045b19084A98153
$$ 344074 223592 -268429 368884 -119957 213756 -102855 138808 252853 -219084 198153
13017B19155A6062L01447a68688B43129I3912d9905C7203o53b753o8765o1987
$$ 219155 16062 317509 -168688 243129 93912 -49905 37203 36550 -2753 -71518 -133505
13006a33505A7190J5584d5677C09398I7318e8894F555b19412B54763f5333A03517
$$ -133505 17190 32774 -45677 309398 97318 -58894 6555 -219412 254763 -65333 103517
12994C3950n749h0622a5308D03126a56906A44808K722b30878i2313F7367f9062
$$ 33950 28201 -80622 -15308 403126 -156906 144808 147530 -230878 -92313 67367 -69062
12982D60180a35023p6075A73045g9679r4963C89359a25523A05689J34906j11375
$$ 460180 -135023 -211098 173045 -79679 -174642 389359 -125523 105689 240595 129220
12972A29220P9764a57170b4094k48268Q5200f5965A58151J09287b35682R3743
$$ 129220 208984 -157170 -24094 -272362 -187162 -65965 158151 267438 -235682 -141939
12962a41939H0477j9719J04227N2349A6792N5691M0912F298K7351J0770Q5934
$$ -141939 80477 60758 164985 217334 16792 72483 113395 6298 33649 44419 130353
12951A30353A7423J27363a29317M6061E3714J90214j5843b69886i3133A42878
$$ 130353 17423 144786 -129317 -83256 53714 243928 228085 -269886 -93133 142878
12940b32725h874H2537a77801b1738j16683C70463A68900a72799B15653e9665
$$ -232725 -8874 82537 -177801 -21738 -138421 370463 168900 -172799 215653 -59665
12929g2759A45812k956B3998p861b0021G8646h9568B25613F1828K4258i6056b0577
$$ -72759 145812 142856 23998 16137 -20021 78646 -89568 225613 61828 86086 -96056 -20577
12916A75889b8881B99019a43197B98393m4534a3803k4915j00756O721e5885r1396
$$ 175889 -28881 299019 -143197 298393 253859 -13803 -38718 -139474 -132753 -55885 -147281
12905a47281e3300k95711B75918K02172B1643J1539g9287j81582B03957k9293
$$ -147281 -53300 -349011 275918 478090 21643 33182 -79287 -260869 203957 174664
12895A74664L9702a55034B5186f4971A61895a31547E3698b14854C6587d9676m18650
$$ 174664 214366 -155034 25186 -64971 161895 -131547 53698 -214854 36587 -49676 -468326
12884d68326h6782L1814A28030c2728p5563A27759J0317D9133J15277k2408K37127
$$ -468326 -86782 -54968 128030 -32728 -108291 127759 138076 49133 164410 142002 379129
12873C79129e3032p003B47912a61184A34163a71494j00210Q2652B23340A10675
$$ 379129 -53032 -60035 247912 -161184 134163 -171494 -271704 -189052 223340 110675
12862F9462k2779e7867A39303b29330A09293D3275b82523B33849a44932f1377
$$ 69462 46683 -57867 139303 -229330 109293 43275 -282523 233849 -144932 -61377
12851a8024j6320m31067I786L00795e45691b17394J4312O6131A02282r893J53743
$$ -18024 -34344 -465411 9786 310581 -545691 -217394 -203082 -136951 102282 92389 246132
12840B46132c3081A55778a05982b1275D3658J26701b96187Q4678f3265B62113
$$ 246132 -33081 155778 -105982 -21275 43658 170359 -296187 -211509 -63265 262113
12829c55971a31532A56152a95443O2133e5484j81554C2308b89831i8621F2329
$$ -355971 -131532 156152 -195443 -133310 -55484 -237038 32308 -289831 -98621 62329
12818A5839J06454J65694b14481J5173A01181N8954C9042c6206E68634a89225
$$ 15839 122293 287987 -214481 -199308 101181 160135 39042 -36206 568634 -189225
12807a85718L0493B37672a8385A92938a71264A018a97040I8261M0021P4594g1466
$$ -185718 -155225 237672 -18385 192938 -171264 1018 -197040 98261 138282 212876 -71466
12795a13882A3537L62109I0874a47402L4697j25661A37680a71734j3468A50295
$$ -113882 13537 375646 90874 -147402 -112705 -238366 137680 -171734 -185202 150295
12784a46943A24126J01180f0444j27725j58342A74209L1792c4178j24686A8333
$$ -146943 124126 225306 -60444 -188169 -346511 174209 206001 -34178 -158864 18333
12773a01711I2605M5723C3206a44980a8338l8671m36693h7430r5885D1698h6685
$$ -101711 92605 138328 33206 -144980 -18338 -57009 -493702 -87430 -183315 41698 -86685
12761B71308D9304g3904B31747I4288m5497a51812a7014j03129F16260A96520
$$ 271308 49304 -73904 231747 94288 48791 -151812 -17014 -120143 616260 196520
12750g6584A08581i371k7147k21936E0867a30892B0358g8287j0592A66733b010
$$ -76584 108581 -9371 -36518 -258454 50867 -130892 20358 -78287 -88879 166733 -2010
12738B18205j02916g0606c0367j24062j12623A19418m6577J11001f0442j29245
$$ 218205 115289 -70606 -30367 -154429 -267052 119418 72841 183842 -60442 -189687
12728a89687f1958A94716a17506D8905b5618A45542a16118M5496r4811B4766R1795
$$ -189687 -61958 194716 -117506 48905 -25618 145542 -116118 -70622 -165433 24766 116561
12717A16561L4097e644B86437e3766A69853N2443J2892C0019K59798A34096K02697
$$ 116561 150658 -5644 286437 -53766 169853 222296 235188 30019 289817 134096 336793
12706C36793A50765G608K40725j01305E9174A7667R858c55229d8496q2521k70807
$$ 336793 150765 7608 248333 147028 59174 17667 27525 -355229 -48496 -131017 -401824
12695d01824C02212g0262i252C6078N05722E67a28533j73660e090o8983r588k6346
$$ -401824 302212 -70262 -9252 36078 541800 567 -128533 -302193 -5090 -74073 -83661 -110007
12683a10007m6575d6857H1562N08982A34831k3741c10520b2117C11784F2491R723
$$ -110007 -156582 -46857 81562 590544 134831 111090 -310520 -22117 311784 62491 72214
12672G2214O7672E1287K57864a50983j22140D5219N38p114K4711J89438g4511
$$ 72214 139886 51287 309151 -150983 -273123 45219 45757 38643 63354 252792 -74511
12660C7010K5411i4786p2015A50467E6327P2627f719F544J37752n2196M2287K13094
$$ 37010 62421 -94786 -166801 150467 56327 128954 -6719 6544 144296 92100 134387 347481
12648C47481a47116k02044B5576k763L0257J04464i1160B8481M6679N2548R7864
$$ 347481 -147116 -349160 25576 22813 53070 157534 -91160 28481 75160 127708 225572
12637B25572a614N23A31769l8409e8753l5375B70818e8509B99422m6987q6990
$$ 225572 -1614 -1091 131769 93360 -58753 -94128 270818 -58509 299422 252435 165445
12626A65445l1114J27489q5911j3069O2741a48948G9621b12937g0682O835B29852
$$ 165445 134331 261820 175909 162840 225581 -148948 79621 -212937 -70682 -63847 229852
12614i0008n0150e1424o0782c7629l6067A32804f0019j15124R203l2010B0579
$$ -90008 -140158 -51424 -112206 -37629 -73696 132804 -60019 -175143 -165940 -197950 20579
12602A95993R5540K3421c4151k8200H7242J45155c358l1756A25575j4187b0055
$$ 195993 291533 314954 -34151 -62351 87242 232397 -3358 -35114 125575 111388 -20055
12590A7574J07876K38454B7010J01509n367b88353B82129b8166A32621J00644
$$ 17574 125450 363904 27010 128519 123152 -288353 282129 -28166 132621 233265
12580B33265c5511j66737Q5385A06389P3159F8270b61126b414k95692h9829k726
$$ 233265 -35511 -202248 -116863 106389 179548 68270 -261126 -2414 -298106 -89829 -92555
12569i2555C85767i8509m1708A11600B2189O6617A7878i9582n1091a2590A02490
$$ -92555 385767 -98509 -140217 111600 22189 88806 17878 -99582 -150673 -12590 102490
12557a02724K7933D1704c61390D0677J69M21269A15890l2552b14618H2837R3029
$$ -102724 -74791 41704 -361390 40677 40846 462115 115890 83338 -214618 82837 175866
12546A75866e7901j59055C41313b33950P4078o678A62063O2225j3061a23872A58022
$$ 175866 -57901 -216956 341313 -233950 -159872 -166550 162063 224288 211227 -123872 158022
12534b4264j62741A95516b2182j69823F3359k57J68987p8612K90725a23380A08391
$$ -24264 -187005 195516 -22182 -192005 63359 63102 232089 153477 444202 -123380 108391
12522e1051C07516i0862n7689i493k3535j95871f7642j7250A21630O843b22346
$$ -51051 307516 -90862 -148551 -9493 -33028 -228899 -67642 -84892 121630 128473 -222346
12510B55787f363C33394A54745F7622a61410A89479r2947B1490e7855A35564b40231
$$ 255787 -6363 333394 154745 67622 -161410 189479 96532 21490 -57855 135564 -240231
12498b96182e5889q0704I111a21877B2057M7929J20311d69909g774B68722a13313
$$ -296182 -55889 -136593 9111 -121877 22057 69986 190297 -469909 -7774 268722 -113313
12486A15182b08714g0382C0117Q5224I699c87669C65111c13720a49924C09484
$$ 115182 -208714 -70382 30117 115341 9699 -387669 365111 -313720 -149924 309484
12475h3369A9651h0834K7852j20735k35854A53215G2672a65535p0919Q3770H4661
$$ -83369 19651 -80834 -52982 -173717 -409571 153215 72672 -165535 -236454 -152684 84661
12463F5647a10872M8392A14008a06960I7770l99C6918K66199a21511K4172A08872
$$ 65647 -110872 -62480 114008 -106960 97770 97371 36918 303117 -121511 -97339 108872
12451d0211o3129m2495e8319C6271b52116A7637b59701E2459j1859i5474l4093
$$ -40211 -103340 -145835 -58319 36271 -252116 17637 -259701 52459 40600 -95474 -129567
12440a29567I693L4977a97755E1115c96083a25763C49172G533b15744j31091B03322
$$ -129567 9693 44670 -197755 51115 -396083 -125763 349172 7533 -215744 -346835 203322
12428C8896a2420A32608K61711o8871j30467a57552J5576A5317i6736k64321G9252
$$ 38896 -12420 132608 394319 325448 194981 -157552 -141976 15317 -96736 -361057 79252
12416I2966c2690B2235J50467g1724B48843a80997G0430a42861n0419B31109b11221
$$ 92966 -32690 22235 172702 -71724 248843 -180997 70430 -142861 -193280 231109 -211221
12404G674K5399a46070A39908c41945a54096B3709O2619c30496R4762a3239A48555
$$ 7674 33073 -146070 139908 -341945 -154096 23709 86328 -330496 -235734 -13239 148555
12392A38778g1197r0089e5004A11276L9069a59637G9606K26232a29567j18477
$$ 138778 -71197 -161286 -55004 111276 150345 -159637 79606 305838 -129567 -248044
12382b48044J21730G5125K00558G8761R932a5671j4641A76339b934j21288C8604
$$ -248044 -126314 75125 275683 78761 88693 -15671 -30312 176339 -2934 -124222 38604
12370b48351J1270A31327a06695K5711c4006o0171j0981B05590r1336J12511A03196
$$ -248351 -237081 131327 -106695 -80984 -34006 -94177 -105158 205590 114254 226765 103196
12358H1926c03519R8582A3293a46929E9672L99523A29658K1167n7597J15105a69297
$$ 81926 -303519 -204937 13293 -146929 59672 459195 129658 150825 93228 208333 -169297
12346A43153i3920A79813h6651k74811I7238M1648j6743m7769K4061N8019F2632
$$ 143153 -93920 179813 -86651 -361462 97238 138886 122143 74374 98435 156454 62632
12334e0259G8506a45739b7953G6380h097A8996a00808A51956F5322K03147d0819
$$ -50259 78506 -145739 -27953 76380 -8097 18996 -100808 151956 65322 268469 -40819
12322C27713H1551a02752A44972l1847J95408k5030o2578c6902A55924L03000
$$ 327713 81551 -102752 144972 113125 308533 283503 220925 -36902 155924 458924
12312D58924a23934C47569A69397l7995M9161m1114o9438J38989J85662j51522
$$ 458924 -123934 347569 169397 131402 180563 139449 70011 209000 394662 243140
12302B43140O321A0911J28367m5783K10432f9333K7868A70746m2131b92678C84002
$$ 243140 249461 10911 139278 93495 303927 -69333 -41465 170746 128615 -292678 384002
12290B29637i264A43853Q8579j06248P1767F5072R3160D1154J8452L4789K61624
$$ 229637 -9264 143853 232432 126184 197951 65072 158232 41154 59606 94395 356019
12279C56019j00448Q1745K0419A71472b0088K578A37029K6088c6207j3961A21252
$$ 356019 255571 337316 357735 171472 -20088 -17510 137029 163117 -36207 -50168 121252
12267D0510K26280a12345A21628h8424A67656J67650j43538R5069k4027j16857
$$ 40510 266790 -112345 121628 -88424 167656 335306 191768 286837 262810 145953
12257A45953a82717B9763A3308b13228A6826J36061e4851j48261d580o5887C31859
$$ 145953 -182717 29763 13308 -213228 16826 152887 -54851 -203112 -4580 -70467 331859
12245B93100G2835a69798N5821H815b53947G8424k5960a0333n0995A77936f7712
$$ 293100 72835 -169798 -113977 8815 -253947 78424 52464 -10333 -61328 177936 -67712
12233C92260b09834A45909a22322E6160J69961O3660c2453b602l1666A93737f2387
$$ 392260 -209834 145909 -122322 56160 226121 289781 -32453 -2602 -34268 193737 -62387
12221A48901B0119J85376a12732C03008j13088i4659B12119i2983C23055k8502
$$ 148901 20119 205495 -112732 303008 189920 -94659 212119 -92983 323055 294553
12211B94553a6562A32212F4372L62286E5680P3142E2613r844h987F6435A0077
$$ 294553 -16562 132212 64372 426658 55680 128822 52613 42769 -8987 66435 10077
12199A5970b55552F7365L7238a65752C16311i7387a5972A79331B3040a35239B10636
$$ 15970 -255552 67365 104603 -165752 316311 -97387 -15972 179331 23040 -135239 210636
12187B41998f9426D82972A57331M002D7095J43033c15301a29797A13261J49070
$$ 241998 -69426 482972 157331 161333 47095 190128 -315301 -129797 113261 262331
12177B62331j23307f0060J3185E3721M07128j87518P7M4055k291c7467C80931
$$ 262331 139024 -60060 -46875 53721 460849 273331 273408 317463 315172 -37467 380931
12165A44911a55592C63860Q9961A93309K38478A47758C2754g8956A19428c2169
$$ 144911 -155592 363860 453821 193309 431787 147758 32754 -78956 119428 -32169
12154A55943M0191a0092A6381c6092p778D9810K73975a13756B41821E0737J17736
$$ 155943 196134 -10092 16381 -36092 -43870 49810 323785 -113756 241821 50737 168473
12143A68473b8700H9847e219A88185m8192n6538B127a91002O7944D3202b72585
$$ 168473 -28700 89847 -5219 188185 139993 83455 2127 -191002 -123058 43202 -272585
12131i3749j66086C41978j11825I3014K52983N4914H8279I792a06482I8273J08449
$$ -93749 -259835 341978 230153 93014 345997 400911 88279 9792 -106482 98273 206722
12120B06722C8784L144A8849R7286K30055D5905A4857e4550D36333q1854b20849
$$ 206722 38784 41928 18849 116135 346190 45905 14857 -54550 436333 354479 -220849
12108c1019A52587E9615J42940n2445J84610a22141N4745r3586A06683k9386B179
$$ -31019 152587 59615 202555 150110 334720 -122141 -67396 -160982 106683 77297 2179
12096A61344a69531E4140K67945j23561J45287A4247J82634o6483A9171L07195
$$ 161344 -169531 54140 322085 198524 343811 14247 196881 130398 19171 326366
12086C26366a65755E28560C427i7651A22212R4107r5649c2772C32310I4540b79698
$$ 326366 -165755 528560 3427 -97651 122212 216319 120670 -32772 332310 94540 -279698
12074F2347J89408k400r9609J68064M1688g4531A73620b4825B08849j01525J24853
$$ 62347 251755 249355 149746 317810 359498 -74531 173620 -24825 208849 107324 232177
12063B32177d074k586G5430k8418e517E0407a397A09182K6265J4797b51077H523
$$ 232177 -4074 -6660 75430 47012 -5517 50407 -1397 109182 135447 150244 -251077 8523
12050F1399h8384M0156k0494A95521l0999G7892b23356B15666q3966n6358d7502
$$ 61399 -88384 -48228 -68722 195521 164522 77892 -223356 215666 131700 75342 -47502
12038G994a9388A84495a39987A2533h324F6365J08378H7167K41956g1043G3874
$$ 7994 -19388 184495 -139987 12533 -8324 66365 174743 87167 329123 -71043 73874
12026C0127a91398D2128a94598F1512a0991j4961j26099F9779K42676a1072B1406
$$ 30127 -191398 42128 -194598 61512 -10991 -25952 -152051 69779 312455 -11072 21406
12014B93569A5062d3558A27164J51176b09686A14635O2118d9770a2830A87519
$$ 293569 15062 -43558 127164 278340 -209686 114635 176753 -49770 -12830 187519
12003a04192A12380J59176A17928C2451F753d6196a3126B0636Q2507g6980M926
$$ -104192 112380 271556 117928 32451 6753 -46196 -13126 20636 103143 -76980 -72054
11992g2054j1447A38791M6532a86085H1375a32881L8800a214j80812B24871d9342
$$ -72054 -83501 138791 185323 -186085 81375 -132881 -94081 -1214 -182026 224871 -49342
11980E4381k6513a00359H1237c0555r2896b5636A32786a12917j87093g6901j95486
$$ 54381 27868 -100359 81237 -30555 -123451 -25636 132786 -112917 -300010 -76901 -272387
11969b72387I9930a34147C37248a37327E484N5836J42088L577A4034L6315b4502
$$ -272387 99930 -134147 337248 -137327 5484 61320 203408 206985 14034 50349 -24502
11957a18142j96958A28248J04371n7237a58871P4392p3731c9355j49549k3061
$$ -118142 -315100 128248 232619 175382 -158871 -84479 -158210 -39355 -188904 -211965
11947b11965d0464C9892K57177a43765l9658j06991a39510A36561Q712h4521p7792
$$ -211965 -40464 39892 297069 -143765 -183423 -290414 -139510 136561 145273 -84521 -162313
11936a62313f65B11582K1582B4600J36912h4167k39994I5856M4151a09157M6697
$$ -162313 -665 211582 233164 24600 161512 -84167 -324161 95856 140007 -109157 -62460
11925f2460B02741J43289A62817b06895C7386b24007a01192H3023R2335l4145
$$ -62460 202741 346030 162817 -206895 37386 -224007 -101192 83023 175358 141213
11915A41213K67219a44310c920j9226j53117E4128d327A2404h8340A19073b99298
$$ 141213 408432 -144310 -3920 -23146 -176263 54128 -4327 12404 -88340 119073 -299298
11903c35513J36258C03240j02880a43611O0194r7194C14029b46845b6975k26389
$$ -335513 -199255 303240 200360 -143611 -83417 -180611 314029 -246845 -26975 -253364
11893b53364I3816M8411g4928A3913M15804A99346M5550j537c02297g7538B36414
$$ -253364 93816 142227 -74928 13913 429717 199346 244896 243359 -302297 -77538 236414
11881A23048a96933N3137e9274j03061j12342F5595J64952a58587q1716E2196
$$ 123048 -196933 -143796 -59274 -162335 -274677 65595 230547 -158587 -240303 52196
11870E2856Q8861a37787I1833a39425A57640c87103f8938j65043O9758m1759a1212
$$ 52856 141717 -137787 91833 -139425 157640 -387103 -68938 -233981 -164223 -205982 -11212
11858g4451o3531J044E9353a8160C90502d1823m8647G1764g6664G098P0853M70063
$$ -74451 -137982 -136938 59353 -18160 390502 -41823 -90470 71764 -76664 7098 77951 548014
11846E48014g300F6294M2838b46825H4443e9793b5770l7851j15953A57341C5141
$$ 548014 -7300 66294 109132 -246825 84443 -59793 -25770 -63621 -179574 157341 35141
11834E0294a78058d2072r5391A32414a6697B07860H9150N7995c35950B8793n058
$$ 50294 -178058 -42072 -137463 132414 -16697 207860 89150 147145 -335950 28793 23735
11823B3735d07505a57376J6583G224c39622a50015L1587q9488H0255b10622c6269
$$ 23735 -407505 -157376 -140793 7224 -339622 -150015 -118428 -207916 80255 -210622 -36269
11811b35410C35806B1531i8610k59060A91960a12487e5188B01089c340l45727
$$ -235410 335806 21531 -98610 -357670 191960 -112487 -55188 201089 -3340 -349067
11801c49067a47198q3711h5583D9799b9043A13684J48766G9489d5399B49782b07035
$$ -349067 -147198 -230909 -85583 49799 -29043 113684 262450 79489 -45399 249782 -207035
11789d1074H303a62638j3917g2387j42512C20581H0297b68018B1705c01655P4904
$$ -41074 8303 -162638 -176555 -72387 -214899 320581 80297 -268018 21705 -301655 -226751
11778b26751g6932C7147e2934j25999B27681H4531J42665d1401m6949A75365D0751
$$ -226751 -76932 37147 -52934 -178933 227681 84531 227196 -41401 -88350 175365 40751
11766g1248R406o3347o6988j53045E9870i4062C23095b90594a29916l13971a40305
$$ -71248 -61842 -125189 -192177 -345222 59870 -94062 323095 -290594 -129916 -443887 -140305
11754a61978E404P561c54493d7143k4802A21684b5468B29380p4460d9440l3588
$$ -161978 5404 12965 -354493 -47143 -71945 121684 -25468 229380 154920 -49440 -83028
11743h3028H1319a49293g4200J0458l7523G3742K2326r999m1877b6254C4559J24381
$$ -83028 81319 -149293 -74200 -63742 -101265 73742 96068 86069 44192 -26254 34559 158940
11731A58940N4113l8218f022A31174K41304c409l1195k53199K6431Q303e8380
$$ 158940 213053 174835 -6022 131174 372478 -3409 -34604 -287803 -261372 -253069 -58380
11719C13932p4240B9501i6041j46054B6307f7322A37954C8408a58600H4064a17563
$$ 313932 239692 29501 -96041 -242095 26307 -67322 137954 38408 -158600 84064 -117563
11707c16516B50834r3299d02701a76047E3898f8746I7929J02196i8115j8276A17294
$$ -316516 250834 157535 -402701 -176047 53898 -68746 97929 200125 -98115 -116391 117294
11695C49540I6448b09123A38168D8110P4952K69130c7781E9172b59896J13795
$$ 349540 96448 -209123 138168 48110 123062 392192 -37781 59172 -259896 -146101
11685a46101B17147e9879B84087g8543F3195J12792e8498j98350A25184D1089
$$ -146101 217147 -59879 284087 -78543 63195 175987 -58498 -256848 125184 41089
11674f5639D6248a75148B78999h9765B86699G6786a11583B09325F1588a44963
$$ -65639 46248 -175148 278999 -89765 286699 76786 -111583 209325 61588 -144963
11663C2392g0687m0971P919j78771H4040b88139N8931A34784l9739l4790a06200
$$ 32392 -70687 -111658 -103739 -282510 84040 -288139 -229208 134784 95045 60255 -106200
11651A12111h1342A57620A3911B372c27494B33132a34773j42647a6603A8025c09015
$$ 112111 -81342 157620 13911 2372 -327494 233132 -134773 -277420 -16603 18025 -309015
11639D9744M4030b9656B74538a14098j19496h1139l6350D9051d8996B75715j31403
$$ 49744 93774 -29656 274538 -114098 -233594 -81139 -117489 49051 -48996 275715 144312
11628A44312g7417b8726H0435C7653a71144C8710a90046A10140h3716C04998b05808
$$ 144312 -77417 -28726 80435 37653 -171144 38710 -190046 110140 -83716 304998 -205808
11616B56354f2753B76618a36342A2801a59494K4778A80843a59356A98604p5732
$$ 256354 -62753 276618 -136342 12801 -159494 -134716 180843 -159356 198604 122872
11606A22872n9550a44596A85805p0694R014Q5285p4821g1569n5423A97291i3160
$$ 122872 63322 -144596 185805 115111 124125 209410 134589 -71569 -126992 197291 -93160
11594F5642K3905A3287K17400N3840p8140J88453b72053B5615K04075r4193h102
$$ 65642 89547 13287 230687 284527 206387 394840 -272053 25615 229690 135497 -8102
11582c27774F0139K49654d5827r2259B14261e2684D02230a29095F4849k1815K40696
$$ -327774 60139 309793 -45827 -138086 214261 -52684 402230 -129095 64849 43034 283730
11571B83730J19279A73707G7796a43831C9603J30259p0832J128D3175a5294k1696
$$ 283730 403009 173707 77796 -143831 39603 169862 99030 100158 43175 -15294 -36990
11560c6990D0642b59105B52645K213G2321c5395j17540b3230j43133A01166D8708
$$ -36990 40642 -259105 252645 254858 72321 -35395 -152935 -23230 -166363 101166 48708
11548H8222O5989C6095B573a46213A09255B01K92961K11526C9794K58277j35703
$$ 88222 154211 36095 2573 -146213 109255 201 293162 504688 39794 298071 162368
11537A62368J47728a31353a5407m9362p7217A53641h8089O502k72919D84218k01893
$$ 162368 310096 -131353 -15407 -64769 -141986 153641 -88089 -81587 -354506 484218 282325
11526B82325d216A05693J16769p0118A6561a92367A04584a23921A80731a41543
$$ 282325 -4216 105693 222462 152344 16561 -192367 104584 -123921 180731 -141543
11515b01279B9038d85401c2982A09601L4451a55418M257C38073D8654K20077H4884
$$ -201279 29038 -485401 -32982 109601 144052 -155418 -151161 338073 48654 268731 84884
11503F7159e1012I4184D3005J4278K9685n012b3805I413J75663a01645I0172R3489
$$ 67159 -51012 94184 43005 57283 86968 81956 -23805 9413 185076 -101645 90172 183661
11491A83661e6632k569J4809A73204F1536J03122c43663c5534I6181h6095a2286
$$ 183661 -56632 -59201 -44392 173204 61536 164658 -343663 -35534 96181 -86095 -12286
11479c0652G394J66100O1105J32094c7345C07227r9027q6671R9143l9859J62107
$$ -30652 7394 173494 234599 366693 -37345 307227 208200 121529 220672 180813 342920
11468C42920a06203A04241m3694J0446K19193I5186L8154a88860n57D32909a01565
$$ 342920 -106203 104241 60547 70993 290186 95186 133340 -188860 -189417 432909 -101565
11456B20412L0604r7875L3974o6855L12851b46874A35605K25008M38a92279A59808
$$ 220412 251016 153141 187115 120260 433111 -246874 135605 360613 361051 -192279 159808
11444b67503J06833b1244I0642h1642k6709A55893E3649L32623J06011c9048j1256
$$ -267503 -160670 -21244 90642 -81642 -108351 155893 53649 386272 492283 -39048 -50304
11433e0304A29479e6720B28746o8355j4876a40891N764j03026D7620I336N869
$$ -50304 129479 -56720 228746 160391 145515 -140891 -135127 -238153 47620 9336 15205
11422A5205a39454b450n869B24254A2757A732J36253J84167c1500l9473L122A50459
$$ 15205 -139454 -2450 -8319 224254 12757 1732 137985 322152 -31500 -70973 -67851 150459
11409B42657D8095g5181n7559c7687A54683G7338J10f7937k33511A11186a01159
$$ 242657 48095 -75181 -132740 -37687 154683 77338 77448 -67937 -301448 111186 -101159
11397b5106B79894r9309l3223Q3793E5132a42921O7342l1855I1626a08447A3523
$$ -25106 279894 180585 147362 231155 55132 -142921 -75579 -107434 91626 -108447 13523
11385E0705d28741K10865j0006e6643D3604J58033n6237e1321B9891a66773b0788
$$ 50705 -428741 -217876 -227882 -56643 43604 201637 145400 -51321 29891 -166773 -20788
11373C49670i9877o17j08557m4477B47663j3435O8056A6569c19190G001h8564
$$ 349670 -99877 -100494 -209051 -253528 247663 234228 302284 16569 -319190 7001 -88564
11361B01920M1819F539J46943d1193k12361K3993B95826j23895b52503A38391
$$ 201920 243739 6539 153482 -41193 -253554 -229561 295826 171931 -252503 138391
11350a54522n4790J2691D0959K78764A57715P5491j9109E4587h7824b3752n0097
$$ -154522 -209312 -196621 40959 319723 157715 233206 214097 54587 -87824 -23752 -73849
11339g3849B2826f4974l2641j14794r1827H9645g0733K7967H7228m2450b37537
$$ -73849 22826 -64974 -97615 -212409 -304236 89645 -70733 -42766 87228 44778 -237537
11327b17831l1993g5652C24083m8548G9788a47124j30382C8547J53479p1162a21191
$$ -217831 -249824 -75652 324083 275535 79788 -147124 -277506 38547 192026 120864 -121191
11315A10929e875j62734J9161E8128A0141K298e760I9929a31222F6133b57816
$$ 110929 -5875 -168609 -149448 58128 10141 12439 -5760 99929 -131222 66133 -257816
11303C20693A04218a40095A81667E2941j0847J64146e7704B30516c07831F4855
$$ 320693 104218 -140095 181667 52941 42094 206240 -57704 230516 -307831 64855
11292a35422A3886b51229A24049c6337j43679c0421H0856B2790J26799H783a41225
$$ -135422 13886 -251229 124049 -36337 -180016 -30421 80856 22790 149589 8783 -141225
11280A38528b64067a28197B22962g6822A82413G3446a85509L2667A82473E8486
$$ 138528 -264067 -128197 222962 -76822 182413 73446 -185509 -152842 182473 58486
11269A04424i7367N186k92092F781g5296A60466c60556C5008a83316F9108a9425
$$ 104424 -97367 -92181 -384273 6781 -75296 160466 -360556 35008 -183316 69108 -19425
11257D6694a52820j33315Q2402G8876C0014J26751f7314B0805L7728r689J71178
$$ 46694 -152820 -286135 -203733 78876 30014 156765 -67314 20805 58533 48844 220022
11246B20022j07764C8861J49096a83936A43976i9958A92693a46098m3941F2440
$$ 220022 112258 38861 187957 -183936 143976 -99958 192693 -146098 -190039 62440
11235c31786A30378L980J68833a27136j16467A38072q397b09710Q6976j85272
$$ -331786 130378 134358 303191 -127136 -243603 138072 129675 -209710 -122734 -308006
11225c08006G4961a51403j1534D9766B3276e3646H1107a50325D0352K3110b56002
$$ -308006 74961 -151403 -162937 49766 23276 -53646 81107 -150325 40352 63462 -256002
11213H7800K6585O3869b53300E8240a03699F8317J33971g3199C3300q874a98275
$$ 87800 114385 178254 -253300 58240 -103699 68317 202288 -73199 33300 24426 -198275
11201b73946M1322A47107F5839g3092n6271l02770A32115c3603q8143N1458n1389
$$ -273946 -232624 147107 65839 -73092 -129363 -432133 132115 -33603 -121746 -70288 -121677
11190a21677b5830j05931B3314M2429A1506b51970a7231H4843A6132c8765A37717
$$ -121677 -25830 -131761 23314 65743 11506 -251970 -17231 84843 16132 -38765 137717
11178a42490e2662n1885D09348B8056a98883h4762k09498J46940C2702f6386j83468
$$ -142490 -52662 -104547 409348 28056 -198883 -84762 -294260 -147320 32702 -66386 -249854
11167b49854J06653r7799a16073j31777j5346R4594F6940A0443b37384R6930J6639
$$ -249854 -143201 -241000 -116073 -247850 -263196 -168602 66940 10443 -237384 -140454 -123815
11156a23815A83786c72343A2160b35087O7389A99650a69622f9097q4280q852F7997
$$ -123815 183786 -372343 12160 -235087 -167698 199650 -169622 -69097 -153377 -162229 67997
11144a43713l04848h4276j16256d7676I7508h6580B8848J11113A0916J58087i7773
$$ -143713 -448561 -84276 -200532 -47676 97508 -86580 28848 139961 10916 169003 -97773
11132a60320A13230E0845L20923a43655D8828a51219I8268J32314a44146B12209
$$ -160320 113230 50845 371768 -143655 48828 -151219 98268 230582 -144146 212209
11121a59994A87868E9688a20464B2638N9009c2713B13586J88889a28984N6214
$$ -159994 187868 59688 -120464 22638 81647 -32713 213586 402475 -128984 -72770
11111g2770o6964B0784K65083a43382a8117l1480m1167d0413B5944e9170C12124
$$ -72770 -139734 20784 285867 -143382 -18117 -49597 -90764 -40413 25944 -59170 312124
11099f2154m9418E66249A42890J41155a50794C19741j12039b245G8053J14444
$$ -62154 -111572 566249 142890 284045 -150794 319741 207702 -2245 78053 192497
11089A92497h3097l0761f042j05748C8980L84871A66778h2847o8827B33949b6740
$$ 192497 -83097 -113858 -6042 -111790 38980 423851 166778 -82847 -151674 233949 -26740
11077e522A47370N014N5149J34926J07845A15676n1430J63699M791o122a14166
$$ -5522 147370 152384 207533 342459 450304 115676 64246 227945 232736 226614 -114166
11065D22043j64438m8255a3715F69461C5274L40131a7518E76774B50396M98881
$$ 422043 257605 209350 -13715 669461 35274 375405 -17518 576774 250396 749277
11055G49277A41551L43770K07873k69363J30343B04085L64571r3285M6924P4444
$$ 749277 141551 485321 693194 423831 554174 204085 568656 475371 522295 596739
11045E96739M9344p2395K48566k11977J54445l0681j70158j08389M7428j73898
$$ 596739 646083 573688 822254 610277 764722 734041 563883 455494 502922 329024
11035C29024N55900k77930p6326j2199K35923j09985K56796k96288J5960q140
$$ 329024 884924 606994 530668 518469 754392 644407 901203 604915 620875 612735
11025F12735p6819m2389J58257J56023k16667P6951K23306C74991Q2398j78024
$$ 612735 535916 493527 651784 807807 591140 668091 891397 374991 457389 279365
11015B79365K91594k6996k41718l2022J59774A14956L91099o7235j16566J72770
$$ 279365 570959 543963 302245 270223 429997 114956 506055 438820 322254 495024
11005D95024P0239j04476K3463K05282r8199r9701A74411M90347k15258r626j79976
$$ 495024 565263 460787 484250 689532 591333 491632 174411 664758 449500 439874 259898
10994B59898K34713m6434J23287B16498K32264A72264N5977O6542M20231l25177
$$ 259898 494611 448177 571464 216498 448762 172264 228241 294783 715014 389837
10984C89837j50948O37403k70427J23152K78227m57522J80966j21912N5260J74880
$$ 389837 238889 876292 605865 729017 1007244 549722 730688 608776 664036 838916
10974H38916L34573j60652M1259L23902O222J88086J92652L66077J43721j59196
$$ 838916 1173489 1012837 1054096 1377998 1384220 1572306 1764958 2131035 2274756 2115560
10964B115560K20909J98408q7651k16565k23683m35573j25231k79539k874k05376
$$ 2115560 2336469 2534877 2447226 2230661 2006978 1571405 1446174 1166635 1163761 958385
10954I58385K9610K6253J61859k49190J88174k05516j2707Q5631q7520l68862
$$ 958385 987995 1014248 1176107 926917 1115091 909575 896868 982499 894979 526117
10944E26117R8326j17230J39560B13494J77169p6211n0771K01825a47125F7484
$$ 526117 624443 507213 646773 213494 390663 314452 263681 465506 -147125 67484
10933B96606O0265A12997m075J48603h1607j71521C5662e0553a6194E6101Q0135
$$ 296606 356871 112997 108922 257525 -81607 -253128 35662 -50553 -16194 56101 136236
10922A36236J76677a88108A24396b0950n7327E3704a11372j06090h7080d2949
$$ 136236 312913 -188108 124396 -20950 -78277 53704 -111372 -217462 -87080 -42949
10911C8287d61053R9569A77654p2111a0219A92057D0008M4725a84316F4477a0887
$$ 38287 -461053 -361484 177654 105543 -10219 192057 40008 84733 -184316 64477 -10887
10899I3825c744n2675I3978K87515b35175J04421j24059A03741B0558a10498q2598
$$ 93825 -3744 -56419 93978 381493 -235175 -130754 -254813 103741 20558 -110498 -193096
10888a93096Q4409q0068L1171j47066B39734c6412r8930d3715p3451F804J84443
$$ -193096 -108687 -188755 -157584 -304650 239734 -36412 -135342 -43715 -117166 6804 191247
10877A91247d1854k34428a07644k3464F5763b00884a2811l7244B37285a84221
$$ 191247 -41854 -276282 -107644 -131108 65763 -200884 -12811 -50055 237285 -184221
10866a23022B84101G8530g1547i963C5088a17135M7562K3032j07424M650J5369
$$ -123022 284101 78530 -71547 -9963 35088 -117135 -69573 -46541 -153965 -149315 -133946
10855a33946A58226N8089B9944c47345a23142j5007A70206a5288A64241o4519
$$ -133946 158226 216315 29944 -347345 -123142 -138149 170206 -15288 164241 99722
10845I9722g164m46637h2761k8668G1014a17585B96709b03166j13359N3773k055
$$ 99722 -7164 -453801 -82761 -111429 71014 -117585 296709 -203166 -316525 -262752 -264807
10834b64807A4213f0354k6792i897A46687R0221a37368A66616a13610C11912b6577
$$ -264807 14213 -60354 -87146 -9897 146687 236908 -137368 166616 -113610 311912 -26577
10822A61533A5010e7030j14535L5713a0116j32387B73336k7172m2238i4692k88532
$$ 161533 15010 -57030 -171565 -135852 -10116 -142503 273336 246164 203926 -94692 -383224
10811c83224e4440k37478I3984b07470A15897J01775J49831a89537K2234I9492
$$ -383224 -54440 -291918 93984 -207470 115897 217672 367503 -189537 -167303 99492
10800a6316A52281n1997a72963A04593J73670a68191A62277b26908d2217A24374
$$ -16316 152281 100284 -172963 104593 278263 -168191 162277 -226908 -42217 124374
10789e8967l95398g8883B6530a24858D2005J20120C5822c8238j27027A87212j2670
$$ -58967 -454365 -78883 26530 -124858 42005 162125 35822 -38238 -165265 187212 174542
10778A74542a0902B5490b70536a15965c1914j60948C16013a91324A76082q0900
$$ 174542 -10902 25490 -270536 -115965 -31914 -192862 316013 -191324 176082 95182
10768I5182a15914B21098d68989B45586j09664a37798G1165c15665J46974m9303
$$ 95182 -115914 221098 -468989 245586 135922 -137798 71165 -315665 -168691 -217994
10758b17994R740j48239A22104B8061d1368J2171A6231n006b47799C7983h7899
$$ -217994 -208254 -356493 122104 28061 -41368 -29197 16231 11225 -247799 37983 -87899
10746A87153m7164b91001A24240J23750a72966A32030a70810k02681J16134Q5077
$$ 187153 139989 -291001 124240 247990 -172966 132030 -170810 -373491 -257357 -172280
10736a72280I7310h2254A96222g1703a7103j52927d3493E3173K13221D988b59166
$$ -172280 97310 -82254 196222 -71703 -17103 -170030 -43493 53173 266394 4988 -259166
10724D2075a84679O2443k4103Q378k22796B81882A8044M21933e4258B91410e3661
$$ 42075 -184679 -122236 -146339 -137961 -360757 281882 18044 439977 -54258 291410 -53661
10712b1085A28383a62568j36091A386a36332C766i7930g772p7588m8125A79313
$$ -21085 128383 -162568 -298659 1386 -136332 3766 -97930 -7772 -85360 -133485 179313
10700c65485h5157k22212E6866b60878g3631B13561b16274B44117c9422p4602
$$ -365485 -85157 -307369 56866 -260878 -73631 213561 -216274 244117 -39422 -114024
10690a14024F2642K36175a09866H1058a85244A27405l7371h4698j40889a7710
$$ -114024 62642 298817 -109866 81058 -185244 127405 90034 -84698 -225587 -17710
10679d48620a91818g2425k0616C1798I13b07881M2168N7103j51177A33316A5599
$$ -448620 -191818 -72425 -93041 31798 913 -207881 -165713 -108610 -259787 133316 15599
10667g3113J9364G9308d27779D8067J90727N8606j28873f1313B83145b04345P3768
$$ -73113 -53749 79308 -427779 48067 238794 297400 168527 -61313 283145 -204345 -130577
10656a30577o1304D0931b64182A6758c9169k29474j13588h8175j92019R0132J0115
$$ -130577 -191881 40931 -264182 16758 -39169 -268643 -382231 -88175 -280194 -190062 -179947
10645a79947A4951b29505D4956a81184O265F1572e7873l35373P802H9804g5230
$$ -179947 14951 -229505 44956 -181184 -174919 61572 -57873 -393246 -385444 89804 -75230
10633H6138f5212k768j04236F796a85177g4569N040Q442K2267A71792a8091A38409
$$ 86138 -65212 -67980 -172216 6796 -185177 -74569 -69529 -61087 -38820 171792 -18091 138409
10620A569c4901O893j99185a2197m2966a567E0256b25942G533b45461a5595j55567
$$ 1569 -34901 -28008 -227193 -12197 -55163 -1567 50256 -225942 7533 -245461 -15595 -171162
10608a71162k9188p9370o9627C03382a6510A6910P8380a76757n3181J8998f6832
$$ -171162 -200350 -279720 -349347 303382 -16510 16910 95290 -176757 -229938 -210940 -66832
10596a09360H0445J07055k1108B3456b05825B4346c21004J31983I2392N4448a42227
$$ -109360 80445 187500 166392 23456 -205825 24346 -321004 -189021 92392 146840 -142227
10584C2153c5978o9460j40353f0334j06112r4572Q9902A12385c45512P2909A14347
$$ 32153 -35978 -105438 -245791 -60334 -166446 -261018 -171116 112385 -345512 -272603 114347
10572a02992A60419G5848a91667B04439a33443A4167J57351K0499a37691j68192
$$ -102992 160419 75848 -191667 204439 -133443 14167 171518 192017 -137691 -305883
10562c05883A0676a13619F9840b09842C4135c4905k06588A84286a72692j08779
$$ -305883 10676 -113619 69840 -209842 34135 -34905 -241493 184286 -172692 -281471
10552b81471L3408a14909L3476A56605a95777A20029c13109e2769r1891A69804
$$ -281471 -248063 -114909 -81433 156605 -195777 120029 -313109 -52769 -144660 169804
10541d05589a52650C8822B102g3628A34636b62829A30743b59442e1495K3772q7735
$$ -405589 -152650 38822 2102 -73628 134636 -262829 130743 -259442 -51495 -27723 -115458
10530a15458B38243A11956p139J26187h5748b1382j6279A23843c8443A30585b82781
$$ -115458 238243 111956 104817 231004 -85748 -21382 -37661 123843 -38443 130585 -282781
10518A97835b6282q8432G7009a83319F6628m773e3531k19608B39926o6034b22500
$$ 197835 -26282 -114714 77009 -183319 66628 61855 -53531 -273139 239926 173892 -222500
10506a11307q835B85883b77575h6999B07032a14186K0437j3380A11773b97824
$$ -111307 -120142 285883 -277575 -86999 207032 -114186 -93749 -107129 111773 -297824
10495d25435A20586M5997K07742D1814O1913a48306g1024A88336B3164f6668A79930
$$ -425435 120586 166583 374325 41814 103727 -148306 -71024 188336 23164 -66668 179930
10483D9005a32557l1409F19d6645A19072c7621E5390K09986j01407B2907K74937
$$ 49005 -132557 -163966 619 -46645 119072 -37621 55390 265376 163969 22907 297844
10472B97844P538G3912J78177n8474a43104a6864D97b92517B3736a14247B27473
$$ 297844 305382 73912 252089 193615 -143104 -16864 497 -292517 23736 -114247 227473
10460A63407f9954l21409d7697A50778a74415C7550b24442a02414j08029F6793
$$ 163407 -69954 -391363 -47697 150778 -174415 37550 -224442 -102414 -210443 66793
10449c0361E5552K44868a35715A25780m3593c27960n8101A22036b1873C45512
$$ -30361 55552 300420 -135715 125780 82187 -327960 -386061 122036 -21873 345512
10438a48903j8418c3826k9113A34773C5559J87713c19128C50678a01722M160l29644
$$ -148903 -167321 -33826 -62939 134773 35559 223272 -319128 350678 -101722 -97562 -427206
10427d27206a54849f9398p99B41501c43291B8608e2346q1574A10414b37558L3005
$$ -427206 -154849 -69398 -70197 241501 -343291 28608 -52346 -133920 110414 -237558 -204553
10416b04553O8383A57586e2705R281n0237k48186I351i524k01487j71237A23074
$$ -204553 -136170 157586 -52705 -43424 -93661 -341847 9351 -9524 -211011 -382248 123074
10404h0857C3170c70797D29371b30121c4715A54488o75b6879j41173g8361A88818
$$ -80857 33170 -370797 429371 -230121 -34715 154488 153813 -26879 -168052 -78361 188818
10392a52756H3465a649D7450r594D40L8499a85343I3333K03921A27347a72378
$$ -152756 83465 -1649 47450 37856 440 38939 -185343 93333 297254 127347 -172378
10380C1368J80021a20110A71647a05306F3144J49531J44513E1832L4183J07073
$$ 31368 211389 -120110 171647 -105306 63144 212675 357188 51832 86015 193088
10370A93088J03687E6493L8227c4731q8858C89452i2988C9687M59004E3329k3986
$$ 193088 296775 56493 94720 -34731 -123589 389452 -92988 39687 498691 53329 29343
10359B9343L60198A26889K58589A48602l1455k8805M9017E5005A4016k635M6235
$$ 29343 389541 126889 385478 148602 117147 88342 137359 55005 14016 11381 57616
10348E7616K76778C6597M48033E7485L47028j40475n2261M2822j02990P0292O3510
$$ 57616 334394 36597 484630 57485 404513 264038 211777 254599 151609 221901 285411
10337B85411I0886J86848e7544A73841j0806k3657K26630A73222b55704B08029
$$ 285411 90886 277734 -57544 173841 163035 139378 366008 173222 -255704 208029
10326d2011A85018n238B6486M5799L8304P0936J09551j29979p5430J35868K6858
$$ -42011 185018 179780 26486 72285 110589 181525 291076 161097 85667 221535 248393
10315B48393j04791L1307m5472b18893O9648B03840E2965k4381a63897N0154j7284
$$ 248393 143602 174909 129437 -218893 -149245 203840 52965 28584 -163897 -113743 -131027
10304a31027C6579c1222j0177j06945o7266A01082a97415A50246a61966E0429
$$ -131027 36579 -31222 -41399 -148344 -215610 101082 -197415 150246 -161966 50429
10293a80015e074A94996b58885a23169B08786b30549b347j98547I1819K67250
$$ -180015 -5074 194996 -258885 -123169 208786 -230549 -2347 -200894 91819 359069
10283C59069b5587l65514A6664b6611j20150M3732d5428J5790E23768B5703b76190
$$ 359069 -25587 -391101 16664 -26611 -146761 -103029 -45428 -29638 523768 25703 -276190
10271a30006l11862b3002C313e923j22981m5197B2326K2138j7624K83440B0123
$$ -130006 -441868 -23002 3313 -5923 -128904 -174101 22326 44464 26840 310280 20123
10259g5109A95443B957K07707A04153a47728A06217N0938N5853h3017B85007F5011
$$ -75109 195443 2957 210664 104153 -147728 106217 157155 213008 -83017 285007 65011
10247B84965o2009A04009B2994J12023M1247b37716Q8618H8151a30960C41058
$$ 284965 222956 104009 22994 135017 176264 -237716 -149098 88151 -130960 341058
10236A40265a67995r640c5936A9433a92414j00474f5001B7687b2492E2278h7120
$$ 140265 -167995 -177635 -35936 19433 -192414 -292888 -65001 27687 -22492 52278 -87120
10224b53420o8691D01914g59A8853f6875A01218J71384a61258A12861R0301e6728
$$ -253420 -322111 401914 -759 18853 -66875 101218 272602 -161258 112861 203162 -56728
10212h8798B06341f7658I654h4556n8272B7999M46112a09081n9566a9440L882
$$ -88798 206341 -67658 9654 -84556 -142828 27999 474111 -109081 -168647 -19440 -15558
10201a5558l33939d4726j62832N2186o2974J08365e3388A85901i9799A6024J41170
$$ -15558 -349497 -44726 -207558 -155372 -218346 -109981 -53388 185901 -99799 16024 157194
10190A57194l3603c02887i071A56777h7636L2456F955M3537b23102R7711N2468
$$ 157194 123591 -302887 -9071 156777 -87636 -55180 6955 50492 -223102 -125391 -72923
10179g2923D48393I2595J7998K4079a64954A45573a93270c7926j46364B20589
$$ -72923 448393 92595 110593 134672 -164954 145573 -193270 -37926 -184290 220589
10168e29342a16769H2945a88071B8956b5018K080a1067A15520a76128A10778e20960
$$ -529342 -116769 82945 -188071 28956 -25018 -22938 -11067 115520 -176128 110778 -520960
10156b52388a22220H7939J46717b0909q4956j16419a06344B22049p2260i1147
$$ -252388 -122220 87939 234656 -20909 -105865 -222284 -106344 222049 149789 -91147
10145f220l7906j46441H116h2813J2207j27802E5351J14572a57235L7045I8033
$$ -6220 -44126 -190567 8116 -82813 -70606 -198408 55351 169923 -157235 -120190 98033
10133b34160B711a09922G8442d63560b29653C2630J56654b86781o7292b9298A9062
$$ -234160 2711 -109922 78442 -463560 -229653 32630 189284 -286781 -354073 -29298 19062
10121D4433j7202b42286e3750j58349F2467K8349e06387a37715J9792B98838K99
$$ 44433 27231 -242286 -53750 -212099 62467 90816 -506387 -137715 -117923 298838 299137
10110B99137E5434d5543l04159N8534P2502j46666J29031B39J34655a37039j15470
$$ 299137 55434 -45543 -349702 -291168 -218666 -365332 -236301 239 134894 -137039 -252509
10099b52509J15240j57491i1438r9079d6260A1255a97893F2704b1168n7753k0975
$$ -252509 -137269 -294760 -91438 -190517 -46260 11255 -197893 62704 -21168 -78921 -99896
10088i9896n4482A63719b64398C83413H2225L8399m586b23163a7513n0326A18396
$$ -99896 -154378 163719 -264398 383413 82225 120624 116038 -223163 -17513 -67839 118396
10076b77278E515a68153A36861c11079J13267L9009j08427C41606A25796a14958
$$ -277278 5515 -168153 136861 -311079 -197812 -158803 -267230 341606 125796 -114958
10065b80741J17674e2965A31434f9117I9719e2193A28487i8921A96375f4763P426
$$ -280741 -163067 -52965 131434 -69117 99719 -52193 128487 -98921 196375 -64763 -57337
10054e7337m0132D9079a60255c8095G1250l0811R241E382i4593h887A68493c75101
$$ -57337 -97469 49079 -160255 -38095 71250 40439 49680 5382 -94593 -8887 168493 -375101
10041a91387Q3869L1326j51740E243a60457a1131k8142q8015e0218j84759E2665
$$ -191387 -107518 -76192 -227932 5243 -160457 -11131 -39273 -127288 -50218 -234977 52665
10029C15688I712a8349j21852a4895m2380D1330e4428O55A76597M456e1641r6465
$$ 315688 9712 -18349 -140201 -14895 -57275 41330 -54428 -53773 176597 181053 -51641 -148106
10017a48106l5684B11000F628a03835j73773a24174B95315Q1210A29582b52597
$$ -148106 -183790 211000 6628 -103835 -277608 -124174 295315 376525 129582 -252597
10006A02749a0857C17703a64492b9976r3513K6278q1378M7391B45422b74041A2532
$$ 102749 -10857 317703 -164492 -29976 -123489 -97211 -178589 -131198 245422 -274041 12532
9994F2214a27275E8247N4324D0868L6685b2347k13447A9783O9943B9423M5830
$$ 62214 -127275 58247 112571 40868 77553 -22347 -235794 19783 89726 29423 75253
9983G5253a44130k24781a60126a8558D1391j3247L20245j50365b08042O1370I0333
$$ 75253 -144130 -368911 -160126 -18558 41391 28144 348389 198024 -208042 -146672 90333
9971A55331a19416b9102A3688d12558b03276o023K6285g4660k85419A34570c05656
$$ 155331 -119416 -29102 13688 -412558 -203276 -209299 -183014 -74660 -360079 134570 -305656
9959a34043A54060K6082D8569a44195A20903a63130e6405F4276f1305q0896m6728
$$ -134043 154060 180142 48569 -144195 120903 -163130 -56405 64276 -61305 -142201 -188929
9948a88929Q0955B8681c00652j3814e5259J9377D64374k25509B7859M4627l3928
$$ -188929 -107974 28681 -300652 -314466 -55259 -35882 464374 238865 27859 72486 38558
9937C8558b4338o8175D528a98051P8635C6285a87397l034j03738a12630I8517
$$ 38558 -24338 -92513 4528 -198051 -119416 36285 -187397 -190431 -294169 -112630 98517
9925A08028D3819R1704g1860k55255j9155Q6502a20609A06566a11799d8657j12001
$$ 108028 43819 135523 -71860 -327115 -346270 -259768 -120609 106566 -111799 -48657 -160658
9914a60658c5422Q86j48669j19573G7158b85238d7080k76001A80741N149D5957
$$ -160658 -35422 -34536 -183205 -302778 77158 -285238 -47080 -323081 180741 185890 45957
9902c6698j06775k04755J70798h1396j75089J22293e8490A92125a2000F741b99717
$$ -36698 -143473 -348228 -177430 -81396 -256485 -134192 -58490 192125 -12000 6741 -299717
9890A02821d1408k27978A4790J75966a61485k1937L9346d9786q1367a1354E1112
$$ 102821 -41408 -269386 14790 190756 -161485 -183422 -144076 -49786 -131153 -11354 51112
9878c6756B63643c09413A91334b33173n4948A53465b8468o0830A46686D8192n806
$$ -36756 263643 -309413 191334 -233173 -288121 153465 -28468 -89298 146686 48192 42386
9867D2386a02142F919c9555H8501M8822m1525c48456J52623F9306K0966b705k15716
$$ 42386 -102142 6919 -39555 88501 137323 95798 -348456 -195833 69306 90272 -2705 -218421
9855b18421f2518B4349E610K68379a04417A04612a71913e9118C8483b12808K720
$$ -218421 -62518 24349 5610 273989 -104417 104612 -171913 -59118 38483 -212808 -210088
9844b10088A63335e7982A12382a17174j89072d819A02997a68361G4517A0819M3858
$$ -210088 163335 -57982 112382 -117174 -306246 -4819 102997 -168361 74517 10819 54677
9833E4677M8615a29203L0841l2412A6597b07678l3115B12097a8634j23002G469
$$ 54677 103292 -129203 -98362 -130774 16597 -207678 -240793 212097 -18634 -141636 7469
9821a17547D6912M416d34098i9192Q788I5947c88060A6973c00092M7498J15293
$$ -117547 46912 51328 -434098 -99192 -90404 95947 -388060 16973 -300092 -252594 -137301
9810a37301J0404D2481J43846a34713r1116D5428j7033b69942a01181k9697l0411
$$ -137301 -126897 42481 186327 -134713 -225829 45428 28395 -269942 -101181 -130878 -161289
9799a61289K3153A7281J39873b05445j23828D9204f7242n5430C40529i2731b9121
$$ -161289 -138136 17281 157154 -205445 -329273 49204 -67242 -122672 340529 -92731 -29121
9787h7326k42454A30681D6117a81999c0953l0598J9836j00225A67601d603A59871
$$ -87326 -329780 130681 46117 -181999 -30953 -61551 -41715 -141940 167601 -4603 159871
9775A5340L7323a04754A56234D5676A0516M0660K7657A2519b74577A73663b04129
$$ 15340 52663 -104754 156234 45676 10516 51176 78833 12519 -274577 173663 -204129
9763B03118c4704j98489e1487j62005A04286M629a20463e9884B6778b07897d4298
$$ 203118 -34704 -233193 -51487 -213492 104286 108915 -120463 -59884 26778 -207897 -44298
9751A0343a95246h6890K5803C5189b60339j22583r4211C07929j06079B7177F652
$$ 10343 -195246 -86890 -61087 35189 -260339 -382922 -477133 307929 201850 27177 6652
9739A92989f2705A33948b13815A96377b75695B06171c14657A10251j8465A3474
$$ 192989 -62705 133948 -213815 196377 -275695 206171 -314657 110251 91786 13474
9728b8471j04167o9036j7875A88923a38003B31955a56640F4277a6616A05708P0936
$$ -28471 -132638 -201674 -219549 188923 -138003 231955 -156640 64277 -16616 105708 176644
9717A76644b38351i0789I0055b35093i2534J79j06977K6725G6012J8180a20041
$$ 176644 -238351 -90789 90055 -235093 -92534 -92355 -199332 -172607 76012 94192 -120041
9705a14185L2128A04882Q0414M4705a51197p167a0945p1619j64974i5666l85731
$$ -114185 -82057 104882 185296 230001 -151197 -158364 -10945 -82564 -247538 -95666 -481397
9694d81397b31016L7297K9898K7144K4261A28069h8148k93853f0796A43761c50579
$$ -481397 -231016 -193719 -163821 -136677 -112416 128069 -88148 -382001 -60796 143761 -350579
9682h0814B34912C2855h7400J7460A60268g925A3691P1217f5645C04726H4436
$$ -80814 234912 32855 -87400 -69940 160268 -7925 13691 84908 -65645 304726 84436
9670e6588E0446c62304J24492N4895e9034k13908g5799k99695C89525A76125h2559
$$ -56588 50446 -362304 -237812 -182917 -59034 -272942 -75799 -375494 389525 176125 -82559
9658b47432A5629K02037r3617m1206a66m64020J88873C8727M0302Q126l2866b94176
$$ -247432 15629 217666 124049 82843 -166 -464186 -275313 38727 79029 87155 54289 -294176
9645c1556k61754B76038b97514a08174h774B96027A1945b32317g366A09789b06687
$$ -31556 -293310 276038 -297514 -108174 -8774 296027 11945 -232317 -7366 109789 -206687
9633c86631J66770j10608e4924D5296K5949b04678i7974j45375i7146H1389a36203
$$ -386631 -219861 -330469 -54924 45296 71245 -204678 -97974 -243349 -97146 81389 -136203
9621b16868k6655J4360D1241R7332a50341B39077a24764N9368j21531A11314b9809
$$ -216868 -243523 -229163 41241 138573 -150341 239077 -124764 -65396 -186927 111314 -29809
9609d18535A99015C4953b52489g4861m04106c4787J2899m8313L424j50721M1018
$$ -418535 199015 34953 -252489 -74861 -478967 -34787 -21888 -70201 -66777 -217498 -176480
9598a76480A60177j9124B785P6997l8492H252a2091k98400B16619j6253i1560
$$ -176480 160177 141053 2785 79782 41290 8252 -12091 -310491 216619 200366 -91560
9586b18570j59029J53467j2203B67314A28727n1128a48636f3332k9527k0290K2244
$$ -218570 -377599 -224132 -236335 267314 128727 77599 -148636 -63332 -92859 -113149 -90905
9575i0905A35300a7614l28480h0463a1967j24440j1116k8590l5131I537g1299
$$ -90905 135300 -17614 -346094 -80463 -11967 -136407 -147523 -176113 -211244 9537 -71299
9563a36795j3686A11101a27108j270c4984q4722J6903B13288q8932a38663F3278
$$ -136795 -150481 111101 -127108 -128378 -34984 -119706 -102803 213288 124356 -138663 63278
9551b11194R9179L654L6958D0897b64918O7245b1107B325n32M5687J98526B8804
$$ -211194 -112015 -108361 -71403 40897 -264918 -197673 -21107 2325 1793 47480 246006 28804
9538A06329k2133c62324J21789a01595H3300h9031M3214k12929k3183J25923m0403
$$ 106329 84196 -362324 -240535 -101595 83300 -89031 -45817 -258746 -281929 -156006 -196409
9527a96409i7829A01828a27496M6946L1876o3449k03225B0168f1647B3816h6686
$$ -196409 -97829 101828 -127496 -80550 -48674 -112123 -315348 20168 -61647 23816 -86686
9515d11754c6302J4521o5315C26286b6404A18131n2463d4428r9228f0009k4062
$$ -411754 -36302 -21781 -87096 326286 -26404 118131 65668 -44428 -143656 -60009 -84071
9504h4071I3322J36325i9993k07977B81267i3072j72056J03707B32505E4584g7496
$$ -84071 93322 229647 -99993 -307970 281267 -93072 -265128 -161421 232505 54584 -77496
9492E2077B3177c430C0239f9940l66673a53821A39540b12384l2488A64121c08700
$$ 52077 23177 -3430 30239 -69940 -436613 -153821 139540 -212384 -244872 164121 -308700
9480A44688n968d4815L032k6866A62459a49999o1706A99110b8894j17286f0609
$$ 144688 138720 -44815 -41783 -68649 162459 -149999 -211705 199110 -28894 -146180 -60609
9468B9614L02246l2464j48468n038d52259K04965H0124d540B11965F8643c97719
$$ 29614 331860 299396 150928 145890 -452259 -247294 80124 -4540 211965 68643 -397719
9456i7354r882A77346a11802k1492c7821j27803P1559A22476A6720a21706j62826
$$ -97354 -107236 177346 -111802 -133294 -37821 -165624 -94065 122476 16720 -121706 -284532
9445b84532i8075j18516M8653B94245A2745f9089k68011Q9211b0275A74513G7151
$$ -284532 -98075 -216591 -167938 294245 12745 -69089 -337100 -247889 -20275 174513 77151
9433a89209f5327B8055O9877d19635B04496a31956o3029k31939p8812a27802A76862
$$ -189209 -65327 28055 97932 -419635 204496 -131956 -194985 -426924 -505736 -127802 176862
9421H6178e35557b63501c7132E8140J06460F9322a33713C3125b34943k961A2518
$$ 86178 -535557 -263501 -37132 58140 164600 69322 -133713 33125 -234943 -237904 12518
9409a84965K4809O3459I2511L450C1116c0335j08410B7029J94307a14270r4288
$$ -184965 -160156 -96697 92511 95961 31116 -30335 -138745 27029 221336 -114270 -208558
9398b08558A51933g8190A5338J60168o0474a47665c5255p9133j9711A01466a97636
$$ -208558 151933 -78190 15338 175506 115032 -147665 -35255 -114388 -134099 101466 -197636
9386a16648N0998k58471B38645d8892l2211A25475c01325j19093a45496R429A04224
$$ -116648 -65650 -324121 238645 -48892 -81103 125475 -301325 -420418 -145496 -136067 104224
9374a74777a9095q790l49101A04457b0331j43264A94416a12889j81450e6438D8307
$$ -174777 -19095 -27885 -376986 104457 -20331 -163595 194416 -112889 -294339 -56438 48307
9362d07944g5191j94268A67451b04404A53704h6955a2853B21306c35396j67624
$$ -407944 -75191 -269459 167451 -204404 153704 -86955 -12853 221306 -335396 -503020
9352e03020a36552F6808R0180C079i6717K3560E07782a16406k5013A16031R3397
$$ -503020 -136552 66808 156988 3079 -96717 -73157 507782 -116406 -141419 116031 209428
9341B09428B6773d995l24537J39032R1099M5462k59298A6440a94873B6393f9846
$$ 209428 26773 -4995 -329532 -190500 -99401 -53939 -313237 16440 -194873 26393 -69846
9329a48786e2216B01136a66592I072M5457a57912j43560E0122K9098a24127K2978
$$ -148786 -52216 201136 -166592 9072 54529 -157912 -301472 50122 79220 -124127 -101149
9318a01149q5513B87334D859A4c31970O25D6468b60354i9490A64056b03030Q6677
$$ -101149 -186662 287334 4859 14 -331970 -331345 46468 -260354 -99490 164056 -203030 -116353
9306a16353G3849K29250c3454C065b98018A8137b57042O4798o2792G6495a1194
$$ -116353 73849 303099 -33454 3065 -298018 18137 -257042 -192244 -255036 76495 -11194
9294d6335k15921J18150k0764a6633A30892L2729a33068j00528g8920c4278j75529
$$ -46335 -262256 -144106 -164870 -16633 130892 163621 -133068 -233596 -78920 -34278 -209807
9283b09807C21588c5446k66675g6153r5180o2680A76610b7050m9551J7305n8148
$$ -209807 321588 -35446 -302121 -76153 -171333 -234013 176610 -27050 -76601 -59296 -117444
9272a17444a5186F054N7064J57147b8771k31327c6149j31184j07098B2838R4672
$$ -117444 -15186 6054 63118 220265 -28771 -260098 -36149 -167333 -274431 22838 117510
9261A17510b37713b7219j23051d2567k83662a39940B16306p4106n3024g8330k31561
$$ 117510 -237713 -27219 -150270 -42567 -326229 -139940 216306 142200 89176 -78330 -309891
9250c09891J05959l6234n4591A81909a0988a957F1105b26192G2485K9363P0448
$$ -309891 -203932 -240166 -294757 181909 -10988 -1957 61105 -226192 72485 101848 172296
9239A72296o7317c41389B03895g4645n2194k78078a8898F699L59370d5758K1758
$$ 172296 104979 -341389 203895 -74645 -126839 -404917 -18898 6699 366069 -45758 -24000
9228b4000H5863K65316b93252a20975n874b7175B09038e7191B9739b35642O4054
$$ -24000 85863 351179 -293252 -120975 -126849 -27175 209038 -57191 29739 -235642 -171588
9217a71588N8926A03521f7698l30504a53077a4250A92830b28405R0901B5674a349
$$ -171588 -112662 103521 -67698 -398202 -153077 -14250 192830 -228405 -137504 25674 -1349
9205F2036L12704j17020g0371p338C02355E8648G609a53235N438P2033k1544k35996
$$ 62036 374740 257720 -70371 -77709 302355 58648 7609 -153235 -147797 -75764 -97308 -333304
9193c33304g2251A7783a70078o991j27489B7694K53960b77477A71408b12651c9547
$$ -333304 -72251 17783 -170078 -177069 -304558 27694 281654 -277477 171408 -212651 -39547
9181A33676a41220H3027a43553E3955Q3722b9086j57366m3552j68840B8426b05656
$$ 133676 -141220 83027 -143553 53955 137677 -29086 -186452 -230004 -398844 28426 -205656
9169h4938A30665b19882L5213b5569k30987J15334L7080A27830a02882l4687C509
$$ -84938 130665 -219882 -184669 -25569 -256556 -141222 -104142 127830 -102882 -137569 3509
9157f5878F0255i4517B0778M0793b35941c5812L963j67092i9426a4636A33279
$$ -65878 60255 -94517 20778 61571 -235941 -35812 -31849 -198941 -99426 -14636 133279
9145a36448A23940i6705k6803B24180f7453B01144a90559a3801r3677A86663e7971
$$ -136448 123940 -96705 -123508 224180 -67453 201144 -190559 -13801 -107478 186663 -57971
9133b44047R7259k98477h4730A74405a07879k3361j60186B14112c4052B7851Q062
$$ -244047 -146788 -445265 -84730 174405 -107879 -131240 -291426 214112 -34052 27851 35913
9122C5913c78537J21998b9206A7754a14884A60004C040a94649l1024C23463b34736
$$ 35913 -378537 -256539 -29206 17754 -114884 160004 3040 -194649 -225673 323463 -234736
9110b1684N59p9469E1178d20793A20759O7431a8390A21047a13462A31703a57433
$$ -21684 -21125 -100594 51178 -420793 120759 188190 -18390 121047 -113462 131703 -157433
9098f2481j05755g4852K3953l98178g5905G3091a34510A39034J60929G4617b3513
$$ -62481 -168236 -74852 -50899 -449077 -75905 73091 -134510 139034 299963 74617 -23513
9086c11665B5060Q8898i7911A65994A8601a85667l6016F0608h2228c1738B60604
$$ -311665 25060 113958 -97911 165994 18601 -185667 -221683 60608 -82228 -31738 260604
9074g6618A52637c2490H246L9701L6941l7937a09122B52730a13319I4797j3610
$$ -76618 152637 -32490 8246 47947 84888 46951 -109122 252730 -113319 94797 81187
9063H1187c53584J5290A24200b13694I731g1059n1484a9620j83895R4011C2195
$$ 81187 -353584 -338294 124200 -213694 9731 -71059 -122543 -19620 -203515 -109504 32195
9051c9700A15797h7891l0135N7795o5098a0785j95364O2648A6333L02323j57044
$$ -39700 115797 -87891 -118026 -60231 -125329 -10785 -206149 -143501 16333 318656 161612
9040A61612g8894F7720h6451G9015b24122f9146A28274a413m25812F7687I717
$$ 161612 -78894 67720 -86451 79015 -224122 -69146 128274 -1413 -427225 67687 9717
9028a17446b9678l78671e9937F3901a61252C8664K0166J61256o2790a1756j04430
$$ -117446 -29678 -408349 -59937 63901 -161252 38664 58830 220086 157296 -11756 -116186
9017a16186N0823D2162d898m9026I970a96812R1661D4582J49282A6440b14105
$$ -116186 -65363 42162 -4898 -53924 9970 -196812 -105151 44582 193864 16440 -214105
9005b88128R4972n72L8901j17789A97577I7174c02147e1535B9385P7203P0108
$$ -288128 -193156 -193728 -154827 -272616 197577 97174 -302147 -51535 29385 106588 176696
8994A76696B0807a08699a4324j09421N9921n47j00557F468c62866J15587c2728
$$ 176696 20807 -108699 -14324 -123745 -63824 -64371 -164928 6468 -362866 -247279 -32728
8982a91120r1045a1808j77822j58265G535P0491e7086l60540C99332b73054M4466
$$ -191120 -282165 -11808 -189630 -347895 7535 78026 -57086 -417626 399332 -273054 -228588
8971b28588A45863c6968j74696A75920C7812a12483F6295b16825d7565A678b84196
$$ -228588 145863 -36968 -211664 175920 37812 -112483 66295 -216825 -47565 1678 -284196
8959D5939j5377M8408c08231f9170o6181M2768A62796a96697e2102k45838A08068
$$ 45939 30562 78970 -308231 -69170 -135351 -92583 162796 -196697 -52102 -297940 108068
8947B9497L95453b02062r9559P8248J4944j31002C2012K0880i9123B50770a1609
$$ 29497 424950 -202062 -301621 -223373 -208429 -339431 32012 52892 -99123 250770 -11609
8935b7358j08024C0256g3495A37686A2618i6320k00645a38850j94733I3062a96111
$$ -27358 -135382 30256 -73495 137686 12618 -96320 -296965 -138850 -333583 93062 -196111
8923A61400a55356B80147K096n7674E9545J046846l03920C59167C0084a00587
$$ 161400 -155356 280147 282243 224569 59545 1106391 802471 359167 30084 -100587
8912B60468d5119B1128c9640C06448f6223k03625g5749j471i80r5036q1473d6035
$$ 260468 -45119 21128 -39640 306448 -66223 -269848 -75749 -77220 -980 -96016 -177489 -46035
8899d27533a9575A79545A2896a97682k9273n0747N5181D7469k0093h0351A29855
$$ -427533 -19575 179545 12896 -197682 -226955 -277702 -222521 47469 27376 -80351 129855
8887a48096d0123k04473d4291A66387G2471a96455c5884B53588b21993g875A78116
$$ -148096 -40123 -244596 -44291 166387 72471 -196455 -35884 253588 -221993 -7875 178116
8875b99470Q4734k1617d2877j2371r6173B1082c7576E1628b0304k2095B66454
$$ -299470 -214736 -236353 -42877 -55248 -151421 21082 -37576 51628 -20304 -42399 266454
8863B42495a43153f3024l8728A42420c35641B6491K13467b54625A20421D0777
$$ 242495 -143153 -63024 -101752 142420 -335641 26491 239958 -254625 120421 40777
8852b16441L5903B38321J989p4580b29988h927b739A67527e3943A751a87919j28409
$$ -216441 -180538 238321 240310 165730 -229988 -8927 -2739 167527 -53943 1751 -187919 -316328
$$ [...]
##END NTUPLES=NMR SPECTRUM
##END=
