##TITLE=NES1009_842410_9233004_osP6W4uPZL
##JCAMPDX= 6.0         $$ Bruker NMR JCAMP-DX V2.0
##DATA TYPE= NMR SPECTRUM
##DATA CLASS= NTUPLES
##ORIGIN= BRUKER
##OWNER= Administrator
$$ 1.72 TOPSPIN		Version 2.1
$$ 2015-06-17 20:25:25.159 -0700  Administrator@X
$$ Compression mode = diff/dup
##.OBSERVE FREQUENCY= 400.02188249412
##.OBSERVE NUCLEUS= ^1H
##.ACQUISITION MODE= SIMULTANEOUS (DQD)
##.ACQUISITION SCHEME= undefined
##.AVERAGES= 8
##.DIGITISER RES= 22
##SPECTROMETER/DATA SYSTEM= spect
##.PULSE SEQUENCE= zg30
##.SOLVENT NAME= COFFEE_meoh
##.SHIFT REFERENCE= INTERNAL, COFFEE_meoh, 1, 14.98509
##AUDIT TRAIL= $$ (NUMBER, WHEN, WHO, WHERE, PROCESS, VERSION, WHAT)
$$ ##TITLE= Audit trail, TOPSPIN		Version 2.1
$$ ##JCAMPDX= 5.01
$$ ##ORIGIN= Bruker BioSpin GmbH
$$ ##OWNER= Administrator
$$ $$ E:\/data/COFFEE/nmr/NES1009_842410_9233004_osP6W4uPZL/10/pdata/1/auditp.txt
$$ ##AUDIT TRAIL=  $$ (NUMBER, WHEN, WHO, WHERE, PROCESS, VERSION, WHAT)
(   1,<2015-06-17 20:25:18.081 -0700>,<Administrator>,<X>,<go>,<TOPSPIN 2.1>,
      <created by zg
	started at 2015-06-17 20:24:12.019 -0700,
	POWCHK enabled, PULCHK disabled,
       configuration hash MD5:
       21 0F 79 D6 B3 7B B4 F6 88 20 88 DB 03 48 BD 9F
       data hash MD5: 64K
       99 6F 53 AB AF 7D E9 D0 C6 D0 73 64 D9 18 6A 4B>)
(   2,<2015-06-17 20:25:21.112 -0700>,<Administrator>,<X>,<proc1d>,<TOPSPIN 2.1>,
      <Start of raw data processing
       efp LB = 0 FT_mod = 6 PKNL = 1 PHC0 = 0 PHC1 = 0 SI = 32K 
       data hash MD5: 32K
       D6 75 1E 2C 0A 97 A9 07 52 52 9A EF 6B A3 B6 39>)
(   3,<2015-06-17 20:25:21.394 -0700>,<Administrator>,<X>,<proc1d>,<TOPSPIN 2.1>,
      <pk PHC0 = 92.16431 PHC1 = 0 
       data hash MD5: 32K
       4F 55 8C 1C 8E D8 11 FB 5E 76 65 74 87 64 A5 48>)
(   4,<2015-06-17 20:25:21.503 -0700>,<Administrator>,<X>,<proc1d>,<TOPSPIN 2.1>,
      <abs ABSG = 1 
       data hash MD5: 32K
       07 23 AD 21 15 B5 5D 64 04 FE 2C 40 86 9C 9A 4F>)
(   5,<2015-06-17 20:25:21.566 -0700>,<Administrator>,<X>,<proc1d>,<TOPSPIN 2.1>,
      <abs ABSG = 2 
       data hash MD5: 32K
       DC B7 E5 64 8D 4A BC C6 62 02 2C 59 DD BA 40 F0>)
(   6,<2015-06-17 20:25:21.628 -0700>,<Administrator>,<X>,<proc1d>,<TOPSPIN 2.1>,
      <abs ABSG = 3 
       data hash MD5: 32K
       69 87 1C 43 EC 3B 10 03 2E CB C4 0B D9 02 C0 82>)
(   7,<2015-06-17 20:25:21.691 -0700>,<Administrator>,<X>,<proc1d>,<TOPSPIN 2.1>,
      <abs ABSG = 4 
       data hash MD5: 32K
       69 71 DC 5F BD DF 2A 28 54 30 D5 46 EA 7D 8A 69>)
(   8,<2015-06-17 20:25:21.753 -0700>,<Administrator>,<X>,<proc1d>,<TOPSPIN 2.1>,
      <abs ABSG = 5 
       data hash MD5: 32K
       84 FF AA 67 50 64 99 B3 55 B3 FA 89 88 0C 37 A5>)
$$ ##END=
$$ 
$$ $$ hash MD5
$$ $$ C0 F4 84 9E EB 8A 8F 9F 0D 14 B7 B3 2B 71 0C 9F
##$RELAX= 
##$RELAX= 
##$RELAX= 
##$RELAX= 
##$RELAX= 
##$RELAX= 
##$RELAX= 
$$ Bruker specific parameters
$$ --------------------------
##$DU= <E:\>
##$EXPNO= 10
##$NAME= <NES1009_842410_9233004_osP6W4uPZL>
##$PROCNO= 1
$$ [...]
150 150 150 150 150 150 150 150
##$TP07= 0
##$TPNAME0= <>
##$TPNAME1= <>
##$TPNAME2= <>
##$TPNAME3= <>
##$TPNAME4= <>
##$TPNAME5= <>
##$TPNAME6= <>
##$TPNAME7= <>
##$TPOAL= (0..7)
0.5 0.5 0.5 0.5 0.5 0.5 0.5 0.5
##$TPOFFS= (0..7)
0 0 0 0 0 0 0 0
##$TUNHIN= 0
##$TUNHOUT= 0
##$TUNXOUT= 0
##$USERA1= <user>
##$USERA2= <user>
##$USERA3= <user>
##$USERA4= <user>
##$USERA5= <user>
##$V9= 5
##$VALIST= <valist>
##$VCLIST= <CCCCCCCCCCCCCCC>
##$VD= 0
##$VDLIST= <DDDDDDDDDDDDDDD>
##$VPLIST= <PPPPPPPPPPPPPPP>
##$VTLIST= <TTTTTTTTTTTTTTT>
##$WBST= 2048
##$WBSW= 25
##$XGAIN= (0..3)
0 0 0 0
##$XL= 0
##$YL= 0
##$YMAX_a= 620033
##$YMIN_a= -519250
##$ZGOPTNS= <>
##$ZL1= 120
##$ZL2= 120
##$ZL3= 120
##$ZL4= 120
##$ABSF1= 14.98509
##$ABSF2= -5.573092
##$ABSG= 5
##$ABSL= 3
##$ALPHA= 0
##$AQORDER= 0
##$ASSFAC= 0
##$ASSFACI= 0
##$ASSFACX= 0
##$ASSWID= 0
##$AUNMP= <proc_prof1d_extract_pilot.lims>
##$AXLEFT= 0
##$AXNAME= <>
##$AXNUC= <1H>
##$AXRIGHT= 0
##$AXTYPE= 0
##$AXUNIT= <>
##$AZFE= 0.1
##$AZFW= 0.1
##$BCFW= 0
##$BC_mod= 0
##$BYTORDP= 0
##$COROFFS= 0
##$CY= 15
##$DATMOD= 1
##$DC= 0
##$DFILT= <>
##$DTYPP= 0
##$F1P= 0
##$F2P= 0
##$FCOR= 0.5
##$FTSIZE= 32768
##$FT_mod= 6
##$GAMMA= 0
##$GB= 0
##$INTBC= 1
##$INTSCL= 1
##$ISEN= 128
##$LB= 0
##$LEV0= 0
##$LPBIN= 0
##$MAXI= 10000
##$MC2= 0
##$MEAN= 0
##$ME_mod= 0
##$MI= 0
##$NCOEF= 0
##$NC_proc= -8
##$NLEV= 6
##$NOISF1= 0
##$NOISF2= 0
##$NSP= 0
##$NTH_PI= 0
##$NZP= 0
##$OFFSET= 14.98509
##$PC= 1
##$PHC0= 92.16431
##$PHC1= 0
##$PH_mod= 1
##$PKNL= yes
##$PPARMOD= 0
##$PPDIAG= 0
##$PPIPTYP= 0
##$PPMPNUM= 2147483647
##$PPRESOL= 1
##$PSCAL= 4
##$PSIGN= 0
##$PYNMP= <proc.py>
##$REVERSE= no
##$SF= 400.02
##$SI= 32768
##$SIGF1= 0
##$SIGF2= 0
##$SINO= 400
##$SIOLD= 32768
##$SPECTYP= <>
##$SREGLST= <1H.CDCl3>
##$SSB= 0
##$STSI= 32768
##$STSR= 0
##$SW_p= 8223.68421052631
##$SYMM= 0
##$S_DEV= 0
##$TDeff= 65536
##$TDoff= 0
##$TI= <>
##$TILT= no
##$TM1= 0
##$TM2= 0
##$TOPLEV= 0
##$USERP1= <user>
##$USERP2= <user>
##$USERP3= <user>
##$USERP4= <user>
##$USERP5= <user>
##$WDW= 1
##$XDIM= 32768
##$YMAX_p= 443818077
##$YMIN_p= -704333
##$CURPLOT= <Network HP LaserJet P1505>
##$CURPRIN= <$Network HP LaserJet P1505>
##$DFORMAT= <normdp>
##$LAYOUT= <+/1D_H.xwp>
##$LFORMAT= <normlp>
##$PFORMAT= <normpl>
##$SURQMSG= 1
$$ End of Bruker specific parameters
$$ ---------------------------------
##NTUPLES= NMR SPECTRUM
##VAR_NAME=  FREQUENCY,     SPECTRUM/REAL,   SPECTRUM/IMAG
##SYMBOL=    X,             R,               I
##VAR_TYPE=  INDEPENDENT,   DEPENDENT,       DEPENDENT
##VAR_FORM=  AFFN,          ASDF,            ASDF
##VAR_DIM=   32768,         32768,           32768
##UNITS=     HZ,            ARBITRARY UNITS, ARBITRARY UNITS
##FACTOR=    0.250966925370066, 1,           1
##FIRST=     8223.43324360094, 45659,        -16800
##LAST=      0,             -190884,         -90459
##MIN=       0,             -704333,         0
##MAX=       8223.43324360094, 443818077,    0
$$ Real data points
##PAGE= N=1
##DATA TABLE= (X++(R..R)), XYDATA
$$ [...]
23760 165333 -64291 38665 8332 4397 166414 22252 -68320 -67086 -143905 -227696 -157051 -367802
23748 -367802 -13659 361294 97769 -369620 -149203 -169913 83724 -143748 -294969 -228281
23738 -228281 -157582 -10812 -72600 -13786 209987 -181511 111645 -48479 269679 61519 -69244
23726 39883 1266 -209628 -115320 428099 19651 71693 -96168 -213507 -62952 212163 -9398
23714 35389 -164482 146697 -168522 -86978 335916 161853 -167524 -203793 178507 108988
23704 108988 283588 116104 -76038 75038 86189 40392 -7065 -155900 182997 -260956 -295024
23693 -295024 270483 -68133 40874 217264 304568 6749 44370 71763 69673 196006 -4496
23681 -61880 256553 85505 79069 -117284 244481 -230941 -89299 -240314 -353423 -383775 -23394
23669 -74519 31763 -75381 273169 82748 179006 -52611 -56715 127888 227310 -175459 116718
23657 28585 -16955 102944 119900 140040 172548 116331 684 139680 146343 10816 38579 -101410
23644 347782 -28952 -275083 102476 -105818 19085 -50003 45705 -165898 -259908 -152896
23634 -152896 -30865 -59288 811 -198839 212590 -23003 95987 25421 -188451 -46966 -173527
23623 -173527 -155433 117821 -175708 -118997 -144313 -308921 63443 -295648 -296241 -125380 -55873
23611 -84335 115939 -45447 -150200 -56071 -136015 25647 -34199 -17832 -255834 -61994 182513
23599 314845 -382170 228238 107185 -245632 139101 284341 78025 -137174 143653 131588
23589 131588 -5181 222571 194656 13881 253313 358914 101394 29437 393465 81824 -10554
23577 366039 3476 -179407 -175681 -134460 -40134 -75266 32247 242060 64466 -305257 -141371
23565 -32919 -159700 -163958 -379691 -18984 -114036 344022 -148639 132203 -194491 -134845 -53898
23553 -109747 -210420 -169741 -24437 -136776 -5252 -139745 -544616 18578 380515 123613
23542 158518 -136897 -143111 -9063 401219 153586 -134564 -57430 -143631 173921 -251122 145571
23530 161512 -109070 65218 -74001 -123901 -121743 -154975 183819 22807 102508 -305620 175620
23518 67634 -207718 -108033 -35462 -283663 43514 -102765 136662 -182098 219989 -2619 143796
23506 -44835 -77929 202689 -135182 -218414 -83680 -31977 -147536 -109884 -30071 236340 -424879
23494 -165278 -399466 52862 -320419 -9390 -50777 -171674 153752 18011 -9864 163775 -1681
23482 186749 -25170 -196441 -177001 -305639 -18275 -411224 -92110 61627 -114104 -244618
23472 -244618 6191 27220 68290 28520 201913 79090 89523 298332 -133389 95906 87984
23461 87984 -26668 -97025 145787 24442 105680 -16831 64100 72099 -180649 -34943 -303799
23450 -303799 -100738 61792 -18638 -61066 292239 -107465 54643 -170143 -218666 37718 -297104
23438 227372 43319 -179976 -249288 -123665 -198812 215669 -186760 31685 -48378 264689
23427 -302393 -294172 -252712 -364672 -90573 64289 255901 -73957 -106409 58965 -155114 98988
23415 81632 163412 76677 -62197 52571 -68484 -81930 136099 59978 -8630 -171189 132461
23403 -234885 41918 226646 -178714 -180721 71206 -234212 -107359 12465 319039 147804
23392 -140267 -151013 -100506 225458 128479 -21820 -105221 193512 -149162 250211 -115236
23381 3877 -119962 222635 -107433 -149303 -78203 11887 308924 93498 -199520 -278129 155612
23369 -249151 223991 -90873 -88732 -23946 -331065 -160970 -90737 -75366 75802 -143455 -255945
23358 -255945 93398 -130955 -101317 -60802 -131630 -45476 -195106 -30266 39159 -285676 422152
23346 76834 -207174 49025 98265 2068 30126 -359075 -16874 -222913 225791 -135361 -38071
23334 -289176 -48863 -50319 -263278 215343 -318063 151197 -112456 -89581 -283827 -67610
23323 17289 -91863 187461 -199478 -2039 33943 53234 -165279 29826 61038 -67318 126863
23311 269503 71831 301650 79195 109114 -6322 153006 -88147 144723 162340 -11489 -79380
23300 -79380 17931 36772 267584 -90425 -282203 -5791 -76535 -87372 -107403 -57170 55761
23288 -220710 -166419 267133 -279905 -234299 -244855 32524 -98329 108048 -191270 214892
23277 -307294 -379798 205470 56753 -467643 -119384 114274 -205318 -54099 12274 76042
23267 76042 26192 162083 175725 -460747 -343687 -3446 -281578 -47119 130314 -39173 97440
23255 118982 52017 -66667 12274 -204599 -252351 -153082 -51827 191779 -227900 -269738 -272892
23244 -272892 92461 36653 -74647 -81660 -252196 -192911 -33281 -269581 -98010 -307684 -1468
23232 150949 -62094 -56697 -47016 73436 -155309 -275 -145940 69886 95579 -113022 354673
23220 113467 -255971 -132663 -165508 -134789 95674 -179366 -78003 -83365 -55901 -260274 -228056
23209 -228056 -71692 212507 -70954 -171777 -337686 -186824 -59283 299438 209057 -146076
23198 10342 -118205 236315 -227917 -23343 328194 85336 -177498 199169 196481 67573 -86568
23186 -215145 -339879 -117074 -227172 55399 104347 -157854 215306 -298889 477370 30869
23175 -64710 68829 -295481 356169 110823 16952 -185350 252415 -254719 124317 -73250
23164 -45182 -42916 129761 -247006 160388 -319378 32590 -181349 215895 196164 83490 -42689
23152 -398326 -46828 -1081 365373 33295 28786 32533 -102629 30681 -171466 -38059 142926
23140 128745 -235818 -75370 -34289 -50924 -62831 -121382 -140795 35385 -221416 -211115 29799
23128 -98854 -132263 279219 -91964 509636 -60924 147164 -101849 27116 146712 196823 313710
23117 313710 -78437 -7447 -61422 -339083 234298 -67998 178994 -19308 345144 -68915 -214594
23106 -214594 1828 -214528 -774 166251 59257 86764 55946 97260 -128840 88801 171956
23095 171956 46581 -70243 -202585 -58808 -226311 -152537 307252 10298 223990 -1119 49337
23083 232427 -199866 -309601 -175881 242481 -132360 189270 214252 260649 62552 -142952
23072 -23788 -27438 37508 -228339 -300647 -121115 -220841 147893 331329 -134653 37112 -103090
23060 -233142 327428 -5213 -44657 104966 -30634 73702 -7495 45719 -51294 80647 -34191
23048 -11953 -123682 -170227 -256889 277143 -366478 71139 110828 -212164 56878 -106533 234589
23036 -224006 -57484 -96121 -156863 181592 -2604 -404918 -122861 89960 -120476 215234 260399
23025 260399 55765 192973 234335 152299 -111436 -78016 -66857 268944 -137915 172734
23014 218745 -150601 -15691 45335 290852 377653 -111743 -220729 103820 -80077 -113224
23004 -113224 -251329 -147943 -28797 180654 -139824 8315 -250796 -330565 101976 -139403
22993 175250 94010 118296 -213287 -263071 188087 -249004 -5921 237615 -82260 -234020 -87097
22981 102088 87136 35740 -33497 -24537 218056 118938 102531 277597 -354287 340196 93320
22969 88441 109595 -125107 -127835 -300478 -69441 -95493 -70448 73455 -28217 -81007 538765
22957 47808 -131093 79404 -127243 -238243 -107302 -335004 -397255 107515 -91968 -152713
22947 -152713 -290431 187323 -50037 -84459 -21973 -108389 -93644 132120 114789 81153 -140827
22935 -434893 172339 -61959 -329508 40003 86861 -315669 -89443 -256560 -293028 -6074 -67790
22924 -67790 434117 -55859 -319084 -130876 36711 100146 -134358 -90302 -25187 50131 -359847
22912 142242 -157974 -20002 -69417 1291 -57254 -195768 -2199 -83786 -98439 -94217 72531 -163868
22899 -57211 3465 122127 51070 -57160 -40394 -162774 221544 -141075 36862 81471 -252999
22887 -107417 68903 -44850 -168503 -134202 148221 -219562 -56180 -74150 -186278 79814 171645
22876 171645 13629 -236819 -174727 41900 450704 -312676 67729 -189331 -15357 -503013
22866 -503013 130558 304296 -33516 -277005 -183790 -4721 -106994 -109202 37448 -37406 -185699
22855 -185699 176677 93426 -287438 -242030 -29396 -39948 164822 252835 -199517 -81565 -162890
22844 -162890 -22493 -99392 -321022 196342 -146394 85536 -227550 -78212 12418 30336 -34115
22832 -229421 57684 -362654 -436888 -230533 50565 18766 14783 -118751 321171 -256574 35495
22820 -190245 -328240 -53118 -64232 -345070 -313566 168555 15667 -233404 -99751 169420
22809 125409 111288 -3933 -142317 -158878 -37790 -83136 -153837 320071 127780 -31428 -174726
22798 -174726 226340 -157250 -476453 124290 -48334 68187 -136679 -16856 -14383 -229219
22788 -229219 140469 15238 143970 181266 -56148 -219122 337443 33629 13464 69821 -94356
22776 335788 -179734 -278756 209519 -96237 -20041 38739 -54502 -93141 -275595 -228517 242182
22764 -140610 -14435 -20736 124696 -161395 185194 35797 52042 -80692 -58717 144346 72465
22753 72465 67756 -205590 -232462 -323566 -162087 49460 -73145 184131 -258919 -254904 -297363
22742 -297363 121268 -160957 -225380 278575 -97421 141013 -60484 208584 -198600 6994
22731 -134887 -66151 257967 -18959 -20767 -103211 -146878 -207450 -185203 -210414 101556 -388362
22719 70605 44789 -221608 128291 -328122 -265789 -1622 -145779 136679 -137273 273347
22708 411457 51334 -18698 -184022 9745 7648 111282 -102940 162640 -48864 -28331 -14651
22697 -14651 -30918 120123 6131 156892 -26476 -4422 5795 114272 -31004 271984 136052
22686 136052 -138947 177203 -7936 -191731 -233347 201391 -9074 198496 -243841 150221
22675 -73038 178301 -256461 -164055 -110743 -167256 -119867 -264737 49760 -175774 -126055 130816
22663 186369 -67551 -361256 -14402 -50818 -134455 -82815 152498 -474 53101 -164210 38062
22651 256707 -76835 -233518 -94162 -169460 3005 -394891 -386556 93776 283902 -201697 130239
22639 -1041 -164190 11935 -150233 -160416 -234468 -10972 126584 -64469 346581 -1738 -23632
22628 -23632 70530 197112 -231958 -240328 47085 105196 -99940 393332 -277907 -124517 -13088
22616 175580 -602815 115337 19419 -14604 -219282 -121817 -150675 -301156 -159473 88385
22605 -52337 -23241 -344980 73670 -168913 -465745 -511980 -22238 64790 133520 41433 -296621
22593 -17725 -252208 -152827 -177808 6243 61417 299780 -159533 -148405 -127637 -99581 -127057
22582 -127057 117923 5796 -249747 -188589 -129221 -207398 -478176 -27715 -29169 155294 -105922
22570 130486 97419 303833 -167681 142272 86390 -164858 110256 -128763 88352 -48458
22559 -81285 -156226 -78044 95227 -12491 163046 -338849 -15202 88205 357472 130746 -113073
22547 -51400 -289590 -28493 -394885 27716 -154822 -248940 11757 152606 74650 113865 18232
22535 -4721 -209958 191355 -308758 212033 129587 -127946 128047 -58675 110198 192382
22525 192382 136626 -240202 49832 175453 -78092 159494 -111520 185913 139627 -127173
22514 166444 -298570 -299014 -251430 154228 55567 -49847 138263 123005 12283 105833 45279
22502 152189 252100 -108972 11835 -56865 -68089 104508 117235 36438 -50565 125606 -26051
22490 -161749 41977 -165975 -61394 -219547 -34568 -470556 -697997 -106359 -21619 -22986 -529773
22479 -529773 -177255 -185294 -28559 -157918 -128547 -381031 -20308 48091 -181764 169634 13219
22467 -127492 -131402 175830 -20402 199275 -22682 -157603 146486 -158844 125018 29351
22456 -44326 125847 -522122 -184588 43972 164730 -162829 -38427 49452 23417 100073 -297857
22444 -115050 10410 -46146 -511229 -1975 -44671 114546 -8266 36776 -247343 235126 82470
22432 77893 -326419 163131 -273925 -169948 -64363 16351 -31079 -59575 -487353 364655
22421 110234 6172 -59290 -73955 -50064 21986 -68911 36923 -94543 43102 -116670 256960
22409 -28806 40273 -160051 178720 -389570 -581016 131510 -86383 11099 -16524 -270735
22399 -270735 -83361 -23756 43278 -115649 -167043 -137849 360658 -85206 14778 -69790 -291847
22388 -291847 -115359 27563 105514 -56637 -26700 -45006 126909 -146280 -276754 -246314 -107710
22376 197804 -99103 78432 -309024 243268 -79303 -31450 -7883 114404 -77582 67725 163216
22365 163216 -134730 231829 61219 58732 16427 5193 167364 -191 -31161 -33555 -127000 -123860
22353 -123860 -214679 -27336 268300 -90769 -170148 -85959 -218596 -234786 -79734 108869 123498
22342 123498 -70630 -330538 103586 -184725 207025 -168453 -16874 79248 129781 -102207
22331 113575 -133846 5362 257260 -171293 -214091 93705 45014 -47620 -242039 48530 137688
22320 137688 -62499 149937 22822 -34770 27749 28034 -212124 -139974 -9067 217584 -98678
22308 -155083 8140 -15944 -159410 -122263 -146343 -133122 47166 28500 84054 -82552 32354
22296 -117679 16587 135365 -138131 357871 35476 396567 -321253 -292372 80714 -126555
22285 60279 -6856 -379841 88490 -178803 249446 236332 -185176 139 -365126 -222949 3131
22273 134678 -121624 -113001 172686 -54036 180103 29494 -354983 -123485 -67466 197409
22262 47465 -114309 -51140 15411 50494 -319684 855 -138547 54709 212193 -104351 80687
22250 -258515 -98111 277190 159285 -411519 -338520 53805 -333897 -186138 144753 24329
22239 40639 101183 311619 -97358 -244795 -247094 -29035 -179593 96565 113195 -237606 77133
22227 160901 -132069 122685 -76351 -327653 94485 25504 -6111 -10142 -296228 -111324 -83770
22216 -83770 -23864 -176357 -308815 -91866 157919 -158183 14863 -166523 141422 318504
22206 318504 -211246 -259402 -1648 254724 -44843 144763 236129 -35725 -196847 16724 -195010
22194 41405 -59256 -338338 -115718 -90567 -115464 -21484 60229 -231613 105406 -3796 -249907
22183 -249907 -158048 -143989 -202814 152279 -162128 -30030 25255 56358 22040 10969 161378
22172 161378 27856 -74326 -185447 145241 -45237 -58078 393379 -73403 -226819 73644 54395
22161 54395 -137538 29168 -409081 36357 -147666 -257552 -14739 30193 53343 1350 -32823
22149 -46199 -122239 -163108 -162323 186803 85046 -9511 -120882 131939 214827 -87474 -344202
22138 -344202 -108807 -436399 42473 -152987 -160914 -225313 31737 -49906 229126 -24358 -246274
22127 -246274 66343 154019 -125189 146404 -155572 -97137 -19219 -232052 -370081 55763
22116 109586 41039 -48391 4841 -274775 -48232 -186323 78530 -73122 -213358 -396718 147730
22104 50820 42454 -165428 -232335 -4436 -215878 -312494 65923 -25449 70822 -155770 194055
22092 -89321 -137971 -170120 -278269 28372 -201101 23392 -148126 -279938 -138461 7673 32365
22081 32365 -147968 4596 5618 102811 -1305 233462 -103057 18953 -62172 -212017 -84974
22069 -44937 -24194 165228 -115102 22771 79566 -4309 -4654 -174068 159791 247688 13885
22057 -275522 22675 -126719 -210394 -251786 14594 -108733 -395803 4048 -78351 -205267 279691
22045 93388 259674 33513 -315689 180257 -130850 -11340 40650 -51431 -303494 -65913 316129
22033 -14711 -163109 -48336 -211756 248204 -437679 -186177 -132381 -168040 -29867 63023 110438
22022 110438 24991 -21596 -310843 24206 80642 -49959 170164 -99827 -42502 7507 -194777
22010 65727 -36105 10152 42701 -195417 -201305 -94345 -131608 -52366 -242058 -294221 183351
21998 -18838 -131224 194274 -4590 -73627 -73176 -73383 369684 -109457 -93318 -276842 236263
21986 109868 -96890 -15179 -43867 -58815 -164759 -328094 -125774 63440 -209958 -76448 -5120
21974 -137364 -45647 137865 -113764 -55295 -15212 -280819 -64093 -8912 -203095 112321 37985
21962 -34566 -5079 -179780 -28004 -75540 -30606 -220695 -50424 354308 -141038 -279482 -92579
21950 96625 -106935 -15867 25563 -197342 -245703 -267389 -21927 -57563 -187823 -103093 103537
21938 51971 66872 -45304 -35359 -197069 16648 251854 153390 -105838 135799 -35863 -162250
21927 -162250 44545 263003 -428040 34989 -283335 120686 43036 84734 -180341 28259
21916 94404 -86247 -197379 -259164 -24257 -129122 19330 -52996 -76141 -109487 78215 -86571
21904 -136630 -73435 -212644 28702 159785 -550971 -114458 -38899 108033 -93855 -109137
21894 -109137 20059 -224139 -200822 -202209 -384316 -77840 -126055 59174 70767 -25271 187298
21882 -187192 107110 58295 298146 -212378 6794 -42831 -88607 208273 -155167 320664
21871 -199784 -45207 198522 308556 -180789 -74586 -209687 -70323 144118 122287 235106
21861 235106 59068 -217814 119576 341735 -3693 -48540 -110619 15184 -68742 -170571 -229202
21850 -229202 95177 -244880 -8124 155702 61531 147342 43427 80412 197493 -186979 -63467
21838 -48152 20065 271459 -218215 204936 -283886 21186 -2347 -22798 -134814 326762 -58146
21826 -43733 74142 -124562 -121070 87720 -161888 -56026 -233880 -144744 -184341 -40738 -47973
21815 -47973 123615 -525540 -138681 98998 -149466 158023 -79021 -74293 -232034 -20874 -140718
21804 -140718 -239012 -53324 -258709 93507 -325248 -15625 305077 -128101 -108393 -115772 -186409
21793 -186409 246428 146810 -52385 19067 -127155 -230913 13468 139373 -199194 145457
21782 -192438 -219221 -217254 -106351 64643 127234 554538 69578 216456 -95007 -404253 -329227
21771 -329227 -12601 156193 169382 -457141 -90332 -113979 -90028 -116830 257158 -147759 -81308
21760 -81308 137239 -15524 -34317 72894 -76000 -101261 264321 456744 135129 -139241 -313135
21749 -313135 -9930 -65324 -34916 -127017 -62438 -114062 101420 -337204 -238561 -9051 -29510
21738 -29510 -264356 -5268 -51063 47287 183702 448939 -102613 -234093 -67225 -8992 -57086
21727 -57086 -96479 -4017 -238768 -131415 45888 124846 11599 -357687 -166516 131204 278955
21716 278955 -59256 271130 171594 59884 -15735 171 -58586 -31368 263576 -88825 -271708
21705 -271708 -12596 -484505 41083 96641 28074 49889 93046 -194502 -156274 -144584 314910
21693 -111343 37185 -154310 224152 -152260 -139091 45752 -68884 21419 -265963 114718
21682 -263245 -153583 -203902 -308614 -278895 -135797 37959 -61220 34600 -224322 114248
21671 -125124 124002 -37113 21639 -261384 271475 -68721 66141 145906 133201 -40909 522
21659 128019 -298483 -330864 -36375 8618 -126169 -68871 -302063 -17982 -22621 -249048 -113132
21647 -122524 -188541 -142540 20362 -185666 141410 389081 -97263 -61795 -332159 -374194 -235701
21636 -235701 -35405 -208912 -181506 -262688 -408948 -65307 -80648 -208112 -46303 -234781 44464
21624 44808 -152770 152190 126047 166099 -61417 -14443 -176972 -196148 50197 -11063 174982
21612 88237 -234306 245079 -8191 -23407 91593 -262856 -83541 -67106 -139591 -182910 -377574
21601 -377574 197558 -165455 -112414 -52752 43931 -382525 -172872 84698 -20065 -101278 -278061
21590 -278061 24068 154955 -241767 11618 5650 -198986 -520562 -29061 144011 55820 -181105
21578 -239744 173059 57004 -24916 -89694 215040 -140805 199515 143786 100989 -90195 126098
21566 32541 159097 30116 79862 -225521 -281650 -367440 2868 -120939 -130812 231140 -388157
21554 -256236 -43347 52810 118 -38059 -237761 -123535 -123590 124423 -148033 36968 140851
21543 140851 -18891 38895 -213210 82016 -271389 -114618 133776 28971 83713 -77020 -17852
21531 -110766 37686 27234 19868 -361634 -209177 95511 -201852 129363 -34645 -16272 -343364
21520 -343364 -142290 203435 195742 56406 62619 -15976 184129 -112052 -65651 249648 -26279
21508 -112683 105815 -16846 189689 -104388 228789 289382 90329 3839 -187227 139955
21497 -164052 -113727 -132587 -177002 -208231 106457 114051 -31776 -66297 -213917 -74706 -22366
21485 -262806 42682 152527 183328 -224107 -214475 -290750 -157157 -90789 -411788 -32120 -331361
21474 -331361 -269861 -449758 -196626 -12509 -229300 -18595 -170795 -12359 -142893 -71715
21464 -71715 208564 75687 -30124 65974 -113538 71575 72283 -101358 -244578 -335723 -239247
21453 -239247 -309416 -268113 -342074 106631 32580 -189909 -40880 225847 -299916 144524
21442 -8208 -162288 -44822 205570 475911 459598 302110 92479 558875 269789 37650 -16710
21430 -34179 -52856 -6181 282461 101047 66663 -73893 165164 -71787 -71179 -207543 -162097
21419 -162097 8674 196169 -130548 -191206 -71107 -150084 92834 -32947 -113960 -25104 -120386
21408 -120386 -93467 -19798 -57580 45066 -205341 -8041 -146919 -72695 -1451 -39014 216449
21396 -209815 -142264 -285889 -254674 323486 -156177 -134773 -60465 -181273 112688 -273161
21385 218972 247855 62000 -190100 74411 -95769 141428 11465 -75388 -398331 -99626 -52562
21374 -52562 -171034 20438 44442 -379285 17768 -52015 212408 304355 -179827 -52783 -36534
21363 -36534 -131110 -220030 -71317 95642 -5335 -209354 -225472 80890 116109 -98563 -202397
21352 -202397 -19015 -258501 86056 -74321 -9498 43408 -252651 -204231 -58065 57495 -117202
21340 175815 143503 16812 -165924 -343842 52868 -92947 -336893 -219789 -316565 -257162 267208
21328 -213934 -374773 -155172 -178655 -70833 -106502 -129349 275213 -95853 -187035 -143190 -257105
21317 -257105 163553 181194 -190421 184914 -11626 -426486 76007 -155858 -335205 -214124
21307 -214124 -64382 64030 322785 -283363 -455278 9233 -48582 285449 -14199 -241159 -99741
21295 220031 -289280 -68598 -182860 61900 -75512 -13048 -4885 -152062 97229 128665 -152973
21283 -106936 -44867 -59342 -76663 -218485 32660 -397958 -276543 -320288 -126800 -29683 -236214
21272 -236214 -283803 285184 -125588 19881 -184555 48711 61417 -71557 -53566 -308456 -9165
21260 24015 -65199 -36948 -282286 -197237 -389496 -293210 -170277 -213794 -393126 61525 -142178
21248 -235560 -217595 -341687 -174872 154913 -212177 -52950 4351 -121402 -7622 -20592 15273
21236 -294187 -220447 122231 111039 137300 -195719 304477 17799 166821 -73329 208080
21225 84035 -6116 352096 -37231 -30848 -241076 13798 -25182 -174501 -62253 -122995 21432
21213 -66776 -127758 27433 -204050 -248476 162330 -47095 -164114 8847 -240219 55409 122057
21202 122057 261107 -142704 -18527 -201793 -28583 -266101 430314 -59547 -118551 -387531
21192 -387531 -145709 422247 -78828 207482 -81552 -78833 31900 23255 -279171 -39770 -151329
21181 -151329 14423 -194796 -195913 51276 -30796 -152583 -87998 -95473 36313 -283646 -144746
21170 -144746 -179662 277413 130893 -184699 -75655 -87594 -158040 20101 16382 -156472 -56647
21158 130513 194513 133361 -58510 132183 107593 92087 96364 203801 -154596 -15204 70923
21146 148545 -179403 -211063 -14767 170475 174547 68896 -273646 -355698 -245689 342760 -161456
21134 -158624 1607 64822 -154928 -97324 75392 128693 -169838 116345 -105197 -186317 -79511
21122 71494 -321961 -51730 -87057 2065 -90974 -10961 178876 -222836 -226704 94007 -21916
21110 -462175 192116 -293812 -197129 -54150 -241158 8906 -173137 120504 46572 -166373
21099 -94919 279772 -470977 -149799 -165432 -221931 30966 -18880 -154065 321498 -95087 -140469
21088 -140469 3808 16183 -106799 24721 79320 110983 245924 147173 142519 -56862 -130059
21077 -130059 -136318 87343 -250646 -35720 -225106 143130 -134731 -74871 317258 253506 -203575
21065 -268141 85903 -448193 1113 -103263 -209992 86721 -176869 223641 -263485 300904
21054 -4442 -96629 -49700 -62964 35454 -77277 -128584 -177247 60901 -102256 -278529 60081
21042 -535388 79647 -281284 116636 274839 108308 -186080 17403 -324365 -198782 236015
21031 216230 152584 -142549 -99103 350248 302259 -329189 59613 -134400 323395 -202222
21020 -191283 28084 -126609 -115068 -292161 4919 -50510 150409 185971 124626 -142714 -220583
21009 -220583 310910 285041 501663 225429 456120 400787 148109 -86324 -161013 16462
20998 -243380 -106919 -29630 -246612 -191283 2360 245865 -18322 -110948 13889 -328719 -81142
20986 261376 -193833 -21825 66001 -43687 239055 -254564 -136889 -221004 -39738 -37642 -187593
20975 -187593 259582 12146 -307527 122491 -83582 -196234 -280391 25270 -242053 139349
20964 -117343 264588 139657 300901 -56757 20093 -345241 209916 -259810 -182018 -357277
20954 -357277 -52398 -236264 -160865 -29004 -9953 186741 -382073 259592 153854 220264 98454
20942 235397 287528 278817 27754 164864 -352407 -103269 42398 182767 -220717 -185783 -7539
20930 146798 -65129 -4674 -134494 -186208 11762 -196693 118090 -61470 117298 -52159 -26216
20919 -26216 -55066 -92888 18726 -66665 186356 71061 -186671 -145967 46390 -98525 -254368
20908 -254368 134327 -173055 -265697 -279457 -85555 -394834 -157642 -355523 -135203 -326829
20898 -326829 -14601 169792 107278 -39664 -245374 -78259 -311876 -99279 -195339 -53079 -271375
20887 -271375 -274090 -106146 27073 202524 -149642 49096 -37861 57345 60993 38931 -200456
20875 -110649 128417 23704 172381 -329008 -12332 448221 -295459 -234612 144574 -278750
20864 395966 -228954 23098 -85187 -88130 46547 14962 -22210 12042 91741 -67153 -17245
20852 -269602 79770 -54955 -190424 -121650 69891 27362 -197336 -93073 -335492 -113263 -53196
20840 -72880 5921 23179 -16261 -244300 65548 17616 -98559 1592 -160306 -256116 1530 -183022
20827 -248417 -274113 -437178 62962 -319578 224308 150020 -332239 -99879 -53949 -116660 -299924
20816 -299924 -6159 -184380 75032 181379 -6529 78924 -48576 103570 91294 -195693 -92478
20804 221610 276831 351173 -202673 41613 -203648 -153870 8609 -334212 -87035 -188390 -72156
20792 146237 -147124 -139323 -86284 -52324 87559 2512 -387532 -54970 -137619 -175896 348119
20780 -60016 -47770 -17644 -249061 134062 -37449 -192583 136754 -166185 -190516 -99255 -166390
20769 -166390 168422 -315509 -11821 -86642 -311921 -145973 -26449 -24908 -161308 -770 -47350
20758 -47350 -133957 -104033 -414693 -145895 91039 -51444 -143687 171524 86574 261371 -144777
20746 -157233 -151989 135455 -262949 48430 -195457 -89787 42791 27839 73784 55881 -41298
20734 -195044 22729 -127364 -249434 -123357 -8718 -54032 8494 -110518 -3668 133600 -351060
20722 203902 -221603 -27799 203648 -59879 -83825 -172065 -79411 348423 -72989 40821 74397
20711 74397 65667 49416 -104880 -443902 -229429 176848 157333 290376 -65089 338378 112319
20699 -253434 211632 85328 -85333 -125742 -470549 -338370 163030 329255 -193253 65176
20688 -98577 5944 -251580 -191340 -26957 -204317 -9070 137285 -115966 55807 -277612 -371733
20677 -371733 -46366 -169767 -205547 280092 -113616 -13695 70494 -131005 -107071 -599219
20667 -599219 162372 292910 32693 193427 -176508 -98257 -246023 -46357 -35492 -119408
20657 -119408 -207246 -393479 -199531 -179251 -114685 -424737 70209 288927 -107960 -88510
20647 -88510 22933 -184109 -158412 -226109 129012 -257871 -269993 311459 132149 -265251
20636 -181596 -123045 -49037 5414 -51248 -239189 -48303 139809 17845 -58648 -119997 -266312
20625 -266312 140453 13356 284330 -72412 -109420 -43001 -181973 -143560 26667 -164875 -288902
20614 -288902 2412 125710 -40929 -153412 -24600 270868 -116323 -109665 69762 -139750 -186520
20603 -186520 125380 -97755 -123186 -156620 -222386 130665 174596 69597 55576 85479 -29515
20591 23437 -48032 -35575 -430422 36506 -28960 334657 45132 6074 -23292 121566 -98017
20579 177847 103358 -123820 208417 -15212 44867 -116650 145465 -237074 -118082 26429
20568 -269407 -38517 47616 41305 -160055 -107206 -37840 -18846 36512 -4411 -216529 -27238
20556 100030 149259 206077 57808 -7521 -106067 286900 -100180 -120386 -31698 -29296 -286793
20545 -286793 -275457 -242865 -263998 -50498 -131808 245940 -324467 -101782 174087 -172054
20534 97431 27791 -20466 -67150 -80859 62791 -161804 252060 75038 58908 -71549 106491
20522 349929 213862 -29020 -65734 -360532 -70803 -112891 127420 -266206 -72465 236685
20511 179033 -212271 75874 -171770 28812 27043 -185497 -8433 101897 5412 -116972 -212841
20500 -212841 -203586 148745 28228 20845 164882 -280535 -141787 -152802 -245732 128135 -323184
20488 -264709 -134405 74151 -216547 -123312 -260028 -52550 43311 -125842 362684 4097 -238688
20476 266553 -244857 -227510 143014 -63609 -61261 -243828 181047 -250341 182951 -237179
20465 76050 -112403 56000 65317 247699 50963 -108011 -205756 13666 58893 326913 -12631
20453 125962 -4353 -95761 -147115 180455 5301 367873 -182176 -112514 -282193 -65101 -172247
20442 -172247 -137515 -149991 78170 -230786 -160063 -8312 -62454 41220 -187946 -149454 161099
20430 58924 77560 69363 25588 -163555 -155882 59322 -7057 -106439 -327113 41556 -42896 -301473
20418 -301473 -406417 87819 125913 49424 -19685 -29867 -315146 -104971 -63669 -94671 -199670
20407 -199670 43976 -91313 33935 -167561 -76560 141491 -160745 -266932 -35341 32874 69305
20396 69305 -224260 -46016 -140389 -48301 -157420 -110825 31797 -138693 23502 -353094 -258351
20385 -258351 199551 141687 -101128 182274 -296754 -26723 138913 -144369 -59545 -343164
20375 -343164 134384 -24856 -164266 -13225 33948 -8169 191423 103695 -258490 -301774 -67514
20363 57568 -396934 -9978 -88022 -64855 -314864 -220757 31327 -82645 -303586 -359372 140291
20351 -48318 -58070 -210042 -200496 -182003 -59284 49642 -22765 -25873 205063 47855 195907 -42501
20338 -174096 -15524 -49543 -74592 23442 331817 -149467 -199597 -231927 -178393 -99626 435889
20326 -129655 4238 -123992 -72372 -176848 94203 -306328 -150957 -323725 -246607 -109131
20315 -30084 13249 260459 -229656 73518 62577 117431 -156971 -149410 -367607 -68109 17996
20303 -141700 -47394 33280 -239657 -86507 -158218 254354 -28313 48012 39674 80590 -56890
20291 281600 180985 56249 -12696 -248811 26596 -88219 -128042 27568 292703 9322 -75910
20279 35831 -361286 -156609 116714 21737 230933 -118032 -54197 -259654 -228176 -128338
20269 -128338 -94785 -181886 170636 -18857 -107462 -285721 62196 -462112 -23804 284630 -278962
20257 10845 -115854 71160 46690 38257 160794 -362817 273683 -277071 164082 -122058
20246 -171857 -28444 -287300 -40617 -81624 -1366 -233057 153880 37190 -66196 -81017 -186824
20235 -186824 -23985 4576 -388902 -34087 -56115 -4030 37781 -281802 29062 -411037 -19505
20223 -310058 -25563 -323724 -42123 27510 -113729 71167 50138 -168693 -53013 -70472 14225
20211 -33550 246669 203134 -106820 629 -140650 -176930 35790 53243 -239350 -30814 177518
20199 -109334 -59358 128787 336311 -42694 -456786 67160 84914 -33009 156929 -171137
20188 -119524 112225 -334180 -84530 -222851 5310 155451 -288376 -62986 92376 102970 -130848
20176 -234932 -5591 3946 -144485 -249464 102158 254757 304684 -172262 120881 26639 186855
20165 186855 -232005 130436 -75833 -29651 -189223 -49626 47386 76721 46866 262275 507
20153 50676 -48717 21503 418563 458688 466259 467324 389071 364368 553430 344160 218788
20142 218788 184096 692597 560587 291810 282191 -3627 12555 -75940 58837 -434489 -94271
20130 247137 -147433 -265369 -167470 -293199 -58132 -382447 21572 -158463 -250006 -109557
20119 -327511 -112118 -141904 -168990 267726 -63335 -117871 55021 6141 194623 107124 -156408
20107 182671 -4110 6504 33960 -81248 -184702 -93606 19582 -52271 -239874 -176916 -270005
20096 -270005 193903 -105971 -130029 240561 89880 -301413 45590 -53665 -278496 -211320
20086 -211320 -119896 -86327 131336 -4082 113701 -30739 -64412 -102137 -287403 -45951 -111023
20075 -111023 -84532 -4382 -144000 -215174 -302809 -24603 -231516 -91585 -370948 144565 -489174
20063 -207641 43016 -368738 -122612 -85452 -110192 -103586 -54257 209263 -39723 -31318 -45761
20052 -45761 -110074 137221 130082 -81024 -341226 129307 -153782 -157598 -262801 -299322 -51747
20040 163219 -52900 -79745 -8829 133739 -151656 101308 239048 168920 403456 -226552
20029 -273671 -146586 169601 -239699 22414 -37999 -248199 -388547 -222869 34044 -416948
20018 91032 49276 264522 -184375 113135 145026 -4405 19254 -156037 -15183 -116161 256940
20006 -142738 213693 -268789 -210695 -50840 32622 17240 162354 14517 510296 292537
19996 292537 355359 69295 51478 209956 -145990 216897 323568 -64497 257433 140641
19986 140641 254610 30464 3963 101897 80985 262973 -43323 -115510 -203277 -210698 -249521
19975 -249521 -181563 65317 -77174 109442 -149869 49831 211778 -129108 -89928 225067
19964 275357 177740 210769 40746 54959 -194698 61318 300606 283900 187512 328098 278557
19953 278557 216033 -96680 -363053 -38868 -208088 46214 -38582 -154267 -294848 -264811 -149484
19942 -149484 -46918 -134504 204150 -595 -218577 25077 -281202 111138 -208120 -109411 -278942
19931 -278942 -106740 -371921 -34588 226544 -219077 -232747 -42314 177371 -381740 -132903
19920 -332971 111922 50387 183126 -172539 -89257 -93659 -51969 -180351 175362 -76252 -63028
19909 -63028 -320218 -580675 -392016 259901 -244336 3981 13267 177976 -41333 -304516 24280
19897 -129470 109745 124250 -60462 -140384 -51683 85354 127666 -221950 -314060 -135914 234757
19885 22228 106583 -53696 31487 -226879 -237552 -103196 -131120 -264774 -33955 -11445 -118696
19874 -118696 -42862 -9507 -170316 182229 67027 15125 -232774 -7750 188417 -31167 -123414
19863 -123414 -48931 -219176 328181 202051 -59837 -6278 -34752 -246076 15194 208122 197731
19852 197731 -172563 -309776 103035 -8336 -112146 -84473 128829 -174409 -64288 -53358
19842 -53358 -128733 123661 173667 204410 -64738 239659 -47850 -226593 150496 348499 -348475
19830 -142833 144094 -183664 34477 116390 -286275 -64618 -51464 277707 -333438 -240755
19820 -240755 -104052 -36747 172475 -7099 -277736 -42516 -15513 -75300 23171 -123385 52590
19808 -10509 231413 -103430 10755 -65871 -8954 -101654 -29463 3332 78425 -264121 68042
19796 -225066 67083 -173233 201760 43080 -169152 -175053 -70051 -8476 -431932 -474289 -178645
19784 198156 162888 -7074 48710 40463 -241986 -126090 1534 -100583 78083 -252669 74496
19772 92565 -161120 -69505 303504 190756 -31800 -158089 205364 239343 -248962 79079
19761 9311 -72349 -107289 -24659 -205664 -110098 -1515 -50816 -169023 -33273 65671 -323606
19749 -339528 -114897 -396966 202682 -25733 -7377 82274 -193742 57319 -37982 37177 -5278
19737 -16688 117300 111906 129206 -94931 18736 302043 732475 427948 752483 -166002 -141448
19726 -141448 -125333 -102301 153338 -47085 -270065 -132502 -72722 -65785 42581 -22108 -198055
19715 -198055 30612 -120680 173980 158705 -34720 -35590 93790 -405730 139224 -68886 -74630
19704 -74630 -254417 148598 340197 70806 500318 491909 509503 199560 -104855 135832
19693 -91384 -305593 331844 -485891 -82315 -79070 -87957 16607 37216 -93215 -94427 1769 92208
19681 92208 -180611 -70198 -282952 -19066 -137214 172552 -138326 -68455 325505 115318
19670 156 -36356 230668 -112104 -100565 -67963 67744 23246 -27351 66790 -304231 -130877
19658 -93918 55498 -85792 49906 -206303 -357878 -72695 -10711 -314349 -96080 -17546 11745
19646 50599 -291262 -133485 -200238 70759 55804 -78298 -36809 280876 -343280 -289060 -115972
19634 -31331 -156110 82978 8500 -131374 -308801 -96964 -561320 21504 -38460 -49334 -88436
19623 -88436 83556 -96299 -79782 -257366 113860 68666 216855 374206 57933 -63757 -308008
19612 -308008 -293820 286710 -361528 -78621 -295646 -65178 31663 -92083 -192986 -36997 -15825
19600 93210 -143105 -84050 -28677 -542467 -207087 -37053 200242 27091 -44047 87225 -2485
19588 -3522 67902 -162561 -194635 149414 -21639 -161601 87714 -156899 -300386 -348241 -200156
19577 -200156 247795 100769 172354 -124067 229782 231818 -209742 -393183 -548369 -258194
19566 -133075 -29006 255800 -149610 -181113 -95584 -59443 -286505 292963 -45620 84184 -5414
19554 99495 -333868 -104933 -90412 -117621 -142871 -72493 12130 -81213 -254744 -272382 -93775
19542 33963 -255357 -46920 -108885 -13080 -92254 -152790 -29432 -149217 -36596 -173827 45085
19530 -178937 -35634 51794 -246584 -47712 284441 -173160 -36932 -439096 -83703 -113132 -333974
19519 -333974 65413 8531 -184202 -112205 -22092 9721 -219734 -67529 348643 -93088 126298
19507 -120892 -200809 -91479 -220773 -136215 -143607 -174084 -158387 27415 -7367 10807 -175264
19495 -65159 171295 -131545 -215651 9551 -229511 -62488 148650 -203003 236013 16086 -102007
19483 96531 5072 64131 -120736 -316136 -353434 152179 -404865 -240551 -332320 -63913 231578
19471 -112384 254558 -146936 59181 -392939 -62093 -24524 148770 138065 -42480 -37292 -381012
19460 -381012 -11810 115947 -90449 -169886 -212842 -99052 179635 24762 -188649 -215406 21937
19448 -6349 152460 54180 -77235 -42030 -126597 -283259 27449 143801 95097 -312869 64667
19436 -219959 -414216 6605 -114377 -362960 -197634 -139354 -67671 -153620 -151669 -185091 -128534
19425 -128534 -209838 -127610 171357 -324697 -118226 41217 -64334 245505 -98383 -24169 197281
19413 -144288 22654 -51435 99705 -253281 -172075 -268506 37370 -428143 157724 -342566 -44894
19401 -6633 -140018 1799 -84070 -398049 -175846 -95147 -209056 -207096 -29086 -1502 6295 162635
19389 162635 -258159 -146634 -16697 131730 76906 -185261 -119650 189587 10851 -32199
19378 277899 -322137 -58514 -235479 -29315 -191335 -76610 -200840 27258 7524 -230746 -179373
19367 -179373 -177803 -94070 -241118 -81510 -272516 34505 -144577 -21675 -274015 -43756 -154015
19356 -154015 -171185 -94382 -48841 -284669 43999 -167925 -188172 -41874 -8023 102019 134033
19345 134033 126429 -67006 91871 -67105 -251137 151060 206859 -103390 261503 -2614 319546
19333 -210528 -333951 -247032 -314076 -81954 -108869 304330 -169671 -47166 39447 83577 -309430
19321 72313 -226877 -218392 -93070 -127410 -25632 97422 -75222 -18980 425936 -35691 -321928
19310 -321928 -111899 52122 95946 -13546 -129394 -308901 -93263 71633 -193362 -69458 119103
19298 -54708 58522 -77321 -251936 -648956 -333164 34338 40005 92003 107529 290325 -264450
19286 -446017 -240046 30850 -136 -207979 -115337 -183002 -43057 -45978 -19290 -76270 -34489 208154
19273 145411 230955 -104673 -366251 -137690 22659 -118691 37081 -116488 9485 -3184 -133027
19262 -133027 97229 -78167 -21073 -237968 -225892 57464 144174 -343374 -375939 -49045 -88568
19251 -88568 -298042 103093 119576 39929 74806 -152122 162846 -134133 26120 -459243
19240 -391252 26390 228534 -460872 142094 -322393 360293 -249532 148773 76810 -312680
19229 -202368 -15400 -302292 -139031 62862 -267009 -136730 -68837 -177053 -17948 -150131
19219 -150131 -37473 -287971 120110 -151573 -134494 -241307 -387182 39188 45592 113256 -56271
19207 -242038 -90512 11377 138929 183136 102861 -79157 -76233 36743 -95135 149809 -20817
19195 22188 -92596 -158395 -236469 -305296 -181525 239457 121645 -67476 -27725 -198955 18017
19183 -156165 184262 179320 -177269 46748 27377 14034 -144700 -215695 -18660 -270141 356317
19171 -134075 -103821 -86060 -61673 -218268 -92764 23494 160749 -191315 -133595 77883 63023
19160 63023 -250811 127887 -479216 -57951 45046 -168357 -111952 -152288 -208967 26821 3671
19148 -261918 -210549 -265409 154180 28248 -117368 -47059 41470 -9374 13483 -24739 -418533
19137 -418533 8997 175768 109784 118516 -89758 -5922 -116849 53959 61809 -37711 243100 -191910
19124 -59399 -88193 -47274 88684 169540 -95956 -32960 -166089 100821 235000 -480314 -510289
19113 -510289 87518 41187 -335887 -27910 25558 -304597 -77354 -176641 -411201 -187841 -8126
19101 -151859 31840 107023 -206985 -543057 84207 -82957 186567 -112406 230703 -175422
19090 -38917 -361240 99251 -90945 15086 -132096 55539 -329788 -319060 -263048 -162849 124755
19078 -14014 5901 -81301 -258151 -196230 -90980 -183034 -278642 225082 8489 81911 235930
19067 235930 -97563 5233 96753 262803 17578 58407 -23378 -118786 108889 -168978 33722
19055 79639 -60600 182986 31127 -52956 41971 -37868 -96566 5202 -197778 -114694 -43033
19043 -202476 -63109 -128386 177510 -334300 67601 153209 -215422 -299956 -222021 -394805 -102479
19031 -107797 -104622 -87502 -328430 -103442 346684 161067 277558 52676 -28998 -198860
19021 -198860 -11354 217882 15064 54624 100987 -74446 -257292 163634 -127451 154638
19010 55797 -21101 -25033 80419 -396613 53594 -65336 -183289 -149723 -408122 -50137 32044
18998 -66357 -20962 -81384 252652 -171748 197751 12253 -292868 -174785 -180301 -75960 151038
18986 -193885 -56289 8892 45851 -221802 -45728 -39013 28612 -225417 -11906 49873 202168
18975 202168 -26071 86290 273955 419098 330047 124360 216476 -131345 39616 -338366
18964 -342804 68483 -227426 34117 -92354 78732 -1070 -301017 -31787 -326771 51130 341382
18953 341382 -150738 -175049 85300 -36422 -113104 -127586 -446500 57879 -361115 81137 109180
18942 109180 125989 112011 56111 377773 -66253 88476 -50761 -121094 95941 265813 -39453
18930 34089 -77148 -404789 -181962 124535 -64376 143748 -288700 6099 -194176 97488 165195
18919 165195 -275121 129275 -363704 -177051 33108 -163453 136734 76684 -18743 116226
18908 799098 383776 233278 131403 262366 162092 -364928 57328 -98019 -143258 53308
18897 147878 245298 -60107 -141445 32693 -61729 -38182 -88476 -32561 -296047 -115994 -39863
18885 36109 48374 -223599 86549 -87147 -288477 23014 -344321 -170983 -290195 23976 12511
18874 12511 41195 59769 -227973 -240906 97236 -127191 157219 -32138 175637 -49847 -207419
18863 -207419 51820 47695 27700 -179018 205837 -68001 57934 -209186 -127395 214242 -228319
18851 -17142 6639 -103229 -15442 100238 67871 -313426 -40577 -101932 869 -123524 244167
18839 -94034 38604 -54637 5226 -66690 -115839 -258465 -252979 -141105 115337 -93629 97566
18827 112203 -256996 -103906 -365221 -248774 -114587 37942 -10779 -158307 113115 201730
18817 201730 4498 41622 170997 142533 333673 -170485 -45377 -46664 205101 109306 281494
18806 281494 390707 307944 271639 30262 34692 -276699 -256082 -4782 -223842 -396792 -257868
18795 -257868 -53137 -63563 23733 -102229 483003 155961 -324370 -215711 -10464 6737 -157894
18783 -30886 84370 -289132 -192513 -81073 105227 -126631 155508 -278741 422706 -9424 4948
18771 -360087 -70595 -226184 -99997 -2225 -189752 -106647 445567 -84073 153143 -39449 128393
18759 -170862 -119596 -283941 64635 -259702 81779 -65574 -141166 -151535 1090 186538 274697
18748 274697 88161 -231879 74066 99316 196682 17212 208884 -1976 152868 59397 248391
18737 248391 183564 109821 33035 17063 7906 -142637 101365 -120751 -102590 -86954 -7154
18725 -114737 -39432 -188563 -156231 -99705 -280433 48223 55592 -242169 265649 141957 -3816
18713 -183282 -297018 -123324 341665 -139980 -6980 179213 -88016 -182810 -212328 -54216 -80334
18702 -80334 -35439 -25189 -163575 -45716 -223436 80883 77794 -83647 -210340 16364 204336
18691 204336 -173730 1979 244908 -76144 -625425 38108 -44566 24165 -41166 115725 278599
18680 278599 -275000 -104086 -66144 47166 32565 162893 43120 20978 -76807 -127820 -102075
18669 -102075 541329 -242192 -115674 70120 -60721 104512 78121 161587 5799 -76590 117497
18657 245840 52670 96686 196560 42411 -528730 -314187 -109614 -129080 -362655 -184890
18647 -184890 -107591 -30519 -88325 -274476 206653 -232026 37568 -83063 -259660 34592 4089
18635 -82687 13927 -454565 -166440 106264 -7382 -162765 -43879 134565 -291689 145471
18624 13841 10980 -215418 -24207 -145269 -30969 -105963 -331997 -19609 -413446 -20987 214620
18612 -195949 -160629 37973 41228 -154922 93752 76757 -297477 -90292 -165072 -159829 -157764 -54722
18599 -159227 -144466 -9200 -90816 -116385 -33623 53882 -343137 11880 216889 -265643 52207
18587 132841 119455 -138904 81073 -35133 -116564 -222903 -411935 -166378 -157078 102301 85197
18576 85197 -11498 174571 -69673 -110176 -152634 -260106 1988 -85052 212446 135756 201477
18565 201477 382632 72926 232308 40764 -66064 -18001 295651 -90549 -2454 391278 -26854
18553 -201974 -178908 81508 -46247 -162531 81301 -70291 -244220 530 252557 -70597 -137179
18542 -137179 -266966 -213023 85044 -21354 -199551 78630 -516474 32525 -172626 119830
18531 29780 -261159 -80954 -30003 59647 34380 -23633 -34428 121358 -605641 -300698 -257860
18520 -257860 -22424 -202474 16112 -305939 49966 -26764 -10291 113402 -43723 -321172 72812
18508 304788 298633 61861 -105144 70622 73460 -23738 -12006 86616 208530 1802 -170359
18496 -65119 -169841 -276072 87514 71316 23385 190322 -68731 236867 -279511 -413407
18486 -413407 -238357 350708 -87681 -283424 -339158 283672 -355162 -172151 -129487 -255157
18476 -255157 9320 -123870 -511538 -125074 -170799 224187 -148992 6744 -294099 -67811 169351
18464 -122721 19416 -20215 28087 -203608 118119 43521 190333 27671 122099 -6075 -179042
18453 -179042 256840 -177801 -245264 -190099 -89831 -125434 -307134 -83693 -162162 151017 -353314
18441 6574 -45739 -23374 -148351 -248965 -342667 14968 -177465 -212001 39400 -179848 -116819
18430 -116819 237306 -59903 -422695 -265676 -216440 69964 -81936 48426 152574 121820 -372981
18418 191724 191062 -249483 -168939 -106410 -5963 -15648 256973 141932 -110610 -5964 186282
18406 -86837 -912 -208133 229066 310449 103948 127161 81884 -35976 173651 124139 194505
18395 194505 -55821 -266444 115887 -78667 119880 14983 210558 81244 -168280 102094
18384 -21425 79180 8152 238211 495152 18073 200017 56549 -155631 -156334 -73192 128317
18372 -88481 227509 -46575 234960 107183 63436 -306044 54422 -131393 -61535 -78543 -84263
18361 -84263 60077 -50439 340388 -136328 148163 124103 -108901 -294577 193390 256971
18351 256971 49731 -10905 -64679 -104315 8255 -231088 -64941 -36247 -299257 -38393 -178658
18340 -178658 -330847 -92905 -95514 55900 -193352 -2829 211611 -26342 24817 -196934 -304022
18329 -304022 -60659 -288592 -22173 8925 -67977 250685 -88854 -94600 -11521 193062 -125334
18317 446672 -74369 297511 -74320 -132085 -122440 -4525 167946 111999 -104 99513 -219380 -189246
18305 -189246 -222379 -5059 -218266 -169610 28349 33431 -8814 -327850 40546 -19701 162544
18293 352927 -25149 104548 380816 -25499 -92416 179281 -58732 -52437 -89470 -352195 -139682
18281 -258539 -226769 -140014 85744 325604 21759 -44647 -374556 53544 68288 23597 284156
18270 284156 202668 121067 -157093 -72338 74207 26526 -153826 60574 1573 -6967 -138155
18259 -138155 34753 61294 -260489 -155367 79902 -63882 -72124 -12578 214828 223956 -404394
18247 -137850 45782 -3328 -134133 2779 -216498 -353154 -196528 -93849 22330 89166 -160052
18235 27492 186056 267138 -111228 89837 -58264 -149126 -139922 64294 -291029 -205804 90423
18223 68571 280471 -670924 82273 123187 57662 213654 -250667 -219192 -14842 -35286 -410154
18212 -410154 -108120 122077 -194513 -156907 -144911 174975 -74735 239981 126304 -90233
18201 170534 -77043 -28984 -42820 -53085 157726 -109758 -111574 -189522 -378082 254351 -68120
18189 -499389 -157991 56019 -315256 351256 -33953 -122669 151100 112776 -9376 -140941 -115242
18178 -115242 -13897 101943 -69632 103082 193567 -234523 -37147 -83448 108399 217704
18168 217704 -39338 -109038 292790 -123641 46244 -43345 383376 -119332 187425 -94513
18157 23610 -468448 155987 35041 193187 -225856 55767 29069 -162589 -137751 17108 -34581
18145 181720 -275941 -173658 -9301 74347 -86643 -62662 95124 13159 -44061 33814 -59171
18133 178678 168074 70819 135100 -199699 32325 165197 -277737 148608 -28758 152786
18122 -101882 -13088 172207 -45146 232905 -179739 -161830 120869 53721 -387225 -246639
18112 -246639 -71636 -34694 -48530 180605 185669 -293699 126531 -193691 -328201 98968 140546
18101 140546 -106752 56712 -7395 -136489 184337 -122209 -142048 -62874 165193 181156 148397
18090 148397 24278 -45241 134789 253491 18333 165542 146106 229943 -204724 279843
18079 43449 155853 194340 -204724 -4216 -214585 22108 311914 224201 -95498 131304 -189607
18067 33067 288917 48281 92553 111922 98686 198690 -20897 -63048 135173 -114129 43782
18055 -71358 -27214 91900 5012 108908 46360 63566 -207052 228662 -133066 -30426 -150052
18044 -150052 -102558 72397 -99861 83131 24559 -52155 -119940 -253412 -276540 -37463 -79144
18033 -79144 305139 -4297 -334202 -13535 -247008 -315392 41087 -138581 -18848 -48941 119696
18021 157261 -59101 -63725 9288 270099 -12854 55273 -283699 49924 273716 15867 -183983
18009 -133319 -489831 44872 -204332 271618 -212901 -25739 136238 147035 292493 -39188
17998 -53170 -41824 140698 -326340 -267176 143097 404993 35291 93165 195854 -173642
17987 116333 6756 201765 -61585 107470 312617 93576 300191 47732 44324 268274 -133428
17975 -186212 236543 -15748 245279 -2185 -145706 -115376 -66247 135994 208433 122901 -47065
17963 11717 -95659 -308799 -56957 -323526 147688 62233 -752 -14468 23534 -35340 17928
17951 -98817 -41894 6717 -104171 -79016 -50011 7276 85375 45328 -50339 232462 -148941
17939 98799 153322 154511 212588 144692 -277719 -533093 74369 -222757 210773 -180814 -22704
17927 103602 -80269 70174 251370 -114698 -217362 -71953 39889 68888 109429 -135309 162262
17915 -30708 -87195 99161 -42941 -258888 356696 -103671 225650 173545 -47382 148533 346377
17904 346377 -259899 -113271 -34732 196009 83032 -65390 79371 446420 -43034 124750
17893 54685 -25533 162256 6117 226092 -58520 73494 86512 218444 -185100 126634 257530
17882 257530 220857 -25706 83186 148164 -14635 -86884 -202372 -169251 -69383 -197581 -130520
17871 -130520 -363666 197162 -187576 123190 -63566 -238411 502156 94462 226290 131431
17861 131431 -182402 64391 196303 -129349 -354649 -139033 109967 14044 221077 188058
17851 188058 -4026 79760 -65909 -110609 -18025 28281 75668 -172158 300685 -103824 -222182
17840 -222182 290378 -112955 108549 387594 -93473 23361 277327 157135 214423 299207
17830 299207 16462 -57053 -210661 -5305 1334 8406 -274085 -274730 232516 -15330 27317 64554
17818 64554 -54362 -48876 -72282 -87463 287488 122842 -230410 -199797 323931 201613 -140149
17806 228265 97671 189759 165149 -368076 64788 95381 114102 290084 31671 99599 53039
17795 53039 -232324 137782 187561 49036 243066 236763 -99527 -64380 168284 -70159 94122
17783 -12901 -34186 184641 202713 145062 -33911 -9818 13139 99541 157060 -116505 317664
17771 249821 -374250 -59996 139293 261867 260248 130846 243974 -170630 -64396 190038
17760 21387 31617 200748 66070 42194 -195096 -130114 -147736 -245353 -97212 227131 16992
17748 -114734 143748 16022 562353 194269 220301 25157 77054 157976 2746 -160272 461902
17736 36406 356575 420737 -97973 271244 -155787 -262751 -128221 262705 149137 -67455
17725 8583 -291453 -1608 11501 113867 339031 183439 161048 -781 1617 99533 -30077 141859
17712 9474 130198 930 -15997 -73977 118880 27507 132249 180716 168591 -225707 494115
17700 22676 -39206 10246 160807 114471 195730 72841 58126 197710 -91770 235161 159581
17689 159581 186016 -180643 78421 -80646 134937 -116704 252630 442702 201294 147554
17679 147554 198895 -47702 215604 108872 207560 11466 84411 368950 182268 380981
17669 380981 -24840 -28955 20556 -5377 64229 331211 709 6013 334292 12339 -15938 222844
17656 2823 168841 -38263 96172 -40861 37374 324611 188841 62643 210919 252079 -54024
17644 -147966 178471 216567 -83313 -390805 130246 -14453 31118 -211490 248573 -177870
17633 333876 67288 123655 -4863 113132 100341 77498 120699 204944 190756 -60161 -293473
17622 -293473 19846 78223 220242 69717 234164 155248 382446 73682 80768 248169 108008
17610 -148638 422447 -74755 283792 -39375 178273 46371 205188 396442 245949 215450
17600 215450 168048 277179 315319 327977 109939 317980 289625 166931 173852 75362 48434
17589 48434 314279 -107265 -12745 142847 234362 -75599 -14273 226246 141458 89214 -92586
17577 98835 220031 72112 18240 284962 76262 145447 454174 425061 296315 337248 75141
17565 127814 93193 81982 371278 224542 51622 101177 -100178 98553 181364 203580 252458
17554 252458 458771 191109 206162 -14644 306179 -24820 341733 201256 214949 329699
17544 329699 501189 21438 178530 328418 142590 59433 573292 607194 12031 19487 81451
17533 81451 254502 447007 113225 329301 217436 186622 472797 768712 482955 914190
17523 914190 1134827 918176 761763 508849 434643 151986 503542 440861 481325 412523
17513 412523 349425 392045 738097 703157 1055826 620931 983346 762708 849631 414113
17502 522656 534029 494823 -14155 297785 -172072 425377 354814 395599 -127246 570535
17491 391838 244656 41000 170728 290103 129823 34265 166611 362227 251795 99457
17480 499637 61649 -11247 388768 -59559 35693 126299 249007 35460 263041 176658 154317
17469 154317 250129 71257 172708 258617 414362 24556 203050 286068 314888 119817 203422
17458 203422 224538 102819 339025 275902 472446 44951 181681 221130 389842 267475
17448 267475 587571 195339 446917 291462 457436 386043 202460 355857 666015 536587
17438 536587 460846 428883 458099 396174 424186 323654 376368 553212 40896 500162 362393
17427 362393 284177 425502 248790 501808 463996 235339 430945 160624 528198 97340
17416 373035 46775 105400 285164 370216 322553 477857 142980 127358 342962 -91318 220910
17404 191517 355983 55718 -183455 257241 29379 337692 444765 261258 416278 230120
17394 230120 504589 263707 259797 270383 21306 67004 267516 259699 302521 353246 353081 207027
17382 207027 304240 293381 283155 139556 239853 267989 176925 38812 184548 570841 356299
17371 356299 371788 -34309 250267 323328 325479 -18835 363809 91584 237651 106405 62411
17360 62411 244976 438871 388446 436173 256414 402391 450947 -28914 258641 299079 183321
17349 183321 227412 462642 351704 132680 497331 163011 161261 183967 254785 206253 -265488
17337 192037 228567 406193 341225 473068 42929 470846 575252 291230 239806 240907 395386
17326 395386 98777 380916 871883 438358 188428 8239 269075 206149 346834 279695
17316 279695 515392 385780 130048 256239 356846 310772 409932 199115 200271 417436
17306 417436 186727 251766 443908 319554 283382 307936 149788 390354 530855 343718
17296 343718 349548 528444 536399 107517 375770 351393 430805 311417 437913 361576 100151
17284 456709 331514 336588 382255 110276 257360 135133 414414 127412 128678 219937 5996
17272 137136 502751 9273 583176 418759 60417 207447 348858 430165 73891 211509
17262 211509 391886 175555 385056 398802 48507 238080 50218 368442 302144 345404
17252 345404 225221 442593 351778 303535 576188 444626 194636 161977 299857 681932
17242 681932 447661 262187 686169 368815 541274 213659 448995 -3608 558382 603080
17232 603080 241231 496363 276328 406393 371238 410664 204990 489754 649240 361672
17222 361672 358219 315117 466159 549543 483471 435797 135500 748126 473466 536791 67657
17210 340525 391962 449267 511135 522388 558968 483183 282338 569314 551972 362428 350391
17199 350391 458422 488082 353773 312446 402639 855571 208237 490034 461158 363388
17189 363388 395110 344416 320847 405782 503972 384042 632899 731228 548400 123649 379341
17178 379341 609591 322599 465214 521575 664948 708078 427395 583604 774057 769563
17168 769563 590253 743209 357547 376445 543019 441460 472043 551463 526542 535319 625231
17157 625231 669683 394189 671614 663049 452963 592228 326520 606433 718096 451946
17147 451946 523343 244242 255686 374389 746944 609828 760797 643956 521645 701090
17137 701090 441237 877647 588990 546469 506289 535294 614945 624436 723319 287648 509411
17126 509411 640484 534918 652853 790691 273160 660006 282001 302592 978108 582468
17116 582468 435585 532188 605021 640420 726159 514930 650686 655776 767525 910552 706370
17105 706370 358400 551850 711284 667881 755327 776056 987927 832164 1060177 730468
17095 730468 665923 848028 951862 1081429 837030 843144 713861 477622 723725 452456
17085 452456 989698 450923 1137751 962640 802980 910022 884343 845200 1025475 788969
17075 788969 848044 493324 578147 869763 943630 784220 710260 1079983 764445 805392
17065 805392 1035675 777684 932925 731083 1005273 618308 553939 818389 530145 809957
17055 809957 851554 1089715 1052023 857324 960150 880012 698635 906693 801259 966443
17045 966443 959732 1079170 1130250 1504074 970815 794679 1025916 908157 1215922 1050406
17035 1050406 1239326 1114705 1027277 1239796 1049742 927107 1054156 1296785 1067885 1541418
17025 1541418 979015 1471022 1330333 1365438 1073086 1022194 1015207 1121665 1119789 1338118
17015 1338118 1217134 1306986 1332026 1061224 1325356 1421993 1201193 1351622 1428737 1281701
17005 1281701 1212429 1280462 1419402 1405521 1166565 1501534 1297566 1547921 1577856 1231282
16995 1231282 1499760 1050015 1464050 1484327 1084243 1127129 1565430 1358454 1405323 1419769
16985 1419769 1102985 1333740 1435056 1711588 1387717 1384027 1573192 1265475 1512186 1716640
16975 1716640 1694893 1376051 1500088 1669457 1606074 1802275 1362863 1844045 1527439 2051986
16965 2051986 1752722 1607731 1706930 1669451 1915365 1855749 1981396 1899828 1735088 2196022
16955 2196022 1825778 1979782 1893303 1931150 1870442 1946782 2419296 1837432 2022116 1898675
16945 1898675 1791309 1811482 2114777 2056031 2121447 2132545 1919549 2294836 2363180 2430925
16935 2430925 2231004 2243312 2186002 2591816 2265446 2020577 2135067 2275537 2241516 2441719
16925 2441719 2463111 2572040 2817419 2847229 2517456 2814025 2552410 2590506 2832049 2812130
16915 2812130 2717424 2871903 2885776 2922016 2876530 2719650 2868914 3039294 2748991 2970633
16905 2970633 3049263 3128084 3477800 2812309 3308660 3086783 3191422 3600744 3458449 3442993
16895 3442993 3200128 3475130 3346320 3598249 3560858 3690285 3700537 3715395 3805301 3714123
16885 3714123 4189752 3992608 4263013 4303154 3820987 4189947 4468253 4312640 4366646 4195688
16875 4195688 4432214 4834753 4599090 4877187 4638445 4821401 4520628 4542233 5037400 5053220
16865 5053220 5247775 5386502 5427967 5303569 5343448 5684081 5711193 5680007 5887174 6048898
16855 6048898 5750714 6013371 5930041 6022200 6043936 6093533 6092649 6398259 6785968 6552371 6538973
16844 6538973 7084690 7011143 7369282 7316590 7393820 7203909 7905008 8229660 8127109 8076170
16834 8076170 8484328 8544304 8164963 8930187 8554574 9071453 9259155 9197945 9678220 9643021
16824 9643021 9951763 9942646 10209398 10578834 10849767 10821477 11348559 11436494 11548405 11814566
16814 11814566 12522294 12298360 12917433 12964631 13386283 13579108 13508629 13784327 14390667 14338931
16804 14338931 14787255 15330458 15568842 16123137 16314956 16467406 16983197 17283973 17736943
16795 17736943 18208336 18770690 19114700 19665401 20293945 20773658 21228308 21701410 22682171
16786 22682171 22964216 23677379 24412343 24872537 25727271 26835078 27087678 27798378 28536666
16777 28536666 29524525 30469150 31287487 32047314 33185098 34414127 35422577 36096892 37233598
16768 37233598 38426914 39631498 40631071 42216051 43699574 44942436 46463213 47968072
16760 47968072 49089978 50921543 52210075 54092213 55703070 57861444 59564043 61270124
16752 61270124 63173819 65104338 67493269 69306104 71408090 73611710 75455450 77356110
16744 77356110 79523793 81540499 83752168 85653015 87907193 89644424 91403762 93098536
16736 93098536 94570081 96217673 97475562 98935061 99974385 100893567 101450488 101765615
16728 101765615 102233009 101937086 102117709 101642563 101440736 100454736 100187869 98927509 97584040
16719 97584040 96589440 95244425 93294965 91832913 89917972 87756416 85864634 84220348
16711 84220348 82135395 79814664 77843799 75743992 73538049 71653185 69507176 67718557
16703 67718557 65325879 63953765 61887705 59847764 58054485 56393779 54587400 52931744
16695 52931744 51580049 49467723 48200325 46607127 45183218 43797577 42532785 41234261
16687 41234261 40253772 38709794 37412340 36543557 35152397 34452981 33101461 32351919 31434127
16678 31434127 30679812 29506056 28828312 28163368 27355649 26459490 25613405 25258802 24534812
16669 24534812 23835287 23223272 22465556 22101809 21664732 20723264 20213605 19893066 19341958
16660 19341958 18974138 18127390 18358192 17740754 16960290 16994625 16636575 16228986 15617454
16651 15617454 15146308 15148795 14797651 14330906 14244845 13445273 13511864 13117276 12881902 12831653
16641 12831653 12490857 12281674 11919723 11592906 11186328 11406647 11048505 10433019 10682729
16632 10682729 10229831 10182075 9949104 9877525 9555154 9648704 9080305 8737684 9330554 8744595
16622 8744595 8670045 8297966 8659412 8297606 8262954 8176573 7737976 8032751 7663212 7529410
16612 7529410 7549982 7152261 7356803 6877344 7001173 6882189 6625919 6702549 6389093 6428822
16602 6428822 6358637 6085050 6149277 6016765 5709557 5890519 5432343 5797271 5496197 5549723
16592 5549723 5701251 5513913 5156015 5263005 5086576 4789005 5237833 4891724 4852944 4786401
16582 4786401 4739223 5033897 4947013 4894078 4844349 4291096 4492108 4468768 4237160 4126920
16572 4126920 3890882 3998514 4451304 3932433 4153848 4018137 4159792 3854940 3790576 3955138
16562 3955138 3812557 3763943 3727829 3502444 3326931 3721340 3593242 3618947 3540452 3670996
16552 3670996 3624736 3009648 3286666 3318286 3686779 2912034 3127599 3408494 3001809 2932161
16542 2932161 2758008 3041188 3113087 3263745 3045103 3103165 3150639 2774717 2773848 2710900 2675750
16531 2675750 2750705 2665736 2562407 2852442 2363686 2607764 2756250 2575178 2536198 2179760
16521 2179760 2335657 2525498 2252982 2531125 2292568 2899280 2443586 2463751 1982818 2202437
16511 2202437 2093013 2078523 1986799 2164940 2217736 2108129 2535433 1942601 2090272 2301495
16501 2301495 2123965 1985607 2284932 1833615 2136926 2101492 1974770 1843135 1961510 2139435
16491 2139435 2143933 1621427 1684617 1844173 1612603 1474490 1917449 1526439 1710163 1665626
16481 1665626 1646183 1688692 1696798 1592846 1421960 1631953 1576264 1849708 1307141 1763202
16471 1763202 1704207 1522276 1824939 1763641 1543621 1581670 1505653 1480169 1350260 1359691 1464040
16460 1464040 1606776 1467624 1617385 1398144 1369600 1533581 1415753 1278582 1067900 1639538
16450 1639538 1027639 1495707 1607296 1773829 1221887 1374620 1327161 1413912 1221230 1359334
16440 1359334 1113600 1242523 1667420 1335617 972745 1286969 1328816 1162774 1068400 1524462
16430 1524462 1246400 1111101 1092249 1353112 1205966 977163 1079237 876268 1195169 994606
16420 994606 1135240 1250797 1089161 1080805 1335076 881889 1138351 1190404 1026297 1106899
16410 1106899 1164225 801484 1163859 1080300 687624 1077241 1074187 962252 835056 1075467
16400 1075467 1165900 888762 1297443 1092317 902526 1221349 1322957 825617 846218 878559
16390 878559 1124940 820711 795412 838968 871697 752108 958580 1067473 985440 1274685
16380 1274685 787764 869868 857688 796612 830635 620998 680132 805292 647800 830910
16370 830910 976967 1010644 956618 309844 1153244 600981 1086612 803848 709790 943267
16360 943267 606824 762356 714965 397949 572951 502210 420415 579594 1020682 423503
16349 787717 794397 710286 398543 706247 699044 764998 664882 970283 795926 906159 767616
16338 767616 573561 522707 679015 916782 678050 743104 489925 543474 505903 479369
16328 479369 535984 309282 540180 699317 419782 92574 537995 539037 440904 270445
16318 270445 353949 729966 744206 576415 702078 838952 857962 781138 426723 487717
16308 487717 595405 859478 834523 592739 966684 1128218 447422 721433 580277 667663
16298 667663 484103 538647 399981 141960 849332 566681 627359 403093 710519 559045
16288 559045 359312 542766 524541 929169 696796 382927 393190 713587 468703 319420
16278 319420 549993 735745 240066 560905 723306 161568 664345 361205 318208 604432
16268 604432 780951 350365 338076 490015 543911 714978 276986 467695 393590 480823
16258 480823 139944 531396 554585 467022 628218 562707 405850 283891 519215 635546
16248 635546 305023 429683 654317 -7789 420660 484417 422418 181776 247673 319540 468523
16237 468523 61354 311605 685748 497977 237183 356028 353955 452438 348311 280756
16227 280756 428002 627280 250092 230130 251290 95387 330357 330767 175687 441359 589137
16216 589137 447036 509445 303892 143920 513800 249060 360922 122778 356017 605566
16206 605566 466771 222929 83647 43626 535534 401326 145112 600095 675521 152894
16195 304886 441205 136871 415382 184804 315678 121319 572475 422713 -109151 565317
16184 376399 109466 171756 149678 180329 246746 190262 37438 447880 -89681 419383 371928
16173 371928 185594 43755 237748 236798 418337 314235 634057 -144087 163188 111211
16163 111211 306419 604598 385370 105485 316115 262256 163300 -23820 300564 347522
16153 347522 95049 308178 -89010 149814 215159 434005 179779 442325 308971 36229
16142 148127 305323 389923 272108 303746 188886 70379 -25328 362072 107200 67003
16132 67003 -4341 391879 110005 432062 202717 317539 465890 291712 153058 265842
16122 265842 140687 303814 309805 55940 92868 -6492 -46826 156111 317253 196090 75354
16110 38544 252970 262921 36315 -126830 270846 42863 292200 167823 235176 402739 46731
16098 218098 -82660 583631 138903 58919 349323 -211083 330332 38940 -21018 286209
16087 -51804 82417 -203724 -5242 66177 157448 -16945 -114987 84481 -10206 -238604 -145945
16076 -145945 47023 -174200 98270 362407 65278 139550 108939 -105762 82390 260904 538077
16065 538077 388283 -211768 188862 37264 107202 -6689 97821 74523 221060 182994 167516
16054 167516 300096 -34766 189521 1922 237579 397417 253790 514801 -174578 -1342
16043 -117230 -17126 191740 -81646 236250 101277 161360 180582 313780 458899 434218
16033 434218 98991 17702 1385 -75125 211041 74306 -282793 130151 317331 174497 -87061
16021 150457 99198 9545 140070 75654 -188857 -150441 230150 -167845 76023 160857 315091
16010 315091 79897 97536 -58587 -14124 44981 14602 135960 121844 162601 -302368 -24342
15998 175913 216627 71935 82879 36468 228907 57052 -72106 295087 -77752 287529 384953
15987 384953 486023 827848 1015590 1418569 1025179 435952 101889 305395 298189 91788
15976 281123 221200 383484 -238285 186515 197707 105501 149581 -77914 270544 348638 156416
15964 100441 -46145 -40799 127601 -122433 -70135 72892 224834 -151788 -35778 -229725 65020
15952 152512 172812 -47734 -63928 227137 -155899 122218 -360584 -135146 276473 -193244
15941 419451 53733 936 181845 -222258 -46072 -13987 14403 181299 -175576 -87375 39969
15929 23684 231671 -303587 1060 109 -88075 163591 114494 78483 54148 -266130 174906
15917 -90864 -149991 -295885 -19218 -39774 -71518 73545 39464 -143076 353281 5603 -119855
15905 160693 222474 63954 58325 -8717 207768 88984 85298 -115024 118008 -26061 72359
15893 -15001 520099 -127411 63140 -255950 -58707 76897 85637 27107 40273 -296583 -4711
15881 -35768 106103 -214162 171610 -59891 61566 259068 200406 -24893 254127 -286607
15870 -259330 -26245 -42636 169875 -3647 -125033 -14754 -249200 -3958 -140234 259114 -231928
15858 68225 -104925 -5374 83369 -41168 -32791 -164831 13617 195283 76248 235855 -58787
15846 286063 -137708 -91047 170032 -52518 -85181 -65784 -63161 -53921 -3996 -97324 62583 -111393
15833 -376172 66892 -270079 233055 -258171 297158 39255 -206005 -141289 25320 -88834
15822 45315 -260504 42360 -165380 -61223 -100389 -55074 72498 19879 390904 11239 4965
15810 -262697 64379 -11387 -35812 -199866 44709 23158 -397602 66040 81051 190404 68241
15798 20445 351131 -95433 154007 -50366 132715 -5810 20755 224977 -199551 -78284 -14583
15786 21152 -148167 220068 -147156 -126663 -318140 139898 324082 13328 -52320 -77199
15776 -77199 144994 51314 -285416 -154387 -99001 61816 -1479 159773 323363 -114623 -260480
15765 -260480 -42898 -157713 25437 -35349 -43765 60221 2747 166815 177908 54508 2774 73414
15753 73414 111826 -380080 89777 284999 55519 -52467 65685 327097 -262805 62480 105345
15742 105345 359158 50610 -179538 -26238 34635 -252899 -232209 18433 131071 -537418
15731 -129 -5157 49137 270387 196744 201916 -92225 -8881 -74004 30880 101662 -69765 -150368
15719 -150368 100049 142548 80186 -58938 -137145 -137108 188962 72756 -68142 27666 -230313
15707 132168 -107748 94136 14391 -121646 -262605 8468 95717 -67308 43297 -101542 -131903
15696 -131903 -36977 59317 138389 -120591 73642 329957 302805 -74055 -108075 -106071 171541
15684 -29435 -335015 149346 -179707 -84489 -301128 -79809 236757 -81927 163137 25102
15673 156276 279733 201296 -153457 295571 224876 -169710 316167 270307 126307 95869
15663 95869 2340 -126832 43005 -325595 -271320 -98505 -182293 85564 -55533 115239 -74479
15651 -322105 -228376 118135 -184709 82517 -24225 70145 -346 179870 -11469 -30773 -16980
15640 -16980 -129872 -247561 -88548 -69572 -40420 -414617 -73904 -18889 -91612 227490 -2181
15628 -183592 392996 76631 -23632 116643 -64377 -263552 306846 -165287 196190 -120223
15617 50437 -429620 334906 298000 -234207 330219 -97043 29503 257496 -347541 83833
15606 11073 -9519 51568 -111243 53249 1167 -58504 -143609 -151872 382989 34084 69020 133815
15594 133815 102926 74408 -363789 -195538 263072 8497 129624 -90058 -79801 78219 102894
15583 102894 -184587 178604 -159951 -715 -46356 -506636 242455 172581 -99456 130165 -23976
15571 39669 -379002 -17081 -121465 -70627 79038 -330539 -85362 194258 276484 134026 -9651
15559 382971 164029 26361 -131676 -333658 -33667 -143269 -27558 -87212 -85533 -150508 -11448
15547 -265278 19500 -219818 -245611 -79917 -252 88235 -139501 -1161 132596 299583 9964
15535 133244 93927 -73080 -24423 128000 -266291 -143090 114030 196114 244487 108448
15524 -196079 61809 338364 111335 79558 362229 242258 -248663 240118 -220833 78190
15513 83741 224068 -78517 152982 129261 127474 13156 531970 259562 -25313 186136 212686
15502 212686 335787 240039 414472 135583 126895 273647 -120774 252185 -115432 250094
15491 69468 206616 200006 -30567 281432 -249650 -22847 -217102 235061 126323 -181907
15480 102298 163418 350562 87078 37067 327135 608627 613335 578443 295052 311936 -53865
15468 176818 22105 118403 -40158 -16949 -41108 -172007 -390407 187396 164498 112641 -250743
15456 86577 -133466 221840 -206900 -167180 -108465 70376 -64733 273730 109089 111874 198021
15445 198021 102661 288477 746385 1160631 1504716 897508 532534 290700 307690 241328
15435 241328 -41497 119963 220441 -85285 -93954 -40868 408457 -101757 -7978 123464 122083
15424 122083 -132571 -76592 -14658 -96386 265961 -197979 196373 -52175 -35671 335870
15413 -154180 -55570 -189773 -23806 61959 -273945 -186955 299426 242490 -241911 221743
15402 -85329 -7817 434299 62041 -68686 287335 226645 279638 -175009 -18561 -116508 -282230
15391 -282230 90943 -174423 196371 -281382 316338 -30570 263322 63171 -5015 219963
15380 -102501 182184 -46890 504303 -56448 335570 -98176 383826 -94305 255911 160463
15370 160463 268528 -108388 33145 -202799 131735 138493 173148 122922 150995 146273 -95236
15358 149870 451251 181247 308131 421135 270169 -100380 392102 297193 253280 96366
15347 281183 -302193 99491 315624 181700 414357 512908 325196 416216 405487 100663
15336 -81445 265022 27766 37601 -106495 350182 79874 54032 -157584 161825 320012 138531
15324 -89793 146419 321401 165865 269155 40698 213202 -134980 170347 43360 199148
15314 199148 144480 -129148 53540 72529 402941 10609 400413 279155 230174 220692 34998
15302 -377928 81941 -176889 -44741 -34321 55972 -24233 -24146 245029 191525 -182774 119263
15290 338901 148590 -253760 323518 16178 449 218951 152827 340271 193 29467 43966
15279 43966 20250 -23696 31741 68948 172758 100767 122756 -238823 -204127 -108218 46424
15267 71671 -84351 -271035 40755 224238 322008 -130897 115619 25582 278740 -33861 26208
15255 85621 197918 301343 -185364 41567 -10076 364390 154657 274306 1916 -203879
15244 166175 27123 891543 1646807 1741981 1573174 1929551 909856 318985 124460 222010
15234 222010 275442 279720 -6894 -157838 5261 54764 -82611 -168992 47965 89980 77887 120043
15222 120043 -257470 177374 218331 507536 -149560 -150511 4701 -1404 -214534 131087 -230519
15210 72379 381265 -157648 -300857 100038 -4364 420315 53596 -63293 -161979 48100 125695
15199 125695 -211407 -131539 -21483 338275 200106 272130 137051 203451 -6113 43237 -103821
15187 33627 175561 -44256 25757 84607 -211737 39927 212216 -162235 260266 -196438
15176 237315 157406 180837 213902 51038 277777 189896 -239774 245455 -64781 97237 125056
15165 125056 69613 161854 103593 -13713 129988 311200 -160621 -81754 -117089 167060 40076
15153 76740 130794 460718 59208 13928 -118729 -24748 96645 105093 -25522 403158 523461
15142 523461 18267 126787 53184 37487 -36424 9054 -283813 72200 5172 52114 229943
15131 229943 130097 243576 -324185 -190557 257481 102898 343512 77931 288532 176358
15121 176358 153354 93817 576760 273824 284927 302317 280339 418341 -22973 -9069 298142
15109 67768 367493 90394 -129034 -36134 381550 22322 156104 224929 219278 219744 430282
15098 430282 149737 80205 202219 253339 273386 221553 33225 -122636 -179204 229915 166048
15087 166048 152789 -124805 90689 -50866 -87511 -104424 51573 67457 126746 439145 298988
15076 298988 -304620 -29472 244550 140402 181286 -25332 -127812 81207 164469 -49855 330768
15064 150174 92705 -382578 197904 55833 235860 244343 360334 474837 385026 138775
15053 227611 42973 429161 398342 296961 481692 305414 377788 438236 -92443 221918
15042 81137 389710 340298 415567 -49604 180741 309377 230339 71269 297881 363253 294514
15031 294514 428134 640033 628789 883530 726680 704970 443325 525909 529283 309836
15021 309836 520061 526426 356715 311021 679736 450568 200268 263558 179511 641303
15011 641303 205801 196284 777518 532513 453375 228854 46219 379698 420195 499959 142122
14999 457274 445885 418052 471111 190257 445063 241726 267395 634664 196243 491734
14989 491734 412212 404629 384130 540830 494608 387523 157427 537969 694503 710931 555047
14978 555047 384230 532689 482124 608813 401146 510617 520492 761654 545879 469004
14968 469004 245645 322856 499908 510345 433974 393758 291740 529309 498472 145263
14957 330935 587626 526338 269645 218409 710036 334770 272005 360321 722819 231839
14946 386280 501268 628041 731036 959010 766121 642845 483289 472013 555754 530645
14936 530645 520691 370903 729478 560737 716560 884454 1185482 1433235 1181487 1160621
14926 1160621 1514545 1720257 1226701 1227107 1346158 1077066 1570876 1677278 1780134 2096369
14916 2096369 1583843 1638401 1559003 1041821 957433 904457 791443 603135 453168 398388
14906 398388 144825 307709 82159 117234 218748 339346 -36384 570253 627645 61739
14895 168341 668720 234831 438450 535855 697427 537033 619805 405310 606386 459383
14885 459383 772020 449912 1010764 888837 708413 538131 682778 832929 451509 650940
14875 650940 541953 497717 427012 400981 526904 445622 120090 880011 448362 896295
14865 896295 804690 363440 697574 230740 683387 657397 458140 432052 555700 467081
14855 467081 316098 278037 755105 676046 361577 399919 308865 517343 533153 726553
14845 726553 700578 479265 1244702 1074829 911161 987481 981538 854035 819866 1046137
14835 1046137 882284 571700 592450 823674 711330 759598 392425 598658 569028 404386
14825 404386 571958 484752 691376 671887 865716 611937 508276 609430 810561 687336
14815 687336 511082 492245 265111 594304 890093 885643 711778 614373 852829 823722
14805 823722 990802 1016598 900575 503976 666027 945459 305877 516077 661780 741917
14795 741917 541033 529361 735787 575168 512197 503224 660525 404779 815472 514795
14785 514795 874226 383852 830221 745798 654502 880688 825564 871514 917285 851028 914504
14774 914504 650799 958905 606397 445096 329871 567900 560267 778143 388257 511095
14764 511095 564714 762931 643557 694983 786072 467306 769762 603498 604521 298636
14753 890228 841626 740950 542132 380499 293496 684106 560119 616007 474743 588791
14743 588791 394441 802031 533561 1026422 952146 595026 627190 715544 586795 860364
14733 860364 890824 926806 1027065 971717 1327959 1199243 1467356 2108746 1459886 1229988
14723 1229988 1564130 1192696 774825 891869 857687 1170767 709714 884488 735055 1010669
14713 1010669 1085104 940707 840896 977345 897007 964917 777563 1152742 1002524 1355055
14703 1355055 1178169 1670943 1679762 1644773 1712540 1530287 1237270 879242 851858 923825
14693 923825 856657 819596 576530 587699 893532 527540 1091350 937484 946251 962221 1116334
14682 1116334 829410 830428 1197402 878512 1045296 868549 845578 1161387 1048444 918055
14672 918055 770786 873900 836787 889731 802954 1129504 677307 1143383 1021566 1155520
14662 1155520 938448 597205 1005140 1073415 1283136 1327626 1293010 1134781 855442 941600
14652 941600 1121118 1050049 1250461 1444355 1294185 714656 1106083 1020617 1117369 1259795
14642 1259795 1037908 994370 1123677 1165273 1123753 1096060 959691 1065837 1238582 1406922
14632 1406922 1313201 1398337 1021586 1060384 1419045 1446853 1416492 1306880 1282972 1299616 828173
14621 828173 1653281 1332190 1688830 1672690 1465920 1826991 1521502 1048995 1424494 1561410
14611 1561410 1297177 1550947 1626169 1760048 1599527 1720801 1692743 1194462 1446140 1595627
14601 1595627 1581284 1377168 1438013 1194749 1360058 1761068 1628132 1648294 1522088 1627095
14591 1627095 1645134 1675396 1377182 1558872 1823675 1259894 1692516 1647274 1392788 1895782
14581 1895782 1793560 1488017 1555606 1936276 1924809 1723715 1996357 1611507 2255369 2026128
14571 2026128 1912568 1919417 2106167 2025117 2135267 2487994 2544745 1998449 2354002 2440308
14561 2440308 2542846 2527151 2227471 2708056 2379925 2968677 2738911 3086056 3399596 3845057
14551 3845057 4623096 5505799 7714656 11377765 20345164 39200427 42830399 16783128
14542 6903822 3935271 2723845 2299167 2981408 3847059 5679158 2917443 2028680 1749047
14533 1749047 1894537 2270681 2017407 2070452 2290555 1978414 2304976 2198952 2339684 2248089
14523 2248089 1962448 2125671 2290784 2187915 2209585 2495036 2568684 2573272 2678080 2749345
14513 2749345 2520139 2559511 2919502 2781415 2663932 2797135 2851446 2898367 2958854 2881777
14503 2881777 2795755 2875811 2993362 3039734 3149671 3155017 3017124 3164689 3273760 2952247
14493 2952247 3092809 3486283 3149102 3052796 3666820 3220803 3320872 3377008 3546059 3332955
14483 3332955 3678508 3806943 3672045 3340684 3537951 3869473 3622034 3860762 3911605 3969691
14473 3969691 3740291 4106144 4156518 4169433 4208200 3869557 3997975 4116551 4471326 4114310
14463 4114310 4676571 4521361 4497950 4880530 4420694 4810066 4510488 4901695 4616308 4785452
14453 4785452 4746941 4960670 5071139 4956005 5108589 5366220 5077677 5329152 5395319 5467343
14443 5467343 5421237 5660015 5771301 5834656 5700739 5759162 6205555 5981886 6034239 6451336
14433 6451336 6304902 6381721 6603368 6710172 6606284 7058858 6721395 6959945 6852241 7285496
14423 7285496 7243227 7562696 7709397 7880101 8464185 7975695 8176489 8215484 8149206 8138570
14413 8138570 8225507 8557122 8853724 8455022 8736807 9079457 9527311 9730149 9584794 9771677
14403 9771677 9775973 9996655 10009755 9944989 10223357 10321700 10479705 10512478 10830805 11031848
14393 11031848 11255446 11226429 11624321 11712559 12118741 12225798 11974846 12750703 12996984 13554505
14383 13554505 13694519 13672305 13979644 14309055 14302164 14542493 14697654 15173157 15280279 16078535
14373 16078535 15947833 16694661 16649251 17165548 17501295 17808065 18030224 18886421 18724597
14364 18724597 18877254 19285634 20208264 20086350 20791821 20931269 21672082 22129115 22796223
14355 22796223 23275625 23704331 24279701 24980832 25298652 26136763 26673026 27302191 27923165
14346 27923165 28780730 29432857 30129887 31094371 31830330 33218329 33556065 34650465 35320671
14337 35320671 36560808 37578402 38711760 39824950 41097993 42052392 43318889 44796723
14329 44796723 46171504 47652513 49034676 50686709 52482120 54311436 55860617 57700577
14321 57700577 59891642 61949835 64275963 66209337 68634161 70988866 73876783 76389452
14313 76389452 79646014 82921273 86303639 89834257 93418338 97274869 101433296 106050661
14305 106050661 110592353 115723513 120823873 126493654 132574364 138888418 145651555 152611859
14297 152611859 160048529 168045112 176515339 185649032 195287323 205257325 215738142 226784828
14289 226784828 238651450 250924907 263718776 277090356 290304597 304813658 319300735
14282 319300735 333791017 348455572 362802804 377009383 390545084 403504643 415783644
14275 415783644 425925230 434071864 438829353 441033227 442301736 443347919 443818077 440355987
14267 440355987 437076572 431127901 422818926 413023915 401505202 388686878 374944377
14260 374944377 360611267 345288120 330057038 314930228 300409768 285928835 272134676
14253 272134676 258795590 245975138 233449229 221993805 210622177 201765403 192201720
14246 192201720 182553404 173542749 165511056 157459784 150397480 143303817 136673408 130496344
14238 130496344 124681402 119272151 114171594 109001731 104428941 100131758 96044964 92667177
14230 92667177 88722311 85030738 81638222 78494576 75643973 72965543 70127240 67772531
14222 67772531 65110654 62834146 61103628 58721915 56584244 54709428 52738331 51243646
14214 51243646 49928269 48146056 46986024 45320015 43820734 42635237 41500378 40309623
14206 40309623 39457470 38207390 36906249 35728064 34988089 34088274 33623454 32545904 31400601
14197 31400601 30127212 29829340 29202502 28285638 27758034 27044157 26364551 25732794 25272845
14188 25272845 24544345 23935793 23275824 22722840 22620974 22187760 21275818 20922892 20173537
14179 20173537 19946064 19591259 19375884 18863266 18419505 18213540 17852816 17323270 16991543
14170 16991543 16687769 16291597 16194499 15869023 15632220 14863974 15074400 14522422 14347901
14161 14347901 14232082 13848178 13742723 13638261 13074213 13009477 12900775 12570012 12666714 12281066
14151 12281066 12022585 11841948 11558268 11272986 11232915 10995971 10648550 10656081 10346602 10577305
14141 10577305 9969992 10033090 9872440 9873174 9577742 9691928 9576781 9314344 9258026 9111098
14131 9111098 8435052 8764064 8665829 8641043 8471246 8207316 8004917 8175154 7810090 7568923
14121 7568923 7664208 7572286 7443004 7103618 7236835 7075533 7008838 7000103 6839633 6394808
14111 6394808 7054664 6785203 6733685 6583515 6334832 6392608 6181136 6012912 6191804 6163343
14101 6163343 6175440 5737947 6062812 5546389 5261351 5642914 5805859 5446698 5467951 5093907
14091 5093907 5535980 5366124 4976880 5304692 5055026 5139502 4978508 5085780 4915757 5095889
14081 5095889 4961817 4412810 4681317 4438260 4327845 4574597 4345518 4333985 4492401 4146042
14071 4146042 4262248 4391932 4115690 4313474 4341229 4201323 4145273 3625335 3996441 4282319
14061 4282319 3882911 4069053 3955010 3725102 3718624 3901887 3902430 3879555 3725020 3387272
14051 3387272 3395410 4047319 3366369 3470713 3616542 3400070 3472349 3420485 3536783 3564387
14041 3564387 3177255 3315885 2786693 3234727 2876505 3037802 2851325 3176682 3025591
14032 3025591 2854015 2858276 3166660 3221987 2991577 3232551 2681542 2867145 2695627 2711780
14022 2711780 2523551 2922547 2775116 2995632 2436066 2534352 2606367 2401925 2521287 1985862
14012 1985862 2278038 2333892 2085043 2163356 2233760 2424283 2103212 2341067 2364169 2169125
14002 2169125 1881168 2005003 1941096 1925402 1770723 2131688 1787579 1663118 2142958 1944359
13992 1944359 2109735 2356012 2405710 3515240 6083890 12631923 29726391 48390458
13984 48390458 25525519 12291904 7829422 5627917 4752094 4263219 3234332 3151997
13976 3151997 2928921 2882246 2342518 2944102 2731911 2598761 2631119 2285104 2221300 2255947
13966 2255947 2329266 2348842 2065894 1835035 2357305 2039931 2246362 2149995 2192767 1948329
13956 1948329 2140306 1818731 2064836 2092216 1835998 2079274 2070365 1961318 1566477 1766604
13946 1766604 1567894 1345268 1707403 1668596 1865725 1893295 1568089 1598464 1748872 1799150
13936 1799150 1565432 1456368 1553956 1654366 1381268 1653789 1666355 1453346 1897730 1506297
13926 1506297 1600905 1231998 1601002 1320280 1679446 1461482 1331381 1480829 1570220 1331232
13916 1331232 1231969 1396337 1393194 1472159 1736047 1181773 1463932 1381776 1430335 1227045
13906 1227045 1697709 1357462 1548001 1347515 1387530 1127617 1109031 1469895 1618923 951969
13896 951969 1567208 1464008 1443193 1558116 938644 1207047 1450618 1318421 1230860 1094277
13886 1094277 1460935 1086310 997252 1122812 1141514 1394917 1101743 1047089 907367 1117556
13876 1117556 889519 1212461 1204552 872927 1059432 1201179 1078415 1189029 1390472 1115059
13866 1115059 1115243 855680 1419238 1137388 993472 1362845 1075858 852532 573921 752245
13856 752245 1147784 956824 1097027 1234723 1103196 917243 1066617 944027 1047012 956455
13846 956455 944168 1041506 791210 1074571 1091163 1031857 954427 941210 997173 720656 1047638
13835 1047638 1067037 532719 747077 641631 717677 780608 788588 519830 860265 831766
13825 831766 920435 825596 1065309 969416 853053 949073 705670 851336 831096 657860
13815 657860 807860 717179 792775 901744 842086 734762 824983 789745 883350 806917 783064
13804 783064 618600 550712 594594 603788 690006 740919 651032 772930 736345 510783 505264
13793 505264 629858 627669 690762 747675 770796 920024 689364 614657 589414 933834 767921
13782 767921 901940 826723 700579 712296 473348 839819 889682 859182 973119 900925
13772 900925 615013 638227 862473 714149 393913 935080 384084 686327 937689 680154
13762 680154 627682 361520 731764 449928 685649 561838 949483 453271 683526 782729
13752 782729 673684 498844 742349 599976 670393 541759 633369 551567 723362 420585
13742 420585 762619 486591 687169 465043 623027 925394 638609 956904 164393 433430
13732 433430 601348 669983 837206 493428 562725 505113 529301 700890 845680 679520
13722 679520 500724 698947 736950 564096 520022 312097 841983 581721 317435 304953
13712 304953 195671 437761 608916 555587 645648 323707 610340 643866 333887 350319
13702 350319 515139 226368 432479 551157 555986 333480 440352 246824 572907 421620
13692 421620 426248 463706 256675 499066 343281 316417 494559 564940 535911 676668 295697
13680 273777 560180 772180 612636 768052 809003 281491 628207 678113 672751 255706
13669 266251 761319 242138 350739 461460 358936 513124 519276 451701 546716 465761
13659 465761 388678 509404 690614 587255 369061 371190 373185 485695 436052 626985 676560
13648 676560 588460 366649 305747 468995 438845 384203 459561 239222 547089 376238
13638 376238 584122 587771 -69671 2791 108940 527457 638052 301911 208560 326474 406474
13627 406474 343161 408985 272826 357203 162005 171710 374032 -67509 585104 179450 73673
13615 44691 261236 397045 396101 321882 594853 82743 390933 229116 470492 312670 358012
13604 358012 525297 126879 214636 141669 684523 462130 22435 353828 479881 68260
13593 232663 270213 349045 409777 584462 134837 323922 313840 482358 417562 429174 102359
13581 101823 646976 288339 56533 406942 242160 311824 478502 569051 268705 589787
13571 589787 449904 524548 415522 364482 152113 476309 339858 297142 184052 261552
13561 261552 333330 275121 540803 356464 -139915 148426 330655 375583 520734 124797
13550 203135 257865 254564 148608 402709 186114 608861 6024 431147 39686 466504 478251
13539 478251 575791 924284 -163853 398097 315062 53841 133556 254494 293313 370056 140390
13527 256701 161339 78624 116936 25145 357675 368860 193248 400929 109060 346131
13517 346131 104628 267024 533782 -26689 405127 235194 338911 549515 127603 238901
13507 238901 83590 211482 571379 335905 493950 270606 235823 172972 261411 194899
13497 194899 143610 247185 400871 586252 177878 326340 306134 463519 128142 106251
13487 106251 334507 453621 344955 111937 208858 466904 242149 104115 195019 157457
13477 157457 135148 98407 52085 137063 242973 216021 178217 204880 503403 500022 261663
13466 261663 166434 269517 -178046 161001 98956 612156 459454 66691 373235 267386
13456 267386 83704 -41721 -8535 -148531 196912 440452 152515 244291 177155 157327 376274
13445 376274 174574 -15357 232728 403180 120884 166447 219788 485957 -132600 203423
13434 372267 189321 438579 -44213 436360 -4619 168076 382811 183696 341972 10058
13423 82893 387960 76269 204939 528260 -15981 287013 377540 -123945 -214979 512419
13412 310411 238001 -90257 229341 300319 212667 168714 140682 265731 296984 302848 9264
13400 300838 180865 221988 118848 180088 -277021 87080 308031 79456 191305 525184
13390 525184 309200 64390 192151 227963 227823 145501 15982 -11204 124684 257565 100829
13378 191337 501058 400794 208951 1450 148971 213519 137592 84662 -133751 251621
13367 58947 185228 613449 109661 91923 -58344 275940 225664 94873 159723 36337 425755
13356 425755 114617 328 122656 454941 -55782 208223 102390 233719 113850 290421
13346 290421 67207 188302 478475 363878 35284 178653 130936 94475 49600 167083
13336 167083 422823 241796 141843 684436 407731 225266 560361 -37432 359064 282133
13326 282133 92279 -10435 266737 458445 249266 343400 83417 1279 381156 -148379 509446
13314 323710 58590 224775 322523 -6500 527194 427955 405556 263149 138836 293553 1126
13302 97802 269480 153629 112523 15583 248158 44402 92780 157838 240842 105673 9929
13290 -85441 16149 -156894 -2293 57006 111961 111114 17077 210581 342382 -76740 -139786 -37755
13277 126693 429965 -4006 103357 221373 -70098 -106570 327229 3757 115282 469066 15822
13265 178904 177276 -12726 218906 415530 75000 -38643 95921 -94807 339913 297006 170081
13254 170081 372635 -197029 39247 311593 -321 221495 147857 -207623 263649 67121 283441
13243 283441 211316 -201197 -95725 228833 152525 401252 241159 -104809 107703 237684
13233 237684 7043 221806 104864 152750 84406 -12968 41069 28075 -7188 67260 304283
13222 304283 124620 41790 115931 117725 72517 -37037 38474 -102480 332687 175552 -239183
13210 108322 278247 18594 158414 300350 -190534 25577 51044 36889 -33211 20878 196458
13199 196458 92763 139320 -213146 267947 10159 -30114 -198554 134455 214578 157691 -121867
13187 255508 60243 15458 289249 193427 168040 13163 181473 -341090 287635 136217
13176 210491 -53412 -190696 121668 -181426 287516 76066 198538 206847 101197 416756
13166 416756 141001 307347 -82526 -80582 33424 -68278 -347955 -3175 149001 135350 249681
13155 249681 194133 99119 264675 -9110 263542 -38101 -229005 190010 491854 160238
13144 127432 243473 167656 224341 76039 39251 211653 76891 -101092 -205363 71070 -284787
13132 65290 -92958 109593 -64500 -97137 307117 180132 -1722 -72520 20958 50397 320737
13121 320737 129733 -227138 50907 44117 -9746 50177 111138 207279 -258114 136220 -86735
13109 212298 120017 458438 184868 -41419 382027 21739 -307383 235428 205708 174889
13099 174889 309266 94208 -193016 -136730 6087 11232 372029 192722 -44720 -246143 208874
13087 59896 212782 -179401 -36020 -265214 174538 221504 221949 -292801 28127 -169899 51938
13075 -193459 -126247 72627 -115408 272684 328771 184822 147662 80902 -51487 140978 218137
13064 218137 236724 236700 -88156 119256 358 343325 -88548 -45016 208949 -199220 101845
13052 12423 33000 159808 251361 109923 109828 28092 -21315 -81910 95285 154144 80235 -46873
13039 185728 176344 262785 64134 -59986 -184181 -67768 22019 52248 193396 125117 47939
13027 -18612 141116 162044 83908 118270 42963 -28471 107389 133470 -207491 -141274 409121
13015 -14764 -88325 -79966 286654 -180336 -542 243041 -170559 -141713 120548 127696 118162 -17916
13002 15904 197818 260381 -95211 -80601 181552 144783 1888 477483 -275785 -223800 105663
12990 157964 -220192 -296623 57140 153170 -169660 292351 26819 312068 -73217 263794
12979 -147632 148526 -183834 243730 7672 -93433 147693 -171513 -42169 -18641 162258
12968 -126632 -193017 -82592 453425 141562 -11021 150610 -19979 3361 177716 247843 1832
12956 -52226 374178 216790 170167 -43203 -8948 -103710 -41692 6553 233878 -81308 113163
12944 136649 354968 385610 34229 151335 199087 -56440 -212707 -204546 220903 103109 140175
12933 140175 95511 -88598 -201803 -112167 -142289 224353 213199 217963 138167 -30152 162849
12921 10603 3384 246817 -64540 -18774 137508 325551 23597 260880 -163122 177500 -70342
12909 378681 29215 -108133 -294576 86257 275678 391749 199121 17745 -49800 155805
12898 -355138 -181455 173440 -8588 344508 -105201 165365 -163286 34509 115459 -168267
12887 -290410 -371995 50317 52455 -29963 78064 -79946 176007 -222492 -28849 83845 -100338
12875 172001 -40155 -107729 -158664 142134 -304514 7213 53690 121112 3268 -60452 -20383
12863 27851 -35974 327694 69340 -108736 -199699 -386026 53762 -43386 145383 161516 -129152
12851 260640 1021 145544 -1400 44357 -113364 -6455 -154444 6190 -79827 108651 -30057
12839 276925 85875 -176477 -12946 -5530 126236 -164683 229933 -221012 -25605 -307808
12829 -307808 -58241 150149 -52362 169706 -470941 2544 -289672 -306823 169568 9815 -24764
12817 -28182 285464 2605 77326 -218452 125622 61106 206410 69767 -293823 -281968 59692
12805 -341944 -407519 -64304 -335146 -153840 -281899 104220 33955 228541 -90735 -382034
12795 -382034 -256871 46118 85163 3233 331018 -488544 9827 -110780 -36751 -40341 -87303
12784 -87303 35025 -86825 53355 -13323 -291251 -50313 18329 -174394 -284068 113589 -432709
12772 -90553 96498 -205503 -79557 176891 83960 -102117 22565 95837 -192882 142639 -59126
12760 -6819 -137485 -108397 21399 51907 -279751 -35686 -182219 204628 -204849 153816 208359
12749 208359 -76344 181958 -188557 -213407 -320517 -3737 362971 189459 138122 141626 207536
12738 207536 32497 -21377 -102724 235104 468281 4981 151057 -56566 -174544 179287 204343
12727 204343 67365 91665 -295244 52159 240232 26481 -56359 168727 131325 -35811 291487
12715 -144327 108631 -112080 -309577 -48276 6642 41278 163817 215325 110517 64766 216125
12704 216125 79855 419823 116470 155753 -12945 -93488 49965 74225 -210981 28521 -328623
12692 -181235 -123892 -79475 -288393 -39007 -110631 -92675 -8010 288054 84520 202365 -36022
12680 183263 141280 107569 -96664 114518 45279 -143016 -174364 323261 -108895 111458
12669 -93123 -13669 162284 -293495 -104747 232884 -60250 -20677 87166 308505 -78442 -25634
12657 -42173 31098 111261 16304 -96652 -115635 12430 -81439 346416 124665 284492 203944
12646 203944 -202818 -44663 82552 -180428 142327 -15614 74927 -76339 70634 61439 249434
12635 249434 223101 34043 14154 -41153 44093 131532 198557 401360 -12770 84792 49888
12624 49888 88773 83227 191564 312808 294658 42272 342691 180436 -201712 -48723 241590
12612 -7673 231872 -74015 -268886 145443 225001 80802 145414 144728 416546 124552 169373
12601 169373 115785 -100687 399206 139551 138743 307156 390567 83526 -110355 258313 123941
12589 131146 83634 30508 161994 106721 -142501 -9151 -115315 -302674 -139159 186550
12578 -242609 99078 171943 -182819 -212540 97489 19822 140913 -94186 281618 94299 -112452
12566 50236 -1070 11279 67195 136991 194998 -294051 112824 2658 146008 -159097 72425
12554 -104204 -24475 80849 -12973 2606 30391 132067 -491227 -292089 -125039 5076 197108
12543 197108 -181176 -129508 236543 -386 -370141 -260005 90184 37566 160574 -159458 -297469
12532 -297469 -259926 -33718 -82547 74374 -6906 -32382 -145276 -8368 -96819 -77106 13039 72198
12520 72198 -49794 -491880 71122 -7779 165017 -66518 38813 25056 -297334 -23569 -280787
12509 -280787 -101679 198732 -81848 231383 65949 -147711 -26321 70472 -136450 44322
12498 34219 -119853 49854 -10967 -381708 -152501 -81584 -100919 -111927 -261253 -40805 216971
12486 -400717 -21957 233442 -187392 212118 180012 59695 -208320 -165000 -164028 137009 -6051
12474 106095 -315068 -210125 -132921 -54634 336707 139977 190498 91470 220157 -33771
12463 186862 140958 280919 -205388 137371 95157 -109162 -33571 115808 -185210 -84052
12452 -128371 99974 -156486 -179012 2050 -52037 -209671 -102949 301009 -25493 19776 33458
12441 33458 398180 30769 -95143 -291423 146889 -28683 -15857 148664 26912 -67652 -114321
12430 -114321 43890 -231539 -90450 137074 39297 -218857 193120 6287 -278637 -30523 -248939
12419 -248939 60784 27908 464225 -276916 7098 36351 181202 337780 168707 2004 43287
12408 43287 -232474 -47579 -78072 75157 -320593 -41972 437011 21770 -173198 -158678 377001
12396 -166339 -26251 -297637 113201 126530 -306955 -242757 1020 53811 193319 272922 -156708
12384 303713 -83862 162499 127114 -96006 -221364 99313 -10995 457764 -135310 167882
12373 121273 -19 40501 132277 -342376 -157015 62330 -721 -174528 46833 243311 170407 -21973
12360 61088 -118491 223263 -22790 90849 -137013 91868 71690 -34647 70105 118681 -115527
12348 231054 191302 -205735 -242603 -41838 262621 401822 4973 -27321 243947 223801 307620
12337 307620 -11592 90517 51024 -188537 129564 -160528 28117 33391 268120 -2612 140263
12325 275382 -62446 39285 167042 365123 104374 304036 568950 278994 102195 194445
12315 194445 337057 -18426 66394 -183784 154409 98979 348865 -416062 165459 122756
12305 122756 8237 69533 -132044 206775 259436 10590 4964 -146842 -80054 -30747 149755
12293 -68328 170267 247086 -77796 80820 -33014 -92276 226452 -123564 39964 353543 -95081
12281 -223673 138294 -66155 1271 289465 92108 403099 98719 -17695 -181769 224490 13849
12269 54979 279001 327997 30847 416649 115833 465176 627475 -115334 291103 -16775
12258 231970 99708 -2599 108039 182563 49834 189519 51125 483890 152957 166519 261504
12247 261504 -80311 223059 25616 -90777 -94278 199605 25093 88765 -121718 -88503 477403
12235 -254330 191359 279286 242131 421637 -201606 -100132 -121480 17613 -93301 331996
12224 94097 -173968 184883 14237 108410 354570 -15202 80805 283914 125399 225713
12214 225713 257228 52833 342751 23087 193926 122225 146796 140777 265296 -165823 293535
12202 266151 171802 -53047 185399 -2496 -17422 48877 244523 205598 241155 108734 350031
12191 350031 26209 226340 208117 -208041 445150 212662 330718 42014 42521 -207811 143432
12179 262783 255441 -87808 218023 178631 86111 270203 15584 141337 44760 324396 364780
12168 364780 -14526 -109589 160833 255001 245199 -27161 440305 -104219 269888 270671 366469
12157 366469 -193725 38090 102816 41817 -142336 -59036 156945 381274 170769 135546
12147 135546 -177696 146218 111698 180156 204512 -53449 76248 543206 -91852 344136 -168414
12135 167174 307095 -92460 62627 -111932 117547 -285741 -106184 176258 -3217 -20747
12125 -20747 221586 38970 101517 307461 107740 56241 -75143 291355 234244 130859 92405
12114 92405 264060 236129 129885 537329 161944 75478 29830 131400 390693 79202
12103 -170849 41866 -88290 111349 -60642 190928 -56003 61769 86663 95348 125033 -82528
12091 208439 184717 -15401 -66718 151264 -274182 257198 -20571 152774 4963 86535 -5456
12079 438662 97494 -46383 285711 60688 227062 3045 126081 226133 236266 132809 259470
12068 259470 427388 278965 166071 104368 58990 -50756 67376 -9965 183989 -53669 291930
12056 -111174 -89640 45935 69108 153848 -281002 26954 74195 313053 37610 -217550 192422
12044 79710 -2507 42392 290262 -170287 -107516 -25953 -305137 -186430 -345109 144209 46340
12032 73163 2041 -106652 78632 367998 92692 74733 -65303 161723 35850 62616 -82119
12020 -15581 -12966 136707 -174520 90134 234324 170413 -12566 39534 190257 -194456 -55266
12008 110465 -118034 439210 -148644 98369 -96465 -258479 218293 -190628 207573 -69527
11997 -87872 133372 201281 214882 -76905 65466 42733 -191317 177217 -139544 16324 -51856
11985 122987 155716 209412 -194494 160594 -53714 135497 -131953 -77206 -130885 -115517 -27062
11973 -28292 -75922 191432 -263778 -98285 -75971 38782 -80530 -31315 -285151 183671 -14460
11961 121170 -108358 -63175 56079 149061 1376 61486 210354 58264 -14306 -42850 69027
11949 133951 -330459 -40540 -35796 -577781 35675 25520 -155349 -58869 -39730 -85039 254834
11937 -14685 -319280 183898 148124 123895 -36068 415010 -635520 115779 157935 32290 -309088
11925 -45644 -135030 -215164 -162350 225575 155687 -41985 25849 223484 -88193 102530 -135570
11913 -20042 -27017 -183523 -664 63529 8168 -288182 232309 -63879 -80508 -54484 47106 -299501
11900 175974 -267575 117847 7864 -21928 43031 -30411 161310 -146375 -246844 -223838 44259
11888 -7902 -311557 122014 -214647 64370 -105550 247757 -19668 67868 128366 214446 -137985
11876 -224558 34501 240716 -137111 -64853 -193599 -56330 -193625 46265 91849 -273624
11865 35039 -55401 186094 -405929 -233617 -11751 -240200 -206300 -231 -134548 2786 93437
11854 93437 265022 112946 431648 -121610 -26777 216378 -29671 171724 119219 -177773
11843 23998 154438 239151 -80606 6410 138436 125923 -402192 66920 -71052 -73546 -143478
11832 -143478 -331395 32161 -129406 -437552 30774 6800 -130797 -92980 -263168 -113381
11821 251739 -229780 -170881 -114107 143334 -160980 269348 -131957 -232937 -267417 55031
11810 -178649 32792 235138 -103614 -44795 -164947 -3295 -51033 -414736 204496 -472574
11799 -112312 -205233 181333 -21039 -314134 -186181 -74559 -3477 -153799 297881 90823 50425
11788 50425 -34262 117655 -41866 287698 246355 135054 30419 43468 48791 148012 153116
11777 153116 -241179 -37947 -90652 -66083 -52014 97690 -60242 57269 6444 98148 -70820
11765 56338 -231274 20197 -135089 -137546 246451 151205 373181 375020 -33515 132763 -394568
11753 -12623 156290 61193 254888 69772 148004 271210 -163864 -266921 -106406 30485
11742 -180393 -108348 -20762 -215311 -172202 67942 -129596 -156317 -254264 -110219 -243888 -98593
11730 -7175 -66037 -208137 90473 -49214 35659 -42685 -48463 89542 -217053 272232 205829
11719 205829 -142823 -48745 -260330 98624 488375 217720 -41723 55815 -209148 90190
11708 -191938 40419 223089 167128 166086 -145512 -13834 -118188 198023 -144830 -106480 144971
11696 154634 -137053 -142796 83318 -9550 -97890 -148998 102929 -313585 68271 158783 143301
11685 143301 -176282 241984 1540 135746 250321 -21521 -181816 251802 51341 451689
11675 451689 60901 -25177 -73920 -66449 -256300 82954 160971 -50087 -221133 -70843 19249
11663 -46201 -106117 -139608 -64040 -165733 317691 -98903 -212696 315127 322289 13580 49622
11652 49622 435676 -63563 173020 208341 8561 -103755 -112368 -228620 -209629 208989 232015
11641 232015 110292 225704 74006 295577 -111630 274836 118168 105251 -49565 -92851
11631 -92851 25525 -232796 432791 132328 352776 57650 180997 201541 -11640 -157464
11621 -157464 -71474 -274992 -193079 -74262 156861 -48633 -83787 -57489 43881 89945 -33302
11609 -61819 -5616 271405 -273003 -5552 44905 -45571 31355 -148545 -61950 259581 88862
11597 14270 -43117 127753 41979 -95970 -232489 -88481 -127782 -55552 17226 -198183 -134759
11586 -134759 -276558 -322523 -415012 -47981 -290546 -40978 55228 97161 10262 237191 -109349
11574 73238 132454 380737 203410 -25278 -149742 267435 57833 125041 -128257 -70061 173559
11562 67705 36671 -107487 -112622 4612 233831 64672 59082 -64882 -45412 95566 -289951 200979
11549 -269912 99326 -321588 130874 -165126 -70515 278567 128888 -161068 11914 128793
11539 128793 220597 -186429 150321 -294915 -207380 26504 84759 48220 -181326 -205220 -127462
11528 -127462 54727 19150 50466 77827 -18247 -92090 938 -164795 -13248 -272195 13117
11516 221727 57525 -215578 125443 212465 -90809 83801 217856 -38367 53980 31680 130790
11505 130790 -92388 -134449 -61645 21800 41072 93433 364197 -225083 425110 92729 257166
11494 257166 25770 57529 265420 -245770 43751 184940 -185625 -279015 242877 192263
11484 192263 77456 197243 55457 19112 172699 139543 84183 -192220 82940 -31613 -156022
11473 -156022 181462 145741 355225 164330 -66722 244945 267137 172955 128846 84517 168192
11462 168192 237086 -130688 275912 54640 88668 -70724 -3690 51229 -383 68285 28890 20817
11450 20817 268582 -30488 20149 259627 86119 119176 29397 -4139 226237 77279 -30629
11438 112786 196535 103153 -129448 90875 598920 -220577 127779 -48357 -295171 159832
11427 -42989 -1764 99041 147980 246708 53195 75203 32587 -75411 -8525 -301497 219662 -409249
11414 -143738 -206918 -160584 73847 -96849 -211588 65837 292336 -56514 -72026 -123079 103095
11402 35913 -33601 -273965 -229494 56846 422513 -107360 252447 -46255 216647 25089 24004
11391 24004 21053 200273 -122209 176822 200249 -158260 -105635 30398 41279 140774 -51837
11379 -216895 195867 -54620 313358 166700 -16735 -255690 -150810 445121 -15883 -79628
11369 -79628 -109344 -176650 121628 -16165 -24057 103301 -195282 -71069 31390 39647 -210849
11357 -325043 381965 35520 -301035 -144772 26494 212355 -104405 229541 -131418 -213517
11347 -213517 -246857 61428 -31261 77278 88470 -119073 22422 277716 106854 188623 110377
11336 110377 294070 -107353 326388 4912 -73749 -394404 202128 -71706 -159209 -78571 -125981
11325 -125981 295321 125091 208179 -310015 -45857 -31929 45326 220414 137394 6631 -22502
11313 -113168 290972 -354251 -116240 -109708 97346 -251349 -27296 -197900 260522 220686
11303 220686 -237108 109647 -129825 -37107 138455 -135847 -1578 200677 14079 -172482
11292 230255 130624 73316 65734 -44828 43026 -136977 96700 59630 -19730 -242317 44986
11280 368319 -196042 -142037 140914 52479 -275822 215513 3676 -111009 -197693 14037 67744
11269 67744 86649 96475 259254 -106691 136847 599145 -118112 -170021 8062 -128746 -301673
11258 -301673 177009 -181208 158547 -61332 -209459 -140688 -221072 -314872 110987 172777
11248 172777 87333 -169654 -382239 133662 -325065 232178 -206829 -107822 -130014 213106
11237 53819 181709 37763 -94030 -29387 -47313 181335 -63757 -166092 -94293 25246 56603
11226 56603 180944 -289964 -156680 -287067 -195693 48164 186138 139772 415384 -373030
11215 -13923 156888 203279 82050 -14429 -37579 -103918 143205 126389 -69661 -21555 -47260
11204 -47260 278580 92273 27153 -188874 9083 -195858 139226 -222546 -233610 98524 -45308
11192 -134614 160675 -70341 -5453 -61976 -472325 -97928 -214772 -99685 -228854 -120240 -89269
11181 -89269 48062 -270223 -213624 42926 -183368 -256216 -125301 -99668 -254619 -364579 -93172
11169 -237465 134498 174223 -68398 61977 -269165 -311229 -33945 -160054 6966 -29453 -77954
11158 -77954 104826 -38157 -240376 -399287 18848 -178853 -207997 -66538 -179369 -132542 57241
11146 -101354 -42619 -192038 -29490 -205726 -458803 -275654 -73767 73070 251119 -50964
11135 -88364 -10779 -11396 139301 78692 -219234 -114019 -45585 329362 -309034 98470 -160499
11123 -113800 -282362 90172 158291 -142139 351939 63100 151582 -38928 -124697 -144289 113954
11111 296 177022 43518 37819 -77250 14730 -33723 151328 252510 -105476 193089 340795
11100 340795 -120836 208148 84131 59872 281651 199689 39124 -61112 43953 288554 70626
11088 116875 416831 -29713 128718 87123 152529 137762 254242 143898 225484 437755
11078 437755 -8243 -19453 274317 429343 41687 160631 319146 440044 417079 202395
11067 274652 160186 -45601 90978 389805 561449 459627 223794 294219 382775 483688
11057 483688 508648 588420 748235 492902 604689 568293 648920 679433 579193 548029 731878
11046 731878 704228 711579 561178 745935 802781 602912 412755 928456 717083 620218
11036 620218 604969 582012 522126 586263 855902 752421 348752 456652 807443 470413
11026 470413 568307 972041 721206 818855 776093 438160 499538 455878 722902 288485
11015 375884 433283 495950 748478 522301 220306 458463 324942 294684 470844 881390
11005 881390 550095 877513 116505 562311 499114 598640 411275 469153 544749 747462
10995 747462 458557 686052 877111 522073 352150 443459 796273 436722 623715 475776
10985 475776 730087 705374 853210 450255 359410 893502 969628 941214 853142 1224809
10975 1224809 744136 924389 1129261 1542206 1458242 1982554 1941899 2574247 2330744 2619804
10965 2619804 2297288 2296159 2258278 2052252 1955063 1874144 1810695 1557524 1601757 1358621 1607901
10954 1607901 1241583 1176298 1409113 1546802 1133647 1396151 1014460 1175606 610583 1153747
10944 1153747 1008105 491928 492709 483570 581355 109917 372768 151574 634903 82287 -75368
10932 34057 264973 380690 215465 -10582 60987 168254 -126302 -291891 -142112 -43491
10921 297814 -216317 25547 174072 123640 -168868 -15811 -292897 -133394 -101612 506751
10910 -96838 38338 -44980 -5622 -82912 119147 403562 31720 121324 -149720 -45881 -173919
10899 -173919 -106311 -52812 111852 131083 -19136 66824 -2199 -177113 194510 159469 106401
10888 106401 14290 -27033 -132868 -196010 96314 -36173 -126694 -110455 -271909 -156015 96496
10876 -207033 12466 19423 165215 226066 24565 24165 -284737 179857 -150382 -79631 -36858
10864 -91467 -179650 -144946 125891 -13388 -175409 168145 -63027 233922 166089 -40697 254031
10852 -265476 -418266 -275588 58940 -156217 -203780 -495783 -185203 231016 -140067 -138272
10842 -138272 -178697 86406 75735 221553 -376801 -338471 68292 28799 -82444 243884 -115432
10830 150309 -216106 89195 -22623 328943 50827 -43043 172648 6587 -42157 -189414 -172960
10819 -172960 42379 -57711 97048 -230008 -89042 -199059 -87731 -54596 36400 -343936 -325464
10808 -325464 -213306 193327 -215132 139203 -273273 220686 124411 -143449 -183529 17906
10797 -36137 70976 50600 -342896 -41708 -81238 85620 50831 216504 -870 10777 -199252
10785 -98428 492481 163557 -77227 -144610 -136396 -273144 -128573 137120 106411 -175690 181233
10773 -124672 81840 -167424 -223624 -42389 112942 167345 -12574 -417725 -177808 75334 72718
10762 72718 -176592 145801 355 -112703 2490 -234423 8552 -291321 207234 -205709 -233254
10751 -233254 63295 -70720 -7414 -111332 331725 -142733 67429 137377 -379246 -301091 -222595
10740 -222595 -185137 -188603 146517 -33373 -148645 -109856 103731 -312587 -512209 -388545
10730 -388545 -102137 -62111 232496 23666 -289335 42953 36101 -13739 -193402 -15363 -428349
10719 -428349 -135762 166117 -64710 -144815 -148149 21661 -143795 277942 -254304 -77344 19323
10707 94324 -181133 -122543 -40412 -49912 232960 44821 16850 -433418 2157 -174108 -170724
10696 -170724 105311 -174208 18406 -326047 -14827 -141915 72285 183188 -22791 -154 -315841
10685 -315841 124541 -18120 113789 -227413 -47244 -153782 -573239 67699 -157237 -248819
10675 -248819 -129364 -150049 -244488 -303118 219660 148134 -82619 171937 -197415 -90399 -86568
10664 -86568 -248585 52043 -92598 -108804 40482 90154 236079 27826 -169681 76725 74754
10653 74754 107187 -360863 365847 -138767 -171333 176806 -85962 41891 -113183 -160622 -191615
10642 -191615 69447 24261 -129206 3627 -113829 -133986 -132457 -190491 311649 -178165 -24064
10630 -59193 122609 228272 -277339 125721 211597 -52014 -211604 -19623 -170110 -363809
10620 -363809 126102 35204 197725 115970 39008 -274739 -166886 -113245 91189 -194519
10609 -37850 68860 -492353 -240126 -236485 -74995 205725 34644 -180022 223406 -201892 -53212
10597 -162627 19292 167380 38053 -182274 232859 -398343 85065 -52123 -114685 -62531 10975
10585 -50635 318167 -189607 -184864 -287817 60701 -350654 -339087 -327471 -8294 23409 -106077
10573 93350 -36720 -104337 -104385 250850 34423 69734 -1518 14240 248249 -27273 -3621 -12262
10561 -12262 22505 -258117 -229456 4722 -80081 -181365 -88098 -22766 40025 -176885 56687
10549 -5219 248619 111157 -132910 76270 5226 -94654 -71036 -138872 198520 84303 80076
10538 80076 -339325 -303909 -178587 -205961 -182163 -442383 -69669 -64753 -86678 -124690 70276
10526 53104 113053 79776 -309455 -179489 -227339 -47545 124403 -393316 -268239 -209259 -52019
10514 -116475 60586 -108731 48007 84242 -11381 -22298 -244768 -135730 -61602 51590 -477132
10502 -9507 225804 -136070 -130429 78970 322390 32703 -216228 98615 187967 12301 -252666
10490 -27545 -290453 105024 -316704 -125875 -225399 -389107 155470 208799 349125 138283
10479 -20881 111984 117374 218812 228479 166748 295122 428186 491637 529937 -190237 23453
10467 112172 255139 196482 -296702 -118718 161588 170256 -137459 114821 -69594 98645
10456 -158563 106115 156984 9168 58737 -51434 -190010 -354472 -204951 4488 -8910 89440
10444 -175809 18057 -305165 -164143 -262128 -2664 135370 293713 -191378 88866 -103428
10433 -30886 -423474 -6671 30351 -65579 114489 212400 160709 52598 59093 126963 52289 -24887
10420 -44692 -162312 -44056 112918 -369891 -325827 1396 8097 -566849 -310191 196049 157962
10409 157962 -307870 178640 332378 -252198 -180758 -382628 -21249 -107830 -25280 265235
10398 -178898 322456 -257161 7198 60591 -245110 19787 96736 328282 -157715 -191987 110484
10386 17676 215852 241962 -20601 6585 45283 186419 -28775 -50126 29484 -151720 277213
10374 86256 220096 65371 242240 145038 321089 271505 228083 354589 215830 43960 383017
10363 383017 458347 423315 75684 288523 -28377 295600 -95583 466992 124945 168965 168001
10352 168001 299488 -2577 306099 410195 318006 521944 233477 300131 281118 564651
10342 564651 96934 201512 347174 254296 70538 -243321 193413 128211 237933 6070 43523
10331 43523 -100358 326487 73110 346619 233185 82133 266911 -53409 54586 232735
10321 232735 89778 303280 81544 538264 170249 559255 26737 -196147 316796 59529
10310 -3071 88979 -52864 252038 113101 -153570 -138555 -44791 237360 97103 -172763 13222
10298 -315 170820 89059 -89361 -362818 177418 42173 95462 101455 -58358 -38199 -3527 -171864
10286 -171864 -349416 127855 -155194 68855 -17237 -179007 249862 -352830 -9747 20449
10275 155129 77771 -78574 -82233 -80678 -32253 16531 -244540 -370233 206928 -92704 -80955
10264 -80955 259757 -318285 -236992 55247 -133036 -151198 -253189 15260 -205469 -190280 184517
10252 340513 378224 414679 157523 72174 154324 79761 -187201 94286 -15761 -41908 -160543
10241 -160543 202015 30266 -214563 14374 386348 -108053 -110343 465786 -160382 4595 -156517
10229 83025 -100685 195077 -141594 -42934 -286335 76864 -46804 162923 48432 -220273
10218 240356 18956 -304608 -273476 -131999 -221309 92993 63917 -6999 -275 -27500 308582
10206 40820 149317 -11291 185393 105618 85429 -149541 22876 2923 -108034 -293883 -7204
10194 -261324 -123458 55982 -227454 -154216 38148 -99260 -310310 130712 60030 207630
10184 207630 53683 -130113 -43161 -72161 -68270 56263 -366862 -133207 -208683 -116759 -178501
10173 -178501 33156 -32434 -255314 76094 -7963 -186900 -109586 -102491 -145146 71554 217583
10162 217583 -41128 73445 -114583 -74506 -187071 -313233 52811 -293040 -242334 -38781 38777
10150 88018 32402 -135632 -232422 -268429 146718 -339453 91659 -196085 -129831 -263745 -254
10138 -1188 79368 -173689 -123055 -448290 -219826 -89019 -129932 -119684 -43951 219131 207059
10127 207059 -249439 105857 70428 49569 214694 14296 -77104 -230053 -174611 -275807
10117 -275807 79813 16192 116260 -283055 78265 152660 104332 46244 -91234 -106812 -54318
10106 -54318 -9494 188580 -234101 -148911 33339 -114457 139145 38228 -9128 151327 -40568
10094 33072 -65194 -110701 -268866 -186979 -185868 -182656 363772 178822 319783 -264638 48157
10082 41392 -337751 -208693 198946 -111003 -26438 -25933 -88571 259992 -60143 -126767 -363347
10071 -363347 -252101 -376594 -493340 -322330 201904 192939 -22165 -296172 76074 185322
10061 185322 116082 108335 -37920 -266687 -99704 -208580 173104 -231263 211735 -117222
10050 281539 -228166 24551 -100832 -219717 183841 -107072 -414354 -185188 78104 -87605
10039 -234283 -229236 -84494 -255306 -192441 -46328 -431232 326649 108812 -203979 -317751
10029 -317751 -444654 -15354 -425585 88118 -144555 -5562 280864 -80401 77768 62837 146025
10018 146025 -359227 -9661 20454 129085 -112035 -26862 -223511 -29449 -430159 95953 -143702
10006 55317 -214526 -110281 -275184 288985 -13926 -164456 10755 -132612 -1041 199127
9995 -136021 -99633 -341994 77628 -19482 -8243 -469585 -48218 -311867 -340328 -31994 -70225
9984 -70225 -391526 -397259 266702 -275196 -268042 76226 -46665 164165 160926 134411 104876 -58714
9971 -258890 144312 -33855 -107871 -133729 -93964 -102855 -233025 248593 -109170 -57669 62852
9959 11493 -22204 -517953 -248533 -109411 -66164 187933 -90056 -114023 -184877 -55840 -7160
9947 -212745 -329301 -37546 122377 156126 -224467 -147325 -167836 -2658 -140899 161265 -237952
9935 -19361 152094 96152 -306347 258558 73873 -879 -454134 -67244 -76025 -29607 -273694
9924 -273694 -35686 -155879 90495 -314073 25953 7587 -9394 -160277 -251367 -78877 -306909
9913 -306909 -19931 81306 112701 316283 -22932 145802 -267606 -218443 18073 139821 -37311
9901 -159965 269500 -76618 -9863 355997 -68824 171077 -191726 -159294 513017 -130905 -230831
9890 -230831 -220670 19233 -62989 -103549 92671 -162438 46469 -50983 198017 -171558 -97224
9879 -97224 -61044 -67976 -66819 -388 22966 -159237 70455 86140 -245857 84070 105424 -72553
9866 105567 -224878 -256138 -73481 120890 6092 -4640 -173187 -129883 44152 -64624 53306
9854 70342 63750 -147330 -37546 -138872 61883 -195590 -95873 -77621 226822 1011 -271613
9842 319438 485 139124 174081 -166965 108093 -232217 126720 -2321 -476108 25209 133690
9831 133690 -295780 -328818 -128319 284285 -43950 106209 -392344 48764 -40603 48220 -193871
9819 -307992 -76269 -69211 27194 -231371 72611 -211360 236244 -188322 178375 -192279 -2581
9807 -263420 221811 316835 -66836 10871 -230883 194823 -146916 214546 -174302 -189749
9797 -189749 14091 46959 134738 -200935 -47452 43414 -294553 -11230 118703 -67898 -66188
9786 -66188 -67724 -2315 -393913 72322 82359 -37027 -273486 -67045 10656 -71894 -331743 -62952
9773 412909 -201498 -272490 -149296 82824 -320488 -98820 -238485 -104586 -121942 -86539 -203379
9762 -203379 -227162 -142593 11221 -135387 192088 72836 -417554 -79582 -137963 -139640 189748
9750 -173326 -229754 -49535 181711 -217897 -118415 75051 -351666 -128300 111850 149325 61229
9738 -200196 4189 -42402 -193975 -101912 -120526 115377 -86080 6491 -123697 -122275 -16574 262155
9725 170151 -159939 24178 185141 169594 -61778 -19959 49525 -56535 -420401 -264021 -129769
9713 95785 79781 257787 -130840 -166125 90832 -361469 -140733 -247090 -150577 -109795 -296991
9702 -296991 -147480 -309528 15997 81788 20795 -205351 -95318 -113598 -235188 -73286 273495
9690 -218797 -286223 -171329 -71327 -190877 -39060 12565 -85264 -157808 105346 -171275 -27376
9678 -424930 305404 -253857 -80472 127065 -5455 -320326 -27495 87292 -161524 -150694 355296
9666 -226923 -1143 -160739 21142 -272725 -231268 80607 -220941 -72085 212584 120426 -81988
9654 -226748 -191404 -120508 -57015 120903 -162311 54572 18842 -217084 29432 78344 132869
9643 132869 189019 -159994 -207295 -101799 -58349 -267542 -153878 -89252 64242 -306175 -85780
9631 -134726 -378002 -116977 -307637 154113 -144658 335924 128158 70596 -242113 -171173
9621 -171173 -12362 41201 -25431 359766 -58690 -81546 39106 -117355 120913 -78041 60181
9609 -316754 -212091 -32180 -117589 -19161 -68716 225140 -104575 15732 -160585 293826 65692
9597 -29256 -29934 147548 -22321 -470782 -548 211277 -266412 -40687 18182 -34105 -153061 -15235
9584 94958 -339260 -41503 -165445 -216905 -59086 -205419 94874 274765 -153363 -215317 204679
9572 -67665 39452 -12871 77580 -232713 25833 -199305 -124359 186848 -293535 -168722 -103382
9561 -103382 125747 -73382 -29622 -74511 -92682 -153335 -4846 2706 -6193 -62093 -171767 175693
9548 -104044 4710 -289869 -350950 -147709 -212390 -36979 -98143 -127132 -302550 220847 -210805
9536 -53586 -250040 -89069 -251619 -6434 7092 -106074 -152450 84099 -57433 -5454 -146450 -251107
9524 -251107 229860 11903 -269844 -189847 -30770 -233629 24978 -334865 -120397 40314 -411311
9512 -230180 -170273 177703 -47163 -140785 267536 -16456 48858 204960 -32519 -21724 -91576
9501 -91576 3116 -331455 267735 -296182 87655 22949 36053 -24897 256551 -331270 -76896
9489 -95469 23553 -52868 46506 134361 9565 -146848 -52767 99196 107360 93009 168808 -6160
9476 -232850 -30515 -50130 -71110 -107364 -11016 52215 -93099 3388 -112889 58325 -52703 -220733
9464 -220733 18327 42403 175275 222947 -99772 -183114 35588 123276 -161065 -2395 -24396
9453 -24396 -170958 204236 39671 -435612 -88000 63912 -8913 -317538 -40681 -113964 -304001
9442 -304001 19481 191862 -86883 -191228 15643 -97109 -295652 -87600 80130 -32576 102727
9430 -67475 -52917 -176347 -244776 119348 -70812 -174277 248964 -282388 175386 435670
9420 435670 61892 -358252 250124 -244729 23547 -33610 -143466 -18796 31644 -36884 -185475
9409 -185475 139914 76739 -47642 -140406 -56807 -34151 -232534 -297026 -444132 -23733 96047
9397 73705 -186806 109360 -382764 184192 -90120 -42460 -219470 -229661 -45587 187918 -127504
9385 -328087 -155860 -224856 -266589 -71126 -49999 104461 -200426 58071 -356409 -348908 195959
9373 87399 69605 -191431 -172874 -203893 -208708 70040 38341 -105207 -38363 -34367 -7434 -164055
9361 -164055 144247 17539 -17125 -147289 216939 -451047 44331 20500 -200616 116718
9350 -203486 123550 208747 -89530 -83965 -17872 -86134 124789 -124417 2745 -26183 -64400
9339 -64400 -309961 -273096 42300 -38154 -8407 -60392 47493 -82863 -47270 -73131 152965 -171449
9326 -59387 -26550 193053 -240350 -24897 77663 -80133 -249954 -66272 118940 410334 28595
9314 -95714 -187068 -81566 43244 -300372 -166599 -601427 -112055 128583 -236523 -29037 -54333
9303 -54333 27985 -116444 -53323 212785 -404176 96211 -382665 41850 55336 -112456 -185402
9292 -185402 -176073 89368 73948 -38358 -174295 162513 361959 -535708 133158 -18316 -244207
9281 -244207 121204 -74026 -93496 -355419 -243646 59248 -268972 -139879 -128570 221084
9270 104144 268637 -7276 12945 -122009 81132 11577 135462 -190717 -170417 -85041 101720
9258 1854 143239 -314781 -290143 -127435 -86391 -106903 -186298 30740 -222676 -164059 -365433
9247 -365433 -161679 34940 -256504 168296 55772 74212 -182731 -110201 -119783 -119274 -6749 241193
9234 1487 -253891 -268690 -170263 -211600 159014 -60703 -245463 72566 -251836 252730 -342885
9222 -27721 -228767 -230866 -159166 109849 94483 26621 54484 -46686 14836 58745 -348548
9210 337352 -115557 -338993 -33097 -87657 -1706 -112938 -82132 -85464 46533 274289 2044
9198 -184755 -279298 -384603 -55636 -34733 -131451 -216453 -84445 437184 -63219 -83534 -4546
9186 98366 201527 -281786 22910 -330310 180055 -12221 -193360 -245711 -321699 -230522 172561
9174 -17832 -323332 -56580 161132 -375779 186383 -28432 -210475 -182948 -228204 98779 -212813
9162 -107017 -191915 -99326 79900 67688 -171569 -179055 102836 -407887 -45228 -97035 -114875
9151 -114875 -42444 -3278 -201118 -262673 -34375 8351 -227396 6064 -209658 -109187 158443
9139 142198 -219411 -164883 14785 18718 -77149 -138897 -444 -408836 -326370 27317 -180611 -184982
9127 -184982 -154874 -121332 -216120 242911 -121283 -117464 -408401 -57415 -183875 124176 -156785
9115 94225 935 -502521 65661 248491 -83780 121026 -66266 -3065 -88714 -265592 -16026 -181216
9103 -181216 134447 5047 -35771 -277085 -143820 5010 320183 131101 -3633 -114019 172712
9091 -360718 114480 11623 102800 -114524 58283 140363 -65538 -45441 192765 244425 -56489
9079 -46413 -142840 -199397 -59692 21120 -200615 74014 94018 46200 -23202 57158 -116909
9067 -28476 -247612 150464 -86742 63376 -282218 41210 -79718 19280 -192698 2490 -64319
9055 16403 -80609 -224458 -272932 -339670 -159979 195641 -201078 -144641 -94497 27804 -79922
9043 -152490 -24144 259811 -9862 73230 -42724 -261821 -160381 -96249 60522 -84192 448351
9031 -185304 166080 -147774 171207 -114412 13765 15200 -158565 -285317 -91053 -42927 -6490
9019 -63114 -87076 -367143 -174362 -45683 -291599 -35220 -132522 -28968 88357 90235 -219601
9007 -106302 33308 151018 -129394 263936 -77920 -63368 81938 -104353 53880 -366389 -122482
8995 143285 90764 -80331 49774 -184022 105788 -85878 -6943 23031 24791 -291084 68639
8983 -55284 -196592 22296 -196661 -266999 -137699 50694 -111459 113788 -99270 -59282 188
8971 283616 59026 -18673 -74577 -192554 -149103 33969 -54902 80585 68442 -205177 -170676
8960 -170676 142027 -243248 17185 -105990 -17355 -229886 -7383 -85128 -14668 -218923 228146
8948 -35722 -148301 -23521 -248356 314272 -162757 -224613 206952 -111583 -42616 -68214 -60344
8937 -60344 43900 -89920 -447082 -252179 54506 139791 67695 -88808 -62442 -43260 -195984
8926 -195984 -82079 -47816 -25189 117625 149859 223203 -249267 804385 1868757 108444
8915 -42765 107759 -204852 -168226 -240774 135661 -26858 -76606 96343 233300 141733 -103408
8903 -29185 -201596 92956 -190392 -96584 300228 351518 -223766 -215888 -1047 167839 132586
8892 132586 311240 -193871 -66318 76363 14256 -27175 -146875 -103992 -31675 -21828 -123733
8881 -123733 -49361 102324 -362545 -147911 31842 -380464 226740 429579 29940 -213402
8870 -218638 123002 -430696 -175202 65046 -112995 -111264 161402 203076 -26640 -5645 251194
8858 -301391 -67344 116903 116463 -173171 133943 47372 -111813 119153 -68361 -1379 10264
8846 -241438 96361 -250957 29854 -136822 -104643 -69287 145411 255537 -133909 -230901 -75302
8834 -80719 129433 174877 -33191 276826 -150368 145113 -337542 84760 -120524 40470 -6263
8822 -145132 -180875 -178427 418453 -344509 3604 -84413 -56644 -277223 217922 173103 -119027
8810 221267 -120087 21146 278195 -191359 -83206 169738 123776 -349355 158164 -52100
8799 -18237 -106649 -284246 -175461 195465 120560 -286338 -35409 -66726 -90192 -104486 129813
8787 100695 2083 233941 28712 -173190 27487 108320 -208036 -201272 180056 129090 -70305
8775 -64244 -19211 -195444 -27461 -97625 -87860 -141948 -57655 -408670 -191464 -289801 7828 -105573
8762 -117305 -30362 -83694 -173616 274596 -105928 98630 84322 -67789 228233 -267427 -156786
8751 -156786 -32480 -160802 -168208 -187733 223209 36786 -445005 127715 24718 3930 -299805
8739 -155012 116905 32609 306832 -60003 -162417 -110893 94273 157056 170178 -609 -343904
8728 -343904 -53094 -202486 -391824 -362743 64120 467 48644 -179461 -48636 -291957 33112
8716 -265560 236373 -448757 103034 176312 89672 143033 -238369 -89589 268297 -271938
8705 -145708 -30977 -326547 -333247 -33357 394381 9830 298756 -209455 -273383 -307486 -210385
8694 -210385 56661 -8649 179225 -246551 -143611 5844 88079 38653 -253755 -59924 -444655
8683 -444655 -13937 -218014 -639976 -28077 61168 -178060 150498 -6097 -99208 -31225 -25129
8672 -25129 -126261 82879 -178245 -156286 160712 13332 49741 -14548 59001 19344 -252802
8660 132527 -46157 -27881 92505 -90510 55402 114680 21734 -134362 -316035 -95753 156542
8648 171871 -292279 245876 -317005 -191030 3377 159194 204082 152220 49173 244023 6129
8636 29399 140810 -15880 217098 55412 -419579 -300781 85721 -186408 -269271 113942 14229
8624 76219 -292238 -321848 31694 -138456 -135520 -32322 -175050 -186766 -97379 198502 -160358
8612 -42364 -162076 145037 -158208 -113437 162785 -42861 -4867 -130447 104105 -27380 -475865
8601 -475865 -360806 -79058 182648 57611 74672 -122417 155341 -281251 319716 10443
8590 41818 127041 130742 -47168 317853 73264 -7880 42384 -419473 107465 -295142 -125578
8578 -201164 201416 -290485 -123729 -159022 13827 62025 84780 -34154 -159636 -266207 126538
8566 -99047 -382093 58004 57522 -87917 195947 111770 -250244 -367106 -7010 120405 -31691
8554 -234 -379311 10135 60882 -291553 -56300 -174119 -3485 -290248 -28714 -92687 -35572 -30822
8542 -30822 -192562 -81179 -238353 228758 176485 -113484 -117804 -356147 -11831 232856 152452
8531 152452 283792 150613 33292 99580 44436 -133919 -63257 -55902 125413 -81884 -36923
8519 9396 30322 -5688 -374937 -242926 -189945 -9281 -98215 -189437 -12762 -288432 -107451 2332
8506 75136 -165007 3518 -39548 19093 -134013 44587 -229318 -65966 -55898 -34094 -28258 -98677
8494 -98677 243227 -24177 62927 -386771 108902 -251078 112745 104171 164055 -205361 123821
8482 -337543 127972 -223523 147669 -218575 -57636 -227766 -36308 -185990 -361588 -176 134677
8470 -532362 -41903 17259 340838 -76774 -312238 36342 -24107 170977 29788 -43458 -250771
8459 -250771 -152841 179894 102147 -142805 -41507 -306063 46088 44309 -208102 -104976 -29514
8447 51304 -301052 -57022 175734 106268 -177325 -247010 99236 -221612 -256684 -230066 36688
8435 -488052 142644 -151070 -200221 -190725 -231503 -179122 -306369 -277013 39969 -186423 -325073
8424 -325073 -252064 99256 -159676 3405 51556 -127201 86223 -64711 -109085 -118267 -77187 75755
8411 8792 15776 196435 235406 -143260 214051 -157199 58503 39410 8702 -494622 -85838
8399 -293343 -184366 303198 -200950 269643 52377 -68013 -70551 55136 -99012 -57466 196002
8387 -26929 282643 139788 258044 -152236 67133 26179 -273566 -141131 224777 153914
8377 153914 250676 -145082 -57008 25610 -166883 -192894 -266077 56180 -111870 196644 -200273
8365 154790 104175 -152243 169614 -189332 399323 30131 -20255 -138484 182851 -203412
8354 -160259 -5941 224297 -71164 -231977 -120402 -95940 221963 -43956 53062 196685 -114154
8342 106965 -57872 44088 4838 298347 -313369 279175 -260224 -196183 85444 384276 -264079
8330 -361547 -86386 -210853 -285782 -137125 195459 -109540 -65295 49685 121116 -212589 -29372
8318 23062 24698 244569 -167624 -137362 -207210 -118344 47393 -132472 -249626 191700 8988
8306 -342090 -104921 -5320 -255613 -90144 133222 140187 30665 -303702 -194375 -29838 -3149
8294 -13766 -216613 -84252 50231 -175488 -156189 240180 -50057 -70209 -348682 -348731 151190
8282 9223 398283 -148745 211259 104322 52157 11481 -137945 197235 -108813 12663 -368140
8270 -124627 -123731 -243486 -121684 -273641 86242 -169042 7035 -51595 268158 -46045 -29285
8259 -29285 -178531 18217 -198971 -129920 -144006 111713 -4684 36240 -26101 -211935 -21305
8247 -119978 58225 3457 286642 -20700 105176 -202406 38130 -278547 -15637 129875 52825
8235 37057 6317 93305 -14915 -207125 -232930 -356241 -209613 -176771 -112501 -380922 -485267
8224 -485267 181445 -23993 -282591 164590 96396 93847 -232219 69053 37264 -220586 108066
8212 -223574 -38197 116680 -390507 350954 -122484 116779 -90987 116972 -102899 -288421
8202 -288421 -503878 -226728 58081 245485 -163673 51580 4891 -83606 -369831 39664 -145987
8190 21992 32928 -200744 -55810 -267237 31671 212438 -13492 39913 206346 90592 63875
8179 63875 19874 -26037 -250272 68213 -17172 -157880 76438 -372244 121958 82859 -148195
8167 -245963 105847 -19248 -49231 130036 -396590 130060 -98269 -264016 -11180 208787
8156 -159677 -188771 -237769 -201734 -84958 259647 -327884 -76629 -30420 127285 -228554 -32340
8144 72362 -148491 -33784 -168262 -70897 -195377 -162518 -164870 18215 87320 121575 160743
8133 160743 -256820 -154112 -445735 72762 -163489 -203432 274709 276721 29740 -169385 58708
8121 -125808 -55480 -150783 86632 35739 -140863 46877 -102076 89752 -463053 -312328 -26717
8109 -246689 325706 172972 44234 87829 132010 -250734 48651 -231969 189189 6357 343144
8098 343144 55026 -385144 162351 93762 -223334 168951 35965 -1353 409545 -176571 27397
8086 123697 -116423 -40092 -275448 -413551 94566 -29724 117842 95595 -191371 77290 187051
8075 187051 -75156 -90311 -146841 155272 145570 -126821 33124 119405 -36047 -112375 -23037
8063 30921 -234507 -163659 -61 -173786 193339 319117 76204 -33509 -7512 114404 347238
8052 347238 163546 84326 -330158 -40542 -351083 -18550 96871 -25931 154620 -13869 -276379
8041 -276379 132215 -219512 -109270 118583 -429447 54634 112554 178506 -123174 -104908
8031 -104908 -17090 -44193 -98496 38300 -130137 139851 -413970 -66490 -21861 -12602 -25584
8020 -25584 8056 -87024 -195926 51310 -412977 -136301 -106056 -395856 286436 -300339 -390630
8009 -390630 221110 -80765 91145 -171949 -77368 20417 -132725 72354 181445 -20794 -162893
7998 -162893 293882 13732 8121 -129021 -96670 -109324 -32139 258873 275342 93216 -123278
7986 -331307 -307385 -193365 -369292 67999 -131389 -58142 -163141 -81025 -80734 -58026 39576
7974 -56920 283309 -192135 -144985 74381 -300191 148125 -215509 157673 28973 80059 -47131
7962 34664 -91783 -128536 156379 218279 206060 145259 84094 -241471 302504 132220 149116
7951 149116 -244262 -101274 -10701 -84022 -129719 -74961 128083 -121810 -101406 -219258 -72177
7939 24074 -51115 -220248 -221181 -127672 172535 -57008 -243672 39510 89352 60031 -156832
7927 -138825 -163605 -92801 63968 -155880 -119446 237950 -108144 37367 142356 -80913 -191865
7916 -191865 51841 -63004 32898 -133831 -154802 -283210 155761 -151030 -55894 -210050 -391979
7905 -391979 -60560 -121729 -40782 114391 -26912 63791 -447508 -199581 -233662 -164781 -266045
7894 -266045 217524 -51487 -13863 -63131 -110078 240 -39900 37370 -211973 -164677 14742 110696
7882 110696 -51053 -337108 115000 513467 128799 -271674 35125 -102796 -105366 -75652 -218438
7871 -218438 64520 328452 -30049 102974 264896 15496 253663 -1083 153526 105413 67646
7860 67646 -9026 -51349 203059 290199 211459 37849 -341624 -61633 37968 58293 -119564
7848 -272344 61682 -245936 -174855 -260977 -62641 -24066 42729 -313601 147632 -52481 -303406
7837 -303406 -22293 -97699 -121644 -851 22109 102855 -239015 259937 -90043 -117426 -328938
7826 -328938 -393674 164468 173013 134382 -206231 15380 -26476 -215313 -43178 -163572 121444
7814 160737 -66740 -387184 -63411 -217958 -55555 -87777 -91279 16325 -122656 126993 -184095
7802 186724 43124 -228299 39937 -155208 -125100 -117160 -213081 -24670 157664 -265248 -85208
7790 996 153453 117158 -101001 59524 -53969 -138654 -230553 309593 -93362 -151370 142726
7778 -201183 -277952 -265548 211059 322057 29084 253273 110406 24926 -3851 200301 90380
7766 15871 -267114 184312 -2604 142139 -114665 136430 115661 -154737 -145477 -261368 362102
7754 48500 91860 314068 -25488 -153672 -62324 -76359 -39251 95539 163488 -177133 -85886
7742 -132391 -386209 145795 -152827 -4456 -20568 16055 -59061 231758 -259474 111276 40944
7730 -148717 256379 15580 -132065 -25701 58621 -187860 -281920 -120288 -99945 -217517 12774
7718 2243 -370017 67081 -207586 -152118 17504 202008 118691 -189765 147036 -51331 -217413
7707 -217413 63792 612912 166107 -16488 -95066 -56218 -267347 -56780 -79844 135810 241234
7696 241234 5278 166442 20460 -284397 251011 29273 -18746 114837 176570 -166351 -46611
7684 58593 -226438 -207264 -175885 -53481 -30290 75538 283146 6642 -51676 -58752 206376 -50985
7671 -85244 19404 -26119 -311413 202900 -48479 135638 -19769 -99106 -27699 -198142 226506
7659 -260367 -175699 148308 173242 -52785 -168744 241461 -8092 -89745 -88949 -60039 -27301 138916
7646 -31267 13571 51224 139154 323447 94550 -335354 -332330 -286887 16774 54237 45327 98863
7634 98863 243363 -210450 130065 6568 109119 -128886 -43198 36996 -99024 -221647 108119
7622 -285686 -42146 10931 125276 -98248 -77549 -315901 180457 91920 -53040 -85618 -58769
7611 -58769 12943 -75193 -241306 -45091 -154956 123289 -144897 -28524 -142051 -276028 -173119
7600 -173119 169161 58770 -270226 363383 -46088 -395199 -239760 -217009 74851 -380667
7589 147876 -378341 -75178 -144820 9170 -152 -26087 -204792 -246483 -51126 -108922 -56954 -203688
7577 -203688 -308333 -96271 160390 1678 -117846 -336378 215015 -172173 -54572 -8916 87489
7565 -95685 300050 -24177 3291 -422685 58344 58385 -51771 159610 -1253 144776 43939 239458
7553 239458 104771 -167925 -78651 -156225 -66738 -43225 -198956 278978 100944 -101874
7542 -159195 -83134 -4943 18335 132909 196869 103529 -39758 105356 -34061 -85416 -83848 -89102
7530 -89102 204794 -15009 92226 -322787 -194456 -10332 2480 -12884 42613 34929 56635 150546
7518 150546 30210 202413 171475 121310 -68934 -227959 179056 75033 70286 -265421 12080
7506 -93322 33184 -47739 -1401 103870 131122 -245628 -57037 149442 -182413 34925 46547
7495 46547 428 22410 578969 -123140 152156 -224157 -106024 -361410 -12843 173146 -73594
7483 314889 -249945 -108937 11952 -28742 -248453 -285186 -168403 -215236 146643 -112666
7472 -46871 -135582 -379837 88832 -198596 114325 -153001 113812 -374286 -9575 -49795 -93252
7461 -93252 13573 -19101 201073 -65592 149261 123536 53712 -76865 143356 -8602 -210177
7450 -210177 -139212 105039 -231391 90035 144186 58075 -41928 -135444 -168778 209397 39653
7438 -84778 -292938 13432 -113422 70580 -394706 -181550 188993 13078 384579 -173354
7427 -85226 268494 -237767 3574 -50381 -92845 141282 -40191 -179973 69720 -164545 24585
7415 75053 113331 -5286 -110045 245502 38419 51652 -152489 -119936 -93151 229028 184307
7404 184307 -288158 -193475 -360889 -66805 58217 117186 -964 -146270 331671 160360 -168802
7392 -98191 -224942 130568 224614 -8183 -153880 -133783 -382625 283326 238903 -165346 82814
7380 -284556 -36686 76599 -119815 -86765 -97783 -126094 383089 -55082 4930 -145505 -138251
7369 -138251 -389986 8027 -36191 -107766 -229301 -143787 91414 -98632 240998 62677 34765
7358 34765 -243148 -223268 126985 -279191 -74311 37984 -120505 -32159 -97703 129812 -175765
7346 -120611 -81104 162076 -9876 -287451 35939 -251978 -11871 158790 78258 52219 -53606
7334 111960 272263 110942 125686 -224970 -110636 -355396 55569 21314 -123555 201773
7323 -86271 -84388 -51405 32930 -322491 119073 127403 54034 116856 -69052 203150 199376 -127041
7310 144526 20513 -8627 -260590 143054 -131575 6102 -119867 106327 -319085 -152417 -341524
7299 -341524 76526 12673 55432 121045 -31464 -314393 -9806 -190743 -171331 -107610 199087
7287 -162167 -123812 343777 29925 -34037 29623 -10443 9593 -327254 28829 124274 15779
7275 77293 96543 69044 -174537 -130629 93958 -34265 -227081 -200344 -54630 -350335 284149
7263 161341 77255 -84594 188197 16206 231381 -61539 -241551 6003 -256727 -126815 -299160
7252 -299160 -57581 -140935 -5657 -33816 219388 84290 -297798 -93872 91020 -24534 -48861
7241 -48861 53281 124132 26637 215153 -116993 191172 -233197 32802 9180 202942 40926
7229 133591 -121379 -217396 4932 141471 -77207 -8959 -352148 -11219 515457 41574 -156043
7217 -229959 -76715 201389 24580 -178155 -188689 160341 154276 7657 -74241 -85729 51449
7205 190460 -264206 40454 114487 -85576 -178482 108905 89861 26245 62017 7587 -24765
7193 -34083 -172336 95855 199844 18195 -61953 -146431 50023 -167539 205620 168360 -202639
7181 -61199 91393 337724 51861 86123 116261 -115957 111538 89122 -273965 -47125 11138
7169 -355390 37671 -79964 -311621 1894 -211963 137065 3943 27121 249455 208036 91519
7157 -244198 -30614 6664 -222831 -159822 -233145 -38535 -259135 411267 62816 -86738 -67714
7146 -67714 6371 -370805 -69076 170539 75945 53693 -119778 -266607 -119119 -416332 330396
7134 -47099 37274 193692 221596 -27145 -59536 -132230 366408 -77797 -137936 -297217 -20982
7122 378152 -42061 -19085 19177 149277 -309229 119036 -27058 -65191 354882 -81375 126737
7110 -49396 -75094 -33326 -182856 -15773 -79310 71532 -105775 -198391 -24984 -123728 -113694
7099 -113694 -34409 -295435 131795 190107 223678 -50174 -186821 -80009 70009 320333 -193461
7087 -226844 -155126 -139408 -276323 -40238 -263389 18897 46540 -283132 208691 70621 -204558
7075 -377676 -120409 -85911 -102650 205063 -299074 -55564 -33231 -104099 -124532 -147216 291572
7063 -45850 -61953 78007 -121626 18603 54835 -23910 59301 70962 42781 21406 162151
7052 162151 -193926 -174078 -147968 -155548 21941 -91574 -31607 198850 2680 -137564 -44241
7040 43512 108395 133220 -15847 21974 -394234 115133 -160302 214879 -109644 -147140 86145
7028 95288 -47318 -67090 -168657 177944 -214346 186091 -377295 34138 -98886 -69972 48913
7016 75284 188912 -201706 -400570 -435681 -174871 43706 18457 -120633 -5320 109152 -17176
7004 131029 16767 26417 -45412 196923 -99772 -230415 245659 -120632 -123652 -227349 165260
6992 197307 -179862 306730 77761 -10978 -107955 -39146 262715 168311 -154580 -5034 109775
6980 223347 -82899 87199 360334 -164286 -59744 96958 -157085 -107492 43118 79831 -43579
6968 192228 -127976 229756 -234106 -98339 232314 268142 -227617 232151 -55780 -26166
6957 -1688 -70229 -186997 272278 -115306 85083 51253 -119154 -56032 -28474 178644 -42321
6945 -117834 -159751 -104912 -82777 -274454 121603 -147391 7289 106604 1547 69206 -89697
6933 -184919 269588 43869 -31229 -20721 -25275 -103824 136627 -206643 242765 -67234 -122398
6922 -122398 97507 -208469 -42063 -75279 40577 267209 -466213 -107729 -163941 196798 136926
6911 136926 110048 233362 -375018 162714 11077 -69847 -365219 148254 -70559 -158431 63002
6899 -43050 54916 -113655 63450 -61921 -211109 -197445 -271971 -110212 361985 -226723 63597
6887 50000 -146580 -258804 -151491 -80340 -19159 -7673 104414 -10178 202554 136501 175316
6876 175316 73922 451 11124 224044 -196187 89589 87068 -86953 5296 -39998 49958 -289730
6863 426143 99460 -15857 -35586 -71090 -385308 -137311 -31289 207954 -70564 168600 206596
6852 206596 -317070 24496 -10381 333454 68027 -139709 -56741 -259490 110554 -46517 -137140
6841 -137140 38092 -134670 82434 -62425 -357478 115334 81282 34054 -69512 61381 63589
6830 63589 -251901 366117 16115 -175486 24660 101482 -180916 248046 28805 -235812 -55349
6818 491525 -160601 191406 31436 -31924 108286 -311638 257575 -125453 -289051 -127071
6807 -23614 33523 177570 -147240 174596 -219581 -169766 -143613 196759 -154090 -437225
6797 -437225 -108647 -303529 382583 346519 163221 -9706 -48998 221567 -230169 -92037 -81537
6786 -81537 -22340 300853 29803 234807 165330 475366 -59421 -169942 13242 175064 -322792
6774 9768 -157997 -22471 -172536 -93769 155806 -239329 5110 -120377 46162 313828 -269504
6762 181777 -127860 221262 77903 -25483 -61068 -5197 184140 89037 8038 -109843 -124 -15474
6750 -15474 -192225 35051 -289886 -266491 115283 61305 -384163 -34892 -45374 15926 326330
6739 326330 -253498 -32568 434701 -395186 150428 124581 129135 -66169 -119725 -5834 45685
6727 -77428 -238399 -301959 -228472 31577 33375 156032 83154 -109684 -283192 152961 -134489
6715 -42145 -227159 -184767 -133340 -35465 -23193 49498 -125686 135402 -253445 305468 -145491
6703 163136 -185741 114239 -25247 264637 -64548 -95789 -130891 -240387 -308322 -281523 -33790
6691 -40003 -101147 209535 17599 -499495 -328366 -165031 -246836 -248986 183281 -83921 35417
6679 155074 151723 -198595 156266 39105 229988 243544 -128715 -132024 -110823 77940 29608
6667 -6094 220180 45799 56499 -378413 100672 86644 75719 -206481 212242 199458 499105
6656 499105 60164 86882 -49378 128643 -72748 169818 102859 353924 -7389 338149 78598
6644 -260414 290031 60619 163675 26022 245528 204232 -301779 -139123 -141673 221558 -215640
6632 264590 20147 -320108 -247368 19526 -55516 -232073 -75517 -116114 -233818 -549236 -267995
6620 -133264 -188991 4149 47986 356084 -192322 -105426 -309574 154288 -191590 -36976 -157115
6609 -157115 -99287 -90708 -42669 293880 -57742 105020 112903 -25274 -143517 296942 -70256
6597 -64384 101538 -264048 -35370 122706 233221 -305978 43888 36573 61468 152318 -35660
6585 -212526 -21759 63525 1572 123625 141808 233898 194653 -97138 -82389 189099 -231875
6573 167061 48981 -286920 -9479 -297826 -267646 139473 -147643 138431 -131744 60020 131158
6562 131158 -36685 -81654 -187109 -280336 -110092 -120747 70989 113379 212321 108147 -16139
6550 299173 -28084 -58857 120601 80896 27554 74835 204555 15903 -201874 -29979 -237
6538 -189822 342153 -44380 -65830 -73933 -249863 132486 -74523 -216733 -98249 131916 -93628
6526 240853 -356083 132160 -152111 -51991 151041 230778 -98443 -207047 -13886 -5881 -139295
6515 -139295 49965 -40208 101411 83509 292993 73137 -126417 -38630 -47871 -208916 75403
6503 253489 142939 -87457 -136491 158937 198038 -184690 108759 171935 -361020 234030
6492 -142878 -413139 70778 98550 -103910 15813 -104921 272587 -275112 -73127 146443
6481 256009 -162806 -69121 7795 -221665 -159110 56927 -210570 167083 -110962 -102463 44290
6469 105124 61623 -20972 -81426 -297348 116807 327618 -57621 207068 -135158 131117
6458 -162160 -111127 62031 187077 296920 351574 -29085 -128616 -133084 242989 -191428 -134309
6447 -134309 295438 28192 143088 275246 -140333 -144595 -40501 -72123 231902 -409112 -60517
6435 61210 -7566 24472 -72756 180865 440 -203856 23083 -101026 267889 -244104 -50486
6423 42436 9927 -33474 26026 363108 144834 115140 -139812 -118448 -76798 207860 160307
6412 160307 -118923 -359572 17001 49246 -250233 113723 51342 -129229 -47496 -76689 16906
6400 -20141 -194180 10146 -45928 111998 -166934 63543 -52004 -166192 -372263 -295368 14121
6388 -259168 328993 -189461 -125350 -76030 -84721 154009 191666 205735 -194392 -99225 -105156
6377 -105156 -25931 82902 -127413 -183566 149386 145606 69520 -50864 -18826 120819 -4441
6365 166053 -67816 212791 -185239 42553 77238 -348297 -330930 -245003 -34564 -11260 -54718
6354 -54718 -176183 61034 -233768 -206739 28070 86799 -268333 119540 -232505 327829 -82253
6342 -156323 -1509 -40354 -288137 243365 -98438 -105929 -17599 106253 -435616 -274267 148455
6330 47850 531420 116350 -77413 -7263 -304532 -265504 52090 -47771 65895 85365 -223751
6318 406171 -234615 212796 -244989 57629 30266 -58461 174979 -171016 51497 233185
6308 233185 112060 -170668 1736 -80543 -3890 92648 -212694 194045 -68663 -216554 -153794
6297 -153794 -88830 -188099 -42722 255240 -198181 72378 -53408 148718 268681 396118 -25009
6285 873 308044 -207 23673 352697 132344 -108656 205622 134292 -91857 -90520 -189857 73119
6272 93108 -473919 187587 -45663 -297274 -385013 -17401 62929 -224271 -241009 -159219 119835
6260 -65391 28245 29925 176204 -82243 353366 -178312 -119828 -415233 -39682 322455 -3387
6248 -68731 -61906 -82449 10955 -26943 -287610 -7753 90502 108288 -174980 84860 157238 255065
6236 255065 -102314 -261043 -370105 26469 55902 -119133 -122020 -54862 -30904 -457667 19545
6224 -102992 -134720 -546638 427469 -324888 -153042 337332 280496 48132 126089 -71126 -154628
6213 -154628 -282978 107307 -134993 -52273 179923 -150490 -51454 258466 -204580 169355
6202 -44438 3876 -116723 164438 236508 112591 -123316 -40903 206263 111082 -222431 457388
6190 -300020 209835 -12126 -132157 -252903 -140384 -80847 -221790 -65796 -115679 -274913
6180 -274913 43706 240474 10847 72598 88107 -234920 109030 -10632 -43445 -165155 -293656
6169 -293656 -43268 -99541 84976 -169111 -193048 25904 196215 -299817 -120295 75120 -238778
6157 67007 -123962 104603 139252 105841 19579 -218455 -236782 19248 33147 -483013 62926
6145 -66034 181337 -32792 -88117 -251864 -173248 -125036 3758 -122336 204341 -60626 53956
6133 325506 -211641 -22226 -150176 -139074 439511 -219035 -48378 -316928 44034 -33230 8486
6121 62236 76129 -41618 194443 80220 -624 -280958 106030 146043 -87164 -83521 -78288 122212
6108 -335393 -173882 -69524 163069 -487877 227292 -321101 -26231 -81820 -121215 -91026 85241
6096 320134 -12911 185732 -268138 -328405 175051 146312 -259804 130452 -77770 -182789
6086 -182789 -6097 2698 -405 157074 89034 179099 -261415 -11571 242234 -138649 253068
6074 34824 -90898 -221230 142539 83527 -301216 2625 -346838 -362206 -61449 44903 -114040
6062 -67791 -32882 112534 -144032 291579 353700 4393 -5355 358132 -23983 78726 -12310
6050 -2351 -211912 -230274 146130 3042 -200250 -56954 45178 -189926 66826 -60099 42519
6038 1707 -104328 126330 -127835 267189 -167817 -3388 -314146 515020 41434 -113414 52231
6026 225977 186323 10561 -265134 59082 206163 -86372 225778 150894 -65266 36234 -37258
6014 187411 -79827 224382 -50671 126772 -349546 -252232 276209 43190 -234242 -332753 -372689
6003 -372689 179292 -109595 188607 100927 -353471 150936 -141211 32933 -112815 81846
5992 424820 -72128 377872 370084 -265269 -136856 323298 274737 -177692 -52199 34904 352970
5981 352970 -132794 130274 203328 14847 16255 8828 -42397 77642 162909 125658 -281902
5969 -278362 -295659 -48682 -339626 -68014 128389 71343 223204 -250552 -79892 -138873 271731
5957 31810 -141088 162246 179506 -24311 -16360 89888 121595 286820 73064 -69265 -75119 -36378
5944 -64418 -158330 -121036 -53964 321836 -171214 -53479 119598 124429 9884 178738 30716
5932 70419 149325 -126698 -182357 -108006 106280 -159584 -121658 -35597 125448 18997 -833
5920 116136 235832 -236462 -60338 79974 43835 337784 89129 237897 -48827 28157 -69004
5908 123554 144252 -83003 -122687 -171085 192495 -118989 159927 -219604 -100521 -134352 -171511
5897 -171511 -148675 -254133 69785 -4850 -52416 -296006 -229221 -239471 -8278 -337418 97887
5885 -43795 244579 350503 231749 450022 -173121 192507 -125056 133072 -26992 162229
5874 66703 -168887 -114725 -899 -162739 125347 -261031 56931 267276 98904 -91417 -126169
5863 -126169 -457149 53656 -112329 -48347 -53339 163786 141404 -279044 -188918 361080 239958
5852 239958 16100 -137951 -124290 -144546 -61067 -186261 15757 -93800 -8273 -48716 220941
5840 -122599 127562 -96719 174674 230500 -133990 38909 -104015 -229827 -133779 -97912 39195
5828 49155 -26070 37403 138485 -130373 -188768 -323110 -26925 -172044 -126252 -133633 146085
5816 -72926 186508 121985 180956 -150106 41578 -180758 71390 -296297 6180 -321062 -159800
5804 245156 -191776 -229122 132666 -11875 -217668 5418 12291 218825 159220 334054 153596
5792 -93668 178234 778 -77083 48185 138458 222408 81898 -160079 -147294 -94499 241575 -236386
5779 229438 -303575 -57937 38446 -22537 204236 164729 76204 -4457 300056 -123231 -151528
5768 -151528 -238936 260144 43121 117631 22044 -95884 -195 253350 -40254 111087 -220211
5756 93154 27887 159537 -76165 -72728 74359 -129004 -153086 -107088 21065 59105 -77344 60617
5743 -238232 57443 -145235 7642 85165 73253 8447 71946 99201 64772 -140477 180645
5731 76738 -248289 133676 56940 -9345 213692 8513 -16446 295677 98745 -168608 -67374
5719 -54837 -193114 -168043 31393 15205 -174910 -206321 138945 -130248 196722 99618 34699
5707 -194518 127511 66202 99307 70030 -126049 -123443 -85037 -124853 70783 336440 131910
5695 225841 -209172 89875 102409 -108859 25084 -106852 -222562 -55489 -130730 6781 -80212
5683 -8362 -275256 -37163 40772 190075 -146559 -79731 -158876 -76171 114777 137610 -197340
5671 -272573 55883 40933 -117614 -202379 34013 313834 -109411 -147377 262635 -130345 -10850
5659 -98744 -14013 -89649 86283 107269 -141328 337361 140828 88321 117678 -110087 182957
5647 -88884 -237845 215388 133329 -162104 -2080 -88312 293551 107660 -54735 -284768 32931
5635 371123 -101464 22807 -85524 -351479 197883 420355 114359 52127 -88276 -150196 135643
5623 -3833 107753 114554 -178125 70127 225018 6741 280914 -40666 258943 55080 -42368
5611 243852 -181265 -167956 -115281 52054 -184074 20121 -57440 286100 393564 118893 231898
5600 231898 57644 -156713 221043 63648 -150383 261272 -240579 246537 -114833 124243
5589 60326 -235172 -376945 -28188 -76777 -181655 181218 -77114 68445 406392 -94661 75036
5577 -117818 -18398 148177 45640 -22622 -211997 -244741 -340564 137757 -182868 160558 5910
5565 -113383 -122211 117615 -207541 -45046 -48887 46839 379031 -33450 -5615 -67578 292630
5553 320960 286972 -8628 209436 170182 239493 233848 64118 97550 283154 -247355 14342
5541 169411 270840 156777 171668 -160291 -74446 97827 -20214 -107533 212783 -251614 -76738
5529 -11109 -358562 -35071 -208317 -96724 -209847 147942 17504 -233265 -33291 -33809 105747
5517 137285 -173716 356339 100541 34010 228681 553882 231320 134244 -118862 31782
5506 -132243 -174362 -182125 26915 -4008 -50782 -163720 177649 56628 148492 -296440 1936 70274
5494 70274 -224915 -72419 -288973 195374 36644 187345 -66166 -12891 -63888 119613 100599
5483 100599 -219444 -199660 -184 -176060 179132 -263571 -87347 -124472 153491 72634 118864
5472 118864 146775 98727 -292432 -226814 141179 166384 278250 92489 -19982 -113984 -234294
5461 -234294 159201 83250 -278482 -25200 -81752 189321 275022 154572 -3411 1672 -85329
5449 71637 171628 127537 -68975 103358 53572 312244 -49744 -57339 88672 20847 171511
5438 171511 10867 -2351 -249917 435726 56248 -78205 3839 -88131 79368 73284 -76704 87260
5425 18014 63873 -69329 14364 -156388 49523 -22429 -282785 137774 -196587 126437 36506
5413 -51091 -332925 -261321 -80363 279055 -363517 -86332 218812 -155720 18667 -39168 77578
5401 287763 13812 -28605 -51357 54214 -48024 -152551 -34353 81504 -13342 -6267 -27622 -9435
5388 -162789 -174512 194669 -152537 164071 -98361 347414 25690 -273608 212421 78272
5377 -109217 -66332 -32461 -53336 -146803 88563 29998 11169 -179106 136891 136932 26928 65927
5365 65927 242347 -7116 141962 117372 282664 -129835 -104753 -9701 -47008 103099 66284
5354 66284 17178 -214705 -277925 -71320 134481 340464 275019 -109821 13610 -157860 -6277
5342 59125 339636 -211389 -47647 277168 -282291 448119 -266366 153642 -141526 -9104
5331 74052 152162 17441 -197144 169483 -61630 -47262 -67240 78485 278576 270424 265726 -184107
5318 -102234 58669 -204464 289501 -241786 26115 -242281 -175926 -141055 164836 58111 274457
5307 274457 51849 -24324 -172268 178370 57760 -95311 -61481 -173130 -36926 65882 -219343
5295 273603 142960 203340 244708 -90233 -79384 -131892 116220 133204 -34347 208597 -338625
5283 73611 67268 -159743 360343 30327 -239292 -103654 -243815 -16932 455264 162496 125958
5272 125958 177288 -162933 55777 76182 -59828 -3377 -135021 -101051 -199972 47623 303075
5261 303075 -191742 -185390 44956 -354236 -262418 -299030 -47449 53045 25765 -192347 -183643
5250 -183643 -142589 102865 -102147 -283894 61413 32809 -148150 121144 140772 -3763 162176
5238 176347 -61453 81473 -126850 -252149 188419 45655 272539 -22608 -23503 125407 -278343
5226 -318292 164488 1487 98376 -365637 -7846 343662 -26783 228818 128186 121449 -41887
5214 -144011 114260 396112 36201 -93684 -175624 203805 -262956 176154 96668 132533 -112590
5202 20509 -14023 48622 345157 69172 -105217 -171611 -285271 -213422 -209591 -17588 -126843
5191 -126843 105785 -40990 185699 329222 28377 -220000 285455 -163716 -49314 90634
5180 -218980 282508 -111373 -44740 4036 63500 -169752 -247433 210883 -86148 -46330 -71794
5169 -71794 72446 41633 94824 -23194 -25717 -108687 146258 -64085 31708 -146910 14273 -62833
5156 50498 230713 233603 37735 73686 112061 114343 205945 -124094 -99684 201530 29454 -43911
5143 232896 57787 -63720 -213062 -27426 -321026 -174204 -4678 -140939 -82017 171071 103852
5132 103852 -240049 -325411 116192 204965 129142 -150506 135651 106649 -124170 6344 -60680
5120 -39030 47242 -82155 47990 -210221 202162 -296882 253504 -69238 -239416 -82107 391869
5108 -28038 50838 -278946 -261947 -142541 -185274 -145706 -207908 -27594 66313 156697 36844
5096 -419 -57460 57197 184772 -40238 148651 285330 513110 -163199 45768 21394 -56209
5084 -46939 -407258 135711 -82029 386125 139249 16136 -64173 173312 -119943 9505 155070
5073 155070 110945 -95222 -103530 -278246 120352 -50685 -183656 166440 -184257 127101 -290534
5061 175307 -55422 244244 69874 -79350 226735 67783 -67409 79922 -141994 -292619 349730
5049 338655 -28513 29154 -109566 186572 87026 134766 -72725 -266818 294899 -255244 -151239
5038 -151239 166089 -134717 198169 163013 -235578 104277 -161989 -57092 -204609 -55249
5027 -1395 -88013 61093 173295 -39282 115610 256308 -195685 66013 226441 110895 163716
5016 163716 43692 206095 312369 -58412 65076 362071 161362 127500 279577 178196
5006 178196 48118 95057 120509 33855 -138595 -50812 -185530 78505 96550 27227 -98824
4994 -55630 61974 42486 128730 -115807 178902 224801 154128 43304 -119980 -127771 35734
4982 50640 999 -130567 -108767 156370 19932 177585 -131202 -272291 -72477 24968 72887
4971 72887 -51112 -57749 30774 -213334 181348 23180 156545 42933 -269779 -156117 -249594
4960 -249594 -238002 -122088 5817 52672 -37907 -245114 -44732 259776 15840 114140 4550
4948 55477 72884 -11811 -67202 -144210 84411 -70026 189 36186 257669 313880 292443 38754
4935 -28816 -187592 -105957 -159553 -220321 -25567 188023 349640 142111 -85694 -163973 89823
4923 9114 60283 7214 -190384 64279 45345 5803 200430 105782 -3984 112944 283186 -52968
4910 90868 -55487 67835 282264 -75914 301567 -104497 68547 -119722 -131929 -67671 30522
4898 129654 -288230 275081 74377 -125472 89447 11382 -74344 152855 -16040 103006 -100877
4886 -160221 -74207 -11569 264648 -292176 87050 -140895 -247679 71705 149045 79036 147250
4875 147250 -95267 -18966 5721 50460 191190 199121 11506 307983 210711 58811 116403 -170094
4862 -369738 252822 218000 38050 91873 1906 -106370 -65282 -93158 -285197 -85746 156760
4850 142433 36884 -53911 269077 -396708 168088 37821 -122598 -138510 41874 8877 156400
4839 156400 122675 188593 -73675 -148055 259431 53306 -70572 116886 187131 57092 95669
4828 95669 -101146 -163357 -254635 -174070 16653 -376424 -331444 -300520 345581 -276032 -255857
4817 -255857 -150968 133019 181596 117421 -257108 -245280 93553 144701 10497 -168211 50286
4805 45980 48841 -86915 34900 173305 255005 205915 -489901 106816 18564 -88607 141313
4793 -247959 15296 146318 339232 -90524 -46783 53782 -9625 22603 -116796 -166393 -31005
4781 125807 77877 237320 -52115 147685 11490 32161 27666 -231601 30218 246687 101008
4769 -108200 191377 -184244 -377340 285951 -128452 -137902 200142 -34835 332089 244645
4759 244645 182421 328473 -458546 217563 302129 122309 119505 -83579 -107392 220533 -255189
4747 320500 -73630 -127631 106225 126752 47510 -23276 -344647 -263434 123826 -5329 218342
4735 50473 15762 7562 -149574 -18852 95789 195500 -32805 432483 -38916 -30717 87084 -37453
4722 -406501 -149879 106977 168686 -74914 123461 38319 -36522 -195325 -85815 -65724 -14516
4710 -266188 -76642 50925 -27132 6885 60753 -141957 81693 -47015 -146200 159976 -61727
4698 -318709 179204 -81452 97338 131090 229110 -59796 -127753 -69190 16936 163404 216333
4687 216333 378462 -147664 255152 314464 12754 200942 -106450 -188858 219362 -134117
4676 -11475 75214 271852 532 42047 -125482 -202168 -39554 190364 303697 69462 -98124
4664 120252 405673 235288 65904 266793 -17945 -15987 -180736 -60679 101204 -132333 136237
4652 -184042 -46843 -113685 -166975 -261462 -312098 -79545 -231958 101429 -30785 -126737 252303
4640 -297736 262194 153570 199755 27187 -70353 -87351 17633 -2790 80540 324484 108472
4628 253120 -211310 -42307 -172157 -338664 20327 340208 -57885 156964 -253326 -9086 161867
4616 242561 2682 427791 -290114 -43214 68522 188231 147113 451245 -317542 281167 162615
4605 162615 170668 50317 105437 -105954 -80016 -31734 -134561 170210 232312 248412 393894
4594 393894 436849 -100724 11382 58756 65751 -167017 -54302 -123146 122648 -313022 210080
4582 -108917 -255691 -3653 -197563 -78034 180776 41986 -15636 195765 449909 -35043 -315717
4571 -315717 84271 -61707 63056 -54129 145470 -28248 174510 -230899 194973 -84599 192122
4559 -104744 20926 -127784 -314184 130224 -71881 58962 58674 70442 62792 272600 277866 259952
4547 259952 -161092 140406 71636 17586 217443 -163540 314699 -161979 -235255 -269159
4537 -269159 -303031 60294 -136442 144032 42747 -170167 -31358 -487298 -328644 -36851 289586
4525 -41881 -32585 -50356 -27098 -14195 -21616 46965 44962 83002 132883 -251513 -68620 14790
4512 15400 -11164 -94739 7947 68998 -2561 35717 -276591 73699 -237404 -23392 -135846 -184660
4500 -184660 -54376 125714 -196600 -10789 -186236 186567 -7050 180643 94153 -66497 449944
4488 3107 281952 347378 177913 -50761 -173115 188866 -173615 178045 199974 67673 -138715
4476 -123650 89139 -46508 30157 151534 213485 -224874 144156 -45283 189180 175533 -254306
$$ [...]
##END NTUPLES=NMR SPECTRUM
##END=
