##TITLE=NES1009_842410_9233004_osP6W4uPZL
##JCAMPDX= 6.0         $$ Bruker NMR JCAMP-DX V2.0
##DATA TYPE= NMR SPECTRUM
##DATA CLASS= NTUPLES
##ORIGIN= BRUKER
##OWNER= Administrator
$$ 1.72 TOPSPIN		Version 2.1
$$ 2015-06-17 20:38:29.316 -0700  Administrator@X
$$ Compression mode = diff/dup
##.OBSERVE FREQUENCY= 400.02188249412
##.OBSERVE NUCLEUS= ^1H
##.ACQUISITION MODE= SIMULTANEOUS (DQD)
##.ACQUISITION SCHEME= undefined
##.AVERAGES= 64
##.DIGITISER RES= 22
##SPECTROMETER/DATA SYSTEM= spect
##.PULSE SEQUENCE= noesygpps1d.comp
##.SOLVENT NAME= COFFEE_meoh
##.SHIFT REFERENCE= INTERNAL, COFFEE_meoh, 1, 14.96279
##AUDIT TRAIL= $$ (NUMBER, WHEN, WHO, WHERE, PROCESS, VERSION, WHAT)
$$ ##TITLE= Audit trail, TOPSPIN		Version 2.1
$$ ##JCAMPDX= 5.01
$$ ##ORIGIN= Bruker BioSpin GmbH
$$ ##OWNER= Administrator
$$ $$ E:\/data/COFFEE/nmr/NES1009_842410_9233004_osP6W4uPZL/12/pdata/1/auditp.txt
$$ ##AUDIT TRAIL=  $$ (NUMBER, WHEN, WHO, WHERE, PROCESS, VERSION, WHAT)
(   1,<2015-06-17 20:38:24.066 -0700>,<Administrator>,<X>,<go>,<TOPSPIN 2.1>,
      <created by zg
	started at 2015-06-17 20:26:53.831 -0700,
	POWCHK enabled, PULCHK disabled,
       configuration hash MD5:
       21 0F 79 D6 B3 7B B4 F6 88 20 88 DB 03 48 BD 9F
       data hash MD5: 64K
       A7 8E 6C 0C E1 5D 75 DB 47 32 54 AE 0F 5B F2 35>)
(   2,<2015-06-17 20:38:27.237 -0700>,<Administrator>,<X>,<proc1d>,<TOPSPIN 2.1>,
      <Start of raw data processing
       efp LB = 0.3 FT_mod = 6 PKNL = 1 PHC0 = 0 PHC1 = 0 SI = 128K 
       data hash MD5: 128K
       6B C0 82 DC 31 51 8C 4E 61 4B 48 42 82 F3 4F 11>)
(   3,<2015-06-17 20:38:28.128 -0700>,<Administrator>,<X>,<proc1d>,<TOPSPIN 2.1>,
      <pk PHC0 = -85.57251 PHC1 = 0 
       data hash MD5: 128K
       19 60 3B B3 09 4F F9 1E 51 2A DA F5 EA 01 50 EB>)
(   4,<2015-06-17 20:38:28.503 -0700>,<Administrator>,<X>,<proc1d>,<TOPSPIN 2.1>,
      <abs ABSG = 1 
       data hash MD5: 128K
       95 90 19 BA BF 6B 7D 8C 7D 4A 29 C1 9C E9 5D 47>)
(   5,<2015-06-17 20:38:28.612 -0700>,<Administrator>,<X>,<proc1d>,<TOPSPIN 2.1>,
      <abs ABSG = 2 
       data hash MD5: 128K
       11 AB 36 43 BD D3 61 2C 69 ED F9 65 ED C9 FE A2>)
(   6,<2015-06-17 20:38:28.691 -0700>,<Administrator>,<X>,<proc1d>,<TOPSPIN 2.1>,
      <abs ABSG = 3 
       data hash MD5: 128K
       C0 BB 75 39 54 32 12 16 59 8C B9 23 DA 52 9F F2>)
(   7,<2015-06-17 20:38:28.784 -0700>,<Administrator>,<X>,<proc1d>,<TOPSPIN 2.1>,
      <abs ABSG = 4 
       data hash MD5: 128K
       9C 34 6A 2B 5F E0 19 C1 62 E7 7D A8 EE 45 4D 68>)
(   8,<2015-06-17 20:38:28.909 -0700>,<Administrator>,<X>,<proc1d>,<TOPSPIN 2.1>,
      <abs ABSG = 5 
       data hash MD5: 128K
       68 9D 40 E2 70 B8 82 F0 9F 73 6C 77 BE 2F E0 26>)
$$ ##END=
$$ 
$$ $$ hash MD5
$$ $$ BC 58 58 76 03 E4 9D 36 E4 9D 21 81 33 7B F5 F6
##$RELAX= 
##$RELAX= 
##$RELAX= 
##$RELAX= 
##$RELAX= 
##$RELAX= 
##$RELAX= 
##$RELAX= 
$$ Bruker specific parameters
$$ --------------------------
##$DU= <E:\>
##$EXPNO= 12
$$ [...]
##$TP07= 0
##$TPNAME0= <>
##$TPNAME1= <>
##$TPNAME2= <>
##$TPNAME3= <>
##$TPNAME4= <>
##$TPNAME5= <>
##$TPNAME6= <>
##$TPNAME7= <>
##$TPOAL= (0..7)
0.5 0.5 0.5 0.5 0.5 0.5 0.5 0.5
##$TPOFFS= (0..7)
0 0 0 0 0 0 0 0
##$TUNHIN= 0
##$TUNHOUT= 0
##$TUNXOUT= 0
##$USERA1= <user>
##$USERA2= <user>
##$USERA3= <user>
##$USERA4= <user>
##$USERA5= <user>
##$V9= 5
##$VALIST= <valist>
##$VCLIST= <CCCCCCCCCCCCCCC>
##$VD= 0
##$VDLIST= <DDDDDDDDDDDDDDD>
##$VPLIST= <PPPPPPPPPPPPPPP>
##$VTLIST= <TTTTTTTTTTTTTTT>
##$WBST= 2048
##$WBSW= 25
##$XGAIN= (0..3)
0 0 0 0
##$XL= 0
##$YL= 0
##$YMAX_a= 7420671
##$YMIN_a= -16072320
##$ZGOPTNS= <>
##$ZL1= 120
##$ZL2= 120
##$ZL3= 120
##$ZL4= 120
##$ABSF1= 14.96279
##$ABSF2= -5.595392
##$ABSG= 5
##$ABSL= 3
##$ALPHA= 0
##$AQORDER= 0
##$ASSFAC= 0
##$ASSFACI= 0
##$ASSFACX= 0
##$ASSWID= 0
##$AUNMP= <proc_prof1d_extract.lims>
##$AXLEFT= 0
##$AXNAME= <>
##$AXNUC= <1H>
##$AXRIGHT= 0
##$AXTYPE= 0
##$AXUNIT= <>
##$AZFE= 0.1
##$AZFW= 0.1
##$BCFW= 0
##$BC_mod= 0
##$BYTORDP= 0
##$COROFFS= 0
##$CY= 15
##$DATMOD= 1
##$DC= 0
##$DFILT= <>
##$DTYPP= 0
##$F1P= 0
##$F2P= 0
##$FCOR= 0.5
##$FTSIZE= 131072
##$FT_mod= 6
##$GAMMA= 0
##$GB= 0
##$INTBC= 1
##$INTSCL= 1
##$ISEN= 128
##$LB= 0.3
##$LEV0= 0
##$LPBIN= 0
##$MAXI= 10000
##$MC2= 0
##$MEAN= 0
##$ME_mod= 0
##$MI= 0
##$NCOEF= 0
##$NC_proc= -2
##$NLEV= 6
##$NOISF1= 0
##$NOISF2= 0
##$NSP= 0
##$NTH_PI= 0
##$NZP= 0
##$OFFSET= 14.96279
##$PC= 1
##$PHC0= -85.57251
##$PHC1= 0
##$PH_mod= 1
##$PKNL= yes
##$PPARMOD= 0
##$PPDIAG= 0
##$PPIPTYP= 0
##$PPMPNUM= 2147483647
##$PPRESOL= 1
##$PSCAL= 4
##$PSIGN= 0
##$PYNMP= <proc.py>
##$REVERSE= no
##$SF= 400.020008920596
##$SI= 131072
##$SIGF1= 0
##$SIGF2= 0
##$SINO= 400
##$SIOLD= 131072
##$SPECTYP= <>
##$SREGLST= <1H.CDCl3>
##$SSB= 0
##$STSI= 131072
##$STSR= 0
##$SW_p= 8223.68421052631
##$SYMM= 0
##$S_DEV= 0
##$TDeff= 65536
##$TDoff= 0
##$TI= <>
##$TILT= no
##$TM1= 0
##$TM2= 0
##$TOPLEV= 0
##$USERP1= <user>
##$USERP2= <user>
##$USERP3= <user>
##$USERP4= <user>
##$USERP5= <user>
##$WDW= 1
##$XDIM= 131072
##$YMAX_p= 441929960
##$YMIN_p= -11073
##$CURPLOT= <Network HP LaserJet P1505>
##$CURPRIN= <$Network HP LaserJet P1505>
##$DFORMAT= <normdp>
##$LAYOUT= <+/1D_H.xwp>
##$LFORMAT= <normlp>
##$PFORMAT= <normpl>
##$SURQMSG= 1
$$ End of Bruker specific parameters
$$ ---------------------------------
##NTUPLES= NMR SPECTRUM
##VAR_NAME=  FREQUENCY,     SPECTRUM/REAL,   SPECTRUM/IMAG
##SYMBOL=    X,             R,               I
##VAR_TYPE=  INDEPENDENT,   DEPENDENT,       DEPENDENT
##VAR_FORM=  AFFN,          ASDF,            ASDF
##VAR_DIM=   131072,        131072,          131072
##UNITS=     HZ,            ARBITRARY UNITS, ARBITRARY UNITS
##FACTOR=    0.0627417313425164, 1,          1
##FIRST=     8223.62146879497, 2526,         -53998
##LAST=      0,             4678,            -53852
##MIN=       0,             -11073,          0
##MAX=       8223.62146879497, 441929960,    0
$$ Real data points
##PAGE= N=1
##DATA TABLE= (X++(R..R)), XYDATA
$$ [...]
60981D242176M48849N34833O38279P62461R11229J093150J317427J587110J902616
60972A3438130K262450K631543K893144K860867K395688J547294N72134k15088
60964B8386162o25403o52034l90560M1030M91358P44594N88638l4458r50209j848078
60954B5751040k472827k742093k718839k513354k217702j895515j589029j319624
60946H282057j090527q97727p38103o08389n03046m17109l48630k96288k56732
60937C125506k26133k02308j83728j68042j53368j39747j27764j16698j05410
60928A702308r4098q3829p4962o7352o1445n7883n6259n5341n4298n2806n0363
60917I93672m6527m1763l7104l3023k9318k5915k3012k0558j8349j6541j5294
$$ plain form
60981 4242176 4691025 5225858 5864137 6626598 7537827 8630977 9948404 11535514 13438130
60972 13438130 15700580 18332123 21225267 24086134 26481822 28029116 28601250 28386162
60964 28386162 27760759 27108725 26718165 26759195 27250553 27995147 28583785 28549327 27599118 25751040
60954 25751040 23278213 20536120 17817281 15303927 13086225 11190710 9601681 8282057
60946 8282057 7191530 6293803 5555700 4947311 4444265 4027156 3678526 3382238 3125506
60937 3125506 2899373 2697065 2513337 2345295 2191927 2052180 1924416 1807718 1702308
60928 1702308 1608210 1524381 1449419 1382067 1320622 1262739 1206480 1151139 1096841 1044035 993672
60917 993672 947145 905382 868278 835255 805937 780022 757010 736452 718103 701562 686268
60906F86268j4111j2319j0207q785q392q285p725o676n307l680k179j424j345
60893E95833j029J00J519K509L199M223N680P047P882Q184Q175Q054P836P319
60879F66531O323M992L640K355J061j06j025k098l831n842p101p280p130p216
60865F43273p211o812o492o641o767o297n497m849m123k912j529m50N50J844L022
60850E89109L574M098N625P981R978J1177J2292J3770J5141J5981J6460J6616
60838G21802J6008J4559J3014J2121J1914J2068J2324J2381J1962J1276J0732
60827H60161J0025Q268N312K249K08o99q82n47M1K51k32r08j235j546k531m190
60811H73745n976p743r811j2126j3988j4844j4853j4549j4248j3954j3604j3131
$$ plain form
60906 686268 672157 659838 649631 640846 632454 624169 616444 609768 604461 600781 598602 597178 595833
60893 595833 594804 594904 596423 598932 602131 606354 612034 619081 626963 635147 643322 651376 659212 666531
60879 666531 672854 677846 681486 683841 684902 684796 683771 681673 677842 672000 664899 657619 650489 643273
60865 643273 636062 629250 622758 616117 609350 603053 597556 592707 588584 585672 584143 583693 584243 586087 589109
60850 589109 592683 596781 602406 610387 620365 631542 643834 657604 672745 688726 705186 721802
60838 721802 737810 752369 765383 777504 789418 801486 813810 826191 838153 849429 860161
60827 860161 870186 878454 883766 886015 886223 885524 884642 884095 884136 884387 884155 883247 882012 880466 877935 873745
60811 873745 867769 860026 850215 838089 824101 809257 794404 779855 765607 751653 738049 724918
60799G24918j2389j1268r894q565p366o001m200k196m83Q59K143L324L854L604
60785F76340L306L535L756L111J756O26J15r6m4O73J949K977L354L591M226N068
60769G14243N684O122O677P474Q523R851J1204J2078J2324J2331J2405J2332J1862
60756H43110J1199J0707J0421J0077R484Q658P842P358P212O886N887M433L088
60743I46362J955Q13j42n16o72j504l050m264m532m508n009n870o570p267q495
60728H96731j0255j2082j3683j4951j5668j5721j5347j4787j4025j3213j2861
60717G44138j3133j3374j2884j1875j1034j0471r639q233o578n163m169l391k433
60704F31761r84Q37K574L947N116O336P682R183J0785J2040J2234J1152R317P272
$$ plain form
60799 724918 712529 701261 691367 682802 675436 669435 665235 663039 662556 663415 665558 668882 672736 676340
60785 676340 679646 683181 686937 690048 691804 692430 692545 692449 692405 693078 695027 698004 701358 704949 709175 714243
60769 714243 719927 726049 732726 740200 748723 758574 769778 781856 794180 806511 818916 831248 843110
60756 843110 854309 865016 875437 885514 894998 903656 911498 918856 926068 932954 938841 943274 946362
60743 946362 948317 949130 948988 948472 947800 946296 943246 938982 934450 929942 924933 919063 912493 905226 896731
60728 896731 886476 874394 860711 845760 830092 814371 799024 784237 770212 756999 744138
60717 744138 731005 717631 704747 692872 681838 671367 661728 653495 646917 641754 637585 634194 631761
60704 631761 630777 631614 634188 638135 643251 649587 657269 666452 677237 689277 701511 712663 721980 729252
60690G29252N025K466j66k608m933p200r139j0567j1817j3273j4747j5632j5464
60677F31197j4231j2375j0664r681r165q323o890n378m114k759j159J40P53J221
60663E48572K144L168L585L504L503L496K888J770J061J287J987K530K907L415
60649E85817M028M405M369M075L794L673L680L741L895M178M515M866N410O285
60635F46731P242P966Q643R660J0755J1193J0907J0807J1507J2414J2538J1695
60623G72058J0451R376Q817Q902R178Q648O831M473K700J720Q72l12j762l359
60609H38593n045o447o953o332n052l927l537l812m091l819l305l441m532n886
60595G72414o765p208p469p274o229m669l375k643k094j342m19L93Q21Q08O34
$$ plain form
60690 729252 734277 736743 736577 733969 729036 721836 712697 702130 690313 677040 662293 646661 631197
60677 631197 616966 604591 593927 584246 575081 566758 559868 554490 550376 547617 546458 546598 547351 548572
60663 548572 550716 553884 557469 560973 564476 567972 570860 572630 573691 574978 576965 579495 582402 585817
60649 585817 589845 594250 598619 602694 606488 610161 613841 617582 621477 625655 630170 635036 640446 646731
60635 646731 653973 661939 670582 680242 690997 702190 713097 723904 735411 747825 760363 772058
60623 772058 782509 791885 800702 809604 818782 827430 834261 838734 841434 843154 844026 843714 841952 838593
60609 838593 833548 827101 820148 813816 808764 804837 801300 797488 793397 789578 786273 782832 778300 772414
60595 772414 765649 758441 750972 743698 737469 732800 729425 726782 724688 723346 722927 723320 724141 724949 725583
60580G25583O91R81J072P43K35k20p43j440k157k815l542m238m551m523m684n216
60564F95176n613n571n482n587n386m481l389k776k445j782p34L35J432K820M500
60549F61017O350Q490J0927J3260J5269J7400K0132K3374K6998L1389L6715M2265
60537I13586M7222N1553N5176N6775N4477M7597L6913K3598Q746o255j9922l1269
60525A238197l9665m4372m5016m2322l7619l1752k5007j7816j0776m250J447N745
60513I46794Q412J0035J1209J1711J1269J0584J0676J1608J2995J5254J9172K4530
60501A104249L0527L7396M6219N7113O8974Q1229R4643J10023J27219J45663J64843
60490B068098J83956K02230K20072K38968K59810K81967L03839L22586L32456
$$ plain form
60580 725583 726274 727255 728327 729070 729305 729085 728342 726902 724745 721930 718388 714150 709599 705076 700392 695176
60564 695176 689563 683992 678510 672923 667537 663056 659667 656891 654446 652664 651930 652265 653697 656517 661017
60549 661017 667367 675857 686784 700044 715313 732713 752845 776219 803217 834606 871321 913586
60537 913586 960808 1012361 1067537 1124312 1178789 1226386 1263299 1286897 1295643 1289388 1269466 1238197
60525 1238197 1198532 1154160 1109144 1066822 1029203 997451 972444 954628 943852 939602 941049 946794
60513 946794 955206 965241 976450 988161 999430 1010014 1020690 1032298 1045293 1060547 1079719 1104249
60501 1104249 1134776 1172172 1218391 1275504 1344478 1425707 1520350 1630373 1757592 1903255 2068098
60490 2068098 2252054 2454284 2674356 2913324 3173134 3455101 3758940 4081526 4413982
60481D413982L24893K92325K32576J49563N0615n5895j60763k53804l25479l70013
60471D298000l87422l82471l61583l30595k94708k58643k25445j95522j68069
60462A693542j43327j22590j06275r3213q1967p1922o2918n4827m7829m2238l7818
60451H28618l3911l0348k7390k4742k1641j8231j5810j5104j5138j4442j2698
60440E99163j0671r064q109p827p989q047p556o653n805n179m433l124j300K21
60426E13627M56o06j680j563m95K86K16p1K60J368K811L915M147L688L474M060
60410E33893M754M623L971L807M125L993L324L158L915M670M666M328M200L925
60396E91352L196K746L436M856N711N345M218L169K671K600K431J801J019O48
$$ plain form
60481 4413982 4738875 5031200 5263776 5413339 5463954 5408059 5247296 4993492 4668013 4298000
60471 4298000 3910578 3528107 3166524 2835929 2541221 2282578 2057133 1861611 1693542
60462 1693542 1550215 1427625 1321350 1228137 1146170 1074248 1011330 956503 908674 866436 828618
60451 828618 794707 764359 736969 712227 690586 672355 656545 641441 626303 611861 599163
60440 599163 588492 579428 571319 563492 555503 547456 539900 533247 527442 522263 517830 514706 513406 513627
60426 513627 514083 513477 511797 510234 509739 510025 510241 510170 510430 511798 514609 518524 522671 526359 529833 533893
60410 533893 538647 543270 547241 551048 555173 559166 562490 565648 569563 574233 578899 583227 587427 591352
60396 591352 594548 597294 600730 605586 611297 616642 620860 624029 626700 629300 631731 633532 634551 635199
60382F35199O19K90m96j129j223j178j441j858k173k437k573k116r47K40P57Q11
60366F20345J011J410J642J741K198L136L911L830L141K951M021N770O943P205
60352F69255P359P784P669O455N128M945N547N669N185M942M774L472R23j322
60338G37785k136k131k303k640k784k858k880k292q30Q61K163L201M154M733M860
60323G36903M939M830L608J098j346k492k778l255l881l929l525l457l890m272
60309G18553m351m357m298l910l208k471j791j143p27p13q32p05l65l3L49Q89
60293F90887J326J284Q32L83K05J90M4m98j331j836j449m41L87P88J295K238L231
60276F97535L795L879L618L249L373M492O133P252P707Q344R441J0231J0415J0895
$$ plain form
60382 635199 635818 636108 635612 634483 633260 632082 630641 628783 626610 624173 621600 619484 618537 618777 619534 620345
60366 620345 621356 622766 624408 626149 628347 631483 635394 639224 642365 645316 649337 655107 662050 669255
60352 669255 676614 684398 692067 698522 703650 708595 714142 719811 724996 729938 734712 738184 739107 737785
60338 737785 735649 733518 731215 728575 725791 722933 720053 717761 716931 717792 719955 723156 727310 732043 736903
60323 736903 741842 746672 750280 751378 750032 747540 744762 741507 737626 733697 730172 726715 722825 718553
60309 718553 714202 709845 705547 701637 698429 695958 694167 693024 692297 691584 690752 690047 689682 689649 689998 690887
60293 690887 692213 693497 694329 694712 694917 695107 695151 694653 693322 691486 690037 689596 689983 690771 692066 694304 697535
60276 697535 701330 705209 708827 712076 715449 719941 726074 733326 741033 749377 758818 769049 779464 790359
60262G90359J2323J4078J5487J7017J9254K1615K3187K4157K5465K7550L0326
60251A020818L3799L7818M1743M5277M9127N4040N9767O5735P2115P9194Q6312
60240A645745R2502R7878J03233J08479J12451J14207J13740J11445J07567J02069
60230B709316R4595Q4776P2920N9997M6556L2349J7434K863j0518k3005l4856
60219C052427m4884n1441n4299n4433n2334m7751m0877l2606k3617j4054l999
60208B632132O614J8307L1367M4990N7973P0111Q2013R3748J04536J13645J20591
60197C376027J24635J25019J21711J15128J05197R1669P5284N7642L9734K1439
60187D253485K543j6552l5266n3100o9222q2520r2425r9121j02736j02775r8660
$$ plain form
60262 790359 802682 816760 832247 849264 868518 890133 913320 937477 962942 990492 1020818
60251 1020818 1054617 1092435 1134178 1179455 1228582 1282622 1342389 1408124 1480239 1559433 1645745
60240 1645745 1738247 1836125 1939358 2047837 2160288 2274495 2388235 2499680 2607247 2709316
60230 2709316 2803911 2888687 2961607 3021604 3068160 3100509 3117943 3120806 3110288 3087283 3052427
60219 3052427 3007543 2956102 2901803 2847370 2795036 2747285 2706408 2673802 2650185 2636131 2632132
60208 2632132 2638746 2657053 2688420 2733410 2791383 2861494 2943507 3037255 3141791 3255436 3376027
60197 3376027 3500662 3625681 3747392 3862520 3967717 4059386 4134670 4192312 4232046 4253485
60187 4253485 4256028 4239476 4204210 4151110 4081888 3999368 3906943 3807822 3705086 3602311 3503651
60176C503651r0537p9401o6636n3243l9278k4079p416R896K6756M2706N7607P0823
60164C350849Q1371Q8598R2068R1147Q5476P5696O3122M8786L3413J7916L169
60153D031611j0525k3033l3621m1364m6134m8369m7966m4258l7154k7507j6167
60142C655513l271J1413K7921M5998O5211Q5121J05654J27236J50241J74548J99891
60131D645476K26194K53073K79389L03935L26249L46219L63135L75763L82956
60122G502389L83656L76794L61960L39970L12024K78539K39459J95287J46971
60113A0137049R5130M0237j6570p3640j29528j82855k31718k74032l08285l33291
60103H722497l47761l51160l44668l30319l09405k82598k51310k17601j82773
$$ plain form
60176 3503651 3413114 3333713 3267077 3213834 3174556 3150477 3143061 3152957 3179713 3222419 3280026 3350849
60164 3350849 3432220 3520818 3612886 3704033 3789509 3865205 3928327 3977113 4010526 4028442 4031611
60153 4031611 4021086 3998053 3964432 3923068 3876934 3828565 3780599 3736341 3699187 3671680 3655513
60142 3655513 3652242 3663655 3691576 3737574 3802785 3887906 3993560 4120796 4271037 4445585 4645476
60131 4645476 4871670 5124743 5404132 5708067 6034316 6380535 6743670 7119433 7502389
60122 7502389 7886045 8262839 8624799 8964769 9276793 9555332 9794791 9990078 10137049
60113 10137049 10232179 10272416 10255846 10182206 10052678 9869823 9638105 9364073 9055788 8722497
60103 8722497 8374736 8023576 7678908 7348589 7039184 6756586 6505276 6287675 6104902
60094F104902j47159j11308p6336m2982j1394J8006M4318O6984Q5934J00779J10631
60083F142375J14868J13389J06156R3304P5738N4833L1588O840j7994m1381o2812
60072F616904q2450r9886j14495j26893j38584j49824j59217j65744j69698j71115
60062E238998j68855j62337j52976j42620j31245j17505j01106q3483o6146m9363
60052D063362l2584j5444K020J9718L7662N5746P3489R0192J05283J18365J28770
60041D646579J35396J37294J34204J26259J13504R6191P5298N2202K7941L134
60031E548002k1670m6071o9834r2266j11852j27154j37834j44258j46534j44728
60021D505801j39519j31724j21474j08783r4584q0141o5641n0506l4814j9196
$$ plain form
60094 6104902 5957743 5846435 5770099 5727117 5715723 5733729 5778047 5845031 5930965 6031744 6142375
60083 6142375 6257243 6370632 6476788 6570092 6645830 6700663 6732251 6739091 6721097 6679716 6616904
60072 6616904 6534454 6434568 6320073 6193180 6054596 5904772 5745555 5579811 5410113 5238998
60062 5238998 5070143 4907806 4754830 4612210 4480965 4363460 4262354 4178871 4112725 4063362
60052 4063362 4030778 4015334 4017354 4037072 4074734 4130480 4203969 4294161 4399444 4517809 4646579
60041 4646579 4781975 4919269 5053473 5179732 5293236 5389427 5464725 5516927 5544868 5548002
60031 5548002 5526332 5480261 5410427 5318161 5206309 5079155 4941321 4797063 4650529 4505801
60021 4505801 4366282 4234558 4113084 4004301 3909717 3829576 3763935 3713429 3678615 3659419
60011C659419l438J3421L1376M9292O6754Q4767J03994J23384J41261J56917J70333
60000D597480J80988J87667J89169J84764J74227J57849J36299J10541Q2004N2416
59990F053404K2774p251l8118o8847r7493j22859j44591j61665j72233j75335
59980E087786j71732j62688j49021j31688j12249r2021p1411n0562k9928r881
59970D106605R524K7962M4750N9719P3497Q6508R8320J08244J15900J20856J22407
59959D974292J20190J14495J05722R4157Q0530O6099N1858L8080K4905J2773K166
59948E685267o442j2148j3816j0919l692P629K3108M2743O6485R4538J26825J62177
59936F161755J98940K36442K74880L13702L51091L85036M13774M34950M45540
$$ plain form
60011 3659419 3655981 3669402 3700778 3750070 3816824 3901591 4005585 4128969 4270230 4427147 4597480
60000 4597480 4778468 4966135 5155304 5340068 5514295 5672144 5808443 5918984 6000988 6053404
59990 6053404 6076178 6068927 6030809 5961962 5864469 5741610 5597019 5435354 5263121 5087786
59980 5087786 4916054 4753366 4604345 4472657 4360408 4268387 4196976 4146414 4116486 4106605
59970 4106605 4116129 4144091 4188841 4248560 4322057 4408565 4506885 4615129 4731029 4851885 4974292
59959 4974292 5094482 5208977 5314699 5408856 5489386 5555485 5607343 5645423 5670328 5683101 5685267
59948 5685267 5678825 5666677 5652861 5641942 5638250 5645879 5668987 5711730 5778215 5872753 5999578 6161755
59936 6161755 6360695 6597137 6872017 7185719 7536810 7921846 8335620 8770570 9216110
59927I216110M43048M25899L92496L41294K72451J88736R4510n128j04116j95928
59917A1069372k75452l39893l87761m18227m32004m31667m20115l99430l71533
59908G593290l38770l03061k65382k26756j88694j51950j15859p9853m4656j1196
59898E867113K0821N2105Q2342J10527J36131J58919J77945J91665J98730J98057
59888G194355J88520J69230J39971J01083N3533m28n7243j13198j65232k10654
59878G299937k47161k73681k90539k98250k97058k87985k73253k54887k33772
59869D843351k10769j87685j66191j46636j28894j13670j01886r3407q7380q3356
59859C523477q1106p9768p8095p5287p0963o4836n7146m8931m1005l3093k4701
$$ plain form
59927 9216110 9659158 10085057 10477553 10818847 11091298 11280034 11374544 11369416 11265300 11069372
59917 11069372 10793920 10454027 10066266 9648039 9216035 8784368 8364253 7964823 7593290
59908 7593290 7254520 6951459 6686077 6459321 6270627 6118677 6002818 5922965 5878309 5867113
59898 5867113 5887934 5940039 6022381 6132908 6269039 6427958 6605903 6797568 6996298 7194355
59888 7194355 7382875 7552105 7692076 7793159 7846692 7846264 7789021 7675823 7510591 7299937
59878 7299937 7052776 6779095 6488556 6190306 5893248 5605263 5332010 5077123 4843351
59869 4843351 4632582 4444897 4278706 4132070 4003176 3889506 3787620 3694213 3606833 3523477
59859 3523477 3442371 3362603 3284508 3209221 3138258 3073422 3016276 2967345 2926340 2893247 2868546
59848B868546j6468r905o092n337p621j2634j9533k7342l5390m3054m9385n3527
59836B582258n5113n4126n0811m5975m0631l5000k8603k1506j4523p830n24P792
59824B235408J6181K3912L1647M0054M8208N4560N8740O1372O2806O3258O3473
59813B759619O4006O4249O3068N9866N4125M4784L1556J6461K690p898j5239j9550
59801C117737k0710j8996j5144r487j827P825J9126L1916M6141O1482P7690R5172
59789C390925J14643J36479J60945J88615K19803K53941K89941L26520L61256
59780E443068L89759M06337M04926L79103L23182K36003J24362J965j15427k14511
59770G378767k86829l29920l46890l43617l25622k97390k63445k28101j93966
$$ plain form
59848 2868546 2852078 2842173 2836081 2830744 2823123 2810489 2790956 2763614 2728224 2685170 2635785 2582258
59836 2582258 2527145 2473019 2422208 2376233 2335602 2300602 2271999 2250493 2235970 2228140 2227616 2235408
59824 2235408 2251589 2275501 2307148 2347202 2395410 2449970 2508710 2570082 2632888 2696146 2759619
59813 2759619 2823625 2887874 2950942 3010808 3064933 3109717 3141273 3157734 3160424 3152526 3137287 3117737
59801 3117737 3097027 3078031 3062887 3053400 3051573 3059398 3078524 3110440 3156581 3218063 3295753 3390925
59789 3390925 3505568 3642047 3802992 3991607 4211410 4465351 4755292 5081812 5443068
59780 5443068 5832827 6239164 6644090 7023193 7346375 7582378 7706740 7708705 7593278 7378767
59770 7378767 7091938 6762018 6415128 6071511 5745889 5448499 5185054 4956953 4762987
59761D762987j61828j32111j05502q2223o1781m3653k7457j2445K266J6970L1568
59750D186791M6331O1595P6892R1455J05601J20629J37169J54645J72527J91292
59740E344927K11791K34312K58641K84559L12158L41883L74313M09389M46057
59731H218030M82962N19203N53821N84820O09366O24837O29212O20940N99502
59722A3442693N66348N24796M79101M33913L94186L64480L47985L46289L59569
59713A7259360L86415M23573M66540N10507N50618N81920N99783O00412N80923
59704B1960051N39687M77175L96088L00264J94188Q3944k2580j17812j96687k56339
59694B3357979k94664l10483l04637k79525k37642j81264j13036l5572M9503J41190
$$ plain form
59761 4762987 4601159 4469048 4363546 4281323 4219542 4175889 4148432 4135987 4138253 4155223 4186791
59750 4186791 4233122 4294717 4371609 4463064 4568665 4689294 4826463 4981108 5153635 5344927
59740 5344927 5556718 5791030 6049671 6334230 6646388 6988271 7362584 7771973 8218030
59731 8218030 8700992 9220195 9774016 10358836 10968202 11593039 12222251 12843191 13442693
59722 13442693 14009041 14533837 15012938 15446851 15841037 16205517 16553502 16899791 17259360
59713 17259360 17645775 18069348 18535888 19046395 19597013 20178933 20778716 21379128 21960051
59704 21960051 22499738 22976913 23373001 23673265 23867453 23951397 23928817 23811005 23614318 23357979
59694 23357979 23063315 22752832 22448195 22168670 21931028 21749764 21636728 21601156 21650659 21791849
59684B1791849K38010L38174M40669N45048O49969P52504Q48685R33751J001757
59675B7540416J045317J055903J024475R43097Q07468O18761L83710J14347j71980
59666C3361514m54240p11971r29175j095169j204171j256024j256534j215185
59658B5239045j142240j048487r46287q48694p67271p11294o87486o97642p35914
59649A7653730p89734q44286q86562r07499r03524q77020q34000p80495p21139
59640A0109471o59818n99678n42346m88490m39024l94584l54308l16791k82151
59631F032281k51611k25130k01103j78451j57452j38359j20810j04818r0820p8476
59621D485251o6799n5738m6355l9276l4301l1610l1886l5062m0292m7286n6118
$$ plain form
59684 21791849 22029859 22368033 22808702 23353750 24003719 24756223 25604908 26538659 27540416
59675 27540416 28585733 29641636 30666111 31609208 32416676 33035437 33419147 33533494 33361514
59666 33361514 32907274 32195303 31266128 30170959 28966788 27710764 26454230 25239045
59658 25239045 24096805 23048318 22102031 21253337 20486066 19774772 19087286 18389644 17653730
59649 17653730 16863996 16019710 15133148 14225649 13322125 12445105 11611105 10830610 10109471
59640 10109471 9449653 8849975 8307629 7819139 7380115 6985531 6631223 6314432 6032281
59631 6032281 5780670 5555540 5354437 5175986 5018534 4880175 4759365 4654547 4563727 4485251
59621 4485251 4418452 4362714 4316359 4277083 4242782 4211172 4179286 4144224 4103932 4056646 4000528
59610D000528o5675p3991q0494q6185r1196r4064r4053r2363r0045q6319q0220
59599C065923p2598o5194n8555n1979m4885l7282k9353k1374j3678o333P05P050
59587B672447J2186J6390K0431K4217K6777K7813K8165K8441K8269K7305K6004
59576B938445K4950K4391K4810K6884L0580L5202M0599M7317N5343O3892P2743
59565C385156Q2537R3378J04413J15403J27419J41306J56528J72201J88161K04418
59555D770920K20578K36433K52112K66862K78739K86186K89123K87884K82189
59546G171026K71944K58079K41690K23072K02418J80780J59432J38643J17646
59537H964730R5400P1294M6016K2307M069n989p624j945J0048K7620M9948P5956
$$ plain form
59610 4000528 3934853 3860862 3780368 3694183 3602987 3508923 3414870 3322507 3232462 3146143 3065923
59599 3065923 2993325 2928131 2869576 2817597 2772712 2735430 2706077 2684703 2671025 2664692 2665397 2672447
59587 2672447 2684633 2701023 2721454 2745671 2772448 2800261 2828426 2856867 2885136 2912441 2938445
59576 2938445 2963395 2987786 3012596 3039480 3070060 3105262 3145861 3193178 3248521 3312413 3385156
59565 3385156 3467693 3561071 3665484 3780887 3908306 4049612 4206140 4378341 4566502 4770920
59555 4770920 4991498 5227931 5480043 5746905 6025644 6311830 6600953 6888837 7171026
59546 7171026 7442970 7701049 7942739 8165811 8368229 8549009 8708441 8847084 8964730
59537 8964730 9060130 9131424 9177440 9199747 9203816 9197827 9190203 9188258 9198306 9225926 9275874 9351830
59525I351830J03790J30161J51116J63686J66076J56420J32933R5803M7574q890
59515A0490499p1580j37941k03863k65165l19271l64645l99681m23167m35112
59506G870074m36292m27587m10412l86933l59190l28606k96755k65537k35924
59497D722838k07553j80212j54779j31961j11115r1239p2256n4466l7500k0799
59487C660958m415J1457K7219M3356N9772P6333R3379J11080J29008J47025J65810
59476D520982J85632K05223K22674K37041K48342K56360K59943K57242K46300
59467F639739K26001J96767J59831J15819O4902Q612m9516j05591j56874k01510
59457F898180k38020k65773k85087k96274k99433k95546k86666k74408k59244
$$ plain form
59525 9351830 9455620 9585781 9736897 9900583 10066659 10223079 10356012 10451815 10499389 10490499
59515 10490499 10418919 10280978 10077115 9811950 9492679 9128034 8728353 8305186 7870074
59506 7870074 7433782 7006195 6595783 6208850 5849660 5521054 5224299 4958762 4722838
59497 4722838 4515285 4335073 4180294 4048333 3937218 3845979 3773723 3719257 3681757 3660958
59487 3660958 3656543 3668000 3695219 3738575 3798347 3874680 3968059 4079139 4208147 4355172 4520982
59476 4520982 4706614 4911837 5134511 5371552 5619894 5876254 6136197 6393439 6639739
59467 6639739 6865740 7062507 7222338 7338157 7403059 7411671 7362155 7256564 7099690 6898180
59457 6898180 6660160 6394387 6109300 5813026 5513593 5218047 4931381 4656973 4397729
59448D397729k41790k23648k06154j89337j72827j56964j42227j28450j15345
59439B820987j03043r1582q0659p0378o1258n3097m4933l6614k9180k3126j7588
59428B209529j1988p068l344O4M012P871J0651J2558J4357J6164J7952K0402K4200
59415B315360K9092L4219L8398L9698L6372K9281K2209J8644J9418K4032L2338
59404B639061M3518N5386O6599P8127R0502J01130J06848J08508J10641J16979
59394C517299J28278J44005J63812J87116K13202K42142K74395L09528L46605
59385E526382L85601M26805M68761N08206N42217N69090N87078N93703N86981
59376A0194824N66629N34011M91762M43516L92983L42853K94854K50488K10884
$$ plain form
59448 4397729 4155939 3932291 3726137 3536800 3363973 3207009 3064782 2936332 2820987
59439 2820987 2717944 2626362 2545703 2475325 2414067 2360970 2316037 2279423 2250243 2227117 2209529
59428 2209529 2197541 2190473 2187129 2187193 2191205 2199076 2209727 2222285 2236642 2252806 2270758 2291160 2315360
59415 2315360 2344452 2378671 2417069 2456767 2493139 2522420 2544629 2563273 2582691 2606723 2639061
59404 2639061 2682579 2737965 2804564 2882691 2973193 3074323 3181171 3289679 3400320 3517299
59394 3517299 3645577 3789582 3953394 4140510 4353712 4595854 4870249 5179777 5526382
59385 5526382 5911983 6338788 6807549 7315755 7857972 8427062 9014140 9607843 10194824
59376 10194824 10761453 11295464 11787226 12230742 12623725 12966578 13261432 13511920 13722804
59367A3722804J75934J44215J13848Q3081N0388J4569k5264o9841j19147j71307
59357A3919280k22793k70259l11576l45112l69508l85128l94518m00445m04268
59348A0815673m06959m10172m14802m19549m22414m22733m20391m14110m02396
59339G082147l85675l65796l43782l19721k94320k68906k43985k19318j95307
59330D445337j72916j52325j33012j15033r8908q4324p0272n6550m3951l2880
59320C485166k2805j3123l677N568J4576K3105L1228L9625M8694N7774O6033P3536
59308C805700Q0578Q6583R0725R3024R3789R2581Q8786Q2655P4619O4363N1870
59297D705273L8731K6926J6791P598l32n603p536o540k910L369J1838K1895L3738
$$ plain form
59367 13722804 13898738 14042953 14156801 14239882 14290270 14304839 14279575 14209734 14090587 13919280
59357 13919280 13696487 13426228 13114652 12769540 12400032 12014904 11620386 11219941 10815673
59348 10815673 10408714 9998542 9583740 9164191 8741777 8319044 7898653 7484543 7082147
59339 7082147 6696472 6330676 5986894 5667173 5372853 5103947 4859962 4640644 4445337
59330 4445337 4272421 4120096 3987084 3872051 3773143 3688819 3618547 3561997 3518046 3485166
59320 3485166 3462361 3449238 3445561 3451129 3465705 3488810 3520038 3559663 3608357 3666131 3732164 3805700
59308 3805700 3886278 3972861 4063586 4156610 4250399 4342980 4431766 4514421 4589040 4653403 4705273
59297 4705273 4744004 4770930 4787721 4795319 4794987 4789384 4781848 4775308 4772398 4775767 4787605 4809500 4843238
59284D843238M7667O2712P7164R0272J02102J11960J18334J20324J17985J11392
59274E803150J00475Q5743O8022M7681K4936M57k5120n1441p6980r8160j11634
59263E767129j17069j16277j10362r9528q5151o9826n5106m0909k7341j5501o203
59252E023856P29N582Q302R026Q001N052K54n007q821j0502j0461q628m220L204
59238E016367J3759K8018M6585O9051R4525J22838J54064J87392K21839K57315
59228F211753K93379L27427L55783L76082L86817L85277L68196L34380K84870
59219I323964K20842J43566N6389l5574j27962k17460k99658l69133m22489m59458
59209G813027m80671m86366m77993m58980m32765m01481l67146l32462k99340
$$ plain form
59284 4843238 4890905 4953617 5030781 5121053 5223155 5335115 5453449 5573773 5691758 5803150
59274 5803150 5903625 5989368 6057390 6105071 6130007 6130464 6105344 6053903 5976923 5878763 5767129
59263 5767129 5650060 5533783 5423421 5323893 5238742 5168916 5113810 5072901 5045560 5030059 5023856
59252 5023856 5024585 5030167 5038469 5047495 5055496 5060548 5060802 5055795 5046974 5036472 5026011 5017383 5013163 5016367
59238 5016367 5030126 5058144 5104729 5173780 5268305 5391143 5545207 5732599 5954438 6211753
59228 6211753 6505132 6832559 7188342 7564424 7951241 8336518 8704714 9039094 9323964
59219 9323964 9544806 9688372 9744761 9709187 9581225 9363765 9064107 8694974 8272485 7813027
59209 7813027 7332356 6845990 6367997 5909017 5476252 5074771 4707625 4375163 4075823
59200D075823k67919k37932k10046j85203j63579j44794j28298j13393r9730q7878
59190B437051p8417p0621o3175n5928m9629m4181l8787l3583k9358k5759k1574
59179A926039j6852j2880r910o861l398l13K457O086J0675J4780J7720K0535K4031
59166A972109K7748L1409L5577M0152M4069M7197N0844N5612O0523O4955O9655
59155B499850P5091Q0540Q5539R0506R5112R7951R8634R8331R7324R3940Q7080
59144C499898P7915O7823N6375M2881K8280J3951M2j3518k5602l4939m1601m6130
59132C625375m8249m7635m4894m0521l3927k4743j4068l119Q420K1433L5587M9838
59120C483497O4061P8935R4654J10783J26891J42576J57384J71436J85506J99764
$$ plain form
59200 4075823 3807904 3569972 3359926 3174723 3011144 2866350 2738052 2624659 2524929 2437051
59190 2437051 2358634 2288013 2224838 2168910 2119281 2075100 2036313 2002730 1973372 1947613 1926039
59179 1926039 1909187 1896307 1886397 1879536 1876138 1875825 1878282 1884368 1895043 1909823 1927543 1948078 1972109
59166 1972109 1999857 2031266 2066843 2106995 2151064 2198261 2249105 2304717 2365240 2430195 2499850
59155 2499850 2574941 2655481 2741020 2831526 2926638 3024589 3123223 3221554 3318878 3412818 3499898
59144 3499898 3577813 3645636 3702011 3744892 3773172 3787123 3787165 3773647 3748045 3713106 3671505 3625375
59132 3625375 3577126 3529491 3484597 3444076 3410149 3385406 3371338 3368219 3376639 3398072 3433659 3483497
59120 3483497 3547558 3626493 3721147 3831930 3958821 4101397 4258781 4430217 4615723 4815487
59110D815487K13074K24151K32713K38834K41833K40438K33435K19676J98141
59101F857782J68537J31552Q8521M1593o040n1352r3034j30830j63539j89408
59091F653782k08527k22946k33921k40882k43685k43918k42949k40397k35601
59082D540956k29112k21536k12432k01615j90317j79806j69854j59687j49400
59073B827197j39477j29916j20695j12123j04022r5641q7061p9425p3026o6647
59063A819164n9584n2901m7580m2866l7735l2765k9202k7146k5803k4675k3544
59052A415363k2157k0836k0474k1119k1536k0857j9572j8210j6430j4225j2619
59041A207328j2130j1730j0358q328o286m044j397J113L291N891R175J2084J3785
$$ plain form
59110 4815487 5028561 5252712 5485425 5724259 5966092 6206530 6439965 6659641 6857782
59101 6857782 7026319 7157871 7246392 7287985 7281945 7230593 7137559 7006729 6843190 6653782
59091 6653782 6445255 6222309 5988388 5747506 5503821 5259903 5016954 4776557 4540956
59082 4540956 4311844 4090308 3877876 3676261 3485944 3306138 3136284 2976597 2827197
59073 2827197 2687720 2557804 2437109 2324986 2220964 2125323 2038262 1958837 1885811 1819164
59063 1819164 1759580 1706679 1659099 1616233 1578498 1545733 1516531 1489385 1463582 1438907 1415363
59052 1415363 1393206 1372370 1351896 1330777 1309241 1288384 1268812 1250602 1234172 1219947 1207328
59041 1207328 1195198 1183468 1173110 1164782 1158496 1154452 1153055 1154168 1157459 1163350 1172525 1184609 1198394
59028A198394J4795J5559J5258J3180J0030O791L523K56k181l314l793l959l058
59015A261481q22J550L205M916P350R527J0358J0259R908Q723O130L052O51j321
59001A334967l536n629p037q143r237r544q547p052n718l923j347P91J609K157
58987A269811L568N100N702O089P378R001R856J0340J1293J2137J2069J2015J3347
58974A387706J5522J7050J7978J9438K1425K3049K4320K5917K7726K9273L0904
58963A640308L2948L4436L4367L3438L2930L2701L2008L1414L1895L2935L3471
58952B002851L4049L6090L9539M3232M7074N1877N7429O2611O7266P2252P7819
58941B592089Q3518Q9493R6357J04022J12000J20484J29998J40440J51738J64723
$$ plain form
59028 1198394 1213189 1228748 1244006 1257186 1267216 1274007 1277530 1277786 1275605 1272291 1268498 1264539 1261481
59015 1261481 1260659 1262209 1265414 1270330 1277680 1287207 1297565 1307824 1317732 1326455 1332585 1335637 1336288 1334967
59001 1334967 1331431 1325802 1318765 1310622 1301385 1291841 1283294 1276242 1270524 1266601 1265254 1266045 1267654 1269811
58987 1269811 1273379 1278479 1284181 1290270 1297648 1306649 1316505 1326845 1338138 1350275 1362344 1374359 1387706
58974 1387706 1403228 1420278 1438256 1457694 1479119 1502168 1526488 1552405 1580131 1609404 1640308
58963 1640308 1673256 1707692 1742059 1775497 1808427 1841128 1873136 1904550 1936445 1969380 2002851
58952 2002851 2036900 2072990 2112529 2155761 2202835 2254712 2312141 2374752 2442018 2514270 2592089
58941 2592089 2675607 2765100 2861457 2965479 3077479 3197963 3327961 3468401 3620139 3784862
58931C784862J80083J97173K15223K34876K57156K81708L07636L35202L65194
58922F159113L97501M31830M68884N09068N50845N92099O32210O70963P06297
58913A1118810P34867P53980P61009P51830P22129O69850N94796M96887L77251
58904A6981409K40478R3584n6929k05182l44022m65833n65677o42142o95502p26925
58894A3613259p38973p34794p16647o86627o48223o05479n60983n16351m73835
58885G931347m35521m01407l70260l41830l16447k93249k71079k50571k33102
58876E017881k18021k03259j88304j74337j61677j49403j37429j26656j17019
58867C541776j07385r7499q8094p9207p0333o2166n6048n1590m6776m0614l4010
$$ plain form
58931 3784862 3964945 4162118 4377341 4612217 4869373 5151081 5458717 5793919 6159113
58922 6159113 6556614 6988444 7457328 7966396 8517241 9109340 9741550 10412513 11118810
58913 11118810 11853677 12607657 13368666 14120496 14842625 15512475 16107271 16604158 16981409
58904 16981409 17221887 17315471 17258542 17053360 16709338 16243505 15677828 15035686 14340184 13613259
58894 13613259 12874286 12139492 11422845 10736218 10087995 9482516 8921533 8405182 7931347
58885 7931347 7495826 7094419 6724159 6382329 6065882 5772633 5501554 5250983 5017881
58876 5017881 4799860 4596601 4408297 4233960 4072283 3922880 3785451 3658795 3541776
58867 3541776 3434391 3336892 3248798 3169591 3099258 3037092 2981044 2929454 2882678 2842064 2808054
58856B808054k7894k2199j6688j1274n560O26O558J1753J7104K3427K9827L5362
58844B849096M1156M8626N6561O2638O7199P2830Q0543Q9039R7507J06531J16190
58833C687916J25904J36238J48531J62552J76916J91741K08646K28052K48947
58824E315443K71353K96562L24829L55194L87710M23414M61942N01590N41808
58815H879845N83115O24221O61759O93072P16757P30010P28102P07128O65232
58806A4989241O00895N12805M02159K73070J30393k0476j71549l13173m38358
58797A5965007n44348o29553o91711p30104p47154p46478p31105p04333o70198
58788I770023o31800n90596n47996n05942m65422m26108l88003l51796l17346
$$ plain form
58856 2808054 2780160 2757961 2741273 2729999 2724439 2725065 2731623 2743376 2760480 2783907 2813734 2849096
58844 2849096 2890252 2938878 2995439 3058077 3125276 3198106 3278649 3367688 3465195 3571726 3687916
58833 3687916 3813820 3950058 4098589 4261141 4438057 4629798 4838444 5066496 5315443
58824 5315443 5586796 5883358 6208187 6563381 6951091 7374505 7836447 8338037 8879845
58815 8879845 9462960 10087181 10748940 11442012 12158769 12888779 13616881 14324009 14989241
58806 14989241 15590136 16102941 16505100 16778170 16908563 16888087 16716538 16403365 15965007
58797 15965007 15420659 14791106 14099395 13369291 12622137 11875659 11144554 10440221 9770023
58788 9770023 9138223 8547627 7999631 7493689 7028267 6602159 6214156 5862360 5545014
58779E545014k83841k51854k23396j99642j80668j67523j61941j63239j67565
58770C745345j71027j71772j68895j61828j51601j40483j29484j18002j06235
58761B426018r5663q6593p7576o8047n9267n1978m5340l9011l4003l0573k7376
58750A810591k3656k0296j7880j5712j3478j1914j1059r908q491q241r577j1177
58738A649202j2270j3563j5225j6187j6199j6404j7201j7626j7525j8067j9481
58727A469454k0654k1587k3748k7127k9592l0167l0410l1465l2255l1873l1261
58716A159315l1084l0296k8264k6169k4844k3256k0522j7565j5386j3577j1718
58705I16634j0461j0045r566q693q255q304p658o229n551o016n868m174k469k197
$$ plain form
58779 5545014 5261173 5009319 4785923 4586281 4405613 4238090 4076149 3912910 3745345
58770 3745345 3574318 3402546 3233651 3071823 2920222 2779739 2650255 2532253 2426018
58761 2426018 2330355 2243762 2166186 2098139 2038872 1986894 1941554 1902543 1868540 1837967 1810591
58750 1810591 1786935 1766639 1748759 1733047 1719569 1707655 1696596 1686688 1678197 1669956 1660379 1649202
58738 1649202 1636932 1623369 1608144 1591957 1575758 1559354 1542153 1524527 1507002 1488935 1469454
58727 1469454 1448800 1427213 1403465 1376338 1346746 1316579 1286169 1254704 1222449 1190576 1159315
58716 1159315 1128231 1097935 1069671 1043502 1018658 995402 974880 957315 941929 928352 916634
58705 916634 906173 896128 886562 877869 869614 861310 853652 847423 841872 835856 829988 825814 823345 821148
58691H21148k622k515j969j368n53l0r19k757l547k912k729l721l969k131N33
58676G89939K702N018Q056J0693J2208J3739J6135J8561K0766K4334K9990L5817
58664I87958L9660M1090L9431L2431J9029J784j5147k8853l7542m0209l8084l4317
58652I67231l0561k5738j9297j3131q747n042p44L274N928P938J0145J2008J3421
58639I16685J5786J9604K3285K5932K8940L3194L7304M0454M4311N0081N6276
58628A291852O1622O7605P5822Q5267R4654J05087J17842J31709J45189J59279
58618B335928J75372J92161K07048K19067K28047K32476K30286K20335K01399
58609D242119J71713J31425Q3846L2631k0166p1846j17720j54357j81891k01222
$$ plain form
58691 821148 818526 816011 814042 812674 812121 812091 811172 808415 804868 801956 799227 795506 791537 789406 789939
58676 789939 792641 797659 805715 816408 828616 842355 858490 877051 897817 922151 952141 987958
58664 987958 1027618 1068708 1108139 1140570 1159599 1161383 1146236 1117383 1079841 1039632 1001548 967231
58652 967231 936670 910932 891635 878504 869757 864715 863971 867245 873173 881111 891256 903264 916685
58639 916685 932471 952075 975360 1001292 1030232 1063426 1100730 1141184 1185495 1235576 1291852
58628 1291852 1353474 1421079 1496901 1582168 1676822 1781909 1899751 2031460 2176649 2335928
58618 2335928 2511300 2703461 2910509 3129576 3357623 3590099 3820385 4040720 4242119
58609 4242119 4413832 4545257 4629103 4661734 4641568 4569722 4452002 4297645 4115754 3914532
58599C914532k11506k12688k07760j99774j88934j75109j60617j47659j35278
58590B275207j21851j08444r6867q6475p5874o5772n7280m9285m0499l2264k6456
58579A514140k2355j8393j5160j3810j3300j2202j1561j3037j5672j7303j7734
58568A343613j7936j7674j6515j5542j5629j5789j5493j6479j9705k2761k3156
58557A146934k1929k1045j9527j5573j0379o434l772j347l72k729p343j1505j4503
58544A010476j7074j8690j8539j7830j8135j8725j8213j7256j6945j6441j4972
58533H17656j4110j5050j5745j4056j1655j1305j2250j1970j0664j0257j0537
58522F80057r987r051q974q797p003m751m086m307l496k134j797j807o37Q64J013
$$ plain form
58599 3914532 3703026 3490338 3282578 3082804 2893870 2718761 2558144 2410485 2275207
58590 2275207 2153356 2044912 1948045 1861570 1785696 1719924 1662644 1613359 1572860 1540596 1514140
58579 1514140 1491785 1473392 1458232 1444422 1431122 1418920 1407359 1394322 1378650 1361347 1343613
58568 1343613 1325677 1308003 1291488 1275946 1260317 1244528 1229035 1212556 1192851 1170090 1146934
58557 1146934 1125005 1103960 1084433 1068860 1058481 1052047 1048275 1046928 1046556 1043827 1036484 1024979 1010476
58544 1010476 993402 974712 956173 938343 920208 901483 883270 866014 849069 832628 817656
58533 817656 803546 788496 772751 758695 747040 735735 723485 711515 700851 690594 680057
58522 680057 670070 661019 652045 643248 636245 631494 627408 623101 619605 617471 615674 613867 613230 614094 615107
58507F15107N41J052J894J821J891L344M609L990L123M064N216M220K666L564
58493F57102O103P399P500Q162Q505O678M231M020N122M594K847K507L163K253
58479G30186Q9q80q75k077m072m702m612o213q934j0169j0102j0868j1892j0883
58465F43996q649q033q670p682m976l141k626j757q48j596k981k551j081j312
58451E88093k846l094k372k968m064k867j59O56l86j14J860K825K412K987M607
58436E84570M819L473K821K927J955O47J474L606L895K527K533M090M625M136
58422F28098M948O562O264M551M353N278M335J994J537K750K330L96L11K054K157
58407F77918L58m7J224R67j041j638p40j601m050m202j767q37k354k535j29J412
$$ plain form
58507 615107 615648 616700 618594 620415 622306 625650 630259 634249 637372 641436 646652 650872 653538 657102
58493 657102 663205 670604 678104 686266 694771 701449 705680 709700 714822 719416 722263 724770 727933 730186
58479 730186 730275 729395 728520 726443 722371 717669 713057 706844 697910 687741 677639 666771 654879 643996
58465 643996 635347 627314 618644 610962 605986 602845 600219 598462 597614 596018 593037 590486 589405 588093
58451 588093 585247 582153 579781 576813 572749 569882 569723 570379 569993 569879 571739 574564 576976 579963 584570
58436 584570 589389 592862 595683 598610 600565 601212 602686 606292 610187 612714 615247 619337 623962 628098
58422 628098 633046 639608 645872 650423 654776 660054 664389 666383 667920 670670 673000 673396 673707 675761 677918
58407 677918 678276 678229 679453 680420 679379 677741 677001 675400 671350 667148 665381 664544 662190 659655 659526 660938
58391F60938N96L21K046L636M567P276J1825J5149J6763J9339K2552K2593J8968
58378H06569J5468J3292R675M462J406J385R31j087j770n50n13j991j567J016
58364H46726J789l6n38J495K585J624J804L770M069K269K373N097O210M542M164
58349H87943O386P126M777L125L863L708J571J136L546M919L842L915O271P214
58335I49342N833O214R317J0593Q535P592R600J0501Q694Q279J0718J1585R113
58322A065916P786R818J1314J0363J0577J3133J3795J1457J0901J3503J4090J0839
58310A203492R037J1077J2070R687Q779J1748J3833J2667J2826J6124J7286J4318
58298A352944J3114J6548J9059J7484J6942K0230K1942J9251J7951K1315K3536
$$ plain form
58391 660938 661534 661855 663901 667537 672104 679380 691205 706354 723117 742456 765008 787601 806569
58378 806569 822037 835329 845004 849466 850872 852257 853188 852101 850331 849781 849268 847277 845710 846726
58364 846726 848515 848479 847941 849436 852021 853645 855449 859219 863288 865557 867930 873027 879237 883779 887943
58349 887943 894329 901455 906232 909357 913220 916928 918499 919635 923181 928100 931942 935857 942128 949342
58335 949342 955175 961389 970706 981299 989834 997426 1007026 1017527 1026221 1034500 1045218 1056803 1065916
58322 1065916 1073702 1083520 1094834 1105197 1115774 1128907 1142702 1154159 1165060 1178563 1192653 1203492
58310 1203492 1212529 1223606 1235676 1245363 1254142 1265890 1279723 1292390 1305216 1321340 1338626 1352944
58298 1352944 1366058 1382606 1401665 1419149 1436091 1456321 1478263 1497514 1515465 1536780 1560316
58287A560316K1011J9519K3128K6606K6088K6638L1714L5732L4933L5005M0000
58276A880690M4240M3336M2486M5636M7235M3268L9620M0803M1387L7332L4730
58265B340763L8149M1648M0534M0555M6011N0535M9401M9119N4774O0002N9695
58254B871186O0173O6295P1378P0780P2197Q1047Q9187R0038R1120R9178J07070
58243C769649J08377J10540J19995J28895J30644J33606J44919J56103J59860
58234D962588J65191J80036J95339K02992K12628K33068K54389K66899K80259
58225F953389L04550L30577L49175L71138M06717M44874M75212N10189N62040
58216A0707861O19075O69944P28880Q10046R00523R87832J089571J224545J380644
$$ plain form
58287 1560316 1581327 1600846 1623974 1650580 1676668 1703306 1735020 1770752 1805685 1840690 1880690
58276 1880690 1924930 1968266 2010752 2056388 2103623 2146891 2186511 2227314 2268701 2306033 2340763
58265 2340763 2378912 2420560 2461094 2501649 2547660 2598195 2647596 2696715 2751489 2811491 2871186
58254 2871186 2931359 2997654 3069032 3139812 3212009 3293056 3382243 3472281 3563401 3662579 3769649
58243 3769649 3878026 3988566 4108561 4237456 4368100 4501706 4646625 4802728 4962588
58234 4962588 5127779 5307815 5503154 5706146 5918774 6151842 6406231 6673130 6953389
58225 6953389 7257939 7588516 7937691 8308829 8715546 9160420 9635632 10145821 10707861
58216 10707861 11326936 11996880 12725760 13535806 14436329 15424161 16513732 17738277 19118921
58207A9118921J545442J741664J995783K300807K650906L082520L636791M313608
58199D0386442N110834O072305P242401Q617181J0211948J2138594J4536929J7469247
58191A21785881K0970826K5143040L0022364L5270510L9970796M2613640M1244097
58184C57021154L4042945K0533164K665895j5532936k9960977l8506499m1478717
58177B88784029m0466845l7083853l2536474k7708279k3180727j9196058j5779200
58170I2832593j2915136j0577900q680302p108881n798037m717011l812625l018942
58162C6203759k303827j658696j053877m42933J95990Q58660J556045K316835
58154C5671956L098374L668816L618880K606932O95579j561866l448971m545186
$$ plain form
58207 19118921 20664363 22406027 24401810 26702617 29353523 32436043 36072834 40386442
58199 40386442 45497276 51569581 58811982 67429163 77641111 89779705 104316634 121785881
58191 121785881 142756707 167899747 197922111 233192621 273163417 315777057 357021154
58184 357021154 391064099 411597263 414263158 398730222 368769245 330262746 288784029
58177 288784029 248317184 211233331 178696857 150988578 127807851 108611793 92832593
58170 92832593 79917457 69339557 60659255 53550374 47752337 43035326 39222701 36203759
58162 36203759 33899932 32241236 31187359 30744426 30940416 31799076 33355121 35671956
58154 35671956 38770330 42439146 46058026 48664958 49360537 47798671 44349700 39804514
58146C9804514m878733m707534m260128l682037l089366k563086k117235j733886
58138A2772509j416040j174019r89011q31617o98605n98476n19479m43854l77233
58129E724175l33574l05134k75097k46493k31851k26282k15966k02339j94235
58120C493204j86495j69057j47653j33913j24118j08100r0089q0678p6860o9674
58110B306567o3285o7048p6014p8098p3995p2329p1722o5123n5791n1977n1237
58099A579948m5925l8678l6907l7731l3709k7941k8203l1472k9549k4912k5835
58088A219086l0331l0035k5990k5810k8758k7961k4372k4652k7771k7066k3150
58077I23190k2092k3258k1201j7209j6886j8665j6550j1896j0893j2687j1466
$$ plain form
58146 39804514 34925781 30218247 25958119 22276082 19186716 16623630 14506395 12772509
58138 12772509 11356469 10182450 9193439 8361822 7663217 7064741 6545262 6101408 5724175
58129 5724175 5390601 5085467 4810370 4563877 4332026 4105744 3889778 3687439 3493204
58120 3493204 3306709 3137652 2989999 2856086 2731968 2623868 2533779 2453101 2376241 2306567
58110 2306567 2243282 2176234 2100220 2022122 1948127 1875798 1804076 1738953 1683162 1631185 1579948
58099 1579948 1534023 1495345 1458438 1420707 1386998 1359057 1330854 1299382 1269833 1244921 1219086
58088 1219086 1188755 1158720 1132730 1106920 1078162 1050201 1025829 1001177 973406 946340 923190
58077 923190 901098 877840 856639 839430 822544 803879 787329 775433 764540 751853 740387
58066G40387q028p938j0189r038n188m229n742m790k460m108q563r777p936q476
58052F43925j1236j0910p475o085p154o200l131k199l232k023R64J149j330j937
58038E83126l56l51j679m99K644L529K340L000N072M415J280k02k0j827n103n706
58022E89663l752l245m382l943k613m052p239p678n809o188q682q624n704m584
58008E13168o253o775n238n196p244p625n378l983m818n506n566p238r991j0517
57994D21840q807q050q202n961j398J914L690P247J2589J5769J5811J5779J6296
57981D78517J4567J0694Q410Q387P182L950K061K679K787R94m99j020k774n823
57967E30112p240o571o758q463q831p081n980o481o254m699m174n051m698k573
$$ plain form
58066 740387 732359 724421 714232 705194 700006 695777 690035 685245 682785 678677 670114 660337 652401 643925
58052 643925 632689 621779 614304 608219 601065 594865 591734 589535 586303 584280 585244 586393 585063 583126
58038 583126 582770 582419 580740 580241 582885 586414 588754 591754 596826 601241 602521 602319 602299 600472 595369 589663
58022 589663 585911 582666 578284 574341 571728 567676 560437 552759 546950 540762 532080 523456 517752 513168
58008 513168 506915 500140 494902 489706 482462 474837 469459 465476 460658 455152 449586 442348 432357 421840
57994 421840 413033 404983 396781 390820 389422 391336 395026 402273 414862 430631 446442 462221 478517
57981 478517 493084 503778 512188 520575 527757 531707 533768 536447 539234 540228 539729 538709 535935 530112
57967 530112 522872 516301 509543 501080 492249 485168 479188 472707 466453 461754 457580 452529 447831 445258
57953D45258j267j426p12J155J617N35R77L483M838L844L097L651L131P51q66
57938D68066o38r70l051m862n425o479q397q936p651p108q248q836p874p151p145
57923C75295n876l128j469j654j399J15R05N04J059L033M353M898O981J0235J1078
57908D04930Q822P223Q237R243Q363P537Q019P673N280L083K569J851l31k114
57894D80385k276k612m308n750o029o774q535r245q186p562q245q125o490n735
57880C90513o565o035k796J08M11K80J910L586L391L041M657O939P759P678P970
57865D22847Q023P307P084P770P476N511M131M461M053J116k192l477l897n317
57851D64896o718o570o005o568p262o713n913o104o209n036l796l870m258l649
$$ plain form
57953 445258 443991 442565 441853 443008 444625 445160 446137 449620 454458 458302 461399 465050 468181 468932 468066
57938 468066 467428 466458 463407 458545 453120 446641 438244 429308 421657 414549 406301 397465 389591 382440 375295
57923 375295 369419 366291 364822 363168 361769 361884 362789 363293 364352 367385 371738 376636 383617 393852 404930
57908 404930 413752 420975 429212 438455 446818 454355 462374 470047 475327 478410 480979 482830 482499 480385
57894 480385 478109 475497 471189 465439 459410 452636 444101 434856 426670 419108 410863 402738 396248 390513
57880 390513 383948 377913 375117 375225 375636 375916 377826 381412 384803 387844 392501 399440 407199 414877 422847
57865 422847 430870 438177 445261 453031 460507 466018 470149 474610 478663 479779 477587 474110 470213 464896
57851 464896 458178 451608 445603 439035 431773 425060 419147 413043 406834 401798 398002 394132 389874 386225
57837C86225k888l067l308k653k001k238k620k743l703n612o664o370o752q537
57823C27069r426q217p213q102q891p658o089o199o670n616m135l821l472j636
57809B39924J15j37j019l60R52R52L78J018K223K455K677M757Q009J0493J2230
57794B84667J4072J4874J3024R607O935N142L072J292J221K216K370J353O1j511
57780C58395l621n215n439n601p252r403r959q812p350o088m952m531m919m644
57766B70609k887j214j059j114L92K580L583L667M094M468L916L422M229N258
57752B99944M819L667L625M352M198L219K700K713K578K731L645M137L166K087
57738C47581K550L503L033J895K291M130N484N901O445P169P260P137P849R019
$$ plain form
57837 386225 383337 380270 376962 374309 372308 370070 367450 364707 361004 355392 348728 342358 335606 327069
57823 327069 317643 309426 302213 294111 285220 277562 271473 265274 258604 252988 248853 245032 241560 239924
57809 239924 240039 239902 238883 238523 239475 240427 240805 241823 244046 246501 249178 253935 261944 272437 284667
57794 284667 298739 313613 326637 336244 343179 348321 351393 352685 353906 356122 358492 359845 359906 358395
57780 358395 354774 349559 344120 338519 331267 321864 311905 303093 295743 289655 284703 280172 275253 270609
57766 270609 267722 266508 265449 264335 264727 267307 270890 274557 278651 283119 287035 290457 294686 299944
57752 299944 304763 308430 312055 316407 320605 323824 326524 329237 331815 334546 338191 342328 345494 347581
57738 347581 350131 353634 356667 358562 360853 364983 370467 376368 382813 389982 397242 404379 412228 421247
57724D21247R708J0464J2178J3910J4320J4241J5247J6740J7122J6856J7565J9041
57712E98639J9996K0859K2947K5697K7717K9772L3621L8590M2566M5915N1123
57701I57442N8656O6444P3557Q1358R0741J01009J11907J24200J37931J52339
57691A955584J67558J84064K00456K14036K23482K28614K27727K17744J97290
57682C816555J67350J29114Q3687L4126j4684n8681r5432j22676j38502j42986
57672C657871j37685j23513j01123p2902m2498j3261R984J8599M050l4020q5545
57661C079957j36398j75469j96811j99555j87885j68682j47043j24730j02759
57652A640625q3085o6886n3276m0928k9582j9316r930j633N108J0899J7245K4818
$$ plain form
57724 421247 430955 441419 453597 467507 481827 496068 511315 528055 545177 562033 579598 598639
57712 598639 618635 639494 662441 688138 715855 745627 779248 817838 860404 906319 957442
57701 957442 1016098 1082542 1156099 1237457 1328198 1429207 1541114 1665314 1803245 1955584
57691 1955584 2123142 2307206 2507662 2721698 2945180 3173794 3401521 3619265 3816555
57682 3816555 3983905 4113019 4196706 4230832 4216148 4157467 4062035 3939359 3800857 3657871
57672 3657871 3520186 3396673 3295550 3222648 3180150 3166889 3176873 3195472 3199522 3165502 3079957
57661 3079957 2943559 2768090 2571279 2371724 2183839 2015157 1868114 1743384 1640625
57652 1640625 1557540 1490654 1437378 1396450 1366868 1347552 1337622 1335989 1341097 1351996 1369241 1394059
57640A394059L3162M2141N2109O2682P3079Q3769R6064J09951J24041J37709J51407
57629B360173J64773J76305J85078J90891J92440J87123J73122J50217J18648
57620C898770P9009L3499j4376o1514j05221j42147j69514j87494j98297k02890
57610B929825k00757j92896j82360j71194j59026j45423j31611j18959j07532
57601A520067r6973q7359p8594p0337o2862n6645n1101m5287l9824l6201l4239
57590H60645l2154k9252k6446k4052k1343j8527j6891j6444j5634j3929j2519
57579F33454j1950j1262j0036r065q374o805m347k653k379k197j270m39K2J430
57565E64129M195O482O864O503P208Q943J0697J2255J3847J5206J6275J7642J9448
$$ plain form
57640 1394059 1427221 1469362 1521471 1584153 1657232 1741001 1837065 1947016 2071057 2208766 2360173
57629 2360173 2524946 2701251 2886329 3077220 3269660 3456783 3629905 3780122 3898770
57620 3898770 3977779 4011278 3996902 3935388 3830167 3688020 3518506 3331012 3132715 2929825
57610 2929825 2729068 2536172 2353812 2182618 2023592 1878169 1746558 1627599 1520067
57601 1520067 1423094 1335735 1257141 1186804 1123942 1067297 1016196 970909 931085 894884 860645
57590 860645 828491 799239 772793 748741 727398 708871 691980 675536 659902 645973 633454
57579 633454 621504 610242 600206 591141 582767 575962 571615 568962 566583 564386 563116 562677 562699 564129
57565 564129 568324 574806 581670 588173 595381 604324 615021 627276 641123 656329 672604 690246 709694
57552G09694K1056K2521K4902K8431L2100L5709M0482M6766N3080N8576O4541
57541A137858P2212Q0895Q9634R8967J09485J20208J29973J39051J47818J55035
57531B281136J58823J58197J52270J39264J17940Q9252N5399J8190k0608n8358
57521C091505r2296j20430j41154j53307j57703j57103j53533j46796j36634j24748
57511A707801j13167j02070r0824q0028p0756o2727n4999m7719m1661l6630l1781
57500I75439k6956k2430j7962j3324r106n777k571J433N765R370J2350J5670J9593
57487I41494K3658K7755L2155L6831M1781M7639N4940O3214P1648Q0296Q9725
57476A511136R9925J10387J20811J30902J39748J46124J48976J47196J39416J24727
$$ plain form
57552 709694 730750 753271 778173 806604 838704 874413 914895 961661 1014741 1073317 1137858
57541 1137858 1210070 1290965 1380599 1479566 1589051 1709259 1839232 1978283 2126101 2281136
57531 2281136 2439959 2598156 2750426 2889690 3007630 3096882 3152281 3170471 3149863 3091505
57521 3091505 2999209 2878779 2737625 2584318 2426615 2269512 2115979 1969183 1832549 1707801
57511 1707801 1594634 1492564 1401740 1321712 1250956 1188229 1133230 1085511 1043850 1007220 975439
57500 975439 948483 926053 908091 894767 885661 879884 877313 878746 884511 893881 906231 921901 941494
57487 941494 965152 992907 1025062 1061893 1103674 1151313 1206253 1269467 1341115 1421411 1511136
57476 1511136 1611061 1721448 1842259 1973161 2112909 2259033 2408009 2555205 2694621 2819348
57466B819348J03083P4702M0038R61l8927p5998j08080j33883j52112j62256j65498
57455B201378j63876j58873j51314j41880j31064j19238j07299r6479q7049p8108
57445I66198o9168o0918n3926m7805m2341l8177l5448l2983k9831k6579k4086
57434E04936k2021j9710j7397j5546j3828j1966j0632j0361j0357r659q638q278
57422C46543q543q647q296p665o751n674m975m847m742m411m362m641m331l092
57408B65566j917j447r19J07N13l83j179m78O24K69j016j090M89K055K460K163
57392B65817J795J402J134J203J159M81l13l47J22J96l3K69J103J683J817J883
57376B79371J705Q63j23k93J80L08l5p7L37O27P58J281K025K154J609J202J213
$$ plain form
57466 2819348 2922431 2997133 3037171 3038132 2999205 2923207 2815127 2681244 2529132 2366876 2201378
57455 2201378 2037502 1878629 1727315 1585435 1454371 1335133 1227834 1131355 1044306 966198
57445 966198 897030 836112 782186 734381 692040 653863 618415 585432 555601 529022 504936
57434 504936 482915 463205 445808 430262 416434 404468 393836 383475 373118 363459 354821 346543
57422 346543 338000 329353 321057 313392 306641 300967 295992 291145 286403 281992 277630 272989 268658 265566
57408 265566 263649 262202 261283 261390 261903 261520 260341 259863 260487 260756 259740 258650 259139 261194 263654 265817
57392 265817 267612 269014 270148 271351 272510 272991 272678 272331 272453 272649 272616 272885 273988 275671 277488 279371
57376 279371 281076 281939 281816 281523 281703 282011 281976 281899 282236 282863 283621 284902 286927 289081 290690 291892 293105
57359B93105J055N02O0k0j8O8N29J102J170R48J312K317K963K784K543L002L870
57342C17292M370M293M018L945M192M629N120N767O622P064O200M277K892L107
57328C83788M116M605M631N055N828O127N814N557N694O028O510P218P907Q426
57314D67304R139J0210J0948J0855J0672J1316J2400J2961J3122J3693J4661J5368
57302F12649J5817J6547J7570J8614J9969K1865K3503K4076K4185K4920K6044
57291H45759K6717K7283K8627L0112L0203K8879K7489K6227K3810J9796J5284
57280A130186J0920O104O57m398q351j1652j4680j6985j8245j8696j8317j6795
57268A019748j4651j3009j1966j0524q399o464n093l569j608J41J514L249N311
$$ plain form
57359 293105 294160 294662 294722 294702 294684 294752 295281 296383 297553 298501 299813 302130 305093 307877 310420 313422 317292
57342 317292 321662 325955 329973 333918 338110 342739 347859 353626 360248 367312 373512 377789 380681 383788
57328 383788 387904 392509 397140 402195 408023 414150 419964 425521 431215 437243 443753 450971 458878 467304
57314 467304 476443 486653 497601 508456 519128 530444 542844 555805 568927 582620 597281 612649
57302 612649 628466 645013 662583 681197 701166 723031 746534 770610 794795 819715 845759
57291 845759 872476 899759 928386 958498 988701 1017580 1045069 1071296 1095106 1114902 1130186
57280 1130186 1141106 1147210 1147867 1143469 1135118 1123466 1108786 1091801 1073556 1054860 1036543 1019748
57268 1019748 1005097 992088 980122 969598 961199 954735 949642 946073 944465 944606 946120 949369 954680
57255I54680O447O166N747O361P520Q309Q945J0024J1217J1801J1836J1975J2595
57242A073623J3657J4886J5675J5577J5150J5489J6629J7387J7108J6544J6573
57231A248298J7143J7868J8679J9406J9686J9736K0221K1061K1451K1376K1828
57220A466753K3086K4109K4228K4152K4551K4948K4904K5059K6062K7353K8093
57209A743298K8427K8919K9505K9847L0114L0549L0911L0990L1153L1796L2812
57198B078321L4067L5612L7088L7759L7607L7487L7735L7595L6539L5097L3752
57187B478659L2075K9787K7665K6547K6210K6037K6033K6444K7133K8075K9672
57176B784337L2011L4480L6720L9069M1542M3401M4363M5203M6344M6940M6296
$$ plain form
57255 954680 961127 967293 973040 979401 986921 995230 1004175 1014199 1025416 1037217 1049053 1061028 1073623
57242 1073623 1087280 1102166 1117841 1133418 1148568 1164057 1180686 1198073 1215181 1231725 1248298
57231 1248298 1265441 1283309 1301988 1321394 1341080 1360816 1381037 1402098 1423549 1444925 1466753
57220 1466753 1489839 1513948 1538176 1562328 1586879 1611827 1636731 1661790 1687852 1715205 1743298
57209 1743298 1771725 1800644 1830149 1859996 1890110 1920659 1951570 1982560 2013713 2045509 2078321
57198 2078321 2112388 2148000 2185088 2222847 2260454 2297941 2335676 2373271 2409810 2444907 2478659
57187 2478659 2510734 2540521 2568186 2594733 2620943 2646980 2673013 2699457 2726590 2754665 2784337
57176 2784337 2816348 2850828 2887548 2926617 2968159 3011560 3055923 3101126 3147470 3194410 3240706
57165C240706M5143M4432M3764M2157L9704L7319L5340L3363L1081K8434K5398
57154C646841K2274J9670J7662J5575J3142J1050R851R159Q664Q874J0178J2069
57142C805009J4150J6912K0624K4426K7517L0384L3790L7419M0530M3075M5154
57131D138990M6165M5621M4076M2240M0020L7376L5283L4633L5081L6085L8190
57120D573760M2046M7008N2065N7409O3779P0948P8212Q5792R4648J05707J20255
57109E391629J40100J65808J95800K28724K66077L11278L67460M37905N27580
57100H032361O42118P86020R63649J181149J445234J760651K130251K555922L036199
57091B2533554L563023M122432M697199N266539N805063O284910O676779O945736
$$ plain form
57165 3240706 3285849 3330281 3374045 3416202 3455906 3493225 3528565 3561928 3593009 3621443 3646841
57154 3646841 3669115 3688785 3706447 3722022 3735164 3746214 3756065 3765224 3773888 3782762 3792940 3805009
57142 3805009 3819159 3836071 3856695 3881121 3908638 3939022 3972812 4010231 4050761 4093836 4138990
57131 4138990 4185155 4230776 4274852 4317092 4357112 4394488 4429771 4464404 4499485 4535570 4573760
57120 4573760 4615806 4662814 4714879 4772288 4836067 4907015 4985227 5071019 5165667 5271374 5391629
57109 5391629 5531729 5697537 5893337 6122061 6388138 6699416 7066876 7504781 8032361
57100 8032361 8674479 9460499 10424148 11605297 13050531 14811182 16941433 19497355 22533554
57091 22533554 26096577 30219009 34916208 40182747 45987810 52272720 58949499 65895235
57083F5895235P051101O960076O660981O151820N412312M402056L104644J577004
57075A07215229n2813j641317l084659m329954n352869o137630o675259o969489
57067G2971239p037827o907430o610936o184627n667877n101564m523670l963737
57059B6973571l440387k963691k538969k168177j849571j578663j350426j160220
57051I923467j002920q72439p62879o69841n90357n21993m62490m10080l63640
57042D266828l22460k85955k53683k25389k00887j79888j61944j46526j33095
57033B357001j21175j10426j00722r2154q4858p8792p3717o9322o5287o1207n6733
57022A442608n1999m7675m4217m1214l7924l4379l1351k9105k6822k3583j9280
$$ plain form
57083 65895235 72946336 79906412 86567393 92719213 98131525 102533581 105638225 107215229
57075 107215229 107162416 105521099 102436440 98106486 92753617 86615987 79940728 72971239
57067 72971239 65933412 59025982 52415046 46230419 40562542 35460978 30937308 26973571
57059 26973571 23533184 20569493 18030524 15862347 14012776 12434113 11083687 9923467
57051 9923467 8920547 8048108 7285229 6615388 6025031 5503038 5040548 4630468 4266828
57042 4266828 3944368 3658413 3404730 3179341 2978454 2798566 2636622 2490096 2357001
57033 2357001 2235826 2125400 2024678 1932524 1847666 1768874 1695157 1625835 1560548 1499341 1442608
57022 1442608 1390609 1342934 1298717 1257503 1219579 1185200 1153849 1124744 1097922 1074339 1055059
57011A055059j4149q043q19P143J5504K4760L5909M9791O7104Q8471J14155J44646
56999A579531J81119K21299K51701K47549J88668P9871m6673j52374k15949k38659
56989B096083k32878k10710j80898j49457j19592r2372o8812n0552l8511l2297
56979I20004l1045l3594l7667m0359m0004l6885l2145k6954k2489j9435j7220
56968E82207j4757j1901r321p064m422j139K500O793J2483J9246K5497K9888L1847
56955F61857L0385K3847J1747l844j9270l1225l7876l9226l6961l3213k8988k4146
56943D73087j8754j3609r252n417j757J730N240R368J4482K0429K6960L3679L9492
56930E75678M2702M1686L5056K1887L265j6587l2347m1415m4891m4894m2412l8054
$$ plain form
57011 1055059 1040910 1032867 1032048 1039191 1054695 1079455 1115364 1165155 1232259 1320730 1434885 1579531
56999 1579531 1760650 1981949 2233650 2481199 2669867 2749738 2703065 2550691 2334742 2096083
56989 2096083 1863205 1652495 1471597 1322140 1202548 1110176 1041364 990812 952301 920004
56979 920004 888959 855365 817698 777339 737335 700450 668305 641351 618862 599427 582207
56968 582207 567450 555549 546228 539164 534742 533603 536103 542896 555379 574625 600122 630010 661857
56955 661857 692242 716089 727836 723992 704722 673497 635621 596395 559434 526221 497233 473087
56943 473087 454333 440724 431472 426055 424298 426028 431268 440636 455118 475547 502507 536186 575678
56930 575678 618380 660066 695122 717009 720274 703687 671340 629925 585034 540140 497728 459674
56918D59674l3071k8507k4304k0184j6653j4263j2633j1026r364p942o733n572
56906B69422m569l757k797j550n10j40j81k0N32J220J813K375L307N117P819J0688
56890B88769J3073J5280J8032K1271K4194K6163K6584K4218J8050R056j27p530
56878D77033j2842j6100j6924j5524j3116j0591p826m734j803J037M697R381J3986
56865D06674J8019K2848K9881L8450M6689N3555N8457N9460N3607L9455J8725
56854H45820m447k5372m0426m8105m9115m5451l9263l2198k5053j7739j0037k362
56842E06252M751J1764J9756K8987L8886M9534O1708P5047Q7366R6112R8852R1932
56830A170947P1233L6661m964m3389p1415q7434r3047r0422q1945p0359n8096
$$ plain form
56918 459674 426603 398096 373792 353608 336955 322692 310059 299033 289669 281727 274994 269422
56906 269422 264853 261096 258299 256749 256239 256099 255918 255898 256430 257650 259463 261838 265145 270262 278081 288769
56890 288769 301842 317122 335154 356425 380619 406782 433366 457584 475634 484690 484563 477033
56878 477033 464191 448091 431167 415643 402527 391936 384110 379376 377573 378610 383307 392688 406674
56865 406674 424693 447541 477422 515872 562561 616116 674573 734033 787640 827095 845820
56854 845820 841373 816001 775575 727470 678355 632904 593641 561443 536390 518651 508614 506252
56842 506252 511003 522767 542523 571510 610396 659930 721638 796685 884051 980163 1079015 1170947
56830 1170947 1242180 1278841 1273877 1230488 1159073 1071639 978592 888170 806225 735866 677770
56819F77770m6604l6348k6985j7740q164J453J0645J9473K8397L7923M8431N9640
56807G47891O9660P5012P2111N8685L4560K643l0574n7390p3297p8814p6971p0310
56795F73206o0823n0808m1984l4354k7213k0571j4625q794k497L847R745J5859
56783D40988K3051L0735L7206M0929M0451L4091K1311M172j3689k9255m0640m6629
56771E42721m7307m4563m0551l5905l0458k4921k0383j6762j3345j0410q714p819
56759B41583o534m865l848l599l167k288j833k177k602k573k382k294k089j711
56745A99621j370r69l66j01q16j977k363j814j307j296j215p30l60n53j095j673
56729A81616k146k149j326p3P28P69M00j94j015j668j660j228r46p34j67M58N08
$$ plain form
56819 677770 631166 594818 567833 550093 541929 543382 554027 573500 601897 639820 688251 747891
56807 747891 817551 892563 964674 1023359 1057919 1060562 1029988 972598 899301 820487 743516 673206
56795 673206 612383 561575 519591 485237 458024 437453 422828 414034 411537 415384 425129 440988
56783 440988 464039 494774 531980 572909 613360 647451 668762 672934 659245 629990 589350 542721
56771 542721 495414 450851 410300 374395 343937 319016 298633 281871 268526 258116 249402 241583
56759 241583 235049 230184 226336 222737 219570 217282 215449 213272 210670 208097 205715 203421 201332 199621
56745 199621 198251 197282 196916 196815 195999 194022 191659 189845 188538 187242 186027 185297 184937 184384 183289 181616
56729 181616 179470 177321 175995 175922 176650 177419 177819 177625 176610 174942 173282 172054 171108 170374 170207 170665 171173
56712A71173J41k1j28q14j841k303k081j852j717j124j58L67K33J5p3l17n28k41
56694A58731J23l08j209j234j49Q30J026J226K036K762K604J870J252Q66N89N26
56678A71541O23N06J16j91l21n09o12k92J59J07l02m34m49j056j903j807p42j07
56660A64327m97p80r9P04N66j54n21n64q59j289j273q11n08p26j196j332p16L89
56642A54661J089Q01Om98q14j443j970j417M4J027P51j63q68j141r02j06O23M04
56624A50084n22q93j67Q38J253R97K07r26j573q40P53J606J190N75N86Q01P78
56607A54747Q49J086R02K37p1K95O16N85Q93J749K171J570P79O62P79L78l24o66
56589A67237m97L1Q59J595J615J023P02J041J552J924K344K644K429K216K959
$$ plain form
56712 171173 171314 171293 171165 170351 168510 166207 164126 162274 160557 159433 159275 159642 159875 159890 159817 159500 158972 158731
56694 158731 158854 158546 157337 156103 155954 156784 157810 159036 161072 163834 166438 168308 169560 170426 171015 171541
56678 171541 172164 172670 172786 172595 172274 171765 171153 170861 171020 171127 170825 170391 169942 168886 166983 165176 164434 164327
56660 164327 163830 163050 162951 163655 164221 164067 163546 162982 162123 160834 159561 158750 158242 157516 156320 154988 154272 154661
56642 154661 155750 156551 156557 156059 155245 153802 151832 150415 150459 151486 152237 152074 151206 150065 149163 149057 149680 150084
56624 150084 149562 148669 148502 149340 150593 151590 151797 150871 149298 148458 149211 150817 152007 152582 153168 153969 154747
56607 154747 155596 156682 157584 157821 157750 158045 158661 159246 160139 161888 164059 165629 166408 167070 167849 168227 167903 167237
56589 167237 166740 166771 167630 169225 170840 171863 172565 173606 175158 177082 179426 182070 184499 186715 189674
56574A89674M180M270L112K597L858N701O617O696O578O219N820O460Q547J0921
56560B71250J2503J3554J4324J3965J2078R955Q986Q941Q860Q552Q051O900N030
56547D02949L272J909Qk789n223o300o918q248r870j0832j1330j1925j2254j1910
56533C10539j1493j1458j1019r537p816o724n744m375l603m299n316n022l837
56520B20296l404l964m371m095l634l308l032k862k694k013q98l40o32n90M52
56505A84911J208M82p35r10m54o91j330j078n2M42J15j84j38j70k51k5K40J87
56487A81567L65J422K768L378L335L281L097K395J673J613J903K015K310L116
56473B14238L650L257K821L346M103L808K767K280K635L288M163N176N384M320
$$ plain form
56574 189674 193854 198124 201236 203833 207691 213392 220009 226705 233283 239502 245322 251782 260329 271250
56560 271250 283753 297307 311631 325596 337674 347629 356615 365556 374416 382968 391019 397919 402949
56547 402949 406221 408130 408138 405349 400126 393826 386908 378660 368790 357958 346628 334703 322449 310539
56533 310539 299046 287588 276569 267032 259216 252492 246748 242373 238770 234471 229155 224133 220296
56520 220296 216892 212928 208557 204462 200828 197520 194488 191626 188932 186919 186021 185681 185049 184459 184911
56505 184911 186119 186601 185866 184956 184502 183811 182481 181403 181351 181793 181908 181724 181586 181416 181165 181140 181380 181567
56487 181567 181932 183354 186122 189500 192835 196116 199213 201608 203281 204894 206797 208812 211122 214238
56473 214238 217888 221145 223966 227312 231415 235223 237990 240270 242905 246193 250356 255532 260916 265236
56459B65236L238L409M058L717K606J868J468P64K05M49P34J10o39l88J34k24
56443B86745n53N77K114J853J51o22oQ5j213k646l365l951m543m346l382k779
56427B64119k883l011l073l719m721n140m971m917m719l635k260j812j976j562
56413B15720q99j254k182j985p53l20j070j353m18M81M19K5o9m6J80R07J420P05
56395B09508n08n33N54J084O78N96J214J521J305J384J557Q21k00L23K224L234
56379B24762K551J805J968J955J209R37J688K148J530R56J333J903J929J914K136
56364B50724J917J205J064J702J874J053L48N05P58M86K47M58P00R03J494K005
56348B67443J389J02j31R94K002K238K620L409L635L272L593M677M972M096L651
$$ plain form
56459 265236 268474 271883 275941 279658 282264 284132 285600 286364 286569 287018 287752 287862 287223 286835 286969 286745
56443 286745 286192 286769 288883 290736 290887 290265 290259 290344 289131 286485 283120 279169 274626 270280 266898 264119
56427 264119 261236 258225 255152 251433 246712 241572 236601 231684 226965 223330 221070 219258 217282 215720
56413 215720 214821 213567 211385 209400 208647 208327 207257 205904 205486 205967 206386 206411 206342 206296 206476 207383 208803 209508
56395 209508 209000 208467 209021 210105 210783 211379 212593 214114 215419 216803 218360 219181 218981 219304 221528 224762
56379 224762 227313 229118 231086 233041 234250 235187 236875 239023 240553 241509 242842 244745 246674 248588 250724
56364 250724 252641 253846 254910 256612 258486 259539 259887 260392 261150 261636 261883 262341 263041 263944 265438 267443
56348 267443 268832 268934 268803 269797 271799 274037 276657 280066 283701 286973 290566 295243 300215 304311 307962
56333C07962M439N210N136N151N873O452O347O164N884M621K893K692M315N605
56319C78744N360M952N408N502M199K585J775J063l55j704k180k288k491k280
56305C98290j675j676k317k208r54N0J16K50Q55Q50J19L15K056L767M430N047
56289D07315O194O748O418O834Q690J0274J0413J0409J1493J2872J3813J5216
56277E26689J7502J9380K0315K1767K4452K6962K8611L0939L4699L8268M0901
56266H30485M4700N1062N8119O4032P0134P8180Q7058R4991J02700J11512J20330
56255A713303J27281J32619J37376J40672J40871J37985J32681J24465J12824
56246B900077R8703Q2973O5220M5865K7473J1900j773j4595k5228l2276l7042
$$ plain form
56333 307962 312401 317611 322747 327898 333771 340223 346570 352734 358618 363239 366132 368824 373139 378744
56319 378744 384104 389056 394464 399966 404165 406750 408525 409588 409233 407529 405349 403061 400570 398290
56305 398290 396615 394939 392622 390414 389460 389510 389626 389876 390731 391581 391700 392015 394071 397838 402268 407315
56289 407315 413509 420257 426675 433509 442199 452473 462886 473295 484788 497660 511473 526689
56277 526689 544191 563571 583886 605653 630105 657067 685678 716617 751316 789584 830485
56266 830485 875185 926247 984366 1048398 1118532 1196712 1283770 1378761 1481461 1592973 1713303
56255 1713303 1840584 1973203 2110579 2251251 2392122 2530107 2662788 2787253 2900077
56246 2900077 2998780 3081753 3146973 3192838 3220311 3232211 3230438 3215843 3190615 3158339 3121297
56235C121297m1444m5165m7199m8467n0553n3502n6977o1841o8451p5235q0932
56224B491531q6401r2313r7215r9928j01612j03233j03375j00828r7060r3623
56214A515943q9456q3329p6746p1571o6922o1121n4779m9264m4157l8854l4714
56203H45030l2722l1046k7652k3518k0567j8393j5709j3122j1617j0267q123o425
56191F25869o247o029m188k060j408j230k2J096P04L56K174N046O555O862P458
56176F34936P941P282O591P302Q267P732O580O540O958O350N369N166M722K907
56162G24643J290J735L093L382L268M244N394N267N005O404Q738J0652J3072J7083
56148H13270K1253K4335K8365L5698M5261N5020O5591P8042R0736J02068J13752
$$ plain form
56235 3121297 3079853 3034688 2987489 2939022 2888469 2834967 2777990 2716149 2647698 2572463 2491531
56224 2491531 2405130 2312817 2215602 2115674 2014062 1910829 1807454 1706626 1609566 1515943
56214 1515943 1426487 1343158 1266412 1194841 1127919 1066798 1012019 962755 918598 879744 845030
56203 845030 812308 781262 753610 730092 709525 691132 675423 662301 650684 640417 632294 625869
56191 625869 619622 613593 609405 607345 605937 604707 604685 605781 606485 606841 609015 614061 620616 627478 634936
56176 634936 642877 650159 656750 664052 672319 680051 686631 693171 700129 706479 711848 717014 721736 724643
56162 724643 725933 727668 730761 734143 737411 741655 747049 752316 757321 763725 772463 783115 796187 813270
56148 813270 834523 858858 887223 922921 968182 1023202 1088793 1166835 1257571 1359639 1473391
56137A473391J27709J42270J54832J65158J72286J71690J60276J41387J20598
56128B829597R9782P9809O5071N9148N8394N5506M7479L5191J8346k937k3637
56117C321749l7375m3628m6683m9554n3994o3873q2047j04975j25794j41461j52194
56106B420171j56434j52287j42145j30194j16982j01624q6926p6371o8148n8290
56096A330770m7709m0141l5220k9894k4655k1991k0488j7013j2838j1164j0636
56085A059021p827m055k947l320j518J336J672Q64K780O046O474N221O551R377
56071A079675R245P084P544J0095J0311Q715R642J2514J2985J1669J2828J5467
56059A207774J4860J2016J2314J5452J6113J4087J4169J6454J6385J4232J4870
$$ plain form
56137 1473391 1601100 1743370 1898202 2063360 2235646 2407336 2567612 2708999 2829597
56128 2829597 2929379 3009188 3074259 3133407 3191801 3247307 3294786 3329977 3348323 3345386 3321749
56117 3321749 3284374 3240746 3194063 3144509 3090515 3026642 2944595 2839620 2713826 2572365 2420171
56106 2420171 2263737 2111450 1969305 1839111 1722129 1620505 1533579 1457208 1389060 1330770
56096 1330770 1283061 1242920 1207700 1177806 1153151 1131160 1110672 1093659 1080821 1069657 1059021
56085 1059021 1051194 1047139 1044192 1040872 1039354 1040690 1042362 1043226 1046006 1052052 1058526 1063747 1070298 1079675
56071 1079675 1088920 1096004 1103548 1113643 1123954 1132669 1142311 1154825 1167810 1179479 1192307 1207774
56059 1207774 1222634 1234650 1246964 1262416 1278529 1292616 1306785 1323239 1339624 1353856 1368726
56048A368726J8155J9176J7971J9263K2731K3464K1980K3615K8012K9620K8626
56037A621339L0726L5870L8117L7010L8131M1938M3202M2033M4081M9114N0976
56026B072537M9533N0985N5516N6712N4117N4187N7796N9061N7517N8853O2827
56015B689641O3369O1470O4533P2134P6363P6974Q1638R0338R4826R4843R9023
56004C565152J08155J13721J14833J19937J29832J36231J39162J47790J61770
55995D736583J70547J73642J82105J97007K07145K11391K21813K40624K56206
55986F597063K66614K83968L10492L34042L52965L80724M19750M56602M89502
55977I891722N33639N92184O50530P06872P78362Q68823R62568J059395J181401
$$ plain form
56048 1368726 1386881 1406057 1424028 1443291 1466022 1489486 1511466 1535081 1563093 1592713 1621339
56037 1621339 1652065 1687935 1726052 1763062 1801193 1843131 1886333 1928366 1972447 2021561 2072537
56026 2072537 2122070 2173055 2228571 2285283 2339400 2393587 2451383 2510444 2567961 2626814 2689641
56015 2689641 2753010 2814480 2879013 2951147 3027510 3104484 3186122 3276460 3371286 3466129 3565152
56004 3565152 3673307 3787028 3901861 4021798 4151630 4287861 4427023 4574813 4736583
55995 4736583 4907130 5080772 5262877 5459884 5667029 5878420 6100233 6340857 6597063
55986 6597063 6863677 7147645 7458137 7792179 8145144 8525868 8945618 9402220 9891722
55977 9891722 10425361 11017545 11668075 12374947 13153309 14022132 14984700 16044095 17225496
55968A7225496J335107J503734J688585J918866K208151K544526K938887L436554
55960C4799906M064122M815206N706811O792229Q097593R616155J1400472J3589200
55952I8881694J6302484J9590205K3527543K8239914L3680025L9325820M4016979
55945C03564664M5930645M2827854L2977423J6629374l201997k1851129l5448228
55938C81428606m2649250m4384567m2429784l8358422l3348984k8263047k3603354
55931A28391198j9533682j6068806j3209217j0908251r049233p528109o300976
55924D5792924n325732m527090l850418l291587k845098k472398k144685j869398
55916A9466518j650394j463099j290072j142721j027702r26556q26897p41131
$$ plain form
55968 17225496 18560603 20064337 21752922 23671788 25879939 28424465 31363352 34799906
55960 34799906 38864028 43679234 49386045 56178274 64275867 73892022 85292494 98881694
55952 98881694 115184178 134774383 158301926 186541840 220221865 259547685 303564664
55945 303564664 349495309 392323163 425300586 441929960 438727963 416876834 381428606
55938 381428606 338779356 294394789 251965005 213606583 180257599 151994552 128391198
55931 128391198 108857516 92788710 79579493 68671242 59622009 52093900 45792924
55924 45792924 40467192 35940102 32089684 28798097 25952999 23480601 21335916 19466518
55916 19466518 17816124 16353025 15062953 13920232 12892530 11965974 11139077 10397946
55908A0397946o76925o19273n58148n05351m68291m33873l93284l57589l34348
55899F050864l12685k85107k61474k48146k34919k15258j98786j91458j83322
55890C919709j67878j54327j48968j42964j30070j18717j15029j11011j00820
55881B729925r2237r0868q8818q0084p1990p0462o8682o1085n4447n4405n4475
55870A942372m9118m4659m6657m8813m4871l9837l9254l8560l2941k6966k4945
55859A505751k2161j4892q756p960o591J44N854L481l323q355j3309k1089k7384
55846A381410k8047k7178k9419l1700l0479k9454l2202l4726l3040l0793l1919
55835A042453l2978l0312k7411k7796k7786k3790j9699j9606k0022j6818j3089
$$ plain form
55908 10397946 9721021 9101748 8543600 8038249 7569958 7136085 6742801 6385212 6050864
55899 6050864 5738179 5453072 5191598 4943452 4708533 4493275 4294489 4103031 3919709
55890 3919709 3751831 3597504 3448536 3305572 3175502 3056785 2941756 2830745 2729925
55881 2729925 2637688 2546820 2458002 2377918 2305928 2235466 2166784 2105699 2051252 1996847 1942372
55870 1942372 1893254 1848595 1801938 1753125 1708254 1668417 1629163 1590603 1557662 1530696 1505751
55859 1505751 1483590 1468698 1459942 1451982 1445391 1445535 1451389 1454870 1451547 1443192 1429883 1408794 1381410
55846 1381410 1353363 1326185 1296766 1265066 1234587 1205133 1172931 1138205 1105165 1074372 1042453
55835 1042453 1009475 979163 951752 923956 896170 872380 852681 833075 813053 796235 783146
55824G83146j2768j2975j0243p912r821j2675j2115j0501j1406j2116q983m799
55812F56832l655l609j359Q81o1j882j531j371m148o841o070m673o336q572p621
55797E99984n637o391q331q445q578j1345j4045j3177j1024j1343j2506j1137
55785D78025q638p795o823l069R41J401m00j444l115p872j3305j5572j5672j6544
55771C80118j7201j5406j2930j2458j2398j0287q067q547r922r281q202r250j0428
55758B35741q867o676p265q973q357o633o814p402n100j165J068K502O049J0409
55744A88517J2028J1240J0743J0036P073L404K019J940L65j762j737n74j090k417
55730B39785j867m46j043k868l093k320l076m546m165k814l109m128l234j511
$$ plain form
55824 783146 770378 757403 747160 739248 729427 716752 704637 694136 682730 670614 661631 656832
55812 656832 653177 649568 648209 649090 649029 647147 645616 644245 640097 633256 627186 622513 616177 607605 599984
55797 599984 594347 587956 579625 571180 562602 551257 537212 524035 513011 501668 489162 478025
55785 478025 469387 461592 454769 451700 452641 454042 453642 452198 449083 441211 427906 412334 396662 380118
55771 380118 362917 347511 334581 322123 309725 299438 291371 282824 272902 263621 255419 246169 235741
55758 235741 226874 220198 212933 203960 195603 188970 182156 174754 169654 168489 169557 172059 178108 188517
55744 188517 200545 211785 222528 232564 239637 243041 245060 247000 247365 245603 243866 243292 242202 239785
55730 239785 237918 237472 236429 233561 230468 228148 225072 220526 216361 213547 210438 206310 203076 201565
55716B01565j923l523l035q92j52n59P80L631M995M599M892O173O572O229O744
55701B36096P262N829L710L549M254K657n91j973j242j465l326m444m211m449
55687B41656n277m942l650l255l261j555J177K100J142R63K162K744K204K035
55673B34243K258J486K68M75J633J686R05J177J989J345k5K75J582J068j001j536
55657B47828j24M53o17j049J8O63J7n84q37k056m063n149n536p136r670j0699
55641B01459r807r058r002q081o310n648o207n821m039k969l468l965l634l393
55627A20057l250k063m22m01j878k417j323n42r87j304q36p12j285j469j115j244
55611I8809j609r60J59o7j322j465l81j86j349j974j310o99n85J46J351J408L05
$$ plain form
55716 201565 199642 196119 193084 192192 192040 191481 192261 195892 200887 205486 210378 216551 223123 229352 236096
55701 236096 243358 249187 252897 256446 260700 263357 262766 260793 259551 258086 254760 250316 246105 241656
55687 241656 236379 231437 227787 224532 221271 219716 220893 222993 224135 225098 227260 230004 232208 234243
55673 234243 236501 237987 238255 238730 240363 242049 242954 244131 246120 247465 247440 247715 249297 250365 249364 247828
55657 247828 247704 248157 247540 246491 246509 247172 247189 246605 245768 243712 239649 234500 228964 221828 212158 201459
55641 201459 191652 182594 173592 165511 159201 153553 147346 141525 137486 134517 131049 127084 123450 120057
55627 120057 116807 114744 114322 113921 112043 109626 108303 107761 106774 105470 104634 103922 102637 101168 100053 98809
55611 98809 97200 96240 96399 96332 95010 93545 93164 92978 91629 89655 88345 87646 87061 87207 88558 89966 90271
55594I0271j13N32O56r6k83K94K00o44o99M8j33j331j636o60k20r80j478j078
55576H2650q09q20m1J206J289L41J66Q54P33o6M56K320L199K405J709J615N19
55559I7726j665k750k106j669k219k146r52m01j018r98K60R46M12M68J774K442
55543H8104J606J001J501J575O90P77K518L591K582J419J855K648K295J739K076
55528A15977K311J543Q85J117Q65q56k549k773k508l113l984m102l911l958l618
55513I1326k755k561l372l673k777k193k920l669l297k739k918l020k412k059
55499E0961k403k037k18J453J507P05J57m66j373j487m86J02n68j166p00k52o57
55482D3072q04M8N95m0n32J65P98K32m16m2K76n40j334r31m38j074j702r08L06
$$ plain form
55594 90271 90158 90690 91346 91250 90967 91261 91461 90817 90118 90166 90033 88702 87066 86406 86186 85206 83728 82650
55576 82650 81841 81021 80980 82186 83475 83816 83982 84836 85569 85503 85959 88279 91478 93883 95592 97207 97726
55559 97726 96061 93311 91205 89536 87317 85171 84219 83818 82800 81802 82062 83008 83420 83888 85662 88104
55543 88104 89710 90711 92212 93787 94477 95254 97772 101363 103945 105364 107219 109867 112162 113901 115977
55528 115977 118288 119831 120716 121833 122698 121842 119293 116520 114012 110899 106915 102813 98902 94944 91326
55513 91326 88571 86010 82638 78965 76188 73995 71075 67406 64109 61370 58452 55432 53020 50961
55499 50961 48558 46521 46303 47756 49263 49968 50125 49659 48286 46799 46313 46415 45847 44681 43981 43729 43072
55482 43072 42268 42316 42911 42871 42339 42504 43302 43534 43118 43076 43352 42812 41478 40547 40109 39035 37333 36425 36731
55463C6731L64r0L14R48M98m11l71K33J42l27n7O11N89J06N9P8p17j732j632m99
55443C4837L96M78J60j91l71m9N99P43K13k0N21R92Q37P60J207J418J001Q15J203
55424D5549J114J07n39m2M43l2n14j23J80n00j117n22M72O38M17O28P38K50K10
55405D7357J347K266J496k1n06j32j77o44p54p71j310j811j535j131j472j917
55389D0285j460n65k30k56o1j17q36j265o08J67m3m64L9O75P8j132j267l46J54
55370C2748k85q87j160j157p32N5L89j37o40l72Kj87k50M43R67M64j99J6L65j21
55350B9322o01K4P50l3j626j965p60M34P60O58L90q5k05N25J362J286O43L65L02
55331C1546j38n58l30J8k62o61m55k49q74j631j381n04l0K26R47J628J446R43
$$ plain form
55463 36731 37095 37005 37319 38267 38765 38354 37983 38216 38358 38031 37974 38585 39174 39280 39339 39417 38700 36968 35336 34837
55443 34837 35233 35711 35871 35680 35309 35260 35859 36602 36815 36795 37316 38308 39145 39905 41112 42530 43531 44346 45549
55424 45549 46663 46770 46231 46189 46632 46600 46086 45963 46143 45643 44526 44004 44476 45114 45531 46159 46897 47147 47357
55405 47357 48704 50970 52466 52445 51939 51807 51630 50986 50232 49461 48151 46340 44805 43674 42202 40285
55389 40285 38825 38260 38030 37774 37713 37596 36760 35495 34887 35054 35011 34547 34586 35261 35339 34207 32940 32594 32748
55370 32748 32463 31576 30416 29259 28527 28582 28971 28834 28194 27822 27824 27637 27387 27830 28797 29261 29062 29078 29443 29322
55350 29322 28721 28745 29495 29462 27836 25871 25111 25545 26305 26963 27353 27268 27063 27588 28950 30236 30879 31244 31546
55331 31546 31408 30850 30520 30538 30276 29615 29160 28911 28037 26406 25025 24521 24491 24717 25664 27292 28738 29681
55313B9681J017J143M22m60k49P15J162R54O86J45r43j581q90R2m0o85m84R7k83
55294C0499j164j038q1L82M36J165K108J763L43m61l44n42j207j100j09L25l36
55277C0639r05n86k2J72K85M99N12L68M10L66k29r13q94m60m38o48l92J8j25l24
55257B7333L48J335J286K91l64l60l88l98K26R73O70m51r83n76j38J4M07Q94O86
55238C0805p5m39k28nK47Q28J160N89j02K04Q87N60m26o12o2p3n88m22J80k51
55218C2177j520j707l30Q77Q60O08R52J212Q50N52Q45J180J069P13J33q90j778
55201C5803j578n59R9J97M85Q80N85r7j32J60m65j624j559k17M28l09p33J82J061
55182C2607N86m09o14k49p0R2N12P07M28M08J061J611J309N45l7n01j054j431
$$ plain form
55313 29681 30698 31841 32263 31803 31554 32269 33431 34385 35071 35216 34273 32692 31802 31894 31854 31169 30685 30782 30499
55294 30499 29335 28297 28216 28598 29034 30199 32307 34070 34413 33952 33608 33066 31859 30759 30650 30975 30639
55277 30639 29734 29148 29126 29298 29583 30082 30594 30962 31372 31738 31509 30596 29702 29242 28804 28156 27764 27782 27657 27333
55257 27333 27681 29016 30302 30593 30229 29869 29481 29083 29309 30282 30952 30501 29518 28942 28804 28818 29225 30119 30805
55238 30805 30730 30291 30063 30058 30305 31133 32293 32882 32780 32984 33871 34431 34005 33393 33331 33258 32670 32248 32428 32177
55218 32177 30657 28950 28620 29497 30357 30965 31917 33129 33979 34531 35376 36556 37625 38338 38471 37581 35803
55201 35803 34225 33666 33765 33962 34447 35327 35912 35815 35683 35843 35378 33754 32195 31978 32406 32097 31364 31546 32607
55182 32607 33193 32784 32170 31921 31851 31943 32455 33162 33590 33998 35059 36670 37979 38524 38487 37986 36932 35501
55164C5501j453j366j251r23n47m81m12J82R11R17L43O5J45j6k66l2K03l93j099
55145C0028m57J115J709R31L31N76O07j8l41j32m87j440j311N60K531L194L191
55128D0587L464L589L059K513K444K227J436P20M63R5n16o76n65j459l285l984
55112E0112k446k52P33O95N10m4j125j564n72O12M76m76p56k12K53L84N39O58
55094D7525M93L25L98L92K03L70R26R27j3q38o00J01K72N3J28N28R73J529K042
55075E5734J890J041L96M27N05K80L94J074J364O95nK04Q86J255J340J291P70
55058F9541m5j88L69K55r97j785r24L27K59o17p18O5P54J251K029K618K215J334
55040G5743J118J422J091o1j079j407j391j289r60m30RJ70p2p41j246p05O81J469
$$ plain form
55164 35501 34048 32682 31431 30508 29961 29480 29068 29250 30161 31078 31421 31486 31631 31615 31349 31317 31520 31127 30028
55145 30028 29571 30686 32395 33326 33657 34233 34840 34822 34481 34349 33862 32422 31111 31671 34202 37396 40587
55128 40587 44051 47640 50699 53212 55656 57883 59319 60039 60502 60597 60081 59405 58840 57381 54096 50112
55112 50112 47666 47414 48147 48842 49352 49308 48183 46619 46047 46659 47135 46659 45903 45691 45944 46328 46867 47525
55094 47525 48018 48343 48741 49133 49336 49706 50632 51559 51546 50708 50108 50209 50481 50534 50662 51190 52163 53692 55734
55075 55734 57624 58665 59061 59488 59993 60273 60667 61741 63105 63800 63795 63999 64885 66140 67480 68771 69541
55058 69541 69496 69308 69677 69932 68935 67150 66226 66553 66812 66195 65477 65542 66296 67547 69576 72194 74409 75743
55040 75743 76861 78283 79374 79313 78234 76827 75436 74147 73187 72757 72766 72936 72864 72123 70877 70172 70853 72322
55022G2322J009M77R59J637J161j83j128j436j780k167k029j550j490j824j778
55007F2200j084k47L31N86L87k38p16n32k0J41n7q3K62P12R79Q86L55l05n65m04
54987F2588l40m58k19N14J142J391J680K081J988J370J171J751K123J582Q81R02
54971H0147J264J290J299J850K666L308M107N381O579P179P632Q442R274R936
54957A50354J1120J3155J4930J5268J4504J3502J2023R275N342Q68l937q816j2738
54944B34850j4924j5820j6123j5632j4175j2613j1656j0579q523o237n095n022
54932I8451m850m111l176k169j094l77p2P29K422L663L181J986K071L516M690
54917A04860M967N369O641Q380J0167J2018J3531J3926J3097J1614R636O817L219
$$ plain form
55022 72322 73331 73808 74767 76404 77565 77382 76254 74818 73038 70871 68842 67292 65802 63978 62200
55007 62200 61116 60869 61200 61786 62173 61935 61219 60687 60667 60808 60751 60668 60930 61642 62621 63507 63862 63557 62992 62588
54987 62588 62248 61790 61571 62085 63227 64618 66298 68379 70367 71737 72908 74659 76782 78364 79245 80147
54971 80147 81411 82701 84000 85850 88516 91824 95931 101312 107891 115070 122702 131144 140418 150354
54957 150354 161474 174629 189559 204827 219331 232833 244856 254131 259473 260341 256404 247588 234850
54944 234850 219926 204106 187983 172351 158176 145563 133907 123328 114805 108568 103473 98451
54932 98451 93601 89490 86314 84145 83051 82674 82602 83331 85753 89416 92597 94583 96654 100170 104860
54917 104860 109827 115196 121837 130217 140384 152402 165933 179859 192956 204570 214206 221023 224242
54904B24242n99m334p857j0694j2491j3669j4670j4956j3764j1504r292p482n725
54891I7205m140l285l071k822k285j711j213q47r37j476j707j177n97o93r40n34
54875F9770Q9J8m99n50k58m67j131j433j252j211j451j544j482j531j439q89l85
54858E4355n52r57q17m27n19p37j76Q73J269Q57M80L05k79j202j647j510j522
54841D7794j838j799j209n75J2R88K207K852K616J890Q73m56j526j487l88R23
54825E0877J984K787L031K480J839J954K356J886O39p2L07J057J647K295K995
54810G8062L316L435M122N468O753P732Q903J0379J1559J2190J2674J3209J3506
54797A91308J3399J2684J0637O747J929k194n156p684r954j1235j1211j0482r565
$$ plain form
54904 224242 223643 219309 211452 200758 188267 174598 159928 144972 131208 119704 110412 102930 97205
54891 97205 93065 89780 86709 83887 81602 79891 78678 77831 76894 75418 73711 72534 71937 71244 70304 69770
54875 69770 69859 69877 69378 68828 68570 68103 66972 65539 64287 63076 61625 60081 58599 57068 55629 54740 54355
54858 54355 53803 52846 52029 51602 51083 50346 50170 51043 52312 53169 53649 53954 53675 52473 50826 49316 47794
54841 47794 45956 44157 42948 42373 42385 43373 45580 48432 51048 52938 53811 53355 51829 50342 49954 50877
54825 50877 52861 55648 58679 61159 62998 64952 67308 69194 69833 69761 70068 71125 72772 75067 78062
54810 78062 81378 84813 88935 94403 101156 108888 117791 128170 139729 151919 164593 177802 191308
54797 191308 204707 217391 228028 234775 236704 234510 229354 221670 211716 200481 189270 178788 169223
54784A69223q592p925p866p765o693m999l902l548k914j693p39m03K9Q78J477
54769A14568J520J696K485L520M525N762P085P859Q210R200J1183J3140J4211
54756B04964J4778J5388J5606J4736J2863J0554Q064N374K459p81m287p335r007
54743B83376r394r636j0515j1632j2182j1975j1437j1069j1035j1000j0515r717
54731A53269r217q898p774n653l940l694l912l180k045j948k624k585j802j654
54717I4343k309k358j261q6N56J225J908J590K82m35J90Q39K76q22j177p47k55
54700I1759OP6m2RP34J700J721N82n36q22q33j164j459j298r01m05M73J536K017
54681I3153J858J865K200K059J301R14J275J453J010R56J991L225L664L767M410
$$ plain form
54784 169223 160631 152706 144840 137075 130382 125383 121481 117933 115019 113326 112587 112184 112213 113091 114568
54769 114568 116088 117784 120269 123789 128314 134076 141161 149020 157230 166430 177613 190753 204964
54756 204964 219742 235130 250736 265472 278335 288889 296953 302327 304786 304005 299718 292383 283376
54743 283376 273982 264346 253831 242199 230017 218042 206605 195536 184501 173501 162986 153269
54731 153269 144052 135154 127380 121727 117787 114093 110181 107001 104956 103008 100384 97799 95997 94343
54717 94343 92034 89676 88415 88329 88885 90110 92018 93608 93890 93455 93645 94484 94760 93938 92761 92014 91759
54700 91759 91765 91841 91799 91808 92542 94242 95963 96545 96009 95187 94354 93190 91731 90433 89532 89127 89600 91136 93153
54681 93153 95011 96876 99076 101135 102436 103350 104625 106078 107088 108044 110035 113260 116924 120691 125101
54666A25101N445O272O849P140O579N068L616L063K996K680K135J610R73L81N29
54651A80437J477K251K355K557L414M262M582N127O595Q298R337J0148J1549J3207
54637B65596J4194J4378J4033J2746R918N891J500l018p760j2237j5599j7482
54625B82160j7969j7221j5723j4271j3069j1549r574p962p152o328m753l055k165
54612A51369j816j104QQ07J004Q86O97O08Q75J347J282K34j333k785l974m705
54596A43400m473l377k502k585l073l178l090l312l571l306k633k090j898k089
54582A02223k730l444l480k777k182k077j767q44l6L1j00J60L43j29q30j134j253
54565G9974j433j109M9J152J316J065J311J758J501O02j70n88q39p40j87K06k4
$$ plain form
54666 125101 130546 136818 143667 150807 157386 162454 166070 169133 172129 174809 176944 178554 179527 179908 180437
54651 180437 181914 184165 186520 189077 192491 196753 201335 206462 213057 221355 230692 240840 252389 265596
54637 265596 279790 294168 308201 320947 330865 336756 338256 335238 327478 315241 299642 282160
54625 282160 264191 246970 231247 216976 203907 192358 182784 174822 167670 161342 156589 153534 151369
54612 151369 149553 148449 148457 149264 150268 151154 151851 152459 153334 154681 155963 156197 154864 152079 148105 143400
54596 143400 138927 135550 133048 130463 127390 124212 121122 117810 114239 110933 108300 106210 104312 102223
54582 102223 99493 96049 92569 89792 87610 85533 83766 82922 82886 82917 82817 82977 83320 83191 82361 81227 79974
54565 79974 78541 77432 77481 78633 79949 81014 82325 84083 85584 86186 86016 85428 84589 83849 83662 83868 83844
54548H3844k77J32Q08J114J343J881K072J325N97J158K465K962K626K928M284
54533A09262N325N080M466M924O567Q252Q926Q456P460O469N179K891k45l065
54519A79947m848o139p460q151p488o204n685o077o351n897n022m057l017k027
54505A01524j337r67q79j154j487j138n7O31J19p84q70l18j72n56p01m50l83n79
54487I0442l65N80J723K363K237J545Q60O86P84M18l79o19j2K94n29j485j279
54470I7264l72j09m80l21O16J306J035J23q92j661j777j104k74K5k7N8N3m95j225
54451I1743j455j342j427j536j155n14k26k29j46k46r30j739j998j909j911j615
54435G3365o17K60M3o61n54K10M89K92O25J425J521O86m3k39n15q71m16Q67J712
$$ plain form
54548 83844 83567 83699 84507 85621 86964 88845 90917 92242 92839 93997 96462 99424 102050 104978 109262
54533 109262 114587 119667 124133 129057 135624 143876 152802 161258 168718 175187 180366 183257 183012 179947
54519 179947 175099 168960 161500 153349 145861 139657 133972 127895 121544 115647 110625 106568 103551 101524
54505 101524 100187 99220 98341 97187 95700 94562 94505 95136 95255 94471 93601 93283 93111 92555 91854 91404 91021 90442
54487 90442 90077 90657 92380 94743 96980 98525 99385 100071 100855 101273 100894 100275 100263 100557 100028 98543 97264
54470 97264 96892 96783 96303 95982 96598 97904 98939 99062 98170 96509 94732 93628 93354 93379 93352 93410 93463 92968 91743
54451 91743 90288 88946 87519 85983 84828 84314 84088 83859 83713 83467 82537 80798 78800 76891 74980 73365
54435 73365 72748 73008 73051 72390 71836 72046 72535 72827 73452 74877 76398 77084 77041 76802 76287 75416 75000 75867 77579
54416G7579J497J167J588K287K410J943J349R53J033J680K260K020J319J349K404
54401A02838L591M336M991N684N844N337M949N177N455N069M068K862J676O91
54387A62568N0n22j411k318k590k341k415l115l841m121m053l723l048k328k064
54372A24728k133k019j859k241k957l101k484j887j711j459p90r1L21N37N15R8
54356A03467k66Q1Q04Q47J12k86L06J272J875K152K345K476K844L848N023N269
54340A32169M452L715L789M086L841L170K411J487L88n32j271k343l782m803m931
54325A41846m671m652m910n291n693n618m513k918k247k923l726l523k715k279
54311H6167k329k367k269k184k020j643j243r94p86o22p60j176j439j358j200
$$ plain form
54416 77579 79076 80243 81831 84118 86528 88471 89820 90773 91806 93486 95746 97766 99085 100434 102838
54401 102838 106429 110765 115756 121440 127284 132621 137570 142747 148202 153271 157339 160201 161877 162568
54387 162568 162618 162096 160685 158367 155777 153436 151021 147906 144065 139944 135891 132168 129120 126792 124728
54372 124728 122595 120576 118717 116476 113519 110418 107934 106047 104336 102877 102087 101996 102317 102854 103369 103467
54356 103467 103201 103282 104086 104933 105045 104759 105065 106337 108212 110364 112709 115185 118029 121877 126900 132169
54340 132169 136621 140336 144125 148211 152052 155222 157633 159120 159508 158976 157705 155362 151580 146777 141846
54325 141846 137175 132523 127613 122322 116629 111011 106498 103580 101333 98410 94684 91161 88446 86167
54311 86167 83838 81471 79202 77018 74998 73355 72112 71118 70332 69710 68950 67774 66335 64977 63777
54296F3777j059o93j88o4m33o85l62K43O04N32J13l81m60N9N52L50j53l6O20Q19
54276F3155K70k75m05o10j075j157m80L97Q82J039J019P80O13J031J767J946J464
54259G0361J198J442J372N32l16m40j37Q9M24J074J615J676J464J121L92n64r60
54242H0343n13L5P8r2j47l64q70j130q86p01r58j185r63o68o83o73k83K38N87
54223G1165Q40Q75K98n68o40L75J368J353P01J95j06l55k54K28L45l81j298j577
54205G2564j280q77m21P4K26m2j72J43M80O21R76J485J254L0r79p38J23M06O2
54186G3935k51n02j061j679j758j267n69J28N89L84l42o89k59J88j3l42j32K05
54168F6565j6m88n17k35j56j30K75P57O81J32k36j63J37M55N80K50l06l34M31
$$ plain form
54296 63777 62718 62025 61837 61773 61340 60655 60293 60536 61140 61672 61785 61404 60944 61003 61555 61905 61752 61716 62336 63155
54276 63155 63425 63150 62745 62135 61060 59903 59423 59820 60702 61741 62760 63540 64153 65184 66951 68897 70361
54259 70361 71559 73001 74373 74905 74589 74149 74012 74101 74525 75599 77214 78890 80354 81475 81867 81303 80343
54242 80343 79830 79865 79943 79851 79704 79340 78470 77340 76454 75753 74795 73610 72647 71979 71296 70623 70340 70578 71165
54223 71165 72005 72880 73178 72610 71970 72345 73713 75066 75767 75962 75856 75501 75247 75475 75820 75439 74141 72564
54205 72564 71284 70407 69986 70060 70286 70244 70072 70215 70695 71316 72292 73777 75031 75061 74082 73344 73467 73873 73935
54186 73935 73684 73182 72121 70442 68684 67417 66848 66976 67565 67949 67607 66918 66659 66847 66834 66492 66360 66565
54168 66565 66549 66061 65544 65309 65153 65023 65298 66055 66736 66868 66632 66469 66606 67061 67641 67891 67585 67251 67682
54149F7682J291J550J300Q31J18o03p22k65j18o02r00n00l8q0k31k81q05j702
54131F5925j651k55P79M0j312j442o85o01j211j249n68j43j15K73R37R91M45K45
54113F0403O54J058J267J529J509O90k82l34J34k65j528k029r81M66R86N89q1
54096F3785o79r30n84n9j90r69j443j136o68n43l56L44J138J283O85o2l70j60
54078E9086J22P4n4L68J255J616R35K5j59J43K21K08N84J022R33O53Q10R49J85
54059F8976j097j516o15P52J807K396K355J631R96J280J904J518J51o72j31R08
54043H0643J465J597J669J628J586K007K898L628M000M474N057M984M054L350
54029A23040L920N411O577O715O115N489N254N174M637L580K818L016L612L540
$$ plain form
54149 67682 68973 70523 71823 72654 72772 72169 71447 71182 71064 70462 69562 69062 69024 68944 68713 68432 67627 65925
54131 65925 64274 64019 64798 64838 63526 62084 61399 60798 59587 58338 57770 57627 57512 57785 58722 59713 60158 60403
54113 60403 61057 62115 63382 64911 66420 67110 66828 66494 66628 66363 64835 62806 61825 62291 63277 63866 63785
54096 63785 63106 62176 61592 61533 61343 60374 58931 57795 57127 56584 56228 56572 57710 58993 59678 59616 59246 59086
54078 59086 59208 59282 59228 59596 60851 62467 63402 63427 63268 63411 63632 63840 64424 65446 66379 67032 67842 68791 68976
54059 68976 67879 66363 65748 66500 68307 70703 73058 74689 75685 76965 78869 80387 80538 79866 79735 80643
54043 80643 82108 83705 85374 87002 88588 90595 93493 97121 101121 105595 110652 115636 119690 123040
54029 123040 126960 132371 138948 145663 151778 157267 162521 167695 172332 175912 178730 181746 185358 188898
54015A88898K732K020J737J437R74P58Q09N44k87j250k009k685l353l845m236
54000A82244m667m802m185l219k830l144l372l112k824k850k904k751k550k269
53986A36765j673j092j326k404l227k895j748p96n86r60j380j356q86m57l40p9
53970A15560P61J719K060J924J944K055J719J181J270J950K224J725J257J418
53956A38767J726J536J004O54N95N48K73k25n48j77P75J389J138P33J028J656
53940A50872J835J924K891M501N548N700N620N386M344K736J791J798J545J99
53926A96690j565k719k948k208n07J342K082J680J543K482L674M120L966L763
53912B11395L602L634M358N615O376O196N926O289O765O551N708M566K957Q70
$$ plain form
54015 188898 191630 193650 195387 196824 197798 198556 199365 199909 199622 198372 196363 193678 190325 186480 182244
54000 182244 177577 172775 168590 165371 162541 159397 156025 152913 150089 147239 144335 141584 139034 136765
53986 136765 135092 134000 132674 130270 127043 124148 122400 121604 121018 120058 118678 117322 116436 115979 115639 115560
53970 115560 116321 118040 120100 122024 123968 126023 127742 128923 130193 132143 134367 136092 137349 138767
53956 138767 140493 142029 143033 143687 144282 144830 145103 144878 144330 144153 144928 146317 147455 148188 149216 150872
53940 150872 152707 154631 157522 162023 167571 173271 178891 184277 188621 191357 193148 194946 196491 196690
53926 196690 195125 192406 189458 187250 186743 188085 190167 191847 193390 195872 199546 203666 207632 211395
53912 211395 214997 218631 222989 228604 234980 241176 247102 253391 260156 266707 272415 276981 279938 280808
53898B80808r35j753j848j904k201k742l478m026l947l653m143n377o094n685
53884B33022n152n489o195o244n616m979m664m712n166n598n185l928l027l219
53870A63848l680l338k509k207k652l312l865m196m057l506l198l420l449k618
53856A17841j430p96p66q54j046j618k278k452k162j907j852j737j421j025o53
53841I5844l15M6N70J152J192K88q54j037k08M48K43k51l66j99Q9O88J328J204
53823I9862K45n85p70q46j061q36j75o9o16l55J361K879K593J416J236K098K705
53806A09082K738K818K807K122J357J712K985L831L877M062M800N333N124M569
53792A57217M145L838L640L650L633L265K738K417K047J242L97K14N80Q94J121
$$ plain form
53898 280808 279873 278120 276272 274368 272167 269425 265947 261921 257974 254321 250178 244801 238707 233022
53884 233022 227870 222381 216186 209942 204326 199347 194683 189971 184805 179207 174022 170094 167067 163848
53870 163848 160168 156830 154321 152114 149462 146150 142285 138089 134032 130526 127328 123908 120459 117841
53856 117841 116411 115615 114849 113995 112949 111331 109053 106601 104439 102532 100680 98943 97522 96497 95844
53841 95844 95529 95575 96145 97297 98489 98777 97923 96886 96678 97126 97369 97118 96752 96553 96642 97330 98658 99862
53823 99862 100107 99522 98752 97906 96845 96009 95834 95765 95149 94794 96155 99034 101627 103043 104279 106377 109082
53806 109082 111820 114638 117445 119567 120924 122636 125621 129452 133329 137391 142191 147524 152648 157217
53792 157217 161362 165200 168840 172490 176123 179388 182126 184543 186590 187832 188229 188443 189023 189917 191038
53777A91038J451J320M7j728k530k017j292j237j634k030k370k604k648k830l561
53762A67375m450m723m409m196m139l611k545j692j384j121n82j32pO3J80N7k31
53745A34453j21N24J127J329J467J805K048J949J683J333O09n04j429j717j593
53730A42963j444j288j042r43j271j923k508k660k221j392o83m30l88j81K2k33
53714A24378q07j004n88j43j79l65k7R20J821J998J448Q96J045J738K109J630
53698A34870P69L05N06J284K658M405N576N217L556J893J201J381J838K269K764
53683A70492L484M396N113N122M343L342K707K396J960J182K61m29o01l49k84
53668B03135r23j818j932j111m21o16j115j124r17j162j709j950j867j785j536
$$ plain form
53777 191038 192489 193809 193856 192128 189598 187581 186289 185052 183418 181388 179018 176414 173766 170936 167375
53762 167375 162925 158202 153793 149597 145458 141847 139302 137610 136226 135105 134523 134391 134384 134447 134627 134684 134453
53745 134453 134332 134856 135983 137312 138779 140584 142632 144581 146264 147597 148206 147702 146273 144556 142963
53730 142963 141519 140231 139189 138246 136975 135052 132544 129884 127663 126271 125588 125158 124770 124589 124611 124378
53714 124378 123571 122567 121979 121836 121657 121292 121265 122185 124006 126004 127452 128348 129393 131131 133240 134870
53698 134870 135639 135944 136450 137734 140392 144797 150373 155590 159146 161039 162240 163621 165459 167728 170492
53683 170492 173976 178372 183485 188607 192950 196292 198999 201395 203355 204537 204798 204369 203768 203419 203135
53668 203135 202212 200394 198462 197351 196930 196314 195199 194075 193158 191996 190287 188337 186470 184685 183149
53653A83149q40m6L56N60Q73Q93K61k81K17J289J584Q16n6m71q42j348j450q51
53635A83813p5K07j88j033j720j442j17J114J138L42q0J29M10Q16J842K950K845
53618A90951J495L98M85J106J501J941K750L387L252K622K151K142K646L509M100
53603B24436L853L247L261L738L534K585K326L461M767M995M646M748N080M880
53589B79557M372M210M063L284K443K749M018M720M156L310L233L607L493K707
53575C29922J843J396J414J781K329K736K695K264J848J698J600J190N15lj36
53560C53092j8K95J001J961K407J797O71Q8L00O02M24jj83q3q7n07j177j471r36
53541C58175QM14J12K7P60J522J322N54L67Q93J303J335J533K023K330K418K764
$$ plain form
53653 183149 182309 182263 182619 183179 184052 184945 185206 184925 185142 186431 188015 188831 188775 188304 187462 186114 184664 183813
53635 183813 183738 183945 183757 182724 181004 179562 179445 180559 181697 182039 181959 182088 182498 183314 185156 188106 190951
53618 190951 192446 192844 193329 194435 195936 197877 200627 204014 207266 209888 212039 214181 216827 220336 224436
53603 224436 228289 231536 234797 238535 242069 244654 246980 250441 255208 260203 264849 269597 274677 279557
53589 279557 283929 288139 292202 295486 297929 300678 304696 309416 313572 316882 320115 323722 327215 329922
53575 329922 331765 333161 334575 336356 338685 341421 344116 346380 348228 349926 351526 352716 353231 353228 353092
53560 353092 353074 353369 354370 356331 358738 360535 361206 361294 361594 362196 362620 362619 362436 362353 362266 361759 360582 359111 358175
53541 358175 358183 358597 358709 358736 359496 361018 362340 362894 363261 364154 365457 366792 368325 370348 372678 375096 377860
53524C77860L345L671L914M723N859O346O226O693Q087R217R353R402J0204J1085
53510D75985J1164J0975J1520J2665J3720J4771J6151J7246J7230J6572J6517
53499F34516J7294J8110J8740J9911K1893K3829K4796K4789K4406K4140K4244
53488H76668K4797K5579K6131K6101K5452K4436K3496K2997K2856K2563K1912
53477A142988K1340K1356K1910K2628K3288K3646K3229K1851K0133J8986J8640
53466A379995J8599J8369J7832J6934J5543J3705J1728R880Q189O538M833L086
53454A525231J423k9j253k362l591n332p832j0673j2915j4190j5295j7030j8828
53441A417324j9435j8865j8542j9396k0815k1870k2504k2964k3052k2668k2345
$$ plain form
53524 377860 381205 384876 388790 393513 399372 405718 411944 418637 426724 435941 445294 454696 464900 475985
53510 475985 487149 498124 509644 522309 536029 550800 566951 584197 601427 617999 634516
53499 634516 651810 669920 688660 708571 730464 754293 779089 803878 828284 852424 876668
53488 876668 901465 927044 953175 979276 1004728 1029164 1052660 1075657 1098513 1121076 1142988
53477 1142988 1164328 1185684 1207594 1230222 1253510 1277156 1300385 1322236 1342369 1361355 1379995
53466 1379995 1398594 1416963 1434795 1451729 1467272 1480977 1492705 1502585 1510774 1517312 1522145 1525231
53454 1525231 1526654 1526625 1525372 1523010 1519419 1514087 1506255 1495582 1482667 1468477 1453182 1436152 1417324
53441 1417324 1397889 1379024 1360482 1341086 1320271 1298401 1275897 1252933 1229881 1207213 1184868
53430A184868k2463k2488k1807k0781k0168j9935j9396j8227j6631j4740j2647
53419I75585j0842r856r526r133q257p060n772m366k733q82J030K680L852M795
53405I19515O010P467Q546R093R993J2098J5049J7723J9543K0799K1858K2774
53393A090468K3551K4348K5354K6795K8853L1307L3528L5151L6539L8197M0061
53382A434152M1794M3385M4977M6401M7456M8431M9738N1146N2000N2095N1796
53371A963371N1368N0745M9948M9224M8570M7607M6095M4216M2206L9891L6833
53360B470074L2824K8197K3616J9541J5847J2098Q155M283O67k913o774j0989
53348B594626j5421j9766k3520k6346k8674l1401l4799l8189m1060m3837m6946
$$ plain form
53430 1184868 1162405 1139917 1118110 1097329 1077161 1057226 1037830 1019603 1002972 988232 975585
53419 975585 964743 954887 945361 936228 927971 920911 915139 910773 908040 907158 908188 910868 914720 919515
53405 919515 925525 932992 941538 950631 960624 972722 987771 1005494 1025037 1045836 1067694 1090468
53393 1090468 1114019 1138367 1163721 1190516 1219369 1250676 1284204 1319355 1355894 1394091 1434152
53382 1434152 1475946 1519331 1564308 1610709 1658165 1706596 1756334 1807480 1859480 1911575 1963371
53371 1963371 2014739 2065484 2115432 2164656 2213226 2260833 2306928 2351144 2393350 2433241 2470074
53360 2470074 2502898 2531095 2554711 2574252 2590099 2602197 2610352 2614635 2615302 2612389 2605615 2594626
53348 2594626 2579205 2559439 2535919 2509573 2480899 2449498 2414699 2376510 2335450 2291613 2244667
53337B244667m9645n0628m9684m8043m6901m6252m5310m3674m1747m0209l9329
53326A743245l8823l8313l7773l7437l7293l6921l5893l4161l1997k9706k7504
53315A357424k5456k3485k1507j9504j7408j5180j3203j2238j2477j2962j2557
53304A171447j1321j0253r794r391q492p127n434l455j561l20L05Q08J158R10
53290A107480N14J275L515N901P189P709Q345R170R977J1249J3370J5576J6872
53277A218142J7603J9005K1360K3599K4693K4622K3968K3232K2566K1780K0711
53266A461281J9735J9466J9660J9060J6865J3765J0913Q555O402M652L646K938
53254A606938J744lj887l912o261q485r961j0999j2501j4512j6138j6894j7334
$$ plain form
53337 2244667 2195022 2144394 2094710 2046667 1999766 1953514 1908204 1864530 1822783 1782574 1743245
53326 1743245 1704422 1666109 1628336 1590899 1553606 1516685 1480792 1446631 1414634 1384928 1357424
53315 1357424 1331968 1308483 1286976 1267472 1250064 1234884 1221681 1209443 1196966 1184004 1171447
53304 1171447 1160126 1149873 1140079 1130688 1122196 1115069 1109635 1106180 1104619 1104299 1104604 1105412 1106570 1107480
53290 1107480 1107994 1109269 1112784 1118685 1125874 1133583 1141928 1151098 1161075 1172324 1185694 1201270 1218142
53277 1218142 1235745 1254750 1276110 1299709 1324402 1349024 1372992 1396224 1418790 1440570 1461281
53266 1461281 1481016 1500482 1520142 1539202 1556067 1569832 1580745 1589300 1595702 1600354 1604000 1606938
53254 1606938 1608682 1608679 1606792 1602880 1596619 1588134 1578173 1567174 1554673 1540161 1524023 1507129 1489795
53241A489795j8175j9555k1263k2985k4228k4579k4209k3679k3264k2866k2433
53230A242559k2018k1513k0847k0231j9793j9219j8244j7184j6384j5549j4377
53219A037200j3512j3884j5203j6012j5403j3971j2861j2474j2305j1694j0559
53208H89322r540r363r954j0498j0629j0897j1783j2886j3699j4479j5536j6321
53196G43737j6157j5441j5151j5411j5545j5220j4647j3916j3128j2776j3072
53185E83273j3261j2644j1977j2535j4035j4872j4391j3549j3212j3069j2621
53174D37107j2054j1677j1413j1161j0867j0131q673p256p046p842q114p165o078
53161C17630o059o819p234o751n589m299l578l827m526m697m214l897m033l891
$$ plain form
53241 1489795 1471620 1452065 1430802 1407817 1383589 1359010 1334801 1311122 1287858 1264992 1242559
53230 1242559 1220541 1199028 1178181 1157950 1138157 1118938 1100694 1083510 1067126 1051577 1037200
53219 1037200 1023688 1009804 994601 978589 963186 949215 936354 923880 911575 899881 889322
53208 889322 879782 870419 860465 849967 839338 828441 816658 803772 790073 775594 760058 743737
53196 743737 727580 712139 696988 681577 666032 650812 636165 622249 609121 596345 583273
53185 583273 570012 557368 545391 532856 518821 503949 489558 476009 462797 449728 437107
53174 437107 425053 413376 401963 390802 379935 369804 361131 353875 346829 338987 330873 323708 317630
53161 317630 311571 304752 297518 290767 285178 280879 277301 273474 268948 264251 260037 256140 252107 248216
53147B48216l080k332k335k704k791k723k844k968k796k543k371j865p61L53P25
53132B17181M31P5j7K42J010K152K994L118K980L212L666L748L376K943K578K021
53116B51710J106J7q57j094o51k66r19k600m172m790m853n081n344n087m412l976
53100B08731m084m492m904n049m643l826l321l515l794l368k486k027k166k329
53086A58727k293k380k515k102j120m38o21j089j123j000j421k150k192j290m00
53071A36593m22j098j629j818j992k125j807j038l46J5L27O09L01p85j768j624
53055A21393m72O69J172J263J398J698J982J867R59o29k100k731k589k168j670
53040A20042j153r29j121j140l79P90J476J407Q87L7j012j466p27L95N09k89n46
$$ plain form
53147 248216 245136 242804 240469 237765 234974 232251 229407 226439 223643 221100 218729 216864 216103 216456 217181
53132 217181 217612 217687 217670 217912 218922 221074 224068 227186 230166 233378 237044 240792 244168 247111 249689 251710
53116 251710 252816 252833 251976 250882 250231 249965 249046 246446 242274 237484 232631 227550 222206 217119 212707 208731
53100 208731 204647 200155 195251 190202 185559 181733 178412 174897 171103 167735 165249 163222 161056 158727
53086 158727 156434 154054 151539 149437 148317 147879 147258 146169 145046 144046 142625 140475 138283 136993 136593
53071 136593 136171 135073 133444 131626 129634 127509 125702 124664 124318 124333 124660 125269 125570 124785 123017 121393
53055 121393 120921 121590 122762 124025 125423 127121 129103 130970 131929 131300 129200 126469 123880 121712 120042
53040 120042 118889 117960 116839 115699 115320 116110 117586 118993 119880 119917 118905 117439 116712 117107 117616 117327 116781
53023A16781K83J127J173R85J141J180P20M60J023J728J559O90R5J62N59R89J320
53006A31975J333R90O28L83o9p57j027m75L29P42R55J313J387O50m34r42p19k28
52988A36034M73J557K549K636J933J510K019L016L736L928L763L472L322L561
52974A73509M222N049N608N441M379K976K199K315K389J391n04k225l115l350
52960B00284l267k946k538k371k535k727k648k320j955j687j516j397j298j232
52946A69847j161r43n73l67o03j025j104p91n37m90k88K11O51Q41J132J717K128
52929A68645J899J254P01L53Q0q6j11j60k52j14K98N67M44K54L55O13P90Q79P87
52910A77196K38n82r69p20n14p35p76j26O68Q89Q11R74J035L72n73p86j94L33
$$ plain form
53023 116781 117064 118191 119364 120349 121490 122670 123390 123850 124873 126601 128160 128850 128945 129107 129666 130655 131975
53006 131975 133308 134298 134926 135309 135240 134483 133456 132981 133310 134052 135007 136320 137707 138357 137923 136981 136262 136034
52988 136034 136507 138064 140613 143249 145182 146692 148711 151727 155463 159391 163154 166626 169948 173509
52974 173509 177731 182780 188388 193829 198208 201184 203383 205698 208087 209478 208974 206749 203634 200284
52960 200284 197017 194071 191533 189162 186627 183900 181252 178932 176977 175290 173774 172377 171079 169847
52946 169847 168686 167743 167170 166803 166200 165175 164071 163280 162743 162253 161965 162176 162827 163668 164800 166517 168645
52929 168645 170544 171798 172499 172852 172932 172846 172735 172575 172323 172209 172507 173074 173518 173772 174127 174740 175530 176409 177196
52910 177196 177434 176852 175883 175163 174649 173914 173138 173012 173680 174569 175380 176354 177389 177761 177188 176402 176208 176541
52892A76541L76L52N56P66P78O47L64k0j41K03N95P01R72J818K499J965N79k20
52874A89331P0N08L12j98n39p79r27n50M38J379J750J822J980K014J578Q99N63
52857A99651Q63J679K740L769M615N311N807N785N107M226L623L031J952P79M68
52842B49406J020J265N25n15j081j598k906m768o067o228n732n281n031m759m292
52827B03958l624k844k117j596j290j076q71q16j211k160l269l850l550k638j625
52812A71421q58n32p72j390j843j805j490j198q42k84K46N07O54Q10O21j84j137
52795A61924j611j735j973k157j768j024p29j020j254j148j117j305j224p13l89
52780A42757o73j137j308j447j879k182j709o59Q9O3l46m63r8L44K87m08j304
$$ plain form
52892 176541 176917 177269 177825 178591 179369 180016 180380 180360 180219 180422 181017 181718 182690 184508 187007 188972 189551 189331
52874 189331 189401 189909 190221 190023 189484 188705 187778 187228 187666 189045 190795 192617 194597 196611 198189 199088 199651
52857 199651 200514 202193 204933 208702 213317 218628 224435 230220 235327 239553 243176 246207 248159 248938 249406
52842 249406 250426 251691 252216 251701 250620 249022 246116 241348 235281 229053 223321 218040 213009 208250 203958
52827 203958 200334 197490 195373 193777 192487 191411 190540 189724 188513 186353 183084 179234 175684 173046 171421
52812 171421 170563 170031 169259 167869 166026 164221 162731 161533 160691 160407 160653 161160 161814 162624 163245 163061 161924
52795 161924 160313 158578 156605 154448 152680 151656 150927 149907 148653 147505 146388 145083 143859 143146 142757
52780 142757 142084 140947 139639 138192 136313 134131 132422 131763 131852 131915 131569 131106 131008 131352 131639 131231 129927
52763A29927j896k131k208k083j639j160j087j312j327j063r91j289j602j811
52749A08328k248k868k937k033q16j97j70n2M77J071J282R40J11r19j684j876
52733I6409j623j283j086j035j011p98l31K9j65o97p66p1O67P19M20N95J250J561
52715I2784J209Q94J298K086K465K334K300K596K656K088J547J985L220L946L290
52700A26698J806O08Q7m1kO9k41j215k318k617j982j257j162j536j863j966j990
52683A11078k121k469k949l125k567j494p36q70j685k543k988k953k666k418k180
52668G7314j526l59N75M40m69r31m06L66N58L13K19L20K52qj17L2J36j19o73j147
52648G4770j165p11j68J19K31M48P60R47J002J084J172J233J581K477L335L121
$$ plain form
52763 129927 128031 125900 123692 121609 119970 118810 117723 116411 115084 114021 113030 111741 110139 108328
52749 108328 106080 103212 100275 98242 97426 97229 97059 97007 97484 98555 99837 100777 100888 99969 98285 96409
52733 96409 94786 93503 92417 91382 90371 89573 89242 89271 89106 88409 87643 87572 88239 88958 89378 89973 91223 92784
52715 92784 93993 94887 96185 98271 100736 103070 105370 107966 110622 112710 114257 116242 119462 123408 126698
52700 126698 128504 129112 129199 129158 129156 129225 128984 127769 125451 122834 120852 119595 118433 116897 115034 113068 111078
52683 111078 108957 106488 103539 100414 97847 96353 95617 94747 93062 90519 87531 84578 81912 79494 77314
52668 77314 75788 75429 76004 76444 75975 75044 74638 75004 75562 75875 76094 76414 76666 76658 76541 76573 76709 76590 75917 74770
52648 74770 73605 72894 72726 72845 73076 73524 74284 75231 76233 77317 78489 79722 81303 83780 87115 90236
52632I0236J665l6j012j261j255j192j070r63q74o98n83q70j400j501r52l93l75
52615G7466n75m56j46r7k46j44L37R26J389J576J316P06K84M48Q56Q59L42k75
52597H4566o91q79p44q9R34J720J671P03o85j695j721p88M86J399J597J163N32
52580H7479K69O08J150J339J184J137J281J279J151J411K141K565K023Q74Kj98
52564A05695J17P80J581K053J765P86m23j368j577p54P32J905K186K022K080K207
52548A19787J814R64L58L38N18N04M10N25Q27J043R87P47N87O90R02Q60M24k35
52530A32050q73j327j406j031n29l33l18O2Q11J233R77N25K99L3n00q41o27l54
52512A27851n60q83p76n87r07j307q73J66O10Q1m83l38J51L91L63J91k33o82n14
$$ plain form
52632 90236 91901 91865 90853 89592 88337 87145 86075 85112 84238 83540 82957 82087 80687 79186 78234 77841 77466
52615 77466 76891 76435 76289 76192 75946 75802 76139 77065 78454 80030 81346 82052 82336 82784 83640 84499 84841 84566
52597 84566 83875 82996 82252 82163 83097 84817 86488 87191 86506 84811 83090 82302 82788 84187 85784 86947 87479
52580 87479 87748 88356 89506 90845 92029 93166 94447 95726 96877 98288 100429 102994 105017 105891 105893 105695
52564 105695 105812 106592 108173 110226 111991 112777 112354 110986 109409 108655 109387 111292 113478 115500 117580 119787
52548 119787 121601 122565 122923 123261 123779 124283 124693 125218 126045 127088 128075 128822 129409 130099 131001 131861 132285 132050
52530 132050 131177 129850 128444 127413 126884 126551 126233 126295 127106 128339 129316 129841 130140 130173 129673 128832 128205 127851
52512 127851 127291 126408 125632 125045 124138 122831 121958 122124 122734 122815 122332 121994 122145 122536 122899 123090 122857 122175 121661
52493A21661L69J085R23L16R9L59O58R31J405J924K027J600R31J47p50j414j263
52476A31008k33R97J622J311K64r28j472q91L85J329J393J064J059J361J334O87
52460A40290k13q62j096j010p52n24m23k17L91J162J428J021O55R38J466J483
52444A43737J071R01J057R65N27M34R90J480J180L95p2K2M40J111K020K612K129
52427A60999N77j132k120k262k016j948k360l073l460l072k230j681j635j569
52413A33018j076n03m02o63o97m00m20j153j882j521j29R83R06K78K65Q50J017
52396A28471L99k03j26K50K62l4j32J32O07J218J780J786R62j43o64m16N2L06
52378A34507L71L50J41k49m78j28Q72K093K888K915K442K006J778J524J173J018
$$ plain form
52493 121661 122030 123115 124038 124354 124453 124812 125470 126401 127806 129730 131757 133357 134288 134435 133685 132271 131008
52476 131008 130775 131772 133394 134705 134969 134041 132569 131678 132063 133392 134785 135849 136908 138269 139603 140290
52460 140290 140077 139215 138119 137109 136357 135833 135410 135193 135584 136746 138174 139195 139850 140788 142254 143737
52444 143737 144808 145709 146766 147731 148258 148692 149682 151162 152342 152737 152665 152687 153127 154238 156258 158870 160999
52427 160999 161576 160444 158324 156062 154046 152098 149738 146665 143205 140133 137903 136222 134587 133018
52413 133018 131942 131439 131037 130374 129677 129277 128857 127704 125822 124301 124172 125155 126061 126339 126604 127454 128471
52396 128471 128870 128667 128541 128791 129053 129019 128887 129019 129626 130844 132624 134410 135372 135229 134565 134149 134201 134507
52378 134507 134878 135228 135369 135120 134642 134514 135386 137479 140367 143282 145724 147730 149508 151032 152205 153223
52362A53223J219J558J873K290K750K788K244J723J837K300K362J932J654J973
52348A81726K652L177L172K513J466O94P24J338J857J978J985K113K123J688R19
52333B10125L56M26J027J643J912J953K005J950J580J204J386J974K077J351O69
52318B31638J031K246L373L976M290M456M368M153M162M483M912N361N847O165
52304B90461O094N883O038O708P664Q742R840J0618J0742J0475J0519J1179J1986
52291D06949J2270J1860J1251J1230J2210J3772J5083J5880J6684J7736J8378
52280E63303J8019J7222J7005J7395J7493J6925J6253J5941J5628J4810J3581
52269G43575J2401J1495J0741R839Q517O811N231M398M379M648M594L919K695
$$ plain form
52362 153223 154442 156000 157873 160163 162913 165701 167945 169668 171505 173805 176167 178099 179753 181726
52348 181726 184378 187555 190727 193240 194706 195400 196124 197462 199319 201297 203282 205395 207518 209206 210125
52333 210125 210481 210907 211934 213577 215489 217442 219447 221397 222977 224181 225567 227541 229618 230969 231638
52318 231638 232669 234915 238288 242264 246554 251010 255378 259531 263693 268176 273088 278449 284296 290461
52304 290461 296555 302438 308476 315184 322848 331590 341430 352048 362790 373265 383784 394963 406949
52291 406949 419219 431079 442330 453560 465770 479542 494625 510505 527189 544925 563303
52280 563303 581322 598544 615549 632944 650437 667362 683615 699556 715184 729994 743575
52269 743575 755976 767471 778212 788051 796568 803379 808610 813008 817387 822035 826629 830548 833243
52256H33243J316K96k02m60o71o26k47m1n04j377j980k006j511n53N51J092Q45
52239H27165P83K022M294O361P669Q667R641J0317J0677J1098J1560J1662J1543
52226I33459J1822J2384J2373J1650J1236J1677J2042J1310R876Q867Q488P927
52214A063111O587M761L162K259J894J338M4j609k704l148l846n266o606p024
52200A052953p016p724r260j0622j1098j0913j0525r961r110q157p441p053o807
52187I37266o501o131n876n818n715n198m235l224k611k544k859l173l086k530
52173H77765k007k100k779l385l357k682j708r03p29j294k091k509k595k829l188
52158H43609l060k245j371j030j043r67q61j132j882k850l712m276m488m459m309
$$ plain form
52256 833243 834559 834855 834653 834193 833522 832896 832649 832608 832104 830727 828747 826741 825230 824677 825228 826320 827165
52239 827165 827948 829970 834264 840625 848294 856961 866602 876919 887596 898694 910254 921916 933459
52226 933459 945281 957665 970038 981688 992924 1004601 1016643 1027953 1037829 1046696 1055184 1063111
52214 1063111 1069698 1074459 1077621 1079880 1081774 1083112 1083156 1081547 1078843 1075695 1071849 1066583 1059977 1052953
52200 1052953 1045937 1038213 1028953 1018331 1007233 996320 985795 975834 966724 958567 951126 944073 937266
52187 937266 930765 924634 918758 912940 907225 902027 897792 894568 891957 889413 886554 883381 880295 877765
52173 877765 875758 873658 870879 867494 864137 861455 859747 858844 858115 856821 854730 852221 849626 846797 843609
52158 843609 840549 838304 836933 835903 834860 833893 833032 831900 830018 827168 823456 819180 814692 810233 805924
52143H05924m047l804m069n102o221o308n200l947l473l582l568l241k910k815
52129G47637k997l360l583l322k778k671l312m108m298l834l234k888k844k975
52115G01433l033k788k267j689j092m08J70L87N55J257K385L205L609M359N663
52100G11746O553O363O024O911Q960J0896J2010J2637J3119J3296J3257J3721
52088H35493J5228J7364J9084J9706J9443J9113J9345J9974K0262J9749J8692
52077A043453J7637J6819J6112J5318J4357J3324J2422J1666J0718R345P823O431
52065A195425M792K435j32j813k511l249m521n580n857n977o627p396p692p901
52051A143396q649r511r613r052q606q394p819o700n413m127k731j528j026j133
$$ plain form
52143 805924 801877 798073 794004 788902 782681 776373 771173 767226 763753 760171 756603 753362 750452 747637
52129 747637 744640 741280 737697 734375 731597 728926 725614 721506 717208 713374 710140 707252 704408 701433
52115 701433 698400 695612 693345 691656 690564 690156 690326 690713 691268 692525 694910 698115 701724 706083 711746
52100 711746 718299 724662 730686 737597 746557 757453 769463 782100 795219 808515 821772 835493
52088 835493 850721 868085 887169 906875 926318 945431 964776 984750 1005012 1024761 1043453
52077 1043453 1061090 1077909 1094021 1109339 1123696 1137020 1149442 1161108 1171826 1181171 1188994 1195425
52065 1195425 1200217 1202652 1202520 1200707 1198196 1194947 1190426 1184846 1178989 1173012 1166385 1158989 1151297 1143396
52051 1143396 1134747 1125236 1115623 1106571 1097965 1089571 1081752 1075052 1069639 1065512 1062781 1061253 1060227 1059094
52037A059094j209r35l99M14J522K424K540K160K115K609L107L390L824M504N019
52022A090179N204N377N534N088L795K319J450J214J098P49J73n06j260k260l769
52007A114385n693p365q206q508r122j0354j1714j2748j3703j5119j7102j9135
51995I75616k0469k0783k0636k1001k2086k2981k2917k2392k2399k2881k2923
51984G34148k2290k1801k1951k2188k1821k0952k0098j9469j9021j8697j8281
51973E07579j7435j6196j5018j4145j3322j2360j1517j1026j0673j0106r294q440
51961C58047p715p176o641n681m139k745k544l575m658m745l973l101k471j990
51947B96893j633j499j534j642j872k233k520k607k639k714k604k108j395q11
$$ plain form
52037 1059094 1057885 1056950 1056551 1056965 1058487 1060911 1063451 1065611 1067726 1070335 1073442 1076832 1080656 1085160 1090179
52022 1090179 1095383 1100760 1106294 1111382 1115177 1117496 1118946 1120160 1121258 1122007 1122180 1121674 1120414 1118154 1114385
52007 1114385 1108692 1101327 1093121 1084613 1075491 1065137 1053423 1040675 1026972 1011853 994751 975616
51995 975616 955147 934364 913728 892727 870641 847660 824743 802351 779952 757071 734148
51984 734148 711858 690057 668106 645918 624097 603145 583047 563578 544557 525860 507579
51973 507579 490144 473948 458930 444785 431463 419103 407586 396560 385887 375781 366487 358047
51961 358047 350332 343156 336515 330834 326695 323950 321406 317831 313173 308428 304455 301354 298883 296893
51947 296893 295260 293761 292227 290585 288713 286480 283960 281353 278714 276000 273396 271288 269893 269082
51933B69082n71q56j771k946l544l108k169j627j698j866j716j394j220j291j458
51918B41847j543j497j466j627j890j921j623j324j254j113n34J85L88M4j12L07
51902B26867O84K55p12j224j005q93j550k372k319j432p87r00j022l22Q05J247
51886B15320O34k77n48N3J044J731J681J077N34M18M60L07K04O36J469J995J874
51869B28612J540J511J786K022K011J752J358J016Q57P80O32N76R82J795K414
51854B49644K333J728J178J028J216J596K186K939L433L078J836N95L91J178J853
51839B76212J636R66O64P12M82k41j094j795k244k124j144K65J199J324J113R27
51823B76858O00R2j45K23R52J637K125K225J592L52o37o44L7N15L93L5j79m03
$$ plain form
51933 269082 268511 267655 265884 262938 259394 256286 254117 252490 250792 248926 247210 245816 244596 243305 241847
51918 241847 240304 238807 237341 235714 233824 231903 230280 228956 227702 226589 226055 226240 226628 226672 226560 226867
51902 226867 227551 227806 227094 225870 224865 223972 222422 220050 217731 216299 215512 214612 213590 213268 214073 215320
51886 215320 215954 215677 215129 215182 216226 217957 219638 220715 221249 221667 222127 222434 222638 223274 224743 226738 228612
51869 228612 230152 231663 233449 235471 237482 239234 240592 241608 242465 243245 243877 244453 245435 247230 249644
51854 249644 251977 253705 254883 255911 257127 258723 260909 263848 267281 270359 272195 272790 273181 274359 276212
51839 276212 277848 278814 279478 280190 280672 280431 279337 277542 275298 273174 272030 272295 273494 274818 275931 276858
51823 276858 277458 277550 277405 277628 278580 280217 282342 284567 286159 286511 285874 285230 285267 285782 286175 286210 286031 285628
51805B85628r88j868k443k152j163k79r2m07p58j110j626j986j664q25k82l97
51789B67588o76o66o24r03j149p48K28R71Q04j22j018j241q96o13o84p04l04P6
51771B59319k09r20j193q47o05r26j392j494j294r77m87L6J47k16n12m20k44j91
51753B47575N2N39P77O85R85J880K248J143o49j633j667j761k212k290j703j100
51737B42869r15q05n30m34p37j115j307j461j594j426j015p96p11j10J054J724
51721B32691J080k40r67q47p38j324k391l275l456k814j751j006r71j262j270
51706B11459r88q52r98j155j241j483j844j823j092jP59P95J48q41j581j503n45
51689A97214P39J875K991M356N669O302O282O412P252Q268Q251O366K709j762
$$ plain form
51805 285628 284640 282772 280329 278177 277014 276735 276643 276236 275478 274368 272742 270756 269092 268267 267985 267588
51789 267588 266912 266246 265622 264719 263570 262822 263050 264021 264825 264703 263685 262444 261548 260935 260251 259547 259243 259319
51771 259319 259110 258190 256997 256150 255545 254619 253227 251733 250439 249462 248975 249011 249158 248942 248430 248010 247766 247575
51753 247575 247627 248166 248943 249628 250613 252493 254741 255884 255235 253602 251935 250174 247962 245672 243969 242869
51737 242869 241954 241149 240619 240185 239448 238333 237026 235565 233971 232545 231530 230734 230023 229913 230967 232691
51721 232691 233771 233531 232564 231717 230979 229655 227264 223989 220533 217719 215968 214962 213991 212729 211459
51706 211459 210471 209619 208621 207466 206225 204742 202898 201075 199983 199982 200741 201536 201684 200843 199262 197759 197214
51689 197214 197953 199828 202819 207175 212844 219146 225428 231840 239092 247360 255611 261977 264686 262924
51675B62924n562p309o673m737l102k436k212j672p12L35J338K374L247L503L015
51660B42321K309J974J848J142m91k323l316l334l162l318l459l137k607k423
51646B22024k568k581k307j976j659j258j036j529k665l567l440k444j398q84
51632A92712q79r64p42k10J32j92j000j570j466r37l57K61R42J396J353J032Q70
51615A90381R38R36O53J32n32j193j571j468j050o32k31L78J170J720J682J173
51599A92486O27M10O93J413K209K515K024J101N22P46J508K173K360K094J600
51584B14481J208J345K204L389M229M603N073N966O744O676N823M823L904K782
51570B73250J485N85L31J24p16j948k650k405j773j545j764j770j182m96m13q34
$$ plain form
51675 262924 257362 250053 243380 238643 235541 233105 230893 229221 228509 228844 230182 232556 235803 239306 242321
51660 242321 244630 246604 248452 249594 249103 246780 243464 240130 236968 233650 230191 227054 224447 222024
51646 222024 219456 216875 214568 212592 210933 209675 208639 207110 204445 200878 197438 194994 193596 192712
51632 192712 191833 190869 190127 189917 190049 189857 188857 187287 185821 184884 184527 184788 185730 187126 188479 189511 190381
51615 190381 191319 192255 192908 193040 192508 191315 189744 188276 187226 186594 186363 186741 187911 189631 191313 192486
51599 192486 193113 193523 194216 195629 197838 200353 202377 203478 204000 204746 206254 208427 210787 212881 214481
51584 214481 215689 217034 219238 222627 226856 231459 236532 242498 249242 255918 261741 266564 270468 273250
51570 273250 274735 275320 275651 275775 275059 273111 270461 268056 266283 264738 262974 261204 260022 259526 259113 258279
51554B58279r40l04O58J535K563L974N178N384M752M313M703N573O163N991N000
51539C12822L560K340J661J110K04p15r70o85n90p22l48O72J428J255O46L47K85
51522C22300Rm20o84q66j275j834k244k459k620k795l117l815m729n178m817m219
51506B81237m169m609m801m325l452k735k528k848l314l428l072k616k359k133
51492B34848j710j225r38r01j057j376j668j603j173p62n94m98m11n14p12n57
51476B19149j7L23K69M12J079J617J449J086J301J852K029J949K281K953L237
51461B40969L055L173L926M706M884M575M202L905L606L196K524J516M87o1J5
51446B84678M41Q87J082P22k49j253j522r15p9K68j07r77j911k548k950l531m503
$$ plain form
51554 258279 257339 257035 257693 259228 261791 265765 270943 276327 281079 285392 290095 295668 301831 307822 312822
51539 312822 316382 318722 320383 321493 321697 320982 320012 319327 318737 318015 317667 318339 319767 321022 321668 322015 322300
51522 322300 322309 321889 321205 320339 319064 317230 314986 312527 309907 307112 303995 300180 295451 290273 285456 281237
51506 281237 277068 272459 267658 263333 259881 257146 254618 251770 248456 245028 241956 239340 236981 234848
51492 234848 233138 231913 230975 230074 229017 227641 225973 224370 223197 222435 221841 221343 220932 220418 219706 219149
51476 219149 219132 219455 219724 220136 221215 222832 224281 225367 226668 228520 230549 232498 234779 237732 240969
51461 240969 244024 247197 251123 255829 260713 265288 269490 273395 277001 280197 282721 284237 284724 284663 284678
51446 284678 285119 286006 287088 287810 287561 286308 284786 283871 283792 284060 283953 282976 281065 278517 275567 272036 267533
51429B67533n538o164o252n886n233m742m925n505n413m176k729k185k374k399
51415B04012k116j998j984j577q47l38n8M39J095J485J833K741L919M318L752
51400B14676L188L186L117K441J590J057M74o72k157l446m430n159n437n184m775
51385A98469m526m341m201m392m874n062m709m351m369m280l575k675k278k269
51371A42567k070j725j740k075k136j805j681k159k814k954k384j474o79j58K36
51356A16949O30Q27M66l83j018p28M50J753K410K279J807J437J096L70p48j592
51340A26005j644j284j199j250p76J34N37J45r8N44J468J750J567J726K241K440
51324A32306K238K292K864L394L428L228L225L462L852M390M784M449L308K173
$$ plain form
51429 267533 261995 255831 249579 243693 238460 233718 228793 223288 217875 213699 210970 208785 206411 204012
51415 204012 201896 199898 197914 196337 195490 195152 195094 195533 196628 198113 199946 202687 206606 210924 214676
51400 214676 217864 221050 224167 226608 228198 229255 229729 229057 226900 223454 219024 213865 208428 203244 198469
51385 198469 193943 189602 185401 181009 176135 171073 166364 162013 157644 153364 149789 147114 144836 142567
51371 142567 140497 138772 137032 134957 132821 131016 129335 127176 124362 121408 119024 117550 116871 116713 116949
51356 116949 117579 118406 118872 118489 117471 116743 117193 118946 121356 123635 125442 126879 127975 128345 127597 126005
51340 126005 124361 123077 121878 120628 119852 119986 120523 120668 120570 121114 122582 124332 125899 127625 129866 132306
51324 132306 134544 136836 139700 143094 146522 149750 152975 156437 160289 164679 169463 173912 177220 179393
51310A79393J719J457L44j647l318l692l181k837l066l536m045m665n069m530
51296A43327k953j343p83j263j930k199k122j866j477j087r22r30p88k91N19J452
51280A25344K144K070J054k69j006j042j109j688k366k431j746q19k22j38k71
51265A17505j46L92R82J191J011O60J36o03j167r67M2J244J958J856R91r5n79
51248A24411j66L34n6j189k048k126j710r90J00J093J173M47L0M10P14R9r86j586
51230A17954j423p19L81J411J436K08j120j308o08j55k58k76J26O21J004J406
51214A18680J694J567J242J259J524J334N43n6J68P94R75N61K04M62J137J483
51198A33571J018J24l04J11P97R84O09J62n9j05j7J81K22j18n43n53k67l09q23
$$ plain form
51310 179393 181112 182569 182913 181266 177948 174256 171075 168238 165172 161636 157591 152926 147857 143327
51296 143327 140374 139031 138248 136985 135055 132856 130734 128868 127391 126304 125382 124452 123664 123373 123892 125344
51280 125344 127488 129558 130612 130343 129337 128295 127186 125498 123132 120701 118955 118136 117914 117776 117505
51265 117505 117359 117751 118733 119924 120935 121595 121731 121128 119961 118994 119036 120280 122238 124094 125085 124990 124411
51248 124411 124245 124579 124523 123334 121286 119160 117450 116460 116560 117653 118826 119273 119303 119713 120427 120526 119540 117954
51230 117954 116531 115812 116193 117604 119040 119248 118128 116820 116212 116057 115799 115523 115649 116270 117274 118680
51214 118680 120374 121941 123183 124442 125966 127300 127843 127787 127955 128749 129724 130285 130489 130951 132088 133571
51198 133571 134589 134713 134409 134520 135317 136301 136910 137072 137013 136908 136891 137072 137294 137176 136633 136080 135813 135504 134681
51179A34681j151q37l57l89p81q60o27q23j646k102j220M55J465J313R45J038
51163A29104Q96l18j971k635j953q48p3L16J76p76j935k046r67j53o32j546j457
51146A13182l42O92R89O63p8q79r66J1J093J041J23j66Q51K204K670K060R60n6
51128A24052n96m72J05N79N82J24n88j229j323o75K11N69K74j79m36n55n32k03
51110A19708L44P22P21M36m1n92p86k58O80J274J323J306J450J331O69l5n3P25
51092A28924J766K433K366J627O54q9n04p94r98r29n09J08P47J230J319J003P44
51075A39098R54J364J420J173J131J253R46J96j39M11J052P25n06j622j878j356
51059A44222n25K52Q07J071J004N42j62o06l55L34Q00R44J355K214K747K283J311
$$ plain form
51179 134681 133530 132693 132336 131947 131166 130306 129679 128856 127210 125108 123888 124343 125808 127121 128066 129104
51163 129104 130000 129682 127711 125076 123123 122275 122202 122518 122694 121918 119983 117937 116970 116817 116185 114639 113182
51146 113182 112840 113532 114521 115184 115106 114227 113261 113272 114365 115406 115529 115363 116214 118418 121088 123148 124108 124052
51128 124052 123456 122984 123089 123668 124250 124374 123786 122557 121234 120559 120770 121339 121613 121434 120998 120443 119911 119708
51110 119708 120052 120774 121495 121931 121890 121298 120512 120254 120934 122208 123531 124837 126287 127618 128287 128252 128199 128924
51092 128924 130690 133123 135489 137116 137770 137681 137177 136383 135385 134456 133947 134055 134802 136032 137351 138354 139098
51075 139098 140052 141416 142836 144009 145140 146393 147339 147535 147396 147807 148859 149584 149078 147456 145578 144222
51059 144222 143697 143949 144756 145827 146831 147373 147211 146605 146250 146584 147384 148328 149683 151897 154644 156927 158238
51042A58238Q00Q79R19O88O46R86J205Q74K90K3R8P9k77p48r88q57m68n0K09K95
51022A62841M16Q27J592K441K921K765K180J717J729J973J912J428R98J053J443
51007A88236J780K119K784L611L992L880M084N085O067N878M673L749L835M452
50993B44225N060N877P077Q036Q184P983Q372R528J0824J1808J2560J3363J4573
50980C67470J6603J9413K2178K4150K5726K8030L1437L5229L8728M2046M5576
50969F96586M9353N3143N6639N9413O1131O1995O2460O2380O1015N8115N4363
50958A336593N0315M5522L9255L1854K4614J8402J2908P376J767l065o239p738
50946A551564q346q725q715p740n755l519j968j571k402m430p531j1379j5563
$$ plain form
51042 158238 159038 159917 160836 161524 162170 163156 164361 165235 165525 165548 165646 165725 165448 164700 163712 162855 162387 162337 162546 162841
51022 162841 163257 164084 165676 168117 171038 173803 175983 177700 179429 181402 183314 184742 185740 186793 188236
51007 188236 190016 192135 194919 198530 202522 206402 210486 215571 221638 227516 232189 235938 239773 244225
50993 244225 249285 255162 262239 270275 278459 286442 294814 304342 315166 326974 339534 352897 367470
50980 367470 384073 403486 425664 449814 475540 503570 535007 570236 608964 651010 696586
50969 696586 745939 799082 855721 915134 976265 1038260 1100720 1163100 1224115 1282230 1336593
50958 1336593 1386908 1432430 1471685 1503539 1528153 1546555 1559463 1566839 1568606 1565541 1559302 1551564
50946 1551564 1543218 1534493 1525778 1518038 1512283 1508764 1506796 1505225 1502823 1498393 1490862 1479483 1463920
50933A463920j9856k4295k9051l4168l9390m4296m8621n2270n4975n6290n6095
50922A004613n4838n2946n0383m7134m3762m0838l8075l4772l0987k7479k4485
50911E58914k1464j8247j5523j3764j2339j0394q087o297n393m898m219l242k258
50898D32789j648j537j523r64K11J251J478J146J005J277J600J838K329L216M113
50883D46581M629M919N425O311P343Q202Q777R235R916J1023J2335J3357J3894
50870E61947J4434J5752J8145K1156K4052K6529K8947L1964L5981M0864M6180
50859H65951N1649N7461O4045P1581P9781Q8192R6530J04688J12569J20102J27276
50848A839825J33916J39451J43108J44301J42680J37960J29928J18534J03793
$$ plain form
50933 1463920 1444064 1419769 1390718 1356550 1317160 1272864 1224243 1171973 1116998 1060708 1004613
50922 1004613 949775 896829 846446 799312 755550 714712 676637 641865 610878 583399 558914
50911 558914 537450 519203 503680 489916 477577 467183 459096 452799 447406 442508 438289 435047 432789
50898 432789 431141 429604 428081 427117 427328 428579 430057 431203 432208 433485 435085 436923 439252 442468 446581
50883 446581 451210 456129 461554 467865 475208 483410 492187 501422 511338 522361 534696 548053 561947
50870 561947 576381 592133 610278 631434 655486 682015 710962 742926 778907 819771 865951
50859 865951 917600 975061 1039106 1110687 1190468 1278660 1375190 1479878 1592447 1712549 1839825
50848 1839825 1973741 2113192 2256300 2400601 2543281 2681241 2811169 2929703 3033496
50839C033496Q5843O5584M4993K6088R566n026j7719k7577l3822l6628l6375l2966
50827C075457k6548j8302r762j858M731Q756Q877M776k942j3704k7012m1785n6593
50814B904091p0697q4211r7187j09056j19075j26699j31444j32978j31446j27371
50804A773927j21187j13203j03956r4168q4376p4906o5994n7620m9509m1764l5063
50793I32181k9685k4813j9530j4173r717o240k989J98K631L929M390M193L301
50780H43676K209J664J467O38j016k591l592m555n760o609o893p538r228j1181
50766G90691j2193j2173j1833j1558j1306j0967j0129q046m652r82K042M673P485
50753G11052J0181J2210J3974J6348J9333K2150K4496K6797K9243L1483L3356
$$ plain form
50839 3033496 3119339 3184923 3229916 3256004 3265570 3260544 3242825 3215248 3181426 3144798 3108423 3075457
50827 3075457 3048909 3030607 3020845 3018987 3023718 3032474 3041351 3046127 3043185 3029481 3002469 2960684 2904091
50814 2904091 2833394 2749183 2651996 2542940 2423865 2297166 2165722 2032744 1901298 1773927
50804 1773927 1652740 1539537 1435581 1341413 1257037 1182131 1116137 1058517 1009008 967244 932181
50793 932181 902496 877683 858153 843980 834263 828023 825034 825232 827863 831792 836182 840375 843676
50780 843676 845885 847549 849016 849654 848638 846047 842455 837900 832140 825531 818638 811100 801872 790691
50766 790691 778498 766325 754492 742934 731628 720661 710532 702486 697834 696852 698894 703567 711052
50753 711052 721233 733443 747417 763765 783098 805248 829744 856541 885784 917267 950623
50742I50623L5289L7868M1375M5793N0913N6451O2292O8357P4163P8932Q2478
50731A584534Q5387Q7931Q9275Q8251Q4414P7886O8750N7310M4439L0889J6593
50720B315659J401j3812k7501l8573m6460n0590n0764m7875m3223l7156k9294
50709A931812k0106j1314m431L64L519M933L926j1o773j5795k6384l7901m9604
50696A772235o0348o8772p4114p6680p7257p6295p3848p0036o5097n9149n2351
50685A018288m5220l8447l2443k7219k2479j7738j2650p555l261k3K912O427J0578
50672H31170J4831J8710K1861K4007K5303K6309K7152K7247K6310K4979K3883
50661A091762K2788K1383K0119J9430J8740J7365J5824J5126J5151J5002J4625
$$ plain form
50742 950623 985912 1023780 1065155 1110948 1161861 1218312 1280604 1348961 1423124 1502056 1584534
50731 1584534 1669921 1757852 1847127 1935378 2019792 2097678 2166428 2223738 2268177 2299066 2315659
50720 2315659 2317060 2303248 2275747 2237174 2190714 2140124 2089360 2041485 1998262 1961106 1931812
50709 1931812 1911706 1900392 1895961 1896325 1899844 1904777 1908703 1908692 1901919 1886124 1859740 1821839 1772235
50696 1772235 1711887 1643115 1569001 1492321 1415064 1338769 1264921 1194885 1129788 1070639 1018288
50685 1018288 973068 934621 902178 874959 852480 834742 822092 814537 811276 811253 814165 820592 831170
50672 831170 846001 864711 886572 910579 935882 962191 989343 1016590 1042900 1067879 1091762
50661 1091762 1114550 1135933 1156052 1175482 1194222 1211587 1227411 1242537 1257688 1272690 1287315
50650A287315J4824J5711J6503J6982J7996K0119K2901K5723K8593L1618L4322
50639A532607L5985L6279L5469L4267L3317L2358L0263K6473K2001J8106J4424
50628A851549R642L705j876n983q836j0857j1887j1851j1051r327o068j514K899
50615A788545O030P939Q934Q730P137M679J999p04l189n081o700r067j2553j6418
50601A780281k0198k4534k9931l5835m1666m7720n3980n9038o1460o1564o0671
50590A283684n9192n6776n3804n1253m9135m6426m2674l8575l4769l1047k7083
50579G92950k3175j9808j7008j4463j1909r261o636m293k292l26J816L823N374
50566F94792O785Q578J0615J2272J3464J4803J6686J8815K0768K2578K4536K6791
$$ plain form
50650 1287315 1302139 1317850 1334353 1351335 1369331 1389450 1412351 1438074 1466667 1498285 1532607
50639 1532607 1568592 1604871 1640340 1674607 1707924 1740282 1770545 1797018 1819019 1837125 1851549
50628 1851549 1861191 1864896 1863020 1857037 1848201 1837344 1825457 1813606 1802555 1793228 1787160 1785646 1788545
50615 1788545 1794575 1802514 1811448 1820178 1827315 1831994 1833993 1833289 1830100 1825019 1818319 1809252 1796699 1780281
50601 1780281 1760083 1735549 1705618 1669783 1628117 1580397 1526417 1467379 1405919 1344355 1283684
50590 1283684 1224492 1167716 1113912 1062659 1013524 967098 924424 885849 851080 820033 792950
50579 792950 769775 749967 732959 718496 706587 697326 690690 686397 684105 683779 685595 689418 694792
50566 694792 701577 710155 720770 733042 746506 761309 777995 796810 817578 840156 864692 891483
50554H91483K9298L1875L4229L6131L7567L8560L9035L9066L9068L9239L9117
50543A294668L8233L7144L7123L8777M1503M4415M7240N0024N2563N4538N6013
50532A792241N7461N9348O1871O4873O7922P0635P3026P5353P7564P9184P9746
50521B559224P9078P7066P3501O8299O1565N3179M2696K9960J5660Q74j3720k7950
50509C019432m1580n4147o5296p4888q2592q7774r0031q9485q6334q0407p1669
50498B195229o0914m9466l8097k6796j5671n523K862R648J5673K1372K6282K9516
50486B104115L0329K8249K2931J4060J493j4276l1714m8748o3925p6784q6925
50475A878805r3374r5516r4206r1124q7220q2538p7257p1900o6445o0332n3631
$$ plain form
50554 891483 920781 952656 986885 1023016 1060583 1099143 1138178 1177244 1216312 1255551 1294668
50543 1294668 1332901 1370045 1407168 1445945 1487448 1531863 1579103 1629127 1681690 1736228 1792241
50532 1792241 1849702 1909050 1970921 2035794 2103716 2174351 2247377 2322730 2400294 2479478 2559224
50521 2559224 2638302 2715368 2788869 2857168 2918733 2971912 3014608 3044568 3060228 3061102 3047382 3019432
50509 3019432 2977852 2923705 2858409 2783521 2700929 2613155 2523124 2433639 2347305 2266898 2195229
50498 2195229 2134315 2084849 2046752 2019956 2004285 1998762 2001624 2011272 2026945 2048317 2074599 2104115
50486 2104115 2134444 2162693 2185624 2199684 2201177 2186901 2155187 2106439 2042514 1965730 1878805
50475 1878805 1785431 1689915 1595709 1504585 1417365 1334827 1257570 1185670 1119225 1058893 1005262
50464A005262m7252m1701l6512l1357k6757k3024j9456j5425j1611r077p619o048
50452G29423l857j558M76K526M755O907Q952J1239J3629J5255J5624J5501J6125
50439H34997J7821J9835K1369K2364K3271K4388K5562K6439K6890K7090K7258
50428A097284K7475K7777K8233K8768K9104K9147K9196K9584L0158L0518L0654
50417A417898L1071L2252L4289L6964L9888M2506M4347M5334M5670M5334M3992
50406A859545M1521L8289L4750L0870K6182K0278J3156N172l190j1603k0056k8788
50394B006126l7958m7320n6180o3725o9501p3670p6679p8507p8316p5196o9296
50383A279778o2033n4891m8137m0935l2720k4043j5944q791k151M298J0219J5105
$$ plain form
50464 1005262 958010 916309 879797 848440 821683 798659 779203 763778 752167 743090 735471 729423
50452 729423 725566 724008 724484 727010 731765 738672 747624 758863 772492 787747 803371 818872 834997
50439 834997 852818 872653 894022 916386 939657 964045 989607 1016046 1042936 1070026 1097284
50428 1097284 1124759 1152536 1180769 1209537 1238641 1267788 1296984 1326568 1356726 1387244 1417898
50417 1417898 1448969 1481221 1515510 1552474 1592362 1634868 1679215 1724549 1770219 1815553 1859545
50406 1859545 1901066 1939355 1974105 2004975 2031157 2051435 2064591 2069763 2066573 2054970 2034914 2006126
50394 2006126 1968168 1920848 1864668 1800943 1731442 1657772 1581093 1502586 1424270 1349074 1279778
50383 1279778 1217745 1162854 1114717 1073782 1041062 1017019 1001075 992284 990133 994431 1004650 1019755
50371A019755J8885K1668K3166K2779K0167J5466Q998J180p255j5314k2184k7504
50359A079807l1317l3914l5668l6643l6429l4757l2235l0024k8616k7455k5848
50348G26901k3779k1532j9070j6319j3743j1961j0898r813q283o692n530m641
50336E74640l471j922m82N30J421K564L739M565N406P092R464J1089J1001J0105
50322F35741J0107J1421J3055J4241J5101J5829J6342J6974J8408K0472K1963
50311H09654K2179K1728K1275K0447J8781J6962J6078J6048J5819J4814J3351
50300A007136J1752R937P861N665L356R44j188k604l431m217n250o596q626j1727
50286A003012j5431j8507k0203k0976k1754k2808k3537k3211k1831k0240j9260
$$ plain form
50371 1019755 1038640 1060308 1083474 1106253 1126420 1141886 1150884 1152064 1144809 1129495 1107311 1079807
50359 1079807 1048490 1014576 978908 942265 905836 871079 838844 808820 780204 752749 726901
50348 726901 703122 681590 662520 646201 632458 620497 609599 599786 591503 584811 579281 574640
50336 574640 571169 569247 568765 569295 570716 573280 577019 581584 586990 594082 603546 614635 625636 635741
50322 635741 645848 657269 670324 684565 699666 715495 731837 748811 767219 787691 809654
50311 809654 831833 853561 874836 895283 914064 931026 947104 963152 978971 993785 1007136
50300 1007136 1018888 1028825 1036686 1042351 1045707 1046651 1045463 1042859 1039428 1035211 1029961 1023365 1014739 1003012
50286 1003012 987581 969074 948871 927895 906141 883333 859796 836585 814754 794514 775254
50275G75254j8760j7996j6859j6208j6475j6707j5697j3567j1451r930q762p783
50263F05059p091o391n217l905l274l239k727j298K25J142J887L005M097M585
50249E86858M860N608O519O658N978N471N801O515O813O460N702M745L693K681
50235F64362J825J088L31o08j829l238m415m901m752m640n141o072o712o690o312
50220F12296n912n316m255l020k218j868j375n10J85L21L95J102K249L028L121
50205E98223L023L308M062N024N843O247O336O604P291P876P618O479M969L365
50191F76268J668J68q22j678l129n080o653p515q312r474j0500j0877j0957j1247
50177E91860j1547j1499j1322j1318j1033r790p736n662l981k583j512j040j137
$$ plain form
50275 775254 756494 738498 721639 705431 688956 672249 656552 642985 631534 621604 612842 605059
50263 605059 597968 591577 586360 582455 579181 575942 573215 571917 572142 573284 575171 578176 582273 586858
50249 586858 591718 597326 603845 610503 616481 621952 627753 634268 641081 647541 653243 657988 661681 664362
50235 664362 666187 667275 667606 666998 665169 661931 657516 652615 647863 643223 638082 632010 625298 618608 612296
50220 612296 606384 601068 596813 593793 591575 589707 588332 587822 588007 588328 588723 589825 592074 595102 598223
50205 598223 601246 604554 608616 613640 619483 625730 632066 638670 645961 653837 661455 667934 672903 676268
50191 676268 677936 678104 677282 675604 672475 667395 660742 653227 644915 635441 624941 614064 603107 591860
50177 591860 580313 568814 557492 546174 535141 525351 517615 511953 507972 505389 503877 502837 501700
50164E01700j531k280l575m969n565n129m524m630n312n682n171m059l149l061
50150D43063l665m194m059l499l187l307l430l267l021k912k802k550k300k181
50136C98689k022j712j439j295r77l01L04L43P6K70J177K365L531M789N982O398
50120D16178N648M373L593L628M073M569N008N169M786L981L216K713K368K131
50106D71434J993J616O40n87j243j160r97j002n47N98J453J249R15J935M047N486
50090D85830N435M961N193N842O145O272O880P948Q984R974J1264J2721J3781
50077E91230J4326J4789J5351J5631J5353J4885J4807J5152J5293J4538J2837
50066G54192J0949R778R434R154Q320P261O792P206Q104R058R914J0500J0596
$$ plain form
50164 501700 500169 497889 494314 489345 483780 478651 474127 469497 464185 458503 453332 449273 446124 443063
50150 443063 439398 435204 431145 427646 424459 421152 417722 414455 411434 408522 405720 403170 400870 398689
50136 398689 396667 394955 393516 392221 391244 390943 391247 391590 391666 391936 393113 395478 399009 403798 409780 416178
50120 416178 421826 426199 429792 433420 437493 442062 447070 452239 457025 461006 464222 466935 469303 471434
50106 471434 473427 475043 475683 475096 473853 472693 471696 470694 470147 470745 472198 473447 474362 476297 480344 485830
50090 485830 491265 496226 501419 507261 513406 519678 526558 534506 543490 553464 564728 577449 591230
50077 591230 605556 620345 635696 651327 666680 681565 696372 711524 726817 741355 754192
50066 754192 765141 774919 784353 793507 801827 809088 815880 823086 831190 840248 850162 860662 871258
50053H71258J0319J0112J0183J0348J0556J1163J2419J4067J5821J7854K0419
50042A014519K3158K5381K6996K8728L1271L4533L7806M0297M1412M0849L8674
50031A383624L5141L0259K3850J6280Q940L529Q34L76J138K364L782N303O558
50018A521978O542L909k010j0518k0137k9782l8838m6345n0991n2346n1484m9810
50006A180168m7634m4416m0067l5332l0940k7016k3422k0275j7858j6270j5332
49995H61606j4700j4044j3235j2460j2010j2050j2518j3230j3944j4486j4872
49984G14057j5118j5017j4326j3301j2600j2429j2234j1513j0512r735r206q742
49972E69324q482q471q066o619m656l379l036k617j467l30k50j094j767j618j003
$$ plain form
50053 871258 881577 891689 901872 912220 922776 933939 946358 960425 976246 994100 1014519
50042 1014519 1037677 1063058 1090054 1118782 1150053 1184586 1222392 1262689 1304101 1344950 1383624
50031 1383624 1418765 1449024 1472874 1489154 1498094 1501623 1502457 1502833 1503971 1506335 1510117 1515420 1521978
50018 1521978 1528520 1532429 1530419 1519901 1499764 1469982 1431144 1384799 1333808 1281462 1229978 1180168
50006 1180168 1132534 1088118 1048051 1012719 981779 954763 931341 911066 893208 876938 861606
49995 861606 846906 832862 819627 807167 795157 783107 770589 757359 743415 728929 714057
49984 714057 698939 683922 669596 656295 643695 631266 619032 607519 597007 587272 578066 569324
49972 569324 560842 552371 544305 537686 533030 529651 526615 523998 522531 522201 521951 520857 519090 517472 516469
49957E16469o03n60m50R0Q29J191J063J000J339J563J093M11N42J520K298K361
49941E30156K454L286M398N003N322O333Q440J1054J3274J4601J5180J5798J7407
49928F52706K0323K4039K8047L2427L7343M2532M7681N2901N8164O2763O5879
49917A124805O7429O7534O5598O0859N3887M6602M0632L6352L3541L2153L1991
49906A661383L2416L2936L3574L4066L3024K8563J9754P211p540k2748l6725m8192
49894A767722n6764o2926o7367p0393p2006p2238p1250o9241o6526o3561o0681
49883A034769n7780n4535n0929m7320m3866m0228l6093l1806k8042k5012k2312
49872E96846j9649j7244j5406j4011j2678j1242r811q546p595p168p314p696p774
$$ plain form
49957 516469 515866 515306 514856 514946 515775 516966 518029 519029 520368 521931 523024 523435 523977 525497 527795 530156
49941 530156 532610 535896 540294 545297 550619 556952 565392 576446 589720 604321 619501 635299 652706
49928 652706 673029 697068 725115 757542 794885 837417 885098 937999 996163 1058926 1124805
49917 1124805 1192234 1259768 1325366 1386225 1440112 1486714 1527346 1563698 1597239 1629392 1661383
49906 1661383 1693799 1726735 1760309 1794375 1827399 1855962 1875716 1882927 1875387 1852639 1815914 1767722
49894 1767722 1710958 1648032 1580665 1510272 1438266 1366028 1294778 1225537 1159011 1095450 1034769
49883 1034769 976989 922454 871525 824205 780339 740111 704018 672212 644170 619158 596846
49872 596846 577197 559953 544547 530536 517858 506616 496805 488259 480664 473496 466182 458486 450712
49859D50712p375o913o876p058o582m921k788j596j891k748l010k673k540k848
49845C90893l143l278l627m048l636k114o25l57r03q92K1P73N34j83l82R2O19
49828C69744Q38J076J757K725L312L028K100J314J304K118L385M679N665O145
49814D09190O318O768P875R300J0399J1100J1950J3294J4847J6342J8208K1110
49802E56701K4995K9038L2632L6029L9768M3755M7216M9358M9741M8075M4172
49791A001480L8333L1468K4558J8205J2896R344Q165R244J1747J4693J7209J8380
49779A215722J7228J3043N656m522j6561k9225m1403n2168o0464o5125o5785o3357
49767H53039n9177n3895m7782m1669l6602l2602k8767k4711k1024j8089j5382
$$ plain form
49859 450712 443337 436424 429548 422490 415908 410987 408199 406603 404712 401964 398954 396281 393741 390893
49845 390893 387750 384472 380845 376797 373161 371047 370422 370065 369162 368270 368291 369064 369598 369415 369033 369125 369744
49828 369744 370582 371658 373415 376140 379452 382480 384580 385894 387198 389316 392701 397380 403045 409190
49814 409190 415508 422276 430151 439451 449850 460950 472900 486194 501041 517383 535591 556701
49802 556701 581696 610734 643366 679395 719163 762918 810134 859492 909233 957308 1001480
49791 1001480 1039813 1071281 1095839 1114044 1126940 1136284 1144449 1153693 1165440 1180133 1197342 1215722
49779 1215722 1232950 1245993 1251649 1247127 1230566 1201341 1159938 1107770 1047306 982181 916396 853039
49767 853039 793862 739967 692185 650516 613914 581312 552545 527834 506810 488721 473339
49756D73339j2454r714p672o096m605l509l250l473l369k744k032j471r01k56
49742D11793L23Q68J578K467L274L730L639K913J833J023Q71J156J484J800K150
49727D40902K291J957J296P01L31J18k0k73q36j434j396o00J33Q8l65m43j63q8
49709D42199k38j62J34K24J96O69J766K828L310L311L090K614J915J289R50Q33
49693D64928R06J282J863K249K245K117K237K664L205L536L273K288J015J73N6
49678D94037L37N36M66K02m1n0K16N46P36P56N13k05j229j807j420n41p5k32n18
49659D92227n75m21m2N28Q40M60k12l52N6J60m38j122j224r28q12j071j521j897
49641D83656j865j213k54L80N37O98J165J649J890K081K386K535K294J928J792
$$ plain form
49756 473339 460885 451171 443499 437403 432798 429289 426039 422566 419197 416453 414421 412950 412049 411793
49742 411793 412116 412984 414562 417029 420303 424033 427672 430585 432418 433441 434312 435468 436952 438752 440902
49727 440902 443193 445150 446446 447147 447478 447596 447576 447303 446467 445033 443637 443037 443170 443258 442893 442450 442287 442199
49709 442199 441961 441799 441933 442157 442353 443022 444788 447616 450926 454237 457327 459941 461856 463145 464095 464928
49693 464928 465834 467116 468979 471228 473473 475590 477827 480491 483696 487232 490505 492793 493808 493981 494037
49678 494037 494374 494910 495376 495578 495537 495487 495703 496249 496985 497741 498254 498049 496820 495013 493593 493052 492977 492745 492227
49659 492227 491652 491231 491189 491717 492557 493017 492805 492453 492509 492669 492231 491109 489885 488957 488145 487074 485553 483656
49641 483656 481791 480578 480324 480704 481241 481939 483104 484753 486643 488724 491110 493645 495939 497867 499659
49626D99659J806J712J527J438J452J416J214Q56O01R44K087L420M061L987L991
49611E30171M387M592M280M091M683N709O495P051P731Q344Q513Q591R297J0564
$$ plain form
49626 499659 501465 503177 504704 506142 507594 509010 510224 511080 511681 512625 514712 518132 522193 526180 530171
49611 530171 534558 539150 543430 547521 552204 557913 564408 571459 579190 587534 596047 604638 613935 624499
$$ [...]
##END NTUPLES=NMR SPECTRUM
##END=
