##TITLE=NES1009_842410_9233004_osP6W4uPZL
##JCAMPDX= 6.0         $$ Bruker NMR JCAMP-DX V2.0
##DATA TYPE= NMR SPECTRUM
##DATA CLASS= NTUPLES
##ORIGIN= BRUKER
##OWNER= Administrator
$$ 1.72 TOPSPIN		Version 2.1
$$ 2015-07-02 02:49:41.320 -0700  Administrator@X
$$ Compression mode = diff/dup
##.OBSERVE FREQUENCY= 400.02188249412
##.OBSERVE NUCLEUS= ^1H
##.ACQUISITION MODE= SIMULTANEOUS (DQD)
##.ACQUISITION SCHEME= undefined
##.AVERAGES= 8
##.DIGITISER RES= 22
##SPECTROMETER/DATA SYSTEM= spect
##.PULSE SEQUENCE= zg30
##.SOLVENT NAME= COFFEE_meoh
##.SHIFT REFERENCE= INTERNAL, COFFEE_meoh, 1, 14.98509
##AUDIT TRAIL= $$ (NUMBER, WHEN, WHO, WHERE, PROCESS, VERSION, WHAT)
$$ ##TITLE= Audit trail, TOPSPIN		Version 2.1
$$ ##JCAMPDX= 5.01
$$ ##ORIGIN= Bruker BioSpin GmbH
$$ ##OWNER= Administrator
$$ $$ E:\/data/COFFEE/nmr/NES1009_842410_9233004_osP6W4uPZL/20/pdata/1/auditp.txt
$$ ##AUDIT TRAIL=  $$ (NUMBER, WHEN, WHO, WHERE, PROCESS, VERSION, WHAT)
(   1,<2015-07-02 02:49:34.086 -0700>,<Administrator>,<X>,<go>,<TOPSPIN 2.1>,
      <created by zg
	started at 2015-07-02 02:48:27.539 -0700,
	POWCHK enabled, PULCHK disabled,
       configuration hash MD5:
       21 0F 79 D6 B3 7B B4 F6 88 20 88 DB 03 48 BD 9F
       data hash MD5: 64K
       31 A3 2A B5 CF CF 9E ED 3B 77 6B 1A 8C 89 68 7A>)
(   2,<2015-07-02 02:49:37.227 -0700>,<Administrator>,<X>,<proc1d>,<TOPSPIN 2.1>,
      <Start of raw data processing
       efp LB = 0 FT_mod = 6 PKNL = 1 PHC0 = 0 PHC1 = 0 SI = 32K 
       data hash MD5: 32K
       77 57 11 F8 AF 33 AB 8B 37 89 D7 CB 73 0C E8 AE>)
(   3,<2015-07-02 02:49:37.508 -0700>,<Administrator>,<X>,<proc1d>,<TOPSPIN 2.1>,
      <pk PHC0 = 91.66443 PHC1 = 0 
       data hash MD5: 32K
       B2 34 42 EF 71 18 FB C9 7B F5 E4 37 E6 45 CF B5>)
(   4,<2015-07-02 02:49:37.617 -0700>,<Administrator>,<X>,<proc1d>,<TOPSPIN 2.1>,
      <abs ABSG = 1 
       data hash MD5: 32K
       7A 72 D5 83 67 97 57 E1 9B 66 2E B4 92 5F BB E3>)
(   5,<2015-07-02 02:49:37.680 -0700>,<Administrator>,<X>,<proc1d>,<TOPSPIN 2.1>,
      <abs ABSG = 2 
       data hash MD5: 32K
       48 E7 33 3A 7C 77 01 1E BA 6A CF FA E5 86 0E AD>)
(   6,<2015-07-02 02:49:37.742 -0700>,<Administrator>,<X>,<proc1d>,<TOPSPIN 2.1>,
      <abs ABSG = 3 
       data hash MD5: 32K
       EC CA 41 C2 AB 8A 46 FE D1 3E 10 13 F5 C7 49 F1>)
(   7,<2015-07-02 02:49:37.805 -0700>,<Administrator>,<X>,<proc1d>,<TOPSPIN 2.1>,
      <abs ABSG = 4 
       data hash MD5: 32K
       43 83 0B 4B 3E 9C 46 CF E3 91 F4 61 5E 1A 09 6B>)
(   8,<2015-07-02 02:49:37.867 -0700>,<Administrator>,<X>,<proc1d>,<TOPSPIN 2.1>,
      <abs ABSG = 5 
       data hash MD5: 32K
       A3 C3 75 F4 BC C6 D7 CE 4A D2 73 03 77 90 97 3E>)
$$ ##END=
$$ 
$$ $$ hash MD5
$$ $$ 16 A9 58 0D DF 24 76 02 01 18 8B C1 AC 44 F2 10
##$RELAX= 
##$RELAX= 
##$RELAX= 
##$RELAX= 
##$RELAX= 
##$RELAX= 
##$RELAX= 
$$ Bruker specific parameters
$$ --------------------------
##$DU= <E:\>
##$EXPNO= 20
##$NAME= <NES1009_842410_9233004_osP6W4uPZL>
##$PROCNO= 1
$$ [...]
##$TP= (0..7)
150 150 150 150 150 150 150 150
##$TP07= 0
##$TPNAME0= <>
##$TPNAME1= <>
##$TPNAME2= <>
##$TPNAME3= <>
##$TPNAME4= <>
##$TPNAME5= <>
##$TPNAME6= <>
##$TPNAME7= <>
##$TPOAL= (0..7)
0.5 0.5 0.5 0.5 0.5 0.5 0.5 0.5
##$TPOFFS= (0..7)
0 0 0 0 0 0 0 0
##$TUNHIN= 0
##$TUNHOUT= 0
##$TUNXOUT= 0
##$USERA1= <user>
##$USERA2= <user>
##$USERA3= <user>
##$USERA4= <user>
##$USERA5= <user>
##$V9= 5
##$VALIST= <valist>
##$VCLIST= <CCCCCCCCCCCCCCC>
##$VD= 0
##$VDLIST= <DDDDDDDDDDDDDDD>
##$VPLIST= <PPPPPPPPPPPPPPP>
##$VTLIST= <TTTTTTTTTTTTTTT>
##$WBST= 2048
##$WBSW= 25
##$XGAIN= (0..3)
0 0 0 0
##$XL= 0
##$YL= 0
##$YMAX_a= 612456
##$YMIN_a= -510585
##$ZGOPTNS= <>
##$ZL1= 120
##$ZL2= 120
##$ZL3= 120
##$ZL4= 120
##$ABSF1= 14.98509
##$ABSF2= -5.573092
##$ABSG= 5
##$ABSL= 3
##$ALPHA= 0
##$AQORDER= 0
##$ASSFAC= 0
##$ASSFACI= 0
##$ASSFACX= 0
##$ASSWID= 0
##$AUNMP= <proc_prof1d_extract_pilot.lims>
##$AXLEFT= 0
##$AXNAME= <>
##$AXNUC= <1H>
##$AXRIGHT= 0
##$AXTYPE= 0
##$AXUNIT= <>
##$AZFE= 0.1
##$AZFW= 0.1
##$BCFW= 0
##$BC_mod= 0
##$BYTORDP= 0
##$COROFFS= 0
##$CY= 15
##$DATMOD= 1
##$DC= 0
##$DFILT= <>
##$DTYPP= 0
##$F1P= 0
##$F2P= 0
##$FCOR= 0.5
##$FTSIZE= 32768
##$FT_mod= 6
##$GAMMA= 0
##$GB= 0
##$INTBC= 1
##$INTSCL= 1
##$ISEN= 128
##$LB= 0
##$LEV0= 0
##$LPBIN= 0
##$MAXI= 10000
##$MC2= 0
##$MEAN= 0
##$ME_mod= 0
##$MI= 0
##$NCOEF= 0
##$NC_proc= -8
##$NLEV= 6
##$NOISF1= 0
##$NOISF2= 0
##$NSP= 0
##$NTH_PI= 0
##$NZP= 0
##$OFFSET= 14.98509
##$PC= 1
##$PHC0= 91.66443
##$PHC1= 0
##$PH_mod= 1
##$PKNL= yes
##$PPARMOD= 0
##$PPDIAG= 0
##$PPIPTYP= 0
##$PPMPNUM= 2147483647
##$PPRESOL= 1
##$PSCAL= 4
##$PSIGN= 0
##$PYNMP= <proc.py>
##$REVERSE= no
##$SF= 400.02
##$SI= 32768
##$SIGF1= 0
##$SIGF2= 0
##$SINO= 400
##$SIOLD= 32768
##$SPECTYP= <>
##$SREGLST= <1H.CDCl3>
##$SSB= 0
##$STSI= 32768
##$STSR= 0
##$SW_p= 8223.68421052631
##$SYMM= 0
##$S_DEV= 0
##$TDeff= 65536
##$TDoff= 0
##$TI= <>
##$TILT= no
##$TM1= 0
##$TM2= 0
##$TOPLEV= 0
##$USERP1= <user>
##$USERP2= <user>
##$USERP3= <user>
##$USERP4= <user>
##$USERP5= <user>
##$WDW= 1
##$XDIM= 32768
##$YMAX_p= 453641299
##$YMIN_p= -671759
##$CURPLOT= <Network HP LaserJet P1505>
##$CURPRIN= <$Network HP LaserJet P1505>
##$DFORMAT= <normdp>
##$LAYOUT= <+/1D_H.xwp>
##$LFORMAT= <normlp>
##$PFORMAT= <normpl>
##$SURQMSG= 1
$$ End of Bruker specific parameters
$$ ---------------------------------
##NTUPLES= NMR SPECTRUM
##VAR_NAME=  FREQUENCY,     SPECTRUM/REAL,   SPECTRUM/IMAG
##SYMBOL=    X,             R,               I
##VAR_TYPE=  INDEPENDENT,   DEPENDENT,       DEPENDENT
##VAR_FORM=  AFFN,          ASDF,            ASDF
##VAR_DIM=   32768,         32768,           32768
##UNITS=     HZ,            ARBITRARY UNITS, ARBITRARY UNITS
##FACTOR=    0.250966925370066, 1,           1
##FIRST=     8223.43324360094, 29437,        46699
##LAST=      0,             -89066,          -75343
##MIN=       0,             -671759,         0
##MAX=       8223.43324360094, 453641299,    0
$$ Real data points
##PAGE= N=1
##DATA TABLE= (X++(R..R)), XYDATA
$$ [...]
19473A12854R1308a31197k40919a22861L8538p7157A68010o0318i8299A27422
19462a74031k26807a993l28375e5389l06114J51053j22753P8110b8749B48042
19451d42262a0021j66487B07057d86641H3508a53361l40474A47972h3934B74292
19440b79914D8563A59J883c01960A24366c7747B9086c2237k03783g5805l20179
19429c95984b2498j72371A10975Q4404o6337P8700r5242d75292A3749g2850p8969
19418a51819j59800O7030C92771E0680J01910d3175p0740k67A4242e1511p1070
19407a22581A8998b03024n4082A059e38405A34195J788c50138a45581L2968j18284
19396b30897Q3747A40011b25145a0953j00890A87137b31731B03662a28322L7211
$$ y = [112854, 204162, -131197, -372116, -122861, -84323, -161480, 168010, 107692, -98299, 127422, -174031, -400838, -1993, -330368, -55389, -361503, -210450, -333203, -255093, -28749, 248042, -442262, -10021, -176508, 207057, -486641, 83508, -153361, -493835, 147972, -83934, 274292, -279914, 48563, 159, 2042, -301960, 124366, -37747, 29086, -32237, -236020, -75805, -395984, -22498, -194869, 110975, 195379, 129042, 207742, 112500, -475292, 13749, -72850, -151819, -311619, -244589, 392771, 50680, 152590, -43175, -113915, -114182, 14242, -51511, -122581, 18998, -203024, -257106, 1059, -538405, 134195, 135983, -350138, -145581, -112613, -230897, -147150, 140011, -225145, -10953, -111843, 187137, -231731, 203662, -128322, -91111]
19386i1111A17334a94616A97856A6561c4125B89762n5349c7038A37106e0125A5870
19374h4425H7833b5991p0205d4041j6814k0553G4366J48914H769b66958I32a99188
19361b2518l12572D41270a29735p7619j97779B02406i7933j08978j14851d3501
19350e1183A97891H5662A5690b00215f9241C4165d0763J663n1272J0318B28523
19338B48356n1936C9249c7974j41515E5430j5804c34864O1202J20729j85361a43398
19326g062A45305b92443J29740D149a77209P6386p7322Q1138B68990a04414k29168
19315c33582P1054N7335G2385a64850l1232A3761J6376Q6883b19614L3720e525
19303b98132B9169a23821D7230e5739j14692B29370E810J41325A8670J62102c3779
$$ y = [-91111, 117334, -194616, 197856, 16561, -34125, 289762, 234413, -37038, 137106, -50125, 15870, -84425, 87833, -25991, -96196, -44041, -60855, -81408, 74366, 223280, 8769, -266958, 932, -199188, -22518, -335090, 441270, -129735, -207354, -405133, 202406, -97933, -206911, -321762, -43501, -51183, 197891, 85662, 15690, -200215, -69241, 34165, -40763, -39100, -90372, -80054, 228523, 248356, 196420, 39249, -37974, -179489, 55430, 39626, -334864, -273662, -152933, -338294, -143398, -7062, 145305, -292443, -162703, 4149, -177209, -100823, -178145, -97007, 268990, -104414, -333582, -262528, -205193, 72385, -164850, -196082, 13761, 30137, 117020, -219614, -185894, -5525, -298132, 29169, -123821, 47230, -55739, -170431, 229370, 5810, 147135, 18670, 180772, -33779]
19291H3019c83954n7928A05540m2064g7819a602k01766R8190a2082n8234j22152
19280a92468H021N1736a890G1520i154E7529a54034j57927g8829q9106l51053
19269e18988a77659A46210f9839A38335A0552a3344C1772d67733K20936L8030
19259b08767G2521K10478a70634A3344f4792E1109c20443M1615k20829h8328C08338
19247h1187m3258n114E9541g3442n9983N1638n7531I2571B4240d05473A91670
19235b50372Q7114B7064e9053j94138A50249a5021A523K38330b53217f0551A60687
19223a82687A67807b04457Q906A52186a74078A98694A6093N8574b30790o7981
19213b98771M6876B4524J12714a42561o7687a2115k98121G4849g1298j6152k41004
$$ y = [83019, -383954, -441882, 105540, 63476, -77819, -1602, -203368, -105178, -12082, -70316, -192468, 8021, 59757, -1890, 71520, -9154, 57529, -154034, -311961, -78829, -167935, -518988, -177659, 146210, -69839, 138335, 10552, -13344, 31772, -467733, -246797, -208767, 72521, 282999, -170634, 13344, -64792, 51109, -320443, -278828, -499657, -88328, 308338, -81187, -124445, -129559, 59541, -73442, -133425, -81787, -139318, 92571, 24240, -405473, 191670, -250372, -163258, 27064, -59053, -253191, 150249, -15021, 1523, 239853, -253217, -60551, 160687, -182687, 167807, -204457, -195551, 152186, -174078, 198694, 16093, 74667, -230790, -298771, -251895, 24524, 137238, -142561, -210248, -12115, -310236, 74849, -71298, -87450, -328454]
19202c28454a23032A72768Q5338a56918O6503A88521c92214h1204A11896b17840
19191A20281f5j9100A2798h6403j10854i3220m0616B63095A25554e8525j26836
19180a85361A83956R0321b66097B19878a81858j65424J50054j27534e7937A16164
19169d68692A59799C0254i5411A85800b94839f7543H9015b27515g754A56282b6590
19157c45499D4780b54776f5868A22746c84408J28154B22974E3200b11832N8038
19147a53794H3301a0126j07592j658k20339a25629k85736A91244a28591b2451
19136b90591C7795b19311D22615p1762H4508a02585d0229j7320j54740E5755a49988
19124A46847a97095A45351h068A71127i5937k18299N1945C38036b47453m0595
$$ y = [-328454, -123032, 172768, 258106, -156918, -90415, 188521, -392214, -81204, 111896, -217840, 120281, -65, -19165, 12798, -86403, -197257, -93220, -133836, 263095, 125554, -58525, -185361, 183956, 274277, -266097, 219878, -181858, -347282, -197228, -324762, -57937, 116164, -468692, 159799, 30254, -95411, 185800, -294839, -67543, 89015, -227515, -7754, 156282, -26590, -345499, 44780, -254776, -65868, 122746, -384408, -256254, 222974, 53200, -211832, -153794, 83301, -10126, -117718, -119376, -339715, -125629, -411365, 191244, -128591, -22451, -290591, 37795, -219311, 422615, 350853, 84508, -102585, -40229, -57549, -212289, 55755, -149988, 146847, -197095, 145351, -8068, 171127, -95937, -314236, -262291, 338036, -247453, -288048]
19114b88048A76602b3454B3704f6571a3835k10669j3026D0805J64947H0a35201
19102A63423b55509e5686n1696i881k67496j3211e1937j46690m0017b1884q3190
19091a05074D8806b42153a10737F1968J46435H1664f61898b61024b8476A37272
19080a88995I8896e3730C88323b28912O1482a574C17707p5269I66a83567K8547
19069a55020A97369L189b01523e4607a6411l4590j99183p2807k3943a61320g5761
19057A10151f3434G3450j9894K3747d8156k33641a5576E5024d9550k52393B0018
19045C35i0548A19543D091J91587g232m78973a96714a7801F7535O8731a88073
19033C0011a18434M6794A92326D8932a25139j41572B95306j00864P1351b39075
$$ y = [-288048, 176602, -23454, 23704, -66571, -13835, -224504, -237530, 40805, 205752, 80, -135201, 163423, -255509, -55686, -107382, -9881, -277377, -290588, -51937, -198627, -238644, -21884, -105074, 48806, -242153, -110737, 61968, 208403, 81664, -661898, -261024, -28476, 137272, -188995, 98896, -53730, 388323, -228912, -167430, -1574, 317707, 242438, 966, -183567, -155020, 197369, 200558, -201523, -54607, -16411, -51001, -250184, -322991, -346934, -161320, -75761, 110151, -63434, 73450, 53556, 77303, -48156, -281797, -15576, 55024, -49550, -301943, 20018, 335, -90548, 119543, 4091, 195678, -7232, -486205, -196714, -17801, 67535, 136266, -188073, 30011, -118434, -71640, 192326, 48932, -125139, -266711, 295306, 194442, 265793, -239075]
19022I7054n097f6626B00673r1621c7555l9700l9692A02714K4505c5113k06813
19011b41926B4845A0758c8978M546E5470a08534M6512B54187b80213a11439B1906
18999c59436d9428A45514k9040B9493L8471m329P4185a15090j25779R7277N3184
18988i0408o3454J0367d262j40655A5027L3698P8899b4843j56940I841a05177
18976b9157B9915a56507D0686K56729J69251Q5899J271H8910b26463I8245K8065
18965A26310b2375A94176e6452A48021K7636a10694p7045l38973a16367A80371
18954a36011B12897b82264C9964b28278K589R3271b4080m7396A26074a1444G52
18942E7398K12174b94780f1359G3645b17165n9303f0003j69605J215A30490a80011
$$ y = [97054, 91957, -66626, 200673, 109052, -37555, -77255, -116947, 102714, 127219, -35113, -241926, 24845, 10758, -38978, -34432, 55470, -108534, -62022, 254187, -280213, -111439, 21906, -359436, -49428, 145514, 116474, 29493, 67964, 63635, 137820, -115090, -240869, -143592, -90408, -153862, -143495, -4262, -144917, 15027, 48725, 127624, -24843, -181783, 9841, -105177, -29157, 29915, -156507, 40686, 297415, 466666, 552565, 553836, 88910, -226463, 98245, 126310, -22375, 194176, -56452, 148021, 175657, -110694, -187739, -526712, -116367, 180371, -136011, 212897, -282264, 39964, -228278, -225689, -132418, -24080, -71476, 126074, -11444, 752, 57398, 269572, -294780, -61359, 73645, -217165, -276468, -60003, -229608, -228393, 130490, -180011]
18930C7431i3241A78620p1395i4555H6819k5667b88514J15784E24i968j37635
18919a47603A35859e73101e1810j55407D9936b11900K7335B46964A3804K87459
18909C01263A30528O41804B80225n2491I4582R8575b33505d6358O470k34954A66236
18897C36064a7051A77677b3579j7873A23054c52778a07853L8072j52854L1053
18887a91582A70599m6475J08569a45323j05496j62525a57327l2780j37824a14794
18876d8656J1369l4565j42489A49442L0742H9748a40454C7010b97232k57382A69497
18864A46237a34105A26016A2927b25879a000H4250B2586b50185e9149B3698b09461
18852B097O7589a52051b4839H8165B9369a15263b9897j9437J5480R190F8955m53
$$ y = [37431, -93241, 178620, 107225, -94555, 86819, 61152, -288514, -172730, 524, -9968, -147603, 135859, -573101, -51810, -207217, 49936, -211900, -184565, 246964, 13804, 301263, 130528, 772332, 280225, 227734, 94582, 193157, -233505, -46358, -39888, -274842, 166236, 336064, -17051, 177677, -23579, -41452, 123054, -352778, -107853, -69781, -222635, -191582, 170599, 124124, 232693, -145323, -250819, -413344, -157327, -190107, -327931, -114794, -48656, -37287, -71852, -214341, 149442, 180184, 89748, -140454, 37010, -297232, -554614, 169497, 146237, -134105, 126016, 12927, -225879, -1000, 84250, 22586, -250185, -59149, 23698, -209461, 2097, 69686, -152051, -24839, 88165, 29369, -115263, -29897, -49334, -33854, -24664, 68955, 68502]
18840F8502e0858m8033a2809A53098o3691N9412a28598j13639A70846i654j41849
18829a51503k0003B85705d53636o111K09129b7100k41799M2048N8991c9013H4638
18817a87956e6636A70775J2769h5646C60648A3775J60318j52n5983P0214J26681
18806C14853I4708b08289g6964l6706K7838o3032d4828j06265f1283m0068j43725
18795b45076b0054A61044c76641C9251L1176b45882h5177M1618n3518J9831l332
18784h0578I324J46074i9075A6891d5767p7855A28771h8277M1916j92303B64288
18772i6561E7229f810k66741E5699a00164l185o4490J4221g873l0582j4892k7639
18760h0986D4641a42769A38893c38316J62438g1244B95320c59730J64875e8735
$$ y = [68502, -50858, -98891, -12809, 153098, 89407, 148819, -128598, -242237, 170846, -9654, -151503, -171506, 285705, -453636, -459747, -250618, -27100, -268899, -226851, -167860, -39013, 84638, -187956, -56636, 170775, 183544, -85646, 360648, 13775, 174093, 173941, 117958, 188172, 314853, 94708, -208289, -76964, -113670, -85832, -148864, -44828, -151093, -61283, -101351, -245076, -20054, 161044, -376641, 39251, 70427, -245882, -85177, -43559, -97077, -77246, -80578, 9324, 155398, -99075, 16891, -45767, -123622, 128771, -88277, -46361, -238664, 264288, -96561, 57229, -6810, -273551, 55699, -100164, -103349, -167839, -153618, -7873, -38455, -53347, -80986, 44641, -142769, 138893, -338316, -175878, -71244, 295320, -359730, -194855, -58735]
18749h8289A6277M1395O010j2883J35435c29819f9709G9658g1061j57431A76260
18737b13576J7524g9146B24436D4614c2776A12107f9144j0033k74428D2161M849
18726D7010b56085l5771E456a89637l433A16846a25393j07323B52538a66575d3248
18714A21501b01164R6495p9443C39774b05166A1275f4431n114A58610h0740g391
18702h9786j1131k7602E7318a8135j46135d2939E7381c74516D0754i3344B18773
18690a92501M6698l4967r3249N1077p6658g8799G7444b32089q9159J44070b6945
18678B75412A03284d9327m8244I9303g3182A09610c49803f155C1443a32964G6079
18666a65479E9490g6396r8182d4433E59982b59349a24771r2171L9670N8929l89151
$$ y = [-88289, 16277, 57672, 63682, 50799, 186234, -329819, -69709, 79658, -71061, -228492, 176260, -213576, -196052, -79146, 224436, 44614, -32776, 112107, -69144, -79177, -353605, 42161, 47010, -256085, -291856, 5456, -189637, -193070, 116846, -125393, -232716, 252538, -166575, -43248, 121501, -201164, -104669, -184112, 339774, -205166, 11275, -64431, -69545, 158610, -80740, -7391, -89786, -100917, -128519, 57318, -18135, -164270, -42939, 57381, -374516, 40754, -93344, 218773, -192501, -145803, -180770, -274019, -222942, -299600, -78799, 77444, -232089, -321248, -177178, -26945, 275412, 103284, -49327, -97571, 99303, -73182, 109610, -349803, -6155, 31443, -132964, 76079, -165479, 59490, -76396, -174578, -44433, 559982, -259349, -124771, -216942, -177272, -118343, -507494]
18655e07494a16257j2809A10539a44142B25571b81924D0373J6149f2006p8739
18645a40745A3609a96121l9316F9337J3761a64039f6043j84404C34575G7878J90936
18634B68814b97643i7827C5167f4409B68903G583d08949a17961j55733M1370F6276
18622b12719A09450m7349a7033B10313a72680C5427h5573A04248l8191h6383D9128
18610c16277g5723j34094C3705a97087A31565b52283k5930j44815c9537j73410
18600b12947g91A78369m4497a54484l2174B62159a73004J1327C2830Q7381k9064
18589I1147e1920j40297A02347Q1481e1105B88230a23008K205I374a19392k05167
18578c24559A58499f6731C9309P8805f5679j16216g3867C05770b2770o4121c5606
$$ y = [-507494, -116257, -129066, 110539, -144142, 225571, -281924, 40373, 56522, -62006, -140745, 13609, -196121, -235437, 69337, 83098, -164039, -66043, -250447, 334575, 77878, 268814, -297643, -97827, 35167, -64409, 268903, 7583, -408949, -117961, -273694, -232324, 66276, -212719, 109450, 62101, -17033, 210313, -172680, 35427, -85573, 104248, 66057, -86383, 49128, -316277, -75723, -209817, 33705, -197087, 131565, -252283, -278213, -423028, -39537, -212947, -791, 178369, 133872, -154484, -186658, 262159, -173004, -161677, 32830, 120211, 91147, -51920, -192217, 102347, 183828, -51105, 288230, -123008, -120803, 9374, -119392, -324559, 158499, -66731, 39309, 118114, -65679, -181895, -73867, 305770, -22770, -86891, -35606]
18566b51301G0623M2004b92006e2316j74195B1250h1859b6090j13811E4478i368
18554d4788p3754D709a11230f643j91695j12130a16182k8386e0635K147F3912
18542c598E4963a79379B86163b26400C66587I9628b66131B3133g724j01702B4007
18530C7893d6077B872a97953j26494r72N5750A03868a09574k1294a2609A91197
18518B4698J25257a03742F6375a80776d2530k47788J09133j43386f6744p1406
18508a38150k23784d2722k83846H3175a64574C3064f22I0310a89698a5030B06232
18496b0808A48577m767a53470H7243F888J25473C8954K65826a28494A53845J35967
18485B89812g5711J8211A00587h1328m64192A27814o606K0099a34089k6597j61798
$$ y = [-251301, 70623, 112627, -292006, -52316, -226511, 21250, -81859, -26090, -139901, 54478, -9368, -44788, -118542, 4709, -111230, -6643, -198338, -310468, -116182, -144568, -50635, -48488, 63912, -3598, 54963, -179379, 286163, -226400, 366587, 99628, -266131, 23133, -7724, -109426, 24007, 37893, -46077, 2872, -197953, -324447, -325419, -269669, 103868, -109574, -130868, -12609, 191197, 24698, 149955, -103742, 66375, -180776, -42530, -290318, -181185, -324571, -66744, -138150, -361934, -42722, -326568, 83175, -164574, 33064, -622, 90310, -189698, -15030, 206232, -20808, 148577, 143810, -153470, 87243, 6888, 132361, 38954, 304780, -128494, 153845, 289812, -75711, -57500, 100587, -81328, -545520, 127814, 121208, 141307, -134089, -160686, -322484]
18474c22484J06393C8524a30557k02826n9130F788a60201g9370k32169A65956
18463b32982g5785K943k41604P469i8735n1721k30077c813j1810j25467B17324
18451A01965b08066j15532g6356D9133g7678J2559o1257G5149A7944a26089B63478
18439A717b89230D264b28180j56830D3731M5297b10983h3118C5343b23986j15116
18428c39102C56868j71168d5798A47553L2034e4082j19765K5992B30087g473k66749
18417b74222B27891G8379a91326Q8003E2561f6441p3471l5227n8871A04268R8300
18406B02568h6090I376i513k8170B52162a67815M9311A35251i381m06410A08808
18394b50248G8689d1912F3737k2654N0333O1955F2117h5317C0119a09730b5126
$$ y = [-322484, -216091, 38524, -130557, -333383, -392513, 6788, -160201, -79370, -311539, 165956, -232982, -75785, -72842, -314446, -306977, -98735, -150456, -380533, -3813, -15623, -141090, 217324, 101965, -208066, -323598, -76356, 49133, -77678, -65119, -126376, 75149, 17944, -126089, 263478, 1717, -289230, 4264, -228180, -385010, 43731, 89028, -210983, -83118, 35343, -223986, -339102, 356868, 185700, -45798, 147553, 179587, -54082, -173847, -147855, 230087, -7473, -274222, 227891, 78379, -191326, -103323, 52561, -66441, -139912, -175139, -234010, 104268, 202568, -86090, 9376, -9513, -37683, 252162, -167815, -118504, 135251, -9381, -415791, 108808, -250248, 78689, -41912, 63737, 41083, 91416, 153371, 62117, -85317, 30119, -109730, -25126]
18382a75466e71j2552A98024B2436a4236n4053j5514q5063B70617c62199B08699
18370a33099n0503A68036e1670q996H4447Q6709a74378g1700A2050b06359B20915
18358A5921h1843A20604A1340b6884E2345a34741A76444a93831q7803b645j40429
18347a43074j8856B40346c6004C7676c60200A33706a9457B76448j22334b99518
18336A69183b82466d1693a154r8408q2627B15995J0557p9441a48789A46328a29693
18324E2147J03998I928b4628m4748D1933K0075K6320a13601J911A10269d8496
18312a24844q4571d4621n6419q3667A77780i8535o4564d8385H9067M5790f3609
18300c8640G0026J03584m2181L72809a88935D8300k0855e6759k34306A93772a30587
$$ y = [-175466, -571, -13123, 198024, 22436, -14236, -68289, -83803, -168866, 270617, -362199, 208699, -133099, -183602, 168036, -51670, -60666, 84447, 171156, -174378, -71700, 12050, -206359, 220915, 15921, -81843, 120604, 11340, -26884, 52345, -134741, 176444, -193831, -281634, -2645, -143074, -161930, 240346, -36004, 37676, -360200, 133706, -19457, 276448, 154114, -299518, 169183, -282466, -41693, -1154, -99562, -182189, 215995, 226552, 147111, -148789, 146328, -129693, 52147, 156145, 9928, -24628, -69376, 41933, 62008, 88328, -113601, -111690, 110269, -48496, -124844, -209415, -44621, -101040, -184707, 177780, -98535, -163099, -48385, 89067, 134857, -63609, -38640, 70026, 173610, 131429, 504238, -188935, 48300, 27445, -56759, -291065, 193772, -130587]
18288a22829A3915a15889M7782B9465b68132J09496M4736N4539j9992A22430D7566
18276a83617c498j1757A70402h977D24734a2053k29907g773C52876e5825A00705
18264a99868Q9184n2500e1559j97720g9960J8441I1239e8459g2o1586D5157K9403
18252G4560J52633o2544a37081A7721b73821n9920P6464L1230A23551b63367B87041
18240b18718a208m0327l249o4038C3365Q8512b13932C16199a28968k47919F4165
18228A49071A4885J18187A6279B176f1302H7203g9692G1361B8351b94211d9766
18216a41938k2783c2763B45870e6123j11682O936g6755q4456P3699A17937b23480
18204A3084d3295l19610J01861A18201n6851g2314c1327A48727L690O7544i9734
$$ y = [-122829, 13915, -115889, -68107, 29465, -268132, -158636, -113900, -59361, -79353, 122430, 47566, -183617, -3498, -15255, 170402, -8977, 424734, -12053, -241960, -7773, 352876, -55825, 100705, -199868, -110684, -163184, -51559, -249279, -79960, -61519, 91239, -58459, -72, -61658, 45157, 74560, 227193, 164649, -137081, 17721, -273821, -333741, -257277, -226047, 123551, -263367, 287041, -218718, -1208, -41535, -44784, -108822, 33365, 121877, -213932, 316199, -128968, -376887, 64165, 149071, 14885, 133072, 16279, 2176, -61302, 87203, -79692, 71361, 28351, -294211, -49766, -141938, -164721, -32763, 245870, -56123, -167805, -160869, -76755, -161211, -87512, 117937, -223480, 13084, -43295, -362905, -261044, 118201, 61350, -72314, -31327, 148727, 152417, 219961, -99734]
18192A3972i0859C6040f1389L0101A85657B8887L1155a88475c2074B154h4585
18180A75079G5888p025B3592f4389o436A15557D3917i1517k2673H1843J55014
18169B36857a59785A45980a48292H5896f2594n5255B29040b01136B18335f8911
18158G2841K3822b92741h4420j70104g6791D5545b41733a0919q0446j69735a12172
18146D0333L1324k6202c17091H0642L5228N8395a04431D7780b03437A41757f4700
18134C24083d13746g8090j66280f8604A80115a61840B00840H8781a37680E2045
18123g0918A68719j1248a03003j4999N7949D6825j4453b2537C9937a13021c5417
18111C62720a60102G6993a02324K2695r3096F7784a1835k95857H1023b14551h8276
$$ y = [13972, -90859, 36040, -61389, -31288, 185657, 28887, 60042, -188475, -32074, 2154, -84585, 175079, 75888, 68863, 23592, -64389, -70825, 115557, 43917, -91517, -114190, 81843, 236857, -159785, 145980, -148292, 85896, -62594, -117849, 229040, -201136, 218335, -68911, 72841, 96663, -292741, -84420, -254524, -76791, 45545, -241733, -10919, -91365, -261100, -112172, 40333, 71657, 45455, -317091, 80642, 115870, 174265, -104431, 47780, -203437, 141757, -64700, 324083, -413746, -78090, -244370, -68604, 180115, -161840, 200840, 88781, -137680, 52045, -70918, 168719, 157471, -103003, -118002, -60053, 46825, 32372, -22537, 39937, -113021, -35417, 362720, -160102, 76993, -102324, -79629, -172725, 67784, -11835, -307692, 81023, -214551, -88276]
18099B7141a64240A08107J98176H5397J43234p8641b0987A30494b29909D0889
18088g0209B21736a00109B99701C3891a54572O5183B10588n6472c0021k18423
18078b48444A65700K62036a29523j22893b436D2310g593j78581f0567b2334g58
18066C1566a91739c8572o9348N3284o7275M0164A79417f3683R682A25319b79857
18054I3042Q840D6398A7895a13410F6038B4939c50587J52140C371M3514R1931
18043A38816b88961A71332k963i5035d3258B0098a68159r7375A64768g5060j26608
18032b01668C51880P0464d9732k9769C76170b21484A93431G2039a19356B6227
18021A43154b61298A45507b7716l0711b2916D548a64323h703B93611D4842q756
$$ y = [27141, -164240, 108107, 306283, 85397, 228631, 149990, -20987, 130494, -229909, 40889, -70209, 221736, -100109, 299701, 33891, -154572, -89389, 210588, 154116, -30021, -248444, 165700, 427736, -129523, -252416, -2436, 42310, -7593, -186174, -60567, -22334, -758, 31566, -191739, -38572, -107920, -54636, -121911, -81747, 179417, -63683, -54001, 125319, -279857, 93042, 101882, 46398, 17895, -113410, 66038, 24939, -350587, -198447, 3371, 46885, 138816, -288961, 171332, 168369, -95035, -43258, 20098, -168159, -265534, 164768, -75060, -201668, 351880, 422344, -49732, -79501, 376170, -221484, 193431, 72039, -119356, 26227, 143154, -261298, 145507, -27716, -58427, -22916, 4548, -164323, -8703, 293611, 44842, 36086]
18010C6086a21490c4699p4712a8446A72242a02856I072J11144C2432N2361a51069
17998B43698b6394D5550j1823J51101g142A17980l7361a37204k11586D4506a8767
17986a02122c4696j06584E3998f0224b9983l45056D8240i5828a7597A53677c19453
17974C00162j21011b67971B49329b24478P7937l5954A0326M42930c09901A36283
17963d4919B06053C6664K36015d2437l5745I2595j5942R5829g3400A38646H925
17951A42334F3689J26933i63H9525i3504b0647A16608a81291C39372f9836b3562
17939b29328B1331g6434A11556R7874J79942F5598J7331c12723J11740B3515K75386
17928B98901A33174J06648j8376a49003A66643k8114a76167g6256B59789a52551
$$ y = [36086, -121490, -34699, -109411, -18446, 172242, -102856, 9072, 120216, 32432, 84793, -151069, 243698, -26394, 45550, 33727, 184828, -7142, 117980, 80619, -137204, -348790, 44506, -18767, -102122, -34696, -141280, 53998, -60224, -29983, -375039, 48240, -95828, -17597, 153677, -319453, 300162, 179151, -267971, 249329, -224478, -146541, -182495, 10326, 453256, -309901, 136283, -44919, 206053, 36664, 272679, -42437, -78182, 92595, 76653, 172482, -73400, 138646, 8925, 142334, 63689, 190622, -963, 89525, -93504, -20647, 116608, -181291, 339372, -69836, -23562, -229328, 21331, -76434, 111556, 209430, 389372, 65598, 82929, -312723, -200983, 23515, 298901, 133174, 239822, 221446, -149003, 166643, 138529, -176167, -76256, 259789, -152551]
17917e2805p3539F1460i554A9617K9947P123O2898C5760J65793i6220j33771N5686
17905a74305N2996B19122a57918c2449C17242a00168k3234G242P6118c7024E7142
17893a06736K4830A35905l9237J52353B8618A63K11538a40266O3061D4155Q8809
17882A32964b16875B13127Q164A01412e4355A65554J70691f9885j7647B06323
17871b05383A4066N6408L04511A01166D2026N8901J06157e5333k6415C35600q7799
17860B47801C1656q612c3126m7781b6828G9795b26392G5972c0686m1453A43578
17848g401k44434c8234K165A804J98729a01998b6393A66416l9698J47404c7085
17836B50795j13227k3325L0616J47630k1264o4723F5585b31030B80562b09041
$$ y = [-52805, -126344, 61460, -9554, 19617, 49564, 56687, 119585, 35760, 201553, -96220, -229991, -174305, -121309, 219122, -157918, -32449, 317242, -100168, -123402, 7242, 83360, -37024, 57142, -106736, -81906, 135905, 96668, 249021, 28618, 163, 211701, -140266, -77205, 44155, 132964, -216875, 213127, 221291, 101412, -54355, 165554, 336245, -69885, -87532, 206323, -205383, 14066, 70474, 374985, 101166, 42026, 100927, 207084, -55333, -81748, 335600, 247801, 31656, 23044, -33126, -80907, -26828, 79795, -226392, 75972, -30686, -72139, 143578, -7401, -251835, -38234, -36069, 1804, 200533, -101998, -26393, 166416, 126718, 274122, -37085, 250795, 137568, 114243, 144859, 292489, 271225, 206502, 65585, -231030, 280562, -209041]
17825b8456m58775h9909J7252c5493A77838A8866b16329A63113b0485D626a13765
17813g0737A65974c9397A37541L8758H2642a20039D20503b89863i0131k70948
17803c61079B57007h4670K2356J5728l499n4982B46551B8978R6939D3067J12420
17792A55487g286C14347a46549d4666A75167M9357E6064J4441b73822D8422B1801
17780A34190a10517G3980Q0860Q2182A5772b861F3337O384i0690a0357A48332
17768E38971A28204B2634b14520B18957e109r1474B18291j2782a51232B65391
17757B67567a0638A78823R0638b8061C08655j14728E184a19600b6701G5919C0567
17745E1971a98870A99788E8595c0381B01722q7559b5515B94774C1642h7818A58521
$$ y = [-28456, -487231, -89909, -72657, -35493, 177838, 18866, -216329, 163113, -20485, 4626, -113765, -70737, 165974, -39397, 137541, 176299, 82642, -120039, 420503, -289863, -90131, -361079, 257007, -84670, -62314, -46586, -50085, -105067, 246551, 28978, 125917, 43067, 155487, -7286, 314347, -146549, -44666, 175167, 224524, 56064, 70505, -273822, 48422, 21801, 134190, -110517, 73980, 154840, 237022, 15772, -2861, 63337, 69721, -90690, -10357, 148332, 538971, 128204, 22634, -214520, 218957, -5109, -96583, 218291, 205509, -151232, 265391, 267567, -10638, 178823, 269461, -28061, 308655, 193927, 5184, -119600, -26701, 75919, 30567, 51971, -198870, 199788, 58595, -30381, 201722, 114163, -25515, 294774, 31642, -87818, 158521]
17733a08502H3977d0153E4473a08652C25835A0609h3107a0199D43049C534K54612
17722B58146B9590a17848A04550a46323A13571J82764f3437C59417A48172a76255
17711f3122n6692e4005l718A40418l874k6119a0287k0309m9426A85378j978P7935
17699B61335a17334N4976B14645k1048J73322j57323J161a9367A9706i0773A28356
17687G3348K6704A2443L35070q0040b46011D7576J2514b03173B16315G9761J96138
17676B75899a21217j50496a3602A14025Q6003L42978A91560i0551c2538D3190
17665C2181R1925K66637A31701R0718L1482A25270P9620b05478A88436D6057N9078
17654A05135j7108b6123B41752o2740G781e3609H3644K3413b84191H1603a3525
$$ y = [-108502, 83977, -40153, 54473, -108652, 325835, 10609, -83107, -10199, 443049, 3534, 258146, 29590, -117848, 104550, -146323, 113571, 296335, -63437, 359417, 148172, -176255, -63122, -119814, -54005, -57723, 140418, 136544, 110425, -10287, -30596, -80022, 185378, 183400, 261335, -117334, -62358, 214645, 193597, 366919, 209596, 210757, -19367, 19706, -90773, 128356, 73348, 100052, 12443, 347513, 267473, -246011, 47576, 60090, -203173, 216315, 79761, 275899, -121217, -271713, -13602, 114025, 200028, 543006, 191560, -90551, -32538, 43190, 32181, 124106, 390743, 131701, 222419, 253901, 125270, 204890, -205478, 188436, 46057, 105135, 88027, -26123, 241752, 179012, 7781, -53609, 83644, 107057, -284191, 81603, -13525]
17642a56222A83570M1962J45027c2100G6055h9619B41050k4836J52436h3644B02799
17630a081n4129L025A7336L086J86935Q8829A2499c57011A15991a73856D7319
17618B12879g3409G727K39629A09533g1457B2219L20304H1666a66169B35329a48357
17606E05687B51268e4679I3329J76578D4159J54362p1855K52308j30338R0670
17596C39306b3915j88308B60148A07503i8187C5316J68294r5877J73487b8012
17585A27226m6457J10464e5288J2324A55303B5697e9349l1762B12969f5328C79493
17573b29895J05213G4296O6648a07351B91410A39009D5434a42618H5916N7690
17563A43606g585I8920Q9040k4054o1294K5983f3314I2020L98141k16346J50732
$$ y = [-156222, 183570, 225532, 370559, -32100, 76055, -89619, 241050, 216214, 368650, -83644, 202799, -1081, -55210, -52185, 17336, 20422, 207357, 296186, 12499, -357011, 115991, -173856, 47319, 212879, -73409, 7727, 247356, 109533, -71457, 22219, 342523, 81666, -166169, 235329, -148357, 505687, 251268, -54679, 93329, 269907, 44159, 198521, 126666, 378974, 248636, 339306, -23915, -212223, 260148, 107503, -98187, 35316, 203610, 107733, 281220, -28012, 127226, 80769, 191233, -55288, -42964, 155303, 25697, -59349, -91111, 212969, -65328, 379493, -229895, -124682, 74296, 140944, -107351, 291410, 139009, 45434, -142618, 85916, 143606, -7585, 98920, 187960, 163906, 102612, 128595, -63314, 92020, 490161, 273815, 424547]
17552D24547c8145H3908K08278o6575K6575G6506a18965D83008a80947B86039
17541A83024L15380h833B40696J05034F5278L05915H6195K30871E0739K06357
17531B57096j11958K07627G6923N57666j81815M57399J1337N8841j56977j43769
17521F79605K6206j8322k70996R3345n2044k15707r7197N48306j90166R5767K47628
17510H46425m9411J69453k45306k28155k8370j58712J73653j3203A98066P5997
17500B74063O4218q4809K20702E0443J87997O33643B53443Q3462j5667k5742l5402
17489B60094p5532o6487K21145H0667K05505A32170J96660b5662C23623J76561
17479E00184k11155N5689A23854K78793m5032A31710K00744i999F64333I4311
$$ y = [424547, -38145, 83908, 292186, 225611, 252186, 76506, -118965, 483008, -180947, 286039, 183024, 498404, -8833, 240696, 345730, 65278, 371193, 86195, 317066, 50739, 257096, 145138, 352765, 76923, 634589, 452774, 910173, 921510, 980351, 823374, 679605, 705811, 687489, 416493, 509838, 457794, 242087, 144890, 693196, 503030, 598797, 846425, 797014, 966467, 721161, 493006, 464636, 305924, 479577, 466374, 198066, 274063, 338281, 253472, 474174, 50443, 238440, 872083, 253443, 336905, 321238, 295496, 260094, 184562, 118075, 339220, 80667, 286172, 132170, 328830, -25662, 323623, 500184, 289029, 344718, 123854, 402647, 357615, 131710, 332454, -9999, 664333, 94311]
17468B42704M2137E8700a86449D09863j26236K40885A00030M5977k0311b7327
17457D63468j18151p9238K1500J73331c7271D08560R4649I1204M43935A24635
17446C46256A35585M02820k54625K64143j95773J03491j80495q8898K30927A08796
17435C98127J74488k43438Q947n9997J7865q8809M60500G7966M10978k14974l7415
17424B36555J87898A32050K33341Q3157M0389j36149r1446G0635M10331J18334
17414E99300B94801k0895A34001R7920R7914Q0875J63674A14650m8028K2113Q2685
17403A71420K91937G5516C0030k799M70838k41578F7296N17769A27167J94131
17393C21298J39975j557j63217e8371C92600A19645C1708K12734J28438N7650
$$ y = [242704, 284841, 58700, -186449, 409863, 283627, 524512, 100030, 146007, 125696, -27327, 463468, 345317, 266079, 287579, 460910, -37271, 408560, 503209, 91204, 535139, 124635, 346256, 135585, 538405, 283780, 547923, 352150, 455641, 275146, 186248, 417175, 108796, 398127, 572615, 329177, 338124, 278127, 295992, 207183, 667683, 77966, 488944, 273970, 236555, 424453, 132050, 365391, 448548, 488937, 352788, 261342, 70635, 480966, 599300, 294801, 273906, 134001, 231921, 329835, 410710, 574384, 114650, 66622, 88735, 171420, 463357, 75516, 30030, 27231, 498069, 256491, 67296, 585065, 127167, 321298, 461273, 459716, 296499, -58371, 392600, 119645, 31708, 244442, 372880, 430530]
17383D30530j91205J59159j0651J52618k38164D9548L08680A21855O0015J94132
17373C76002L5015j27493J51729o2843j54462j126J26857G2142J58758E3500M31463
17362D84963A40798K24548K6452E3205L58698B7726J23282K52578l2281A28473
17351H4041R2541J82803j05860Q1560J28956A47003K03906q2997r2413Q6842q4648
17340A77693J63480L4444r7403J5091J67100J50397m6665k26275j21583J56897
17330C73176b1000C14651m5481J01019m1098j2546L9051j45045K10497a07086
17319B33304A05924N0772K41563A91416l1062J03045J49815j56122P5733J51089
17309D83914A85766J96725Q8434A47148p3326M28083A23597K114J95631j48587
$$ y = [430530, 239325, 398484, 387833, 540451, 302287, 49548, 358228, 121855, 181870, 376002, 411017, 283524, 435253, 372410, 217948, 216822, 343679, 72142, 230900, 53500, 484963, 140798, 365346, 391798, 53205, 411903, 27726, 151008, 403586, 371305, 128473, 84041, 176582, 359385, 253525, 335085, 464041, 147003, 350909, 267912, 175499, 262341, 177693, 341173, 375617, 278214, 293305, 460405, 610802, 564137, 337862, 216279, 373176, -21000, 314651, 269170, 370189, 329091, 316545, 355596, 210551, 421048, -107086, 233304, 105924, 156696, 398259, 191416, 160354, 263399, 413214, 257092, 332825, 483914, 185766, 382491, 470925, 147148, 73822, 501905, 123597, 125711, 321342, 172755]
17299A72755K68618k12940J53893j67975j02679M42298k01290G8426J14971J20647
17289C14044m6134p786K21110J80098k23695A59977K10265A84001c1465A87059
17278E48017F8721J67038m0694J9210K06569A40872K82927O9480k33476L6137
17268B95940L6339P3383A86772J09626K65085k21615j15817K55069A39716J68997
17258C08713j09413J77113J09670B35438R6061K82351k29585J94324k06724k7392
17248C44473L1547J25335A54019O0632l0023B5065L24178k3504K78551j38951
17238D65339L19807C78360J15082J29787B03946K92085o4226J68568k45724K8050
17228C82699R6574J15076j10419R2909q7164i372A65002L52688n3239n6836J4612
$$ y = [172755, 441373, 228433, 382326, 214351, 111672, 553970, 352680, 78426, 193397, 314044, 267910, 260124, 481234, 661332, 437637, 159977, 370242, 184001, -31465, 187059, 548017, 68721, 235759, 195065, 214275, 420844, 140872, 423799, 493279, 259803, 295940, 332279, 405662, 186772, 296398, 561483, 339868, 224051, 479120, 139716, 308713, 199300, 376413, 486083, 235438, 331499, 613850, 384265, 578589, 371865, 344473, 376020, 501355, 154019, 214651, 184628, 25065, 349243, 325739, 604290, 465339, 785146, 378360, 493442, 623229, 203946, 496031, 431805, 600373, 354649, 382699, 479273, 594349, 483930, 576839, 489675, -9372, 165002, 517690, 464451, 407615, 422227]
17217D22227m5223J86267n6708n46B22145L11063j49043M4568j36390M1034J48764
17206D82141j67325J19901j21327K4118J39340Q5310j72176R5977K2001l5427
17196D72533O3897j57253L25958j10994j84800J19752j16734K38195B90319K16334
17186E06653R269K16642k28336j49605J66090k30300N85053D21574J7137K16034
17176F54745k28045K08040k3815J26852j46843j53996J58395j0896j51190p6016
17166C57231K28826j70900R1894K23962j87632j70065k3932N61199k96285q2595
17156E31703m8598o5502J50628l8278O3042j08635J52653J87737j50603B83499
17145E79527j64305L89962k38927j55622J68449P7003k80502K54479J25992q9137
$$ y = [422227, 377004, 563271, 506563, 506017, 222145, 533208, 384165, 428733, 292343, 333377, 482141, 314816, 434717, 313390, 337508, 476848, 562158, 389982, 485959, 507960, 472533, 536430, 379177, 705135, 594141, 409341, 529093, 412359, 650554, 290319, 506653, 515922, 732564, 504228, 354623, 520713, 290413, 875466, 421574, 438711, 654745, 426700, 634740, 610925, 737777, 590934, 436938, 595333, 584437, 433247, 357231, 586057, 415157, 507051, 731013, 543381, 373316, 349384, 910583, 614298, 531703, 483105, 417603, 568231, 529953, 592995, 484360, 637013, 824750, 674147, 283499, 579527, 415222, 805184, 566257, 410635, 579084, 656087, 375585, 630064, 756056, 666919]
17135F66919K91740k98986q4020k77122L35338K8240o7764P1759l07436J80356
17125E39024p6769K57463M3806k9752B59432M80153j36436j80580J91400o4030
17115E49939L42615l39993L07918l25405L16380l98865M41386r8935J6418k23712
17105E87746J55541n4725j30336j31883J64605J89252L31251k68785R4001r8163
17095H38504l501k6093J82029P5371n7273k28449j36960r5951O12321k64529l9618
17084H55851M1218O1320j24309P685j22173l0388L77653m07603K10489J73781
17074A043524k71165L66283k73068l33519M25987O6471k10119J50900J09321j16409
17064I58206K95497k18348j15209r1369J33856J24295l412j68778L40340m25508
$$ y = [666919, 958659, 659673, 575653, 298531, 633869, 662109, 594345, 666104, 358668, 539024, 462255, 719718, 763524, 733772, 259432, 739585, 603149, 422569, 613969, 549939, 892554, 552561, 860479, 535074, 851454, 452589, 893975, 795040, 811458, 587746, 743287, 688562, 558226, 426343, 590948, 780200, 1111451, 842666, 936667, 838504, 835003, 808910, 990939, 1066310, 1009037, 780588, 643628, 547677, 1159998, 895469, 855851, 897069, 958389, 834080, 841765, 719592, 689204, 1066857, 659254, 869743, 1043524, 772359, 1138642, 865574, 532055, 958042, 1024513, 814394, 965294, 1074615, 958206, 1253703, 1035355, 920146, 828777, 962633, 1086928, 1083516, 914738, 1255078, 829570]
17054H29570k0785K24985l1714J07675k61322J41516l05437J99748O0802k11011
17044G34027J27402M24719l04521J99249j71986j10131O56606n51481J33702O3065
17034A200651l01287J86101J29223R4511k20162l6641N7794M68991m19817K16296
17024A375660o3076l3025j57556j13119J92558k69111K56668J55123k75360L97918
17014A466680k59775K88541o3146j70246L45512n12899J78013N858L05531l04026
17004A280043J35494m3678q6762L36185j00008j25688J58665L5375K4481R6328
16994A710435P2519l19536l468J60628n4821k79898N17441k91524M3372m0821
16984A514327K85276k64757j76777J66793R636K90523R7707k67701J9207J39801
$$ y = [829570, 808785, 1033770, 1002056, 1109731, 848409, 989925, 684488, 884236, 945038, 734027, 861429, 1286148, 981627, 1180876, 1008890, 898759, 1555365, 1003884, 1137586, 1200651, 899364, 1085465, 1214688, 1309199, 1089037, 1052396, 1110190, 1579181, 1159364, 1375660, 1312584, 1279559, 1122003, 1008884, 1201442, 932331, 1188999, 1344122, 1068762, 1466680, 1206905, 1495446, 1432300, 1262054, 1607566, 1094667, 1272680, 1278538, 1584069, 1280043, 1415537, 1371859, 1285097, 1621282, 1521274, 1395586, 1554251, 1589626, 1614107, 1710435, 1782954, 1463418, 1459950, 1620578, 1565757, 1285859, 1803300, 1511776, 1555148, 1514327, 1799603, 1534846, 1358069, 1524862, 1534498, 1825021, 1922728, 1655027, 1674234, 1814035]
16974A814035P1226p8580O7021J65006j53452J41413n21956L22570N5861j35530
16964A747614K86415k5109J89733j04704p1610l81985M11649J62873j55547j27943
16954A931386P065j57389J81911M49423l88342K15316Q6942K1105j56048j05401
16944B085968m3470K57588L7949N8116j87238K45962k40161J74681J12440J73162
16934B674997k66282J45700k84869M71039m4744J35649j95682K16998j56859r2416
16924B603531J89217L06848m38149K82996p3619J26982r2106M173O7423k73725
16914B703571M69534n00165L19150L493M35786k49987r0902M68700k93281j39323
16904C126576J34409K93531p8896k72911J86160L55709m3943m59082M54354R7443
$$ y = [1814035, 1885261, 1806681, 1873702, 2038708, 1885256, 2026669, 1504713, 1827283, 1883144, 1747614, 2034029, 2008920, 2198653, 2093949, 2022339, 1640354, 2052003, 2214876, 2059329, 1931386, 1938451, 1781062, 1962973, 2412396, 2024054, 2239370, 2326312, 2347417, 2191369, 2085968, 2042498, 2300086, 2338035, 2396151, 2208913, 2454875, 2214714, 2389395, 2501835, 2674997, 2408715, 2554415, 2269546, 2740585, 2695841, 2831490, 2635808, 2852806, 2695947, 2603531, 2792748, 3099596, 2661447, 2944443, 2870824, 2997806, 2905700, 2909873, 2977296, 2703571, 3173105, 2672940, 2992090, 2995583, 3431369, 3181382, 3090480, 3559180, 3265899, 3126576, 3260985, 3554516, 3475620, 3202709, 3388869, 3744578, 3700635, 3241553, 3695907, 3793350]
16894C793350l21266L51162J28681J19573R7700l23121O9620J03056J60218J37166
16884D316139Q102j13380k9133J16468j34891K53694j26249L94665q1255L78046
16874D982206j0576k41517n4615N4207L07822j02111o8988M02349P7914l20719
16864E025972L84588L13010Q7918l75025N43027k82712K35745l03193L24836J50379
16854F104545p1661J12367K98339J87907M5920l5365J98684j72378L12582N3434
16844G034374J72609k22985K43138K38714K78365L0128J62024K28003L02167j44896
16834H321641J52121K08148J95189k85687P38795k48930K89934L67669n1998L47409
16824A0034291J30452J82125m910J49412O66943j80865K00908J45296J82080K59155
$$ y = [3793350, 3472084, 3823246, 3951927, 4071500, 4169200, 3846079, 3915699, 4018755, 4178973, 4316139, 4324241, 4210861, 4181728, 4298196, 4163305, 4416999, 4290750, 4685415, 4604160, 4982206, 4971630, 4730113, 4675498, 4729705, 5037527, 4935416, 4866428, 5268777, 5346691, 5025972, 5410560, 5723570, 5811488, 5436463, 5979490, 5696778, 5932523, 5629330, 5954166, 6104545, 6032884, 6145251, 6443590, 6631497, 6677417, 6642052, 6840736, 6668358, 6980940, 7034374, 7206983, 6983998, 7227136, 7465850, 7744215, 7774343, 7936367, 8164370, 8466537, 8321641, 8473762, 8681910, 8877099, 8591412, 9330207, 9081277, 9371211, 9738880, 9686882, 10034291, 10164743, 10346868, 10341958, 10491370, 11158313, 10977448, 11178356, 11323652, 11505732, 11764887]
16814A1764887K38184N18102m4781N68991j2093J78277K4883O64632L37259M36144
16804A4674485j20891N10008M81227J97942O08721K72587M76900J44063M91903
16795A7736945J26761M00091N16544J25619P82305Q69155l2199N39107O32941
16786B1697269K20960P05119M23319Q99290N65872L98973M48380J044331P33548
16777B7137061L64862R10112L26800R86570P53880J037198P65503O98406J051790
16768C4032182N12614R87300J080775J349468P45689J356087P96466J141101J227960
16759D3229642J389661J271902Q48809J686425J473871J287345J322755J561941
16751E4072351J244704J626762J539682J440127J819101J438720J947729J323796
$$ y = [11764887, 12003071, 12521173, 12476392, 13045383, 13033290, 13211567, 13236450, 13901082, 14238341, 14674485, 14553594, 15063602, 15544829, 15742771, 16351492, 16624079, 17100979, 17245042, 17736945, 17863706, 18263797, 18780341, 18905960, 19688265, 20557420, 20525221, 21064328, 21697269, 21918229, 22623348, 23046667, 23945957, 24511829, 24910802, 25359182, 26403513, 27137061, 27501923, 28412035, 28738835, 29725405, 30479285, 31516483, 32281986, 32980392, 34032182, 34544796, 35532096, 36612871, 37962339, 38708028, 40064115, 40860581, 42001682, 43229642, 44619303, 45891205, 46740014, 48426439, 49900310, 51187655, 52510410, 54072351, 55317055, 56943817, 58483499, 59923626, 61742727, 63181447, 65129176, 66452972]
16743F6452972J562031K112823J398519J665889J575128J312445J719978J688790
16735G9488575P64549J843030J364528J275079J158772J061648R53426Q87212
16727H8796819M21379J031712M38651K11601k6395L78146n51472K21502l80797
16718I0541146p62684l31805o92340r82200j159381j232241j040079j374953j143498
16709H1821965j471356j344901j520640j674227j782357j737497j641009j388393
16701F9261585j533704j685345j659412j597998j720190j301795j929896j440763
16693E6392482j513452j632136j622288j330240j232984j639405r31150j584526
16685D4906301p90791j639915j032311j059784j099725j059574p69022j227928
$$ y = [66452972, 68015003, 70127826, 71526345, 73192234, 74767362, 76079807, 77799785, 79488575, 80253124, 82096154, 83460682, 84735761, 85894533, 86956181, 87909607, 88796819, 89218198, 90249910, 90688561, 90900162, 90873767, 91251913, 90700441, 90921943, 90541146, 89778462, 89446657, 88754317, 87772117, 86612736, 85380495, 84340416, 82965463, 81821965, 80350609, 79005708, 77485068, 75810841, 74028484, 72290987, 70649978, 69261585, 67727881, 66042536, 64383124, 62785126, 61064936, 59763141, 57833245, 56392482, 54879030, 53246894, 51624606, 50294366, 49061382, 47421977, 46490827, 44906301, 44115510, 42475595, 41443284, 40383500, 39283775, 38224201, 37455179, 36227251]
16677C6227251j359189m27172j234521q97955o52204o74455j218851m54680j163394
16668B8144830k31315o80061j280210m60203p05041p99475j23129p48524n27563
16659B2589309o24087k41959n06572n80220m19596n31333k61002n24521m81259
16650A8418760m12381l40492l85802j60741p76300j46176l75606m22922m10092
16641A4988248l68173J66676o99039k64145l78758r0513k89686j75105j88038
16632A2701467m41544m92502O3382k21381K24910n56109j20738l47558M0658j41792
16622A0708793o27936J83436l24836m1794j99810k97343O4872k00238J50011p42102
16612H673053L02775n41023J57279k65987o6801n63875J74817Q7873j67223l74717
$$ y = [36227251, 34868062, 34440890, 33206369, 32308414, 31656210, 30981755, 29762904, 29308224, 28144830, 27913515, 27233454, 25953244, 25493041, 24788000, 23988525, 23865396, 23116872, 22589309, 21965222, 21723263, 21216691, 20636471, 20216875, 19685542, 19424540, 18900019, 18418760, 18006379, 17665887, 17280085, 17119344, 16343044, 16196868, 15821262, 15398340, 14988248, 14620075, 14786751, 14087712, 13823567, 13444809, 13354296, 13064610, 12889505, 12701467, 12259923, 11767421, 11830803, 11609422, 11834332, 11278223, 11157485, 10809927, 10850585, 10708793, 10080857, 10264293, 9939457, 9897663, 9697853, 9400510, 9465382, 9265144, 9415155, 8673053, 8975828, 8434805, 8592084, 8326097, 8259296, 7695421, 7870238, 7958111, 7790888, 7416171]
16602G416171J25616k55823k13859J57976k6401k48086q6191m25984K11079m12650
16592F241848J12566l21316K00738R9106J28890m17889J56989k19068l12213O5153
16582E734804R5818j80258k64821k08086k51343N26062j48673n17488l3551K85463
16572E037927m0573J5817k20118J22624P406k2152N6585m44942M160m2438m01605
16561D072691L87187m3500k32488K79463k29156r2449l30706L76476m36713O3928
16551C814733N3576j3107J45023m12339J92400o2300j40595j29937K53297m0585
16541C660166n6441l48079K36469j25061k39044K09362k9724j37526k24724L49036
16531C294434M9666p89815K68469J43752j30526J41490J07748q0508j74259K9288
$$ y = [7416171, 7541787, 7285964, 7072105, 7230081, 7203680, 6955594, 6869403, 6443419, 6654498, 6241848, 6354414, 6033098, 6233836, 6332942, 6461832, 6043943, 6200932, 5981864, 5669651, 5734804, 5830622, 5650364, 5385543, 5177457, 4926114, 5452176, 5303503, 4786015, 4752464, 5037927, 4997354, 5013171, 4793053, 4915677, 4923083, 4900931, 4957516, 4512574, 4516734, 4474296, 4072691, 4459878, 4416378, 4183890, 4463353, 4234197, 4141748, 3811042, 4187518, 3750805, 3814733, 3868309, 3855202, 4000225, 3587886, 3780286, 3717986, 3577391, 3447454, 3700751, 3660166, 3603725, 3255646, 3492115, 3367054, 3128010, 3337372, 3307648, 3170122, 2945398, 3294434, 3344100, 2554285, 2822754, 2966506, 2835980, 2977470, 3085218, 3004710, 2830451, 2859739]
16521B859739m6424J85884m9104k87029K09638q3993J3410k80582k54770N50476
16511B817245l87598K29009K6679o4478j95329r003j06656M25260j17875k14893
16501B402361j17462L7498R664K27956l08963J81571k34992K62523k63447M63796
16491B660505l37320k30459Q0266j83975J59736j7308J61327k32007K4195J21634
16481B206594q4869j84880N0253R4476k54042M9926K7780p3434m0912K53923m87938
16470A556877L91475j24716j32684J86453j19016j44985J44841m8207J15135r0199
16460A734974n30591J01910K95331L3106M4083j14044J93366m39025L69345l7331
16450A651124j00858j23652j0440j8883K7269k13037L49749n0399m8144J89360
$$ y = [2859739, 2813315, 2999199, 2950095, 2663066, 2872704, 2788711, 2802121, 2521539, 2266769, 2817245, 2429647, 2658656, 2685335, 2620857, 2425528, 2416525, 2309869, 2735129, 2617254, 2402361, 2284899, 2322397, 2332061, 2560017, 2251054, 2432625, 2197633, 2460156, 2196709, 2660505, 2323185, 2092726, 2172992, 1989017, 2148753, 2131445, 2292772, 2060765, 2084960, 2206594, 2121725, 1936845, 1987098, 2081574, 1827532, 1877458, 1905238, 1831804, 1790892, 2044815, 1556877, 1948352, 1823636, 1690952, 1877405, 1758389, 1613404, 1758245, 1710038, 1825173, 1734974, 1204383, 1306293, 1601624, 1634730, 1678813, 1564769, 1758135, 1319110, 1688455, 1651124, 1550266, 1426614, 1416174, 1397291, 1424560, 1211523, 1561272, 1510873, 1462729, 1652089]
16440A652089k2518k79586j43136M34696j04337j89433O2812J17049J75473j40298
16430A562811k04772P3040p6533l07549J07657J03984L4078k0566K74519l69242
16420A177427R3325Q1867l8876j7128J99594o63145O06756j12407L1812m13914
16410I45311K32269k31083L11828o9607Q2169J43920j21498l3394j3335M6898
16400A293478l53636m8305p2926L21540N891k42803K23222j49713M38137o17003
16390G97882K02052M2411L05644m93480P09990j60834m65283J07875Q5087j56474
16380I74870J84413n1992k82869K98241j45891J33P2393l7973k54630N20015k13162
16369A063548k180l49069J65948J75554Q3434j49255L00171j91669m09793K18135
$$ y = [1652089, 1629571, 1349985, 1206849, 1641545, 1537208, 1347775, 1410587, 1527636, 1703109, 1562811, 1358039, 1431079, 1354546, 1046997, 1154654, 1258638, 1292716, 1272150, 1546669, 1177427, 1270752, 1352619, 1313743, 1296615, 1496209, 833064, 1439820, 1327413, 1359225, 945311, 1177580, 946497, 1258325, 1188718, 1270887, 1414807, 1293309, 1259915, 1246580, 1293478, 939842, 891537, 818611, 1140151, 1146042, 903239, 1126461, 976748, 1414885, 797882, 999934, 1042345, 1347989, 854509, 1564499, 1403665, 938382, 1046257, 1131344, 974870, 1159283, 1107291, 824422, 1122663, 976772, 976905, 1049298, 1011325, 756695, 1276710, 1063548, 1061368, 712299, 878247, 1053801, 1137235, 987980, 1288151, 1096482, 686689, 904824]
16359I04824M9361R4759m46946K66162K4023J21957k1836j3654J27608l15314
16349G90944K24056j70673j11688P706K22509q4284K5174K2640o2442j90951J50818
16338H23809p7708K01512j94354k11839L76016k14895J36341P4091j1265o954
16328H94754k13717M0823m7357l22557K56042N9081q36q2977j22531M71416j01669
16317H30472j15716J20647j14393C37956L43825k21950K29186J97995k84309n8033
16307E44670J62272L5644o5565R9392l28092N71104D87001j6699J34732j71019
16297D34015M38018j39023k54520M118P059q5298K69425m3425j22762K03345k50409
16286D60543M9398J10634M521J14977k38774K68040m9440k75038J60366j98610
$$ y = [904824, 954185, 1048944, 601998, 868160, 892183, 1014140, 992304, 978650, 1106258, 790944, 1015000, 844327, 732639, 740345, 962854, 878570, 903744, 926384, 863942, 672991, 823809, 746101, 947613, 753259, 541420, 917436, 702541, 838882, 912973, 901708, 894754, 681037, 721860, 674503, 351946, 607988, 667069, 666233, 583256, 460725, 932141, 830472, 714756, 835403, 721010, 337956, 681781, 459831, 689017, 887012, 602703, 544670, 706942, 742586, 677021, 776413, 448321, 1019425, 487001, 470302, 605034, 434015, 872033, 733010, 478490, 482608, 489667, 404369, 673794, 630369, 507607, 710952, 460543, 509941, 620575, 625096, 740073, 501299, 769339, 719899, 444861, 605227, 406617]
16276D06617L40005l05012K51035k87767M2175K98788j27167B10508N71782k10361
16266E71929j10133J35068J28471j61718k0445j20020M3163j17021K10772k58122
16256C01944j8189K77859A85021L24296J72343l16405L17836A57759L8101J41391
16246C37251J06377J6476L1227K6221p9926A34500P9171L23373r0523j81630K96206
16235E61097Q5234A56985K25348O3179j07067J20281q4947R5793o5980k9739m7092
16224C26761c034A37951K62113n6687L45787l18809j35395M48960r3933A46345
16213E60367j49564A95588M4701L75756j27910A77481L84780A77010J37526j36368
16203A78168C1695M17023B09633O086Q7792o7351K31378j87240r4206M98786l20668
$$ y = [406617, 746622, 441610, 692645, 404878, 447053, 745841, 618674, 210508, 782290, 571929, 461796, 596864, 725335, 563617, 543172, 423152, 466315, 349294, 560066, 301944, 283755, 561614, 185021, 509317, 681660, 365255, 683091, 157759, 195860, 337251, 443628, 460104, 491331, 517552, 437626, 134500, 213671, 537044, 446521, 264891, 561097, 646331, 156985, 382333, 445512, 338445, 458726, 373779, 469572, 403592, 373853, 326761, -3034, 137951, 400064, 343377, 689164, 370355, 234960, 683920, 589987, 146345, 560367, 410803, 195588, 240289, 616045, 488135, 177481, 562261, 177010, 314536, 178168, 31695, 448718, 209633, 215719, 303511, 236160, 467538, 280298, 186092, 684878, 364210]
16192C64210A72756K47919O8691j16860n4585R4306m4462M7761P223j66925M47351
16181G03175C7012M82455E3420K74252M160n2577A28445J73107K19431r4987A52760
16169C66152A50650K01824K60904j36515o2206F7074R3720n0889L81074A6690
16158D69984A75122L2250L29776k19738i929E36479B57080J23663J24675a3811
16147i989C52184L75693A36655M84185b838C73289c257A5204O89505j92163c1907
16135C28867J303j57755F150N72348k37830r3373M0559K01883k08907l0173K63064
16124E13721A39824J7001a11932G1505M01695e1667C25227k0010J43011n3253
16114C94975A52142J04090E4038L51682p1311k6646r6688K13442j18276n6226
$$ y = [364210, 172756, 420675, 489366, 372506, 317921, 412227, 367765, 415526, 422749, 255824, 703175, 37012, 519467, 53420, 327672, 331832, 279255, 128445, 301552, 520983, 425996, 152760, 366152, 150650, 352474, 613378, 476863, 414657, 67074, 160794, 109905, 490979, 16690, 469984, 175122, 207372, 537148, 317410, -9929, 536479, 257080, 380743, 505418, -13811, -9989, 352184, 727877, 136655, 620840, -2838, 373289, -3257, 15204, 704709, 512546, -31907, 328867, 330170, 172415, 6150, 578498, 340668, 247295, 287854, 489737, 280830, 250657, 513721, 139824, 156825, -111932, 71505, 473200, -51667, 325227, 305217, 448228, 394975, 152142, 256232, 54038, 405720, 334409, 307763, 211075, 424517, 306241, 250015]
16104B50015F461f2436D07892A80037N0838M7280c73368c9845A54794L1112a0823
16092B98728j07967l8653b0301A73874G5413K48333j41776F2961k3583R3866J22485
16081B55729B0576K24298G4358Q5489K24075j08478i7572B08650M4110d3504A05194
16069G0364L16884A03672J2483c7345I4807a1249j28957E00072H4667J83361R4730
16058C62758J22097k02940A2269J79732N5184a9861A83394e9767B74775m76J67672
16047D41971p1073c1746I093J08572f821A15695J99722A7676K13880F5962R7162
16036A63124j414D4435J48551A3781L245a65172A6241J65755M0566M7113D7334
16024A16458K38671a26689A55242B5387K4900B351K68346J1712B7873J90566L1552
$$ y = [250015, 6461, -62436, 407892, 180037, 230875, 278155, -373368, -39845, 154794, 185906, -10823, 298728, 190761, 152108, -20301, 173874, 75413, 323746, 181970, 62961, 39378, 133244, 255729, 20576, 244874, 74358, 159847, 383922, 275444, -97572, 208650, 252760, -43504, 105194, 70364, 387248, 103672, 116155, -37345, 94807, -11249, -140206, 500072, 84667, 268028, 362758, 484855, 281915, 12269, 192001, 247185, -19861, 183394, -59767, 274775, 274299, 441971, 370898, -31746, 9093, 117665, -6821, 115695, 315417, 17676, 231556, 65962, 163124, 161710, 44435, 192986, 13781, 17026, -165172, 16241, 181996, 222562, 269675, 47334, 116458, 355129, -126689, 155242, 25387, 50287, 2351, 270697, 282409, 27873, 218439, 249991]
16013B49991E8832P9457C3415J48452a80938A86181M8532B2651N0796P246Q5125
16002A65818K895b88569A28665g7421A09122M56627a00835D85795J03314a8410
15991B26790K16147B20361J23542J063K50803L57037N0202K63403m79138N8776
15981H46049k78552A69222K15672A11383J42690G8454E257J15062e2466a5347
15970c21534B72986H6404O5109j49F2533J99713a8640r966C00969E2764a98746
15958a03125J0569A48845L8625R280c4601D937J18020g8798A37523c80570D99047
15946B37709o0559j2745G3397k1114b9218j06880A1745L31535A63417N7258c11475
15934a5690B44826I3366a70512f4080j56153B40243a19138B2557b1298p1729H501
$$ y = [249991, 58832, 138289, 33415, 181867, -180938, 186181, 234713, 22651, 73447, 80693, 165818, 168713, -288569, 128665, -77421, 109122, 565749, -100835, 485795, 589109, -18410, 226790, 442937, 220361, 343903, 344966, 595769, 952806, 1003008, 1266411, 787273, 846049, 567497, 169222, 384894, 111383, 254073, 78454, 5257, 120319, -52466, -15347, -321534, 272986, 86404, 151513, 151364, 62533, 262246, -18640, -28606, 300969, 52764, -198746, -103125, -92556, 148845, 187470, 196750, -34601, 4937, 122957, -78798, 137523, -380570, 499047, 237709, 177150, 164405, 73397, 52283, -29218, -136098, 11745, 343280, 163417, 220675, -311475, -15690, 244826, 93366, -170512, -64080, -220233, 240243, -119138, 22557, -21298, -93027, 8501]
15922D3883b80208A20733l7730a437B39647j13067a65641A12058a80406D56237
15911A71208m554i3973l3200B26664m7056E1160j5716J33446c13844h2670j36917
15900b19587A86183F2321J00967a51074e4906j12989B99691I8802B7680J89969
15890B17649d7607C9220e4182n5846B17822J50304H4959a9052I8463b03504O9710
15879a33794j77628A4187L13598b01266n8072b7623l80245c9690C5319f3889B28064
15867a52159A8802L3823b00575N0799b3542m94938B22752a44549B33522d9781
15856c3270A34537e2037A1000J34082D9306J30095b97368J44677B65975a78572
15845a2039l55271a31804D4814P0111A3400c8048n5172j02063k1445H7257f6171
$$ y = [43883, -280208, 120733, 83003, -1437, 239647, 126580, -165641, 112058, -180406, 456237, 171208, 166654, -93973, -127173, 226664, 179608, 51160, 35444, 168890, -313844, -82670, -219587, 186183, 62321, 163288, -151074, -54906, -167895, 299691, 98802, 27680, 217649, -47607, 39220, -54182, -110028, 217822, 368126, 84959, -19052, 98463, -203504, -133794, -311422, 14187, 327785, -201266, -259338, -27623, -407868, -39690, 35319, -63889, 228064, -152159, 18802, 52625, -200575, -149776, -23542, -518480, 222752, -144549, 233522, -49781, -33270, 134537, -52037, 11000, 145082, 49306, 179401, -297368, -152691, 265975, -178572, -12039, -367310, -131804, 44814, 114925, 13400, -38048, -93220, -195283, -216728, 87257, -66171]
15833B55948a29199j23020H2834J8724k0632j0148g785j64478b675j03824C1166
15821A6541N8389J01392K34758a9665j58140A05287L1136l3368B5508m755M471
15810B5224c7609j81835M0763b2655o3941C14753C7633G925i6112b8762a0796
15798A29777d3739j34556N7441A42324h9694b8335j41475B49936K2314i0539E1787
15786c4702A00444N0293b82362d5153H2475b00139J8010B78518c02439g2588k47597
15775c20185J27855Q348D00079A50284b60837e6310k69386c5407G8470b49931
15764a93638A02281D1524c6427j24758B47076D1159K39509K6485a20703B44762
15753b50332A17453a82063e201D4042R1582a51411B80041a61057E53008B62956
$$ y = [255948, -129199, -252219, 82834, 101558, 80926, 70778, -7785, -172263, -2675, -106499, 31166, 16541, 74930, 176322, 411080, -19665, -177805, 105287, 136423, 103055, 25508, 20753, 25224, -37609, -219444, -178681, -22655, -86596, 314753, 37633, 7925, -96112, -28762, -10796, 129777, -43739, -178295, -120854, 142324, -89694, -28335, -169810, 249936, 272250, -90539, 51787, -34702, 100444, 150737, -282362, -45153, 82475, -200139, -182129, 278518, -302439, -72588, -320185, -192330, -183982, 400079, 150284, -260837, -56310, -325696, -35407, 78470, -249931, -193638, 102281, 41524, -36427, -161185, 247076, 41159, 280668, 307153, -120703, 244762, -250332, 117453, -182063, -5201, 44042, 135624, -151411, 280041, -161057, 553008, 262956]
15742A27629C3878Q4109c5544C36190j66064P5719m1473c9084j7893C32102C7200
15730A83786a55703q9856A3532J08533b39686B06701a22089F5115a92246H5339
15719C5682J77878a58693j03257A38381a08784l8700B14637h2496A89133F5237
15708b8444B58719a70252F8893a46980p4485L2132A63702c1505k66498A69177
15697b81631a30922l2528B9852P6199m0456a05201B26569o1714D4271c9684H6800
15685e7454C0011J36214j3743K55367f9588A63362b08429D3523a85682D55117
15674a26737I7625b95010R8453h7345B15521a16515N6900B72107a48644M7376
15664a01268o7977d0881p2898k34131a36480q7757A02573k9050b6599A31260b15687
$$ y = [127629, 33878, 117987, -35544, 336190, 170126, 245845, 204372, -39084, -56977, 332102, 37200, 183786, -155703, -245559, 13532, 122065, -239686, 206701, -122089, 65115, -192246, 85339, 35682, 213560, -158693, -261950, 138381, -108784, -147484, 214637, -82496, 189133, 65237, -28444, 258719, -170252, 68893, -146980, -221465, -189333, 163702, -31505, -298003, 169177, -281631, -130922, -163450, 29852, 106051, 65595, -105201, 226569, 164855, 44271, -39684, 86800, -57454, 30011, 166225, 152482, 407849, -69588, 163362, -208429, 43523, -185682, 455117, -126737, 97625, -295010, -196557, -87345, 215521, -116515, -59615, 272107, -148644, -101268, -169245, -40881, -113779, -347910, -136480, -224237, 102573, 73523, -26599, 131260, -215687]
15652b8360q5712B7425L1834N1061a64556D2310J34084A7287n744Q1642h978q0143
15640h9121B36533A4407a12496a4502j08015I868J76648f1015j90758a15724j36609
15629b52333G6547K1717a77765K0118a3145k13526A45394J7203G9417a16682A73812
15617b2621b152k67106b4097j17190k84544A3155k120a31402j4224d094A71159
15605a85802L7499B33501b53857H958a88424A6684e7207m4591o2411D8520C209
15593A02413K56077E6774b61480B92527a40735k50388J85571L782J7261A32318
15582b03867P0575q2358B7089b09422c4612C37948a34025K3053j40820b426l40823
15571c43249F3682c702p6075A67211d6907q7483O6549F2347J38056e7268A6069
$$ y = [-28360, -114072, 27425, 59259, 110320, -164556, 42310, 176394, 17287, 11543, 93185, -8978, -89121, 236533, 14407, -112496, -14502, -122517, 9868, 186516, -61015, -251773, -115724, -252333, 76547, 98264, -177765, -157647, -13145, -226671, 145394, 162597, 79417, -116682, 173812, -22621, -2152, -269258, -24097, -141287, -425831, 13155, 11035, -131402, -145626, -4094, 171159, -185802, -148303, 233501, -253857, 8958, -188424, 16684, -57207, -101798, -164209, 48520, 3209, 102413, 358490, 56774, -261480, 292527, -140735, -391123, -205552, -201770, -184509, 132318, -203867, -133292, -215650, 27089, -209422, -34612, 337948, -134025, -110972, -251792, -2426, -343249, 63682, -3702, -79777, 167211, -46907, -134390, -67841, 62347, 200403, -57268, 16069]
15559B72114d5909B5269a7507l10404H487m155c4784n9671C16337b65236a08677
15547A6847K02572E5553d6270l3772b8237B25595D9197J3234a53082A17905J29390
15536B47295n2006k8703R65c90266B33256A06705a1804C16582D7713M3375a4968
15524f177j51773A52855P1585H5331K87424C296J63107E80K42203C7826J82224
15513B20050c3547q3035n8830a1468B89590j31979l3055J81101a109l016B96075
15501g3430L2962C09221K922a10326D02950j85375r4265O7681b82282I7886L8989
15490A36875j6246J35142G9264R8134p5951a5925j41474k2891D69779k2926g608
15478E60538A76060F7624L36553J64883j52289q6769A47222O0363a88846B47489
$$ y = [272114, -45909, 25269, -17507, -327911, 8487, 4332, -34784, -94455, 316337, -265236, -108677, 16847, 219419, 55553, -46270, -80042, -28237, 225595, 49197, 62431, -153082, 117905, 247295, 195289, 166586, 167551, -390266, 233256, 106705, -11804, 316582, 47713, 91088, -14968, -6177, -157950, 152855, 224440, 85331, 372755, 3296, 166403, 580, 242783, 37826, 220050, -33547, -116582, -175412, -11468, 289590, 157611, 124556, 305657, -1109, -4125, 296075, -73430, -40468, 309221, 312143, -110326, 402950, 217575, 123310, 190991, -282282, 97886, 136875, 120629, 255771, 79264, 177398, 101447, -15925, -157399, -180290, 469779, 446853, -7608, 560538, 176060, 67624, 404177, 569060, 416771, 330002, 147222, 207585, -188846, 247489]
15467a99994i0846A85645m8101A4198J98875G0869M3689O9759p6640J93804a19906
15455B85421r532q9908a09481B0836c9193A10412N9379a21069B93614o7505L1099
15444B57208K15070M11449K16505j60123l10086A16615f821A82286O2225l6727
15434B07784a05937j81416A4107a95782A30100C520M4080b90902O4208A01162
15423a87099a6301G8771c2850j88076i5450A38600e7567C40139h2348c5145j8468
15412e3613q7080B36512a89625H498J52278R6105K9167i6366l32336A65043J2143
15401A77186M558D3494M6452a76395E067J8892J1506b89331A35724o227n8710
15390G0787l0677G537b94526H587a41602E2729M00558A20661Q879D9170a21745
$$ y = [-199994, -90846, 185645, 137544, 14198, 213073, 70869, 114558, 184317, 107677, 301481, -119906, 285421, 275889, 185981, -109481, 20836, -39193, 110412, 169791, -121069, 293614, 226109, 257208, 472278, 883727, 1100232, 940109, 630023, 116615, -6821, 182286, 244511, 207784, -105937, -287353, 14107, -195782, 130100, 3520, 47600, -290902, -226694, 101162, -187099, -16301, 78771, -32850, -220926, -95450, 138600, -57567, 340139, -82348, -35145, -53613, -140693, 236512, -189625, 8498, 160776, 256881, 286048, -96366, -428702, 165043, 177186, 181744, 43494, 89946, -176395, 5067, 23959, 35465, -289331, 135724, 129497, 70787, 40110, 7537, -294526, 8587, -141602, 52729, 453287, 120661, 129540, 49170, -121745]
15378B73242b61837A42836l3059l1204M9591R7938J2314H7330K37104n310A58681
15366A41064i4548C39217p9587r9064A2628d1256G8562O59289l52406c721C42931
15354B81302M7032D7212c61197B4326K79093A03756C4216M7140N9447j8747J22130
15343B44186R8928j07488J14960j27843K08087k07150h2450F6903K35445A39145
15332B34766a31498H4782n788B5479g5295b8259A82300k1134J60820a06869a6112
15320b97469I0720J20879C1208a35004g033A07452B3016J45811g9013B48290j15325
15309A32965J25230d1230A26051Q0152F5134J6131J43904a01882B13007J88858
15299D01865D4070R4201L7337m8605i2914A73186b61308B64315a87438P2609A39061
$$ y = [273242, -261837, 142836, 109777, 78573, 128164, 226102, 238416, 87330, 324434, 319124, 158681, 141064, -94548, 339217, 259630, 160566, 12628, -41256, 78562, 737851, 385445, -3721, 342931, 281302, 328334, 47212, -361197, 24326, 303419, 103756, 34216, 81356, 140803, 122056, 244186, 343114, 235626, 350586, 222743, 430830, 223680, -82450, 66903, 302348, 139145, 234766, -131498, 84782, 78994, 25479, -75295, -28259, 182300, 161166, 321986, -106869, -16112, -297469, 90720, 211599, 31208, -135004, -7033, 107452, 23016, 168827, -79013, 248290, 132965, 258195, -41230, 126051, 206203, 65134, 81265, 225169, -101882, 213007, 401865, 44070, 138271, 175608, 127003, -92914, 173186, -261308, 264315, -187438, -114829, 139061]
15287A11491a01477j83611B86861E756c5641o4825q0364a7371m8918H7237a12255
15275F419h8303K3381A2958P6071a44212N7213a283j71796D45840G0637J55316
15264B25953d6234r191j48463A03392b9410C4334M701J8010a10478A81165a86713
15252b4917l22378a27481A54572O9858I8001C2681a15941A49364Q0561J27590
15242C57515M29758M58207R80487r68819L99675l11219F36179A85129J76759b50730
15231C06987I4006J49800a3572C01019A25306B286b1597J0702E5811P8908m4640
15220I0079P2517K50231j07669j19555g4006k07397B064L2664M4175J06017h4836
15208A06327A8768L0086a96176H7137J34749E6816K4783e5249B4170c17712A08322
$$ y = [111491, -101477, -285088, 286861, 5756, -35641, -100466, -180830, -17371, -66289, 87237, -112255, 6419, -88303, -64922, 12958, 89029, -144212, -86999, -1283, -173079, 445840, 70637, 225953, -46234, -55425, -203888, 103392, -29410, 34334, 39035, 57045, -110478, 181165, -186713, -24917, -347295, -127481, 154572, 224430, 98001, 32681, -115941, 149364, 229925, 357515, 787273, 1245480, 2225967, 1257148, 1656823, 1345604, 636179, 185129, 361888, -250730, 306987, 94006, 243806, -13572, 301019, 125306, 2286, -21597, -10895, 55811, 134719, 90079, 162596, 412827, 305158, 185603, -74006, -281403, 2064, 34728, 78903, 184920, -84836, 106327, 18768, 48854, -196176, 87137, 221886, 56816, 81599, -55249, 24170, -317712, 108322]
15196d4436B64563p1903d5704j46143B33014h9951F2837Q37i3564E355P0572b963
15183c57209G2544e4049C32675A13745p936L8725J7079J3529d7858J2478o0221
15172i5601j35392A5401N57539D7467b45078G0690a91217D97312A97617g1314
15161A01351e3571B66331K3549a6884p8214B24590r3283m1239a54684C28925A16461
15149a41590c8357I4452L39785e1973m9599H3533j8060J22238D0598e8535A89457
15137F0329J54506b50863L408h1282H5807N2014n350P9182J83416G1586b67002
15125B43967C0150M14230A86110b2659I5945K04443J06838A6684K17349D0685
15114A92002J29734o337a51598k15024G29g7077A73201a31971A83611C4172N1803
$$ y = [-44436, 264563, 192660, -45704, -191847, 233014, -89951, 62837, 63674, -93564, 5355, 75927, -2963, -357209, 72544, -54049, 332675, 113745, 105809, 144534, 161613, 175142, -47858, -35380, -95601, -230993, 15401, 572940, 47467, -245078, 70690, -191217, 497312, 197617, -71314, 101351, -53571, 266331, 289880, -16884, -95098, 224590, 131307, 90068, -154684, 328925, 116461, -141590, -38357, 94452, 434237, -51973, -101572, 83533, 65473, 187711, 40598, -58535, 189457, 60329, 214835, -250863, -247455, -81282, 85807, 137821, 132471, 211653, 395069, 71586, -267002, 243967, 30150, 444380, 186110, -22659, 95945, 300388, 407226, 16684, 234033, 40685, 192002, 321736, 315399, -151598, -366622, 729, -77077, 173201, -131971, 183611, 34172, 85975]
15103H5975L3770J98340e637F5485K3647A9866R9443b7428A93373E118L06118
15092C11236O3224b10061E3529Q2934A5045b0144N36A88079O7092K08646j59694
15081C04123C8471L05506j927a71330C41204f616B07478J34993j50232o0530R5811
15070B27520N5630E4746O2427L1721j6136L9399N712c63645J03415C90551j72768
15059B17783J35493j69964o0219a13159j28385C10019A07130a969B68001L12028
15049E80029A92426L87777A71078K06741j54924j06881K03808l2582J96661A47541
15038C11542a42244D31954J89428A51850M86735k99458J66279k7900j7884L43585
15028H03207k69265r6451J66097k42178J61398A59339N00448n65J36292l40385
$$ y = [85975, 119745, 318085, -5637, 65485, 89132, 19866, 119309, -27428, 193373, 5118, 311236, 374460, -210061, 53529, 136463, 15045, -20144, -19608, 188079, 255171, 463817, 304123, 38471, 343977, 342050, -171330, 341204, -6616, 207478, 342471, 192239, 131709, 227520, 283150, 54746, 117173, 148894, 132758, 172157, 177869, -363645, -260230, 390551, 217783, 353276, 183312, 123093, -113159, -241544, 310019, 107130, -1969, 268001, 580029, 192426, 580203, 171078, 377819, 222895, 116014, 319822, 287240, 483901, 147541, 311542, -142244, 431954, 621382, 151850, 638585, 339127, 505406, 477506, 459622, 803207, 533942, 437491, 603588, 361410, 522808, 159339, 659787, 659222, 795514, 455129]
15018D55129Q0548J31792A72686K06514I1837N18193k74152r8106L39403j39349
15008D37826J0857j89152A25838J13193J91168j68306J00895A34784L21882K38556
14998F95222n5548B29671K84987o9998k07012L69356k58143j20157K54146L24393
14988H07243l93041j1412A79114J40255M8293K41609R010N30438m43608L28723
14978A033834m38277B12296N366J17356J64620k7304L47179m08909M2913n9143
14968C94374R6970J0751k14691A14935D0828L30318j23749H2812O51784l32513
14958D02083A47810O3873r1769M7931K63355N3216j23040j0609K38073G3563L94377
14947D67940j75035N10990J66916d4055A29828L04720O2611H3213O36947C39859
$$ y = [455129, 535677, 667469, 172686, 379200, 91837, 610030, 335878, 237772, 577175, 437826, 448683, 259531, 125838, 239031, 430199, 261893, 362788, 134784, 456666, 695222, 639674, 229671, 514658, 444660, 237648, 607004, 348861, 228704, 482850, 807243, 414202, 402790, 179114, 319369, 367662, 609271, 618281, 1148719, 705111, 1033834, 595557, 212296, 217662, 335018, 499638, 472334, 819513, 410604, 453517, 394374, 491344, 502095, 287404, 114935, 40828, 371146, 247397, 82812, 734596, 402083, 147810, 211683, 119914, 167845, 431200, 484416, 361376, 350767, 588840, 73563, 467940, 292905, 803895, 970811, -44055, 129828, 434548, 497159, 83213, 720160, 339859]
14936C80262l3670M34888l16031M03942L64446k70694k1302K72869O610K21915
14926A443235J82772r5567j61303k90680J96494M10770N16799r5792K79562m76566
14916A909724m26758L8240l90769k14123K2031B90940N511K96694p6086m2529
14906D74530k14184M32659j56649j54844j22510O3337Q335K340N4359R2015n7916
14895D21472L5438p5479A47906K57868j86568M03955A92350N37320J04577l27726
14885E06521L53759k19010J5544M07421P6473M7278l54882B67697M65006j47609
14875E85094k33358C6473M47133R5841j88216Q8949N3297j11732J26030J31005
14865F78780M2376k67324J71759k62069I4471P57690l06557r5687j58990N10854
$$ y = [380262, 346592, 781480, 465449, 869391, 1233837, 963143, 941841, 1214710, 1221320, 1443235, 1626007, 1530440, 1369137, 1078457, 1274951, 1685721, 2202520, 2106728, 2386290, 1909724, 1482966, 1521206, 1130437, 916314, 938345, 290940, 296451, 593145, 517059, 474530, 260346, 693005, 536356, 381512, 259002, 322339, 330674, 333014, 387373, 479388, 421472, 456910, 381431, 147906, 405774, 219206, 623161, 192350, 729670, 834247, 506521, 860280, 641270, 656814, 1064235, 1140708, 1187986, 833104, 267697, 732703, 585094, 351736, 36473, 483606, 579447, 391231, 480180, 533477, 421745, 547775, 678780, 721156, 453832, 625591, 363522, 94471, 852161, 545604, 449917, 290927, 801781]
14855H01781k76251K38843k97742M7R4191M4995N9169n5488M24545m83789L45467
14844H95768Q7334j01480K90586j57958k44333J32556k41116M4287j10666J6494
14834F11472L00786m23112j28739J39279P9135k35407K99704j68791j5968j83083
14824B75276K24784j13373L55579j5529k4785K13239l2351K9591k35316K59452
14814I36567C83751K52600O4738j45187n6036K78263O3125J50992q4227M7842
14804I55861j60066J25216m35843j71842J90633q7991J21182K83721k12262M7840
14794F56449k50664J97978J9081M3329C06858K36826J43534J41240k39739j57966
14784D30753K72654C03804K83136J02500J09105j57135K90761J48451J0432m09547
$$ y = [801781, 525530, 764373, 466631, 466678, 560869, 605864, 665033, 609545, 1034090, 550301, 895768, 983102, 881622, 1172208, 1014250, 769917, 902473, 661357, 705644, 594978, 611472, 912258, 489146, 360407, 499686, 578821, 343414, 643118, 474327, 458359, 275276, 500060, 386687, 742266, 726737, 701952, 915191, 882840, 912431, 677115, 936567, 383751, 636351, 701089, 555902, 499866, 778129, 841254, 992246, 908019, 955861, 795795, 921011, 485168, 313326, 503959, 415968, 537150, 820871, 608609, 656449, 405785, 603763, 622844, 666173, 306858, 543684, 687218, 828458, 588719, 430753, 703407, 303804, 586940, 689440, 798545, 641410, 932171, 1080622, 1091054, 681507]
14774F81507L99335D88592M04226C90484L60325j48116B81417j36167M50651M06227
14764A002128m71226j5644M809K07676k74591L45088C61949L30661m1148O7787
14754G19249B34926Q7970K93700l3541o3082q4411M18455k18188m8928J77995
14744G64896j41053J12945P4671j03388J17139k51486M5201K22179l11846J27935
14734F57193K45859k54652J26674L9443M90606J74783K51417r4681Q7753m78126
14724A246269k33438j00096k8312J74072j21481l90989N74517m17408K36170j49797
14714G89507m2177j65710O0926J88690J30112K08515k18573N5918K69711l03113
14704I73806N55033O2852L762M49147o12784k38779k57769K40254k71349k57989
$$ y = [681507, 1080842, 488592, 892818, 390484, 750809, 602693, 281417, 145250, 595901, 1002128, 530902, 515258, 520067, 727743, 453152, 798240, 361949, 692610, 651462, 719249, 234926, 322896, 616596, 583055, 519973, 435562, 854017, 635829, 586901, 764896, 623843, 736788, 811459, 708071, 825210, 573724, 618925, 841104, 529258, 657193, 903052, 648400, 775074, 814517, 1305123, 1479906, 1731323, 1636642, 1724395, 1246269, 1012831, 912735, 884423, 1058495, 937014, 546025, 1120542, 703134, 939304, 789507, 747330, 581620, 642546, 831236, 961348, 1169863, 951290, 1007208, 1276919, 973806, 1528839, 1591691, 1595453, 2044600, 1431816, 1193037, 935268, 1175522, 904173, 646184]
14694F46184K86147l38539K67603j68142k92893N19905L1089l56022J75418j9560
14684G51190K10260Q7345E07194K98476J84614l59724J67893o7863K06070k81095
14674F55565O2458O4933O8269J12448O054m29318K24824K25335M3073j30329K04823
14663A108135l01790J23258J2820R6076p8732j45213M17502q8038k01001M89575
14653A432592k27187P8284k57183J84597o7039j0357K9064J30243l62117J2368
14643I43265O8332o5959K89811j50724J03950k81383J54466m04154N85356m67838
14633G75122K08183Q1115K36641j77937j47907J3241J91859m2961K90785k48283
14623A179858L93691k95672j73521j02368M00564k90032o9433K26975J00876j91553
$$ y = [646184, 932331, 593792, 861395, 693253, 400360, 920265, 951354, 595332, 770750, 751190, 961450, 1048795, 507194, 805670, 990284, 630560, 798453, 730590, 936660, 655565, 718023, 782956, 851225, 963673, 969727, 540409, 765233, 990568, 1033641, 903312, 1108135, 806345, 929603, 942423, 1038499, 959767, 814554, 1232056, 1144018, 943017, 1432592, 1205405, 1283689, 1026506, 1211103, 1144064, 1133707, 1162771, 1293014, 930897, 943265, 1011597, 945638, 1235449, 1084725, 1188675, 907292, 1061758, 657604, 1242960, 775122, 983305, 1064420, 1301061, 1123124, 975217, 988458, 1180317, 1137356, 1428141, 1179858, 1573549, 1277877, 1104356, 1001988, 1402552, 1112520, 1043087, 1270062, 1370938, 1179385]
14613A179385k19077Q8588O42003j57652j13039m41782M28855j48682p4143K96878
14603A481334k19728K82454m5868L6987K79230j85207q6307Q5369j65133P7084
14593A540215n047K16814j88799R1260O4091M91036o01156K53849j08107J02220
14583A856376n4843j0487K55545j18348j26524k9949J67794j18962M3125K85224
14573B148951k37520J2360J84049J43203j77520J86173k18680K14309j67576l6326
14563B051423p183L07491J34704l8895R899J18059M48441R0889n4329J37581L89849
14552C587929P38025Q03807Q36252J265978L407184O815191J8010370L057820
14544C8522556A6601233H047140l507616j380811n10010j7259J03372P05699K235402
$$ y = [1179385, 960308, 1048896, 1690899, 1533247, 1420208, 978426, 1407281, 1258599, 1184456, 1481334, 1261606, 1544060, 1498192, 1535179, 1814409, 1629202, 1542895, 1628264, 1463131, 1540215, 1535168, 1751982, 1563183, 1654443, 1718534, 2209570, 1608414, 1862263, 1754156, 1856376, 1801533, 1791046, 2046591, 1928243, 1801719, 1771770, 1939564, 1820602, 1863727, 2148951, 1911431, 1923791, 2107840, 2251043, 2073523, 2259696, 2041016, 2255325, 2087749, 2051423, 2044240, 2351731, 2486435, 2447540, 2457439, 2575498, 3023939, 3114828, 3060499, 3198080, 3587929, 4325954, 5129761, 5966013, 7231991, 10639175, 17454366, 35464736, 38522556, 16601233, 8047140, 4539524, 3158713, 2648703, 2631444, 2734816, 3440515, 5675917]
14535E675917j933040j337871J40360n35690K61959r2198k3426k50347L31789
14526B237453q7380J60847J0954m6550l361k93054K71074L24779l25055J53541
14516B403248K25820j59900p0107Q3725k1404j14185Q909J52901j17408L37454
14506B729053r5846K29024k51766O8466K34014j18278k197Q8842J45377k05210
14496B821479J7159L14129j38670J62661j37827Q7429m3947L9627J0341L30382
14486C462763J05099j82927K65596j47898k38161K81287L98693k33183J47414
14477C858683j02903j40869K40721J01849K10424K8723l08641L32644k31830K0872
14467D009673M13337j31437j79482O43506p39183K74413J28396j0056K89666k41531
$$ y = [5675917, 3742877, 2405006, 2545366, 2009676, 2271635, 2179437, 2156011, 1905664, 2237453, 2150073, 2310920, 2321874, 2275324, 2271963, 1978909, 2249983, 2574762, 2249707, 2403248, 2629068, 2469168, 2399061, 2482786, 2461382, 2347197, 2356106, 2509007, 2391599, 2729053, 2633207, 2862231, 2610465, 2678931, 2912945, 2794667, 2792470, 2881312, 3026689, 2821479, 2838638, 3152767, 3014097, 3176758, 3038931, 3126360, 3082413, 3122040, 3132381, 3462763, 3567862, 3384935, 3650531, 3502633, 3264472, 3545759, 3944452, 3711269, 3858683, 3755780, 3614911, 3855632, 3957481, 4167905, 4196628, 3887987, 4220631, 3988801, 4009673, 4423010, 4291573, 4112091, 4755597, 4016414, 4290827, 4419223, 4409167, 4698833, 4457302]
14457D457302R33L77729P56k29935K16598j727O6492k59686J30658M33554J52454
14446E345128j03184K07201j19616j2431K59746J79766N35m8279K12008j06762
14436E814112L5680l16K56342L81137m32756L17298J72329J84009o8791J55729
14426F814773K673N02384J47062q2942J97590m9390j87458M34517O0974k08516
14416G631667N07495p4764K83641l56922M82886K4996J70622J33012M05873J53888
14406I362394l29372L54598n5736J21019L19066K19001N7007o8422K80442j43256
14396A0116741K70768J17180L07748M16578M2701J25421K5017N50143K3364M92111
14386A2487772J04695L41526N81066j50621N01395q6644J41609k9710M14887L69026
$$ y = [4457302, 4458235, 4835964, 4836720, 4606785, 4823383, 4821656, 4888148, 4628462, 4759120, 5192674, 5345128, 5241944, 5449145, 5329529, 5317098, 5576844, 5756610, 5757145, 5708866, 5920874, 5814112, 5849792, 5849476, 6105818, 6486955, 6054199, 6371497, 6543826, 6727835, 6659044, 6814773, 6817446, 7319830, 7466892, 7383950, 7581540, 7532150, 7344692, 7779209, 7840183, 7631667, 8139162, 8064398, 8348039, 7991117, 8474003, 8498999, 8669621, 8802633, 9208506, 9362394, 9033022, 9387620, 9331884, 9452903, 9771969, 9990970, 10047977, 9979555, 10259997, 10116741, 10387509, 10504689, 10812437, 11229015, 11271716, 11397137, 11422154, 11972297, 11995661, 12487772, 12592467, 12933993, 13515059, 13364438, 13865833, 13779189, 13920798, 13891088, 14305975, 14675001]
14376A4675001J92519l6346O22027L16390O32282J14333L88683O36225R4721L11100
14366A7946935K77025M34807L82471N27023k2643O33162N84410o8704P93255L46772
14356B1834513N86116J110031j1832O30577O57527O42312L73837J115498J86325
14347B7124904J014315M92647Q75093Q41617J073383L93463R73567J017557Q39720
14338C4646266R03194J293842P74114J083278J198528R81281J542321J059414
14330D3482238J668176J474567J136014J714970J504164K112529J257626J786419
14322E6136703K285571J969384J998613J981159K100798K730811K461962K579463
14314G4244464K650157L252547L580939L277472L310106L767865M035369M222674
$$ y = [14675001, 14867520, 14831174, 15453201, 15769591, 16401873, 16516206, 16904889, 17541114, 17635835, 17946935, 18223960, 18658767, 19041238, 19568261, 19545618, 20178780, 20763190, 20694486, 21487741, 21834513, 22420629, 23530660, 23518828, 24149405, 24806932, 25449244, 25823081, 26938579, 27124904, 28139219, 28631866, 29506959, 30348576, 31421959, 31815422, 32788989, 33806546, 34646266, 35549460, 36843302, 37617416, 38700694, 39899222, 40880503, 42422824, 43482238, 45150414, 46624981, 47760995, 49475965, 50980129, 53092658, 54350284, 56136703, 58422274, 60391658, 62390271, 64371430, 66472228, 69203039, 71665001, 74244464, 76894621, 80147168, 83728107, 87005579, 90315685, 94083550, 98118919, 102341593]
14306A02341593M021913N190740M963331N282004N095069O220175O358070O840654
14298A46313549P062474P120741P863723Q238719Q426361R189456J0044675R949341
14290B14209039J1062463J1663946J1679692J2609021J2715738J3634443J4010503
14283C01584845J4177931J4404876J5038466J5062720J4402172J3993984J3555259
14276D02220253J2060946J1198817R747444P395661M806888L214237K997053j415386
14268D52225913p996934m961117p216656r554647j0665389j2630505j3924241
14261C85276424j5155747j5395689j5812807j5338568j5783653j5348474j4380482
14254B78061004j4292897j3694652j3031705j2044430j2075134j0682107j0617466
$$ y = [102341593, 106363506, 111554246, 116517577, 121799581, 126894650, 133114825, 139472895, 146313549, 153376023, 160496764, 168360487, 176599206, 185025567, 194215023, 204259698, 214209039, 225271502, 236935448, 248615140, 261224161, 273939899, 287574342, 301584845, 315762776, 330167652, 345206118, 360268838, 374671010, 388664994, 402220253, 414281199, 425480016, 435227460, 442623121, 447430009, 450644246, 453641299, 452225913, 444228979, 439267862, 432051206, 422496559, 411831170, 399200665, 385276424, 370120677, 354724988, 338912181, 323573613, 307789960, 292441486, 278061004, 263768107, 250073455, 237041750, 224997320, 212922186, 202240079, 191622613]
14247A91622613q950910p999189q899212p498170p888397p527126o726306o629674
14239A29503629n978040n102051n508375m976241m831838m681535l886449l893760
14231I0645340l414880l591229l423772l127764l213936k743661k780372k546490
14223F5803236k170667k314583j872616k156952j903376k302568j407428j758818
14215D9916228j588573j349619j249912j716948j340069j112773j280845j137691
14207C9139798n70928j244251j304066j272679n05141r48476r19081m12318j368336
14198C0594522r05725m95011q36827p38341l90586r38771m06864q02065m57783
14189B4622549o83270q64025r7015o96956o66936l31854m74870l94859m76062
$$ y = [191622613, 182671703, 174672514, 165773302, 158275132, 150386735, 142859609, 136133303, 129503629, 123525589, 118423538, 112915163, 107938922, 103107084, 98425549, 94539100, 90645340, 87230460, 83639231, 80215459, 77087695, 73873759, 71130098, 68349726, 65803236, 63632569, 61317986, 59445370, 57288418, 55385042, 53082474, 51675046, 49916228, 48327655, 46978036, 45728124, 44011176, 42671107, 41558334, 40277489, 39139798, 38568870, 37324619, 36020553, 34747874, 34242733, 33294257, 32375176, 31962858, 30594522, 29688797, 29193786, 28356959, 27618618, 27228032, 26289261, 25882397, 25080332, 24622549, 23939279, 23075254, 22978239, 22281283, 21614347, 21282493, 20807623, 20412764, 19936702]
14180A9936702P603o49080l57745o76136k29218k3598p39717l18908M3581p12498
14170A6280986l2965m08876k94494m93818k9658n90692k31773q3630k46348j78016
14160A3690716k12891j25464n13432j92483j35211k96809j89522j64033k24460
14151A1636411J89762n05802l29460k4704k34081o3371j90289l46849N7896m24037
14141I765476J43024n94021L46625n92874L15517l35533J55789l8719n83619k3501
14131H558164p6420l61385K99786k44591l26033J30360k09396L7165l82018M1610
14121G467242R448l95371o4048J33185n4166k71361J21895l59023k17187J76691
14111F547305n7594k29216J29636j75332j55048k5983k7671j98953J51477k38035
$$ y = [19936702, 19944305, 19295225, 18937480, 18261344, 18032126, 18008528, 17268811, 16949903, 16993484, 16280986, 16248021, 15839145, 15544651, 15050833, 15021175, 14430483, 14198710, 14115080, 13868732, 13690716, 13477825, 13352361, 12838929, 12646446, 12511235, 12214426, 12024904, 11860871, 11636411, 11826173, 11320371, 10990911, 10966207, 10732126, 10668755, 10478466, 10131617, 10189513, 9765476, 9908500, 9314479, 9661104, 9068230, 9383747, 9048214, 9204003, 9165284, 8581665, 8558164, 8481744, 8120359, 8420145, 8175554, 7849521, 7979881, 7770485, 7807650, 7425632, 7467242, 7476690, 7081319, 7017271, 7150456, 7096290, 6824929, 6946824, 6587801, 6370614, 6547305, 6489711, 6260495, 6390131, 6214799, 6059751, 6033768, 6006097, 5807144, 5958621, 5720586]
14101E720586J67165j63962k47363L4051J3773J04876j81920l32686J81469p8428
14091E217561M0032j36465n5986N9170j79199K8441j2388k89175m8506R2208j83755
14080D531938q1603J78344j3039j27181m45996M16599l20358r6582L10029j42586
14070D209565l00141n7750o3126N26073n29607L40551k79454K63820M0133o0102
14060D089962l21060o1093M3148N5088k09667J47118l52945Q9850k58529j19340
14050C102532M83214m59100J79389K0049J32792q2436J70638l26722j33655n0654
14040C036047K78619j73427k05668K17580m28789J89528K08857j61284N4559O8625
14030C084647k54263l92934L27410M37548n52228J47470k93772J25651J20237
$$ y = [5720586, 5887751, 5723789, 5476426, 5510477, 5524250, 5629126, 5447206, 5114520, 5295989, 5217561, 5257593, 5121128, 5065142, 5124312, 4945113, 4973554, 4961166, 4671991, 4623485, 4715693, 4531938, 4450335, 4628679, 4615640, 4488459, 4042463, 4459062, 4138704, 4042122, 4352151, 4209565, 3909424, 3851674, 3788548, 4314621, 3785014, 4125565, 3846111, 4109931, 4150064, 4089962, 3768902, 3707809, 3750957, 3806045, 3596378, 3743496, 3390551, 3480401, 3221872, 3102532, 3585746, 3126646, 3306035, 3326084, 3458876, 3376440, 3547078, 3220356, 3086701, 3036047, 3314666, 3141239, 2935571, 3153151, 2724362, 2913890, 3122747, 2961463, 3016022, 3084647, 2830384, 2437450, 2764860, 3202408, 2650180, 2797650, 2503878, 2629529, 2749766]
14021B749766j26272k59704K5361K05087J50958n5594j83968j8913J85179k06535
14011B465365k71884K49283k07222m5678J42974O850L6896n72409M15409J81662
14001B401246M9832l09560j74820J62904Q4143m3944J04120l63046L81730L29929
13991B622534M53492L37494M16289K278696M611411J4596684J8286940j9299615
13983B4303925j1298061m838489k447284q42904q80330k22083n62514M1238k24612
13974C028886l79097M17225o40111L152N09290p58967L85223l23236j97459K38361
13964B283267j26809k3357J02357j49587J11183j82225q1128j14693j49720L13133
13954A982421O6283q4689j67275J08374j13172K07383j28829j50408j3065J03342
$$ y = [2749766, 2623494, 2363790, 2389151, 2594238, 2745196, 2689602, 2505634, 2486721, 2671900, 2465365, 2193481, 2442764, 2235542, 2189864, 2332838, 2339688, 2376584, 1804175, 2219584, 2401246, 2451078, 2141518, 1966698, 2129602, 2213745, 2169801, 2273921, 1910875, 2292605, 2622534, 3076026, 3413520, 3829809, 6108505, 10719916, 25316600, 43603540, 24303925, 13005864, 8167375, 5720091, 4877187, 3996857, 3774774, 3212260, 3253498, 3028886, 2649789, 3067014, 2426903, 2430055, 2939345, 2180378, 2565601, 2242365, 2044906, 2283267, 2156458, 2133101, 2235458, 2085871, 2197054, 2014829, 1933701, 1819008, 1669288, 1982421, 2048704, 1964015, 1796740, 1905114, 1791942, 1999325, 1870496, 1720088, 1707023, 1810365]
13944A810365o8986k18919R3911k8955P9890j20152J22317j229n1151M553j88744
13933A432900M17054j56110J3320k56135K84011j74028k83669M88987k15426k3458
13923A527446l7122j86031L96571l31275L55614P5269J83540p01799K68204q0024
13913A470393K0714k23567j7768N491N7386k08383L52676k92150n9756m2353J80476
13902A243159n3608k33696M44852l01179J04301K49876n5632j80981k67307K23563
13892A173348J29854j64141j8190L06877m06321r7905L37855O0273k09797L17232
13882A429085k56767N9833M882j23152K60150l17954K53770k12172L5225J51170
13872A284070J670o6511j2143k39595j05008K7528J54722J34112o5574k27326
$$ y = [1810365, 1741379, 1522460, 1616371, 1587416, 1667306, 1547154, 1669471, 1668242, 1617091, 1621644, 1432900, 1849954, 1693844, 1707164, 1451029, 1735040, 1561012, 1277343, 1766330, 1550904, 1527446, 1490324, 1304293, 1700864, 1369589, 1725203, 1800472, 1984012, 1282213, 1550417, 1470393, 1491107, 1267540, 1249772, 1255263, 1312649, 1104266, 1456942, 1164792, 1105036, 1062683, 1243159, 1189551, 955855, 1400707, 1099528, 1203829, 1453705, 1398073, 1217092, 949785, 1173348, 1303202, 1139061, 1120871, 1427748, 1021427, 923522, 1261377, 1321650, 1111853, 1429085, 1172318, 1232151, 1237033, 1113881, 1374031, 1056077, 1309847, 1097675, 1132900, 1284070, 1285740, 1219229, 1207086, 967491, 862483, 890011, 1044733, 1178845, 1113271, 885945]
13862H85945l1723L18271m17265K09990o8585Q2361j9253M52063m17090k00528
13852G94186K9611O99740n68306j10148j32009K55219k6349O2275m9562J90618
13842A145275n2451j73607o1192j36148k2910L26089J86388k07181o1539k39893
13832G02831M33260n16097L47984k80165m191K0323J6717K39224j39921J77452
13822I97417k92851J39097N5007m446j87899K11209D57412K66753K01889j2523
13812I13531k62265J70383J20622j50312J11286j34622k17900p107j03145K86277
13802G26748j46149J95485O7488l87772M51290l15877q2012J90283J67242k11521
13792F55205l20365M06360J63644M2412l08232R6532j4236k48359J48381Q3359
$$ y = [885945, 854222, 1172493, 755228, 965218, 896633, 978994, 959741, 1411804, 994714, 794186, 823797, 1523537, 955231, 845083, 713074, 968293, 941944, 1004219, 954657, 1145275, 1092824, 919217, 858025, 721877, 698967, 1025056, 1211444, 1004263, 942724, 702831, 1136091, 619994, 967978, 687813, 683622, 703945, 720662, 959886, 819965, 997417, 704566, 843663, 898670, 894224, 706325, 917534, 457412, 724165, 926054, 913531, 651266, 821649, 942271, 791959, 903245, 768623, 550723, 543616, 440471, 726748, 580599, 776084, 843572, 455800, 907090, 591213, 509201, 699484, 866726, 655205, 334840, 741200, 904844, 947256, 639024, 735556, 721320, 472961, 621342, 704701]
13782G04701J83261k49232j48008J30952j34398L48136J0093o3582l34088M58682
13772I06517l34477R5791J56908j54135q2862K76693j72899j20189K19024j35915
13762F54456J0741K73116Q3656k98973r5042j34236K63188j58734M3607K82861
13752I24640m16629M29850j48098J22780m21944K17736C31509O2324K25245k9545
13742E89533O6630j3921q0044J1582R6132j72487o388L61120l32650K8003j37754
13731D09756K77444k06809j34932N52655m47697O13289k30550j57655j82223J13706
13721F06984L746o5047j29947n1413R8996K18009K9255l09810K30632j48939L43328
13710H25794k78280k00945P173L57939K3768C27386J54862K27205k48672N1894
$$ y = [704701, 887962, 638730, 490722, 621674, 487276, 835412, 845505, 781923, 447835, 906517, 572040, 667831, 824739, 670604, 587742, 864435, 691536, 571347, 790371, 654456, 665197, 938313, 1021969, 722996, 627954, 493718, 756906, 598172, 641779, 924640, 508011, 937861, 789763, 912543, 490599, 708335, 331509, 393833, 619078, 589533, 656163, 642242, 562198, 573780, 669912, 497425, 491037, 852157, 519507, 547510, 409756, 687200, 480391, 345459, 898114, 450417, 1063706, 833156, 675501, 493278, 606984, 610730, 545683, 415736, 364323, 463319, 681328, 710583, 400773, 631405, 482466, 825794, 547514, 346569, 353742, 711681, 735449, 327386, 482248, 709453, 460781, 512675]
13700E12675J29380j64954L8960j15818j41111J91807K13869l17076O0041J32262
13690E40035j51292R7255O72K87704B66764J95311j4079J21429p5848O7462n4746
13679E06293P2482B77475J53143A12442R0332J11943j02861P9868K18778k6743
13669D83759B26605K5973J69847J10860J39909j3689k10312J47558k80080L61825
13659F78496j7263C16206K20712p5231K7357G2924K99120J37413J19231H6713
13648D84137k04925K92033A83008K76176O6383k10512M254R6819L00630o8185
13638F48573l18106L09825B93780q9753M46273H4915J99094J34510m8697M42218
13628H12040k37247B76031l6708P7926K12449H9210M85510F7366L39307j95010
$$ y = [512675, 642055, 477101, 516061, 400243, 259132, 450939, 664808, 347732, 407773, 540035, 388743, 485998, 486670, 774374, 266764, 462075, 447996, 569425, 493577, 561039, 506293, 578775, 277475, 430618, 112442, 202774, 314717, 211856, 291724, 510502, 483759, 226605, 252578, 422425, 533285, 673194, 659505, 449193, 596751, 316671, 678496, 661233, 316206, 536918, 461687, 489044, 72924, 372044, 509457, 628688, 86713, 484137, 279212, 571245, 183008, 459184, 525567, 315055, 319309, 416128, 716758, 648573, 330467, 640292, 293780, 204027, 650300, 84915, 284009, 418519, 369822, 812040, 574793, 276031, 239323, 317249, 529698, 89210, 574720, 67366, 406673, 211663]
13618B11663K83600p9706L9604m0954l3943J36277k09740Q3270j29070J74982
13608D35983j7731A99597J24118j9926J42163O7769m3083O5824A42750L43895
13598D86645N6444k42698J53730O2725J69184F3959N85105A49109J71890K68455
13588E89454r4167k15138K94117j95044N1451j00443n8115K57744B2513M49955
13578D72468j14334e3257B65406N8208A08032K04201B1573L37217A24540J45940
13568B70480j11549K6599R1542L68467k40067I2240Q4380l1736J48177G1485K85137
13557C56622e9811E08416l1441N3472B23566K9801J90695j44271n4482A21727
13546E7817O0115O0655C5685K88050c3837C41375A45591L28001j66740J73860
$$ y = [211663, 495263, 415557, 455161, 414207, 380264, 516541, 306801, 390071, 261001, 435983, 418252, 199597, 323715, 303789, 445952, 513721, 470638, 536462, 142750, 486645, 543089, 300391, 454121, 516846, 686030, 63959, 649064, 149109, 320999, 589454, 495287, 280149, 574266, 379222, 430673, 330230, 272115, 529859, 22513, 472468, 358134, -53257, 265406, 323614, 108032, 312233, 21573, 358790, 124540, 270480, 158931, 185530, 277072, 645539, 405472, 92240, 176620, 144884, 293061, 71485, 356622, -59811, 508416, 476975, 530447, 223566, 253367, 444062, 299791, 245309, 121727, 57817, 117932, 178587, 35685, 323735, -33837, 341375, 145591, 473592, 306852, 480712]
13536D80712B3610J28864Q6553n836A09452K82378J46931k44016K9288C5051M72430
13525E07481A59734J4809i6487A50443j0402a79787n1800B29548J24512j04708
13515B49352m5936p2676J41403c6642D43306A56712l3624J00977M6478F8289J11666
13504A79955a75727A34322Q6887O5034I9886J26531o8744K60872q3672o7527d0194
13492C70587g6462H4102R2006K99683j82748J21291A33933J03400L56673A47275
13481C26097E9645J82451d1815A94660N8390G5438J92688j30253b6456D8287J001
13470D9288L14326q4244J9879K16207e703D53552B16903M03193a17542B71902
13459E33762A47536o3445A3122K87858n7966q9593K16424l1313r4806L15046E8262
$$ y = [480712, 23610, 152474, 239027, 233191, 109452, 391830, 538761, 294745, 324033, 35051, 507481, 159734, 174543, -96487, 150443, 140041, -179787, -231587, 229548, 354060, 249352, 203416, 130740, 272143, -36642, 443306, 156712, 123088, 224065, 270543, 68289, 179955, -175727, 134322, 221209, 286243, 99886, 226417, 157673, 418545, 334873, 267346, -40194, 370587, -76462, 84102, 176108, 475791, 293043, 414334, 133933, 237333, 594006, 147275, 326097, 59645, 242096, -41815, 194660, 253050, 75438, 268126, 137873, -26456, 48287, 49288, 363614, 279370, 299249, 515456, -5703, 453552, 216903, 620096, -117542, 271902, 533762, 147536, 84091, 13122, 300980, 243014, 153421, 369845, 338532, 243726, 558772, 58262]
13447C26940J49332j87758A7217K32002e0419A09194J91413A46295N56871c0760
13436C43545j44336b1475C47441A19026l0443f7601B58620p7425d9192o4630C33345
13424D76398H3060M4162J3223l288K3675b0758C52596j28962P2232j35195K38487
13413C99158A2920L09675B8807g1124B92750m271B4351J10834j0142N300i9593
13401A06168j1058K38518o0325c411H5701K7O7925J83294i128D50512j66893A11376
13388B21284J29577P95j360I7991j969k8558K40589a43900D88706j31686j00508
13377B56512J06808r4707K74741B10190l9881a24283C22873i4A92167K76860A06807
13365A8531K00721J09275j47520J03644k745Q4873j41990n0889L28602A74838
$$ y = [326940, 476272, 288514, 17217, 249219, -50419, 109194, 300607, 146295, 703166, -30760, 343545, 199209, -21475, 347441, 119026, 88583, -67601, 258620, 181195, -49192, -113822, 333345, 476398, 83060, 127222, 140445, 137157, 160832, -20758, 352596, 223634, 295866, 160671, 399158, 12920, 322595, 28807, -71124, 292750, 288479, 24351, 135185, 125043, 130343, -99593, 106168, 95110, 333628, 273303, -3411, 85701, 85728, 153653, 336947, -9128, 450512, 283619, 111376, 221284, 350861, 351656, 350296, 97991, 96022, 67464, 308053, -143900, 488706, 357020, 256512, 363320, 268613, 543354, 210190, 170309, -124283, 322873, -94, 192167, 469027, 106807, 18531, 219252, 328527, 181007, 284651, 281906, 366779, 224789, 173900, 502502, 174838]
13354f1581A59404o7101K27849A40606l1514J81563A36544J79822n9616g4419
13343B70669O6031A35293K525L20476j36352D0785K23862J73402r862B07589P9654
13332B87243j30684K82508l4133A67565j0649R3057L3868r3067E0838J95729D1399
13320D3511J8637R0964K4655g1516E86744b50832B39595b40602E6134Q4025j223
13309A38936K79665j29138c1165D40019I9470K75138M2672A73121a7269C09061
13298D95781B05795N390L04056J4831A03089e0813a8155E43241B08222L0419n1524
13287A87117g4616B62464K8243A39330B6827a9557m2887b5221H7274Q3608l6898
13276A33984A8579E656J6324a5989B91429a4022G9578J30612L5632O9211O9053
$$ y = [-61581, 159404, 92303, 320152, 140606, 109092, 290655, 136544, 316366, 256750, -74419, 270669, 336700, 135293, 137818, 458294, 321942, 40785, 264647, 438049, 428187, 207589, 287243, 156559, 439067, 404934, 167565, 156916, 249973, 283841, 190774, 50838, 246567, 41399, 43511, 62148, 153112, 177767, -71516, 586744, -250832, 239595, -240602, 56134, 140159, 138936, 418601, 289463, -31165, 440019, 99470, 374608, 417280, 173121, -17269, 309061, 495781, 205795, 211185, 515241, 530072, 103089, -50813, -18155, 543241, 208222, 238641, 187117, -74616, 262464, 290707, 139330, 26827, -19557, -62444, -25221, 87274, 170882, 133984, 18579, 5656, 21980, -15989, 291429, -14022, 79578, 210190, 245822, 315033, 384086]
13265C84086n1963d989k09812F2276J4734j6024b2835A38745F251M6957a44747
13253G303L18074D9790e088A86674d2178e080C21633C3176l272L65911b0563a45
13240b560A19175a98481h3566G7808A9249K35815D6113f4656C81055g3764B84242
13228A55541J03780p1598C5197K27530E0025L39036A2798O170o043i7673A81460
13216f9372A42227J0055a35169a9974C0118K74981o4202q3177p4932c5339C32084
13204A05237a31193N8573A10590J47645n5362a31538A92562K461j18K18549G4212
13192G1647i3365k5949C4203J21423j1227B4526K5868b13452D91311A79487a40051
13180H8018C2963J11416O645J54710k896A206R0843J10465G2314J71556e4378
$$ y = [384086, 332123, -4989, -214801, 62276, 77010, 60986, -22835, 138745, 6251, 53208, -144747, 7303, 325377, 49790, -5088, 186674, -42178, -5080, 321633, 33176, 29904, 395815, -20563, -145, -2560, 119175, -198481, -83566, 77808, 19249, 255064, 46113, -64656, 381055, -73764, 284242, 155541, 259321, 187723, 35197, 262727, 50025, 389061, 12798, 18968, 12925, -97673, 181460, -69372, 142227, 152282, -135169, -19974, 30118, 305099, 240897, 157720, 82788, -35339, 332084, 105237, -131193, -72620, 110590, 258235, 202873, -131538, 192562, 195023, 194905, 413454, 74212, 71647, -93365, -119314, 34203, 155626, 144399, 24526, 50394, -213452, 491311, 179487, -140051, 88018, 32963, 144379, 151024, 305734, 302838, 1206, 92049, 202514, 72314, 243870, -54378]
13168h7455j07971E223a2049j59890d1130C18667A38454N7062c2894B04678b049
13156b74296A23641b62015A99988F3970c47030f6668o4036B24533l8812C4515
13145A52525g5882k19077a24921j90410H1163k6823d97662i2237C15334A10631
13134E6968d0104I2719J58377J95553A50750d9168A69903b0187k00814A59322
13123B62682m566G342L5536h5011B78922A30459J24195F735a5215B65366c43468
13111H4668B7209a6991j8759m4322o0259D6101b01744I3820J6578a40506B6947
13099B58570P6997C3109m170a97308B65306J11744a41609e7057A05832J15569
13089B21401J7609J37022C5466n991a92199C8785a4711k7408k58770B47935b9471
$$ y = [-87455, -195426, 5223, -12049, -171939, -41130, 318667, 138454, 195516, -32894, 204678, -2049, -274296, 123641, -262015, 199988, 63970, -347030, -66668, -130704, 224533, 185721, 34515, 152525, -75882, -294959, -124921, -315331, 81163, 54340, -497662, -92237, 315334, 110631, 56968, -40104, 92719, 251096, 446649, 150750, -49168, 169903, -20187, -221001, 159322, 262682, 258116, 7342, 42878, -85011, 278922, 130459, 254654, 6735, -15215, 265366, -343468, 84668, 27209, -16991, -35750, -80072, -140331, 46101, -201744, 93820, 110398, -140506, 26947, 258570, 335567, 33109, 28939, -197308, 265306, 377050, -141609, -57057, 105832, 221401, 239010, 376032, 35466, 29475, -192199, 38785, -14711, -42119, -300889, 247935, -29471]
13077I6736J2697j244K59311K5023A11760J35460P531r1232D8611e0392q961H5363
13064H0974g128C63699m6133d2553g565k16294A13218L9811j1729o2905l0668
13053D7727E4K50542C7342N15253j95163a97210G7501K12689a12872f521B06836
13041B17326a19320p45B76751j34337N1073J23854a3171f117B75612D005g1010
13029A95590o5191B1097J31061O6783K9031h58E0587Q5125J25518h864B41000
13017G6036N3367c3868B13605i0495B1577b43570H807K40945H5988B3338N7782
13006H1120g8737B60764P3754b03690H6593d5615A20826J1470E0531R2946a6656
12994c7531D989b2666A3468L95244H8279k6569a43760D9768b5173C339c27703
$$ y = [96736, 109433, 108189, 367500, 392523, 111760, 247220, 254751, 163519, 48611, -50392, -59353, 85363, 80974, -7128, 363699, 317566, -42553, -7565, -223859, 113218, 153029, 141300, 78395, 47727, 54, 250596, 37342, 552595, 357432, -197210, 77501, 290190, -112872, -6521, 206836, 217326, -119320, -120065, 276751, 142414, 193487, 317341, -13171, -6117, 275612, 4005, -71010, 195590, 130399, 21097, 152158, 218941, 247972, -858, 50587, 135712, 261230, -8864, 241000, 76036, 129403, -33868, 213605, -90495, 21577, -243570, 8807, 249752, 85988, 23338, 81120, -78737, 260764, 334518, -203690, 86593, -45615, 120826, 132296, 50531, 143477, -16656, -37531, 4989, -22666, 13468, 408712, 88279, 61710, -143760, 49768, -25173, 3339, -327703]
12982a29361A2548e7734d140A14250J18748m7401i4873a4656D46576h5554m4013
12971a29567a798n5486j24701I3495J18479C4990i9322F9585N0610k0323b33259
12959d1444C0930J11288B6220K13565B7511J86354K3506h713j24502l33668a55620
12947a05231d1417L614D50731A59027B8757K35200q680c2355A31728O5749h4881
12935F5177M7241N8009c2436j46338A13145b52803E2594b6332p7326J0417B8816
12923b54847B31276P666C25K42975d7652D50028C2376O1230a6715f954p3589r5815
12911a76358h064D24467b4956A7197d1556B7156o764L03791p6063D1494A3964
12899A27945A5962L25943c46906A63226c2129A03515B9706L76434d2659H3944
$$ y = [-129361, 12548, -57734, -4140, 114250, 232998, 185597, -94873, -14656, 446576, -85554, -129567, -1798, -57284, -181985, 93495, 211974, 34990, -99322, 69585, 120195, 99872, -233259, -41444, 30930, 142218, 26220, 239785, 27511, 213865, 237371, -8713, -133215, -466883, -155620, -105231, -41417, -37803, 450731, 159027, 28757, 263957, 255277, -32355, 131728, 197477, -84881, 65177, 112418, 170427, -32436, -178774, 113145, -252803, 52594, -26332, -103658, -93241, 28816, -254847, 231276, 238942, 325, 243300, -47652, 450028, 32376, 93606, -16715, -6954, -80543, -176358, -8064, 424467, -24956, 17197, -41556, 27156, 20392, 324183, 248120, 41494, 13964, 127945, 15962, 341905, -346906, 163226, -32129, 103515, 29706, 406140, -42659, 83944]
12888a68687B11252b2824q7199M984b4011C70026a05209c8688j26581E4003J52347
12877B06350e3442C56578b37550F3294O3229p677n314a59963a6217n8849l23126
12866c98192B24808A01241a11957E0052R974G592i3271d3617l3166e94A98425
12854d0853B22452b38551A11519g0371A5031m228O9127a55586J5482j4296O9141
12843h5259j52311L0890A63391i9728C584h7223n9846C92654A13650C9859c4670
12831a48897b7328G0759b6244r3679A82828G7619j7790Q0646h2837j6844B79379
12819D11013H947i9553r14e782k9158A18699a25877N5009j04321A00067K23799
12808C23866a17055K0042j19400A98916B9446f6470j51990C0649d3526k59934
$$ y = [-168687, 211252, -22824, -110023, -105039, -24011, 370026, -105209, -38688, -165269, 54003, 206350, -53442, 356578, -237550, 63294, 126523, 118846, 113532, -159963, -16217, -75066, -398192, 224808, 101241, -111957, 50052, 60026, 7592, -93271, -43617, -76783, -594, 198425, -40853, 222452, -238551, 111519, -70371, 15031, 10803, 79930, -155586, -140104, -154400, -85259, -237570, -206680, 163391, -99728, 3584, -87223, -147069, 392654, 113650, 39859, -34670, -148897, -27328, 70759, -26244, -119923, 182828, 77619, 59829, 140475, -82837, -99681, 279379, 411013, 8947, -99553, -100467, -5782, -34940, 118699, -125877, -70868, -175189, 100067, 323866, -117055, -97013, -216413, 198916, 29446, -66470, -218460, 30649, -43526, -303460]
12798c03460B14815a19993I2084C1308j2259c4911D6599O2742L03597a02945A55946
12786D2519K59630I385a71081N1066J3401m4020c0160J4692k61533B19621g4896
12774B49444b6342o2610A35554n8747L07460A08852a58845G8415J5993a52872
12763B52733a68656f861E729P7020a39530A06748g9318k44348a7911k9978D38469
12751C07066b28673m4568F6923i0174j14517l4492E9700J19370q8308M35437A38291
12739A40128f2965B40037m9044p0143f0324H7852J68979l759f2833B47463r6987
12728A50476c0303r9084A89320k1694E6537i2313J1015J5329l3542m3297B49564
12716A52022n2168J44884a53916F9403O6665n1612K76314B0433J04529J08274
$$ y = [-303460, 214815, -119993, 92084, 31308, 19049, -34911, 46599, 109341, 412938, -102945, 155946, 42519, 302149, 9385, -171081, -120015, -106614, -150634, -30160, -15468, -277001, 219621, -74896, 249444, -26342, -88952, 135554, 76807, 384267, 108852, -158845, 78415, 94408, -152872, 252733, -168656, -6861, 5729, 82749, -139530, 106748, -79318, -323666, -17911, -47889, 438469, 307066, -228673, -273241, 66923, -90174, -204691, -239183, 59700, 179070, 90762, 526199, 138291, 140128, -62965, 240037, 190993, 120850, -60324, 87852, 256831, 253072, -62833, 247463, 150476, -30303, -129387, 189320, 167626, 56537, -92313, -81298, -65969, -99511, -142808, 249564, 152022, 99854, 244738, -153916, 69403, 136068, 84456, 360770, 20433, 124962, 233236]
12706B33236P3203D621a28679J3403A15774L3464h104A9235f2725r0232G603c6521
12693H311b5978B07865a87661B77507A3756K19416m3793h9252I6481C8859p973
12682C0886b44872f8404E7469J24917R5714o1127H2599P5226P3313A06170n2131
12671E4039N9181m5319C1092M8010a43165A92273M4526D7958J94999n7195Q546
12660A94308a1046c141p6992A76119G7511M4998M05500a38058c3451A29106a14172
12648A05028a23734A9242n561a08957l7577M4335l1640B44995J1831a53053I7043
12636B0213M60575F2254M48349A05175j145B6782K75982I4207B7682H574L9539
12625D8113a05298B22758p7546M6843q9165O5218J48378D6652J81216O1892E3228
$$ y = [233236, 306439, 4621, -128679, -115276, 115774, 149238, -8104, 19235, -62725, -152957, 7603, -36521, 8311, -25978, 207865, -187661, 277507, 13756, 233172, 189379, -89252, 96481, 38859, 30886, -244872, -68404, 57469, 182386, 278100, 216973, 82599, 157825, 231138, 106170, 54039, 113220, 67901, 31092, 79102, -143165, 192273, 236799, 47958, 242957, 185762, 194308, -11046, -3141, -80133, 176119, 77511, 122509, 528009, -138058, -33451, 129106, -114172, 105028, -123734, 19242, 13681, -108957, -146534, -102199, -133839, 244995, 256826, -153053, 97043, 20213, 480788, 62254, 510603, 105175, 104030, 26782, 302764, 94207, 27682, 8574, 48113, -105298, 222758, 145212, 192055, 102890, 168108, 316486, 46652, 227868, 289760, 53228]
12613A33226f0354A46178j2301i5992A12521E4457c84874a05363j31779g8440
12602A4600b73031I394a80049C12584b99882C1933a64614K1203J9044H5700a4554
12590a16482A6421K78956a59879G9860i9836H2522b12468C76846A6965g5673p2691
12579a48364j0457n2636D2809b86936C5454a5152l95071A69143M9770b6518k28381
12568b54899B6742c02265d8553B93393j43980b40183A44353a80397r8800e4684
12557d543A23532K7825p3595B4035J16457h8286C31070j03077g3967B39021B420
12545A88389b1645C9496a94378A31601b51123a7206I9335C132O0656c17562J35779
12534a81783j5923e9611B2378J2010a91231k80470a36960A23053g3230M872A40172
$$ y = [133226, -60354, 146178, 133877, -95992, 112521, 54457, -384874, -105363, -237142, -78440, 14600, -273031, 9394, -180049, 312584, -299882, 31933, -164614, -143411, -124367, 85700, -14554, -116482, 16421, 295377, -159879, 79860, -99836, 82522, -212468, 376846, 16965, -75673, -148364, -158821, -211457, 42809, -286936, 35454, -15152, -410223, 169143, 218913, -26518, -254899, 26742, -302265, -48553, 293393, 149413, -240183, 144353, -180397, -279197, -54684, -4543, 123532, 151357, 77762, 24035, 140492, -88286, 331070, 227993, -73967, 239021, 2420, 188389, -21645, 39496, -194378, 131601, -251123, -17206, 99335, 3132, 63788, -317562, -181783, -197706, -59611, 22378, 34388, -191231, -471701, -136960, 123053, -73230, -68358, 140172]
12522C2309j3531K22257d4993e895A51151e6428A630L17143k2014a08127A57407
12510B40445o3382G1454b09308C35869l4650a97759j52273C06839B2130R0887
12500A13017C3876J80288k2414f2208A04855C0808J54340h2709A76541b88817
12489B22666a84256A49896b31508c0753O533l70934D82642B23371a4354E4943
12478i0957I5374E437J7778e9565l49421B35678g7945k01793C153d26692a32989
12466A47104m4558L4242c8533p34m8377k1343l6264c2921k38933A98447a32647
12454A6413J19399L00866a43725A4126c50316I1225E619L71780D0251b38467A15118
12442F3701a9902r3112k05216e3691J5103a7071G1266g0362A72225O7457E7497
$$ y = [32309, 18778, 241035, -44993, -5895, 151151, -56428, 1630, 318773, 296759, -108127, 157407, 240445, 177063, 71454, -209308, 335869, 301219, -197759, -350032, 306839, 22130, 113017, 33876, 214164, 191750, -62208, 104855, 30808, 185148, -82709, 176541, -288817, 222666, -184256, 149896, -231508, -30753, -24220, -395154, 482642, 223371, -14354, 54943, -90957, 95374, 5437, 23215, -59565, -408986, 235678, -77945, -279738, 3153, -426692, -132989, 147104, 102546, 136788, -38533, -39267, -87644, -108987, -145251, -32921, -271854, 198447, -132647, 16413, 135812, 436678, -143725, 14126, -350316, 91225, 5619, 377399, 40251, -238467, 115118, 63701, -19902, -113014, -318230, -53691, -38588, -17071, 71266, -70362, 172225, 239682, 57497]
12430A23450E0156a65444e5724a7328D6550d8649C11055G1707c1612B74670i3273
12418b2432B5483R8721H869P4328j9766L1191J04811a35020H0874b12268C9063
12406A21937a60152k9804A24025J78473B3361L1064a95778b0367n0625l42770
12396d13762H530b74757A0871K969R237J47288n709l734a11923B60090A9686f8662
12383c13925A54249b48746l333B90497H8095A3708K65014a4941j65495P4994o5986
12372a71428B00952F9960h7626A0119Q6395b62271b5091j90040Q7752E1320N7627
12361A08947J83198b00548F4184e9358I3383j6440K7874c03354Q483a03688B0960
12349B42658m0289a81333c0247k55437l940J18828H3896L36940C822J8969R6416
$$ y = [123450, 50156, -165444, -55724, -17328, 46550, -48649, 311055, 71707, -31612, 274670, -93273, -22432, 25483, 124204, 8869, 83197, 63431, 94622, 199433, -135020, 80874, -212268, 39063, 121937, -160152, -189956, 124025, 302498, 23361, 54425, -195778, -20367, -70992, -413762, 8530, -274757, 10871, 13840, 23077, 170365, 164656, 160922, -111923, 260090, 19686, -68662, -313925, 154249, -248746, -252079, 290497, 88095, 13708, 278722, -14941, -180436, -105442, -171428, 200952, 69960, -87626, 10119, 96514, -262271, -25091, -215131, -127379, 51320, 108947, 292145, -200548, 64184, -59358, 93383, 76943, 104817, -303354, -294871, -103688, 20960, 242658, 202369, -181333, -30247, -285684, -289624, -170796, 83896, 420836, 3822, 22791, 119207]
12338A19207f2962F7529J1457K05886l5273o8010J03288f4000D35565Q3614j12884
12327D06295J25419j15349j94790a57171F3477b82961G27224A46762m4658K415
12317A04519k2892h306A38039J15066B8991a99670B5446P1192m212J16165L8240
12306B46831M0700m8036E2831Q4899b20224p0883e2123m0835p026c5479r925A23079
12293B34171E6949K49258C5372i8069E3024d9356A22117E4740a59608A68560q3261
12282H5299c8121N990E4181c206I9295K9136Q1511O4628N4099P998H4383J55394
12270B39777j00270C0007K060i324A33770D8395L08108j16144J70249a3679D44644
12258A07793B3282L02078G5155J1836K99662i5787D20121A62630K52240F2934
$$ y = [119207, -62962, 67529, 78986, 284872, 249599, 181589, 284877, -64000, 435565, 519179, 406295, 531714, 416365, 221575, -157171, 63477, -282961, 727224, 146762, 102104, 104519, 81627, -8306, 138039, 253105, 28991, -199670, 25446, 96638, 92426, 208591, 246831, 287531, 239495, 52831, 137730, -220224, -291107, -52123, -92958, -99984, -35479, -45404, 123079, 234171, 56949, 306207, 35372, -98069, 53024, -49356, 122117, 54740, -159608, 168560, 85299, -38121, -32131, 54181, -3206, 99295, 128431, 209942, 274570, 328669, 336667, 84383, 239777, 139507, 30007, 32067, -9324, 133770, 48395, 356503, 240359, 410608, -13679, 444644, 107793, 23282, 325360, 75155, 86991, 386653, -95787, 420121, 162630, 414870, 62934]
12247a53088A48208Q635G5372a7827D38476j23090b40728Q2450B3775e4241B05538
12235a47883A12042J66582d3574A79713a97008A23826a3159A78840q6275J12369
12225B04934J0129O9903G0104a62473C77231A25102a84029E51226B3869O605K9817
12214F0291j6412f8973C23715p0392K2723n2969a66711D49193I5765J60904j08687
12203A47982q613D1674J86197D2885K97835G729K45143L8241A12756J25928R238
12192B47922J88727J10264q4788b8704B96876J68101M7965B40117L5492J1652
12182B87261m5642a90240D23172a9854m1475C90759j18321H1547J66382b14017
12171A40077J22140J2985J6395K58196n5021A94246J88962A37857J19937N315
$$ y = [-153088, 148208, 156843, 75372, -17827, 438476, 315386, -240728, -158278, 23775, -54241, 205538, -147883, 112042, 278624, -43574, 179713, -197008, 123826, -13159, 178840, 92565, 204934, 215063, 284966, 70104, -162473, 377231, 125102, -184029, 551226, 23869, 30474, 60291, 43879, -68973, 323715, 253323, 276046, 223077, -166711, 449193, 95765, 256669, 147982, 139369, 41674, 227871, 42885, 340720, 7729, 252872, 291113, 112756, 238684, 247922, 436649, 546913, 462125, -28704, 296876, 464977, 512942, 240117, 275609, 287261, 241619, -190240, 423172, -19854, -61329, 390759, 272438, 81547, 247929, -214017, 140077, 262217, 275202, 291597, 549793, 494772, 194246, 383208, 137857, 257794, 263109]
12161B63109A16175b8237A32537e1387D3782b95534C11594j26724a12719B63291
12150A32734k4636a44151b0690C30686m602k0133A22051a43402D7882b54183a7587
12138f2284h206A81769a41118K5567G8205Q5209b57397F0062J06869a83886A07360
12126c64877A4261M85813B26688F3657R1703n7321a53292H0645K20287p0801K48425
12115D78556f067j60500A41708m0584b77323h459j3193D42569b12606B06196o7255
12104A38941B0966h8658A03151J69948B1570N8520O352B8255a07441F9809i1811
12092g6316k2130P034A8244L98690A31246a95945E136J84936j9735j990C1778
12080B97993F4811J74288L02665j89687a04376B49678h1492b660C10343D4732
$$ y = [263109, 116175, -28237, 132537, -51387, 43782, -295534, 311594, 184870, -112719, 263291, 132734, 108098, -144151, -20690, 330686, 326084, 305951, 122051, -143402, 47882, -254183, -17587, -62284, -8206, 181769, -141118, -115551, 78205, 163414, -257397, 60062, 166931, -183886, 107360, -364877, 14261, 500074, 226688, 63657, 155360, 98039, -153292, 80645, 300932, 230131, 478556, -6067, -166567, 141708, 101124, -277323, -8459, -21652, 442569, -212606, 206196, 138941, 20966, -88658, 103151, 273099, 21570, 80090, 86442, 28255, -107441, 69809, -91811, -76316, -98446, -91412, 18244, 416934, 131246, -195945, 5136, 190072, 170337, 168347, 31778, 297993, 64811, 239099, 541764, 352077, -104376, 249678, -81492, -2660, 310343, 44732]
12069a02721B92344A39511D2888K18945q3937K19876A23579D6547J27517a31154
12058i0101m4379L628B44603b659j4244k28686b7035j46437j29688A65454L25078
12047D90532I843c3759F8976r535h0946j0135G2213K48965H1268B9555c38681
12035d6320l0757C34267A61138c5113C10697e2591B92978E6676d711r5772C7700
12023a64868C68872p8870j26650b31569C04213I8458a63806i212j359C67732e9358
12011A82160o988M77510b08637M0354B81560a44811A26472f4281B83726F5182
12000D7031J05354f6511j06967B21912K89697A57697J20826D3144J2321a32593
11989B09915c4168j32891H1072a4658l46025J07469B44150d9185I0597k7631f8519
$$ y = [-102721, 292344, 139511, 42888, 261833, 177896, 397772, 123579, 46547, 174064, -131154, -90101, -134480, -130852, 244603, -2659, -16903, -245589, -27035, -173472, -303160, 165454, 490532, 9843, -33759, 68976, 59441, -80946, -91081, 72213, 321178, 81268, 29555, -338681, -46320, -77077, 334267, 161138, -35113, 310697, -52591, 292978, 56676, -4711, -100483, 37700, -164868, 368872, 290002, 163352, -231569, 304213, 98458, -163806, -9212, -10571, 367732, -59358, 182160, 175172, 652682, -208637, -168283, 281560, -144811, 126472, -64281, 283726, 65182, 47031, 152385, -66511, -173478, 221912, 511609, 157697, 278523, 43144, 55465, -132593, 209915, -34168, -167059, 81072, -14658, -360683, -253214, 244150, -49185, 90597, 62966, -68519]
11977d4084A724g3032B628R0666J87101A6946g3932l02831A47764b53358P9878
11966a73480F7318J6603h7998E7984b47283A99751a0002o3733j4605k01348b2781
11954B70828m8205P0530a64112G1184K01137G5199h065l898F0714J4766a53716
11942A46942d9995j23564J0066c3549I5816A2907a9994j56438a4384A08998M2283
11931A51281J10469c0226j55803e1295A39614o4777b15924j0993A28117Q6275
11921B14392E7274i5092B1615a08611k39116A83574b01200B79278i8764H2844
11910g5789j39403A79437a21274N7546B58091C018P8599J67260i8913A99702b82377
11898a62118c2071C51445f5473C676b60267P056d6312I4694a58913B72229A3643
$$ y = [-44084, 1724, -73032, 2628, 93294, 280395, 16946, -73932, -376763, 147764, -253358, -173480, 67318, 83921, -87998, 57984, -247283, 199751, -10002, -73735, -88340, -289688, -22781, 270828, 222623, 293153, -164112, 71184, 272321, 75199, -8065, -11963, 60714, 75480, -153716, 146942, -49995, -173559, -163493, -33549, 95816, 12907, -19994, -176432, -14384, 108998, 151281, 261750, -30226, -186029, -51295, 139614, 74837, -215924, -226917, 128117, 214392, 57274, -95092, 21615, -108611, -347727, 183574, -201200, 279278, -98764, 82844, -75789, -215192, 179437, -121274, -63728, 258091, 3018, 81617, 248877, -98913, 199702, -282377, -162118, -32071, 351445, -65473, 3676, -260267, -253211, -46312, 94694, -158913, 272229, 13643]
11886c13933A76387a15909N4716I806c0324h89C03149A03587a89177B2239f7540
11874a66743A18885c98017J19887a22739A0861b2789j63614j60530i2236A74653
11863b44517e8920l75344B06792f9383p5378D830K4342L12226j33947E2607a09799
11851a51240N0473C5097M9368c98913B30366G4759Q0726b60173h7494K6456k05141
11840b66179D0139J94780c89716a23679a9831p4165m3547o5016D3451J217e8764
11828a17250b8181j32818k4389i1450A5647k345L4229Q265d21199b09662A45317
11816h4715A60646k1297F386J9090M1413a83136j02823g8779A65516a03358p559
11805a10917B0720J73684B1104Q2405a94016H062L8899L9976L04868A72644o4401
$$ y = [-313933, 176387, -115909, -61193, 9806, -30324, -889, 303149, 103587, -189177, 22239, -67540, -166743, 118885, -398017, -278130, -122739, 10861, -22789, -186403, -346933, -92236, 174653, -244517, -58920, -434264, 206792, -69383, -144761, 4830, 29172, 341398, 207451, 52607, -109799, -151240, -100767, 35097, 84465, -398913, 230366, 74759, 155485, -260173, -87494, -61038, -266179, 40139, 234919, -389716, -123679, -19831, -93996, -137543, -202559, 43451, 44668, -58764, -117250, -28181, -160999, -185388, -91450, 15647, 13302, 47531, 55796, -421199, -209662, 145317, -84715, 160646, 139349, 6386, 25476, 66889, -183136, -285959, -78779, 165516, -103358, -110917, 20720, 194404, 21104, 103509, -194016, 8062, 46961, 86937, 391805, 172644, 108243]
11794A08243d1138j52498h5201r6304A75231d6316A78501a81066Q8279Q843L2167
11783e1777p2558A03011d03207D2353J20027E9184Q0999a44466c8123A48812a75470
11771h5739I4108l4197f9227C3622b93346a36656A39033e3370j60023O9338O5813
11760g8242B79053J82144a489G3642R9880G5714a5227I1799F084M5644J30423
11749A82151g2300A65216h6594j5383F463a19142F0516a6939G6013i004A02489
11737f826j77260e3763a0002k55005I6679f0836q5143C48216a44698b4794j69499
11726a94293f3673I7753g1916B92583h2132e03H6669c2710j3196j10766C0260
11714C90511c97360B16147i1459q2789n9883A10866O1917g7090A01272h0959A97070
$$ y = [108243, -41138, -193636, -85201, -181505, 175231, -46316, 178501, -181066, -92787, -83944, -51777, -124335, 103011, -403207, 42353, 162380, 59184, 140183, -144466, -38123, 148812, -175470, -85739, 94108, 59911, -69227, 33622, -293346, -136656, 139033, -53370, -213393, -144055, -78242, 279053, 461197, -1489, 73642, 173522, 75714, -15227, 91799, 6084, 51728, 182151, -72300, 165216, -86594, -101977, 6463, -119142, 60516, -16939, 76013, -9004, 102489, -6826, -184086, -53763, -10002, -265007, 96679, -60836, -145979, 348216, -144698, -24794, -194293, -63673, 97753, -71916, 292583, -82132, -503, 86669, -32710, -45906, -156672, 30260, 390511, -397360, 216147, -91459, -174248, -234131, 110866, 172783, -77090, 101272, -80959, 197070]
11702B31177D1092b85018A23417R7512d7540B50540a33003B67828a20090b5005
11691e4715j15785q8293A32784N6941f3496l7705B20894b10593j14459J08455
11681b16597M3010j05272A82557a35700B20643g7128B06218b02747A91977d768
11670A91894E2727K11441b75073A50135d5786A22516J49002G1954b58105B7928
11659b33591j36861B40377d5452A66584a3824o266C418b01997g1758B1044e7195
11647D1010b27273b1750A18575i1157J1366L5395F6582M23a637D2344a73777C42382
11634A03564C2770c28330G8979a4583r6744b9991k73034M7660D09054i6912A70215
11622b65374C1274J15832c77254A51500J02934E8804Q7798a68114B57422G0807
$$ y = [231177, 41092, -285018, 123417, 220929, -47540, 250540, -133003, 267828, -120090, -25005, -54715, -170500, -258793, 132784, 189725, -63496, -101201, 220894, -210593, -325052, -216597, -173587, -278859, 182557, -135700, 220643, -77128, 206218, -202747, 191977, -4768, 191894, 52727, 264168, -275073, 150135, -45786, 122516, 271518, 71954, -258105, 27928, -233591, -370452, 240377, -45452, 166584, -13824, -20090, 3418, -201997, -71758, 21044, -57195, 41010, -227273, -21750, 118575, -91157, -79791, -44396, 66582, 67005, -1637, 42344, -173777, 342382, 103564, 32770, -328330, 78979, -14583, -111327, -29991, -303025, -255365, 409054, -96912, 170215, -265374, 31274, 147106, -377254, 151500, 254434, 58804, 146602, -168114, 257422, 70807]
11611i6302G3397C3406O1760J31157H6582b10423A94066b3755A69000G522a52171
11599C5668f8161l4637D3965J11496a97198N0239I8038L6100A3904c37310B96441
11587a50049A40266h1466A64197d1868A73478j043J81457f8588F7773O3360K02636
11576C33769B7751J7583J1878a33806C72946g20A97319A8929J78783b67733A17361
11564A17443P2299d5818D09088A26766K08544A36136J9106m2134a3491k4742C07450
11552B03976e6295B08459a1528k3312E4033A9926Q3739M9581E0936O3436d7204
11540g3377D7292J8003J20158J66836r4272m5509a45439J9927C04883F4520J99988
11529B64508c4302A58191L5783r3108f2884A72786b0321k19911f7460G1823a07448
$$ y = [-96302, 73397, 33406, 95166, 226323, 86582, -210423, 194066, -23755, 169000, 7522, -152171, 35668, -68161, -102798, 43965, 155461, -197198, -146959, 98038, 134138, 13904, -337310, 296441, -150049, 140266, -81466, 164197, -41868, 173478, 172435, 353892, -68588, 67773, 131133, 333769, 27751, 45334, 57212, -133806, 372946, -720, 197319, 18929, 197712, -267733, 117361, 117443, 189742, -45818, 409088, 126766, 335310, 136136, 155242, 113108, -13491, -38233, 307450, 203976, -56295, 208459, -11528, -34840, 54033, 19926, 103665, 153246, 50936, 114372, -47204, -73377, 47292, 65295, 185453, 352289, 258017, 212508, -145439, -125512, 304883, 64520, 264508, -34302, 158191, 193974, 100866, -62884, 172786, -20321, -240232, -67460, 71823, -107448]
11517a52686k0304e8654A96696c08628B36346q4528J9562p1039a11053a3539j9737
11506c3276B20949J94052h7844A85345n8354J39453j15911N8438f9705E1149e7913
11494H9612M91P1235a61997A19465R6719G8683L65012g4326j05090B72671K2128
11483B94799D3049J48007J7512L64981a7757D5875k0161J8470J44110K0647J55002
11472C63943A12797O1115K40357B01407e8435B9512E047K55592A0285J70590I53
11460B25505D7112M78799f7235j6463D7896d682o7346E9097Q5107m7264B4465
11448c5941J091j92789B42127f9125a8710l10392A31706J88511G5494a01482H3335
11436A04694J0795f5914B80691r4866l1076J37029a49980c3724j5341A06518a29442
$$ y = [-152686, -172990, -58654, 196696, -308628, 236346, 151818, 171380, 100341, -111053, -13539, -33276, 220949, 415001, -87844, 185345, 126991, 266444, 150533, 208971, -69705, 51149, -57913, 89612, 90103, 161338, -161997, 119465, 216184, 78683, 443695, -74326, -179416, 272671, 294799, 43049, 191056, 208568, 573549, -17757, 45875, 25714, 44184, 188294, 208941, 363943, 112797, 173912, 414269, 201407, -58435, 29512, 5047, 260639, 10285, 180875, 953, 225505, 47112, 525911, -67235, -83698, 47896, -4682, -72028, 59097, 144204, 96940, 24465, -35941, -34850, -227639, 242127, -69125, -18710, -329102, 131706, 320217, 75494, -101482, 83335, 104694, 115489, -65914, 280691, 185825, 154749, 291778, -149980, -33724, -49065, 106518, -129442]
11424G4696a2023A32383n4172M0741h687o1072A0814a12152H2940b74805I3148
11412b5517j49974A05899c9344l183D2702b84512J37493a8954B01381e4999l57818
11401d12817D9259J44260C4899b69366a29187A63536a4408j39417B76353a54861
11390b45148b6071C8424d1139j63630c1937n7681k25226A3224f9994A05135b37980
11378a39294k45293A5971c9976q8886A72460p1202A1336K31854B10h8347j44035
11367b32382N4633A18760c1411E0681J28870D9988e4627A55685a6528m39541A21902
11355C27351b13612i4034o5080L8065a2985j16476A4637g8670j29979i5010j4993
11344a10003M5083j00007b8824j85623n6359i7056C051b5109l07917H9764a86163
$$ y = [74696, -12023, 132383, 78211, 118952, -8687, -69759, 10814, -112152, 82940, -274805, 93148, -25517, -175491, 105899, -39344, -42527, 42702, -284512, -147019, -18954, 201381, -54999, -412817, 49259, 193519, 34899, -269366, -129187, 163536, -14408, -153825, 276353, -154861, -245148, -26071, 38424, -41139, -204769, -31937, -89618, -314844, 13224, -69994, 105135, -237980, -139294, -384587, 15971, -39976, -128862, 172460, 101258, 11336, 243190, 210, -88347, -232382, -177749, 118760, -31411, 50681, 179551, 49988, -54627, 155685, -16528, -456069, 121902, 327351, -213612, -94034, -159114, -121049, -12985, -129461, 14637, -78670, -208649, -95010, -110003, -64920, -164927, -28824, -214447, -270806, -97056, 3051, -25109, -333026, 89764, -186163]
11332b40582R5802F8661k6804j7185b13578a04375A702b05923m7652A53219a06500
11320b10586B2629j28J34778b26295B01382k9863m2955L4878b46n4066F7702a39740
11307D4933b16425b5037j40683L720F9723a8071E7815f8478j37135b7943n6483
11296h4426l67912b23761A3036b5182F238J19233b9282k51267a09492p6046c3180
11284h5668d1560j91957B22464J77890A6503a08517j26810H7820g5195a2072j26480
11273a38552B69788b81937a36718F327c75950d4328K0862A93831a46969o2011
11263b08980a8826j6062A39588f616k1078h130B17017h6979F7557a98582A23153
11251G5142A4574N7405b03832j06149C8066h460j2379l8980H2293A8240a29635
$$ y = [-240582, -144780, 68661, 41857, 24672, -213578, -104375, 1702, -205923, -253575, 153219, -106500, -210586, 22629, 22501, 157279, -226295, 201382, 171519, 128564, 163442, -246, -54312, 67702, -139740, 44933, -216425, -25037, -165720, -162000, 69723, -18071, 57815, -68478, -205613, -27943, -84426, -452338, -223761, 13036, -25182, 6238, 125471, -29282, -280549, -109492, -185538, -33180, -85668, -41560, -233517, 222464, 400354, 16503, -108517, -235327, 87820, -75195, -12072, -138552, 269788, -281937, -136718, 6327, -375950, -44328, -23466, 193831, -146969, -208980, -18826, -34888, 139588, -6616, -27694, -8130, 217017, -86979, 67557, -198582, 123153, 75142, 14574, 71979, -203832, -309981, 38066, -8460, -20839, -59819, 82293, 18240, -129635]
11239b65642c8515C1432d18311f7274N499n8899k5341b8697k2359b2470B85583
11227A04507h6587G0159d9972j53930C0563M7136a29584q1367H5265C1677j535
11216C0142f3228j8330A17090i5576K5604A9253a58441A26308a18195A54612F9710
11204a79472n0800A34600p172a97293E7330h3031b9589C3894a60329G9415J87129
11193B66544d8983A11781a7700A31356H612a80273h776j86802P8289d8868m6215
11182i5083k86881a56232B54099B9010a8759o3420J6968E440c11413B50870a28884
11170h7959D6493a25129l6075c7653h676B03327a18517m0546M6669A52479M450
11159A56929l9581K13068a75489b9137k02407j32237J10949F4278J04499f2663
$$ y = [-265642, -38515, 31432, -418311, -67274, -61775, -120674, -146015, -28697, -51056, -22470, 285583, 104507, -86587, 70159, -49972, -203902, 30563, 77699, -129584, -210951, 85265, 31677, 30142, -63228, -81558, 117090, -95576, -69972, 19253, -158441, 126308, -118195, 154612, 69710, -179472, -230272, 134600, 127428, -197293, 57330, -83031, -29589, 33894, -160329, 79415, 266544, -48983, 111781, -17700, 131356, 8612, -180273, -8776, -195578, -117289, -48868, -95083, -381964, -156232, 254099, 29010, -18759, -82179, -65211, 5440, -311413, 250870, -128884, -87959, 46493, -125129, -161204, -37653, -8676, 203327, -118517, -159063, -112394, 152479, 156929, 117348, 330416, -175489, -29137, -231544, -363781, -252832, 64278, 168777, -62663]
11148D644a91360G7354c05280C42558f9600D02497A21247R770a76623l03841A05123
11136b67550a25089C34791e6923o1888o0668A40624N7625b11580g7858k8693a1513
11124C76225c62143H6256a4769A04731J25745G6093J8756D4052C920K09711b21027
11112I6739J87002m1445c559j06918A38028J13300r5349P5930g706H2625Q0297
11101A62922a80726h2253G5500b52A89262R1431l0265F0196J79661Q5234k5570
11090B99521a0672C11957A45614J05516a03303J9004C02365I2525N1392j7917
11080A26000J62443A34540J54345b3311A59267J22536N9707r0309m3927N5267
11070B62541n7972D5761K9355A7875c2633D92867H5162J06505R683K66704J49673
$$ y = [4644, -191360, 77354, -305280, 342558, -69600, 402497, 121247, 131017, -176623, -480464, 105123, -267550, -125089, 334791, -56923, -118811, -179479, 140624, 198249, -211580, -77858, -106551, -11513, 376225, -362143, 86256, -14769, 104731, 230476, 76093, 94849, 44052, 3920, 213631, -221027, 96739, 283741, 242296, -3559, -110477, 138028, 251328, 155979, 231909, -7706, 82625, 162922, -180726, -82253, 75500, -252, 189262, 280693, 250428, 60196, 239857, 325091, 299521, -10672, 311957, 145614, 251130, -103303, -84299, 302365, 92525, 143917, 126000, 288443, 134540, 288885, -23311, 159267, 281803, 341510, 251201, 207274, 262541, 204569, 45761, 75116, 17875, -32633, 492867, 85162, 191667, 201350, 468054, 617727]
11059F17727k96863n1768j0444r7722K73256J4970K19543p5175B89325J00740
11049C90065J08451J62054k14856N1736J54097J09242C77843L92197k29443J19155
11039F59752P9676k85446K51454O7476j5163K54952l24859r8475J46233N8066
11029G93666q966l16277J74750k34866Q0297J14759J932L01856k44390j90437
11019D72324L80695m16527L59202j03698o679J6816n2845q5976j35717o7848M71592
11008H31339B74398L25800r2190o1397M8616R5323k93212L40853n5757j12997
10998D69437J88602N3845B42880K39396p8700J3571K17765K6858P9717k17786
10988E23701L2746q615n8184O733j09372N37173k66424j2995N46548n88872L43442
$$ y = [617727, 320864, 269096, 258652, 160930, 434186, 449156, 668699, 593524, 289325, 390065, 498516, 660570, 445714, 497450, 651547, 760789, 377843, 770040, 540597, 659752, 739428, 453982, 705436, 772912, 757749, 1012701, 687842, 589367, 735600, 793666, 784700, 468423, 643173, 408307, 488604, 603363, 605295, 907151, 662761, 472324, 853019, 436492, 795694, 691996, 685317, 702133, 649288, 563312, 427595, 359747, 831339, 274398, 600198, 508008, 446611, 495227, 590550, 297338, 638191, 582434, 469437, 658039, 711884, 242880, 482276, 403576, 417147, 634912, 661770, 741487, 523701, 556447, 547832, 489648, 496381, 387009, 924182, 657758, 644763, 1191311, 602439, 945881]
10977I45881l4993m1887K01318o734J18931J6163L16250o7564J95301L22983L48133
10966B313782m1592j61149L61541K73893r5090n30555j47407k41835n9787J0811
10956A682612k22628J25645n5199j63772K64266k03998K32527m06262K43061k2988
10946A473264n79739K24901k03871l01338l0602a36041F08953A90707Q1555K19170
10936D91432q0929A51082C9282M27832k01150o4473H9450P738l3024M3414a19483
10924H0542J63757a05753B05075a00511q3179H0476J13202J19565f5087C6946
10913H1503k6481L5650h4394p8416B29723m6886R9674j38613J6299a29245A07821
10901C9344b57818b03H8165K93623j19857d5821E2803J38516a92545f9874A56471
$$ y = [945881, 910888, 869001, 1070319, 1063585, 1182516, 1198679, 1514929, 1447365, 1642666, 1965649, 2313782, 2272190, 2111041, 2472582, 2746475, 2651385, 2120830, 1973423, 1731588, 1671801, 1682612, 1459984, 1585629, 1530430, 1366658, 1630924, 1426926, 1659453, 1253191, 1496252, 1473264, 893525, 1118426, 914555, 613217, 582615, -136041, 608953, 190707, 272262, 491432, 410503, 151082, 39282, 467114, 265964, 201491, 89450, 97188, 64164, 107578, -119483, 80542, 244299, -105753, 205075, -100511, -183690, 80476, 193678, 313243, -65087, 36946, 81503, 55022, 90672, -84394, -162810, 229723, 182837, 282511, 143898, 160197, -129245, 107821, 39344, -257818, -203, 88165, 381788, 261931, -45821, 52803, 191319, -192545, -69874, 156471]
10889a16694J0405n8985k36336A31673b14219C16400E9111a03149B09006q2C0318
10877b77838a1057A6350b06868G9464g2789j49609e6031j00500r6244K3874j45181
10866c74082A58256D9607O9407g5235C44P5374B698c06713B8087i6044H1635b09451
10853b45655O4217m5947Q7874C23646g8391C74954k8609F077b14264H8767a92462
10841C69733a0639F0125h5484B81927b23783j50443F6139f4988A40681a2788j23290
10830a36078j01902g1627A31012P7528a5872j03846G4594j1234g7023A79608b09202
10818A00631J01719F3911K95435a82993A3764i8768j66610a13173J4302A43210
10807f8577A2422b1280E2232b0836j8996j61864g294k27367h5319C77985A7915
$$ y = [-116694, -106289, -165274, -401610, 131673, -214219, 316400, 59111, -103149, 209006, 208924, 30318, -277838, -11057, 16350, -206868, 79464, -72789, -222398, -56031, -156531, -252775, -228901, -374082, 158256, 49607, 119014, -75235, 344, 75718, 2698, -306713, 28087, -96044, 81635, -209451, -245655, -181438, -227385, -139511, 323646, -78391, 374954, 346345, 6077, -214264, 88767, -192462, 369733, -10639, 60125, -85484, 281927, -223783, -374226, 66139, -64988, 140681, -12788, -136078, -237980, -71627, 131012, 208540, -15872, -119718, 74594, 63360, -77023, 179608, -209202, 100631, 202350, 63911, 359346, -182993, 13764, -98768, -265378, -113173, -98871, 143210, -68577, 12422, -21280, 52232, -20836, -39832, -201696, -7294, -234661, -85319, 377985, 17915]
10795A30632a61550B95974d38546A10828a67143h0657A4600e8998r91q3597A84681
10783b9480j80094Q0885m5160I227N8234b57860j57735A61544Q0710b07118B66230
10771i9494A42151c1258D8505K21198K11339a26456B5374N2897J4849f4149G534
10759a4542A09288e2808r303q7858C52546a22434A68903E7728a41235A75228h6090
10747a18014I6342K2625a18716p9887Q2494j9193B06430a74632A96984c9540j70929
10736b10469A52708j8335a41358F3865K28000g5646b4039A8344b05115l1462l0033
10725b66610I2879c94073i0370F0175c34465g3045k0124j09976A09294a47592
10714C04337F3827M2981c78913J63652b1338j38688C9274a08358j95474M9743
$$ y = [130632, -161550, 295974, -438546, 110828, -167143, -80657, 14600, -58998, -59989, -143586, 184681, -29480, -209574, -128689, -173849, 9227, 67461, -257860, -415595, 161544, 242254, -207118, 266230, -99494, 142151, -31258, 48505, 269703, 481042, -126456, 25374, 78271, 93120, -64149, 7534, -14542, 109288, -52808, -62111, -149969, 352546, -122434, 168903, 57728, -141235, 175228, -86090, -118014, 96342, 118967, -118716, -198603, -116109, -135302, 206430, -174632, 196984, -39540, -210469, 152708, 134373, -141358, 63865, 291865, -75646, -24039, 18344, -205115, -236577, -266610, 92879, -394073, -90370, 60175, -334465, -73045, -93169, -203145, 109294, -147592, 304337, 63827, 106808, -378913, -215261, -21338, -160026, 39274, -108358, -303832, -254089]
10704b54089C65981C410a13583D1207J76880c31928f5474A6021b52213H7788c50753
10692D15772b62612A30092a40760F6136J32931h8346q4911j40051A9828b32561
10681B00115H668J73389A271a32110A90954O5196J18733D4300g5624k19096B6484
10669H1586b83703a09913o3566o8346A49738c01572A3546K37521h9515A48159
10658B6299Q1347a98444e308j4967k02991A00385b24233A70115o1463a44792j4264
10647a59056q9080A70200J61245a0250j32666k64565J84515G9703a72254Q3759
10637h8495J3544B8895a22990k81927Q1821c5920A99270a50835k728g5251n3721
10626a28972D2440J79868A9612J20444p957g4483B83005C9429a73786N0469A16712
$$ y = [-254089, 365981, 3410, -113583, 41207, 218087, -331928, -65474, 16021, -252213, 87788, -350753, 415772, -262612, 130092, -140760, 66136, 199067, -88346, -173257, -313308, 19828, -232561, 200115, 8668, 182057, 1271, -132110, 190954, 256150, 374883, 44300, -75624, -294720, 26484, 81586, -283703, -109913, -173479, -241825, 149738, -301572, 13546, 251067, -89515, 148159, 26299, 107646, -198444, -5308, -20275, -223266, 100385, -224233, 170115, 108652, -144792, -159056, -248136, 170200, 331445, -10250, -142916, -407481, -222966, 79703, -172254, -88495, -74951, 28895, -122990, -404917, -323096, -35920, 199270, -150835, -153563, -75251, -128972, 42440, 222308, 19612, 140056, 132099, -74483, 283005, 39429, -173786, -123317, 116712]
10614a49336i383D04821j97768o8136e6473A00279h5481J9806j47734K3722k6534
10603b16221R0804k55514f9700A1344J9180J50038C3231R0747h9279A22972b69550
10591b76786i3203H297h5743k42389J27752A81550D7343a3002k19605J05094M3171
10580h4342k99335B11360D7984a45063A79430a54105E4657c9773A08654m8766
10570E9888J22519C5273f0585E5947b14150P0854e2491a8727F3857a10161j3471
10559a23632A12088n2852a39007d4587j03674L2499j03435C2408c8917o3798j711
10548a04426N240B18236e8400k0491K1093p7122b0518l3576e160A28263j3902
10537A14361N1892a40553a2882k00079r209L1198A07672J144g3233I2940d77709
$$ y = [-149336, -9383, 404821, 207053, 138917, -56473, 100279, -85481, -65675, -213409, -189687, -216221, -125417, -380931, -69700, 11344, 30524, 180562, 33231, 123978, -89279, 122972, -269550, -276786, -93203, 8297, -85743, -328132, -200380, 181550, 47343, -13002, -232607, -127513, -84342, -383677, 211360, 47984, -145063, 179430, -154105, 54657, -39773, 108654, 59888, 182407, 35273, -60585, 55947, -214150, -143296, -52491, -18727, 63857, -110161, -123632, 112088, 59236, -139007, -44587, -148261, -115762, -219197, 32408, -38917, -102715, -104426, -99186, 218236, -58400, -78891, -57798, -134920, -20518, -54094, -5160, 128263, 114361, 166253, -140553, -12882, -212961, -222170, -190972, 107672, 108816, -73233, 92940, -477709]
10525A66173a78543O6579m4201p1065A2426b12910f6894r0735N6776A9081L9869
10514E8950c94663a56395A0014Q1777i9946j65578d6674B32561c0676j71102G3146
10502B57622g797A2710a57575m6194D5576a11900A70660l9286a39622C8753P9551
10491A18304O8681A0669K99895a06171L6016g558j70092A41266h9099A34794a09110
10479B7106a67075A15282d08743F0541K88875A62640M2266K44500A12700K46584
10469C59284j04547A7566b20125h3332L3200A6767L6802G820b431A20200P6924
10458A97124d7298j21842q5653j40A80981n0718a61699C8293a82620L8834k52807
10447c96593q6431i4836d3399n1242j02116A9014h2506A59845D5866G64b72648
$$ y = [166173, -178543, -111964, -156165, -227230, 12426, -212910, -66894, -157629, -100853, 19081, 58950, -394663, -156395, 10014, 91791, -99946, -265524, -46674, 232561, -30676, -201778, 73146, 257622, -7797, 12710, -157575, -203769, 45576, -111900, 170660, 131374, -139622, 38753, 118304, 186985, 10669, 310564, -106171, -70155, -7558, -177650, 141266, -89099, 134794, -109110, 27106, -167075, 115282, -408743, 60541, 349416, 162640, 204906, 449406, 112700, 359284, 254737, 17566, -220125, -83332, -50132, 16767, 53569, 7820, -2431, 120200, 197124, -47298, -169140, -254793, -254933, 180981, 130263, -161699, 38293, -182620, -143786, -396593, -483024, -94836, -43399, -94641, -196757, 19014, -82506, 159845, 45866, 764, -272648]
10435c3617A39917h197p430C00606a46797L4272l4512r2124q5154A32394h4455
10423A71477B8002J25387N4425A4290L45961A9332b0402A4488R3882a37707A2871
10411b91048N6876B04527Q004a58300j71389A6729K99819a85166J244M8895b8964
10399a57796M6304A48387f7077k33506J5833a03260l1541A45015k9995J61975
10389B76995b70994B94820d6843K1781n9720B42671I9696a61780A3702a88677
10378a70367A17792n8727b509l86794i0317G1195l4511L00793a19745F49285a59713
10366E16226A15865K11615r0255m0124L05448k4112j06568a90970C39825C7901
10355C84774f2694B94400p1988m3509N1644a13396B35578M53776k73338J58011
$$ y = [-33617, 139917, -8197, -15627, 300606, -146797, -112525, -147037, -239161, -324315, 132394, -84455, 171477, 28002, 153389, 207814, 14290, 360251, 19332, -20402, 14488, 108370, -137707, 12871, -291048, -234172, 204527, 212531, -158300, -329689, 16729, 316548, -185166, -183922, -135027, -28964, -157796, -111492, 148387, -67077, -300583, -284750, -103260, -134801, 145015, 115020, 276995, -270994, 294820, -46843, -25062, -84782, 242671, 99696, -161780, 13702, -188677, -170367, 117792, 59065, -2509, -389303, -90317, 71195, 36684, 337477, -119745, 649285, -159713, 516226, 115865, 327480, 237225, 197101, 502549, 478437, 371869, -190970, 339825, 37901, 384774, -62694, 294400, 222412, 178903, 230547, -113396, 235578, 689354, 416016, 574027]
10345E74027N7070B74078j24756O0723a59326B99474j21683n1007J60788I2970
10334C19470A30355E6063M03538A08068a16180H6301L51998F0639b550p4300A84922
10322b1381j37969H4782c0268j70979a8750G9576K67112D312Q9483k677K84281
10311C75399J8818J26274a60830M5760I0151a24362o4259E21318E0783b15632
10300f9107c3846l3106O050B98112c4533A81427a30998m5742a0823I6440P9927
10289A76367g403b78p6926B19865E936R9291i6599A73425a75290A69294b17916
10277A17210Q7088b09126N3690M1828O887L254K2530B18693k5470B5811Q2588
10266A08399P7306L4912f2062p9307j6109H5776a6371C79796A88078c22163A01856
$$ y = [574027, 631097, 274078, 149322, 210045, -159326, 299474, 177791, 126784, 287572, 92970, 319470, 130355, 56063, 459601, 108068, -116180, 86301, 438299, 60639, -2550, -76850, 184922, -21381, -159350, 84782, -30268, -201247, -18750, 79576, 346688, 4312, 93795, 91118, 375399, 394217, 520491, -160830, -115070, 90151, -124362, -188621, 521318, 50783, -215632, -69107, -33846, -66952, -60902, 298112, -34533, 181427, -130998, -176740, -10823, 96440, 176367, -7403, -278, -77204, 219865, 5936, 105227, -96599, 173425, -175290, 169294, -217916, 117210, 204298, -209126, -155436, -113608, -106721, -103467, -80937, 218693, 193223, 25811, 108399, 185705, 220617, -62062, -141369, -157478, 85776, -16371, 379796, 188078, -322163, 101856]
10254A8962J00708p813a31925B70660L21232k58815F6430J65736a54964C92639
10243a8121A76760A2415a1849C3137a43522A62360P3671b53221i6016E4823a49986
10231c9765I0364l5733M35127A3775K86019b18694F1538K0710a69222b1170A38049
10219a69536e8758E6765a30441j26471B9962b33370j39261d8190k18617K004J27150
10208a37653A3799Q2655d24531G1087b38432d1593A34947a80121M2991O3801l40992
10197d14321d1714I0214b2048C98496a05421J1039k156j52667C23843A12485a16544
10185E0024Q854h1632A3210e6710B53892h7917k66987J16284e485j83833k6272
10174b15590D37684F9172a48167M1064l23344C9670a34975M2146G5273h0521k67499
$$ y = [18962, 119670, 111857, -131925, 270660, 591892, 333077, 66430, 232166, -154964, 392639, -18121, 176760, 12415, -11849, 33137, -143522, 162360, 236031, -253221, -96016, 54823, -149986, -39765, 90364, 54631, 489758, 13775, 299794, -218694, 61538, 82248, -169222, -21170, 138049, -169536, -58758, 56765, -130441, -256912, 29962, -233370, -372631, -48190, -266807, -264803, -137653, 13799, 96454, -424531, 71087, -238432, -41593, 134947, -180121, -137130, -73329, -414321, -41714, 90214, -22048, 398496, -105421, -94382, -96538, -249205, 323843, 112485, -116544, 50024, 58878, -81632, 13210, -56710, 253892, -87917, -354904, -238620, -5485, -189318, -215590, 437684, 69172, -148167, -107103, -430447, 39670, -134975, -92829, 75273, -80521, -348020]
10163c48020g5898k83999F3690c26508f9765p1286R019L749k5432G0129b21637
10151a63161O6267L2367m7393B6232J9236a90619J4045b7398I0038b88332a30538
10139c18664A58167b32422k18204A2080g1607k64213J6734q9041G4305i1531c7481
10127c02054O8735A42260C4143a46867E4285J39473b10572i6955E6049b78326
10116A13750A2495a55719j5178C40938d31561f9812j72246J15154e5670j03834
10106a59504B37J55692D0079N9947a9632k47613a5749A6728e00328B21470A04055
10094a05404j62526R8929B28995q610b22800g4442A93217b34018e4199l8139D8640
10082e6313k1858j31576C05986C8293R4912i948n2638m05907b00583C44827d5045
$$ y = [-348020, -75898, -359897, 63690, -326508, -69765, -141051, -132032, -128283, -153715, 70129, -221637, -163161, -96894, -64527, -111920, 26232, 45468, -190619, -176574, -27398, 90038, -288332, -130538, -318664, 158167, -232422, -450626, 12080, -71607, -335820, -319086, -408127, 74305, -91531, -37481, -302054, -233319, 142260, 34143, -146867, 54285, 193758, -210572, -96955, 56049, -278326, 113750, 12495, -155719, -170897, 340938, -431561, -69812, -242058, -126904, -55670, -159504, 237, 155929, 40079, 100026, -19632, -267245, -15749, 16728, -500328, 221470, 104055, -105404, -267930, -169001, 228995, 220385, -222800, -74442, 193217, -234018, -54199, -92338, 48640, -56313, -78171, -209747, 305986, 38293, 133205, -9948, -62586, -468493, -200583, 344827, -45045]
10070d74871C60841j65502i7415B1707b87839j04960c9495C28197f3057E6689
10059c73320O096a22104a4139j0654J239l4317j18111a7215B17564a64402b7702
10047a19887E7843h7570p6279a5969j75592g1949A54596b26270H8379h9080A29696
10035b8696j42036F9954h9226C3221b67392A34458j9485a30559n4454g51j19692
10024a20443B38568o3973b13266b9359A64449e5548j45673Q4891k01622F615a11409
10012e5374j28169r8822Q7841C5381b74332C1152a34579e1452A00292b39415P4863
10001a64552A19440h4359m59392b25907D0933c98775C11339e5440q7914N4167
9991h9187l61425B39963a89600G8319k6999c33428J00260J11622I5568L6296a48726
$$ y = [-474871, 360841, 195339, -97415, 21707, -287839, -392799, -39495, 328197, -63057, 56689, -373320, -367224, -122104, -14139, -24793, -23554, -57871, -175982, -17215, 217564, -164402, -27702, -119887, 57843, -87570, -163849, -15969, -191561, -71949, 154596, -226270, 88379, -89080, 129696, -28696, -170732, 69954, -89226, 33221, -267392, 134458, 114973, -130559, -185013, -751, -120443, 238568, 174595, -213266, -29359, 164449, -55548, -201221, -116330, -317952, 6615, -111409, -55374, -183543, -282365, -194524, 35381, -274332, 31152, -134579, -51452, 100292, -239415, -164552, 119440, -84359, -543751, -225907, 40933, -398775, 311339, -55440, -143354, -89187, -450612, 239963, -189600, 78319, 51320, -333428, -233168, -121546, 95568, 131864, -148726]
9979f1659H0658b40850k00648D2594g1458B00607b16507C7879d22330N8096E2485
9967a9269q8251j15154b0752A84019D9469b8103k56275B09212c22675E5774b56362
9955I821b80930g5272A97751a7988j22911a3727A0860K6363J37442A6976c2586
9943B60495I196c67652K1507A27945O1968a38317A57555E7199b34942B0180a44733
9931C7823c45652d9761J2009A8752b25274J3418H3438g4224K9186E2043J43228
9920A95271R0240c46050h5846F1342b31708K9057k6005h9218H0394c4753j35149
9909a69902P9363l36307A1967e8454Q589A83901n2599a13743A4490b48757A55324
9897b38800G1097K37617a85548g2837a0338n6204A95854J74807A16797a64393
$$ y = [-61659, 80658, -240850, -441498, 42594, -71458, 200607, -216507, 37879, -422330, -364234, 52485, -19269, -107520, -222674, -20752, 184019, 49469, -28103, -284378, 209212, -322675, 55774, -256362, 9821, -280930, -75272, 197751, -17988, -140899, -13727, 10860, 37223, 174665, 16976, -32586, 260495, 9196, -367652, -346145, 127945, 189913, -138317, 157555, 57199, -234942, 20180, -144733, 37823, -345652, -49761, -37752, 18752, -225274, -211856, 83438, -74224, -45038, 52043, 195271, 285511, -346050, -85846, 61342, -231708, -202651, -228656, -89218, 80394, -34753, -169902, -90539, -426846, 11967, -58454, -49865, 183901, 131302, -113743, 14490, -248757, 155324, -238800, 71097, 308714, -185548, -72837, -10338, -66542, 195854, 370661, 116797, -164393]
9886B883Q146a35672l0182B7360g7975B56693b77417f9607k27436a01133N249
9875i5884D16507a71179d0131B1938a09754C016P7893a69573k9570j20290a25131
9863b03170g8082B61164m0693a09372m6601I6696b88037a41123a2093l6447m3844
9852i2384H3399b02830a9120j52395e2861k96387g6306e435A25059N3628b76925
9840I633b5659k93045f3107k6757k81968G7042a25653k00363k86869b18085b7696
9828I5907b42518j66013a24453c4636k08881P7757B244b33081p2866E4808O9144
9817A23952b53152J02536O6495j64790K8928l2836R2524k31187A31068c4643A04436
9805b22072F5066a93414g0730D40256b43828g2065a8026r7814j24823d9294E052
$$ y = [2883, 11029, -135672, -165854, 27360, -77975, 256693, -277417, -69607, -297043, -101133, -95884, 416507, -171179, -40131, 21938, -109754, 3016, 80909, -169573, -199143, -319433, -125131, -203170, -78082, 261164, 220471, -109372, -155973, 96696, -288037, -141123, -12093, -48540, -92384, 83399, -202830, -19120, -171515, -52861, -349248, -76306, -5435, 125059, 178687, -276925, 9633, -25659, -318704, -63107, -89864, -371832, 77042, -125653, -326016, -612885, -218085, -27696, 95907, -242518, -408531, -124453, -34636, -243517, -165760, 2244, -233081, -305947, 54808, 123952, -253152, -150616, -84121, -248911, -219983, -252819, -160295, -391482, 131068, -34643, 104436, -222072, 65066, -193414, -70730, 440256, -243828, -72065, -18026, -115840, -240663, -49294, 5052]
9793F1572i6034K4013q6901A94145a69131H9112C8274h1400r9854j75720J42253
9782b14721j18206J21387f8407K6866i42k02018H9026C9611a27290j00874c1782
9770c8802F396a61556D7099J66905m116J50715c64877a19815d3740A75193a21263
9758a73936r8024A18789a71684k82607J78102o2041I2231e6380k55767A08323
9747a33043d727A46164d13544e1296k18350i3921b5441n2691J8486a2183B08069
9735A08602b55810a4946l25896B08455N2424j30233i7180l7951A20864a85520
9724A00846a67318E2292b43449A46148a86370A6314b97479E4181c46876c4298
9713d393A16387b05910B41954c387j42557R118N2789l3687E6183J12360B2280
$$ y = [61572, -96034, -72021, -158922, 194145, -169131, 89112, 38274, -81400, -181254, -356974, -214721, -332927, -211540, -68407, -41541, -942, -202960, 89026, 39611, -127290, -228164, -31782, -38802, 6396, -161556, 47099, 214004, 209888, 360603, -364877, -119815, -43740, 175193, -121263, -173936, -271960, 118789, -171684, -454291, -276189, -338230, 92231, -56380, -312147, 108323, -133043, -4727, 146164, -413544, -51296, -269646, -93921, -25441, -78132, -59646, -12183, 208069, 108602, -255810, -14946, -340842, 208455, 260879, 130646, -97180, -135131, 120864, -185520, 100846, -167318, 52292, -243449, 146148, -186370, 16314, -297479, 54181, -346876, -34298, -4393, 116387, -205910, 241954, -3387, -145944, -136826, -84037, -117724, 56183, 168543, 22280]
9701b88111A43678a47023p9794J08265n6970a8973E4610a78452i033o3443k59719
9690c32195a1663j13881A44716l126D7863k2605a39201r2115I7058i5651p4248
9679a69899h0679c6989l37492f0044B58327A18289h7970A12902J73137A09664
9668A35724B5949a71877j18323a364k61080i9350B05972a3563A39440C714c0008
9656f1081l4269c6801k03484N0377a8319k6221l112F0746h8899l15634B6717i9918
9643f849m7482j28725K3781C5930b9057n7624A13524a45327I2208b14941A04256
9631b04716A27492K9580C6553J3460b28244c809n1788K3537j09311B17836c60933
9619G4295g7879I1354a21036p1578I8243g3329k75496A45644J95872C4762J78783
$$ y = [-288111, 143678, -147023, -226817, -118552, -175522, -18973, 54610, -178452, -9033, -72476, -332195, -11663, -125544, 144716, 141590, 47863, 25258, -139201, -231316, 97058, -95651, -169899, -80679, -36989, -374481, -60044, 258327, 118289, -87970, 112902, 286039, 109664, 135724, 25949, -171877, -290200, -1364, -262444, -99350, 205972, -13563, 139440, 3714, -30008, -61081, -95350, -36801, -240285, -189908, -18319, -44540, -47652, 60746, -88899, -404533, 26717, -99918, -6849, -54331, -183056, -159275, 35930, -29057, -86681, 113524, -145327, 92208, -214941, 104256, -204716, 127492, 157072, 36553, 50013, -228244, -3809, -55597, -32060, -141371, 217836, -360933, 74295, -77879, 91354, -121036, -192614, 98243, -73329, -348825, 145644, 341516, 34762, 213545]
9608B13545c9494j64137a5054j21923j15374c0128A16909e03012g9484o8744a2560
9596a6972L394A6811g2496k66670J16600j05958a28981j81024B088f7130j51535
9585b18665B78381a89565n7067H019a31084B56856a87588B09084c28372g881q7854
9574i5735E8548b55557a21978j73626F3365J24064B6010N1802R6534a74742a2217
9562c08818h0604k3936j55072i7821d5100G9897b53295C1269J33480N4240a42211
9550B48678d0868J8391n9476A07106J17751c67790a66261f2412D3045i9428j82170
9539b81598E4377Q621a77230B18454a0030n4778k15009k86179B53285F5909e134
9527b76265f5613I573b49851B09259F0720e299j80344B29646b09978g5362E54338
$$ y = [213545, -39494, -203631, -15054, -136977, -252351, -30128, 116909, -503012, -79484, -148228, -12560, -16972, -13578, 16811, -72496, -339166, -222566, -328524, -128981, -310005, 2088, -67130, -218665, 278381, -189565, -246632, 8019, -131084, 256856, -187588, 209084, -328372, -7881, -95735, 58548, -255557, -121978, -295604, 63365, 187429, 26010, 77812, 174346, -174742, -12217, -308818, -80604, -104540, -259612, -97821, -45100, 79897, -253295, 31269, 164749, 218989, -142211, 248678, -40868, -22477, -81953, 107106, 224857, -367790, -166261, -62412, 43045, -99428, -281598, 54377, 62998, -177230, 218454, -10030, -64808, -279817, -565996, 253285, 65909, -5134, -276265, -65613, 9573, -249851, 209259, 60720, -5299, -185643, 229646, -209978, -75362, 554338]
9515B41472e1844B93176a96377B0138P0422b21963G380J8243K33759a59092A58672
9503i6226n138e082A02653i6470A07927a17185N3836J1308A45098g3903A33057
9491I555a35385c5936n2074A9827a82549j75174i9447B58046I5387b38522J18916
9480a19606n7899K783k9668O4359c7354l1267F1623R3707a10264o8006A37871
9468b14468b7863A99554K22071b91486N3357j04143Q1664F4894e7735q4544A89322
9456b12069j28210J55610N925j16892i8763D5375l047a69006d7633i925n5456
9445f5381r8620a7381B44283B3602J9563J40754a16204F0463B770b34345B5888
9433c48542J01463N6472g3843j55901B11138a85293j01812a8671A05759D9643
$$ y = [241472, -51844, 293176, -196377, 20138, 90560, -221963, 7380, 25623, 259382, -159092, 158672, -96226, -101364, -5082, 102653, -96470, 107927, -117185, -63349, -52041, 145098, -73903, 133057, 9555, -135385, -35936, -88010, 19827, -182549, -357723, -99447, 258046, 95387, -238522, -119606, -177505, -174722, -204390, -140031, -37354, -68621, 61623, 155330, -110264, -178270, 137871, -214468, -27863, 199554, 421625, -291486, -238129, -342272, -260608, 64894, -57735, -142279, 189322, -212069, -340279, -184669, -178744, -295636, -98763, 45375, 42328, -169006, -47633, -9925, -65381, -164001, -17381, 244283, 23602, 43165, 183919, -116204, 60463, 2770, -234345, 25888, -348542, -247079, -190607, -73843, -229744, 211138, -185293, -287105, -18671, 105759, 49643]
9422e2250D8629b7982C8179f8040A04767N6388N9060c5973o3050b5873B9483b34082
9409b56844N9792r2561B77043j16270E2831a4638j07763A07239N4593a96655k16138
9398d12793A27316f757j01117e0618A25634h8950j3976m0719f9414B3025g3166
9386A65717a48366d2268k0762p5638c3378A63692k7702C6955b23588N3979j44697
9375c14306F3189c69835A16255f8403C444h6979j3258G9302i5654a2989H6236
9363d2449F8646b84525I7448R230R4970C2366b33993G0960K3725L506F254A506
9350a31991b8587F8614L3281a49986a4922B26746b52616J21028e823C717d8481
9338b08202a3767j84827n497r6030a5689j18211d0101o4601q1446d4967c731j40547
$$ y = [-52250, 48629, -27982, 38179, -68040, 104767, 161155, 220215, -35973, -99023, -25873, 29483, -234082, -256844, -197052, -289613, 277043, 160773, 52831, -14638, -122401, 107239, 161832, -196655, -412793, 127316, -6757, -107874, -50618, 125634, -88950, -102926, -143645, -69414, 23025, -73166, 165717, -148366, -42268, -63030, -138668, -33378, 163692, 135990, 36955, -223588, -169609, -314306, 63189, -369835, 116255, -68403, 3444, -86979, -100237, 79302, -95654, -12989, 86236, -42449, 68646, -284525, 97448, 106678, 201648, 32366, -233993, 70960, 94685, 98191, 6254, 1506, -131991, -28587, 68614, 101895, -149986, -14922, 226746, -252616, -131588, -5823, 3717, -48481, -208202, -13767, -198594, -204091, -300121, -15689, -133900, -40101, -104702, -186148, -44967, -3731, -144278]
9326a44278p6531d9028n9635M347M8893j2561A06141k2477b20136N983F6062a61925
9313A49858d55730a29918H4479B5732K2977d349m21972D53722j34226d15246a38952
9301b05984e5095o999E2434e8895k39668a23631A14514b97281l3426f3213A01732
9289b57706J8315j01352j60503b32254j13089B4960d69602A15646E6724J72672
9279B29396B5455f0082A24350c8924k51192a3734B16388I9471a25254M1860A38887
9267b62121a4428A72705f5126a8412j89813a7919m3062j9176j69114A20021a8973
9255A9227c9664G7513b8476k05180L6040k1457P7866b8289A32936b8378p1953
9244a00331B96291e1443c727k286C24414B2813K27139b12905m26904b57501C2387
$$ y = [-144278, -220809, -49028, -108663, -104316, -55423, -67984, 106141, 83664, -220136, -214153, 66062, -161925, 149858, -455730, -129918, 84479, 25732, 48709, -4349, -426321, 453722, 319496, -415246, -138952, -205984, -55095, -62094, 52434, -58895, -298563, -123631, 114514, -297281, -330707, -63213, 101732, -257706, -239391, -340743, -501246, -232254, -345343, 24960, -469602, 115646, 56724, 229396, 25455, -60082, 124350, -38924, -290116, -13734, 216388, 99471, -125254, -83394, 138887, -262121, -14428, 172705, -65126, -18412, -208225, -17919, -60981, -80157, -249271, 120021, -18973, 19227, -39664, 77513, -28476, -233656, -197616, -219073, -141207, -28289, 132936, -28378, -100331, 296291, -51443, -3727, -6013, 324414, 22813, 249952, -212905, -639809, -257501, 32387]
9232a23105F694K47480a09658c3213k8252A08687J29520i3364A36555b9959k37024
9221b66983B5859g6944J1955A64288a34383I6855J88812A31020o2272J77043D6319
9209c13908A24374a43019j45420Q5759e4209B7749a0082A71210f6497j12810b4454
9197i2297j0900D9310a04896B47995c7579k66950G1300B2489c49647A511a68205
9185h529A08711a80737l4992d4247l9630D04766e7438b7827k19207A5146a21428
9173C8247a70967J249D0751a02878K8345m6260H9904b60834F1563d6160k04097
9162b50257i4158j86204A62519c18278e288j95188g9479j87795N2432o4398a0755
9150a05110L359h212j8608j75235k98520a01983k8102k2981d2068r8735A51150
$$ y = [-123105, 6694, 254174, -109658, -33213, -61465, 108687, 238207, -93364, 136555, -29959, -266983, 25859, -76944, -64989, 164288, -134383, 96855, 285667, 131020, 68748, 245791, 46319, -313908, 124374, -143019, -288439, -202680, -54209, 27749, -10082, 171210, -66497, -179307, -24454, -92297, -103197, 49310, -104896, 247995, -37579, -304529, 71300, 22489, -349647, 1511, -168205, -8529, 108711, -180737, -215729, -44247, -83877, 404766, -57438, -27827, -247034, 15146, -121428, 38247, -170967, -169718, 40751, -102878, -74533, -120793, 89904, -260834, 61563, -46160, -250257, -94158, -280362, 162519, -318278, -5288, -200476, -79479, -267274, -214842, -279240, -10755, -105110, -101751, -8212, -26820, -202055, -500575, -101983, -130085, -153066, -42068, -140803, 151150]
9138A30425h1427I5787a47316j07136j71102B84979c92697d9970j55805A7557
9127F068a33325H5780a77902a0977k50605J3415i2154j29506E3554p894a26193
9115a28821A21933n7132B7541Q5165a89895B71021G0419a21661n614j94740I6097
9103a73789k0938A71517a24393q2573A48504C7417A1316b54828a26485O0924J5580
9092d9981l08A8663b00871H1769a73536o5655f4604o1940m6905k19671D0013d5491
9079b34827C25337e0282j12915j39016c5860k83356G7349g2341q4408M4668c206
9067A09564c48496H7202i0367l22354A44400e423k52003e571l03665H4323a52077
9055a12751C21185a90539A6851K3140J8800K88577A11428e47316b31856k0434
$$ y = [130425, -81427, 95787, -147316, -254452, -425554, 284979, -392697, -49970, -205775, 17557, 6068, -133325, 85780, -177902, -10977, -261582, -248167, -92154, -221660, 53554, 45660, -126193, -128821, 121933, 64801, 27541, 112706, -189895, 271021, 70419, -121661, -127275, -322015, 96097, -173789, -194727, 171517, -124393, -206966, 148504, 37417, 11316, -254828, -126485, -65561, -49981, -50289, 18663, -200871, 81769, -173536, -239191, -64604, -126544, -173449, -393120, 40013, -45491, -234827, 325337, -50282, -163197, -302213, -35860, -319216, 77349, -72341, -156749, -112081, -3206, 109564, -348496, 87202, -90367, -412721, 144400, -5423, -257426, -5571, -309236, 84323, -152077, -112751, 321185, -190539, 16851, 39991, 58791, 347368, 111428, -547316, -231856, -252290]
9045b52290J09374B16330r1700E1191J82439b18275A7040a83632c2796l34A03170
9033H9321I407K99565d29060a12456A29746g8697E712b41517H5091C5799a23020
9021A74659K0546r2853J6297a02304B50976h7232j20209M0847B17761f3889a0383
9009A4706K6683K25648C9664a18069C2089i2687p4062O5936n8628k34756A70872
8997B49233G6625a39645I6469Q934d18216F4937J26518a92632g1234k90705J14720
8986b47219d6076p7768L6376j74193g964H3831a69988F861K93215b9510p2550
8975a02060p5520A46048a13392B46784a74456m3937J5494N1854b9559l032r3741
8964a26332b8110f426A26248B319J10922B2562H132L02411k8121A02627a18235
$$ y = [-252290, -142916, 216330, 124630, 51191, 233630, -218275, 17040, -183632, -32796, -33130, 103170, 89321, 9407, 308972, -429060, -112456, 129746, -78697, 5712, -241517, 85091, 35799, -123020, 174659, 195205, 102352, 118649, -102304, 250976, -87232, -207441, -166594, 217761, -63889, -10383, 14706, 41389, 267037, 39664, -118069, 32089, -92687, -166749, -100813, -159441, -394197, 170872, 249233, 76625, -139645, 96469, 105403, -418216, 64937, 191455, -192632, -71234, -361939, -247219, -46076, -123844, -87468, -261661, -7964, 83831, -169988, 6861, 300076, -29510, -102060, -177580, 146048, -113392, 246784, -174456, -218393, -202899, -151045, -29559, -32591, -126332, -28110, -6426, 126248, 2319, 113241, 22562, 8132, 310543, 282422, 102627, -118235]
8952d885m3071A05996k6950l8811a74906C34419c2735r8994a0680j89697p6786
8941b77163J25940k5694B60360c99984A20567D097a92396G322J81093b38524f1692
8929b6991j60142C676J26331P460M17a82283A20554C8954O4056e1369D79395O54135
8917A133530n03244k64383N0150c2253A02946A5054a95115j44126g4309B4391
8906c2327A8380a7884p5815j74444N0979B73897d56849D9081c34984a56719i795
8894a72419C43686g4434J8150j35371j27558a06105d5222p4892G7688d49273A03831
8882a01679I4555K556d0272A24897c08708A10137b31321A76825R5529j5634b74068
8870F2440R5074h2301A0664J54130F5068K42621J4451h5851A6550K89833a0141
$$ y = [-4885, -47956, 105996, 79046, 40235, -174906, 334419, -32735, -131729, -10680, -200377, -277163, -151223, -176917, 260360, -399984, 120567, 4097, -192396, 7322, 188415, -238524, -61692, -26991, -187133, 3676, 130007, 137467, 137884, -182283, 120554, 38954, 103010, -51369, 479395, 1133530, 630286, 365903, 416053, -32253, 102946, 15054, -195115, -339241, -74309, 24391, -32327, 18380, -17884, -93699, -268143, -217164, 273897, -456849, 49081, -334984, -156719, -9795, -172419, 343686, -74434, -56284, -191655, -319213, -106105, -45222, -120114, 77688, -449273, 103831, -101679, 94555, 97111, -40272, 124897, -308708, 110137, -231321, 176825, 272354, 256720, -274068, 62440, 157514, -82301, 10664, 164794, 65068, 307689, 322140, -85851, 16550, 306383, -10141]
8858e2618D788c3013k00471O5215d3764q334A68023a8796A0782N4842J51191r2099
8846A24716b11872B12381c30364a22483B0993d61722a14781B45415a5001F7953
8835E282h1551n2650k30453J76886A12411b9918r9665O1949l82013A92512p1748
8824A20764a97296B90744b9957C27050d6318k78607a39644L4480k2109K5627k1447
$$ y = [-52618, 4788, -33013, -233484, -168269, -43764, -52098, 168023, -18796, 10782, 65624, 216815, 124716, -211872, 212381, -330364, -122483, 20993, -461722, -114781, 245415, -15001, 67953, 5282, -81551, -134201, -364654, -187768, 112411, -29918, -129583, -67634, -449647, 192512, 120764, -197296, 290744, -29957, 327050, -46318, -324925, -139644, -105164, -127273, -101646, -123093]
$$ [...]
##END NTUPLES=NMR SPECTRUM
##END=
