##TITLE=NES1009_842410_9233004_osP6W4uPZL
##JCAMPDX= 6.0         $$ Bruker NMR JCAMP-DX V2.0
##DATA TYPE= NMR SPECTRUM
##DATA CLASS= NTUPLES
##ORIGIN= BRUKER
##OWNER= Administrator
$$ 1.72 TOPSPIN		Version 2.1
$$ 2015-07-02 03:02:44.727 -0700  Administrator@X
$$ Compression mode = diff/dup
##.OBSERVE FREQUENCY= 400.02188249412
##.OBSERVE NUCLEUS= ^1H
##.ACQUISITION MODE= SIMULTANEOUS (DQD)
##.ACQUISITION SCHEME= undefined
##.AVERAGES= 64
##.DIGITISER RES= 22
##SPECTROMETER/DATA SYSTEM= spect
##.PULSE SEQUENCE= noesygpps1d.comp
##.SOLVENT NAME= COFFEE_meoh
##.SHIFT REFERENCE= INTERNAL, COFFEE_meoh, 1, 14.9632
##AUDIT TRAIL= $$ (NUMBER, WHEN, WHO, WHERE, PROCESS, VERSION, WHAT)
$$ ##TITLE= Audit trail, TOPSPIN		Version 2.1
$$ ##JCAMPDX= 5.01
$$ ##ORIGIN= Bruker BioSpin GmbH
$$ ##OWNER= Administrator
$$ $$ E:\/data/COFFEE/nmr/NES1009_842410_9233004_osP6W4uPZL/22/pdata/1/auditp.txt
$$ ##AUDIT TRAIL=  $$ (NUMBER, WHEN, WHO, WHERE, PROCESS, VERSION, WHAT)
(   1,<2015-07-02 03:02:39.461 -0700>,<Administrator>,<X>,<go>,<TOPSPIN 2.1>,
      <created by zg
	started at 2015-07-02 02:51:09.774 -0700,
	POWCHK enabled, PULCHK disabled,
       configuration hash MD5:
       21 0F 79 D6 B3 7B B4 F6 88 20 88 DB 03 48 BD 9F
       data hash MD5: 64K
       C6 A3 63 5A E1 EB B0 BA D2 2C AE E9 63 B7 A7 49>)
(   2,<2015-07-02 03:02:42.633 -0700>,<Administrator>,<X>,<proc1d>,<TOPSPIN 2.1>,
      <Start of raw data processing
       efp LB = 0.3 FT_mod = 6 PKNL = 1 PHC0 = 0 PHC1 = 0 SI = 128K 
       data hash MD5: 128K
       00 C4 D4 90 FA 7C B8 FB 7A 12 C2 F0 1A E0 CB CA>)
(   3,<2015-07-02 03:02:43.508 -0700>,<Administrator>,<X>,<proc1d>,<TOPSPIN 2.1>,
      <pk PHC0 = -85.64941 PHC1 = 0 
       data hash MD5: 128K
       F4 58 FE B7 39 AC C1 A2 11 F2 CA 60 75 76 CC 08>)
(   4,<2015-07-02 03:02:43.899 -0700>,<Administrator>,<X>,<proc1d>,<TOPSPIN 2.1>,
      <abs ABSG = 1 
       data hash MD5: 128K
       3A F4 12 7F 52 66 44 71 CF A4 4F 24 6F 5E E3 93>)
(   5,<2015-07-02 03:02:43.992 -0700>,<Administrator>,<X>,<proc1d>,<TOPSPIN 2.1>,
      <abs ABSG = 2 
       data hash MD5: 128K
       12 F6 09 98 FA 48 E3 CB CA FD 4C 68 77 CD 56 D0>)
(   6,<2015-07-02 03:02:44.086 -0700>,<Administrator>,<X>,<proc1d>,<TOPSPIN 2.1>,
      <abs ABSG = 3 
       data hash MD5: 128K
       EC 11 CA C5 9C C0 91 5E 3D 86 29 29 4F 0F BE 12>)
(   7,<2015-07-02 03:02:44.180 -0700>,<Administrator>,<X>,<proc1d>,<TOPSPIN 2.1>,
      <abs ABSG = 4 
       data hash MD5: 128K
       F6 48 B4 D4 A4 0D B2 E7 FF C9 58 3A AF A8 B5 89>)
(   8,<2015-07-02 03:02:44.352 -0700>,<Administrator>,<X>,<proc1d>,<TOPSPIN 2.1>,
      <abs ABSG = 5 
       data hash MD5: 128K
       BE EB A4 76 77 A4 DB 8F AF 3A 41 A6 0B 6E 4A 3C>)
$$ ##END=
$$ 
$$ $$ hash MD5
$$ $$ C8 4E 4E B5 D1 AE 91 09 54 CD 03 0E 89 33 5C 20
##$RELAX= 
##$RELAX= 
##$RELAX= 
##$RELAX= 
##$RELAX= 
##$RELAX= 
##$RELAX= 
##$RELAX= 
$$ Bruker specific parameters
$$ --------------------------
##$DU= <E:\>
##$EXPNO= 22
$$ [...]
150 150 150 150 150 150 150 150
##$TP07= 0
##$TPNAME0= <>
##$TPNAME1= <>
##$TPNAME2= <>
##$TPNAME3= <>
##$TPNAME4= <>
##$TPNAME5= <>
##$TPNAME6= <>
##$TPNAME7= <>
##$TPOAL= (0..7)
0.5 0.5 0.5 0.5 0.5 0.5 0.5 0.5
##$TPOFFS= (0..7)
0 0 0 0 0 0 0 0
##$TUNHIN= 0
##$TUNHOUT= 0
##$TUNXOUT= 0
##$USERA1= <user>
##$USERA2= <user>
##$USERA3= <user>
##$USERA4= <user>
##$USERA5= <user>
##$V9= 5
##$VALIST= <valist>
##$VCLIST= <CCCCCCCCCCCCCCC>
##$VD= 0
##$VDLIST= <DDDDDDDDDDDDDDD>
##$VPLIST= <PPPPPPPPPPPPPPP>
##$VTLIST= <TTTTTTTTTTTTTTT>
##$WBST= 2048
##$WBSW= 25
##$XGAIN= (0..3)
0 0 0 0
##$XL= 0
##$YL= 0
##$YMAX_a= 8165924
##$YMIN_a= -17498552
##$ZGOPTNS= <>
##$ZL1= 120
##$ZL2= 120
##$ZL3= 120
##$ZL4= 120
##$ABSF1= 14.9632
##$ABSF2= -5.594982
##$ABSG= 5
##$ABSL= 3
##$ALPHA= 0
##$AQORDER= 0
##$ASSFAC= 0
##$ASSFACI= 0
##$ASSFACX= 0
##$ASSWID= 0
##$AUNMP= <proc_prof1d_extract.lims>
##$AXLEFT= 0
##$AXNAME= <>
##$AXNUC= <1H>
##$AXRIGHT= 0
##$AXTYPE= 0
##$AXUNIT= <>
##$AZFE= 0.1
##$AZFW= 0.1
##$BCFW= 0
##$BC_mod= 0
##$BYTORDP= 0
##$COROFFS= 0
##$CY= 15
##$DATMOD= 1
##$DC= 0
##$DFILT= <>
##$DTYPP= 0
##$F1P= 0
##$F2P= 0
##$FCOR= 0.5
##$FTSIZE= 131072
##$FT_mod= 6
##$GAMMA= 0
##$GB= 0
##$INTBC= 1
##$INTSCL= 1
##$ISEN= 128
##$LB= 0.3
##$LEV0= 0
##$LPBIN= 0
##$MAXI= 10000
##$MC2= 0
##$MEAN= 0
##$ME_mod= 0
##$MI= 0
##$NCOEF= 0
##$NC_proc= -2
##$NLEV= 6
##$NOISF1= 0
##$NOISF2= 0
##$NSP= 0
##$NTH_PI= 0
##$NZP= 0
##$OFFSET= 14.9632
##$PC= 1
##$PHC0= -85.64941
##$PHC1= 0
##$PH_mod= 1
##$PKNL= yes
##$PPARMOD= 0
##$PPDIAG= 0
##$PPIPTYP= 0
##$PPMPNUM= 2147483647
##$PPRESOL= 1
##$PSCAL= 4
##$PSIGN= 0
##$PYNMP= <proc.py>
##$REVERSE= no
##$SF= 400.02000875835
##$SI= 131072
##$SIGF1= 0
##$SIGF2= 0
##$SINO= 400
##$SIOLD= 131072
##$SPECTYP= <>
##$SREGLST= <1H.CDCl3>
##$SSB= 0
##$STSI= 131072
##$STSR= 0
##$SW_p= 8223.68421052631
##$SYMM= 0
##$S_DEV= 0
##$TDeff= 65536
##$TDoff= 0
##$TI= <>
##$TILT= no
##$TM1= 0
##$TM2= 0
##$TOPLEV= 0
##$USERP1= <user>
##$USERP2= <user>
##$USERP3= <user>
##$USERP4= <user>
##$USERP5= <user>
##$WDW= 1
##$XDIM= 131072
##$YMAX_p= 387213984
##$YMIN_p= -12601
##$CURPLOT= <Network HP LaserJet P1505>
##$CURPRIN= <$Network HP LaserJet P1505>
##$DFORMAT= <normdp>
##$LAYOUT= <+/1D_H.xwp>
##$LFORMAT= <normlp>
##$PFORMAT= <normpl>
##$SURQMSG= 1
$$ End of Bruker specific parameters
$$ ---------------------------------
##NTUPLES= NMR SPECTRUM
##VAR_NAME=  FREQUENCY,     SPECTRUM/REAL,   SPECTRUM/IMAG
##SYMBOL=    X,             R,               I
##VAR_TYPE=  INDEPENDENT,   DEPENDENT,       DEPENDENT
##VAR_FORM=  AFFN,          ASDF,            ASDF
##VAR_DIM=   131072,        131072,          131072
##UNITS=     HZ,            ARBITRARY UNITS, ARBITRARY UNITS
##FACTOR=    0.0627417313425164, 1,          1
##FIRST=     8223.62146879497, 1815,         -54090
##LAST=      0,             2904,            -55040
##MIN=       0,             -12601,          0
##MAX=       8223.62146879497, 387213984,    0
$$ Real data points
##PAGE= N=1
##DATA TABLE= (X++(R..R)), XYDATA
$$ [...]
60914A448837n9952n6389n2021m7876m4127m0094l5744l1808k8463k5219k2196
60903A004948k0046j8518j6461j3537j0717q802p525o331n029l494j690j09O87
60890H93376R64J385J766J325J5j404k639m062n691p087q276r659j0930j1355
60876H37728j1233j1821j3398j4587j4177j2583j0956r675q455p261o424o088
60864G11070n988n639m606k864r09P59K156L498M635N367O011P013Q209R235J0412
60849G48359J2333J4659J6334J7037J7498J8170J8554J8182J7415J6779J6180
60838I31500J5375J4611J4165J3552J1807Q694N231K838K019K058K037J919K168
60825A027974K523J839n24l752o534q454j0000j1678j3631j5706j7333j7720j6810
$$ y = [1448837, 1388885, 1332496, 1280475, 1232599, 1188472, 1148378, 1112634, 1080826, 1052363, 1027144, 1004948, 984902, 966384, 949923, 936386, 925669, 916867, 909342, 903011, 897982, 894488, 892798, 892689, 893376, 894340, 895725, 897491, 898816, 898831, 897427, 894788, 890726, 885035, 877948, 869672, 860013, 849083, 837728, 826495, 814674, 801276, 786689, 772512, 759929, 748973, 739298, 730843, 723582, 717158, 711070, 705082, 699443, 694837, 691973, 691064, 691823, 693979, 697477, 702112, 707479, 713490, 720503, 728712, 737947, 748359, 760692, 775351, 791685, 808722, 826220, 844390, 862944, 881126, 898541, 915320, 931500, 946875, 961486, 975651, 989203, 1001010, 1009704, 1014935, 1017773, 1019792, 1021850, 1023887, 1025806, 1027974, 1030497, 1032336, 1031812, 1028060, 1021526, 1013072, 1003072, 991394, 977763, 962057, 944724, 927004, 910194]
60812I10194j5658j5233j5193j4502j2859j0828q864p046n559m675m186l525k400
60799G89666r83L91J326J534J270J216J518J531R50M49N28N01l95j590j941j416
60783G94555p70p1J150K587L389L671M508O288Q252R792J1063J2092J2496J2410
60769H81412J2678J3649J4614J4788J4146J2977J1349R404P497N787M161K783
60757A005245K066J907J625R47N06J036K447L915M570M037K669J213Qj393l438
60742A027360n753p597q822r768j0535j1063j1645j2617j3733j4600j5426j6505
60730H89296j7295j7009j5897j4866j4061j2952j1646j0830j0331r156p237n778
60718G42238n429n300m416l081k113j614j163n25M32J909L735N329O443P333P911
$$ y = [910194, 894536, 879303, 864110, 849608, 836749, 825921, 817057, 810011, 804452, 799777, 795591, 792066, 789666, 788683, 789074, 790400, 791934, 793204, 794420, 795938, 797469, 798419, 798868, 799396, 799897, 799502, 797912, 795971, 794555, 793785, 793714, 794864, 797451, 800840, 804511, 809019, 815307, 823559, 833351, 844414, 856506, 869002, 881412, 894090, 907739, 922353, 937141, 951287, 964264, 975613, 985017, 992514, 998301, 1002462, 1005245, 1007311, 1009218, 1010843, 1011790, 1012296, 1013332, 1015779, 1019694, 1024264, 1028301, 1030970, 1032183, 1032191, 1030798, 1027360, 1021607, 1014010, 1005188, 995420, 984885, 973822, 962177, 949560, 935827, 921227, 905801, 889296, 872001, 854992, 839095, 824229, 810168, 797216, 785570, 774740, 764409, 755253, 748016, 742238, 736809, 731509, 727093, 724012, 721899, 720285, 719122, 718597, 719029, 720938, 724673, 730002, 736445, 743778, 751689]
60703G51689P607O451N484N417N603M919L088O11k030m515o529q107r725j1547
60689G48416j3021j3652j3718j3733j3641j3035j1820j0238q573p223o539o168
60677F17055n124l041q71L21Q19J662K965L794L723L563M149N078N279M521L671
60662F47564L493L678L415K620K092K487L602M823N895O956Q084R127R823R878
60648G23537R208Q273P793P844P691O947O331O674P631Q124P825P386P353P662
60634H30279Q059Q295P946O809N505M911M986M876M191L406K808J906J75k189
60620H91963m553o447p636q088q065p937p817p709p782q062q068p303o004m748
60606G91744l471j667N93K638M189N601O988P980Q409Q501Q236P261N672M156
$$ y = [751689, 759296, 765747, 771231, 776648, 782251, 787170, 790258, 790869, 788839, 784324, 777795, 769688, 759963, 748416, 735395, 721743, 708025, 694292, 680651, 667616, 655796, 645558, 636985, 629762, 623223, 617055, 611931, 608890, 608019, 608340, 609159, 610821, 613786, 617580, 621303, 624866, 629015, 634093, 639372, 643893, 647564, 651057, 654735, 658150, 660770, 662862, 665349, 668951, 673774, 679669, 686625, 694709, 703836, 713659, 723537, 732745, 741018, 748811, 756655, 764346, 771293, 777624, 784298, 791929, 800053, 807878, 815264, 822617, 830279, 838338, 846633, 854579, 861388, 866893, 871804, 876790, 881666, 885857, 889263, 892071, 893977, 894152, 891963, 887410, 880963, 873327, 865239, 857174, 849237, 841420, 833711, 825929, 817867, 809799, 802496, 796492, 791744, 788273, 786606, 787199, 789837, 794026, 799627, 806615, 814595, 823004, 831505, 839741, 847002, 852674, 856830]
60592H56830L150K444J773J169O12k0n81q07r38j540k730m177n791p618r158r722
60576H22896r492r364r687j0056j0359j0903j1379j0918r456q021p200o402n089
60563G04570l685k678j789p19J47N29R50J956L207M002M265M435M836N562O531
60548G32119P330P527P451Q043R763J2226J5103J8500K2247K5774K9168L3441
60536I28692L9186M5722N1978N7255O0585O0375N5678M7120L5876K2437P261q008
60524A404157k1033l0321l5716l7752l7125l4475l0167k4435j7997j1968o924
60513A116244k624J119M009O015P653R129J0020J0290J0732J1908J3565J5782
60501A213842J9506K5138L1609L7932M4750N3249O3318P4109Q5778R9213J14229
$$ y = [856830, 859980, 862424, 864197, 865366, 865978, 865958, 865377, 864570, 863632, 862092, 859362, 855185, 849394, 841776, 832618, 822896, 813404, 804040, 794353, 784297, 773938, 763035, 751656, 740738, 731282, 723261, 716061, 709659, 704570, 700885, 698207, 696418, 695699, 695846, 696375, 697325, 699281, 702488, 706490, 710755, 715190, 720026, 725588, 732119, 739449, 746976, 754427, 762470, 772233, 784459, 799562, 818062, 840309, 866083, 895251, 928692, 967878, 1013600, 1065578, 1122833, 1183418, 1243793, 1299471, 1346591, 1382467, 1404904, 1412165, 1404157, 1383124, 1352803, 1317087, 1279335, 1242210, 1207735, 1177568, 1153133, 1135136, 1123168, 1116244, 1113620, 1114739, 1118748, 1124763, 1132416, 1141545, 1151565, 1161855, 1172587, 1184495, 1198060, 1213842, 1233348, 1258486, 1290095, 1328027, 1372777, 1426026, 1489344, 1563453, 1649231, 1748444, 1862673]
60490A862673J29379J43523J56684J69430J82408J96505K12735K31873K54313
60481C539523K79211L02629L16948L13714K87604K37586J65474P5432k4876j24493
60471E368752k12242k80217l25082l47373l50288l38460l16759k89496k60161
60462B648674k31214k04036j79321j57545j38931j23156j09502r7299q6165p6042
60452A245463o7161n9744n3512m7764m2149l6956l2520k8738k5481k2917k1054
60441H07467j9406j7534j5542j3672j1910j0372r481r356r419r052q168o862n249
60428F61444l919l688m243m012k234k46L17j71q5J012K076K472K672K991K875
60413F57261J867M38m80l32P59K093K860K990L247M048M653M233L234K754K913
$$ y = [1862673, 1992052, 2135575, 2292259, 2461689, 2644097, 2840602, 3053337, 3285210, 3539523, 3818734, 4121363, 4438311, 4752025, 5039629, 5277215, 5442689, 5518121, 5493245, 5368752, 5156510, 4876293, 4551211, 4203838, 3853550, 3515090, 3198331, 2908835, 2648674, 2417460, 2213424, 2034103, 1876558, 1737627, 1614471, 1504969, 1407670, 1321505, 1245463, 1178302, 1118558, 1065046, 1017282, 975133, 938177, 905657, 876919, 851438, 828521, 807467, 788061, 770527, 754985, 741313, 729403, 719031, 709550, 700194, 690775, 681723, 673555, 666693, 661444, 657525, 653837, 649594, 645582, 643348, 643102, 643419, 643248, 643163, 644175, 646251, 648723, 651395, 654386, 657261, 659128, 659566, 659086, 658754, 659513, 661606, 664466, 667456, 670703, 674751, 679404, 683637, 686871, 689625, 692538]
60398F92538K936K615K474K547K245J655J747K860L935L872K867J856J289J042
60384G26478J047J345J666J503O27o51j674j851j086J42J217J808J791J091ko44
60368G32807k14Q10J371J221J130J595K075J888J308J196J834K730L544M539N892
60353G63726P048P337P057P286Q417R487R476Q680Q154Q057P543O177M575L416
60339H66436K640J926J213M52m73j278j431j054q92j041o60N91J819K290K629
60324H73167L706N138N883N734N123L974J983l08j792k256k552l345m381n098
60310H84976n312n211n075n064m975m445l534k727k080j042N18J750J930J491
60296H51200J239J180R01N36M42L91n3o85r92r58p97l44M91J217J568K252L877
$$ y = [692538, 695474, 698089, 700563, 703110, 705355, 707010, 708757, 711617, 715552, 719424, 722291, 724147, 725436, 726478, 727525, 728870, 730536, 732039, 732666, 732015, 730341, 728490, 727404, 727546, 728763, 730571, 732362, 733453, 733451, 732807, 732593, 733403, 734774, 735995, 737125, 738720, 740795, 742683, 743991, 745187, 747021, 749751, 753295, 757834, 763726, 770774, 778111, 785168, 792454, 800871, 810358, 819834, 828514, 836668, 844725, 852268, 858445, 863020, 866436, 869076, 871002, 872215, 872667, 872194, 870916, 869485, 868431, 867539, 866498, 865838, 866429, 868248, 870538, 873167, 876873, 882011, 887894, 893628, 898751, 902725, 904708, 904400, 902608, 900352, 897800, 894455, 890074, 884976, 879664, 874453, 869378, 864314, 859339, 854894, 851360, 848633, 846553, 845511, 846029, 847779, 849709, 851200, 852439, 853619, 854520, 855056, 855498, 855889, 855836, 855151, 854159, 853201, 852404, 852060, 852551, 853768, 855336, 857588, 861465]
60279H61465N725O648O780P110P778Q109Q145Q698R874J0818J1182J1750J3245
60266I77327J5408J7516J9147K0330K1550K3571K6568K9660L1972L3872L6374
60255A253295L9658M3190M6972N1514N6681O1792O6788P2208P8071Q3925Q9954
60244A944048R6634J03301J08457J11762J14218J15988J15488J11525J05001R7451
60234C023873Q8867P8234O5629N2524L9995K7574J4246R5j3366k4427l2566l8390
60222C282288m2393m4323m3897m1474l7460l1642k3867j4830n366M664J5844K7910
60210C045454L9950N1650O3369P5074Q6251R6668J06264J14330J19861J22616
60200C921487J22759J19629J12101J00302Q5845P0124N3421L5762J7517j102k0025
$$ y = [861465, 867190, 873838, 880618, 887728, 895506, 903615, 911760, 920458, 930332, 941150, 952332, 964082, 977327, 992735, 1010251, 1029398, 1049728, 1071278, 1094849, 1121417, 1151077, 1183049, 1216921, 1253295, 1292953, 1336143, 1383115, 1434629, 1491310, 1553102, 1619890, 1692098, 1770169, 1854094, 1944048, 2040682, 2143983, 2252440, 2364202, 2478420, 2594408, 2709896, 2821421, 2926422, 3023873, 3112740, 3190974, 3256603, 3309127, 3349122, 3376696, 3390942, 3391037, 3377671, 3353244, 3320678, 3282288, 3239895, 3195572, 3151675, 3110201, 3072741, 3041099, 3017232, 3002402, 2997036, 3001700, 3017544, 3045454, 3085404, 3137054, 3200423, 3275497, 3361748, 3458416, 3564680, 3679010, 3798871, 3921487, 4044246, 4163875, 4275976, 4376278, 4462123, 4532247, 4585668, 4621430, 4638947, 4637845, 4617820]
60189D617820l8471n5049o9005q0445q9183r4404r5774r3916q9486q2706p4019
60178C755362o4127n3027m0068k5339j0053M848J9543L4352M8892O2563P4945
60167C807891Q5219R2046R4537R2792Q7246P8375O7145N4705M1242K6193R884
60156D537275n988j9920l1515m0368m5383m5990m3004l7392k9055j7726m265R960
60144D226629K4560M0200N7506P6467R6540J16957J37353J58361J81006K05213
60134E320792K29599K52984K75323K96774L16721L34190L48431L58541L63236
60125H096591L61623L53568L38900L17126K88407K54108K15687J73717J28550
60116A0528277Q1210L2943j5590o4014j11591j57310k00051k38259k69948k93572
$$ y = [4617820, 4579349, 4524300, 4455295, 4374850, 4285667, 4191263, 4095489, 4001573, 3912087, 3829381, 3755362, 3691235, 3638208, 3598140, 3572801, 3562748, 3567596, 3587139, 3621491, 3670383, 3732946, 3807891, 3893110, 3985156, 4079693, 4172485, 4259731, 4338106, 4405251, 4459956, 4501198, 4527391, 4537275, 4531287, 4511367, 4479852, 4439484, 4394101, 4348111, 4305107, 4267715, 4238660, 4220934, 4216669, 4226629, 4251189, 4291389, 4348895, 4425362, 4521902, 4638859, 4776212, 4934573, 5115579, 5320792, 5550391, 5803375, 6078698, 6375472, 6692193, 7026383, 7374814, 7733355, 8096591, 8458214, 8811782, 9150682, 9467808, 9756215, 10010323, 10226010, 10399727, 10528277, 10609487, 10642430, 10626840, 10562826, 10451235, 10293925, 10093874, 9855615, 9585667, 9292095]
60106I292095l08519l14606l11812l00854k83337k60991k35187k07166j77771
60097F891852j46874j14178q0797m8827j8999R841L8257O4609Q6780J04065J16368
60086F902097J22697J21872J13958R9836Q0190N6065K9606K866k3600m9758p4372
60075G381457r5664j13388j28776j42511j54002j62695j68841j72616j73434j70642
60065E898888j64468j55953j46085j35065j22328j07413r0873p3973n7469m1166
60055D804095k4679p908R417K7621M6145O3613P9365R3846J06821J16384J20854
60044E435574J20702J17311J10597R9324Q3377O4278M3474K1367j860k5562m9104
60033F019478p2186r4274j14139j30227j41388j47337j48673j46313j40778j32200
$$ y = [9292095, 8983576, 8668970, 8357158, 8056304, 7772967, 7511976, 7276789, 7069623, 6891852, 6744978, 6630800, 6550003, 6501176, 6482177, 6492018, 6530275, 6594884, 6681664, 6785729, 6902097, 7024794, 7146666, 7260624, 7360460, 7440650, 7496715, 7526321, 7529187, 7505587, 7455829, 7381457, 7285793, 7172405, 7043629, 6901118, 6747116, 6584421, 6415580, 6242964, 6069530, 5898888, 5734420, 5578467, 5432382, 5297317, 5174989, 5067576, 4976703, 4902730, 4845261, 4804095, 4779416, 4771508, 4780925, 4808546, 4854691, 4918304, 4997669, 5091515, 5198336, 5314720, 5435574, 5556276, 5673587, 5784184, 5883508, 5966885, 6031163, 6074637, 6096004, 6094144, 6068582, 6019478, 5947292, 5853018, 5738879, 5608652, 5467264, 5319927, 5171254, 5024941, 4884163, 4751963]
60023D751963j21004j08005r3630p7800o0838m3801k7358j1109N525K2397L9194
60012D275534N6076P3148R0012J06523J23197J40017J55515J67897J76385J80614
60002E544918J79556J72267J59220J41824J20925R6807P0232M2356J3857j4934
59992F527028m3238p0045r4779j16845j34909j47608j54756j56968j54380j46842
59982E306658j35140j20846j04928q7451o8667m9475l0603j2184N729K2857L9038
59971D764988N4302O8497Q1268R2386J01677J08743J13145J14705J13300J08695
59961E721706J01006R0909P8965O5281N0363L5624K2276J0268q30j0397j7114
59950F148057k0223j9534j4614n078Q555K5355M5195O8590R5486J25119J56906
$$ y = [4751963, 4630959, 4522954, 4429324, 4351524, 4290686, 4246885, 4219527, 4208418, 4213943, 4236340, 4275534, 4331610, 4404758, 4494770, 4601293, 4724490, 4864507, 5020022, 5187919, 5364304, 5544918, 5724474, 5896741, 6055961, 6197785, 6318710, 6415517, 6485749, 6528105, 6541962, 6527028, 6483790, 6413745, 6318966, 6202121, 6067212, 5919604, 5764848, 5607880, 5453500, 5306658, 5171518, 5050672, 4945744, 4858293, 4789626, 4740151, 4709548, 4697364, 4703093, 4725950, 4764988, 4819290, 4887787, 4969055, 5061441, 5163118, 5271861, 5385006, 5499711, 5613011, 5721706, 5822712, 5913621, 5992586, 6057867, 6108230, 6143854, 6166130, 6176398, 6175568, 6165171, 6148057, 6127834, 6108300, 6093686, 6088608, 6097163, 6122518, 6167713, 6236303, 6331789, 6456908, 6613814]
59939F613814J90574K25545K61062K96779L32328L66373L96865M21995M39924
59930I545259M47771M41982M19869L80262L23026K49302J62503O8127k7873j20206
59920A1890022k04159k75644l32035l72557l97723m08711m07140l94847l73759
59911H723447l46229l15074k82531k49272k14996j79800j44467j09737p6032m3669
59901F761640j2663J7465M7031P5514J02201J26960J49496J68231J80891J86086
59891G802852J83241J71314J48865J15694P3623K5448k6095p8236j28016j72780
59881H115910k10639k40454k61730k74441k78669k74737k64054k49330k33209
59872E828647k17013k01289j86889j74681j64726j56635j50299j45271j40092
$$ y = [6613814, 6804388, 7029933, 7290995, 7587774, 7920102, 8286475, 8683340, 9105335, 9545259, 9993030, 10435012, 10854881, 11235143, 11558169, 11807471, 11969974, 12038101, 12010228, 11890022, 11685863, 11410219, 11078184, 10705627, 10307904, 9899193, 9492053, 9097206, 8723447, 8377218, 8062144, 7779613, 7530341, 7315345, 7135545, 6991078, 6881341, 6805309, 6761640, 6748977, 6766442, 6813473, 6888987, 6991188, 7118148, 7267644, 7435875, 7616766, 7802852, 7986093, 8157407, 8306272, 8421966, 8495589, 8521037, 8494942, 8416706, 8288690, 8115910, 7905271, 7664817, 7403087, 7128646, 6849977, 6575240, 6311186, 6061856, 5828647, 5611634, 5410345, 5223456, 5048775, 4884049, 4727414, 4577115, 4431844, 4291752]
59863D291752j33434j25639j17916j10240j01285r0356p8235o6105n4611m3909
59853C370022l3768k3801j4536p862n347o550j0071j5660k3667l2856m0682m5825
59841C109397m8784m9966m9078m6569m3692m0449l5276k7619j9195j1806n375
59830B731588R57P304J3790K1447L0745M0243M8099N4396O0574O6969P2226P4985
59818C223323P5111P3175O9543O4111N6486M6431L4460K1986J0726K101k898l986
59806C670569j915K063P374J4197K2235L0348L8079M6852N8777P4598R3459J14504
59794D171140J37935J64524J94632K27841K63336L00253L37322L71615L97295
59785F565893M05874L88499L39316K58548J53741L8151p3415j68848k40831k86860
$$ y = [4291752, 4158318, 4032679, 3914763, 3804523, 3703238, 3612882, 3534647, 3468542, 3413931, 3370022, 3336254, 3312453, 3297917, 3290055, 3284708, 3278158, 3268087, 3252427, 3228760, 3195904, 3155222, 3109397, 3060613, 3010647, 2961569, 2915000, 2871308, 2830859, 2795583, 2767964, 2748769, 2736963, 2731588, 2732545, 2739849, 2753639, 2775086, 2805831, 2846074, 2894173, 2948569, 3009143, 3076112, 3148338, 3223323, 3298434, 3371609, 3441152, 3505263, 3561749, 3608180, 3642640, 3664626, 3675352, 3677453, 3674555, 3670569, 3668654, 3670717, 3678091, 3692288, 3714523, 3744871, 3782950, 3829802, 3888579, 3963177, 4056636, 4171140, 4309075, 4473599, 4668231, 4896072, 5159408, 5459661, 5796983, 6168598, 6565893, 6971767, 7360266, 7699582, 7958130, 8111871, 8150022, 8076607, 7907759, 7666928, 7380068]
59775G380068l08596l10772k99132k78502k52402k23686j94584j66249j39076
59766E207069j13586r0354o9343n0079l2466j6596j887J2630K7182M1201N4514
59755D968285O7754Q1559R6107J11469J27608J44066J60580J77984J97492K18976
59745F351880K41064K63170K86415L12231L41022L72400M05688M39707M73006
59736I486583N04750N34488N60584N79785N88936N86428N71614N44124N04942
59727A4462234M57741M08205L61986L23516K96005K81563K81173K94796L21566
59718A7488785L59783M06945M59915N15010N68128O15225O52628O76642O83261
59709B2426322O69018O32243N73226M93764L97405K89956J78712P0924k6868j08873
$$ y = [7380068, 7071472, 6760700, 6461568, 6183066, 5930664, 5706978, 5512394, 5346145, 5207069, 5093483, 5003129, 4933786, 4883707, 4851241, 4834645, 4832758, 4845388, 4872570, 4913771, 4968285, 5036039, 5117598, 5213705, 5325174, 5452782, 5596848, 5757428, 5935412, 6132904, 6351880, 6592944, 6856114, 7142529, 7454760, 7795782, 8168182, 8573870, 9013577, 9486583, 9991333, 10525821, 11086405, 11666190, 12255126, 12841554, 13413168, 13957292, 14462234, 14919975, 15328180, 15690166, 16013682, 16309687, 16591250, 16872423, 17167219, 17488785, 17848568, 18255513, 18715428, 19230438, 19798566, 20413791, 21066419, 21743061, 22426322, 23095340, 23727583, 24300809, 24794573, 25191978, 25481934, 25660646, 25731570, 25704702, 25595829]
59699B5595829j70889k11245k30092k27961k05832j66152j12244m6575K9320J13458
59689B4367617K03426K97923L96790M99196O03029P06189Q06692R00636R81089
59680B9762587J039552J067369J055402R94384Q77651P04149M79498K15865o8559
59671C6127898l51989o13481q36525j009967j128089j191180j205043j178786
59663B8612838j123365j052138r80725r23930q91730q87251r06605r39843r74028
59654A9933223r98070j005973r96322r70325r31099q83282q31242p77454p23058
59645A1816398o69394o18041n69801n24541m81858m41392m02910l66614l33130
59636G408717l02701k74811k48834k24561k01839j80307j59913j41018j23725
$$ y = [25595829, 25424940, 25213695, 24983603, 24755642, 24549810, 24383658, 24271414, 24224839, 24254159, 24367617, 24571043, 24868966, 25265756, 25764952, 26367981, 27074170, 27880862, 28781498, 29762587, 30802139, 31869508, 32924910, 33919294, 34796945, 35501094, 35980592, 36196457, 36127898, 35775909, 35162428, 34325903, 33315936, 32187847, 30996667, 29791624, 28612838, 27489473, 26437335, 25456610, 24532680, 23640950, 22753699, 21847094, 20907251, 19933223, 18935153, 17929180, 16932858, 15962533, 15031434, 14148152, 13316910, 12539456, 11816398, 11147004, 10528963, 9959162, 9434621, 8952763, 8511371, 8108461, 7741847, 7408717, 7106016, 6831205, 6582371, 6357810, 6155971, 5975664, 5815751, 5674733, 5551008]
59627E551008j07705r2988q0103o9190n9867n2244m7172m5063m5463m8140n3456
59616D849617o1126o9689p7920q5754r3098r8866j02118j03178j02686j00437
59606C954745r6124r0444q4389p8059p1073o3586n6015m8317m0334l2380k4805
59595C269219j7453j0235l572K254P507J2139J5347J6789J7426J8359J9399J9702
59583C366881J9231J8833J9246K0698K3122K6285L0107L5023M1429M8695N5752
59572C705302O2756P0955Q0603R0491J00037J10309J22114J34737J47614J61665
59562D786583J77623J94478K11060K27867K45583K62937K77864K89965L00001
59553F973961L07593L11330L10740L06452K98638K86928K71763K54434K35821
$$ y = [5551008, 5443303, 5350315, 5270212, 5201022, 5141155, 5088911, 5041739, 4996676, 4951213, 4903073, 4849617, 4788491, 4718802, 4640882, 4555128, 4462030, 4363164, 4261046, 4157868, 4055182, 3954745, 3858621, 3768177, 3683788, 3605729, 3534656, 3471070, 3415055, 3366738, 3326404, 3294024, 3269219, 3251766, 3241531, 3237959, 3240213, 3247720, 3259859, 3275206, 3291995, 3309421, 3327780, 3347179, 3366881, 3386112, 3404945, 3424191, 3444889, 3468011, 3494296, 3524403, 3559426, 3600855, 3649550, 3705302, 3768058, 3839013, 3919616, 4010107, 4110144, 4220453, 4342567, 4477304, 4624918, 4786583, 4964206, 5158684, 5369744, 5597611, 5843194, 6106131, 6383995, 6673960, 6973961, 7281554, 7592884, 7903624, 8210076, 8508714, 8795642, 9067405, 9321839, 9557660]
59544I557660K16421J97479J80684J66516J53773J40769J26546J11529R8028Q9584
59534A1038989Q8466R3707J02056J10174J15126J13804J03508Q3033N2259J1311
59524A1912433l8666r4612j52879k11089k67476l19054l62191l94902m17208m29543
59514I224813m32353m27180m16532m02168l84434l63380l39566l13896k87577
59505E857727k62026k37856k14275j90525j67511j46686j27831j09468r1248p4205
59495D236096n8620m3338k7684j2499J381J4466K7749M1527N5755P0770Q6934
59484D392537J04040J21548J39119J56706J74361J92043K09332K25415K39539
59475E954640K51177K59293K61920K57055K43708K21633J90623J50827J03410
$$ y = [9557660, 9774081, 9971560, 10152244, 10318760, 10472533, 10613302, 10739848, 10851377, 10949405, 11038989, 11127455, 11221162, 11323218, 11433392, 11548518, 11662322, 11765830, 11848863, 11901122, 11912433, 11873767, 11779155, 11626276, 11415187, 11147711, 10828657, 10466466, 10071564, 9654356, 9224813, 8792460, 8365280, 7948748, 7546580, 7162146, 6798766, 6459200, 6145304, 5857727, 5595701, 5357845, 5143570, 4953045, 4785534, 4638848, 4511017, 4401549, 4310301, 4236096, 4177476, 4134138, 4106454, 4093955, 4095336, 4109802, 4137551, 4179078, 4234833, 4305603, 4392537, 4496577, 4618125, 4757244, 4913950, 5088311, 5280354, 5489686, 5715101, 5954640, 6205817, 6465110, 6727030, 6984085, 7227793, 7449426, 7640049, 7790876, 7894286]
59466G894286N0366n918o2452j15897j63902k05622k40203k65884k81700k89161
59456F313913k90790k87662k79790k68116k54364k39298k22874k05980j90177
59447D074862j75693j61318j46504j32051j18503j05391r2514q0577p0084o0642
59437B931585n1829m3719l6272k9087k2153j5913j0411n158k6M565Q454J1917
59425B741953J4902J6969J8180J9276K0868K3105K6168L0371L5720M1844M8137
59414C037493N3410N6076N5739N4418N5224N9855O8000P8616R0938J04737J20616
59403C835122J39368J60069J79590J95495K08932K23295K40743K61673K86712
59394E730999L16812L51361L88332M26577M65990N04981N39611N65833N81078
$$ y = [7894286, 7944652, 7938734, 7876282, 7760385, 7596483, 7390861, 7150658, 6884774, 6603074, 6313913, 6023123, 5735461, 5455671, 5187555, 4933191, 4693893, 4471019, 4265039, 4074862, 3899169, 3737851, 3591347, 3459296, 3340793, 3235402, 3142888, 3062311, 2992227, 2931585, 2879756, 2836037, 2799765, 2770678, 2748525, 2732612, 2722201, 2717043, 2717017, 2721582, 2730036, 2741953, 2756855, 2773824, 2792004, 2811280, 2832148, 2855253, 2881421, 2911792, 2947512, 2989356, 3037493, 3090903, 3146979, 3202718, 3257136, 3312360, 3372215, 3440215, 3518831, 3609769, 3714506, 3835122, 3974490, 4134559, 4314149, 4509644, 4718576, 4941871, 5182614, 5444287, 5730999, 6047811, 6399172, 6787504, 7214081, 7680071, 8185052, 8724663, 9290496, 9871574]
59385I871574N83479N71576N45878N09294M65283M16584L66035L16882K71258
59376A3917843K29358J90696J55009J21395Q7876N2692J5110k5500p0231j19465
59366A4554783j71761k24256k73330l14762l44693l61344l65361l58366l42314
59357A1798596l20401k97164k76730k61609k53243k52438k58637k69794k83637
59348I324943k98342l11911l22131l27644l28211l23657l13726k99271k82198
59339F517852k63682k43620k22313k01221j81319j61895j42054j22378j04116
59330D875254q7531p1932n6776m1979k7605j3874r73J1437K3846L5741M5691N3011
59318D744310N8363O2351O4412O3703O0199N4202M5621L4442K1316P175p230k0997
$$ y = [9871574, 10455053, 11026629, 11572507, 12081801, 12547084, 12963668, 13329703, 13646585, 13917843, 14147201, 14337897, 14492906, 14614301, 14702177, 14754869, 14769979, 14744479, 14674248, 14554783, 14383022, 14158766, 13885436, 13570674, 13225981, 12864637, 12499276, 12140910, 11798596, 11478195, 11181031, 10904301, 10642692, 10389449, 10137011, 9878374, 9608580, 9324943, 9026601, 8714690, 8392559, 8064915, 7736704, 7413047, 7099321, 6800050, 6517852, 6254170, 6010550, 5788237, 5587016, 5405697, 5243802, 5101748, 4979370, 4875254, 4787723, 4715791, 4659015, 4617036, 4589431, 4575557, 4574584, 4586021, 4609867, 4645608, 4691299, 4744310, 4802673, 4865024, 4929436, 4993139, 5053338, 5107540, 5153161, 5187603, 5208919, 5216094, 5208864, 5187867]
59306E187867l2971m2502m9773n5046n8130n8809n7134n3001m6153l6860k5966
59295D671522j4018r67J3152K7910M3014N8449P4108Q9873J05959J22211J37238
59284E328451J49326J58128J64340J67785J67125J61576J51610J37731J19942
59275F706014R8791P5719N2047K8694P078j0974k4613l4131l9756m1652m1383
59264F775834m1841m5188n1931o1955p4732q8181r9199j06236j10068j11639j10695
59253E874169j07017j01207r3382q2643o8732n2712l5294j5970N422K8002N1591
59242E402227P7472J06291J36918J68522K02040K38026K74598L09051L40031L66394
59232G621570L85186L92732L86874L66544L30315K77474K10103J32228M7285m2084
$$ y = [5187867, 5154896, 5112394, 5062621, 5007575, 4949445, 4890636, 4833502, 4780501, 4734348, 4697488, 4671522, 4657504, 4656537, 4669689, 4697599, 4740613, 4799062, 4873170, 4963043, 5069002, 5191213, 5328451, 5477777, 5635905, 5800245, 5968030, 6135155, 6296731, 6448341, 6586072, 6706014, 6804805, 6880524, 6932571, 6961265, 6968343, 6957369, 6932756, 6898625, 6858869, 6817217, 6775834, 6733993, 6688805, 6636874, 6574919, 6500187, 6412006, 6312807, 6206571, 6096503, 5984864, 5874169, 5767152, 5665945, 5572563, 5489920, 5421188, 5368476, 5333182, 5317212, 5322634, 5350636, 5402227, 5479699, 5585990, 5722908, 5891430, 6093470, 6331496, 6606094, 6915145, 7255176, 7621570, 8006756, 8399488, 8786362, 9152906, 9483221, 9760695, 9970798, 10103026, 10150311, 10108227]
59222A0108227j32116k17664k94008l57854m06896m39866m57306m61199m53703
59213F887615m36861m13244l85723l56369l26191k96050k67207k40827k17172
59204C947971j95478j74717j54794j36714j21163j07297r3903q1380p1205o3463
59194B747857n6494m9339m2853l7782l3285k8324k3123j8247j3424q348l520O41
59182B433759M587Q608J2170J5201J8824K3713K8822L2883L6233L9987M4356M8997
59170B748140N4069N9757O5509P0844P6167Q1761Q6812R0522R3237R5330R5841
59159C617989R3480Q8293Q1091P1983O0701M7726L3874J9352M373r908k2230l2645
59147D054079m1924m9950n5686n8475n8550n6556n3182m8842m3194l5591k6409
$$ y = [10108227, 9976111, 9758447, 9464439, 9106585, 8699689, 8259823, 7802517, 7341318, 6887615, 6450754, 6037510, 5651787, 5295418, 4969227, 4673177, 4405970, 4165143, 3947971, 3752493, 3577776, 3422982, 3286268, 3165105, 3057808, 2963905, 2882525, 2811320, 2747857, 2691363, 2642024, 2599171, 2561389, 2528104, 2499780, 2476657, 2458410, 2444986, 2436638, 2433118, 2433759, 2438346, 2446954, 2459124, 2474325, 2493149, 2516862, 2545684, 2578567, 2614800, 2654787, 2699143, 2748140, 2802209, 2861966, 2927475, 2998319, 3074486, 3156247, 3243059, 3333581, 3426818, 3522148, 3617989, 3711469, 3799762, 3880853, 3952836, 4013537, 4061263, 4095137, 4114489, 4118862, 4108954, 4086724, 4054079, 4012155, 3962205, 3906519, 3848044, 3789494, 3732938, 3679756, 3630914, 3587720, 3552129, 3525720]
59136C525720j7065q209J036J1452K2439L3201M4111N5970O8806Q2288R6398J10926
59124D027073J25375J40041J56123J73953J92409K10766K29579K48851K66881
59115E771051K82091K94299L02814L04896K97803K80951K54551K17648J69643
59106H175747J12698N0750j2892p5357j32981j82612k23596k56723k81927k98751
59096F874356l08207l12241l11845l07339k99719k90004k77973k63294k47223
59087D256511k31419k15891j99915j84175j69987j57127j44485j32280j21635
59078B699597j12483j03873r5858q8992q2549p5320o7824o1584n6505n1168m5450
59067A857991m0596l6799l2938k8832k5661k3969k3092k2652k2708k2459k0919
$$ y = [3525720, 3508655, 3500446, 3501482, 3512934, 3535373, 3568574, 3612685, 3668655, 3737461, 3819749, 3916147, 4027073, 4152448, 4292489, 4448612, 4622565, 4814974, 5025740, 5255319, 5504170, 5771051, 6053142, 6347441, 6650255, 6955151, 7252954, 7533905, 7788456, 8006104, 8175747, 8288445, 8339195, 8326303, 8250946, 8117965, 7935353, 7711757, 7455034, 7173107, 6874356, 6566149, 6253908, 5942063, 5634724, 5335005, 5045001, 4767028, 4503734, 4256511, 4025092, 3809201, 3609286, 3425111, 3255124, 3097997, 2953512, 2821232, 2699597, 2587114, 2483241, 2387383, 2298391, 2215842, 2140522, 2072698, 2011114, 1954609, 1903441, 1857991, 1817395, 1780596, 1747658, 1718826, 1693165, 1669196, 1646104, 1623452, 1600744, 1578285, 1557366]
59056A557366j8938j8455j9369j9335j7186j4509j3112j2828j2647j2352j2026
59045A386609j1211r508p183m594j802R84L491O069R347J3079J6317J8675K0485
59032A440758K1709K1893K1035J9428J6738J2530P567L406P09r39j814j862j482
59019A559676j076m4K405N624Q147R759J1448J3422J4722J4805J4003J2353R432
59006A674676N516J581j947n218p858r179r428r483r366q391o629m864l241j314
58992A604855P03K212L537N429P514Q835R698J1222J3190J4239J4205J4461J5692
58979A725792J7126J8255J9576K1295K2865K4254K6219K8993L2000L5066L8480
58968B009921M1761M3839M4706M5483M6606M7379M7425M7268M7328M7618M8489
$$ y = [1557366, 1538428, 1519973, 1500604, 1481269, 1464083, 1449574, 1436462, 1423634, 1410987, 1398635, 1386609, 1375398, 1365890, 1358707, 1354113, 1352311, 1353295, 1356786, 1362855, 1372202, 1385281, 1401598, 1420273, 1440758, 1462467, 1484360, 1505395, 1524823, 1541561, 1554091, 1561658, 1565064, 1565773, 1564834, 1563020, 1561158, 1559676, 1558600, 1558556, 1560961, 1566585, 1574732, 1584491, 1595939, 1609361, 1624083, 1638888, 1652891, 1665244, 1674676, 1680192, 1681773, 1679826, 1674608, 1666750, 1657571, 1648143, 1638660, 1629294, 1620903, 1614274, 1609410, 1606169, 1604855, 1605558, 1607770, 1611307, 1616736, 1624250, 1633085, 1642783, 1654005, 1667195, 1681434, 1695639, 1710100, 1725792, 1742918, 1761173, 1780749, 1802044, 1824909, 1849163, 1875382, 1904375, 1936375, 1971441, 2009921, 2051682, 2095521, 2140227, 2185710, 2232316, 2279695, 2327120, 2374388, 2421716, 2469334, 2517823]
58957B517823N0410N3071N5937N9418O4103O9310P4119P9274Q6125R4032J01042
58946C304664J07042J13921J22512J31752J41139J51626J63467J75469J87288
58937D598880K00498K16486K34997K55455K78094L03015L29795L58647L90518
58928G166385M25361M61782M98890N37049N76374O15960O54809O91897P24931
58919A2353438P50587P66147P69223P55874P21147O62099N78752M72271L44809
58910A8174347K01691N1271r8523k41815l72812m85119n74581o41032o86276p12160
58900A4614991p21475p18251p05476o83972o54696o20323n83231n43661n01461
58891H882445m58371m17140l79430l45839l16921k93036k73874k58715k46322
$$ y = [2517823, 2568233, 2621304, 2677241, 2736659, 2800762, 2870072, 2944191, 3023465, 3109590, 3203622, 3304664, 3411706, 3525627, 3648139, 3779891, 3921030, 4072656, 4236123, 4411592, 4598880, 4799378, 5015864, 5250861, 5506316, 5784410, 6087425, 6417220, 6775867, 7166385, 7591746, 8053528, 8552418, 9089467, 9665841, 10281801, 10936610, 11628507, 12353438, 13104025, 13870172, 14639395, 15395269, 16116416, 16778515, 17357267, 17829538, 18174347, 18376038, 18427309, 18328786, 18086971, 17714159, 17229040, 16654459, 16013427, 15327151, 14614991, 13893516, 13175265, 12469789, 11785817, 11131121, 10510798, 9927567, 9383906, 8882445, 8424074, 8006934, 7627504, 7281665, 6964744, 6671708, 6397834, 6139119, 5892797]
58882E892797k34509k21358k07261j94122j82169j69496j55315j41420j29391
58873D257756j18429j07212r6086q5995p6844o8286o0735n4291m8012m1397l5302
58862C465167l0283k5414j9843j4114q888l748J689O948J2040J8183K5920L3944
58850C461601M0952M7375N4183O1321O8501P6209Q4780R3669J02709J12778J24218
58839D328296J36019J47583J59899J73922J89155K04959K21866K40480K60544
58830F062723K82167L06387L33392L61871L91470M24199M61679N02414N43452
58821I669754N83522O22800O60509O94340P21272P37558P38707P20981O82365
58812A5831808O21316N36004M26390K96333J52478J867j48518k91244m19414n28180
$$ y = [5892797, 5658288, 5436930, 5229669, 5035547, 4853378, 4683882, 4528567, 4387147, 4257756, 4139327, 4032115, 3936029, 3850034, 3773190, 3704904, 3644169, 3589878, 3541866, 3500469, 3465167, 3434884, 3409470, 3389627, 3375513, 3366625, 3362877, 3364566, 3371514, 3383554, 3401737, 3427657, 3461601, 3502553, 3549928, 3604111, 3665432, 3733933, 3810142, 3894922, 3988591, 4091300, 4204078, 4328296, 4464315, 4611898, 4771797, 4945719, 5134874, 5339833, 5561699, 5802179, 6062723, 6344890, 6651277, 6984669, 7346540, 7738010, 8162209, 8623888, 9126302, 9669754, 10253276, 10876076, 11536585, 12230925, 12952197, 13689755, 14428462, 15149443, 15831808, 16453124, 16989128, 17415518, 17711851, 17864329, 17866196, 17717678, 17426434, 17007020, 16478840]
58802A6478840o14801o78220p19384p40953p45721p36032p14985o86682o54284
58793A0187778o18927n81276n42762n04541m66779m29914l95219l63216l32958
58784E952186l03829k76507k51203k26731k02367j79011j57430j37340j19713
58775D098055j08109j05552j11033j20437j29774j36320j38245j35196j28585
58766B984804j20032j10151r9480q9222q0034p1375o2971n5494m9039m2670l6473
58755B167863l2102l0033k8206k4846k0750j7375j4544j1696r601r034r413j0368
58743A949895j2846j6962k0548k1939k2350k3536k4860k4889k4317k4765k5966
58732A706917k6507k6449k6979k8284k9661l0965l2180l2534l1663l0641l0289
$$ y = [16478840, 15864039, 15185819, 14466435, 13725482, 12979761, 12243729, 11528744, 10842062, 10187778, 9568851, 8987575, 8444813, 7940272, 7473493, 7043579, 6648360, 6285144, 5952186, 5648357, 5371850, 5120647, 4893916, 4691549, 4512538, 4355108, 4217768, 4098055, 3989946, 3884394, 3773361, 3652924, 3523150, 3386830, 3248585, 3113389, 2984804, 2864772, 2754621, 2655141, 2565919, 2485885, 2414510, 2351539, 2296045, 2247006, 2204336, 2167863, 2135761, 2105728, 2077522, 2052676, 2031926, 2014551, 2000007, 1988311, 1978710, 1969676, 1960263, 1949895, 1937049, 1920087, 1899539, 1877600, 1855250, 1831714, 1806854, 1781965, 1757648, 1732883, 1706917, 1680410, 1653961, 1626982, 1598698, 1569037, 1538072, 1505892, 1473358, 1441695, 1411054, 1380765]
58721A380765k9665k7843k5795k4783k4170k2686k0615j8873j7239j5268j3630
58710A140198j2801j1743r671p661o679n699l800k452l405n817p871r813j2817
58697A039969j6080j7649j7272j6092j4478j2387j0856j0809j1224j0566r090
58686H93466p700n845k721N91K671M251O815R808J1604J2238J2789J3123J2703
58673I63793J2572J4036J6414J8525K1283K6246L2714L8978M5135N1452N4752
58662A295900M9998L5759J5802m479k1028l1449l5435l5146l3031k9461k3990
58651A183440j7798j2554p903k595K777O829J0264J4884K0346K4744K7947L1635
58639A282016L6365M1269M6331N2402N9228O5821P2511Q0384Q9271R8479J08766
$$ y = [1380765, 1351100, 1323257, 1297462, 1272679, 1248509, 1225823, 1205208, 1186335, 1169096, 1153828, 1140198, 1127397, 1115654, 1105983, 1098322, 1091643, 1085944, 1082144, 1079692, 1076287, 1070470, 1062599, 1052786, 1039969, 1023889, 1006240, 988968, 972876, 958398, 946011, 935155, 924346, 913122, 902556, 893466, 885766, 879921, 877200, 877791, 880462, 884713, 891528, 901336, 912940, 925178, 937967, 951090, 963793, 976365, 990401, 1006815, 1025340, 1046623, 1072869, 1105583, 1144561, 1189696, 1241148, 1295900, 1345898, 1381657, 1397459, 1392980, 1371952, 1340503, 1305068, 1269922, 1236891, 1207430, 1183440, 1165642, 1153088, 1145185, 1142590, 1145367, 1152196, 1162460, 1177344, 1197690, 1222434, 1250381, 1282016, 1318381, 1359650, 1405981, 1458383, 1517611, 1583432, 1655943, 1736327, 1825598, 1924077, 2032843]
58628B032843J21145J34515J47158J59829J74599J91204K07185K20960K32023
58619C621461K38563K37812K28393K09876J80764J39970Q9995L5903j8524p1016
58609D893197j18271j56494j84447k03202k13233k14566k09266k00602j89835
58600C203281j76587j61973j48329j36039j23716j11314j00157r0076p9598o8903
58590B006589n9642n1938m4454l7395l2422k9662k7614k5979k5683k6314k6380
58579A619106k5906k5891k5587k3377j9950j7387j5452j2195p978n278m567m012
58567A431526l466n057r323j4201j8356k2307k5755k7102k6228k4802k3319k0659
58555A210951j6852j3321j0281o867m005m006p124j1441j6026k1134k5461k6877
$$ y = [2032843, 2153988, 2288503, 2435661, 2595490, 2770089, 2961293, 3168478, 3389438, 3621461, 3860024, 4097836, 4326229, 4536105, 4716869, 4856839, 4946834, 4982737, 4964213, 4893197, 4774926, 4618432, 4433985, 4230783, 4017550, 3802984, 3593718, 3393116, 3203281, 3026694, 2864721, 2716392, 2580353, 2456637, 2345323, 2245166, 2155090, 2075492, 2006589, 1946947, 1895009, 1850555, 1813160, 1780738, 1751076, 1723462, 1697483, 1671800, 1645486, 1619106, 1593200, 1567309, 1541722, 1518345, 1498395, 1481008, 1465556, 1453361, 1445383, 1440105, 1435538, 1431526, 1428060, 1423003, 1413680, 1399479, 1381123, 1358816, 1333061, 1305959, 1279731, 1254929, 1231610, 1210951, 1194099, 1180778, 1170497, 1163630, 1159625, 1155619, 1148495, 1137054, 1121028, 1099894, 1074433, 1047556]
58543A047556k5922k5086k4584k2409j8673j5987j5158j4286j2588j1480j1280
58532H50103j0587r407r369j0311j0234r044q646q966p824n185l570l695l660
58519G49605k979l292m323l492m77J965K664L371M633M733L777M342O731Q032
58505G75290P279P108Q716R718Q770Q021Q873R478Q505P431P056N713K943J084
58491H75985J158J063k79r89m23j081m021o476o516o145p194p963o731m980m409
58476H20999m062l083l031m819o563o931p492r351j0671r953q641q169p557o133
58462G24543n345n714n225l022j321j477j651n47J35o39p98R94K666K558K414
58447G07571L920N641O195P040R182J0416Q788N855L778K036l85k535l698n106
$$ y = [1047556, 1021634, 996548, 971964, 949555, 930882, 914895, 899737, 885451, 872863, 861383, 850103, 839516, 830109, 820740, 810429, 800195, 791151, 782505, 773539, 765715, 760530, 756960, 753265, 749605, 746626, 743334, 739011, 735519, 735042, 737007, 739671, 743042, 747675, 752408, 756185, 760527, 767258, 775290, 782569, 789677, 798393, 808111, 816881, 824902, 833775, 843253, 851758, 859189, 866245, 871958, 874901, 875985, 877143, 878206, 877927, 876938, 876515, 875434, 871413, 864937, 858421, 852276, 845082, 837119, 830388, 825408, 820999, 816937, 813854, 810823, 806004, 799441, 792510, 785018, 775667, 764996, 755043, 746402, 738233, 730676, 724543, 719198, 713484, 708259, 705237, 703916, 702439, 700788, 700241, 700376, 699737, 698939, 699933, 702599, 705157, 707571, 711491, 717132, 723327, 730367, 739549, 749965, 758753, 764608, 768386, 770422, 770037, 767502, 763804, 758698]
58433G58698p161p985o834n748n721m815k156j56l69r09k23L78K71J415M210N692
58417G28587M621M036N893P611P052O457P908R115P642N294M514M111K397Q72
58403H06110J098J429L83l12O51J289M57P19L557N904N244L977M720N522M054
58388H44802K377K983L917K471J12p10j152k875l921k175M32J465K270M517O178
58373H60691N323M232N278O366N052L475M561O778P357P184Q051Q585P402O608
58359I46943P846Q656P073N692O728P508N548L468L849M044J540m61J387M127
58345A013948L749K399L944O781P495P573R859J2271J1669J0106J0750J1578R724
58332A121846P996J0113J3461J3674J2556J4121J6634J6102J4204J5092J7516
$$ y = [758698, 751537, 743552, 736718, 730970, 725249, 720434, 718278, 718122, 717753, 716844, 716621, 716999, 717270, 718685, 722895, 728587, 733208, 737244, 743137, 750748, 757800, 764257, 772165, 781280, 788922, 794216, 798730, 802841, 805238, 806110, 807208, 808637, 809020, 808708, 809359, 810648, 811105, 811824, 815381, 821285, 826529, 830506, 835226, 840748, 844802, 847179, 850162, 854079, 856550, 856662, 855952, 854800, 851925, 848004, 845829, 846261, 847726, 849996, 854513, 860691, 866014, 870246, 875524, 881890, 886942, 890417, 894978, 901756, 909113, 916297, 924348, 932933, 940335, 946943, 954789, 963445, 970518, 976210, 982938, 990446, 995994, 999462, 1003311, 1007355, 1008895, 1008434, 1009821, 1013948, 1017697, 1020096, 1024040, 1030821, 1038316, 1045889, 1055748, 1068019, 1079688, 1089794, 1100544, 1112122, 1121846, 1129842, 1139955, 1153416, 1167090, 1179646, 1193767, 1210401, 1226503, 1240707, 1255799, 1273315]
58321A273315J7629J6436J7099J7985J5787J2479J1900J2556J1105R521J1418
58310A427230J4653J5069J4135J5416J7192J6240J5085J7478K0635K0051J8151
58299A611335J9730K2854K2912K1700K3535K6384K5980K4814K7534L1480L1427
58288A889685K9863L2554L7745L9848M0135M3351M7506M7592M5794M7267M9524
58277B350864M6988M2318M1891M3772M1790L7846L8132M0706L9194L5413L5905
58266B794819L9280L9645L9109M3852N1192N3854N3691N7718O4116O6069O5805
58255C369150P0364P7191P8814P8043Q3097R1464R4679R5244J01993J12370J16806
58244D369215J17314J23720J34668J40862J43920J52975J65756J72809J77146
$$ y = [1273315, 1290944, 1307380, 1324479, 1342464, 1358251, 1370730, 1382630, 1395186, 1406291, 1415812, 1427230, 1441883, 1456952, 1471087, 1486503, 1503695, 1519935, 1535020, 1552498, 1573133, 1593184, 1611335, 1631065, 1653919, 1676831, 1698531, 1722066, 1748450, 1774430, 1799244, 1826778, 1858258, 1889685, 1919548, 1952102, 1989847, 2029695, 2069830, 2113181, 2160687, 2208279, 2254073, 2301340, 2350864, 2397852, 2440170, 2482061, 2525833, 2567623, 2605469, 2643601, 2684307, 2723501, 2758914, 2794819, 2834099, 2873744, 2912853, 2956705, 3007897, 3061751, 3115442, 3173160, 3237276, 3303345, 3369150, 3439514, 3516705, 3595519, 3673562, 3756659, 3848123, 3942802, 4038046, 4140039, 4252409, 4369215, 4486529, 4610249, 4744917, 4885779, 5029699, 5182674, 5348430, 5521239, 5698385]
58235E698385J89301K06225K16476K22941K37977K59307K74362K85256L04824
58226G895054L30888L50434L66381L93103M28138M56855M82496N21506N71592
58217A1796447O16308O58869P17733P91061Q61511R33937J029730J146132J262733
58208A9814461J386208J543728J734205J935407K157778K437849K780701L169136
58200C6959473L627915M211743M931703N769999O764815P993254R479947J1236563
58192I0975412J3387873J6125512J9562165K3824840K9185981L5517930M1194208
58185B69773921M2930341L7617980K4862598P688629r342578k2708316l1046137
58178C19776438l4664090l4659334l2371463k9020574k5412768k1915793j8689004
$$ y = [5698385, 5887686, 6093911, 6310387, 6533328, 6771305, 7030612, 7304974, 7590230, 7895054, 8225942, 8576376, 8942757, 9335860, 9763998, 10220853, 10703349, 11224855, 11796447, 12412755, 13071624, 13789357, 14580418, 15441929, 16375866, 17405596, 18551728, 19814461, 21200669, 22744397, 24478602, 26414009, 28571787, 31009636, 33790337, 36959473, 40587388, 44799131, 49730834, 55500833, 62265648, 70258902, 79738849, 90975412, 104363285, 120488797, 140050962, 163875802, 193061783, 228579713, 269773921, 312704262, 350322242, 375184840, 382873469, 373530891, 350822575, 319776438, 285112348, 250453014, 218081551, 189060977, 163648209, 141732416, 123043412]
58171A23043412j5842003j3405818j1323411r545919q071541o872075n866324
58164E2116321m995525m256031l635353l083643k572161k116609j717630j336345
58156B8403024r51769n83008k28320J59613O11347J119971J716548K473833L330768
58147C6052007L945388L846375K803074J041913r00960k518980l561004m029507
58139C6678306m057562l804019l408888k977744k570750k205588j881015j598944
58131A4173796j363129j167772j001227q58768p41187o43575n57445m82508m24375
58122F933810l81083l43616l09711k85026k69904k56723k41773k28300k16296
58113D401378k00517j80780j63354j49816j34771j16815j01702r2260q4975p8752
$$ y = [123043412, 107201409, 93795591, 82472180, 72926261, 64854720, 57982645, 52116321, 47120796, 42864765, 39229412, 36145769, 33573608, 31456999, 29739369, 28403024, 27451255, 26868247, 26639927, 26799540, 27410887, 28530858, 30247406, 32721239, 36052007, 39997395, 43843770, 46646844, 47688757, 46787797, 44268817, 40707813, 36678306, 32620744, 28816725, 25407837, 22430093, 19859343, 17653755, 15772740, 14173796, 12810667, 11642895, 10641668, 9782900, 9041713, 8398138, 7840693, 7358185, 6933810, 6552727, 6209111, 5899400, 5614374, 5344470, 5087747, 4845974, 4617674, 4401378, 4200861, 4020081, 3856727, 3706911, 3572140, 3455325, 3353623, 3261363, 3176388, 3097636]
58103C097636p7369q0736q3051q2135q1777q2779q0729p4960p0633o9544o7501
58092B246422o3107o0384o0306n8402n3298m9290m7953m5443m0567l7315l6909
58081A693448l5473l2063l0791l2481l2427k9148k7184k8264k7912k4080k1068
58070A372557k1318k1043j7833j5164j5451j5585j3386j1753j2473j2362r550
58059A206639p482q675j0329r933r638j1287j2549j1619j0642j1030j0477p886
58047A085092o188p019p566n810m079m248m268k432m89K59J392L427M175L328
58033A055574L724N798O012L225J032J211N34k823n483m933l887m904n931n065
58019A044084m594o258p357n792m360n650p054n377k517j899k753k452j519j991
$$ y = [3097636, 3020267, 2939531, 2856480, 2774345, 2692568, 2609789, 2529060, 2454100, 2383467, 2313923, 2246422, 2183315, 2122931, 2062625, 2004223, 1950925, 1901635, 1853682, 1808239, 1767672, 1730357, 1693448, 1657975, 1625912, 1595121, 1562640, 1530213, 1501065, 1473881, 1445617, 1417705, 1393625, 1372557, 1351239, 1330196, 1312363, 1297199, 1281748, 1266163, 1252777, 1241024, 1228551, 1216189, 1206639, 1199157, 1190482, 1180153, 1170220, 1160582, 1149295, 1136746, 1125127, 1114485, 1103455, 1092978, 1085092, 1078904, 1071885, 1064319, 1058509, 1054430, 1050182, 1045914, 1043482, 1042993, 1043252, 1044644, 1048071, 1052246, 1055574, 1059298, 1065096, 1071108, 1074333, 1075365, 1076576, 1077110, 1074287, 1068804, 1063871, 1059984, 1055080, 1049149, 1044084, 1039490, 1033232, 1025875, 1020083, 1015723, 1010073, 1003019, 997642, 995125, 993226, 990473, 988021, 986502, 984511]
58005I84511l413m324n260o946q038p687p691r189j0179r044p486p093o339l922
57991H87900j803j731k054j099m70j624k432p31J672K091J305J315J489M81o09
57976H83700m16k43j393k094n41J283M26k419m555n525o525p358p253p072p668
57961H32347p703n845l399k218j833j200j113k164k545q14J242J477J008J950
57947H09190L532L728K911K643K401P80j423k432k622l569n189o407p408q601
57933G87534q783p049n095m990n970o021n300n215n501m979m058l780l467j976
57919G15350j65M44M16J259K640L276L532M644O209O982P270Q219R509J0058J0115
57904G89758J0455J0496R327P641O452M997K129j262l470m580n666o505o405o255
$$ y = [984511, 981098, 976774, 971514, 964568, 956530, 948843, 941152, 931963, 921784, 912740, 905254, 898161, 891822, 887900, 886097, 884366, 882312, 881213, 880743, 879119, 876687, 875956, 877628, 879719, 881024, 882339, 883828, 884309, 883700, 883284, 883041, 881648, 879554, 879013, 880296, 880722, 878303, 873748, 868223, 861698, 854340, 847087, 840015, 832347, 824644, 818799, 815400, 813182, 811349, 810149, 809036, 806872, 804327, 803513, 804755, 806232, 807240, 809190, 812722, 816450, 819361, 822004, 824405, 825185, 823762, 821330, 818708, 815139, 809950, 803543, 796135, 787534, 778751, 771702, 766607, 761617, 755647, 749626, 744326, 739111, 733610, 728631, 724573, 720793, 717326, 715350, 715185, 715629, 716045, 717304, 719944, 723220, 726752, 731396, 737605, 744587, 751857, 760076, 769585, 779643, 789758, 800213, 810709, 820036, 827677, 834129, 839126, 841255, 839993, 836523, 831943, 826277, 819772, 813367, 807112]
57890H07112p279q621q576p502p096p528p474o532n385m129k421p80P3O10J652
57875G36124K884L742M674N986O648O048N589O589P955P975P092O700O526N579
57861H20111M421M051L617J756o97j860j765j783j996j676j507k685m436m960
57847H10591m323l999m127l656k721k388k456j838p33k53l21j45k69j773l977
57832G77612n276n791o814q094q242p468p355q077q318p895p947q544q483p640
57818F71668p212p429p124n796m155k557q55K87o0j200j412m29O13J434K744M267
57802F42784M969N295O871R727J2013J2764J2890J3122J3062J2715J2937J3750
57790G72899J4014J3183J1773R802O625K661n07k296l744n561p197q272r302j0448
$$ y = [807112, 799833, 791212, 782636, 775134, 768038, 760510, 753036, 746504, 741119, 736990, 734569, 733789, 733862, 734472, 736124, 739008, 742750, 747424, 753410, 760058, 766106, 771695, 778284, 786239, 794214, 801306, 808006, 814532, 820111, 824532, 828583, 832200, 833956, 833259, 831399, 829634, 827851, 825855, 824179, 822672, 819987, 815551, 810591, 806268, 802269, 798142, 794486, 791765, 789377, 786921, 785083, 784350, 784097, 783776, 783631, 783362, 781589, 777612, 772336, 766545, 759731, 751637, 743395, 735927, 728572, 720495, 712177, 704282, 696335, 687791, 679308, 671668, 664456, 657027, 649903, 644107, 639952, 637395, 636540, 636827, 636767, 635567, 634155, 633726, 634339, 635773, 638517, 642784, 647753, 653048, 659919, 669646, 681659, 694423, 707313, 720435, 733497, 746212, 759149, 772899, 786913, 800096, 811869, 821671, 828296, 830957, 830450, 828154, 824410, 818849, 811652, 803380, 794078, 783630]
57776G83630j0939j0344r189p928o458m833l415k193r57rL99Q98K107L424M130
57761G38323M895O449P549O538M369L634M724N526M987M332M429M485M133M351
57747H08724N456O284O292O501P475Q223Q099P972Q525R051R002R145J0150J1448
57733I22347J2405J3353J4577J5599J6278J7287J8783J9914K0449K1513K3800
57722A116305K6361K8106K9352L0947L2981L5281L8187M1895M5919M9896N4218
57711A529448N9241O4839P1210P9125Q8737R9074J09379J20174J32423J46415
57701B500065J61828J78087J94194K09010K21880K32190K38170K36999K26257
57692D398680K04484J70855J26028P3517J8738l3779q1257j21204j51186j70592
$$ y = [783630, 772691, 762347, 753158, 745230, 738772, 733939, 730524, 728331, 727374, 727365, 727764, 728662, 730769, 734193, 738323, 743218, 749667, 757216, 763754, 768123, 771757, 776481, 782007, 786994, 791326, 795755, 800240, 804373, 808724, 814180, 820464, 826756, 833257, 840732, 848955, 857054, 865026, 873551, 882602, 891604, 900749, 910899, 922347, 934752, 948105, 962682, 978281, 994559, 1011846, 1030629, 1050543, 1070992, 1092505, 1116305, 1142666, 1170772, 1200124, 1231071, 1264052, 1299333, 1337520, 1379415, 1425334, 1475230, 1529448, 1588689, 1653528, 1724738, 1803863, 1892600, 1991674, 2101053, 2221227, 2353650, 2500065, 2661893, 2839980, 3034174, 3243184, 3465064, 3697254, 3935424, 4172423, 4398680, 4603164, 4774019, 4900047, 4973564, 4992302, 4958523, 4877266, 4756062, 4604876, 4434284]
57682D434284j80993j84068j80556j71478j58582j42909j24453j03852q2655o1275
57672C043463l8342j2881J4532M2986P0863R2604R8618Q1673M3498o062n5342
57661C375610r5479j21275j31341j28163j16435j00394q2770o5301m8869l3296
57651B452287j8083l395J0264K2982L5323M7678O0308P3609Q7701J02161J16704
57640B987539J31675J47302J62890J77196J89066J97168J99639J94565J80568
57631D567608J56876J23567Q2125L5251j4075o2770j07087j43397j70137j88162
57621D279799j98785k02504k00048j93247j83970j73004j60740j48057j35736
57612B683708j23847j12434j02026r2803q4081p5379o7187o0092n3934m8433m3792
$$ y = [4434284, 4253291, 4069223, 3888667, 3717189, 3558607, 3415698, 3291245, 3187393, 3104738, 3043463, 3005121, 2992240, 3006772, 3049758, 3120621, 3213225, 3311843, 3393516, 3437014, 3430952, 3375610, 3280131, 3158856, 3027515, 2899352, 2782917, 2682523, 2599753, 2534452, 2485583, 2452287, 2434204, 2430809, 2441073, 2464055, 2499378, 2547056, 2607364, 2680973, 2768674, 2870835, 2987539, 3119214, 3266516, 3429406, 3606602, 3795668, 3992836, 4192475, 4387040, 4567608, 4724484, 4848051, 4930176, 4965427, 4951352, 4888582, 4781495, 4638098, 4467961, 4279799, 4081014, 3878510, 3678462, 3485215, 3301245, 3128241, 2967501, 2819444, 2683708, 2559861, 2447427, 2345401, 2252598, 2168517, 2093138, 2025951, 1965859, 1911925, 1863492, 1819700]
57601A819700l9978l6292l2384k8869k6216k3936k1526j9285j7517j5849j4125
57590A543723j3026j2848j2611j1270r083o972n328m126l382k722j403M78J829
57577A463259K300L019M724O485P438Q472J0755J3629J5558J6360J6994J7887
57565A586880J9001K0879K3975K7375K9743L1270L3302L6347L9787M3349M7457
57554A939365N2235N7441O3312P0329P8289Q6666R5659J05790J16702J27473J37866
57543B931127J48103J57538J64728J68656J68633J63088J49793J27690R7699O1831
57533D338886K2459j7608n5434q8746j15865j35303j46451j50625j50292j47053
57523C353968j41076j32397j21844j10553r9382q8895p9206o9954o1031n3125
$$ y = [1819700, 1779722, 1743430, 1711046, 1682177, 1655961, 1632025, 1610499, 1591214, 1573697, 1557848, 1543723, 1530697, 1517849, 1505238, 1493968, 1484885, 1477913, 1472585, 1468459, 1465077, 1462355, 1460952, 1461430, 1463259, 1465559, 1468578, 1473302, 1479787, 1487225, 1495697, 1506452, 1520081, 1535639, 1551999, 1568993, 1586880, 1605881, 1626760, 1650735, 1678110, 1707853, 1739123, 1772425, 1808772, 1848559, 1891908, 1939365, 1991600, 2049041, 2112353, 2182682, 2260971, 2347637, 2443296, 2549086, 2665788, 2793261, 2931127, 3079230, 3236768, 3401496, 3570152, 3738785, 3901873, 4051666, 4179356, 4277055, 4338886, 4361345, 4343737, 4288303, 4199557, 4083692, 3948389, 3801938, 3651313, 3501021, 3353968, 3212892, 3080495, 2958651, 2848098, 2748716, 2659821, 2580615, 2510661, 2449630, 2396505]
57513B396505m6745m1009l4496k7150k0296j4803j0300o251k738J56K880N900
57501B201653R280J2945J6882K1006K5249K9750L4484L9095M3652M9136N6334
57490B539466O4563P2515Q0152Q8690R8779J09756J20732J31342J41224J49723
57480C596942J56265J60135J59681J52560J37241J13751Q3096M6725O801l3740
57470D579457p1783j04507j29747j46698j56240j59919j58653j53076j44596j35020
57460C219218j25176j14846j04067r3507q3622p4455o6276n9367n3137m6607l9915
57449B358243l4301l0306k7095k3845k0768j8306j6274j4305j2384j0487q470
57438B141702o555n239m413l363j907o86l5N45J463K368K912L321L847M286M478
$$ y = [2396505, 2349760, 2308751, 2274255, 2247105, 2226809, 2212006, 2201706, 2195455, 2192717, 2192873, 2195753, 2201653, 2210933, 2223878, 2240760, 2261766, 2287015, 2316765, 2351249, 2390344, 2433996, 2483132, 2539466, 2604029, 2676544, 2756696, 2845386, 2944165, 3053921, 3174653, 3305995, 3447219, 3596942, 3753207, 3913342, 4073023, 4225583, 4362824, 4476575, 4559671, 4606396, 4613197, 4579457, 4507674, 4403167, 4273420, 4126722, 3970482, 3810563, 3651910, 3498834, 3354238, 3219218, 3094042, 2979196, 2875129, 2781622, 2698000, 2623545, 2557269, 2497902, 2444765, 2398158, 2358243, 2323942, 2293636, 2266541, 2242696, 2221928, 2203622, 2187348, 2173043, 2160659, 2150172, 2141702, 2135147, 2129908, 2125495, 2122132, 2120225, 2119539, 2119504, 2120049, 2121512, 2123880, 2126792, 2130113, 2133960, 2138246, 2142724]
57423B142724M658M978N392O081P243Q300Q332P642P767R383J1253J1901J1436
57410B247090J0955J0997J1440J2180J2962J3141J2509J1923J2295J3271J3766
57399B382529J3509J3247J3571J4259J4783J4923J4797J4620J4545J4613J4842
57388B540238J5316J5924J6174J5721J4962J4595J4612J4471J4196J4433J5245
57377B705887J5878J6037J6431J7511J8587J8833J8434J8013J7652J7193J6891
57366B897347J7032J7352J7527J7730J8165J8590J8906J9588K0827K1827K1828
57355C106719K1266K1089K1336K1401K1331K1818K2979K4080K4541K4469K4101
57344C355130K3416K2470K1568K0974K0704K0670K0766K0933K1337K2251K3518
$$ y = [2142724, 2147382, 2152360, 2157752, 2163833, 2171076, 2179376, 2187708, 2195350, 2203117, 2212500, 2223753, 2235654, 2247090, 2258045, 2269042, 2280482, 2292662, 2305624, 2318765, 2331274, 2343197, 2355492, 2368763, 2382529, 2396038, 2409285, 2422856, 2437115, 2451898, 2466821, 2481618, 2496238, 2510783, 2525396, 2540238, 2555554, 2571478, 2587652, 2603373, 2618335, 2632930, 2647542, 2662013, 2676209, 2690642, 2705887, 2721765, 2737802, 2754233, 2771744, 2790331, 2809164, 2827598, 2845611, 2863263, 2880456, 2897347, 2914379, 2931731, 2949258, 2966988, 2985153, 3003743, 3022649, 3042237, 3063064, 3084891, 3106719, 3127985, 3149074, 3170410, 3191811, 3213142, 3234960, 3257939, 3282019, 3306560, 3331029, 3355130, 3378546, 3401016, 3422584, 3443558, 3464262, 3484932, 3505698, 3526631, 3547968, 3570219, 3593737]
57333C593737K4455K4663K4546K4665K4972K5203K5607K6586K7845K8592K8539
57322C879410K8175K8098K8551K9544L0883L2074L2705L2873L2976L3174L3396
57311D221859L3751L4458L5460L6466L7430L8659M0392M2413M4130M5020M5180
57300D655218M5405M6454M8220M9944N1236N2342N3364N3865N3532N2578N1183
57289E213341M9054M5908M1850L6933L0993K4313J7834J2192P166K551j096l174
57277E477865l913l870l097j507N04K563M972Q120J1613J4674J7033J8820K0081
57264E563858K1089K2535K4578K6254K6675K6325K6272K6608K6760K6877K7652
57253E845483K8950K9816K9887K9744K9837L0001L0179L0679L1522L2267L2705
$$ y = [3593737, 3618192, 3642855, 3667401, 3692066, 3717038, 3742241, 3767848, 3794434, 3822279, 3850871, 3879410, 3907585, 3935683, 3964234, 3993778, 4024661, 4056735, 4089440, 4122313, 4155289, 4188463, 4221859, 4255610, 4290068, 4325528, 4361994, 4399424, 4438083, 4478475, 4520888, 4565018, 4610038, 4655218, 4700623, 4747077, 4795297, 4845241, 4896477, 4948819, 5002183, 5056048, 5109580, 5162158, 5213341, 5262395, 5308303, 5350153, 5387086, 5418079, 5442392, 5460226, 5472418, 5479584, 5482135, 5481039, 5477865, 5473952, 5470082, 5466985, 5465478, 5465982, 5468545, 5473517, 5481637, 5493250, 5507924, 5524957, 5543777, 5563858, 5584947, 5607482, 5632060, 5658314, 5684989, 5711314, 5737586, 5764194, 5790954, 5817831, 5845483, 5874433, 5904249, 5934136, 5963880, 5993717, 6023718, 6053897, 6084576, 6116098, 6148365, 6181070]
57242F181070L3132L3785L4479L4827L4599L3926L3477L3963L5105L5670L5121
57231F559154L4487L4812L5507L5329L4376L3722L3501L2809L1464L0430L0390
57220F925981L1029L1852L2722L3389L3572L3648L4339L5558L6416L6467L6134
57209G301107L5877L5714L5486L4790L2797K8925K3364J6231O949m005j3255j6164
57197G517816j0515K491K0243L9857N7677P0238P6654P8565P7400P3312O7169
57186H070907O1259N6839N2718M7558M2168L8117L5273L2198K8244K4013K0204
57175H509498J7030J4392J1976R480P153N487M276K774R39n16j608l367o177r127
57161H562210j1544j3956j6850j9779k2274k4530k6506k7673k8343k9929l2952
$$ y = [6181070, 6214202, 6247987, 6282466, 6317293, 6351892, 6385818, 6419295, 6453258, 6488363, 6524033, 6559154, 6593641, 6628453, 6663960, 6699289, 6733665, 6767387, 6800888, 6833697, 6865161, 6895591, 6925981, 6957010, 6988862, 7021584, 7054973, 7088545, 7122193, 7156532, 7192090, 7228506, 7264973, 7301107, 7336984, 7372698, 7408184, 7442974, 7475771, 7504696, 7528060, 7544291, 7551240, 7547235, 7533980, 7517816, 7507301, 7509792, 7530035, 7569892, 7627569, 7697807, 7774461, 7853026, 7930426, 8003738, 8070907, 8132166, 8189005, 8241723, 8289281, 8331449, 8369566, 8404839, 8437037, 8465281, 8489294, 8509498, 8526528, 8540920, 8552896, 8562376, 8569529, 8575016, 8579292, 8582066, 8583005, 8582489, 8580881, 8577514, 8571337, 8562210, 8550666, 8536710, 8519860, 8500081, 8477807, 8453277, 8426771, 8399098, 8370755, 8340826, 8307874]
57150H307874l6180l8551m0626m3197m5822m7934n0083n2780n5223n6376n6296
57139G784806n5222n2552m7970m2569l7525l2580k7067k1421j6453j2056p994
57128G431397n043m055m680o185q798j3076j8639k4388k9225l2288l4072l7542
57116G213406m5364n4375n5633m2708j8197J0815M2223Q0255J27984J81850K34498
57105G674754K81327L23984L69084M23906M92543N76314O77864Q03412R60547
57096A2583735J156443J399520J700044K066476K502660L009709L586787M226688
57088C2232062M912993N623649O333020P007268P603109Q074310Q367708Q399783
57080H8553902Q048861P204048N846474M083308K097739O9301j862476l587626
$$ y = [8307874, 8271694, 8233143, 8192517, 8149320, 8103498, 8055564, 8005481, 7952701, 7897478, 7841102, 7784806, 7729584, 7677032, 7629062, 7586493, 7548968, 7516388, 7489321, 7467900, 7451447, 7439391, 7431397, 7426354, 7422299, 7417619, 7411434, 7402636, 7389560, 7370921, 7346533, 7317308, 7285020, 7250948, 7213406, 7168042, 7113667, 7058034, 7015326, 6997129, 7007944, 7050167, 7130422, 7258406, 7440256, 7674754, 7956081, 8280065, 8649149, 9073055, 9565598, 10141912, 10819776, 11623188, 12583735, 13740178, 15139698, 16839742, 18906218, 21408878, 24418587, 28005374, 32232062, 37145055, 42768704, 49101724, 56108992, 63712101, 71786411, 80154119, 88553902, 96602763, 103806811, 109653285, 113736593, 115834332, 115903633, 114041157, 110453531]
57072A10453531n017476o100191o833943p254939p412569p353621p118894o744615
57064E6617283o265648n718929n142387m568590m020059l510566l048321k636884
57056B1705899k275589j961673j691900j462057j266697j100644r60124q41981
57048A0145234p42891o59842n90390n31923m81507m36938l97237l61908l30402
57039E612196l02425k77932k56554k37549k20359k04634j89929j75999j63252
57030C583563j52179j42485j33395j24515j15788j07079r8536r0990q5075q0248
57020B453273p5463p0434o5538o0955n6700n3009m9847m6501m2525l8557l5295
57009A858449l2397k9237k5976k2808j8985j3720p395o64O756J5375K5182L6818
$$ y = [110453531, 105436055, 99335864, 92501921, 85246982, 77834413, 70480792, 63361898, 56617283, 50351635, 44632706, 39490319, 34921729, 30901670, 27391104, 24342783, 21705899, 19430310, 17468637, 15776737, 14314680, 13047983, 11947339, 10987215, 10145234, 9402343, 8742501, 8152111, 7620188, 7138681, 6701743, 6304506, 5942598, 5612196, 5309771, 5031839, 4775285, 4537736, 4317377, 4112743, 3922814, 3746815, 3583563, 3431384, 3288899, 3155504, 3030989, 2915201, 2808122, 2709586, 2618596, 2533521, 2453273, 2377810, 2307376, 2241838, 2180883, 2124183, 2071174, 2021327, 1974826, 1932301, 1893744, 1858449, 1826052, 1796815, 1770839, 1748031, 1729046, 1715326, 1707931, 1707267, 1714023, 1729398, 1754580, 1791398]
56997A791398N1982P1226R3805J22102J62222K13279K56049K59880K06748J07594
56987C336285o183j04604j71989k05539k10160j95858j74467j54455j38522j25980
56977A848528j15740j06682r7369q7036p6315o6200n6915m8284m0599l4421k9871
56966A089096k6611k4257k2412k0424j7548j3374p949j529N557J2598J8058J9720
56954A010925J5872O724n313j6977k5919l1396l3777l3771l1993k8912k5002k0889
56942G79572j7231j4326j1901r404o481l145M58M345Q755J4059K0571K8047L5026
56929H28345L8560L5385K4238P320j0803k6005l6385m1789m2730m0269l6223l2413
56917F67231k9500k6974k4224k1202j8115j5043j2161j0009r101r260r517q887
$$ y = [1791398, 1843380, 1914606, 2008411, 2130513, 2292735, 2506014, 2762063, 3021943, 3228691, 3336285, 3330102, 3225498, 3053509, 2847970, 2637810, 2441952, 2267485, 2113030, 1974508, 1848528, 1732788, 1626106, 1528737, 1441701, 1365386, 1299186, 1242271, 1193987, 1153388, 1118967, 1089096, 1062485, 1038228, 1015816, 995392, 977844, 964470, 956521, 954992, 960549, 973147, 991205, 1010925, 1026797, 1033521, 1028208, 1011231, 985312, 953916, 920139, 886368, 854375, 825463, 800461, 779572, 762341, 748015, 736114, 726710, 720229, 717084, 717542, 721887, 730642, 744701, 765272, 793319, 828345, 866905, 902290, 926528, 933848, 923045, 897040, 860655, 818866, 776136, 735867, 699644, 667231, 637731, 610757, 586533, 565331, 547216, 532173, 520012, 510003, 500902, 491642, 482125, 473238]
56905D73238p330n762m988m796m354l352k207j191j0J532L041M093M883N958P617
56890D66372R856J2611J5768J9175K2755K6048K7489K4994J7845P690k720j1340
56878F36543j7189j9861j9730j8126j6327j4402j1636p898l933m21K530N204Q100
56865E22854J1818J6535K1836K7628L4856M4299N4379O0872N9254M7569K7632
56854I29532M213j7186l2784m1629m4704m3388l8915l2648k5939j9600j3794q312
56842F14846k738L406J0299J7808K6005L5297M6016N8337P2455Q7194R7742R6481
56830A163148P8434M6036P701k7952n5714p3347q0636p9694p4149o6672n7829
56819G79326m7720l7550k8730k1319j4344p186J11P513J5375K4243L4728M7056
$$ y = [473238, 465908, 460146, 455158, 450362, 446008, 442656, 440449, 439258, 439248, 440780, 443821, 447914, 452797, 458755, 466372, 476228, 488839, 504607, 523782, 546537, 572585, 600074, 625068, 642913, 650603, 647883, 636543, 619354, 599493, 579763, 561637, 545310, 530908, 519272, 511374, 507441, 507020, 509550, 514754, 522854, 534672, 551207, 573043, 600671, 635527, 679826, 734205, 795077, 854331, 901900, 929532, 933745, 916559, 883775, 842146, 797442, 754054, 715139, 682491, 656552, 636952, 623158, 614846, 612108, 615514, 625813, 643621, 669626, 704923, 750939, 809276, 881731, 968925, 1066667, 1163148, 1241582, 1287618, 1295319, 1267367, 1211653, 1138306, 1057670, 977976, 903827, 837155, 779326, 731606, 694056, 665326, 644007, 629663, 622477, 622588, 630101, 645476, 669719, 704447, 751503]
56807G51503N9945O9745P1369O1030L8959R970j8846m1710n6285o3170o4104o0911
56795G57495n5232m8279m0770l3354k6845k1579j6993j2403p861l640P32O080
56783D97351J2562J9760K7299L4150L7527L4090K3009P169q984k2218l1232l5968
56771E94515l7199l6213l4071l1088k7330k3301j9806j7274j5475j3844j1982
56760C26932r959q162o868o064n664n601n527m898l697k706k618l239l965m571
56746B53393m940m569l196j651j177j924k817k978k536k064j844j844j905j801
56732B18147j450j046q38q95j230j796k143j709p78m46j046j439o66M97O72j02
56716B03732o50n63m34n30m66j43J09L20Q17J389J448R47K75n12j438j850j124
$$ y = [751503, 811448, 881193, 952562, 1013592, 1052551, 1062521, 1043675, 1001965, 945680, 882510, 818406, 757495, 702263, 653984, 613214, 579860, 553015, 531436, 514443, 502040, 494179, 490539, 491271, 497351, 509913, 529673, 556972, 591122, 628649, 662739, 685748, 692917, 683933, 661715, 630483, 594515, 557316, 521103, 487032, 455944, 428614, 405313, 385507, 368233, 352758, 338914, 326932, 316973, 308811, 301943, 295879, 290215, 284614, 279087, 274189, 270492, 267786, 265168, 261929, 257964, 253393, 248453, 243884, 240688, 239037, 237860, 235936, 233119, 230141, 227605, 225541, 223697, 221853, 219948, 218147, 216697, 215651, 214813, 213918, 212688, 210892, 208749, 207040, 206262, 205816, 204770, 203331, 202665, 203162, 203834, 203732, 203082, 202519, 202085, 201555, 201089, 200946, 201055, 201375, 202192, 203581, 205029, 205976, 206251, 205739, 204301, 202451, 201327]
56699B01327J41P36N61M93P68P73M10K96N18M98K27L02O17L77l73n85J5M06p8
56680B07429q56j382j975k736k900k119j396j761k748l013j980k67J047J151J9
56665A86513j431k081j752j122o04l5N38O62J86n68j421k269k531j717n18j93
56649A71657p44r80m80j59n09p26k81M3n18j379j539j004n05m05n74q29r32o63
56631A59473j72J35K51M65O65M88K07M56J076J259R16P85J041J028N51K21K49
56614A69094J86M5L28P39L49n38m71P10J289L59o37k40P90R99N96P15J304J389
56596A77006Q52M28L83L67L04M21O55Q64J232J850K294K227J993K026K171K119
56580A97192K029K206K648L258L906M118L471K554K504L393M082M083M283N341
$$ y = [201327, 201468, 202204, 202765, 203258, 204026, 204799, 205209, 205505, 206023, 206521, 206748, 207050, 207667, 208044, 207671, 207086, 207101, 207507, 207429, 206573, 205191, 203216, 200480, 197580, 195461, 194065, 192304, 189556, 186543, 184563, 184296, 185343, 186494, 186513, 185082, 183001, 181249, 180127, 179523, 179488, 180026, 180688, 180874, 180306, 178885, 176616, 174085, 172368, 171850, 171657, 170913, 169933, 169453, 169294, 168785, 168059, 167778, 167821, 167303, 165924, 164385, 163381, 162876, 162471, 161897, 161068, 160136, 159473, 159301, 159436, 159687, 160152, 160817, 161305, 161512, 161968, 163044, 164303, 165219, 166004, 167045, 168073, 168624, 168845, 169094, 169280, 169325, 169653, 170392, 170741, 170203, 169732, 170442, 171731, 172090, 171453, 171213, 172003, 173002, 173598, 174313, 175617, 177006, 177858, 178286, 178669, 179036, 179340, 179761, 180416, 181280, 182512, 184362, 186656, 188883, 190876, 192902, 195073, 197192, 199221, 201427, 204075, 207333, 211239, 215357, 218828, 221382, 223886, 227279, 231361, 235444, 239727, 245068]
56566B45068O697P799R042J0525J1245J0664R979J0590J2043J2701J1847J0157
56554C68357Q572P575P128O651N496L828K384J163o27l032n017o204p509r312
56540C79453j0468j0242r806j0487j1654j1844j1003j0213r856r531r196r096
56528B56057q930q227p137n978m518k705j401j361k007k271k102k151k445k462
56514B02362k183k006j948j730j420j242j047n75M0N14Q00Q31M91Q4J87O94Q70
56497A94722O13O27R98Q55jm52K22J196J506J423J532J620J431J349J510J356
56481B10507R27J281K625L474K862K070K682M162M855M435L828L523L315L111
56467B53657K814K131J468K025L957N580N550M630M053L502K232R54P29J021O43
$$ y = [245068, 251765, 259564, 268606, 279131, 290376, 301040, 311019, 321609, 333652, 346353, 358200, 368357, 376929, 384504, 391632, 398283, 403779, 407607, 409991, 411154, 410527, 407495, 402478, 396274, 388765, 379453, 368985, 358743, 348937, 338450, 326796, 314952, 303949, 293736, 283880, 274349, 265153, 256057, 247127, 238900, 231763, 225785, 221267, 218562, 217161, 215800, 213793, 211522, 209420, 207269, 204824, 202362, 200179, 198173, 196225, 194495, 193075, 191833, 190786, 190211, 190251, 190765, 191565, 192396, 192887, 192971, 193158, 193852, 194722, 195335, 195962, 196960, 197815, 197814, 197362, 197584, 198780, 200286, 201709, 203241, 204861, 206292, 207641, 209151, 210507, 211434, 212715, 215340, 218814, 221676, 223746, 226428, 230590, 235445, 239880, 243708, 247231, 250546, 253657, 256471, 258602, 260070, 262095, 266052, 271632, 277182, 281812, 285865, 289367, 291599, 292553, 293282, 294303, 294946]
56452B94946j35k43J83J57k45j40N03R85J275J797K194J775Q15J25l50j271k556
56435B99815l505l911m114m285m566n255o148o405n815n177m759l706j970j185
56421B39014k229l442k981j584j126j635j821j522j547j745j280l52J55K76O28
56406B18809R52O25J3j20L7j9J06Q55J555J549J550K264K779K058J005J060J772
56389B36850J710R48O19P61O66O56J453K419K411J716J359J187N85J73P15J253
56373B55481N44m88m4J448K000J229N52O08Q15J093J746K062J217J55L31J164
56357B69913J105O14J371K962L247J966J193J909K814K965L164M036M822M854
56343C06935M533M384M482N029O064O784O556O201O758P521O978N249L711K904
$$ y = [294946, 294811, 294568, 294751, 294908, 294663, 294523, 295026, 296011, 297286, 299083, 301277, 303052, 303867, 303992, 303642, 302371, 299815, 296310, 292399, 288285, 284000, 279434, 274179, 268031, 261626, 255811, 250634, 245875, 242169, 240199, 239014, 236785, 233343, 230362, 228778, 227652, 226017, 224196, 222674, 221127, 219382, 218102, 217750, 217905, 218181, 218809, 219761, 220386, 220399, 220279, 220316, 220297, 220403, 221258, 222813, 224362, 225912, 228176, 230955, 233013, 234018, 235078, 236850, 238560, 239508, 240127, 240888, 241554, 242210, 243663, 246082, 248493, 250209, 251568, 252755, 253340, 253513, 254228, 255481, 256025, 255537, 255493, 256941, 258941, 260170, 260722, 261330, 262145, 263238, 264984, 267046, 268263, 268418, 268749, 269913, 271018, 271632, 273003, 275965, 279212, 281178, 282371, 284280, 287094, 290059, 293223, 297259, 302081, 306935, 311468, 315852, 320334, 325363, 331427, 338211, 344767, 350968, 357726, 365247, 372225, 377474, 381185, 384089]
56329C84089K542K926M272N339M866L640L009K323L47j789j978q09q34k481l674
56314D01788l427k798k311j324j62o4p46o25L51P17M39J092K827L888L701L766
56298D07112N018O525P405P892Q055P638P252P852Q903R134Q950R862J1774J3119
56284E26491J3532J4053J4943J5753J7113J9848K2717K3815K3854K5187K7971
56273G45277L0406L2483L6049M1233M6169N0526N5965O2740O9139P4755Q1197
56262A325939Q8981R6794J04178J12000J19840J25977J30294J34137J37065J36896
56252B512101J33299J27979J20954J10175R5405P9171O3038M6247K8825J2828
56242C330022l89j1262j9861k5698k9986l4887m0046m3204m4566m7044n1724n6756
$$ y = [384089, 386631, 389557, 393829, 399168, 404034, 407674, 410683, 413006, 413353, 411564, 409586, 408777, 407943, 405462, 401788, 398361, 395563, 393252, 391928, 391766, 391702, 390956, 390331, 390682, 391399, 391838, 392930, 395757, 399645, 403346, 407112, 412130, 418655, 426060, 433952, 442007, 449645, 456897, 464749, 473652, 482786, 491736, 501598, 513372, 526491, 540023, 554076, 569019, 584772, 601885, 621733, 644450, 668265, 692119, 717306, 745277, 775683, 808166, 844215, 885448, 931617, 982143, 1038108, 1100848, 1169987, 1244742, 1325939, 1414920, 1511714, 1615892, 1727892, 1847732, 1973709, 2104003, 2238140, 2375205, 2512101, 2645400, 2773379, 2894333, 3004508, 3099913, 3179084, 3242122, 3288369, 3317194, 3330022, 3329633, 3318371, 3298510, 3272812, 3242826, 3207939, 3167893, 3124689, 3080123, 3033079, 2981355, 2924599]
56230B924599o1365o7081p4234q0826q5990r0953r5785r8714r9534j00117j00808
56219A969192r9884r7195r4496r1623q6450p9382p3520o9450o4376n7513n1702
56208A103601m8128m4191l8530l3581l0950k8569k4733k0972j8599j6270j3232
56197G85846j1170j0706r671p067m942m366l342q83Q13M64J97J554K752K287J584
56182G43350J801J609M03M9J218J719O11P4J046J113p86j789kK150K348K269L963
56165G61146O100O897P386Q727R548Q856Q398R458J0509J0473J0995J3037J4684
56152H86214J4785J5266J7555K0214K2363K5629L0499L4667L7364M1303M8073
56141A193932N5775O3522P3922Q8471J04858J21270J38608J55769J67478J69899
$$ y = [2924599, 2863234, 2796153, 2721919, 2641093, 2555103, 2464150, 2368365, 2269651, 2170117, 2070000, 1969192, 1869308, 1772113, 1677617, 1585994, 1499544, 1420162, 1346642, 1277192, 1212816, 1155303, 1103601, 1055473, 1011282, 972752, 939171, 908221, 879652, 854919, 833947, 815348, 799078, 785846, 774676, 763970, 754299, 747232, 742290, 737924, 734582, 733699, 734512, 734976, 735173, 736727, 739479, 741766, 743350, 745151, 746760, 747163, 747212, 748430, 750149, 750760, 750834, 751880, 752993, 752207, 750418, 750416, 752566, 754914, 757183, 761146, 767246, 774143, 781529, 790256, 799804, 808660, 817058, 826516, 837025, 847498, 858493, 871530, 886214, 900999, 916265, 933820, 954034, 976397, 1002026, 1032525, 1067192, 1104556, 1145859, 1193932, 1249707, 1313229, 1387151, 1475622, 1580480, 1701750, 1840358, 1996127, 2163605, 2333504]
56131B333504J64221J52425J34737J14008R6918Q7059Q1317P5983P1006O5225
56121C376403N3781L4916J4155k593j5254k5418l1964l5631m2470n7309p7955
56110C190661r9935j21982j42601j56802j61499j59513j53854j43116j27012j10625
56100A813722r7878q6195p2803o0756n3155m6985l8677l0591k5979k2635j7554
56089A260514j2904j1310j0111o363k640j886j534J206L468K335J007L061N766
56076A230609N578M946P099R533R312R354J2517J5092J3348J0891J2239J4737
56064A355255J4348J3556J5731J7618J5620J3749J6768K1135K1399J9978K1663
56053A546820K4151K3179K1636K4149K7936K8327K8104L1743L5898L5336L3049
$$ y = [2333504, 2497725, 2650150, 2784887, 2898895, 2995813, 3082872, 3164189, 3240172, 3311178, 3376403, 3430184, 3465100, 3479255, 3476662, 3461408, 3435990, 3404026, 3368395, 3325925, 3268616, 3190661, 3090726, 2968744, 2826143, 2669341, 2507842, 2348329, 2194475, 2051359, 1924347, 1813722, 1715844, 1629649, 1556846, 1496090, 1442935, 1395950, 1357273, 1326682, 1300703, 1278068, 1260514, 1247610, 1236300, 1226189, 1219826, 1217186, 1215300, 1213766, 1214972, 1218440, 1220775, 1221782, 1224843, 1230609, 1236187, 1241133, 1248232, 1257765, 1267077, 1276431, 1288948, 1304040, 1317388, 1328279, 1340518, 1355255, 1369603, 1383159, 1398890, 1416508, 1432128, 1445877, 1462645, 1483780, 1505179, 1525157, 1546820, 1570971, 1594150, 1615786, 1639935, 1667871, 1696198, 1724302, 1756045, 1791943, 1827279, 1860328]
56042A860328L4480L7082L5667L2842L3761L5917L4608L3115L6692M1803M2331
56031B258626M1092M4050M8523M8588M6818M9032N2761N2612N1674N5611O1094
56020B810481O2092O1922O6679P2778P3698P2957P7326Q3524Q5038Q5479R1476
56009C643450R9171J01869J03859J11980J21134J23465J24015J31286J40634J43727
55999D844590J45709J55255J66608J70367J72922J85281K01789K10851K17528
55990F470900K33438K53600K66506K77823K99897L27015L46367L64112L94122
55981I233780M30706M60161M89261N33019N84821O29640O75887P41364Q19245
55972A4597884Q92885R71902J076285J197920J318276J449982J617300J811219
$$ y = [1860328, 1894808, 1931890, 1967557, 2000399, 2034160, 2070077, 2104685, 2137800, 2174492, 2216295, 2258626, 2299718, 2343768, 2392291, 2440879, 2487697, 2536729, 2589490, 2642102, 2693776, 2749387, 2810481, 2872573, 2934495, 3001174, 3073952, 3147650, 3220607, 3297933, 3381457, 3466495, 3551974, 3643450, 3742621, 3844490, 3948349, 4060329, 4181463, 4304928, 4428943, 4560229, 4700863, 4844590, 4990299, 5145554, 5312162, 5482529, 5655451, 5840732, 6042521, 6253372, 6470900, 6704338, 6957938, 7224444, 7502267, 7802164, 8129179, 8475546, 8839658, 9233780, 9664486, 10124647, 10613908, 11146927, 11731748, 12361388, 13037275, 13778639, 14597884, 15490769, 16462671, 17538956, 18736876, 20055152, 21505134, 23122434, 24933653]
55964B4933653K012214K241211K535642K893694L300876L791226M416461N177840
55956E1302817O063277P125002Q436527J0012470J1880907J4194563J7146245
55949A26161808K0850895K5477952L1267230L7782137M2881580M3034438L5571411
55942C63027451K1028072L158461j3430355k5704633l2847811l5484956l4817971
55935B44928258l2173729k8689011k5065071k1603428j8441581j5671963j3303405
55928H9980070j1274606r546987q117170o947146n962660n123167m428347l857417
55920C4722570l363393k927267k562132k262171j996977j756716j556598j395121
55912A6902195j249777j114922j004692r17294q33038p48749o79837o27337n75154
$$ y = [24933653, 26945867, 29187078, 31722720, 34616414, 37917290, 41708516, 46124977, 51302817, 57366094, 64491096, 72927623, 82940093, 94821000, 109015563, 126161808, 147012703, 172490655, 203757885, 241540022, 284421602, 327456040, 363027451, 384055523, 387213984, 373783629, 348078996, 315231185, 279746229, 244928258, 212754529, 184065518, 159000447, 137397019, 118955438, 103283475, 89980070, 78705464, 69158477, 61041307, 54094161, 48131501, 43008334, 38579987, 34722570, 31359177, 28431910, 25869778, 23607607, 21610630, 19853914, 18297316, 16902195, 15652418, 14537496, 13532804, 12615510, 11782472, 11033723, 10353886, 9726549, 9151395]
55903I151395n20747m77678m46665m13402l76142l47637l28617l05897k77938
55894E656672k56875k43988k27614k06608j92284j85648j75404j60011j49907
55885C858333j46240j38661j25904j18124j16790j11915j01385r4215r2474q8076
55875B724549p9589p4759p4353p0345o2134n8240n9947n9139n4056n1644n2679
55864B027664m9890m2637l8488l8469l5330k8118k4080k4360k2013j6041j3372
55853A694866j5054j4185r576q069j1265j3256j3628j9360l1263m1263m5824m9758
55841A422365n4265n3751m7489m2485m1459l9219l3772l0033k9604k7610k2588
55830A000090j9192j8494j5823j0535p824q535p392l453k183m883o307n036n936
$$ y = [9151395, 8630648, 8152970, 7706305, 7292903, 6916761, 6569124, 6240507, 5934610, 5656672, 5399797, 5155809, 4928195, 4721587, 4529303, 4343655, 4168251, 4008240, 3858333, 3712093, 3573432, 3447528, 3329404, 3212614, 3100699, 2999314, 2905099, 2812625, 2724549, 2644960, 2570201, 2495848, 2425503, 2363369, 2305129, 2245182, 2186043, 2131987, 2080343, 2027664, 1977774, 1935137, 1896649, 1858180, 1822850, 1794732, 1770652, 1746292, 1724279, 1708238, 1694866, 1679812, 1665627, 1656051, 1647982, 1636717, 1623461, 1609833, 1590473, 1559210, 1517947, 1472123, 1422365, 1368100, 1314349, 1266860, 1224375, 1182916, 1143697, 1109925, 1079892, 1050288, 1022678, 1000090, 980898, 962404, 946581, 936046, 928222, 919687, 912295, 908842, 906659, 901776, 895469, 890433, 884497]
55817H84497r934j1686r974j0182j3641j4773j1878j0612j3319j4795j2269j0138
55805G41296j0959j0971q418p421r604j0382p633n822p611r304q423q042r902
55792F26804j0790r407r403j2062j3273j1194r637j0485j0021o242k729j878j314
55779E18369k24k048p422j1504j1761j1670j3416j3911j1512r709j0448j0520
55767D04224q193o792q031q417o037m371n565o318m310k497l033l083p20J013
55753C37870n2j050K33J109o52k699l165m328p401r151p636o009o722p225n355
55738B77767l686m407m980l080j095j517k464j758j007j813k302j118n07j844
55724B46189k570j038Q1j179k277r95M87J28M3K153M187L968L455M648N656M693
$$ y = [884497, 874563, 862877, 852903, 842721, 829080, 814307, 802429, 791817, 778498, 763703, 751434, 741296, 730337, 719366, 710948, 703527, 693923, 683541, 675908, 670086, 662475, 653171, 644748, 636706, 626804, 616014, 606607, 597204, 585142, 571869, 560675, 551038, 540553, 530532, 524290, 521561, 519683, 518369, 518145, 516097, 508675, 497171, 485410, 473740, 460324, 446413, 434901, 425192, 414744, 404224, 396031, 389239, 381208, 372791, 366754, 362383, 356818, 350500, 346190, 343693, 340660, 337577, 336857, 337870, 337818, 336768, 337001, 338110, 337458, 334759, 331594, 327266, 319865, 310714, 303078, 297069, 290347, 283122, 277767, 274081, 269674, 264694, 261614, 260519, 259002, 256538, 254780, 253773, 251960, 249658, 248540, 248033, 246189, 243619, 242581, 242662, 241483, 239206, 238211, 238698, 238826, 238869, 241022, 245209, 249177, 252632, 257280, 262936, 267629]
55708B67629L898N223O523N573M102L974L339M59k485l247l525n188o399n383
55694B74493m363n595o978n690k993j420l82J528K954K348J306J733K454K025
55680B61420J840L165M176L293K315K895L195J483l10j63K31j101k433j624k85
55665B78097p77k012k012j811l016m231l705k889l731n033n105n270p069q701
55651B22735p957o188n661n628m590l879n151o770o430n091m741m670l543k659
55637A49777l465m238k928r84o84j099l81L20q20k417k232j302j787k766k088
55622A22906n54l31j015r78r02k148l435k859j531j555k075j118M40M66m08j61
55606A04742O88K62r07r62k86n00j166q54k02o06j210m26R33J219J075J832K496
$$ y = [267629, 271527, 276750, 283273, 288846, 292948, 296922, 300261, 300720, 298235, 294988, 291463, 286275, 279876, 274493, 270130, 264535, 257557, 251867, 248874, 247454, 247072, 248600, 251554, 253902, 255208, 256941, 259395, 261420, 263260, 266425, 270601, 273894, 276209, 279104, 282299, 283782, 283472, 283309, 283540, 282439, 280006, 278382, 278097, 277320, 275308, 273296, 271485, 268469, 264238, 260533, 257644, 253913, 248880, 243775, 238505, 231436, 222735, 214778, 208590, 202929, 197301, 192711, 188832, 183681, 176911, 170481, 165390, 160649, 155979, 152436, 149777, 146312, 142074, 139146, 138162, 137478, 136379, 135998, 136318, 135498, 133081, 130849, 129547, 127760, 124994, 122906, 122352, 122021, 121006, 120028, 119126, 116978, 113543, 110684, 109153, 107598, 105523, 104405, 104845, 105311, 104903, 104742, 105430, 105692, 104785, 103823, 103537, 103037, 101871, 101017, 100815, 100209, 98999, 98573, 99506, 100725, 101800, 103632, 106128]
55589A06128J644N18Q40J360J63j451j216j91p99k198j897n05n23j486q31J238
55573A00794K080J334J175K089K403J907K156L173L324K533K340K819K523J396
55559A32046P55N95j72j164j100m99q79j766j440j99J67k76J64J549K285K109
55543A32175K248K780K589J777J472J535R49O6n2J1j071k687l136k584k601l284
55527A30187l431l043l102l489l527l800m938n637m585l208l572m677m067k193
55513G6918j613k485k471q87M06L39k62r29k080l184l102k202j762j596o79M28
55497E4839L84l06j99L04j08p39J2J362J176k63p76j19M1m34k07L30m97k115k131
55478E0554n38J25r21j649j031m89q65j064n73m35q81p41Q5J50q40j317n45L52
$$ y = [106128, 107772, 108290, 109130, 110490, 110653, 109202, 107986, 107795, 106996, 104798, 102901, 102396, 101873, 100387, 99556, 100794, 102874, 104208, 105383, 107472, 109875, 111782, 113938, 117111, 120435, 122968, 125308, 128127, 130650, 132046, 132801, 133396, 133224, 132060, 130960, 130461, 129582, 127816, 126376, 126177, 126344, 126068, 126232, 127781, 130066, 132175, 134423, 137203, 139792, 141569, 143041, 144576, 145525, 145591, 145539, 145550, 144479, 141792, 138656, 136072, 133471, 130187, 126756, 123713, 120611, 117122, 113595, 109795, 104857, 99220, 94635, 91427, 87855, 83178, 79111, 76918, 75305, 72820, 70349, 69462, 69868, 70207, 69945, 69016, 66936, 63752, 60650, 58448, 56686, 55090, 54411, 54839, 55223, 54917, 54718, 55022, 54914, 54175, 54187, 55549, 56725, 56462, 55686, 55567, 55608, 55174, 54967, 55297, 54800, 52685, 50554, 50016, 50141, 49220, 47571, 46540, 46051, 45186, 44122, 43549, 43114, 42233, 41492, 41577, 41727, 40887, 39570, 39025, 39377]
55460C9377N96O90P29J14p11m29P96J371Q10J44k80r84j483o62Q25J073n4q42
55442D1080o49m48m24K51J174R64r3k74N12O32j65l38M89R55O95Q75J603J570
55424D8409P04M74J064R56j88r19p70r20j590j520n99k50o24k19J112J631R59
55407D7710R21K197K930J856K30n25p07p99l82L19Q4j127j712j085n64p97o51
55390D7898L43Q19m0j054j144q94j023j123q64p05o30M4J003R56j64r38q15o67
55372D1002o94oJ193J411M70l6N47J048Q84R10J248Q44j25K0J426J956N43j110
55354E1531j379q80p32q20r11j445k192k049j015l81m06k5P33N31n12o04M13M88
55336D0345r81j851q50M17M61J54L83K75o06q47J96Q36j10j247j136n61n31l11
$$ y = [39377, 39973, 40663, 41392, 41506, 40795, 40366, 41162, 42533, 43343, 43487, 43207, 42223, 40740, 40078, 40903, 41976, 41922, 41080, 40431, 39983, 39559, 39810, 40984, 41948, 41855, 41581, 42093, 42725, 42560, 42222, 42711, 43666, 44361, 45236, 46839, 48409, 49113, 49587, 50651, 51607, 51419, 50500, 49730, 48810, 47220, 45700, 45101, 44851, 44227, 44008, 45120, 46751, 47710, 48631, 50828, 53758, 55614, 55844, 55319, 54612, 53813, 53431, 53750, 53834, 52707, 50995, 49910, 49346, 48549, 47898, 48241, 49060, 49020, 47966, 46822, 45928, 44905, 43782, 42918, 42213, 41583, 41627, 42630, 43586, 43422, 42484, 41669, 41002, 40308, 40302, 41495, 42906, 43376, 43340, 43887, 44935, 45819, 46729, 47977, 48821, 48696, 48716, 50142, 52098, 52641, 51531, 50152, 49272, 48540, 47720, 46809, 45364, 43172, 41123, 40108, 39727, 39321, 39296, 40029, 40560, 40048, 39444, 39857, 40345, 39364, 37513, 36663, 37080, 37541, 37695, 38078, 38353, 37747, 36900, 37096, 37932, 37822, 36575, 35439, 34878, 34347, 34036]
55318C4036O55J114K61n10l3M93k11j104p49J80L59J23L20N15J97K17J125J676
55300C8664P53o76j201j105j143r08n5M58L8j82O57J428J017L16M33N77l41j546
55282C7184j766j370j269j048q0Q84J036J092J767K067R73n17r11n70o68j064
55266C5740r81p05q00p35RO13L06j75j6R3n21q37J00J172Q43l17p24k25L80J105
55246C4325K128K525J557K61r5r1q34j716j517o63l71l66L86J477J560O11k58
55229C8919o37q67q23k85J22j53l89J66P77M49k33j52L52K98nL30R34Q07J79j9
55209C9770J61Q2j6L53N93o2r53r76m01j82j74L18R26Q57M29M01M30j71q95r36
55189C9554p82j187j440m85R22J143K14m18k72p8p1J56L70m0p28q21l41J30O85
$$ y = [34036, 34691, 35805, 36066, 35556, 35523, 36016, 35805, 34701, 33952, 34132, 34491, 34614, 34934, 35449, 35646, 35863, 36988, 38664, 39417, 38741, 37540, 36435, 35292, 34384, 34329, 34787, 34825, 34643, 35300, 36728, 37745, 38061, 38494, 39071, 38730, 37184, 35418, 34048, 32779, 31731, 31651, 32535, 33571, 34663, 36430, 38497, 39470, 38953, 38042, 37472, 36804, 35740, 34759, 34054, 33254, 32519, 32528, 33141, 33447, 33272, 33256, 33349, 32828, 31991, 32091, 33263, 34106, 33789, 33065, 32840, 33220, 34325, 36453, 38978, 40535, 40796, 40701, 40610, 39776, 38060, 36543, 35880, 35509, 35143, 35529, 37006, 38566, 39177, 38919, 38282, 37415, 36592, 36307, 36429, 36276, 35887, 36053, 36830, 37279, 37046, 36894, 37246, 37544, 37539, 37869, 38803, 39610, 39789, 39770, 39931, 40013, 39997, 40350, 40943, 40881, 39928, 38952, 38551, 38369, 38195, 38513, 39439, 40296, 40725, 41126, 41556, 41385, 40490, 39554, 38772, 37585, 36145, 35660, 36582, 37725, 37939, 37521, 37249, 37171, 37100, 37256, 37626, 37586, 36858, 36037, 35696, 35826, 36511]
55170C6511J532J886J018j65k23O06R19L69k16m36m77j58O09R56J94p64p05j49
55152D1307l90j174j229n76l33n29o2J233K326K677K647K354J629R02P40P59L76
55135E2657J75J030K319K652J992J421J182O42j39n15o81j331k101k055j472j476
55119E4300k075k200j588j050r41q79q80j202j294l39J206K005J669R26L12rM10
55102D8371J684K778K656J828J329R04j62j160q87K14Q04J035J958L031K606Q59
55086F7848k06J59O14K75m2K80N62K99M0J72K75J84L40P24P60M51L40K93k27p80
55066G2361m42L33J26j030j494o25K64J07m26k94M32J131J523J502J072P67J087
55049G6394J480R93n9l73L68J144J264J013O77K23O5P43J762J993J308M97j85
$$ y = [36511, 38043, 39929, 40947, 40782, 40559, 41165, 42084, 42453, 42237, 41801, 41324, 41166, 41775, 42731, 42925, 42161, 41456, 41307, 40917, 39743, 38514, 37938, 37605, 37076, 37014, 38247, 40573, 43250, 45897, 48251, 49880, 50782, 51522, 52281, 52657, 52832, 53862, 56181, 58833, 60825, 62246, 63428, 64070, 63931, 63416, 62735, 61404, 59303, 57248, 55776, 54300, 52225, 50025, 48437, 47387, 46446, 45567, 44687, 43485, 42191, 41852, 43058, 45063, 46732, 47658, 47970, 47961, 48371, 50055, 52833, 55489, 57317, 58646, 59550, 59388, 58228, 57341, 57555, 58359, 59394, 61352, 64383, 66989, 67848, 67642, 67801, 68415, 68690, 68648, 68928, 69490, 69789, 69829, 70001, 70276, 70460, 70800, 71524, 72284, 72735, 73075, 73368, 73141, 72361, 71919, 72252, 72378, 71348, 69854, 69229, 69493, 69600, 69174, 68880, 69312, 70443, 71966, 73468, 74540, 75307, 76394, 77874, 78867, 78808, 78435, 78803, 79947, 81211, 82224, 82901, 83124, 83189, 83932, 85694, 87687, 88995, 89492, 89307]
55032H9307j056j758j624j108j212j592j033K11N38m74j538j883k057k239j733
55017G0749o69l21j036j604j234o22m14k80l0j34n38m70K8j6o97q82k14K69N2
54998F1937m0M14O40L22L47J056J456J081R24J554J991J544J139J580K014J489
54982G9448P66J079K180K985L255L463L669L776M194N191O234O745P022P586Q382
54967A45975R289J0625J2446J4079J4985J5310J4977J3214R768N678J979j529
54955B66796n387r097j1615j2686j2874j2685j2323j1936j1488j0749r704q641
54943A37611p581o299m986m258m181m097l584k857k006p44P77J798J969J805J892
54928A05259K357L287M748O221O970P167P727Q961J0274J1304J2198J2629J1782
$$ y = [89307, 88251, 86493, 84869, 83761, 82549, 80957, 79924, 80135, 80673, 80199, 78661, 76778, 74721, 72482, 70749, 70080, 69759, 68723, 67119, 65885, 65263, 64849, 64569, 64539, 64405, 63867, 63397, 63425, 63409, 62712, 61830, 61616, 61885, 61937, 61897, 62311, 62951, 63273, 63620, 64676, 66132, 67213, 68137, 69691, 71682, 73226, 74365, 75945, 77959, 79448, 80214, 81293, 83473, 86458, 89713, 93176, 96845, 100621, 104815, 110006, 116240, 122985, 130007, 137593, 145975, 155264, 165889, 178335, 192414, 207399, 222709, 237686, 250900, 260668, 266346, 268325, 266796, 261409, 252312, 240697, 228011, 215137, 202452, 190129, 178193, 166705, 155956, 146252, 137611, 130030, 123731, 118745, 114487, 110306, 106209, 102625, 99768, 97762, 97018, 97795, 99593, 101562, 103367, 105259, 107616, 110903, 115651, 121872, 128842, 136009, 143736, 152697, 162971, 174275, 186473, 199102, 210884]
54915B10884R534O531K923j663o638j0363j2022j2347j2151j1497j0641j0288
54903A42262j0325r668q030o497n756n097l916k787k233j751r42m27o35q25l08
54888H3065L09J21o45j139j166j195j629k545l555l732k524q13l3k01j72J45l72
54871F3919j705k191j176k04m93j028m91N34P62K97n8m00j092j528j035k11%j66
54853E3734R7P52J258J563J718J325M50J73R98J705J005m50j122p83l16rM99J046
54835F3643J196J250J677J993J460N77N54J522K439K634K357J991J747J939K571
54820H9550K881K235J336J575L268N470P327Q773R972J0933J1760J2584J3196
54807A80860J3277J2896J2271J1178R124N984K162j748n158p612r070r846j0142
$$ y = [210884, 220418, 226949, 229872, 228209, 221571, 211208, 199186, 186839, 174688, 163191, 152550, 142262, 131937, 122269, 114239, 107742, 101986, 96889, 92973, 90186, 87953, 86202, 85260, 84833, 84198, 83373, 83065, 83374, 83495, 82850, 81711, 80545, 79350, 77721, 75176, 71621, 67889, 65365, 64552, 64519, 64318, 64146, 64291, 63919, 62214, 60023, 58847, 58643, 58150, 57122, 56631, 57165, 57927, 58224, 58166, 57766, 56674, 55146, 54111, 53900, 53900, 53734, 53831, 54583, 55841, 57404, 59122, 60447, 60897, 61070, 62068, 63773, 64778, 64328, 63206, 62423, 62107, 62098, 62597, 63643, 64839, 66089, 67766, 69759, 71219, 71796, 72350, 73872, 76311, 78945, 81302, 83293, 85040, 86979, 89550, 92431, 94666, 96002, 97577, 100845, 106315, 113642, 122415, 132387, 143320, 155080, 167664, 180860, 194137, 207033, 219304, 230482, 239606, 245590, 247752, 246004, 240846, 233234, 224164, 214318, 204176]
54794B04176r978r592r344r044q161o801n736n158m364l030j862j411j232p45
54780A27718p7N47J371K386K963K885K895L567M479N258O420Q314J0162J1165
54766A90053J1841J3157J4898J5923J5602J4192J2076R508O726L834Q16j994m026
54753C02606n288o426p629q368q570q980r886j0585j0677j0770j1223j1294j0413
54740A82497r209q449p923p219o519n882m789l351k722l331l897l265k067j383
54726A12491r93k86K03l06j263j636j499j426j156k78M50R2q05j005n08k73m99
54709A01303n85m06k82p6M98J006R37O46O56N81q6q38r52p43p09k77J129K497
54691A04299K402J161K83K24L28M77J065J634J311M79M14J283K007K046J918J981
$$ y = [204176, 194198, 184606, 175262, 166218, 158057, 151256, 145520, 140362, 135998, 132968, 131106, 129695, 128463, 127718, 127641, 128188, 129559, 131945, 134908, 137793, 140688, 144255, 148734, 153992, 160412, 168726, 178888, 190053, 201894, 215051, 229949, 245872, 261474, 275666, 287742, 297250, 303976, 307810, 308626, 306632, 302606, 297318, 290892, 283263, 274895, 266325, 257345, 247459, 236874, 226197, 215427, 204204, 192910, 182497, 173288, 164839, 156916, 149697, 143178, 137296, 132507, 129156, 126434, 123103, 119206, 115941, 113874, 112491, 111498, 111212, 111415, 111109, 109846, 108210, 106711, 105285, 104129, 103851, 104301, 104393, 103588, 102583, 102075, 101802, 101303, 100718, 100312, 100030, 99954, 100452, 101458, 102395, 103041, 103697, 104278, 104192, 103354, 102402, 101659, 100950, 100673, 101802, 104299, 106701, 107862, 108145, 108369, 108697, 109174, 110239, 111873, 113184, 113663, 114077, 115360, 117367, 119413, 121331, 123312]
54675A23312K114K527L484M313M057L068K701L381M343N114N883O490O451O035
54661A83273N976O099N521M263L346L243L498L849M485N165N426N703O938Q956
54647B55741J0610J1545J2524J3695J3991J2628J0100P195M036L97l814q556j3296
54634C26796j6706j7720j6967j6098j5769j5259j4004j2324j0519q568o886o219
54622A69757o420o404n520m085k535j025K3J70j05J95J045J405R46O55J261K119
54606A51482K191J358K28p10j285j508j505j362j084r13j354k386l218l421l608
54591A32905m232m492l656k674k925l908l927k766j909k144k651k689k484k166
54577I0282j361l23ln00p58k56K12l3n22n56k17P9J57o3m79m43M81J436J123k43
$$ y = [123312, 125426, 127953, 131437, 135750, 139807, 142875, 145576, 148957, 153300, 158414, 164297, 170787, 177238, 183273, 189249, 195348, 200869, 205132, 208478, 211721, 215219, 219068, 223553, 228718, 234144, 239847, 246785, 255741, 266351, 277896, 290420, 304115, 318106, 330734, 340834, 348029, 352065, 352462, 348648, 340092, 326796, 310090, 292370, 275403, 259305, 243536, 228277, 214273, 201949, 191430, 182862, 175976, 169757, 163337, 156933, 151413, 147328, 144793, 143768, 143791, 143961, 143856, 144051, 145096, 146501, 147447, 148102, 149363, 151482, 153673, 155031, 155259, 154549, 153264, 151756, 150251, 148889, 147805, 146892, 145538, 143152, 139934, 136513, 132905, 128673, 124181, 120525, 117851, 114926, 111018, 107091, 104325, 102416, 100272, 97621, 94932, 92448, 90282, 88921, 88598, 88595, 88095, 87337, 87081, 87293, 87260, 86738, 86182, 85965, 86044, 86201, 86138, 85659, 85216, 85697, 87133, 88256, 88013]
54557H8013j054n72L27Q75J388K039K155J450P97R87J698K256K577K828L062L560
54541A12386M675N969O497O256O257O891P345P055O555O267N678M292K463O36
54527A89222j262l178m629n559o502p486p756p109o368n993n404m298l486l521
54513A16671l620k939j942j519j541j391j197j455j925j878j253o15j81L88J266
54498I6869K088K355J952J271Q30O29O7j058j897j561n67k24p40j011m39K42L14
54481I9120P0J7M1j34m22p60j208j394p78K65O22Q0k92J21M40k08j222j365n10
54462I2483M01O57L72J2j71l69r08j533j302J19J448J137m58j482j158n51n95
54445H8102q22n91j96o5pJ10q8n91p54m29l47p41p77O0J050J414J399J433J277
$$ y = [88013, 86959, 86387, 86714, 87589, 88977, 91016, 93171, 94621, 95418, 96405, 98103, 100359, 102936, 105764, 108826, 112386, 117061, 123030, 129527, 135783, 142040, 148931, 156276, 163331, 169886, 176153, 181831, 186123, 188586, 189222, 187960, 184782, 180153, 174594, 168092, 160606, 152850, 145741, 139373, 133380, 127976, 123678, 120192, 116671, 113051, 110112, 108170, 106651, 105110, 103719, 102522, 101067, 99142, 97264, 96011, 95396, 95215, 95603, 96869, 98957, 101312, 103264, 104535, 105365, 105994, 106061, 105003, 103106, 101545, 100978, 100754, 100014, 99003, 98564, 98806, 99120, 99190, 99207, 99248, 99114, 98692, 97932, 96724, 95330, 94552, 94817, 95439, 95519, 95227, 95348, 95788, 95580, 94358, 92993, 92483, 92884, 93541, 93913, 93925, 93754, 93385, 92477, 90944, 89642, 89761, 91209, 92346, 91888, 90406, 89248, 88697, 88102, 87280, 86689, 86493, 86428, 86421, 86531, 86443, 85852, 85098, 84669, 84322, 83581, 82804, 82864, 83914, 85328, 86727, 88160, 89437]
54426H9437P47L69M84O15M01K96O41R97J007J001J169J129Q87J122J860K122J598
54409A05882J368K097K776K422J748J906K687L258L720M505N139M952M425M407
54395A51292M592M086K937J933J285O76J59j21o34j797k963l229k806k596k768
54380A50046k814k662k726l070l436l761l896l308j941q61j049k005k551k553
54366A13413k758l302l472k846j656k42J028J577J197N96N45Q45R25R82J589K503
54350A10924K899K573J977J388R36J107K200L492M011L920M137M690M550L140
54336A51944J123m15r27n78j64p48k605m609n373m872m198l944l678l000k186
54321A15770j685j600j842k253k566k708k991l547l835l319k353j717j427r04
$$ y = [89437, 90184, 90553, 91037, 91652, 92053, 92349, 92990, 93987, 94994, 95995, 97164, 98293, 99180, 100302, 102162, 104284, 105882, 107250, 109347, 112123, 114545, 116293, 118199, 120886, 124144, 127864, 132369, 137508, 142460, 146885, 151292, 155884, 159970, 162907, 164840, 166125, 166801, 166960, 166839, 166205, 164408, 161445, 158216, 155410, 152814, 150046, 147232, 144570, 141844, 138774, 135338, 131577, 127681, 124373, 122432, 121571, 120522, 118517, 115966, 113413, 110655, 107353, 103881, 101035, 99379, 99137, 100165, 101742, 102939, 103535, 104080, 104925, 105850, 106832, 108421, 110924, 113823, 116396, 118373, 119761, 120697, 121804, 124004, 127496, 131507, 135427, 139564, 144254, 148804, 151944, 153067, 152652, 151725, 151147, 150983, 150235, 147630, 143021, 137648, 132776, 128578, 124634, 120956, 117956, 115770, 114085, 112485, 110643, 108390, 105824, 103116, 100125, 96578, 92743, 89424, 87071, 85354, 83927, 83023]
54307H3023j87j66j266k678l168k363r85m4L6l97p53p95n77m9P39J163M41j222
54289G0752k586k693j740m41O85J232R27K32Q7O60J095Q95O07O32M56l04r98r57
54271F8541m65J1O21J332J384N67oM99J237J131O51P68J026L72p04p00M33J137
54253G7835N16o22j165q79j02O35P30L3p84j173j554k348k822k161j056p58j002
54236F3323n56M85Q23K55K2N45P17k7o65m10k8l85q63m05P54J441J109K98j75
54217F6258J72J187K019J763N15n61n37L04J020J052N26j39n73p22q60j147j344
54200F8933j210r88r32o93J66J209J521R78M01L43N27N29L66K73L74P28J117R57
54182G4599k0j092j291o67n8K34O40J221J399J000O30O45N47j62j114j560j242
$$ y = [83023, 82836, 82670, 81404, 78726, 75558, 73195, 72210, 72166, 72202, 71805, 71052, 70257, 69680, 69631, 70370, 71533, 71974, 70752, 68166, 65473, 63733, 63292, 63977, 65209, 66136, 66368, 66455, 67115, 68210, 69105, 69712, 70344, 70800, 70496, 69498, 68541, 68076, 68087, 68708, 70040, 71424, 71991, 71985, 72484, 73721, 74852, 75503, 76271, 77297, 77669, 76965, 76265, 76698, 77835, 78351, 77729, 76564, 75685, 75583, 76218, 76948, 76981, 76197, 75024, 73470, 71122, 68300, 66139, 65083, 64325, 63323, 62767, 63252, 64075, 64330, 64352, 64897, 65614, 65587, 64922, 64512, 64484, 64099, 63236, 62831, 63585, 65026, 66135, 66433, 66258, 66430, 67617, 69636, 71399, 71914, 71353, 70816, 71120, 72140, 73192, 73718, 73579, 73006, 72284, 71424, 70277, 68933, 67723, 66735, 65803, 65110, 65276, 66485, 68006, 68984, 69385, 69728, 70255, 70784, 71150, 71423, 71797, 72525, 73642, 74599, 74579, 73487, 72196, 71529, 71471, 71705, 72345, 73566, 74965, 75965, 76595, 77240, 77787, 77625, 76511, 74951, 73709]
54165G3709m77K43M83J20m30n06j7L73K1r35j699j594o82K67N44K57J18M36P94
54146G1025Q45Q40J019J151J120J328J930K271J822J040N39L2r55j901j909j154
54130G9043o18o05n68k01K25N10N51j8j244k163j735l80M78L60J14L38N17J9r21
54111G3702j612j626r96j43L21J60j76k22j48k61l46j00K38L77N32P22L07q61
54093F9868j598r42K26M29j64l14J11J94j00N0N59M86j29l00pk76j130j307m50
54074F5206K26Rk90k6J66j93m13R5P70J018J177J569J721J297Q08O19L49j12p1
54055G3925P12J337J131O88P69J070J010Q13R49J246J372J538J936K181J941J626
54039I4244J785K343K963L466L667L416L172L653M634N031M605M446N275O318
$$ y = [73709, 73232, 73475, 73958, 74078, 73648, 73142, 73125, 73498, 73519, 72584, 70885, 69291, 68609, 68876, 69420, 69677, 69795, 70231, 71025, 71870, 72710, 73729, 74880, 76000, 77328, 79258, 81529, 83351, 84391, 84930, 84962, 84007, 82106, 80197, 79043, 78425, 77820, 77252, 77051, 77276, 77786, 78337, 78319, 77075, 74912, 73177, 72797, 73275, 73635, 73749, 74087, 74604, 74623, 73702, 72090, 70464, 69468, 69325, 69646, 69806, 69630, 69408, 69260, 68999, 68653, 68553, 68791, 69168, 69700, 70422, 70729, 69868, 68270, 67328, 67554, 67983, 67819, 67505, 67616, 67810, 67710, 67760, 68319, 68805, 68676, 68376, 68369, 68093, 66963, 65656, 65206, 65432, 65441, 65151, 65125, 65291, 65098, 64685, 64780, 65550, 66568, 67745, 69314, 71035, 72332, 73140, 73759, 74108, 73996, 73925, 74637, 75974, 77105, 77793, 78562, 79632, 80642, 81455, 82404, 83650, 85022, 86560, 88496, 90677, 92618, 94244, 96029, 98372, 101335, 104801, 108468, 111884, 115056, 118709, 123343, 128374, 132979, 137425, 142700, 149018]
54025A49018O539N971N109M030K904K430K855L352L187K727K591K607K467K495
54011A98282K887K920J935M32o82j398k216l022l301l085k931l207l964n045n807
53996A71798n372l815k456k294k690k406j381o30p62j392j813j644j062p44j210
53981A42127k003k056j221o27j057j739j465k33Q82J043K47q41j206k36J364K062
53965A35041J378M59L95Q18Q77N98M56M38M13O89J274J377O07j15J72R74J201
53948A47052R92J319K290L061L285L422L636L481K845K394K799M057N593O563
53934A92789O276M807L077J962J412Q41j0r73j869k534k713k354j711r03K05J377
53918A99679J948J787J693K321L293L943M269M626M995N218N352N362M980M413
$$ y = [149018, 155557, 161528, 166637, 170667, 173571, 176001, 178856, 182208, 185395, 188122, 190713, 193320, 195787, 198282, 201169, 204089, 206024, 206456, 205774, 204376, 202160, 199138, 195837, 192752, 189821, 186614, 182650, 177605, 171798, 166426, 162611, 160155, 157861, 155171, 152765, 151384, 150754, 149992, 148600, 146787, 145143, 144081, 143337, 142127, 140124, 138068, 136847, 136220, 135163, 133424, 131959, 131726, 132608, 133651, 133898, 133057, 131851, 131615, 132979, 135041, 136419, 136878, 137273, 138091, 138968, 139566, 140022, 140460, 140873, 141562, 142836, 144213, 144820, 144705, 144877, 145851, 147052, 148044, 149363, 151653, 154714, 157999, 161421, 165057, 168538, 171383, 173777, 176576, 180633, 186226, 192789, 199065, 203872, 206949, 208911, 210323, 211164, 211154, 210181, 208312, 205778, 203065, 200711, 199000, 198097, 198302, 199679, 201627, 203414, 205107, 207428, 210721, 214664, 218933, 223559, 228554, 233772, 239124, 244486, 249466, 253879]
53904B53879M381N001N372M887M033L285K190M26j152j669j581j788k189k223
53890B72852k194k727l495l815l984m782n908o317n806n122m676m344m291m768
53876B10623n243m966m309m260m767m837m272l904l960l636k679k081k534l344
53862A55831l526l176k978l072l107k942k680k311j864j652j964k644l255l510
53848A17150l332k661j524l09K78j46j006j127j15Q94N40q14j423n38N46M09n49
53831A06273r74n84k25l49n19l29O7L71M31J38l73o09k34M68J050J495J880J904
53813A09881J352O93N17P54J007J275J673J869J593J351J775K597L036K986L012
53798A35371L339L641L714L690L678L777M209M875N112M579L946L954M229L878
$$ y = [253879, 258260, 263261, 268633, 273520, 277553, 280838, 283028, 283454, 282302, 280633, 279052, 277264, 275075, 272852, 270658, 267931, 264436, 260621, 256637, 251855, 245947, 239630, 233824, 228702, 224026, 219682, 215391, 210623, 205380, 200414, 196105, 191845, 187078, 182241, 177969, 174065, 170105, 166469, 163790, 161709, 159175, 155831, 152305, 149129, 146151, 143079, 139972, 137030, 134350, 132039, 130175, 128523, 126559, 123915, 120660, 117150, 113818, 111157, 109633, 109324, 109602, 109456, 108450, 107323, 107208, 108102, 108642, 107828, 106405, 105867, 106413, 106822, 106273, 105299, 104715, 104490, 104141, 103622, 103293, 103360, 103731, 104162, 104300, 103927, 103318, 103084, 103552, 104602, 106097, 107977, 109881, 111233, 111926, 112443, 113197, 114204, 115479, 117152, 119021, 120614, 121965, 123740, 126337, 129373, 132359, 135371, 138710, 142351, 146065, 149755, 153433, 157210, 161419, 166294, 171406, 175985, 179931, 183885, 188114, 191992]
53784A91992K963K350K335K360K024J434O36m36j430j835j838k116k801l357l507
53769A88774l538l632l631l494l367l109k403j459j045j602k659l282k887j764
53755A50902r45j320k565l285k507p25P61J123L67q85j633j180o3M04q6m32K8
53738A37959M30n0o87m39K97N21L30M10N66K28j99OL68q0r78j137n77m70j167
53719A35331j854k042j926j357m6J249J283K31m43j33L29L02J03l1k95m28R2Q26
53701A31191Q02L35Q19K436L733L880L686L810L624K613J449P79L72K01J009K846
53685A63585M362M588M325M685N328N311M703M185L724K849J749J062Q92Q17O15
53670B12780L51R9JK24M90K34m96r47q39p79j120j341j104r83j373j605j025j84
$$ y = [191992, 194955, 197305, 199640, 202000, 204024, 205458, 206094, 205658, 204228, 202393, 200555, 198439, 195638, 192281, 188774, 185236, 181604, 177973, 174479, 171112, 168003, 165600, 164141, 163096, 161494, 158835, 155553, 152666, 150902, 149957, 148637, 146072, 142787, 140280, 139555, 140316, 141439, 141806, 140921, 139288, 138108, 138045, 138449, 138363, 137931, 137959, 138389, 138339, 137652, 137213, 137510, 138031, 138361, 138771, 139337, 139565, 139366, 139372, 139740, 139660, 138682, 137545, 136968, 136498, 135331, 133477, 131435, 129509, 128152, 128106, 129355, 130638, 130869, 130426, 130293, 130622, 130924, 131027, 130996, 130701, 130273, 130365, 131191, 131993, 132328, 133147, 135583, 139316, 143196, 146882, 150692, 154316, 156929, 158378, 159157, 159529, 159730, 160739, 163585, 167947, 172535, 176860, 181545, 186873, 192184, 196887, 201072, 204796, 207645, 209394, 210456, 211348, 212165, 212780, 213131, 213230, 213231, 213455, 213945, 214179, 213683, 212736, 211897, 211118, 209998, 208657, 207553, 206570, 205197, 203592, 202567, 202383]
53652B02383J0k57j84J82P4o15j072p23J04Q32J291J453J060j00j601k456k021
53635A98360q02k2k04o40n47j49m5l3M63J226J481J171R31Q80N64J00J89Q61J338
53616B05122J293J191J169Q91O93J504L121M012L439K539K473K784K581K207K496
53601B37515L216L492L267L267L793M477M980N228N131M657M024L416K851K564
53587B91878L047M298N500N897N546M951M451M282M609N139N212M576L653K872
53573C55911K379K385L014L696L640K968K513K338J692O35L10J130J997K046J804
53558C88458J906J877J227N53M70M81k9n87n51l51o56j083r17m15k58k95M3N74
53540C90447P43O35O26M96l1m39p4P32J200J253J212R67M67M19J334K428K648
$$ y = [202383, 202393, 202136, 201952, 202134, 202208, 201593, 200521, 199798, 199902, 200734, 202025, 203478, 204538, 204438, 202837, 200381, 198360, 197558, 197536, 197332, 196692, 196145, 195996, 195951, 195918, 196381, 197607, 199088, 200259, 201190, 202070, 202634, 202734, 202923, 203784, 205122, 206415, 207606, 208775, 209666, 210359, 211863, 214984, 218996, 222435, 224974, 227447, 230231, 232812, 235019, 237515, 240731, 244223, 247490, 250757, 254550, 259027, 264007, 269235, 274366, 279023, 283047, 286463, 289314, 291878, 294925, 299223, 304723, 310620, 316166, 321117, 325568, 329850, 334459, 339598, 344810, 349386, 353039, 355911, 358290, 360675, 363689, 367385, 371025, 373993, 376506, 378844, 380536, 381171, 381481, 382611, 384608, 386654, 388458, 390364, 392241, 393468, 394021, 394491, 394972, 394943, 394356, 393805, 393454, 392798, 391715, 390798, 390383, 390125, 389830, 389873, 390447, 391190, 391825, 392451, 392947, 392916, 392477, 392403, 393135, 394335, 395588, 396800, 397767, 398234, 398653, 399987, 402415, 405063]
53523D05063K305K478L242L869M369N388O742P574P917Q723J0115J1035J0889
53510D89709J0349J0144J0116R950R906J0309J1053J2004J3284J4727J5724J5993
53498F33268J6053J6504J7290J7983J8441J8896J9568K0450K1385K2220K2936
53487H44994K3609K4197K4515K4491K4238K3923K3673K3687K3942K3879K2987
53476A108135K1764K1311K1748K1920K1130K0213K0207K0820K1098K0851K0440
53465A339637J9685J8111J6032J4433J3886J4222J4962J5409J4729J2787J0590
53454A504483R177Q377P440O374N682N142L920J847l58k131l549m900o394q277
53440A526833j0444j2203j3018j3374j4147j5454j6785j7962j9108k0009k0420
$$ y = [405063, 407368, 409846, 413088, 416957, 421326, 426714, 433456, 441030, 448947, 457670, 467785, 478820, 489709, 500058, 510202, 520318, 530268, 540174, 550483, 561536, 573540, 586824, 601551, 617275, 633268, 649321, 665825, 683115, 701098, 719539, 738435, 758003, 778453, 799838, 822058, 844994, 868603, 892800, 917315, 941806, 966044, 989967, 1013640, 1037327, 1061269, 1085148, 1108135, 1129899, 1151210, 1172958, 1194878, 1216008, 1236221, 1256428, 1277248, 1298346, 1319197, 1339637, 1359322, 1377433, 1393465, 1407898, 1421784, 1436006, 1450968, 1466377, 1481106, 1493893, 1504483, 1513660, 1522037, 1529477, 1535851, 1541533, 1546675, 1550595, 1552442, 1552084, 1549953, 1546404, 1541504, 1535110, 1526833, 1516389, 1504186, 1491168, 1477794, 1463647, 1448193, 1431408, 1413446, 1394338, 1374329, 1353909]
53429A353909k0763k1549k2334k2338k1889k2120k3120k3603k2628k0704j8833
53418A114028j7371j6156j5101j4118j3007j1718j0469r398q449p497o311m559
53406I79874k318l29Q06J457K439L921N481O986Q656J0536J2607J5153J8144K0599
53392A084012K1621K1810K2554K4007K5032K5159K5327K6338K7836K9268L0779
53381A363743L2524L4163L5625L7625M0548M3578M5640M6755M7687M8698M9431
53370A826017M9795N0150N0655N1050N1187N1324N1645N1782N1121M9489M7336
53359B381551M5177M3011M0516L7622L4578L1502K8272K4983K1929J9011J5656
53348B723808J1614P347L280p06m669q121j0857j3636j7316k1806k6576l1668
$$ y = [1353909, 1333146, 1311597, 1289263, 1266925, 1245036, 1222916, 1199796, 1176193, 1153565, 1132861, 1114028, 1096657, 1080501, 1065400, 1051282, 1038275, 1026557, 1016088, 1006690, 998241, 990744, 984433, 979874, 977556, 977227, 978033, 979490, 981929, 985850, 991331, 998317, 1006973, 1017509, 1030116, 1045269, 1063413, 1084012, 1105633, 1127443, 1149997, 1174004, 1199036, 1224195, 1249522, 1275860, 1303696, 1332964, 1363743, 1396267, 1430430, 1466055, 1503680, 1544228, 1587806, 1633446, 1680201, 1727888, 1776586, 1826017, 1875812, 1925962, 1976617, 2027667, 2078854, 2130178, 2181823, 2233605, 2284726, 2334215, 2381551, 2426728, 2469739, 2510255, 2547877, 2582455, 2613957, 2642229, 2667212, 2689141, 2708152, 2723808, 2735422, 2742769, 2746049, 2745343, 2740674, 2732553, 2721696, 2708060, 2690744, 2668938, 2642362, 2610694]
53336B610694l7291m2765m6904m9332n0520n0762n0044m8819m7832m7180m6323
53325B092922m5137m4096m3371m2651m2003m1993m2653m3019m2160m0222l8123
53314A627494l6556l5444l4079l1834k8905k6136k3897k1647j9049j6950j6300
53303A336697j6619j6537j5623j4633j3965j3061j1496r687q198p093o224n493
53291A198068m666l472k145j252r76r78q87m49N69K021L251M040N285P771J0740
53276A216920J2805J4043J5723J8106K0017K0895K1639K2890K3848K3693K2999
53265A433578K2793K3035K2998K2534K2078K1693K0952J9587J7789J5983J4539
53254A657559J3484J2397J0903R223P820O542M839K696N93j499m156p358j0181
$$ y = [2610694, 2573403, 2530638, 2483734, 2434402, 2383882, 2333120, 2283076, 2234257, 2186425, 2139245, 2092922, 2047785, 2003689, 1960318, 1917667, 1875664, 1833671, 1791018, 1747999, 1705839, 1665617, 1627494, 1590938, 1555494, 1521415, 1489581, 1460676, 1434540, 1410643, 1388996, 1369947, 1352997, 1336697, 1320078, 1303541, 1287918, 1273285, 1259320, 1246259, 1234763, 1225076, 1216878, 1209785, 1203561, 1198068, 1193402, 1189930, 1187785, 1186533, 1185557, 1184579, 1183692, 1183243, 1183812, 1185833, 1189084, 1193124, 1198409, 1206180, 1216920, 1229725, 1243768, 1259491, 1277597, 1297614, 1318509, 1340148, 1363038, 1386886, 1410579, 1433578, 1456371, 1479406, 1502404, 1524938, 1547016, 1568709, 1589661, 1609248, 1627037, 1643020, 1657559, 1671043, 1683440, 1694343, 1703566, 1711386, 1717928, 1722767, 1725463, 1726056, 1724557, 1720401, 1713043, 1702862]
53241A702862j2078j3589j5427j7541j9499k1119k2297k2860k2974k3213k3850
53230A488415k4578k5152k5684k6118k6066k5464k4722k4075k3367k2737k2619
53219A217833k2837k2497k1285k0102j9898k0534k1227k1495k1200k0287j9021
53208I87450j7938j7191j6395j5433j4796j4773j4989j5126j5425j5984j6316
53197H13084j6145j6030j6561j7441j7939j7886j7610j7295j6856j6223j5341
53186F27757j4233j3240j2763j2605j2149j1371j1009j1376j1772j1560j1123
53175D94556j1167j1681j2214j2588j2746j2401j1485j0590j0255j0178r647q574
53163C61030p533o984o864o773o246n133l854l018k595j986j093o68j196k030
$$ y = [1702862, 1690784, 1677195, 1661768, 1644227, 1624728, 1603609, 1581312, 1558452, 1535478, 1512265, 1488415, 1463837, 1438685, 1413001, 1386883, 1360817, 1335353, 1310631, 1286556, 1263189, 1240452, 1217833, 1194996, 1172499, 1151214, 1131112, 1111214, 1090680, 1069453, 1047958, 1026758, 1006471, 987450, 969512, 952321, 935926, 920493, 905697, 890924, 875935, 860809, 845384, 829400, 813084, 796939, 780909, 764348, 746907, 728968, 711082, 693472, 676177, 659321, 643098, 627757, 613524, 600284, 587521, 574916, 562767, 551396, 540387, 529011, 517239, 505679, 494556, 483389, 471708, 459494, 446906, 434160, 421759, 410274, 399684, 389429, 379251, 369604, 361030, 353497, 346513, 339649, 332876, 326630, 321497, 317643, 314625, 312030, 310044, 308951, 308283, 307087, 305057]
53149C05057k178j482m99L31R29J259J293J111P17J1r06j727k441l321m289m748
53133B89117m380l625l104l043l437m201m898m945m432m143m514n089n317n225
53119B28764m936m285l381k815k779k664k059j541j779k486k934l007l017k910
53105A88171k462j958j912k217k206j567o97k32m81j235k005k482k811l129l063
53090A59714k223j145q96j618k315k288j952j800j536q09n1J17k58p01r25p54
53074A40560o5P03P00j77r54r12n01l57k54K04N85K65m45p59n74l95l74k09J59
53055A37200M37M34K23RL4K89K57n46j616j877j224p43r47r60j02P84N79m12j040
53036A30779r58o41l50o5q0o33j247j180l06R49K165K871K578J489N86M21M31
$$ y = [305057, 302879, 301397, 300898, 301229, 302158, 303417, 304710, 305821, 306538, 306549, 305643, 303916, 301475, 298154, 293865, 289117, 284737, 281112, 278008, 274965, 271528, 267327, 262429, 257484, 253052, 248909, 244395, 239306, 233989, 228764, 223828, 219543, 216162, 213347, 210568, 207904, 205845, 204304, 202525, 200039, 197105, 194098, 191081, 188171, 185709, 183751, 181839, 179622, 177416, 175849, 175152, 174920, 174439, 173204, 171199, 168717, 165906, 162777, 159714, 157491, 156346, 155450, 153832, 151517, 149229, 147277, 145477, 143941, 143132, 143081, 143198, 142940, 142239, 141314, 140560, 140495, 141198, 141898, 141721, 140767, 139855, 139354, 138997, 138743, 138947, 139532, 139797, 139352, 138593, 138019, 137624, 137250, 137041, 137200, 137637, 138071, 138294, 138303, 138337, 138626, 138883, 138337, 136721, 134844, 133620, 132877, 131930, 130970, 130868, 131652, 132231, 131819, 130779, 129821, 129180, 128830, 128765, 128685, 128052, 126805, 125625, 125319, 126268, 128433, 131304, 133882, 135371, 135957, 136378, 136809]
53019A36809Q2j12M81J458J982J912J552J080Q42J426K541K879K018J373K111
53004A58434L274L391K837K922L508L426K726K567L148L487L180K743K301J484
52990A99428N52J42j06j116k677l587l518l254l123k676k020j875k184k172j881
52975A69933k132k787k764k047j918k746l217k434j272q31r75j190j497j671q71
52960A41581R23K290K224J542J425J579J059J05j87L89R19P08Rm89k72P36K042
52943A56583K880K958K621K144J405N02l0j3k0m32o86q3J098J907J869J329R09
52926A74941R63J408J791J715J259P22M4j032k168k490j621j25J216K039K195
52911A80857J670Q94N00M83K39m14q88p53k81J47M88O21L04j85p7P55J490J603
$$ y = [136809, 136891, 136779, 137260, 138718, 140700, 142612, 144164, 145244, 146086, 147512, 150053, 152932, 154950, 156323, 158434, 161708, 165099, 167936, 170858, 174366, 177792, 180518, 183085, 186233, 189720, 192900, 195643, 197944, 199428, 199980, 200122, 200016, 198900, 196223, 192636, 189118, 185864, 182741, 180065, 178045, 176170, 173986, 171814, 169933, 167801, 165014, 162250, 160203, 158285, 155539, 152322, 149888, 148616, 147785, 146810, 145620, 144123, 142452, 141581, 142504, 144794, 147018, 148560, 149985, 151564, 152623, 152728, 152541, 152930, 153849, 154557, 154566, 154077, 153805, 154541, 156583, 159463, 162421, 165042, 167186, 168591, 169093, 169063, 169050, 169030, 168598, 167912, 167829, 168927, 170834, 172703, 174032, 174941, 175904, 177312, 179103, 180818, 182077, 182799, 182843, 181811, 179643, 177153, 175532, 175407, 176623, 178662, 180857, 182527, 183421, 183921, 184404, 184643, 184229, 183341, 182588, 182307, 182454, 182942, 183563, 183867, 183682, 183605, 184360, 185850, 187453]
52893A87453J597J981K297J902J115Q16J291K125K868L295L360L303L461L641
52879B20505L213K184J559K092L200L801L701L486L383L071K377J497O01k37q03
52864B53630q84o82p32j312k201k871k869k168j317r68j149j322j238j267j706
52849B30944k212k285j882j212l89L76N73m2r62j394j137o48m19n60r19j282j535
52832B15015j714j890k008j976j876j774j520r93m58k72l58n03r18j825k594k253
52816A92083r56kj11o06p73r55j631k248j974j095p01j174j846j998j530o75K54
52799A74062P66M58m08j001q09k14km29r98j134r29r40j306j499j115n49l89n69
52781A62995o55o91j006j384j303r90j236k022k277j402k41O0n28j202j489j521
$$ y = [187453, 189050, 191031, 193328, 195230, 196345, 197161, 198452, 200577, 203445, 206740, 210100, 213403, 216864, 220505, 223718, 225902, 227461, 229553, 232753, 236554, 240255, 243741, 247124, 250195, 252572, 254069, 254670, 254433, 253630, 252746, 252064, 251332, 250020, 247819, 244948, 242079, 239911, 238594, 237626, 236477, 235155, 233917, 232650, 230944, 228732, 226447, 224565, 223353, 222964, 223340, 223913, 223871, 222909, 221515, 220378, 219730, 219311, 218751, 217832, 216550, 215015, 213301, 211411, 209403, 207427, 205551, 203777, 202257, 201264, 200806, 200534, 200176, 199673, 198755, 196930, 194336, 192083, 191127, 191125, 191014, 190408, 189635, 188680, 187049, 184801, 182827, 181732, 181031, 179857, 178011, 176013, 174483, 173808, 174062, 174828, 175286, 174878, 173877, 173068, 172854, 172852, 172423, 171425, 170291, 169362, 168422, 167116, 165617, 164502, 163953, 163564, 162995, 162340, 161649, 160643, 159259, 157956, 156966, 155730, 153708, 151431, 150029, 149788, 149848, 149320, 148118, 146629, 145108]
52765A45108j562j720j963k061j730j076n85o03j073j799k464k487j547l19O0
52750A24179n84j331j586j679j847j628q35j34m5j25J92O90R86J298J876K245
52734A21672J949J421J400J844K246K481K668K562K007J569J876K514K359R74
52720A49542j010k652l377l100k361k106k774l732m051l569k741j929j390j552
52706A13198k438l200k989k051j293r94p74o28r81j757k280k257k112k108j841
52691H5495r32K59R91R85O51N94R47J217Q70J06l38k34k64j011k034k407j885
52674H3010r93k80L2j09n74j030j314j550j650j167j16O33M35j59k31J33K41O5
52656G5376J10K18k65j145j350m92N64J008J037J054Q89L71k0J86O39P55P07J162
$$ y = [145108, 143546, 141826, 139863, 137802, 136072, 134996, 134411, 133808, 132735, 130936, 128472, 125985, 124438, 124119, 124179, 123595, 122264, 120678, 118999, 117152, 115524, 114689, 114555, 114510, 114385, 114577, 115267, 116253, 117551, 119427, 121672, 123621, 125042, 126442, 128286, 130532, 133013, 135681, 138243, 140250, 141819, 143695, 146209, 148568, 149542, 148532, 145880, 142503, 139403, 137042, 134936, 132162, 128430, 124379, 120810, 118069, 116140, 114750, 113198, 110760, 107560, 104571, 102520, 101227, 100233, 99459, 98831, 97850, 96093, 93813, 91556, 89444, 87336, 85495, 84563, 84822, 85813, 86798, 87449, 88043, 88990, 90207, 91077, 91183, 90845, 90611, 90347, 89336, 87302, 84895, 83010, 82017, 81737, 81769, 81660, 81086, 80056, 78742, 77192, 75542, 74375, 74259, 74892, 75327, 75168, 74937, 75070, 75311, 75376, 75486, 75704, 75439, 74294, 72944, 72452, 73016, 74024, 75061, 76115, 77004, 77375, 77355, 77541, 78180, 78935, 79642, 80804]
52638H0804K172K941K760J754N69l07p82r35p55k18M54P51K85p45j624j748j169
52621H4207n04k99m98n16L1Q14J120O58k20j017j449j284l28J134K263K354J545
52604H8011N48n8j21K09N97P23N59L63K17o9m77n78j17N68R96J079Q83K82o94
52585I2921j437j291l50P08J473K051K527K633K132J233M94L41O97J095J246J320
52569A07793J510J593J299R33R93J384J627J769K168K444J767L77l82J2N00K73
52553A26060M2N91J268J176Q46J220J783J340K03j20P14J444J229O55M36M41M43
52536A39771O77J113J126M60k99o08o14n74l82r9j99q32j401j351q68m06o0K18
52518A35672K17k19p68r12n14J46O68P85N49L70N69R22R93Q03P45Q23N92k9m98
$$ y = [80804, 82976, 85917, 88677, 90431, 91000, 90693, 89911, 88976, 88221, 88003, 88457, 89208, 89493, 88748, 87124, 85376, 84207, 83703, 83404, 82906, 82390, 82421, 83235, 84355, 85013, 84793, 83776, 82327, 81043, 80715, 81849, 84112, 86466, 88011, 88559, 88501, 88380, 88589, 89186, 89909, 90468, 90831, 91048, 90979, 90502, 89924, 89807, 90375, 91371, 92450, 93333, 93615, 92921, 91484, 90193, 89843, 90551, 92024, 94075, 96602, 99235, 101367, 102600, 103094, 103435, 104132, 105227, 106473, 107793, 109303, 110896, 112195, 113128, 114121, 115505, 117132, 118901, 121069, 123513, 125280, 125657, 125275, 125287, 125787, 126060, 126102, 126693, 127961, 129137, 129983, 131203, 132986, 134326, 134529, 134409, 135123, 136567, 137796, 138451, 138887, 139328, 139771, 140448, 141561, 142687, 143147, 142848, 142240, 141626, 141052, 140670, 140571, 140372, 139540, 138139, 136788, 135920, 135514, 135454, 135672, 135889, 135670, 134902, 133990, 133476, 133622, 134290, 135075, 135624, 135994, 136563, 137485, 138478, 139281, 140026, 140849, 141441, 141412, 140914]
52499A40914m50k29k70l85j05O11J300J572J420J070O86L02o4k53j13K74O58J016
52481A47954J522J961J723P74R6N22J485J700R17J49J77O47Q31O62N95Q83J339
52464A63937J582J448J168J150J398J399Q20l6p20j252j753k007j975k238l147
52449A59774l939l677k674k001j804j291l73Qn64j250j254q52p02r82j636k589
52433A34194l226k606q01P17P43k31r10q91o84n57k09M76J102J198O73r6m52J2
52415A28452Q73J215P50K02K42N38L33l87r44r87q30p86o80k14M58P93M71j61
52397A29338l97P4Q46J391J656J810J701J088L09N9M49Q66R00Q21R68J159J069
52380A44107Q00P15R83J497K055K414K438K248K063J855J481J060Q90R72J055
$$ y = [140914, 140464, 140235, 139965, 139580, 139475, 140086, 141386, 142958, 144378, 145448, 146134, 146436, 146372, 146119, 146006, 146280, 146938, 147954, 149476, 151437, 153160, 153934, 154030, 154552, 156037, 157737, 158654, 158803, 158980, 159627, 160458, 161120, 161715, 162598, 163937, 165519, 166967, 168135, 169285, 170683, 172082, 172902, 172866, 172146, 170894, 169141, 167134, 165159, 162921, 159774, 155835, 152158, 149484, 147483, 145679, 144388, 144015, 144023, 143459, 142209, 140955, 140103, 139401, 138419, 136783, 134194, 130968, 128362, 127561, 128278, 129021, 128790, 127880, 126989, 126305, 125748, 125539, 126015, 127117, 128315, 128988, 128892, 128440, 128452, 129325, 130540, 131290, 131492, 131734, 132272, 132605, 132218, 131274, 130287, 129457, 128671, 127991, 127777, 128235, 129028, 129499, 129338, 128941, 129015, 129861, 131252, 132908, 134718, 136419, 137507, 137816, 137875, 138324, 139190, 140090, 140911, 141879, 143038, 144107, 144907, 145622, 146605, 148102, 150157, 152571, 155009, 157257, 159320, 161175, 162656, 163716, 164606, 165578, 166633]
52365A66633J110J336J699J937K031K201K436K510K411K256J874J108M00L70P91
52350A91103R02P29J113K219L053K907K366K234K344K105J587J288J328J559K024
52335B18861K680L027K680K022J671J634J535J305J149J059R79J111J528J807
52321B43048J562J158J239J812K352K665L004L421L652L653L721L986M240M354
52307B83867M542N037N797O562P030O972O441N909N938O619P403P574O917O023
52293C72631N851O810Q291R311R568R541R589R467Q966Q525Q760R636J0477J0753
52279D98176J0580J0466J0800J1475J2063J2360J2655J3250J3850J3915J3541
52268F33131J3424J3785J3937J3295J2218J1468J1237J1231J1320J1582J1770
$$ y = [166633, 167743, 169079, 170778, 172715, 174746, 176947, 179383, 181893, 184304, 186560, 188434, 189542, 189942, 190312, 191103, 192005, 192734, 193847, 196066, 199119, 202026, 204392, 206626, 208970, 211075, 212662, 213950, 215278, 216837, 218861, 221541, 224568, 227248, 229270, 230941, 232575, 234110, 235415, 236564, 237623, 238602, 239713, 241241, 243048, 244610, 245768, 247007, 248819, 251171, 253836, 256840, 260261, 263913, 267566, 271287, 275273, 279513, 283867, 288409, 293446, 299243, 305805, 312835, 319807, 326248, 332157, 338095, 344714, 352117, 359691, 366608, 372631, 378482, 385292, 393583, 402894, 412462, 422003, 431592, 441059, 450025, 458550, 467310, 476946, 487423, 498176, 508756, 519222, 530022, 541497, 553560, 565920, 578575, 591825, 605675, 619590, 633131, 646555, 660340, 674277, 687572, 699790, 711258, 722495, 733726, 745046, 756628, 768398]
52257G68398J1430J0569R751R382R170Q570P566O758O548O509N904M801M055M023
52243H73434L831K575P21m50o24o74j098j260n70M88J013Q80P24J061J900K912
52227H84863L770M457N359O719Q064Q694Q722Q926R496R770R538R673J0816J2170
52213A001037J2404J1409J0361J0159J0493J0425R458P968O749O215O002N499
52201A108179M561L395K019M02r44j352j084j231k301l675m693n411n929n962
52187A085974n636n853p050q338q681q298q095q253q282q107q101q270q228p957
52173I76825p819p805p410o351n045m258m513n638o751o903o012m904m349m420
52159H94647m868n446n631m842l406k603l052l785l631k905k770l385l748l205
$$ y = [768398, 779828, 790397, 800148, 809530, 818700, 827270, 834836, 841594, 848142, 854651, 860555, 865356, 869411, 873434, 877265, 879840, 880561, 880111, 879487, 878813, 877715, 876455, 875885, 876373, 877386, 878266, 878990, 880051, 881951, 884863, 888633, 893090, 898449, 905168, 913232, 921926, 930648, 939574, 949070, 958840, 968378, 978051, 988867, 1001037, 1013441, 1024850, 1035211, 1045370, 1055863, 1066288, 1075746, 1083714, 1090463, 1096678, 1102680, 1108179, 1112740, 1116135, 1118154, 1118556, 1117612, 1116260, 1115176, 1113945, 1111644, 1107969, 1103276, 1097865, 1091936, 1085974, 1080338, 1074485, 1067435, 1059097, 1050416, 1042118, 1034023, 1025770, 1017488, 1009381, 1001280, 993010, 984782, 976825, 969006, 961201, 953791, 947440, 942395, 938137, 933624, 927986, 921235, 914332, 908320, 903416, 899067, 894647, 889779, 884333, 878702, 873860, 870454, 867851, 864799, 861014, 857383, 854478, 851708, 848323, 844575, 841370]
52145H41370k178j392j103j245j667k120k392k547k759l027l282l558l838m008
52131H06254m070m118l970l412k942l429m633n034l816k161j736k582l538m131
52117G56682m775n488n624m943l953l133k570k294k337k383k124j805j863k093
52103G11297j811q25L77J269J657J596J486J967L215M566N370N797O273O648O697
52088G55579O972Q150R909J1308J2128J2952J4160J5626J7139J8286J8364J7347
52076I17920J6566J7191J8415J8436J7107J6180J6780J7996J8343J7444J5885
52065A108263J4422J3721J3955J4254J3417J1479R691Q676P659N937M021K684
52053A228179J721M81j035k393l521m572n306n338m908m849n716p154q203q202
$$ y = [841370, 839192, 837800, 836697, 835452, 833785, 831665, 829273, 826726, 823967, 820940, 817658, 814100, 810262, 806254, 802184, 798066, 794096, 790684, 787742, 784313, 779680, 774646, 770830, 768669, 766933, 764351, 760813, 756682, 751907, 746419, 740795, 735852, 731899, 728766, 726196, 723902, 721565, 719182, 717058, 715253, 713390, 711297, 709486, 708661, 709038, 710307, 711964, 713560, 715046, 717013, 720228, 724794, 730164, 735961, 742234, 748882, 755579, 762551, 770701, 780610, 791918, 804046, 816998, 831158, 846784, 863923, 882209, 900573, 917920, 934486, 951677, 970092, 988528, 1005635, 1021815, 1038595, 1056591, 1074934, 1092378, 1108263, 1122685, 1136406, 1150361, 1164615, 1178032, 1189511, 1199202, 1207878, 1215537, 1221474, 1225495, 1228179, 1229900, 1230381, 1229346, 1226953, 1223432, 1218860, 1213554, 1208216, 1203308, 1198459, 1192743, 1185589, 1177386, 1169184]
52039A169184p458o929p109p452p153o169n074m261l820l874m288m330l411k069
52025A095787j363j370j189l73M84P59N85M45O90J521K809L814L815L112K713
52010A112239L075L832M621N280N364M445K974J806Q23q45l111m747n222n577
51996A124957o841q706j0347j1638j2903j4250j5763j7630j9571k0855k1384k1966
51984I43103k3121k4374k5253k5964k6678k6956k6603k6135k5806k5048k3638
51973F63527k2452k2112k1797k0399j8289j6778j6369j6488j6591j6496j5919
51962D59837j4647j3034j1622j0451r288q251p538o979o464o382o882p114o174
51949C45011m456l198k833k691k244j711j396j187r49q25r70j330j737j991j938
$$ y = [1169184, 1161726, 1154797, 1147688, 1140236, 1133083, 1126914, 1121840, 1117579, 1113759, 1109885, 1105597, 1101267, 1097856, 1095787, 1094424, 1093054, 1091865, 1091492, 1091976, 1092735, 1093320, 1093765, 1094455, 1095976, 1098785, 1102599, 1106414, 1109526, 1112239, 1115314, 1119146, 1123767, 1129047, 1134411, 1138856, 1141830, 1143636, 1144459, 1143614, 1140503, 1135756, 1130534, 1124957, 1118116, 1109410, 1099063, 1087425, 1074522, 1060272, 1044509, 1026879, 1007308, 986453, 965069, 943103, 919982, 895608, 870355, 844391, 817713, 790757, 764154, 738019, 712213, 687165, 663527, 641075, 618963, 597166, 576767, 558478, 541700, 525331, 508843, 492252, 475756, 459837, 445190, 432156, 420534, 410083, 400795, 392544, 385006, 378027, 371563, 365181, 358299, 351185, 345011, 340555, 337357, 334524, 331833, 329589, 327878, 326482, 325295, 324346, 323521, 322551, 321221, 319484, 317493, 315555]
51934C15555j766j905k372k590k277k040k472l126l121k446j884j777j795j808
51920B84176k130k785l315l499l540l446k848j701o06j53l75r51j480j505q21
51905B55021JMr04j657j366m88r3l73n43j09N00P28O81P57Q43N06j79o08n16l88
51885B51817o70j047r55n28l98o69p15o8R78J813K085J724Q83L5k99j42L4J64
51867B54042P56J897K664K173Q56O1M45J365J845J620J098O77M76N39R21J408
51851B72843J476Q71J24N4O64J049O94K65N82J350J659J379J098R31M96K5L17
51834B85877J267J617P15n08r28p71q47j041n72N58J393J288O77M24Q34J393J387
51817B92763P77L23N53Q37J76j166j733q36M94R77O09J36j73m86p45q51r55j008
$$ y = [315555, 313789, 311884, 309512, 306922, 304645, 302605, 300133, 297007, 293886, 291440, 289556, 287779, 285984, 284176, 282046, 279261, 275946, 272447, 268907, 265461, 262613, 260912, 260306, 260153, 259778, 258827, 257347, 255842, 255021, 255022, 255026, 254122, 252465, 251099, 250611, 250518, 250145, 249602, 249493, 249993, 250721, 251402, 252159, 253002, 253508, 253329, 252721, 252205, 251817, 251147, 250100, 249145, 248617, 248219, 247550, 246835, 246767, 247745, 249558, 251643, 253367, 254250, 254285, 253986, 253844, 253878, 254042, 254798, 256695, 259359, 261532, 262388, 262449, 262894, 264259, 266104, 267724, 268822, 269499, 269975, 270514, 271435, 272843, 274319, 275190, 275314, 275368, 276032, 277081, 277775, 278040, 278622, 279972, 281631, 283010, 284108, 285039, 285535, 285560, 285877, 287144, 288761, 289476, 288968, 288040, 287269, 286422, 285381, 284809, 285367, 286760, 288048, 288725, 289149, 289983, 291376, 292763, 293540, 293863, 294416, 295253, 295429, 294263, 292530, 291694, 292188, 293165, 293774, 293910, 293737, 293251, 292506, 291655, 290700, 289692]
51799B89692n96J31J41r85k003j535j20M62m12j670k258k170j719r91k14J64R4
51782B76011n1j88n85j159j407j193r22q08p21p54j244k033k442k234j882j622
51766B56766j062j15M48P5n30k78P14J307J025P03J130J782J507J91j058j408
51750B61197j268j432j890k127k174k450k699k123q02j1n76j645j830r60l2K24
51734B39402n7m56p86j006j146j279j302r71m12k50p21j121o84K89Q39O47K14
51717B31200j51p19j594k268k174j463r14j121j841k193j671q12m98p26p06k12
51701B12137K9m36j079j314j320j267o97M79J195N56o66r93k57N39R98J703K943
51684B12550M265N402O594P857Q706Q663P425M788J187j960l511l918m311m617
$$ y = [289692, 289096, 289227, 289368, 288383, 286380, 284845, 284725, 285187, 284775, 283105, 280847, 278677, 276958, 275967, 275753, 275917, 276011, 275960, 275772, 275187, 274028, 272621, 271428, 270506, 269698, 268977, 268223, 266979, 264946, 262504, 260270, 258388, 256766, 255704, 255589, 256037, 256112, 255582, 255304, 256018, 257325, 258350, 259053, 260183, 261965, 263472, 263663, 262605, 261197, 259929, 258497, 256607, 254480, 252306, 249856, 247157, 245034, 244232, 244221, 243645, 242000, 240170, 239210, 239178, 239402, 239345, 238889, 238103, 237097, 235951, 234672, 233370, 232399, 231987, 231737, 231016, 229895, 229211, 229500, 230339, 230986, 231200, 231049, 230330, 228736, 226468, 224294, 222831, 221917, 220796, 218955, 216762, 215091, 214279, 213781, 213055, 212349, 212137, 212166, 211730, 210651, 209337, 208017, 206750, 206053, 206532, 207727, 208283, 207617, 206624, 206367, 206906, 207904, 209607, 212550, 216815, 222217, 228811, 236668, 245374, 254037, 261462, 266250, 267437, 265477, 261966, 258048, 253737, 249120]
51670B49120l901k337j236j003o46L57J169J175R59R78O25m08j103n78L45K68
51654B43784p39j479j515j504j907k447k866l276l659l719l388k943k564k144
51640B09634j627j161q85p93q40r67j095j227j415j528j218l96M59O38j05j281
51624A96193j979j542j98R86J052K06m49j33Q61J696J873J405O22n3l02j27K78
51607B00389P44J058Q96K47k57M3R07J465J363J053R78J138J520K161K634K266
51591B18605J201N70J146K388L222L206K628J952J624J922K576K956K894K848
51577B49738L009L004K824L203M412N393M979L484K164J458P37l39j187j230p41
51562B80908m23n61q40p93k82L92Q52J164J696K392K604K027J350J525K578L699
$$ y = [249120, 245219, 242882, 241646, 240643, 239997, 240354, 241523, 242698, 243657, 244635, 245260, 244852, 243749, 243171, 243516, 243784, 243045, 241566, 240051, 238547, 236640, 234193, 231327, 228051, 224392, 220673, 217285, 214342, 211778, 209634, 208007, 206846, 205961, 205168, 204328, 203361, 202266, 201039, 199624, 198096, 196878, 196482, 196941, 197579, 197474, 196193, 194214, 192672, 192474, 193460, 194512, 194718, 194269, 194136, 194997, 196693, 198566, 199971, 200593, 200540, 200238, 200111, 200389, 201133, 202191, 203087, 203334, 203077, 203120, 204027, 205492, 206855, 207908, 208886, 210024, 211544, 213705, 216339, 218605, 219806, 220376, 221522, 223910, 227132, 230338, 232966, 234918, 236542, 238464, 241040, 243996, 246890, 249738, 252747, 255751, 258575, 261778, 266190, 271583, 276562, 280046, 282210, 283668, 284405, 284066, 282879, 281649, 280908, 280485, 279924, 279084, 278291, 278009, 278401, 279253, 280417, 282113, 284505, 287109, 289136, 290486, 292011, 294589, 298288]
51546B98288M271M306M008L557L288L492L879L722K763J596R64R21R53P28M75
51531C37211N95J061J351J019K19n28j037j563k257k878l266l657m239m759m951
51516C12321n018n285n559n411m823m121l411k649k189k509l396m022m034l894
51502B56000l910l625k657j562j118j185j051o98p90j405j697j196o07q00j608
51487B32091k247k436k333j818o98M79Q26L52n4J9M7k53k90L10R06Q25M47M96
51469B26669Q46R44R50J426K215K676K913L653M831N371M746L816L630M093M298
51454B73077L746K730J850J544J834K260K233J676J133J096J426J538R62k77j674
51439B95154k660l101l328l508l409l018k975l769m871n384n292n265n323m736
$$ y = [298288, 302559, 306865, 310873, 314430, 317718, 321210, 325089, 328811, 331574, 333170, 334134, 335055, 336008, 336736, 337211, 337806, 338867, 340218, 341237, 341456, 340928, 339891, 338328, 336071, 333193, 329927, 326270, 322031, 317272, 312321, 307303, 302018, 296459, 291048, 286225, 282104, 278693, 276044, 273855, 271346, 267950, 263928, 259894, 256000, 252090, 248465, 245808, 244246, 243128, 241943, 240892, 240194, 239404, 237999, 236302, 235106, 234499, 233699, 232091, 229844, 227408, 225075, 223257, 222559, 223038, 223864, 224216, 224162, 224181, 224228, 223975, 223685, 223995, 224901, 225726, 226173, 226669, 227515, 228459, 229409, 230835, 233050, 235726, 238639, 242292, 247123, 252494, 257240, 261056, 264686, 268779, 273077, 276823, 279553, 281403, 282947, 284781, 287041, 289274, 290950, 292083, 293179, 294605, 296143, 297105, 296828, 295154, 292494, 289393, 286065, 282557, 279148, 276130, 273155, 269386, 264515, 259131, 253839, 248574, 243251, 238515]
51425B38515l373k190k026k610l180l419l378l015k290j406o23o7K44M78J065
51410B12725K191L268L490K933K434K397K378K011J506J059M52l79j122j664k275
51395B31404k973l422l702m403n566o383o332n885n571n202m569m121m245m463
51381A64567m085l180k305j761j610j937k489k594j997j312j123j213j223j368
51367A36370j826k060j608r83r04j121q82k25K01K87M81P55N32k24p56n01K06
51350A27742O01K78n03r83m72Q58J898J792R11L02L25M09L0o38r91n71N60J790
51332A33338K427K456K520K949L240K872K172J835J989K262K479K756L132L548
51318A69975L939M047L425K070N98m74j180j608j687j822k850m675n814n225l781
$$ y = [238515, 235142, 232952, 230926, 228316, 225136, 221717, 218339, 215324, 213034, 211628, 211005, 210938, 211182, 211660, 212725, 214916, 218184, 221674, 224607, 227041, 229438, 231816, 233827, 235333, 236392, 236844, 236465, 235343, 233679, 231404, 228431, 225009, 221307, 216904, 211338, 204955, 198623, 192738, 187167, 181965, 177396, 173275, 169030, 164567, 160482, 157302, 154997, 153236, 151626, 149689, 147200, 144606, 142609, 141297, 140174, 138961, 137738, 136370, 134544, 132484, 130876, 129893, 128989, 127868, 126986, 126761, 126962, 127249, 127730, 128485, 129017, 128793, 128037, 127536, 127742, 128343, 128621, 128118, 127135, 126663, 127521, 129419, 131211, 132122, 132424, 132749, 133158, 133188, 132550, 131559, 130988, 131548, 133338, 135765, 138221, 140741, 143690, 146930, 149802, 151974, 153809, 155798, 158060, 160539, 163295, 166427, 169975, 173914, 177961, 181386, 183456, 184054, 183580, 182400, 180792, 179105, 177283, 174433, 169758, 163944, 158719, 154938]
51303A54938k989k955k741k139j758j748j676j511j533j494r54k95k05m13j36
51288A32391M02L01k73k48M18N14l45r81o08p3l41r95j231j247j598k014j887
51271A22185j374j012p04k2Q24J213J024O34J96k95m65J45J212J801J466P16K12
51254A27756o7o15j600k535k770k177j270n76r6M49J020J246R61L98k00p18q93
51237A18313l36Q44J778J599L99p77r25RJ141J510Q95j50r46j145o86K42J074
51220A22839J208P14K98L12L27L7j7O83J654K014J763J551J570J483J299J316
51204A39051J346R46L34J77M69N73M11N59J051J198Q31O45R28R66K91m44m91j32
51186A48709q4m19p45r35j025q22j99N52J063J274J130M23o12j217j037o91q31
$$ y = [154938, 151949, 148994, 146253, 144114, 142356, 140608, 138932, 137421, 135888, 134394, 133440, 133145, 132940, 132527, 132391, 132793, 133094, 132821, 132573, 132991, 133505, 133160, 132179, 131571, 131498, 131157, 130162, 128931, 127684, 126086, 124072, 122185, 120811, 119799, 119095, 119073, 119897, 121110, 122134, 122768, 122964, 122669, 122204, 122349, 123561, 125362, 126828, 127544, 127756, 127689, 127074, 125474, 122939, 120169, 117992, 116722, 116146, 116050, 116499, 117519, 118765, 119726, 120124, 119924, 119206, 118313, 117977, 118821, 120599, 122198, 122597, 121820, 120895, 120904, 122045, 123555, 124450, 124300, 123354, 122209, 121523, 121765, 122839, 124047, 124761, 125059, 125371, 125698, 125735, 125718, 126401, 128055, 130069, 131832, 133383, 134953, 136436, 137735, 139051, 140397, 141343, 141677, 141854, 142323, 142896, 143307, 143866, 144917, 146115, 146946, 147591, 148519, 149485, 149776, 149332, 148841, 148709, 148625, 148206, 147461, 146526, 145501, 144679, 144480, 145032, 146095, 147369, 148499, 148922, 148310, 147093, 146056, 145365, 144534]
51169A44534j205j219r16p51p72p67r06j501k223k292j527o33l53o78j033r66
51153A26792n70l04l88m76q7O27R43N05k05m71n3Q46J870K520K350J511P73O57
51135A36840Q59P63K37m04q83j122j209j357j642j708j142k60P5l55q16o97k72
51118A26907M0L83Q99J097N60k74p18p90q85r19n59l1J91K11M92J027J415J615
51100A30661J829J853J402R63J353K372K877K336J465R81O55J14k76n3L50J29
51084A49011n70p08K71J665K374J985Q99k21q19n54M60J558K016J760J322J010
51068A61459N54k05p00k44Q87J600J259L27m30p46p12l21L58Q95Q86M70Q5j15
51050A65307k63k72J88J177K216K676K407J801J329J026N82j2k50K04Q85J055
$$ y = [144534, 143329, 142110, 141194, 140443, 139671, 138904, 137998, 136497, 134274, 131982, 130455, 129822, 129469, 128791, 127758, 126792, 126222, 125918, 125530, 125054, 124967, 125594, 126537, 127042, 126837, 126366, 126313, 127159, 129029, 131549, 133899, 135410, 136183, 136840, 137699, 138462, 138699, 138295, 137412, 136290, 135081, 133724, 132082, 130374, 129232, 128972, 129047, 128692, 127876, 127179, 126907, 126947, 127330, 128229, 129326, 129886, 129612, 128894, 128104, 127219, 126300, 125741, 125710, 125901, 126112, 126604, 127631, 129046, 130661, 132490, 134343, 135745, 136708, 138061, 140433, 143310, 145646, 147111, 148092, 148747, 148861, 148585, 148532, 148882, 149011, 148441, 147733, 148004, 149669, 152043, 154028, 154927, 154706, 153887, 153333, 153793, 155351, 157367, 159127, 160449, 161459, 162013, 161808, 161108, 160864, 161751, 163351, 164610, 164937, 164507, 163761, 163049, 162728, 163086, 163981, 164867, 165337, 165422, 165307, 165044, 164772, 164960, 166137, 168353, 171029, 173436, 175237, 176566, 177592, 178174, 178162, 177912, 178116, 179001, 180056]
51034A80056P42O75J072J260P20j24n24k81M21J498K697L303K807J642P36N07
51018A97207P76J354K067K425K024J289J161J873K624K663K214K033K409K977
51004B25096L320L531M046N047O063O353N734M879M668N372O609P832Q666Q987
50990C06203Q961Q976R284R889J0828J2302J4251J6106J7383J8328J9501K0993
50978D73005K2553K4378K7132L0982L5166L8772M1629M4180M6795M9525N2272
50967H86389N4904N7106N8417N8576N7789N6472N4635N1656M6996M1059L5077
50956A459076K9868K5074J9856J4104Q577L987M29k295m243n410n962o064n642
50943A531355m561l117k122k299l684n815q490j1947j6222k0671k4615k8188l2079
$$ y = [180056, 180798, 181473, 182545, 183805, 184525, 184401, 183877, 183596, 184017, 185515, 188212, 191515, 194322, 195964, 196700, 197207, 197983, 199337, 201404, 203829, 205853, 207142, 208303, 210176, 212800, 215463, 217677, 219710, 222119, 225096, 228416, 231947, 235993, 241040, 247103, 253456, 259190, 264069, 268737, 274109, 280718, 288550, 297216, 306203, 315164, 324140, 333424, 343313, 354141, 366443, 380694, 396800, 414183, 432511, 452012, 473005, 495558, 519936, 547068, 578050, 613216, 651988, 693617, 737797, 784592, 834117, 886389, 941293, 998399, 1056816, 1115392, 1173181, 1229653, 1284288, 1335944, 1382940, 1423999, 1459076, 1488944, 1514018, 1533874, 1547978, 1556555, 1560542, 1560971, 1558676, 1554433, 1549023, 1543061, 1536997, 1531355, 1526794, 1523677, 1521555, 1519256, 1515572, 1509757, 1501267, 1489320, 1473098, 1452427, 1427812, 1399624, 1367545]
50930A367545l6474m0799m4458m7311m9354n0503n0866n0701m9885m7939m4889
50919H54366m1546l8602l5859l2737k9147k5465k2036j9135j6962j5317j3608
50908E63952j1627r932r017q538p848o849n734m340k532r31l49o45r18p48m91
50893D93453l09J97J186K173K753L138L677M343N040N888O864P548P708P815Q497
50878E59971R654J0636J1231J2072J3712J5675J6891J7152J7661J9738K3171K6468
50866G54032K8692L0454L2900L6373M0560M5344N0837N6878O3178O9830P7097
50855A286175Q4785R2409R9844J07266J14454J20781J25928J30048J33078J34350
50845B429118J33004J28354J19911J07645R2488P5984N9199M2344K5678J0231
$$ y = [1367545, 1331071, 1290272, 1245814, 1198503, 1149149, 1098646, 1047780, 997079, 947194, 899255, 854366, 812820, 774218, 738359, 705622, 676475, 651010, 628974, 609839, 592877, 577560, 563952, 552325, 542393, 533376, 524838, 516990, 510141, 504407, 500067, 497535, 496604, 496255, 495610, 494692, 493944, 493453, 493144, 493341, 494527, 496700, 499453, 502591, 506268, 510611, 515651, 521539, 528403, 535951, 543659, 551474, 559971, 569625, 580261, 591492, 603564, 617276, 632951, 649842, 666994, 684655, 704393, 727564, 754032, 782724, 813178, 846078, 882451, 923011, 968355, 1019192, 1076070, 1139248, 1209078, 1286175, 1370960, 1463369, 1563213, 1670479, 1784933, 1905714, 2031642, 2161690, 2294768, 2429118, 2562122, 2690476, 2810387, 2918032, 3010520, 3086504, 3145703, 3188047, 3213725, 3223956]
50835C223956k749j2845k0467k5994k9232k9651k6919k1341j3961o251M71N312
50823C040329P620O781K447n135j5227k7112m0386n4614o8836q1734r2558j01672
50811B569903j09823j16872j21641j23099j21250j16789j10439j02947r5106q7271
50801A464666p9175p0747o2654n5505m8831m1724l4259k7452k1883j7110j2647
50790I92679q594n018j451K420N960Q094Q480P785O876O064N136L912K609J576
50776A036528P74k50j799l608n194o421p470q471r480j0559j1587j2138j1920
50763I48405j1141j0062q478o186l636j492L02K207M004M928N007N384O873Q948
50749I45063J0653J1989J3769J6528K0104K4160K8559L3244L8150M3261M8703
$$ y = [3223956, 3221207, 3208362, 3187895, 3161901, 3132669, 3103018, 3076099, 3054758, 3040797, 3034546, 3035017, 3040329, 3047949, 3054730, 3057177, 3052042, 3036815, 3009703, 2969317, 2914703, 2845867, 2764133, 2671575, 2569903, 2460080, 2343208, 2221567, 2098468, 1977218, 1860429, 1749990, 1647043, 1551937, 1464666, 1385491, 1314744, 1252090, 1196585, 1147754, 1106030, 1071771, 1044319, 1022436, 1005326, 992679, 984085, 979067, 977616, 980036, 985996, 994090, 1002570, 1010355, 1017231, 1023295, 1028431, 1032343, 1034952, 1036528, 1037302, 1037052, 1035253, 1031645, 1026451, 1020030, 1012560, 1004089, 994609, 984050, 972463, 960325, 948405, 937264, 927202, 918724, 912538, 908902, 907410, 907712, 909919, 913923, 918851, 923858, 929242, 936115, 945063, 955716, 967705, 981474, 998002, 1018106, 1042266, 1070825, 1104069, 1142219, 1185480, 1234183]
50738A234183N4669O1201O7956P4260P9626Q4114Q7837R0298R0635Q8472Q4041
50727B097292P7460O8422N6837M3304K8762J4029k05j3390k5201l5230m2475m5816
50715B223789m5238m2051l7568l2157k5899j9431j3505q206l445j1P11j885p086
50702A988018j3752k1274k9540l8400m7364n5665o2547o7597p0806p2144p1262
50691A437667o7961o2882n7282n1975m6792m1289l5620l0380k5722k1175j6382
50680I80207j1658p462l545Q94O176J1698J6684K1021K5076K9018L2656L5767
50668A136532L8146L9465L9504L8601L7470L6469L5287L3444L0967K8402K6297
50657A520584K4695K3042K0633J7244J3271R266N458J830j611m854p890j0432
$$ y = [1234183, 1288852, 1350053, 1418009, 1492269, 1571895, 1656009, 1743846, 1834144, 1924779, 2013251, 2097292, 2174752, 2243174, 2300011, 2343315, 2372077, 2386106, 2385901, 2372511, 2347310, 2312080, 2269605, 2223789, 2178551, 2136500, 2098932, 2066775, 2040876, 2021445, 2007940, 1999734, 1996289, 1996278, 1996989, 1995104, 1988018, 1974266, 1952992, 1923452, 1885052, 1837688, 1782023, 1719476, 1651879, 1581073, 1508929, 1437667, 1369706, 1306824, 1249542, 1197567, 1150775, 1109486, 1073866, 1043486, 1017764, 996589, 980207, 968549, 961087, 957542, 958436, 964612, 976310, 992994, 1014015, 1039091, 1068109, 1100765, 1136532, 1174678, 1214143, 1253647, 1292248, 1329718, 1366187, 1401474, 1434918, 1465885, 1494287, 1520584, 1545279, 1568321, 1588954, 1606198, 1619469, 1628735, 1634193, 1636023, 1634412, 1629558, 1621668, 1611236]
50645A611236j1861j1705j0065p362l994l57L149O511R940J3033J4613J4133J2646
50632A639917J1607J1094J0126Q383O527N002L605K387J880K248L212M960Q081
50619A719029J2283J6205J8955K0854K2189K2219K0136J6207J1283N861L25m644
50607A880902q708j2422j6417k0461k3992k7025k9843l2425l4867l7829m1628
50596A595285m5386m7989m9534n0830n1830n1713n0378m8713m7164m5153m2227
50585A064368l8979l6281l4141l1817k8763k5109k1449j8358j5955j3900j1861
50574G87755r886q071o100l566n97K226M573O521Q179R637J1281J3535J6210J8660
50560H50357K0705K2839K5363K7930L0270L2864L6235L9974M3011M4894M6224
$$ y = [1611236, 1599375, 1587670, 1577605, 1570243, 1566249, 1565892, 1569041, 1575552, 1585492, 1598525, 1613138, 1627271, 1639917, 1651524, 1662618, 1672744, 1681127, 1687654, 1692656, 1696261, 1698648, 1700528, 1702776, 1705988, 1710948, 1719029, 1731312, 1747517, 1766472, 1787326, 1809515, 1831734, 1851870, 1868077, 1879360, 1885221, 1885546, 1880902, 1872194, 1859772, 1843355, 1822894, 1798902, 1771877, 1742034, 1709609, 1674742, 1636913, 1595285, 1549899, 1501910, 1452376, 1401546, 1349716, 1298003, 1247625, 1198912, 1151748, 1106595, 1064368, 1025389, 989108, 954967, 923150, 894387, 869278, 847829, 829471, 813516, 799616, 787755, 777869, 769798, 763698, 760132, 759535, 761761, 766334, 772855, 781034, 790671, 801952, 815487, 831697, 850357, 871062, 893901, 919264, 947194, 977464, 1010328, 1046563, 1086537, 1129548, 1174442, 1220666]
50549A220666M7704M9167M9891M9567M8561M7254M5594M3536M1536M0136L9210
50538A722822L8093L6433L4468L2454L0387K8443K7172K6871K7309K8356L0381
50527B063189L3498L6919L9691M1772M3663M5292M6023M5621M4253M1607L6904
50516B518432L0155K2528J5062P570o57r660j8911k8100l7062m5107n1220n5047
50504B347983n7103n7840n6967n4064m9401m3765l7610l0909k3800j7019j1339
50493A908166o904l337l67J933L539M741N851O707O604M659K81o584j5540k5905
50479A883844l6805m7155n5871o2329o6622o9162p0162o9571o7425o4033n9873
50468A214836n5484n1291m7337m3305l9015l4779l0994k7565k4152k0727j7497
$$ y = [1220666, 1268370, 1317537, 1367428, 1416995, 1465556, 1512810, 1558404, 1601940, 1643476, 1683612, 1722822, 1760915, 1797348, 1831816, 1864270, 1894657, 1923100, 1950272, 1977143, 2004452, 2032808, 2063189, 2096687, 2133606, 2173297, 2215069, 2258732, 2304024, 2350047, 2395668, 2439921, 2481528, 2518432, 2548587, 2571115, 2586177, 2593747, 2593090, 2583430, 2564519, 2536419, 2499357, 2454250, 2403030, 2347983, 2290880, 2233040, 2176073, 2122009, 2072608, 2028843, 1991233, 1960324, 1936524, 1919505, 1908166, 1901262, 1897925, 1897558, 1899491, 1903030, 1907771, 1913622, 1920329, 1926933, 1931592, 1931873, 1925289, 1909749, 1883844, 1847039, 1799884, 1744013, 1681684, 1615062, 1545900, 1475738, 1406167, 1338742, 1274709, 1214836, 1159352, 1108061, 1060724, 1017419, 978404, 943625, 912631, 885066, 860914, 840187, 822690]
50457H22690j4352j1017p638m724k479p47M71J145J899L671O437R069J0812J2158
50443H27395J3723J5125J5764J6139J7445J9975K2749K4684K5629K6251K7245
50432A052124K8707L0068L0778L1095L1813L3054L3892L3562L2500L1630L1181
50421A400404L0826L0535L0597L0966L1353L1796L2529L3437L4179L4686L4957
50410A756265L4545L2888L0083K6694K3082J9347J5725J2207Q013K389m194j0527
50398A946517j6392k2730k9914l6909m2730m7750n2792n7569o0950o2488o2832
50387A453461o2666o1815n9673n6041n1367m6170m0583l4458k7934k1635j6110
50376I75009j1281o652k000K405O213R273J1597J3289J4347J4342J2465Q384K952
$$ y = [822690, 808338, 797321, 789683, 784959, 782480, 781733, 782204, 783349, 785248, 788919, 795356, 804425, 815237, 827395, 841118, 856243, 872007, 888146, 905591, 925566, 948315, 972999, 998628, 1024879, 1052124, 1080831, 1110899, 1141677, 1172772, 1204585, 1237639, 1271531, 1305093, 1337593, 1369223, 1400404, 1431230, 1461765, 1492362, 1523328, 1554681, 1586477, 1619006, 1652443, 1686622, 1721308, 1756265, 1790810, 1823698, 1853781, 1880475, 1903557, 1922904, 1938629, 1950836, 1958849, 1961238, 1957044, 1946517, 1930125, 1907395, 1877481, 1840572, 1797842, 1750092, 1697300, 1639731, 1578781, 1516293, 1453461, 1390795, 1328980, 1269307, 1213266, 1161899, 1115729, 1075146, 1040688, 1012754, 991119, 975009, 963728, 957076, 955076, 957481, 963694, 972967, 984564, 997853, 1012200, 1026542, 1039007, 1047391, 1050343]
50363A050343k479p356j2025j6678k0814k3936k6024k7105k6944k5590k3765k2247
50351H15380k1190k0383j9814j9497j8988j7674j5510j3121j1114r530q054o488
50339F34017m950l694k731j678o3K068M015N075N293N367N843O618P321P968Q889
50324F79358J0131J1292J2175J3222J4943J7065J8790J9797K0468K1110K1664
50313H60015K2298K3536K5280K6455K6240K5136K4047K2813K0639J7677J5049
50302A109185J3270J1678R652P429N346L129N42j976l929n534p258r040j0536
50289A121958j1948j3834j6259j8669k0663k2392k4090k5550k6282k6000k4902
50278H91369k3604k2674k2195k1642k0441j8618j6748j5267j4072j2819j1449
$$ y = [1050343, 1047864, 1040508, 1028483, 1011805, 990991, 967055, 941031, 913926, 886982, 861392, 837627, 815380, 794190, 773807, 753993, 734496, 715508, 697834, 682324, 669203, 658089, 648559, 640505, 634017, 629067, 625373, 622642, 620964, 620901, 622969, 626984, 632059, 637352, 642719, 648562, 655180, 662501, 670469, 679358, 689489, 700781, 712956, 726178, 741121, 758186, 776976, 796773, 817241, 838351, 860015, 882313, 905849, 931129, 957584, 983824, 1008960, 1033007, 1055820, 1076459, 1094136, 1109185, 1122455, 1134133, 1143785, 1151214, 1156560, 1159689, 1160231, 1158255, 1154326, 1148792, 1141534, 1132494, 1121958, 1110010, 1096176, 1079917, 1061248, 1040585, 1018193, 994103, 968553, 942271, 916271, 891369, 867765, 845091, 822896, 801254, 780813, 762195, 745447, 730180, 716108, 703289, 691840]
50267F91840j0198r245q576q113p781p373o675n845n411n560n697n102l894k907
50253E99463k597k519j997q95M01J414J821J714J686K242L071L434L349L649M666
50238F18902N697O150O393O826O956O252N211M630M393L966L576L723L866K971
50224F89512J213j32n83r93j960k912l256l337l688m102m188m136m319m631m702
50209F47786m445l988l384k648j722l90J379K987L792M142N013O475P472P463
50195F69932P299P928R053R765R746R222Q228O801N380M357L429K046J13k151
50181G51148m685p290r307j0181j0165r954r869r875j0050j0474j0846j0719r982
50168F27751q762p199n653m751m750n167n465n711o051o138n698n224n256n376
$$ y = [691840, 681642, 672397, 663821, 655708, 647927, 640554, 633879, 628034, 622623, 617063, 611366, 606264, 602370, 599463, 596866, 594347, 592350, 591455, 591856, 593270, 595091, 596805, 598491, 600733, 603804, 607238, 610587, 614236, 618902, 624599, 630749, 637142, 643968, 650924, 657176, 662387, 667017, 671410, 675376, 678952, 682675, 686541, 689512, 690725, 690593, 690010, 689017, 687057, 684145, 680889, 677552, 673864, 669762, 665574, 661438, 657119, 652488, 647786, 643341, 639353, 635969, 633321, 631599, 631209, 632588, 635575, 639367, 643509, 648522, 654997, 662469, 669932, 677231, 685159, 694212, 703977, 713723, 722945, 731173, 737974, 743354, 747711, 751140, 753186, 753299, 751148, 746463, 739173, 729866, 719685, 709520, 699566, 689697, 679822, 669772, 659298, 648452, 637733, 627751, 618989, 611790, 606137, 601386, 596636, 591469, 586004, 580293, 574242, 568104, 562406, 557182, 551926, 546550]
50154E46550m781l636k858k644k246j361p07q46j273j284j085j302j858k071j784
50139E16814j657k106k547k127r59o3J5nQ78K478L572L429K619K121K215K502
50123E27179K606K400J886J267R27J018J218J130P10N5q45j854k451k255j548
50108E31443r44o65n09l94n58j204k155k814k445q41J228K593K951L045L438L767
50092E35936L674L722M615N976O855P172P690Q711R753J0623J1807J3496J5030
50079F45060J5743J5872J6156J6945J8074J9242K0184K0709K0864K0912K0981
50068H50742K0882K0426J9680J8866J8239J8131J8703J9593K0212K0648K1820
50057A067942K4318K7425K9907L1697L4147L8350M3689M8409N1330N2456N2014
$$ y = [546550, 541769, 538133, 535275, 532631, 530385, 529024, 528317, 527471, 526198, 524914, 523829, 522527, 520669, 518598, 516814, 515157, 513051, 510504, 508377, 507418, 507355, 507370, 507365, 508243, 510721, 514293, 517722, 520341, 522462, 524677, 527179, 529785, 532185, 534071, 535338, 536265, 537283, 538501, 539631, 540341, 540396, 539551, 537697, 535246, 532991, 531443, 530499, 529834, 529325, 528931, 528373, 527169, 525014, 522200, 519755, 518914, 520142, 522735, 525686, 528731, 532169, 535936, 539610, 543332, 547947, 553923, 560778, 567950, 575640, 584351, 594104, 604727, 616534, 630030, 645060, 660803, 676675, 692831, 709776, 727850, 747092, 767276, 787985, 808849, 829761, 850742, 871624, 892050, 911730, 930596, 948835, 966966, 985669, 1005262, 1025474, 1046122, 1067942, 1092260, 1119685, 1149592, 1181289, 1215436, 1253786, 1297475, 1345884, 1397214, 1449670, 1501684]
50046A501684M9649M5004L8629L1785K5503K0284J6611J4981J5292J6726J8572
50035A794720K0645K2535K2866J9900J2869K469r817k2590l4850m5911n5177o2067
50023A665592o6145o7293o5700o1927n7195n3142n0484m8057m4074l8515l3426
50012A079634l0462k9099k7729k5620k3010k0120j7181j4887j3670j2766j1075
50001H54015q691o649n317m144k882j937j425r42m40l82p16p21j86K06L2k74n00
49984H19047j252k817m329m933n109n798o754o936o235n654n730n841n375m713
49970G47571m522m659m374l382k200j425j040n44L76J468K239K530K694L201M211
49955G42144N538O857P925Q759R731J1296J3420J5469J6855J7724J8744K0355
$$ y = [1501684, 1551333, 1596337, 1634966, 1666751, 1692254, 1712538, 1729149, 1744130, 1759422, 1776148, 1794720, 1815365, 1837900, 1860766, 1880666, 1893535, 1896004, 1886187, 1863597, 1828747, 1782836, 1727659, 1665592, 1599447, 1532154, 1466454, 1404527, 1347332, 1294190, 1243706, 1195649, 1151575, 1113060, 1079634, 1049172, 1020073, 992344, 966724, 943714, 923594, 906413, 891526, 877856, 865090, 854015, 845324, 838675, 833358, 829214, 826332, 824395, 822970, 822028, 821588, 821206, 820490, 819769, 819583, 819789, 819821, 819547, 819047, 817795, 814978, 810649, 805716, 800607, 794809, 788055, 781119, 774884, 769230, 763500, 757659, 752284, 747571, 743049, 738390, 734016, 730634, 728434, 727009, 725969, 725425, 725801, 727269, 729508, 732038, 734732, 737933, 742144, 747682, 754539, 762464, 771223, 780954, 792250, 805670, 821139, 837994, 855718, 874462, 894817]
49943H94817K2510K5183K8748L3597L9554M5910N2106N8241O4784P1829P8627
49932A415906Q3851Q6335Q5609Q1932P5978O8628O0908N3926M8564M5172M3603
49921B150412M3514M4457M5612M5657M3147L7075K7094J3476k865k0487l7857
49910B389235n3729o7050p6866q2911q6156q8134q9564r0041q9144q7185q4645
49899A493810q1491p7539p3054o8484o3905n9189n4410m9741m5164m0739l6763
49888H43331l3330l0031k6640k3693k1717k0215j8162j5429j2986j1620j1200
49877F18308j1275j1610j1946j1853j1266j0654j0327r957r105p919o936o372
49865D99088o004n566n037m566m302m266m241l851k839j376j03K86k94j022q64
$$ y = [894817, 917327, 942510, 971258, 1004855, 1044409, 1090319, 1142425, 1200666, 1265450, 1337279, 1415906, 1499757, 1586092, 1671701, 1753633, 1829611, 1898239, 1959147, 2013073, 2061637, 2106809, 2150412, 2193926, 2238383, 2283995, 2329652, 2372799, 2409874, 2436968, 2450444, 2447579, 2427092, 2389235, 2335506, 2268456, 2191590, 2108679, 2022523, 1934389, 1844825, 1754784, 1665640, 1578455, 1493810, 1412319, 1334780, 1261726, 1193242, 1129337, 1070148, 1015738, 965997, 920833, 880094, 843331, 810001, 779970, 753330, 729637, 707920, 687705, 669543, 654114, 641128, 629508, 618308, 607033, 595423, 583477, 571624, 560358, 549704, 539377, 529420, 520315, 512396, 505460, 499088, 493084, 487518, 482481, 477915, 473613, 469347, 465106, 461255, 458416, 457040, 456937, 457223, 456929, 455907, 455043]
49850D55043K37J209J157N10M21J282K371K885K741K373K203K494L223L969M211
49835D86329L879L413L265L603M454N689O935P862Q615R631J1020J2456J3765
49822E80916J5129J6754J8702K1167K4454K8490L2797L7162M1899M7266N2867
49811I17603N7907O1728O3877O3907O1450N6469M9311M0700L1737K3720J7726
49800A446135J4293J3390J4497J6700J8878J9901J8675J4281O378m566j7596l1694
49788A529272m5741n8381o8355p4945p7914p7381p4032o9096o3556n7561n1145
49777H11165m5026m0020l5908l1813k7576k3900k1082j8596j6028j3595j1499
49766E26122r635q123p319o936o058m407k822k007j627j159p84p70p29k49L27
$$ y = [455043, 455280, 456489, 457646, 458156, 458577, 459859, 462230, 465115, 467856, 470229, 472432, 474926, 478149, 482118, 486329, 490208, 493621, 496886, 500489, 504943, 510632, 517567, 525429, 534044, 543675, 554695, 567151, 580916, 596045, 612799, 631501, 652668, 677122, 705612, 738409, 775571, 817470, 864736, 917603, 975510, 1037238, 1101115, 1165022, 1226472, 1282941, 1332252, 1372952, 1404689, 1428409, 1446135, 1460428, 1473818, 1488315, 1505015, 1523893, 1543794, 1562469, 1576750, 1583128, 1578562, 1560966, 1529272, 1483531, 1425150, 1356795, 1281850, 1203936, 1126555, 1052523, 983427, 919871, 862310, 811165, 766139, 726119, 690211, 658398, 630822, 606922, 585840, 567244, 551216, 537621, 526122, 516487, 508364, 501045, 494109, 488051, 483644, 480822, 478815, 477188, 476029, 475245, 474475, 473746, 473497, 473824]
49751D73824N13O02J149J986K461K355J819Q75k85q20m5J500K544K586K136J633
49735D94833J034M53L43P50J055P79J26m52p82q94p88n06j20M12J052J382J010
49718D99687L06J80Q64J480J125L3p90p61r8P89J771K678L008K320R32o2K79J794
49700E15535L352L930L502K737K162J824J646J642J685J420O63j89m60O1Q22J117
49684E41449R14P92J083J307P89m12j443j635j181p63p26q37p66n91o94j215j672
49667E34399j427n30K08K08j53j35L40Q29J245J887K601K738K154J569J564J796
49651E49293J618J029N56N15P94J183J494J598J589J737K043K133J794J338J193
49636E69907J418J832K200K218J700J086J231K320L499L972L901L783L541K926
$$ y = [473824, 474337, 474939, 476088, 478074, 480535, 482890, 484709, 485584, 485299, 484479, 484434, 485934, 488478, 491064, 493200, 494833, 495867, 496320, 496663, 497413, 498468, 499247, 499373, 498921, 498139, 497245, 496457, 495951, 495831, 496243, 497295, 498677, 499687, 499993, 500173, 501037, 502517, 503642, 503675, 502885, 502124, 502026, 502815, 504586, 507264, 510272, 512592, 513524, 513462, 513741, 515535, 518887, 522817, 526319, 529056, 531218, 533042, 534688, 536330, 538015, 539435, 540098, 539909, 539449, 539510, 540332, 541449, 542363, 543155, 544238, 545545, 546334, 545922, 544479, 542844, 541663, 540900, 540174, 539337, 538571, 537980, 537286, 536071, 534399, 532972, 532442, 532650, 532858, 532705, 532570, 532910, 533739, 534984, 536871, 539472, 542210, 544364, 545933, 547497, 549293, 550911, 551940, 552496, 553011, 553805, 554988, 556482, 558080, 559669, 561406, 563449, 565582, 567376, 568714, 569907, 571325, 573157, 575357, 577575, 579275, 580361, 581592, 583912, 587411, 591383, 595284, 599067, 602608, 605534]
$$ [...]
##END NTUPLES=NMR SPECTRUM
##END=
