##TITLE=NES1010_Conilon_9232912_cuLHfhc4Ys
##JCAMPDX= 6.0         $$ Bruker NMR JCAMP-DX V2.0
##DATA TYPE= NMR SPECTRUM
##DATA CLASS= NTUPLES
##ORIGIN= BRUKER
##OWNER= Administrator
$$ 1.72 TOPSPIN		Version 2.1
$$ 2015-06-17 15:35:14.878 -0700  Administrator@X
$$ Compression mode = diff/dup
##.OBSERVE FREQUENCY= 400.02188249412
##.OBSERVE NUCLEUS= ^1H
##.ACQUISITION MODE= SIMULTANEOUS (DQD)
##.ACQUISITION SCHEME= undefined
##.AVERAGES= 8
##.DIGITISER RES= 22
##SPECTROMETER/DATA SYSTEM= spect
##.PULSE SEQUENCE= zg30
##.SOLVENT NAME= COFFEE_meoh
##.SHIFT REFERENCE= INTERNAL, COFFEE_meoh, 1, 14.98509
##AUDIT TRAIL= $$ (NUMBER, WHEN, WHO, WHERE, PROCESS, VERSION, WHAT)
$$ ##TITLE= Audit trail, TOPSPIN		Version 2.1
$$ ##JCAMPDX= 5.01
$$ ##ORIGIN= Bruker BioSpin GmbH
$$ ##OWNER= Administrator
$$ $$ E:\/data/COFFEE/nmr/NES1010_Conilon_9232912_cuLHfhc4Ys/10/pdata/1/auditp.txt
$$ ##AUDIT TRAIL=  $$ (NUMBER, WHEN, WHO, WHERE, PROCESS, VERSION, WHAT)
(   1,<2015-06-17 15:35:07.597 -0700>,<Administrator>,<X>,<go>,<TOPSPIN 2.1>,
      <created by zg
	started at 2015-06-17 15:34:01.737 -0700,
	POWCHK enabled, PULCHK disabled,
       configuration hash MD5:
       21 0F 79 D6 B3 7B B4 F6 88 20 88 DB 03 48 BD 9F
       data hash MD5: 64K
       BF B0 8E 7D 9F A8 09 89 1E CD C7 CE 70 74 2A E1>)
(   2,<2015-06-17 15:35:10.894 -0700>,<Administrator>,<X>,<proc1d>,<TOPSPIN 2.1>,
      <Start of raw data processing
       efp LB = 0 FT_mod = 6 PKNL = 1 PHC0 = 0 PHC1 = 0 SI = 32K 
       data hash MD5: 32K
       2D 48 96 74 A1 CA 1D 6D 8F A2 34 D1 F4 1C 21 30>)
(   3,<2015-06-17 15:35:11.191 -0700>,<Administrator>,<X>,<proc1d>,<TOPSPIN 2.1>,
      <pk PHC0 = 92.36206 PHC1 = 0 
       data hash MD5: 32K
       9D 39 E1 60 0A BB D7 F2 F7 48 D7 39 9D 50 A8 45>)
(   4,<2015-06-17 15:35:11.300 -0700>,<Administrator>,<X>,<proc1d>,<TOPSPIN 2.1>,
      <abs ABSG = 1 
       data hash MD5: 32K
       74 E3 E8 14 CC 56 A6 7C E6 7D 45 AB 06 D3 E5 53>)
(   5,<2015-06-17 15:35:11.362 -0700>,<Administrator>,<X>,<proc1d>,<TOPSPIN 2.1>,
      <abs ABSG = 2 
       data hash MD5: 32K
       0D 48 12 BE B7 33 D0 F5 04 93 C7 28 D5 12 F3 1C>)
(   6,<2015-06-17 15:35:11.409 -0700>,<Administrator>,<X>,<proc1d>,<TOPSPIN 2.1>,
      <abs ABSG = 3 
       data hash MD5: 32K
       E6 CF BB 67 67 F7 BE 0D 4A 08 C4 CB 8B 18 81 45>)
(   7,<2015-06-17 15:35:11.472 -0700>,<Administrator>,<X>,<proc1d>,<TOPSPIN 2.1>,
      <abs ABSG = 4 
       data hash MD5: 32K
       B8 DB 9A 47 AD F7 32 AA 3C 5A 80 00 8F 38 4D A2>)
(   8,<2015-06-17 15:35:11.519 -0700>,<Administrator>,<X>,<proc1d>,<TOPSPIN 2.1>,
      <abs ABSG = 5 
       data hash MD5: 32K
       3E 9A 7A 77 C8 9E 5F 9A A9 7D B6 62 03 8E 89 F7>)
$$ ##END=
$$ 
$$ $$ hash MD5
$$ $$ B3 2C 3A 49 E2 37 DE 43 0F 8E 15 F7 66 E6 4F 5D
##$RELAX= 
##$RELAX= 
##$RELAX= 
##$RELAX= 
##$RELAX= 
##$RELAX= 
##$RELAX= 
$$ Bruker specific parameters
$$ --------------------------
##$DU= <E:\>
##$EXPNO= 10
##$NAME= <NES1010_Conilon_9232912_cuLHfhc4Ys>
$$ [...]
150 150 150 150 150 150 150 150
##$TP07= 0
##$TPNAME0= <>
##$TPNAME1= <>
##$TPNAME2= <>
##$TPNAME3= <>
##$TPNAME4= <>
##$TPNAME5= <>
##$TPNAME6= <>
##$TPNAME7= <>
##$TPOAL= (0..7)
0.5 0.5 0.5 0.5 0.5 0.5 0.5 0.5
##$TPOFFS= (0..7)
0 0 0 0 0 0 0 0
##$TUNHIN= 0
##$TUNHOUT= 0
##$TUNXOUT= 0
##$USERA1= <user>
##$USERA2= <user>
##$USERA3= <user>
##$USERA4= <user>
##$USERA5= <user>
##$V9= 5
##$VALIST= <valist>
##$VCLIST= <CCCCCCCCCCCCCCC>
##$VD= 0
##$VDLIST= <DDDDDDDDDDDDDDD>
##$VPLIST= <PPPPPPPPPPPPPPP>
##$VTLIST= <TTTTTTTTTTTTTTT>
##$WBST= 2048
##$WBSW= 25
##$XGAIN= (0..3)
0 0 0 0
##$XL= 0
##$YL= 0
##$YMAX_a= 632167
##$YMIN_a= -524743
##$ZGOPTNS= <>
##$ZL1= 120
##$ZL2= 120
##$ZL3= 120
##$ZL4= 120
##$ABSF1= 14.98509
##$ABSF2= -5.573092
##$ABSG= 5
##$ABSL= 3
##$ALPHA= 0
##$AQORDER= 0
##$ASSFAC= 0
##$ASSFACI= 0
##$ASSFACX= 0
##$ASSWID= 0
##$AUNMP= <proc_prof1d_extract_pilot.lims>
##$AXLEFT= 0
##$AXNAME= <>
##$AXNUC= <1H>
##$AXRIGHT= 0
##$AXTYPE= 0
##$AXUNIT= <>
##$AZFE= 0.1
##$AZFW= 0.1
##$BCFW= 0
##$BC_mod= 0
##$BYTORDP= 0
##$COROFFS= 0
##$CY= 15
##$DATMOD= 1
##$DC= 0
##$DFILT= <>
##$DTYPP= 0
##$F1P= 0
##$F2P= 0
##$FCOR= 0.5
##$FTSIZE= 32768
##$FT_mod= 6
##$GAMMA= 0
##$GB= 0
##$INTBC= 1
##$INTSCL= 1
##$ISEN= 128
##$LB= 0
##$LEV0= 0
##$LPBIN= 0
##$MAXI= 10000
##$MC2= 0
##$MEAN= 0
##$ME_mod= 0
##$MI= 0
##$NCOEF= 0
##$NC_proc= -8
##$NLEV= 6
##$NOISF1= 0
##$NOISF2= 0
##$NSP= 0
##$NTH_PI= 0
##$NZP= 0
##$OFFSET= 14.98509
##$PC= 1
##$PHC0= 92.36206
##$PHC1= 0
##$PH_mod= 1
##$PKNL= yes
##$PPARMOD= 0
##$PPDIAG= 0
##$PPIPTYP= 0
##$PPMPNUM= 2147483647
##$PPRESOL= 1
##$PSCAL= 4
##$PSIGN= 0
##$PYNMP= <proc.py>
##$REVERSE= no
##$SF= 400.02
##$SI= 32768
##$SIGF1= 0
##$SIGF2= 0
##$SINO= 400
##$SIOLD= 32768
##$SPECTYP= <>
##$SREGLST= <1H.CDCl3>
##$SSB= 0
##$STSI= 32768
##$STSR= 0
##$SW_p= 8223.68421052631
##$SYMM= 0
##$S_DEV= 0
##$TDeff= 65536
##$TDoff= 0
##$TI= <>
##$TILT= no
##$TM1= 0
##$TM2= 0
##$TOPLEV= 0
##$USERP1= <user>
##$USERP2= <user>
##$USERP3= <user>
##$USERP4= <user>
##$USERP5= <user>
##$WDW= 1
##$XDIM= 32768
##$YMAX_p= 442291687
##$YMIN_p= -696433
##$CURPLOT= <Network HP LaserJet P1505>
##$CURPRIN= <$Network HP LaserJet P1505>
##$DFORMAT= <normdp>
##$LAYOUT= <+/1D_H.xwp>
##$LFORMAT= <normlp>
##$PFORMAT= <normpl>
##$SURQMSG= 1
$$ End of Bruker specific parameters
$$ ---------------------------------
##NTUPLES= NMR SPECTRUM
##VAR_NAME=  FREQUENCY,     SPECTRUM/REAL,   SPECTRUM/IMAG
##SYMBOL=    X,             R,               I
##VAR_TYPE=  INDEPENDENT,   DEPENDENT,       DEPENDENT
##VAR_FORM=  AFFN,          ASDF,            ASDF
##VAR_DIM=   32768,         32768,           32768
##UNITS=     HZ,            ARBITRARY UNITS, ARBITRARY UNITS
##FACTOR=    0.250966925370066, 1,           1
##FIRST=     8223.43324360094, -122338,      -161518
##LAST=      0,             50675,           -161674
##MIN=       0,             -696433,         0
##MAX=       8223.43324360094, 442291687,    0
$$ Real data points
##PAGE= N=1
##DATA TABLE= (X++(R..R)), XYDATA
$$ [...]
19467c13994a28572G8431b92791B40022b3499A02303a679r338j44039a1207F6165
$$ -313994 -128572 78431 -292791 240022 -23499 102303 -1679 -11017 -155056 -11207 66165
19455I972J24877h0765f773l6904D4134I368K59663N8061a14414l30568a74941
$$ 9972 134849 -80765 -6773 -43677 44134 9368 269031 327092 -114414 -444982 -174941
19443c26070f7588a4851p0561J5770j03470k8994j76A40189b56122l2723c2032
$$ -326070 -67588 -14851 -85412 -69642 -173112 -202106 -202282 140189 -256122 -288845 -32032
19431E6636a32506k0197A0289a32491L4862B21971a21971a4103l3698G7340c51977
$$ 56636 -132506 -152703 10289 -132491 -97629 221971 -121971 -14103 -47801 77340 -351977
19419g8933a5613F0679M0125e9795j30881b9701B5313b5697j41056N0737B94983
$$ -78933 -15613 60679 100804 -59795 -190676 -29701 25313 -25697 -166753 -116016 294983
19407b71874J19439j49162i2581j08180E086M0012J75195b14582J4027J8307o2778
$$ -271874 -152435 -301597 -92581 -200761 5086 45098 220293 -214582 -200555 -182248 -245026
19396b45026h7555j07732K5517G1348b4900j04119o1996M2800A36462a9834M966
$$ -245026 -87555 -195287 -169770 71348 -24900 -129019 -191015 -148215 136462 -19834 -14868
19385a4868F5023b13667E7689a52492j48233a25282C9680D563J27565m1128a28019
$$ -14868 65023 -213667 57689 -152492 -300725 -125282 39680 4563 132128 91000 -128019
19373B64608a39188a8567q957j47807K5895k57390Q9181A40771a86440j42695
$$ 264608 -139188 -18567 -27524 -175331 -149436 -406826 -317645 140771 -186440 -329135
19363c29135J2857h9358c3494j23670p0886f0555m3594b7888Q181A06022J06768
$$ -329135 -316278 -89358 -33494 -157164 -228050 -60555 -104149 -27888 -19707 106022 212790
19352B12790i8165k00131a41803k98285D8639a27247j27093d6660n3739A11061
$$ 212790 -98165 -298296 -141803 -440088 48639 -127247 -254340 -46660 -100399 111061
19341B38188j1879C5291a85661G0960b62455A55296b84632A67649b05866e6404
$$ 238188 226309 35291 -185661 70960 -262455 155296 -284632 167649 -205866 -56404
19330a44261j00974I6001e7595A62509A0262b74600h444A72902b19922a3325D7086
$$ -144261 -245235 96001 -57595 162509 10262 -274600 -8444 172902 -219922 -13325 47086
19318a7018M088p2083M375m7849A1594K88810b2672j45503g7475A69652d17719
$$ -17018 -12930 -85013 -80638 -128487 11594 300404 -22672 -168175 -77475 169652 -417719
19306a08719L225j37773q8287A9328L3513d2832k8308j28838B77360j33741d678
$$ -108719 -105494 -243267 -331554 19328 52841 -42832 -71140 -199978 277360 143619 -4678
19294a29491D7989c7745a6028A30269C2011N9285J67066D3592J00481g6801l7836
$$ -129491 47989 -37745 -16028 130269 32011 91296 258362 43592 144073 -76801 -114637
19283a14637j88380a17207d3324B35965a25846L9557E7128B3612J4651J21755
$$ -114637 -303017 -117207 -43324 235965 -125846 -86289 57128 23612 38263 160018
19273A60018F4327J9089b41540I9825O3414b00748B75731h9560b598m36404a82388
$$ 160018 64327 83416 -241540 99825 163239 -200748 275731 -89560 -2598 -439002 -182388
19261e0075p8366C9605g8293n6580r9268h6705j5891r3583D8405R2065R8502F0335
$$ -50075 -128441 39605 -78293 -134873 -234141 -86705 -102596 -196179 48405 140470 238972 60335
19248a65112j10059A2774c08354P7225a7328N023C3191a17730e5141C93689c30750
$$ -165112 -275171 12774 -308354 -231129 -17328 -12305 33191 -117730 -55141 393689 -330750
19236i0573I3217C6735A7568b3802j79534h6917E5360b17535A74569e6720j9336
$$ -90573 93217 36735 17568 -23802 -203336 -86917 55360 -217535 174569 -56720 -76056
19225g6056L6099j78068K5328G7272C4812b0621B4139f0483A87975a94373c7452
$$ -76056 -39957 -218025 -192697 77272 34812 -20621 24139 -60483 187975 -194373 -37452
19213E7825b95091P3569A32838h7279A20796m353e0235B24821i4336q7084B87692
$$ 57825 -295091 -221522 132838 -87279 120796 116443 -50235 224821 -94336 -181420 287692
19201D8774I672a00026c6648A376L64896a94575j16209L7586F1046J89122h1929
$$ 48774 9672 -100026 -36648 1376 366272 -194575 -310784 -273198 61046 250168 -81929
19189a13967H3219a2918o6371k00125M9734B19806a17974j14781b5228I4679b30092
$$ -113967 83219 -12918 -79289 -279414 -229680 219806 -117974 -232755 -25228 94679 -230092
19177d22569a60512n4713A560a58837d3526I1521J24742a14580A5218a09382l54953
$$ -422569 -160512 -215225 1560 -158837 -43526 91521 216263 -114580 15218 -109382 -464335
19166d64335i1936j80162l0469b6147I1056c96884a15714A16406a50867k51963
$$ -464335 -91936 -272098 -302567 -26147 91056 -396884 -115714 116406 -150867 -402830
19156d02830B5977J42936J3766c10822d9324E742N5378n625N2953a33908F8327
$$ -402830 25977 168913 182679 -310822 -49324 5742 61120 55495 108448 -133908 68327
19144a77613J514F6852a43466j24259B9789J01409b52535P8925B54056d12056
$$ -177613 -176099 66852 -143466 -267725 29789 131198 -252535 -173610 254056 -412056
19133e5158r3385F1466f4103l00207E7116b62905k19830d5238B402J4445O9603
$$ -55158 -148543 61466 -64103 -364310 57116 -262905 -482735 -45238 2402 16847 86450
19122H6450J50243k6489b3290l7361K5112a5332j62435K3608j42921O2328c6680
$$ 86450 236693 210204 -23290 -60651 -35539 -15332 -177767 -154159 -297080 -234752 -36680
19110a37710A84591G4791h1001a8324I5559a94862j5470j92178I6500a77900H6737
$$ -137710 184591 74791 -81001 -18324 95559 -194862 -210332 -402510 96500 -177900 86737
19098A53277c97434E8770b94437j01476a45551j07229j60830d8776j47237C3860
$$ 153277 -397434 58770 -294437 -395913 -145551 -252780 -413610 -48776 -196013 33860
19087a94497l1095R9037c5603n8308A06574b58021C9272J67718a62599k3142a1946
$$ -194497 -225592 -126555 -35603 -93911 106574 -258021 39272 206990 -162599 -185741 -11946
19075b8718J246m01120g1551B0676g6459B1115b37329A54406J1190d4828A88955
$$ -28718 -27472 -428592 -71551 20676 -76459 21115 -237329 154406 165596 -44828 188955
19063E0886L9146b77559J12820j62742a00140e787B68083o2475c7576G773d2539
$$ 50886 90032 -277559 -164739 -327481 -100140 -5787 268083 205608 -37576 7773 -42539
19051g9331k04333k1976B09145E3524d08089A14746l1995J8295d9514H6902d8700
$$ -79331 -283664 -305640 209145 53524 -408089 114746 82751 101046 -49514 86902 -48700
19039c76824M7360A65399c16739E3642d1015n4131K0091j57756j37730I9268i2558
$$ -376824 -329464 165399 -316739 53642 -41015 -95146 -75055 -232811 -370541 99268 -92558
19027A71118J73384b17209A42032a68933r7991O6094c0983a351k09122f6846P719
$$ 171118 344502 -217209 142032 -168933 -266924 -200830 -30983 -1351 -210473 -66846 -59127
19016e9127k09216D8052b82755A35882b4998j46441N8723A72484D2137a99310
$$ -59127 -268343 48052 -282755 135882 -24998 -171439 -112716 172484 42137 -199310
19005d177G5527M6751b03882B18629J83827a55152B14070a3543C55187a49881
$$ -4177 75527 122278 -203882 218629 402456 -155152 214070 -13543 355187 -149881
18994C24995b13641A51407d0710B19967l168a27975A114a18008B00438C43a79322
$$ 324995 -213641 151407 -40710 219967 216799 -127975 1114 -118008 200438 343 -179322
18982a64373r7067f022B51911d67299b14071N7107A06024F015c9801m6640E3955
$$ -164373 -261440 -6022 251911 -467299 -214071 -156964 106024 6015 -39801 -86441 53955
18970h7551E8295k5321J15618a92562d6794A51545n9195L4357M79942D7801Q6645
$$ -87551 58295 32974 148592 -192562 -46794 151545 92350 126707 606649 47801 134446
18959A34446b70497E4728L133k6695q841b42633A90608I2299a22783r4767j05826
$$ 134446 -270497 54728 57861 31166 22325 -242633 190608 92299 -122783 -217550 -323376
18948c23376A0388J78027I907J2774J09833h7234D5506b26749C7850a41320L4938
$$ -323376 10388 188415 9907 22681 132514 -87234 45506 -226749 37850 -141320 -106382
18937a06382l4473A06602d5875j94340B02307f7270o4640N7252k38630a08224
$$ -106382 -140855 106602 -45875 -240215 202307 -67270 -131910 -74658 -313288 -108224
18926i2612j30956r2658I0543l3982g5259E603K6946l775a14804k32630h0227
$$ -92612 -223568 -316226 90543 56561 -75259 5603 32549 28774 -114804 -347434 -80227
18914a02739l2258B36045b70476i4053J855p3278G3662a33967A44283b89833a16542
$$ -102739 -134997 236045 -270476 -94053 -92198 -165476 73662 -133967 144283 -289833 -116542
18902g2411F2405K18275K09250F3005B0906L19752G6287h2575j54981g2923k736
$$ -72411 62405 280680 489930 63005 20906 340658 76287 -82575 -237556 -72923 -75659
18891g5659f519A61636e007j11378n318A03592c18727B23199E9939a17263J7304
$$ -75659 -6519 161636 -5007 -116385 -121703 103592 -318727 223199 59939 -117263 -99959
18880i9959j01291P4668H7624b40153A44785g3650A54585a72268I3573M5191m035
$$ -99959 -201250 -126582 87624 -240153 144785 -73650 154585 -172268 93573 138764 134729
18869A34729c8857C5315J22775k797b69097M6438A79919p6727K38465A13899g6492
$$ 134729 -38857 35315 158090 155293 -269097 -222659 179919 103192 341657 113899 -76492
18857A10088k5419e2350b0264j05459b9331A00385f8316k54525e15C01174a38716
$$ 110088 84669 -52350 -20264 -125723 -29331 100385 -68316 -322841 -515 301174 -138716
18845B02419F0248Q8777l1182J07158b97230B83962e1367l7584B43093b984k81075
$$ 202419 60248 149025 117843 225001 -297230 283962 -51367 -88951 243093 -2984 -284059
18834b84059i4845H2011h4545b5256A64417f1241j46876M5849C1272J57273K8080
$$ -284059 -94845 82011 -84545 -25256 164417 -61241 -208117 -162268 31272 188545 216625
18823B16625b01385A86360M8848I1330b53954A06461E2221D325R6319A1370L3078
$$ 216625 -201385 186360 235208 91330 -253954 106461 52221 4325 100644 11370 44448
18812D4448b7944m0996G6729O3135f7282H3984m1632J12990a64642H5184a01785
$$ 44448 -27944 -68940 76729 139864 -67282 83984 42352 155342 -164642 85184 -101785
18800A1762d33737I5830H756N4526J6511j6112g4070A3704a83599L5600A42646
$$ 11762 -433737 95830 8756 63282 79793 63681 -74070 13704 -183599 -147999 142646
18788C67218c6403l55029B35975a28422B16685a5774l01342a35791k2454j9503
$$ 367218 -36403 -391432 235975 -128422 216685 -15774 -317116 -135791 -158245 -177748
18778a77748F090O3340C3589a40771k9184k05787J44337A37743E6070N3107b75893
$$ -177748 6090 69430 33589 -140771 -169955 -375742 -231405 137743 56070 109177 -275893
18766A2041a58941A65788a02249p9135E8251O930g6806j07505A69515d2737A5556
$$ 12041 -158941 165788 -102249 -181384 58251 65181 -76806 -184311 169515 -42737 15556
18754c2196A67597n9802f0829B11257m8542i0199j00959j9244H6674a42260i346
$$ -32196 167597 107795 -60829 211257 162715 -90199 -191158 -210402 86674 -142260 -9346
18742B91148D5856c10277a32415A25567E5523A9484P9086k5997B090J62664e7962
$$ 291148 45856 -310277 -132415 125567 55523 19484 98570 72573 2090 164754 -57962
18730a97382A78777f4108E7792P788b44930B64916F2492i1719J9758C5875c0354
$$ -197382 178777 -64108 57792 65580 -244930 264916 62492 -91719 -71961 35875 -30354
18718h3151J0492H2778e5365p6762r951q0996A6236b07528b2003p6864k40017
$$ -83151 -72659 82778 -55365 -132127 -142078 -223074 16236 -207528 -22003 -98867 -338884
18707c38884f4293g184A80335h2561b8338B40232a70262M7221m2717D5243B2245
$$ -338884 -64293 -7184 180335 -82561 -28338 240232 -170262 -123041 -165758 45243 22245
18695E258d33591P200B2876i516k7192B8799g7902A22629C5550j6288h0719j12899
$$ 5258 -433591 -426391 22876 -9516 -36708 28799 -77902 122629 35550 19262 -80719 -193618
18683a93618A10728I099b03396j9056G0951a83938O3321C2764L3949e2651k57275
$$ -193618 110728 9099 -203396 -222452 70951 -183938 -120617 32764 66713 -52651 -309926
18672c09926c7581B42636c16344a31341d5862C8336c96256a07095k34117B19680
$$ -309926 -37581 242636 -316344 -131341 -45862 38336 -396256 -107095 -341212 219680
18661c17790A58041d5409B19252a9835j32771O3200K5576j97988B9378J75228
$$ -317790 158041 -45409 219252 -19835 -152606 -89406 -63830 -261818 29378 204606
18651B04606A9705e4598k94696P910c496B93862c15704e7838l07380B04934a18724
$$ 204606 19705 -54598 -349294 -341384 -3496 293862 -315704 -57838 -365218 204934 -118724
18639b24811A68906c54973F4255c48665a22079b9446F0132j6751b4305B0439J08439
$$ -224811 168906 -354973 64255 -348665 -122079 -29446 60132 43381 -24305 20439 128878
18628A28878b7810j78526p3375b3799o9931B9063g8358n149K0436B2374R2695
$$ 128878 -27810 -206336 -279711 -23799 -93730 29063 -78358 -83507 -63071 22374 115069
18617A15069D4542L0764a69477E8680J36239a51698j2661k0924J3390C0129b74609
$$ 115069 44542 75306 -169477 58680 194919 -151698 -164359 -185283 -171893 30129 -274609
18605A5372f4779k11425f5716E8504Q2933C6766f3535j74375J11807i016j87446
$$ 15372 -64779 -276204 -65716 58504 141437 36766 -63535 -237910 -126103 -9016 -196462
18594a96462B70697A040J75107n416A5836a20691F5048b42548d7233C1815c38867
$$ -196462 270697 1040 176147 170731 15836 -120691 65048 -242548 -47233 31815 -338867
18582E9261K28469a85446I1608G169a52630c901j24412c9274n4100b5730C581
$$ 59261 287730 -185446 91608 7169 -152630 -3901 -128313 -39274 -93374 -25730 3581
18570A94452c60997A23460q045c36641a25501M4459B49759j03756g3256F593N0242
$$ 194452 -360997 123460 115415 -336641 -125501 -81042 249759 146003 -73256 6593 56835
18559E6835b331G8936g6421o5210F0156d2157k34393A28888a48596P0453j92756
$$ 56835 -2331 78936 -76421 -141631 60156 -42157 -276550 128888 -148596 -78143 -270899
18548b70899P03J04383j09822Q1451C40025D7544f16813b12950m0633J15826I0879
$$ -270899 -270196 -165813 -275635 -194184 340025 47544 -616813 -212950 -253583 -137757 90879
18536a7069O445I6524g0046I1333c31707a5340o9504k17989i5565B50323d4911
$$ -17069 -10624 96524 -70046 91333 -331707 -15340 -84844 -302833 -95565 250323 -44911
18524a7568M961j31738m2721l9946H7786J2366b18521J2917e4440A06762a04871
$$ -17568 -12607 -144345 -187066 -227012 87786 100152 -218521 -205604 -54440 106762 -104871
18512a98412B75038D5a4590m6538A79363b7225k28912i4878l1591d7981H1490
$$ -198412 275038 45 -14590 -61128 179363 -27225 -256137 -94878 -126469 -47981 81490
18500A38016d3581m2828B45919a84048l2979a3751H6749m1710P977J31799n0446
$$ 138016 -43581 -86409 245919 -184048 -217027 -13751 86749 45039 53016 184815 134369
18489A34369L5384c28124l0976G068P4724J00045f2594j10354B30883a58337I8958
$$ 134369 169753 -328124 -359100 7068 81792 181837 -62594 -172948 230883 -158337 98958
18477d7311O757A80018n5492p521c32161B30731g8110m7182c078B56308a29389
$$ -47311 -40554 180018 124526 117005 -332161 230731 -78110 -125292 -3078 256308 -129389
18465a4079H8207h0521c6377A17135C1184l699a79040A82343E9361d8169q4244
$$ -14079 88207 -80521 -36377 117135 31184 27485 -179040 182343 59361 -48169 -132413
18454a32413N7450H2251O4029B6216b33892C16076J339a5738k10629e0950A88411
$$ -132413 -74963 82251 146280 26216 -233892 316076 317415 -15738 -226367 -50950 188411
18442A08456N4433m491B3902a22938g127k19800N6936A26544A9942Q4850B426
$$ 108456 162889 158398 23902 -122938 -7127 -226927 -169991 126544 19942 104792 2426
18430e6221A07822f3980o305B0315Q073a15070B04797N4863h3523k08592a36878
$$ -56221 107822 -63980 -70285 20315 28388 -115070 204797 259660 -83523 -292115 -136878
18418d6180B19554E4851h5095k80863a64195J8921o3171j70215a10135G7255a5409
$$ -46180 219554 54851 -85095 -365958 -164195 -145274 -208445 -378660 -110135 77255 -15409
18406a69475j4944G3210k0702J06104c50633A335J05086b06144C2144b61269Q4151
$$ -169475 -184419 73210 52508 158612 -350633 1335 106421 -206144 32144 -261269 -177118
18395a77118d8121l20164c6426A3804b30595k4356H734P5067a39176G8478g5034
$$ -177118 -48121 -368285 -36426 13804 -230595 -254951 8734 83801 -139176 78478 -75034
18383D8616L9701j9648k627a73437c9521a232I5082l3344J2046k1862P8804a32962
$$ 48616 88317 68669 66042 -173437 -39521 -1232 95082 61738 73784 51922 130726 -132962
18370d0086m00404D034a75744B63892d41963a10120j52722B66003l3573o5124
$$ -40086 -440490 4034 -175744 263892 -441963 -110120 -262842 266003 232430 167306
18360A67306B3882L9718i5614c3620o0589P607L4643k04161e7071A26450a77642
$$ 167306 23882 63600 -95614 -33620 -94209 -86602 -51959 -256120 -57071 126450 -177642
18348b14060j5989d0418j02163O5624o3943e8675J5748r1639b7051j35834A5450
$$ -214060 -230049 -40418 -142581 -76957 -140900 -58675 -42927 -134566 -27051 -162885 15450
18336a68939a7200A85817n9804b48671E4124a69513g2351Q292A63214l2247b31466
$$ -168939 -17200 185817 126013 -248671 54124 -169513 -72351 -64059 163214 130967 -231466
18324i5727j63300c2331A36561c1135j88665j6748d472l9815A55434C930a09620
$$ -95727 -259027 -32331 136561 -31135 -219800 -236548 -4472 -44287 155434 3930 -109620
18312B0181c35733j40887A59808L7037g2460j4928j71564e5201p9884k6695B92546
$$ 20181 -335733 -476620 159808 196845 -72460 -87388 -258952 -55201 -135085 -161780 292546
18300F4566i2642j02813f8834j03512k5319a6112j31534B19590L1599a27166N4015
$$ 64566 -92642 -195455 -68834 -172346 -197665 -16112 -147646 219590 251189 -127166 -73151
18289g3151j05179A56712a43799K2365J4100A24522b71206A71439a20933A22378
$$ -73151 -178330 156712 -143799 -121434 -107334 124522 -271206 171439 -120933 122378
18278a66740F252L30787E3900a79887O6168C9486L9492d4920B34878n2119a95359
$$ -166740 6252 337039 53900 -179887 -113719 39486 78978 -44920 234878 182759 -195359
18266a02165q656K258A37805f8861A69987J50233A00589C5440M47509I2006R5445
$$ -102165 -110821 -108563 137805 -68861 169987 320220 100589 35440 482949 92006 187451
18255A87451b37235c3310D2070a01851k00950J03012B73389G4951f2436k05208
$$ 187451 -237235 -33310 42070 -101851 -302801 -199789 273389 74951 -62436 -267644
18245b67644A14581a14767B03642a70648g9335B9086c3632I6970P7139a85430
$$ -267644 114581 -114767 203642 -170648 -79335 29086 -33632 96970 174109 -185430
18234a31967M9174l1921l35970B71441e3096A9648c0574C4191a30839A85339a60528
$$ -131967 -82793 -114714 -450684 271441 -53096 19648 -30574 34191 -130839 185339 -160528
18222A75006a18562D8481b11242F58O5838c2028G0570J95629A09735J21779k4558
$$ 175006 -118562 48481 -211242 658 66496 -32028 70570 266199 109735 231514 206956
18211B06956I3124k2616a05113B03032c14861H6106K6267a84437B792a07499F4996
$$ 206956 93124 70508 -105113 203032 -314861 86106 112373 -184437 2792 -107499 64996
18199h699p4690L7591J865B2696d2832A53592b39735k3465F6724O701J1978b06364
$$ -8699 -83389 -45798 -43933 22696 -42832 153592 -239735 -263200 66724 73425 85403 -206364
18186A95779C5135M7887B1408J02355c3112k66338E6240k6055b9571a2784j65909
$$ 195779 35135 83022 21408 123763 -33112 -299450 56240 30185 -29571 -12784 -178693
18175a78693B36695A14188J02621a034k53439A98527L7591n9225h408k35471a3108
$$ -178693 236695 114188 216809 -1034 -254473 198527 236118 176893 -8408 -243879 -13108
18163b46991A99164a71817j40290M4518i8722B26613g7819p0836q000k0480B00345
$$ -246991 199164 -171817 -312107 -267589 -98722 226613 -77819 -148655 -156655 -177135 200345
18151D4200a87698b0747j33344j56961f8700j64293p5095A20007a43130q345B2369
$$ 44200 -187698 -20747 -154091 -311052 -68700 -232993 -308088 120007 -143130 -151475 22369
18139b30528D44105G8849N4133B880L15721g1909L4697B34659c9827r3960B08856
$$ -230528 444105 78849 132982 2880 318601 -71909 -37212 234659 -39827 -133787 208856
18127h2949n859B4366K73396i4513j49466B41633C7029c01503g4276M489A33001
$$ -82949 -88808 24366 297762 -94513 -243979 241633 37029 -301503 -74276 -69787 133001
18115C44404G61i790j12097B04136a6718D30772A54389a17452a3040r890A84852
$$ 344404 761 -9790 -121887 204136 -16718 430772 154389 -117452 -13040 -22930 184852
18103b42458B23052I9832C845L2000J42918o2881b15065i0691N611c1126a2039
$$ -242458 223052 99832 3845 35845 178763 115882 -215065 -90691 -85080 -31126 -12039
18091g4216n7801c1277m5205A73774B4381d31467A04694a44926F1997k3724K28986
$$ -74216 -132017 -31277 -76482 173774 24381 -431467 104694 -144926 61997 38273 267259
18080B67259d2224j23795B9266K28554h2098p0434L1450B25884g8160G6386J5486
$$ 267259 -42224 -166019 29266 257820 -82098 -152532 -121082 225884 -78160 76386 91872
18069I1872b15268G0853e001I6351a24520H1601a19936J4597J5935I5756D7134
$$ 91872 -215268 70853 -5001 96351 -124520 81601 -119936 -105339 -89404 95756 47134
18057C70135a86530K1066m1983k06935i6476j17820J06931b8952p2689b8936G2051
$$ 370135 -186530 -165464 -207447 -414382 -96476 -214296 -107365 -28952 -101641 -28936 72051
18045A22098L2408J41164b9985m4615C5336J81602b27250h4962o8452B4232a45682
$$ 122098 154506 295670 -29985 -74600 35336 216938 -227250 -84962 -153414 24232 -145682
18033A0512h1279B0148g5534C5677k104a91802B48764K13131D7049K9674A0177
$$ 10512 -81279 20148 -75534 35677 33573 -191802 248764 461895 47049 76723 10177
18021a02510I0049N7784R1113d23673g1687j17815Q2952C83795h5806B27247p9089
$$ -102510 90049 147833 238946 -423673 -71687 -189502 -106550 383795 -85806 227247 148158
18010A48158b75183A70803k9897D8965J8955a03856a8503B54293J0860A306a76396
$$ 148158 -275183 170803 140906 48965 67920 -103856 -18503 254293 265153 1306 -176396
17998a87441f0252I3759K01624j32226C4097J29256o1301d4363C49915a58103
$$ -187441 -60252 93759 295383 163157 34097 163353 102052 -44363 349915 -158103
17987F0820N6775j0579D0344J55435a01211G3148f6788r9363j56842B70216L8945
$$ 60820 117595 107016 40344 195779 -101211 73148 -66788 -166151 -322993 270216 309161
17976C09161a5646B84977o4396o7547c42242I229N1654a4642r7410B42890A00893
$$ 309161 -15646 284977 220581 153034 -342242 9229 60883 -14642 -112052 242890 100893
17964a59740e9137p2891H1802K85477a21260d4614A99939p867a82467F2051M5331
$$ -159740 -59137 -132028 81802 367279 -121260 -44614 199939 192072 -182467 62051 107382
17953A07382P7015G1416K73103G9152G063J06029b37771f1336k7982K6475j7051
$$ 107382 184397 71416 344519 79152 7063 113092 -237771 -61336 -89318 -62843 -79894
17942g9894A04220Q6074E0615O1341c10511A13465N7253a38069B25054d4932B0910
$$ -79894 104220 190294 50615 111956 -310511 113465 170718 -138069 225054 -44932 20910
17930b57447B13502h8036j39831B03062b5980k0776B19995J99914h6140C54279
$$ -257447 213502 -88036 -227867 203062 -25980 -46756 219995 419909 -86140 354279
17919a65848d1988A43310d24353g2485E2875R498d1270k6354n7261e8123B08018
$$ -165848 -41988 143310 -424353 -72485 52875 62373 -41270 -67624 -124885 -58123 208018
17907a74891E7231J06894n8322K63128H8227a0918A26245K43556A5454N7424K09419
$$ -174891 57231 164125 105803 368931 88227 -10918 126245 369801 15454 72878 282297
17896B82297P9008j58509I0223C1296J15555Q2376e9809j87112B45723F4359a87437
$$ 282297 361305 202796 90223 31296 146851 229227 -59809 -246921 245723 64359 -187437
17884A01109B39J42585A4050b60075K8652C29483j25944r7819D623R3631l2612
$$ 101109 239 142824 14050 -260075 -231423 329483 203539 105720 4623 98254 65642
17873F5642h5878I775L73473A26990J07630R077e0854B50647i5948k10638C13604
$$ 65642 -85878 9775 383248 126990 234620 243697 -50854 250647 -95948 -306586 313604
17861a92332A89007c20875B28862a27937d5611j65664l9023E21458H7195l2922
$$ -192332 189007 -320875 228862 -127937 -45611 -211275 -250298 521458 87195 54273
17851E4273L6856f1802a4410A53873b16528B42189A7051B978c12132D9460c69528
$$ 54273 91129 -61802 -14410 153873 -216528 242189 17051 2978 -312132 49460 -369528
17839A17518R7726a35498A66067B6238J31968G3126J26644J32508I6139O1672
$$ 117518 215244 -135498 166067 26238 158206 73126 199770 332278 96139 157811
17829A57811n7760B3432b34689A39345d23133B2631R0289N2738k4079D7856J05077
$$ 157811 100051 23432 -234689 139345 -423133 22631 112920 165658 141579 47856 152933
17818A52933m7794J97523C8578a84203A55495j1565K46251A70588q0761g7091
$$ 152933 105139 302662 38578 -184203 155495 143930 390181 170588 89827 -77091
17807B90533a00288C29653q77b8505C5799K86729H7113l7219d3247A48354f5599
$$ 290533 -100288 329653 328776 -28505 35799 322528 87113 49894 -43247 148354 -65599
17795I7481A1854K173b8858p8504A19378O3255P8009g5646B13134d0632l341A65345
$$ 97481 11854 14027 -28858 -107362 119378 182633 260642 -75646 213134 -40632 -43973 165345
17782g5732B95229B4763P2294J41145r6083a54799B00745i649A23211m3831N3249
$$ -75732 295229 24763 97057 238202 142119 -154799 200745 -9649 123211 79380 132629
17771A32629Q3793G7627M733J20157f0892E10648b92271F0191O3340J55789c7658
$$ 132629 216422 77627 82360 202517 -60892 510648 -292271 60191 123531 279320 -37658
17759a86526N0861m8953B99129j32839B2985e9447k62532G3821b1031A949L23918
$$ -186526 -135665 -184618 299129 166290 22985 -59447 -321979 73821 -21031 1949 325867
17748C25867g9584p5614D2911j8141J41212N2872G8593N1891N2823J09326b61694
$$ 325867 -79584 -155198 42911 24770 165982 218854 78593 130484 183307 292633 -261694
17736B64962e9917A52064J66696f42A18481b09528e9028j88106L584f0254q4186
$$ 264962 -59917 152064 318760 -642 118481 -209528 -59028 -247134 -243550 -60254 -144440
17725a44440C13411E0222a007A41871a37166B96651f9587A58296b83243a03434
$$ -144440 313411 50222 -1007 141871 -137166 296651 -69587 158296 -283243 -103434
17714B29743n7803d8457A12632J47583f5898E1711N6093g8052A03592c2128j54364
$$ 229743 171940 -48457 112632 260215 -65898 51711 107804 -78052 103592 -32128 -186492
17703a86492g3344B79458J60005A65866q0406f48j18806b883A71787l3309C7244
$$ -186492 -73344 279458 439463 165866 85460 -648 -119454 -2883 171787 138478 37244
17691B35975E4292J2590K6432b63809F0455g9014K157b3285I7621k1173R8478
$$ 235975 54292 66882 93314 -263809 60455 -79014 -76857 -23285 97621 76448 174926
17680A74926a11527D9566K33192D4911e2936A25630k2614a9039C0530J41217l0729
$$ 174926 -111527 49566 282758 44911 -52936 125630 103016 -19039 30530 171747 141018
17669A41018e5092A26629a27636B1305K2114P4303K91111F3029P5198B0547J56186
$$ 141018 -55092 126629 -127636 21305 43419 117722 408833 63029 138227 20547 176733
17658A76733C5845h8237A63761a34794c1663A7587K35407n1894P3273q1142o6625
$$ 176733 35845 -88237 163761 -134794 -31663 17587 252994 201100 274373 193231 126606
17647A26606g8411B87724d9851C26669d0671l035i759A31067a96023A517g7913
$$ 126606 -78411 287724 -49851 326669 -40671 -43706 -9759 131067 -196023 1517 -77913
17635c77207C30892a37506D61805A1054a50343A42127E3626M4423N0472l7416
$$ -377207 330892 -137506 461805 11054 -150343 142127 53626 98049 148521 111105
17625A11105K25366n6249b9512B51493A19296J84459K4353k0526j18740J34966
$$ 111105 336471 280222 -29512 251493 119296 303755 328108 307582 188842 323808
17615C23808a15095D02029C1493K27813b5661B19291a1959A30540K63479C0188
$$ 323808 -115095 402029 31493 259306 -25661 219291 -11959 130540 394019 30188
17604b3858B15044b0392j04697B87612j14365o3152P55k1796K51989i2349B33136
$$ -23858 215044 -20392 -125089 287612 173247 110095 110850 89054 341043 -92349 233136
17592C57498j43323K4155I659b1497B72278F0203a78195G5378l1373b27756e6397
$$ 357498 214175 238330 9659 -21497 272278 60203 -178195 75378 44005 -227756 -56397
17580C94053j46474j14179p586J03826j02690a19023C22226N0195A67665Q717
$$ 394053 247579 133400 125814 229640 126950 -119023 322226 372421 167665 176382
17570A76382j5038A5263K05920C1816J10157o1604N0229b40150B85287h0640c4362
$$ 176382 161344 15263 221183 31816 141973 80369 130598 -240150 285287 -80640 -34362
17558G7442b7155B1121J5802q756R624d281E13697D3588i0490C28038a38912D97237
$$ 77442 -27155 21121 36923 28167 37791 -4281 513697 43588 -90490 328038 -138912 497237
17545b59146B39173a48157B40316j17844J5768L8985F0176b65562E7233J27499
$$ -259146 239173 -148157 240316 122472 138240 177225 60176 -265562 57233 184732
17535A84732J34963j39196K38758C2947a24928B56823J22794A08648K1129R6740
$$ 184732 319695 180499 419257 32947 -124928 256823 379617 108648 129777 226517
17525B26517R9106M5399O622k1376L24477l29546n4092j31714K98945A79486K07469
$$ 226517 325623 371022 377644 356268 680745 351199 297107 165393 464338 179486 386955
17514C86955o7229j40830P2631b65438A24795Q2519j2374J68413j18330J70546
$$ 386955 319726 178896 251527 -265438 124795 207314 194940 363353 245023 415569
17504D15569j44765M24981l09488j37382A16172j8998N5849r632a49817D97163
$$ 415569 270804 695785 386297 248915 116172 97174 153023 143391 -149817 497163
17493B58712r6095K06116j84309J44412k1910p3459K20226B8315P8301M46775
$$ 258712 162617 368733 184424 328836 306926 233467 453693 28315 106616 553391
17483E53391B15368A9507O6814J67809K11502B26380o6717J87293J69753B34990
$$ 553391 215368 19507 86321 254130 465632 226380 159663 346956 516709 234990
17472D13244A73805J11118A29458J96832K91478a3201B29311k135J3479g7051
$$ 413244 173805 284923 129458 326290 617768 -13201 229311 227176 240655 -77051
17461A30124J25550P195J82559A67642L9120j8039j1080J64813K9182j10391Q7890
$$ 130124 255674 262869 445428 167642 206762 188723 177643 342456 371638 261247 349137
17450C49137Q3523N9282j22676j7641A44295k727J91778J7302r5682Q1169A06867
$$ 349137 432660 491942 369266 351625 144295 141568 333346 350648 254966 336135 106867
17438A54973K19674J71216B26442J12715P561j40902J33473K8064r0905K7435
$$ 154973 374647 545863 226442 339157 346718 205816 339289 367353 276448 303883
17428C03883J629r8496L20989I7338K14738G117K41087D8926J05303L41651j7190
$$ 303883 305512 207016 528005 97338 312076 7117 248204 48926 154229 495880 478690
17417D78690k38678J69363o1782o9746l0970G4567L44812j52907J9141F9267J46410
$$ 478690 240012 409375 347593 277847 246877 74567 419379 266472 285613 69267 215677
17406B15677D6449M67623A93062C9949a1808E6658i7063A5203K62739J08320m8427
$$ 215677 46449 514072 193062 39949 -11808 56658 -97063 15203 277942 386262 337835
17395C37835j61345l3770J68169J07043j82632P6486J64999A65135P5431I9005
$$ 337835 176490 142720 310889 417932 235300 311786 476785 165135 240566 99005
17384C52813j11967I3235L10691j64255j8834M4429i1385c085B34498L0042J3558
$$ 352813 240846 93235 403926 239671 220837 265266 -91385 -3085 234498 264540 278098
17373B78098N3103A57162b2936D19549M0837h89D82296J89984A72848K38374A51023
$$ 278098 331201 157162 -22936 419549 460386 -889 482296 672280 172848 411222 151023
17361B3930L18762A22807g9207C38999I5597L87293A10120K28035K1031N2606
$$ 23930 342692 122807 -79207 338999 95597 482890 110120 338155 359186 411792
17351D11792j35885k3453G2780N36527A55644D0567M57040k43677A18539K48094
$$ 411792 275907 252454 72780 609307 155644 40567 497607 253930 118539 366633
17341C66633j07554J87309k16045j13145K09941o263b00619E3376F365O20580
$$ 366633 259079 446388 230343 117198 327139 320876 -200619 53376 6365 626945
17331F26945k07891A83962J76742A8204J48911L36682j73886m7198J68273m1550
$$ 626945 419054 183962 360704 18204 167115 503797 329911 282713 450986 409436
17321D09436J6739D2902J24910N0745K80059R2503A77392n9731N87870j11217
$$ 409436 426175 42902 167812 218557 498616 591119 177392 117661 705531 594314
17311E94314n7430B59047J33740K1670j23410J10003o5142O1492A86140J97657
$$ 594314 536884 259047 392787 414457 291047 401050 335908 397400 186140 383797
17301C83797J5454d3753D32215J06566A89185Q5588J26257J07053r5590j98581
$$ 383797 399251 -43753 432215 538781 189185 274773 401030 508083 412493 213912
17291B13912J16961J12359J16950k39407J68824A64862J28227I4943K33852P689
$$ 213912 330873 443232 560182 320775 489599 164862 293089 94943 328795 336484
17281C36484J66504j46778K03778P9334k45142a01725D63644j83159J55431I8595
$$ 336484 502988 356210 559988 639322 394180 -101725 463644 280485 435916 98595
17270C13425M0654M8186k9675Q4743J4146A69199L39235o9012o3246J03262D5135
$$ 313425 354079 402265 372590 457333 471479 169199 508434 439422 376176 479438 45135
17258E97085R4442k08761K11027l33778E8483J41369M3754K72375o2006R2086
$$ 597085 691527 482766 693793 360015 58483 199852 243606 515981 453975 546061
17248E46061q561J49947B88418K58172B43923J94112r7782J18810N6328p8856
$$ 546061 537500 687447 288418 546590 243923 438035 340253 459063 515391 436535
17238D36535J07610j66211J74682j60346N2178Q1043j88770J69416K62193j89017
$$ 436535 544145 377934 552616 392270 444448 525491 336721 506137 768330 579313
17228E79313B66705K45673N8314j16490A28592K11557J43221q8071N0898j21301
$$ 579313 266705 512378 570692 454202 128592 340149 483370 395299 446197 324896
17218C24896J23768A48782N12988C17377K86147n9647j81421E7129O4379L12406
$$ 324896 448664 148782 661770 317377 603524 543877 362456 57129 121508 433914
17208D33914j14550K28296C5423M44534k0486K1452A68798N17857J10996l12326
$$ 433914 319364 547660 35423 479957 459471 480923 168798 686655 797651 485325
17198D85325j1833r3999K30228q0499M0067j94310K61245l04074J81999n9183
$$ 485325 473492 379493 609721 529222 569289 374979 636224 332150 514149 454966
17188D54966j6501J37443j31227J15612j92449R8399A34541K62526J12192J00981
$$ 454966 438465 575908 444681 560293 367844 466243 134541 397067 509259 610240
17178F10240r3024K32580o7201R789j11623k64401J21375M2447j14875L5886L51948
$$ 610240 517216 749796 682595 692384 580761 316360 437735 480182 365307 401193 753141
17167G53141L1716j65477j32352J84233C35534L89141k00331J97131Q0409j69045
$$ 753141 784857 619380 487028 671261 335534 724675 524344 721475 801884 632839
17157F32839K53188l59584K19400q4031j81383P0369K08120l8595J41775C27867
$$ 632839 886027 526443 745843 661812 480429 550798 758918 720323 862098 327867
17146H55568j71474l2991N5295K43253k36739B69304N29665l4644n3370j33585
$$ 855568 684094 651103 706398 949651 712912 269304 798969 764325 710955 577370
17136E77370l8784O0060K74794K08382n4507j64459P0093D59675L64423j54826
$$ 577370 538586 598646 873440 1081822 1027315 862856 932949 459675 824098 669272
17126F69272J38776j94512K86607j87682R3580K395j11673R3370K04229m56128
$$ 669272 808048 613536 900143 712461 806041 808436 696763 790133 994362 538234
17116E38234K83876j60590J56340j73613L81710o9312l07318J41252r6065P6916
$$ 538234 822110 661520 817860 644247 1025957 956645 649327 790579 694514 771430
17106G71430j43725J04425J65825j19632j05939n4748J23362M11254m39367P3230
$$ 771430 627705 732130 897955 778323 672384 617636 740998 1152252 712885 786115
17096G86115J84585P3465K94070k71022k14707r6320R4295j93379L77042J25823
$$ 786115 970700 1044165 1338235 1067213 852506 756186 850481 657102 1034144 1159967
17086A159967k09268J33346n173j40438k74223L97084j07564l69599L34252K7191
$$ 1159967 950699 1084045 1078872 938434 664211 1061295 953731 584132 918384 945575
17076I45575j14412J85516k9751J93706J85468j53091j09086l4333J6098j82555
$$ 945575 831163 1016679 986928 1180634 1366102 1213011 1103925 1069592 1085690 903135
17066I03135J67773M3581J63575l02724K07847l99418K78759J7699K65912j29429
$$ 903135 1070908 1114489 1278064 975340 1183187 783769 1062528 1080227 1346139 1216710
17056A216710j57296J4696j69288K02628K34613j67997K49201k91612j1196L42595
$$ 1216710 1059414 1074110 904822 1107450 1342063 1174066 1423267 1131655 1120459 1463054
17046A463054k14424k50023J53686K88530N4968m94149L68320K11434k92075J48122
$$ 1463054 1248630 998607 1152293 1440823 1495791 1001642 1369962 1581396 1289321 1437443
17036A437443l4098k13469p1136J23333J658J10072K9630l03592L95550J40400
$$ 1437443 1403345 1189876 1118740 1242073 1243731 1353803 1383433 1079841 1475391 1615791
17026A615791j7076l0016j51959M01945n72715P8238K06440j26125J63473J31608
$$ 1615791 1598715 1568699 1416740 1818685 1245970 1324208 1530648 1404523 1567996 1699604
17016A699604k78078J56819O8200k31140M8255J54148L3532j10390l80368L72519
$$ 1699604 1421526 1578345 1646545 1415405 1463660 1617808 1651340 1540950 1160582 1533101
17006A533101L35506k34461J07863k73175L36099k59075L34702k93117L0829R9039
$$ 1533101 1868607 1634146 1742009 1468834 1804933 1545858 1880560 1587443 1618272 1717311
16996A717311K03808k47393L32027m39151J17551R7323K31450j59477P8306K20309
$$ 1717311 1921119 1673726 2005753 1566602 1684153 1781476 2012926 1853449 1931755 2152064
16986B152064l92284R7141L84892k71913Q0912J93276L0704K9232l87646L90893
$$ 2152064 1759780 1856921 2241813 1969900 2050812 2244088 2274792 2304024 1916378 2307271
16976B307271j19711l05356M08490j54475j4668L74263m20092K19002q2251J90564
$$ 2307271 2187560 1882204 2290694 2136219 2121551 2495814 2075722 2294724 2212473 2403037
16966B403037j97098R6327o9590J92046L14893k84548j97509K67810J11834m52898
$$ 2403037 2205939 2302266 2232676 2424722 2739615 2455067 2257558 2525368 2637202 2184304
16956B184304J10871J11697O0863J32734k01537K50027O0971K23910j43836J5736
$$ 2184304 2295175 2406872 2467735 2600469 2398932 2648959 2709930 2933840 2790004 2805740
16946B805740k0921J33788J6466j85251J13907m3023k1723K59335J07353M3928
$$ 2805740 2784819 2918607 2935073 2749822 2863729 2820706 2798983 3058318 3165671 3209599
16936C209599J38430M0776k78256J46766q36J14147j31737m3338J64639J4116
$$ 3209599 3348029 3388805 3110549 3257315 3256479 3370626 3238889 3195551 3360190 3374306
16926C374306J7177J6112J75729k92839J47405l1107L54570J5920K595J48369
$$ 3374306 3391483 3407595 3583324 3290485 3437890 3406783 3761353 3777273 3779868 3928237
16916C928237q9078p8040J35822J35975q1967K83358j78144J79321o9686K51772
$$ 3928237 3839159 3761119 3896941 4032916 3950949 4234307 4056163 4235484 4165798 4417570
16906D417570k22071P114J3534K57916q6193j09348K31786j11185J17627L33636
$$ 4417570 4195499 4202613 4216147 4474063 4387870 4278522 4510308 4399123 4516750 4850386
16896D850386m25575L06648K78908l10468L17845k76639P46379m21390K32371
$$ 4850386 4424811 4731459 5010367 4699899 5017744 4741105 5487484 5066094 5298465
16887E298465M5219K32596L532j36383K02816J34461q2663Q6936R1394p04o7707
$$ 5298465 5343684 5576280 5579812 5443429 5646245 5780706 5698043 5784979 5876373 5875669 5807962
16876E807962P44171k14383K27959M4578l4771O8173k74502P06299n21637N15671
$$ 5807962 6552133 6337750 6565709 6610287 6575516 6643689 6369187 7075486 6553849 7069520
16866G069520j30994K20250L79845O1685m4858L2314R5627k32562O19884l1414
$$ 7069520 6938526 7158776 7538621 7600306 7555448 7587762 7683389 7450827 8070711 8039297
16856H039297J10352j56667M98337q7113K47540L71986l549R1808L51402P1449
$$ 8039297 8149649 7992982 8491319 8404206 8651746 9023732 9020183 9111991 9463393 9534842
16846I534842N5601Q2762N7687K65978K80234K09725q8014L04207J8817M54113
$$ 9534842 9590443 9673205 9730892 9996870 10277104 10486829 10398815 10703022 10721839 11175952
16836A1175952J49804J87989L56248q6395O4427N4457Q09208k0808L84441J29317
$$ 11175952 11325756 11513745 11869993 11783598 11848025 11902482 12711690 12690882 13075323 13204640
16826A3204640K10003N52615Q6108n0356J29164P50637J44930M62553P9205N18437
$$ 13204640 13414643 13967258 14053366 14003010 14132174 14882811 15027741 15490294 15569499 16087936
16816A6087936l5920L79785K06904O08438M01786J43334L15660M65309M21566
$$ 16087936 16052016 16431801 16638705 17247143 17648929 17792263 18107923 18573232 18994798
16807A8994798L18384N54007K84076N14703J94788O15409K26117L52223P44126
$$ 18994798 19313182 19867189 20151265 20665968 20860756 21476165 21702282 22054505 22798631
16798B2798631L74275N28249O61541L84914R25827L01654Q71347L14663N31781
$$ 22798631 23172906 23701155 24362696 24747610 25673437 25975091 26846438 27161101 27692882
16789B7692882P76735N31680P15636N57796P26244Q04703Q23178L88878J209101
$$ 27692882 28469617 29001297 29716933 30274729 31000973 31805676 32628854 33017732 34226833
16780C4226833M93055Q95514O14307P73248J012678R38569R62585Q58355Q67037
$$ 34226833 34719888 35615402 36229709 37002957 38015635 38954204 39916789 40775144 41642181
16771D1642181P38818J192076M06762J618357P47185J063230J292707J052759
$$ 41642181 42380999 43573075 43979837 45598194 46345379 47408609 48701316 49754075
16763D9754075J256734Q67248J179012J005198R44023R80003J545684P41098J598203
$$ 49754075 51010809 51878057 53057069 54062267 55006290 55986293 57531977 58273075 59871278
16754E9871278R36710J087874J011033J170648J178625R16989J143852Q38895
$$ 59871278 60807988 61895862 62906895 64077543 65256168 66173157 67317009 68155904
16746F8155904R16477J148090M53557J067622N51582R20537P20673M79046O99425
$$ 68155904 69072381 70220471 70674028 71741650 72293232 73213769 73934442 74413488 75112913
16737G5112913K66796L96506P24026J88183R4254K91443j22689J38303M3791k54178
$$ 75112913 75379709 75776215 76500241 76688424 76782678 77074121 76951432 77089735 77133526 76879348
16727G6879348j10558n35411m7555m14087p37589n94124n34051o93455p71195
$$ 76879348 76768790 76233379 76185824 75771737 75034148 74440024 73905973 73212518 72441323
16718G2441323r00188k55754j340961o82765q76492j067134o69819j302700p50358
$$ 72441323 71541135 71285381 69944420 69261655 68385163 67318029 66648210 65345510 64595152
16709F4595152j015622r47094j235937j301132q12612j029711j136042p97742
$$ 64595152 63579530 62632436 61396499 60095367 59282755 58253044 57117002 56319260
16701E6319260j287831q41522j089762j270876q25936j068966j155019j090622
$$ 56319260 55031429 54189907 53100145 51829269 51003333 49934367 48779348 47688726
16693D7688726p96737p78867j357261m35765r60611j366415p60125q24702o78417
$$ 47688726 46891989 46113122 44755861 44320096 43359485 41993070 41232945 40408243 39729826
16684C9729826j100871o73993o85769o90988l91936j142323o09638q52860p98002
$$ 39729826 38628955 37954962 37269193 36578205 36186269 35043946 34434308 33581448 32783446
16675C2783446j75900o61108j175336m85936n24314n31436q08652m87321o73677
$$ 32783446 32607546 31946438 30771102 30285166 29760852 29229416 28420764 27933443 27259766
16666B7259766k62362m91350p51835n13733l51760j92980n94922l64923p61791
$$ 27259766 26997404 26506054 25754219 25240486 24888726 24695746 24100824 23735901 22974110
16657B2974110j35333o92663k97495m19841l82540n19529k19432l50840m46220
$$ 22974110 22838777 22146114 21848619 21428778 21046238 20526709 20307277 19956437 19510217
16648A9510217k74650k60690l2819o45640l38685m4661k85321k89984m71690l93315
$$ 19510217 19235567 18974877 18942058 18296418 17957733 17913072 17627751 17337767 16866077 16472762
16638A6472762K05801m66421n43967j59959k22552j98928l44375n8508n04084
$$ 16472762 16678563 16212142 15668175 15508216 15285664 15086736 14742361 14683853 14179769
16629A4179769n6643Q5545n37904n2904m87451Q3926l45837J73791o24537m17334
$$ 14179769 14123126 14208671 13670767 13617863 13130412 13214338 12868501 13042292 12417755 12000421
16619A2000421J41249j9677k8676m5800l36766m89226J11395m49137j86420J13835
$$ 12000421 12141670 12121993 12093317 12047517 11710751 11221525 11332920 10883783 10697363 10811198
16609A0811198k87079j03749k36485Q746K05469j44809n75337L78419l78833j77406
$$ 10811198 10524119 10420370 10183885 10192631 10398100 10253291 9677954 10056373 9677540 9500134
16599I500134r7944l13300J82010k00673l72245K42324k49154r5887J07243m36473
$$ 9500134 9402190 9088890 9270900 9070227 8697982 8940306 8691152 8595265 8702508 8266035
16589H266035J74420j65231k82821J89470m51020q4391M18819m75848j17549p4904
$$ 8266035 8440455 8275224 7992403 8181873 7730853 7646462 8065281 7589433 7471884 7396980
16579G396980P4131p8818k21593l46340N30822m53820K8045j03617m9270J40177
$$ 7396980 7471111 7392293 7170700 6824360 7355182 6901362 6929407 6825790 6776520 6916697
16569F916697k61378j33317m7680J3358k43121M1996k60331J82104j81056j91942
$$ 6916697 6655319 6522002 6474322 6487680 6244559 6286555 6026224 6208328 6027272 5835330
16559E835330K69969k0324l37876o8792Q4838k95340M96871l40788j15415J16127
$$ 5835330 6105299 6084975 5747099 5678307 5763145 5467805 5964676 5623888 5508473 5624600
16549E624600K4524j34633k70608K1861l7987j11446K69169j64055n3475j52963
$$ 5624600 5649124 5514491 5243883 5265744 5227757 5116311 5385480 5221425 5167950 5014987
16539E014987l6713p8372J8500J78370l1551l29028J87908q8741l1880l05757
$$ 5014987 4978274 4899902 4918402 5096772 5065221 4736193 4924101 4835360 4803480 4497723
16529D497723J77164k99995J24724J53683m39731J94804K65077Q1989n14156R607
$$ 4497723 4674887 4374892 4499616 4653299 4213568 4408372 4673449 4755438 4241282 4250889
16519D250889k0031k49423L23321k94915N4614j9847O9044l62571J17204j23196
$$ 4250889 4230858 3981435 4304756 4009841 4064455 4044608 4113652 3751081 3868285 3745089
16509C745089K49383P1937j15002p4827j40105j74636J74274k97389j33722L45413
$$ 3745089 3994472 4066409 3951407 3876580 3736475 3561839 3736113 3438724 3305002 3650415
16499C650415L01646m73364j72963j85899P02808k09487l67546K53955j45886
$$ 3650415 3952061 3478697 3305734 3119835 3822643 3613156 3245610 3499565 3353679
16490C353679J11810k27339Q9029k7845O1604l17254Q3919M4820L43575k65824
$$ 3353679 3465489 3238150 3327179 3299334 3360938 3043684 3127603 3172423 3515998 3250174
16480C250174P0701P7471k18626L70367k64075L1888j72995m3370o6406J84508
$$ 3250174 3320875 3398346 3179720 3550087 3286012 3317900 3144905 3101535 3035129 3219637
16470C219637r5101o4478j22466J8311k23547L43449j98299J31049N7501n19866
$$ 3219637 3124536 3060058 2937592 2955903 2732356 3075805 2877506 3008555 3066056 2546190
16460B546190N6124L43519m24766Q7435j26225K12527j33174N87371o53332J48843
$$ 2546190 2602314 2945833 2521067 2608502 2482277 2694804 2561630 3149001 2495669 2644512
16450B644512J77582q5797l10313j6245K84168l28078L84930l32135L97137l87806
$$ 2644512 2822094 2736297 2425984 2409739 2693907 2365829 2750759 2418624 2815761 2427955
16440B427955j04166p917k9275P2912Q2546L24598m86612K46692j40403J30528
$$ 2427955 2323789 2315872 2286597 2359509 2442055 2766653 2280041 2526733 2386330 2516858
16430B516858N1847l21235N358m2432J47295j25434m3259l4900J72281J92459
$$ 2516858 2568705 2247470 2252828 2210396 2357691 2232257 2188998 2154098 2326379 2518838
16420B518838j04044l59349n0979J35042K94883j85898m37473N07388k72269L32176
$$ 2518838 2414794 2055445 2004466 2139508 2434391 2248493 1811020 2318408 2046139 2378315
16410B378315n73220J55078p3095Q0987J90479j38348Q5272n14648J34074K80364
$$ 2378315 1805095 1960173 1887078 1968065 2158544 2020196 2105468 1590820 1724894 2005258
16400B005258j27050N938J52436j94580Q5552M1337j53130Q4637j03515L7486
$$ 2005258 1878208 1884146 2036582 1842002 1927554 1968891 1815761 1900398 1796883 1834369
16390A834369J87451k74763M64445m87845K23303j03063J28841k14425J94192
$$ 1834369 2021820 1747057 2211502 1723657 1946960 1843897 1972738 1758313 1952505
16381A952505l32969j1495K29972k20144K46414n36505M43942j16485l3054o7348
$$ 1952505 1619536 1608041 1838013 1617869 1864283 1327778 1771720 1655235 1622181 1554833
16371A554833J90163k30222l5273p5519K56132j14635K26265j83004J2050j29237
$$ 1554833 1744996 1514774 1479501 1403982 1660114 1545479 1771744 1588740 1600790 1471553
16361A471553J21664q3788J53548k27144J34945J03404m38300K44423k41155L583
$$ 1471553 1593217 1509429 1662977 1435833 1570778 1674182 1235882 1480305 1239150 1242733
16351A242733J15520M44605m74449J69177j38026J44360m5735J82254j60933J83122
$$ 1242733 1358253 1802858 1328409 1497586 1359560 1503920 1458185 1640439 1479506 1662628
16341A662628j58851K13441k81012l32725Q1139K67748j75997J15483K42182k95915
$$ 1662628 1503777 1717218 1436206 1103481 1184620 1452368 1276371 1391854 1634036 1338121
16331A338121j91909J47700O590R1393N2441j75580j08299K99504l1302p576J5856
$$ 1338121 1146212 1293912 1300502 1391895 1444336 1268756 1160457 1459961 1428659 1421083 1436939
16320A436939J31298l40407J45438R8936m67796L12547N0954k65051K38261k31874
$$ 1436939 1568237 1227830 1373268 1472204 1004408 1316955 1367909 1102858 1341119 1109245
16310A109245J18898l8350r3076J77839M6767m01978K08735l1062K4848J79509
$$ 1109245 1228143 1189793 1096717 1274556 1321323 919345 1128080 1097018 1121866 1301375
16300A301375m21154Q5957L49288l1003l2391M2967j39426J5347j38155N2996
$$ 1301375 880221 966178 1315466 1284463 1252072 1295039 1155613 1170960 1032805 1085801
16290A085801q7118O02825n92231K00271j57416J86928k42688q7956K63365j47371
$$ 1085801 998683 1601508 1009277 1209548 1052132 1239060 996372 908416 1171781 1024410
16280A024410L04490k31177m3658k41520K83444l1189J44324n14049K97949n4675
$$ 1024410 1328900 1097723 1054065 812545 1095989 1064800 1209124 695075 993024 938349
16270I38349O23750l96088q8212l73801J43185J29491L3930m2029Q1519k97516
$$ 938349 1562099 1166011 1077799 703998 847183 976674 1010604 968575 1050094 752578
16260G52578L05031l82043L93908k23320k4303K24936N8857j90006K84393j28138
$$ 752578 1057609 675566 1069474 846154 821851 1046787 1105644 915638 1200031 1071893
16250A071893l65253L6943L4039K78418L5614k47122N9307k65423J73547J97871
$$ 1071893 706640 743583 777622 1056040 1091654 844532 903839 638416 811963 1009834
16240A009834m88846L46291q1849J99242o9864m4248J78392k28942j22294L9122
$$ 1009834 520988 867279 785430 984672 914808 870560 1048952 820010 697716 736838
16230G36838j11061P8044p8872J81223j06709J21163l6379J71055k43452K57911
$$ 736838 625777 703821 624949 806172 699463 820626 784247 955302 711850 969761
16220I69761l32818R9118K26991k03222o7816L67493k57069K53006l64074M8970
$$ 969761 636943 736061 963052 759830 692014 1059507 802438 1055444 691370 740340
16210G40340j01923n8722L1878R5489J12808j50732K16338k54249K40063k2777
$$ 740340 638417 579695 611573 707062 819870 669138 885476 631227 871290 848513
16200H48513j79894k48865J49039j7677l663L65462k7794k14743k14691L47573
$$ 848513 668619 419754 568793 551116 547453 912915 885121 670378 455687 803260
16190H03260j76262K58138J30932C63324k6171M83115B47938J26278M99441C54824
$$ 803260 626998 885136 1016068 363324 337153 820268 247938 374216 873657 354824
16179E12928J30765j64679K85143j70243k52360m9673M04086j7561B72384N91519
$$ 512928 643693 479014 764157 593914 341554 291881 695967 678406 272384 863903
16169H63903j76317j52396k462r6094R6410J83798k7225O5997k19578j29647L45528
$$ 863903 687586 535190 532728 436634 533044 716842 689617 755614 536036 406389 751917
16158G51917o4323l29144O7179J54056N0324A67108L67921M6934K3701j20599
$$ 751917 687594 358450 425629 579685 630009 167108 535029 581963 605664 485065
16148D85065P4391q4635j84119j6039O20256l80856B32425K32774B09487M08236
$$ 485065 559456 474821 290702 274663 894919 514063 232425 465199 209487 617723
16138F17723j17921o230J27069k28810J91036A92225K82892m8443P2620R7949
$$ 617723 499802 493572 620641 391831 582867 192225 475117 426674 499294 597243
16128E97243k122j34727A76458L00946j55716L73030r9675j77712O1301P5800
$$ 597243 595121 460394 176458 477404 321688 694718 595043 417331 478632 554432
16118E54432A42983K46420K98408o4855m5878j81792l1097p8644j20102L45099
$$ 554432 142983 389403 687811 622956 577078 395286 364189 285545 165443 510542
16108E10542M036O2930k81372K2875P6699G6296N92100A76223J99237K1161k2363
$$ 510542 514578 577508 296136 319011 395710 76296 668396 176223 375460 396621 374258
16097C74258H3474M21573h8458F40502j61353O2360K2284L6057Q0807k97291L56138
$$ 374258 83474 505047 -88458 640502 479149 541509 563793 599850 680657 383366 739504
16086G39504k47959k04578e0183C98447n1187J98862j1121j75754j00982K80540
$$ 739504 491545 286967 -50183 398447 347260 546122 535001 359247 258265 538805
16076E38805J44947G6145L44031J30954j24640j89355O2969p8040J63707Q5824
$$ 538805 683752 76145 420176 551130 426490 237135 300104 222064 385771 471595
16066D71595j39749L568j45376P1299J16447j81203K88280A44728J81088c9269
$$ 471595 331846 335414 190038 261337 377784 196581 484861 144728 325816 -39269
16055D20269J26181j73116j43552K29644A07583O3734K16308a9339k224F8270
$$ 420269 546450 373334 229782 459426 107583 171317 387625 -19339 -21563 68270
16044I1872J97623R2932j58811J27117L3424C9506J20142J59308R006o0773k3809
$$ 91872 289495 382427 223616 350733 384157 39506 159648 318956 327962 267189 243380
16033B43380J32297P5739j902n1447P1544B00825L46390A28627j9917K06204B0972
$$ 243380 375677 451416 449514 398067 469611 200825 547215 128627 108710 314914 20972
16021D81062G5393K64326j47279K40784p1033j11600C5849K89340A55146L48315
$$ 481062 75393 339719 192440 433224 362191 250591 35849 325189 155146 503461
16011E03461A42967M48989A97536O0224b5097A62888G7557K08214L1638j23862
$$ 503461 142967 591956 197536 257760 -25097 162888 77557 285771 317409 193547
16001A93547E9996Q8233C5507L38227n0277j53762N648o2994K86768A6114a00475
$$ 193547 59996 148229 35507 373734 323457 169695 175343 112349 399117 16114 -100475
15989C07352L0691K45070M0935J7688N24789k24037r1424j65098N198C24932c0557
$$ 307352 338043 583113 624048 641736 1166525 942488 851064 685966 691164 324932 -30557
15977A92840J69459A34333A2483N68252G6125K29712k4603J42545A95764J90029
$$ 192840 362299 134333 12483 580735 76125 305837 281234 423779 195764 385793
15967C85793j22333o0725r7290J94665p1069M682a59601D0390R2209K59490H5666
$$ 385793 263460 202735 105445 300110 229041 233723 -159601 40390 132599 392089 85666
15955A24221B2378K67400b6291B6855K29022J28613r7017q4063H946a2535A68056
$$ 124221 22378 289778 -26291 26855 255877 384490 287473 203410 8946 -12535 168056
15943B21326H2147h0487A86814R7311c2488A76193J1994D1614J10622J63891a39280
$$ 221326 82147 -80487 186814 284125 -32488 176193 188187 41614 152236 316127 -139280
15931C18725I5149N1734m5288J65316q3723J1271q8282P1788J64660A44302m8998
$$ 318725 95149 146883 101595 266911 183188 194459 106177 177965 342625 144302 95304
15920I5304j7943P822K3738J70444J57489F4967J2417p121E604J36754f277C30389
$$ 95304 77361 85183 108921 279365 436854 64967 77384 70263 5604 142358 -6277 330389
15907a68182b7576j64192b3281Q263p1091k89135F9170l4272a69989A73154J71475
$$ -168182 -27576 -191768 -23281 -15018 -86109 -375244 69170 34898 -169989 173154 344629
15896C44629f5680A45747l9523J65601a79398F0593K29301C3976J15826N4885
$$ 344629 -65680 145747 106224 271825 -179398 60593 289894 33976 149802 204687
15886B04687F5687Q0681a36115A3978k693i3187A97641a73922A25474K7999g748
$$ 204687 65687 146368 -136115 13978 11285 -93187 197641 -173922 125474 153473 -7748
15874B74395N5478D5864b75720J37463N4915A92976K9448C2619b94265B7002J00213
$$ 274395 329873 45864 -275720 -138257 -83342 192976 222424 32619 -294265 27002 127215
15863A27215b45767b115B06990a61221A51754D4547A8233P0609g8482A40124E9457
$$ 127215 -245767 -2115 206990 -161221 151754 44547 18233 88842 -78482 140124 59457
15851a81540P4721P532A50783J34104i7976c7228I1291M2863n304f0021A87054
$$ -181540 -106819 -99287 150783 284887 -97976 -37228 91291 134154 128850 -60021 187054
15839I284J24661O8301b74524A65108e3987D69348e0432C3346a50556d1117l92432
$$ 9284 133945 202246 -274524 165108 -53987 469348 -50432 33346 -150556 -41117 -433549
15828d33549b01388a177B17496K28834A7595K52292I9956J13562k4364b18120
$$ -433549 -201388 -1177 217496 446330 17595 269887 99956 213518 189154 -218120
15817a22001C27047J6039A61030b13476A33324a83604D5677a98729h3951B45649
$$ -122001 327047 343086 161030 -213476 133324 -183604 45677 -198729 -83951 245649
15806b0966B49482f3146H6950J53892E2285m505a42721B11324a9656m8075I0774
$$ -20966 249482 -63146 86950 240842 52285 47780 -142721 211324 -19656 -67731 90774
15794A64801K27156A87885E5811e7294H3294j6387A2592J50201q602i1470L2294
$$ 164801 391957 187885 55811 -57294 83294 66907 12592 162793 154191 -91470 -59176
15783e9176l0981G6993a78721J726c8525h784n4788E848O1762f9067k09010R3243
$$ -59176 -90157 76993 -178721 -176995 -38525 -8784 -63572 5848 67610 -69067 -278077 -184834
15771a84834A9868J32663l1200a56990B33078j02578C854O2215J63934D9655b83821
$$ -184834 19868 152531 121331 -156990 233078 130500 3854 66069 230003 49655 -283821
15759b8069j14570o9494A0070R4634l4712f5817b4525l8622e573k61826R7271
$$ -28069 -142639 -212133 10070 104704 69992 -65817 -24525 -63147 -5573 -267399 -170128
15748a70128A58253q113R0524k4529J41226a19537A90393p0433K92280F4982k389
$$ -170128 158253 150140 240664 216135 357361 -119537 190393 119960 412240 64982 62593
15737F2593P6310D8483M4839e0709o8877b2711I3189J09837b62828A10262h7254
$$ 62593 138903 48483 93322 -50709 -119586 -22711 93189 203026 -262828 110262 -87254
15725c79259i3269A6793a74162N4743m8694k834a0079B1921c7122k22244j01460
$$ -379259 -93269 16793 -174162 -119419 -168113 -170947 -10079 21921 -37122 -259366 -360826
15714c60826a00190B32526f3854J9388B00177J37794H2581P6039a35793j13846
$$ -360826 -100190 232526 -63854 -44466 200177 337971 82581 158620 -135793 -249639
15704b49639C46482I8320e73l02516G939M5927L03699f4581B40755I9774K4372
$$ -249639 346482 98320 -573 -303089 7939 53866 357565 -64581 240755 99774 124146
15693A24146J4445f3780k75450i4109A7835a44665A39548F5750d8218A10584a79174
$$ 124146 138591 -63780 -339230 -94109 17835 -144665 139548 65750 -48218 110584 -179174
15681F0106B1046J39202f8263A14111g7407A39907b31610j6762C8365b23133D3081
$$ 60106 21046 160248 -68263 114111 -77407 139907 -231610 -248372 38365 -223133 43081
15669b53639A90086a0336l2247K032C5435K61355A9834i1600D816c3571A73658
$$ -253639 190086 -10336 -42583 -40551 35435 296790 19834 -91600 4816 -33571 173658
15657A36702e2027A7480R484d8633b1827A18809K42031c36176A57835g1662B81250
$$ 136702 -52027 17480 26964 -48633 -21827 118809 360840 -336176 157835 -71662 281250
15645D4011a60596f0678B28700M5797a9026p8996B55341b14633I4668N3776e397
$$ 44011 -160596 -60678 228700 274497 -19026 -98022 255341 -214633 94668 148444 -5397
15633C4025J18539a6182A64524J09667B8050a41194B12039C5590A2900J19174
$$ 34025 152564 -16182 164524 274191 28050 -141194 212039 35590 12900 132074
15623A32074g9023B84690a23724G4397k7857J2086K19534a99837k53309f0801
$$ 132074 -79023 284690 -123724 74397 46540 58626 278160 -199837 -453146 -60801
15612i2816d5287r2215d096B806a7247A0406b33380D3517b50139O5579b1520O264
$$ -92816 -45287 -137502 -4096 2806 -17247 10406 -233380 43517 -250139 -184560 -21520 -15256
15600a5256k74394h6924c904j45911C46057b10791A47120J35747j38630j2749
$$ -15256 -289650 -86924 -3904 -149815 346057 -210791 147120 282867 144237 131488
15590A31488N2439A9938c8199k37288J9431D38064A20158n0377b16175H6684c29705
$$ 131488 183927 19938 -38199 -275487 -256056 438064 120158 69781 -216175 86684 -329705
15578A65488n3426m9147N1400h1739E2357f2010A43510a76263C11684b71439B04037
$$ 165488 112062 62915 114315 -81739 52357 -62010 143510 -176263 311684 -271439 204037
15566A20964a563H417M32579M043A88698h2317A45532J25727g5408B61435f8186
$$ 120964 -1563 8417 440996 445039 188698 -82317 145532 271259 -75408 261435 -68186
15554B31138j11984J51618b7238m6738A97993F5144i8053L3014B40418a09634
$$ 231138 119154 270772 -27238 -73976 197993 65144 -98053 -65039 240418 -109634
15543D40722A10002f6035j8703K0769n5675o687G848g2353k5317D9648L08263
$$ 440722 110002 -66035 -84738 -63969 -119644 -126331 7848 -72353 -97670 49648 357911
15532C57911k0559E8074K70798A15377J22980A792b93673E4885P8289K86326B4793
$$ 357911 337352 58074 328872 115377 238357 1792 -293673 54885 133174 419500 24793
15520a87488h6023I1720J65592g243l4669C03713r7623a00999D7236Q8839o0631
$$ -187488 -86023 91720 257312 -7243 -41912 303713 206090 -100999 47236 136075 75444
15509G5444j1156a7650j66235Q2080k92016E51148b55850a18652E6665K7601P4873
$$ 75444 64288 -17650 -183885 -101805 -393821 551148 -255850 -118652 56665 84266 159139
15498A59139d9030k37223G5848a65178h0691k11751f1183F4549b14432d9574A27035
$$ 159139 -49030 -286253 75848 -165178 -80691 -292442 -61183 64549 -214432 -49574 127035
15486B47829J1664c18874A14612J15899D2054Q4646J19837m4479K5729c4058B89572
$$ 247829 259493 -318874 114612 230511 42054 126700 246537 202058 227787 -34058 289572
15474A37447D8987b6735B67153B8356J71288a11724M8400H9085a1217j21066m1157
$$ 137447 48987 -26735 267153 28356 199644 -111724 -63324 89085 -11217 -132283 -173440
15463a73440e3582A51180a548B30913a94571b381B65518b96566e7776k10446A869
$$ -173440 -53582 151180 -1548 230913 -194571 -2381 265518 -296566 -57776 -268222 1869
15451A6900J35926e1281k7145A91544N8556H6418M36032j91327k9122l4819R7741
$$ 16900 152826 -51281 -78426 191544 250100 86418 522450 331123 302001 267182 364923
15440C64923C6771h6540G3837K75047b67922A00655Q8241R2969a8970j7485D9897
$$ 364923 36771 -86540 73837 348884 -267922 100655 188896 281865 -18970 -36455 49897
15428C34286a14385c2738j10236F2107f3700A48176a25139E9825J94558G9654
$$ 334286 -114385 -32738 -142974 62107 -63700 148176 -125139 59825 254383 79654
15417c0526n2122B05307B3549e7325C6065Q7948N9758a99696D7833d4716B27700
$$ -30526 -82648 205307 23549 -57325 36065 124013 183771 -199696 47833 -44716 227700
15405A34961a29989c1655A0925a09371B78894H3369K10607o5135p7409a73170
$$ 134961 -129989 -31655 10925 -109371 278894 83369 293976 228841 151432 -173170
15394B17a10262A58460d6643A08430l0617O985a76271A0959J11838J11351A04349
$$ 217 -110262 158460 -46643 108430 77813 84798 -176271 10959 122797 234148 104349
15382a23008i578k49185c1563j04719B7535L43178A26146K22830A04945k3995
$$ -123008 -9578 -258763 -31563 -136282 27535 370713 126146 348976 104945 80950
15372H0950J43322k3065h7981A9759J24479B852J92789F532b0094A98505c2318
$$ 80950 224272 201207 -87981 19759 144238 2852 195641 6532 -20094 198505 -32318
15360A26258b5364L321F4286p728a21828C31073D9354e4976B12887J28349M915
$$ 126258 -25364 -22043 64286 56558 -121828 331073 49354 -54976 212887 341236 346151
15349C46151b31288A12276m2067K09310c77814c7603o1169D51602e4694B09232
$$ 346151 -231288 112276 70209 279519 -377814 -37603 -98772 451602 -54694 209232
15338I6114c6707B37541G007J600g2244A77217J30835j50280p8146C6843J57027
$$ 96114 -36707 237541 7007 8607 -72244 177217 308052 157772 79626 36843 193870
15327A93870E3372a916E8980J02389J34510e3024A05879P2492N543j662a90579
$$ 193870 53372 -1916 58980 161369 295879 -53024 105879 178371 183914 182252 -190579
15315a06584B46403B7573e4361B24255K92985B19515a24520D64761k10150i9646
$$ -106584 246403 27573 -54361 224255 517240 219515 -124520 464761 254611 -99646
15304B24560A11095J24900j07285E9504L12077b04816C3956h7467M2168j04686
$$ 224560 111095 235995 128710 59504 371581 -204816 33956 -87467 -45299 -149985
15294a49985C2810b90529A41937M0746j4903o6798a92089g3859o6628C2544a03525
$$ -149985 32810 -290529 141937 182683 167780 100982 -192089 -73859 -140487 32544 -103525
15282E1362g9536j38347A45975H297K57167b4264A71177a29414e6438A20917b01323
$$ 51362 -79536 -217883 145975 8297 265464 -24264 171177 -129414 -56438 120917 -201323
15270C64348A38154c17837H7883J24703q8524E9594J56715I4786c4585A90984
$$ 364348 138154 -317837 87883 212586 124062 59594 216309 94786 -34585 190984
15259I5210e163A43419D1270J23851q0448a76D4379J68081d841C71339F5879M44820
$$ 95210 -5163 143419 41270 165121 84673 -176 44379 212460 -4841 371339 65879 510699
15247E10699d901C21130K01151k2810j52912P48306N91422J236890Q17913r64721
$$ 510699 -4901 321130 522281 499471 346559 1094865 1686287 2923177 3741090 2776369
15237B776369Q55637j439826I93164m29267k74764A41154P3343k8295a65609B72925
$$ 2776369 3632006 2192180 993164 563897 289133 141154 214497 186202 -165609 272925
15226A63431g9779m2894A14877g6983F611J22049C8622J91270h3404c03j2239
$$ 163431 -79779 -122673 114877 -76983 6611 128660 38622 229892 -83404 -303 -12542
15215a2542k35949a02172B43445I8490r311J2671l52L4268a93913B69865n5633
$$ -12542 -248491 -102172 243445 98490 89179 101850 101498 135766 -193913 269865 214232
15204B14232g65H4602J60750b86347J29212A0273L1827M0803Q9748P1410j15443
$$ 214232 -765 84602 245352 -286347 -157135 10273 42100 82903 172651 244061 128618
15193A28618n2335K14946K23298F7649J22223H9476Q8968K31513a80939A22223
$$ 128618 76283 291229 514527 67649 189872 89476 178444 409957 -180939 122223
15182I5747b25664I728J57273a3003D4466E073K3150b40573e2928A6370K29115
$$ 95747 -225664 9728 167001 -13003 44466 5073 28223 -240573 -52928 16370 245485
15171B45485j04544J87778a04597A04142M4215a16325D02666A62765k5518j2444
$$ 245485 140941 328719 -104597 104142 148357 -116325 402666 162765 137247 124803
15161A24803J39894Q8645H3228P3452l1048g340B92613I8349P0656o6306K83071
$$ 124803 264697 353342 83228 156680 125632 -7340 292613 98349 169005 102699 385770
15150C85770A83582m9276h5475A47710C9306Q227b00880I6704j2929J8675B1000
$$ 385770 183582 134306 -85475 147710 39306 47533 -200880 96704 83775 102450 21000
15138a9964l45367D50334a07692c8401A22737j9677O7149n493J8826f495F8915
$$ -19964 -365331 450334 -107692 -38401 122737 103060 170209 164716 183542 -6495 68915
15126B96948o9254J23722j75568J44297j28871K33258A97672R1689J7730K37358
$$ 296948 227694 351416 175848 320145 191274 424532 197672 289361 307091 544449
15116E44449k15093l1893j02887n6967N15318k03292K68979A06633J8731n7373
$$ 544449 329356 297463 194576 137609 652927 449635 718614 106633 125364 67991
15106F7991e0079m3988C0051e5703a587D13880B151J52565J21672A18939N4902
$$ 67991 -50079 -94067 30051 -55703 -1587 413880 2151 154716 276388 118939 173841
15095A73841q2476L17358A60232K06972J41390a47566B1084e6070I8138N65520
$$ 173841 91365 408723 160232 367204 508594 -147566 21084 -56070 98138 663658
15085F63658a03963A44169J58810A26881J00485J56219A68127N8J0879n2865K6598
$$ 663658 -103963 144169 302979 126881 227366 383585 168127 168185 179064 126199 152797
15074A52797b31400A09417M4629G6192Q5627L0845o0240a0347A73564m306l8285
$$ 152797 -231400 109417 154046 76192 161819 192664 132424 -10347 173564 169258 130973
15063A30973J80125j40661J7194b0149B05483L532H6800J74613J7225p7567K35870
$$ 130973 311098 170437 187631 -20149 205483 209015 86800 261413 278638 201071 436941
15052D36941a03448A08961m379L048L01161j53055P8170j14142g4441A57902E4244
$$ 436941 -103448 108961 104582 107630 408791 255736 333906 219764 -74441 157902 54244
15040B55342I4548C6324f4313B60764a69082D13352k03910J08995m4408N8031
$$ 255342 94548 36324 -64313 260764 -169082 413352 209442 318437 274029 332060
15030C32060A10728L3251R1985O4402L13495I4554R4510K09222o2648R9511l3854
$$ 332060 110728 143979 235964 300366 613861 94554 189064 398286 335638 435149 401295
15019D01295A1058M10656a54760G4319O4450R3770n4435j1668L45798B11079E2670
$$ 401295 11058 421714 -154760 74319 138769 232539 178104 166436 512234 211079 52670
15007C33089H432J85821N6753M6331R6924h4537E88429H6683K17603b5233C00974
$$ 333089 8432 194253 251006 297337 394261 -84537 588429 86683 304286 -25233 300974
14995D81448j64278j57223K44417J04404k35572J77883J68319k99777p8220L20249
$$ 481448 317170 159947 404364 508768 273196 451079 619398 319621 241401 561650
14985E61650J04408j09420j92836J57687A35318N4808J97525J03499k08392p711
$$ 561650 666058 556638 363802 521489 135318 190126 387651 491150 282758 275047
14975B75047m5408j6642J14998p3317J5906K64629j20723J58412r4052n7937H3225
$$ 275047 229639 212997 327995 254678 270584 535213 414490 572902 478850 420913 83225
14963C74338O3511q7478R4608M0728J28304k34982d0128B65863J89177j09117
$$ 374338 437849 350371 444979 485707 614011 379029 -40128 265863 455040 345923
14953C45923a57676C47516F2034M15653n7202k6081K01926B28944K40866l9288
$$ 345923 -157676 347516 62034 477687 420485 394404 596330 228944 469810 430522
14943D30522A58691K01900l5534J74749B03730P1145J43292J62124j56908J07356
$$ 430522 158691 360591 325057 499806 203730 274875 418167 580291 423383 530739
14933E30739J26890j25804K44855C05235o0984M48707j89136K3449j05429K00279
$$ 530739 657629 531825 776680 305235 244251 692958 503822 527271 421842 622121
14923F22121j04407l7134M67959j0999m4639p5876l38768J57813J76372B95109
$$ 622121 517714 480580 948539 937540 892901 817025 478257 636070 812442 295109
14912D51470h942C50061N9788j40192J70740J6270K50622B16720L40934p114l5478
$$ 451470 -8942 350061 409849 269657 440397 456667 707289 216720 557654 550540 515062
14901E15062L16696C26104p5297k3627L35571j56410c29893B67290K1080r1566
$$ 515062 831758 326104 250807 227180 562751 406341 -329893 267290 288370 196804
14891A96804K16561j8605J9400R294K3331J31158l3744k04576J23662A70506J12321
$$ 196804 413365 394760 414160 423454 446785 577943 544199 339623 463285 170506 282827
14880B82827K16658q7727k2347Q5930A23559L09741J91190B76055N32537p2922
$$ 282827 499485 411758 389411 475341 123559 433300 624490 276055 808592 735670
14870G35670k76456B07748K55989K3324O6753J82480k99304B10832L11304j56199
$$ 735670 459214 207748 463737 487061 553814 736294 436990 210832 522136 365937
14860C65937L20580k44679A45160K35314K5907r7354q0456J24459P4739R6256
$$ 365937 686517 441838 145160 380474 406381 309027 228571 353030 427769 524025
14850E24025Q0139r9137n6959K45003R5869k03787K21466p8299q6272q4805p5530
$$ 524025 604164 505027 448068 693071 788940 585153 806619 728320 642048 557243 481713
14839D81713J64906k08434P7798n8227J46705k22090J22261j24580K49268j36177
$$ 481713 646619 438185 515983 457756 604461 382371 504632 380052 629320 493143
14829D93143j0681N8172q6766J80964K02570l01382j00685K0388J09728J28648
$$ 493143 482462 540634 453868 634832 837402 536020 435335 455723 565451 694099
14819F94099J08902C96730l8653J39727l9026K69487l40429N67565l61351N6373
$$ 694099 803001 396730 358077 497804 458778 728265 387836 955401 594050 650423
14809F50423r4691j06494L67618j5530l75218j05267L19009k30180J87217j72328
$$ 650423 555732 449238 816856 801326 426108 320841 639850 409670 596887 424559
14799D24559K31763k63928M97530B95489J73344j84503N16091l34754J34692r3655
$$ 424559 656322 392394 889924 295489 468833 284330 800421 465667 600359 506704
14789E06704K43429j16255j17084L29908k11266m6247J5109J92577j93666p0116
$$ 506704 750133 633878 516794 846702 635436 589189 604298 796875 603209 533093
14779E33093q667Q1751K01158k60296N9141J09314R3366B57353o263M93260k10293
$$ 533093 524426 606177 807335 547039 606180 715494 808860 257353 251090 744350 534057
14768E34057l5784P7068J50722J2611Q7474m01098p288M30461C51586J45200n5014
$$ 534057 498273 575341 726063 738674 826148 425050 417762 848223 351586 496786 441772
14757D41772K70075k38924J10615n960J70741j38973O011M842N2402k17025L08848
$$ 441772 711847 472923 583538 577578 748319 609346 615357 620199 672601 455576 764424
14746G64424j91340K7651j53207R1827j0949J35489N7063j15610J82570j90597
$$ 764424 573084 600735 447528 539355 528406 663895 720958 605348 787918 597321
14736E97321L41103N917j49643J44115D23348R3080J68861J22206M0774J01646
$$ 597321 938424 944341 794698 938813 423348 516428 685289 807495 848269 949915
14726I49915k63005P0244M63300l06833m1916L16818j48346M3057K2688E46528
$$ 949915 686910 757154 1220454 913621 871705 1188523 1040177 1083234 1105922 546528
14715E24386K39573J41082k62253J93803K99263k81675Q2845Q9046o2544k54968
$$ 524386 763959 905041 642788 836591 1135854 854179 937024 1026070 963526 708558
14705G08558J81793P2285j15584K28099l3950j41743L06178m58039J11297L17083
$$ 708558 890351 962636 847052 1075151 1041201 899458 1205636 747597 858894 1175977
14695A175977j92739k18707L306M1798M21899m12850k2760J20477P4568o7649
$$ 1175977 983238 764531 767837 809635 1231534 818684 795924 916401 990969 923320
14685I23320L16333k93232l16599M62190o1773j10248L9993J525o9885K22372
$$ 923320 1239653 946421 629822 1092012 1030239 919991 959984 961509 891624 1113996
14675A113996j712l36832L89843J30602o38880J00990K86605L19546o19520K21724
$$ 1113996 1112284 775452 1165295 1295897 657017 758007 1044612 1364158 744638 966362
14665I66362L55256k07210K3095l19725N32722k76422L5211L2363R4589j29149
$$ 966362 1321618 1114408 1137503 817778 1350500 1074078 1109289 1141652 1236241 1107092
14655A107092J10710J70859l55775K79777K8253k7050l60238L22498m5023N1832
$$ 1107092 1217802 1388661 1032886 1312663 1340916 1313866 953628 1276126 1231103 1282935
14645A282935l00697Q1537j09790L69741j4195k05050K3398K08119l0075O0224
$$ 1282935 982238 1063775 953985 1323726 1309531 1104481 1127879 1335998 1305923 1366147
14635A366147j82932j9770J39756m64703M02877j62746M90935k54484J59357k35635
$$ 1366147 1183215 1163445 1303201 838498 1241375 1078629 1569564 1315080 1474437 1238802
14625A238802j495k35643N89979m53451K60724M4037M3394j35323j74047J98793
$$ 1238802 1237307 1001664 1591643 1138192 1398916 1442953 1486347 1351024 1176977 1375770
14615A375770K26097k5204n62712O61891k44889J71442q8170P1196m08530N27358
$$ 1375770 1601867 1576663 1013951 1675842 1430953 1602395 1514225 1585421 1176891 1704249
14605A704249m99397K85381j06639o6293M05166O7334l08461K46661K8603J39400
$$ 1704249 1204852 1490233 1383594 1317301 1722467 1789801 1481340 1728001 1756604 1896004
14595A896004k25202J02388j82319M6774j8263J51967j2770K28140j25880j69909
$$ 1896004 1670802 1773190 1590871 1637645 1619382 1771349 1758579 1986719 1860839 1690930
14585A690930L29003l41429L38488Q331J35473l43268J68486j75631N0991j47364
$$ 1690930 2019933 1678504 2016992 2025323 2160796 1817528 1986014 1810383 1861374 1714010
14575A714010J52730K43027k734j44341m6609L92129m8505l33692L76222R8007
$$ 1714010 1866740 2109767 2107033 1962692 1916083 2308212 2259707 1926015 2302237 2400244
14565B400244l06346K61066J75413K49995m57056K64309j11913j24018M02700
$$ 2400244 2093898 2354964 2530377 2780372 2323316 2587625 2475712 2351694 2754394
14556B754394N6309M17981J91408R2741N53791N88655J013803K135758M248297
$$ 2754394 2810703 3228684 3420092 3512833 4066624 4655279 5669082 7804840 12053137
14547A2053137P945689J6522727L666234A8847201H554005l952118j660869j89842
$$ 12053137 19998826 36521553 40187787 18847201 8554005 4601887 2941018 2751176
14539B751176l83329j2686M56816J055693K424053K871363m535511j825179n14579
$$ 2751176 2367847 2355161 2811977 3867670 6291723 9163086 4627575 2802396 2287817
14530B287817j61219K2883j5305N08225n53709l6910L03778m9591k147J46459
$$ 2287817 2126598 2149481 2134176 2642401 2088692 2051782 2355560 2305969 2303822 2450281
14520B450281o8943K06803j99327K14350k52685K18356l21272M04659k48654K52156
$$ 2450281 2381338 2588141 2388814 2603164 2350479 2568835 2247563 2652222 2403568 2655724
14510B655724p9820K78517k60445N46780n91066K51161o3018K22551p5792K44059
$$ 2655724 2575904 2854421 2593976 3140756 2549690 2800851 2737833 2960384 2884592 3128651
14500C128651l82398L79966k48861J63636j03181j38653N70323j5186L9950R5706
$$ 3128651 2746253 3126219 2877358 3040994 2937813 2799160 3369483 3354297 3394247 3489953
14490C489953j69834K24391K13796n0221l60414K24802o4422L10223k88001K19259
$$ 3489953 3320119 3544510 3758306 3708085 3347671 3572473 3508051 3818274 3530273 3749532
14480C749532P6968L05104j12409l72509K42394j17086l60323P91465j52419K4582
$$ 3749532 3826500 4131604 4019195 3646686 3889080 3771994 3411671 4203136 4050717 4075299
14470D075299l5900Q272M96135n90272J25898L55247J36018j63216l7714J16071
$$ 4075299 4039399 4047671 4543806 3953534 4079432 4434679 4570697 4407481 4369767 4485838
14460D485838J73956k78414K35328J21037L1562l40029M90476j64553J57120K48246
$$ 4485838 4659794 4381380 4616708 4737745 4769307 4429278 4919754 4755201 4912321 5160567
14450E160567k16789M52227J05185o6893j74827L05388J32443k27548L18528j05495
$$ 5160567 4943778 5396005 5501190 5434297 5259470 5564858 5697301 5469753 5788281 5682786
14440E682786K7789J95628p6258O9732K34677K53524r9754l06690O17043j4310
$$ 5682786 5710575 5906203 5829945 5899677 6134354 6387878 6288124 5981434 6598477 6584167
14430F584167Q5963K5017j16093L72953J12130L58422p3326N861Q9240l0045N66371
$$ 6584167 6670130 6695147 6579054 6952007 7064137 7422559 7349233 7355094 7444334 7414289 7980660
14419G980660l71651K4694L21434L86372Q8127j66791R9173J65975j82068K18078
$$ 7980660 7609009 7633703 7955137 8341509 8429636 8262845 8362018 8527993 8345925 8564003
14409H564003M55531m06371N50013K10015K15640M7185J62593j41020N7159N66807
$$ 8564003 9019534 8613163 9163176 9373191 9588831 9636016 9798609 9657589 9714748 10281555
14399A0281555l0727M25885J71499j62948N71661k87946K88809M80585P9388K32634
$$ 10281555 10250828 10676713 10848212 10685264 11256925 10968979 11257788 11738373 11817761 12050395
14389A2050395j44450N97643K67158K41519m7890J23046L54232K90993L40695
$$ 12050395 11905945 12503588 12770746 13012265 12964375 13087421 13441653 13732646 14073341
14380A4073341K65695j89532K87012M53385L61561K49023K63543J13425J014397
$$ 14073341 14339036 14149504 14436516 14889901 15251462 15500485 15764028 15877453 16891850
14371A6891850k66677O27217J64290K21169M23887O26429L55985M48581M75056
$$ 16891850 16625173 17252390 17416680 17637849 18061736 18688165 19044150 19492731 19967787
14362A9967787K8764P71705j0236O41612N6581Q45281O33312M64389N47076K98852
$$ 19967787 19996551 20768256 20758020 21399632 21456213 22301494 22934806 23399195 23946271 24245123
14352B4245123J065630L17893M86926P51215M67427O32186Q31862O49334O77161
$$ 24245123 25310753 25628646 26115572 26866787 27334214 27966400 28798262 29447596 30124757
14343C0124757J001148P55317L17515J458428J120547O20275J225583J234547
$$ 30124757 31125905 31881222 32198737 33657165 34777712 35397987 36623570 37858117
14335C7858117M47922J474199J195649J054162J232998J586428J255264J540587
$$ 37858117 38306039 39780238 40975887 42030049 43263047 44849475 46104739 47645326
14327D7645326J663813J517599J507993J518617K226073J621569K154063K495834
$$ 47645326 49309139 50826738 52334731 53853348 56079421 57700990 59855053 62350887
14319F2350887J775778K524330K266569K809142K687898K954690K694253L453351
$$ 62350887 64126665 66650995 68917564 71726706 74414604 77369294 80063547 83516898
14311H3516898L048290L757988L798991M008559M069289M904267M691558N113371
$$ 83516898 86565188 90323176 94122167 98130726 102200015 107104282 111795840 116909211
14303A16909211N352520N537653O291133O180866O612063P232703P431768P780586
$$ 116909211 122261731 127799384 134090517 140271383 146883446 154116149 161547917 169328503
14295A69328503Q375920Q818731R197384R828642J0507319J1224540J1654501
$$ 169328503 177704423 186523154 195720538 205549180 216056499 227281039 238935540
14288B38935540J1777209J2900005J3051948J3590239J4015340J4212446J4603492
$$ 238935540 250712749 263612754 276664702 290254941 304270281 318482727 333086219
14281C33086219J4598629J4465995J4288141J3550502J2926665J1767107J0723932
$$ 333086219 347684848 362150843 376438984 389989486 402916151 414683258 425407190
14274D25407190Q443371N183454O59697O54998M95204J447773m974389k960242
$$ 425407190 433850561 439034015 439693712 440348710 440843914 442291687 437317298 434357056
14266D34357056m199382p146143r839936j1541231j2073526j2973519j4626316
$$ 434357056 430157674 423011531 413171595 401630364 389556838 376583319 361957003
14259C61957003j4689063j4916551j5005573j4620322j4515213j3742632j3893265
$$ 361957003 347267940 332351389 317345816 302725494 288210281 274467649 260574384
14252B60574384j3124732j1734154j2184774j1112116j1013261j0041758r747054
$$ 260574384 247449652 235715498 223530724 212418608 201405347 191363589 181616535
14245A81616535p721535n088270q538570p988782p507522o874497o102659n946210
$$ 181616535 173895000 168806730 160268160 152279378 144771856 137897359 131794700 125848490
14237A25848490n539222n253245n003405n025462m438043l994915l122616m015387
$$ 125848490 120309268 115056023 110052618 105027156 100589113 96594198 93471582 89456195
14229H9456195l718673l322415l417394k602120l092223k695257k640364k295484
$$ 89456195 85737522 82415107 78997713 76395593 73303370 70608113 67967749 65672265
14221F5672265k569406j893513k118133j803628k132827j684829j650013j203840
$$ 65672265 63102859 61209346 59091213 57287585 55154758 53469929 51819916 50616076
14213E0616076j862561j519796j684492j195628j379074j335405o34577r16261
$$ 50616076 48753515 47233719 45549227 44353599 42974525 41639120 41004543 40088282
14205D0088282j626881r10564j207463r15186r53671o17730j057080j051600q76196
$$ 40088282 38461401 37550837 36343374 35428188 34474517 33856787 32799707 31748107 30871911
14196C0871911k62864r89920o79007o11259p19452q84433q16396m97274l33403
$$ 30871911 30609047 29619127 28940120 28328861 27609409 26724976 25908580 25411306 25077903
14187B5077903p90887p81887p05226M051r88349l41715n09218l89482m14771l87646
$$ 25077903 24287016 23505129 22799903 22803954 21815605 21473890 20964672 20575190 20160419 19772773
14177A9772773m19647k93195k28522p40123q0493l43531p01121j37512m75071
$$ 19772773 19353126 19059931 18831409 18091286 18010793 17667262 16966141 16828629 16353558
14168A6353558j27559l23789k19017l51502p12159J26076m81840n3301k156l41224
$$ 16353558 16225999 15902210 15683193 15331691 14619532 14745608 14263768 14210467 14208311 13867087
14158A3867087k72441k16260l03442n18558j29554J07197l89729k11290j84149
$$ 13867087 13594646 13378386 13074944 12556386 12426832 12534029 12144300 11933010 11748861
14149A1748861m84839N3443k08763l38679l20196L15857l88524p4088k32742l450
$$ 11748861 11264022 11317465 11108702 10770023 10449827 10765684 10377160 10303072 10070330 10066880
14139A0066880M7914j48097l68604J55591l15666r1237k16467q4355l34162K67563
$$ 10066880 10114794 9966697 9598093 9753684 9438018 9346781 9130314 9045959 8711797 8979360
14129H979360m27079J11821o79145m2429O5519j83468k53269K53633Q921m3129
$$ 8979360 8552281 8664102 7984957 7942528 8008047 7824579 7571310 7824943 7833864 7790735
14119G790735j41607l05814l4175L98567r21065l5133J28520o724k4013l3583
$$ 7790735 7649128 7343314 7309139 7707706 6786641 6751508 6880028 6873304 6849291 6815708
14109F815708k72081n4035j88348K25214j79423K271k23972k17595Q4804N8888
$$ 6815708 6543627 6489592 6301244 6526458 6347035 6349306 6125334 5907739 5992543 6051431
14099F051431m08989O2554J84145l75751J39532k56040j61109M29839k07411k95320
$$ 6051431 5642442 5704996 5889141 5513390 5652922 5396882 5235773 5665612 5458201 5162881
14089E162881j37137j60183O06218l15643q8853L33999n09251r0756K1627j9727
$$ 5162881 5025744 4865561 5471779 5156136 5067283 5401282 4892031 4801275 4822902 4803175
14079D803175j79347m7476J15464J67457l07526k39441K84809m38713K47092k80374
$$ 4803175 4623828 4576352 4691816 4859273 4551747 4312306 4597115 4158402 4405494 4125120
14069D125120R1020j44509J69663j42040k63087k0134J75610j11628J38409j38085
$$ 4125120 4216140 4071631 4241294 4099254 3836167 3816033 3991643 3880015 4018424 3880339
14059C880339j50416N20374o00639J2476j58556O6096k29717Q4214p3639K936
$$ 3880339 3729923 4250297 3649658 3662134 3503578 3569674 3339957 3424171 3350532 3353468
14049C353468K94687k86274J24793j77071L34856m37352q269k0055R7392j71021
$$ 3353468 3648155 3361881 3486674 3309603 3644459 3207107 3198838 3178783 3276175 3105154
14039C105154m28342M89439k96553Q8164l02087L09764K24320n33404M41639J14433
$$ 3105154 2676812 3166251 2869698 2957862 2655775 2965539 3189859 2656455 3098094 3212527
14029C212527q2454j49008n5411l27001M18519j43147k73661L6707L05318n09091
$$ 3212527 3130073 2981065 2925654 2598653 3017172 2874025 2600364 2637071 2942389 2433298
14019B433298N4295M7494k9077L39601m16298j29114J45789k00515J67814k08459
$$ 2433298 2487593 2535087 2506010 2845611 2429313 2300199 2445988 2245473 2413287 2204828
14009B204828j01578L11688J68341m19034R2508M5112J42140m35799J90538l9013
$$ 2204828 2103250 2414938 2583279 2164245 2256753 2301865 2444005 2008206 2198744 2159731
13999B159731M3057l33241L33516r2605L3901l9210J42898m52258K79227M93379
$$ 2159731 2202788 1869547 2203063 2110458 2144359 2105149 2248047 1795789 2075016 2568395
13989B568395P07654K761126N615611J3091056J9225132j4348299j3980022o704989
$$ 2568395 3276049 6037175 11652786 24743842 43968974 29620675 15640653 8935664
13981H935664k760330j341943p97564n68420m26680j05567l09125L34756l55122
$$ 8935664 6175334 4833391 4035827 3467407 3040727 2935160 2626035 2960791 2605669
13972B605669r8524J44033j96912J35007k37680k39347M8222J71659j52641L7798
$$ 2605669 2507145 2651178 2454266 2589273 2351593 2112246 2160468 2332127 2179486 2217284
13962B217284j49297J13083l35771K87772j68767K47713j96515J95306k84041
$$ 2217284 2067987 2181070 1845299 2133071 1964304 2212017 2015502 2210808 1926767
13953A926767R6294k9099p8573m5538L7890r0854m2898K24218k22073J38070j01523
$$ 1926767 2023061 1993962 1915389 1869851 1907741 1816887 1773989 1998207 1776134 1914204 1812681
13942A812681r191j0575j65446O7974L6074J45594m44179K95648J24216k44298
$$ 1812681 1803490 1792915 1627469 1695443 1731517 1877111 1432932 1728580 1852796 1608498
13932A608498M8709j42161P669p2003m2731M96443o64105L80302m30587O78334
$$ 1608498 1657207 1515046 1522715 1450712 1407981 1904424 1240319 1620621 1190034 1868368
13922A868368l15054K55997m29618M52538n82116L65449p5954l08505J50726K21485
$$ 1868368 1553314 1809311 1379693 1832231 1250115 1615564 1539610 1231105 1381831 1603316
13912A603316m54063K1253L84613k48614J06287R504j9766R1917K35926m51196
$$ 1603316 1149253 1170506 1555119 1306505 1412792 1422296 1402530 1494447 1730373 1279177
13902A279177K55070j78604j97076J73908j60570J75305r0461K26037j03513n2960
$$ 1279177 1534247 1355643 1158567 1332475 1171905 1347210 1256749 1482786 1379273 1326313
13892A326313O2729o044k9051q5400K80523j70284j46590j66951N07316k78836
$$ 1326313 1389042 1382998 1353947 1268547 1549070 1378786 1232196 1065245 1572561 1293725
13882A293725l25634L2705L10913K00124l21458L9322k37533J01699J7606Q0780
$$ 1293725 968091 1000796 1311709 1511833 1190375 1229697 992164 1093863 1111469 1192249
13872A192249K11637k72577O4882k81660K07368J93098m72205L96940k79800J25164
$$ 1192249 1403886 1131309 1196191 914531 1121899 1314997 842792 1239732 959932 1085096
13862A085096m20808M7784J10929K88797J57916r0739k42995K14102j39079K4786
$$ 1085096 664288 712072 823001 1111798 1269714 1178975 935980 1150082 1011003 1035789
13852A035789k25373L50769k24909J18854k32346K7990K20693j13458L5539m4580
$$ 1035789 810416 1161185 936276 1055130 822784 850774 1071467 958009 993548 948968
13842I48968J16365J29868n8784p9854l90462O0907M9910l5284k7715K27006L2495
$$ 948968 1065333 1195201 1136417 1056563 666101 727008 776918 741634 713919 940925 973420
13831I73420l8041K9827L6017l14264o7220M14517j04119l61040Q49574D29742
$$ 973420 935379 965206 1001223 686959 619739 1034256 930137 569097 1418671 429742
13820G98382k87863L90249n5835k03398K94084k88287r4072M10281r2882l44724
$$ 798382 510519 900768 844933 641535 935619 647332 553260 963541 870659 525935
13810E25935N57791l78355J81060k17424L36976o2230L5537k67189O7982l8769
$$ 525935 1083726 705371 886431 669007 1005983 943753 979290 712101 780083 741314
13800G41314Q3821j5369l11840N9109K63285j71832J69996l18373K97136J59209
$$ 741314 825135 809766 497926 557035 820320 648488 818484 500111 797247 956456
13790I56456k03761m9033j01297O3898J27316R9077j61794r0935J75916J17318
$$ 956456 752695 703662 602365 666263 793579 892656 730862 639927 815843 933161
13780I33161l81349J40306J01616k40884L17112l31131L2594K89260k25595B64488
$$ 933161 551812 692118 793734 552850 869962 538831 571425 860685 635090 264488
13769F37036M4527N7855j12330J63309l75236J37022J4203K77986l41868j77526
$$ 637036 681563 739418 627088 790397 415161 552183 566386 844372 502504 324978
13759C24978K96346n0062o2789L27354C62361M5901L47703l52946K03965k21774
$$ 324978 621324 571262 508473 835827 362361 408262 755965 403019 606984 385210
13749C85210M55292k24376K44607m9759j56037k25202L06753k0723k66649J40369
$$ 385210 840502 616126 860733 810974 654937 429735 736488 715765 449116 589485
13739E89485M2834K5301K36864r6480p0401j44764J15125j20500j78480K11178
$$ 589485 632319 657620 894484 798004 727603 582839 697964 577464 398984 610162
13729F10162J52297P326l53631J78986k26538K43122m0449p5178A84432K53086
$$ 610162 762459 769785 416154 595140 368602 611724 571275 496097 184432 437518
13719D37518m5356k9853L00130j37753j95890L24818L62712l84963L6364J53116
$$ 437518 392162 362309 662439 524686 328796 653614 1016326 631363 667727 820843
13709H20843l33368j36123J3947K9632A50613N67305j91297L40387k53461j65547
$$ 820843 487475 351352 365299 394931 150613 717918 526621 867008 613547 448000
13699D48000j95869L96918j38483j16775K07959j59342J92267Q698B75690J19496
$$ 448000 252131 649049 510566 393791 601750 442408 634675 643373 275690 395186
13689C95186k6085K11584r7519j42771L71636j24508j37795K8082j28293K33020
$$ 395186 369101 580685 483166 340395 712031 587523 449728 477810 349517 582537
13679E82537k13558P2887r5622K22445k9423J06102k0278j86174C0513Q21116
$$ 582537 368979 441866 346244 568689 539266 645368 625090 438916 30513 851629
13669H51629l81933J5614L3797j29724N7338Q8092Q5331p548p7631o0938k01496
$$ 851629 469696 485310 519107 389383 446721 534813 620144 612596 534965 474027 272531
13658B72531N65996C76957K30890j69189N3563p3044J3182A79554q6500J29069
$$ 272531 838527 376957 607847 438658 492221 419177 432359 179554 93054 222123
13648B22123K06735A45570K36014j35343P7683J44472p6106J98263k92911j33731
$$ 222123 428858 145570 381584 246241 323924 468396 392290 590553 297642 163911
13638A63911K03399a93548E61378L3953j69309j04202A36958L14355j81442K37879
$$ 163911 367310 -193548 561378 595331 426022 321820 136958 451313 269871 507750
13628E07750B01477J13213O8715J54101j43611r6199K95062n0709j54006A27827
$$ 507750 201477 314690 383405 537506 393895 297696 592758 542049 388043 127827
13617b9592B39655n7481D3021L32586A19490L95931K02160C48215B2433K58158
$$ -29592 239655 182174 43021 375607 119490 515421 717581 348215 22433 280591
13607B80591J07226j40178Q472L6354M61060B34141a08917C35944R1291k1880
$$ 280591 387817 247639 256111 292465 753525 234141 -108917 335944 427235 405355
13597D05355A32600K84316j40926j29767k4246L00956j08489M7367R270J18628
$$ 405355 132600 416916 275990 146223 121977 422933 314444 361811 371081 489709
13587D89709K5411P878K78738C64340P818M8035n5073J8007J37399k09811P9440
$$ 489709 515120 522998 801736 364340 372158 420193 365120 383127 520526 310715 390155
13576C90155K9003B08632J59632A40774a00603E59866k43868K0215l1399K50306
$$ 390155 419158 208632 368264 140774 -100603 559866 315998 336213 304814 555120
13566E55120k56770o7363K11246j45973J46965k7073r4397R919A12546J87723
$$ 555120 298350 230987 442233 296260 443225 416152 321755 331674 112546 300269
13556C00269K00126A71671L20832a14868A3385L40797j01793A8787L03933Q1564
$$ 300269 500395 171671 492503 -114868 13385 354182 252389 18787 322720 404284
13546D04284j36860L4270J2975K85347k91391K1788N1354q7865l5640M8266j47785
$$ 404284 267424 301694 314669 600016 308625 330413 381767 293902 258262 306528 158743
13535A58743J55072K47532k74902M3822b0836D64086A90138L04638k13430J25563
$$ 158743 313815 561347 286445 330267 -20836 464086 190138 494776 281346 406909
13525D06909o5371K2832J13166C2775O8815J80187M9281j07326d6422B17758O3124
$$ 406909 341538 364370 477536 32775 101590 281777 331058 223732 -46422 217758 280882
13514B80882m194J7607K82886B64531a58297D15962O4270B07609K3822k0911k6787
$$ 280882 276688 294295 577181 264531 -158297 415962 480232 207609 231431 210520 183733
13503A83733K8773J9290O4689R8073a9359C27119j43839n7210N48092q9956o8702
$$ 183733 212506 231796 296485 394558 -19359 327119 183280 126070 674162 584206 515504
13492E15504D6145M493J02031K0086n3942m068K09447R4625p4332A39586J4020
$$ 515504 46145 50638 152669 172755 118813 114745 324192 418817 344485 139586 153606
13481A53606p2522J46251a22261A06363L1877K3104K78790A76848J18265L1622
$$ 153606 81084 227335 -122261 106363 138240 161344 440134 176848 295113 326735
13471C26735K09228j80574F8000K876J30801Q419m125h7499K2358C69671K18864
$$ 326735 535963 355389 68000 70876 201677 210096 205971 -87499 -65141 369671 588535
13460E88535e6970C34725F8418O8587K45726I0212J41098b11657A84456O4480
$$ 588535 -56970 334725 68418 137005 382731 90212 231310 -211657 184456 248936
13450B48936d2039B66599d50A77578J70265j39175l1744k2016Q7991Q78a00615
$$ 248936 -42039 266599 -450 177578 347843 208668 176924 154908 242899 243777 -100615
13438h9252D07686q0888o5723K61130A25723m0934K08853P2407Q0523G1740j4090
$$ -89252 407686 326798 261075 522205 125723 84789 293642 366049 446572 71740 57650
13427E7650O5549K41998A45345Q7690A02019a02311B8640J51822m9497Q1673I2053
$$ 57650 123199 365197 145345 233035 102019 -102311 28640 180462 130965 212638 92053
13415E44113c4295B42630p3806K31381j56767C9950d0955B51128i364j5539C27966
$$ 544113 -34295 242630 168824 400205 243438 39950 -40955 251128 -9364 -24903 327966
13403c0510E2811i2928D71844B23138J81330f4486D55571A77778J6949H5869P199
$$ -30510 52811 -92928 471844 223138 404468 -64486 455571 177778 194727 85869 93068
13392I3068L22392a46428E13960j69942a93587A42496K2751l6113b07033F4310
$$ 93068 415460 -146428 513960 344018 -193587 142496 165247 129134 -207033 64310
13381c19704C12536a78181K3916C44634K17448A14544O9124a80549A39687B524
$$ -319704 312536 -178181 -154265 344634 562082 114544 183668 -180549 139687 2524
13370C34868j60532G5237J50752A01043a43769A98950J48051g3192F88868e5256
$$ 334868 174336 75237 225989 101043 -143769 198950 347001 -73192 688868 -55256
13359C67448A03731J53367r5719E5768c0082A00367J11435p05c2692j89566A47778
$$ 367448 103731 257098 161379 55768 -30082 100367 211802 211097 -32692 -222258 147778
13347B78572L4356r3648p7725M37027A19406K25313j18008n3092L9818q3076K59425
$$ 278572 312928 219280 141555 578582 119406 344719 226711 173619 213437 130361 389786
13336C89786P722M4638j41451D2948N22883j77642p7130n5083O839A13567J73087
$$ 389786 397508 442146 300695 42948 565831 388189 311059 255976 262815 113567 286654
13325B86654a98650A43186F6111M5871P9421b2218A89639N6732d6613A08290M97815
$$ 286654 -198650 143186 66111 111982 191403 -22218 189639 246371 -46613 108290 606105
13314F06105k99000g1741F3814C629O6622C3031e4642H6874c06052B54086J2697
$$ 606105 307105 -71741 63814 3629 70251 33031 -54642 86874 -306052 254086 266783
13303B66783j20664C022K69367a77080C7341K6964O1635P4216K54636j43251E0925
$$ 266783 146119 3022 272389 -177080 37341 64305 125940 200156 454792 311541 50925
13291a33529b3295A87757J34550j03715h8744B8638J08527J097L18397I7282a24547
$$ -133529 -23295 187757 322307 218592 -88744 28638 137165 138262 456659 97282 -124547
13279B49425q0146a18809B16100F1832K50091c03948A69245L4499f7153A80336
$$ 249425 169279 -118809 216100 61832 311923 -303948 169245 203744 -67153 180336
13268C22726D1846J99738i808C88441A04115K430c949j06519A44915a2484l8979
$$ 322726 41846 241584 -9808 388441 104115 106545 -3949 -110468 144915 -12484 -51463
13257e1463j98819A58372p3858a90028A07489k536L0827J03629g3579l4147d0660
$$ -51463 -250282 158372 84514 -190028 107489 104953 135780 239409 -73579 -107726 -40660
13245F0709A170J05269J30382a39079O7203B42893i17C2874K14617H7510K8406
$$ 60709 1170 106439 236821 -139079 -71876 242893 -917 32874 247491 87510 115916
13234A15916h0886j03114B12397q7756f5584l44674A02439J91941a4114A95064
$$ 115916 -80886 -184000 212397 124641 -65584 -410258 102439 294380 -14114 195064
13223A56731J01142A21277e5653D30445k02134g720A19860a08291A96665K2015
$$ 156731 257873 121277 -55653 430445 228311 -7720 119860 -108291 196665 218680
13213B18680a02823A51088J69984j11017P3545j20219L2071o8139e0639j10960
$$ 218680 -102823 151088 321072 210055 283600 163381 195452 127313 -50639 -161599
13203a61599j41556D3977a14981E5943h3563A40536b46442I8942J76678A29640
$$ -161599 -303155 43977 -114981 55943 -83563 140536 -246442 98942 275620 129640
13192A55393b53540j41506F5182K54501a7485B38497G3201J66468k9669d5102
$$ 155393 -253540 -395046 65182 319683 -17485 238497 73201 239669 210000 -45102
13181a04505K064F202J81475H3414P4082o6805O2023F1221M8433B2683J13913
$$ -104505 -102441 6202 187677 83414 157496 90691 152714 61221 109654 22683 136596
13170A36596b08615C45771j47924C8420J92204f5257A18497K77083b01385A18425
$$ 136596 -208615 345771 197847 38420 230624 -65257 118497 395580 -201385 118425
13159B66393h9674j2209A53297K40151C7585Q749J27380b3812B6364L42424I6020
$$ 266393 -89674 -101883 153297 393448 37585 46334 173714 -23812 26364 368788 96020
13147B53436P0365j27924J68725c34932H07a88982I0401N3648J28989e4870B55545
$$ 253436 323801 195877 364602 -334932 807 -188982 90401 144049 273038 -54870 255545
13135c20750A11797c0125I4098a24259B22793M0021C3213L5376e738l0091E0133
$$ -320750 111797 -30125 94098 -124259 222793 262814 33213 68589 -5738 -35829 50133
13123a01866A32017J3191K7530c10294G4358L10506j57108c78022F7215a79938
$$ -101866 132017 145208 172738 -310294 74358 384864 227756 -378022 67215 -179938
13112A12362B3547f067A67976k9515J76856h8712B08070h8997D29937R02A3656
$$ 112362 23547 -6067 167976 138461 315317 -88712 208070 -88997 429937 430839 13656
13100b01537k56726a70606C30931a21883A35424e0895A480K32705n4355C769b11451
$$ -201537 -458263 -170606 330931 -121883 135424 -50895 1480 234185 179830 3769 -211451
13088b25877a00079a3886F5263P3894D9671J30598H9278K14286f0880B46587G5284
$$ -225877 -100079 -13886 65263 139157 49671 180269 89278 303564 -60880 246587 75284
13076a84567A43617c02237A04881d0201k83598i2953p9987I8812J478K0075a01810
$$ -184567 143617 -302237 104881 -40201 -323799 -92953 -172940 98812 100290 120365 -101810
13064b132l6482B5406J44206g9576K0561D15954A57464e123C18678D8406j0477
$$ -2132 -38614 25406 169612 -79576 -59015 415954 157464 -5123 318678 48406 37929
13053C7929M0103J97625b26892q1195a7988E2798L7488o941J62990k7772G2017
$$ 37929 78032 275657 -226892 -308087 -17988 52798 90286 83345 246335 218563 72017
13041A69397J36171A35068j1741b7122D1553b28094J13258H102K0662J35986d5569
$$ 169397 305568 135068 123327 -27122 41553 -228094 -114836 8102 28764 164750 -45569
13029A9231a6945C62323A14453J29226E7555N18185e9544k43139h5646A64436
$$ 19231 -16945 362323 114453 243679 57555 575740 -59544 -302683 -85646 164436
13018B58305A03025e5828D3062K14162I5272J49762a4968r1471A82901c58698
$$ 258305 103025 -55828 43062 257224 95272 245034 -14968 -106439 182901 -358698
13007C4706b27001n1338B07297a77560C9858c4179A42429c63355J50450F8160
$$ 34706 -227001 -278339 207297 -177560 39858 -34179 142429 -363355 -212905 68160
12996g8860A07436M7676G080i2521B87963r5530o5807J78072a28786e2956j97570
$$ -78860 107436 155112 7080 -92521 287963 192433 126626 304698 -128786 -52956 -250526
12985b50526M2251D3045e8618C20060A58417c6478q2856C10402A42480J15710
$$ -250526 -208275 43045 -58618 320060 158417 -36478 -119334 310402 142480 258190
12975B58190a13353j16906i8532p2242c7718j19419G2565c4032D40985A04565
$$ 258190 -113353 -230259 -98532 -170774 -37718 -157137 72565 -34032 440985 104565
12964A40643E3935L2360a1144A72275h576k54049b6555A33067F1685c2603A32546
$$ 140643 53935 86295 -11144 172275 -8576 -262625 -26555 133067 61685 -32603 132546
12952a84995A09548N1990B7123b76275F8699K545K47323r3711C4891Q7860c35491
$$ -184995 109548 161538 27123 -276275 68699 71244 318567 224856 34891 122751 -335491
12940A52292E2806J4682j1201J00379G1422a85166K8481f041r7099j37674e7269
$$ 152292 52806 67488 56287 156666 71422 -185166 -156685 -6041 -103140 -240814 -57269
12928a94770C7662a02541b464q0351K9544A7768J1186j4420e5908r7974A05945
$$ -194770 37662 -102541 -2464 -82815 -53271 17768 28954 14534 -55908 -153882 105945
12916G0285L21798h0674m946A30105J5641N3665m8688N9018a65914b5508B27887
$$ 70285 392083 -80674 -85620 130105 145746 199411 150723 209741 -165914 -25508 227887
12904A19280Q1858A3972b09700B21292o6981h5151C8778b30354H9061j5327c36854
$$ 119280 201138 13972 -209700 221292 154311 -85151 38778 -230354 89061 73734 -336854
12892f7921k4813G9870A6368J33766a47952j2087A98636a15369m52468B22402
$$ -67921 -92734 79870 16368 150134 -147952 -160039 198636 -115369 -567837 222402
12881B32603r2118J7137k2968b68368B5926b6783I6110e4573A9751g0489E5180
$$ 232603 140485 157622 134654 -268368 25926 -26783 96110 -54573 19751 -70489 55180
12869i8950r5328C13602A48160M6175b01580R5571j10460a5653K004A1749a68082
$$ -98950 -194278 313602 148160 194335 -201580 -106009 -216469 -15653 -13649 11749 -168082
12857B23205r7546d32254A40554C2642L6359K8903a68471C7726h5679a9687A8669
$$ 223205 125659 -432254 140554 32642 69001 97904 -168471 37726 -85679 -19687 18669
12845e42163A19485i4069d6211B6412J76081c1514B15294a85714O429B73204E3717
$$ -542163 119485 -94069 -46211 26412 202493 -31514 215294 -185714 -179285 273204 53717
12833H2672L0925l6318a79546C4282P201l566K36508j05460E6255O1291M7992
$$ 82672 113597 77279 -179546 34282 41483 37917 274425 168965 56255 117546 165538
12822A65538L5010m2297N5741a59227r1737E6280b52401I0886r733O8281J0245
$$ 165538 200548 158251 213992 -159227 -250964 56280 -252401 90886 81153 149434 159679
12811A59679K02622A49881a2015j37785f3040A59002m5657B5498K30632c6347
$$ 159679 362301 149881 -12015 -149800 -63040 159002 113345 25498 256130 -36347
12800A42567o0756a14241a3316E8387J43167I6762j2613J88862A28769a38474
$$ 142567 81811 -114241 -13316 58387 201554 96762 84149 273011 128769 -138474
12789b9764I7773c91366B7935a39597B72413G1723L7574c6435C3548R630h0214
$$ -29764 97773 -391366 27935 -139597 272413 71723 109297 -36435 33548 43178 -80214
12777b3829k14030c758C15358B4687i9118A27138a08631A32517a05829c04q2256
$$ -23829 -237859 -3758 315358 24687 -99118 127138 -108631 132517 -105829 -304 -82560
12766h2560k31861M1206O484c522F1671h9648n191L4155k6960c4665A13724K94
$$ -82560 -314421 -273215 -266731 -3522 61671 -89648 -94839 -60684 -87644 -34665 113724 114018
12754A14018a69487B84698L3113J33370E4059J02221c04967A32595J6204r067
$$ 114018 -169487 284698 317811 451181 54059 156280 -304967 132595 148799 139732
12744A39732a98165h1841j47279b1187B45873j22592o882d6826A94683q1239b23781
$$ 139732 -198165 -81841 -229120 -21187 245873 123281 116399 -46826 194683 113444 -223781
12732e9865D52868c19168d45j75112H3908l0407J21907a50718d2804A38801K13
$$ -59865 452868 -319168 -445 -175557 83908 53501 175408 -150718 -42804 138801 139014
12721A39014a26153G8794d4095A15709a62468A18512K7708f0926k1607l7089l39548
$$ 139014 -126153 78794 -44095 115709 -162468 118512 146220 -60926 -82533 -119622 -459170
12710d59170C31171p0751m6482a01155A46293n3256M60709a99067M3331k047A38679
$$ -459170 331171 260420 213938 -101155 146293 93037 553746 -199067 -155736 -157783 138679
12698B7458J1325a75229f7147B04461A01038a81466g0409H0249h0420K9005n9339
$$ 27458 38783 -175229 -67147 204461 101038 -181466 -70409 80249 -80420 -51415 -110754
12687a10754a5882E8923K9432b39379a05547B1445J31473a20595C0669k426a39133
$$ -110754 -15882 58923 88355 -239379 -105547 21445 152918 -120595 30669 28243 -139133
12675a36340J9393e2476B64188J8120a48219j8905E5048J4294J90183e9629b9350
$$ -136340 -116947 -52476 264188 282308 -148219 -167124 55048 69342 259525 -59629 -29350
12663B31663C9239J8866k4563h1148k1054A04633Q9531l1707c60733B36511D6680
$$ 231663 39239 58105 33542 -81148 -102202 104633 194164 162457 -360733 236511 46680
12651B27313E9878d2410B40546i7532C03964a79528H8339a07610d542A65494d6614
$$ 227313 59878 -42410 240546 -97532 303964 -179528 88339 -107610 -4542 165494 -46614
12639a73438p168A15240g8761G2987B9103M9879d19187A29742K05149A14132e9321
$$ -173438 -180606 115240 -78761 72987 29103 78982 -419187 129742 334891 114132 -59321
12627C33270d55289a46381C35452d194j85609B35884a89981D0570a69251e5392
$$ 333270 -455289 -146381 335452 -4194 -189803 235884 -189981 40570 -169251 -55392
12616b33576b8178n4529F324b1142A78018a22460A69681b45657A52297o9186c1199
$$ -233576 -28178 -82707 6324 -21142 178018 -122460 169681 -245657 152297 83111 -31199
12604A81103a62809A88531O5880H8279J45546a65969k2939Q7033j35991g0639
$$ 181103 -162809 188531 254411 88279 233825 -165969 -188908 -101875 -237866 -70639
12593B1044K80201h3236b0591n3445j29315b5578A74456e6819O415A34517a96773
$$ 21044 301245 -83236 -20591 -74036 -203351 -25578 174456 -56819 -50404 134517 -196773
12581c82196b5876L652A90199a67135A96701b69897a13336d8994A87359O5733
$$ -382196 -25876 -22224 190199 -167135 196701 -269897 -113336 -48994 187359 253092
12571B53092F088N2362b3235r7867A55235a39666j26219a1239A04473a69377C1776
$$ 253092 6088 58450 -23235 -121102 155235 -139666 -265885 -11239 104473 -169377 31776
12559e5409E7786b07618A67555b45365Q1758J7554A74389o532d9354A6417e15631
$$ -55409 57786 -207618 167555 -245365 -163607 -146053 174389 167857 -49354 16417 -515631
12547a73925N0197N90e3481l10202a65986g7981b199G5259B9736e9562b6521B02087
$$ -173925 -123728 -123138 -53481 -363683 -165986 -77981 -2199 75259 29736 -59562 -26521 202087
12534h8054H663b29529I358a67004e748B39455d68482a06291B0506J02784c1811
$$ -88054 8663 -229529 9358 -167004 -5748 239455 -468482 -106291 20506 123290 -31811
12522A05234L8679a27347M7707J0832D2296R1119R4329d0241k6043A27297A4408
$$ 105234 143913 -127347 -79640 -68808 42296 133415 227744 -40241 -66284 127297 14408
12510A12358a1977B9701K3933M252B5038O4752a80155j04088E2601k3281J33407
$$ 112358 -11977 29701 53634 57886 25038 89790 -180155 -284243 52601 29320 162727
12499A62727K85758C1563a48917k9349C0423A2931d05248J08911B61e4063A51307
$$ 162727 448485 31563 -148917 -178266 30423 12931 -405248 -296337 261 -54063 151307
12487b20469J06362m0991D09863b39433M9143B57150A13566i2702C03148f6569
$$ -220469 -114107 -155098 409863 -239433 -190290 257150 113566 -92702 303148 -66569
12476A49480c69741f070G2480R073a63982P8892q0285I3707O3899a34942H0840
$$ 149480 -369741 -6070 72480 81553 -163982 -85090 -165375 93707 157606 -134942 80840
12464h9234j13590I9649N2997E8769a53260k9791f7781H9920b60321C2346J3810
$$ -89234 -202824 99649 152646 58769 -153260 -183051 -67781 89920 -260321 32346 46156
12453D6156P6825h7544k3488H7953a95673A17249K05666i0513B31762e3242A5200
$$ 46156 122981 -87544 -111032 87953 -195673 117249 322915 -90513 231762 -53242 15200
12441e9787J6834r5774b4120E836J64661q3812B3566a50520A41391c34258A5154
$$ -59787 -42953 -138727 -24120 5836 170497 86685 23566 -150520 141391 -334258 15154
12429A48081b89586a24475B9032a2805I9146i3667C41610f5707A22501b73565
$$ 148081 -289586 -124475 29032 -12805 99146 -93667 341610 -65707 122501 -273565
12418A69163C8148M7381b83621Q0886K4572j2753B4811a07656k97784g0754l044
$$ 169163 38148 85529 -283621 -202735 -178163 -190916 24811 -107656 -405440 -70754 -73798
12407g3798H7835f0990B36531l120B0416O3070b17049I2723b51005q8181n8656
$$ -73798 87835 -60990 236531 233411 20416 83486 -217049 92723 -251005 -339186 -397842
12396c97842A0725c82561a78295b4874C0745J27841b1940O484B14111E9767a35967
$$ -397842 10725 -382561 -178295 -24874 30745 158586 -21940 -15456 214111 59767 -135967
12384b4045A7484M31409D8158d7092B5582h6072C8842J9153O0699d3773A51092
$$ -24045 17484 448893 48158 -47092 25582 -86072 38842 57995 118694 -43773 151092
12372a8006o5247B38784j05579b2967A4716J28859L18639a55909I9270K91N0876
$$ -18006 -83253 238784 133205 -22967 14716 143575 462214 -155909 99270 99561 150437
12361A50437d0902D4680J02774M9420n3691J6332M5140L8265F0559M4397c8692
$$ 150437 -40902 44680 147454 196874 143183 159515 204655 242920 60559 104956 -38692
12349a55806A966b35196A64711n9073A5713J44963n405L0735H5974A4771a940
$$ -155806 1966 -235196 164711 105638 15713 160676 155271 186006 85974 14771 -1940
12337h4348n3051A22418J29290G0543A0032J70793N8399r140b8842n0978B30777
$$ -84348 -137399 122418 251708 70543 10032 180825 239224 230084 -28842 -79820 230777
12325D1067K49620g7210C51066k7310a51977C04547A46898L7727q9759N0037o8878
$$ 41067 290687 -77210 351066 323756 -151977 304547 146898 184625 94866 144903 76025
12314G6025r373J26379g6033b9773D8911J00848O6747l8934b08912A15862E1483
$$ 76025 66652 193031 -76033 -29773 48911 149759 216506 177572 -208912 115862 51483
12302c440C9205O3896J1074J60381o2401B5460c6766B63315e5363b274D9476a27157
$$ -3440 39205 103101 114175 274556 212155 25460 -36766 263315 -55363 -2274 49476 -127157
12289G3637b24685e4606j3722j95490F8705k9520j6631J81475H5640Q4476a58339
$$ 73637 -224685 -54606 -68328 -263818 68705 39185 22554 204029 85640 170116 -158339
12277d7453o5803k06920P2868H5489M9731d7271A39813C4795a20404q8001B2611
$$ -47453 -113256 -320176 -247308 85489 135220 -47271 139813 34795 -120404 -208405 22611
12265A59988b95242A85074B682b16097N9960A71422H5178C771P5272A8360a91025
$$ 159988 -295242 185074 2682 -216097 -156137 171422 85178 3771 79043 18360 -191025
12253a75586r3418A21074e1829B41849j5122p4170a27942A12289J09846f6695
$$ -175586 -269004 121074 -51829 241849 226727 152557 -127942 112289 222135 -66695
12242c05312d4622j71277B21779E2548a10587C06376D5083a54029b8337a4116
$$ -305312 -44622 -215899 221779 52548 -110587 306376 45083 -154029 -28337 -14116
12231F1701c8069D33138A47474J08398A19622A1138a95552A5770a59057b2510
$$ 61701 -38069 433138 147474 255872 119622 11138 -195552 15770 -159057 -22510
12220E3359O8749C453a53212b493A58740p296p2118L52154I8571J65635C2133
$$ 53359 122108 3453 -153212 -2493 158740 151444 79326 431480 98571 264206 32133
12208B28801I3092c6588B00434C8809K76299a52724a0131A80112c6102B91741
$$ 228801 93092 -36588 200434 38809 315108 -152724 -10131 180112 -36102 291741
12197A66450J50959j35964J37502A55153J53571g3720F9402b09384A73676k7848
$$ 166450 317409 181445 318947 155153 308724 -73720 69402 -209384 173676 145828
12187A45828Q2646l2471K33941B14295L60129E6489q390n699K93091E4544L01591
$$ 145828 228474 196003 429944 214295 574424 56489 48099 42400 335491 54544 356135
12176C56135A15489h8239G9722O0302a30510B5434J42296o9750a03644B33885
$$ 356135 115489 -88239 79722 140024 -130510 25434 167730 97980 -103644 233885
12165e6116A78916D8568J07252a51148A93005F7701K8078j8770c5360A88989F0240
$$ -56116 178916 48568 155820 -151148 193005 67701 95779 77009 -35360 188989 60240
12153B44238C7269b06177G2377a08504j35460E5550N385c3340C76765a95725a4482
$$ 244238 37269 -206177 72377 -108504 -243964 55550 60935 -33340 376765 -195725 -14482
12141a20479a151A8222N3659J78859m9338K55966i7251F8720K92712A04600R9799
$$ -120479 -1151 18222 71881 250740 201402 457368 -97251 68720 361432 104600 204399
12130B04399m5905P7656m9815G9362A982J70955K63772F2519m265e1606E185j399
$$ 204399 158494 236150 186335 79362 1982 172937 436709 62519 58254 -51606 5185 3786
12118C786K1632N5547N6525K48377D2646M9576K17536A33434H670c9460B15303
$$ 3786 25418 80965 137490 385867 42646 92222 309758 133434 8670 -39460 215303
12106C51725B7636O5083d113C5943e6502A17521n8688m006b01883B35047h0101
$$ 351725 27636 92719 -4113 35943 -56502 117521 58833 54827 -201883 235047 -80101
12094b6991D4346B2043J28870f8891l2247E0036J59282g4403L3834l7820A53600
$$ -26991 44346 22043 150913 -68891 -101138 50036 209318 -74403 -40569 -78389 153600
12082A56189a09775H1700J1017Q106p436a18804A74268i4056I5818a6053k10041
$$ 156189 -109775 81700 92717 100823 93387 -118804 174268 -94056 95818 -16053 -226094
12071b26094A06576M1855a53175J7179j2060J7628L1588j61115C2842J7961d3596
$$ -226094 106576 148431 -153175 -135996 -148056 -130428 -98840 -259955 32842 50803 -43596
12059I2591B9134a11569N5738l9160C9977P5482k7989d8860C33873C7742a05108
$$ 92591 29134 -111569 -55831 -94991 39977 115459 87470 -48860 333873 37742 -105108
12047i3956H7187K03989A11366a2978l8836E1687g1854A06905a8744j04909j8578
$$ -93956 87187 291176 111366 -12978 -51814 51687 -71854 106905 -18744 -123653 -142231
12036a42231N4299n8161C04862f9900B00605a14514H2733e1640A05987a40255
$$ -142231 -87932 -146093 304862 -69900 200605 -114514 82733 -51640 105987 -140255
12025a23859K0321j73188J4715A5035a87089L1971O0313A35396R4754a00073E259
$$ -123859 -103538 -276726 -262011 15035 -187089 -155118 -94805 135396 230150 -100073 5259
12013A65556e0035D0070g7853j13327N9201C79908D7543i1174K0831A27351J0515
$$ 165556 -50035 40070 -77853 -191180 -131979 379908 47543 -91174 -70343 127351 137866
12002A37866A741b02927P3667l53354A59052R1055i9876B43777l1438n5382d40900
$$ 137866 1741 -202927 -129260 -482614 159052 250107 -99876 243777 212339 156957 -440900
11990b61400N2653A655a49449p3590A46977c57475i7814j30747D3954K46604c68404
$$ -261400 -208747 1655 -149449 -223039 146977 -357475 -97814 -228561 43954 290558 -368404
11978b5606m6147C6182d2413J1230m25564a93562f5299J948K7032j70773I613
$$ -25606 -71753 36182 -42413 -31183 -456747 -193562 -65299 -63351 -36319 -207092 9613
11966C319b37182c6356B7907b87675A97953f6227Q305j00336j80924A56905l3652
$$ 3319 -237182 -36356 27907 -287675 197953 -66227 -57922 -158258 -339182 156905 123253
11955A23253b66694D7530b14482e9380f052E147h2328j7643j11014A02O3780d00473
$$ 123253 -266694 47530 -214482 -59380 -6052 5147 -82328 -99971 -210985 102 63882 -400473
11942B86187E9835a69057q2654H7515A2444L86582B8542a49184F578a04924C7263
$$ 286187 59835 -169057 -251711 87515 12444 399026 28542 -149184 6578 -104924 37263
11930D0646b62712d0852C27857c4205D0601J4909b96734a14673q8125d3305A54739
$$ 40646 -262712 -40852 327857 -34205 40601 55510 -296734 -114673 -202798 -43305 154739
11918F1308a05973F1649a95523A88106m5177a60386M7441j07736F0321J90512
$$ 61308 -105973 61649 -195523 188106 142929 -160386 -112945 -220681 60321 250833
11908B50833c9316k08078f9752k199q5370E2122J0805d30416b12863D2243J63779
$$ 250833 -39316 -247394 -69752 -71951 -157321 52122 62927 -430416 -212863 42243 206022
11897B06022d8658B5095J55086L72d9509k5990B72323q5206c67484c7105J340
$$ 206022 -48658 25095 180181 180553 -49509 -75499 272323 187117 -367484 -37105 -35765
11886c5765a3228k9848G9181a93836f3066D259a92918A20720e6317H3735a10487
$$ -35765 -13228 -43076 79181 -193836 -63066 4259 -192918 120720 -56317 83735 -110487
11874A6880a85783M4540l9905A41503C8223a78281B10004c24651h9085E4065K4068
$$ 16880 -185783 -141243 -181148 141503 38223 -178281 210004 -324651 -89085 54065 78133
11863G8133b15308J9213P5817j11792G8559a22518B18225a46775J6241k16661
$$ 78133 -215308 -196095 -120278 -232070 78559 -122518 218225 -146775 -130534 -347195
11853c47195b1402a0291j29017f7810j53409B69364b34712J12390L8219k04976
$$ -347195 -21402 -10291 -139308 -67810 -221219 269364 -234712 -122322 -84103 -289079
11843b89079B43746a23233k62768C8836c5180k36830B23903D7205c615j5872j29395
$$ -289079 243746 -123233 -386001 38836 -35180 -272010 223903 47205 -3615 -19487 -148882
11832a48882A17658b47648B8252J19560g9611N579p2257M733d7034R331D18149
$$ -148882 117658 -247648 28252 147812 -79611 -74032 -146289 -141556 -47034 -37703 418149
11820a4932l45533J38185b1349r019A41211a84874K7407e0053j9187a085o4331
$$ -14932 -360465 -222280 -21349 -30368 141211 -184874 -157467 -50053 -69240 -1085 -65416
11809f5416B85083a88421H4437i1459C0636R8962a35352l8934g9652j07066G4858
$$ -65416 285083 -188421 84437 -91459 30636 129598 -135352 -174286 -79652 -186718 74858
11797h5020D7955b34158d9836E6397e0429l0026n5555k1065B13229a53080b122
$$ -85020 47955 -234158 -49836 56397 -50429 -80455 -136010 -157075 213229 -153080 -2122
11785G3786J98084a30768l0220j13969O6552m88028A1758J2175m775M7529M2974
$$ 73786 271870 -130768 -160988 -274957 -208405 -696433 11758 23933 19158 66687 109661
11774A09661k7604e3076E1979a701B6808b10595A037g2189D2910i396n9179j00566
$$ 109661 82057 -53076 51979 -1701 26808 -210595 1037 -72189 42910 -9396 -68575 -169141
11762a69141P1590I7056G992b60272R4655A01038a86887i0404E7197c4184k1164
$$ -169141 -97551 97056 7992 -260272 -165617 101038 -186887 -90404 57197 -34184 -55348
11751e5348B4188c8570k64251j1365D159J323L06496O5584E6776j7042a66777
$$ -55348 24188 -38570 -302821 -314186 4159 5482 311978 377562 56776 39734 -166777
11739a15257G6699P239b65604b760o3328l32172G7829d4457r0066D2356a14467
$$ -115257 76699 83938 -265604 -2760 -66088 -398260 77829 -44457 -134523 42356 -114467
11727a3726C48119c00178H9809J59194a19897N9169k91217h8359K5025j29642
$$ -13726 348119 -300178 89809 249003 -119897 -60728 -351945 -88359 -63334 -192976
11717a92976a5388j11198j03735d7322C5339a58475O6245F5292a82107C23586
$$ -192976 -15388 -126586 -230321 -47322 35339 -158475 -92230 65292 -182107 323586
11706c24271H0737l3910g5148A89901h8050k11599A62776b6928H1319N6663g5782
$$ -324271 80737 46827 -75148 189901 -88050 -299649 162776 -26928 81319 137982 -75782
11694g4580K334B33452E6175e4004A53209o8710R962b27762j24091J13009h2946
$$ -74580 -72246 233452 56175 -54004 153209 84499 94461 -227762 -351853 -238844 -82946
11682G9873B2788J29133a05942j42889b7916k03175D128a5235I3431b24511k18388
$$ 79873 22788 151921 -105942 -248831 -27916 -231091 4128 -15235 93431 -224511 -442899
11671d42899a15966a7617C7441a59356B04825b38227A70474a27229M1950A49078
$$ -442899 -115966 -17617 37441 -159356 204825 -238227 170474 -127229 -85279 149078
11660A42258a60258P2966C6041L72392c40796Q5802A65101a98109b1251H3347
$$ 142258 -160258 -87292 36041 408433 -340796 -254994 165101 -198109 -21251 83347
11649i668o0132L005B26367c27604c1305J2757j06287j88140J38244B29260n3450
$$ -9668 -69800 -66795 226367 -327604 -31305 -18548 -124835 -312975 -174731 229260 175810
11638A75810a14398l1278H7482b11388C0254J18214f4957B2581O7456h7667K8117
$$ 175810 -114398 -145676 87482 -211388 30254 148468 -64957 22581 90037 -87667 -59550
11627e9550l1819k5840C9521c8234m5209j04638F2487b38174r9579e3287J4193
$$ -59550 -91369 -117209 39521 -38234 -83443 -188081 62487 -238174 -337753 -53287 -39094
11616c9094j18823D80332F3091c11051I2996g7416r1025A31658a80337B30313
$$ -39094 -157917 480332 63091 -311051 92996 -77416 -168441 131658 -180337 230313
11605d355m9718B7992b49340e6157H8171g9520l48243a92708n4458H0023n211
$$ -4355 -54073 27992 -249340 -56157 88171 -79520 -427763 -192708 -247166 80023 74812
11594G4812g2253A55021c70774B3830g8385B11180q7186e0903A5594a39046e4145
$$ 74812 -72253 155021 -370774 23830 -78385 211180 123994 -50903 15594 -139046 -54145
11582e4936i372C5914h5543A08484a77630K7154o4625M8544A00058B8704e4523
$$ -54936 -9372 35914 -85543 108484 -177630 -150476 -215101 -166557 100058 28704 -54523
11570G8603a67491F8636b8106J1405r0844A67482M0347c6964R948q3400I1604
$$ 78603 -167491 68636 -28106 -16701 -107545 167482 207829 -36964 -27016 -110416 91604
11558C3939a30199I8811H938a36075O3214B9896b20597n1259L1816a2909A98522
$$ 33939 -130199 98811 8938 -136075 -72861 29896 -220597 -271856 -240040 -12909 198522
11546A72528d63417d2495l7520A5373a32157j85655a10645B19777a44402l8736
$$ 172528 -463417 -42495 -80015 15373 -132157 -317812 -110645 219777 -144402 -183138
11536a83138j86784J03134A85376b70266h0176J7860D1379K58593a22559f0548
$$ -183138 -369922 -266788 185376 -270266 -80176 -62316 41379 299972 -122559 -60548
11525B00967F726b7268C03754j04651a60905f4378B05175a3331j46817j15895
$$ 200967 6726 -27268 303754 199103 -160905 -64378 205175 -13331 -160148 -276043
11515b76043A85647d1301B70086a25582B94788L5782h6891K1206G6405R106j6005
$$ -276043 185647 -41301 270086 -125582 294788 330570 -86891 -65685 76405 85511 69506
11504F9506K61066q0603a97180a6504p4929j9394l20964a35406d6303G530b4475
$$ 69506 330572 249969 -197180 -16504 -91433 -110827 -431791 -135406 -46303 7530 -24475
11492D022K67055e2145A52820F6075a53719I5876R1995c1263C3039a20373A86387
$$ 4022 271077 -52145 152820 66075 -153719 95876 187871 -31263 33039 -120373 186387
11480D55595D2501M6726d6501l9012B27556c4987D13889a5909A76980G5281J07348
$$ 455595 42501 89227 -46501 -85513 227556 -34987 413889 -15909 176980 75281 182629
11469A82629D5523a06923D3029J70836F1120A8236a16897C1007N2433a21369j5361
$$ 182629 45523 -106923 43029 213865 61120 18236 -116897 31007 83440 -121369 -136730
11458a36730D05812e8280p3277H5627N5664P0329I7068f3392B2288g1724j7010
$$ -136730 405812 -58280 -131557 85627 141291 211620 97068 -63392 22288 -71724 -88734
11447h8734k79273A38198f3460C936d31149B38185a20415K3026F2346c87346c0951
$$ -88734 -368007 138198 -63460 3936 -431149 238185 -120415 -97389 62346 -387346 -30951
11435A55638B3890J41019a95616h9556D8277d0224j4465L511n1927A49088K12349
$$ 155638 23890 164909 -195616 -89556 48277 -40224 -54689 -51178 -103105 149088 361437
11424C61437b44694J00500H060M7977M6958k1893a58119A66896K1403F2289b99629
$$ 361437 -244694 -144194 8060 56037 102995 81102 -158119 166896 188299 62289 -299629
11412B2650g4349k2410H3258a2662p4832j8071B12600c12522g4621C3862J16925
$$ 22650 -74349 -96759 83258 -12662 -87494 -105565 212600 -312522 -74621 33862 150787
11401A50787a76405k34154a90929G6200a21254k6953q132A10184J13115d9969
$$ 150787 -176405 -410559 -190929 76200 -121254 -148207 -156339 110184 223299 -49969
11390a12588j52049b580n5273j1641b1796j13794j2392N0466o0513E1677c48021
$$ -112588 -264637 -2580 -57853 -69494 -21796 -135590 -147982 -97516 -158029 51677 -348021
11378b24898A43307a30894f025B33310I0628l7286a57523q5280B81631c43889
$$ -224898 143307 -130894 -6025 233310 90628 53342 -157523 -242803 281631 -343889
11367a45670j16491a08015J8753j16624j64822a39838C9691f5678E7558a62278
$$ -145670 -262161 -108015 -89262 -205886 -370708 -139838 39691 -65678 57558 -162278
11356a00028j03051K1382p7290b3934n2123j26932A20872k2382e0275n9538B51434
$$ -100028 -203079 -181697 -258987 -23934 -76057 -202989 120872 98490 -50275 -109813 251434
11344E4785a67722N0983D8194b66079J1757J26028C5558l99c2102B15396i8232
$$ 54785 -167722 -116739 48194 -266079 -254322 -128294 35558 35159 -32102 215396 -98232
11332H1818b0436I5985m3286M6658l5267a05671P235B14893j0737b31734E9049
$$ 81818 -20436 95985 52699 99357 64090 -105671 -98436 214893 204156 -231734 59049
11320e9625C9642e0166L405j5179b9065B7632b2376k15011A95287J4595b63725
$$ -59625 39642 -50166 -46761 -61940 -29065 27632 -22376 -237387 195287 209882 -263725
11308A27289b2152k05962A68153A5646a64722f4547b6307j24104O7803j29216
$$ 127289 -22152 -228114 168153 15646 -164722 -64547 -26307 -150411 -82608 -211824
11298b11824A91645B1943M71444h6114I0992m0718b49569e5932k3470j70860J18857
$$ -211824 191645 21943 493387 -86114 90992 50274 -249569 -55932 -79402 -250262 -131405
11287a31405M7331M1584A37228a51243L7771j68773i4144j3834o2393P2510l28444
$$ -131405 -84074 -42490 137228 -151243 -113472 -282245 -94144 -107978 -170371 -97861 -426305
11276d26305C1818h6771k56481a50625P4469L0068l86892d1369j53248d9692A24402
$$ -426305 31818 -86771 -343252 -150625 -76156 -46088 -432980 -41369 -194617 -49692 124402
11264a15069n0369R78E3868h3558b4328D32084E2663a11996h148j36948d6709
$$ -115069 -165438 -164460 53868 -83558 -24328 432084 52663 -111996 -8148 -145096 -46709
11252c22463A7936c82699h2153A4352b25256F8687B0652i265C7608a09185G3222
$$ -322463 17936 -382699 -82153 14352 -225256 68687 20652 -9265 37608 -109185 73222
11240b26812H4301R1681H0425d8056B6627J50647I144a94855b9491j68600C87682
$$ -226812 84301 175982 80425 -48056 26627 177274 9144 -194855 -29491 -198091 387682
11228a93506m7030Q3481P2907q9904C44500j35799F495a84020K9846C46808n4395
$$ -193506 -240536 -157055 -84148 -174052 344500 208701 6495 -184020 -154174 346808 292413
11217B92413j44895b52743B37905N393j2818a02033E4766h0948B1394N047a83677
$$ 292413 147518 -252743 237905 243298 230480 -102033 54766 -80948 21394 26441 -183677
11205A9973K87173b1528j2040D4684P5287J58983b3774A70084f5404k59887g5454
$$ 19973 307146 -21528 -33568 44684 119971 278954 -23774 170084 -65404 -325291 -75454
11193a27428r8925P0031A26710e8443j68508A03388P6919f0531B04321F3573h8425
$$ -127428 -226353 -156322 126710 -58443 -226951 103388 180307 -60531 204321 63573 -88425
11181b00470j19071d2375o060k13307e7421b2099D1744b78070J09590d9128A4527
$$ -200470 -319541 -42375 -48435 -261742 -57421 -22099 41744 -278070 -168480 -49128 14527
11169f3650j59083e0378L755B53670a25467q0101n5431a22578F1736a23327e8235
$$ -63650 -222733 -50378 -46623 253670 -125467 -205568 -260999 -122578 61736 -123327 -58235
11157a20042j25772I6102a80142A32025b48695B57444g3408I1656i5826o4135
$$ -120042 -245814 96102 -180142 132025 -248695 257444 -73408 91656 -95826 -159961
11147a59961J8064E192J04984c62979a37783q4383E2883a06300o8993O9142B91486
$$ -159961 -141897 5192 110176 -362979 -137783 -222166 52883 -106300 -175293 -106151 291486
11135E3376f1837K1425D7040J28044p263a09578L808A88211H3400J59960C6861
$$ 53376 -61837 -40412 47040 175084 167821 -109578 -105770 188211 83400 243360 36861
11123a73589D7987N7850J939L325J27780e328H3328j3200a0213A16888b86890
$$ -173589 47987 105837 107776 111101 238881 -5328 83328 70128 -10213 116888 -286890
11111B03874q8739N1242O5206A3013J109O7819i498B42767p2111k9031N1251f9895
$$ 203874 115135 166377 231583 13013 14122 81941 -9498 242767 170656 141625 192876 -69895
11098F4001B788a42806O2782B26568J17143d4360k88A70564l7685K7979J88238
$$ 64001 2788 -142806 -80024 226568 343711 -44360 -44648 170564 132879 160858 349096
11087C49096A67644h5271j13202B0043K64092D5899J95638G7921J13104N1567
$$ 349096 167644 -85271 -198473 20043 284135 45899 241537 77921 191025 242592
11077B42592J47832c9301C0929Q7190r245g9174j30052B31867J44962A34461a8614
$$ 242592 390424 -39301 30929 118119 108874 -79174 -209226 231867 376829 134461 -18614
11065B54490N4798J26134C6747L17827C0352M78388k30895J73244A02495L36258
$$ 254490 309288 435422 36747 354574 30352 508740 277845 451089 102495 438753
11055D38753j59013j28350p1049K34919j22689J7304K75824k30272J94228B22954
$$ 438753 279740 151390 80341 315260 192571 209875 485699 255427 449655 222954
11044E68462o6302j60624p988K75597k44896K62074j86767L73757C78693L3665
$$ 568462 502160 341536 333548 609145 364249 626323 439556 813313 378693 412358
11034D12358O68J62512n4560J83390C23355J25981k24572M38760k67667O969j31483
$$ 412358 413026 575538 520978 704368 323355 449336 224764 663524 395857 402826 271343
11023B71343J89735L25366q6899k84115m1482J21946B41715K91310j38088K30266
$$ 271343 461078 786444 699545 415430 373948 495894 241715 533025 394937 625203
11013F25203k84657J65245k12470J2286N0686o0798R2661F1537J47591j2721J69803
$$ 625203 340546 505791 293321 305607 356293 295495 388156 61537 209128 196407 366210
11002C66210j16440J07652j27292J71104J85472j07365j89663A17986M24889j40488
$$ 366210 249770 357422 230130 401234 586706 479341 289678 117986 542875 402387
10992D02387j08117A17347J18076r8106L87652A19659J92481J27079A61474J15317
$$ 402387 294270 117347 235423 137317 524969 119659 312140 439219 161474 276791
10982B76791J90825j08276R6892n0032j60097N3573L43867k97921K45734L0899
$$ 276791 467616 359340 456232 406200 246103 299676 643543 345622 591356 622255
10972F22255K35134r8678m7437K3348K90557J95999j41043j6912N32556J36791
$$ 622255 857389 758711 711274 734622 1025179 1221178 1080135 1063223 1595779 1732570
10962A732570j61666L26188L52273n07806j9368k79821o5909m16913C78405J75624
$$ 1732570 1570904 1897092 2249365 1741559 1722191 1442370 1376461 959548 378405 554029
10952E54029K70242r6413k32802J72624L91878E25971J39323C18932M0055j25562
$$ 554029 824271 727858 495056 667680 1059558 525971 665294 318932 358987 233425
10942B33425Q9667e810C88517n5231l9440a5046q8295D28833a22421A18685K20416
$$ 233425 323092 -5810 388517 333286 293846 -15046 -103341 428833 -122421 118685 339101
10931C39101j45448k6583b10675B25732I9784l5559a89164a5349p6889A74234
$$ 339101 193653 167070 -210675 225732 99784 64225 -189164 -15349 -92238 174234
10920I8223a0153A1039h8161p8766L3997D7605a83366b8525n81H4866A3423a22481
$$ 98223 -10153 11039 -88161 -166927 -132930 47605 -183366 -28525 -29106 84866 13423 -122481
10907A63523a28062a3725G9308m057B0786P8226g9543k4253d0099p4537A21683
$$ 163523 -128062 -13725 79308 75251 20786 99012 -79543 -103796 -40099 -114636 121683
10895C6008c12534J13945i864j56735Q2600E2333Q7050O8955k4056d2490j10963
$$ 36008 -312534 -198589 -9864 -166599 -83999 52333 139383 208338 184282 -42490 -153453
10884a53453b0362D48031E9832o605J56225b34160B93047C3672J68092p7532a10526
$$ -153453 -20362 448031 59832 53227 209452 -234160 293047 33672 201764 124232 -110526
10872a70680B52389d36469h7044k38000A70849b71908A81223d7638l30823J08372
$$ -170680 252389 -436469 -87044 -325044 170849 -271908 181223 -47638 -378461 -270089
10862b70089a10941H0217M5728b0520o0340C5648d73056B2209a15167j52140B6718
$$ -270089 -110941 80217 125945 -20520 -80860 35648 -473056 22209 -115167 -267307 26718
10850a9524B99079G9034K83547j66043d2104A80827K17383H7801J19445G9750
$$ -19524 299079 79034 362581 196538 -42104 180827 398210 87801 207246 79750
10839d51812C0138Q1809a50063j5320A1636a37685q303j08023I802a71631A71982
$$ -451812 30138 111947 -150063 -165383 11636 -137685 -145988 -254011 9802 -171631 171982
10827F859J82380c14394a51851h910I6664c38278g3169A96503a43118A56259a19589
$$ 6859 189239 -314394 -151851 -8910 96664 -338278 -73169 196503 -143118 156259 -119589
10815c25452B04723l8171b398k7645l8763L3560n1044d038k55647b7918j78069
$$ -325452 204723 166552 -2398 -30043 -68806 -35246 -86290 -4038 -259685 -27918 -205987
10804b05987j7431J4947g8343G0108J3700g5040A41748E8485g9530K1873A92067
$$ -205987 -223418 -208471 -78343 70108 83808 -75040 141748 58485 -79530 -57657 192067
10792a54911B83515E6106f9194K5100j0583q5548n3359j68324A11508b77712O3158
$$ -154911 283515 56106 -69194 -44094 -54677 -140225 -193584 -361908 111508 -277712 -214554
10781b14554i1654q1128h4462D7693h375j49999A16500b95405i9427B70628A28426
$$ -214554 -91654 -172782 -84462 47693 -8375 -158374 116500 -295405 -99427 270628 128426
10769a1316k10271A94313a6791n3883r3199N1372q7697e8204a6363b043l50954
$$ -11316 -221587 194313 -16791 -70674 -163873 -112501 -200198 -58204 -16363 -2043 -352997
10758c52997A35244a94296r8389O9215D4583J1866i1676B10837a96821A03733
$$ -352997 135244 -194296 -292685 -223470 44583 56449 -91676 210837 -196821 103733
10747a56462C3083L0497k9126O8488A515c04950k35I018K24797j88b09361M5065
$$ -156462 33083 63580 34454 102942 1515 -304950 -305185 9018 233815 233627 -209361 -164296
10735a64296A82968b01585A60500M7424C7990C344K58448b54312E0529c27659
$$ -164296 182968 -201585 160500 207924 37990 3344 261792 -254312 50529 -327659
10724b00168f642B44811g0654k3642B19398J89375C0763a52677K5250K3479j13291
$$ -200168 -6642 244811 -70654 -94296 219398 408773 30763 -152677 -127427 -103948 -217239
10713b17239A07356l1043P1740i8990h542A90909I1034b40854G8736a63079d2733
$$ -217239 107356 76313 148053 -98990 -8542 190909 91034 -240854 78736 -163079 -42733
10701d6028q7092A46141J19710b34587A0905a16389b343B56487b20932E7023K6386
$$ -46028 -133120 146141 265851 -234587 10905 -116389 -2343 256487 -220932 57023 83409
10690H3409J117c42802J52849P9363k0161j12215k20008C624K9350a55314j09045
$$ 83409 84526 -342802 -189953 -110590 -130751 -242966 -462974 3624 32974 -155314 -264359
10679b64359b2249J019A10517a76761b1712p5983j40114R2723B56663H4144a93371
$$ -264359 -22249 -21230 110517 -176761 -21712 -97695 -237809 -145086 256663 84144 -193371
10667A50603B2961O9524m4127b62989B03181a08309N469m75880A37246C437b73175
$$ 150603 22961 92485 48358 -262989 203181 -108309 -102840 -578720 137246 3437 -273175
10655b92513H1934K7133a82276A71415b41667b9993r595A21599b70385L5491A8529
$$ -292513 81934 109067 -182276 171415 -241667 -29993 -39588 121599 -270385 -234894 18529
10643A63978b79977A31974O3754c19511O9420a05997l9475M1487j92942N6036
$$ 163978 -279977 131974 195728 -319511 -250091 -105997 -145472 -103985 -296927 -240891
10633b40891N2112M9653A15193c5137k02720A31243J01468a16935l8637R116H0108
$$ -240891 -188779 -139126 115193 -35137 -237857 131243 232711 -116935 -155572 -146456 80108
10621a09322o4326B27395a34714k87994a06759n1822o5747E403c0446k30922L5106
$$ -109322 -173648 227395 -134714 -422708 -106759 -158581 -224328 5403 -30446 -261368 -226262
10610b26262A01012J06325l2192A8540M25133a9053A9619a84335B2280e8037k34977
$$ -226262 101012 207337 175145 18540 443673 -19053 19619 -184335 22280 -58037 -293014
10599b93014A63494p9230a56288b1287G1278M2092a31946f0350j40425a6942l9072
$$ -293014 163494 84264 -156288 -21287 71278 113370 -131946 -60350 -200775 -16942 -56014
10588e6014o3517N87P328k18444H6225i451D7776L0458b91690f2260C927a7034
$$ -56014 -119531 -118944 -111616 -330060 86225 -9451 47776 78234 -291690 -62260 3927 -17034
10575d5701k00469b6051C7600a3039l0742F4761a98067B45227q6571l8558a29117
$$ -45701 -246170 -26051 37600 -13039 -43781 64761 -198067 245227 158656 120098 -129117
10563a74332A23453e5590B45899C9276b61703J18741F3037J3811c7930B02022
$$ -174332 123453 -55590 245899 39276 -261703 -142962 63037 76848 -37930 202022
10552I0292h8251A28547F2565A0287e1899j49851C46242b09599R5210l00363A41432
$$ 90292 -88251 128547 62565 10287 -51899 -201750 346242 -209599 -114389 -414752 141432
10540c44148A32675A3896a46054A29995j297k1043J11261B0252N1348i7824j91930
$$ -344148 132675 13896 -146054 129995 128698 107655 218916 20252 71600 -97824 -289754
10529b89754B09099a02922M9385E1560J55740c6998B2271g7713N639J0414A16539
$$ -289754 209099 -102922 -53537 51560 207300 -36998 22271 -77713 -72074 -61660 116539
10517d61484h1616l8416j29959h7861L7113n3566A52158D7896a08704m72663a2928
$$ -461484 -81616 -120032 -249991 -87861 -50748 -104314 152158 47896 -108704 -581367 -12928
10505a16474e4208j42700m0314d1143A01068b21113B91244b4476o9880l6354J5966
$$ -116474 -54208 -196908 -237222 -41143 101068 -221113 291244 -24476 -94356 -130710 -114744
10494a14744N402q7784A750d79744b31998f6756m67091f0714j02024j38299B59009
$$ -114744 -109342 -197126 1750 -479744 -231998 -66756 -533847 -60714 -162738 -301037 259009
10482c79478E2638a20269C576b22324J00807b1532l295l64181A76926H625J23214
$$ -379478 52638 -120269 3576 -222324 -121517 -21532 -24827 -389008 176926 8625 131839
10471A31839J5629b754q9548b5784j21357B11654g2807G0384f933k7214k18654
$$ 131839 147468 -2754 -92302 -25784 -147141 211654 -72807 70384 -6933 -34147 -252801
10460b52801o775g3531B79946e1814D8928J84200b4557B44859a50358C5180R6794
$$ -252801 -259576 -73531 279946 -51814 48928 233128 -24557 244859 -150358 35180 131974
10449A31974B7851P8946d34330j21727A98746L5419A03925b26414N7019B4544
$$ 131974 27851 106797 -434330 -556057 198746 234165 103925 -226414 -169395 24544
10438b66916a1962K574k1400m5865C8600K37459c30876A8189b22950i4517j19316
$$ -266916 -11962 -9388 -30788 -76653 38600 276059 -330876 18189 -222950 -94517 -213833
10427b13833g3637r583j14625R4965j71785I4385j0440a2821C12017l373i0718
$$ -213833 -73637 -83220 -197845 -102880 -274665 94385 83945 -12821 312017 308644 -90718
10415A53722b08176K0510A55514K01061a41766A37834b987A20537J91527c1388
$$ 153722 -208176 -187666 155514 356575 -141766 137834 -2987 120537 312064 -31388
10404C26071j26396E9096a11232n5017L3491N3388j1866H6903J0969a79474E8924
$$ 326071 199675 59096 -111232 -166249 -132758 -79370 -91236 86903 97872 -179474 58924
10392b64239r214A69692B1240J8479K58987a82597J5290j52435b6278C27567c42795
$$ -264239 -273453 169692 21240 39719 298706 -182597 -167307 -319742 -26278 327567 -342795
10380A01598J30649a04774C96435a21369A41565e5240C02228D5790a87371L3786
$$ 101598 232247 -104774 396435 -121369 141565 -55240 302228 45790 -187371 -153585
10370a53585k0907j9288B47149L6256H6642g9729I0230J55353C8699L48809J41128
$$ -153585 -174492 -193780 247149 283405 86642 -79729 90230 245583 38699 387508 528636
10359E28636j85448j31241l9614L10997A56493j1606K38428f9330j54517N7445
$$ 528636 343188 211947 172333 483330 156493 144887 383315 -69330 -223847 -166402
10349a66402g9737K3766A99175K25088K6152M109j82584P819A3050Q2263f7444
$$ -166402 -79737 -55971 199175 424263 450415 454524 271940 279759 13050 95313 -67444
10337A34773A0772R185R6197n6815J65310R2675O0477A62617D5487K32544E8761
$$ 134773 10772 19957 116154 59339 224649 317324 377801 162617 45487 278031 58761
10325D27104B4887a47205o2509G0737j0829R3665M2843F2934i1138A43441J07240
$$ 427104 24887 -147205 -209714 70737 59908 153573 196416 62934 -91138 143441 250681
10314B50681o7822O9640h4738o5473E2935J8301j2584f6650Q846r4510g255p0972
$$ 250681 182859 252499 -84738 -150211 52935 71236 58652 -66650 -57804 -152314 -7255 -78227
10302g8227A39943j2911j4948a98072H522f2768D8768J38461b83546J12187H9896
$$ -78227 139943 127032 112084 -198072 8522 -62768 48768 187229 -283546 -171359 89896
10290e781C8971O9957A4381N607K6826c96613B66083f6428A06033a20514e4928
$$ -5781 38971 108928 14381 19988 46814 -396613 266083 -66428 106033 -120514 -54928
10278c49754h1961n7728p7213d1165k60782o4354a12425o3236d4359G4189i7294
$$ -349754 -81961 -139689 -216902 -41165 -301947 -366301 -112425 -175661 -44359 74189 -97294
10266a95701B16590b54747A85418a67091c0034H2615D021a8289r0108L365L3676
$$ -195701 216590 -254747 185418 -167091 -30034 82615 4021 -18289 -108397 -105032 -71356
10255g1356k20019A60310b55440g9729C20405b81868j33344C3171q660J45039
$$ -71356 -291375 160310 -255440 -79729 320405 -281868 -415212 33171 24511 169550
10245A69550a1640n0422r9151b474k8948r0321j97980b3657C6339c52812e9429
$$ 169550 -11640 -62062 -161213 -2474 -31422 -121743 -319723 -23657 36339 -352812 -59429
10233b2733n2735j48759A98498a23009p351A22650a82068Q6267H9092b74199A49359
$$ -22733 -75468 -224227 198498 -123009 -130360 122650 -182068 -95801 89092 -274199 149359
10221B44978c6014j24268o3001G2550a9140j49832b4144E5977b78858a18999E3205
$$ 244978 -36014 -160282 -223283 72550 -19140 -168972 -24144 55977 -278858 -118999 53205
10209a82916b0606A07285m2596b92762D0314A2904a03834M6211j79701A28184
$$ -182916 -20606 107285 64689 -292762 40314 12904 -103834 -57623 -237324 128184
10198a64298B70365i3859J0813j34001B2008Q2691m7913a68815G2786e6000b828
$$ -164298 270365 -93859 -83046 -217047 22008 104699 56786 -168815 72786 -56000 -2828
10186d39811B61764h4193j01005F85P837N9544P9243f9955l998A01491d6162k06197
$$ -439811 261764 -84193 -185198 685 8522 68066 147309 -69955 -73953 101491 -46162 -252359
10174b52359a10326A44397a13230p2828B97743A19933a41559B3068d3091j66943
$$ -252359 -110326 144397 -113230 -186058 297743 119933 -141559 23068 -43091 -210034
10164b10034L4939d8739B34210b4440q5332A54943G2502J60978p5391J6139p9660
$$ -210034 -175095 -48739 234210 -24440 -109772 154943 72502 233480 158089 174228 94568
10153I4568a87060n7562b8236k23021A0228f6435k69385B60035B5973a17834E9975
$$ 94568 -187060 -244622 -28236 -251257 10228 -66435 -335820 260035 25973 -117834 59975
10141D8460k1610b57038A09760B850f8006l1678d5902j85652L6181d1577j70974
$$ 48460 26850 -257038 109760 2850 -68006 -99684 -45902 -231554 -195373 -41577 -212551
10130b12551b1894I8342c0553P930m0539p9581k7532A3135a64076M0525A05990
$$ -212551 -21894 98342 -30553 -22623 -63162 -142743 -170275 13135 -164076 -123551 105990
10118h0001k56605e6906d25q9004G3351B9882b23308b2682p9217k20236f3904
$$ -80001 -336606 -56906 -425 -89429 73351 29882 -223308 -22682 -101899 -322135 -63904
10106b63101D6937i3352n3813K0877N0568k58505J18945g0616C8898a3121k59731
$$ -263101 46937 -93352 -147165 -126288 -75720 -334225 -215280 -70616 38898 -13121 -272852
10095b72852D1285f163j04302e1265H8476f5066b8768m59661i4116J4482j74361
$$ -272852 41285 -6163 -110465 -51265 88476 -65066 -28768 -488429 -94116 -79634 -253995
10084b53995i1607A23765a38390r3934k1271D06170c5681A9199b4476n2594E74515
$$ -253995 -91607 123765 -138390 -232324 -253595 406170 -35681 19199 -24476 -77070 574515
10072c14552G2541M2909j9025a76585j5340d9277a1669C3301J23639a74683J9151
$$ -314552 72541 115450 96425 -176585 -191925 -49277 -11669 33301 156940 -174683 -155532
10061a55532f0517B04241o8933a26202j19861Q0759O2786A18147a2316I3218a88264
$$ -155532 -60517 204241 135308 -126202 -246063 -165304 -102518 118147 -12316 93218 -188264
10049a48970O7117C03268B9248K2068J74850B0056L4096c6821j92161j18906K5165
$$ -148970 -81853 303268 29248 51316 226166 20056 54152 -36821 -228982 -347888 -322723
10038c22723a54251k22259A97017a79856c8954k91628G22a53443g5561C9560J9581
$$ -322723 -154251 -376510 197017 -179856 -38954 -330582 722 -153443 -75561 39560 59141
10027E9141i9856d5533B69416a16466c5562j50802a5436n8068m5425b207l23990
$$ 59141 -99856 -45533 269416 -116466 -35562 -186364 -15436 -73504 -118929 -2207 -326197
10016c26197H330M028Q3032P7324n3799b7113j22186f7544j79070A57031J29512
$$ -326197 8330 12358 95390 172714 118915 -27113 -149299 -67544 -246614 157031 286543
10005B86543a14628j811B52421a60847a5020j92842i4310J580J7720D7614i4496
$$ 286543 -114628 -116439 252421 -160847 -15020 -207862 -94310 -92730 -75010 47614 -94496
9993A85847a30200G881h1521E1385O3285l0147b03738f3170D8102c24086I1638
$$ 185847 -130200 7881 -81521 51385 114670 84523 -203738 -63170 48102 -324086 91638
9981a22952j4105K195L7089k14615g0038B65999b28653A74513M0177b08784A6384
$$ -122952 -137057 -134862 -97773 -312388 -70038 265999 -228653 174513 214690 -208784 16384
9969A33432a73535N8463b4600k85317b361A6263a06310q8342A4966b06876L7393
$$ 133432 -173535 -115072 -24600 -309917 -2361 16263 -106310 -194652 14966 -206876 -169483
9958a69483M7887d1776B57424F2704b16531i3218B73355b68628E7244f4406L1667
$$ -169483 -121596 -41776 257424 62704 -216531 -93218 273355 -268628 57244 -64406 -32739
9947c2739m9616b989o3153A23108a0983j916q963l80845b450m03798F5031J54730
$$ -32739 -82355 -2989 -66142 123108 -10983 -12899 -21862 -402707 -2450 -406248 65031 219761
9935B19761c3542A10920a06580M8389B8617J45207c15343h4475b932I4790a39501
$$ 219761 -33542 110920 -106580 -58191 28617 173824 -315343 -84475 -2932 94790 -139501
9923a17195I0494b78591j65110b0545k77612a03104c9681j23786B19488F9427
$$ -117195 90494 -278591 -443701 -20545 -298157 -103104 -39681 -163467 219488 69427
9912A75687a56870A0989J2018b24716A36060c8448d186H5249k5179b90571A8143
$$ 175687 -156870 10989 23007 -224716 136060 -38448 -4186 85249 60070 -290571 18143
9900g820o5547C6368g9030j63798A82906a60074K4386B4526g7466n2025A70118
$$ -7820 -73367 36368 -79030 -242828 182906 -160074 -135688 24526 -77466 -129491 170118
9888g1078k00781A23478M7808a81492l2811M3105h4493j14466A4779R6084a91418
$$ -71078 -271859 123478 171286 -181492 -214303 -171198 -84493 -198959 14779 110863 -191418
9876F9678a5538B43959c57592F6880a76431n8288G3427L0453d8362F1070b93551
$$ 69678 -15538 243959 -357592 66880 -176431 -234719 73427 103880 -48362 61070 -293551
9864a21843r834q8229Q2099n31A2747g3711l6414c5506l10160E2411J25980n1230
$$ -121843 -131677 -219906 -137807 -138338 12747 -73711 -110125 -35506 -345666 52411 178391 127161
9852A27161c3564n686A47046a8458J378G2314a28759j52900p427c9200A456J30431
$$ 127161 -33564 -39250 147046 -18458 -17080 72314 -128759 -281659 -289086 -39200 1456 131887
9840A31887a80571p5044J9623D6171J89264i3239l004o1727A37082K0996o8744
$$ 131887 -180571 -255615 -235992 46171 235435 -93239 -96243 -157970 137082 158078 89334
9829H9334i7765m9362A22898a28853H912J07971b37449j13895A40242a87175b6279
$$ 89334 -97765 -147127 122898 -128853 8912 116883 -237449 -351344 140242 -187175 -26279
9817b67817j52377F7288b05075A57275P1411b89089B20168A00362K6180d7158
$$ -267817 -420194 67288 -205075 157275 228686 -289089 220168 100362 126542 -47158
9806c00040q139A197K2267e4264l066I5383b08113a0686F2364Q1266B6975c39626
$$ -300040 -308179 1197 23464 -54264 -57330 95383 -208113 -10686 62364 143630 26975 -339626
9793d1481l45930J04418b9520A14160C9361J80994a94990b2105F1229a56465K2517
$$ -41481 -387411 -282993 -29520 114160 39361 220355 -194990 -22105 61229 -156465 -133948
9782a33948d4774H7437c26436i1056p639m0162c1074E8798a03725B5481a97067
$$ -133948 -44774 87437 -326436 -91056 -98695 -138857 -31074 58798 -103725 25481 -197067
9770b96635o4677a73284A38061e5689K4467D8679K08256c34951e2452j24002R554
$$ -296635 -361312 -173284 138061 -55689 -31222 48679 256935 -334951 -52452 -176454 -166900
9759a66900e0165B1073a95162l2349h2637A03213b13738n6664H8562b98943g8612
$$ -166900 -50165 21073 -195162 -227511 -82637 103213 -213738 -270402 88562 -298943 -78612
9747h9431a7631o884a1331l3428A78083b7262J782l8953A85K17969a2684j72486
$$ -89431 -17631 -24515 -11331 -44759 178083 -27262 -25480 -64433 185 218154 -12684 -185170
9735a85170A30689a11423B2376b14879L7612j9154f235m32896a14209j45012g2856
$$ -185170 130689 -111423 22376 -214879 -177267 -196421 -6235 -439131 -114209 -259221 -72856
9723b04920j01524A56627k3216b40564g1294j11935o6816D0768a39518C4114J24366
$$ -204920 -306444 156627 133411 -240564 -71294 -183229 -250045 40768 -139518 34114 158480
9712A58480N4604h9034l60707G0459J89496A11151J43937j03082h7983D153Q0581
$$ 158480 213084 -89034 -449741 70459 259955 111151 255088 152006 -87983 4153 84734
9701H4734l0421N1080b0108j52m04460F2654d9928j95011c7959q2912C5519b10088
$$ 84734 54313 105393 -20108 -20260 -424720 62654 -49928 -244939 -37959 -120871 35519 -210088
9688b82557a06040C90763A82578p2119a32851L0084A17198a5800J631j62911M3759
$$ -282557 -106040 390763 182578 110459 -132851 -102767 117198 -15800 -14169 -177080 -133321
9677a33321d3546B56789a11561B7864P9175a52694A71013c3257l3030D2582b13486
$$ -133321 -43546 256789 -111561 27864 107039 -152694 171013 -33257 -66287 42582 -213486
9665C51041A0802J07404c33808A97015g6105D0245j6527a61247j62609N8203d1700
$$ 351041 10802 118206 -333808 197015 -76105 40245 23718 -161247 -323856 -265653 -41700
9653b4768A83615H881N7632a9669r2019A02710d2010I6680a02765H0107f4356
$$ -24768 183615 8881 66513 -19669 -111688 102710 -42010 96680 -102765 80107 -64356
9641a83967a3176m2621D7727J18783d9863k20096P5343h2168c9100k837C10138
$$ -183967 -13176 -55797 47727 166510 -49863 -269959 -194616 -82168 -39100 -41937 310138
9629f9204k1551j02205D0546j9595e9132A5827d4774k78250b9421E3907A3837
$$ -69204 -90755 -192960 40546 20951 -59132 15827 -44774 -323024 -29421 53907 13837
9617c64638J71597f3972k39457M548b3807A53903o6265K26308e4713j00593m1583
$$ -364638 -193041 -63972 -303429 -298881 -23807 153903 87638 313946 -54713 -155306 -196889
9606a96889I1303a19635k31561B0878N4182a00764Q614c6495l8428A11750e8099
$$ -196889 91303 -119635 -351196 20878 75060 -100764 -92150 -36495 -74923 111750 -58099
9594A34503L7354a91726C5826b4380m3373B74567H0399f8053E9893b32326c4044
$$ 134503 171857 -191726 35826 -24380 -67753 274567 80399 -68053 59893 -232326 -34044
9582a77604O6075E0163a28828j67958D8027j3750a74085A83034E1333a18612j04138
$$ -177604 -111529 50163 -128828 -296786 48027 34277 -174085 183034 51333 -118612 -222750
9571b22750H8602e1754r8909C9140a07196d8202K3016E139i0306B37285G0706
$$ -222750 88602 -51754 -150663 39140 -107196 -48202 -25186 5139 -90306 237285 70706
9559D7167K27994p5902C0171P4105N414e23943a07569N0351q5001h090r4794b3123
$$ 47167 275161 199259 30171 104276 109690 -523943 -107569 -57218 -142219 -8090 -102884 -23123
9546H5210D1948a50913C15214a72774N0813d8585j22732K8100q5422m5640f7778
$$ 85210 41948 -150913 315214 -172774 -121961 -48585 -171317 -143217 -228639 -274279 -67778
9534C20747a36953A47959B1560a09130E6651J2181d8941j0259m3228k7563E0455
$$ 320747 -136953 147959 21560 -109130 56651 68832 -48941 -59200 -102428 -129991 50455
9522B83195f6813j06903b0860B24804c06721B76043B2602a21504A22409a38236
$$ 283195 -66813 -173716 -20860 224804 -306721 276043 22602 -121504 122409 -138236
9511C5096b22344A60632F6127c1622A48294c60867J77119K8044g4296p6265B73305
$$ 35096 -222344 160632 66127 -31622 148294 -360867 -183748 -155704 -74296 -150561 273305
9499c0887k59970F763Q5372k6316a31631C2219c3697p1617b4934k20872J01739
$$ -30887 -290857 6763 92135 65819 -131631 32219 -33697 -105314 -24934 -245806 -144067
9488a44067N1774I6613a05982g069n5188k9192j32625a03313I9008a77446H1046
$$ -144067 -92293 96613 -105982 -7069 -62257 -91449 -224074 -103313 99008 -177446 81046
9476c00565B58566a98409N1330b020j69270q6499i7698A34199c50249f0604A50758
$$ -300565 258566 -198409 -147079 -2020 -171290 -257789 -97698 134199 -350249 -60604 150758
9464C65298A50960i5598H2881d1302f659F9004h8647j34150j18018B00519G6793
$$ 365298 150960 -95598 82881 -41302 -6659 69004 -88647 -222797 -340815 200519 76793
9452a89775f2633r8604B3825c39664J11101k5229P3044k30554i6216k26183i371
$$ -189775 -62633 -161237 23825 -339664 -228563 -253792 -180748 -411302 -96216 -322399 -9371
9440a95133c1506p4809I5603k5552R893b78094j3054J40476c3512A5556b06463
$$ -195133 -31506 -106315 95603 70051 79944 -278094 -291148 -150672 -33512 15556 -206463
9428H8947J2442d3008j62869A61850e05535b01936A51537a51647d890l3492L375
$$ 88947 101389 -43008 -205877 161850 -505535 -201936 151537 -151647 -4890 -38382 -35007
9417c5007k73524G0220K1614A5861i761j69713N9396A35640k3248C0765a28642
$$ -35007 -308531 70220 91834 15861 -9761 -179474 -120078 135640 112392 30765 -128642
9405a91071c6354j65074i4313c6970j51430A73067b7183p7982A75419a3182A15345
$$ -191071 -36354 -201428 -94313 -36970 -188400 173067 -27183 -105165 175419 -13182 115345
9393A49465E7010b48135B23013f3897j59541F9823K88760a4552j17372o8954G5372
$$ 149465 57010 -248135 223013 -63897 -223438 69823 358583 -14552 -131924 -200878 75372
9381A75025b01583C4315b18940A00775c78241C7015a98646a2060A5812c25559
$$ 175025 -201583 34315 -218940 100775 -378241 37015 -198646 -12060 15812 -325559
9370a70800L1571R529c5823k59137A48689c6857k56325a37209F853a18524C3283
$$ -170800 -139229 -129700 -35823 -294960 148689 -36857 -293182 -137209 6853 -118524 33283
9358c22800A56899K1370b05067M7633M9972d6296j17109L1401A43219c34071B42338
$$ -322800 156899 178269 -205067 -157434 -107462 -46296 -163405 -132004 143219 -334071 242338
9346f2901A58048m8988b7459r9399b2596k12858A20233h8980A03399h5028k09673
$$ -62901 158048 109060 -27459 -126858 -22596 -235454 120233 -88980 103399 -85028 -294701
9335b94701J3249d6034C8198f0832j22776A64563a29887n46B05518a72966A16348
$$ -294701 -281452 -46034 38198 -60832 -183608 164563 -129887 -130433 205518 -172966 116348
9323a23319C04078F1073a10829m31l7194d0605E562O2922F984J84884e3916A01408
$$ -123319 304078 61073 -110829 -111260 -148454 -40605 5562 68484 6984 191868 -53916 101408
9310A22694d9304r7144j96807a6964j13256H3099K05373a68954F4010B687a39129
$$ 122694 -49304 -146448 -343255 -16964 -130220 83099 288472 -168954 64010 2687 -139129
9298E8722a3896q2696F9983c64779J73400j77014o4242b01204R1991B049a5287
$$ 58722 -13896 -96592 69983 -364779 -191379 -368393 -432635 -201204 -109213 2049 -15287
9286h0535b3562n4589l9071B46678B6293h622C2634g8202j05161l1850P9350e4233
$$ -80535 -23562 -78151 -117222 246678 26293 -8622 32634 -78202 -183363 -215213 -135863 -54233
9273B4829a29745D6749J88699c63277a24749I393b49792O6810B73605b46148J562
$$ 24829 -129745 46749 235448 -363277 -124749 9393 -249792 -182982 273605 -246148 -244586
9262b44586a13567a7574A36873J12384H4410i9232L1106A17738b70341a18644
$$ -244586 -113567 -17574 136873 249257 84410 -99232 -68126 117738 -270341 -118644
9251c66319d6036p5251a5534A19181b56778R7063D9334j8587b74540D7745K11642
$$ -366319 -46036 -121287 -15534 119181 -256778 -159715 49334 30747 -274540 47745 259387
9240B59387h5936F2073j0468b345m9777A01632b42481a13907J4910E2193a53832
$$ 259387 -85936 62073 51605 -2345 -52122 101632 -242481 -113907 -98997 52193 -153832
9228F6410i8973p6517q9154D5591c07780a39044A20385E3542e60A14093a09249
$$ 66410 -98973 -175490 -264644 45591 -307780 -139044 120385 53542 -560 114093 -109249
9216d45098a1850r0893j87765a32223D3291i3157A82044a47449C06495c01237
$$ -445098 -11850 -102743 -290508 -132223 43291 -93157 182044 -147449 306495 -301237
9205b20463g8487L1856B34793d16321A06506k9168h4279k77674C1042J29102b39604
$$ -220463 -78487 -46631 234793 -416321 106506 77338 -84279 -361953 31042 160144 -239604
9193a1388A49486o7645d7653j42757N1010B79290a71871h0946k25135O9862B9949
$$ -11388 149486 81841 -47653 -190410 -139400 279290 -171871 -80946 -306081 -236219 29949
9181g8263j8326h824k0698o9647F6994R9564C6837a73470r8203j43276g7484k45737
$$ -78263 -96589 -8824 -29522 -99169 66994 166558 36837 -173470 -271673 -414949 -77484 -323221
9169c23221h4777d2222l5925o2918k7188j32634M4998P8488C2753d32476B55394
$$ -323221 -84777 -42222 -78147 -141065 -168253 -300887 -255889 -177401 32753 -432476 255394
9157A64203b1102j24497A33192a53485K5901B40264h1559F3545i379j99712C3703
$$ 164203 -21102 -145599 133192 -153485 -127584 240264 -81559 63545 -9379 -209091 33703
9145A9545b38373A94779a5350p8013E1552a57609k6449B2008f0043p1372k15840
$$ 19545 -238373 194779 -15350 -93363 51552 -157609 -184058 22008 -60043 -131415 -347255
9134c47255E0089d08198J52771J25433B4739c28687J22706B12187d1990j81892
$$ -347255 50089 -408198 -255427 -129994 24739 -328687 -205981 212187 -41990 -223882
9124b23882j2943B99013H4461c14204d9925C6480b57895m0899c8388j97082h8156
$$ -223882 -236825 299013 84461 -314204 -49925 36480 -257895 -298794 -38388 -235470 -88156
9112B32316a36205A55627b6778j90320A01007J55449I0910b1927k45039A39316
$$ 232316 -136205 155627 -26778 -217098 101007 256456 90910 -21927 -266966 139316
9101a41375e7444A30127m3321A3716b59617B17097A6774Q9555B5033K51569I4771
$$ -141375 -57444 130127 86806 13716 -259617 217097 16774 106329 25033 276602 94771
9089I1036G502J380N4646O65L29750a05434a5900p6746A97520a5514n55848e3731
$$ 91036 7502 8882 63528 64193 393943 -105434 -15900 -92646 197520 -15514 -571362 -53731
9076A69059a39356c8820n5990j2425k805A94236J99272b69079i0407F8080L1779
$$ 169059 -139356 -38820 -94810 -107235 -110040 194236 393508 -269079 -90407 68080 99859
9065I9859Q6941d24504a67017A12215d5216j83982i8657A30862a15081A86561
$$ 99859 186800 -424504 -167017 112215 -45216 -229198 -98657 130862 -115081 186561
9054f2507K1572o2891B666d47012d1198l56805a69665b3701m0421q1017c2449
$$ -62507 -40935 -103826 2666 -447012 -41198 -398003 -169665 -23701 -64122 -145139 -32449
9042E8508L8309h2978A0090N22628b05408r1380A02034a40785G7424d39985b3896
$$ 58508 96817 -82978 10090 532718 -205408 -296788 102034 -140785 77424 -439985 -23896
9030a37954J7009j21607h9552b3405l83096D766J12844b27385j26248A59881o1281
$$ -137954 -120945 -242552 -89552 -23405 -406501 4766 117610 -227385 -353633 159881 98600
9019I8600B2606I462K95556I2397O8906j7620b09907A40796d2859A99210a20154
$$ 98600 22606 9462 305018 92397 161303 143683 -209907 140796 -42859 199210 -120154
9007A16811a2120A58360B0029K9991n31c1380p590j85814d3118j10494B43980
$$ 116811 -12120 158360 20029 50020 49489 -31380 -38970 -224784 -43118 -153612 243980
8995c7445l70316a13337m5069P8168j38424a2417j77583j1617C3272J05268b71920
$$ -37445 -407761 -113337 -158406 -80238 -218662 -12417 -190000 -201617 33272 138540 -271920
8983g4748A71900F6859d3310A26092a67972P8198j4381l59010h2284E7532b84690
$$ -74748 171900 66859 -43310 126092 -167972 -89774 -104155 -463165 -82284 57532 -284690
8971a15719H7589b03921b4162o5697a1356j05531q5107j8021J7078r5474a05528
$$ -115719 87589 -203921 -24162 -89859 -11356 -116887 -201994 -220015 -202937 -298411 -105528
8959A6677P1830a69179B09386a7119j23293E7536P5183a01182b0675A30965o4010
$$ 16677 88507 -169179 209386 -17119 -140412 57536 132719 -101182 -20675 130965 66955
8948F6955A0320b10668e8590j0795E3434a43446k0193n9412C9424f6130K2624
$$ 66955 10320 -210668 -58590 -69385 53434 -143446 -163639 -223051 39424 -66130 -43506
8937d3506k47908O6298E4356R0996P0733a66796D4227J8830J80138c19174J04216
$$ -43506 -291414 -225116 54356 145352 216085 -166796 44227 63057 243195 -319174 -214958
8926b14958b2539H0105d7771C1670b39695f4147J3295F2322a71120F69606N60851
$$ -214958 -22539 80105 -47771 31670 -239695 -64147 -50852 62322 -171120 669606 1230457
8915A230457A70976R6762r0347l1368a13604E8406N9026b26059m4107a25819C1678
$$ 1230457 170976 267738 177391 146023 -113604 58406 117432 -226059 -270166 -125819 31678
8903A45198R623J6309a30286G950J89404p0401a80457j1293L0741j3288f419D1693
$$ 145198 154821 171130 -130286 7950 197354 126953 -180457 -191750 -161009 -174297 -6419 41693
8890e1901I8145b0087B93362f9556A00310b31405g0337m5520A0725c9574H4131
$$ -51901 98145 -20087 293362 -69556 100310 -231405 -70337 -115857 10725 -39574 84131
8878A6739M6176J72556b83490h7102L5381j41653j09375C6371K6163f8825b8610
$$ 16739 62915 235471 -283490 -87102 -51721 -193374 -302749 36371 62534 -68825 -28610
8866A13837b6538F6242g9995C6267d3622H054c6001l43541P7434B36939c36713
$$ 113837 -26538 66242 -79995 36267 -43622 8054 -36001 -379542 -302108 236939 -336713
8854c00180J29662I3463b469q5209A3152i7675j42198A03493J35526a45444A32152
$$ -300180 -170518 93463 -2469 -87678 13152 -97675 -239873 103493 239019 -145444 132152
8842a14367A2076K41307b88711G3522N8965a49859D77944d9109G0205j3326P5958
$$ -114367 12076 253383 -288711 73522 132487 -149859 477944 -49109 70205 56879 132837
8831A32837a74344B66279A28273C5360b80142E1213K00294b53818j0321G2059
$$ 132837 -174344 266279 128273 35360 -280142 51213 251507 -253818 -264139 72059
$$ [...]
##END NTUPLES=NMR SPECTRUM
##END=
