##TITLE=NES1010_Conilon_9232912_cuLHfhc4Ys
##JCAMPDX= 6.0         $$ Bruker NMR JCAMP-DX V2.0
##DATA TYPE= NMR SPECTRUM
##DATA CLASS= NTUPLES
##ORIGIN= BRUKER
##OWNER= Administrator
$$ 1.72 TOPSPIN		Version 2.1
$$ 2015-06-17 15:48:18.972 -0700  Administrator@X
$$ Compression mode = diff/dup
##.OBSERVE FREQUENCY= 400.02188249412
##.OBSERVE NUCLEUS= ^1H
##.ACQUISITION MODE= SIMULTANEOUS (DQD)
##.ACQUISITION SCHEME= undefined
##.AVERAGES= 64
##.DIGITISER RES= 22
##SPECTROMETER/DATA SYSTEM= spect
##.PULSE SEQUENCE= noesygpps1d.comp
##.SOLVENT NAME= COFFEE_meoh
##.SHIFT REFERENCE= INTERNAL, COFFEE_meoh, 1, 14.96429
##AUDIT TRAIL= $$ (NUMBER, WHEN, WHO, WHERE, PROCESS, VERSION, WHAT)
$$ ##TITLE= Audit trail, TOPSPIN		Version 2.1
$$ ##JCAMPDX= 5.01
$$ ##ORIGIN= Bruker BioSpin GmbH
$$ ##OWNER= Administrator
$$ $$ E:\/data/COFFEE/nmr/NES1010_Conilon_9232912_cuLHfhc4Ys/12/pdata/1/auditp.txt
$$ ##AUDIT TRAIL=  $$ (NUMBER, WHEN, WHO, WHERE, PROCESS, VERSION, WHAT)
(   1,<2015-06-17 15:48:13.378 -0700>,<Administrator>,<X>,<go>,<TOPSPIN 2.1>,
      <created by zg
	started at 2015-06-17 15:36:43.909 -0700,
	POWCHK enabled, PULCHK disabled,
       configuration hash MD5:
       21 0F 79 D6 B3 7B B4 F6 88 20 88 DB 03 48 BD 9F
       data hash MD5: 64K
       FD 3D 7E 4C 4B 4E 56 52 7D F3 7B 7B 1D 48 E2 3C>)
(   2,<2015-06-17 15:48:16.878 -0700>,<Administrator>,<X>,<proc1d>,<TOPSPIN 2.1>,
      <Start of raw data processing
       efp LB = 0.3 FT_mod = 6 PKNL = 1 PHC0 = 0 PHC1 = 0 SI = 128K 
       data hash MD5: 128K
       47 C8 FE 2D 9D 06 6F 31 DD CD 15 4E 9C 79 30 91>)
(   3,<2015-06-17 15:48:17.800 -0700>,<Administrator>,<X>,<proc1d>,<TOPSPIN 2.1>,
      <pk PHC0 = -85.63293 PHC1 = 0 
       data hash MD5: 128K
       F4 F6 B3 7C 6E 77 6C 6D 46 47 9F 9C 87 7F 70 68>)
(   4,<2015-06-17 15:48:18.175 -0700>,<Administrator>,<X>,<proc1d>,<TOPSPIN 2.1>,
      <abs ABSG = 1 
       data hash MD5: 128K
       20 72 20 6A 8E F4 72 83 C1 3B 6E 46 F6 69 94 6C>)
(   5,<2015-06-17 15:48:18.269 -0700>,<Administrator>,<X>,<proc1d>,<TOPSPIN 2.1>,
      <abs ABSG = 2 
       data hash MD5: 128K
       C2 AB C8 53 97 B6 B7 B9 9E 3D 51 EF 9C 5A 36 DF>)
(   6,<2015-06-17 15:48:18.347 -0700>,<Administrator>,<X>,<proc1d>,<TOPSPIN 2.1>,
      <abs ABSG = 3 
       data hash MD5: 128K
       94 44 0B 21 92 6A F6 F6 4D 2A A6 BA E1 51 DC 09>)
(   7,<2015-06-17 15:48:18.441 -0700>,<Administrator>,<X>,<proc1d>,<TOPSPIN 2.1>,
      <abs ABSG = 4 
       data hash MD5: 128K
       16 4A 79 87 28 A1 EB 0E CB 47 93 FD 52 2D BF E3>)
(   8,<2015-06-17 15:48:18.566 -0700>,<Administrator>,<X>,<proc1d>,<TOPSPIN 2.1>,
      <abs ABSG = 5 
       data hash MD5: 128K
       C5 75 31 0D 61 D6 C9 E6 29 CD 8B E1 F6 6F B4 85>)
$$ ##END=
$$ 
$$ $$ hash MD5
$$ $$ 7B F9 87 A0 95 74 CA E0 3E 34 74 D7 F1 8B B8 5D
##$RELAX= 
##$RELAX= 
##$RELAX= 
##$RELAX= 
##$RELAX= 
##$RELAX= 
##$RELAX= 
##$RELAX= 
$$ Bruker specific parameters
$$ --------------------------
##$DU= <E:\>
##$EXPNO= 12
$$ [...]
##$TP07= 0
##$TPNAME0= <>
##$TPNAME1= <>
##$TPNAME2= <>
##$TPNAME3= <>
##$TPNAME4= <>
##$TPNAME5= <>
##$TPNAME6= <>
##$TPNAME7= <>
##$TPOAL= (0..7)
0.5 0.5 0.5 0.5 0.5 0.5 0.5 0.5
##$TPOFFS= (0..7)
0 0 0 0 0 0 0 0
##$TUNHIN= 0
##$TUNHOUT= 0
##$TUNXOUT= 0
##$USERA1= <user>
##$USERA2= <user>
##$USERA3= <user>
##$USERA4= <user>
##$USERA5= <user>
##$V9= 5
##$VALIST= <valist>
##$VCLIST= <CCCCCCCCCCCCCCC>
##$VD= 0
##$VDLIST= <DDDDDDDDDDDDDDD>
##$VPLIST= <PPPPPPPPPPPPPPP>
##$VTLIST= <TTTTTTTTTTTTTTT>
##$WBST= 2048
##$WBSW= 25
##$XGAIN= (0..3)
0 0 0 0
##$XL= 0
##$YL= 0
##$YMAX_a= 5758014
##$YMIN_a= -12315944
##$ZGOPTNS= <>
##$ZL1= 120
##$ZL2= 120
##$ZL3= 120
##$ZL4= 120
##$ABSF1= 14.96429
##$ABSF2= -5.593892
##$ABSG= 5
##$ABSL= 3
##$ALPHA= 0
##$AQORDER= 0
##$ASSFAC= 0
##$ASSFACI= 0
##$ASSFACX= 0
##$ASSWID= 0
##$AUNMP= <proc_prof1d_extract.lims>
##$AXLEFT= 0
##$AXNAME= <>
##$AXNUC= <1H>
##$AXRIGHT= 0
##$AXTYPE= 0
##$AXUNIT= <>
##$AZFE= 0.1
##$AZFW= 0.1
##$BCFW= 0
##$BC_mod= 0
##$BYTORDP= 0
##$COROFFS= 0
##$CY= 15
##$DATMOD= 1
##$DC= 0
##$DFILT= <>
##$DTYPP= 0
##$F1P= 0
##$F2P= 0
##$FCOR= 0.5
##$FTSIZE= 131072
##$FT_mod= 6
##$GAMMA= 0
##$GB= 0
##$INTBC= 1
##$INTSCL= 1
##$ISEN= 128
##$LB= 0.3
##$LEV0= 0
##$LPBIN= 0
##$MAXI= 10000
##$MC2= 0
##$MEAN= 0
##$ME_mod= 0
##$MI= 0
##$NCOEF= 0
##$NC_proc= -2
##$NLEV= 6
##$NOISF1= 0
##$NOISF2= 0
##$NSP= 0
##$NTH_PI= 0
##$NZP= 0
##$OFFSET= 14.96429
##$PC= 1
##$PHC0= -85.63293
##$PHC1= 0
##$PH_mod= 1
##$PKNL= yes
##$PPARMOD= 0
##$PPDIAG= 0
##$PPIPTYP= 0
##$PPMPNUM= 2147483647
##$PPRESOL= 1
##$PSCAL= 4
##$PSIGN= 0
##$PYNMP= <proc.py>
##$REVERSE= no
##$SF= 400.020008319648
##$SI= 131072
##$SIGF1= 0
##$SIGF2= 0
##$SINO= 400
##$SIOLD= 131072
##$SPECTYP= <>
##$SREGLST= <1H.CDCl3>
##$SSB= 0
##$STSI= 131072
##$STSR= 0
##$SW_p= 8223.68421052631
##$SYMM= 0
##$S_DEV= 0
##$TDeff= 65536
##$TDoff= 0
##$TI= <>
##$TILT= no
##$TM1= 0
##$TM2= 0
##$TOPLEV= 0
##$USERP1= <user>
##$USERP2= <user>
##$USERP3= <user>
##$USERP4= <user>
##$USERP5= <user>
##$WDW= 1
##$XDIM= 131072
##$YMAX_p= 408274291
##$YMIN_p= -11525
##$CURPLOT= <Network HP LaserJet P1505>
##$CURPRIN= <$Network HP LaserJet P1505>
##$DFORMAT= <normdp>
##$LAYOUT= <+/1D_H.xwp>
##$LFORMAT= <normlp>
##$PFORMAT= <normpl>
##$SURQMSG= 1
$$ End of Bruker specific parameters
$$ ---------------------------------
##NTUPLES= NMR SPECTRUM
##VAR_NAME=  FREQUENCY,     SPECTRUM/REAL,   SPECTRUM/IMAG
##SYMBOL=    X,             R,               I
##VAR_TYPE=  INDEPENDENT,   DEPENDENT,       DEPENDENT
##VAR_FORM=  AFFN,          ASDF,            ASDF
##VAR_DIM=   131072,        131072,          131072
##UNITS=     HZ,            ARBITRARY UNITS, ARBITRARY UNITS
##FACTOR=    0.0627417313425164, 1,          1
##FIRST=     8223.62146879497, 1787,         -35551
##LAST=      0,             2188,            -35450
##MIN=       0,             -11525,          0
##MAX=       8223.62146879497, 408274291,    0
$$ Real data points
##PAGE= N=1
##DATA TABLE= (X++(R..R)), XYDATA
$$ [...]
67689 93386 94122 94476 94429 93960 92883 91162 89263 87960 87758 88584 89861 90857 91232 91368 91896 92803 93324 92910
67671 92910 91938 91146 90725 90364 89954 89750 89916 90366 91033 91944 92940 93689 94071 94316 94643 94998 95228 95325 95369 95383
67651 95383 95418 95659 96236 96910 97147 96632 95702 95115 95316 96003 96508 96516 96263 96161 96474 97378 98953 100911 102607
67632 102607 103637 104287 105056 105790 105706 104409 102564 101271 100876 100747 100217 99460 99257 100068 101576 103041 103861
67615 103861 103826 103184 102614 102804 103790 104857 105344 105432 105848 106908 108198 109170 109644 109633 109109 108283 107897 108766 110924
67596 110924 113407 115072 115593 115547 115523 115410 114807 113999 113976 115273 117198 118608 119177 119424 119725 119941 119990 120160
67578 120160 120611 121113 121535 122152 123140 124120 124550 124393 124122 124247 124939 125895 126404 125900 124644 123564 123175 123038
67560 123038 122509 121589 120652 119786 118958 118569 119141 120528 121950 122866 123348 123645 123813 123841 123675 123120 122126 121221
67542 121221 121202 122217 123515 124259 124291 124047 124040 124570 125563 126584 127238 127633 128103 128426 127825 126044 124023 123092
67524 123092 123683 125133 126527 127423 127855 127992 127919 127668 127376 127361 127800 128395 128633 128462 128379 128745 129313 129611 129484
67505 129484 129058 128536 128268 128666 129736 130955 131944 132925 134107 135018 135073 134542 134300 134620 134895 134597 133901 133181
67487 133181 132501 131909 131736 132222 133132 134035 134741 135238 135517 135716 136173 136998 137804 138209 138404 138913 139926 141265
67469 141265 142833 144609 146167 146715 145893 144309 143011 142588 143001 144077 145791 147936 149897 151118 151684
67454 151684 152109 152562 152638 152073 151211 150541 150103 149817 150019 151011 152261 152823 152654 152747 153674 154734 155009 154646 154488
67435 154488 154884 155584 156475 157677 158973 159877 160341 160845 161684 162619 163309 163677 163740 163477 163025 162661 162474 162336
67417 162336 162267 162552 163413 164831 166671 168696 170473 171626 172218 172572 172787 172801 172802 173046 173352 173438 173737 175064
67399 175064 177277 179097 179714 179746 180056 180404 180143 179637 179908 181109 182376 183175 183823 184553 184994 184968 185028 185677
67381 185677 186561 187010 187045 187322 188226 189518 190841 192164 193574 194957 196083 196955 197879 199100 200424 201399
67365 201399 201928 202513 203663 205150 206201 206440 206378 206813 207958 209360 210551 211566 212811 214561 216669 218708
67349 218708 220324 221408 222014 222265 222343 222439 222608 222764 222880 223057 223331 223586 223824 224342 225390 226820 228304 229820
67331 229820 231568 233422 234858 235638 236307 237716 240061 242546 244038 244051 243145 242466 242882 244433 246401 247806
67315 247806 248075 247520 247189 247925 249479 250805 251296 251410 251908 252922 254112 255376 256886 258594 260221 261684
67299 261684 263064 264228 264948 265474 266478 268271 270418 272314 273825 275177 276532 277877 279151 280302 281332
67284 281332 282363 283516 284726 285870 287050 288459 289970 291177 291938 292533 293214 293911 294485 294989 295539 296321
67268 296321 297775 300309 303540 306245 307607 308208 309351 311487 313763 315090 315270 314983 315019 315719 316952 318442
67252 318442 320077 321989 324349 327107 329944 332501 334673 336685 338831 341169 343606 346265 349439 353000
67238 353000 356172 358258 359381 360111 360668 361086 361988 364259 367764 371190 373570 375354 377465 379896 381899
67223 381899 383180 384238 385716 387976 391094 394688 397872 399997 401425 403026 404946 406427 406925 406900 407342
67208 407342 408941 411847 415766 419995 423652 426206 427781 428887 430089 431876 434495 437692 440837 443537
67194 443537 446003 448701 451741 454724 457167 458984 460616 462681 465393 468350 471003 473294 475654 478412
67180 478412 481487 484714 488162 491897 495589 498644 500796 502496 504607 507697 511645 515940 520240 524493
67166 524493 528593 532286 535513 538585 541774 544957 547940 550888 554043 557164 559760 561866 564178 567261
67152 567261 571016 575037 579118 583200 587136 590846 594502 598255 601884 605000 607566 609943 612490 615358
67138 615358 618760 623076 628422 634214 639522 643976 648092 652563 657403 662078 666344 670499 674789 679003
67124 679003 682886 686591 690402 694343 698449 703146 708804 715009 720801 725647 729817 733778 737693 741651
67110 741651 745942 750852 756398 762425 768689 774784 780301 785306 790381 795986 801996 808088 814313 820920
67096 820920 827730 833996 839002 842706 845860 849555 854486 860445 866545 872050 877005 882028 887583 893580
67082 893580 899643 905621 911772 918435 925630 933051 940410 947534 954109 959737 964546 969510 975662 983052
67068 983052 990826 998256 1005237 1011867 1018200 1024538 1031383 1038766 1046087 1052930 1059589 1066456 1073361 1080036
67054 1080036 1086829 1094308 1102323 1110072 1117076 1123657 1130473 1137984 1146320 1155207 1163953 1171894 1178977 1185689
67040 1185689 1192460 1199452 1206808 1214652 1222791 1230831 1238714 1246718 1254852 1262720 1270171 1277610 1285318 1292914
67026 1292914 1299982 1306946 1314727 1323532 1332472 1340556 1347744 1354804 1362354 1370301 1378176 1385758 1393247 1400978
67012 1400978 1409193 1418053 1427555 1437204 1446078 1453659 1460619 1468304 1477260 1486580 1494986 1502228 1509127 1516504
66998 1516504 1524513 1532884 1541326 1549613 1557695 1565832 1574325 1583000 1591291 1599039 1606867 1615450 1624582 1633312
66984 1633312 1640926 1647471 1653420 1659185 1665071 1671412 1678421 1686013 1693853 1701566 1708886 1715774 1722467 1729275
66970 1729275 1736190 1742801 1748716 1753994 1759041 1764191 1769549 1775220 1781358 1787887 1794310 1800021 1804812 1809044
66956 1809044 1813329 1818110 1823447 1829047 1834428 1839177 1843283 1847206 1851514 1856277 1860947 1864975 1868527 1872347
66942 1872347 1876856 1881588 1885670 1888721 1891068 1893234 1895476 1897791 1900059 1902086 1903707 1905048 1906500 1908267
66928 1908267 1909997 1911078 1911293 1911001 1910676 1910425 1910107 1909755 1909658 1910011 1910671 1911335 1911776 1911772 1910968 1909111 1906465 1903771
66910 1903771 1901716 1900500 1899868 1899329 1898342 1896597 1894253 1891711 1889019 1885794 1881947 1878181 1875363 1873498 1871632
66895 1871632 1868739 1864488 1859344 1854277 1850254 1847533 1845370 1842657 1838846 1834092 1828726 1823066 1817557 1812399
66881 1812399 1806993 1800491 1793140 1786387 1781234 1777006 1772231 1766213 1759238 1751712 1743912 1736373 1729725 1724043
66867 1724043 1718785 1713409 1707616 1701104 1693658 1685602 1677736 1670628 1664186 1657895 1651151 1643449 1634735 1625665
66853 1625665 1617134 1609465 1602357 1595523 1588886 1582189 1575073 1567727 1560796 1554316 1547329 1539049 1530003 1521473
66839 1521473 1514063 1507290 1500348 1492799 1484640 1476232 1468182 1460886 1454108 1447193 1439700 1431650 1423265 1414766
66825 1414766 1406372 1398285 1390625 1383396 1376404 1369169 1361267 1352921 1344862 1337371 1329903 1322065 1314438 1307727
66811 1307727 1301507 1294725 1287275 1280096 1273573 1266826 1259007 1250488 1242200 1234411 1226783 1219169 1211707 1204376
66797 1204376 1197091 1190093 1183718 1177859 1172087 1166202 1160298 1154355 1148146 1141541 1134617 1127566 1120694 1114338
66783 1114338 1108469 1102569 1096237 1089703 1083412 1077312 1071064 1064720 1058628 1052736 1046612 1040172 1033821 1027725
66769 1027725 1021507 1014820 1007804 1000830 994280 988666 984395 981086 977633 973328 968531 963791 958723 952339
66755 952339 944404 935931 928307 922156 917052 912000 906176 899447 892352 885627 879700 874537 869725 864741
66741 864741 859380 853986 849072 844702 840566 836632 833239 830355 827195 822903 817312 810826 803987 797480
66727 797480 792125 788278 785426 782734 779786 776387 772055 766412 759997 753998 749059 744825 740737 736791
66713 736791 733283 730182 727073 723658 720153 717140 714818 712373 708476 702760 696564 691687 688539 686027
66699 686027 683128 679933 677040 674533 671922 668757 665034 661151 657594 654458 651235 647297 642619 637772
66685 637772 633256 629136 625287 621576 617796 613848 610125 607252 605285 603491 601097 597977 594485 590973
66671 590973 587653 584606 581712 578762 575718 572637 569398 565865 562344 559322 556662 553616 549911 546309
66657 546309 543721 542160 540910 539367 537295 534657 531645 528717 526149 523715 521051 518188 515419 512850
66643 512850 510388 507997 505654 503213 500645 498221 496184 494325 492163 489484 486490 483538 480884 478554
66629 478554 476325 474017 471827 470070 468526 466535 463963 461533 459830 458440 456565 454093 451507 449080
66615 449080 446833 444993 443760 442665 440819 437965 434802 432182 430334 428944 427631 426271 425050 424167
66601 424167 423372 422086 420172 418200 416550 414719 412177 409476 407632 406629 405519 403960 402614 401775 400623
66586 400623 398356 395318 392421 390017 387892 385915 384124 382522 381228 380490 380091 379185 377293 375151 373927
66571 373927 373762 373693 372875 371250 369046 366342 363395 360810 358935 357350 355302 352589 349802 347775 346945
66556 346945 347105 347562 347559 346755 345366 343780 342078 340077 337799 335644 333960 332676 331541 330546 329765 328964
66540 328964 327747 326109 324444 322923 321363 319873 319108 319472 320447 321149 321260 320957 320209 318801 316951 315314
66524 315314 314284 313661 313012 311946 310081 307243 303840 300704 298469 297260 296835 296625 295871 294293 292612
66509 292612 291795 291781 291526 290367 288693 287143 285810 284565 283524 282827 282301 281668 280746 279374 277613 276108
66493 276108 275570 275689 275244 273626 271498 269603 267806 265990 264982 265519 266854 267442 266790 265657 264617 263485
66477 263485 262157 261007 260194 259377 258436 257789 257709 257858 257772 257317 256432 254914 252802 250574 248718 247384 246577
66460 246577 246330 246469 246605 246548 246395 246110 245414 244283 243070 241832 240049 237446 234782 233276 233403 234621
66444 234621 236070 237128 237426 236868 235791 234780 234186 233953 233842 233543 232651 230883 228476 226131 224436 223443
66428 223443 222888 222608 222564 222612 222423 221714 220503 219187 218323 218153 218242 217761 216279 214227 212462 211454 211105 211220
66410 211220 211792 212733 213670 214232 214367 214191 213734 213069 212461 212094 211814 211494 211465 212053 212808 212792 211816 210743 210250
66391 210250 209848 208600 206418 204075 202143 200545 199120 198057 197560 197429 197138 196243 194678 192840 191370
66376 191370 190648 190469 190348 190070 189833 189933 190483 191289 191824 191508 190309 188921 188078 187851 187927 188266 189016 189879
66358 189879 190194 189723 188885 188107 187401 186662 185955 185301 184588 183848 183254 182737 182056 181373 181196 181467 181335 180287
66340 180287 179006 178508 178811 179081 178859 178461 178295 178450 178958 179780 180428 180249 179324 178572 178643 179167 179419 179262 178940
66321 178940 178250 176623 174081 171591 170208 170102 170569 170854 170710 170319 169873 169334 168530 167396 166111 164983
66305 164983 164215 163791 163568 163383 163108 162688 162240 162043 162305 162855 163203 163006 162396 161742 161086 160048 158436 156771
66287 156771 155952 156331 157286 157817 157454 156481 155434 154671 154401 154760 155606 156411 156634 156221 155545 154940 154551 154585 155270
66268 155270 156394 157233 157295 156911 156734 156748 156255 154902 153284 152256 151904 151547 150687 149633 149051 149123 149386 149424
66250 149424 149439 149908 150785 151432 151452 151262 151506 152140 152548 152486 152357 152344 151811 150020 147251 144700 143223 142547 141862
66231 141862 140873 140016 139738 139909 140088 140152 140398 141009 141689 142004 141918 141726 141530 141119 140458 139959 140041 140604 141220 141756
66211 141756 142505 143680 145006 145929 146106 145590 144680 143762 143245 143407 144138 144913 145200 144988 144788 145069 145750 146342
66193 146342 146464 146124 145574 145125 145048 145461 146223 147100 148066 149272 150677 151909 152673 153127 153697 154606 155733 156847
66175 156847 157771 158360 158587 158660 158856 159131 159068 158399 157505 157192 157894 159249 160515 161271 161538 161343 160548 159255
66157 159255 158065 157563 157632 157583 156959 155899 154666 153188 151276 149060 146952 145336 144438 144290 144548 144529 143811
66140 143811 142759 142153 142270 142652 142788 142676 142511 142181 141408 140246 139153 138583 138703 139461 140630 141769 142417
66123 142417 142480 142276 142029 141510 140425 139090 138366 138810 140100 141528 142857 144395 146242 147887 148817 149289
66107 149289 150142 151808 153810 155375 156300 156966 157640 158187 158575 159289 160844 163010 164907 166003 166760 168096
66091 168096 170414 173322 176138 178446 180168 181381 182148 182512 182615 182738 183013 183061 182205 180256 177933 176231
66075 176231 175484 175306 175284 175357 175584 175957 176483 177129 177622 177679 177532 177788 178660 179726 180622 181542 182745 183981 184823
66056 184823 185250 185474 185418 184886 184094 183543 183324 182933 181827 179907 177484 175092 173283 172259 171665 170976 170073
66039 170073 169224 168633 168355 168458 168752 168437 166661 163597 160456 158186 156582 154913 152912 150798 148794 147089
66023 147089 145994 145640 145675 145628 145472 145490 145818 146497 147790 149898 152368 154258 155040 155078 155154 155787 157018 158544
66005 158544 159925 160929 161762 162787 164003 165014 165582 165944 166446 167056 167387 167184 166691 166563 167318 168766 170114
65988 170114 170780 171014 171523 172692 174483 176867 179797 182782 185015 186098 186250 185751 184734 183639 183133 183182
65972 183182 182813 181389 179634 178708 178592 178216 177048 175716 174954 174637 174136 173092 171562 169841 168449 167866
65956 167866 167949 167852 166826 164942 162857 161141 160015 159438 159099 158517 157536 156609 156333 156745 157311 157579 157599 157709
65938 157709 158036 158305 158103 157403 156697 156407 156210 155315 153527 151598 150280 149502 148846 148406 148488 148706 148161 146609
65920 146609 144786 143383 142273 141036 139692 138497 137475 136628 136259 136581 137201 137580 137852 138586 139702 140357
65904 140357 140127 139743 140127 141156 141925 142065 142126 142610 143203 143303 142876 142427 142278 142231 141886 140991 139518 137689
65886 137689 135943 134659 133858 133341 133049 133055 133177 132961 132184 131161 130348 129823 129286 128391 126961 125087 123217
65869 123217 121929 121316 120789 119840 118863 118840 120197 122315 124175 125175 125284 124833 124415 124609 125477 126416 126798
65852 126798 126674 126644 127069 127652 127776 127045 125471 123323 120948 118635 116509 114587 112972 111898 111436 111221
65836 111221 110713 109829 109084 108907 108993 108616 107543 106291 105422 104978 104737 104643 104652 104442 103738 102830 102328 102367 102414 101933
65816 101933 100961 99955 99313 99188 99520 100083 100621 101052 101468 101930 102346 102596 102638 102469 102145 101785 101426 100891 100006
65797 100006 98890 97780 96669 95439 94338 93860 94067 94415 94473 94414 94512 94553 94137 93351 92691 92461 92614 93102
65779 93102 93948 94915 95495 95405 94866 94320 94003 93875 93866 94070 94735 96002 97605 98972 99760 100184 100597 100949 101046
65760 101046 101259 102452 104952 107995 110574 112522 114290 115778 116090 114740 112602 111142 110819 110752 109974 108534
65744 108534 107132 106100 105180 104144 103185 102598 102365 102137 101554 100612 99807 99736 100289 100463 99354 97250 95258
65727 95258 93963 93069 92388 92339 93037 93603 93155 92063 91466 91706 92032 91824 91298 90782 90056 88854 87544 86781
65709 86781 86738 87075 87456 87723 87729 87430 87114 87113 87267 87059 86414 85993 86395 87289 87704 87205 86439 86392 87315 88593 89583
65688 89583 90273 91038 91941 92543 92373 91398 89932 88248 86489 84927 84038 84069 84611 84810 84082 82562 80921
65671 80921 79895 79897 80796 81980 82915 83741 85042 86885 88397 88603 87414 85507 83580 82115 81560 81998 82745
65654 82745 82914 82466 82136 82299 82572 82629 82634 82560 81849 80322 78763 77967 77668 77132 76440 76380 77243 78448 79348 79744
65634 79744 79583 78782 77493 76094 74792 73607 72749 72587 73264 74723 77022 80071 83079 84902 85208 84815
65618 84815 84716 85196 86047 87075 88038 88505 88265 87673 87264 87157 87043 86596 85737 84659 83751 83291 83109 82755 82089
65599 82089 81443 81091 80904 80638 80229 79607 78658 77632 77225 77802 78782 79202 78738 77886 77274 77164 77483 77975 78312
65580 78312 78316 78067 77654 76994 76101 75305 74920 74821 74715 74594 74575 74421 73774 72812 72196 72225 72510 72642 72767 73264 74164
65559 74164 75174 76048 76648 76864 76768 76741 77151 77902 78476 78425 77650 76297 74644 73108 72109 71736 71622 71278 70558
65540 70558 69779 69474 70042 71483 73349 74995 76063 76743 77389 77857 77472 75862 73713 72368 72587 73858
65524 73858 75045 75555 75700 76056 76694 77195 77245 77007 76819 76673 76191 75129 73755 72580 71838 71350 70882 70463
65506 70463 70372 70875 71939 73090 73685 73542 73252 73605 74717 75983 76927 77743 78804 79924 80470 80105 79130
65489 79130 78110 77395 76990 76678 76207 75483 74664 73986 73548 73354 73479 73961 74535 74750 74526 74411 74999 76180
65471 76180 77188 77450 77148 76876 76939 77232 77594 77931 77978 77359 76114 74954 74598 74930 75081 74423 73269 72454
65453 72454 72378 72610 72415 71544 70442 69736 69658 70075 70902 72104 73270 73600 72714 71238 70192 69853 69657 69181
65435 69181 68727 68709 68919 68804 68340 68155 68704 69588 69978 69587 68946 68645 68613 68445 68216 68377 68836 68818 68039 67371
65415 67371 67715 68683 69254 69496 70574 72968 75679 77622 78872 79961 80682 80513 79807 79634 80490 81821 82862
65398 82862 83353 83372 83054 82704 82780 83482 84504 85440 86367 87867 90432 93811 97062 99454 101310 103687 107174
65381 107174 111378 115776 120586 126358 133000 139712 145751 150815 154785 157588 159331 160151 159871 158131 154922
65366 154922 150722 146083 141305 136411 131222 125562 119764 114779 111287 108791 106125 102894 99801 97483
65352 97483 95664 93749 91676 89711 87884 86143 84782 84149 84023 83760 83087 82390 82177 82509 83012 83249 82987
65335 82987 82229 81133 79927 78878 78234 77999 77819 77265 76309 75292 74454 73728 73066 72577 72161 71411 70231
65318 70231 69227 69033 69380 69347 68499 67327 66493 66097 65858 65641 65500 65446 65513 65877 66600 67298 67391 66765 65953 65548
65298 65548 65646 65968 66389 67043 67967 68937 69755 70483 71219 71786 71867 71391 70538 69396 67913 66268 65008 64542
65280 64542 64652 64737 64499 64157 64023 64123 64330 64637 65091 65570 65859 65974 66208 66774 67532 68181 68620 68927 69101
65261 69101 69084 69043 69285 69735 69841 69307 68667 68722 69481 70150 70215 70035 70237 70944 71890 72880 73732 74112 73955 73875 74529
65240 74529 75621 76100 75517 74650 74517 75216 76128 76871 77537 78199 78766 79317 80074 80881 81131 80501 79436 78610
65222 78610 78082 77320 76018 74538 73460 72914 72530 71930 71092 70209 69389 68651 68128 68065 68549 69370 70279 71229
65204 71229 72192 72871 72891 72262 71408 70658 69968 69200 68450 67942 67793 68031 68628 69366 69848 69887 69759 69905 70496 71419
65184 71419 72467 73321 73598 73281 72950 73256 74214 75298 76097 76557 76726 76674 76611 76686 76689 76324 75770 75504 75656 75974
65164 75974 76471 77492 79044 80617 81898 83089 84261 84967 84965 84815 85272 86358 87553 88588 89552 90424 91044
65147 91044 91494 92095 92985 94006 94908 95477 95618 95532 95632 95997 96180 95831 95265 95055 95324 95828 96409 96910 96906 96139
65127 96139 95063 94401 94276 94304 94392 94795 95453 96020 96567 97520 98681 99089 98203 96688 95662 95633 96478 97933
65109 97933 99618 101018 101977 102953 104323 105662 106218 105950 105582 105613 105753 105494 104921 104744 105657 107787 110641
65092 110641 113400 115337 116220 116584 117559 120051 123889 127869 130846 132666 133902 134954 135781 136315 136697 137043
65076 137043 137328 137479 137257 136142 133805 130718 127801 125394 123042 120401 117744 115327 112856 110033 107175
65061 107175 104767 102702 100568 98499 97131 96665 96455 95732 94452 93224 92576 92465 92498 92439 92397 92554 92920
65044 92920 93444 94177 95127 96111 96992 97925 99081 100283 101307 102289 103344 103954 103522 102542 102330 103320 104446
65027 104446 104676 104341 104312 104492 104024 102583 100650 98710 96995 95871 95646 95927 95827 94973 93794 92791 92072
65010 92072 91671 91696 91971 91995 91504 90728 89950 89242 88755 88779 89351 90164 91117 92438 93993 94968 94772 93947 93598
64991 93598 94089 94786 95036 94811 94347 93697 92942 92448 92514 92957 93398 93786 94238 94446 93785 92171 90345 89025
64973 89025 88127 87156 86007 84880 83648 81978 80037 78426 77336 76446 75858 76338 78083 79889 80318 79391
64957 79391 78372 78059 78074 77899 77773 78153 78801 78988 78415 77536 76990 77008 77396 77810 77921 77482 76558 75723 75732 76706
64937 76706 77778 77876 76871 75638 75018 75089 75480 75904 76138 75922 75215 74234 72998 71241 69137 67580 67181
64920 67181 67360 67135 66516 66354 66926 67595 67975 68628 70146 72183 73889 74899 75451 75821 76112 76465 77014 77596
64902 77596 77761 77170 75820 73903 71597 69129 66988 65860 66098 67204 68099 68057 67291 66523 66179 66184 66286 66230
64884 66230 65793 65015 64343 64225 64652 65347 66217 67269 68245 68831 69128 69428 69555 68997 67748 66516 65931 66009
64866 66009 66460 67031 67356 67021 66089 65143 64586 64244 63928 63874 64259 64688 64630 64104 63474 62820 61989 61190 61009 61680
64846 61680 62671 63156 62828 62181 61970 62405 62919 62875 62371 62051 62179 62309 61998 61461 61180 61158 60878 59873 58176
64827 58176 56333 55106 54940 55559 56262 56728 57298 58381 59945 61739 63587 65149 65818 65350 64383 63869 64082
64810 64082 64558 64872 65026 65115 65037 64665 64121 63752 63856 64295 64346 63253 61198 59432 59114 60167 61586 62596
64792 62596 63106 63229 62983 62510 62110 61875 61544 60889 60062 59523 59706 60687 62004 62957 63318 63575 64250 65222 66082
64773 66082 66837 67650 68062 67187 64794 61663 58738 56460 55047 54721 55291 56037 56471 56856 57588 58483 59116
64756 59116 59532 60087 60791 61344 61726 62243 62966 63596 63935 64119 64318 64514 64656 64715 64512 63834 62885 62271 62304 62540
64736 62540 62346 61746 61444 61993 63259 64736 66104 67228 67758 67134 65209 62697 60679 59607 59013 58283
64720 58283 57445 56990 57135 57660 58397 59433 60679 61609 61689 60946 59927 59239 59243 59953 61005 61858 62303 62635 63143
64701 63143 63627 63756 63721 64083 64968 65838 66160 65919 65362 64644 63909 63376 63115 63001 63095 63684 64689 65425 65432 65209
64681 65209 65636 66817 68023 68668 68819 68759 68589 68365 68140 67760 67009 66089 65524 65502 65703 65975 66643 67896 69316
64662 69316 70410 71263 72221 73198 73759 73737 73363 72861 72284 71723 71329 71157 71228 71729 72921 74817 77070 79113
64644 79113 80335 80444 79914 79810 80766 82312 83574 84440 85518 87032 88409 89079 89180 89216 89438 89782 90088
64627 90088 90135 89742 89069 88501 88111 87580 86875 86521 86771 86985 86428 85399 84872 85119 85427 85254 84911 84812 84714 84191
64607 84191 83420 82915 82777 82771 82933 83506 84243 84370 83377 81511 79359 77374 75925 75403 75904 77013 78161 79169
64589 79169 80310 81962 84215 86632 88361 88747 87931 86599 85201 83781 82560 81986 81938 81558 80382 79055
64573 79055 78257 77547 76187 74753 74713 76370 78311 79198 79181 79077 79033 78663 77899 76937 75742 74203 72494 70733
64555 70733 68579 65794 63039 61471 61519 62545 63697 64662 65546 66441 67301 68047 68682 69369 70307 71428 72405
64538 72405 73068 73579 73955 73785 72768 71303 70115 69438 69024 68793 68936 69395 69742 69726 69573 69606 69878 70269 70630
64519 70630 70745 70432 69829 69338 69120 68823 67954 66431 64737 63605 63500 64257 65222 65871 66237 66557 66701 66260
64501 66260 65166 63882 62919 62403 62247 62516 63469 65237 67483 69442 70438 70480 70197 70098 70134 70080 69984 69948 69746
64482 69746 69109 68221 67511 67157 67196 67912 69486 71329 72318 71863 70393 68821 67908 68027 68992 70046 70501 70439
64464 70439 70377 70346 69915 69098 68519 68518 68759 68932 69131 69320 69109 68450 67876 67634 67241 66395 65643 65552 65848 66096 66689
64443 66689 68241 70348 71857 72300 72328 72754 73838 75425 77105 78206 78292 77755 77404 77452 77520 77564 78034 78959
64425 78959 79635 79623 79441 79865 80977 82330 83656 84940 86027 86640 86776 86811 87229 88354 90182 92338 94369
64408 94369 96177 98012 100013 102067 104207 106770 109893 113243 116540 120038 124109 128606 133099 137548
64394 137548 142257 147202 151913 156070 159755 163024 165612 167295 168191 168514 168285 167491 166290 164758 162661
64379 162661 159777 156305 152687 149169 145896 143345 142213 142790 144807 148002 152411 157880 163673 168990
64365 168990 173728 178409 183531 189364 196239 204521 214148 224596 235478 246975 259584 273746 289881
64352 289881 308490 329928 354265 381631 412595 448040 488787 535604 589384 650908 720357
64341 720357 797266 880868 970066 1062647 1154483 1239617 1311252 1362955 1389575 1388033 1358220 1303599
64329 1303599 1230583 1146487 1057388 967464 879843 797321 721931 654226 593530 538946 490048
64318 490048 446832 409367 377430 350147 326011 303670 282851 264311 248788 236103 225304
64307 225304 215433 206096 197492 190050 183911 178657 173613 168455 163380 158652 154248 150098 146508 144019
64293 144019 142760 142117 141212 139690 137934 136522 135638 135163 135158 135900 137328 138793 139577 139551 139121 138719 138543 138637
64275 138637 138852 138864 138565 138421 139105 140781 143013 145339 147512 149163 149791 149368 148640 148475 149063 149949 150605
64258 150605 150775 150509 150163 150229 150878 151800 152621 153356 154272 155528 157144 159131 161413 163853 166646 170347 175125
64241 175125 180260 184911 189231 194184 200322 207406 215275 224426 235465 248495 263347 279991 298464
64228 298464 318846 341685 368068 398852 434139 473844 518416 568535 624585 687079 757263
64217 757263 836327 923755 1016934 1112216 1205480 1291385 1363047 1413474 1437616 1433376 1401654 1346149
64205 1346149 1272702 1187772 1097081 1005431 917028 835027 760731 693865 633848 580542 533856
64194 533856 493258 457947 427166 400158 376158 354671 335532 318526 303150 288891 275500
64183 275500 262840 250716 239064 228064 217858 208408 199795 192305 185838 179522 172485 164966 158190
64170 158190 153016 149058 145297 141243 137288 134134 132096 130869 129801 128416 126754 125176 123873 122707
64156 122707 121515 120360 119377 118530 117685 116827 116056 115410 114762 113948 112975 112157 111962 112528 113349 113638 113143 112415
64138 112415 112127 112259 112155 111306 109859 108374 107247 106431 105632 104694 103765 103040 102432 101701 100971 100795 101451 102381
64120 102381 102678 102122 101383 101209 101740 102685 103779 104857 105752 106416 107020 107693 108272 108551 108728 109392 110972 113263
64102 113263 115531 117076 117792 118182 118792 119649 120441 121209 122468 124482 126754 128613 129999 131236 132179 132213
64086 132213 131236 130125 129874 130508 131147 131061 130334 129501 128799 128050 127212 126763 127179 128196 129051 129572 130424 131910
64068 131910 133096 132878 131636 130966 131814 133725 136082 139051 142809 146617 149472 151294 152913 155165 158450
64053 158450 162715 167252 170908 173248 175325 178619 183329 188318 192563 195919 198593 200729 202628 204602
64039 204602 206340 207063 206545 205336 203783 201553 198519 195445 193224 191882 190908 190180 189987 190447 191436 192951
64023 192951 195025 197429 199952 202853 206502 210569 214068 216424 218137 220241 223352 227385 231999 237037
64009 237037 242494 248185 253673 258725 263732 269371 275775 282350 288567 294614 301025 307939 315036 322066
63995 322066 329205 337052 346504 358361 372655 388531 405127 422420 440914 460704 481361 502620
63983 502620 524661 547715 571912 597644 625579 656044 688696 723051 759157 797618 839215
63972 839215 884657 934524 989338 1049893 1117622 1194409 1281989 1381865 1495998 1627336 1779476
63961 1779476 1956156 2161337 2399411 2674737 2990733 3349418 3751391 4195627 4679206
63952 4679206 5197744 5746476 6320821 6915783 7524834 8139164 8747240 9334506 9883973
63943 9883973 10378420 10803428 11149151 11409872 11582439 11665121 11657068 11557823 11367199 11086400
63933 11086400 10720045 10277388 9771687 9218461 8633847 8033185 7429517 6832588 6249257
63924 6249257 5685089 5145780 4637410 4165705 3734889 3346754 3000554 2694042 2424801
63915 2424801 2190502 1988012 1812823 1659962 1525524 1407149 1303219 1212012 1131659 1060373
63905 1060373 996352 937777 883373 832901 786605 744131 704382 666546 630840 597909 567817
63894 567817 539973 513764 488854 465079 442572 421884 403421 386747 370965 355788 341655
63883 341655 328664 316122 303575 291693 281542 273324 266388 260166 254477 249042 243343 237129 230678
63870 230678 224516 219148 214960 211941 209488 206833 203789 200768 198105 195710 193434 191334 189376 187197
63856 187197 184457 181309 178383 176328 175341 174959 174321 172800 170454 167784 165132 162518 159895 157266 154562
63841 154562 151744 149058 146879 145271 144037 143232 143186 143748 143942 142739 140137 137144 134776 133258 132216
63826 132216 131414 131122 131722 133070 134428 135127 135190 135118 135169 135079 134438 133126 131392 129674 128350 127449 126652 125731
63808 125731 124877 124342 123885 123007 121712 120623 120262 120567 121203 121890 122253 121800 120386 118433 116429 114434 112278
63791 112278 109995 107750 105576 103473 101618 100181 99104 98294 97945 98337 99384 100615 101558 101992 101918 101539
63775 101539 101204 101126 101136 100891 100340 99824 99704 100017 100529 101015 101421 101795 102175 102682 103619 105178 106878 107650 106980
63756 106980 105849 105931 107728 110012 111345 111695 112246 114059 117362 121781 126670 131373 135656 139948 144862
63741 144862 150546 156757 163366 170378 177629 184902 192258 199679 206438 211424 214259 215518 215570 213742 209154
63726 209154 202071 193873 185761 178003 170516 163670 158071 153743 149960 146078 142275 139172 136841 134551
63712 134551 131575 127917 124087 120523 117535 115501 114584 114394 114442 114953 116629 119429 122191 123844 124622 125612
63696 125612 127420 129810 132512 135705 139539 143689 147680 151350 154736 157761 160448 163348 167377 172997
63682 172997 179633 185985 190888 193926 195385 195712 195056 193251 190202 186184 181709 177117 172388 167371 162172
63667 162172 157299 153334 150424 148170 146154 144543 143883 144237 144926 145414 146086 147674 150109 152555 154630
63652 154630 156883 159866 163304 166630 169848 173399 177557 182474 188517 195896 204090 212227 220016 227806
63638 227806 235754 243482 250548 256696 261600 264993 267245 269161 270906 271679 270907 269363 268553 269242 271011
63623 271011 273038 274898 276635 278514 280711 283043 284930 285785 285406 283890 281340 277807 273468 268683 263897
63608 263897 259511 255702 252299 248974 245614 242306 238996 235479 231851 228590 226014 223955 222252 221219
63594 221219 221282 222426 224341 226902 230117 233758 237479 241240 245276 249688 254385 259352 264675 270290 276074
63579 276074 282160 288810 295894 302720 308455 312539 314693 314887 313447 311053 308419 305942 303653 301510
63565 301510 299774 299062 299847 301856 304154 305970 307279 308452 309597 310534 311202 311730 312144 312274 311944 311081
63549 311081 309745 308274 307275 307129 307530 307770 307436 306527 304873 301880 297082 290828 284161 277933 272094 265927
63533 265927 259017 251823 245123 239060 233150 227234 221835 217354 213404 209403 205483 202273 200017 198384
63519 198384 197020 195807 194670 193620 192966 192989 193380 193352 192390 190622 188566 186842 186074 186614 188319 190866
63503 190866 194174 198213 202575 206782 210922 215462 220441 225432 230304 235443 241010 246536 251435 255452
63489 255452 258454 260325 261246 261555 261080 259161 255661 251398 247126 242644 237445 231875 226910 222936 219374
63474 219374 215637 211995 209329 208273 208685 209864 211213 212698 214631 217082 219839 222939 226831 231742
63460 231742 237195 242537 247741 253337 259674 266612 273924 281675 290093 299175 308526 317626 326409 335494
63446 335494 345549 356308 366524 375080 381808 386987 390484 391928 391582 390453 389480 389001 389035 389595 390538
63431 390538 391508 392344 393328 394659 395796 395732 393995 391129 387916 384283 379313 372426 364286 356337 349595
63416 349595 344071 339205 334557 330125 326341 323825 322852 322976 323412 323848 324606 325957 327671 329483 331693
63401 331693 334949 339574 345364 351904 358817 365782 372650 379590 386976 395084 403965 413471 423254 432841
63387 432841 441946 450700 459334 467596 474633 479542 481986 482288 481099 479077 476781 474593 472628 470815
63373 470815 469245 468319 468295 468708 468618 467604 466114 464541 462344 458582 453112 446686 439932 432825 425165 416995
63357 416995 408442 399716 391431 384377 378637 373423 368072 362802 358150 354129 350334 346531 342737 339058
63343 339058 335801 333364 331592 329592 326741 323582 321167 319773 318784 317645 316231 314413 311990 309165
63329 309165 306469 303979 301138 297562 293644 290063 287000 284141 281250 278494 276279 274848 273979 273061 271585
63314 271585 269576 267378 265107 262565 259688 256805 254322 252341 250679 249091 247397 245497 243428 241427
63300 241427 239860 239008 238824 238955 239143 239508 240164 240614 240075 238550 237075 236507 236476 236050 235038 233951 232968
63283 232968 231724 230126 228623 227431 226118 224263 222059 220008 218381 217220 216479 215878 214967 213699 212653
63268 212653 212400 212821 213347 213664 213830 213816 213382 212525 211808 211996 213328 215225 216823 217794 218501 219328 220113 220504
63250 220504 220591 220830 221427 222223 223123 224158 225088 225436 225099 224545 224236 224231 224459 224924 225467 225854 226424 228096 231225
63231 231225 234901 238007 240637 243724 247454 250891 253311 255222 257657 260981 264800 268750 272839 277081
63217 277081 281252 285193 289135 293493 298338 303262 307844 312169 316673 321514 326418 331248 336468 342630
63203 342630 349479 355932 361088 365071 368756 372820 377205 381457 385452 389667 394712 400604 406635 412020
63189 412020 416554 420542 424266 427824 431429 435490 440254 445614 451498 458207 466039 474658 483235 491354
63175 491354 499549 508748 519362 531102 543514 556338 569315 582104 594653 607405 620779 634575
63163 634575 648235 661672 675414 689754 704150 717743 730235 741880 752717 762229 769830 775323
63151 775323 778680 779606 777639 772662 765157 755840 745187 733419 720905 708353 696402 685047 673741
63138 673741 662172 650733 639993 629937 620110 610466 601641 594209 588080 582885 578602 575375 572890
63125 572890 570445 567632 564583 561479 558266 554996 552072 549849 548187 546657 545060 543584 542571 542275
63111 542275 542650 543240 543561 543821 544947 547553 551109 554577 557641 560791 564361 568162 572133 576585 581515
63096 581515 586281 590425 594390 598918 604023 609080 613717 618068 622252 626113 629568 632788 635845 638472
63082 638472 640310 641243 641384 640843 639615 637657 635078 632212 629389 626590 623490 619911 615968 611677 606727
63067 606727 600959 594798 588853 583233 577660 572140 567108 562938 559745 557595 556444 555865 555330 554927 555354
63052 555354 556984 559309 561512 563220 564453 565215 565575 565950 566847 568322 569873 570898 571139 570813 570440 570395
63036 570395 570550 570470 570011 569441 568886 568014 566527 564608 562492 559915 556539 552791 549653 547479 545500 542711
63020 542711 538930 534797 531066 528074 525614 523066 519889 516299 513290 511717 511460 511727 512054 512701 514203
63005 514203 516938 521074 526490 532613 538768 544956 551961 560396 569988 580150 591005 603269 617198
62992 617198 632179 647508 663101 679211 695871 712987 730690 749177 768231 787215 805538
62981 805538 822944 839387 854915 869717 884113 898298 912050 924640 935034 942348 946214 946687
62969 946687 943711 936816 925478 909652 889774 866273 839356 809305 776843 743056 708968 675217
62957 675217 642168 610304 580385 553045 528233 505238 483362 462472 442887 424894 408484
62946 408484 393442 379580 366947 355733 345824 336593 327468 318644 310780 303935 297389 290724 284416
62933 284416 278970 274085 269337 265163 262287 260448 258567 256162 253741 251701 249675 247276 244786 242704
62919 242704 241104 239821 238820 238010 237037 235675 234099 232488 230645 228353 225872 223715 222074 220766 219590
62904 219590 218453 217286 216047 214693 213047 210852 208164 205525 203586 202745 203165 204807 207172 209407 211051
62889 211051 212507 214420 216771 218958 220672 222225 224044 226215 228602 231075 233488 235620 237276 238313
62875 238313 238543 237795 236200 234285 232653 231554 230771 229849 228386 226179 223270 219958 216717 213916 211530
62860 211530 209242 206945 205021 203883 203371 202819 201735 200222 198762 197838 197721 198331 199243 200031 200663 201341
62844 201341 202032 202489 202778 203347 204448 205809 207060 208142 209117 209931 210622 211495 212775 214314 215920 217723
62828 217723 219906 222238 224189 225419 225916 225798 225209 224315 223230 222014 220919 220414 220756 221689 222796 223952
62812 223952 225192 226315 226986 227179 227189 227138 226715 225510 223490 221042 218562 216048 213221 210114 207375 205681
62796 205681 204951 204433 203563 202367 201099 200010 199602 200411 202176 203734 204250 204170 204513 205586 206937 208238
62780 208238 209590 211093 212725 214628 216994 219690 222432 225288 228523 231901 234620 236110 236614 236877 237445
62765 237445 238231 238598 237899 236124 233943 231955 230150 228253 226203 223864 220692 216333 211378 206896 203322
62750 203322 200432 198228 197041 196651 196138 194940 193471 192362 191583 190685 189482 188110 186740 185573 184853
62735 184853 184568 184399 184167 184117 184523 185263 186023 186704 187409 188228 189280 190749 192670 194774 196735 198484 200242
62718 200242 202447 205581 209768 214416 218707 222628 227181 233313 240920 249200 257705 266671 276455 287122
62704 287122 298627 311213 325462 341880 360376 380272 401084 423247 447686 474675 503584
62693 503584 533910 565935 599970 635291 670407 704144 735956 765298 791248 812867 829519
62682 829519 840727 845988 844904 837392 823796 804888 781727 755309 726397 695802 664612 633745
62670 633745 603327 572860 542164 511925 483257 456888 432868 410829 390384 371348 353732
62659 353732 337576 322816 309346 297153 286265 276603 267992 260301 253482 247484 242224 237577 233284
62646 233284 228940 224308 219636 215454 211983 208936 205962 203118 200753 199075 197976 197179 196350 195180 193585
62631 193585 191948 190934 190959 191829 192942 193713 193795 193060 191649 189986 188544 187461 186521 185564 184817 184668 185159
62614 185159 185790 185854 185009 183575 182325 181921 182527 183986 186188 189076 192312 195281 197583 199300 200684 201853
62598 201853 202971 204350 205961 207046 206779 205331 203872 203430 204134 205631 207773 210523 213485 215970 217563
62583 217563 218405 218885 219199 219316 219319 219677 220976 223260 225710 227236 227423 226725 225775 224774 223612 222283 220899
62566 220899 219470 217912 216198 214370 212447 210493 208717 207325 206250 205210 204054 202932 202046 201382 200799
62551 200799 200336 200210 200467 200784 200752 200212 199153 197436 195046 192596 191132 191167 192159 193212 194007 194822 195927
62534 195927 197359 199080 200956 202743 204487 206788 210126 214097 217873 221341 225152 229603 234286 239116
62520 239116 244921 252399 261027 269722 278391 288118 299829 313304 327645 342275 357312 373188 390144
62507 390144 408016 426325 444526 462164 478872 494271 507793 518511 525311 527609 525944 521580
62495 521580 515406 507380 497077 484519 470357 455542 440917 426860 413177 399566 386250 373853
62483 373853 362627 352276 342677 334197 326962 320357 313826 307754 302941 299498 296852 294629 292849 291387
62469 291387 290028 289083 289199 290350 291616 292256 292427 292555 292556 292186 291703 291587 291812 291919 291768 291714 291972 292132 291495
62450 291495 289756 287364 285268 284244 284342 285002 285764 286640 287687 288597 289195 290148 292533 296569 301344 306073
62434 306073 311175 317621 325592 334358 343354 352748 362950 374134 386422 399919 414177 428094 440865
62421 440865 452855 465039 477632 489749 500355 509068 515879 520563 522723 522324 519935 516439 512525
62408 512525 508376 503783 498643 493304 488364 484229 480978 478550 476819 475589 474914 475473 478335 484139 492632
62393 492632 503092 515022 528384 543421 560414 579518 600718 624003 649553 677603 708185
62382 708185 741182 776502 813851 852394 891099 929518 967771 1005589 1041822 1075218 1105310
62371 1105310 1132183 1155606 1174727 1188448 1195800 1196217 1189916 1177975 1161779 1142392 1120613 1097314
62359 1097314 1073264 1048677 1023322 997169 970633 944243 918348 893206 869104 846291 824987
62348 824987 805507 788178 773113 760244 749651 741640 736381 733565 732611 733162 735256 738932 743798
62335 743798 749161 754587 760072 765487 770088 772924 773707 772886 770867 767504 762447 755593 747059 737142 726553
62320 726553 716213 706381 696269 685037 673028 661593 651756 643468 636096 629209 622789 617101 612593
62307 612593 609686 608458 608557 609466 610824 612492 614424 616513 618578 620601 622953 626175 630431 635366 640626
62292 640626 646305 652716 659924 667773 676206 685342 695396 706693 719524 733714 748565 763600 779270
62279 779270 796560 815995 837352 860226 884439 909905 936484 964028 992306 1020805 1048940
62268 1048940 1076460 1103320 1129075 1152757 1173507 1191137 1205986 1218481 1228943 1237557 1244207 1248459
62256 1248459 1249963 1248948 1246239 1242708 1238639 1233661 1227383 1220125 1212929 1206822 1202178 1198799 1196377 1194743
62242 1194743 1193867 1193825 1194584 1195664 1196252 1195933 1195103 1194379 1193848 1193305 1193014 1193637 1195337 1197491 1199465 1201263 1203219
62225 1203219 1205496 1208288 1212194 1217861 1225191 1233257 1241183 1248945 1257138 1266116 1275632 1285316 1295248 1305866
62211 1305866 1317601 1330863 1346127 1363546 1382513 1402125 1422183 1443272 1465723 1489082 1512958
62200 1512958 1537776 1564141 1591692 1619171 1645472 1670194 1693392 1715312 1736296 1756486 1775678
62189 1775678 1793885 1812022 1831566 1853403 1877290 1902475 1928560 1955709 1984186 2013795 2043752
62178 2043752 2073226 2102006 2130296 2157866 2183874 2207728 2229560 2249520 2267300 2282889 2297107
62167 2297107 2310491 2322134 2330611 2335761 2338571 2339495 2338079 2334318 2329274 2323997 2318734 2313514 2308631 2304078
62153 2304078 2299235 2293639 2287540 2281350 2275093 2268750 2262569 2256606 2250445 2243732 2236546 2228996 2221010 2212856
62139 2212856 2205237 2198428 2191866 2185063 2178375 2172374 2166964 2161707 2156571 2151678 2146667 2140934 2134340 2127120
62125 2127120 2119303 2110756 2101672 2092501 2083482 2074650 2066129 2057981 2049840 2041141 2031760 2022165 2012970 2004501
62111 2004501 1996632 1988836 1980569 1971791 1962927 1954204 1945402 1936438 1927794 1920028 1913218 1907200 1901954 1897387
62097 1897387 1893187 1889424 1886947 1886629 1888453 1891862 1896701 1903241 1911477 1921111 1932184 1945142 1960199
62084 1960199 1977026 1994829 2012059 2026072 2033882 2033788 2026231 2013213 1997282 1980895 1965918 1953007
62072 1953007 1941289 1928619 1912136 1889131 1858166 1819771 1776006 1729369 1682094 1635890 1591577
62061 1591577 1548958 1507610 1467876 1430661 1396315 1364361 1334434 1306818 1281732 1258595 1236496
62050 1236496 1215138 1194933 1176323 1159238 1143002 1126505 1108677 1089155 1068518 1047716 1027301
62039 1027301 1007288 987518 967894 948354 928907 909777 891387 874042 857676 841881 826223
62028 826223 810538 794964 779734 765053 751177 738466 727154 717072 707735 698729 689975 681695
62016 681695 674259 668021 663127 659411 656577 654504 653294 653006 653356 653720 653377 651806 648738 643909 636859
62001 636859 627213 615205 601767 587938 574297 561015 548216 536085 524755 514321 504938 496773
61989 496773 489868 484167 479506 475553 471881 468328 465195 462969 461920 462015 463064 464809 467043 469740 472882
61974 472882 476066 478578 480136 481335 483049 485580 488647 492019 495755 499894 504268 508704 513171 517727
61960 517727 522480 527597 533251 539605 546907 555366 564847 574989 585810 597850 611398 626020 641353
61947 641353 657980 676827 697853 720110 743161 767730 794762 824556 857161 893088 933076
61936 933076 977426 1025971 1078434 1134431 1193337 1254669 1318697 1386442 1459114 1537838 1623949
61925 1623949 1719159 1825051 1942315 2070444 2207958 2352596 2501059 2648634 2789324 2916463
61915 2916463 3023289 3103313 3150974 3162737 3137904 3078466 2988396 2873181 2739578 2594881
61905 2594881 2445692 2296995 2152226 2013935 1884223 1764539 1655166 1555165 1463054 1377668
61895 1377668 1298375 1224744 1156391 1093191 1035237 982419 934275 890373 850503 814406 781708
61884 781708 752346 726578 704297 684772 667471 652643 640548 630626 622126 615187 610411 607565
61872 607565 605572 603847 602766 602725 603608 605478 608934 614253 620736 627449 634185 641246 648726 656509 664720
61857 664720 673599 683007 692345 700841 707777 712783 716257 719143 721921 724064 724975 725133 725769 727514 730000
61842 730000 732756 735809 739200 742522 745357 747834 750301 752765 755061 757431 760389 763965 767588 770950
61828 770950 774735 780250 788505 799822 814067 830959 850197 871486 894290 917457 939387 958987
61816 958987 976384 992419 1007691 1022543 1037776 1054715 1074620 1098616 1128117 1164479 1208012
61805 1208012 1258137 1314885 1379500 1453191 1536167 1628613 1731951 1848286 1979098 2125285
61795 2125285 2287908 2467791 2664557 2876989 3104175 3345276 3597945 3857496 4117288
61786 4117288 4368820 4601396 4802890 4961724 5068239 5115082 5098104 5017963 4880516 4695234
61776 4695234 4473298 4226556 3966485 3702718 3442361 3190686 2951795 2728346 2521381
61767 2521381 2331039 2157213 1999465 1856963 1728870 1614277 1511602 1418874 1335047 1260324
61757 1260324 1194621 1136389 1083573 1035117 990852 950464 913451 879654 848970 820746 794284
61746 794284 769786 747961 728678 710778 693388 676750 661533 647820 635065 622787 611002
61735 611002 600084 590307 581566 573654 566742 561283 557276 553969 550606 547185 544163 541644 539220 536438
61721 536438 533080 529108 524648 519927 515075 510168 505581 501888 499154 496764 494413 492793 492743 494098 496025
61706 496025 498154 500601 503062 504781 505512 505770 505957 505886 505407 504849 504537 504395 504414 505033 506497 508084 508437
61689 508437 506695 503035 498139 492382 485589 477446 468024 457825 447359 436859 426505 416659 407641
61676 407641 399408 391734 384589 378026 371819 365688 359888 355124 351732 349262 347038 344740 342320 339718
61662 339718 337013 334611 332851 331533 330183 328797 327984 328214 329153 329986 330330 330558 331099 331637 331372 330083
61646 330083 328597 327997 328547 329651 330694 331516 332053 331985 331074 329702 328749 328849 329879 331163 332071 332368 332179
61629 332179 331854 331832 332406 333461 334618 335728 337044 338719 340388 341545 342196 342709 343104 343007 342382 341800 341713
61612 341713 341863 341708 341184 340728 340730 341226 342037 343050 344384 346299 348756 351176 353049 354851 357838 362707
61596 362707 368963 375866 383435 392017 401362 410837 420393 430660 442068 454325 466762 478807 490196
61583 490196 501174 512584 525483 540622 558352 578739 601422 625601 650665 676747 704174
61572 704174 732272 759036 782019 799371 810245 814645 812954 805467 792549 775399 756201 736949
61560 736949 718337 700353 683602 669234 657657 648265 640658 635269 632405 631361 631073 631162 631818 633014
61546 633014 634431 635923 637497 638892 639672 639740 639365 638622 637182 634835 631978 629315 627202 625500 624066
61531 624066 623148 623156 624209 626145 628944 632916 638406 645560 654459 665290 678235 693437 711213 732079
61517 732079 756384 784152 815476 850843 890795 935474 984814 1038940 1098118 1162417 1231665
61506 1231665 1305452 1382853 1462397 1542544 1621819 1698189 1768984 1832345 1888649 1939908 1988037
61495 1988037 2034438 2080837 2129123 2179856 2231766 2283200 2333427 2382332 2429685 2475365 2519619
61484 2519619 2562204 2601446 2634613 2658973 2671962 2670613 2651741 2613171 2554855 2478908 2388744
61473 2388744 2288119 2180766 2070754 1962705 1860954 1768166 1684970 1611009 1545960 1489484
61463 1489484 1440876 1399350 1364410 1335551 1311833 1292244 1276401 1264552 1256956 1253481 1253714 1257121
61451 1257121 1263227 1271922 1283570 1298636 1317349 1339915 1366885 1399025 1436842 1480440 1529705 1584306
61439 1584306 1643394 1705242 1766932 1824235 1872153 1906268 1924131 1925812 1913670 1891697 1864408
61428 1864408 1835448 1806864 1779706 1755109 1734541 1719275 1710110 1707563 1711905 1722992 1740425 1763811
61416 1763811 1792113 1822285 1848936 1865959 1868766 1855319 1825954 1783186 1731567 1676488 1622084
61405 1622084 1570138 1521189 1476364 1437509 1405547 1379407 1357055 1337353 1320564 1307278 1297304
61394 1297304 1289724 1283715 1279211 1276924 1277809 1282361 1290365 1301408 1315586 1333627 1356314 1383925 1416217
61381 1416217 1452825 1493644 1538893 1588740 1642807 1700124 1759762 1821415 1885085 1950160 2014905
61370 2014905 2076861 2133643 2183442 2224980 2257120 2278594 2288306 2285937 2272010 2247213 2211937 2166775
61358 2166775 2113204 2053366 1989256 1922410 1854126 1785473 1717116 1649641 1584058 1521553 1462718
61347 1462718 1407479 1355838 1308232 1265047 1226213 1191454 1160613 1133580 1110258 1090707 1075049
61336 1075049 1063126 1054578 1049264 1047226 1048198 1051648 1057448 1066009 1077508 1091427 1107108 1124413 1143567
61323 1143567 1164684 1187628 1211953 1236737 1260770 1283084 1302891 1318913 1329462 1333744 1332763 1328585
61311 1328585 1323056 1317566 1313385 1311343 1311235 1312193 1313760 1316230 1319966 1324770 1329982 1334907 1339080 1342318
61297 1342318 1344580 1345687 1345359 1343715 1341624 1340332 1340679 1342693 1345730 1348933 1351743 1354146 1356362 1358341
61283 1358341 1359879 1361186 1362920 1365560 1369205 1374150 1381055 1390186 1400973 1412674 1424950 1437222 1447929
61270 1447929 1455219 1458327 1457862 1454972 1450800 1446486 1442956 1440529 1439138 1438905 1440181 1443203 1448152 1455440
61256 1455440 1465437 1478025 1493020 1511059 1533478 1561187 1594128 1631952 1674794 1723218 1777903
61245 1777903 1839632 1909150 1986512 2070384 2157726 2243589 2321031 2381919 2418986 2428099 2409337
61234 2409337 2366431 2305326 2232725 2155080 2077984 2005764 1941243 1885927 1840614 1805900 1782147
61223 1782147 1769241 1766763 1774457 1792062 1818125 1848680 1877312 1897079 1902976 1892970 1867238 1827228
61211 1827228 1775897 1718101 1659363 1603532 1551746 1503489 1458019 1414696 1372961 1332898 1295599
61200 1295599 1262428 1233943 1209687 1188724 1170122 1153279 1138083 1124443 1111529 1098062 1083760
61189 1083760 1069878 1057698 1046967 1036429 1025458 1014376 1003549 993014 982908 973444 964449 955531
61177 955531 946783 938787 931973 926414 922126 919050 916902 915640 915909 918437 923031 928790 935082 941535
61163 941535 947127 950054 948667 941966 929348 910767 887333 860975 833208 804730 776220 748639
61151 748639 722589 698184 675924 656845 641321 628344 616501 605180 594412 584203 574643 566219
61139 566219 559289 553453 548030 543012 539071 536602 535168 533933 532416 530822 529769 529797 531169 534103 538902
61124 538902 545585 553626 562496 572274 583157 594462 604721 612805 618374 621186 620759 617071 611027 603890
61110 603890 596592 589780 583978 579365 575769 573147 571694 571351 571712 572664 574517 577233 580064 582431 584675
61095 584675 587473 590870 594292 597225 599463 600943 601732 602016 601903 601488 601220 601792 603408 605498 607415 609134
61079 609134 611070 613544 616531 619545 621695 622354 621906 621244 620373 618251 614286 609232 604128 599090 593742
61064 593742 588244 583148 578654 574682 571427 569320 568661 569701 572702 577503 583376 589770 596914 605389
61050 605389 615494 627361 641156 656693 673276 690294 707537 724730 741398 757546 773696
61039 773696 789773 804764 818025 830055 841250 850819 857927 863070 867278 870705 873191 875554 878926
61026 878926 883240 887711 892559 898970 907536 917981 930317 944945 961635 979646 999073 1020983
61014 1020983 1046035 1073910 1104265 1137326 1173378 1212430 1254492 1299591 1347663 1399145 1455315
61003 1455315 1517167 1584363 1656299 1733660 1817726 1908695 2006199 2111035 2224438 2345622 2471626
60992 2471626 2599585 2727625 2854015 2977971 3102037 3231914 3373537 3531916 3712549
60983 3712549 3921089 4160592 4431352 4734765 5076205 5464868 5914556 6446008 7085322
60974 7085322 7858255 8788288 9900895 11226390 12799377 14663755 16883183 19540964
60966 19540964 22725881 26525241 31025267 36263328 42090890 48031670 53316192 57171028
60958 57171028 59195996 59546025 58801088 57678060 56809015 56636799 57321070 58615465 59850069
60949 59850069 60157494 58865947 55797742 51279995 45915391 40314180 34936246 30054379
60941 30054379 25781935 22122944 19025592 16422002 14244958 12430829 10922227 9670819
60933 9670819 8634936 7775204 7054894 6443225 5915815 5453062 5040561 4670040 4336859
60924 4336859 4036349 3763954 3517643 3297483 3102688 2930851 2779573 2646492 2527443
60915 2527443 2416577 2309078 2202781 2097212 1992570 1890029 1791656 1699240 1613611 1535031
60905 1535031 1463438 1398357 1339423 1286929 1241056 1200805 1164623 1131933 1103013 1077623 1054945
60894 1054945 1034781 1017460 1002332 987608 972127 956384 941393 927355 913752 899984 885611
60883 885611 870564 855355 840527 825933 811202 796754 783451 771288 759510 748057 737776
60872 737776 728900 720500 711812 703122 694856 686806 678819 671281 664285 657181 649669 642534 636588 631610
60858 631610 627115 623368 620683 618280 614985 610835 606945 603767 600277 595051 587632 578722 569549 561207
60844 561207 554286 548837 544642 541462 539137 537640 537031 537147 537428 537366 536990 536442 535241 532677 528893 524787
60828 524787 520773 516554 512329 509179 507654 506779 505137 502251 498315 493345 487439 481300 475650 470499
60814 470499 465725 461887 459587 458385 457191 455511 453600 451671 449801 448417 447968 448117 447980 447202 446189
60799 446189 445289 444413 443432 442420 441425 440451 439588 438794 437716 436224 434808 433845 432652 429965 425285 419208
60783 419208 412625 406174 400258 394832 389282 383175 377026 371670 367150 363010 359429 357047 355715 354504
60769 354504 353056 351922 351352 350812 350081 349816 350517 351756 353017 354539 356726 359371 362039 364661 367174
60754 367174 369127 370270 371050 371916 372547 372413 371716 371137 370849 370422 369538 368322 367141 366513 366930 368220 369234
60737 369234 368793 366960 364880 363336 361914 359695 356355 352401 348517 344867 341076 336905 332867 329864
60723 329864 328082 326600 324427 321727 319632 318906 319130 319249 318602 317336 316017 315068 314582 314516 314905 315789 317115
60706 317115 318850 321065 323661 326159 328122 329724 331510 333607 335594 337227 338746 340284 341517 342296
60692 342296 343133 344550 346172 347029 346751 346032 345882 346666 347900 348801 348950 348563 348221 348425 349481 351630 354952
60675 354952 359128 363641 368305 373321 378733 384144 389088 393388 397038 400157 403223 406912 411392 416039
60661 416039 420118 423415 426046 428039 429365 429934 429204 426291 421007 414407 407820 401676 395878 390913 387656
60646 387656 386137 385391 384729 384426 384863 385660 386137 386161 385987 385562 384526 382832 380901 379086 377312 375340 373095
60629 373095 370542 367480 363764 359778 356432 354518 354120 354663 355371 355615 355091 354048 353276 353501 354682 356135
60613 356135 357430 358927 361255 364550 368385 372344 376429 380970 386269 392335 398920 405876 413426 421997
60599 421997 431832 442942 455313 468841 483115 497613 512201 527057 541884 555477 566362 573797
60587 573797 578019 579603 578666 574722 567353 557120 545527 533855 522292 510572 499164 489075 480583
60574 480583 473002 465905 459809 455232 451734 448402 444886 441478 438554 436349 434991 434373 434263 434775 436348
60559 436348 438949 441745 443947 445596 447155 448778 450416 452215 454230 456131 457679 459171 460990 463096
60545 463096 465504 468769 473354 478927 485003 491900 500254 509900 520197 531318 544295 559722 577311
60532 577311 596888 618982 644201 672765 705013 741770 783860 831745 886033 947999 1019197
60521 1019197 1100702 1192849 1295373 1407346 1526713 1649593 1769909 1880176 1973437 2044797
60511 2044797 2091339 2111461 2105389 2076278 2029778 1971928 1907548 1840263 1772935 1707470 1644793
60500 1644793 1585615 1531035 1482150 1439447 1403055 1373442 1351554 1338362 1334489 1340253 1355974 1382285
60488 1382285 1420149 1470466 1533698 1609751 1697680 1794890 1896644 1996800 2089246 2168804 2231642
60477 2231642 2276026 2303109 2316692 2322161 2325655 2333237 2349113 2373818 2404680 2438469 2473448 2509270
60465 2509270 2546439 2587077 2635907 2699743 2785922 2901313 3052072 3243297 3478571 3759862
60455 3759862 4087530 4459588 4870096 5307217 5751759 6177363 6553292 6849172 7039519
60446 7039519 7106725 7043075 6852432 6550453 6162054 5716758 5243949 4769287 4312450 3886399
60436 3886399 3498226 3150782 2843880 2574989 2340129 2135148 1956548 1801285 1666168
60427 1666168 1547907 1443896 1352642 1273181 1204251 1144439 1093014 1049906 1014597 985612 961565
60416 961565 942145 927412 916523 908016 901202 896481 894318 894750 897945 904293 913562 924720 936986
60403 936986 950410 964960 979637 993041 1004430 1013699 1020646 1024814 1025927 1024069 1019503 1012529 1003497
60390 1003497 992884 981543 970782 961699 954349 948010 942361 937731 934070 930443 926116 921516 917463
60377 917463 913892 910073 905844 901938 899150 897733 897544 898207 898998 898915 896931 892069 883437 870578 853806
60362 853806 833985 812033 788687 764464 739600 714224 688858 664542 642184 622012 603867
60351 603867 587736 573649 561376 550658 541614 534488 529082 524810 521212 518169 515743 514079 513321
60338 513321 513280 513349 513098 512794 512975 513562 513759 512822 510644 507604 504183 500745 497502 494566 492007 489784 487646
60321 487646 485405 483321 481902 481179 480572 479668 478712 478029 477440 476659 475838 475193 474425 473160 471726 470885 470894 471463
60303 471463 472519 474261 476410 478124 479070 480081 482317 485953 489968 493145 495106 496470 498127 500395
60289 500395 502865 505021 506895 509052 512130 516491 522122 528719 536073 544514 554771 567187 581384
60276 581384 596852 613515 631368 649970 668715 687342 705647 722987 738684 752850 766225
60265 766225 779237 791701 803482 814903 826376 838010 849670 861164 872359 883389 894632
60254 894632 906200 917712 929100 941468 956441 974630 995303 1017596 1041393 1066825 1093665
60243 1093665 1121653 1150959 1181875 1214340 1248087 1282980 1318905 1355631 1393062 1431370 1470590
60232 1470590 1510345 1550279 1590539 1631523 1673292 1715539 1757945 1800302 1842256 1883184 1922337
60221 1922337 1959134 1993485 2025894 2056934 2086462 2113635 2137917 2159834 2180413 2200118 2218672
60210 2218672 2235646 2250712 2263363 2273051 2279848 2284603 2288164 2290779 2292596 2294461 2297712 2303174 2310731
60197 2310731 2319955 2330742 2343149 2356980 2371944 2388142 2406016 2425709 2446551 2467078 2485419
60186 2485419 2499878 2509534 2514328 2514392 2509403 2498813 2482517 2460712 2433048 2398460 2356135 2306295
60174 2306295 2249975 2188557 2123838 2058002 1992930 1929757 1869426 1813275 1762504 1717277 1676987
60163 1676987 1641358 1610833 1585919 1566688 1552962 1544479 1540723 1540955 1544501 1550704 1558500 1566446 1573274
60150 1573274 1578160 1580444 1579613 1575840 1570091 1563203 1554990 1544692 1532381 1519620 1508562 1500555 1495817
60137 1495817 1494388 1497093 1505339 1520153 1541807 1570485 1607034 1652794 1708769 1775075 1851004 1935427
60125 1935427 2027144 2124921 2227173 2331755 2436367 2539222 2639099 2734963 2826175 2913167
60115 2913167 2997128 3078448 3155913 3227796 3293144 3351302 3400639 3438721 3463673 3474675 3471261
60104 3471261 3453020 3420170 3373735 3314958 3245088 3165851 3079365 2987306 2890648 2790557 2688967
60093 2688967 2587948 2488979 2393338 2302846 2219724 2145745 2081791 2028012 1984136 1949830 1925115
60082 1925115 1910431 1906054 1911498 1925597 1947057 1974738 2007462 2043806 2082161 2120940 2158731 2194251
60070 2194251 2226298 2253951 2277003 2296077 2312193 2326253 2339035 2351367 2363951 2377140 2391164
60059 2391164 2406421 2423108 2440610 2457713 2473446 2487224 2498127 2504641 2505518 2500605 2490526 2475803
60047 2475803 2456668 2433621 2407745 2380348 2352326 2323948 2295200 2266458 2238863 2214085 2193745
60036 2193745 2178959 2170117 2166822 2168098 2172921 2180487 2189823 2199293 2206870 2210948 2210701 2205754 2195752 2180238
60022 2180238 2158660 2130646 2096626 2058146 2017166 1974925 1931827 1888414 1845989 1806056 1769460
60011 1769460 1736327 1706572 1680183 1657224 1637910 1622846 1613019 1609336 1612052 1620690 1634673 1653998
59999 1653998 1679113 1710189 1746938 1789222 1837305 1891092 1949402 2010337 2072048 2132818 2190841
59988 2190841 2244508 2292756 2334753 2369632 2397002 2417177 2430131 2434554 2428887 2413131 2388727 2356827
59976 2356827 2317796 2272583 2223474 2173105 2123527 2076538 2033947 1996877 1965508 1940105 1921667
59965 1921667 1910940 1907360 1909693 1917412 1930914 1950550 1975950 2006076 2039559 2075116 2111908 2149328
59953 2149328 2186368 2221637 2254288 2284525 2312911 2339535 2364135 2386520 2406428 2423225 2436155
59942 2436155 2444693 2448483 2447360 2441878 2433543 2424198 2415373 2408367 2404533 2405173 2411507 2425017 2447435 2480032
59928 2480032 2523202 2576986 2641528 2716712 2801788 2895733 2997498 3105470 3217123 3329632
59918 3329632 3440339 3546084 3642582 3725263 3790624 3836401 3861062 3864064 3846578 3811236 3761164
59907 3761164 3699746 3631092 3559806 3489909 3424340 3365562 3316111 3278332 3253908 3243894 3249064
59896 3249064 3270120 3307625 3361664 3431242 3513759 3604897 3698824 3788645 3867327 3929095 3970655
59885 3970655 3991781 3995241 3985968 3969327 3949298 3927948 3906134 3883909 3860129 3832542 3798982 3758199
59873 3758199 3709484 3652309 3587066 3515669 3440882 3365469 3292429 3225197 3166633 3118220 3081177
59862 3081177 3058003 3051927 3064885 3097022 3148209 3219104 3310429 3421777 3551188 3695135 3848469
59851 3848469 4004548 4155421 4291856 4404025 4483547 4525695 4529876 4498688 4437303 4353088 4253991
59840 4253991 4146153 4033033 3916432 3797254 3675060 3548112 3414983 3276084 3133579
59831 3133579 2990452 2850052 2715814 2590543 2475947 2373102 2283047 2206544 2143433 2092549
59821 2092549 2052145 2020255 1995034 1975262 1960639 1951436 1947890 1949768 1956179 1965569 1976025 1985670
59809 1985670 1992882 1996666 1997549 1998195 2002565 2014147 2035028 2066249 2108016 2159198 2217457 2280776 2348908
59796 2348908 2423183 2505141 2595287 2692123 2791217 2885140 2965025 3022911 3053384 3054228 3026762 2975685
59784 2975685 2907871 2830538 2749938 2670897 2596583 2528336 2466089 2409352 2357869 2311382 2269185
59773 2269185 2230299 2194213 2161330 2132643 2109050 2091028 2078777 2072344 2071508 2075773 2084763 2098520
59761 2098520 2117183 2140427 2167420 2197231 2229041 2262104 2295962 2330809 2367254 2405658 2446133
59750 2446133 2489375 2536949 2590257 2649497 2714180 2784541 2861821 2947118 3040504 3141526 3250022
59739 3250022 3365796 3487554 3612557 3737340 3858432 3972447 4076215 4167590 4246245 4313537
59729 4313537 4371741 4423691 4472936 4523569 4579477 4643729 4718575 4805562 4905443 5018108 5142572
59718 5142572 5276582 5416163 5556215 5692142 5820794 5939677 6045934 6136902 6211488 6270211
59708 6270211 6313858 6342872 6358300 6362701 6359614 6352530 6344863 6340642 6344482 6360564 6391789 6439955
59696 6439955 6506535 6593077 6700868 6830363 6981049 7151924 7342047 7550454 7775351 8013232
59686 8013232 8258710 8505062 8744702 8969002 9168030 9331265 9449295 9515181 9524736 9476569
59676 9476569 9372808 9219630 9026174 8802415 8557881 8301528 8041234 7782359 7526815
59667 7526815 7273570 7019668 6761116 6494467 6219168 5938574 5658313 5383809 5119333
59658 5119333 4868203 4632365 4411736 4204898 4010648 3828360 3657024 3494966 3340978
59649 3340978 3195156 3058192 2930207 2810537 2698443 2593707 2496716 2408131 2328441 2257742
59639 2257742 2195942 2142944 2098449 2061739 2031929 2008249 1989859 1975649 1964599 1956066 1949214 1942407
59627 1942407 1933803 1922579 1909043 1893560 1875990 1856329 1835281 1813783 1792218 1770358 1747890
59616 1747890 1724814 1701520 1678649 1656838 1636565 1618232 1602206 1588613 1577270 1567990 1560691 1554923
59604 1554923 1549667 1544029 1537922 1531610 1524957 1517741 1510482 1504133 1498914 1494185 1489627 1485916 1484023 1484350
59590 1484350 1486726 1490764 1495979 1502000 1508872 1516931 1526413 1537605 1551339 1568715 1590119 1614958 1642512
59577 1642512 1672592 1705198 1739975 1776263 1813354 1850612 1887816 1925614 1965294 2007892 2053721
59566 2053721 2102682 2154581 2209089 2266001 2325748 2389187 2456602 2527231 2599886 2673611 2747480
59555 2747480 2820170 2890046 2955480 3014962 3067142 3110904 3145302 3169551 3183174 3185697 3175572
59544 3175572 3149878 3106346 3046085 2973819 2895325 2815215 2736962 2663680 2598027 2541884 2496668
59533 2496668 2463558 2443183 2435758 2441888 2462584 2498034 2546883 2607098 2676822 2753800 2834609 2915121
59521 2915121 2991338 3059307 3114893 3154491 3175788 3177370 3158116 3117695 3057396 2979821 2888013
59510 2888013 2785414 2676184 2564636 2454193 2347245 2245671 2150905 2063721 1984595 1914202
59500 1914202 1853033 1800806 1756918 1721325 1694252 1675161 1662833 1656625 1656948 1664310 1678491 1698973
59488 1698973 1725672 1758771 1798044 1842692 1891800 1944732 2001035 2059896 2119609 2177634 2231344
59477 2231344 2278735 2318338 2348611 2367652 2373661 2365706 2344210 2310710 2267039 2214628 2154619 2088486
59465 2088486 2018118 1945357 1871883 1799557 1730170 1664453 1601889 1542034 1485634 1433894 1387025
59454 1387025 1344250 1305093 1269938 1239154 1212290 1188484 1167422 1149603 1135692 1125720 1118995 1114814
59442 1114814 1113088 1114048 1117457 1122625 1129345 1138298 1150228 1165108 1182409 1201804 1223204 1246514 1271787
59429 1271787 1299331 1329220 1361082 1394910 1431664 1472125 1515021 1556935 1594321 1625496 1651017
59418 1651017 1673000 1694348 1717975 1746036 1779684 1819484 1865744 1918233 1975555 2034834 2092314
59407 2092314 2144965 2192324 2237019 2283332 2335024 2394276 2462002 2538481 2623667 2717403 2819567
59396 2819567 2929834 3047187 3169710 3294772 3419295 3540219 3655382 3764355 3868444
59387 3868444 3969915 4071231 4174741 4282450 4395693 4514934 4639786 4768969 4900151
59378 4900151 5030080 5155336 5273334 5382764 5483086 5573716 5653995 5723978 5784799 5837792
59368 5837792 5883462 5921719 5952706 5976520 5991877 5995673 5984110 5953862 5902214 5827149 5728172
59357 5728172 5606756 5465606 5307862 5137485 4959871 4781163 4606762 4440631 4285597
59348 4285597 4143571 4015371 3900733 3798662 3707583 3625234 3548717 3474877 3400946 3325285
59338 3325285 3247736 3169065 3089905 3010410 2930772 2851496 2773018 2695509 2619303 2544991 2472789
59327 2472789 2402287 2333158 2265699 2200404 2137522 2077357 2020481 1967249 1917709 1872372 1832402
59316 1832402 1798373 1769420 1744349 1723164 1706778 1695668 1689628 1688544 1692503 1701200 1713928 1730096
59304 1730096 1749252 1770820 1794409 1820176 1848202 1877733 1907726 1938084 1969697 2003352 2039142
59293 2039142 2076754 2115646 2154965 2193869 2231758 2267687 2299797 2326099 2345706 2358583 2364198
59282 2364198 2361220 2348694 2326962 2297426 2261986 2222670 2181242 2139078 2097826 2059856 2027347
59271 2027347 2001045 1980538 1965630 1956701 1953809 1956318 1963581 1975396 1991743 2012680 2038517 2069567
59259 2069567 2105655 2146089 2189263 2231160 2264820 2283295 2284206 2271058 2250218 2227530 2207528 2193755
59247 2193755 2188260 2191278 2202291 2221179 2248030 2282601 2324687 2374572 2432497 2498037 2570520 2649708
59235 2649708 2735572 2827720 2925513 3028446 3136075 3247800 3363009 3481001 3600405 3718966
59225 3718966 3834121 3943338 4043592 4131073 4201978 4253399 4283190 4289587 4271638 4229825 4165853
59214 4165853 4082133 3981972 3869945 3751329 3631051 3513407 3402434 3301740 3213673 3139067
59204 3139067 3077988 3030540 2996798 2976248 2967611 2969264 2979782 2998047 3022943 3053043 3086545 3121241
59192 3121241 3154328 3182336 3201570 3208853 3202052 3180335 3144295 3095781 3037273 2971244 2900009 2825813
59180 2825813 2750616 2675825 2602341 2530721 2461133 2393496 2328008 2265288 2205708 2149038 2095289
59169 2095289 2045496 2000883 1961474 1926399 1895470 1869461 1848620 1831834 1817749 1806015 1796940
59158 1796940 1790424 1785924 1783213 1782717 1785319 1792142 1804296 1822292 1845551 1872637 1901992 1932504 1963546
59145 1963546 1994658 2025247 2054600 2082108 2107315 2129665 2148462 2163179 2173427 2178459 2177154 2168925
59133 2168925 2154268 2134064 2108780 2078863 2045499 2010322 1974795 1940634 1910417 1886731 1870707
59122 1870707 1862139 1860805 1866640 1878671 1894969 1914014 1935304 1958368 1982064 2005225 2027263 2047682
59110 2047682 2065516 2079601 2088943 2092699 2090476 2082954 2071736 2058307 2043579 2028516 2014492 2002786
59098 2002786 1994159 1989022 1987432 1988854 1992545 1998203 2005498 2012831 2017433 2016978 2010560 1998078 1979613 1955775
59084 1955775 1927771 1896637 1862937 1827484 1791705 1756993 1724204 1693817 1665782 1639173 1613038
59073 1613038 1587875 1565269 1545791 1528295 1511721 1496373 1482853 1470973 1460682 1453135 1449817 1451101
59061 1451101 1456247 1463825 1471287 1474969 1471770 1460593 1441642 1415211 1382154 1344833 1306380 1269217
59049 1269217 1234995 1205325 1181388 1163077 1149567 1140674 1136934 1138583 1145088 1155336 1167583 1179756
59037 1179756 1190719 1201002 1211460 1221713 1230984 1240149 1251627 1267146 1286726 1310148 1338368 1372940
59025 1372940 1414672 1463400 1518790 1580970 1650325 1726602 1808054 1891641 1974292 2053557 2126643
59014 2126643 2189284 2236469 2264443 2271741 2258693 2226841 2179085 2119738 2053799 1985864 1919403
59003 1919403 1856824 1800149 1751562 1712901 1684593 1665537 1654250 1649591 1650192 1653967 1658767 1663044
58991 1663044 1665461 1664431 1658733 1648095 1632594 1612044 1586736 1558387 1529576 1502509 1478869 1460218
58979 1460218 1447490 1440333 1437880 1439996 1446922 1457898 1471114 1485002 1498752 1511695 1523231 1533611
58967 1533611 1543904 1554796 1565961 1576832 1587412 1598056 1608942 1619976 1630849 1640981 1649767
58956 1649767 1657066 1663285 1669032 1675033 1682377 1692464 1706569 1725636 1750389 1781384 1818899 1862858
58944 1862858 1912600 1966365 2021058 2072699 2117138 2150630 2170676 2177025 2171749 2158081 2139486 2119818
58932 2119818 2103323 2093335 2091044 2096072 2108021 2126954 2152803 2185139 2223501 2267526 2317023 2372525
58920 2372525 2435629 2508254 2591726 2686951 2794981 2916563 3051210 3197293 3352767 3515035
58910 3515035 3680220 3843402 3999956 4146610 4281777 4405775 4520744 4629621 4734836
58901 4734836 4837933 4939856 5040695 5139054 5232124 5316468 5388632 5445479 5484537 5503866 5501205
58890 5501205 5473645 5418811 5336228 5227174 5093736 4938783 4766460 4581689 4389007 4192191
58880 4192191 3994604 3799057 3607470 3421345 3242433 3072278 2911371 2759608 2617545
58871 2617545 2486392 2366690 2257617 2157672 2065569 1980633 1902908 1832851 1770433 1714662 1664402
58860 1664402 1619297 1579353 1544089 1512892 1485857 1463404 1445278 1430726 1419411 1411208 1405346 1400827
58848 1400827 1397688 1396849 1398680 1402662 1408527 1416710 1427464 1440455 1455535 1473205 1493999 1518044 1545436
58835 1545436 1576431 1611107 1649341 1691184 1736682 1785286 1835912 1887491 1938885 1988594 2035500
58824 2035500 2079997 2123617 2167563 2212455 2259549 2311221 2369878 2436999 2513349 2599394 2695258
58813 2695258 2800859 2916313 3041632 3175967 3317655 3464971 3616195 3768945 3920116
58804 3920116 4066412 4204224 4329086 4436150 4521372 4581691 4614296 4616916 4589169 4532911 4451137
58793 4451137 4347299 4225714 4091420 3948983 3801866 3653164 3506317 3364861 3232009
58784 3232009 3110531 3002266 2907490 2825213 2753986 2691595 2633940 2575328 2510657 2437362 2355746
58773 2355746 2268422 2179449 2092823 2011088 1935537 1867445 1808214 1758430 1717894 1686838 1666175
58762 1666175 1656355 1656925 1667483 1688088 1718391 1757344 1804306 1859703 1924072 1997054 2077589 2164173
58750 2164173 2254268 2343969 2428754 2504358 2566957 2613275 2640939 2648439 2634926 2600914 2549275
58739 2549275 2484682 2411738 2334194 2255652 2179597 2108114 2041360 1978722 1919747 1863713 1809409
58728 1809409 1755986 1703394 1651559 1599944 1548507 1498521 1452040 1411052 1377340 1352309 1336331
58717 1336331 1328738 1328671 1335285 1346728 1359577 1369666 1373142 1366943 1349386 1320898 1283699 1240605 1194619
58704 1194619 1149295 1107985 1072188 1041440 1015029 992782 973861 956177 937815 918267 897779
58693 897779 876489 854969 834713 817268 803376 793415 787949 787267 791056 799003 811005 826411 843952
58680 843952 862978 883972 907259 932085 957554 983614 1010524 1038189 1066741 1097027 1129750
58669 1129750 1164601 1200435 1235103 1264275 1281615 1281670 1262729 1226744 1177552 1119983 1059535 1001070
58657 1001070 947421 899682 858441 824087 796332 774301 757043 743629 733129 725015 719287 715872
58645 715872 714316 714310 715888 718617 721172 722209 721330 718957 715851 713010 711253 710524 710215 710492 712544 717168
58629 717168 723946 732184 741802 752842 765118 779015 795815 816501 840847 868154 898082 930289
58617 930289 964231 1000079 1039071 1082258 1129533 1180363 1234518 1291388 1349514 1407578 1465043
58606 1465043 1521008 1573304 1619568 1658483 1689108 1709906 1719597 1718500 1708186 1690255 1666262 1638258
58594 1638258 1608495 1578909 1551476 1528569 1512236 1503424 1502294 1508691 1521872 1540489 1563287 1589218
58582 1589218 1616574 1643230 1668541 1694257 1722988 1756544 1796074 1842380 1894785 1950243 2004213
58571 2004213 2051629 2086577 2102493 2094208 2059772 2000315 1919522 1823824 1721312 1618693 1519660
58560 1519660 1426623 1342385 1268829 1205329 1150178 1102722 1062565 1027538 994264 960494 925687
58549 925687 889845 853236 817044 783028 752415 725636 702609 682590 664443 647840 633558
58538 633558 622000 612362 603936 597013 591590 586474 580907 575903 572785 571490 571642 573927 578838 585222
58524 585222 591879 599671 610230 623466 638206 654528 673513 695269 719093 745095 773737 804066
58512 804066 834240 863578 892443 920415 946407 970457 993776 1017092 1040516 1064994 1092353
58501 1092353 1123805 1159415 1198567 1239545 1279047 1313729 1342125 1363821 1377366 1380722 1373473 1356841
58489 1356841 1331627 1297826 1256229 1208778 1157303 1103326 1049105 997286 949327 905442 865945
58478 865945 831331 801180 774403 750633 730201 712926 698202 686047 676680 669240 662250 655160
58466 655160 648159 640798 632290 622973 614034 605921 598344 591508 585855 580842 575460 569843 564974 561055
58452 561055 557574 554655 552795 551540 549957 548219 547228 546970 546693 546364 546358 546167 545170 544322 545179 547479 549576
58435 549576 551060 552987 555594 557860 559493 561431 564102 566879 569550 572661 576204 579531 582772 586867
58421 586867 592010 597432 602794 608496 614751 621652 629834 639623 649942 659633 669362 680495 692694
58408 692694 704595 716423 729892 745885 764426 786644 814576 849196 890770 940876 1001907
58397 1001907 1075028 1161066 1263100 1385740 1532294 1704676 1903291 2120190 2330149 2493815
58387 2493815 2575726 2562004 2463556 2306945 2122966 1937743 1767161 1616608 1485650 1372538
58377 1372538 1275203 1191202 1118921 1058048 1008085 967447 934479 908029 886662 868830 854173
58366 854173 843136 835036 828179 822073 817694 815280 813724 812465 812105 812841 814143 816137 819292 822649
58352 822649 824638 825895 828919 834502 840899 846892 853176 860159 867039 873936 882520 893531 905937 919313
58338 919313 934693 952174 970030 987316 1005189 1024607 1044834 1065141 1085934 1107184 1127712
58327 1127712 1146869 1164970 1181447 1194696 1204521 1212595 1219805 1225274 1228644 1231019 1233012 1234225 1235377
58314 1235377 1238556 1244497 1251833 1259709 1268896 1279813 1291958 1305871 1323058 1343304 1364606 1386355
58302 1386355 1409984 1435953 1463009 1491001 1521481 1554805 1589743 1626748 1668501 1716380 1769458
58291 1769458 1827783 1893309 1966666 2046355 2132215 2226187 2328175 2434175 2539487 2640527
58281 2640527 2732524 2809081 2865707 2900997 2913951 2904032 2874991 2834666 2789434 2742116 2695807
58270 2695807 2655213 2622742 2597493 2579642 2571672 2573958 2583645 2599511 2623368 2655035 2690821 2729010
58258 2729010 2772085 2821349 2874148 2928718 2986928 3049807 3115204 3182423 3254362 3332534 3414730
58247 3414730 3500014 3590961 3688428 3789484 3893260 4003512 4122434 4247388 4376670 4512968
58237 4512968 4658005 4809553 4967006 5134166 5313215 5501822 5699449 5910356 6137039
58228 6137039 6377223 6630816 6903034 7196968 7510239 7843035 8202220 8593350 9016080
58219 9016080 9471716 9967525 10509406 11098610 11740259 12446713 13228362 14090551 15044122
58210 15044122 16109132 17304082 18643271 20150594 21864878 23827947 26082931 28692681
58202 28692681 31747663 35351803 39618899 44690833 50740324 57946434 66487982 76574390
58194 76574390 88471436 102503900 119071097 138663053 161805581 188948151 220375995
58187 220375995 256032683 294960480 334448750 369708418 394923175 405433467 399653877
58180 399653877 379449216 348965979 312944627 275468727 239423484 206478467 177349111
58173 177349111 152142744 130641422 112471882 97205714 84426935 73760685 64870162
58166 64870162 57456063 51266297 46093506 41759885 38112066 35026466 32407106 30179233
58158 30179233 28292705 26725063 25469984 24525855 23900219 23613355 23686491 24135420 24984175
58149 24984175 26275434 28065747 30431410 33485555 37365964 42204335 48138561 55313436
58141 55313436 63683812 72620720 80711840 86162450 87644575 84935316 78873076 70802224
58133 70802224 62010719 53446411 45666244 38896259 33146717 28333115 24343933 21055587
58125 21055587 18343981 16105694 14261077 12739525 11477102 10427375 9558738 8838800
58117 8838800 8231858 7710163 7255776 6851549 6480600 6133988 5809342 5502731 5210454
58108 5210454 4936870 4690846 4474784 4284546 4117918 3974461 3848464 3730924 3618389
58099 3618389 3512657 3412489 3312439 3208772 3099726 2981279 2849921 2709210 2567372
58090 2567372 2429145 2295796 2171338 2061439 1966414 1881625 1804749 1736825 1676582 1619870
58080 1619870 1565122 1514118 1467149 1422308 1379546 1340625 1304941 1269834 1234989 1202333 1171898
58069 1171898 1142026 1113319 1088085 1066129 1045174 1025219 1008368 994652 982022 970250 960860
58058 960860 953316 945100 935475 925580 915114 902682 889175 877021 866112 854150 840999 829055
58046 829055 819153 809727 800416 793131 788945 786760 785501 785094 785176 785395 786910 791048 796582 800766 802801
58031 802801 803795 803814 801868 798541 795830 794423 793732 794431 798339 805822 815804 828251 844324 864359 888090
58016 888090 916524 951171 991773 1037108 1087460 1143640 1204007 1265228 1325691 1385407 1442810
58005 1442810 1494519 1538374 1574174 1601392 1618735 1625968 1623708 1611377 1587876 1554368 1514032 1469018
57993 1469018 1420062 1369048 1319394 1273671 1233230 1200383 1178456 1169126 1171716 1185343 1209763 1243983
57981 1243983 1286184 1335309 1390750 1450323 1510357 1567567 1618663 1658217 1679522 1678424 1654933
57970 1654933 1611383 1551205 1479422 1401825 1322776 1245125 1171923 1106092 1048382 997813 954278
57959 954278 918718 890810 868816 852023 841169 836239 836080 840566 850961 867614 889363 915686
57947 915686 947460 985026 1027402 1073977 1125050 1179970 1236370 1291734 1344022 1390161 1425552
57936 1425552 1445866 1448370 1431715 1396253 1344957 1282428 1212636 1138689 1064186 992578 925093
57925 925093 861364 802224 749677 703858 662443 623794 588637 557929 531111 507320 486478
57914 486478 468326 452010 437415 425321 415666 407306 400033 395024 392686 391898 392087 394130 398321 403250
57900 403250 407709 412058 416724 421036 424569 427956 431158 432447 430448 425985 420703 414990 408398 401107
57886 401107 393803 386871 380500 374837 369481 363841 358531 355233 354583 355367 356446 358208 361387 365709 370579
57871 370579 376012 382051 388302 394727 401873 409671 417105 423571 429293 433906 436176 435966 434888 433940 431820
57856 431820 426824 419202 410422 401272 391999 383373 376163 370222 365213 361596 359797 359102 358484 357982 358306
57841 358306 359641 361827 365192 370130 376202 382442 388274 393530 398079 402043 405793 409104 410916 410562
57827 410562 408639 405989 402533 397921 392822 388644 386252 385554 386094 387595 390195 394522 401229 410319 421446
57812 421446 434876 451359 470925 492829 517042 544821 577375 614925 657530 705733 759643
57801 759643 818169 879588 941719 1000827 1051498 1088812 1110359 1115844 1105975 1082743 1049848 1011590
57789 1011590 971452 932087 895563 862576 832025 802315 772703 742857 712005 679545 645958
57778 645958 612223 578782 545820 514020 484184 456517 430967 407876 387668 370376 356019
57767 356019 344795 336297 329320 323185 318600 316419 316275 317322 319617 323742 329626 336810 345446 355876
57753 355876 367392 378395 387702 394938 399776 401614 400034 395146 387637 378910 370779 364327 359284 354915
57739 354915 351107 348104 345774 343870 342640 342432 343009 343920 345304 347643 350927 354631 358366 362117 366077
57724 366077 370611 376012 382002 387935 393849 400727 409252 418964 429161 439947 451730 464446 478133
57711 478133 493676 512044 533238 556862 583317 613380 646818 682221 718091 753460 787818
57700 787818 821383 855327 890925 928457 967452 1007705 1049277 1091613 1133284 1172492 1207252
57689 1207252 1235361 1255032 1265616 1267265 1260118 1244494 1221818 1194703 1166093 1138686 1114944 1097007
57677 1097007 1086528 1085078 1094643 1117409 1155256 1210038 1284383 1381814 1505986 1659956 1845853
57666 1845853 2063932 2309565 2568236 2811881 3002115 3102515 3093680 2980631 2788048 2548791
57656 2548791 2293708 2045927 1819071 1618837 1446666 1302388 1184279 1088877 1012553 952923
57646 952923 907988 874944 851243 836209 830263 832862 842427 857842 878652 904001 932750 964576
57634 964576 999631 1036892 1073872 1108041 1137635 1161143 1177195 1185144 1184838 1175674 1156840 1128686
57622 1128686 1092983 1051709 1006438 958977 911418 865020 819835 775904 734190 695848 661076
57611 661076 629160 599338 571392 545669 522678 502444 484261 467368 451767 437997 426355
57600 426355 416746 409086 403174 398289 393578 388859 384550 380836 377408 373913 370167 366107 362062 358859
57586 358859 356976 355803 354388 352761 351739 351609 351832 351983 352190 352572 353004 353487 354020 354124 353233 351536 349683
57569 349683 347626 344636 340644 336705 333845 332071 330787 329614 328596 328146 328989 331733 336364 342463 349816
57554 349816 358355 367851 378401 391035 406881 425708 446150 467493 490420 515929 544309 575263
57542 575263 608175 642111 676325 710867 745836 779978 810997 837370 858745 874369 882423 881602
57530 881602 872384 856154 834047 807282 777556 746114 713104 678775 644755 613155 584821 559279
57518 559279 536079 515322 497058 481031 467050 455050 444781 435875 428254 422171 417851 415242
57506 415242 413922 413104 412045 410646 409352 408334 407202 405720 404297 403431 403207 403730 405495 408767 413075
57491 413075 418015 424273 433196 445415 460398 477341 496090 517227 541493 568997 598762 629284
57479 629284 659775 690577 721941 752660 780278 802487 817950 826051 826489 819230 804556 783121
57467 783121 756139 725311 692120 657107 620163 581716 543481 507780 476005 447800 421863
57456 421863 397544 375391 355959 338574 321896 305560 290570 277873 267169 257442 248156 239477
57444 239477 231631 224451 217551 210784 204598 199787 196562 193909 190391 185651 180609 176122 172165 168493
57430 168493 165308 162753 160363 157670 154953 152834 151494 150709 150285 149889 148869 146930 144761 143407 143144
57415 143144 143440 143730 143684 143048 141957 141328 142172 144372 146698 148104 148577 148704 148957 149579 150661 152074 153631
57398 153631 155431 157719 160285 162366 163369 163435 163137 162852 162580 162122 161245 159823 158109 156739 156231 156459
57382 156459 156838 157104 157743 159430 162128 165034 167512 169730 172111 174547 176685 178827 181797 185777 190011
57367 190011 193959 198056 202726 207242 210429 212302 214169 217044 220606 223858 226210 227588 227965 227202 225286
57352 225286 222470 219314 216600 214961 214335 213972 213142 211804 210496 209739 209705 210311 211343 212496 213498 214362
57336 214362 215382 216804 218541 220286 221815 223071 224085 225051 226380 228342 230623 232639 234448 236844
57322 236844 240241 243951 247132 250133 254199 259965 266944 274480 282402 290601 298748 306808 315243 324219
57308 324219 333089 341039 347834 353535 357931 360731 361951 361707 359916 356677 352575 348117 343105 337089
57294 337089 330211 323136 316365 310192 305091 301502 299207 297405 295462 293250 290954 289055 288358 289445
57280 289445 291993 295004 297702 299795 301095 301560 301755 302580 304285 306254 307951 309564 311408 313218 314465
57265 314465 315081 315478 316068 317094 318726 320967 323498 325826 327631 328924 330007 331373 333448 336236 339298
57250 339298 342180 344788 347357 350221 353689 357915 362758 367968 373661 380424 388757 398517 409056 419807
57236 419807 430631 441748 453495 466042 479222 492670 506274 520296 534894 549720 564369
57225 564369 579169 595122 612922 632258 652310 672670 693514 715040 737180 759862 783163
57214 783163 806988 830960 854983 879647 905687 933074 961065 989134 1017445 1046257 1075280
57203 1075280 1103822 1131293 1157418 1182299 1206571 1231206 1256826 1283386 1310770 1339311 1369234
57192 1369234 1399842 1429862 1458584 1486167 1512863 1538580 1563294 1587210 1610155 1631298 1649973
57181 1649973 1666509 1681801 1696343 1710169 1723553 1737119 1751126 1765214 1779188 1793719 1809860
57170 1809860 1828003 1847701 1868475 1890433 1913965 1939100 1965324 1991833 2017762 2042374 2065267
57159 2065267 2086340 2105350 2121687 2134934 2145572 2154717 2163070 2170584 2177232 2183585 2190206 2196870 2202934
57146 2202934 2208279 2213366 2218398 2222985 2226743 2229717 2231949 2233095 2232929 2232039 2231592 2232413 2234579 2237964 2242844
57131 2242844 2249891 2259823 2273245 2290552 2311577 2335331 2360429 2385981 2411898 2438297 2464897 2491189
57119 2491189 2516975 2542516 2568503 2596359 2628376 2666885 2713105 2767195 2829518 2901481 2985018
57108 2985018 3081868 3193853 3323641 3474999 3652540 3861594 4108261 4399578 4744150 5153403
57098 5153403 5642707 6231727 6944104 7806674 8847926 10095957 11576770 13312983 15322003
57089 15322003 17613603 20188081 23034891 26129810 29430706 32875776 36387486 39880027
57081 39880027 43265353 46455695 49363336 51898120 53964534 55464795 56313811 56461468
57073 56461468 55907771 54700559 52919694 50659576 48017260 45086106 41953227 38700198
57065 38700198 35405277 32143948 28986338 25993077 23211475 20672871 18391887 16368428
57057 16368428 14591599 13043334 11700724 10538183 9530263 8653993 7889324 7218220
57049 7218220 6624047 6092120 5610722 5171614 4769588 4401391 4064687 3757523 3478197
57040 3478197 3225078 2996367 2790007 2603825 2435622 2283177 2144378 2017503 1901379
57031 1901379 1795275 1698687 1611076 1531552 1458778 1391362 1328448 1269849 1215637 1165772 1120148
57020 1120148 1078669 1040987 1006263 973419 941749 911258 882455 855863 831652 809648 789693
57009 789693 772012 757143 745528 737360 732865 732476 736547 745082 758013 775589 798399 827441 864670
56996 864670 913138 975838 1054484 1150165 1265163 1403407 1569436 1768415 2007511 2295925
56986 2295925 2643564 3061730 3563569 4153334 4801396 5425362 5905928 6138379 6083144 5776751
56976 5776751 5301496 4744834 4175521 3638512 3157823 2741433 2387662 2090926 1844350
56967 1844350 1640480 1472475 1335108 1224126 1135373 1065390 1012135 973902 947869 930665
56957 930665 919881 913888 910292 905629 896493 880335 855581 822308 782926 741235 700470 662732
56945 662732 629855 603432 583624 569015 558243 551096 547733 547725 550553 556346 565466 577813 593292
56932 593292 612540 636304 663910 692541 717753 734482 738274 726914 701544 666075 625206 582730
56920 582730 541072 501682 465536 433404 405692 382080 361582 343362 327402 314111 303367
56909 303367 294284 285959 278101 270926 264753 259814 256166 253565 251579 249969 248818 248208 248009 248180 249078
56894 249078 251153 254467 258892 264716 272688 283269 296185 310930 327441 345785 365165 383548
56882 383548 398372 407535 409842 405153 394584 380426 365325 351185 338812 328520 320854 316585
56870 316585 316100 319030 324638 332577 343167 357054 374863 397299 425245 459305 499204 543662
56858 543662 590415 635710 673981 699213 707682 699618 678321 648186 613668 579041 547703 521324
56846 521324 500118 484128 473957 470386 473784 484030 500730 523629 553278 591217 638964 696700
56834 696700 763311 837317 916339 994816 1063052 1110063 1128391 1116856 1079734 1024284 958696
56823 958696 890640 825933 767751 717090 674120 639130 612378 593496 581601 576129 577315 585702
56811 585702 601490 624679 655688 695311 743683 798958 856363 908167 945262 960414 951278 920818
56799 920818 875050 820438 762718 706653 655601 611112 573261 541588 515832 496040 482171
56788 482171 473683 469691 469726 474095 483142 496414 513149 533302 557018 582652 606002 622047 627166
56775 627166 619818 600267 570601 534465 495712 457147 420676 387898 359686 335556 314358 295581
56763 295581 279356 265442 253118 242110 232780 225136 218360 211665 205181 199665 195609 192803 190522
56750 190522 188026 185129 182357 180368 179232 178461 177562 176295 174659 173108 172552 173517 175375 177037 178367
56735 178367 180211 182973 186005 188739 191690 195801 201291 207731 214933 223185 232701 243327 254905 267683
56721 267683 282165 298491 315941 333239 349554 365077 380345 395197 408810 420676 431016
56710 431016 440181 448185 454942 460437 464462 466667 467126 466476 465287 463639 461534 459276 457209 455488 454438
56695 454438 454703 456641 459743 462917 465146 465806 464717 462235 458901 454726 449024 441199 431435 420427
56681 420427 408747 396750 384770 373156 362326 352863 345153 338816 333015 327580 323237 320319 317889
56668 317889 314734 310791 306940 303707 300868 298140 295579 293408 291992 291922 293565 296574 300296 304570 309620
56653 309620 315266 320844 325945 330660 334970 338386 340454 341312 341559 341760 342201 342889 343661 344314 344650 344297
56637 344297 342701 339549 335102 329944 324594 319544 315473 312967 312097 312521 313922 316145 319042 322520 326598
56622 326598 331155 335740 339947 343779 347328 350308 352334 353541 354486 355509 356606 357804 359212 360736
56608 360736 362173 363550 364984 366308 367317 368330 369976 372344 374761 376449 376978 376143 374017 371292 369036
56593 369036 367857 367609 367990 368956 370358 371667 372398 372500 372075 371028 369263 366936 364148 360622 355992 350314
56577 350314 344049 337667 331436 325475 319758 314161 308777 304192 301239 300377 301385 303670 306839 310889
56563 310889 315877 321550 327479 333513 339877 346719 353773 360563 366733 372027 376272 379605 382462 384982
56549 384982 386612 386675 385181 382693 379526 375573 370873 365816 360677 355368 349858 344487 339603 335139 330780
56534 330780 326436 322357 318792 315662 312657 309695 307223 305871 305734 306151 306269 305610 304022 301447 298003
56519 298003 294013 289695 285000 279960 274865 269851 264672 259283 254171 249627 245055 239637 233464 227365
56505 227365 221777 216563 211855 208293 206198 204982 203634 201467 198469 195332 193084 192217 192154 191942 191295
56490 191295 190516 189679 188618 187635 187417 188122 189211 190361 191855 193956 196485 199252 202381 206016 210221
56475 210221 215242 221235 227607 233205 237426 240561 242938 244379 244802 244676 244453 244006 242981 241337 239273
56460 239273 237002 234782 232709 230383 227294 223719 220619 218458 216793 215310 214512 214923 216176 217497 218632
56445 218632 219827 221273 222982 224911 226800 228241 229205 230137 231267 232343 233391 235210 238570 243241 248272
56430 248272 252957 257172 261175 265444 270375 275750 280846 285352 289793 294696 299816 304611 308903 312533
56416 312533 314840 315261 314178 312497 310469 307566 303453 298490 293218 287819 282232 276476 270676 264933
56402 264933 259261 253671 248319 243428 238870 234036 228598 223306 219355 216843 214528 211519 208537 206949
56388 206949 206974 207508 207503 206905 206254 205878 205638 205298 204971 205091 205837 206728 207139 207071 206999 207035 206841 206406 206292 206886 207928
56367 207928 208980 209885 210629 211240 211934 212863 213703 214143 214763 216597 219653 222785 225242 227441 229827 232025
56351 232025 233645 235065 236704 238306 239509 240441 241178 241444 241405 241905 243223 244500 245188 246158 248386 251351
56335 251351 253743 255066 255463 254797 253173 251837 252112 253701 255282 256547 258366 261007 263524 265102 265928
56320 265928 266475 266829 267068 267600 268789 270682 273191 276184 279421 282763 286296 289963 293491 297062 301455
56305 301455 306885 312353 317023 321698 327834 335447 343105 349747 355318 359773 362848 365094 367906 371959
56291 371959 376375 379879 382194 384004 386115 388984 392605 396545 400374 404141 408211 412695 417416 422316
56277 422316 427505 433087 439323 446776 455864 466451 478264 491411 506094 522261 540027 559947
56265 559947 582215 606178 631407 658683 688924 721617 755429 790026 825994 863045 899674
56254 899674 934848 968935 1002629 1035919 1068515 1100444 1131618 1161344 1188754 1213475 1235661
56243 1235661 1255534 1272879 1286738 1295772 1299213 1297256 1290131 1277238 1257795 1232024 1201080 1166153
56231 1166153 1128244 1088381 1047170 1004399 959985 915211 872236 832451 795971 762444 731534
56220 731534 702779 675865 651028 628590 608351 590091 574281 561405 550830 541337 532552 524949
56208 524949 518642 513163 508275 504034 500141 496208 492677 490593 490424 491823 494381 497802 501586 505420
56194 505420 509683 514731 519984 524684 529185 534369 540054 545192 549474 553535 557642 561359 564516 567344
56180 567344 569626 570837 571160 571348 571583 571512 571338 571825 573281 575577 579010 583938 589657 594877 599339 603862
56164 603862 608936 614507 621070 629545 639935 651322 663303 676274 690343 705243 721373 739698
56152 739698 760613 784177 811385 843873 882315 926521 977164 1036095 1105074 1185712 1280716
56141 1280716 1393456 1526011 1678914 1852722 2047884 2262470 2491202 2726655 2959744
56132 2959744 3179402 3374816 3540185 3677021 3791810 3892463 3986169 4077260 4164729 4242350
56122 4242350 4302185 4338150 4347457 4331344 4295321 4246722 4190049 4124237 4043610 3940051 3805214
56111 3805214 3634167 3429196 3199567 2957224 2713385 2478237 2260561 2065713 1895012
56102 1895012 1747790 1622959 1518494 1431391 1359067 1299594 1250349 1208246 1171892 1141775 1117721
56091 1117721 1097900 1080869 1066687 1055242 1045348 1036364 1028989 1023512 1018920 1014608 1011361 1009850 1009659
56078 1009659 1010542 1012990 1016838 1020921 1024869 1029628 1035620 1042174 1049375 1058549 1070084 1082550 1094770
56065 1094770 1107074 1119890 1132999 1146743 1162021 1178428 1194388 1209779 1226251 1244251 1261985
56054 1261985 1278172 1293659 1309514 1325734 1342556 1360673 1379421 1397136 1414081 1432501 1453152
56043 1453152 1474605 1496682 1521388 1549197 1577563 1604531 1630931 1657587 1683548 1708781 1735597
56032 1735597 1765457 1797105 1829540 1864049 1901631 1941363 1983056 2028497 2078172 2129641 2181097
56021 2181097 2233687 2288600 2344904 2402078 2461537 2523834 2587537 2652665 2721835 2796201 2873869
56010 2873869 2954180 3039547 3130951 3225722 3322263 3422869 3529269 3639492 3751871 3867983
56000 3867983 3988791 4112214 4237529 4367952 4505885 4650046 4800282 4960442 5133227
55991 5133227 5317107 5511669 5720853 5947274 6188707 6444032 6717228 7011664 7326299
55982 7326299 7661688 8023716 8417110 8841789 9300072 9800475 10349519 10947362 11596827
55973 11596827 12308748 13092806 13952052 14893329 15934254 17093366 18383930 19826177 21456345
55964 21456345 23316635 25449553 27913826 30795956 34198256 38231276 43030640 48765652
55956 48765652 55617045 63762928 73403931 84791517 98231105 114096256 132859236
55949 132859236 155059913 181195701 211631565 246488077 285196453 325625120 363450920
55942 363450920 392795745 408274291 407230293 390630841 362216096 326793278 288787872
55935 288787872 251507902 216994775 186217153 159419335 136450156 116966701 100540532
55928 100540532 86735305 75157484 65458695 57321249 50466956 44671803 39754908 35558854
55920 35558854 31951032 28831910 26124767 23760316 21679382 19840779 18213166 16763373
55912 16763373 15461315 14289406 13236644 12287943 11427523 10647190 9942229 9303225 8719602
55903 8719602 8186909 7703186 7262060 6856192 6483516 6143447 5830797 5539781 5270283
55894 5270283 5023957 4797689 4586770 4390981 4211685 4046293 3891283 3747564 3617325
55885 3617325 3498662 3388568 3288079 3199009 3118549 3042605 2971917 2909717 2855821 2808153 2767497
55874 2767497 2735163 2707637 2678542 2644443 2604510 2556658 2499017 2433951 2366137 2297708 2228952
55863 2228952 2162095 2100245 2043777 1991425 1943516 1900567 1860243 1819420 1777976 1737353 1697006
55852 1697006 1655715 1614711 1575870 1538358 1500583 1464026 1431632 1403894 1380057 1361783 1351955
55841 1351955 1350942 1357177 1369600 1385502 1397244 1395604 1376658 1342824 1298394 1247570 1195765 1148453
55829 1148453 1108033 1074272 1047338 1027744 1014048 1003678 995733 990332 985752 979022 968925 955962
55817 955962 940037 920836 899869 879392 859730 840160 821730 806516 794690 785049 778035 775549
55805 775549 778121 784812 795545 811051 830925 854280 881942 915376 953578 993450 1032919 1071240
55793 1071240 1106436 1135079 1154693 1164152 1161800 1145634 1115758 1074898 1026394 973270 918641 864851
55781 864851 812258 760704 711880 668301 630354 596400 565413 537466 511961 487759 465116
55770 465116 445491 429317 415649 403792 393508 383901 374001 364248 355695 348091 340471 333113 326940
55757 326940 321416 315105 307920 300799 293562 285247 276250 267975 260604 253350 246687 242081 239652 238264
55743 238264 237805 239069 241402 242845 242882 242900 243629 244203 244050 243747 243644 243426 243336 244100 245482 246527 247290 248617
55725 248617 250355 251560 252390 253779 255467 256420 257159 259364 263188 267279 271603 277721 285881 294328 302122
55710 302122 310245 319110 327262 333518 338269 341671 342605 340644 337177 333363 328530 321818 313939 306209
55696 306209 299129 292918 288174 285042 282870 281531 281926 284455 288245 292614 298117 305475 314720 326065
55682 326065 340355 357840 377737 399800 425178 455030 489406 528098 571194 617905 665931
55671 665931 712777 756620 795317 826027 846891 858135 860678 854862 841610 823713 804577 786210
55659 786210 769368 755054 744826 739872 740512 746328 756329 769268 784032 799174 811948 818620
55647 818620 816196 803499 780746 749151 711097 669431 625915 581115 536053 492925 453656 418626
55635 418626 387357 359588 335193 313777 294949 278431 263664 250033 237749 227603 219547 212341
55623 212341 204970 197628 190954 185108 179963 175480 171532 167945 164902 162643 160790 158725 156562 154853
55609 154853 153447 151787 150234 149762 150183 150062 148755 147296 146827 147335 148288 149396 150318 150784 151364 152980
55593 152980 155349 157127 157895 158645 159940 161057 161511 161932 162724 163279 163368 163992 165900 168433 170778 173242
55577 173242 176399 180097 184316 189979 197914 207827 219184 232180 247062 263430 280984 299781 318651
55564 318651 334400 343945 346712 344049 337112 326504 313238 298677 283633 268350 253127 238380
55552 238380 224552 212427 202916 195964 190446 185740 182665 182248 184437 188755 195236 203805 213603 224046
55538 224046 235927 250473 267893 287771 310240 335711 363909 394108 425885 458706 491186
55527 491186 521602 548705 571177 586777 593073 589005 575128 552731 523421 489197 452119 413926
55515 413926 376279 340824 308471 279070 252354 228683 208366 190880 175411 161649 149490
55504 149490 138642 129141 121582 116107 111802 107786 104221 101486 99035 95953 92098 87820 83177 78307
55490 78307 74025 71054 69085 67376 65792 64435 62859 60643 58296 56587 55395 54193 53219 53086 53473
55475 53473 53349 52373 51118 50008 48963 48071 47728 48015 48575 49087 49335 48955 47771 46241 45045 44317 43748
55458 43748 43212 42794 42506 42424 42782 43432 43635 42950 41873 41045 40302 39234 38179 37862 38369 39184 39926 40343
55440 40343 40008 38846 37673 37423 37998 38581 38856 39270 40259 41802 43511 44693 44710 43787 43036 43092 43315 42930
55422 42930 42335 42455 43362 44473 45664 47180 48778 49975 50925 52269 54276 56824 59814 62816 64751
55407 64751 64864 63734 62462 61234 59620 57857 56730 56345 56075 55564 54857 53687 51652 49059 46641 44563
55391 44563 42551 40858 40078 40151 40453 40831 41578 42484 42899 42761 42599 42503 42040 41208 40499 39933 39005 37706 36717
55372 36717 36345 36068 35279 33840 31808 29423 27368 26290 25949 25557 24927 24554 24628 24827 25049 25454 25800 25651
55354 25651 25315 25603 26557 27353 27580 27661 27876 27986 28076 28756 30136 31408 31885 31700 31279 30863 30754 31176 31607
55335 31607 31122 29749 28628 28487 28782 28758 28471 28225 27821 26984 25994 25347 25323 26225 28359 31331 33991 35588
55317 35588 36442 37041 37211 36734 36109 35884 35687 34743 33102 31663 31082 31232 31664 32040 32087 31534 30330 28824
55299 28824 27730 27815 29320 31584 33500 34426 34486 34014 33139 32047 31261 31312 32228 33467 34221 33862 32391 30484
55281 30484 28864 27698 26822 26411 26936 28502 30621 32627 34006 34471 34187 33794 33722 33612 32897 31733 30743
55264 30743 30061 29373 28727 28426 28226 27600 26838 26814 27465 27632 26866 26323 27233 29276 31219 32422 32994 33109
55246 33109 33004 33277 34330 35670 36310 35731 34069 31706 29220 27432 26872 27257 27906 28565 29410 30419 31214
55229 31214 31505 31344 30947 30495 30138 29954 29938 30099 30527 31244 32114 32940 33581 34031 34562 35695 37636 39777
55211 39777 41132 41370 41037 40702 40312 39507 38137 36263 34054 31891 30294 29466 29186 29247 29662 30254 30483
55194 30483 29977 29045 28381 28360 28715 28777 28048 26746 25765 25801 26569 27238 27486 27642 27857 27780 27184 26328 25523 24876
55174 24876 24638 25125 26036 26446 25957 25360 25599 26473 26894 26285 25263 24999 26134 28223 30046 30634 30113 29421
55156 29421 29178 29207 29184 29246 29614 30081 30293 30358 30785 31884 33475 35067 36150 36442 36091 35633 35663 36548 38351
55137 38351 40832 43540 46102 48455 50691 52836 54972 57326 59892 62191 63856 65189 66556 67484 67059
55122 67059 65207 62816 60497 58022 55170 52412 50379 49216 48744 48721 48684 48125 47183 46643 46885 47279 46996
55105 46996 45994 44879 44207 44227 44921 45879 46406 46076 45063 43858 42940 42708 43195 43716 43323 41905 40396
55088 40396 39757 40160 41236 42519 43489 43871 44147 45143 46748 47710 47131 45587 44283 43657 43311 42883 42409
55071 42409 42134 42380 43356 44742 45815 46190 46153 46196 46720 48195 50794 53619 55152 54961 54203 54014 54290 54628
55053 54628 55454 57245 59421 61115 62550 64583 67270 70009 72897 76693 81392 85836 89033 91078 92476
55038 92476 93239 93056 91952 90445 89155 88386 87958 87498 86866 86084 84851 82671 79723 77049 75345 74050
55022 74050 72151 69470 66555 63755 61170 59178 58111 57556 56755 55729 55198 55393 55684 55565 55331 55514
55006 55514 56148 56880 57425 57656 57569 57368 57465 58207 59647 61488 63210 64467 65548 67194 69697 72445 74664
54989 74664 76361 78213 80829 84540 89599 96029 103438 111510 120592 131381 144154 158798 175475
54976 175475 194725 216880 241715 268520 296116 322910 347363 368318 384577 394549 397006 392114
54964 392114 381185 365545 346268 324768 302727 281187 260327 240287 221636 204764 189433
54953 189433 175330 162688 152049 143605 137019 131725 127314 123826 121690 121159 121870 123201 125055 127874
54939 127874 131973 137280 143842 152137 162696 175777 191490 209827 230310 251998 274126 296440
54927 296440 318493 338764 354813 364378 366299 360616 348187 330336 308613 284617 259859 235731
54915 235731 213438 193741 176663 161590 147949 135838 125844 118266 112660 108152 103980 99779 95703
54902 95703 92323 90103 88812 87755 86636 85870 85862 86333 86576 86107 84891 83243 81675 80550 79655 78400
54886 78400 76566 74488 72387 70013 67228 64446 62104 60149 58434 57206 56699 56595 56337 55758 55027 54279
54870 54279 53649 53340 53260 52912 51992 50800 49829 49403 49917 51739 54379 56536 57662 58803 61119 64163 66532
54853 66532 67657 67916 67458 66167 64597 63687 63485 63214 62729 62842 63981 65440 66336 66541 66385 66122 66092 66786
54835 66786 68450 70991 74351 78468 82940 87415 92366 98758 106789 115751 125395 136652 150665 167675
54821 167675 187166 208506 231077 254300 277854 301389 323719 342787 356666 364234 364948 358754
54809 358754 346589 330206 311027 289764 267545 246540 228556 213449 199757 186751 175099
54798 175099 165662 158406 152685 147942 143826 140045 136551 133708 131989 131454 131762 132728 134683 138114 143145
54783 143145 149684 157998 168656 181799 196953 213859 233009 254872 278884 303674 328029 351090
54771 351090 371881 389329 402678 411342 414489 411490 402974 390929 377655 364905 353762 344534
54759 344534 336545 328556 319587 309069 296425 281301 264328 246987 230400 214670 199493 184880
54747 184880 171102 158498 147507 138431 130956 124370 118382 113264 109057 105255 101522 98189 95734
54734 95734 94169 93225 92679 92240 91500 90356 89210 88569 88634 89279 90104 90511 90230 89800 90127 91483 93446 95713
54716 95713 98323 101025 103231 104836 106378 108059 109313 109658 109344 108772 107932 106846 106004 105828 106142 106584
54700 106584 107013 107121 106222 104100 101614 99845 98922 98213 97388 96667 96231 95939 95597 95111 94413 93592 93014 93071
54682 93071 93887 95400 97533 100100 102781 105373 107901 110404 112916 115677 118977 122696 126462 130366 134914
54667 134914 140055 144934 149069 153248 158664 165529 173118 180949 189370 199085 210542 223798 238827
54654 238827 255894 275584 298062 322358 346826 370376 392603 412469 427575 435327 434524 425535
54642 425535 409534 388094 363101 336364 309280 282977 258404 236026 215876 198159 183262
54631 183262 170964 160347 150991 143524 138374 134645 131093 127686 125274 124051 123362 122876 122897 123436 123831
54616 123831 123626 123236 123479 124776 126945 129435 131706 133623 135474 137378 138869 139344 138745 137468 135888
54601 135888 134470 134007 135065 137179 139138 140133 140205 139650 138563 137105 135720 134773 134190 133634 132912 132132 131551
54584 131551 131241 130862 129896 128200 126100 123841 121281 118369 115608 113638 112574 112082 111874 111725 111221 110012
54568 110012 108275 106531 105062 103859 103004 102688 102825 103031 103117 103354 104213 105911 108218 110673 113086 115893
54552 115893 119768 124825 130501 136307 142329 148787 155630 162942 171380 181642 193650 206629 219884
54539 219884 233147 246255 258796 270028 279025 285036 287772 287098 282589 273961 262133 249153 236707
54526 236707 225104 213983 203324 193310 183898 175159 167554 161293 155959 151356 148096 146550 145808
54513 145808 144633 143062 142104 142229 143115 144579 146565 148329 148852 148302 148032 148868 150233 151289 152081 153082
54497 153082 154238 155033 155111 154521 153630 152964 152824 152959 152874 152466 151917 151112 149639 147439 144913 142409 140057
54480 140057 138081 136665 135473 133934 132104 130664 129863 128984 127162 124373 121438 119266 118138 117461 116257
54465 116257 114203 112039 110633 109934 109337 108687 108203 107691 106772 105780 105437 105568 105146 103853 102562 101891 101263
54448 101263 99933 98176 96796 96094 95974 96448 97345 97966 97742 96997 96492 96424 96358 95932 95161 94276 93691 93841
54430 93841 94607 95055 94302 92568 90974 90311 90380 90482 90189 89528 88740 88041 87522 87174 87037 87330 88368 90223
54412 90223 92411 94009 94389 93973 94049 95559 98222 100942 102849 103706 103674 103190 102841 102842 102691 101806 100405 99285
54394 99285 98859 98906 99112 99232 98841 97676 96310 95774 96428 97779 99437 101437 103558 105242 106499 108008
54378 108008 109884 111198 111321 111040 111551 112894 114122 114631 114555 114092 113239 112176 111271 110631 110036 109354 108650
54361 108650 107935 107107 106164 105236 104417 103761 103344 103166 103088 103026 103054 103137 102917 102051 100680 99354 98465 97824 96826
54342 96826 95063 92800 90724 89108 87410 85040 82312 80220 79295 79108 78845 77874 75792 72538 68708
54327 68708 65296 62875 61310 60275 59603 59085 58486 57958 57934 58440 58985 59281 59514 59725 59561 58916 58238 57852
54309 57852 57503 56924 56356 56134 56194 56282 56184 55511 53859 51555 49673 48918 48999 49399 50022 50694 50855 50456 50408 51343
54289 51343 52473 52568 51568 50371 49477 48832 48652 49313 50482 51333 51710 52289 53481 54863 55813 56083 55723
54272 55723 55006 54451 54358 54360 53951 53354 53198 53417 53282 52546 51802 51520 51464 51287 51014 50667 50088 49504 49657 50880
54252 50880 52478 53473 53639 53426 53177 52852 52319 51517 50428 49174 48050 47200 46408 45420 44373 43652 43357
54235 43357 43116 42485 41436 40435 40005 40226 40651 40768 40453 39940 39502 39338 39630 40489 41826 43471 45258
54218 45258 46803 47389 46510 44600 42878 42308 42848 43740 44325 44448 44292 44026 43641 43142 42809 43059 43938 44925
54200 44925 45483 45617 45614 45413 44645 43279 41805 40631 39691 38820 38201 38148 38575 38968 38913 38466 37988 37712 37548
54181 37548 37275 36809 36201 35475 34644 33931 33829 34768 36650 38713 39883 39524 38048 36678 36326 36786 37255
54164 37255 37500 37996 38942 39763 39814 39105 38055 36988 36171 35882 35995 35900 35262 34556 34406 34750 35201 35879 37239
54145 37239 39243 41366 43346 45293 47019 47915 47742 47101 46890 47527 48772 50070 50986 51555 52195 53140 54085
54128 54085 54619 54806 54971 55109 54961 54541 54092 53565 52706 51672 51031 50993 51077 50766 50136 49564 49101 48395 47151
54109 47151 45542 44126 43348 43065 42729 42085 41393 40853 40263 39563 39282 39848 40783 41197 40889 40332 39810 39314
54091 39314 39101 39530 40278 40602 40509 40832 41928 43103 43678 43908 44394 45236 46236 47342 48376 48829 48502 47983
54073 47983 48008 48643 49483 50254 50804 50908 50574 50216 50058 49682 48707 47588 47117 47342 47630 47680 47858 48474 49263
54054 49263 49728 49680 49371 49271 49678 50271 50263 49363 48491 49049 51419 54556 57134 58708 59668 60422 60957 61127 61199
54035 61199 61969 64185 67706 71418 74233 76098 77791 79894 82317 84739 87088 89509 92242 95657 100058
54020 100058 105227 110378 114778 118336 121423 124291 126823 128767 130054 130915 131773 132980 134593 136453 138420
54005 138420 140367 141962 142729 142569 142065 141983 142456 142861 142516 141275 139416 137207 134814 132415 130024 127285
53989 127285 123829 120036 117112 116019 116376 116705 115802 113675 111161 108928 107009 105102 103012 100849 98906
53974 98906 97383 96190 95066 93917 92952 92408 92238 92172 91986 91533 90569 88785 86164 83193 80601 78865
53958 78865 77976 77658 77670 77869 78063 77968 77389 76419 75391 74601 74123 73874 73810 74003 74480 75035 75325 75254 75232 75872
53938 75872 77377 79354 81295 83129 85140 87454 89841 92070 94253 96686 99423 102187 104692 106930
53924 106930 109038 110979 112558 113776 114992 116576 118558 120777 123267 126188 129407 132505 135261 137909
53910 137909 140782 144027 147797 152346 157599 162872 167530 171893 177076 183787 191495 198893 204994 209702
53896 209702 213522 216939 220096 222908 225296 227248 228758 229862 230695 231313 231439 230646 228828 226308 223452
53881 223452 220444 217453 214621 211734 208305 204241 200076 196208 192353 188175 184097 180866 178481 176166
53867 176166 173384 170311 167298 164397 161590 159038 156919 155305 154279 153872 153753 153298 152067 150030 147356
53852 147356 144327 141465 139298 137777 136226 133996 131026 127688 124374 121316 118534 115820 112932 109872
53838 109872 106861 104074 101648 99805 98588 97506 95925 93890 92151 91225 90816 90324 89549 88685 87982 87635
53822 87635 87719 88030 88210 88157 88078 88053 87953 87885 88254 89116 89917 90248 90471 91192 92441 93826 95283 97126 99419
53803 99419 101761 103792 105549 107233 108910 110574 112390 114674 117596 120892 123962 126464 128773 131622
53789 131622 135200 138920 142225 145337 148876 152909 156688 159329 160590 161004 161430 162400 163759 164907 165411
53774 165411 165308 164797 163882 162452 160575 158499 156402 154274 152032 149682 147364 145234 143268 141246 139043
53759 139043 136822 134807 132977 131156 129257 127179 124685 121811 119243 117696 116878 115705 113753 111892
53745 111892 111091 111109 110830 109586 107655 105616 103739 101987 100314 98775 97405 96011 94259 92189 90510
53730 90510 89892 90007 89808 88890 87922 87509 87346 86968 86621 86703 86859 86464 85734 85548 86268 87432 88488 89122 88907
53711 88907 87458 85108 82816 81172 80020 79167 78831 79094 79486 79552 79459 79639 80150 80757 81367 81975 82424 82660
53693 82660 83123 84401 86425 88366 89483 89776 89630 89100 87898 85971 83746 81740 80258 79601 80130 81751
53677 81751 83601 84798 85492 86637 88671 90971 92794 94201 95611 96999 98126 99305 101209 103910 106634
53662 106634 108603 109740 110478 111256 112311 113653 115052 116176 116878 117230 117340 117287 117251 117502 118244 119539 121284
53645 121284 123056 124167 124247 123793 123750 124474 125390 125773 125574 125257 125120 125064 124936 124775 124623 124228 123166 121354
53627 121354 119385 118164 118078 118633 119015 118971 118949 119412 120200 120679 120453 119807 119394 119513 119842 119982 120015 120245 120469
53608 120469 120011 118656 117142 116426 116688 117335 117791 117954 118025 118263 118842 119696 120532 121156 121729 122502 123448 124394
53590 124394 125385 126628 128200 130071 132338 135074 137985 140502 142303 143583 144837 146501 148671 150948
53576 150948 152694 153699 154508 155846 157837 159968 161714 162921 163783 164737 166255 168325 170323 171784 173097
53561 173097 174951 177223 179052 179996 180426 180632 180255 178965 177165 175525 174177 172840 171508 170539 170095 169852
53545 169852 169333 168416 167465 166984 167028 167017 166331 165024 163646 162430 161173 159951 159271 159184 158890 157833 156661
53528 156661 156374 156823 156978 156553 156372 156910 157479 157459 157482 158526 160276 161383 161282 160851 161095 162007 163058 164109
53510 164109 165293 166540 167811 169483 171896 174797 177804 181206 185591 190824 196104 201128 206390 212194
53496 212194 218131 223881 229882 236744 244500 252870 261699 270670 279152 287063 295572 306164 319119 333440
53482 333440 348107 362822 377650 392685 408202 424599 441908 459617 476994 493421 508617
53471 508617 522971 537512 553054 569402 585848 602352 619676 638391 658345 679232 701053
53460 701053 723780 746954 769860 791828 812313 831092 848424 864579 879106 891102 900430 908198
53448 908198 915801 923889 932462 941491 951047 961136 971744 982772 993707 1003696 1012230 1019439 1025535
53435 1025535 1030357 1033772 1036036 1037184 1036407 1032661 1025862 1016983 1006915 995686 982840 968227 952276
53422 952276 935651 918751 901435 883272 864133 844490 825053 806280 788302 771091 754363
53411 754363 737526 720061 701991 683728 665584 647770 630771 615220 601247 588300 575936
53400 575936 564544 554988 547638 542100 537960 535504 535466 538193 543290 550060 558081 567241 577450 588614
53386 588614 600889 614675 630201 647150 664871 682989 701756 721733 743150 765658 788805
53375 788805 812639 837678 864229 891993 920497 949838 980756 1013963 1049506 1086843 1125435
53364 1125435 1165200 1206353 1248855 1292180 1335769 1379543 1423715 1468172 1512445 1556296 1599862
53353 1599862 1643015 1684975 1724881 1762376 1797340 1829474 1858693 1885675 1911496 1936805 1961794
53342 1961794 1986695 2011642 2036147 2059410 2081273 2102232 2122262 2140088 2153807 2161797 2162763 2155470
53330 2155470 2138998 2113241 2078989 2037701 1991306 1941918 1891252 1840165 1788715 1736587 1683577
53319 1683577 1630000 1576813 1525163 1475573 1427518 1379785 1331309 1281872 1232229 1183481 1136137
53308 1136137 1089843 1044082 998911 954830 912249 871485 833058 797465 764737 734607 707046
53297 707046 682268 660327 641154 624856 611481 600645 591881 585172 580498 576955 573137 568583 564250
53284 564250 561438 560785 562276 565441 569377 573305 577414 582534 588861 595684 602631 610356 619593 630245
53270 630245 641830 654153 667071 680319 694130 709348 726289 744054 761632 779167 797452
53259 797452 816640 836179 855593 874600 892842 910293 927659 945603 963739 981087 997342
53248 997342 1013013 1028546 1044092 1060044 1076926 1094576 1111968 1127979 1141899 1153228 1161538 1166609
53236 1166609 1168409 1166910 1162256 1154866 1144942 1132005 1115374 1094970 1071240 1044593 1015557 985194
53224 985194 954550 923719 892197 860245 829155 800000 772793 747113 722879 700186 678843
53213 678843 658392 638208 617369 594953 570734 545252 518975 491844 463957 436228 409889
53202 409889 385577 363267 342930 324783 308911 294997 282550 271301 261287 252587 244990 238028
53190 238028 231383 225148 219536 214463 209668 205123 201021 197399 194061 190860 187769 184650 181300 177804
53176 177804 174520 171591 168749 165744 162767 160269 158529 157481 156761 155796 154046 151367 148146 145006 142374
53161 142374 140269 138443 136734 135336 134624 134616 134745 134333 133204 131606 129728 127615 125465 123633 122265 121232
53145 121232 120505 120323 120814 121706 122569 123141 123260 122585 120774 118057 115438 113992 113867 114160 113962 113278 112624
53128 112624 111973 110759 108966 107506 107115 107424 107548 107180 106486 105378 103641 101709 100560 100679 101669 102998
53112 102998 104669 106890 109447 111672 112926 113044 112439 111764 111333 110961 110533 110517 111493 113248 114729 115029 114220
53095 114220 113179 112725 112939 113191 112885 112188 111798 111981 112256 112223 112116 112118 111720 110408 108589 107043 105774 104209
53077 104209 102339 100697 99263 97395 95021 92986 91885 91342 90793 90259 89902 89500 88897 88409 88258 88011
53061 88011 87160 85895 84807 84121 83605 83052 82436 81771 81108 80514 79858 78951 78049 77820 78500 79467 79992 80021 79848
53042 79848 79426 78630 77875 77842 78577 79351 79420 78567 76995 75168 73762 73308 73714 74348 74699 74824 75092 75702 76475
53023 76475 76986 76903 76292 75586 75117 74785 74282 73572 72908 72457 72052 71357 70141 68419 66477 64737 63452 62506
53005 62506 61644 60915 60722 61278 62108 62304 61410 59922 58778 58416 58519 58592 58476 58180 57569 56532 55201 53778
52987 53778 52327 50996 50228 50381 51266 52381 53425 54304 54844 54951 54876 54870 54733 54249 53881 54351 55586 56802
52969 56802 57752 59117 61412 64128 66346 67649 68123 67991 67683 67770 68364 68906 68919 68623 68423 68222 67745 67193
52951 67193 66944 66757 65847 63898 61590 60028 59781 60487 61246 61456 61316 61408 61820 61972 61440 60554 59911 59592
52933 59592 59156 58253 56990 55815 55235 55459 56180 56879 57455 58245 59284 59983 59898 59582 60189 62289 65274 67881
52915 67881 69150 68966 67855 66259 64129 61378 58503 56252 54760 53568 52551 52105 52230 52198 51581 50927
52899 50927 50815 50873 50464 49853 49840 50466 50974 50986 50929 51174 51426 51232 50636 50037 49654 49348 48896 48396 48316 48936 49710
52878 49710 49620 48405 47039 46609 47106 47752 48180 48649 49378 50319 51526 53111 54817 56060 56472 56071 55104
52861 55104 54136 54048 55354 57605 60012 62538 65740 69666 73627 77092 80046 82312 83283 82643 80804 78283
52845 78283 75179 71605 68097 65152 62684 60381 58374 57124 56774 56880 56771 56103 55143 54539 54553 54614 53944
52828 53944 52596 51363 50631 49936 48943 48222 48511 49602 50541 50718 50240 49449 48663 48337 48847 49924 50755 50840
52810 50840 50438 50003 49563 48918 48129 47418 46756 46036 45631 46243 47949 49744 50431 49844 48849 48273 48226 48459 48858
52791 48858 49370 49790 49985 50084 50173 50018 49472 48990 49302 50511 51852 52503 52411 52194 52360 52771 52842 52197 51057
52772 51057 50024 49562 49783 50568 51577 52164 51729 50386 49024 48436 48634 49181 49920 50947 52101 52973 53417
52755 53417 53730 54290 55268 56686 58483 60448 62242 63571 64366 64945 65975 67969 70612 72866 73932 73866
52739 73866 73059 71555 69319 66765 64446 62405 60360 58387 56847 55711 54541 53159 51798 50600 49461
52724 49461 48414 47615 46898 45927 44866 44330 44454 44674 44710 45135 46436 47958 48444 47479 45900 44780 44463
52707 44463 44652 45094 45872 47074 48394 49350 49886 50501 51537 52546 52728 51927 50779 49940 49590 49738 50474
52690 50474 51672 52826 53518 53852 54167 54546 54785 54690 54208 53445 52678 52208 52025 51815 51391 50933 50614 50214 49353
52671 49353 48059 46835 46164 46055 46134 46137 46252 46915 48223 49676 50609 50784 50426 49828 49149 48524 48104 47976 48209
52652 48209 48895 49943 51011 51913 52897 54147 55197 55341 54646 54015 54088 54503 54420 53413 51697 49801 48259
52635 48259 47380 47121 47204 47329 47129 46156 44351 42469 41565 41989 43275 44901 46569 47760 47787 46657 45298
52618 45298 44562 44471 44714 45274 46121 46786 46879 46765 47142 48100 49092 49709 50012 50101 49834 49063 47951 46972 46589 46826
52598 46826 47099 46758 45879 45222 45214 45361 44986 44204 43745 43959 44486 44898 45258 45963 47198 48694 50003 50988 51898
52579 51898 52826 53290 52816 51895 51727 52772 54050 54287 53333 52094 51357 51203 51347 51544 51701 51900 52274 52694
52561 52694 52828 52761 53253 54993 57794 60852 63570 65714 67058 67449 67201 66927 66924 67045 67163 67449 68156 69407
52543 69407 71165 73172 75032 76562 77983 79459 80644 81070 80870 80680 80779 80722 79946 78509 77145 76632 77062
52526 77062 77599 77162 75498 73392 71641 70173 68549 66909 65865 65589 65654 65774 66117 66763 67367 67560 67358
52509 67358 66972 66481 65793 64778 63406 61935 60870 60435 60216 59695 59080 59157 60284 61951 63415 64368 64880
52492 64880 65071 64974 64523 63660 62730 62611 63894 65989 67583 68100 68089 68029 67548 66255 64676 63665 63271 62877
52474 62877 62229 61653 61333 61046 60705 60638 61089 61802 62346 62577 62627 62628 62632 62701 62840 62915 62747 62334 61876 61540 61274 60897
52452 60897 60414 60134 60385 61131 61967 62498 62654 62725 63218 64577 66758 69025 70471 70890 70920 71236 71899 72707
52434 72707 73800 75397 77047 77717 76833 74925 73050 71818 71146 70740 70513 70607 71211 72324 73569 74363 74452
52417 74452 74220 74259 74692 75204 75617 76081 76553 76558 75788 74681 73998 73941 74046 73917 73599 73221 72655 71802 70928 70449
52397 70449 70466 70718 70968 71321 72161 73742 75761 77439 78274 78686 79552 81047 82322 82568 81995 81430 81286 81450
52379 81450 81962 83154 84965 86615 87254 86762 85719 84813 84368 84270 84161 83794 83327 83209 83704 84614 85520 86158
52361 86158 86488 86548 86435 86340 86412 86545 86534 86462 86768 87654 88583 88683 87784 86784 86715 87649 88770 89439 89824 90470
52341 90470 91578 92889 93994 94607 94701 94502 94284 94129 94014 94066 94418 94856 94981 94848 95034 95857 96891 97542
52323 97542 97796 98132 98923 100215 101778 103063 103452 102982 102536 102867 103679 104178 104281 104600 105319 105863 105805 105451
52305 105451 105224 104955 104200 102999 101996 101915 103011 104883 106781 108284 109701 111580 113892 116058 117749
52290 117749 119247 120926 122868 125064 127539 130070 132270 134280 136857 140414 144350 147850 150954 154265
52276 154265 157834 161081 163824 166593 169694 172569 174572 176006 177859 180610 183748 186461 188447 189950
52262 189950 191319 192717 194071 195110 195614 195788 196210 197157 198140 198468 198191 198104 198730 199767 200683 201458 202405
52245 202405 203561 204687 205728 206864 208200 209686 211313 213055 214758 216424 218499 221450 225028 228417
52231 228417 231213 233866 236973 240494 243944 247089 250139 253368 256744 259881 262225 263421 263699 263885 264853
52216 264853 266840 269254 271187 272222 272837 273966 276118 279006 282072 285096 288114 290992 293478 295566
52202 295566 297445 299144 300631 302230 304503 307589 311009 314275 317362 320507 323856 327512 331555 335834
52188 335834 339900 343414 346455 349377 352528 356161 360309 364628 368702 372638 377037 382131 387285 391630
52174 391630 394939 397586 399942 402224 404730 407706 410954 413905 416208 418037 419806 421744 423768 425573
52160 425573 426825 427337 427175 426552 425703 424784 423792 422489 420601 418188 415741 413793 412489 411564 410552 408980
52144 408980 406579 403483 400130 396914 394040 391688 389997 388795 387696 386664 386203 386673 387628 388122 387514
52129 387514 385752 383165 380343 377970 376311 374888 373100 371082 369508 368510 367320 365184 362250 359308
52115 359308 356956 355339 354420 354056 353833 353177 351795 349933 348098 346597 345323 343946 342292 340603 339431
52100 339431 339191 339698 340129 339578 337769 335260 332900 331178 330152 329846 330343 331409 332377 332693 332462 332193 332157
52083 332157 332264 332515 333176 334395 335951 337538 339135 340944 343105 345620 348420 351278 353790 355656 356976
52068 356976 358073 359115 360164 361547 363750 366726 369636 371641 372837 374053 375788 377739 379433 380901
52054 380901 382532 384538 386879 389498 392292 394921 397038 398770 400718 403258 405997 408052 408959 409286 410283
52039 410283 412826 416569 420215 422654 423828 424502 425339 426284 426764 426413 425642 425403 426155 427160 427185 425959 424438
52022 424438 423442 422574 420970 418588 416049 413535 410647 407317 404052 401136 398290 395371 392740 390590 388407
52007 388407 385506 381760 377455 372856 368331 364534 361906 360176 358791 357723 357370 357765 358303 358350 357767 356808
51991 356808 355807 355169 355341 356462 358016 359066 358998 357911 356147 353550 349584 344298 338695 333743 329276
51976 329276 324324 318384 311810 305016 298006 290901 284333 278855 274198 269430 263708 256770 248952 240879
51962 240879 232876 224674 216007 207421 199940 193759 187928 181616 175071 168956 163369 158148 153615 150192
51948 150192 147541 144779 141426 137601 133473 129209 125317 122320 120035 117753 115207 112802 110824 109066
51934 109066 107387 106052 105243 104688 104070 103384 102612 101467 99809 98038 96653 95619 94512 93174 91890
51919 91890 90989 90636 90963 91998 93294 93957 93429 92186 91358 91568 92356 92914 93123 93529 94388 95243 95536 95229
51901 95229 94580 93679 92605 91819 91939 93060 94569 95682 96052 95936 95940 96498 97430 98073 97991 97383 96690 96085 95636
51882 95636 95686 96553 97921 98987 99368 99489 99953 100811 101628 102119 102511 103277 104570 105952 106802 107009 107075 107473
51864 107473 108208 109229 110873 113443 116509 119185 121134 122855 124871 127027 128817 130138 131519 133715
51850 133715 137164 141724 146876 152320 158380 165747 174867 185758 198390 213040 230257 250696 274987
51837 274987 303583 336649 374175 416162 462491 512315 563300 611134 649919 673811 679174 665732
51825 665732 636077 594531 546265 496297 448119 403121 361731 324792 293253 266832 244022
51814 244022 223641 205735 190749 178491 168362 160064 153570 148602 144570 140966 137519 134060 130445
51801 130445 126590 122560 118640 115222 112472 110216 108357 107157 106712 106308 104956 102665 100611 99790 99972
51786 99972 100184 99784 98731 97243 95662 94394 93560 92763 91444 89413 86966 84688 83204 82771 82949 83014
51770 83014 82875 83231 84559 86326 87597 88089 88201 88226 88051 87561 86943 86522 86540 87037 87733 88081 87729 86901 86182
51751 86182 85948 86138 86385 86200 85249 83753 82419 81676 81084 79900 78084 76352 75223 74472 73643 72690 71923
51734 71923 71591 71736 72243 72871 73397 73916 74774 76028 77165 77681 77819 78364 79709 81424 82874 83927 84855
51717 84855 85817 86775 87758 88789 89555 89540 88662 87426 86281 85087 83517 81717 80239 79340 78718 77896 76635
51700 76635 74981 73202 71716 70825 70464 70424 70802 71929 73706 75374 76170 76139 76079 76763 78394 80789 83815
51683 83815 87368 90959 93648 94732 94431 93562 92548 91095 88946 86538 84580 83381 82900 83126 83937 84819
51667 84819 85284 85432 85636 85805 85513 84817 84352 84596 85459 86641 87867 88761 89027 88803 88381 87628 86286 84815
51649 84815 84099 84205 84222 83675 83247 83593 84239 84327 83876 83528 83493 83541 83709 84211 84795 84913 84575 84381 84720 85405
51629 85405 86130 86815 87464 88108 88918 90021 91206 92228 93374 95298 98208 101598 104862 107879 110837 113804
51613 113804 116656 119240 121451 123191 124327 124685 124188 123095 121984 121327 121173 121369 121898 122784 123744 124216
51597 124216 123747 122201 119724 116642 113289 109813 106257 102933 100396 98833 97749 96539 95132 93792
51583 93792 92560 91364 90481 90328 90844 91485 91797 91626 90840 89374 87616 86281 85700 85554 85416 85239 85226 85532
51565 85532 86235 87333 88562 89444 89740 89725 89914 90563 91432 91935 91616 90671 89911 89941 90371 90196 89012 87533
51547 87533 86754 86848 87137 87010 86617 86578 87131 87771 87927 87851 88458 90163 92325 94113 95497 96870 98095 98666
51529 98666 98702 98933 99559 99924 99620 99263 99690 100918 102461 104302 106803 109773 112318 113774 114399 114876 115488
51512 115488 116015 116330 116761 117701 118987 119909 119981 119511 119209 119345 119623 119842 120183 120689 120857 120156 118732 117238
51494 117238 116066 115079 114023 112851 111642 110499 109552 108806 107907 106352 104074 101620 99578 98027 96629
51479 96629 95095 93321 91224 88780 86253 84099 82542 81365 80199 78881 77478 76122 75052 74700 75501
51464 75501 77431 79769 81418 81593 80377 78631 77247 76420 75675 74557 73109 71663 70516 69929 70129 70992
51448 70992 71937 72524 72951 73628 74468 75094 75538 76118 76696 76758 76357 76252 76824 77522 77768 77755 77887 77996 77789 77564
51428 77564 77817 78475 79284 80674 83333 86942 90147 91986 92734 93185 93669 94052 94238 94330 94581 95272 96367
51411 96367 97239 97145 96064 94722 93659 92680 91407 89946 88765 88197 88310 89020 90109 91302 92452 93477
51395 93477 94111 94097 93700 93597 94008 94315 93839 92696 91532 90660 89864 88847 87553 86118 84842 84105 83974
51378 83974 83944 83314 81881 80091 78590 77770 77589 77583 77152 76184 75348 75415 76277 76996 76894 76243 75756 75755 76148 76865
51358 76865 77833 78601 78511 77415 75882 74516 73349 72133 70948 70156 69874 69840 69821 69835 69903 69906 69839 70013 70780 72125
51338 72125 73601 74554 74439 73148 71140 69162 67750 67128 67407 68523 69941 70897 71185 71443 72346 73782
51322 73782 75062 75723 75882 76009 76552 77553 78398 78264 77105 75881 75406 75386 75074 74540 74542 75265 75949 75925 75364
51303 75364 74745 74061 72970 71418 69777 68424 67396 66447 65447 64656 64438 64673 64746 64343 63885 63812 63860 63599
51285 63599 63363 63873 65082 66180 66855 67698 69118 70609 71495 71900 72454 73413 74521 75538 76546 77799
51269 77799 79443 81303 82868 83697 83792 83370 82389 80729 78757 77177 76244 75619 75038 74553 74070 73333 72554
51252 72554 72351 72769 73059 72819 72621 73013 73600 73814 73977 74755 75924 76627 76730 77078 78328 80128 81579 82060
51234 82060 81612 80872 80665 81263 82075 82358 82149 82145 82820 84061 85542 86952 87898 88085 87674 87164 86863 86729 86652
51215 86652 86534 86155 85360 84385 83617 83051 82351 81483 80906 81031 81838 83076 84480 85729 86493 86715 86612 86325
51197 86325 85799 85056 84293 83585 82752 81683 80583 79754 79318 79255 79556 80069 80341 79830 78409 76644 75438 75257
51179 75257 75636 75623 74824 73886 73806 74932 76893 79303 82107 85215 88227 90761 92778 94338 95222 95082 94028
51162 94028 92857 92509 93281 94610 95675 96168 96365 96538 96507 95903 94702 93347 92368 91994 92047 92113 91890 91378
51144 91378 90724 89902 88779 87481 86398 85727 85332 85180 85583 86660 87887 88588 88684 88586 88472 88143 87584 87185
51126 87185 87212 87432 87437 87173 86933 86996 87422 88104 88878 89549 89920 89888 89580 89335 89391 89557 89410 88860 88316 88184 88436
51105 88436 88826 89249 89632 89675 89067 87877 86528 85448 84874 84778 84727 84130 82987 82168 82421 83275 83504 82696 81769
51086 81769 81795 82810 84083 85083 85771 86272 86718 87345 88338 89513 90424 90860 91063 91345 91628 91517 90848 90006
51068 90006 89559 89663 90003 90236 90294 90199 89897 89482 89323 89705 90437 91081 91495 91950 92724 93821 95099 96492 98029
51049 98029 99728 101495 103154 104640 106152 107897 109646 110836 111266 111434 111914 112623 113007 112752 112042 111245
51033 111245 110634 110326 110205 109995 109624 109372 109451 109640 109657 109654 109961 110470 110722 110529 110179 110084 110538 111661 113214 114573
51013 114573 115287 115539 115682 115591 115036 114486 114769 115902 117011 117567 118001 118816 119775 120439 120982 121988 123745 126124
50995 126124 128885 131712 134201 136207 138070 140232 142799 145694 149010 152893 157173 161371 165075 168197
50981 168197 171040 174138 177825 181870 185764 189472 193561 198451 203896 209424 215007 220981 227587 234855
50967 234855 242809 251561 261432 273075 287144 303500 321097 338974 357159 376220 396304 417058
50955 417058 438290 460106 482449 504963 527245 548698 568116 583986 595490 602943 607106 608414
50943 608414 606959 602766 595733 585613 572443 556882 539831 521785 502780 482865 462352 441625
50931 441625 421055 401149 382546 365704 350668 337206 325084 314192 304531 296142 288880 282265
50919 282265 275814 269632 264405 260622 258055 256218 254978 254268 253502 251951 249732 247790 246684 245945 244867
50904 244867 243406 241969 240804 240036 239876 240257 240580 240362 239889 239740 239912 239987 239883 239789 239480 238477 236907 235500
50886 235500 234600 233819 232886 232205 232213 232709 233219 233672 234325 235248 236216 237034 237792 238920 240954 244020 247588 251082
50868 251082 254763 259511 265620 272315 278718 284880 291447 298703 306415 314567 323825 335090 348605 363536
50854 363536 378695 393884 410306 429264 450693 473573 497695 524200 554288 588177 625756
50843 625756 667461 713878 764928 820021 878718 940644 1005011 1070671 1136463 1201080 1262780
50832 1262780 1319561 1369495 1410725 1441558 1460931 1468574 1464424 1448315 1420605 1382656 1336254 1282992
50820 1282992 1224730 1164109 1103744 1044963 987917 932758 880100 830580 784688 742953 705683
50809 705683 672525 642898 616803 594654 576403 561464 549423 540159 533294 528245 524862 523241
50797 523241 522832 522550 522045 522005 522866 524015 524760 525301 525968 526106 524649 521606 518188 515429 513239 510837 507632
50780 507632 503640 499384 495489 492009 488149 482893 475948 467864 459316 450594 441801 433198 425156 417916
50766 417916 411494 405734 400428 395524 391215 387696 384877 382567 380970 380744 382367 385630 389928 394959
50752 394959 400927 408100 416437 425713 435845 446903 458943 472013 486301 502005 519014 536920
50740 536920 555461 574761 594875 615203 634713 652856 670124 687662 706540 727505 751098
50729 751098 777560 806550 837337 869425 902827 937469 972502 1006502 1038337 1067549 1093937
50718 1093937 1117176 1137025 1153513 1166515 1175330 1178975 1176756 1168255 1153070 1131168 1103566 1072133
50706 1072133 1038525 1003642 968092 932692 898199 864962 833133 802910 774307 747035 720940
50695 720940 696299 673350 651895 631754 613378 597505 584369 573698 565401 559698 556590 555686
50683 555686 556660 559472 564042 570076 577359 585868 595450 605649 616053 626484 636722 646338 655090
50670 655090 663291 671484 679824 688024 695750 702815 708982 713991 717939 721414 725005 728716 732157 735348
50656 735348 739098 744398 751638 760657 771460 784441 799813 817107 835505 854532 874207 894648
50644 894648 915694 936873 957515 976911 994505 1010044 1023525 1035033 1044541 1051850 1056814 1059724
50632 1059724 1061322 1062232 1062582 1062540 1063006 1065117 1069061 1073988 1079297 1085298 1092237 1099324 1105366 1109872 1112910
50617 1112910 1114292 1113776 1111834 1109295 1106094 1101069 1093195 1082447 1069372 1054383 1037692 1019381 999305
50604 999305 977394 954263 931010 908067 884692 860018 834263 808484 783438 759176 735640
50593 735640 713129 692066 672662 654916 638730 623929 610312 597818 586544 576529 567593 559451
50581 559451 551951 545101 538824 532806 526695 520465 514461 509097 504616 501119 498590 496825 495553 494819
50567 494819 495086 496802 499981 504308 509528 515640 522911 531853 542964 556273 571299 587531 604657
50554 604657 622208 639455 656126 672921 690844 710219 730796 752594 776030 801280 828058
50543 828058 856140 885737 917349 951628 989302 1030751 1075623 1123257 1173460 1226464 1282219
50532 1282219 1340157 1399538 1459436 1518434 1575044 1628520 1678551 1723948 1762442 1792205 1813022
50521 1813022 1825493 1829563 1824448 1809717 1785890 1754091 1715579 1671615 1623483 1572567 1520415 1468542
50509 1468542 1418107 1369994 1325259 1285064 1249862 1218932 1191048 1165485 1142316 1122056 1105346
50498 1105346 1092730 1084353 1079854 1078715 1080694 1085897 1094530 1106573 1121371 1137399 1152584 1164941
50486 1164941 1172826 1174795 1169770 1157516 1138605 1113803 1083778 1049446 1012041 972691 932301 891993
50474 891993 853067 816229 781301 747937 716152 685891 656767 628827 603073 580577 561331
50463 561331 544566 529879 517395 506999 498097 490161 483075 476963 472116 468995 467804 468086 469049 470299
50449 470299 471944 474156 477033 480739 485339 490649 496720 504245 513858 525070 536683 548386 561256
50436 561256 576371 593528 611739 630500 650087 670965 693489 718016 744754 773402 803382
50425 803382 834483 866989 900998 935916 970901 1005670 1040598 1076068 1112005 1148049 1183727
50414 1183727 1218180 1250001 1277787 1300797 1318841 1331737 1339321 1341839 1339638 1332283 1318600 1297894
50402 1297894 1270734 1238314 1201582 1161386 1118945 1075474 1031563 987445 943721 901359 861158
50391 861158 823661 789437 758901 731934 708105 687246 669471 654839 643492 635902 632365 632240
50379 632240 634350 638229 644441 653480 664896 677628 690642 702977 713715 722285 728464 731794 731374
50366 731374 726626 718049 706830 693851 679298 663077 645315 626517 607473 588960 571386 554791
50354 554791 539225 524907 511822 499422 487095 474935 463858 454881 448330 443651 439900 436439
50342 436439 433264 430685 428766 427216 425774 424421 423124 421626 419796 418015 416962 416944 417599 418291 418690
50327 418690 419024 419910 422028 425832 431436 438698 447467 457767 469731 483310 498081 513479 529233
50314 529233 545467 562173 578617 593419 605338 614081 620396 625382 629618 632878 634700 635101 634513
50301 634513 633091 630438 626218 620731 614553 607782 599938 590455 578980 565323 549627 532615 515336
50288 515336 498461 482048 466030 450662 436396 423630 412693 403806 396832 391281 386784 383413
50276 383413 381355 380426 380117 380001 379847 379431 378575 377405 376343 375698 375367 375044 374634 374298 374145 373995 373547 372674
50258 372674 371506 370291 369227 368366 367582 366678 365674 365006 365313 366964 369763 373036 375992 378199 379919
50243 379919 381901 384544 387340 389469 390834 392068 393492 394703 395483 396486 398485 401347 404385 407477
50229 407477 411149 415577 420196 424429 428340 432285 436325 440195 443677 446812 449949 453638 458249 463572
50215 463572 469021 474289 479674 485689 492631 500567 509448 519090 529235 539835 551134 563362 576410
50202 576410 589872 603234 615973 627664 638172 647749 656845 665758 674424 682524 689902 696975 704550
50189 704550 713118 722561 732769 744269 757820 773538 791096 810898 834509 863597 898914 940698
50177 940698 989718 1047303 1114414 1191219 1277753 1374502 1481773 1598385 1721141 1845606 1967177
50166 1967177 2081456 2184234 2272081 2343465 2399227 2441850 2474251 2498934 2517320 2529133 2532413
50155 2532413 2524433 2502560 2464314 2407509 2331377 2237720 2130437 2013892 1892012 1768642 1647709
50144 1647709 1532516 1425077 1326266 1236229 1154663 1081238 1016020 959152 910019 867226 829589
50133 829589 796686 768190 743217 720808 700759 683485 669233 657632 647821 638806 629982 621598
50121 621598 614441 608804 604078 599637 595696 592745 590499 588099 585338 582972 581664 581150 580742 580238 579943
50106 579943 580009 580169 580156 580128 580570 581894 584240 587574 591812 596835 602477 608643 615395 622784 630599 638389
50090 638389 645820 653002 660490 668968 678802 689765 701232 712690 723948 734943 745680 756605
50078 756605 768655 782524 798039 814658 832421 851921 873471 896908 922292 950232 981411
50067 981411 1016329 1055654 1100295 1150910 1207943 1272542 1346917 1433363 1533243 1647349 1776798
50056 1776798 1922914 2086302 2266300 2460843 2665975 2875389 3081217 3276106 3455084
50047 3455084 3616044 3759107 3885689 3997742 4097166 4185131 4261256 4323095 4366475 4386575
50037 4386575 4378972 4340372 4269313 4166762 4035975 3881687 3709439 3525114 3334037 3139988
50027 3139988 2945525 2753524 2567793 2391762 2227166 2074587 1934661 1807977 1694163
50018 1694163 1592147 1501326 1421737 1352895 1293164 1240566 1193881 1152762 1117144 1086656 1060405
50007 1060405 1037225 1016279 997301 980049 963717 947332 930588 913836 897291 880742 864032
49996 864032 847331 830781 814299 797861 781686 766003 750983 736912 724059 712263 701079
49985 701079 690442 680818 672477 665036 657977 651342 645629 641171 637887 635530 634004 633515 634476 637061
49971 637061 640781 644751 648544 652551 657314 662715 668105 673065 677691 682117 686133 689474 692289 695074
49957 695074 698112 701240 704311 707768 712497 719117 727593 737632 749250 762877 779049 798095 820062
49944 820062 844956 873299 906475 946235 993764 1049524 1114041 1188339 1273339 1369314 1476236
49933 1476236 1594015 1721554 1855642 1991284 2123064 2245911 2355227 2447517 2521444 2577948
49923 2577948 2619353 2648654 2669216 2683825 2693084 2694735 2684621 2658192 2611625 2542765 2451876 2341398
49911 2341398 2214945 2076919 1932973 1789661 1652559 1524690 1406988 1299803 1203477 1117918
49901 1117918 1042477 976375 918821 868741 824803 785921 751517 721259 694716 671303 650370
49890 650370 631345 613849 597799 583373 570837 560233 551069 542460 533829 525378 517571 510314 503146
49877 503146 496169 490063 484966 480071 474763 469532 465130 461315 457205 452614 448192 444278 440461 436455
49863 436455 432791 430284 429231 429339 429995 430395 429823 428251 426459 425186 424300 423060 421091 418835 417099
49848 417099 416428 416842 417908 418992 419641 419831 419772 419529 419033 418476 418390 419128 420457 421846 423024 423998 424629 424612
49830 424612 423954 423135 422633 422560 422906 423838 425438 427416 429454 431646 434237 437112 440006 443091 446710 450445
49814 450445 453123 454093 453975 453724 453329 452075 449859 447581 446056 445084 443852 441925 439456 436638 433480
49799 433480 430224 427482 425498 423505 420455 416459 412963 411164 410751 410597 410157 409523 408508 406670 404251
49784 404251 402187 400945 400118 399419 399248 399836 400624 401159 401914 403418 405073 405820 405680 405658 406154 406449 405898 404812
49766 404812 403817 403061 402415 401892 401372 400416 398855 397282 396432 396264 396084 395548 395072 395228 396086 397334 398779
49749 398779 400436 402179 403565 404199 404197 404106 404309 404686 404898 404752 404120 402771 400657 398198 395951 393992 391997
49732 391997 389841 387759 385852 383936 382033 380531 379666 379204 378945 379135 379949 380897 381288 381163 381248 381974 383028
49715 383028 383939 384625 385181 385504 385476 385310 385423 386049 387125 388465 389876 391249 392715 394646 397299 400500
49699 400500 403744 406594 408853 410530 411877 413372 415363 417653 419625 420848 421493 422173 423509 425809 428968
49684 428968 432706 436994 442134 448176 454369 459684 463885 467660 471582 475392 478572 481117 483364 485412
49670 485412 487217 488983 491035 493464 496281 499577 503014 505537 506391 506303 506865 508699 511041 513146 515165
49655 515165 517273 518883 519528 519869 521027 523222 525759 528140 530468 532819 534838 536121 536663 536856 537233
49640 537233 538129 539418 540701 541968 543744 546384 549617 553184 557469 562845 568656 573636 577331 580430
49626 580430 583674 587119 590587 594078 597376 599871 601336 602570 604799 608534 613332 618558 624061 630121
49612 630121 636907 644117 651241 658198 665511 673612 682127 690261 697770 705148 712880 721106 730085 740360
49598 740360 752099 764698 777405 789970 802400 814471 825919 836842 847561 858364 869766
49587 869766 882622 897360 913293 929252 944834 960490 976472 992388 1008015 1023911 1040884
49576 1040884 1059192 1078522 1098386 1118123 1136919 1154437 1171438 1189238 1208366 1228057 1247283
49565 1247283 1265958 1284802 1304132 1323279 1341364 1358293 1374663 1390796 1406309 1420674 1433853
49554 1433853 1446161 1457717 1468306 1477700 1485855 1492762 1498311 1502426 1505297 1507430 1509439 1511756 1514442
49541 1514442 1517233 1519759 1521701 1522916 1523619 1524475 1526211 1528999 1532400 1536118 1540624 1546690 1554314 1562460
49527 1562460 1570041 1576959 1584005 1591827 1600260 1608710 1616943 1625233 1633796 1642378 1650561 1658304 1665925 1673590
49513 1673590 1681026 1687645 1692710 1695452 1695465 1693146 1689426 1684873 1679263 1672176 1663659 1654021 1643241 1630984
49499 1630984 1617156 1602116 1586432 1570639 1555118 1539883 1524485 1508447 1491773 1474833 1457789
49488 1457789 1440437 1422585 1404338 1386021 1368026 1350649 1333784 1316914 1299770 1282910 1267159
49477 1267159 1252536 1238245 1223864 1209934 1197133 1185404 1174309 1163754 1153882 1144497 1135187 1125923
49465 1125923 1117118 1109116 1101955 1095556 1089808 1084532 1079626 1075263 1071668 1068709 1065996 1063356 1060938 1058840
49451 1058840 1056946 1055291 1054412 1055144 1057968 1062412 1066952 1069643 1069173 1065504 1059659 1053023 1046800 1041689 1037723
49436 1037723 1034517 1031884 1030072 1029250 1029072 1029065 1029206 1029731 1030569 1031391 1032100 1032784 1033415 1034092 1035469 1038248 1042218
49419 1042218 1046449 1050590 1055277 1061048 1067513 1073949 1080139 1086198 1092123 1098078 1104755 1112815 1122137 1132025
49405 1132025 1141911 1151396 1159961 1167240 1173569 1179744 1186173 1192571 1198428 1203466 1207716 1211438 1214895 1218026
49391 1218026 1220496 1222294 1223944 1225791 1227475 1228672 1230006 1232531 1236421 1240865 1245190 1249413 1253719 1258246
49377 1258246 1263558 1270511 1279241 1288873 1298592 1308410 1318518 1328607 1338481 1348838 1360617 1373820 1387731
49364 1387731 1402181 1417796 1434864 1452683 1470475 1488530 1507968 1529525 1552942 1577512 1602836
49353 1602836 1628847 1655331 1681840 1708197 1734880 1762667 1791921 1822361 1853370 1884395 1915226
49342 1915226 1946223 1978208 2011719 2046293 2080845 2114836 2148754 2183294 2218434 2253530 2287931
49331 2287931 2321203 2353019 2383311 2412455 2440958 2468906 2495851 2521222 2544715 2566337 2586182
49320 2586182 2604133 2619766 2632698 2643099 2651628 2658792 2664587 2668905 2672022 2674416 2676318 2677637 2678178
49307 2678178 2677703 2676061 2673559 2671009 2669055 2667560 2665998 2664332 2663088 2662585 2662580 2662786 2663448 2665184 2668464 2673413
49291 2673413 2679874 2687503 2695831 2704444 2713179 2722162 2731624 2741532 2751305 2760045 2767252 2773300 2778951 2784319
49277 2784319 2788438 2790005 2788495 2784436 2778614 2771133 2761383 2748793 2733296 2714948 2693508 2668886 2641847
49264 2641847 2613662 2584811 2554478 2521636 2486346 2449685 2412737 2376005 2339571 2303326 2267030
49253 2267030 2230455 2193590 2156588 2119641 2083106 2047583 2013641 1981501 1951092 1922256 1894680
49242 1894680 1867864 1841541 1815985 1791637 1768537 1746429 1725267 1705244 1686358 1668278 1650681
49231 1650681 1633423 1616402 1599530 1582883 1566668 1551014 1535953 1521452 1507318 1493276 1479436
49220 1479436 1466446 1454738 1443798 1432720 1421366 1410400 1400139 1390107 1379974 1370318 1361899 1354482
49208 1354482 1346952 1338560 1329665 1321189 1313599 1306613 1299752 1292925 1286330 1279877 1273066 1265534 1257556 1249796
49194 1249796 1242760 1236632 1231304 1226235 1220536 1213733 1206386 1199523 1193471 1187609 1181241 1174313 1167315 1160859
49180 1160859 1155350 1150670 1146175 1141330 1136308 1131605 1127282 1123212 1119870 1118014 1117443 1116963 1115949 1115152 1115448
49165 1115448 1116521 1117484 1118286 1119660 1121952 1124787 1127860 1131414 1135763 1140841 1146434 1152609 1159764 1168384
49151 1168384 1178723 1190597 1203464 1216726 1229944 1242826 1255246 1267290 1279075 1290491 1301397
49140 1301397 1312053 1323027 1334612 1346735 1359416 1372730 1386206 1398988 1410940 1422875 1435201
49129 1435201 1447131 1457965 1468460 1479792 1491536 1501906 1510041 1516955 1523874 1530621 1536217 1540318
49117 1540318 1543349 1545630 1547074 1547567 1547054 1545264 1541838 1536961 1531500 1526273 1521256 1515694 1509025 1501444
49103 1501444 1493456 1485113 1476110 1466622 1457541 1449631 1442822 1436685 1431242 1426835 1423385 1420353 1417427 1414822
49089 1414822 1412938 1412102 1412583 1414373 1416941 1419668 1422542 1425992 1430075 1434419 1439094 1444811 1451868 1459466
49075 1459466 1466592 1473199 1479953 1487066 1493959 1499968 1504878 1508757 1511720 1513969 1515747 1517098 1517858 1517946 1517481
49060 1517481 1516570 1515173 1513175 1510429 1506741 1501994 1496345 1490080 1483299 1475957 1468220 1460508 1452980 1445206
49046 1445206 1436617 1427182 1417413 1407765 1398235 1388506 1378299 1367545 1356459 1345537 1335333 1326056 1317481
49033 1317481 1309365 1301878 1295493 1290493 1286692 1283609 1280830 1278276 1276285 1275440 1276174 1278469 1281941 1286234
49019 1286234 1291361 1297734 1305891 1315966 1327340 1339028 1350595 1362514 1375386 1389054 1402931 1416987
49007 1416987 1431843 1447829 1464481 1481185 1497843 1514669 1531801 1549499 1568247 1588116 1608287
48996 1608287 1627761 1646479 1665216 1684446 1703861 1723098 1742412 1762293 1782693 1803042 1822955
48985 1822955 1842681 1862737 1883209 1903542 1923086 1941801 1960288 1979118 1998310 2017558 2036714
48974 2036714 2055846 2074964 2093907 2112455 2130353 2147236 2162734 2176634 2188888 2199496 2208499
48963 2208499 2215982 2221994 2226545 2229793 2232111 2233899 2235415 2236835 2238318 2239898 2241549 2243358 2245346 2246998
48949 2246998 2247467 2246534 2244967 2243527 2242052 2240065 2238000 2237004 2237575 2239091 2240871 2243180 2246894 2252481 2259562
48934 2259562 2267280 2275047 2283069 2292090 2302439 2313475 2324378 2335366 2347569 2361677 2377171 2392969
48922 2392969 2408345 2423088 2437264 2451174 2465218 2479505 2493758 2507704 2521315 2534678 2547989
48911 2547989 2561731 2576431 2592052 2608023 2624047 2640419 2657329 2674328 2690880 2707093 2723448
48900 2723448 2740061 2756627 2773003 2789482 2806542 2824550 2843648 2863768 2884826 2906998 2930640
48889 2930640 2955913 2982745 3011211 3041563 3073786 3107544 3142801 3180004 3219297 3259997 3301292
48878 3301292 3343067 3385584 3428726 3472189 3516125 3560786 3605621 3649398 3691294 3731148 3768626
48867 3768626 3802897 3833551 3861273 3887112 3911440 3934040 3954950 3974589 3993026 4009546 4023175
48856 4023175 4033468 4040645 4045006 4046402 4044366 4038672 4029612 4017730 4003475 3987164 3969049 3949276
48844 3949276 3927924 3905283 3881899 3858091 3833537 3807649 3780229 3751518 3721754 3691139 3660184
48833 3660184 3629600 3599669 3570021 3540228 3510313 3480633 3451541 3423378 3396466 3370869 3346347
48822 3346347 3322803 3300594 3280155 3261445 3244038 3227732 3212847 3199973 3189581 3181869 3176744 3173837
48810 3173837 3172593 3172479 3173246 3175135 3178748 3184491 3192046 3200632 3209913 3220449 3232973 3247419 3262928
48797 3262928 3278791 3295060 3312172 3330317 3349316 3368922 3388979 3409367 3430016 3451031 3472687
48786 3472687 3495214 3518555 3542361 3566332 3590594 3615680 3641964 3669218 3696988 3725473 3755656
48775 3755656 3788288 3822910 3858350 3894143 3931100 3970300 4011908 4055261 4099925 4146228 4194699
48764 4194699 4245254 4297043 4348971 4400390 4451405 4502518 4553845 4604704 4654077 4701377 4746459
48753 4746459 4788975 4828188 4863706 4895960 4925555 4952281 4975224 4993803 5008319 5019438 5027583
48742 5027583 5032973 5035860 5036368 5034316 5029564 5022413 5013290 5002009 4987659 4969264 4946295 4918484 4885470
48729 4885470 4846919 4802836 4753601 4699862 4642624 4583275 4523124 4462781 4402188 4341266 4280359
48718 4280359 4219977 4160303 4101155 4042348 3983983 3926349 3869583 3813502 3757852 3702789 3648936
48707 3648936 3596838 3546522 3497889 3451376 3407817 3367605 3330424 3295918 3264209 3235492 3209489
48696 3209489 3185682 3163858 3144130 3126605 3111321 3098233 3086989 3076980 3067966 3060351 3054414 3049622
48684 3049622 3045292 3041638 3039456 3038860 3039164 3039968 3041472 3043500 3045165 3046024 3046869 3048680 3051304 3053799 3055677
48669 3055677 3057157 3058515 3059974 3062019 3064994 3068280 3070522 3070863 3069480 3066814 3062838 3057399 3050905 3044357
48655 3044357 3038819 3034946 3032722 3031461 3030289 3028863 3027507 3026565 3025871 3025074 3024270 3023985 3024527 3025566 3026384 3026459
48639 3026459 3025789 3024749 3023631 3022315 3020402 3017591 3013809 3008932 3002625 2994652 2985273 2975096 2964478 2953199
48625 2953199 2940755 2926818 2911383 2894663 2877039 2858998 2840888 2822804 2804918 2787871 2772486
48614 2772486 2758982 2746711 2734901 2723466 2712940 2703787 2696025 2689280 2682951 2676401 2669405 2662434 2656224
48601 2656224 2651095 2646816 2643105 2639969 2637646 2636480 2636733 2638152 2639815 2640857 2641376 2642274 2644224 2647223 2651053
48586 2651053 2655560 2660319 2664649 2668262 2671463 2674486 2677129 2679262 2681180 2683246 2685713 2689152 2694340 2701237
48572 2701237 2708845 2716644 2725528 2736539 2749313 2762749 2776694 2791864 2808356 2825431 2842825 2861189
48560 2861189 2881020 2902132 2924380 2947959 2972641 2997556 3022192 3046859 3071750 3096360 3120398
$$ [...]
##END NTUPLES=NMR SPECTRUM
##END=
