##TITLE=NES1010_Conilon_9232912_cuLHfhc4Ys
##JCAMPDX= 6.0         $$ Bruker NMR JCAMP-DX V2.0
##DATA TYPE= NMR SPECTRUM
##DATA CLASS= NTUPLES
##ORIGIN= BRUKER
##OWNER= Administrator
$$ 1.72 TOPSPIN		Version 2.1
$$ 2015-07-02 05:18:07.133 -0700  Administrator@X
$$ Compression mode = diff/dup
##.OBSERVE FREQUENCY= 400.02188249412
##.OBSERVE NUCLEUS= ^1H
##.ACQUISITION MODE= SIMULTANEOUS (DQD)
##.ACQUISITION SCHEME= undefined
##.AVERAGES= 8
##.DIGITISER RES= 22
##SPECTROMETER/DATA SYSTEM= spect
##.PULSE SEQUENCE= zg30
##.SOLVENT NAME= COFFEE_meoh
##.SHIFT REFERENCE= INTERNAL, COFFEE_meoh, 1, 14.98509
##AUDIT TRAIL= $$ (NUMBER, WHEN, WHO, WHERE, PROCESS, VERSION, WHAT)
$$ ##TITLE= Audit trail, TOPSPIN		Version 2.1
$$ ##JCAMPDX= 5.01
$$ ##ORIGIN= Bruker BioSpin GmbH
$$ ##OWNER= Administrator
$$ $$ E:\/data/COFFEE/nmr/NES1010_Conilon_9232912_cuLHfhc4Ys/20/pdata/1/auditp.txt
$$ ##AUDIT TRAIL=  $$ (NUMBER, WHEN, WHO, WHERE, PROCESS, VERSION, WHAT)
(   1,<2015-07-02 05:17:59.649 -0700>,<Administrator>,<X>,<go>,<TOPSPIN 2.1>,
      <created by zg
	started at 2015-07-02 05:16:53.695 -0700,
	POWCHK enabled, PULCHK disabled,
       configuration hash MD5:
       21 0F 79 D6 B3 7B B4 F6 88 20 88 DB 03 48 BD 9F
       data hash MD5: 64K
       FB 39 30 E3 A2 BF 56 E8 0C F3 B9 64 B0 E7 5B 7B>)
(   2,<2015-07-02 05:18:03.055 -0700>,<Administrator>,<X>,<proc1d>,<TOPSPIN 2.1>,
      <Start of raw data processing
       efp LB = 0 FT_mod = 6 PKNL = 1 PHC0 = 0 PHC1 = 0 SI = 32K 
       data hash MD5: 32K
       17 C3 DA FB 8A B4 E1 E6 40 8B 7E B9 09 96 2F 15>)
(   3,<2015-07-02 05:18:03.352 -0700>,<Administrator>,<X>,<proc1d>,<TOPSPIN 2.1>,
      <pk PHC0 = 92.82349 PHC1 = 0 
       data hash MD5: 32K
       7F 32 CC 62 42 3D CD 92 3F B8 B8 9D C4 A0 20 6B>)
(   4,<2015-07-02 05:18:03.461 -0700>,<Administrator>,<X>,<proc1d>,<TOPSPIN 2.1>,
      <abs ABSG = 1 
       data hash MD5: 32K
       E9 90 D8 84 70 6E FD 52 55 D3 9A 8D 81 1A 73 DC>)
(   5,<2015-07-02 05:18:03.539 -0700>,<Administrator>,<X>,<proc1d>,<TOPSPIN 2.1>,
      <abs ABSG = 2 
       data hash MD5: 32K
       3E 3A C7 22 EA 10 9F E5 E3 A9 58 D3 83 DA EB FC>)
(   6,<2015-07-02 05:18:03.586 -0700>,<Administrator>,<X>,<proc1d>,<TOPSPIN 2.1>,
      <abs ABSG = 3 
       data hash MD5: 32K
       F6 A7 E6 D3 68 68 4A A7 94 04 69 AB 4B 13 7F F4>)
(   7,<2015-07-02 05:18:03.649 -0700>,<Administrator>,<X>,<proc1d>,<TOPSPIN 2.1>,
      <abs ABSG = 4 
       data hash MD5: 32K
       6D BD AB E4 BC 9D 94 59 F4 23 72 6E E4 8B 32 86>)
(   8,<2015-07-02 05:18:03.711 -0700>,<Administrator>,<X>,<proc1d>,<TOPSPIN 2.1>,
      <abs ABSG = 5 
       data hash MD5: 32K
       76 A1 49 C2 1C A7 04 EF D3 06 4C 7A 6D F3 96 F2>)
$$ ##END=
$$ 
$$ $$ hash MD5
$$ $$ 29 AC 0A 44 5B B4 EE E6 FF BF FB 7E C0 16 4E F3
##$RELAX= 
##$RELAX= 
##$RELAX= 
##$RELAX= 
##$RELAX= 
##$RELAX= 
##$RELAX= 
$$ Bruker specific parameters
$$ --------------------------
##$DU= <E:\>
##$EXPNO= 20
##$NAME= <NES1010_Conilon_9232912_cuLHfhc4Ys>
$$ [...]
150 150 150 150 150 150 150 150
##$TP07= 0
##$TPNAME0= <>
##$TPNAME1= <>
##$TPNAME2= <>
##$TPNAME3= <>
##$TPNAME4= <>
##$TPNAME5= <>
##$TPNAME6= <>
##$TPNAME7= <>
##$TPOAL= (0..7)
0.5 0.5 0.5 0.5 0.5 0.5 0.5 0.5
##$TPOFFS= (0..7)
0 0 0 0 0 0 0 0
##$TUNHIN= 0
##$TUNHOUT= 0
##$TUNXOUT= 0
##$USERA1= <user>
##$USERA2= <user>
##$USERA3= <user>
##$USERA4= <user>
##$USERA5= <user>
##$V9= 5
##$VALIST= <valist>
##$VCLIST= <CCCCCCCCCCCCCCC>
##$VD= 0
##$VDLIST= <DDDDDDDDDDDDDDD>
##$VPLIST= <PPPPPPPPPPPPPPP>
##$VTLIST= <TTTTTTTTTTTTTTT>
##$WBST= 2048
##$WBSW= 25
##$XGAIN= (0..3)
0 0 0 0
##$XL= 0
##$YL= 0
##$YMAX_a= 587532
##$YMIN_a= -487547
##$ZGOPTNS= <>
##$ZL1= 120
##$ZL2= 120
##$ZL3= 120
##$ZL4= 120
##$ABSF1= 14.98509
##$ABSF2= -5.573092
##$ABSG= 5
##$ABSL= 3
##$ALPHA= 0
##$AQORDER= 0
##$ASSFAC= 0
##$ASSFACI= 0
##$ASSFACX= 0
##$ASSWID= 0
##$AUNMP= <proc_prof1d_extract_pilot.lims>
##$AXLEFT= 0
##$AXNAME= <>
##$AXNUC= <1H>
##$AXRIGHT= 0
##$AXTYPE= 0
##$AXUNIT= <>
##$AZFE= 0.1
##$AZFW= 0.1
##$BCFW= 0
##$BC_mod= 0
##$BYTORDP= 0
##$COROFFS= 0
##$CY= 15
##$DATMOD= 1
##$DC= 0
##$DFILT= <>
##$DTYPP= 0
##$F1P= 0
##$F2P= 0
##$FCOR= 0.5
##$FTSIZE= 32768
##$FT_mod= 6
##$GAMMA= 0
##$GB= 0
##$INTBC= 1
##$INTSCL= 1
##$ISEN= 128
##$LB= 0
##$LEV0= 0
##$LPBIN= 0
##$MAXI= 10000
##$MC2= 0
##$MEAN= 0
##$ME_mod= 0
##$MI= 0
##$NCOEF= 0
##$NC_proc= -8
##$NLEV= 6
##$NOISF1= 0
##$NOISF2= 0
##$NSP= 0
##$NTH_PI= 0
##$NZP= 0
##$OFFSET= 14.98509
##$PC= 1
##$PHC0= 92.82349
##$PHC1= 0
##$PH_mod= 1
##$PKNL= yes
##$PPARMOD= 0
##$PPDIAG= 0
##$PPIPTYP= 0
##$PPMPNUM= 2147483647
##$PPRESOL= 1
##$PSCAL= 4
##$PSIGN= 0
##$PYNMP= <proc.py>
##$REVERSE= no
##$SF= 400.02
##$SI= 32768
##$SIGF1= 0
##$SIGF2= 0
##$SINO= 400
##$SIOLD= 32768
##$SPECTYP= <>
##$SREGLST= <1H.CDCl3>
##$SSB= 0
##$STSI= 32768
##$STSR= 0
##$SW_p= 8223.68421052631
##$SYMM= 0
##$S_DEV= 0
##$TDeff= 65536
##$TDoff= 0
##$TI= <>
##$TILT= no
##$TM1= 0
##$TM2= 0
##$TOPLEV= 0
##$USERP1= <user>
##$USERP2= <user>
##$USERP3= <user>
##$USERP4= <user>
##$USERP5= <user>
##$WDW= 1
##$XDIM= 32768
##$YMAX_p= 452085890
##$YMIN_p= -669877
##$CURPLOT= <Network HP LaserJet P1505>
##$CURPRIN= <$Network HP LaserJet P1505>
##$DFORMAT= <normdp>
##$LAYOUT= <+/1D_H.xwp>
##$LFORMAT= <normlp>
##$PFORMAT= <normpl>
##$SURQMSG= 1
$$ End of Bruker specific parameters
$$ ---------------------------------
##NTUPLES= NMR SPECTRUM
##VAR_NAME=  FREQUENCY,     SPECTRUM/REAL,   SPECTRUM/IMAG
##SYMBOL=    X,             R,               I
##VAR_TYPE=  INDEPENDENT,   DEPENDENT,       DEPENDENT
##VAR_FORM=  AFFN,          ASDF,            ASDF
##VAR_DIM=   32768,         32768,           32768
##UNITS=     HZ,            ARBITRARY UNITS, ARBITRARY UNITS
##FACTOR=    0.250966925370066, 1,           1
##FIRST=     8223.43324360094, -170540,      -25618
##LAST=      0,             -6170,           -60938
##MIN=       0,             -669877,         0
##MAX=       8223.43324360094, 452085890,    0
$$ Real data points
##PAGE= N=1
##DATA TABLE= (X++(R..R)), XYDATA
$$ [...]
23785 -128840 73692 -171329 -260645 -108038 -119990 -52847 -319937 32247 -196656 -407 -17918
23774 -17918 -147137 136232 37731 85394 84050 -130737 -172216 -110131 59552 -208338 -50241
23762 -147068 -223854 95923 -23716 -170203 166359 -4170 158240 -33265 -164781 147406 -52931
23750 266629 -133002 267936 -41991 207070 -2495 -222458 137661 -84584 358670 74036
23739 240360 22492 49650 -8183 -11303 173971 331362 -58104 821 -193502 -472138 -180074
23727 -65696 87132 -336696 63106 -184319 79360 -121314 -188716 -112370 97649 76 354153
23716 354153 326812 -164021 246839 -351265 -29031 -34981 147467 10250 61272 1089 106028
23705 106028 -190437 14152 153209 -137804 -178845 213658 -233188 293082 3165 -316040
23694 40574 -164479 -203865 -61331 -78158 236258 -61059 -57458 -382749 -417809 9420 25525
23683 25525 286597 17370 -31636 88661 -85548 -44204 -284422 139301 -3764 -246321 -97687
23671 -227666 -478543 306814 80349 -1424 -53804 -84935 75923 452054 -241242 -429359 -101010
23659 161721 82999 201471 33415 -160451 231441 137836 3610 -69615 115336 -39966 83472
23647 -179776 67392 155674 -255258 -8498 71165 -167779 -126601 40395 22764 -62084 155574
23635 -44222 -59422 272804 84688 -18847 -36319 329719 -185756 -418901 -51501 62873 -90828
23623 -186835 1853 -141238 -149731 -19193 302306 -216495 -34158 103217 182267 -98807 69354
23611 -185530 5868 177045 -451980 -79184 1742 -128632 -71903 231595 202388 157534 292173
23600 292173 307124 -258844 144610 135808 -20125 -58937 39995 -177468 180495 -41413 362882
23588 117470 119628 83542 -65042 198092 161500 -135615 283649 -68212 211605 -154027 -42139
23576 -80971 -22879 5477 101656 -56931 -222528 41412 111336 312119 330902 201661 101625
23565 101625 -273704 -85812 -13797 -234477 -165728 127538 25769 -320217 11922 -84891 -179541
23554 -179541 -270577 118397 10777 184542 -9788 65367 -141868 -163332 -38743 -26728 -94151
23543 -94151 -111388 23169 -197261 259504 -69139 -239181 -42956 77718 -45296 271763 77820
23531 99673 140344 225931 178998 -377446 206824 189431 17669 6894 -67109 -203010 -129284
23520 -129284 -45396 -40081 -59016 -85111 -89664 199695 -110726 11962 68428 257452 -134017
23508 -331789 -79448 -241426 -249011 -18854 -1026 179375 242392 -108167 57005 -107320 -55092
23497 -55092 -193996 -48664 109341 -153736 45669 -285116 233598 8465 -40368 -49837 -280628
23486 -280628 119750 -188199 -277314 -120086 -142600 -145724 -119403 101513 -128139 186551
23475 -35674 -42938 -284614 27358 -26248 -389848 -416467 -216501 -139029 27941 138838 -101781
23463 -25892 194667 130257 84812 -261169 -16550 -273945 170840 -296723 238423 214719
23453 214719 80834 -37697 -124084 -483766 -109900 253267 -22931 -12849 89779 -2631 117713
23441 3936 49272 -375565 83292 302188 -277408 103809 51517 -197793 -119957 -228139 -4055
23429 277195 240174 -135144 8994 7092 -420745 80461 -156774 -151627 -87453 227392 -248610
23417 -45582 243789 -515 -184929 -84701 245210 -237628 -7453 -92103 -250056 -189233 66008
23405 94797 18992 172214 -24863 -172730 133801 -146870 279864 -222326 83550 141349
23395 141349 -68455 80890 170186 -98443 -221124 -188048 50563 -46309 -94406 79664 -280975
23383 -128304 39351 -220670 -9586 -318471 342899 -24100 231475 -190652 -132506 -217516 -10541
23371 -76008 123531 160066 -88233 335049 177805 137070 55411 8520 217800 -24249 -74277
23360 -74277 -177300 91469 -62759 -158393 -272989 88253 192835 -160440 69509 158293 321879
23349 321879 120736 22271 -206981 -311223 89433 192463 83405 77011 -34904 97104 -104157
23337 -155165 -91410 -87621 -57096 -145642 125348 -194386 -94495 -221546 281832 -37246 -70633
23326 -70633 255021 -180272 -6885 170999 -150862 -39963 -186838 -59259 127458 175020 -251366
23314 190242 -362520 -148284 112130 -73241 119136 160200 -54 -122698 -324727 -80687 9759
23302 23734 162732 115933 -48860 -188686 190338 60646 4809 -209577 93750 548760 23621
23290 194413 -207542 -86926 -38034 -181179 32940 -69736 101716 140629 -278544 236912
23279 150390 99199 -48613 184522 -47903 26990 799 33789 -346306 14195 80618 274338
23268 274338 -332273 67687 169148 -51836 -74064 13499 -199246 271567 -93222 -26650 73259
23256 220665 -130756 -37778 -66111 13522 -115573 -46513 -141648 -173202 -396881 -47074 161773
23244 -125176 12981 -70964 -22178 193334 19996 74112 42609 18673 -103167 70469 -313119
23232 -192923 -10322 -81345 15521 -141880 -142246 99493 -286394 -421038 -459162 -102519 144338
23220 -250557 26577 36663 -211109 -39089 -39605 -117261 -68907 255351 45395 276750 -75127
23208 355168 180424 -5089 96870 25293 107194 -22165 402706 48949 413174 174848 -99450
23196 24855 72617 192132 -101036 -224849 266998 115095 -240266 67128 114239 229792
23186 229792 186229 84199 -332775 -87371 322414 -239407 -104469 -215003 81303 -298021
23175 -54886 -181907 14565 59434 132819 -85702 -32944 15629 -256028 -313374 -246879 218669
23163 -297368 -66252 51269 -269092 101798 156810 157217 -112450 -117959 49596 -184789 -2142
23151 -185241 219593 97366 -124013 113076 318001 78360 -204789 -173388 12426 -66787
23140 -157252 80898 125069 -132899 73690 -257030 -17784 -17627 -1238 -204589 -199660 -203468 -283185
23128 -283185 -97045 -49632 -55873 235198 -17007 75029 208651 259114 4215 322048 197647
23117 197647 -21029 208292 63126 -310065 -91916 156976 364035 -231885 193244 -150222
23106 -72198 -105614 57759 146041 331109 155242 262248 42572 29716 -148728 -187469 -10167
23094 26480 51050 303984 362608 -246782 -178514 11059 -148269 151300 95827 -192776 -176479
23083 -176479 -208373 -306419 -328137 -62198 -114617 -138631 -132800 378771 52109 353636 -550180
23071 -81225 119224 -66307 -313411 -29924 36244 211412 113615 -31008 -126188 29399 -202047
23059 201689 111230 305302 -130154 14618 -242629 191233 -4980 -52918 55949 1150 -34773
23047 -352249 106455 50631 226409 -138030 -227303 -20990 -4300 228719 -143715 211249
23036 -199128 239460 212502 -64575 221506 113374 35375 -217613 -7609 109865 52785 -50793
23024 -9190 65584 331924 -11507 44949 69569 -175161 10789 -202844 -329591 83695 199638
23013 199638 -75451 -229 -247439 143547 85598 -131019 -45570 10640 124516 -126932 -89423
23002 -89423 300200 261357 -92634 327611 -90124 180720 123038 -26510 -129542 -38387 -304701
22991 -304701 314974 -165964 -166332 -51563 111831 -187155 -114006 -43950 46513 53884 -197693
22979 -509233 -88869 -167154 168114 -239396 66562 -90170 -177332 6645 -185672 -35963 -224766
22968 -224766 -135302 -57254 59949 -166853 -98063 -212129 10647 1580 73850 59772 -71 -223331
22956 -223331 -54584 48109 -224349 249556 12004 52641 18230 -169400 -100778 33922 -301693
22944 380071 -409186 81252 272 -82786 -176046 -425863 -360861 165621 -339983 -74968 179636
22932 -200011 -187818 -92836 -17074 79850 -126614 155072 236187 608734 46989 240395 90794
22920 99681 169004 -429315 -30294 113806 -171479 34271 -9604 -331217 -6011 -32135 153374
22908 -156916 -139655 -310748 167927 -245154 -324718 86306 -151225 -22881 -34022 -40486 -115367
22897 -115367 151860 -161786 65891 7664 37841 -164276 24155 -241068 -389419 236252
22886 8623 -294770 -154554 -165044 -4815 23035 -224371 -109840 86759 79948 -62798 -117746
22875 -117746 -111208 -24963 -13943 -11512 -51221 -104046 280812 -120038 75566 87463 -162369
22863 204518 310240 -98733 194739 -273554 127601 160749 -290452 -148323 306822 -25685
22852 78480 -82746 -268433 -190578 32606 77032 273666 -38415 -121363 48339 22068 -384779
22840 16357 -76571 92689 113063 -191372 229688 -85405 -89934 -101812 -76118 2177 -6556 -1125
22827 141228 -196594 -62510 -185264 -270348 -348585 147879 -29843 -190862 -134951 4911 -146214
22815 222890 -90239 -379088 -246302 14004 -279790 73698 -108574 -130314 -211523 -237503 184929
22803 46683 -13416 128177 14329 40716 -117032 -9731 123444 -124475 154003 -189313 -62071
22791 -16644 -175826 -80110 -279332 -126903 -269830 125085 -134275 -73947 -212084 -323404
22781 -323404 -45925 41485 178002 51618 -29446 85896 49440 48090 -289288 -18610 -45009
22770 -45009 -94077 -48089 -207217 57684 -247944 -119602 -22153 118999 265740 114055
22759 276789 -98471 97084 -276548 244976 -319424 108275 -194452 -258239 169708 -116830
22748 -16862 271507 17936 144130 -241817 202750 -310936 182976 -82086 -78874 117614
22737 -230229 49711 -70589 -116271 -338019 17861 -302861 -114144 81652 94525 -40987 -231982
22726 -231982 121169 -63722 -234312 -19323 66638 -182917 -155095 48048 11047 -143991 -103940
22715 -103940 -208805 -49325 59520 -58850 146527 63939 -58625 -115468 -396090 -98079 213649
22703 159410 45460 50393 364081 -293236 -10008 -211589 -23305 -157268 -34482 162119 -15551
22691 -154212 -59813 -96628 71197 -121981 -123559 78227 -209337 120724 125532 -67982 -76140
22680 -76140 -181866 127835 -306113 159154 -42844 -258848 138371 -6980 92608 -127321
22669 212565 -29389 13418 23974 312958 -97809 87594 74590 -56747 -30993 -156856 142959
22657 136140 -187887 349163 -212885 -139956 114876 -107699 -243858 254711 -114336 -225806
22647 -225806 235837 51141 -94416 27966 -271312 -119562 217686 155812 -148288 212346
22636 140255 -38488 -59563 -199338 -125232 -201451 327820 -74172 -106069 14570 -239002 -141408
22625 -141408 -37815 203198 42435 176744 24513 216633 131058 -264598 -56311 277015
22614 -56804 -23586 -45419 -17231 17547 -235668 44265 -50937 -197994 14621 -226867 68856
22602 -29724 180136 -124978 104342 27825 -232757 -151120 56047 -158365 284626 -370725
22591 108000 -225416 -33724 -113540 -70963 -21902 55660 30385 -11473 -215762 -114899 20715
22579 -214069 -166514 -101480 15152 -164950 136635 99529 97977 164369 -91325 -425579 6654
22567 -111160 71956 -146299 -37343 -156383 -302300 255145 -266352 -84184 -126116 -311526
22557 -311526 125130 -201870 176121 -87686 -238902 -4527 53771 23915 -56623 -26237 125439
22545 -122754 -64945 -157131 -56030 237987 -174020 45299 -318506 -262545 -63257 -109147 -44901
22533 201503 31444 3106 -18688 -79918 -205880 -243392 -217598 -101509 -245852 95539 128064
22522 128064 249566 115893 -352097 -318 -298135 -280009 -122332 -183419 -100729 102860 -168764
22510 -317421 -327132 -135757 156805 20218 90065 -192818 -86629 -63312 -50127 -24571 -52855
22499 -52855 -46796 -224102 -217576 176603 -228701 -205624 -97649 -17962 51048 -90455 -161524
22488 -161524 -36197 69631 -76506 22504 43162 1018 -101684 316211 224990 -287069 28335
22476 -4402 94842 19085 -68337 -72819 183547 -229679 -56723 -26569 7983 119935 -207673
22464 155467 -143679 -376476 146125 -316547 -228477 317610 -107511 -35717 -215129 -116556
22454 -116556 -306605 79380 -223331 191723 -85863 35766 -197564 -191897 205284 77453 24781
22442 34951 -137066 87205 -11126 -120779 -44691 -244258 -21726 58950 -253163 100094 -157457
22430 41317 -327500 58624 -195380 296727 125642 -258553 -100534 -280732 117284 -114519
22419 -315582 -223284 -266045 68484 33407 -238714 -216980 336207 228721 -34961 -309766 43901
22407 -7123 -207129 4644 -123198 -107379 180568 -136221 51162 -61274 -110932 162854 -109448
22395 137501 26563 -141301 -168741 166140 -309704 119524 154160 164623 -74606 234970
22384 -112380 -69706 148366 154458 -106977 37857 -84546 -7270 329811 -60462 152756 43919
22372 -289384 -120267 124487 -150122 -272036 -194258 -33278 -210690 -317906 -29496 -38938
22362 -38938 -113504 -84747 114562 -323116 -161193 31533 -268455 100007 -243882 -71081
22351 135355 192617 -30582 -52711 -264896 272308 -210026 34203 -53421 60677 23445 79373
22340 79373 91793 43021 -244921 97793 -9705 1697 -58045 96438 10499 522 -37432 -152396
22328 -152396 -280090 -130933 257267 -190394 75927 -189178 -160402 -71163 -172458 106771
22317 47987 -49955 -159008 153052 -52264 -73976 -151657 -107743 293777 -130486 -364823 217929
22305 -48881 -5357 55119 243008 -241181 -182251 -122430 -65844 -220840 -69936 43589 143287
22294 143287 127167 300234 362336 -127686 -66333 -58371 172010 11812 192103 80332 134614
22283 134614 13734 -59186 -251420 105550 115610 -335922 -176324 -17144 -25578 -91989 349471
22271 82227 -31554 129915 -218346 -204079 174885 -129588 -188506 -58662 -42516 96275 23466
22259 -268490 -178289 165630 20615 -8297 -33235 -121251 -116751 -53527 -263699 52310 83931
22248 83931 -95062 -212273 235338 178891 185982 142121 161559 -270298 140322 -323142 -123390
22236 49972 -43171 -66832 -276410 67866 -99796 82319 -209829 20066 103139 44024 -150436
22224 -202331 128905 94513 -19937 -349477 286985 269777 11880 116222 154250 -82862 291110
22212 -177035 -13398 -250680 -253152 -298770 172592 -184434 -387901 257437 44061 -125183
22201 -440810 173613 -196776 -21864 64343 -40913 -165640 -128318 262615 -230595 -65491
22190 55565 -197797 16087 -79155 -264635 -139419 31433 -306593 -183699 1662 195214 -517612
22178 -166768 264567 -14851 -301093 59657 221801 -78704 -8063 172490 -36182 -338641 -126258
22166 95263 123261 107641 -158245 -73573 114503 -149280 97242 -17511 -312983 -51323 -79759
22155 -79759 143835 -105258 -50984 -147806 100834 144350 -163656 -82696 64749 -252835 -238766
22144 -238766 -251967 203535 -9909 -89812 -410240 -155893 -14975 -75749 -95246 249774 -15603
22132 234204 -2903 -396980 -114081 244762 -12684 275499 -458314 -118070 -339441 100355
22121 -23112 -78571 95518 -44080 118213 -120976 51181 -1066 -30990 194632 98476 108699
22110 108699 30785 146197 7484 -67752 84346 128337 -348849 175476 -117920 306738 -220922
22098 -35735 108455 -29240 16479 -28386 -77926 -123455 -252316 -21886 -42193 -18451 22801
22086 144824 22239 324619 -73085 -46713 -156987 -171673 -230113 100467 171071 -91286 57926
22074 -272955 45355 16312 133643 583 -71163 -253112 -400897 27672 -102995 -90290 13378
22062 317964 69739 292341 -110660 -123210 -92300 -252385 -107435 -411721 -131599 -31993
22051 -107507 -97298 18463 -239112 -240329 193921 -181830 -24509 66441 72067 145706 -214 91192
22038 -100016 2248 40366 162591 76062 -146529 -63905 -131986 -25127 -377726 19751 -273910
22026 -24587 -513738 -74388 -226562 152538 -150452 -11467 119340 -62118 -45767 195769
22015 -91555 -40394 -283523 99919 278513 -53561 117368 -143368 -35433 53073 59709 104838
22004 104838 -312397 176120 34552 -276007 -94719 203643 96230 93137 -144899 291633
21993 -313679 -120506 -188609 -7800 -112229 -35026 -339403 251772 -96539 -31318 -457936 -10094
21981 -47691 -8063 75477 -102501 162102 -158643 -199169 -234672 51530 -116778 -114028 643 -439899
21968 8220 -112232 -31240 -206868 74126 -134627 -136195 -123908 -290511 -133485 -171889 -75161
21956 -8738 -148755 36495 -182933 187153 147439 -214149 -211765 122736 142360 -287219 81409
21944 -286976 238314 16928 -179290 -320805 -133912 -188324 47454 -18292 25198 -45012 82501
21932 342357 -138585 43610 -131519 82188 -54370 -5974 -67895 -176946 -268499 -258019 128881
21920 -3384 -47666 -65582 190210 99312 -101612 170430 76726 58861 -201914 89999 69905
21909 69905 131328 -180724 175244 -29797 -160033 -371780 -84810 434159 -236715 240035
21898 131516 151859 42417 -387502 104083 -55914 -44159 -47557 -90014 373237 110419 -430318
21886 -198177 -327563 114828 -54432 34190 190614 120070 44867 -341230 -128638 -183617
21876 -183617 29506 -77329 136705 -135499 112174 -329573 185175 -190850 -30243 61150
21865 198145 60766 -312407 -44245 -155252 -105954 -164072 -147476 90761 -173579 -56037 -67067
21854 -67067 181699 -18817 -265105 -335449 149059 -64555 -36814 251727 226100 82352 -7844
21842 358545 -200285 -127681 9780 -137169 -69453 40665 118363 210651 -355595 -169333 88300
21830 -175338 -103810 -61196 176505 346339 -7211 -193822 215411 -145311 -246108 -147270
21820 -147270 -150243 -199357 81074 -7207 345585 -340560 6098 28321 34560 42297 -58717 216710
21807 54533 377552 -74893 -57241 -63160 -175851 -139163 5156 374303 -130843 -114468 119189
21795 -302307 -132696 -115526 87178 -45484 71671 25030 29591 -142972 248046 6404 -177880
21783 -46966 217482 25412 31969 -72198 255777 308010 342168 -179968 -74199 16045 36312
21772 36312 375191 -655 -87022 -76072 -193687 -152725 24464 200512 224270 -63894 314204
21760 416399 -143276 -159328 -333860 -17912 33787 47487 22193 39617 -329206 37995 168327
21749 168327 -20955 121858 149058 -90218 -13191 -194928 3758 -362722 8270 -25357 -92787
21738 -92787 -104866 -229603 -35024 -37928 -44493 -108381 -222907 -111932 -49852 -273522 -219886
21727 -219886 112689 -91088 -67309 -67381 -268854 -111434 105407 244945 162149 -105812 -308161
21716 -308161 74372 -206841 88041 -110603 -131428 -9526 59162 -200505 -142165 -62405 105160
21704 -135614 -218104 158266 -183251 -357427 40035 19850 201505 17760 122474 -81816
21693 67217 44458 11896 -18699 -365181 -312211 147286 -37597 -221771 192036 -23297 146000
21681 204355 -260643 161973 64052 181708 -256728 10007 -264676 -60799 -79505 -285767
21671 -285767 35026 -163447 -192817 -197425 62108 -94785 57355 -110341 142104 -9628 -280840
21660 -280840 -321716 27770 -66613 3106 42142 -106989 74998 -276224 -259319 71187 34512
21648 -218797 -19319 -364689 75233 62034 -342689 -110147 -383876 -405169 -189164 -143590
21638 -143590 -110263 -466006 -209035 -384667 98172 465693 -84424 -182461 -87024 -161798 8321
21626 95119 -25962 -9405 35567 -70048 131189 -245609 -93626 42532 -30015 154632 156226
21615 156226 98982 226964 -138343 -307893 340261 -268613 15841 1075 41162 304542
21605 304542 -216917 94415 -433286 -135451 -144616 -117266 263716 32716 -337164 -295061 232374
21593 -87485 -385205 -147269 40455 -411739 45412 -202782 -100511 -208893 -428167 -167769
21582 80142 252263 -55142 34062 -108267 -122264 40157 -139945 -192446 -118324 85436 8577
21570 -107934 231528 -135945 -30820 60015 -44074 -283827 -171090 -252768 38877 -148893
21559 -102693 11244 279784 -21630 289909 -294185 262113 -355560 3057 -178138 -193337
21549 -193337 -486595 -10737 -28382 -319603 9309 -234502 124104 -140726 -69576 -131336 -278095
21538 -278095 -262099 73467 -100619 -100834 -207336 212639 242312 179431 -159141 -102181 16981
21526 246858 189901 28628 -199614 -72025 -85086 107234 -138991 -98974 -199121 4395 -48952
21514 -22449 150133 80311 93330 -142620 -52947 45094 -49861 -37474 -156318 -81799 152665
21502 61461 -355611 -46125 -83452 500934 -136204 118513 -215925 -222149 -135854 -8295 135694
21490 -105497 -175641 -193995 199412 -330665 -195363 99007 -197261 160339 136016 -175668
21479 -447127 79851 -108749 -246336 -231316 -48684 -389912 35757 -18928 252625 140154
21469 140154 -7776 -84477 54091 -292715 481593 -62598 -103188 -113300 -572264 -256694 -101085
21457 -145702 113490 206629 -61611 118878 -440905 -122810 -96766 -163492 -54872 41678 45591
21446 45591 56809 -203033 -46876 156325 -30311 -73131 174235 447547 -106187 201662
21435 48296 407610 685775 648329 883284 771667 465078 240531 294749 324047 -44953
21424 -99540 93604 -175058 59981 151712 -178801 -10179 -29835 -334429 -117109 -164538 37181
21412 112349 79457 47742 -13024 -82177 160849 -212645 34545 46536 14315 -174366 17982
21400 -301269 -201758 -145348 -129925 115261 -242579 -47230 -248600 -263222 -179782 -324206 -36828
21388 37027 -54000 619122 250774 -121869 51510 -586679 -46507 363162 -43648 126572
21377 -4220 -138888 -147877 -143667 27659 -85123 23406 3888 86796 -245318 -142254 -46100 283852
21364 -169093 -39261 -410949 -204429 56957 187763 -90904 195216 185619 116122 -246369 -226758
21353 -226758 -236980 104219 218360 205325 -302533 -90497 -186852 -247763 -43292 -60858 50558
21341 258545 -47523 -180484 -68782 -90265 -15565 -171745 22222 133496 176600 -137781 -290017
21330 -290017 -308647 -389827 -249389 130549 228631 10418 -100275 -14152 194730 -180381
21319 -59245 308485 -49418 -5797 86784 131606 -65264 -251080 -288203 -105429 -200612 -178660
21308 -178660 -46395 442950 166790 -132738 205692 218620 201114 -256351 -233393 -100683
21297 -177779 101506 41005 198559 114228 -169285 -300376 -12884 -115734 83223 105806
21287 105806 110507 -79136 135109 127154 -272186 256520 163100 91888 128896 187484 -326772
21275 131394 -38108 -6859 -106313 -502061 151304 -152766 47952 -170802 -245521 185937 -127793
21263 -210381 -81408 -19885 -49100 -124312 -218750 23543 -22358 52872 132359 363923 -278063
21251 342579 -82686 -63247 388763 -88155 -215597 -310850 -76683 -155450 112713 35948 -446042
21239 -130612 -278129 -258287 -255772 -529590 -124868 -174056 -63964 -169723 -19543 -71442 -45896
21228 -45896 -156118 -584837 182599 125067 92375 -37610 -401976 89604 82261 -46401 5429
21216 -194218 -238862 -31429 66956 50248 -158314 -81512 -22575 -212527 -211883 -189312 -220174
21205 -220174 285871 -285217 -448979 -109129 -192528 -276295 6344 -217792 -26418 -58636 -238683
21194 -238683 -223466 -45070 41051 166766 -159837 -28433 -319281 -16853 -162114 -138982 -98842
21183 -98842 -208393 -74264 -39291 -90833 -375744 -5257 12830 57243 15358 -45385 68457
21171 -109861 -100840 102912 134330 -103214 180491 -26676 -178053 -9258 -82317 131548 -117384
21159 52433 121310 -20942 -19101 -156185 -155427 336774 -221516 -152695 -384953 -64475 -40257
21148 -40257 51722 292398 83305 -5830 77450 -3665 43857 184689 -36718 -443984 -118540
21136 30030 -55120 -225614 343690 -79308 174364 -198357 16086 -55437 141274 -301269
21125 116236 -59140 -173920 155836 -269175 280418 69704 129315 -227139 -238820 794 -168441
21113 -17345 -545659 35791 189503 -97814 -386865 189724 57945 -210393 67767 -465151
21102 308037 218601 -248762 96799 -5809 320067 68292 18506 114414 -59341 -235646 -131988
21091 -131988 80549 39138 278355 28025 157539 -349481 180022 -218351 -51899 50206
21080 -239985 -177206 197024 -228794 -188974 4563 205726 -417196 -1538 17807 143223 -182937
21068 -181816 213293 -15881 -24281 -292382 -202117 279058 126068 94065 -55118 20334 -115365
21056 4892 72882 -127919 -115959 -21742 -70436 -135297 59848 145793 80945 -175897 129580
21044 86731 -212821 -254159 -277774 92831 191362 -34718 6367 -109320 8777 -237173 5361 130901
21032 130901 -31877 87060 228551 -113107 19267 -5767 -28015 -75565 -48427 392307 90427
21020 -105542 154269 -121576 316398 -48238 -30642 -90003 -34107 165445 -131675 79826
21009 -104227 -68405 -65156 107531 296200 31674 -81851 -188637 -92693 220612 -358382 283310
20997 124504 127020 -138715 54894 123967 210033 -64415 245553 55506 204041 -156826 81011
20985 -121386 -93592 -61459 -138648 -173278 -97449 110746 -69422 -162342 13729 -26199 -252612
20974 -252612 -704 -357169 143558 -258990 -88891 24707 236248 -111818 -67493 127937 -329510
20962 41225 -48586 64375 -163938 -158547 94342 -102096 46872 -16924 -214876 119158 466251
20951 466251 -31313 -241628 163387 -194656 -62821 91360 -108371 -279737 -22074 -85104
20941 -85104 -5553 -18855 -315171 -156620 105239 82151 -132664 262266 -123012 169385
20930 256797 100608 185123 31357 76874 -255910 -209423 214194 -17842 37598 -286138 280428
20918 87058 -117499 -143399 -14285 -270843 -105023 47546 51970 -190919 -61913 -245129 -59777
20906 255118 -232148 -58753 -465108 44388 -95736 -13202 -90322 -198861 10474 151778 162963
20895 162963 -122359 22127 165420 161686 -324498 -48182 -69914 -538206 -252418 -246582 -1394
20883 -287138 -90823 211879 -314194 238710 153186 -17734 -346321 89503 -152825 -113558
20873 -113558 3346 -54280 -32239 189087 156516 -224198 -18584 -178681 -130092 15575 -219328
20861 94999 -411155 -150019 133800 50059 165174 -126083 -252615 -77205 56178 55805 13160
20849 -68447 -257189 87436 3918 -71899 -182060 57485 -188883 36287 -104872 -277752 129237
20837 39939 26602 25297 -38674 88941 -54871 -99174 -155634 -244556 -198490 59040 17912 -312971
20824 182882 90495 -241484 -15150 -234360 -307390 74839 -205058 -91097 84161 -106239 -201817
20813 -201817 155228 -7838 -39274 -14255 -216251 -183120 30918 -190948 111905 -61146 -58229
20802 -58229 -29168 105719 -118434 42270 -283494 53178 66623 160855 -14178 238594 25846
20790 -202680 78609 -65414 -75378 -386563 57748 135275 -396944 105769 -56226 167014 112914
20779 112914 -126455 310632 61945 37671 253699 -213306 312834 -222756 45120 -68232
20768 -341571 140102 -101689 113121 197447 -124671 -279191 -207519 -59428 -36869 -57550
20758 -57550 -27341 -198026 22172 75730 -56496 -260769 62118 24879 25119 110069 -134579
20746 -143968 51071 139805 -121138 80591 -38276 -145157 -291283 -354487 -336341 -107417 47522
20734 138305 -46305 -266076 114089 -76492 -106049 -362058 -41248 -46732 -146361 149819 2462
20722 -2928 -201887 -150472 47449 -45065 -22159 -235366 -220666 -526637 10865 111888 127788
20711 127788 -227464 82940 31114 2308 -128955 14198 -32074 -109431 -192761 23749 -193066
20699 -251212 -39298 -108039 -121811 251503 -119858 8830 116507 102856 -106079 -209417 -136849
20688 -136849 -82833 -129639 137226 -120756 -36865 83102 -363945 308367 92518 -159310
20677 133964 -276406 -197592 -195539 48029 -10458 99688 -29754 90691 99325 39033 151529
20666 151529 33846 -48099 199295 185753 -122865 62289 -443898 118934 120252 -466433 -41191
20654 -87505 -174534 133320 127030 -112363 216427 109732 -131075 265883 -640068 -159339
20643 78512 120308 -67467 150558 -109432 -142716 -147018 159437 -129101 -151339 262606 -188417
20631 156312 -77154 -15897 -300776 146465 191175 -204445 -197943 131609 20049 260182 21993
20619 -36769 -61727 119728 -121653 -20958 213035 -266755 322 -71057 173217 33440 -304719
20607 85279 -8669 -325089 -133820 -143462 -300301 -65987 45281 -70557 -76021 118140 -36847
20595 -12397 -1727 -152023 180724 -285585 -288298 -196943 -201235 -75863 -38242 -64020 29094 -142886
20582 23707 -216776 -94482 -195854 -184146 125694 -23381 15693 -196427 72956 68140 -364042
20570 6741 -76855 -126201 -19998 -140904 -39351 -88179 -257828 -58330 -25093 218829 -285842
20558 -313008 -32824 -156400 -397913 68928 -368714 10875 -225289 -138972 -277974 186866
20547 -120401 -44871 166258 24494 329924 41194 -100408 -88855 -163861 133655 -179391
20536 65572 -311384 92098 -9579 -220470 -42486 -46972 106489 113047 -124977 281848 -155294
20524 -106455 -226026 -290091 87337 -23551 -345079 114619 221401 128791 -117221 -194345
20514 -194345 194192 -81461 -93067 70008 137103 -194041 -384634 81174 -6033 83854 -31394
20502 -67013 -228477 66773 69867 224535 139875 -111991 -54737 -93624 -151014 -142358 190165
20490 -89548 -149696 -175572 17633 10866 141292 21159 108961 -34990 28053 23232 -136450 -166010
20478 -166010 225872 29865 -237733 -89052 -97755 -71312 49135 -168495 -4549 -10245 23358
20466 -42097 -242903 -176509 77470 90179 1208 -342836 195970 260440 58291 -95188 173508
20454 -61698 127493 -213293 419300 -30744 -216999 201591 -274436 188382 -122260 107044
20443 160646 -249103 63176 176232 203936 -274825 776 87448 178778 -306896 8003 61250
20432 61250 17713 -160875 -150284 -335158 -250344 -293761 -144137 -77875 73566 -37174 -141192
20421 -141192 -60487 -288215 54907 -102218 -328900 92372 317811 57811 -224211 -210791
20411 -210791 -138125 -81594 -38340 -195818 112021 4070 -210070 -130213 -26111 -428713 -88236
20399 -96980 -343047 -178297 -189860 11788 -205149 -241710 -316970 -173519 -150991 160878 338094
20388 338094 -5026 -90955 5653 31868 -114313 -141946 -349194 77560 -218275 -132187 10830
20376 21523 -369817 22014 -206392 -75390 -72119 -116858 99557 69036 -129602 50924 -180389
20364 149220 -263198 191409 69643 -187634 71222 48091 -218906 -46249 139005 106215
20354 106215 117579 -180106 154041 161250 43458 -208745 130002 -182775 303487 239492
20344 239492 158735 -18517 140475 -188907 105141 1459 -214113 110305 -195079 -150591
20334 -150591 107507 -74096 -124094 14252 -8132 171618 202630 -428684 14534 -45326 314967
20322 -196232 -340812 37042 6255 -93278 52736 10721 23660 49867 -68607 175627 1597
20310 -384980 -280087 -208604 114947 -6974 -93251 -66994 -66243 -305306 30846 77960 -165629
20298 128900 203627 -66598 -269888 169787 -219089 -75616 8898 487261 119057 152529 -66685
20286 -220056 -188633 -104189 -118483 -155349 -74404 -27830 12099 95125 17441 -338250 -285718
20275 -285718 -305540 -188415 -358610 -306374 40223 -49600 -151889 111077 275332 -50091
20264 43651 -147766 273504 -289506 -251292 -289324 -195654 44218 118826 -28624 249106 116938
20252 -20181 36483 -37034 -8104 -351521 -133241 -129601 278955 136921 -126582 220043 11705
20240 -79315 -94411 -43450 9852 -388620 -212149 -20295 80999 333997 13057 61519 27939
20228 219307 174500 -194331 -339493 -27172 67462 71448 -96369 -42741 -175924 269904 -192961
20216 183036 -34908 -133956 -54206 -34984 -217652 -69150 -337126 -199722 -4715 -14215 6154
20204 -41666 -232407 -85233 27574 68327 151401 -172402 -152302 -378985 143912 5761 60362
20193 60362 2409 90962 132599 -298225 47240 27289 -100269 122530 -197106 -291036 -14473
20181 225059 67361 -4486 34427 -232105 57057 -62033 21833 19207 43323 338554 -99745
20169 185974 -166001 88242 -305260 -266954 218446 -227319 273530 -25844 -130670 -120074
20159 -120074 64592 195648 -8591 33620 -97580 35423 174289 -196983 135458 29930 242079
20148 242079 -18933 191154 111634 20051 306599 -24498 474085 161245 273875 249465
20138 249465 337110 202758 146789 226091 324300 491784 166022 18074 95386 -313628 -341857
20127 -341857 146604 90394 -17598 -99309 -120362 41430 255884 -136691 -212906 -73005 144553
20115 236985 -252761 26310 -161056 81467 177235 -134904 28073 209244 -485365 -179446
20104 28519 179465 16068 -49497 -248495 -77712 -80176 -222899 -29173 60369 72451 116520
20093 116520 432992 109354 140276 53477 65877 89803 118230 25852 -105925 87560 129203
20082 129203 -22080 -179639 -456010 -146435 -22153 -421127 -140185 -38258 159937 -14402
20071 -168677 42748 14144 -75720 139024 -126106 -69273 7179 53131 -117193 -95431 186
20059 -178226 -230289 53000 -45613 -247048 -461801 -3895 -228371 -236375 -107273 51258 40440
20048 40440 121160 -102058 -144349 51080 11148 -97881 -118506 118370 39776 -317481 70931
20036 -129449 -110508 64865 -365404 141548 -158969 -80604 -339223 -485756 -62452 17318
20025 -164047 -21621 338621 174758 22904 880 -276113 196876 367085 12886 -4875 185580
20013 -270405 -221831 -84508 -83713 -595033 -168836 -21412 -160493 -83532 -113635 161400 -258502
20001 210247 46048 -170031 -24437 -61729 -142988 168199 -20987 82578 -284479 -104499 27668
19989 62998 11802 218237 247744 209671 -104518 312715 -140255 -31109 38603 -88812 187085
19977 184144 -59943 112361 245325 -148283 146601 -41938 -84776 -40646 -137264 -3429 -213086
19966 -213086 28814 -71174 -303907 208326 141124 217076 169641 211291 -167475 -29105 4641
19954 27399 -116103 348156 -189820 204191 152731 100096 -198067 124513 52366 368628
19944 368628 -8899 -187640 199162 -9186 -3371 4151 -245429 98126 -46318 -203244 113418
19932 27676 -180853 -334365 -181241 75780 -75318 128342 -31049 -98224 -181457 -42200 -145992
19921 -145992 71803 -243551 104333 -84465 162739 -354462 -158953 300727 -44829 -119619
19911 -119619 -215261 77820 119892 -160902 59897 -158178 152455 -138049 -76357 97040 -166634
19899 20247 -118579 -49831 -24783 -20291 109396 -22359 -238444 22629 -51158 55144 -196888
19887 23588 129667 -97238 159546 42231 101346 -168881 -197089 156172 -13242 114248 -72480
19875 -243254 22729 -11463 151841 -54818 -58021 -270524 -61138 208618 -320542 -13030 122490
19863 -215464 -212663 14862 -89532 -178861 -93943 120656 -230294 6854 -302321 50565 -9869
19851 -287287 228122 -23695 165688 59200 11779 -62272 -329035 113187 133368 -202206
19840 228029 64807 102865 -89415 -277279 32231 -118893 -42359 189479 160825 75886 199896
19829 199896 -194191 -317876 -60081 4400 -110642 -18630 -273886 -114424 7950 -77152 -147046
19818 -147046 -2521 -2874 -122645 -229668 -69492 91615 -88609 -122125 -108731 76814 -102236
19806 -23757 35 -37912 -132932 -15130 66855 -7495 -167062 -465554 -642 -121120 -103806 -53904
19794 -53904 -167589 41534 -114734 -43511 61618 71109 -913 253255 -29622 100866 35160
19782 -264436 -83884 -138438 -360280 -168629 -110666 204326 45951 -65157 147445 -145180
19771 -20138 -217569 24045 -222825 -306692 -227015 -80135 -147276 -127456 33916 -177378 147588
19759 152494 -214545 -307289 -144923 158875 -124710 203367 -149572 11789 -447828 -241572
19749 -241572 -214390 -68261 -19149 357898 130857 67462 23075 207481 306679 234157 17388
19737 149588 -326872 -352436 -50830 68211 9717 242020 55357 120769 7799 283337 394964
19726 394964 359152 152024 -125611 186610 -298947 160882 -149354 -136224 90019 -43965
19715 -31581 -256081 31474 -28402 92725 -98559 41261 -169266 216559 -87633 187339 110881
19704 110881 80115 97084 100749 341067 -27780 -109974 -236842 -87739 337941 381616 180982
19692 331193 113487 -301599 120006 -33798 -272390 34794 -6418 -140942 -62385 -10519 -158682
19681 -158682 -57113 111455 -174639 90286 -21939 124171 -152495 -95068 -62049 -252947
19671 -252947 269036 -78796 -96368 -25604 -38167 51201 -244979 122941 -108213 147949
19660 -78119 378427 27174 -10656 12619 6603 11273 163478 -301243 -222677 -97905 126001
19648 -181951 112268 -94531 -143033 -137966 199162 72549 -178011 -76201 256560 -10043 76571
19636 -42637 -75128 148833 -245951 -486307 -230614 -77499 -54912 -138950 -273673 149866
19625 -60912 450858 32514 -28513 164067 -163393 73691 42 -162387 181924 -20871 -21218 -8755
19612 142353 85120 -212968 53499 -306357 -134311 -333980 -169680 52941 -193380 26247
19601 -273503 -25335 -273030 -93018 -176089 -246474 -219434 99777 -40708 125686 -34358 11207
19589 -182592 38508 206061 -188915 42127 -47157 -43341 -83179 -268236 201277 -217253 3369
19577 -106974 375293 212102 131916 -11477 134515 -125003 -7010 -39608 -40190 -125165 -78813
19566 -78813 -244572 -238256 -165003 125211 2261 -133517 151419 -4457 48347 -323495 -178157
19555 -178157 -57382 -234572 4065 -23697 -225072 82341 -49386 -123779 -17853 -49922 -167297
19544 -167297 -377199 121114 24479 161826 -60243 -48924 -451346 5496 213169 71832 160099
19533 160099 24311 -51712 -309667 -24349 -5810 -158241 164775 91272 210195 -243438 259657
19521 378437 -171158 -339423 12566 150764 -80844 -275348 -49010 -164694 -89061 -137104
19511 -137104 -86237 176171 65273 -121073 -263144 -184830 -345065 209087 -333202 -287923
19501 -287923 108344 -72864 -225141 -84236 -13430 34065 -127645 52496 -11090 -408245 184628
19489 -245897 -262855 -407280 -359497 -173888 -248049 -86373 7439 -4965 35716 172415 -31121
19477 -40334 -2727 169538 8591 -349895 -68426 -137632 158843 18152 -91531 70280 -46670
19465 -171012 342756 150940 -17053 173134 97086 -158854 98204 161509 110030 -75108 -46224
19454 -46224 -84578 -33405 -29952 -203409 -237501 -51624 159196 -40687 -153111 -67465 -82599
19443 -82599 -95043 -87200 148825 146676 -158858 -189036 -27311 -52623 -228061 -150046 -73304
19431 187400 170016 -65632 21814 45083 103278 26852 -328360 -407094 -15439 283828 -266563
19419 19074 49030 -281331 107634 -132730 -58217 -173206 -208598 -313176 -517142 -48631
19408 393840 -223630 231002 127453 88086 -403788 117143 18765 57123 -212013 72744
19397 73911 -58586 274165 -43230 980 -194337 -248901 -37944 -45184 140947 -165655 -71502
19385 -352795 215299 -16610 68560 -71667 100227 70071 126931 -87014 -191376 -408112 115659
19373 -91675 -131459 225090 -37752 162730 -45494 -122296 -437966 223355 -1276 104505 -98777
19361 -4027 218083 14913 -55415 70690 -65600 -388793 5306 -123757 -50270 31388 -61660
19349 -52975 51145 156406 -50429 -61537 -118283 86833 -186637 -322961 -248932 -306663 -139540
19337 -63954 -169389 -12669 -922 59515 -62512 -114233 -2100 175059 -65633 -326934 -22058 -222580
19325 -222580 41071 -110849 6526 -292489 -222244 -88091 62317 -528152 248725 88432 290188
19314 290188 -119047 36386 67046 23141 252706 -234825 22843 -45007 -220696 154748
19303 -162014 371496 17229 28533 -57518 -9205 -119459 -377025 -132855 -97023 -95442 -52658
19292 -52658 -100396 -301772 181363 -48482 -126466 -111550 55755 382818 -81075 -152887 -561574
19281 -561574 -192305 -54619 -401163 -149325 71534 -236248 209424 30126 -69997 214496
19270 70667 44100 112649 -83547 -292636 -52743 -100821 60393 -10655 35620 -13999 -72498
19259 -72498 -77126 -259149 437358 -186842 58882 -62929 -265224 7958 -259524 -20046 -211495
19248 -211495 177483 -28473 54781 -179119 -269476 52537 -16099 -189520 57847 144993 73814
19237 73814 43177 85690 -57168 -132250 -108826 -197526 123310 -211321 -250351 134418 -212991
19225 -140490 -20439 -222120 -90674 -119456 -22087 186799 -131444 86107 -227416 -277658 -160569
19214 -160569 86008 81902 164920 -54249 -259046 -109990 150508 15563 45099 -154980 -580489
19203 -580489 -225198 157692 54613 63535 -146733 -220183 -227419 48653 -78851 138296 -202312
19191 -93552 -88260 225281 -126295 -41200 -238184 -154456 81112 -50627 286046 -350221 330293
19179 160633 55629 -161980 -75677 -158664 -216732 54143 -408118 -20016 -169436 68792 -196214
19167 -98778 -114269 202294 -79870 21572 -141671 -12353 -252383 -163833 -81332 -72708 -179934
19156 -179934 -325181 -267044 -217668 -165275 72248 -324296 -275599 97216 -370824 315530 -80581
19144 191685 -108293 31599 30562 81497 -227302 -248251 -237562 234305 87010 167923 -99672
19132 -47474 -42061 32092 -97986 -229026 -58646 -66190 171248 22148 167102 -124979 -111198
19121 -111198 -231701 104255 68768 -215066 -57149 -117621 -12748 154929 -304770 12350
19110 -105784 11701 7487 -372935 119899 266532 -212986 249014 511 226736 635 -58738
19098 -3506 260595 -283366 -170416 174309 -440879 141292 -37148 -146635 -154458 -216263 -220781
19087 -220781 18855 -144778 -18832 -245258 -389980 -349348 217524 -182229 40574 -125174
19076 -265037 85205 -67900 -139343 295716 163314 61300 -251511 186252 69083 -80308 41652
19064 -190073 58854 28183 -90772 -188625 -200493 -66552 37465 -220366 77162 90022 99592
19053 99592 312572 -386247 -94245 116195 -412005 -85746 166756 -131832 -30718 -112334
19043 -112334 363786 -20334 329258 49361 10316 -238994 -136441 -242474 120558 75786
19033 75786 -34449 -127630 134573 -24416 -176664 23300 -53776 64447 -273252 -104678 -224289
19022 -224289 -127041 -235906 -43400 -295472 1275 221238 36032 -138997 -222886 260623 -106752
19010 119366 155200 -40821 23293 238329 -46344 -9785 222599 193735 -263833 -90125 -37363
18998 -33162 -165624 -68371 121184 -96598 -42824 -141458 -22475 -125044 -149702 -39064 -557725
18987 -557725 -106393 251922 -99712 -51078 -215417 -128619 -462974 -344196 320820 -192662
18976 40464 -135997 -106425 -36205 -156829 -16186 -94045 93001 -84297 -255393 2944 -27622
18964 -191108 291254 313647 207516 -84823 -17024 99 247940 110732 -522550 -42071 77853
18952 -28137 87051 -92818 9187 134214 365450 109085 108246 -248117 -180245 4889 -227605
18940 -64792 -398085 -203550 19054 -317183 34346 -162744 86741 80180 -134187 -75715 -368773
18929 -368773 117870 -240792 -264763 295772 -67904 -116189 161659 -456738 28257 8170 132638
18918 132638 160631 249520 -206295 -16117 -203825 -230025 -98873 74741 -55181 218160 -111396
18906 169598 -141643 -267892 65120 134277 21709 268488 94524 427933 211084 121388
18896 121388 -100914 137314 -55039 -244083 183120 -122535 -48267 87111 -90918 112166
18885 113845 215545 -327651 115344 -381055 -105035 73291 -126146 -22671 -313572 -241253
18875 -241253 -147752 130634 -90769 -50142 -81288 -22890 -342704 -305886 -103410 97898 210474
18864 210474 15281 -372092 -249988 -17856 -121364 81278 16024 -42789 -160357 187531
18853 -36754 -254385 173907 103594 -30478 -203583 -40177 -59178 -205325 320275 -96183 20982
18841 -317554 -89492 260132 -223980 -25825 433945 -251529 -6445 -15683 97588 135750 52550
18829 103786 82584 -40150 -413498 -186956 -35775 39021 -900 80125 28362 -28698 -164947
18818 -164947 34809 169142 -85905 304414 -117082 -52289 65716 -214416 -455602 335181
18807 16036 26353 68898 -212996 -425611 -79470 -96837 -98729 -233058 58555 210604 -11469
18795 -149178 -201699 -146132 -53005 75139 88780 -17054 59548 25523 -144073 -82603 -223096
18784 -223096 -484162 166426 -149329 202504 -47344 528201 91268 -324313 -18879 28067
18773 -195508 18010 -280286 -5228 -176631 -20314 26919 39646 214338 -168596 -17893 -114841
18762 -114841 168357 287228 -24668 -143273 -73632 99128 -497097 -129776 -246255 -353345
18752 -353345 -34691 -18323 -28926 198079 10314 179252 34386 -77674 -20818 -68463 101614
18740 -179718 -328109 -5541 113225 -101362 -123134 -379370 344029 -143074 244881 -205443
18729 -129274 39555 145268 424890 24549 -179027 -38771 -253123 -65601 80491 -69402 -159566
18718 -159566 -61599 -162603 -48343 -270266 -408126 -19258 47903 -73873 105056 -366641
18707 198979 16294 165294 -264399 121470 -189883 -307886 108735 -126715 -57652 -273257
18697 -273257 268918 -49683 -922 8807 -76950 -56871 -50386 84315 -167138 45291 -87985 -285096
18685 -285096 314230 41302 20715 -135074 -301956 73577 63295 67737 -370686 -173891 18109
18673 123774 114353 18046 -129997 -81351 32488 61433 -52002 64411 -216146 -476310 190148
18661 -104565 44341 -1591 12623 115539 118724 228425 -95434 -80237 203648 -202503 -31244
18649 -62598 -351926 -87979 -79015 -118385 320362 -23301 -363303 -195777 -225782 -72341 -396263
18638 -396263 93662 93152 221249 -69693 424361 -183011 -168893 110351 109742 111016 80690 -317727
18625 365834 73414 -485352 -271332 30089 22989 -240324 -74812 -297868 165829 92142 -247817
18613 172760 -198496 148289 142321 -197368 -209689 -299676 -270335 -237769 -33522 90889 148429
18602 148429 128095 -294070 -65930 -572834 -27050 -113160 -126528 176357 -26733 -193326 -7929
18590 -112285 88452 18648 -529231 51313 -109033 -183849 11502 -177661 110837 -107302
18579 -308945 -269790 -40883 -99255 10787 -76872 135364 -142189 -132879 -147855 -277769 -301193
18568 -301193 -98712 -102620 -247423 -190629 326529 -95800 -41432 22151 -100830 -141691 -108093
18557 -108093 -301640 125513 204194 396588 -105617 -24639 -103635 -66936 100691 137830
18547 137830 48286 106010 357974 146070 -129317 -116403 204943 -215167 109657 -112292
18536 -125716 25616 -148392 167377 309216 19162 -166548 -17804 -321029 288488 -156603
18525 220093 -279547 283183 89649 -33927 7686 46464 -344742 -312489 135 -241435 -86065
18513 2473 182359 -5677 41899 98301 -287827 -208650 239829 -235769 136690 99838 -354466
18501 13517 109155 -94742 -65213 -117737 84986 99574 -81946 -319998 -117649 -4831 -285696
18490 -285696 77509 48707 251872 -65397 -107327 217791 -42171 62450 -317587 -103303 -75528
18479 -75528 18049 244633 17921 -156328 -36957 256595 -197979 77724 10510 -213541 38139
18467 -225551 -308791 6436 -145612 -146132 -16857 286828 -68308 46039 -11627 -96160 29554 -33582
18454 51500 -7482 -33623 165668 -289646 -183082 125573 -28420 -1722 -35178 -350619 -79698
18442 -299970 -214283 -270494 -191507 -157672 -60159 -104431 97070 202672 -88543 -178528 -243897
18431 -243897 -182116 24270 187863 54817 9696 -286393 -276467 -361448 114427 -281564 73661
18419 342334 210833 -1405 -76267 25181 220682 -132829 22104 -50724 -157558 -18473 -240011
18408 -240011 -19061 164542 -170904 -26737 -74781 -239639 -48657 11393 38153 -120441 -363044
18397 -363044 567462 -55864 -160454 -285555 62349 -24818 33299 -372960 317131 -42280
18386 -179120 51742 -346992 -148538 -147964 -227730 297078 47398 -187209 129436 175800 -279123
18374 -102955 75862 -18068 -276414 403080 72011 46369 -138805 6493 243618 285462 94066
18362 -3406 100332 -207297 93016 -522851 146091 -142697 14271 -150476 113877 -117859
18351 168074 134977 -171633 39765 -17214 122934 -373321 -95862 174590 -166637 -29408
18340 -358301 -299835 143355 -91233 157207 -96763 -12700 -55167 -40661 -418940 -123745 -2528
18328 201557 188667 107730 180917 -147700 -15174 -4898 -19078 317645 191397 -317692 -155489
18316 93582 173655 -191451 -100371 -2764 -132818 153833 -19600 -38619 -40166 128167 -266849
18304 -252231 251039 9957 18346 47867 -127310 -98562 -264102 154519 -211920 -160171 206885
18292 21916 -334623 -199871 -140204 98657 -208082 -279280 -283319 18960 -26983 -15188 -67471
18281 -67471 30356 -394614 -241595 -420458 -113794 52607 -33134 54263 -108335 22282 171415
18270 171415 213258 21144 90721 192701 -69481 -114475 47847 -224306 30258 24807 -19367
18258 -16920 -200536 -293694 -151390 6034 65479 -120480 -30518 77051 -97214 -91474 88070
18246 232967 128174 -105714 179251 -295438 -293083 152249 -75913 -383973 -174348 114062
18235 -390650 221331 -148840 -85563 -127465 -46225 335516 48302 126289 -391812 -230444
18225 -230444 -295775 -153571 20044 295705 146819 -365186 -271154 48881 225998 18946
18214 106760 160354 70958 3986 -65462 265697 -64117 196209 -158119 -146283 -43551 309957
18202 -157607 -21841 -91540 62676 31453 67371 92768 247333 -445150 46874 -279745 -210890
18191 -210890 46226 -138640 -33961 207382 155269 -280060 -86733 -88999 179878 -278122 -29733
18179 -120424 243524 82416 -387916 140772 -227651 90267 -215859 216081 225933 -131547
18168 -79674 -22632 65016 118537 -19785 65790 -7979 167412 50917 -40481 208351 -300147
18156 -176972 -106658 33060 -148523 -107247 -66170 -89562 -426942 -395850 -34151 -48357 -393286
18145 -393286 -174239 -111270 221860 213118 -305109 -4831 -162236 -82890 -24795 -44549 143897
18133 -160360 168737 86173 247603 161775 -44576 -310940 2354 -106446 -153661 -163507 -126792
18122 -126792 -89885 -282777 -2318 -64814 94916 -139028 245390 126322 -58260 -262400 95983
18110 106094 -122437 -42846 13981 -70764 -60181 185618 -126478 -104183 -43384 -171607 -72463
18098 159921 68843 -102987 144063 -38386 -13905 224689 60838 11352 -47300 173599 -15225
18086 -79419 89830 -141734 -45256 -75251 66624 -71440 37092 299590 -14487 -205705 250824
18074 52081 -285703 -276846 279677 161634 36460 188340 -90062 106315 -230565 150707
18063 10432 -116701 -86191 -317597 224122 80381 -69375 -46706 114920 -253931 -70793 -255419
18052 -255419 401413 35340 -62052 225947 -233922 104329 -32729 -178950 -166127 -79088
18041 140618 160552 -145045 148842 153957 76208 132247 199607 155754 -109243 -88467 132126
18029 -93375 207637 317697 26597 -97325 -237067 61921 -75048 16264 90013 57996 -59371
18017 -79331 -137003 166099 -111614 149465 -231541 179628 -165725 43449 25063 -36370
18006 -38751 81524 110136 54425 39983 -117824 -171416 80723 -238330 -18389 10537 -25077
17994 -283139 48642 291796 212223 -139081 268521 172748 -23797 224422 -39729 -115162 90341
17982 7250 151868 171974 -41728 -187128 -187948 -64548 9895 18817 -69297 136838 161874 458263
17970 458263 -348025 -207533 -46675 -139995 -132736 159812 165793 -113424 32339 124079 292030
17959 292030 164562 7500 362580 371954 -207404 224532 64399 100168 -84840 -75916 8224
17947 15659 -15903 -67557 -63614 67360 -161850 -17020 -324290 322519 53204 -58863 76418
17935 190560 142878 106514 -203785 21077 -294573 -251162 -226933 -31280 300388 167503 47880
17923 370658 -47253 210946 -287078 -49485 133112 -18446 -173909 -237661 -108972 22443
17912 -213522 134615 -80197 -186270 219712 -166682 94816 173215 -1927 135358 -280215
17901 -94387 175956 63380 159367 -143689 -128371 78198 -2175 -63155 203825 224107 91272
17889 -90767 126116 -205293 -43807 45284 122671 169139 143943 84386 59799 -241715 -50910
17877 -176963 -409778 -109417 -71304 63444 -9654 275670 19688 -182954 215628 68701 95308
17866 95308 -124333 -111758 208180 -74806 -249054 -128210 332942 69558 174197 -157427
17855 126701 141356 333359 8029 -26303 -156101 145816 168363 73345 249242 530475 205685
17843 219768 261871 210456 104460 -58230 -90406 -220598 267055 -7380 -468174 -196953 92086
17831 -192390 129950 103803 265798 264812 -189042 -165679 144984 289565 43956 4667 196647
17820 196647 -171930 354496 -279784 -61233 -326374 269132 50985 -139700 44119 187639
17810 187639 -46077 224873 -99219 62974 94330 -49764 115268 109295 88770 -212442 -113467
17799 -113467 85556 -17084 130810 236571 57859 78730 -13464 8175 -42277 244709 343956
17788 343956 -301013 166943 -74677 56648 21993 -43101 127666 337580 40185 -213096
17777 -273057 -62729 306151 84628 227422 -93354 5586 14387 38544 123119 56041 37521
17766 37521 -29407 -260401 -171053 -252039 -22393 78999 126896 -164440 159732 -133913 -3349
17754 9984 -125149 -7901 94853 73001 -41634 -118808 -41922 252193 -92282 129959 46869
17742 -58406 -3809 -73009 -81459 127369 -202183 271009 61904 113538 6097 -78164 2208 38125
17730 38125 62547 -272194 -47018 253971 192955 -144945 -351826 81466 59753 370714 156515
17718 185529 -135678 -14975 -39771 -86590 -24348 -96881 77306 129301 25798 264280 -216872
17706 -39316 61911 238672 134236 -106428 57668 347391 249434 15161 16750 409311 34902
17694 50557 197951 31209 235944 -266231 58186 73598 -78487 122014 -295564 -145156
17683 -160997 328600 245461 106788 336143 -352201 61297 494088 -31384 161261 -148300
17672 -226640 15212 29593 372959 -270736 -39584 -59637 144563 152236 324728 -35355 -1209
17660 1688 189787 -188584 176087 -110053 96839 -46922 169359 159836 25664 76905 -78916
17648 84608 16553 84479 373636 306326 -89203 118490 -50357 316018 35610 90922 118719
17637 118719 88626 53133 -75388 -43002 215994 -115538 -25718 251829 201376 28386 -41812
17625 55573 -48297 20059 -54478 140348 416614 69056 219901 -11409 -14425 -260741 -170537
17614 -170537 169134 252860 340571 4303 346779 156743 247144 -78020 66352 369825 412722
17603 412722 34633 124188 269624 159317 -48286 84983 -48083 272557 325449 118947 234089
17592 234089 57558 -128767 293776 256819 269294 226876 185211 213188 83553 12662 177723
17581 177723 219176 319216 84945 275713 90620 -15366 223159 322657 66825 106327 12978
17569 292539 535624 -454 -10045 350662 70115 -34835 24185 437764 -19146 2289 222178
17558 222178 339601 -92217 478962 116403 -11195 108642 6552 230913 57426 452845
17548 452845 208574 174716 535229 274885 332837 98322 286078 11865 402603 149740
17537 74853 74139 113761 168071 363458 243005 172207 148012 28566 49111 -2229 204105 171952
17525 171952 285511 293247 464159 -63878 312495 379132 271237 14896 179845 302742
17515 302742 444262 147535 271708 346847 123345 351258 387112 363578 381550 99873
17504 175943 297918 198200 479353 409518 -41355 100001 110518 163986 -212239 239283
17493 494390 101707 717585 -50036 53520 244656 486823 511488 215449 -75035 291379
17482 152454 279978 7455 57551 261743 354224 351692 85414 354477 486831 -2038 456244
17470 64398 249983 211247 165019 139330 356651 139181 246693 -240500 277125 471329
17460 471329 160729 339988 191598 72497 356109 493127 255161 281634 293724 113533
17449 160054 314075 133467 140959 511635 339922 533932 429773 433784 377595 177277
17438 386517 436342 -26454 287527 296566 121076 77584 249389 -28261 279294 269078 346848
17427 346848 -105786 86578 459036 382092 95609 610940 59465 294975 616437 395875
17417 395875 172938 141824 480449 187987 146653 310627 311678 229468 61296 -52888 312810
17405 69354 422330 98778 -225254 208572 371929 297902 338222 213342 377487 204868
17395 204868 105587 347159 478731 417148 191787 -135817 -69153 205624 352754 64136
17384 -22877 260976 225167 181129 530336 87278 247467 252925 142131 225357 34619 199066
17373 199066 530854 19961 104891 -69932 56913 -12792 626116 -2581 129928 447140 123634
17361 207302 132198 306529 392590 574162 263008 145914 552336 360606 173955 -26035
17350 219745 387599 220608 155080 367637 447845 130384 168610 472257 652609 364523
17340 364523 196696 366684 247767 295990 344777 226667 382380 430758 438662 346795 -8861
17328 42237 -99132 389015 106730 411647 233963 475399 110027 10442 414971 398665
17318 398665 20811 269677 131483 225894 181594 15580 171547 138206 303010 412852
17308 412852 190194 316906 200204 346503 162892 170791 280756 317406 223287 274909
17298 274909 474733 85114 199174 588498 362797 111866 489768 120713 347687 260685
17288 260685 471464 286107 324012 244965 183372 493120 491859 404037 186285 178332 571708
17277 571708 344438 572928 304352 110298 372506 418020 63882 512163 428703 222183
17267 222183 447902 697413 452637 296545 460282 658725 152211 451839 451993 160304
17256 299121 284666 284377 208306 578349 349797 463411 466876 191747 638320 555145 276421
17244 234161 452073 526357 432427 488540 720909 399272 183325 395386 543118 307663
17234 307663 477681 576874 282830 241340 288772 219349 356467 -199891 234365 473617
17224 473617 431582 206199 582740 420848 450518 552787 355944 3933 409361 149018
17213 391360 256192 416812 360678 321342 537150 510264 688499 585468 628309 539282
17203 539282 568720 527644 662931 355873 382432 300411 380226 421050 524741 454689 703299
17192 703299 178186 422774 504236 -1717 135392 308567 544851 335589 420975 336509
17182 336509 331678 585522 472828 511853 526635 413701 780578 262777 345979 491015
17172 491015 709812 540160 885740 363077 484450 696082 280303 530247 414950 681775
17162 681775 520504 778171 597873 719225 470690 639217 401891 373020 831027 816186
17152 816186 910495 617429 367317 519154 381735 658784 563719 417811 419216 938388
17142 938388 739445 786580 706160 601217 913607 934553 711955 748123 484770 589560
17132 589560 771334 453752 761269 461418 726206 704578 657849 820327 613415 721149
17122 721149 935372 818691 454866 722195 520967 740123 707905 856327 624700 928250
17112 928250 1066917 738877 775641 995141 666984 841560 1033863 1188261 929503 936625
17102 936625 1028344 634938 634427 844634 751994 778767 901251 728307 529186 838470 761563
17091 761563 806045 659649 862245 834395 1174232 803386 1055333 765513 729854 989772
17081 989772 910163 1056130 740529 1067439 826322 906624 810826 751524 1005385 1195262
17071 1195262 1226239 1210497 1383294 838748 1175093 994416 1183347 982426 776184 728918
17061 728918 1103859 1031215 1168504 1077197 1139074 1154897 983853 1178210 1134524 1045836 639719
17050 639719 1281137 1095132 1164744 1103174 1074727 1171452 1388763 1394769 1179504 1011714 1305420
17039 1305420 1353040 1316431 1371981 1320012 1277866 1373851 1170078 1127946 1265471 1146908 1156886
17028 1156886 1153910 1259863 1457635 1114097 1098254 1203254 1353956 1213499 1082858 1484904
17018 1484904 1488273 1443351 1214870 1499589 1555352 1308951 1238830 1607308 1790624 1644328
17008 1644328 1449994 1442114 1678520 1630014 1203959 1820687 1677891 1630023 1614095 1456112
16998 1456112 1776497 1516660 1510700 1463928 1678868 1790605 1884260 1564122 2054419 1569514
16988 1569514 1673347 1670791 1941779 1700288 1560674 1740948 2113224 1879610 2057683 1744592
16978 1744592 1984114 2127780 1764660 2114936 1763091 1916800 1951407 1925217 1805888 1924186
16968 1924186 1915856 2001894 2032086 2219292 2331065 2175622 2051873 2137740 2185106 2019402
16958 2019402 2124688 2010489 2169668 2310089 2351815 2254756 2392105 2445014 2554968 2441910
16948 2441910 2528598 2521127 2279451 2303745 2728273 2507454 2720918 2540807 2422517 2425946
16938 2425946 2568286 2682386 2912125 2826414 2953793 2729152 2689575 2850045 2729158 3023736
16928 3023736 3098185 2903531 2937040 3067785 2923449 3382040 3199360 3285259 2932922 3335741
16918 3335741 3427143 3175829 3278197 3426644 3284601 3218017 3387305 3067849 3423090 3914162
16908 3914162 3511803 3338784 3630549 3832722 3661730 3834249 3693571 4037131 3893347
16899 3893347 4097729 3755442 4221373 4255570 4118652 4212738 4362823 4201304 4352679 4431085
16889 4431085 4571572 4672573 4705755 4559856 4655044 4825288 4823741 4765272 4951886 4988432
16879 4988432 5110788 5276439 5339951 5607667 5400677 5428421 5702939 5452594 5870205 5585911
16869 5585911 6001593 5815306 5799490 5838602 5976141 6157796 6449309 6329333 6573593 6533472
16859 6533472 6545592 6749200 6853242 6689799 6708412 7128535 7375258 7285007 7409385 7561231
16849 7561231 7638251 7753932 7666337 8148818 8078363 8633077 8185892 8536676 8513028 8666239
16839 8666239 8409970 8957043 8993354 9267238 9113265 9715842 9940925 10172944 10209110 10332757
16829 10332757 10410826 10600491 10855336 11077969 11266656 11194858 11365654 11559069 11737776 12355696
16819 12355696 12535282 12585193 12945433 13107047 13440057 13605670 13856291 14191487 14264459 14664945
16809 14664945 14911915 15198485 15430312 15864359 16130784 16096933 16624547 17055441 17048151 18025660
16799 18025660 18036831 18347098 18706289 19235008 19326754 19916646 20522186 20684964 21123117 21930740
16789 21930740 22303291 22522547 22945055 23599885 24187207 24613067 25324411 25656154 26252420
16780 26252420 26846144 27528932 28000063 28830071 29143506 30149187 30888447 30994776 31788103
16771 31788103 32886599 33403741 34226321 34789432 35805518 36060062 37540663 37931010 39203841
16762 39203841 39708679 40700510 41263150 42795260 43682648 44318009 45013134 46213155 47117078
16753 47117078 48554378 48972563 49978097 51048819 52233962 53054571 54339312 55137130
16745 55137130 55939406 57285005 58360951 58906946 60026372 60793403 61755011 62624625 63575705
16736 63575705 64083767 65063182 65710159 66516902 67124165 67737904 68541183 68908958 69540789
16727 69540789 69747722 70264018 70110268 70298988 70476447 70804153 70711819 70979758 70584679
16718 70584679 70199311 70067826 70040826 69680022 69147402 68834441 68263733 67430176 66991388
16709 66991388 65997057 65776713 65113449 63997531 63168699 62533169 61499802 60815522 59734639
16700 59734639 58915927 58313250 57278524 56152187 55161444 54195247 52943128 51949532 51479203
16691 51479203 50319719 49649571 48513046 47378370 46490223 45604456 44979474 44040871 43029567
16682 43029567 42150418 41188649 40615556 39833641 39009112 38243655 37180506 36408058 35706289
16673 35706289 34951514 34355371 33892296 33177492 31940780 31734580 31025650 30519270 30032123
16664 30032123 28910701 28625088 27920890 27536211 26811913 26535444 25803970 25307804 24845414
16655 24845414 24359493 24169904 23481091 23096097 22749197 22304624 21731011 21161160 21119382
16646 21119382 20760046 20322349 20080859 19739925 19104192 18968764 18781130 18139041 17783624
16637 17783624 17250278 17196052 17160251 16657538 16454640 16050295 15884793 15565253 15288359 15077262
16627 15077262 15057567 14304583 14379529 14432381 14028148 13949674 13696241 13442214 12809964 13051026
16617 13051026 12560266 12666613 12378581 12409850 11707816 11689546 11620815 11783292 11294572 11249027
16607 11249027 11029551 11107565 10509941 10790413 10593952 10458072 10281283 9913088 9750952
16598 9750952 9710081 9485813 9384596 9336390 9017920 9180732 8593826 9072083 8440969 8778265
16588 8778265 8565215 8108861 8531713 8321117 8041718 7917068 7870513 7825934 7826352 7581882
16578 7581882 7382603 7431314 7316363 7439044 7213064 7027977 7155724 7002136 6578333 6891888
16568 6891888 6707321 6780775 6652136 6307253 6353835 6486089 6035658 6388992 6271048 6018328
16558 6018328 5968330 6113209 5740683 5700177 5827644 6154831 5615660 5746401 5820104 5438156
16548 5438156 5741201 5596019 5303155 5380079 5325900 5124381 5034250 5254748 4987688 4879222
16538 4879222 4756323 5019767 4531327 4824983 4900537 4609088 4821121 4635764 4794618 4488508
16528 4488508 4352285 4571967 4331332 4563477 4538703 4091781 4317279 3838930 4126361 4257611
16518 4257611 4102824 3843621 4050006 3875951 3850662 4119432 3828944 4225834 3735727 3734790
16508 3734790 3882499 3595527 3707145 3514945 3569695 3611796 3795627 3603098 3619464 3318362
16498 3318362 3413322 3786855 3411764 3547331 3399768 3136225 3453670 3445624 3411128 3517509
16488 3517509 3163013 3319353 3186453 3557945 3010249 3037979 2834499 3156924 2910795 3052320
16478 3052320 2794940 2933582 2929569 2931524 2626182 2885047 2894814 2753454 2786398 2603860 2847112
16467 2847112 2707993 3023916 2999987 2840105 2549996 2541318 2812552 2746274 3026610 2690647
16457 2690647 2540553 2650169 2204687 2708218 2704398 2419497 2173749 2364487 2257737 2294199
16447 2294199 2726162 2551662 2674284 2144645 2366890 2494931 2380247 2105173 2289151
16438 2289151 2378220 2304217 2366950 2286398 1923280 2471447 2189180 2061819 2024248 2076454
16428 2076454 2050551 2217254 2028110 2168821 1988403 1888046 2075362 2036763 1700545 2134453
16418 2134453 1794740 1722672 1637983 2012912 1883826 2126717 1852170 2040914 1701627 1979488
16408 1979488 1873932 1900863 1867842 1999857 1578356 1965054 1874741 1777961 1910307 1778185
16398 1778185 1901621 1545610 1814976 1953593 1572400 1722248 1329243 1675217 1898408
16389 1898408 1600012 1692099 1825768 1641126 1444437 1462225 1482808 1546411 1198027 1906825
16379 1906825 1639430 1816048 1661206 1486923 1184803 1611819 1392744 1407997 1540617 1566418
16369 1566418 1340918 1436755 1377769 1632100 1429605 1298594 1529037 1627941 1639322 1500153
16359 1500153 1476671 1269844 1540926 1451067 1338175 1256977 1397413 1403161 1343390 1505287
16349 1505287 1254967 1398825 1359885 1311419 1423125 1605716 1467771 1515369 1302793 1115017
16339 1115017 1265639 1389874 1404558 1345725 698372 916869 1469197 1390856 1048264 1130948
16329 1130948 1059459 929725 992613 1141885 1095784 1427866 881338 1392902 1108852 1132442
16319 1132442 1188871 821353 1203824 1208596 1038667 1190799 1319231 950976 1345279 1161711
16309 1161711 1133853 800268 1292118 1152689 1147232 1207621 990523 945757 646226 1175890
16299 1175890 1424596 835112 1218997 1022874 1146089 985979 1100036 918102 1107893
16290 1107893 963194 1095807 825117 840077 692197 927591 885332 773340 909398 893024
16280 893024 957290 734209 1113951 905547 1011517 1162983 666826 685877 672906 959686
16270 959686 1079757 971503 1058761 896912 1004572 825663 1041284 733744 797858 914207
16260 914207 1054958 721909 737026 803393 715519 799758 690308 725617 1172812 669735
16250 669735 674498 1185310 812566 837121 617396 474896 932463 789600 920985 571650
16240 571650 812102 686224 619022 605380 825339 902986 596704 592817 926737 834935 803561
16229 803561 867184 793741 532439 843846 875323 635116 663976 537467 1040361 781226
16219 781226 518724 738418 589882 840726 450550 606667 390590 737397 732300 611529
16209 611529 537419 673737 640400 670997 612344 647925 657377 650785 470407 481572 141697
16197 627655 280503 471076 378673 682893 554038 856340 648535 315111 434294 543028
16187 543028 319133 574078 213050 270246 824924 553551 869217 536825 553489 558037
16177 558037 521764 211983 592264 259943 793394 504297 446410 626495 658431 590477
16167 590477 525109 597935 559582 482648 580197 397116 751891 410966 439024 358698 334888
16156 334888 609213 695870 120354 311223 356246 639449 614275 766751 550294 334248
16146 334248 468798 440996 385451 617746 291597 309629 457473 499889 490772 725923 320971
16134 286885 213035 345901 596844 215407 502587 434302 349008 196007 440029 255850
16124 255850 278087 792300 500389 453639 206489 384497 681510 296600 463057 356609
16114 356609 518363 583528 274838 414282 527176 185380 99246 467654 141569 459515
16104 459515 436039 245537 257719 393889 317227 120378 559348 255135 563869 216525
16093 273604 353656 335741 429690 267655 390743 333009 265398 294526 499069 528969 413221
16082 413221 93246 115882 89287 -27284 183581 168044 159939 383290 321308 -99373 31135
16070 314266 236010 520596 325189 434092 266576 53675 396944 413726 271112 508127
16060 508127 274342 166902 162025 124316 317499 327730 205973 385964 247390 197635
16050 197635 274825 321636 460607 285521 30346 147015 -81759 81098 341112 261020 266096
16039 266096 497369 337388 393505 549158 257797 274466 52900 316332 91658 489722
16029 489722 154382 275181 407308 110450 400002 143878 91008 140619 159242 202256
16019 202256 507930 179487 356607 126586 421043 161281 386393 250965 436197 171073
16008 187576 48320 57128 111981 159807 90245 226734 323120 486382 364841 374911 167866
15996 259842 562646 392814 296904 450135 276028 46181 66503 410202 422143 716992
15986 716992 1071218 672439 566905 814230 399116 282874 485886 271114 168190 206140
15976 206140 178457 640188 -215122 -26006 211880 106344 285200 -50897 455322 309170
15966 309170 15643 50857 473519 -7398 889 309878 318787 -292462 208652 374798 -41666
15954 81576 -260478 78687 145119 144291 77829 330533 -185266 128985 20367 -94199 261642
15942 157761 -104489 10810 -121804 202636 302404 361765 486350 -171116 28835 416512
15932 416512 129832 215748 295445 439578 267827 144093 -45702 146052 54828 165263
15922 165263 49237 -9164 113308 119555 389902 497416 41961 40800 97760 349164 56435
15910 -5539 -50675 9884 138181 71623 102283 60744 -63371 -218912 56233 -32898 -43645 -195849
15898 -195849 -67855 -273536 33406 180663 46163 91033 120675 -28676 67349 315665 607561
15887 607561 371495 271541 126110 150151 108166 -55832 74748 181958 317210 208502
15877 208502 -10168 338260 174151 -55997 140221 148527 90206 -112675 29475 99044 34320
15865 20646 39182 -99065 153473 137762 -134714 -73928 -87230 -56901 -163206 -229943 330728
15853 -113109 47944 345082 -11854 36168 225400 38811 286249 77985 326297 42742 97487
15842 97487 -230794 215346 370268 15300 185965 242461 323816 35734 -61393 -71592 -62844
15831 -62844 -20989 -137010 -343809 166419 169113 -1759 244930 185132 188261 30251 -77220
15819 120587 138605 116069 -100401 -117144 -183286 -118708 -169641 -351398 44610 275944 -148459
15807 224969 37748 -50896 -89493 143775 -199258 323338 -42780 15584 -59477 -11560 -117697
15796 -117697 34051 51806 -145941 226880 42231 107618 -210246 -55034 58658 -108058 -122139
15785 -122139 -202631 -161710 -12054 -164276 -129227 -52061 112285 68967 -97748 -14864 229626
15773 19248 -99363 27609 -101120 -30345 257187 -85035 -214591 358498 -44835 144802 -292213
15761 50885 -67173 169781 -68576 164881 82171 -185259 12280 -78214 416372 263192 -14691
15749 127763 79202 -25575 98916 95072 -16557 351910 -104149 116943 123054 -171031 136003
15737 180116 -28974 97066 264220 51897 -207253 -116541 331499 -80131 136766 260575
15727 260575 121914 -71627 -70149 253768 134912 25603 177722 -73277 -50065 101442 -189902
15715 183713 87556 280658 -171156 -8413 139695 -91739 170610 -37495 -153004 202006
15704 21799 319553 132597 -53479 392165 -9500 -59300 -143329 109153 47915 -100728 -64995
15693 -64995 -149694 -91744 209012 -4328 8048 16900 205982 -12132 -61857 -130812 29814 172151
15681 172151 -114614 -89952 -56225 125319 -44145 -399696 125538 -136325 -121088 42742
15670 88694 -21458 264309 -66887 -154077 -166355 -278221 -26606 -218758 70744 129167 66022
15659 66022 247342 176877 -130891 -58246 108464 54128 141275 152937 253051 125416 -46244
15647 389308 231248 -5706 27697 60767 -153326 101432 -64619 -208878 84419 -185435 95901
15635 223984 61270 -172604 208208 51167 -178049 75981 -81381 84227 72841 108693 -124888
15623 11341 79705 -68886 -44333 25076 153513 25898 -130640 -12270 79725 -89662 377786
15611 62107 -197499 1308 76133 -75435 -216080 -182409 -65636 57831 -153957 316479 106702
15599 159452 -52894 215947 28137 237876 -78047 -103075 -42130 -36745 -356809 -77321 169604
15587 118840 10614 -147799 -21921 107256 183076 -1091 127059 4452 -49859 128299 218561
15576 218561 96247 339161 276569 -83702 -134951 157160 131810 -127268 -176551 147886 146919
15565 146919 153240 -32299 284971 32775 47098 -20967 -26635 -80102 13814 -85185 349737
15553 71403 -28896 -117070 125015 259025 -23891 107879 71999 143214 -174203 -129919 126557
15541 329159 -300314 457902 264542 -116591 -38076 125274 223841 177460 -101880 -115136
15531 -115136 -3733 218891 216231 -132504 -63500 -194264 24627 -358525 334486 -79239 16299
15519 170372 165590 18822 174476 83734 -122651 -252755 -126949 -75872 344678 -104621
15508 -97421 178510 98494 103538 -23654 -62418 -152627 169931 67857 -166712 -67943 148200
15496 -223659 -176477 -141898 -32655 -38248 43370 -20722 114748 111265 44773 110233 -215427
15484 72223 -160355 116155 135185 109360 124929 -124947 156285 -88174 110385 187483 194900
15473 194900 -235900 247690 -67119 27811 287905 111183 365342 66647 -20996 87164
15462 -85653 -43400 -262342 173412 -209774 90966 -108832 251116 35672 13506 137398
15452 137398 -60944 -137210 59313 151322 196592 295711 282393 213137 136657 311002 152863
15440 93020 -39666 168575 164790 -324758 75393 183331 -121897 -23211 111546 28981 -158277
15428 -85750 203807 81384 100990 224250 242316 -263865 -115502 -214964 -2662 -296311 12395
15416 -153638 51090 -38600 161115 -15244 -182135 -189080 -258004 -192955 -342048 -128301 -62630
15404 41784 -239486 129100 8217 7124 -275227 -240233 -437256 375053 -38602 167672 -240530
15392 -345902 151817 5801 141783 -91206 18927 14718 -36884 -96067 -12240 -210439 22117
15380 10711 -54326 191690 10185 40105 -146252 49956 177458 87473 150616 51222 259376
15369 259376 336482 -62837 -10171 100106 -258144 201580 215852 57569 254174 -223367
15358 73379 5337 355165 -250450 217172 100402 71643 257086 111012 22946 32335 -16732
15346 -88628 174308 -328613 37053 309812 -134702 36594 79138 -41383 146565 53954 409376
15335 409376 -99369 90425 -168677 269747 239155 86559 13557 146636 33099 216038 452265
15324 452265 -47666 200255 146170 -82694 109820 94257 19990 294801 -27689 -131305 83056
15312 -5995 403868 70259 96658 106190 -95548 177986 -10647 -59502 -128227 60185 151512 429256
15300 429256 141331 -73366 136581 -20841 -195894 185635 -136593 -297118 171493 295570
15290 295570 512525 -180728 220646 178630 298579 -12025 -27330 -31620 37605 319149 -168297
15278 152060 -120144 33751 16448 -12808 -213280 6222 173515 -5859 30988 -78510 106842
15266 -196384 81458 293 -121587 220217 173524 -72391 219177 -122025 137544 35421 28146
15255 28146 163966 50827 -24247 102332 -90365 -194260 71257 -139299 7198 505306 443348
15244 443348 334538 10579 104525 746859 1434927 3699836 2828193 2627860 3513874 1738435
15233 674567 532924 153938 81536 169854 166396 140953 273789 4009 140572 -184181 -180001
15222 -180001 -422828 163826 -181781 413738 19383 9700 -320631 162811 -6289 56180 32698
15211 32698 31619 204903 -69389 -116539 199550 -96672 -73426 8411 184935 -354677 -115014
15199 -31929 2701 132390 -135796 -50360 302950 51452 105801 196307 -116387 31701 389875
15188 389875 -43687 192200 236464 97205 73315 180462 361123 251351 -7885 -74671 43471
15176 260642 -2630 269386 778 -90351 359608 23440 -132586 -91880 -304724 -93625 -167312
15165 -167312 273291 243448 209737 -58122 121313 123242 -62962 56329 230288 35946 -37550
15153 -360897 34520 437974 -1446 -104452 421112 164284 435340 142238 230141 168331
15143 168331 -50677 -149790 257645 71218 109050 -32538 -30847 170494 59387 277642 147336
15132 147336 179842 -192622 -249913 266286 110265 391244 129556 75628 -2622 160003
15121 215052 284394 -135100 269463 276040 259453 232250 356429 367250 164146 419516 454393
15110 454393 469811 308530 122190 198287 311144 214223 -59854 -199078 132658 245456
15100 245456 -178534 305548 127448 165631 169106 335612 -140571 141789 153470 39921
15089 -69568 17037 -70091 264945 88101 438847 -81342 -50759 128373 342394 101909 10259
15077 -12270 28697 179068 280418 -193803 112002 137452 -53729 192646 -151800 205351
15066 150694 111615 394554 126078 72919 171544 278129 289509 -64790 315620 199616
15056 199616 381885 -153918 368091 129794 177231 178258 240805 209685 87267 382884 333468
15045 333468 232153 200810 -47443 670226 181829 5531 -3945 368515 383965 116254 152542
15034 152542 258991 107442 87166 -20348 285527 95116 357795 339526 428706 27854 -31677
15022 201795 328440 -48500 236278 -60848 277162 401206 364679 330448 335735 140393 123691
15011 123691 163299 126917 203805 308675 311486 363685 26605 255691 30523 316733 60639
14999 199422 203121 137093 346106 59121 346552 -194791 185918 267667 391726 111981
14988 517614 -87020 352606 98573 172469 181336 39172 -11691 487223 236414 158118 248693
14977 248693 111733 96417 11503 294448 366517 161646 -54394 426174 267743 312868
14967 312868 598808 472104 338081 357216 769555 529628 197190 477671 314814 409045
14957 409045 462040 565985 63034 385470 101140 3039 211755 421004 591883 500461
14947 500461 426668 11691 137598 -91138 -142293 -23376 995 85362 149995 615787 397882
14936 397882 291804 292925 436141 211611 326201 405378 498842 301928 428363 293050
14926 293050 306916 380993 438662 751335 481290 527983 695054 582452 500670 275650
14916 275650 531833 702758 530695 293101 409482 96338 250359 353661 369354 500475
14906 500475 587675 254018 313073 316591 98047 319667 419606 100371 352802 285628 624983
14895 624983 371827 559353 289179 468055 302769 466794 191384 452290 388404 563427
14885 563427 279071 186807 409769 632043 244750 463309 617073 279339 90392 70689
14875 70689 173228 458228 146456 428242 403822 399428 78629 205057 374799 384068 185496
14863 624942 481169 519106 164902 436719 198647 153586 97468 247151 561983 367571
14853 367571 257497 95130 740435 481087 782817 473879 242231 703550 623773 328162
14843 328162 643171 573028 358921 714892 436452 719958 301824 431955 -31532 547515
14832 253438 578263 497803 155431 190959 434214 393646 322875 544862 550003 396815 322970
14821 322970 420810 402955 73362 349164 319672 661346 761678 130561 406069 76735
14810 395934 383439 536722 702516 689118 371677 711980 406751 295590 615794 442152
14800 442152 305609 528063 377211 528052 814546 563245 382285 607086 759559 741069
14790 741069 549115 533704 666005 560803 364172 506235 376791 575397 449643 249410
14780 249410 500118 617206 566114 405907 52138 476696 717352 480512 637863 653703
14770 653703 402537 568925 526679 273422 558955 362744 643266 371498 601605 657005
14760 657005 871583 705915 274354 715939 485111 778111 434422 988982 160852 672063
14750 672063 588525 764803 898475 485935 546931 619849 902950 383816 363086 576559
14740 576559 541020 381854 128259 645722 791921 590211 690292 519739 716922 721434
14730 721434 694641 679955 534257 644436 751439 978439 985741 1072541 868181 804010 943415
14719 943415 682782 818599 631411 641819 613038 818072 475232 795303 461207 554612
14709 554612 649986 641345 686092 815400 710029 666263 757712 879303 816911 593180 425592
14698 425592 1001476 803718 717255 592837 832215 1074867 895301 960787 686083 869736
14688 869736 849038 1128616 673621 1149067 957817 1357709 1125601 699271 1079680 892601
14678 892601 1040452 677206 614400 592346 840462 629409 908372 845187 937689 1035582
14668 1035582 766658 859327 980240 811511 981530 649063 827981 920322 1236528 789306
14658 789306 604495 834278 802069 683514 1086336 905453 993027 820453 858054 760198
14648 760198 788531 1138035 777924 1018671 1241467 926272 1043431 1246367 938455 931125
14638 931125 1346101 873249 866654 790922 847369 931765 883656 1003065 1144179 922364 1131019
14627 1131019 1009734 1086407 1618357 1367803 1167924 1105754 1101260 1285143 981189 1008970
14617 1008970 1066561 1386249 1041580 1142679 1234074 903869 1058483 1323772 1068595 1589009
14607 1589009 1327546 1334877 1079792 1352262 1283011 1249760 1369805 1393848 1031216 1414796
14597 1414796 1326795 1304166 1227711 1385625 1387415 1188212 1299197 1082912 1660531 1653832 1214120
14586 1214120 1851066 1795115 1507596 1648158 1221062 1190607 1726257 1489979 1695971 1679221
14576 1679221 1659401 1732647 2128611 1723360 1785528 1988028 2037991 1917086 1534905 1702034
14566 1702034 1417488 1926822 2077010 1827803 1930826 2044913 1878357 2106377 2269018
14557 2269018 2288570 2252573 2889488 2577459 2922548 3349208 3909465 4729244 6176483 9433216
14547 9433216 16669262 34512877 38161756 15828810 7956658 4890020 3147342 2615765
14539 2615765 2380972 2193995 2517792 2635096 3677132 6322826 8148652 3563866 2347297
14530 2347297 2346295 2166334 1616546 1874220 2122543 2065561 1953906 1925376 1608451 1966967
14520 1966967 1617842 1999796 2042682 2233381 1841091 2079674 2192996 2188268 2211701 2366017
14510 2366017 2235973 2150011 2035368 2093667 2326396 2501894 2246776 2751822 2538623 2741840
14500 2741840 2841446 2588585 2594645 2808697 2543368 2671226 2607915 2901243 2654068 2555748
14490 2555748 2791162 2853236 3036936 2936015 2901064 2981517 2809790 3096354 3000866 2934142
14480 2934142 3134212 3090187 2736042 2923157 2964080 2982562 2984415 3423335 3147666 3255216
14470 3255216 3474269 3309705 3286321 3541129 3277257 3678491 3563097 3378877 3923285 3793949
14460 3793949 3862113 3777075 3821466 4068761 4124097 3785334 4116374 4115067 4500934 4264838
14450 4264838 4422269 4780533 4418975 4442048 4506729 4645872 4642445 4745357 4680854 4653628
14440 4653628 4669799 5336044 5022975 4801237 5062480 4991788 5476974 5106446 5453448 5278940
14430 5278940 5654326 5673534 5592288 5499993 5504758 5824472 6239911 6114075 6307709 6599210
14420 6599210 6396030 6341945 6189936 6326893 6582072 7080550 7062690 6923882 7020345 6866175
14410 6866175 7026546 7179673 7565926 7651273 7880479 8138078 7689172 7781224 8402119 8252161
14400 8252161 8323118 8545437 8804219 9031363 8685090 9025790 9003489 9412146 9406611 9738616
14390 9738616 10439257 10042620 10031702 10570074 10500223 10669987 10929019 11063887 11561690 11716709
14380 11716709 11640368 11768866 12142909 12625792 12845913 13051644 13405540 13617644 13882150
14371 13882150 14103336 14320993 14587401 14575186 15147131 15510736 15838853 16305037 16275008 17041409
14361 17041409 17392428 17252823 18193398 18236705 18672790 19360548 19780183 20354524 20708926
14352 20708926 21287394 21795793 22548818 22664070 23380087 23862614 24559144 24804337 25668005
14343 25668005 26384512 27233029 27566427 28822435 29212813 30296531 31076874 32381081 33211528
14334 33211528 33621566 35237520 36066936 37115546 38206954 39508552 40978593 42047399
14326 42047399 43640521 44716455 46264469 47860522 49537752 51288860 53228118 55534510
14318 55534510 57058655 59586578 61804703 64172881 66729925 69234589 72092519 75230320
14310 75230320 78341591 81775953 85001589 89282843 92954584 97555937 101836937 106690893
14302 106690893 111912513 117472304 123158793 129527075 136273182 143121984 150531906 158938793
14294 158938793 167332901 176821432 186326422 196670392 207547735 219360774 231512515
14287 231512515 244443546 257711162 271621317 286366911 301774952 317520465 333497416
14280 333497416 349949339 365968378 381923353 397331638 411849412 424922960 436507413
14273 436507413 445160701 448425517 450298628 452085890 450646989 446941880 440065193 431372328
14265 431372328 423205106 412304879 399128211 384423116 370743478 354377845 337944965
14258 337944965 321650983 305281806 289470656 273883216 259451183 245242721 232084978
14251 232084978 219531368 207320815 196002628 185480409 175136349 165806949 156933495
14244 156933495 151844714 145779630 137700677 130288314 123588978 117591351 112360091 107184607
14236 107184607 102277509 97205745 92914915 88969402 85229777 82147120 78524907 75426822
14228 75426822 72263657 69301865 66631287 64007111 61583524 59277548 57207939 55422622
14220 55422622 53335812 51525448 49801708 47866538 46556160 44808408 43675091 42613221
14212 42613221 41055347 39605505 38318364 36950860 36362158 35487689 34383048 33639144
14204 33639144 32445095 31419770 30480539 29793247 29111033 28276028 27579951 26649005 26086264
14195 26086264 25563804 24834622 24389552 23801982 22954624 22405824 21811039 21423860 20826598
14186 20826598 20424371 19908042 19408431 18936656 18483734 18294704 17834999 17457208 17150165
14177 17150165 17013176 16605370 15790383 15644327 15156503 15158259 14838426 14612925 14388112 14069023
14167 14069023 13922163 13494845 13172872 13150190 12494355 12359606 12344194 12200808 11951192 11906657
14157 11906657 11644702 11116085 11161458 11000687 10834455 10744580 10399071 10258454 10050945 10224211
14147 10224211 9614889 9543761 9733445 9602912 9098535 8908108 9206489 8718864 8703414 8329634
14137 8329634 8401840 8336052 7967951 8258471 7896916 7915837 7808284 7518529 7501764 7257778
14127 7257778 7045850 6852795 7104170 6783196 6728951 6732927 6485477 6545350 6084526 6243635
14117 6243635 6328385 6308604 5893469 5922419 6220711 6320424 6078252 5889970 5580907 5386268
14107 5386268 5529796 5641413 5369381 5453480 5465659 5126894 5370631 5185917 4834253 4868638
14097 4868638 4894570 4757144 4981212 4618559 4849780 4805604 4705320 4586953 4351343 4288630
14087 4288630 4376136 3945173 4515269 4576712 4448902 4225900 4039339 4025295 3583417 3901689
14077 3901689 3717701 3883567 3646575 3982102 3792285 3601831 4046791 3437411 3760321
14068 3760321 3432540 3461957 3775259 3592809 3439087 3226138 3368071 3382527 3364267 3567684
14058 3567684 3515501 3548157 3344909 3074312 2979479 3046522 3261459 3070437 2968362 3286363
14048 3286363 3013910 3076876 2478061 2849733 2843727 2724237 2610208 2698492 2693041 2588996
14038 2588996 2676802 2933875 2687756 2480053 2534392 2509617 2887036 2744775 2866004 2758196
14028 2758196 2733227 2504670 2268208 2597776 2538628 2407922 2421953 2262246 2203061 2334508
14018 2334508 2258124 1993719 2042616 2150615 2045601 1987615 2079284 2018321 2246059 2465083
14008 2465083 1958092 2156059 1895431 1919815 2146115 1885519 1790000 1727061 1596609 1480329
13998 1480329 1789317 1888322 1773454 1679054 2171512 1821573 1892960 1858074 2281686 2852079
13988 2852079 4550019 9184581 21748125 43411508 25536761 13601810 8503468 5478534
13980 5478534 4486136 3791241 3394974 3037083 2650899 2489014 2469708 2378816 2162570 1994495
13970 1994495 1804576 2095763 2109259 2144273 1957138 2172468 2290734 1931734 2041795 1814055
13960 1814055 1754570 1731564 1664378 1810813 1815371 1715734 1352634 1574352 1483332 1560885 1622249
13949 1622249 1917410 1513427 1763724 1734542 1735671 1514235 1407027 1628026 1449733 1428266
13939 1428266 1398255 1503769 1486903 1512753 1365072 1322464 1583072 1404024 1411918 1222867
13929 1222867 1206888 1448374 1463619 1545482 1357846 1338408 1131241 1066117 1624834 1060806
13919 1060806 1419943 1246630 1250983 1537036 1157619 1304246 1370645 1084588 1147040 1205725
13909 1205725 1134120 1247997 916107 1155610 1428856 1128031 1163907 1370357 1140464 1019154
13899 1019154 1207150 1027494 1141780 1187199 1358308 1100929 1089865 1040230 1055024 1001125
13889 1001125 851505 1280729 1063896 910569 774587 1038203 1177594 1344104 912177
13880 912177 1066646 831703 1187178 931021 1051130 1069058 1231438 995855 975367 1130418
13870 1130418 950743 1207131 585362 622968 980436 1141185 966342 809741 1087767 996958
13860 996958 766076 910587 921540 871583 878128 1054550 556921 723408 736209 957309
13850 957309 409094 1034701 798580 1011125 453606 1058839 899271 826884 1168397 943030
13840 943030 794322 695880 989631 1252798 634864 958483 557964 602044 1008916 969302
13830 969302 724872 778292 777103 591508 359194 564546 636406 625231 1053313 827924
13820 827924 490526 1242433 706982 654773 660692 644273 876819 358817 668705 556966
13810 556966 507303 648772 825804 418364 742824 486282 697508 663483 682315 518294
13800 518294 558132 638375 493484 727373 605725 425989 669457 506796 604029 623252
13790 623252 686273 552305 825139 733783 550640 537909 737362 528301 554366 822492
13780 822492 475943 801293 542242 724023 694251 432677 533280 548540 416831 746126
13770 746126 663428 418127 543415 532472 624777 418183 419483 747813 248527 670500
13760 670500 442875 561555 607882 594129 336476 136884 527444 769644 518240 508300
13750 508300 293024 140412 852932 317109 631038 526787 400325 499951 594451 276850
13739 216026 647491 540323 353053 344452 646598 613585 596227 432833 433375 656546 430558
13728 430558 392264 360995 447136 383731 519962 -9480 528419 689756 133358 541543 251796
13716 500638 594160 321571 912609 334649 256717 604877 676830 502322 646763 301498
13705 320023 621533 341802 250184 522354 442159 538811 281973 393146 504985 283303
13695 283303 598964 182678 462118 569546 200836 705616 415187 345667 617644 268848
13684 355057 116322 255349 568109 323721 262109 504663 296026 635309 275241 764154
13674 764154 650965 272916 158684 486605 96236 418797 609256 289266 142271 277619
13664 277619 392703 399584 424288 433612 355831 383086 259908 102784 214332 660746 221925
13652 421046 293175 521804 305676 524498 3027 437224 579320 234052 404270 687945
13642 687945 782753 291126 170585 171018 155042 276133 298349 197618 204230 291701 186923
13631 186923 433922 264221 297867 278790 561333 144954 578999 280226 206753 72364
13620 9332 378588 193769 637467 417346 120818 429862 339938 200131 70920 107356
13610 107356 749011 134281 405902 274376 163224 -27346 414992 276946 321003 266661
13600 266661 240560 243618 380405 522085 430888 107735 243139 190199 510711 -67718 271466
13588 577007 607469 246698 218424 54400 225395 267252 224113 261444 -33753 114329 264589
13577 264589 -45910 94489 383183 299227 173242 586168 393813 -60399 452757 587765
13567 587765 167871 402078 -77390 409857 262312 292027 44060 -66994 299054 386265
13557 386265 300965 204421 398119 -76346 138801 433144 429284 294002 101688 391610
13547 391610 363000 148434 446945 239589 787811 237637 131387 400890 -41594 330523
13536 41568 175037 346886 352917 58014 161247 565256 66429 356077 584282 73757 19447
13524 362081 398753 240914 212816 108428 232855 86721 463052 410263 209265 288407
13514 288407 -111704 110959 650547 360002 227578 430245 512807 23133 76894 233988
13504 233988 220230 106443 -56043 -46113 -58646 -84378 167021 254505 -209711 284245 -58373
13492 157674 220053 588070 136453 150139 421155 1314 24930 242270 288468 181895 186864
13481 186864 319890 161929 199869 147325 527697 -53222 338769 155912 493103 -39562
13470 505009 119192 -90956 115582 341343 221642 326177 244271 163744 -148801 193783
13459 303954 295970 -279774 271992 -138315 408405 202315 265394 242480 213176 126767 -28054
13447 99278 87204 17993 106506 430098 320747 19716 -24947 -48164 235110 70329 -88026
13435 7952 350167 185917 123060 360259 -82353 354415 -132082 104673 199132 -77259 125147
13423 1935 46213 104594 284622 305309 165418 149872 349178 -113935 320933 158384 83051
13412 83051 213769 303563 -6728 -86387 123544 138876 319997 16169 85402 326546 95892
13400 47728 300388 144426 159376 45149 93993 -353322 199190 153531 146879 -222534 144800
13388 337260 169506 239682 -136187 216830 305829 84253 197820 318598 357445 62320
13377 82499 -5296 239507 286858 -273077 244589 1076 -44122 42221 94755 153883 527904
13366 527904 -120925 275134 177219 12616 94525 308868 18904 158965 79458 259907
13356 259907 148442 214396 -141199 396435 394847 385446 267979 295785 285575 57625 -4403
13344 171030 255228 111863 -14297 -60173 497457 45495 -138047 111872 164620 302120
13334 302120 204754 314030 279432 20367 -16859 210437 140574 260253 443107 58562 213184
13323 213184 111733 113156 52307 333436 118600 -31495 -45693 250120 156777 372442 355302
13312 355302 -28942 181421 123695 398478 292521 175512 -36271 223987 209510 -90852
13301 165458 198734 116582 175253 56691 263654 -83124 90817 -82865 269592 117271 103394
13290 103394 -39397 129828 55116 55385 92090 170931 113014 73214 393120 412978 -349958
13278 -28390 92403 113091 196312 -54365 458592 -147313 59567 164907 349259 191241 -37041
13266 55410 -67730 -45370 69863 405820 25203 94429 -112028 -11842 39480 -29257 -311053
13255 -311053 -184086 148253 -174332 125438 206526 156136 423455 -271845 52031 217882
13245 217882 405417 919 -93638 -18799 50435 176067 371478 51031 4488 -42454 47748
13233 105156 294034 54669 195664 164287 109170 -15380 306210 241211 486079 -135743
13222 255438 37784 -132180 64506 84400 165155 -234794 -48540 243508 180661 -132055 65724
13210 -88346 298597 105940 318427 -82655 20755 -9355 -82819 -54135 96125 45502 288278
13199 288278 179228 -34767 307685 -48177 220356 192494 -11760 160890 -155743 67504
13188 -150551 -171812 -304702 -53989 -88006 37200 -36019 294788 -15659 144949 -47246 -120304
13177 -120304 350624 164821 2010 55407 172467 -243388 -17610 7145 39215 109478 -191238
13165 -35960 351596 152485 -87197 56271 -59344 -19448 11898 -63887 -113433 -38406 166942
13153 -217602 219154 -151864 70716 138820 114780 114482 138209 163377 120802 143819 190719
13142 190719 102568 -231527 203734 -59369 366138 362065 -135734 -1748 -83757 -4512 117518
13130 -160398 -100303 -21539 237991 148235 -12737 -81035 126360 -138595 -38791 -46800 -112545
13119 -112545 -47913 100146 109934 548096 -7246 186163 86017 -20927 78719 -26122 31999
13107 49226 401392 -116528 34309 433518 29706 218444 118773 17110 204577 -102771
13096 187748 45481 -155777 82969 26471 -4593 -135306 107571 -324149 252074 -147760
13085 28136 -327921 -2293 -166023 18016 -51247 -153167 -47128 235202 133314 3993 52517
13074 52517 148733 -167503 207993 47419 136468 -123903 21530 -105884 -131480 172689 -396230
13062 238244 217288 44916 297927 -241444 -36034 -4583 31290 44632 19716 -11884 -162651
13051 -162651 -33153 12382 259280 211751 181734 111716 150649 -352360 -114724 22782 -403999
13039 44818 -178188 200272 22548 172097 1283 426196 28185 59624 58836 285833 203710
13028 203710 53323 -9895 -213337 -107822 235874 -20191 90402 73093 220747 153195 -242604
13016 2746 -20460 -48734 253827 270602 -135945 125178 116670 -263027 113468 343754 -146120
13004 369268 -105167 -14920 301022 68904 72919 -91534 209930 -137877 -223853 183617 -56574
12992 244424 125942 210768 104500 -21912 -110760 -241109 -163802 27353 -32560 -163772 61573
12980 -219890 -243580 118142 91757 72906 3591 21024 294796 -87545 29026 -183902 56296
12968 101565 -208640 -18750 -29856 242899 25331 -5859 70177 -137121 -120939 -58402 -33004
12957 -33004 -16736 -12225 -36981 -22613 -205558 -345936 -207628 358331 -85694 314260 76036
12945 -195448 273166 -196867 75818 -77580 113152 276918 89062 77536 -985 -68617 67254
12933 2916 -60466 111868 382984 87205 161527 -16103 19161 43864 -60299 66507 217050
12922 217050 32032 32243 -61944 -267990 77087 -96795 149556 -268887 122436 185920 159274
12911 159274 -466219 -83113 -24020 -218754 54254 -65685 398494 -37193 295453 -244116
12900 191883 173070 57132 -273569 135324 -208054 -274839 -171206 -69866 -178584 -223065
12890 -223065 178558 38316 -95986 -257185 45623 -110075 -24587 277901 36829 24376 54860
12879 54860 -156827 327441 -33200 124029 61397 -20297 -382115 182049 211345 29923 108965
12868 108965 -222283 -51517 -191231 27301 -238338 -65456 65414 106283 -1697 -44922 5653
12856 -82150 -162782 114998 3133 -393825 261402 352348 298971 170721 217291 32367 -255591
12844 110791 -211568 228020 54716 -131000 248698 117489 -39096 284039 286275 -92760
12833 284901 249596 120071 -123121 127609 51138 -80352 -199800 -165177 138627 336549
12823 336549 51670 301205 24949 -203939 101505 38413 -214508 57668 -161758 -257954
12813 -257954 -121151 69776 -20755 -44541 -121059 102537 -50757 -290092 106840 -50291 41782
12801 -23652 102348 -193825 3698 100425 -78406 -22446 -178416 106977 -216390 -474 51368
12789 -24894 -156626 125307 113586 -89168 -37647 -187157 53442 -92400 34141 28442 -125209
12777 -49796 20620 -30651 -218356 85195 -17928 -13311 20811 -49121 -13112 -17513 -175153 165246
12764 -447602 32841 95652 183101 -149157 -88486 54050 -107596 34224 -41957 -83836 -186178
12753 -186178 564939 76735 -66492 76103 -115426 -163793 -85546 -77497 -81786 -199511 -8237
12741 -8411 -4060 350123 -19690 111713 88546 -25947 -137738 201109 59818 -64293 117421
12729 -80971 -157864 -145808 227745 168676 -33501 19331 -193185 -108937 -14691 7200 103554
12718 103554 -175534 -342945 215298 102430 126095 -179678 -71035 26906 126240 -66133
12707 -200017 38602 171493 55171 -403048 130978 143041 186886 -140185 -75076 130676
12696 -150852 -40745 142939 -168650 68593 -295846 55570 -132130 -276821 -351497 -330817
12686 -330817 -195022 225963 77359 17531 -248828 89968 -193350 62551 162856 -5960 169367
12674 3487 -117748 -233387 150856 66663 -7267 12505 80531 -71612 -86620 -215205 142201
12662 275107 -155586 -66059 -24078 -66625 -365567 -175513 -213201 385237 89839 244641
12652 244641 19621 44384 56871 320206 42998 157448 -31029 -53625 -59943 68871 136163
12641 136163 58896 -19158 -74021 -332305 78386 -278057 59440 -144000 43175 259471 470728
12630 470728 32234 291207 128322 80712 -158776 32914 37656 46726 -136554 389099 246591
12619 246591 137543 -174458 -102676 -135859 -123984 17275 84294 16791 -246608 -23978 -291250
12608 -291250 -340516 -81714 -30598 -48201 143592 -219303 -128188 -199884 87364 -201618 30393
12596 26711 86308 303187 -296702 273753 156116 -46191 -386704 164260 -34368 -310846
12586 -310846 59753 -9567 -119581 -4981 276366 227839 -146110 161594 50800 -169252 24669
12574 147802 -69084 149139 218940 55945 -309838 47367 -345021 -93649 -302391 367522
12563 57750 -71356 1122 -46604 129185 -403206 -111635 21630 200985 -204857 26844 122014
12552 122014 -231815 42354 -263926 -155707 -524645 -160733 -61265 -6528 270083 84382
12541 102235 117829 416287 393962 50169 -47769 -55667 -94122 -102143 114887 82707 -204839
12529 -42984 -142279 47734 -44859 -171536 -107367 24169 5949 45451 14799 -172271 -221848
12518 -221848 106223 -69955 261180 350848 -91660 204510 85774 416152 263291 429639
12508 429639 48381 126639 74823 -224993 164272 66256 66271 -76685 -168493 -169210 -228715 324
12495 -21117 220152 -31373 -161899 73070 83569 198792 214322 -100697 -191579 179000 93721
12484 93721 235353 152985 166009 339147 39552 -83409 -48600 147807 -183539 110150 119244
12473 119244 45813 54856 -234484 98778 55549 438732 -110035 -63048 -160954 -264686 175759
12461 120637 -44825 284495 -159783 -13480 242891 -183772 313212 -88870 -320929 12412
12450 -118542 -94969 -182387 -335997 81372 121800 52520 -27193 -38600 -355405 237180 253363
12439 253363 -186017 -11781 220853 185859 -149326 -142712 332610 43617 -572800 98358 -405749
12427 -179824 140816 -399062 -124660 -100570 67720 -29934 -86218 -81155 34518 -36972 263354
12415 -156243 -80128 -132615 299764 -48796 -55521 -246479 -120856 -120716 232162 335264 -236074
12403 -170317 177649 -76844 -28473 -10678 -194520 -201841 60258 392987 -125845 55687 -219195
12391 291272 362945 269126 -37491 -166664 229539 -224858 225479 -25575 111170 21368
12380 -90474 47948 88576 154988 250368 218317 -120583 7293 90645 -19153 151779 364584
12369 364584 47798 13327 88320 -52257 -168710 -20277 298774 30020 100784 234685 -218284
12357 103974 2238 -9715 -185895 294196 -117938 133903 92367 76895 48049 250113 -85489
12345 -17177 -249371 278992 -101772 -152907 -110930 87556 -63730 413651 121369 164341 21334
12333 -69157 -237048 62924 -150214 143624 53879 201993 136002 -54713 121938 314668
12323 314668 28697 215196 337474 331749 -93548 267010 16584 202452 50728 -61594 91548
12311 197539 -5138 -156957 77006 -91346 -40540 -51319 -224128 38765 -207922 -100860 8620
12299 -18537 216950 278495 -128085 59424 -182128 -191780 -160536 15813 -68923 -153677 -32673
12287 -127035 38592 27605 -20331 34556 332595 65665 96568 581724 -191201 252903 -459644
12275 -114955 97262 155260 -69262 99066 -197106 218697 -3074 -12415 -90052 -242933 -72706
12263 109929 -166731 -51656 195480 32544 64814 230923 74515 182776 20834 -94489 -83663
12252 -83663 118513 25790 81752 -83538 296494 15351 136022 -43726 -305824 -28017 6731
12240 105844 -19875 105140 110025 57528 36710 -111255 189187 3290 385584 -41091 77129
12228 58326 439052 23078 190663 -52569 333158 158948 66294 495665 192415 -73622
12217 79903 97984 -193967 266079 69620 -42584 351114 367930 314271 339590 254123 122079
12205 66330 -86919 -122737 316775 93918 -30140 -3037 76025 122525 418901 -92618 185419
12193 426461 83713 -125281 197744 16758 -781 48396 199079 463817 575862 206748 216468
12182 216468 613103 154361 166917 17393 178003 210041 126529 109627 380255 -51264 -83692
12171 -83692 268252 154057 325529 248351 -83991 -120047 355029 297659 -84169 -191182 261966
12159 149836 206583 111730 249052 168359 106151 159612 238270 100954 231561 93938 273200
12148 273200 79705 54395 161599 254274 79032 -38260 116974 272561 -16647 -155819 -40170
12136 252105 50186 175614 298782 234218 158562 140156 287925 -122764 36062 222553
12126 222553 293300 222576 74483 49822 -174357 191503 129356 74884 83613 441997 54529
12114 47910 187997 -223327 59451 -12436 -141136 -151395 47522 112734 77968 263830 -81723
12102 60977 -162117 -115867 -62157 221128 70751 -84234 -12148 -232 286908 101191 -66480
12090 142979 94423 147182 -80160 241693 24508 199664 -86594 119955 311 126247 -112313
12078 285792 -40217 -225371 136874 -19949 -217566 -152647 -63034 166581 -147750 -126578
12068 -126578 -23643 56474 -312605 -142856 -49764 -305465 -97223 260672 238607 -27445 -88531
12057 -88531 44613 -139955 -138849 -135586 29004 -136709 61610 41192 -48981 -58681 81515 218117
12045 218117 154535 -349470 -49369 72032 251825 -297659 34018 -279149 115769 -123140
12034 -23839 -128515 129261 -393569 291962 -6686 141516 -59000 66829 249208 58771 -153253
12022 -283543 -39236 49135 122625 208668 93890 75982 129570 -220979 -200329 -31742 -178852
12011 -178852 44622 -91470 -51462 -141491 -160586 -607772 -215279 50781 -88822 -192540 -108035
12000 -108035 74057 -160483 171406 124313 -80467 -176547 -348340 29272 -45560 -273770 -40792
11988 81526 -301256 42627 -54218 -410817 -132932 356262 -77294 -230702 95800 133943 -25341
11976 -76674 103224 -248623 -105515 -45357 118674 -115821 -484757 -82612 60317 -130417
11965 -41109 -133039 92087 -194506 -3066 -326916 -49453 -23603 -9367 -223722 -301273 169580
11953 -120241 -191759 -8042 -369254 -265799 226074 -56217 45428 34641 264038 -111796 -247930
11942 -247930 46732 -35312 -81223 36079 70904 -65304 347219 -219817 -33191 -99329 51901
11930 -31706 341809 -61933 -217406 -230920 45871 -55257 -52401 232354 231411 -44608 -118198 -238058
11918 -238058 -60416 -17025 216671 -115684 -86192 143349 -55862 82981 -338212 186419
11907 32279 -215863 32494 254891 23307 116538 18319 144768 -54631 -66240 -109750 -97609
11896 -97609 -62271 103172 131599 96336 -92099 -366821 -190297 214313 -18296 128404 -32789
11884 97921 -134369 -378826 -12935 -26385 30051 -329799 45337 -14928 -204309 159384 -122273
11872 -8739 -120107 -19341 8967 -5430 32297 139929 -148069 -112263 -160677 -92423 -36835 -21059
11860 -21059 -332781 -10190 -238077 224394 -83136 111811 4979 182194 -96998 17608 122660
11849 122660 -36585 90242 53919 -223993 34558 -441632 -223578 3509 -310667 -44052 39472
11837 156060 -6569 -168101 -334294 10274 57240 142958 -97963 22096 105087 -23961 -53063
11826 -53063 57968 -287635 195967 271898 107712 -22330 113562 47406 -255343 210728
11815 58585 -209356 -292657 -72021 -258385 -94114 -621 -45745 -9431 18105 -285180 -37188 198691
11802 -9727 -127678 -84673 -172012 43327 -105488 253959 117097 133620 -308810 -443681 -84424
11790 -9976 -131223 -222592 -11316 -7619 42652 186427 -41596 34420 -271272 106549 -198168
11778 -312700 21116 -11270 130920 144306 -198342 -171775 -299285 -91443 85166 95135 -144467
11766 -17965 91348 163714 -23826 184456 -125088 -18646 -85018 -151723 -199080 118561 -294201
11754 -225050 -305762 -144152 94757 231247 97022 70841 97789 -450092 -105235 -416939
11744 -416939 -13504 350790 198308 105321 -113507 -174047 -155153 -48508 -161887 -41188 170371
11732 -137896 101756 130992 101872 -20000 20392 48943 -134582 74405 -80187 205946 77574
11720 -71077 -179786 -27319 169131 -393369 169813 27153 -12270 -148505 -113134 -117135 -171489
11709 -171489 -278892 -267889 -236971 -180843 191370 192735 -201150 -321126 -236420 -275649 209713
11697 -47175 56251 100888 197969 -245668 -356063 69482 233859 -4079 -280856 -196726 234525
11685 11411 -152918 -43490 -11882 129382 -195739 105719 -173678 -77258 -81797 71405 -116841
11673 -17624 -207177 -279682 109081 168141 -176227 -440675 166157 -139762 -370392 16154
11662 -3306 -181356 53844 -113416 -107670 91009 62069 -44668 -32716 214909 164202 -271849
11650 164369 -277981 8680 -157715 -234390 -211689 130546 -19021 -66215 -104402 -165558 220424
11638 235817 110448 11305 -41053 145736 6667 156487 98990 -122100 159270 97443 -56789
11626 -37723 -185009 -77202 -220714 -104815 -57340 148909 -183254 -140 9076 91341 279153
11615 279153 95535 -13329 -42529 71915 -234911 -84122 257620 -115434 -201462 46771 -39529
11603 -37714 255199 -123730 -497792 -185939 -164847 -245399 134879 -28137 155138 109029
11593 109029 -384948 -234722 179587 1774 -87084 163234 80129 -381727 78850 304665
11583 304665 73984 16955 4174 136272 38350 -3039 167012 -65780 282467 110619 -13929
11571 108057 -124691 -208712 -187469 -92066 -76596 -185505 36505 -188286 -25833 -81017 77127
11559 -366074 124971 -24865 191787 -431816 -170282 -25225 -198934 -307458 -172071 -160494
11549 -160494 -217258 -32740 -219719 34021 -139441 -23456 -180814 286670 -142482 -285187
11539 -285187 -85781 223797 221795 131556 -181808 -79476 283381 -372895 75658 -226809 -343333
11528 -343333 -94780 -106789 -94167 296981 -240698 -48082 18729 85027 -34886 -243007 147293
11516 33658 105399 152933 -10079 119184 -12164 -79705 -147150 -107346 -137089 334684 51396
11504 -97020 202070 303857 168225 23031 19844 -129024 168668 208209 -298530 12583 86486
11493 86486 37842 144889 -194103 -117187 -198641 19661 -100151 -211698 210507 51987 89542
11482 89542 167372 283455 -19617 170587 122725 149414 -199623 125465 167692 161112 41397
11470 229487 476590 331578 67882 248223 -17153 -31796 97694 -194438 22057 130001
11460 130001 110826 19304 345666 234258 83427 292977 -22625 40783 19893 78653 -35982
11448 -185673 223327 81331 -71532 -30668 398860 128732 -43626 -98631 15914 66593 579821
11437 579821 -103241 25049 15745 51780 165790 -294917 -152372 56 -179410 371969 -99016
11425 109536 -286144 -217379 682 269531 173872 7946 141410 -181902 -143665 -274750 -12520
11413 230051 -29759 -152154 -314586 -46734 39330 -66483 67223 -178238 -139569 -57180 4336
11401 115354 -129211 115908 166118 -120085 -57357 56555 145972 172017 -258120 -45981 -67988
11390 -67988 -344455 -103223 25491 51726 -87159 -188558 -7166 55566 51957 -207107 -54285
11378 -40485 -102116 66343 -152346 -184140 164320 -2047 77965 110157 -6463 310624 -93381
11366 242226 -56786 -101119 -94411 424883 183743 -102541 -17471 -361690 198472 -196100
11355 -227165 -165546 -119306 20331 -182939 -127741 78180 -177084 -154836 -91698 130620 -179885
11343 -6855 231837 -32488 -60857 -241840 -108278 -411112 46901 -8499 202456 -269327 -291077
11332 -291077 -50166 -114724 31355 325961 130997 -184756 266767 111330 114918 -282999
11321 -34187 10706 149371 -118994 -163430 123741 92279 -201407 63963 -80885 577879 -239779
11309 -55990 3916 -107183 128634 -144688 -67089 -93688 -90463 106714 154594 55954 -225594
11297 -150942 18160 -257357 -221047 -198150 -30749 365086 103591 37434 30088 90307 161631
11286 161631 97927 -459212 11486 -150080 265315 147385 -353982 204939 103816 -154177
11275 -306779 -36510 83540 -526959 -126349 96919 82110 218700 34409 102385 -154659 -100488
11264 -100488 -484688 -299272 -206260 81600 -283662 -9186 -133972 212162 -66605 -59804 193880
11252 -484384 8265 -19205 46482 -116315 -137591 294743 86804 324006 -297701 147134 -141336
11240 -93115 -71539 -345030 -274132 -37414 -17768 -235285 -162236 6511 -303647 -75507 -10869
11228 -52278 -21046 -116768 77047 -334768 -108701 25318 -171617 43940 77954 -159456 -280540
11217 -280540 -112526 102867 119567 -174427 -19861 146080 -200084 -77288 -139044 -11159
11206 -31947 -172674 -226125 -27540 48463 -9238 127321 -131523 -168374 93180 -130369 -172215
11195 -172215 138031 170062 -96466 34333 34986 60037 -432381 140983 -187063 -81340 -90617
11184 -90617 -138213 10947 -334640 -19917 -258726 207546 -257785 -228815 -90166 -318211 -48083
11172 -96066 -138557 15461 63213 -297091 23482 -439864 146446 71733 182276 -122606 60666
11160 -496095 133443 -518870 12483 155425 -71047 -97005 168406 266562 158181 112784
11150 112784 -21102 -195427 258807 -10412 -58140 213824 -146240 1194 180101 -217740
11139 -41934 27251 -127146 10988 10262 -357978 78009 -55401 -449167 52647 165247 -6916
11127 26256 61737 -238637 81941 88071 189989 172564 -123949 -240748 -258830 208700 -85554
11115 -175401 111679 140275 66169 87375 95334 -124282 63562 225790 55417 71950 95412
11104 95412 -30382 -27373 -47132 116408 -120080 130361 163860 -144782 19924 -140892 196273
11092 170166 -104290 165709 224869 224176 112745 169780 -153142 14006 -156940 115562 29493
11080 -43081 89074 -87327 -104691 85216 159422 253652 136232 205407 216633 256143 180941
11069 180941 170364 137663 246121 419762 134923 281243 515711 127513 515222 160916
11058 330495 -9430 117823 288327 384356 124625 246840 172295 419047 163527 175900
11048 175900 332929 437021 305015 317375 543044 270416 762966 530899 435362 692739
11038 692739 573122 885572 492150 609929 341192 593634 181440 199194 671749 556516
11028 556516 296295 431098 400341 766190 371783 298719 859775 206278 259438 524233
11018 524233 356350 566198 523643 393907 318426 537507 743225 499121 189097 12131
11007 222824 141711 257898 225199 525501 41150 -36954 239633 365531 611849 414476
10997 414476 211132 234653 393181 401213 376708 191710 344111 532910 612841 517720 237071
10985 306251 507134 323497 294163 485697 383182 217321 413280 281747 480724 501745
10975 501745 320226 569012 604529 638634 842000 829207 881755 1222340 764146 1288312
10965 1288312 1419759 1333427 1501306 1878337 1954628 2162868 2080475 1928003 1824232 1253454
10955 1253454 1234059 1256949 803955 887891 722148 770796 551100 584508 768700 679189
10945 679189 669418 422749 380245 133690 162159 236802 132217 348016 -50169 197317 48608
10933 -43008 77393 212246 186896 172799 226919 318532 116334 94100 59880 -253240 -198581
10922 -198581 28471 238442 -87904 -82801 -138825 -166278 -244239 186315 -289019 4756 118937
10911 118937 -241097 272681 150918 -174931 152324 -173223 100103 122072 276114 365554
10901 365554 -446803 79070 36154 -151608 -19421 27573 -176947 -16294 -66398 12443 -48672
10889 -13831 -143984 -274407 57312 -195841 -145417 -195462 -24700 -12625 73381 68777 165067
10878 165067 -66321 143197 -296867 243999 -10212 -19551 261413 -25042 -60615 61458 -57119
10866 86539 -19677 112855 -40568 52937 11433 -140552 -300401 117078 -478974 -172691
10855 -208380 -145309 21129 56342 125756 -196302 -213355 -130352 61924 -250923 -40842 42517
10843 -23683 -164106 -39118 -208234 -75353 -128695 -170113 -99959 -139701 271184 -83943 15742
10831 14654 18109 95910 -11926 -79674 49083 19066 -45063 308330 140098 -182129 -346476
10820 -346476 35660 -189613 -61292 -313199 50367 253509 153959 -239277 -46377 -176057
10810 -176057 -69309 345566 87144 157210 -340600 -139128 -239863 68895 228848 7351 -128319
10798 -7909 6595 -17872 -215229 470180 175516 -25091 108739 -204535 -219558 -158861 -177160
10787 -177160 -111934 -49903 -105972 -225931 -462480 56330 184542 24386 -10332 -3427 61591
10775 -349646 -52081 320606 62223 418444 5049 461182 40776 -110214 38569 -138661 22979
10763 -16322 -211902 -133389 -119032 -107763 25283 -372508 -189533 -68717 135568 52263 -358243
10751 -130996 -173637 -229257 26051 66775 90610 -4124 -65725 108112 -322068 34312 -166409
10739 -44695 -82637 -80621 92914 -93555 111619 -68770 63817 291154 -208653 -291663 162633
10727 2722 -120205 140953 -197050 -28912 285891 -133908 -51653 -74666 87303 -155281 85849
10715 -25071 86552 -75653 -321085 -246708 -447325 43296 10460 62507 -19251 1196 -156515
10703 -113970 -76451 19034 7711 204012 -284061 99677 275803 -131990 -188749 41203 -58915
10691 -38886 -21480 -102967 170124 -98673 99985 -360262 -182947 -167107 -31839 176545 80367
10679 -72208 174513 -194938 30634 -101432 78863 -183949 62179 -206779 -100197 444793
10668 -100274 4987 -514165 -124247 41617 -54740 -352935 86164 -77209 39336 100924 -46050
10656 -57032 239334 174346 121213 -186724 -97438 -91489 -97693 -31443 -177851 -2385 -91647 -414517
10644 -414517 91793 -358025 -324040 253174 94175 -165350 -58774 -166897 -181167 17049 -216505
10632 35875 -172336 -59564 -10529 62172 -55089 -14163 49697 14196 -150929 -122637 207138
10620 25337 -99736 -196703 28154 66719 -143290 145544 161940 178853 21433 -409820 -303321
10609 -303321 -109582 -260080 86510 -186419 -85312 -310552 -57864 -127488 127791 25627
10598 -233226 -139871 -119748 -360007 -266080 -70792 -82369 -23333 168230 20054 99405 -506771
10586 169116 -186078 -48795 694 -77938 93378 28577 -199732 -78783 247714 -70249 111387
10574 -43324 -1769 156727 15184 -214934 143081 -232421 -92891 -484371 -212670 156093
10563 -91122 429900 -20833 -86140 -477940 -32343 -182980 -373741 -90533 278714 123892
10552 -91217 -311125 -161228 -156386 -282229 -58676 4990 -214033 -434831 215277 -90554 26812
10540 40346 8896 127606 -80029 -81499 -2296 -88739 -22069 108936 14386 -141756 28186 121914
10528 121914 -57290 75319 -272530 -76952 237514 -79547 -233959 -156379 230277 -356325
10517 -84124 265331 -199429 -29088 -90697 -26180 -255688 -155894 -30277 -39 115525 63365
10506 63365 -143738 -165560 37471 290174 -168068 74345 -368508 257163 -119689 -117527 -205831
10495 -205831 -131240 62852 -5003 138496 88563 128463 -181841 -46795 -108513 29256 82289
10484 82289 18752 -106805 43825 -344913 -157271 -58098 -205445 -137758 230848 -62559 -84271
10473 -84271 4790 -49076 -155454 429439 46058 -344361 -47286 -24020 -335566 -191294 -161966
10462 -161966 -26700 169572 -287613 200079 25110 65181 -50794 -211383 62678 -28237 63288
10450 -221149 -190441 -164362 -49058 -89517 -367740 -264754 -93823 -83119 290978 -39794 -95966
10439 -95966 -47027 -201954 88612 29765 263304 180928 202315 91899 -5749 -363031 -166509
10427 -98585 -246488 62374 -168731 -27819 -55187 304306 -27875 -214439 -469689 -32200 75972
10415 -97750 137082 -246835 11440 -211660 13603 4379 158889 65241 -65080 -216711 100136
10403 -51221 -125370 -221229 157521 -33393 58810 -44890 -174995 -113480 122810 381368 -80475
10391 21772 -67113 -142289 -19582 -4306 -280164 -81716 -152098 76200 -235227 -114822 -238888
10380 -238888 -46466 93183 47297 40849 38758 -222688 -191563 245651 -37648 -4592 -181888
10369 -181888 -64369 151526 61627 332729 325047 370505 -68089 280705 130702 86251 56553
10358 56553 113512 257211 545099 -59449 153280 -93974 38635 293639 -29633 85954 195573
10347 195573 -47817 103795 156931 718828 492796 569848 266672 95528 196540 -103062
10336 62539 -157425 -97265 381936 -56002 163713 481944 87000 305112 109969 349373
10326 349373 216096 -46268 33327 -26411 15708 28979 107053 142317 116817 -13792 143596
10314 303905 149188 -246600 -90261 -124430 -133536 -83952 -52532 -255709 203466 106163 -176434
10302 -49709 -49658 -18966 -119328 167082 -945 -32415 -256880 65675 -149101 -216799 153284 72942
10289 -314250 -98224 -52827 -140639 80603 7095 34592 386816 219694 -7899 59687 44230
10278 44230 -20176 -184013 -377413 -261915 -37406 3756 352147 42142 -128343 -252035 -59952
10266 -97556 -218952 -40496 -139027 44209 82299 248669 -82580 -226426 -110471 35979 190072
10255 190072 -134864 -82844 -121081 61565 274495 -109877 -12823 229348 -365380 277745
10244 90515 321199 -144288 408642 98342 59843 -78418 -106332 339258 4396 -268786 170829
10232 -215079 -170388 -260124 -179308 -255108 -195416 44364 24348 126898 101019 -133483 -71108
10221 -71108 44918 -18707 68179 -93107 -162567 -337526 -14451 -33935 -226100 -291979 -210604
10210 -210604 -242504 -156720 -80160 -57686 -106175 29290 -124580 228621 45465 -139751 -134526
10199 -134526 -56649 17158 -207345 -146309 -168967 234807 157277 -186056 -42884 175247 73497
10187 -18397 -73222 260406 10066 -114174 323143 -85366 -135088 255213 -120787 -185379 129679
10175 73144 -253222 36843 387682 183644 99912 -2772 -95591 29429 -140780 -115993 -411077
10164 -411077 105603 -251185 -500177 -11957 -308168 -317321 244554 -173157 34868 -318808
10153 -57573 -98552 -74839 -3251 162239 -104754 -83191 260831 128001 -225686 334510 -81642
10141 -335284 -91970 77611 -354947 -271811 -21776 -170139 96160 -267892 -89430 -105698 -193220
10130 -193220 19692 -59065 -128198 -135100 -111240 -95768 -202109 -101119 -54553 -107925 -26185
10118 -82939 -8919 147420 -225471 -74074 12979 -323213 33560 -121243 -282508 -250811 -17995
10106 5691 246070 -255753 -328240 -72907 31347 37378 -22357 -174597 28475 37648 -59303 -158727
10094 -158727 448558 -8671 -33454 -240208 -250623 -105793 41221 -68215 -16930 77756 50552
10083 50552 -105174 -124084 -1308 130616 -44565 -76032 -147806 3959 251001 -279645 -26032
10071 3652 347965 115653 40707 -16172 191635 24099 67791 -291065 -134441 6371 106164
10060 106164 -142831 141828 -373636 -391148 169843 69878 -157282 89143 1246 59003 -67651
10048 106102 -96753 17122 -183797 153462 -97417 -328813 67887 -78182 -194489 61525 -89611
10036 -147272 -51924 113650 157311 -233046 302686 58476 323811 -181398 210628 321990
10026 321990 -37640 -326752 -144980 75310 -205469 94690 -82543 -49042 -339361 -344342 180056
10014 -129099 -148286 17762 -66153 -183080 28042 35854 -19665 70940 -199315 -107589 162274
10002 148211 -30038 -95006 112993 -1349 -13533 43207 -226064 -170816 186770 -232979 -118992
9991 -118992 196405 -166692 -22276 87066 -275609 233745 149175 -289280 -331334 -178103
9981 -178103 -92799 -400833 53497 -233137 -100776 -191888 -186968 -88804 14460 -217005 -195307
9970 -195307 -39667 37123 -34327 166717 -128884 124687 -89755 -102755 67387 79004 -68036
9958 -150794 -208030 -59190 -191467 -117491 107866 -136553 15521 22246 -66079 77189 54233
9947 54233 302324 -10820 -54464 -281775 151982 -157135 -101533 24515 -69191 118667 -80144
9935 -157703 -164069 -47351 165054 162111 235860 -473800 -271647 -58630 75597 -14881 -206610
9924 -206610 -56039 -9629 -306516 -249669 168954 -429339 -179987 187605 -138664 147858
9913 -16393 43265 -194469 217341 -299648 9239 -31203 -356846 -111007 -188492 -202515 -146196
9902 -146196 -13424 -53821 141445 -158192 20408 157486 -159150 28902 -205028 -328500
9892 -328500 -75913 6840 -20724 75537 75344 -46214 -181978 -378024 -31368 218716 -262994
9880 241633 67422 -233547 -43872 -209554 -106224 148055 -231077 244602 -90063 186089
9869 97899 -384914 213967 -241058 -164605 -263798 -94033 13303 -213403 119049 -365323 136448
9857 1306 -574555 -376267 6885 -54107 -205244 55902 69326 -79662 50883 63286 139564 -9489
9844 39758 -16528 -163896 -70268 -53265 -126420 -242634 -32065 -35677 3890 -745 -166283 -133421
9832 -133421 131108 -152063 43028 24141 129067 101963 -374594 -275644 -16638 -109416 102794
9820 -201799 -243086 160292 112620 -26014 47844 -139036 -93326 99756 74826 -173437 -151310
9809 -151310 -93985 162884 159498 201647 -103261 -173577 59709 -175768 69662 -165176 -152055
9798 -152055 -235601 -270022 -19815 -33580 -270009 2059 143760 -197211 -136626 1678 -39363
9786 66618 -168806 -253386 -103462 -72895 -207695 -156268 -58816 70226 342174 -88971 -1136
9774 244078 -71226 390048 -176155 41593 27978 -124021 -795 15991 5552 -163855 69111
9762 -139560 -134598 -37654 -128930 206424 -231791 10149 -203021 -144419 -15613 -141160 296718
9750 -320152 -408970 -379888 238751 220728 88649 55525 165169 -274781 71451 12577 14432
9739 14432 170463 144931 -171655 -184042 -346457 -262000 -44380 -71541 -177522 -128898 -134168
9728 -134168 -254623 -46071 70925 -32846 104899 110044 -127627 -105821 226605 -106528 88643
9716 -155712 51676 -24751 -113296 -112326 -126360 -135995 -4017 -73554 266430 -2972 -55761 -88351
9704 -88351 -239543 13856 150793 -79872 -87950 -135036 -57517 104849 197000 -145069 -286283
9693 -286283 -9722 280771 -345806 351123 -321643 -242037 -97668 -233566 1910 8003 56006
9682 56006 -163914 65508 -205328 67484 -128198 -171032 -262349 -46319 -201414 -162695 -93735
9671 -93735 134422 -211071 -68445 -367814 11557 74983 -242910 -57280 305441 -73228 -405212
9660 -405212 -189347 -238750 61558 -161081 -38745 -577409 -236460 -369205 -162058 128161
9649 119114 -9146 113084 -97124 60213 -199266 22455 -167018 -83679 -7063 -246579 -777 -156328
9637 -156328 -174292 -32805 39464 -110658 -151941 -41332 -128305 -318311 74870 -105040 -199242
9626 -199242 3609 8410 -197215 -311370 -104113 -87830 -171625 -72600 115833 -42382 -160719
9615 -160719 170240 -202856 125301 -8065 -240253 107428 28364 -56750 -239050 -125979
9605 -125979 45558 -42164 -60447 -227320 -81568 -49013 131122 -116313 -240213 -211545 150334
9593 176236 231073 6409 168370 -17736 -55985 -89 -198112 -97555 -23924 -436886 10382 220107
9581 220107 75667 -373767 160546 -199582 -391464 -238183 -81100 60961 42977 95012 74296
9570 74296 -53154 -180833 -55434 151777 152622 -35375 -118864 -255904 85597 -32571 5628 -127210
9557 -29312 142135 4349 92831 119679 98468 -68779 -49789 -244114 -118878 -282037 -154377
9546 -154377 -24776 16794 253909 236486 47296 -34471 -124439 55911 113074 5715 240416
9535 240416 89278 -117976 -231553 -15106 -149590 89871 -475515 -56335 -502401 46454 -142350
9523 -56444 -72304 -228296 -97711 -193437 117275 -145587 -104883 -751 21867 72523 -133181
9511 -213984 -130743 -229598 14551 -131455 88600 110659 290115 122975 186910 -38517 91112
9499 5011 142875 3639 -57663 -5519 -190656 185200 236320 52099 419849 118527 -209372
9487 92874 -92639 -99777 -210104 27620 191234 -104294 8725 -26272 -331289 -51307 -20420
9475 90731 66919 171848 -344158 46032 17654 -197033 -180450 -173680 -4250 -259715 50037
9463 -150152 -171344 -118968 -222266 -112082 -121847 -76431 18358 108312 22946 206338 -8611
9451 114098 -291359 -106033 2986 -151348 -238547 -116265 -60537 424522 313955 54136 -186064
9439 -159608 156534 53555 -220858 104698 -240211 -196984 171846 -81259 62164 48609 2054
9427 -64035 62088 -236516 -212571 -177259 -22564 -158388 86160 -443137 -146082 93982 272519
9416 272519 -197002 149567 -140309 -270144 -194572 -107652 -291616 -196471 -41313 -184999
9406 -184999 -119799 92063 194303 250528 15769 -423401 -206219 -84451 146662 -4106 64103
9394 6566 200706 -45826 -182958 -179407 -322157 367797 -461344 -58922 -124250 -158489 -99203
9383 -99203 -65708 -212739 -169139 -87408 -86863 5001 7419 -148651 69565 -102789 -45609 50938
9370 -207618 126545 64847 -352149 -24080 -100468 -6021 49664 -360029 -53794 231507 28349
9358 -152297 249725 -90765 -40411 -162403 91940 324295 -86255 27229 -130622 -12147 292743
9346 -49630 126753 -65679 -53839 257783 -189784 158611 -27408 68277 -210513 39159 -235078
9334 -108878 -37181 140044 -191100 -406572 -36339 -12728 -14793 -43283 -91287 -192122 37136
9322 -64367 -36623 -199656 24861 -171014 -159226 8576 -170589 -44280 -389188 129019 -232914
9310 -18783 -45531 13080 358663 -165601 159628 22935 -283587 232591 74054 -26026 -41051
9299 -41051 -183879 -161835 87303 -239283 -147384 -113979 -67008 -165152 -89492 -381412 -124013
9287 -130970 -115269 262017 -126293 -81827 -160549 69561 -439996 75536 -157881 -159464 259792
9275 213631 -460541 -28357 -78606 -59750 243711 -149964 34138 -87964 49104 -3681 195414
9263 195386 24559 249319 8510 -42186 -134303 138893 44201 -54383 -46305 58558 -110738
9251 -351813 -127507 -8825 -181938 -358229 161456 -201849 -12415 -378579 -57856 178068
9240 89018 68822 -22614 -9947 -152826 -158279 -62674 432508 -73837 -27414 -123746 102259 -209060
9227 -207878 96385 -387963 -291533 -1205 77873 20361 125396 41050 -155336 -21838 -145689
9216 -145689 -3347 26727 131413 84468 34763 -81461 35596 -35101 -266514 -137712 -61934
9204 -160390 -251872 29949 -110169 -222093 -205519 -41182 -201356 -245549 -274324 59973 -9490
9192 -5944 -55049 94348 -134644 -21978 -88711 -336926 17268 -133547 -175294 -103633 58443
9180 -30067 54849 -151516 25019 -28044 257672 -21376 -218849 93946 -89398 -119179 120295
9168 105491 460746 -203892 -82089 149865 168533 -273908 -240852 89867 -41207 126530 -309236
9156 18521 -210211 -107846 -6431 -18597 -23078 -149424 -545241 -328965 155661 -45648 -272778
9145 -272778 -181662 -136800 164666 261236 -49833 -58125 66993 61280 -170885 -111037 -104186 -335227
9133 -335227 -133951 46585 -26706 142950 -149112 -390864 -21097 -309274 425743 4862 200728
9122 200728 -173491 -202342 11048 269372 -222250 -348848 -37801 -126440 -61551 -198996 52400
9110 -95534 -252033 -228916 -114217 -137948 -214808 -77936 249311 -296027 -124424 243502 39092
9098 -3239 23793 76536 -107528 -169338 -60615 201260 -108279 301602 -97589 -147461 17296
9086 -5777 -70997 -238249 270889 201345 -85380 -100504 -140119 -323756 -63407 -105244 131224
9074 -22314 -94721 -122573 -129630 62310 162125 2997 -40683 -295278 -42833 53820 29461 -197256
9061 -189407 -113402 -5162 -72490 125257 1464 -260954 102881 223309 178913 -129553 -48616
9049 97326 -266364 -168467 207602 -44165 69166 -227448 -98055 -7917 -119706 -101801 -202929
9038 -202929 -404181 -222101 69272 -82414 14810 267269 22933 -41065 139000 -185655 -918
9026 104425 192216 17038 -120728 -45660 -2206 -50009 -96446 -214589 -211841 -106586 10577
9014 -120267 -132348 -212497 109150 -44090 90060 107454 18948 -286032 65766 -103726 -128402
9003 -128402 258504 -49854 -242610 -111143 -24154 103738 -262435 -315550 102407 36836
8992 -102391 -192645 -130182 158380 -252893 -50867 -74658 -4098 295462 -238120 -39479 -288530
8981 -288530 -238406 162143 235179 -213739 -129400 394632 -244500 -564132 -226544 -229558 -203481
8970 -203481 -313070 -73817 -34130 4276 43212 -73455 -142517 132157 69514 -67881 -178678
8959 -178678 80639 -157230 33053 -104702 210737 -90591 -337317 -239486 -229827 106151 -57073
8947 -122555 -59228 -199519 -90948 -459003 -204226 -305362 -35661 -124593 -353635 -308996 25091
8935 -34615 108713 -13558 315279 -68709 -103757 8262 -343602 65357 331582 95777 -11566
8923 -131613 91851 223870 -1099 -98608 -134964 -75872 145863 836430 399784 -20400 -140483
8912 -140483 -249382 69792 -99485 -155328 139974 -14150 -203419 53995 305565 -356033 -104578
8900 152475 70042 104906 -25520 -198242 -11481 -117973 -210986 -216008 -21086 -9965 42759 -52411
8887 -108637 -244861 -324395 -101298 144896 -139038 -210019 9530 -29566 194013 -81372 -303808
8876 -303808 -18979 -100737 -231920 277455 -140141 104797 -116729 -312347 -178075 61782
8865 38168 49490 -340860 -166877 -53240 -169119 -302966 -160955 -128519 -175558 152030 -114401
8853 -255383 -147624 -372118 -98720 106420 -14874 -35906 -30762 -250810 -174403 -347739 -213173
8842 -213173 155342 143229 -41530 -132716 188310 -226188 -28091 -190107 -66364 160406 132602
8831 132602 -219588 -266465 -276943 -21291 8087 -53973 -137938 -319276 77032 147387 184593
8820 184593 192002 -9574 252578 -126860 -454730 49456 -98797 -422032 89202 -390414 80028
8808 -120607 -98294 68008 -276461 30961 290292 214505 -170258 162764 -90545 -233570 83564
8796 -34755 67909 1716 -12799 -96305 -113507 -79728 -119378 -8067 -127827 -33465 -1117 198159
8783 -343031 184527 41217 -41010 -209974 -131045 -268083 120577 164778 -218835 129770
8772 138425 120287 11690 129477 -66072 54114 -122426 190603 -189562 -169906 284531 -63377
8760 536418 -248655 -23568 86106 -4433 -330285 252512 -38979 34661 -108428 -135194 -156491
8749 -156491 114729 -318561 -79019 139904 42859 119916 99860 -99366 21910 -29449 -6242
8737 -29650 -21805 -28205 -24047 66303 -190669 -94278 -212715 82516 228181 -236150 -23178 -81823
8725 -81823 -66884 -103453 108888 -42373 23669 -24251 -224426 -269156 155199 -161855 -293708
8714 -293708 131567 90959 -104110 -113230 -162418 -172696 -317961 -175526 -24638 -5111 -322131
8703 -322131 55997 -599512 5328 32882 194865 -129747 23474 -136143 -309103 -253750 -163185
8692 -163185 -8404 -103498 8736 180959 -281557 216284 12601 -240033 60600 157154 -297739
8680 144603 84793 241269 132768 -70772 -332672 -92447 -301484 -45102 -150525 160014
8669 -180726 169558 -276779 108604 -344647 -174704 24624 -30529 -49905 132209 58101
8658 58877 -39073 -253479 -170807 -264892 251684 -87909 93999 -123530 36663 -196565 -29650
8646 96154 -187363 -241888 136237 -35578 -107412 -17064 -210647 -41580 111019 387109 -9373
8634 214010 76837 157553 -259207 -84477 171259 166045 254527 244412 -139967 -63517 125734
8622 -219514 132895 -135917 107063 -46106 -275763 -473735 -198386 173589 -100891 68238
8611 26293 -75075 54649 -153908 23860 -188939 243903 74199 -73363 -43735 -22448 -31954
8600 -31954 157086 35401 127599 -25778 230039 -129710 -16879 -22999 132202 -297827 143154
8588 73782 -8059 -160366 -304742 262011 145556 -22705 75995 -1744 -139511 -239003 71260
8576 280331 8059 149339 -185326 -233999 4684 -383022 222631 320905 -142688 122976 -31843
8564 97027 138737 -25455 -248890 -323093 -91384 184064 49136 -184696 -219945 -40049 -143624
8553 -143624 18656 -20565 129092 -104205 -205634 -187720 -61129 134909 -224943 -161901 -141641
8542 -141641 -132216 -347165 -58920 304139 337107 -133126 -156944 45614 -425116 212149 140524
8531 140524 145956 -171521 -253576 -204754 -17965 -129893 -358293 -188038 -251043 -345613 187519
8519 339328 -55943 -185508 108714 -179194 138501 -90305 -63222 177708 181296 -317788 284791
8507 64297 -60643 -401711 43987 -115333 -23724 192464 -95344 43710 -298573 -371690 262846
8495 -193783 -327968 -215622 -126582 -150749 -143041 206563 128522 99087 57910 61095 21753
8483 -64774 11799 -238427 -283477 -147119 8645 -183639 -99391 140196 -427708 265914 -92370
8471 -51148 11423 72053 -226571 131122 178640 -38210 -296219 -40172 -157649 173324 -74292
8459 -173369 206359 -142070 130132 -21540 -171698 -188342 80054 -59437 -149165 -498217 -8011
8447 -122307 -236096 -58206 284091 -134157 134497 64695 -59513 -35973 143131 36741 -12999
8435 -134325 129359 -133807 -394686 -431035 -44220 -232259 -294378 -57 -226542 -446635 305332
8423 56582 302160 60645 87650 112251 -150033 -33255 -314794 -55753 54412 12916 -191645
8411 286726 -222059 37447 -239983 -134772 -162556 51285 214618 267311 193890 -148227 155245
8399 115572 278835 23622 239789 -132427 -393691 -71338 -30991 -522285 -36894 -291246
8389 -291246 -139045 79517 -399210 19839 -207949 -11308 149909 -241740 91341 -111669
8378 157598 282496 77781 192271 80406 20087 -416614 276469 266934 -98825 127460 -23039
8366 -41306 -290392 -67113 179600 -232988 -244144 -53247 -73299 61813 183734 159557 -73947
8354 -113045 13331 221495 -7352 -114752 -88849 -183903 -1450 -159353 255817 247411 -37189
8342 108312 104003 -220277 -115229 -126785 83632 -108346 -72367 21793 -101706 68724 -156172
8330 12726 -225988 -50683 -36521 41690 86197 -228860 187739 145099 145825 -210208 -259611
8319 -259611 92556 -86093 60305 153024 -74281 4848 -111557 -91469 50005 -50153 -147760 65627
8306 -288388 -47848 3728 30744 51499 -325681 83926 -41785 317299 97096 94965 29295 120684
8294 120684 -332401 -15648 149845 199263 111654 -11583 -96260 -25817 -332343 -18899 -198527
8283 -198527 92787 -263407 -181986 31842 -95750 -105037 66615 -140806 -89285 23935 -47327
8271 -103028 45785 53562 -242 -68997 91421 -116536 323201 -84851 37741 -101509 286837
8259 89411 -172531 -116687 -226077 4685 27767 71575 -13613 260171 -193329 103598 17040
8247 61301 -78084 38849 -90044 -30316 -27747 109053 -62335 -271996 77063 111966 -97179 -64366
8235 -64366 -256022 207241 -222511 -106225 -212815 -110378 -2724 113564 30503 224874
8225 224874 21173 9141 -231571 92440 348700 -170793 -14783 -17889 10669 -167022 -120180
8214 -120180 -128879 -66636 -91963 169331 257558 -78835 87180 -21801 12296 -60700 119853
8202 -21730 36138 27207 39 -234727 -22298 -90479 8352 -310509 -92455 -176913 -72459 -381223
8190 -381223 -20292 -110330 -302627 -245063 60816 -209206 -89586 13405 123465 -206592 12162
8178 92067 56724 177845 -68176 85185 196249 -327583 22205 -187701 132631 29703 25370
8167 25370 -292676 -154307 -236505 -191071 -68636 33545 -141504 173250 115174 4209 21316
8156 21316 -33024 15062 -51774 -3983 -182216 269579 330301 -367253 58264 137563 70421
8145 70421 -184178 151580 129240 -36866 -46647 -155675 -374363 -19973 5722 -170605 -69808
8133 -70249 -177605 -5502 8930 -120163 46964 114300 -26700 -238014 -345912 72305 -227794
8121 -136192 91002 -45526 -17883 -78432 207634 -225064 -249944 102382 142440 -227094 702
8109 58897 -343557 -189254 -126891 68806 -80563 -169413 -8449 131079 -219010 -202439 310141
8097 -323635 -24808 132920 36255 -131101 32445 99405 50786 595910 37508 397314 -138852
8085 158462 124521 139157 -17641 -403622 23681 12114 129009 186253 -76436 396693 221974
8074 221974 52228 99974 -201249 -54903 24987 -210812 193517 -341944 -186408 -83534 -443024
8063 -443024 -370624 229245 -59766 11214 -212890 -347385 -44073 -48618 -71836 -153536 -192058
8052 -192058 14175 -213673 -77352 -89542 106219 273239 -187189 -96835 -97465 -65638 -158596
8041 -158596 -202532 -120755 -90587 -147957 -96969 -173206 -5860 -59663 -46955 -109514 223107 -100798
8028 -18605 6994 192478 7854 47127 -78592 -185163 -202874 224749 118918 2533 63731 -204823
8015 143884 163517 197116 -665 -144100 115356 -270473 -157437 98294 -67091 -173424 144394
8003 82741 13048 -135889 -221563 167245 -32260 57624 -264349 214268 144546 34922 -123003
7991 -110774 -52974 -95489 104934 168145 -49308 -144390 -77795 -67413 118022 133535 229793
7980 229793 -37374 204608 -325123 123652 123846 -309184 116647 -10463 223847 49961 -119927
7968 -279124 -20846 69915 42958 -12158 73937 132892 -334333 22005 44277 162674 279149
7957 279149 -44425 -169512 -264096 101118 104456 -25412 3762 290046 309387 142242 -96824
7945 -103070 -127464 -91252 -145084 -9849 104445 302983 96016 134772 371716 -220193 -384875
7934 -384875 -178902 -1198 -100781 -83546 3747 -96332 296971 53397 -245747 -10672 395522
7922 -95081 -42405 57594 -240124 -207233 60980 -21707 -322592 -19801 -76694 16181 -26691
7910 3505 151530 288341 319639 -215332 -32461 26493 -231303 -445391 -213366 70033 -192644
7898 53910 -330556 161336 329000 -75549 -137490 -80111 -143654 -311355 32694 -140456 190700
7886 18542 34489 141929 -10134 -107128 44609 -49371 21426 -97757 92639 -162889 -237659
7875 -237659 38387 -212323 124254 -54164 -13133 41014 148446 440997 44244 -95316 -86564
7864 -86564 63184 -1913 -138278 -90237 -39503 -208718 -275355 179924 -87439 72485 -74820
7852 -309954 125276 -244297 111218 162134 134448 -447541 108390 114261 -4194 -91296 300965
7840 -176492 125692 -23160 -23836 135775 -289236 -231606 77616 106474 -1274 157906 11927
7828 94122 7860 -9534 224883 99284 -248224 -51406 -129183 41057 12538 65099 208032 186291
7816 186291 145589 105414 157179 -16080 -330395 -154899 59715 17617 -279532 -177375 -98148
7805 -98148 -124354 -266681 -204049 -255470 118955 -25853 -8410 -117450 -35691 -190151 14692
7793 88329 -267369 134939 2514 229059 -29631 -520879 176035 -17464 94364 -263080 319087
7781 -51228 -18475 189388 -54672 -263824 -44805 221508 -59053 68333 -223571 141604 -40121
7769 -172228 -248457 163742 -210839 260102 145694 -55792 173264 157299 -194940 28997
7758 -206095 99089 -67098 34151 -275496 -46553 50589 -111397 91375 -93973 221695 -58053
7746 186910 -212419 -27908 -340333 -41166 -8596 -21303 15916 -100297 -44538 -224368 85519
7734 -315270 -242895 27964 50975 -112450 -190708 140253 218103 -222093 -211347 -385798 -446071
7723 -446071 -222186 98793 -214679 -205 5077 -33301 211210 15086 143450 167197 -298322
7711 39125 -92352 -180303 -121332 -227497 224796 -296534 -113715 -532842 89272 -112531 -1420
7699 158129 -129214 -204386 -51351 -164204 -178806 21283 -94539 548767 -95998 72089 -127681
7687 238303 109150 55915 -19920 388308 -50170 -384426 -179156 -13184 -89398 -231742 6852
7675 121602 96996 -14024 15972 -194916 -179618 -134063 75701 -217372 -205257 -107860 359533
7663 153160 -26179 109901 109360 113170 -54367 96965 50007 20033 -178035 435557 -68541 -62574
7651 -62574 -264899 -2638 -1433 136585 178372 14863 -420901 66396 -61833 -335543 125703
7639 69777 129096 102413 -9869 186889 -376451 61779 182580 27814 16700 -234138 246056
7627 -317161 -132746 -159561 -236440 153585 -248063 -63150 7040 -111248 193069 -65245 -300249
7616 -300249 -124241 85143 183785 155662 -27867 -83796 -131942 -82669 132882 -112824 -33797
7604 218664 62266 -189509 137745 -81677 92922 79776 -163718 -243942 198773 291707 45145
7592 -125176 33314 2577 -189962 202497 -94849 -152111 195032 121740 -105039 -163276 -29871
7580 173681 -280436 -141359 -73806 87297 119499 237201 -19804 507598 -82693 -39288 -241429
7569 -241429 12662 -444070 77347 -168966 50146 30710 -159015 -71772 -211785 170870 134643
7558 134643 -210928 -226337 -268982 56510 98081 97517 314596 156135 94205 -329585 -248208
7547 -248208 399804 -62708 314671 -121416 2779 -380395 286075 -132549 -253737 -30234
7536 166234 -140278 106541 214860 -103987 -136773 211386 109166 40748 -157883 -207675
7526 -207675 76845 -103986 98369 -113740 -69742 -120125 271300 175884 -91624 -180306 77963
7514 -58521 76983 12626 -132196 -120888 -189440 -151978 -58084 -245307 -209688 -106791 -95156
7503 -95156 -20558 198803 59531 192277 115645 -64871 -108009 -19110 -135696 -90839 285567
7491 89124 45547 -182734 -171517 -101924 -34451 148599 2572 115342 344011 -72335 58980
7479 -130010 167302 -171328 124206 239686 -124500 244745 -204630 -165689 -159047 -29184
7468 31892 -160384 -112633 189711 278654 211539 -320790 104916 -70363 -184630 86304 -82047
7456 14133 -144426 -134992 -180504 21037 -151350 -128631 -157564 226051 -168806 281492 -87531
7444 80119 -64326 -42946 -82193 52714 142597 106666 201187 -43414 -72357 62205 -213262 -34235
7431 -67986 91162 85881 -262781 -335184 -311794 -298012 -36123 65098 -207769 64412 -136740
7419 -356274 -20402 -20982 -195585 -251548 -77918 127015 -211156 -40108 -102897 58787 -311216
7407 139735 30050 -396190 -154709 272776 -182285 -98755 -66956 -117770 -74775 66463 88652
7396 88652 -96302 -281260 -127873 -279918 181934 -142425 -121920 42585 -818 202084 124353
7385 124353 139392 -99875 390473 -41246 -213739 -149262 -3244 -109104 76378 -222038 342176
7373 233860 77186 -79801 195521 32451 13629 259368 337313 32956 24999 -414194 -101040
7361 92364 7237 345631 -74265 -43082 -72278 -149776 144332 -34042 -170893 144922 67924
7349 122167 88555 -109364 -254455 -134700 -193980 193372 273438 389399 -536056 152714
7338 16698 100090 -237029 68169 -272403 -111594 67209 -224133 228242 120787 -68504 162938
7326 223186 107905 -284149 -274105 -94236 -145771 46313 -118458 92630 -45539 -141875 27139
7314 -280137 -154406 -188044 161356 101331 -76395 112994 -182 -52702 -113384 -99068 221617
7302 -82889 -153222 -165037 219267 274124 -63653 63650 -81528 16766 135592 155916 73986
7290 134304 37560 -86487 -42219 -180706 85354 -33462 -35180 -29665 333026 -67392 -50003 -377438
7278 -377438 -305571 -265054 109461 216378 42878 -174084 -12223 126908 -23675 27644 106670
7267 106670 -103677 -45355 -306938 17436 276855 2653 299777 -97260 -382925 -222551 -44384
7255 88112 45468 102940 296496 114519 -20308 -376042 -330697 -10944 -83956 -119647 59389
7243 -102027 -15630 64380 192004 405601 -197112 87789 42496 -47156 68528 -93605 -233257
7232 -233257 101559 29345 196304 -71794 72962 70055 -244689 -306321 135877 52364 -49837
7220 96518 148323 -189177 -56012 40518 -197031 -136132 -48028 -281707 46448 45483 15863 68735
7208 68735 -68917 -143698 -113580 603 -37109 -185225 66479 130410 -90554 -5866 96538 26860
7195 -57330 101252 238815 -134954 -264911 272566 -32556 117230 100497 -344308 -286097
7185 -286097 -324461 274758 11431 -110760 49045 -117948 -172288 59012 -172783 -9038 135259
7173 -244470 64517 35434 70170 -46483 212577 -335511 -29713 -104121 -147931 31373 -25799
7161 -120362 -225469 -106118 133973 -75863 -351216 -338966 -422621 193653 416188 -386560
7150 48886 183732 -115343 -47280 -203981 -91868 219237 -169101 63286 38122 142982 -122285
7138 -41424 45706 103804 92792 70232 203223 -83015 -91665 -147192 3658 -34312 -282850 -91886
7125 -85787 125961 -117585 79869 128017 -43809 -44013 15516 33518 217195 164444 -161959
7113 -53202 56925 -48178 -66427 -287238 -96587 47822 -18198 15472 76997 -124297 51025
7101 -84050 -179882 31847 -12274 -87792 -101224 -227672 -70483 280988 196021 456565 68455
7089 -160713 -49550 -109033 293872 -181323 234714 -61998 126322 -21430 -11011 58136 -334420
7077 48859 71333 91696 -149352 -438580 -42884 218825 233365 91765 83882 98934 -28072
7065 -297110 51547 107839 396443 -40578 -153675 343107 -72062 -94676 -127714 300488 -243171
7053 89235 633129 81248 -190436 163716 -45416 89186 195851 -92298 -84120 -25339 141203
7041 -229483 -70331 -115856 -228076 239893 13374 -77760 106829 -412854 65712 -138080 92680
7029 -81052 -102378 -3121 -131346 219847 -67684 -134979 -99293 -54770 12450 -272991 88118
7017 125475 141021 220248 186350 78261 -130532 -436034 46716 94681 -186990 -151042 -92676
7006 -92676 -147938 -141220 6175 -171838 -247435 226125 46347 31961 133595 -4078 -310495 -115907
6993 -199632 161217 6718 76201 231028 -130649 -91944 -229523 55537 111820 147541 -188050
6981 87921 -84394 -105654 16759 92939 -86848 41179 -191972 -99914 172212 31728 -29184
6969 -245702 388553 200199 179807 82891 -282663 115611 373289 112935 -78221 43453
6958 55291 -294898 -29468 113787 -17750 23332 -9321 -37534 120791 -18317 197838 138950
6947 138950 260211 -3289 177017 124350 176442 129396 50952 -99194 -256227 131639 -163750
6935 127949 -314052 41980 -124257 364269 -155618 -139527 -18771 232405 249315 -171789
6924 -168812 -24518 40237 153422 94205 194697 745 -36051 -127279 36306 -132333 -131379 11880
6911 38816 12451 47889 236289 217311 -248394 -46671 -40212 46845 -43799 141171 130609
6900 130609 -1211 -49900 -21363 -67829 46453 -210386 2375 -310997 -100824 -33543 -112155
6889 -112155 26643 -95917 -87824 142386 105794 109793 288372 -25515 107120 186300 -146179
6877 261898 -95276 256977 -102878 9427 85049 179947 93239 50444 -209701 -23347 -47409
6866 -47409 -278357 110157 265676 18563 -72994 111726 -81217 -214004 239359 123949
6856 123949 47373 -691 -337885 361386 -79335 -67670 -43655 -187842 -127255 1573 111965
6845 111965 203557 -110380 75566 266458 -3409 99416 -97701 -82797 96958 158027 -80268
6833 -14421 42428 219922 -13503 -147343 173298 -159869 68874 -140562 88836 -149434 20172
6821 186642 62598 77155 -26865 184573 -179552 298486 -201180 -31016 167099 352731
6811 352731 -199178 56531 -125088 -35014 137676 -26005 -23692 -321902 202376 -385681 -183737
6799 -41726 -379872 131716 49595 -38928 222389 -221785 -310764 155828 -37090 -143744 76396
6787 -107718 204367 -117512 -87869 60548 178988 -125058 86713 -99494 -186291 -139566 -167461
6776 -167461 66128 3610 271439 -268640 -129122 -103540 -82045 -121644 195320 -103533 117847
6764 -94276 -73694 -128856 -184237 75468 360342 100521 93859 -116705 -69512 45493 -67844
6752 -153131 -71526 130403 -181174 269876 -234748 -95226 -101682 -13736 195980 286552 31394
6740 230995 -428790 -288359 -256750 5392 -439817 146717 57227 -27967 -171704 -157048 -36824
6728 119581 85613 331530 66671 141180 -215155 -320905 156059 -25341 339074 -2096 4628
6716 61940 196821 148541 -73425 -79237 -25336 41331 -28692 -302432 179527 -57610 172866
6704 -54052 -20984 -109407 29745 -20438 72036 205401 99657 117768 -165491 69464 49077
6693 49077 -334587 74254 -559934 -379920 335857 57877 -184219 434392 101960 -20870
6682 34950 79686 117470 377094 -92078 -146987 -46783 12524 256299 -4509 139478 -49637
6670 -47863 -175259 -182598 19115 217193 -62235 99724 177827 213754 55553 1282 -155678 -34484
6657 -355264 -219005 -40466 -117336 -10994 -314259 177280 15333 5964 -96743 56780 176270
6646 176270 318222 65086 161818 -139155 -318234 -274082 -231984 255321 115495 143465 -227669
6634 176990 -135287 84786 -8146 131663 -547132 67950 -97327 -17319 -64447 91306 -43278
6622 -32385 76552 -92668 46298 86624 -98303 210048 312877 4431 252300 116042 -12143
6610 946 252853 -288694 -24103 84341 69883 -21599 -309359 14857 141781 -144100 36777
6598 -161636 -123942 -196238 -234874 16499 138994 98902 89252 -95858 -285632 -38745 92877
6586 -451067 -176266 66833 19186 37564 45890 132350 3131 -34966 -149429 137165 -218095
6574 -194125 53677 -209642 1359 83809 -198881 34705 -63126 -179088 -134812 41998 73469
6563 73469 -96007 -334838 -107973 -211461 -39959 -143996 -228863 60800 179236 -323945 82647
6551 250879 231509 -160284 132486 201177 57623 -74830 -47829 -25958 -165356 13952 -131142
6539 71972 -82211 121701 223937 102936 175142 122706 -41448 135888 32785 143210 83594
6528 83594 -183496 -2218 142934 52471 317505 320453 -224688 -191972 31522 308542 73569
6516 -201971 -144044 -240137 -37069 -139644 178282 96818 -110303 -29401 18967 -139455 -275994
6505 -275994 -529597 347235 -70888 43819 220328 98673 79074 -274589 28486 -98050 -56872
6494 -56872 227161 -103583 -314905 -106648 7582 -7436 -64316 -65699 145301 235190 70648
6482 -155378 -168243 191537 -82766 76610 138181 -236006 -77759 -11136 111439 -92059 -161312
6471 -161312 47699 -153833 107915 8565 89404 -88848 188480 -5684 -245046 195345 -27135
6459 -136381 41947 215327 -49263 -116231 -259431 -39827 -55329 117893 -12738 98042 -351547
6447 -112902 -68545 -184977 -114280 -225936 118536 -36126 259703 -70258 -73199 232391 239920
6436 239920 15398 -85359 83644 155744 -105613 260292 185071 -70247 -186260 -8064 62644
6424 -190881 479623 -37474 -31649 -3333 105938 -33656 -207555 8940 -324209 30677 -235628
6412 -4692 -11682 -193799 193084 -337341 -81673 372095 -312366 -120635 -80685 178522 142275
6401 142275 237292 -40158 -53963 92323 1997 244277 84399 30452 -421497 -11618 -13881 -117097
6389 -117097 -91196 407894 -299218 45142 -376873 -259 -128462 232842 -21271 52191 101353
6378 101353 -283652 -33283 -59503 -20024 -27428 33737 -17682 16314 96129 290606 -204052
6366 -167747 4469 77456 202207 -41279 65268 -446522 -134152 60476 62562 -173312 205463
6354 65118 -257859 -214493 -2478 -137412 119475 222369 -172953 23081 -36826 164335 -45437
6342 37239 110459 133228 -234455 -3879 65249 -262893 -78313 299771 -7618 176327 12197
6330 -172867 120983 -258357 121375 -238656 -69586 183531 74377 -88003 -215365 -24921
6319 -232278 214304 -91062 -243505 -87807 -192427 115825 30401 68861 -76724 18506 116294
6308 116294 65403 -128740 -16577 -162444 -382769 256755 73814 62626 -115700 84404 -89837
6296 -259578 192379 -118591 -148830 191156 279666 253382 -105531 -338391 -301380 153219
6285 -455185 -191604 -351302 72996 -55906 -1508 -61602 -33521 131933 107884 215297 -170463
6273 234192 -21477 142936 178290 8475 193194 171068 222058 -41289 120143 -155643 2347
6261 -48105 218879 -125450 29880 -284546 45670 -202112 -27306 191767 21950 -119305 59718
6249 -161123 56779 -2375 -32034 120730 -61358 205864 -182212 78857 -39068 171329 95219
6238 95219 -94174 -226818 -113089 259760 -119725 141623 271179 134276 33 296551 -157300
6226 13585 -228284 284190 103151 165249 184067 -66858 260401 -19708 -61752 -6254 19119
6214 -83082 301713 8497 205490 -210249 -51876 26710 -266293 -94167 31470 -167978 253015
6202 -3464 207559 385876 82958 95596 -8989 -169698 81204 13292 -22850 -11678 -118796
6191 -118796 -250204 93610 415105 -175489 -103021 -298299 -149820 -120733 22115 56714 -306326
6179 122092 -141936 41203 -112577 -145557 191810 135643 -29725 26964 4329 -95267 3225
6167 -16 -116606 -104710 38803 180898 18472 -65863 -20537 85687 416600 71485 158101 21413
6154 190398 -158775 -567961 132718 169443 -60889 -227966 139837 7448 -195800 -47843 -55627
6143 -55627 -76479 -38136 50143 -151240 -92757 135177 -116979 117616 12242 -126241 153622
6131 -99456 -251263 -116038 -114853 -207482 -318538 -273437 520354 -240170 1977 -335473 36319
6119 -180932 -170630 -82965 32389 -128848 91012 -24674 -80193 -67634 246681 -26959 -27001 -230689
6107 -230689 -70751 -22821 48546 -17891 -271071 48595 -232815 -179007 45403 65115 -135267
6095 -187487 -61063 -236006 -126906 250097 -57395 102841 -237300 226531 -55286 -173580
6085 -173580 129853 -316484 -366254 278569 -72597 166802 230241 -38124 65776 219508 -52356
6073 107283 46500 -86162 -64308 10842 -148436 -166401 -2155 -282397 165743 78215 252449
6062 252449 138721 66842 12602 -85251 16360 316357 -84372 -201843 62443 -74609 78233
6050 -156753 -173570 4869 -271303 59720 341439 -197450 -259730 225585 -95526 -332829 431117
6038 -125513 -23889 7484 147806 -129664 -248516 -265452 50938 32605 -250087 180882 -38439
6026 -20711 -254751 -115396 286112 -27091 -267156 296276 132919 -349308 156785 60564
6015 19765 202039 107905 -184710 -135010 -169186 10476 115594 241059 185558 239337 -160474
6003 -167228 327503 145829 -77207 259736 -168639 157392 -62787 51653 -100975 238532
5992 -160850 -176344 49339 -106637 -127135 170024 -88986 224402 61976 -46774 20839 29312
5981 29312 -165569 58894 -255135 -84019 -78546 109149 -68899 223344 -147254 -241222 -241403
5970 -241403 107970 63900 -102842 -11678 -98372 282873 -295708 17346 21370 -174969 169851
5958 -50883 301719 -174699 -215810 236641 90332 -206609 38621 -6781 236787 -51560 29151
5946 -113700 322018 94162 -1352 -107883 -80710 -198121 -91791 -8087 93291 -167523 43642
5934 91908 -103063 -230459 -197724 -90299 43777 -58034 -54790 35093 120740 -387587 -209281
5923 -209281 -81636 -90727 32077 9292 38903 -77604 -9378 66567 -272476 -67937 295735 -132871
5910 164205 25676 262316 -8113 -25883 -162889 75283 -23862 -27987 -106780 125501 -95469
5898 270246 -108635 331052 -377544 245074 177036 5406 -8570 -170083 -120154 63440 136512
5887 136512 247907 -146010 263964 59066 239406 -60596 3796 125104 155865 -36534 -224335
5876 -224335 -144580 19883 -134719 102651 -98493 75645 86233 -315759 -40572 -134404 -189207
5865 -189207 106652 -199854 -84015 37349 123617 131067 220089 96613 98948 232533 41097
5853 124588 356041 29021 5006 120987 105713 80145 -87866 -166858 98109 225230 -130917
5841 -181038 79140 -211350 27430 276516 -165785 -10588 -360538 201861 51614 -149697
5830 200731 -154314 190987 108454 -63283 -23498 238704 127925 192458 165684 -66103 -76604
5819 -76604 -202632 -391663 168621 158758 -11252 -8124 238958 -61769 -44977 390544 -128110
5807 -17 -171254 14233 99143 -31653 -4138 -99272 144158 167347 172190 116130 -194386 -172807
5795 -172807 -8945 216183 -240709 -87437 83837 -60755 40434 -9581 -37015 284319 283347 -175987
5782 -70866 -12353 44935 40555 -155852 150912 97448 36313 -380 239673 231485 461977 -376600
5769 -13730 -140442 23140 -93518 20253 26917 -54798 -225247 43114 -176883 -303021 34740
5757 1160 -260967 -4468 320699 -367984 -76245 171927 -106152 -75585 -90419 -270421 29719
5745 -280204 -165444 -9485 207709 191820 66098 -383652 -262927 149966 -5660 46837 222598
5734 222598 285469 -251562 -177926 1835 -304986 2447 -885 -180436 -129133 46073 -33094 144451
5721 -141101 -35759 86570 161171 161282 -21100 -189907 -49646 -6017 -119869 96164 -127500 -26168
5708 -450386 124728 -27069 -117834 -97197 -123064 47056 25769 -37046 261893 -27717 -248933
5697 -248933 81263 -36751 266993 32889 -157853 -124349 33777 -9997 -240180 75729 95237
5686 95237 161812 -68161 128543 141678 -38185 254329 -187520 -237514 -74306 -66699 -75438 46291
5673 -55837 150485 238853 99166 229396 -284260 31400 -171245 105027 -35839 -98882 72871
5661 -127645 -130943 -55677 259308 -78644 95085 67454 55515 -234952 -43465 -92918 57292
5649 190513 62976 169890 -128957 -61224 238780 155082 198645 87512 40029 126964 157310
5638 157310 -140685 -247544 179265 -6779 -16402 170490 273393 8030 -97800 359095 -73751
5626 -142823 -64722 -14766 210730 24621 -70778 -40010 -107605 -14526 -43380 -187571 -58529
5614 87733 -151769 193844 -352025 -60140 -91220 -39735 156281 -5075 -106576 256267 294363
5603 294363 25459 -134406 -326940 -46331 195213 194696 75688 -105141 16850 99649 -443795
5591 -40072 223003 -16956 166248 -150200 216326 -220821 -44695 48005 19549 33071 -254942
5579 -49100 48976 -117880 32089 175665 -91414 187430 -32846 -42839 112017 -48315 46455
5567 -252439 335421 202262 232290 42309 109380 -380663 171816 71345 102577 21854 17929
5556 17929 -175373 -167784 8708 392483 -6234 98053 -15313 341090 -129141 -80366 53933 202579
5544 202579 -211893 351739 230594 68083 175152 131689 41706 -134137 273050 -210849
5533 169489 -303464 -73699 237348 137146 -219491 57396 222719 -14410 -26635 271290
5522 186119 159428 -117576 -97212 68710 145616 -234349 76531 84525 194796 -120815 -143648
5511 -143648 -28010 -79752 -312718 -98614 -260048 -128028 43434 -302739 140447 -284154
5500 -148151 16028 242218 -178116 -132837 166727 90947 -4245 19617 -211183 -287926 -17801
5488 -170937 -70391 -110007 -190335 -118660 165020 141637 -293133 79465 146560 84971 -171420
5476 -53265 22668 79855 325299 -14540 73676 -47006 375675 -49826 313427 -42557 -143192
5465 -143192 -190330 -15767 188822 230892 -231594 -69781 -116296 174334 35717 -3634 -377489
5454 -377489 98377 -101120 -117455 -143066 -858 -153377 182772 297800 -63163 -110772 266739
5442 16054 -77554 -125873 -106512 25940 155817 10035 69825 204228 -55841 299409 -64216
5430 115813 179413 -140783 257539 6487 -2463 50861 47857 101885 -234272 -403126 215813
5418 59069 262982 190413 -2565 19966 -39538 -299429 116692 -43066 -248671 -56084 238838
5406 -125617 6610 173292 59884 169168 -225420 -152631 279478 -6000 133069 19011 139671
5395 139671 49406 74793 -188010 19253 145919 30631 26997 195190 169112 -79998 170507
5383 -159508 56550 -176985 384495 19442 -46365 146651 44278 42907 405076 -316586 -57482
5371 -15991 21819 160972 27881 21263 -106066 -258630 -4111 -24666 4183 -48519 211479 82414
5358 -114488 -106877 72023 190831 -91170 70790 -136259 -58149 -186992 300307 -22177 -112814
5347 -112814 -216830 232164 -1594 -129154 262084 124736 -70813 -353946 196020 205042 50894
5335 -63054 -342763 -187560 82607 -7530 9711 154667 48642 -16741 208552 78761 -54359
5323 -192785 -66154 -197228 -34216 170552 14499 227907 -38564 49461 -212017 221298 -42329
5311 98069 -38260 130259 215846 -110469 244261 -351562 31254 -82137 -99955 252989 419203
5300 419203 278479 254291 -332717 121024 75077 435221 -85746 -369663 -226081 -439930
5290 -439930 -232909 -193447 -5377 -200357 -24709 -399005 -70344 266543 83896 119046 -121899
5278 276346 213332 -231286 -33808 -161179 -252140 35180 -303985 192616 -231502 93788 8909
5266 -414498 -48327 109114 -32463 -134728 63601 232126 -280680 -226729 5702 40403 7331
5254 49889 -25060 -169589 -202244 -91294 -250200 35437 -213050 127000 183328 182592 374421
5243 374421 194541 -282786 -181750 -87360 -122884 -32868 293883 -255195 61978 -86806 397504
5231 -350681 -44650 -378604 -165931 -80981 -283367 262768 -48308 -34196 232133 211983 -37836
5219 322272 97598 4379 63652 74632 334675 -67689 -55164 84806 11887 136496 113919
5208 113919 12581 -155494 55874 184900 12042 -153809 -248097 341474 261198 41172 11264
5196 83463 41771 -242457 -25625 -124189 -43365 164152 -24818 -206148 -77896 -77952 -136569 -133261
5184 -133261 -219947 267939 -69319 47795 -77912 177527 2152 76137 -100951 -5864 -96307
5173 -96307 213105 58134 400 -303330 218721 117626 250252 -488677 -67645 410781 -93951
5161 159916 282191 22613 110702 -310313 -90411 -187186 168947 -34703 51565 -417519 38215
5149 42526 94171 -54405 -168381 240850 -298293 16020 -267198 238949 304059 -63643 69724
5137 -217144 205211 173930 -3257 -24098 264048 14615 245769 -34141 -371910 -73424 -392610
5126 -392610 -13095 335208 -154013 3350 304063 -153115 83349 203639 17611 334030 94291
5114 161485 -66280 21348 -330442 -218938 127963 17628 87989 362632 232640 152338 199392
5103 199392 -93408 114920 -178188 -203615 171889 221456 -154386 -150685 50615 -47662 -196692
5092 -196692 66851 -411571 42070 -186871 109490 -318 103473 49851 172119 -116763 -91898
5081 -91898 -24214 -242959 178066 242930 21485 125538 181291 -28029 -2072 393089 -416640
5069 353300 -169833 240794 -269647 -223470 -282670 -24652 190438 217977 -129194 -94482 192932
5057 89412 53634 -51047 -306113 -206700 -341397 190178 -114586 108301 -162685 112294
5046 -176606 119735 28925 126745 178357 49475 -91813 -119006 85292 -31601 289185 -121804
5034 -71545 80875 -350046 -527030 185848 40976 -448368 -87339 80515 -96418 -106920 149193
5022 231009 18297 27236 6466 -158713 -66557 -108112 -124748 -393804 -297317 87290 -52735 250464
5009 -36887 96605 67168 67353 30225 -17741 172464 -44042 234654 297482 125090 37835 252834
4997 252834 -116284 113047 -64462 -2040 180519 -29301 254024 78929 -188746 -8301 -167653
4986 -167653 -207684 252147 467824 -157213 -184342 -52238 93433 150228 84805 109414 28354
4974 -60842 202334 10022 81281 402922 5832 -449888 -243980 -254356 63133 159741 34784
4962 575807 294308 -170297 -20132 66628 -396955 68894 -267816 40558 -182056 244855
4951 144552 133349 -194851 -208124 -101458 -4923 141820 -53984 -172939 68803 86599 136138
4940 136138 151778 -158799 -175902 -223134 -26987 119667 267879 403022 -55088 305889 -107475
4928 -178967 41601 198682 -130822 75146 193389 238050 -13885 268292 -89084 -102494 -197059
4917 -197059 -260772 -134243 32032 -29037 187880 -161810 -3943 206831 260565 -278524 196665
4905 188733 23795 -112479 -86157 167377 -38187 218746 104734 -79505 255714 -219683
4894 138705 -492571 -176605 -23260 77063 -60086 22530 94372 35995 -141232 -145933 -73290
4883 -73290 136396 -101531 168843 -53413 -166767 84976 168278 253504 91486 -190956 -215840
4872 -215840 209701 210863 -32240 -20146 115541 234660 47940 -138466 211768 310925 94875
4860 -121585 -15141 -70409 44015 99438 -62361 32169 227879 34054 170668 54497 -9347
4848 124524 -49604 -313781 -46148 116240 90014 141216 -3382 -143311 37143 -181324 5058
4836 148754 208258 90647 -212487 123916 157953 -40909 -119057 -43413 -77598 -157217 24767
4824 -101752 145861 146346 217723 134894 232393 -46889 -23679 -22921 -157113 -181632 206915 -93295
4811 396502 350083 98513 439191 -323354 223632 167908 -220677 -144386 -63816 80985 127551
4800 127551 -219528 -131509 -105487 -93144 217671 86310 76570 205260 191698 38085 42932
4789 42932 -161766 -311745 8337 178244 -163935 -98383 177864 41163 243825 257666 98214
4777 112801 394979 -34509 106943 -315261 8125 -94783 -133688 1297 -74779 -29790 -277931
4766 -277931 -149731 -71238 278486 -92091 203984 109254 -81079 -172046 -118260 97547 65817
4755 65817 398098 132301 -172473 -34533 -32048 192570 -168413 11467 -83394 294007 -284427
4743 163639 112431 97605 -81639 -19656 -198401 -262134 31456 -356649 -101851 166136 -49163
4731 -56519 -325599 -94988 -148671 266156 -44821 -19310 119864 13425 127059 226070 -115246
4719 -205285 -9374 -109036 104981 150353 156810 -169615 -24070 183736 -295090 210358 64371
4707 -46384 436772 292671 124248 -212051 3459 -69444 -215638 94085 56277 -300792 334471
4695 139015 -219120 191802 -204250 171044 199181 -209542 -192616 -244923 3439 -260978 -218229
4684 -218229 -200720 217441 134408 -110118 445837 322907 114779 413647 47487 -74218
4673 352984 174224 161110 105939 -26516 295072 -52825 388644 -36631 184462 172022 -119171
4661 398056 53362 -148178 -139271 42507 328166 307880 219100 33281 -146151 -118820 44888
4649 -86114 250893 -128494 -21022 -19125 -9950 38125 172356 55035 276626 20318 21954 141726
4637 141726 -88888 -287872 465850 -51002 429373 105365 -239887 -141178 177336 -59884
4626 115899 -132678 233763 11616 -337191 -29635 -140374 -41068 -26097 -351178 -92379 -137572
4615 -137572 43717 -124285 299960 -28765 14765 -127902 -22354 21514 -176821 -119348 246707
4603 41645 121164 114899 92271 414914 226695 -109996 376872 7640 -246560 32664 17020
4592 17020 145652 -87247 192108 113812 -83883 4939 354644 -115714 22034 -27484 -104251
4581 -104251 110923 537510 128168 48295 -83812 14350 2501 -109387 -29803 40007 286499
4570 286499 165417 -307774 -61859 -143644 -83473 328585 -76727 68272 72618 345934 -208953
4558 -140749 136812 187924 124561 -25943 -47552 -91850 -66826 -189331 -4367 129572 -204425
4546 -79270 53587 -141307 -107115 -80812 290049 -28038 191021 59302 -159643 -165085 -26539
4534 68933 -10973 -245661 233598 47785 198166 -37430 2820 205490 -142472 272589 -3244
4522 -18037 -256967 46884 -207734 127290 -141582 133865 174626 2699 -9814 -199313 163034
4510 -122116 48597 339994 291351 -136784 214074 -88787 36501 133645 -340940 284906 -43787
4498 172756 -97804 -245063 -9190 193997 -150148 165144 -9588 -1818 143814 -134973 -22121
4486 105660 -38763 174549 41622 123913 35144 -58265 -117580 187070 30953 -441545 88956
4474 -90015 54418 -87321 303262 -65166 10016 -361209 60701 -95155 -205829 -187450 25934
4462 -116698 211895 -135167 -141588 -140566 113399 -4507 -54562 -357324 193023 11765 -161766
4450 47835 125765 -39139 -85500 -235403 110685 213108 32465 107530 385575 -9534 -53325
$$ [...]
##END NTUPLES=NMR SPECTRUM
##END=
