##TITLE=NES1010_Conilon_9232912_cuLHfhc4Ys
##JCAMPDX= 6.0         $$ Bruker NMR JCAMP-DX V2.0
##DATA TYPE= NMR SPECTRUM
##DATA CLASS= NTUPLES
##ORIGIN= BRUKER
##OWNER= Administrator
$$ 1.72 TOPSPIN		Version 2.1
$$ 2015-07-02 05:31:10.539 -0700  Administrator@X
$$ Compression mode = diff/dup
##.OBSERVE FREQUENCY= 400.02188249412
##.OBSERVE NUCLEUS= ^1H
##.ACQUISITION MODE= SIMULTANEOUS (DQD)
##.ACQUISITION SCHEME= undefined
##.AVERAGES= 64
##.DIGITISER RES= 22
##SPECTROMETER/DATA SYSTEM= spect
##.PULSE SEQUENCE= noesygpps1d.comp
##.SOLVENT NAME= COFFEE_meoh
##.SHIFT REFERENCE= INTERNAL, COFFEE_meoh, 1, 14.9645
##AUDIT TRAIL= $$ (NUMBER, WHEN, WHO, WHERE, PROCESS, VERSION, WHAT)
$$ ##TITLE= Audit trail, TOPSPIN		Version 2.1
$$ ##JCAMPDX= 5.01
$$ ##ORIGIN= Bruker BioSpin GmbH
$$ ##OWNER= Administrator
$$ $$ E:\/data/COFFEE/nmr/NES1010_Conilon_9232912_cuLHfhc4Ys/22/pdata/1/auditp.txt
$$ ##AUDIT TRAIL=  $$ (NUMBER, WHEN, WHO, WHERE, PROCESS, VERSION, WHAT)
(   1,<2015-07-02 05:31:05.055 -0700>,<Administrator>,<X>,<go>,<TOPSPIN 2.1>,
      <created by zg
	started at 2015-07-02 05:19:35.617 -0700,
	POWCHK enabled, PULCHK disabled,
       configuration hash MD5:
       21 0F 79 D6 B3 7B B4 F6 88 20 88 DB 03 48 BD 9F
       data hash MD5: 64K
       61 EF F0 68 2C BF 01 21 8E 51 5A 79 BD 6C 37 B7>)
(   2,<2015-07-02 05:31:08.461 -0700>,<Administrator>,<X>,<proc1d>,<TOPSPIN 2.1>,
      <Start of raw data processing
       efp LB = 0.3 FT_mod = 6 PKNL = 1 PHC0 = 0 PHC1 = 0 SI = 128K 
       data hash MD5: 128K
       1C 19 36 B4 85 28 67 09 13 F4 10 7E CC 5E A2 81>)
(   3,<2015-07-02 05:31:09.352 -0700>,<Administrator>,<X>,<proc1d>,<TOPSPIN 2.1>,
      <pk PHC0 = -84.70459 PHC1 = 0 
       data hash MD5: 128K
       43 CD 67 92 44 62 F1 08 A6 1B 0D 95 D8 0C 12 0A>)
(   4,<2015-07-02 05:31:09.758 -0700>,<Administrator>,<X>,<proc1d>,<TOPSPIN 2.1>,
      <abs ABSG = 1 
       data hash MD5: 128K
       AE 9E 51 6D 83 27 6D 92 59 0E 3D FE 02 B0 B0 E2>)
(   5,<2015-07-02 05:31:09.852 -0700>,<Administrator>,<X>,<proc1d>,<TOPSPIN 2.1>,
      <abs ABSG = 2 
       data hash MD5: 128K
       71 46 9A E3 F0 B0 F8 F5 26 EA 39 BB 08 73 95 1C>)
(   6,<2015-07-02 05:31:09.930 -0700>,<Administrator>,<X>,<proc1d>,<TOPSPIN 2.1>,
      <abs ABSG = 3 
       data hash MD5: 128K
       1E C6 25 C3 39 9A 15 83 A3 34 A0 70 96 61 2B 3E>)
(   7,<2015-07-02 05:31:10.039 -0700>,<Administrator>,<X>,<proc1d>,<TOPSPIN 2.1>,
      <abs ABSG = 4 
       data hash MD5: 128K
       DB D1 76 27 CA 02 48 BA DE 1B 2A 5D AE EC C0 EC>)
(   8,<2015-07-02 05:31:10.149 -0700>,<Administrator>,<X>,<proc1d>,<TOPSPIN 2.1>,
      <abs ABSG = 5 
       data hash MD5: 128K
       F2 97 14 45 6A E8 77 47 99 02 F1 B3 47 C3 3A 93>)
$$ ##END=
$$ 
$$ $$ hash MD5
$$ $$ EE 23 D9 6F 1A A9 A8 8F 78 55 CE C1 73 50 CA E0
##$RELAX= 
##$RELAX= 
##$RELAX= 
##$RELAX= 
##$RELAX= 
##$RELAX= 
##$RELAX= 
##$RELAX= 
$$ Bruker specific parameters
$$ --------------------------
##$DU= <E:\>
##$EXPNO= 22
$$ [...]
150 150 150 150 150 150 150 150
##$TP07= 0
##$TPNAME0= <>
##$TPNAME1= <>
##$TPNAME2= <>
##$TPNAME3= <>
##$TPNAME4= <>
##$TPNAME5= <>
##$TPNAME6= <>
##$TPNAME7= <>
##$TPOAL= (0..7)
0.5 0.5 0.5 0.5 0.5 0.5 0.5 0.5
##$TPOFFS= (0..7)
0 0 0 0 0 0 0 0
##$TUNHIN= 0
##$TUNHOUT= 0
##$TUNXOUT= 0
##$USERA1= <user>
##$USERA2= <user>
##$USERA3= <user>
##$USERA4= <user>
##$USERA5= <user>
##$V9= 5
##$VALIST= <valist>
##$VCLIST= <CCCCCCCCCCCCCCC>
##$VD= 0
##$VDLIST= <DDDDDDDDDDDDDDD>
##$VPLIST= <PPPPPPPPPPPPPPP>
##$VTLIST= <TTTTTTTTTTTTTTT>
##$WBST= 2048
##$WBSW= 25
##$XGAIN= (0..3)
0 0 0 0
##$XL= 0
##$YL= 0
##$YMAX_a= 5579565
##$YMIN_a= -12112144
##$ZGOPTNS= <>
##$ZL1= 120
##$ZL2= 120
##$ZL3= 120
##$ZL4= 120
##$ABSF1= 14.9645
##$ABSF2= -5.593681
##$ABSG= 5
##$ABSL= 3
##$ALPHA= 0
##$AQORDER= 0
##$ASSFAC= 0
##$ASSFACI= 0
##$ASSFACX= 0
##$ASSWID= 0
##$AUNMP= <proc_prof1d_extract.lims>
##$AXLEFT= 0
##$AXNAME= <>
##$AXNUC= <1H>
##$AXRIGHT= 0
##$AXTYPE= 0
##$AXUNIT= <>
##$AZFE= 0.1
##$AZFW= 0.1
##$BCFW= 0
##$BC_mod= 0
##$BYTORDP= 0
##$COROFFS= 0
##$CY= 15
##$DATMOD= 1
##$DC= 0
##$DFILT= <>
##$DTYPP= 0
##$F1P= 0
##$F2P= 0
##$FCOR= 0.5
##$FTSIZE= 131072
##$FT_mod= 6
##$GAMMA= 0
##$GB= 0
##$INTBC= 1
##$INTSCL= 1
##$ISEN= 128
##$LB= 0.3
##$LEV0= 0
##$LPBIN= 0
##$MAXI= 10000
##$MC2= 0
##$MEAN= 0
##$ME_mod= 0
##$MI= 0
##$NCOEF= 0
##$NC_proc= -2
##$NLEV= 6
##$NOISF1= 0
##$NOISF2= 0
##$NSP= 0
##$NTH_PI= 0
##$NZP= 0
##$OFFSET= 14.9645
##$PC= 1
##$PHC0= -84.70459
##$PHC1= 0
##$PH_mod= 1
##$PKNL= yes
##$PPARMOD= 0
##$PPDIAG= 0
##$PPIPTYP= 0
##$PPMPNUM= 2147483647
##$PPRESOL= 1
##$PSCAL= 4
##$PSIGN= 0
##$PYNMP= <proc.py>
##$REVERSE= no
##$SF= 400.020008236809
##$SI= 131072
##$SIGF1= 0
##$SIGF2= 0
##$SINO= 400
##$SIOLD= 131072
##$SPECTYP= <>
##$SREGLST= <1H.CDCl3>
##$SSB= 0
##$STSI= 131072
##$STSR= 0
##$SW_p= 8223.68421052631
##$SYMM= 0
##$S_DEV= 0
##$TDeff= 65536
##$TDoff= 0
##$TI= <>
##$TILT= no
##$TM1= 0
##$TM2= 0
##$TOPLEV= 0
##$USERP1= <user>
##$USERP2= <user>
##$USERP3= <user>
##$USERP4= <user>
##$USERP5= <user>
##$WDW= 1
##$XDIM= 131072
##$YMAX_p= 391348027
##$YMIN_p= -10731
##$CURPLOT= <Network HP LaserJet P1505>
##$CURPRIN= <$Network HP LaserJet P1505>
##$DFORMAT= <normdp>
##$LAYOUT= <+/1D_H.xwp>
##$LFORMAT= <normlp>
##$PFORMAT= <normpl>
##$SURQMSG= 1
$$ End of Bruker specific parameters
$$ ---------------------------------
##NTUPLES= NMR SPECTRUM
##VAR_NAME=  FREQUENCY,     SPECTRUM/REAL,   SPECTRUM/IMAG
##SYMBOL=    X,             R,               I
##VAR_TYPE=  INDEPENDENT,   DEPENDENT,       DEPENDENT
##VAR_FORM=  AFFN,          ASDF,            ASDF
##VAR_DIM=   131072,        131072,          131072
##UNITS=     HZ,            ARBITRARY UNITS, ARBITRARY UNITS
##FACTOR=    0.0627417313425164, 1,          1
##FIRST=     8223.62146879497, -1788,        -36281
##LAST=      0,             -76,             -36691
##MIN=       0,             -10731,          0
##MAX=       8223.62146879497, 391348027,    0
$$ Real data points
##PAGE= N=1
##DATA TABLE= (X++(R..R)), XYDATA
$$ [...]
63568B78430r56j057p90l12P3L80O71P78O91P95J234J496J077K59l01m60n49p60
63550B80699r76j015o86J29J140J669J328M39n01j434k522l830n399p142q379
63535B53520q151o530m926m514m941n187n024m796m386l463k368j793j731j659
63521A94051j501j559j729j626j361j361j547j489j209j022p59o3P34J035J106
63506A81700J664K447K403J498J028J762K978L835M547N464O025N618M791M621
63492B30381N169N484M866L484J826K21j138k146k861l397l769l964m036m006
63478B26114l873l744l712l504k691j387l48q4k24o3O37J627K633L402L622L249
63462B21654K835L086M062N085N519N366N069M974N174N744O790Q184R415J0011
$$ y = [278430, 277474, 276417, 275627, 275315, 275388, 275768, 276439, 277217, 277908, 278703, 279937, 281433, 282510, 282769, 282468, 282008, 281459, 280699, 279723, 278708, 278022, 278151, 279291, 280960, 282288, 282727, 282226, 280792, 278270, 274440, 269041, 261899, 253520, 245369, 238839, 233913, 229399, 224458, 219271, 214247, 209451, 205065, 201602, 199234, 197441, 195710, 194051, 192550, 190991, 189262, 187636, 186275, 184914, 183367, 181878, 180669, 179647, 178888, 178825, 179559, 180594, 181700, 183364, 185811, 188214, 189712, 190740, 192502, 195480, 199315, 203862, 209326, 215351, 220969, 225760, 230381, 235550, 241034, 245900, 249384, 251210, 251431, 250293, 248147, 245286, 241889, 238120, 234156, 230120, 226114, 222241, 218497, 214785, 211281, 208590, 207203, 206855, 206771, 206547, 206484, 207121, 208748, 211381, 214783, 218405, 221654, 224489, 227575, 231637, 236722, 242241, 247607, 252676, 257650, 262824, 268568, 275358, 283542, 292957, 302968]
63448C02968R952R475Q569P041N110L382K198J419R99J108J449J223K93l12K12
63433C55086J200J547J443J884K798K933J676k02j850l297m700n621n651n106
63419C42140m591m363m358m433m227l411k317j724j757j662r07J06Q19J281J770
63404C12366K288K943M106N669O677O453N564N103N392N998O610P173P478P365
63390C91185P171P356P745P710P000N867M510K976J529N09j94r64j735j927j354
63375D37384o72n61q70q77l13L14L99j04r13k032l677n568o827o922o401o185
63359C96175o391o397n925n440n373n612n852n922n587m649l491k933l135l274
63345C26194k747k081k050k449k468j974j574j528j429j072r31j440k244k574
$$ y = [302968, 312920, 322395, 330964, 338005, 343115, 346497, 348695, 350114, 351113, 352221, 353670, 354893, 355186, 354874, 355086, 356286, 357833, 359276, 361160, 363958, 366891, 368567, 368365, 366515, 363218, 358518, 352897, 347246, 342140, 337549, 333186, 328828, 324395, 320168, 316757, 314440, 312716, 310959, 309297, 308390, 308496, 309315, 310596, 312366, 314654, 317597, 321703, 327372, 334049, 340502, 346066, 351169, 356561, 362559, 369169, 376342, 383820, 391185, 398356, 405712, 413457, 421167, 428167, 434034, 438544, 441520, 443049, 443558, 443364, 442400, 440665, 438738, 437384, 436712, 436151, 435281, 434404, 434091, 434405, 434804, 434700, 433787, 431755, 428078, 422510, 415683, 408761, 402360, 396175, 389784, 383387, 377462, 372022, 366649, 361037, 355185, 349263, 343676, 339027, 335536, 332603, 329468, 326194, 323447, 321366, 319316, 316867, 314399, 312425, 310851, 309323, 307894, 306822, 305891, 304451, 302207, 299633]
63331B99633k231j837k089k948l654l567k828k045j518j162j061j586k739l840
63317B66528m173l684k784j837j126r85j480k143k392k136j709j386j285j499
63303B37909j950k210j889j167o36n89p22n35J15Q17Q78n5j453k258j968j179
63287B23108q27j110j493j565j400j129o85j22J45k67j185j915j811q30M34J250
63271B10598J317Q56K45l02o84q00o00j24N23J144J419J138N10J1j22l1J32L74
63253B15604O62Q85J088J346J337N83o53j342r31o3L83N21R86J675J838J334R38
63236B26191J178J603J634J524J938K871L639L819L721L799M005M027L890L977
63222B67816M401M771M686M241L872L853M124M452M554M244L745L643M174M737
$$ y = [299633, 297402, 295565, 293476, 290528, 286874, 283307, 280479, 278434, 276916, 275754, 274693, 273107, 270368, 266528, 262355, 258671, 255887, 254050, 252924, 251939, 250459, 248316, 245924, 243788, 242079, 240693, 239408, 237909, 235959, 233749, 231860, 230693, 230057, 229468, 228746, 228211, 228326, 229143, 230021, 229966, 228513, 226255, 224287, 223108, 222281, 221171, 219678, 218113, 216713, 215584, 214899, 214777, 214922, 214655, 213470, 211555, 209744, 208914, 209348, 210598, 211915, 212771, 213016, 212714, 212030, 211230, 210630, 210506, 211029, 212173, 213592, 214730, 215240, 215251, 215129, 215098, 215230, 215604, 216266, 217151, 218239, 219585, 220922, 221505, 220852, 219510, 218579, 218516, 218899, 219420, 220406, 222081, 223919, 225253, 226191, 227369, 228972, 230606, 232130, 234068, 236939, 240578, 244397, 248118, 251917, 255922, 259949, 263839, 267816, 272217, 276988, 281674, 285915, 289787, 293640, 297764, 302216, 306770, 311014, 314759, 318402, 322576, 327313]
63208C27313M521L649L157L750M993N876N860N191M510M312M622N052N201N015
63194C93022M564L745K627J854K109L137L938M043L985M314M787M979N104N676
63180D47884O625P277P241O920P170Q447J0263J1514J1655J1381J1793J2960J3918
63167E75048J4114J4035J4166J4103J3243J1854J0828J0691J1242J1899J2062
63156G13285J1361R917Q238O693N290L881K215j43l281o367q322r251j0257j1661
63142G11598j2422j1828j0725j0266j0297r934r092q407q116p877p482o907o057
63129E92188n091m598m731m705l915l040l083l785m021l401k425j374k19N99N60
63114E48959J83N75J768K658K735K704L042L162K578J907J939K451K641K362K199
$$ y = [327313, 331834, 335483, 338640, 342390, 347383, 353259, 359119, 364310, 368820, 373132, 377754, 382806, 388007, 393022, 397586, 401331, 403958, 405812, 407921, 411058, 414996, 419039, 423024, 427338, 432125, 437104, 442208, 447884, 454509, 461786, 469027, 475947, 483117, 491564, 501827, 513341, 524996, 536377, 548170, 561130, 575048, 589162, 603197, 617363, 631466, 644709, 656563, 667391, 678082, 689324, 701223, 713285, 724646, 734563, 742801, 749494, 754784, 758665, 760880, 760737, 757456, 751089, 742767, 733516, 723259, 711598, 699176, 687348, 676623, 666357, 656060, 646126, 637034, 628627, 620511, 612634, 605152, 598245, 592188, 587097, 582499, 577768, 573063, 569148, 566108, 563025, 559240, 555219, 551818, 549393, 548019, 547800, 548399, 548959, 549142, 549717, 551485, 554143, 556878, 559582, 562624, 565786, 568364, 570271, 572210, 574661, 577302, 579664, 581863]
63099E81863K596L392M099M356M135L679L227K811K444K204K017J598J006Q08
63085F20235J215J494R62N1l41k39k80m17j82nr16k755m083m265m293m966n565
63068E95650n181m276l885m058m085l678k975j942p09n1n39j438j425l05Q57J241
63052E63201J101J047J248J616K071K386K190J483P87N32M48j02j210k099j979
63037E72720j070n80j355k857l827l783l371l253l321l257l218l512l985m240
63023E31091m235m194m150l964l655l296k717j781q42m64n86m91K03R35R74N61
63007E03389P21J854L015K985J902J268K287M632P061Q750R692J0170J0462J0896
62993E79084J1616J2327J2652J2755J3125J3856J4562J5021J5379J5693J5794
$$ y = [581863, 584459, 587851, 591950, 596306, 600441, 604120, 607347, 610158, 612602, 614806, 616823, 618421, 619427, 620235, 621450, 622944, 623906, 623957, 623616, 623377, 623097, 622680, 622498, 622493, 621577, 618822, 614739, 610474, 606181, 601215, 595650, 590469, 586193, 582308, 578250, 574165, 570487, 567512, 565570, 564861, 564810, 564271, 562833, 561408, 561103, 561960, 563201, 564302, 565349, 566597, 568213, 570284, 572670, 574860, 576343, 577130, 577662, 578110, 578008, 576798, 574699, 572720, 571650, 571070, 569715, 566858, 563031, 559248, 555877, 552624, 549303, 546046, 542828, 539316, 535331, 531091, 526856, 522662, 518512, 514548, 510893, 507597, 504880, 503099, 502257, 501793, 501207, 500716, 500919, 501854, 502828, 503389, 504110, 505964, 508979, 511964, 513866, 515134, 517421, 522053, 529114, 537864, 547556, 557726, 568188, 579084, 590700, 603027, 615679, 628434, 641559, 655415, 669977, 684998, 700377, 716070, 731864]
62982G31864J5688J5541J5194J4245J2847J1796J1524J1397J0483Q621O347L985
62970H69532J290k041n833r576j3031j6506k0292k3856k6069k6621k6716k7740
62958F72541k9457l0330k9561k7915k6393k4982k3132k0826j8587j6833j5648
62947D08877j4871j4161j3215j2135j1315j0824j0298r506q590p626o506n396
62935B84434m691m345l886l294l109l423l579l264l050l286l290k486j530j403
62921B39798j878k028j741j697k022k112j772j502j488j313q97q57j449j949j627
62906B15466q48n63j020j548j543j159r35j041j175j053p67n39l49p8J15L3J8
62889B03014Q14K496M053M446L738K772K040J429Q63M89K51j35n62m75L29J215
$$ y = [731864, 747552, 763093, 778287, 792532, 805379, 817175, 828699, 840096, 850579, 859200, 865547, 869532, 870822, 868781, 862948, 853372, 840341, 823835, 803543, 779687, 753618, 726997, 700281, 672541, 643084, 612754, 583193, 555278, 528885, 503903, 480771, 459945, 441358, 424525, 408877, 394006, 379845, 366630, 354495, 343180, 332356, 322058, 312552, 303962, 296336, 289830, 284434, 279743, 275398, 271512, 268218, 265109, 261686, 258107, 254843, 251793, 248507, 245217, 242731, 241201, 239798, 237920, 235892, 234151, 232454, 230432, 228320, 226548, 225046, 223558, 222245, 221348, 220491, 219042, 217093, 215466, 214618, 214055, 213035, 211487, 209944, 208785, 207850, 206809, 205634, 204581, 203814, 203275, 202926, 202848, 202963, 202996, 203014, 203828, 206324, 210377, 214823, 218561, 221333, 223373, 224802, 225665, 226154, 226405, 226270, 225708, 225233, 225562, 226777]
62873B26777J287L70q75j656j733j518j553j971k401k383j813r98m19m12r28j494
62857B08280j613j295j021j056j083o82P3P22R31O67R5m49n75j89L23N35M68M24
62839B04555N58Q41J313J930K305J994J128M40N21J173J677J555J008O03O73J042
62823B23316J357J464J389J127P56N65P15R02P58N44Q17J379J303K43r28j248
62807B34459q57n71p19j071j550k278l078l541l608l598l599l300k489j467q08
62792B01925p79j019p89J95J194J164K08l10M89J798K252J767J398J668K034K020
62776B15215J938K243K835L429M031M626M756L878K079J45j082j355j113r50j035
62761B39640j101r90r62j334k118l126m100m552l987k751k125k927m309m703l761
$$ y = [226777, 228064, 228434, 227559, 225903, 224170, 222652, 221099, 219128, 216727, 214344, 212531, 211533, 211114, 210702, 209774, 208280, 206667, 205372, 204351, 203295, 202212, 201530, 201603, 202325, 203256, 203923, 204018, 203569, 202994, 202805, 203128, 203663, 204131, 204555, 205113, 205954, 207267, 209197, 211502, 213496, 214624, 215064, 215585, 216758, 218435, 219990, 220998, 221601, 222274, 223316, 224673, 226137, 227526, 228653, 229409, 229974, 230689, 231591, 232349, 232893, 233710, 235089, 236392, 236635, 235707, 234459, 233602, 233031, 232312, 231241, 229691, 227413, 224335, 220794, 217186, 213588, 209989, 206689, 204200, 202733, 201925, 201146, 200127, 199338, 199533, 200727, 201891, 202099, 201789, 202278, 204076, 206328, 208095, 209493, 211161, 213195, 215215, 217153, 219396, 222231, 225660, 229691, 234317, 239073, 242951, 245030, 245175, 244093, 242738, 241625, 240675, 239640, 238539, 237549, 236587, 235253, 233135, 230009, 225909, 221357, 217370, 214619, 212494, 209567, 205258, 200555, 196794]
62746A96794k561j972j774j510j267j153p79J03R40R82L14k84l38j15q9l65o97
62729A86229q09o10k06K47O96J146J540J780J892K051K373K791L161L409L607
62714B09297L957M605N366N829N852N788O049O677P623R093J1111J3044J4200
62701C08491J4930J6363J8916K1629K3360K4056K4486K5209K6342K7888K9657
62690E61327L0955L1071L0044K8456K6422K3370J9008J3929Q846L703j911p733
62678G67487j2870j6836j9909k2421k4316k5629k6741k7705k7927k7120k6065
62667E09948k5626k5355k4074k1721j9564j8396j7535j6072j4196j2679j1732
62656C02998j1072j0548j0035r122p644o190n373m928m193l209k609k570k667
$$ y = [196794, 194233, 192261, 190487, 188977, 187710, 186557, 185778, 185881, 186821, 187803, 188117, 187833, 187495, 187380, 187291, 186926, 186229, 185420, 184810, 184604, 184851, 185547, 186693, 188233, 190013, 191905, 193956, 196329, 199120, 202281, 205690, 209297, 213254, 217859, 223225, 229054, 234906, 240694, 246743, 253420, 261043, 270136, 281247, 294291, 308491, 323421, 339784, 358700, 380329, 403689, 427745, 452231, 477440, 503782, 531670, 561327, 592282, 623353, 653397, 681853, 708275, 731645, 750653, 764582, 773428, 777131, 775220, 767487, 754617, 737781, 717872, 695451, 671135, 645506, 618765, 591060, 563133, 536013, 509948, 484322, 458967, 434893, 413172, 393608, 375212, 357677, 341605, 327409, 314730, 302998, 291926, 281378, 271343, 262221, 254577, 248387, 243014, 238086, 233893, 230684, 228075, 225505, 222838]
62643B22838k635k591k498k175j866k089k782l172k726j767r85p51j002j392j444
62628A92963r43k84r4m54q84j049j052r46n43J35O63P13M77L43M82Q09J094J074
62610A92504O86L16M34R65J299J082O07L56M83Q82J384J758J745J352Q91O57P18
62593B08119J005J414J747J810J604J277R61P59P73R05Q51N88N81J138J766J764
62577B27062J246R53J122J216Q01R4n20q45p00p2L73k75j943l392l672l188k832
62560B15428k689k242j445q42p56r24r96r77j071j378j782k009j808j187m16J73
62544A95079L01k20j250k102j970p82O11J328J283J017J022J400J951K339K366
62529B02373K265K515L212L900M162M143M177M235M097L994M609O323Q646J0597
$$ y = [222838, 220203, 217612, 215114, 212939, 211073, 208984, 206202, 203030, 200304, 198537, 197552, 196801, 195799, 194407, 192963, 192020, 191736, 191642, 191188, 190304, 189255, 188203, 187257, 186714, 186849, 187512, 188225, 188702, 189045, 189527, 190336, 191430, 192504, 193190, 193506, 193940, 194905, 196204, 197286, 197893, 198249, 198732, 199614, 200998, 202756, 204501, 205853, 206744, 207401, 208119, 209124, 210538, 212285, 214095, 215699, 216976, 217937, 218696, 219469, 220374, 221225, 221813, 222394, 223532, 225298, 227062, 228308, 229261, 230383, 231599, 232400, 232494, 231974, 231129, 230429, 230357, 230730, 230455, 228512, 225120, 221448, 218260, 215428, 212739, 210497, 209052, 208210, 207454, 206530, 205534, 204557, 203486, 202108, 200326, 198317, 196509, 195322, 194906, 195079, 195380, 195160, 193910, 191808, 189838, 189056, 189667, 190995, 192278, 193295, 194317, 195717, 197668, 200007, 202373, 204638, 207153, 210365, 214265, 218427, 222570, 226747, 230982, 235079, 239073, 243682, 250005, 258651, 269248]
62515B69248J1571J1775J1842J2149J2658J3262J4033J4999J5932J6565J6801
62504D20835J6540J5548J3743J1334Q501N216J714j292l401n206p567j0367j2572
62491D53026j3456j3204j2439j1732j1501j1682j1531j0366q519p022o385o282
62479C28907o289o145n411l802j952r13p53n34J13N30L65K53O02Q15L97j31k22
62462C05830l42j064j857j841j188p32o52n61n32r71j651j836j365p39k00L83
62446B90682P90N97J30L70J559K730L123L343M524O718Q780R680R493R043Q974
62431C60536R385J0144J1152J2272J3194J3714J3966J4115J3964J3223J2113J1090
62419E08868R971P981M947J813l67j502k171k812l581m548n465n800n378m682
$$ y = [269248, 280819, 292594, 304436, 316585, 329243, 342505, 356538, 371537, 387469, 404034, 420835, 437375, 452923, 466666, 478000, 486501, 491717, 493431, 492139, 488738, 483532, 475965, 465598, 453026, 439570, 426366, 413927, 402195, 390694, 379012, 367481, 357115, 348596, 341574, 335189, 328907, 322618, 316473, 311062, 307260, 305308, 304395, 303642, 303108, 303221, 303751, 304116, 304369, 304971, 305786, 306183, 306052, 305830, 305488, 304424, 302567, 300726, 299538, 298806, 298154, 297593, 297061, 296090, 294439, 292603, 291238, 290499, 290299, 290682, 291472, 292069, 292199, 292569, 294128, 296858, 299981, 303324, 307848, 314566, 323346, 333026, 342519, 351562, 360536, 369921, 380065, 391217, 403489, 416683, 430397, 444363, 458478, 472442, 485665, 497778, 508868, 518839, 526820, 531767, 533580, 533213, 531711, 529540, 526728, 523147, 518599, 513134, 507334, 501956, 497274]
62405D97274m054l129j593J02J399K598M329O442Q207R385J0329J1278J2367J4057
62391E68991J6660J9488K1538K2984K5058K8153L1148L2959L3951L5106L6455
62380H72491L7079L6337L4462L2036K9355K6404K3055J9202J4730R549L780k023
62368A136457p086j1088j4415j7502k0036k1316k1277k0725k0541k0955k1703
62357I39813k2403k2746k2574k1913k0808j9223j7237j5117j2871j0054o568l356
62345G44943j598j205q38M67K406M249N817P223Q245Q501P931O664M715K251j13
62330G99658j761k722l600m945o866r101j1169j2535j2983j2766j2303j1731j0899
62317F86277r722q380p210o412n812m895l308j383K2L63m7l70o7P63J654K276
$$ y = [497274, 493220, 490091, 488498, 488600, 489999, 492597, 496926, 503368, 511575, 520960, 531289, 542567, 554934, 568991, 585651, 605139, 626677, 649661, 674719, 702872, 734020, 766979, 800930, 836036, 872491, 909570, 945907, 980369, 1012405, 1041760, 1068164, 1091219, 1110421, 1125151, 1134700, 1138480, 1136457, 1129371, 1118283, 1103868, 1086366, 1066330, 1045014, 1023737, 1003012, 982471, 961516, 939813, 917410, 894664, 872090, 850177, 829369, 810146, 792909, 777792, 764921, 754867, 748299, 744943, 743345, 742140, 741302, 741769, 744175, 748424, 754241, 761464, 769709, 778210, 786141, 792805, 797520, 799771, 799658, 797897, 795175, 791575, 786630, 779764, 770663, 759494, 746959, 733976, 721210, 708907, 697176, 686277, 676555, 668175, 660965, 654553, 648741, 643846, 640538, 639155, 639177, 639540, 639493, 639123, 639056, 639819, 641473, 643749]
62301F43749K698L167L644L790L561L613M603O150P135P155P076P767Q848R431
62287G22387R602J0350J2017J3766J4849J5642J6855J8359J9516K0394K1743K3765
62275I19245K5683K6828K7506K8291K8959K8705K7200K4901K2381J9873J7453
62264A197025J5195J3080J1048R215P718O386M926L335J794K01j642l393m372
62251A260516m459m226l978l399k438j798j934k215j829j040p33r62q89j10P62
62236A231268J104J168J563K342L019L302L408L651M055M502N089O088P372Q247
62222A286178Q226P883Q387J0076J1962J2945J3004J2905J3171J3870J5025J6648
62210A430280J8450K0015K1254K2349K3383K4276K5031K5680K6128K6244K6026
$$ y = [643749, 646447, 649614, 653258, 657048, 660609, 664222, 668825, 674975, 682110, 689265, 696341, 704108, 712956, 722387, 731989, 742339, 754356, 768122, 782971, 798613, 815468, 833827, 853343, 873737, 895480, 919245, 944928, 971756, 999262, 1027553, 1056512, 1085217, 1112417, 1137318, 1159699, 1179572, 1197025, 1212220, 1225300, 1236348, 1245563, 1253281, 1259667, 1264593, 1267928, 1269722, 1269923, 1268281, 1264888, 1260516, 1256057, 1251831, 1247853, 1244454, 1242016, 1240218, 1238284, 1236069, 1234240, 1233200, 1232467, 1231505, 1230616, 1230506, 1231268, 1232372, 1233540, 1235103, 1237445, 1240464, 1243766, 1247174, 1250825, 1254880, 1259382, 1264471, 1270559, 1277931, 1286178, 1294404, 1302287, 1310674, 1320750, 1332712, 1345657, 1358661, 1371566, 1384737, 1398607, 1413632, 1430280, 1448730, 1468745, 1489999, 1512348, 1535731, 1560007, 1585038, 1610718, 1636846, 1663090, 1689116]
62199A689116K5480K4569K3461K2495K1685K0639J9291J8210J7895J8207J8969
62188A920017K0488K2804K4982K6002K6103K6338K7012K7472K7310K6778K5936
62177B201242K4360K1975J9486J7487J5822J4022J1995R971Q135O514M882K789
62165B358680M8k799m976o364p474q564r407r885j0087r866r024q115q190r394
62151B254583j0506j0395r361q588q678r233r517r125q267p640p801q430q565
62138B138477p800o852o646p178p692p687p400p346p758q429q990r295r511r791
62124B026102j0044j0222j0583j1272j1833j1718j1186j1092j1722j2484j2819
62113A901127j2852j2918j3026j3044j2945j2679j2204j1807j1809j1899j1328
$$ y = [1689116, 1714596, 1739165, 1762626, 1785121, 1806806, 1827445, 1846736, 1864946, 1882841, 1901048, 1920017, 1940505, 1963309, 1988291, 2014293, 2040396, 2066734, 2093746, 2121218, 2148528, 2175306, 2201242, 2225602, 2247577, 2267063, 2284550, 2300372, 2314394, 2326389, 2336360, 2344495, 2351009, 2355891, 2358680, 2358728, 2355929, 2350953, 2344589, 2337115, 2328551, 2319144, 2309259, 2299172, 2289306, 2280282, 2272167, 2263977, 2254583, 2244077, 2233682, 2224321, 2215733, 2207055, 2197822, 2188305, 2179180, 2170913, 2163273, 2155472, 2147042, 2138477, 2130677, 2123825, 2117179, 2110001, 2102309, 2094622, 2087222, 2079876, 2072118, 2063689, 2054699, 2045404, 2035893, 2026102, 2016058, 2005836, 1995253, 1983981, 1972148, 1960430, 1949244, 1938152, 1926430, 1913946, 1901127, 1888275, 1875357, 1862331, 1849287, 1836342, 1823663, 1811459, 1799652, 1787843, 1775944, 1764616]
62102A764616j0003q694p951p467o811o059n247l959k081l45M77N35M17K15k34
62087A707409o17l52O62K285M850Q838J3723J7695J8673J5467Q296j055r758j5363
62073A770753j7138j5967j3146r850p641q517j3709k2424l2180m0461m6056m9015
62061A494649m9704m8278m5042m0892l6920l3628l0836k8313k6060k3999k1917
62050A109060j9820j7998j6608j5648j5377j6154j7638j8903j9600k0365k1487
62039I09462k2035k1116j9389j8316j8186j7922j6800j5349j4361j3886j3564
62028G18538j3220j2705j1751j0448r393q926q545p648o498n869n802n415m160
62015F08158k659j859j674j091L49J780J996P98j046k896m735o693q650j0413
$$ y = [1764616, 1754613, 1745919, 1737968, 1730501, 1723690, 1717631, 1712384, 1708425, 1706344, 1705999, 1706476, 1707011, 1707428, 1707643, 1707409, 1706792, 1706440, 1707102, 1709387, 1714237, 1723075, 1736798, 1754493, 1773166, 1788633, 1796929, 1795874, 1786116, 1770753, 1753615, 1737648, 1724502, 1714652, 1707011, 1698494, 1684785, 1662361, 1630181, 1589720, 1543664, 1494649, 1444945, 1396667, 1351625, 1310733, 1273813, 1240185, 1209349, 1181036, 1154976, 1130977, 1109060, 1089240, 1071242, 1054634, 1038986, 1023609, 1007455, 989817, 970914, 951314, 930949, 909462, 887427, 866311, 846922, 828606, 810420, 792498, 775698, 760349, 745988, 732102, 718538, 705318, 692613, 680862, 670414, 661021, 652095, 643550, 635902, 629404, 623535, 617733, 612318, 608158, 605499, 603640, 601966, 600875, 601224, 603004, 605000, 605798, 604752, 601856, 597121, 590428, 581778, 571365]
62001E71365j1865j2737j2639j1539r920q348p101o319o060n999n557m541l385
61988D65355k470j705j065r50j412j567n39J228K412K533K429K913L747M286M382
61973D79577M245L906L470L465M260N265N418M589L844M109N058N707N716N557
61959E44186N650N979O590P828R728J1629J2759J3073J3267J4075J5765J8036
61947F78565K0227K1800K2885K4122K5865K7821K9698L1838L4791L8626M3017
61936I99255M7693N2377N6587O0087O3224O6323O9122P1479P4361P9328Q7063
61925A726899R6989J08038J18990J28265J34348J36351J33453J24020J06482Q1134
61915B894969N0100J5638k0265n4645q3863j06028j21934j32804j38364j38090
$$ y = [571365, 559500, 546763, 534124, 522585, 512665, 504317, 497216, 490897, 484837, 478838, 473281, 468740, 465355, 462885, 461180, 460115, 459165, 457753, 456186, 455647, 456875, 459287, 461820, 464249, 467162, 470909, 475195, 479577, 483822, 487728, 491198, 494663, 498923, 504188, 509606, 514195, 518039, 522148, 527206, 532913, 538629, 544186, 549836, 555815, 562405, 570233, 579961, 591590, 604349, 617422, 630689, 644764, 660529, 678565, 698792, 720592, 743477, 767599, 793464, 821285, 850983, 882821, 917612, 956238, 999255, 1046948, 1099325, 1155912, 1215999, 1279223, 1345546, 1414668, 1486147, 1560508, 1639836, 1726899, 1823888, 1931926, 2050916, 2179181, 2313529, 2449880, 2583333, 2707353, 2813835, 2894969, 2945069, 2960707, 2940442, 2885797, 2801934, 2695906, 2573972, 2441168, 2302804, 2164714]
61905B164714j33211j26072j18173j09937j01804r4327q7464q0845p4572o8940
61895A169369o3662n8232n2831m8024m3806l9691l5589l1820k8412k5086k1842
61884G20374j8887j6192j3637j1402r636p985o111m361l309k782k018n80J309
61871F24783L105M174M207L920M668O674Q406Q657Q395R204J0654J0909R731Q925
61857G26412R569J0532J0356R124P664O074M118K198R98O14P15J130J762K320
61843G93586K628K784K696J957N78p47j491j881k209k138j352l11L62R62K345
61828G97769M730P511J0266J3272J6863K0714K4071K6367K7408K7054K5126K1758
61816A022909J7736J4247J2050J1169J1511J3494J7626K3541L0047L6292M2536
$$ y = [2164714, 2031503, 1905431, 1787258, 1677321, 1575517, 1481190, 1393726, 1312881, 1238309, 1169369, 1105707, 1047475, 994644, 946620, 902814, 863123, 827534, 795714, 767302, 742216, 720374, 701487, 685295, 671658, 660256, 650620, 642635, 636524, 632163, 628854, 626072, 624054, 623474, 624783, 627888, 632062, 636269, 640189, 644857, 651531, 659937, 668594, 676989, 686193, 696847, 707756, 717487, 726412, 735981, 746513, 756869, 765993, 773657, 779731, 783849, 786047, 787045, 787659, 788374, 789504, 791266, 793586, 796214, 798998, 801694, 803651, 804229, 803482, 801991, 800110, 797901, 795763, 794411, 794100, 794462, 795424, 797769, 802499, 810010, 820276, 833548, 850411, 871125, 895196, 921563, 948971, 976025, 1001151, 1022909, 1040645, 1054892, 1066942, 1078111, 1089622, 1103116, 1120742, 1144283, 1174330, 1210622, 1253158]
61805A253158M9607N7899O7117P6788Q6750R7219J08597J21224J35321J51053
61795B204733J68348J86534K04323K20404K33812K43492K47659K43842K29582
61786D182729K03109J64026J13939N6318m602o4694j19859j66174k01109k24502
61776C939181k37722k42238k39433k31156k19261k04792j88551j72185j57432
61767B046411j44291j31292j17897j05410r5018q6137p7524o9100o1687n5529
61757A102526n0037m4759l9903l5971l3218l1369k9572k7057k4013k1390j9631
61746G45606j8138j6362j4766j4099j4185j4039j3016j1319r592q428q031p975
61734E95656p511o352m975l898l101k385j859j678j714j909k472l309l752l486
$$ y = [1253158, 1302765, 1360664, 1427781, 1504569, 1591319, 1688538, 1797135, 1918359, 2053680, 2204733, 2373081, 2559615, 2763938, 2984342, 3218154, 3461646, 3709305, 3953147, 4182729, 4385838, 4549864, 4663803, 4720121, 4715519, 4650825, 4530966, 4364792, 4163683, 3939181, 3701459, 3459221, 3219788, 2988632, 2769371, 2564579, 2376028, 2203843, 2046411, 1902120, 1770828, 1652931, 1547521, 1452503, 1366366, 1288842, 1219742, 1158055, 1102526, 1052489, 1007730, 967827, 931856, 898638, 867269, 837697, 810640, 786627, 765237, 745606, 727468, 711106, 696340, 682241, 668056, 654017, 641001, 629682, 620090, 611662, 603631, 595656, 588145, 581793, 576818, 572920, 569819, 567434, 565575, 563897, 562183, 560274, 557802, 554493, 550741, 547255]
61720E47255l244l856m899n147m173k701j424l53N49J030J243K041L893N960O845
61705E43019O122M539K832J065o65j618j173J03Q87O84K75L15J76j217l797o390
61689E45157q136r207j0087j0884j1491j1869j1906j1454j0651r896r362q893
61677D21321q398p879p129n969m813m273m141l558k461j898k472l302l265k534
61663C59229k055k004j790j223p35m76j34K80K06n99j581k012j714j025l41J27
61647C44153L68M71M00k0o93j003m36O11J090N21m25p79l26L95Q80J054R66O12
61629C47839J69J17P23J491J604R95N11P84J342J317O61L3k23k87j39M77J284
61612C58698J533J130R30J464K102K084J722J869K653L468L965M351M823N354
$$ y = [547255, 544011, 540155, 535256, 530109, 525936, 523235, 521811, 521458, 522007, 523037, 524280, 526321, 530214, 536174, 543019, 549141, 553680, 556512, 557577, 556912, 555294, 554121, 554224, 555111, 555795, 556070, 556385, 556561, 555344, 551547, 545157, 537021, 527814, 517727, 506843, 495352, 483483, 471577, 460123, 449472, 439576, 430214, 421321, 412923, 405044, 397915, 391946, 387133, 382860, 378719, 375161, 372700, 370802, 368330, 365028, 361763, 359229, 357174, 355170, 353380, 352157, 351422, 350946, 350812, 351092, 351298, 350699, 349118, 347106, 345392, 344367, 344026, 344153, 344521, 344992, 345392, 345372, 344679, 343676, 343240, 343851, 344941, 345462, 345037, 344258, 343932, 344327, 345207, 346261, 347227, 347839, 348008, 348125, 348848, 350339, 351943, 352938, 353449, 354233, 355575, 356892, 357553, 357586, 357363, 357076, 356937, 357414, 358698, 360231, 361361, 362291, 363755, 365857, 367941, 369663, 371532, 374185, 377653, 381618, 385969, 390792, 396146]
61598C96146N954O721P630Q642R817J0967J1468J0944R960R521J0037J1270J3017
61585E22094J5187J7376J9126K0720K3040K6369K9857L2494L4154L5305L6003
61574H11725L5525L2960K7934K0801J2297L101o143j4497k0767k4258k5433k5404
61562H27841k4853k3638k1507j8751j5950j3385j0917q443o207m605l694l004
61550F72887k009p56J79M03J43j62m77j066j946k759l218l405l559l668l403k493
61534F44691j111J83R95J500K125K990L972N210P016R239J1243J2833J4684J7468
61520G33038K0955K4446K7844L1683L6276M1315M6345N1263N6299O1739O7685
61509A198888P3875P9835Q5293R0171R3872R4933R1931Q4805P5031O4606N5184
$$ y = [396146, 402100, 408821, 416451, 425093, 434910, 445877, 457345, 468289, 478249, 487770, 497807, 509077, 522094, 537281, 554657, 573783, 594503, 617543, 643912, 673769, 706263, 740417, 775722, 811725, 847250, 880210, 908144, 928945, 941242, 944343, 938200, 923703, 902936, 878678, 853245, 827841, 802988, 779350, 757843, 739092, 723142, 709757, 698840, 690397, 684190, 679585, 675891, 672887, 670878, 670122, 670301, 670704, 670847, 670685, 670208, 669142, 667196, 664437, 661219, 657814, 654255, 650587, 647184, 644691, 643580, 643763, 644758, 646258, 648383, 651373, 655345, 660555, 667571, 676810, 688053, 700886, 715570, 733038, 753993, 778439, 806283, 837966, 874242, 915557, 961902, 1013165, 1069464, 1131203, 1198888, 1272763, 1352598, 1437891, 1528062, 1621934, 1716867, 1808798, 1893603, 1968634, 2033240, 2088424]
61498B088424M7928M3476M1678M1671M2475M3543M4826M6566M9034N2165N5418
61487B597204N8094N9740N9951N7839N2002M1314K5597N557j7718m2893o8121
61476B828566r0958j08925j20392j25101j23959j18518j10561j01694r2810q3954
61466A751694p4987o6275n8367n1179m4173l7383l1545k6919k2705j8158j3652
61455A306351j0015p162m173n60L301O965J0593J4662J9458K4991L1098L7595
61443A433104M4523N2159O0397O8166P3822P6022P3913O6620N3454L5062J4119
61432B051361n699k1609l2681l9281m1994m1200l7443l1747k5247j8454j1053
61421A744953k541P081J7211K6997L5532M1686M3834L9985K8663J0343j1791l2948
$$ y = [2088424, 2136352, 2179828, 2221506, 2263177, 2305652, 2349195, 2394021, 2440587, 2489621, 2541786, 2597204, 2655298, 2715038, 2774989, 2832828, 2884830, 2926144, 2951741, 2957298, 2939580, 2896687, 2828566, 2737608, 2628683, 2508291, 2383190, 2259231, 2140713, 2030152, 1928458, 1835648, 1751694, 1676707, 1610432, 1552065, 1500886, 1456713, 1419330, 1387785, 1360866, 1338161, 1320003, 1306351, 1296336, 1289174, 1285001, 1284441, 1287742, 1294707, 1305300, 1319962, 1339420, 1364411, 1395509, 1433104, 1477627, 1529786, 1590183, 1658349, 1732171, 1808193, 1882106, 1948726, 2002180, 2037242, 2051361, 2045662, 2024053, 1991372, 1952091, 1910097, 1868897, 1831454, 1799707, 1774460, 1756006, 1744953, 1742412, 1749493, 1766704, 1793701, 1829233, 1870919, 1914753, 1954738, 1983401, 1993744, 1981953, 1949005]
61409A949005m9137n8883o2999o3139o0635n6237n0442m3948l7723l2536k8511
61398A404815k5226k2180j8885j4895j0233n713k199M65L278O812J0852J5271
61386A342162K0313K5754L0673L4650L8352M2367M6134M8858N0846N3057N5579
61375A788745N7450N7867N6776N4334N0396M4710L7156K7881J7441O697l770j4029
61363B181654k4289l4217m3067n0237n5516n9145o1857o4400o6624o7437o6081
61352A588784o3045n9342n5466n1505m7638m3839l9628l4839l0180k6340k2995
61341A113967j9446j5803j2666j0065p634n442l587j298K396P106J1172J3495
61329A072195J4419J4913J5660J7000J8843K0505K1366K1706K2134K2254K0876
$$ y = [1949005, 1899868, 1840985, 1777986, 1714847, 1654212, 1597975, 1547533, 1503585, 1465862, 1433326, 1404815, 1379589, 1357409, 1338524, 1323629, 1313396, 1307683, 1305484, 1305949, 1309227, 1316039, 1326891, 1342162, 1362475, 1388229, 1418902, 1453552, 1491904, 1534271, 1580405, 1629263, 1680109, 1733166, 1788745, 1846195, 1904062, 1960838, 2015172, 2065568, 2110278, 2147434, 2175315, 2192756, 2199453, 2195683, 2181654, 2157365, 2123148, 2080081, 2029844, 1974328, 1915183, 1853326, 1788926, 1722302, 1654865, 1588784, 1525739, 1466397, 1410931, 1359426, 1311788, 1267949, 1228321, 1193482, 1163302, 1136962, 1113967, 1094521, 1078718, 1066052, 1055987, 1048353, 1042911, 1039324, 1038026, 1040422, 1047528, 1058700, 1072195, 1086614, 1101527, 1117187, 1134187, 1153030, 1173535, 1194901, 1216607, 1238741, 1260995, 1281871]
61318A281871J7579J3244Q887M942J801L6l12R6Q13J929L296M215M292L925L547
61303A350161L064K326J515P18k11r95r08J21J017Q32M0p4J068K894M506N394
61287A371468N483M978M253L683L574M202N650P619R626J1504J3346J4982J5800
61274A476168J5223J3117R708N483J153k503n012o381p018p538q263q693p872
61261A467572n599k851n55J553M280P757J1609J5813K0452K5070K9264L3749L9703
61248A647817M7305N5844O5021P4885Q4669R2936R8768J01302R8118Q5891O3528
61237B516084L3757J290k9425n4622p1491p9463q0390p6518o8952n8515m6824
61226A984931l5289k3848j1738J008J3626K5472L5836M3251M5769M1800L0514
$$ y = [1281871, 1299450, 1312694, 1321581, 1326523, 1328324, 1328360, 1328048, 1328144, 1328957, 1330886, 1334182, 1338397, 1342689, 1346614, 1350161, 1353225, 1355551, 1357066, 1357784, 1357573, 1356578, 1355670, 1355791, 1356808, 1357640, 1357680, 1357606, 1358674, 1361568, 1366074, 1371468, 1376951, 1381929, 1386182, 1389865, 1393439, 1397641, 1403291, 1410910, 1420536, 1432040, 1445386, 1460368, 1476168, 1491391, 1504508, 1514216, 1519699, 1520852, 1518349, 1513337, 1506956, 1499938, 1492400, 1484137, 1475444, 1467572, 1461973, 1459122, 1458567, 1460120, 1464400, 1472157, 1483766, 1499579, 1520031, 1545101, 1574365, 1608114, 1647817, 1695122, 1750966, 1815987, 1890872, 1975541, 2068477, 2167245, 2268547, 2366665, 2452556, 2516084, 2549841, 2551131, 2521706, 2467084, 2395593, 2316130, 2235740, 2159222, 2090270, 2031755, 1984931, 1949642, 1925794, 1914056, 1915064, 1928690, 1954162, 1989998, 2033249, 2079018, 2120818, 2151332]
61215B151332J2356j0014l2021m9423o0440o5638o6594o5178o3121o1184n8922
61204A631153n5764n1867m7579m2870l7969l3783l0920k8927k7148k5668k4644
61193A224014k3534k1879k0270j9477j9231j8771j8050j7407j6559j5023j3167
61182A020646j1799j1034j0521j0391j0811j0985r893p913o480o076n750m788
61170I14205l579k534j261N85K377L055K062o77n144j0992j7175k2282k5324k6231
61156H07085k5748k4850k3997k2903k1162j8889j6532j4291j2193j0493r501r028
61144E97498q460p447o196n117m459m213m044l385k003l87P14J186J616K478L525
61129E61306M146M199M330N310P056Q551R060R090R590J0357J0067P999M939K085
$$ y = [2151332, 2163688, 2153674, 2121653, 2072230, 2011790, 1946152, 1879558, 1814380, 1751259, 1690075, 1631153, 1575389, 1523522, 1475943, 1433073, 1395104, 1361321, 1330401, 1301474, 1274326, 1248658, 1224014, 1200480, 1178601, 1158331, 1138854, 1119623, 1100852, 1082802, 1065395, 1048836, 1033813, 1020646, 1008847, 997813, 987292, 976901, 966090, 955105, 945212, 937299, 930819, 924743, 918993, 914205, 910626, 908092, 906831, 907416, 909793, 912848, 914910, 914233, 909089, 898097, 880922, 858640, 833316, 807085, 781337, 756487, 732490, 709587, 688425, 669536, 653004, 638713, 626520, 616027, 606526, 597498, 589038, 581591, 575395, 570278, 565819, 561606, 557562, 554177, 552174, 551787, 552501, 553687, 555303, 557781, 561306, 565452, 569651, 573981, 579291, 586347, 594898, 603958, 613048, 622638, 632995, 643062, 651061, 656000, 658085]
61115F58085j78k037l446m188m295l949l289k626k328k228j665m63P45J461J929
61100F31528K392K503J983J194M63m55j661k520k470j835j199o22o5J37j09k02
61084F29062J96M84J30l64l61j94m60q60q07o67j277k549l568l746l127k026j100
61067F08766j218k324l011k172m48R03J887L295N014O234P021Q314J0402J2566
61053F55229J4161J5147J5724J6280J7333J8717J9260J8179J6279J4771J3627
61042H34707J2084J0109Q083N806L179J162N84O12Mp81l83J089K336L113M311
61027H86015O042P565Q946J0981J3536J5710J7511J9577K1511K2438K3009K4733
61015A077574K7412K9383L0401L1946L4589L7307L9756M2862M6683N0015N2638
$$ y = [658085, 657907, 655870, 652424, 648236, 643941, 639992, 636703, 634077, 631749, 629521, 627856, 627393, 628138, 629599, 631528, 633920, 636423, 638406, 639600, 640063, 639608, 637947, 635427, 632957, 631122, 629923, 629301, 629236, 629373, 629264, 629062, 629258, 629742, 629872, 629508, 629147, 628953, 628493, 627633, 626826, 626159, 624882, 622333, 618765, 615019, 611892, 609866, 608766, 607548, 605224, 602213, 600041, 599593, 600496, 602383, 605678, 610692, 616926, 623947, 632261, 642663, 655229, 669390, 684537, 700261, 716541, 733874, 752591, 771851, 790030, 806309, 821080, 834707, 846791, 856900, 864983, 870789, 873968, 875130, 875714, 876326, 876330, 875549, 875166, 876255, 878591, 881704, 886015, 892057, 899622, 908568, 919549, 933085, 948795, 966306, 985883, 1007394, 1029832, 1052841, 1077574, 1104986, 1134369, 1164770, 1196716, 1231305, 1268612, 1308368, 1351230, 1397913, 1447928, 1500566]
61004A500566N5795N9842O3618O6728P0107P3822P6577P8158P9913Q2172Q3727
60993B291025Q4710Q7273R2189R7350J00829J03055J04994J07146J11672J22385
60983C302628J40677J63994J89910K18764K50436K81987L11322L40919L75981
60974E576618M21838M85000N72510O86852Q24763R84262J169388J386007J640052
60965A3747290J946574K336075K844984L499467M296831N160966N875115O082313
60957D5789615N452440L952493J979688J81474r16551j156001o96310J76934J139385
60948E5903167J793658J716253O87116j088707l037178m553669n334893n442441
60940D0643306n123397m609686m043677l499395l011050k584033k208767j877802
$$ y = [1500566, 1556361, 1616203, 1679821, 1746549, 1816656, 1890478, 1967055, 2045213, 2125126, 2207298, 2291025, 2375735, 2463008, 2555197, 2652547, 2753376, 2856431, 2961425, 3068571, 3180243, 3302628, 3443305, 3607299, 3797209, 4015973, 4266409, 4548396, 4859718, 5200637, 5576618, 5998456, 6483456, 7055966, 7742818, 8567581, 9551843, 10721231, 12107238, 13747290, 15693864, 18029939, 20874923, 24374390, 28671221, 33832187, 39707302, 45789615, 51242055, 55194548, 57174236, 57355710, 56439159, 55283158, 54586848, 54763782, 55903167, 57696825, 59413078, 60100194, 59011487, 55974309, 51420640, 46085747, 40643306, 35519909, 30910223, 26866546, 23367151, 20356101, 17772068, 15563301, 13685499]
60932A3685499j589365j340478j126236r45258p98807o84113n93404n19576m58819
60923E629443m08126l64386l26229k93601k65151k38527k13139j90102j69867
60914C160315j52288j38765j31341j29368j29222j27679j23773j17451j08716
60905B001712r8482q8490p9641p1593o4081n7278n0940m4593l8665l4141l1140
60894A342668k9019k7717k7576k8043k8007k7367k6823k6273k4945k3084k1889
60883A051925k1558k1019j9806j8696j8098j7303j5888j4521j3781j3351j2946
60872H64958j2931j3419j3746j3444j2870j2391j1786j0950j0285r957r594r148
60860G24437r144r555r372p955o075m935m780n072n468n942o424o905p506q081
$$ y = [13685499, 12096134, 10755656, 9629420, 8684162, 7885355, 7201242, 6607838, 6088262, 5629443, 5221317, 4856931, 4530702, 4237101, 3971950, 3733423, 3520284, 3330182, 3160315, 3008027, 2869262, 2737921, 2608553, 2479331, 2351652, 2227879, 2110428, 2001712, 1903230, 1814740, 1735099, 1663506, 1599425, 1542147, 1491207, 1446614, 1407949, 1373808, 1342668, 1313649, 1285932, 1258356, 1230313, 1202306, 1174939, 1148116, 1121843, 1096898, 1073814, 1051925, 1030367, 1009348, 989542, 970846, 952748, 935445, 919557, 905036, 891255, 877904, 864958, 852027, 838608, 824862, 811418, 798548, 786157, 774371, 763421, 753136, 743179, 733585, 724437, 715293, 705738, 696366, 688411, 682336, 677401, 672621, 667549, 662081, 656139, 649715, 642810, 635304, 627223]
60846F27223q118p432o504n800n209m508l826l265k588j715j005o22r9R09J838
60831E79279J778M99j424l258m418m423l147j138O81J626J483L54j445l368m741
60816E58338m995m084k812k394l193m137l946k858k322l008m006m250l835l466
60802E09032l337l198l037l057l299l742m436n215n595n380n028n001n138n067
60788D48502m923n129n690o129o054n514m917m692m830m784m159l426l303l477
60774C81475k828j175J78K49k21J2Q31J154O77Q5j95l89m97rJ289K866M023M425
60756C91950M127L501L090L027K694J491j96j404j835j978k080j857j378j347
60742C97805k117k969k909j855p25n08j440k862l750l612k919k497k579k785k903
$$ y = [627223, 619105, 611673, 605169, 599369, 594160, 589652, 585826, 582561, 579973, 578258, 577253, 576631, 576532, 577441, 579279, 581057, 581556, 580132, 576874, 572456, 568033, 564886, 563748, 564429, 566055, 567538, 567892, 566447, 563079, 558338, 553343, 549259, 546447, 544053, 540860, 536723, 532777, 529919, 527597, 524589, 520583, 516333, 512498, 509032, 505695, 502497, 499460, 496403, 493104, 489362, 484926, 479711, 474116, 468736, 463708, 458707, 453569, 448502, 443579, 438450, 432760, 426631, 420577, 415063, 410146, 405454, 400624, 395840, 391681, 388255, 384952, 381475, 378647, 377472, 377650, 377899, 377678, 377690, 378521, 379675, 380352, 380437, 380242, 379853, 379356, 379347, 380636, 383502, 387525, 391950, 396077, 399578, 402668, 405695, 408389, 409880, 409684, 408280, 406445, 404467, 402387, 400530, 399152, 397805, 395688, 392719, 389810, 387955, 387230, 386722, 385282, 382420, 378670, 375058, 372139, 369642, 367063, 364278, 361375]
60727C61375l130l472l531l094k459j874j082J71J423J866J364O94O63J162J446
60712C51522J213J081J742K835L264K583J605J317J695K024J897J431P52p3p98
60697C74090j173j287j285r59j09Q51J279J186J184J571K028K195K072J807J622
60682C85072J777K232K515K415K532L396M392M416L482K721K754L141L443L769
60668D28057L992L527K347J315R71Q20L61o4lK71K95J29o4n27j366k196k827l698
60650D31340m934n708n331m392l969m178m327m054l524k842k160j915k263k514
60636C79229k013j217j084j604j920j672j295j077q11m74m44q51j323j493j253
60621C60698n41N79J653K201K267K164J922J591J703K614L598L566K683K291L086
$$ y = [361375, 358245, 354773, 351242, 348148, 345689, 343815, 342733, 342904, 344327, 346193, 347557, 348251, 348914, 350076, 351522, 352735, 353816, 355558, 358393, 361657, 364240, 365845, 367162, 368857, 370881, 372778, 374209, 374961, 374888, 374090, 372917, 371630, 370345, 369386, 369277, 370128, 371407, 372593, 373777, 375348, 377376, 379571, 381643, 383450, 385072, 386849, 389081, 391596, 394011, 396543, 399939, 404331, 408747, 412229, 414950, 417704, 420845, 424288, 428057, 432049, 435576, 437923, 439238, 440209, 441029, 441390, 441326, 441323, 441594, 441889, 442018, 441954, 441427, 440061, 437865, 435038, 431340, 426406, 420698, 415367, 410975, 407006, 402828, 398501, 394447, 390923, 388081, 385921, 384006, 381743, 379229, 377216, 375999, 374915, 373311, 371391, 369719, 368424, 367347, 366536, 366062, 365618, 364767, 363444, 361951, 360698, 360157, 360736, 362389, 364590, 366857, 369021, 370943, 372534, 374237, 376851, 380449, 384015, 386698, 388989, 392075]
60606C92075M315N002N110N145N325N658O254P139Q123R117J0248J1523J2732
60593D87766J3724J4419J4574J4040J3190J2435J1397R221N837K066j540n123
60581E92006q565j1039j2071j2238j2280j2134j1396j0179q912p688o392n131
60569D73981m022k956j979j545j841k253j966r47J32P00O51K22r8J61Q44J179
60553D60263P81K88M59J034J173Q33Q83J848L277M534N580O601P417P745P848
60538E10564Q406R743J1458J2973J4243J5657J7359J9003K0401K2074K4757K8467
60526G15105L2563L6834M1938M8555N6533O5416P5364Q6880R9534J11548J20829
60515A491099J25900J25698J18963J04741Q3640N8155L1444N890j7074l6293n0816
$$ y = [392075, 396390, 401392, 406502, 411647, 416972, 422630, 428884, 436023, 444146, 453263, 463511, 475034, 487766, 501490, 515909, 530483, 544523, 557713, 570148, 581545, 590766, 596603, 598669, 597129, 592006, 583441, 572402, 560331, 548093, 535813, 523679, 512283, 502104, 493192, 485504, 479112, 473981, 469959, 467003, 465024, 463479, 461638, 459385, 457419, 456472, 456604, 457304, 457955, 458177, 458079, 458240, 459084, 460263, 461044, 461332, 461791, 462825, 463998, 464831, 465714, 467562, 470839, 475373, 480953, 487554, 494971, 502716, 510564, 518970, 528713, 540171, 553144, 567387, 583044, 600403, 619406, 639807, 661881, 686638, 715105, 747668, 784502, 826440, 874995, 931528, 996944, 1072308, 1159188, 1258722, 1370270, 1491099, 1616999, 1742697, 1861660, 1966401, 2050041, 2108196, 2139640, 2145530, 2128456, 2092163, 2041347]
60504B041347o0461o5917o8024o7330o4439o0226n5303m9606m2971l5808k8779
60493A442483k2030j5103p448J332J1431K2636L4459M6886O0590P5653R0364J01911
60481A843164J08178J08349J02316R0638P5169N8840M4505L4262K9371K9487L1927
60470B556206L2911L0265K4365J6458P274k105r067j0213l157J2704L6574O6813
60458B759028J01652J40034J81779K26816K74554L23793L72048M14312M42953
60449E236969M49662M27802L73887K88723J78205N2365p7295j99707l04389l82393
60439F043829m29269m47035m42211m21979l92355l58389l23926k90778k59248
60430B678639k29627k02569j78298j56491j37020j19922j04689r0514p7335o5838
$$ y = [2041347, 1980886, 1914969, 1846945, 1779615, 1715176, 1654950, 1599647, 1550041, 1507070, 1471262, 1442483, 1420453, 1405350, 1397902, 1399234, 1410665, 1433301, 1467760, 1514646, 1575236, 1650889, 1741253, 1843164, 1951342, 2059691, 2162007, 2252645, 2327814, 2386654, 2431159, 2465421, 2494792, 2524279, 2556206, 2589117, 2619382, 2643747, 2660205, 2667479, 2665374, 2656307, 2646094, 2642937, 2655641, 2692215, 2759028, 2860680, 3000714, 3182493, 3409309, 3683863, 4007656, 4379704, 4794016, 5236969, 5686631, 6114433, 6488320, 6777043, 6955248, 7007613, 6930318, 6730611, 6426222, 6043829, 5614560, 5167525, 4725314, 4303335, 3910980, 3552591, 3228665, 2937887, 2678639, 2449012, 2246443, 2068145, 1911654, 1774634, 1654712, 1550023, 1459509, 1382174, 1316336]
60420A316336n6211m7688l9610l2222k6040k1044j6727j2619q433m113N0L546
60408A055225O164Q216J0213J2434J4730J6543J7224J6553J4831J2339Q945M575
60396A197992k46m687q252j0751j1957j1912j1305j0956j0893j0458r270p670
60384A089635o252n385n111n119m898m372m154m675n232m630k733p06M36Q19R86
60369A038609P79o78m086r330j5474k1238k5732k8878l1065l2417l2627l1489
60357H06374k9371k7010k4937k3108k1044j8459j5728j3497j1800j0011p798n644
60345E97967m075k948j917j121p92o29k87j53p84j806k237j891j615k004k756
60330E72952l429m067m729n041m703l973l310k858k568k437k303j768p46J49J77
$$ y = [1316336, 1260125, 1212437, 1172827, 1140605, 1114565, 1093521, 1076794, 1064175, 1055742, 1051629, 1051679, 1055225, 1061389, 1069605, 1079818, 1092252, 1106982, 1123525, 1140749, 1157302, 1172133, 1184472, 1193417, 1197992, 1197746, 1193059, 1184807, 1174056, 1162099, 1150187, 1138882, 1127926, 1117033, 1106575, 1097305, 1089635, 1083383, 1077998, 1072887, 1067768, 1062870, 1058498, 1054344, 1049669, 1044437, 1039807, 1037074, 1036368, 1036804, 1037623, 1038609, 1039388, 1038710, 1034624, 1025294, 1009820, 988582, 962850, 933972, 902907, 870490, 837863, 806374, 777003, 749993, 725056, 701948, 680904, 662445, 646717, 633220, 621420, 611409, 603611, 597967, 593892, 590944, 589027, 587906, 587114, 586485, 586198, 586045, 585261, 583455, 581218, 579327, 577712, 575708, 572952, 569523, 565456, 560727, 555686, 550983, 547010, 543700, 540842, 538274, 535837, 533534, 531766, 531020, 531169, 531346]
60315E31346n39j035o13K90O79L74L11J229K485K882K377K081K447K601J914J175
60299E50004J338J958K008J651J929K971L783L871L901M508N418O129O682P380
60285F03531Q363R681J1265J2713J3692J4661J6424J8878K0894K1735K1834K1868
60273G95539K1772K1099J9779J8064J6141J4262J2916J2465J2813J3564J4293
60262I72707J4613J4388J4095J4511J5846J7523J8844J9570J9802J9827K0171
60251A161897K1331K3194K5171K6931K8614L0262L1624L2631L3485L4105L4132
60240A483377L3782L3953L5118L6595L7441L7598L7683L8012L8329L8329L8007
60229A888224L7595L7363L7403L7437L6968L5740L3853L1481K8831K6401K4838
$$ y = [531346, 530807, 529772, 529159, 529449, 530128, 530502, 530813, 532042, 534527, 537409, 539786, 541867, 544314, 546915, 548829, 550004, 551342, 553300, 555308, 556959, 558888, 561859, 565642, 569513, 573414, 577922, 583340, 589469, 596151, 603531, 611894, 621575, 632840, 645553, 659245, 673906, 690330, 709208, 730102, 751837, 773671, 795539, 817311, 838410, 858189, 876253, 892394, 906656, 919572, 932037, 944850, 958414, 972707, 987320, 1001708, 1015803, 1030314, 1046160, 1063683, 1082527, 1102097, 1121899, 1141726, 1161897, 1183228, 1206422, 1231593, 1258524, 1287138, 1317400, 1349024, 1381655, 1415140, 1449245, 1483377, 1517159, 1551112, 1586230, 1622825, 1660266, 1697864, 1735547, 1773559, 1811888, 1850217, 1888224, 1925819, 1963182, 2000585, 2038022, 2074990, 2110730, 2144583, 2176064, 2204895, 2231296, 2256134]
60218B256134K4366K4754K5894K7932L0600L2875L3708L2800L0426K6814K2112
60207B568415J6863J2038Q441O056M167K224N57l3O07J812L147M885O963Q231
60193B644373P718O062M635L523J688j032l544n324p301j0320j3913j7376k1106
60180B588083k6008l2231l9246m6644n4047o0612o5425o8211o9249o8826o7249
60169A990335o4922o1994n8120n3005m6968m0583l4069k7423k0907j5018j0100
60158A557226o176l032m68J290J564Q4k271m215n565p229r623j2039j3797j5030
60144A480719j5833j5542j3638j0652p493m381j055K587O687J1678J7631K3835
60132A474543K9768L6002M3471N2219O1587P1186Q0924R0453R9351J07507J14496
$$ y = [2256134, 2280500, 2305254, 2331148, 2359080, 2389680, 2422555, 2456263, 2489063, 2519489, 2546303, 2568415, 2585278, 2597316, 2605757, 2611813, 2615980, 2618204, 2618761, 2618728, 2619335, 2621147, 2624294, 2629179, 2636142, 2644373, 2652091, 2658153, 2662788, 2666311, 2667999, 2666967, 2663423, 2658099, 2650798, 2640478, 2626565, 2609189, 2588083, 2562075, 2529844, 2490598, 2443954, 2389907, 2329295, 2263870, 2195659, 2126410, 2057584, 1990335, 1925413, 1863419, 1805299, 1752294, 1705326, 1664743, 1630674, 1603251, 1582344, 1567326, 1557226, 1551050, 1548018, 1547550, 1548840, 1550404, 1550488, 1548217, 1544002, 1538437, 1531208, 1521585, 1509546, 1495749, 1480719, 1464886, 1449344, 1435706, 1425054, 1417561, 1413180, 1412125, 1414712, 1421399, 1433077, 1450708, 1474543, 1504311, 1540313, 1583784, 1636003, 1697590, 1768776, 1849700, 1940153, 2039504, 2147011, 2261507]
60121B261507J18921J19281J15446J08591R9836Q9751P9019O8643N9196N0414
60111C170605M1718L2626K2736J1819J18j1911k4090l6324m8017n8325o7014p4522
60099B959419q0946q5652q8203q9135q9217q8273q5421q0495p4579o8780o2930
60088B065788n6098m8052l9479l0753k1486j1736k701M691J1114J7698K3941K8114
60076A941041K9626K9619K9036K7443K4257J9932J5300J0709O521L466J801Q66
60064B139617K11M44K259N406R337J4045J9511K5075L0226L5176L9718M2374M1916
60051B405315L9091L5470L0989K4067J3981J887j0529k1991l1208l6892l8835
60040B411345l8141l5897l2340k7613k2621j8523j5748j3857j2257j0869j0304
$$ y = [2261507, 2380428, 2499709, 2615155, 2723746, 2823582, 2913333, 2992352, 3060995, 3120191, 3170605, 3212323, 3244949, 3267685, 3279504, 3279622, 3267711, 3243621, 3207297, 3159280, 3100955, 3033941, 2959419, 2878473, 2792821, 2704618, 2615483, 2526266, 2437993, 2352572, 2272077, 2197498, 2128718, 2065788, 2009690, 1961638, 1922159, 1891406, 1869920, 1858184, 1855483, 1860174, 1871288, 1888986, 1912927, 1941041, 1970667, 2000286, 2029322, 2056765, 2081022, 2100954, 2116254, 2126963, 2133484, 2136950, 2138751, 2139617, 2139828, 2140272, 2142531, 2147937, 2157274, 2171319, 2190830, 2215905, 2246131, 2281307, 2321025, 2363399, 2405315, 2444406, 2479876, 2510865, 2534932, 2548913, 2550800, 2540271, 2518280, 2487072, 2450180, 2411345, 2373204, 2337307, 2304967, 2277354, 2254733, 2236210, 2220462, 2206605, 2194348, 2183479, 2173175]
60029B173175j1378j4246j8064k1746k4872k7600k9966l1783l3026l3857l4270
60018A892367l4099l3217l1528k8941k5718k2516j9728j7057j4078j0799p278
60007A647408l282J130N261Q725J2274J6858K2300K7751L3023L8395M3354M6723
59995A899920M8239M8933M9650M9867M8386M4726L9635L4485L0104K5875K0271
59984B340091J2600L842m753j3166k1830k9948l5983l9619m1889m3169m2467l9169
59972B044540l4284k9210k4124j8497j2458o699j361M098R901J5492K0275K4369
59960A992042K8315L2254L5685L8071L9341L9598L8675L6550L3963L1879L0230
59949B376603K8013K4892K1774J9231J6257J1534N286j014o402j0815j4144j5924
$$ y = [2173175, 2161797, 2147551, 2129487, 2107741, 2082869, 2055269, 2025303, 1993520, 1960494, 1926637, 1892367, 1858268, 1825051, 1793523, 1764582, 1738864, 1716348, 1696620, 1679563, 1665485, 1654686, 1647408, 1644126, 1645256, 1650517, 1659242, 1671516, 1688374, 1710674, 1738425, 1771448, 1809843, 1853197, 1899920, 1948159, 1997092, 2046742, 2096609, 2144995, 2189721, 2229356, 2263841, 2293945, 2319820, 2340091, 2352691, 2356533, 2351780, 2338614, 2316784, 2286836, 2250853, 2211234, 2169345, 2126176, 2083709, 2044540, 2010256, 1981046, 1956922, 1938425, 1925967, 1919268, 1917907, 1922005, 1931906, 1947398, 1967673, 1992042, 2020357, 2052611, 2088296, 2126367, 2165708, 2205306, 2243981, 2280531, 2314494, 2346373, 2376603, 2404616, 2429508, 2451282, 2470513, 2486770, 2498304, 2503590, 2502576, 2496174, 2485359, 2471215, 2455291]
59937B455291j5927j4223j0756n553Q51P953J5972K5283L5417M5512N5418O5441
59925B660679P5311Q4408R2725J00423J06482J09078J07299J01531R2108P8932
59915C608976O2569M4548K6101P716r739k4548l5408m2267m5490m5031m0975l4064
59903C472388k5030j3858j77J5913L3652N1896O9391Q5114R8048J06051J05508
59892C998896R3500P0700M1433J0985j6276l6812m8340n1372m9051m4441l8781
59881C930441l2708k7730k5328k5565k7811l1952l7834m4134m9076n1966n2988
59870C523349n1829m7646m0294l0534j8901n073J1347L0023N0191P1437R4026
59859C586096J18322J43816J68588J89891K05114K11858K07370J89119J56762
$$ y = [2455291, 2439364, 2425141, 2414385, 2408832, 2409683, 2417636, 2433608, 2458891, 2494308, 2539820, 2595238, 2660679, 2735990, 2820398, 2913123, 3013546, 3120028, 3229106, 3336405, 3437936, 3530044, 3608976, 3671545, 3716093, 3742194, 3749910, 3740171, 3715623, 3680215, 3637948, 3592458, 3547427, 3506452, 3472388, 3447358, 3433500, 3433323, 3449236, 3482888, 3534784, 3604175, 3689289, 3787337, 3893388, 3998896, 4092396, 4163096, 4204529, 4215514, 4199238, 4162426, 4114086, 4062714, 4013663, 3969222, 3930441, 3897733, 3870003, 3844675, 3819110, 3791299, 3759347, 3721513, 3677379, 3628303, 3576337, 3523349, 3471520, 3423874, 3383580, 3353046, 3334145, 3329072, 3340419, 3370442, 3420633, 3492070, 3586096, 3704418, 3848234, 4016822, 4206713, 4411827, 4623685, 4831055, 5020174, 5176936]
59850E176936J13423O4683J6418k6685o1688q7605j05196j16261j23072j28221
59840D722732j34125j42162j52332j63742j74879j83521j87384j85520j78689
59831C220378j68181j54838j39474j23372j07675r2794p8978o6901n7099m9171
59821B181895m2162l5479k9086k3177j8090j4166j1156q013l647K318R700J8156
59809B027093K6872L4339L9026M0407L9361L8072L9553M6390N9017P5313R2012
59798B557455J06150J15019J15800J06464Q7185O0553L0592J590k3031m1707n4692
59787C061378o2779o6283o5507o1566n6023m9890m3580l7601l2779k9779k8737
59776B526854k9177l0013k9915k8107k4863k1034j7224j3467r313m087K453R456
$$ y = [5176936, 5290359, 5355042, 5371460, 5344775, 5283087, 5195482, 5090286, 4974025, 4850953, 4722732, 4588607, 4446445, 4294113, 4130371, 3955492, 3771971, 3584587, 3399067, 3220378, 3052197, 2897359, 2757885, 2634513, 2526838, 2434044, 2355066, 2288165, 2231066, 2181895, 2139733, 2104254, 2075168, 2051991, 2033901, 2019735, 2008579, 2000566, 1996919, 1999237, 2008937, 2027093, 2053965, 2088304, 2127330, 2167737, 2207098, 2245170, 2284723, 2331113, 2390130, 2465443, 2557455, 2663605, 2778624, 2894424, 3000888, 3088073, 3148626, 3179218, 3180808, 3157777, 3116070, 3061378, 2998599, 2932316, 2866809, 2805243, 2749220, 2699330, 2655750, 2618149, 2585370, 2555591, 2526854, 2497677, 2467664, 2437749, 2409642, 2384779, 2363745, 2346521, 2333054, 2323741, 2319654, 2322107, 2331563]
59764B331563J5456J9845K3379K6939L0345L2867L4353L5218L5727L5945L6239
59753B657876L7188L9099M1915M5453M9414N3469N7717O2747O8753P4914Q0025
59742C268570Q3519Q5442Q5687Q3800P9431P2577O3514N2919M2082L2680K6205
59731C976426K3550K4829K9512L6972M7026N9605P3927Q8606J02698J15950J27670
59720D706771J36115J39725J38537J33807J26532J16942J05098R1330P6122O0110
59710E831089M4241K9618J7176P658J637o49P97O179J5852K9490M5698O2923Q0542
59697F172251R8678J17241J35551J52923J69274J85104K00815K15693K27537K33569
59687G908636K31819K21328K01231J70584J29524Q0135K5866k9483q2148j28694
$$ y = [2331563, 2347019, 2366864, 2390243, 2417182, 2447527, 2480394, 2514747, 2549965, 2585692, 2621637, 2657876, 2695064, 2734163, 2776078, 2821531, 2870945, 2924414, 2982131, 3044878, 3113631, 3188545, 3268570, 3352089, 3437531, 3523218, 3607018, 3686449, 3759026, 3822540, 3875459, 3917541, 3950221, 3976426, 3999976, 4024805, 4054317, 4091289, 4138315, 4197920, 4271847, 4360453, 4463151, 4579101, 4706771, 4842886, 4982611, 5121148, 5254955, 5381487, 5498429, 5603527, 5694857, 5770979, 5831089, 5875330, 5904948, 5922124, 5929782, 5931419, 5930770, 5931567, 5937746, 5953598, 5983088, 6028786, 6091709, 6172251, 6270929, 6388170, 6523721, 6676644, 6845918, 7031022, 7231837, 7447530, 7675067, 7908636, 8140455, 8361783, 8563014, 8733598, 8863122, 8943257, 8969123, 8939640, 8857492, 8728798]
59677H728798j66793j95703k15832k28262k34831k38129k40916k45382k52561
59668F710389k61505k69070k71592k67430k57532k43716k27423k10247j94285
59659D507589j81008j70511j62303j55963j50588j44752j37926j31036j24910
59650C148592j19114j13088j07282j02063r6513q9641q1995p4674o7421n9119
59640B237682m9823m0824l2945k5988j9793j4620j0594p793o676p432r192j1033
59628B000969j3301j6657k0155k1881k1635k1269k2087k3284k3545k2822k1773
59617A772560k0534j8905j7009j4972j2496r486o631m800m132m142m476n095n988
59604A643894p003p919q521q716q585q124p110n486l772k605k035j664j312j044
$$ y = [8728798, 8562005, 8366302, 8150470, 7922208, 7687377, 7449248, 7208332, 6962950, 6710389, 6448884, 6179814, 5908222, 5640792, 5383260, 5139544, 4912121, 4701874, 4507589, 4326581, 4156070, 3993767, 3837804, 3687216, 3542464, 3404538, 3273502, 3148592, 3029478, 2916390, 2809108, 2707045, 2610532, 2520891, 2438896, 2364222, 2296801, 2237682, 2187859, 2147035, 2114090, 2088102, 2068309, 2053689, 2043095, 2035302, 2028626, 2021194, 2012002, 2000969, 1987668, 1971011, 1950856, 1928975, 1907340, 1886071, 1863984, 1840700, 1817155, 1794333, 1772560, 1752026, 1733121, 1716112, 1701140, 1688644, 1679158, 1672527, 1667727, 1663595, 1659453, 1654977, 1649882, 1643894, 1636891, 1628972, 1620451, 1611735, 1603150, 1595026, 1587916, 1582430, 1578658, 1576053, 1574018, 1572354, 1571042, 1569998]
59590A569998n85O26K744N356Q106J1066J4472J8479K3082K7874L1904L4317L5121
59577A782560L5005L4546L4082L4076L4874L6159L7318L8403M0082M2576M5320
59566B195001M7836N0385N3493N7280O1470O5616O9173P1714P3190P3580P2256
59555B890994O8217O1096N1571M0638K9056J7668P532j104r779k0975l5666n1821
59543C047427o5533p3824p6230p3964o8194n9557m8807l6956k4650j2026P28J3274
59531B521688K5656L8019M9488N8090O2401O2628N9602N3446M3854L1068J5854
59520C021794j094j9002l6720n3256o8197q1054r0763r6588r9096r9359r7599
59509B279066r3441q7235q0137p3037o6103n9342n2878m6690m0637l4679k8678
$$ y = [1569998, 1569413, 1570039, 1572783, 1578139, 1586245, 1597311, 1611783, 1630262, 1653344, 1681218, 1713122, 1747439, 1782560, 1817565, 1852111, 1886193, 1920269, 1955143, 1991302, 2028620, 2067023, 2107105, 2149681, 2195001, 2242837, 2293222, 2346715, 2403995, 2465465, 2531081, 2600254, 2671968, 2745158, 2818738, 2890994, 2959211, 3020307, 3071878, 3112516, 3141572, 3159240, 3166772, 3165668, 3155889, 3134914, 3099248, 3047427, 2981894, 2908070, 2831840, 2757876, 2689682, 2630125, 2581318, 2544362, 2519712, 2507686, 2508414, 2521688, 2547344, 2585363, 2634851, 2692941, 2755342, 2817970, 2877572, 2931018, 2974872, 3005940, 3021794, 3020700, 3001698, 2964978, 2911722, 2843525, 2762471, 2671708, 2575120, 2476024, 2376665, 2279066, 2185625, 2098390, 2018253, 1945216, 1879113, 1819771, 1766893, 1720203, 1679566, 1644887, 1616209]
59498A616209k2285j5507r005l300J980P483J3176J8680K4107K9781L5470M0635
59486A737424M5238M9522N3250N5747N6519N5264N1680M5879L8551L0131K0263
59475B239468Q722l578j5261k5703l4957m3125n0425n7101o2431o4789o3731o1196
59463A765893n9338n8037n5853n2658m9542m6680m3202l8961l4740l0740k6455
59452A269687k2076j8390j5294j1895q187n035k448N44M128P378R938J2467J5028
59439A235845J6737J7507J8561K0625K2944K4751K6351K8127K9757L1090L2636
59428A504931L4636L6822L9466M3099M6432M6289M0979L2783K5931K2962K3887
59417A898217K7679L3260L9656M6581N4460O2901O9542P1709O9191O4681O1461
$$ y = [1616209, 1593924, 1578417, 1569412, 1566112, 1568092, 1575575, 1588751, 1607431, 1631538, 1661319, 1696789, 1737424, 1782662, 1832184, 1885434, 1941181, 1997700, 2052964, 2104644, 2150523, 2189074, 2219205, 2239468, 2248190, 2244612, 2229351, 2203648, 2168691, 2125566, 2075141, 2018040, 1955609, 1890820, 1827089, 1765893, 1706555, 1648518, 1592665, 1540007, 1490465, 1443785, 1400583, 1361622, 1326882, 1296142, 1269687, 1247611, 1229221, 1213927, 1202032, 1193845, 1188810, 1186362, 1186906, 1191034, 1198412, 1208350, 1220817, 1235845, 1252582, 1270089, 1288650, 1309275, 1332219, 1356970, 1383321, 1411448, 1441205, 1472295, 1504931, 1539567, 1576389, 1615855, 1658954, 1705386, 1751675, 1792654, 1825437, 1851368, 1874330, 1898217, 1925896, 1959156, 1998812, 2045393, 2099853, 2162754, 2232296, 2304005, 2373196, 2437877, 2499338]
59406B499338O1274O4203O9757P7595Q7318R7947J08086J16836J24126J29670
59396C436150J32050J29723J22772J12890J01938R1441Q3087P8279P6897P7646
59386D442873P9746Q3205Q7320R0273R0690Q8545Q4221P7926P0445O3214N7028
59375E315486N1533M6452M2164L8630L4884L0157K4497J7736Q935k501j6265l2118
59363E559590n0222o9870q9059j06102j20631j32346j40031j42796j41257j36553
59353D430723j29120j19392j08594r7831q7228p7051o8809o4120o3185o5302p0085
59342C480006p7009q4556r1074r6208j00296j02857j02833j00134r5924r1360
59332B537755q6858q2475p8292p4320p0487o6649o2510n7793n2742m7943m3505
$$ y = [2499338, 2560612, 2624815, 2694572, 2772167, 2859485, 2957432, 3065518, 3182354, 3306480, 3436150, 3568200, 3697923, 3820695, 3933585, 4035523, 4126964, 4210051, 4288330, 4365227, 4442873, 4522619, 4605824, 4693144, 4783417, 4874107, 4962652, 5046873, 5124799, 5195244, 5258458, 5315486, 5367019, 5413471, 5455635, 5494265, 5529149, 5559306, 5583803, 5601539, 5610474, 5607973, 5591708, 5559590, 5509368, 5439498, 5350439, 5244337, 5123706, 4991360, 4851329, 4708533, 4567276, 4430723, 4301603, 4182211, 4073617, 3975786, 3888558, 3811507, 3742698, 3678578, 3615393, 3550091, 3480006, 3402997, 3318441, 3227367, 3131159, 3030863, 2928006, 2825173, 2725039, 2629115, 2537755, 2450897, 2368422, 2290130, 2215810, 2145323, 2078674, 2016164, 1958371, 1905629, 1857686, 1814181]
59321A814181l8908l3912k8778k3523j7767j1685o139j429L175Q223J3385J8491
59309A695314K4037K9923L4829L7818L9645M1451M3091M3776M3593M3307M3197
59298B119981M3150M3336M3828M4013M3201M1408L8855L5347L0844K5856K0426
59287B530245J3499M361n930j5546k3725l0714l6456m0499m2794m3580m2777m0322
59275B225762l6731l2580k7832k2407j6846j1600o364j022L422N933O970P919
59263B094624R452J1457J4123J7885K2564K7782L4127M2679N2900O1557O4135
59252B453285N7666M3085K5426J1094L939L727Q088J4907K2617K9801L5947M1854
59240B751436M8282N4677O0162O4999O9982P5060P9613Q3606Q7321R0395R2079
$$ y = [1814181, 1775273, 1741361, 1712583, 1689060, 1671293, 1659608, 1653469, 1652040, 1655215, 1663438, 1676823, 1695314, 1719351, 1749274, 1784103, 1821921, 1861566, 1903017, 1946108, 1989884, 2033477, 2076784, 2119981, 2163131, 2206467, 2250295, 2294308, 2337509, 2378917, 2417772, 2453119, 2483963, 2509819, 2530245, 2543744, 2548105, 2542175, 2526629, 2502904, 2472190, 2435734, 2395235, 2352441, 2308861, 2266084, 2225762, 2189031, 2156451, 2128619, 2106212, 2089366, 2077766, 2071402, 2070380, 2073802, 2079735, 2086705, 2094624, 2104076, 2115533, 2129656, 2147541, 2170105, 2197887, 2232014, 2274693, 2327593, 2389150, 2453285, 2510951, 2554036, 2579462, 2590556, 2594495, 2598222, 2606310, 2621217, 2643834, 2673635, 2709582, 2751436, 2799718, 2854395, 2914557, 2979556, 3049538, 3124598, 3204211, 3287817, 3375138, 3465533, 3557612]
59229C557612R2018Q9885Q4770P5983O3868M8980L1137J0392j1695l3013n2625
59218C957312p0330q5141r5520j00844j01443r7647q9963p9845o8785n6865m3341
59207C067588k8456j3432J003J4817K7593L8642M8071N6463O3494O8030O9580
59196C413393O8376O3852N4383L8945J8354n264k9501n2216p1936q8043j00182
59185C310161j07922j11527j12430j11949j09912j05566r9327r2457q5432p7995
59175B295644p0545o3981n8115n1646m4002l5961k8308k0991j4011q119m027j575
59163A894363q0J047K251L951O505J0265J5477K1843K8540L5005M1184M6679N0404
59150B157434N1844N1874N1404N0015M7009M3029L9236L5338K9958K2682J4500
$$ y = [3557612, 3649630, 3739515, 3824285, 3900268, 3964136, 4013116, 4044253, 4054645, 4042950, 4009937, 3957312, 3886982, 3801841, 3706321, 3605477, 3504034, 3406387, 3316424, 3236579, 3167794, 3110929, 3067588, 3039132, 3025700, 3026703, 3041520, 3069113, 3107755, 3155826, 3212289, 3275783, 3343813, 3413393, 3481769, 3545621, 3600004, 3638949, 3657303, 3652039, 3622538, 3570322, 3498386, 3410343, 3310161, 3202239, 3090712, 2978282, 2866333, 2756421, 2650855, 2551528, 2459071, 2373639, 2295644, 2225099, 2161118, 2103003, 2051357, 2007355, 1971394, 1943086, 1922095, 1908084, 1899965, 1895938, 1894363, 1894283, 1895330, 1897581, 1901532, 1908037, 1918302, 1933779, 1955622, 1984162, 2019167, 2060351, 2107030, 2157434, 2209278, 2261152, 2312556, 2362571, 2409580, 2452609, 2491845, 2527183, 2557141, 2579823, 2594323]
59139B594323O203k314j1244k0433k9757l8947m7072n3035n6504n7611n6138n1948
59127B175523m5735l8354k9859k0333j0997l146L573J0381J7202K2745K6461K8871
59115B136332L0115K9666K7542K4387K0333J5048Q894K789l015q732j3775j7014
59103B252570j8149j7588j5284j1247o883m026k678j409n1j54k626o711j1567
59090B154197j7084k2640k6851k9190l0492l1293l1114k9846k8322k7033k5574
59079A854758k3840k2376k1047j8915j5894j3151j1276r539p468n629m117j835
59067A699671J826N863Q968J0526R517M146o052j8700l0462l9627m6032m9503
59055A550141m9755m7264m3104l8094l2592k6728k0403j3591o923j303L180P031
$$ y = [2594323, 2600526, 2598212, 2586968, 2566535, 2536778, 2497831, 2450759, 2397724, 2341220, 2283609, 2227471, 2175523, 2129788, 2091434, 2061575, 2041242, 2030245, 2027099, 2030672, 2041053, 2058255, 2081000, 2107461, 2136332, 2166447, 2196113, 2223655, 2248042, 2268375, 2283423, 2292317, 2295106, 2292091, 2283359, 2269584, 2252570, 2234421, 2216833, 2201549, 2190302, 2183419, 2179393, 2176715, 2175306, 2175255, 2175101, 2172475, 2165764, 2154197, 2137113, 2114473, 2087622, 2058432, 2027940, 1996647, 1965533, 1935687, 1907365, 1880332, 1854758, 1830918, 1808542, 1787495, 1768580, 1752686, 1739535, 1728259, 1718720, 1711252, 1705623, 1701506, 1699671, 1701497, 1707360, 1716328, 1726854, 1736371, 1740517, 1734465, 1715765, 1685303, 1645676, 1599644, 1550141, 1500386, 1453122, 1410018, 1371924, 1339332, 1312604, 1292201, 1278610, 1271687, 1270384, 1273564, 1280595]
59043A280595R947J0866R788Q322P844Q279R252J1076J3847J6764J9462K2934
59031A428976K8181L4706M1488M8637N6946O6344P5823Q4663R2892J00607J07356
59020B166619J11926J12445J07152R5424P7852N5348K8995Q60k6021m8940o6354
59009B615306p7464q2009q0793p5419o7117n6509m4662l3072k2262j1668j558
58998B062773O146R800R790P497L494k229r109j6239k3326l0414l6834m1258m2769
58985A897322m1379l7610l1989k4912j6903q925k245K472N578P540Q010O595M143
58972A767697K131J063N39P08K246M963P834J0587J3751J6930J8636J8345J7251
58959A882681J6401J5493J4238J3587J4660J7548K1966K8049L5656M3786N1436
$$ y = [1280595, 1290542, 1301408, 1311196, 1319518, 1327362, 1335641, 1344893, 1355969, 1369816, 1386580, 1406042, 1428976, 1457157, 1491863, 1533351, 1581988, 1638934, 1705278, 1781101, 1865764, 1958656, 2059263, 2166619, 2278545, 2390990, 2498142, 2593566, 2671418, 2726766, 2755761, 2756621, 2730600, 2681660, 2615306, 2537842, 2455833, 2375040, 2299621, 2232504, 2175995, 2131333, 2098261, 2075999, 2064331, 2062773, 2068919, 2078719, 2088509, 2096006, 2099500, 2097271, 2088162, 2071923, 2048597, 2018183, 1981349, 1940091, 1897322, 1855943, 1818333, 1786344, 1761432, 1744529, 1735604, 1733359, 1735831, 1741409, 1748949, 1756959, 1763554, 1767697, 1769828, 1770891, 1771430, 1772138, 1774384, 1779347, 1787181, 1797768, 1811519, 1828449, 1847085, 1865430, 1882681, 1899082, 1914575, 1928813, 1942400, 1957060, 1974608, 1996574, 2024623, 2060279, 2104065, 2155501]
58948B155501N8177O3244O4957O1808N3487M0464K3589M804j2680k5838l3216
58937B454297l4862l1787k5658j7991r149J026J1599K0887K8515L5659M2795M8814
58925B524145N3121N7140O2794P0683Q0599R2625J06639J21599J36219J49486
58915C455050J59850J64908J62992J54608J41882J27395J13743J03026R5826R1330
58905D770610Q8627Q7029Q5143Q1171P4650O6512N6977M4904K9741J2552n652
58894E392264k5053m5802o7192q8899j11339j33783j53674j68932j79583j86211
58884D231796j88571j86975j83356j79305j74319j67424j59257j50976j42282
58875B699331j32297j21518j11254j01858r2908q4493p7041p0396o4173n8456
$$ y = [2155501, 2213678, 2276922, 2341879, 2403687, 2457174, 2497638, 2521227, 2526031, 2513351, 2487513, 2454297, 2419435, 2387648, 2361990, 2343999, 2334850, 2335876, 2347475, 2368362, 2396877, 2432536, 2475331, 2524145, 2577266, 2634406, 2697200, 2767883, 2848482, 2941107, 3047746, 3169345, 3305564, 3455050, 3614900, 3779808, 3942800, 4097408, 4239290, 4366685, 4480428, 4583454, 4679280, 4770610, 4859237, 4946266, 5031409, 5112580, 5187230, 5253742, 5310719, 5355623, 5385364, 5397916, 5392264, 5367211, 5321409, 5254217, 5165318, 5053979, 4920196, 4766522, 4597590, 4418007, 4231796, 4043225, 3856250, 3672894, 3493589, 3319270, 3151846, 2992589, 2841613, 2699331, 2567034, 2445516, 2334262, 2232404, 2139496, 2055003, 1977962, 1907566, 1843393, 1784937]
58865A784937n3228m7948m2483l7594l3623k9798k5673k1982j9074j5907j1834
58854A445793q012n606l814j269J688L830N200O802Q806J0643J2383J4583J7239
58841A508266K0055K3245K7002L0802L4217L7705M1719M5863M9737N3559N6943
58830A929113N8244N6345N2102M7030M1820L7261L5087L6206L9336M3022M7963
58819B423529N5677O5831P6654Q7186R7498J07466J16875J25955J34273J39903
58809C430847J41196J38605J33302J24869J11925R4219P2545M7488J9891q274
58799D306613l5229o0781q4929j06002j22032j33137j40690j44874j44920j41199
58789C192820j35117j27368j17930j07318r6088q3660o9346n4264m0819l0902
$$ y = [1784937, 1731709, 1683761, 1641278, 1603684, 1570061, 1540263, 1514590, 1492608, 1473534, 1457627, 1445793, 1437781, 1432175, 1428361, 1427092, 1428780, 1432610, 1437810, 1444612, 1453418, 1464061, 1476444, 1491027, 1508266, 1528321, 1551566, 1578568, 1609370, 1643587, 1681292, 1723011, 1768874, 1818611, 1872170, 1929113, 1987357, 2043702, 2095804, 2142834, 2184654, 2221915, 2257002, 2293208, 2332544, 2375566, 2423529, 2479206, 2545037, 2621691, 2708877, 2806375, 2913841, 3030716, 3156671, 3290944, 3430847, 3572043, 3710648, 3843950, 3968819, 4080744, 4174963, 4247508, 4294996, 4314887, 4306613, 4271384, 4210603, 4125674, 4019672, 3897640, 3764503, 3623813, 3478939, 3334019, 3192820, 3057703, 2930335, 2812405, 2705087, 2608999, 2525339, 2455993, 2401729, 2360910, 2330008]
58779B330008k5916k7428l5543m7052n7234o3469o5862o5092o1505n5836m8812
58768A776259m0194k9698j8408p707K651J3753K5310L6083M6028N6299O7413P9046
58756B006835R1259J04164J16487J25927J30581J28922J19112J00221P3750M2618
58746C039876R268k3889n3353p6004r1258j00146j03042j00073r2943q4216p5274
58735B248946o6699n9764n5453n2821n0489m9062m9782n1552n1760m9553m5846
58724A666165m0539l2439k1782j0402N18J0493J7732J9718J6002Q243k433j5691
58712A615585k9669m1043m8024n1312n2008n0751m8957m8404m9017m9003m7483
58701A099914m5056m1897l7480l2455k8431k5551k2397j8605j5351j2906r896
$$ y = [2330008, 2304092, 2276664, 2241121, 2194069, 2136835, 2073366, 2007504, 1942412, 1880907, 1825071, 1776259, 1736065, 1706367, 1687959, 1680252, 1682903, 1696656, 1721966, 1758049, 1804077, 1860376, 1927789, 2006835, 2098094, 2202258, 2318745, 2444672, 2575253, 2704175, 2823287, 2923508, 2997258, 3039876, 3049144, 3025255, 2971902, 2895898, 2804640, 2704494, 2601452, 2501379, 2408436, 2324220, 2248946, 2182247, 2122483, 2067030, 2014209, 1963720, 1914658, 1864876, 1813324, 1761564, 1712011, 1666165, 1625626, 1593187, 1571405, 1561003, 1561521, 1572014, 1589746, 1609464, 1625466, 1633709, 1631276, 1615585, 1585916, 1544873, 1496849, 1445537, 1393529, 1342778, 1293821, 1245417, 1196400, 1147397, 1099914, 1054858, 1012961, 975481, 943026, 914595, 889044, 866647, 848042, 832691, 819785, 809889]
58690H09889n578q61L454P529J1283J4274J7119K1006K5453K8451K9155K8516
58678I89690K7170K4919K2572K1877K2992K4232K4874K6048K8041K8838K6248
58667A267501J9724R448m389k0334l5309m6522n2818n4110n1050m5526l9727l4214
58655I12674k8341k2478j8008j5043j2194q947o283m610l057j313k63l12p81j358
58641G89686k431l712m215l814l180k204l26J783K909L540N226P790R577J0385
58627H11014J1581J3421J4917J6498J9760K4269K7643K9418L1830L5954M0086
58616A076391M3019M5944M9791N3405N5717N7221N7913N6254N1626M5543L9049
58605A631873L1242K1704J2057L655m069j1387j6713j8841j8848j8108j6241j2648
$$ y = [809889, 804311, 803450, 806904, 814433, 825716, 839990, 857109, 878115, 903568, 932019, 961174, 989690, 1016860, 1041779, 1064351, 1086228, 1109220, 1133452, 1158326, 1184374, 1212415, 1241253, 1267501, 1287225, 1296673, 1292284, 1271950, 1236641, 1190119, 1137301, 1083191, 1032141, 986615, 946888, 912674, 884333, 861855, 843847, 828804, 816610, 807663, 801380, 796770, 793713, 792400, 792137, 791825, 791044, 789686, 787255, 783543, 779328, 775514, 772334, 770130, 769804, 771587, 774496, 778036, 783262, 791052, 800629, 811014, 822595, 836016, 850933, 867431, 887191, 911460, 939103, 968521, 1000351, 1036305, 1076391, 1119410, 1165354, 1215145, 1268550, 1324267, 1381488, 1439401, 1495655, 1547281, 1592824, 1631873, 1663115, 1684819, 1696876, 1700531, 1696462, 1685075, 1668362, 1649521, 1630673, 1612565, 1596324, 1583676]
58593A583676q318m629j770M10J608K309M217Q159J3157J8491K5005L3332M2608
58580A718255N2042O2107P3048Q3664R2258R7010R4822Q2072N7897K5335j1325
58569B427185m8465q2083j07746j23256j29799j29533j23863j14540j03932r2936
58559A371032q0764o7781n6406m8204m2323l7771l4949l3869l3230l2416l2146
58548H71173l2101l0432k6742k3068k0715j8594j5867j3518j1959r882o963n011
58536F56321m806m568l090j667j088K76L355O242P406Q409J1072J4433J6969J9431
58522G28695K2992K6798K9726L2440L5283L6383L4334L0704K7366K3529J8058
58511A046308J2728J0296J0977J3420J7591K4015L1603L8824M5733N2534N7399
$$ y = [1583676, 1575358, 1570729, 1568959, 1569369, 1570977, 1573286, 1577503, 1585662, 1598819, 1617310, 1642315, 1675647, 1718255, 1770297, 1832404, 1905452, 1989116, 2081374, 2178384, 2273206, 2355278, 2413175, 2438510, 2427185, 2378720, 2296637, 2188891, 2065635, 1935836, 1806303, 1682440, 1567900, 1463968, 1371032, 1290268, 1222487, 1166081, 1117877, 1075554, 1037783, 1002834, 968965, 935735, 903319, 871173, 839072, 808640, 781898, 758830, 738115, 719521, 703654, 690136, 678177, 668295, 661332, 656321, 651515, 646947, 643857, 642190, 641102, 641378, 644733, 650975, 658381, 666790, 677862, 692295, 709264, 728695, 751687, 778485, 808211, 840651, 875934, 912317, 946651, 977355, 1004721, 1028250, 1046308, 1059036, 1069332, 1080309, 1093729, 1111320, 1135335, 1166938, 1205762, 1251495, 1304029, 1361428]
58500A361428N8079N4472M7756L8464K7358J6497P053k552j4222k7282l9780n0981
58488A476290o0473o6618o8268o6666o3549n8884n2455m5987m1384l8276l5379
58477H78351l2782l0894k8797k5763k2863k1034j9200j6361j3774j2883j2756
58466F41244j1782j0264r214q277p026o573p609q530p748o231n541n063l553j670
58452E42163p04k64N22J078Q21Q06J808K544J906J180J830K944L080K805L130
58437E65649L379K798K375K809K762J396L59R87J817J393J098K425L912L744L161
58422F00064M099N587N739N425O596Q638R541R268R075Q900Q175P622P800P543
58408G04072O286N893P653R795J0609J1679J5106J9898K4212K8860L5417M3076
$$ y = [1361428, 1419507, 1473979, 1521735, 1560199, 1587557, 1604054, 1611107, 1608555, 1594333, 1567051, 1527271, 1476290, 1415817, 1349199, 1280931, 1214265, 1150716, 1091832, 1039377, 993390, 952006, 913730, 878351, 845569, 814675, 785878, 760115, 737252, 716218, 697018, 680657, 666883, 654000, 641244, 629462, 619198, 609984, 601707, 594681, 588108, 580499, 571969, 564221, 557990, 552449, 547386, 543833, 542163, 541459, 541195, 541717, 542795, 543616, 544422, 546230, 548774, 550680, 551860, 553690, 556634, 559714, 562519, 565649, 569028, 571826, 574201, 577010, 579772, 581168, 581527, 582514, 584331, 585724, 586822, 589247, 593159, 596903, 600064, 604163, 609750, 615489, 620914, 627510, 636148, 645689, 654957, 664032, 672932, 681107, 688729, 696529, 704072, 710358, 716251, 723904, 733699, 744308, 755987, 771093, 790991, 815203, 844063, 879480, 922556]
58396I22556N0665N9745P2558Q8949J08395J32913J64253J98597K25164K28428
58386B252223J93094J14726J0247q7391j51728j79265j82375j72286j54298j33283
58376A509664j14134r7461q1328o6579n5480m6766l7521k8544k2665j9243j5415
58365I24528j1346r055p699n077k345k020k817j758K70K74r82m25J475J838J093
58350H85954K063M444N670O182Q348J1235J1921J1070J1766J3835J4779J5227
58338A002494J7839K1784K3882K4359K5801K7368K5855K1686J8167J5533J1394
58327A236162O278K966J096j840m921n032k824j598j155J315N140P104P666J0059
58313A260416J3890J5760J5632J6405J7990J8018J7607J9953K3910K5516K5203
$$ y = [922556, 973221, 1032966, 1105524, 1194473, 1302868, 1435781, 1600034, 1798631, 2023795, 2252223, 2445317, 2560043, 2570290, 2482899, 2331171, 2151906, 1969531, 1797245, 1642947, 1509664, 1395530, 1298069, 1216741, 1150162, 1094682, 1047916, 1010395, 981851, 959186, 939943, 924528, 913182, 904127, 896428, 891351, 889006, 886986, 884169, 882411, 882681, 882955, 881973, 881548, 883023, 884861, 885954, 888017, 892461, 898131, 904313, 912661, 923896, 935817, 946887, 958653, 972488, 987267, 1002494, 1020333, 1042117, 1065999, 1090358, 1116159, 1143527, 1169382, 1191068, 1209235, 1224768, 1236162, 1242440, 1245406, 1246502, 1244662, 1239741, 1234709, 1231885, 1230287, 1229132, 1230447, 1235587, 1242691, 1250357, 1260416, 1274306, 1290066, 1305698, 1322103, 1340093, 1358111, 1375718, 1395671, 1419581, 1445097, 1470300]
58302A470300K6929L0866L3682L5400L9239M5174N0410N5596O3826P4260Q3619
58291B009301R2923J05461J19151J28443J32862J35695J35129J25088J04688P8841
58281C167582M9972J7468j4999m0290n6420o6721p1865o9929o3511n7997n2899
58270B740391m3603l1092k0885j3036k794R285J7837K2952K9765L7979M2287M3250
58258B832336M6930N3344N6388N5760N7719O3112O6147O6113O8877P5343Q0013
58247C522082Q2328Q7815R6590J02518J05146J10546J19057J24517J26801J32400
58237D609800J41517J47698J51336J59736J72771J82822J90138K03111K22038
58228F180967K38310K51307K69600K93706L14858L32982L57856L90141M20011
$$ y = [1470300, 1497229, 1528095, 1561777, 1597177, 1636416, 1681590, 1732000, 1787596, 1851422, 1925682, 2009301, 2102224, 2207685, 2326836, 2455279, 2588141, 2723836, 2858965, 2984053, 3088741, 3167582, 3217554, 3235022, 3220023, 3179733, 3123313, 3056592, 2984727, 2914798, 2851287, 2793290, 2740391, 2696788, 2665696, 2644811, 2631775, 2628981, 2638266, 2656103, 2679055, 2708820, 2746799, 2789086, 2832336, 2879266, 2932610, 2988998, 3044758, 3102477, 3165589, 3231736, 3297849, 3366726, 3442069, 3522082, 3604410, 3692225, 3788815, 3891333, 3996479, 4107025, 4226082, 4350599, 4477400, 4609800, 4751317, 4899015, 5050351, 5210087, 5382858, 5565680, 5755818, 5958929, 6180967, 6419277, 6670584, 6940184, 7233890, 7548748, 7881730, 8239586, 8629727, 9049738]
58219I049738M47302M83270N29435N75372O20793O78102P49281Q23276R00680
58210A4857249R96730J114980J243691J384114J555557J766747K011371K299094
58202B7229533K660662L115629L668708M345022N190105O224362P439109Q851823
58194F8724953J0525480J2528004J4933447J7887887K1612159K6270718L1763469
58187B04246117L7436743M1725755M2146058L6263876K3461367O068111j1495337
58180C79852690k5123932l2999564l5702090l4933471l2297250k8874738k5307558
58173A64614087k1928560j8858609j6123911j3734446j1679667r916577q401904
58166F3970413p115085o036109n126993m350586l688584l129973k658451k260718
$$ y = [9049738, 9497040, 9980310, 10509745, 11085117, 11705910, 12384012, 13133293, 13956569, 14857249, 15853979, 16968959, 18212650, 19596764, 21152321, 22919068, 24930439, 27229533, 29890195, 33005824, 36674532, 41019554, 46209659, 52434021, 59873130, 68724953, 79250433, 91778437, 106711884, 124599771, 146211930, 172482648, 204246117, 241682860, 283408615, 325554673, 361818549, 385279916, 391348027, 379852690, 354728758, 321729194, 286027104, 251093633, 218796383, 189921645, 164614087, 142685527, 123826918, 107703007, 93968561, 82288894, 72372317, 63970413, 56855328, 50819219, 45692226, 41341640, 37653056, 34523083, 31864632, 29603914]
58158B9603914j932940j668751j448822j248695j051392q48532o33529l98168
58150B0373085j36196J52186M64104Q03982J184167J615041K108509K700452L457654
58141C2722984M453071N735289P273673Q811355R710827R098744O450038K181163
58133H6437144k418023n986520p899933q378460p995528p217546o309247n421038
58125C4810849m626106l927632l310342k780782k343447j976139j656519j385841
58117A2804041j165949r79492q12884o75001n74191m97706m30942l77682l44856
58108F945338l24682l07143k94567k89938k85149k73643k61265k53081k42457
58099D413413k23876k03591j87201j69342j46061j25457j15767j13654j13439
$$ y = [29603914, 27670974, 26002223, 24553401, 23304706, 22253314, 21404782, 20771253, 20373085, 20236889, 20389075, 20853179, 21657161, 22841328, 24456369, 26564878, 29265330, 32722984, 37176055, 42911344, 50185017, 58996372, 68707199, 77805943, 84255981, 86437144, 84019121, 78032601, 70132668, 61754208, 53758680, 46541134, 40231887, 34810849, 30184743, 26257111, 22946769, 20165987, 17822540, 15846401, 14189882, 12804041, 11638092, 10658600, 9845716, 9170715, 8596524, 8098818, 7667876, 7290194, 6945338, 6620656, 6313513, 6018946, 5729008, 5443859, 5170216, 4908951, 4655870, 4413413, 4189537, 3985946, 3798745, 3629403, 3483342, 3357885, 3242118, 3128464, 3015025]
58090C015025j16833j24371j28030j22120j12095j04252r6129q4923p5514p1667
58080A979091o8494o1772n5844n4520n3039m6998m0777l9148l8647l5036l1487
58069A453329l1647l2041k8860k5240k4616k3854j9967j6661j7299j8104j5345
58058A199695j2548j3685j5700j4736j3505j5425j7573j6409j4700j5856j6993
58047A032565j4540j1284j0968j1072p844l760k942l623j855J311K791L754O682
58034I79215R715R852Q412P928P138M363K217L656O768Q641J0781J5681K1656
58021A096023K6196L0895L8014M5675N1496N7552O6497P6053Q2382Q5863Q8520
58010A745166Q8889Q4441P6394O7217N5985M0751K2938N062j3124l2086m8964
$$ y = [3015025, 2898192, 2773821, 2645791, 2523671, 2411576, 2307324, 2211195, 2126272, 2050758, 1979091, 1910597, 1848825, 1792981, 1738461, 1685422, 1638424, 1597647, 1558499, 1519852, 1484816, 1453329, 1421682, 1389641, 1360781, 1335541, 1310925, 1287071, 1267104, 1250443, 1233144, 1215040, 1199695, 1187147, 1173462, 1157762, 1143026, 1129521, 1114096, 1096523, 1080114, 1065414, 1049558, 1032565, 1018025, 1006741, 995773, 984701, 976857, 973097, 970155, 966532, 964677, 965988, 968779, 972533, 979215, 988930, 998782, 1007194, 1015122, 1022260, 1026623, 1028840, 1032496, 1039264, 1047905, 1058686, 1074367, 1096023, 1122219, 1153114, 1191128, 1236803, 1288299, 1345851, 1412348, 1488401, 1570783, 1656646, 1745166, 1834055, 1918496, 1994890, 2062107, 2118092, 2158843, 2181781, 2186843, 2173719, 2141633, 2092669]
57999B092669o0767o8350p3325p4141o9359o1557n3771m5128l4169k3032j3788
57988A515282l937R576K4894L8545N1184O4989P7949Q5765Q7063Q2116O8852M5429
57976B147707J5006j6540m5870p1257q9266r7457r8571r7183r3785q6505p6585
57965A389694o7391n9455n1099m2623l5521k8885k0904j2576n996k40O925J4822
57953A086751K1404K7527L5446M4416N2040N8782O6838P5377Q0896Q1452P6861
57942A707790O5905M7459K3764j083k5117m7825o6887p9522q6189q9326q9465
57931A359504q5998q0543p5651p1084o5114n8497n3473m9712m5106l9751l5429
57920F99146l1871k7409k2630j9606j8075j5986j3297j1561j0362p954m911l379
$$ y = [2092669, 2031902, 1963552, 1890227, 1816086, 1746727, 1685170, 1631399, 1586271, 1552102, 1529070, 1515282, 1511345, 1520921, 1545815, 1584360, 1635544, 1700533, 1778482, 1864247, 1951310, 2033426, 2102278, 2147707, 2162713, 2146173, 2100303, 2029046, 1939780, 1842323, 1743752, 1646569, 1552784, 1466279, 1389694, 1322303, 1262848, 1211749, 1169126, 1133605, 1104720, 1083816, 1071240, 1065244, 1065004, 1071929, 1086751, 1108155, 1135682, 1171128, 1215544, 1267584, 1326366, 1393204, 1468581, 1549477, 1630929, 1707790, 1773695, 1821154, 1844918, 1843835, 1818718, 1770893, 1704006, 1624484, 1538295, 1448969, 1359504, 1273506, 1192963, 1117312, 1046228, 981114, 922617, 869144, 819432, 774326, 734575, 699146, 667275, 639866, 617236, 597630, 579555, 563569, 550272, 538711, 528349, 520395, 515484, 512105]
57908E12105l050j675P61K145K333L225M754M734K990J959K544K862J804O06j1
57893E38086j203l558n833p007p480p671p428p129p429p739o909n291m199l609
57879D55601k471r18K8N99J862L528M410M664N361O286O441O195O614P175O536
57864E11911N039M007L169J327j044k572l703n835q280r019q185p708p809o873
57850D64425m815l409l052k203m33P77Q00Q35J570K310K932M300O204P108O525
57835D83874N632N170M659L925L475L123K120P40m6l44q72j095M9J851K642K721
57819E17624M091P225J0497J2936J5256J7999K0917K4439K9517L5850M2248M8820
57807G87419N6645O5313P2968P8659Q2284Q2188P5380O0633L9520J4615j1101
$$ y = [512105, 509055, 507380, 508141, 510286, 512619, 515844, 520598, 525332, 528322, 530281, 532825, 535687, 537491, 538097, 538086, 536883, 533325, 527492, 520485, 513005, 505334, 497906, 490777, 483348, 475609, 468700, 463409, 459210, 455601, 453130, 452212, 452240, 452839, 454701, 458229, 462639, 467303, 472664, 478950, 485391, 491586, 498200, 505375, 511911, 516950, 520957, 524126, 525453, 524409, 521837, 518134, 512299, 504019, 495000, 486815, 479107, 471298, 464425, 459610, 456201, 453149, 450946, 450513, 451290, 452090, 452925, 454495, 456805, 459737, 464037, 470241, 477349, 483874, 489506, 494676, 499335, 503260, 506735, 509858, 511978, 512718, 512672, 512328, 511456, 510361, 510410, 512261, 514903, 517624, 521715, 528940, 539437, 552373, 567629, 585628, 606545, 630984, 660501, 696351, 738599, 787419, 844064, 909377, 982345, 1061004, 1143288, 1225476, 1300856, 1361489, 1401009, 1415624, 1404523]
57796A404523l3409m8501n6104n8883n8669n5594n0657m6020m2242l7957l2986
57785H83501k9065k6858k4950k2782k2013k3754k6704k9127l0695l1328l0281
57774E85944k7558k4491k1970j9481j6580j3690j0957p964n051l124j831K24L096
57761D36567N298O410P813J0149J2137J2545J1421Q774M095j954p286j0547j2044
57748D83378j2168j0917r273q787r099q119n377k993k404k436j697p17l86j95
57734D08810O10J692K580L489M377M688M720N532O856P095O069N604O548P463
57720D76133P462P953J0065J2503J3726J4424J6040J8456K0946K4013K8358L3180
57708F83259L7221M0563M3900M6934M8853M9583M9413M8234M6156M3868M1368
$$ y = [1404523, 1371114, 1322613, 1266509, 1207626, 1148957, 1093363, 1042706, 996686, 954444, 916487, 883501, 854436, 827578, 802628, 779846, 757833, 734079, 707375, 678248, 647553, 616225, 585944, 558386, 533895, 511925, 492444, 475864, 462174, 451217, 443253, 438202, 435078, 433247, 433471, 436567, 441865, 448275, 456088, 466237, 478374, 490919, 502340, 511114, 515209, 513255, 505969, 495422, 483378, 471210, 460293, 451020, 442233, 433134, 425015, 419638, 416645, 414241, 411805, 410108, 409391, 409005, 408810, 409420, 411112, 413692, 417181, 421558, 426246, 430966, 436498, 443354, 450449, 456518, 462122, 468670, 476133, 483595, 491548, 501613, 514116, 527842, 542266, 558306, 576762, 597708, 621721, 650079, 683259, 720480, 761043, 804943, 851877, 900730, 950313, 999726, 1047960, 1094116, 1137984, 1179352]
57697A179352L7486L1598K4672J7569R696M49r194j7777k4899l0506l3900l4812
57685A149734l4321l3387l1435k7619k2442j6771j0278k179P363J7885K9787M3588
57673A069925N8978P6006R6379J22099J53508J89749K29284K66732K88882K77409
57663B828951K19637J19367j743j14094j94550k35523k43564k30950k08256j82166
57653A757109j56415j32706j11391r2439p5750o0683m6300l2461j9936r152J73
57642A020049Q086J4250J8997K3142K6449K7593K6045K2613J7691J0677J773p347
57630A210018j5575k3403l0967l6734l9597m0731m1846m2868m2809m1766m0427
57619H13295l8535l5555l2217k9810k8338k6702k4330k1548j8734j6193j4419
$$ y = [1179352, 1216838, 1248436, 1273108, 1290677, 1300373, 1300822, 1291628, 1273851, 1248952, 1218446, 1184546, 1149734, 1115413, 1082026, 1050591, 1022972, 1000530, 983759, 973481, 971302, 978665, 996550, 1026337, 1069925, 1128903, 1204909, 1301288, 1423387, 1576895, 1766644, 1995928, 2262660, 2551542, 2828951, 3048588, 3167955, 3166212, 3052118, 2857568, 2622045, 2378481, 2147531, 1939275, 1757109, 1600694, 1467988, 1356597, 1264158, 1188408, 1127725, 1081425, 1048964, 1029028, 1019876, 1020049, 1028135, 1042385, 1061382, 1084524, 1110973, 1138566, 1164611, 1187224, 1204915, 1215592, 1217365, 1210018, 1194443, 1171040, 1140073, 1103339, 1063742, 1023011, 981165, 938297, 895488, 853722, 813295, 774760, 739205, 706988, 677178, 648840, 622138, 597808, 576260, 557526, 541333, 526914]
57608E26914j3547j2868j1687j0141q635p191o007n678o065n858m280k250r98
57595D31709m44j5R4k80k92O36J420P77n68p16P34K352K899K393J265j70j471
57578D40323k338l096m134n095n426n326n264m993m084l046k771l014k608j112
57564C88016P06K120L296M745O547Q358R778J0698J1478J2663J4425J6573J9110
57551E08513K2128K5161K7429K9034L0928L3355L5241L5672L4831L2968K9585
57540H44845K4512J8627J2541N609k642j0983j7711k2634k6612k9787l1563l1894
57528G32308l1329l0028k7779k4822k1850j9347j7528j6379j5231j3013r753p002
57516D98247n906n664m881l587k777k632k527k313k263k159j584q36m64k92J46
$$ y = [526914, 513367, 500499, 488812, 478671, 470036, 462845, 456838, 451160, 445095, 439237, 434957, 432707, 431709, 431265, 431250, 431344, 431064, 430772, 431408, 432828, 433605, 433037, 432321, 433055, 435407, 438306, 440699, 441964, 441794, 440323, 437985, 434889, 430755, 425660, 420234, 414908, 409644, 404651, 400567, 397521, 394750, 391736, 389128, 388016, 388722, 390842, 394138, 398883, 405430, 413788, 423566, 434264, 445742, 458405, 472830, 489403, 508513, 530641, 555802, 583231, 612265, 643193, 676548, 711789, 747461, 782292, 815260, 844845, 869357, 887984, 900525, 906134, 903492, 892509, 874798, 852164, 825552, 795765, 764202, 732308, 700979, 670951, 643172, 618350, 596500, 577153, 559625, 543246, 528015, 515002, 505249, 498247, 492341, 486677, 481796, 478209, 475432, 472800, 470273, 467960, 465697, 463538, 461954, 461118, 460654, 460362, 460508]
57501D60508O68J019J843L826O275P847Q458R278J1055J3539J6348J9260K1808
57488E81732K3631K5126K6869K8591K9621K9946K9784K8540K5312K0238J4159
57477H63549P268o75q997j6345k2269k7388l1871l4964l6240l6191l5311l3509
57465E87057l0859k8105k6008k4584k3245k1372j8829j6184j4343j3560j3191
57454C56777j2669j2101j1475j0171q063o329o084o766o946o229n257m323l291
57441B57073k454k251k313j931j293j131j418j593j742k358l121l209k706k390
57427B27163k331j935j342j311j705j474m09M40M08J20L47R94J591J897J759J164
57411B25376O44Q19J388J482J030Q60J364K038K399K467K213J534P94M69K46n52
$$ y = [460508, 461176, 462195, 464038, 467864, 474139, 481986, 490444, 499722, 510777, 524316, 540664, 559924, 581732, 605363, 630489, 657358, 685949, 715570, 745516, 775300, 803840, 829152, 849390, 863549, 870817, 870142, 861145, 844800, 822531, 795143, 763272, 728308, 692068, 655877, 620566, 587057, 556198, 528093, 502085, 477501, 454256, 432884, 414055, 397871, 383528, 369968, 356777, 344108, 332007, 320532, 310361, 302298, 295969, 289885, 283119, 276173, 269944, 264687, 260364, 257073, 254619, 252368, 250055, 248124, 246831, 245700, 244282, 242689, 240947, 238589, 235468, 232259, 229553, 227163, 224832, 222897, 221555, 220244, 218539, 217065, 216656, 217096, 217504, 217624, 217971, 218965, 220556, 222453, 224212, 225376, 226020, 226839, 228227, 229709, 230739, 231599, 232963, 235001, 237400, 239867, 242080, 243614, 244408, 244877, 245123, 244571]
57395B44571j635j954j323p16q06j271j692k008j915r65M62J366J513J598J875
57380B37100J852J527J647K390K972L022L038L136K718J894J827K884L727L262
57366B72996K264K025K387K363J894J688J868J947J832J851J922J586Q75M39P44
57351B98681J533K082J865J082O20J065J828J806Q87P7q0j95p77j293j082n01
57335C07598l22n57o48l89K3N46J268K032K571K832K884K834L023L876N213O248
57319C39032O569O630O942P294P283P042O913O818O505O081N727N234M263K827
57305D25160J134p47k670m279n433o430p352p668o996n940n514n854o057n316
57291C56038l735k029p90j22K30O11J223K079L008L679L849L774M034M697M969
$$ y = [244571, 242936, 240982, 239659, 238943, 238137, 236866, 235174, 233166, 231251, 230286, 230748, 232114, 233627, 235225, 237100, 238952, 240479, 242126, 244516, 247488, 250510, 253548, 256684, 259402, 261296, 263123, 266007, 269734, 272996, 275260, 277285, 279672, 282035, 283929, 285617, 287485, 289432, 291264, 293115, 295037, 296623, 297498, 297937, 298681, 300214, 302296, 304161, 305243, 305863, 306928, 308756, 310562, 311449, 311526, 311446, 311251, 310474, 309181, 308099, 307598, 307276, 306719, 306071, 305682, 305705, 306251, 307519, 309551, 312122, 314954, 317838, 320672, 323695, 327571, 332784, 339032, 345601, 352231, 359173, 366467, 373750, 380792, 387705, 394523, 401028, 407109, 412836, 418070, 422333, 425160, 426294, 425547, 422877, 418598, 413165, 406735, 399383, 391715, 384719, 378779, 373265, 367411, 361354, 356038, 352303, 350274, 349484, 349362, 349592, 350203, 351426, 353505, 356513, 360192, 364041, 367815, 371849, 376546, 381515]
57276C81515M230L107K762L300L688L257K428J817J396Q53Q0r01j981k739k840
57261C99972k686l052l968m722n026n249n420n093m498m570n325n409m021k217
57247C38716j330j096m10O96J164N88k72n13J65J500K747L004K073Q28J85J12
57231C48157K11O57J715K838L239L074L120L453L488L246L545M661N765N999N524
57216C98692N074M962M971M914M951N340O026O594O744O760P172P947Q362P924
57202D86433O949N986N149M364L780L476L172K802K922L972N465O517O961P337
57188E55285Q012Q946J0171J1811J3629J5116J6012J6468J6749J7198J8191J9706
57176G27294K1088K1653K1451K0939K0239J9239J8259J7986J8618J9544J9951
$$ y = [381515, 385745, 388852, 391614, 394914, 398602, 401859, 404287, 406104, 407500, 408353, 408433, 407532, 405551, 402812, 399972, 397286, 394234, 390266, 385544, 380518, 375269, 369849, 364756, 360258, 355688, 350363, 344954, 340933, 338716, 337386, 336290, 335880, 336576, 337740, 338328, 338056, 337543, 337708, 339208, 341955, 344959, 347032, 347860, 348045, 348157, 348368, 349025, 350740, 353578, 356817, 359891, 363011, 366464, 369952, 373198, 376743, 381404, 387169, 393168, 398692, 403766, 408728, 413699, 418613, 423564, 428904, 434930, 441524, 448268, 455028, 462200, 470147, 478509, 486433, 493382, 499368, 504517, 508881, 512661, 516137, 519309, 522111, 525033, 529005, 534470, 540987, 547948, 555285, 563297, 572243, 582414, 594225, 607854, 622970, 638982, 655450, 672199, 689397, 707588, 727294, 748382, 770035, 791486, 812425, 832664, 851903, 870162, 888148, 906766, 926310, 946261]
57165I46261J9504J8481J7382J6395J5236J3844J3171J4799J9681K7901L9507
57154A162162N4239O9768Q1612Q6287Q4206P8517P1690O4414N7168N1005M6476
57143A907544M3075M0229L8046L6767L6223L6083L6088L5950L5608L5484L5891
57132B316988L6282L5916L5142L5057L5851L6444L6008L5045L4602L5111L6372
57121B708818L8111M0263M2984M6551N0944N5768O0932O7031P4479Q2678R0823
57110C359382R9249J09130J21194J35579J52631J72871J96488K23922K56609K96270
57100E123325L44036M01473M71629N57537O60317P80254R18568J075740J248733
57091A1581612J432152J620880J808334J982971K129784K233006K271911K218198
$$ y = [946261, 965765, 984246, 1001628, 1018023, 1033259, 1047103, 1060274, 1075073, 1094754, 1122655, 1162162, 1216401, 1286169, 1367781, 1454068, 1538274, 1616791, 1688481, 1752895, 1810063, 1861068, 1907544, 1950619, 1990848, 2028894, 2065661, 2101884, 2137967, 2174055, 2210005, 2245613, 2281097, 2316988, 2353270, 2389186, 2424328, 2459385, 2495236, 2531680, 2567688, 2602733, 2637335, 2672446, 2708818, 2746929, 2787192, 2830176, 2876727, 2927671, 2983439, 3044371, 3111402, 3185881, 3268559, 3359382, 3458631, 3567761, 3688955, 3824534, 3977165, 4150036, 4346524, 4570446, 4827055, 5123325, 5467361, 5868834, 6340463, 6898000, 7558317, 8338571, 9257139, 10332879, 11581612, 13013764, 14634644, 16442978, 18425949, 20555733, 22788739, 25060650, 27278848]
57083B7278848K052544J791354J486620J185131Q88903N65551J97053j92217n57165
57074C4696622q69934j130363j348665j529606j671954j773331j831501j844631
57066B2696637j813250j741589j637135j510148j372537j234525j101869r77159
57058A1308425q62901p61551o73366n96694n30460m74624m28275l89237l55858
57049F235459l27554l03477k82290k63646k48299k36069k24985k13137k00426
57040C935576j88034j77092j68205j61140j54320j45573j34274j22173j11476
57031B573289j02575r4242q5495p6560o8242o1135n5505n1560m9499m9328n0632
57020A828516n2706n4878n6501n6676n4526n0311m5748m2575m0919l9607l7846
$$ y = [27278848, 29331392, 31122746, 32609366, 33794497, 34683400, 35248951, 35446004, 35253787, 34696622, 33826688, 32696325, 31347660, 29818054, 28146100, 26372769, 24541268, 22696637, 20883387, 19141798, 17504663, 15994515, 14621978, 13387453, 12285584, 11308425, 10445524, 9683973, 9010607, 8413913, 7883453, 7408829, 6980554, 6591317, 6235459, 5907905, 5604428, 5322138, 5058492, 4810193, 4574124, 4349139, 4136002, 3935576, 3747542, 3570450, 3402245, 3241105, 3086785, 2941212, 2806938, 2684765, 2573289, 2470714, 2376472, 2290977, 2214417, 2146175, 2085040, 2029535, 1977975, 1928476, 1879148, 1828516, 1775810, 1720932, 1664431, 1607755, 1553229, 1502918, 1457170, 1414595, 1373676, 1334069, 1296223]
57009A296223l5820l3813l1614k9077k6456k3918k1261j8488j6165j4695j3492
56998A031424j1340p666l077J560O514J3213K2713L4600M8040O3398Q2058J05156
56986A386593J33806J70386K18072K79246L55198M43911N30442N77497N36166
56977D631317L81209J41426j10164l02495m06232m34784m17716l78801l32226
56968B771534k86736k47370k15586j90534j70127j51246j31154j09573q8334o8767
56958A112107n0813l4812k2638j6302j6320k1626l0022l8417m3851m5219m3521
56947G48566m0282l6237l1677k7054k2790j8974j5621j2801j0460q462o834n424
56935E11950l529m98L384P359J1291J5225J7781J6242R003k620j5256k5673l2037
$$ y = [1296223, 1260403, 1226590, 1194976, 1165899, 1139443, 1115525, 1094264, 1075776, 1059611, 1044916, 1031424, 1020084, 1012418, 1009341, 1010901, 1017415, 1030628, 1053341, 1087941, 1135981, 1199379, 1281437, 1386593, 1520399, 1690785, 1908857, 2188103, 2543301, 2987212, 3517654, 4095151, 4631317, 5012526, 5153952, 5043788, 4741293, 4335061, 3900277, 3482561, 3103760, 2771534, 2484798, 2237428, 2021842, 1831308, 1661181, 1509935, 1378781, 1269208, 1180874, 1112107, 1061294, 1026482, 1003844, 987542, 971222, 949596, 919574, 881157, 837306, 792087, 748566, 708284, 672047, 640370, 613316, 590526, 571552, 555931, 543130, 532670, 524208, 517374, 511950, 508421, 507923, 511307, 518666, 529957, 545182, 562963, 579205, 588208, 585588, 570332, 544659, 512622]
56922E12622l4211l3537l1797k9749k6934k3173j9524j7219j6148j5136j3391
56911B51803j1145r064p663p125p183p119o317m911l635k962k561j708j43J484
56897A81751K182J736J168J746L554N452O535P200Q527J0969J3966J6558J7967
56884B79311J7712J5557J1492N743j068p685j2502j4553j4192j2610j0714q715
56872B47776o598m522k565m44K134N069Q083J1328J5393K0644K6750L3016L8935
56859C94999M4055M7151M5919L8077K3404M944j2155k3607k8347k8153k5373k1323
56847D59591j6596j1867p733m197q25K750O869J1970J8134K4835L1811L9809M9708
56834F04259O0952P1253P7454P5977O3476L9301P948k2353m4692n7004o0999n9290
$$ y = [512622, 478411, 444874, 413077, 383328, 356394, 333221, 313697, 296478, 280330, 265194, 251803, 240658, 231594, 223931, 216806, 209623, 202504, 196187, 191276, 187641, 184679, 182118, 180410, 180267, 181751, 183933, 185669, 186837, 188583, 192137, 197589, 204124, 211324, 219851, 230820, 244786, 261344, 279311, 297023, 312580, 324072, 329815, 328747, 321062, 308560, 294007, 279815, 267205, 256491, 247776, 241178, 236656, 234091, 233647, 235781, 240850, 248933, 260261, 275654, 296298, 323048, 356064, 394999, 439054, 486205, 532124, 570201, 593605, 598549, 586394, 562787, 534440, 506287, 480914, 459591, 442995, 431128, 423395, 419198, 418373, 421123, 427992, 439962, 458096, 482931, 514742, 554551, 604259, 665211, 736464, 813918, 889895, 953371, 992672, 1000620, 978267, 933575, 876571, 815572, 756282]
56822G56282n4266m8059m1901l5718k9228k2989j7537j2240o053J004Q162J5399
56810E12856K3670L3652M4885N5636O2869O2858N3261L5006J1863j1558l1142
56799H53856m3870m8852m7944m4311l9992l5333l0313k5376k0980j7274j4261
56788D85350j1604q428m153O34N011R164J3962J9124K2928K3642K0284J2210l50
56775E87774j4869k7148l4358l6801l6320l4112l0678k6829k3421k0506j7632
56764B85100j4750j2291j0567r580r133q789p998o702n480m868m775m791m646
56751A80730m194l386k471j818j359o56L07R72J086J139J574K185K683L370M707
56736A84869O557Q289R385R681R327Q813Q744R329J0368J1815J3839J6109J7655
$$ y = [756282, 702016, 653957, 612056, 576338, 547110, 524121, 506584, 494344, 488291, 489295, 497457, 512856, 536526, 570178, 615063, 670699, 733568, 796426, 849687, 884693, 896556, 884998, 853856, 809986, 761134, 713190, 668879, 628887, 593554, 563241, 537865, 516885, 499611, 485350, 473746, 465318, 461165, 461799, 466810, 475974, 489936, 509060, 531988, 555630, 575914, 588124, 587774, 572905, 545757, 511399, 474598, 438278, 404166, 373488, 346659, 323238, 302732, 285100, 270350, 258059, 247492, 237912, 228779, 219990, 211992, 205290, 199810, 194942, 190167, 185376, 180730, 176536, 173150, 170679, 168861, 167502, 166846, 167153, 168125, 169211, 170350, 171924, 174109, 176792, 180162, 184869, 191426, 199715, 209100, 218781, 228108, 236921, 245665, 254994, 265362, 277177, 291016, 307125, 324780]
56723C24780J7847J7092J6142J5082J3496J1227Q554N829L413J706Q94P62J047
56710D37871J705K555L035K766K190K164K925L783L946L413K938L111L590L446
56696D79438K295P53m81j604l279n485p507q974j0203j1466j2561j3304j3756
56683C93866j3750j2826j0965q853p106n749m682m102m092m269m257m190m266
56670C04759m268l808k868j773q83m14k22L39J842L967N665O324O240N741M639
56655C25280K892J206L86N35J348K634M075M933M686L630K338Q40j009k749l684
56640C47341l887m139m833n477n399m396k667n50J469K904L718M404N368O322
56626C40178O568N931N074M700M629M044K738J548J266J568J537R42L26L1j46
$$ y = [324780, 342627, 359719, 375861, 390943, 404439, 415666, 424220, 430049, 433462, 435168, 436062, 436824, 437871, 439576, 442131, 445166, 447932, 450122, 452286, 455211, 458994, 462940, 466353, 469291, 472402, 475992, 479438, 481733, 482486, 482005, 480401, 477122, 471637, 464130, 455156, 444953, 433487, 420926, 407622, 393866, 380116, 367290, 356325, 347472, 340366, 334617, 329935, 325833, 321741, 317472, 313215, 309025, 304759, 300491, 296683, 293815, 292042, 291159, 290745, 290523, 290862, 292704, 296671, 302336, 308660, 314900, 320641, 325280, 328172, 329378, 329764, 330299, 331647, 334281, 338356, 343289, 347975, 351605, 353943, 354783, 353774, 351025, 347341, 343454, 339315, 334482, 329005, 323606, 319210, 316543, 315993, 317462, 320366, 324084, 328488, 333856, 340178, 346746, 352677, 357751, 362451, 367080, 371124, 373862, 375410, 376676, 378244, 379781, 380723, 381049, 381080, 380934]
56611C80934k70k8O34J278J630J874K006J489m7k064l528l858l233k282j632j541
56595C71362j661j422p47j58r9n03j083j719k388l038l713m555n579o678p805
56580C30214q898r677r852r513q960q239p242o090m928l525j705K5J030J630K774
56565B57044M568O060O625O734P006P359P434P194O708N978N219M744M328L461
56551C40462K352J846J962J474m10k809m266m471m202m167m581n460o585p387
56537C03758p396o672n529m243l222k906l140l157k622k083k014j947j225o6O79
56522B58215N70k11j356k626l709m326m431m177l821l694l893l998l565k928k886
56507B13164l529m070m003l682l539l511l522l773m150m040l227k274j697j395
$$ y = [380934, 380664, 380636, 381270, 382548, 384178, 386052, 388058, 389547, 389500, 387436, 383908, 380050, 376817, 374535, 372903, 371362, 369701, 368279, 367532, 367374, 367275, 366772, 365689, 363970, 361582, 358544, 354831, 350276, 344697, 338019, 330214, 321316, 311639, 301787, 292274, 283314, 275075, 267833, 261743, 256815, 253290, 251585, 251610, 252640, 254270, 257044, 261612, 267672, 274297, 281031, 288037, 295396, 302830, 310024, 316732, 322710, 327929, 332673, 337001, 340462, 342814, 344660, 346622, 348096, 347686, 344877, 340611, 336140, 331938, 327771, 323190, 317730, 311145, 303758, 296362, 289690, 284161, 279918, 276696, 273790, 270650, 267493, 264871, 262788, 260774, 258827, 257602, 257536, 258215, 258785, 258574, 257218, 254592, 250883, 246557, 242126, 237949, 234128, 230434, 226541, 222543, 218978, 216050, 213164, 209635, 205565, 201562, 197880, 194341, 190830, 187308, 183535, 179385, 175345, 172118, 169844, 168147, 166752]
56493A66752j245j423j768j623q23l6L37P87J686K484K590K290K119K102K234
56478A76463K925M156M961M623L788L500L732L683L046K132J101o7j144j944k713
56463B08242l651m359m361l841l292k818k262j671j135o26l22m86p43k08J238
56448A79705K521K803K448K029J403N64L92J442K761L043K365J752J582J552J718
56433B08080K431L433M103M412M834N478O060O375O226N312L851K761K451K118
56419B67925J002k91p46n61o69j177j450j369j377j516j515j618k229k918k904
56404B48587k342k225k987m119n043n516n336m528l733l602l870l823l376l025
56390A95062k862k517j880j170m65J84M39J58j67j33r1m11o04j63L09n5q02p34
$$ y = [166752, 165507, 164084, 162316, 160693, 159870, 159834, 160171, 160958, 162644, 165128, 167718, 170008, 172127, 174229, 176463, 179388, 183544, 188505, 193128, 196916, 200416, 204148, 207831, 210877, 213009, 214110, 214043, 212899, 210955, 208242, 204591, 200232, 195871, 192030, 188738, 185920, 183658, 181987, 180852, 180226, 179904, 179418, 178675, 178467, 179705, 182226, 185029, 187477, 189506, 190909, 191473, 191865, 193307, 196068, 199111, 201476, 203228, 204810, 206362, 208080, 210511, 213944, 218047, 222459, 227293, 232771, 238831, 245206, 251432, 256744, 260595, 263356, 265807, 267925, 268927, 268636, 267890, 267329, 266660, 265483, 264033, 262664, 261287, 259771, 258256, 256638, 254409, 251491, 248587, 246245, 244020, 241033, 236914, 231871, 226355, 221019, 216491, 212758, 209156, 205286, 201463, 198087, 195062, 192200, 189683, 187803, 186633, 186168, 186352, 186791, 186949, 186782, 186649, 186558, 186147, 185543, 185380, 185689, 185634, 184832, 184098]
56372A84098K01Q93Q58P74J084J229P05n3k70K48J089J724J873J702J654J844
56356A99653J860J415P99L58J1k64o5P48J625K114K454K756K392J073k20l59M00
56339B16750R60R20O42L29N3J85P44Q94L4r77q39L88J533J986K031J893J490R53
56321B29969M84L0k13M29K018L384L567L124L012L020K634K454L246M248M116
56306B65522L091K566K900L297L550M178M974N052M413M005M156M253L951L477
56292C19385K875K194K167L351M854N363N094N247N782N554M522M024M650N519
56278C80581N963O372P044P636Q075Q756R595J0112J0644J2124J4542J6875J8756
56265E17075K0815K3200K5179K6501K7818K9393L0669L1397L1986L2414L2098
$$ y = [184098, 184299, 185192, 186050, 186824, 187908, 189137, 189842, 189789, 189519, 189767, 190856, 192580, 194453, 196155, 197809, 199653, 201513, 202928, 203727, 204085, 204096, 203832, 203767, 204515, 206140, 208254, 210708, 213464, 215856, 216929, 216709, 216350, 216750, 217710, 218630, 219272, 219601, 219654, 219839, 220583, 221477, 221511, 220534, 219695, 220083, 221616, 223602, 225633, 227526, 229016, 229969, 230453, 230483, 230270, 230699, 232717, 236101, 239668, 242792, 245804, 248824, 251458, 253912, 257158, 261406, 265522, 268613, 271179, 274079, 277376, 280926, 285104, 290078, 295130, 299543, 303548, 307704, 311957, 315908, 319385, 322260, 324454, 326621, 329972, 334826, 340189, 345283, 350530, 356312, 361866, 366388, 370412, 375062, 380581, 386544, 392916, 399960, 407596, 415671, 424427, 434022, 444134, 454778, 466902, 481444, 498319, 517075, 537890, 561090, 586269, 612770, 640588, 669981, 700650, 732047, 764033, 796447, 828545]
56254H28545L1181L0738L1186L1608L1112K9824K8193K6209K3746K0898J7660
56243A130900J3941R986O099J975k961q588j4242j9565k4497k8721l1968l4532
56231I97827l6586l7535l7034l5994l5413l4820l3246l1100k9561k8613k7321
56220F30604k5572k3884k1857j8699j5107j2761j1962j1426j0326q909p180m837
56208D58084k585j718k143k410j825j022l70N25J590K187K382K935L867M411M403
56193D68311M330M180L625L149L467M104M095L758M038M516L993K757K209K452
56179E18984K369J958K359L493L932L337K904L140L192K782K794L576M497N363
56165E64680O562P668P774P341P806R305J0623J1417J2483J3885J4898J5807J7690
$$ y = [828545, 859726, 890464, 921650, 953258, 984370, 1014194, 1042387, 1068596, 1092342, 1113240, 1130900, 1144841, 1154827, 1160926, 1162901, 1159940, 1151352, 1137110, 1117545, 1093048, 1064327, 1032359, 997827, 961241, 923706, 886672, 850678, 815265, 780445, 747199, 716099, 686538, 657925, 630604, 605032, 581148, 559291, 540592, 525485, 512724, 500762, 489336, 479010, 470101, 462921, 458084, 455499, 453781, 451638, 449228, 447403, 446381, 446011, 446536, 448126, 450313, 452695, 455630, 459497, 463908, 468311, 472641, 476821, 480446, 483595, 487062, 491166, 495261, 499019, 503057, 507573, 511566, 514323, 516532, 518984, 521353, 523311, 525670, 529163, 533095, 536432, 539336, 542476, 545668, 548450, 551244, 554820, 559317, 564680, 571242, 578910, 586684, 594025, 601831, 611136, 621759, 633176, 645659, 659544, 674442, 690249, 707939]
56152G07939K0412K2972K5648K9633L4649L9329M3935N0264N8880O8958Q0750
56141A183369R5579J13357J32785J53973J77771K02081K21658K32141K31912K20398
56131B965024J98214J69873J43006J23210J11366J05612J02734R7164Q2759N7866
56121D156828K6904l759k9496m7415n6759o0972o6692p9051r9255j26221j57301
56110C456811j86952k08451k18618k18763k10865j95906j76265j55851j36537
56101A748603j17531r9182q3956p2562o2666n2803m4327l8127l2755k7308k3004
56090A094382k0349j7792j4655j2382j1514j0442q450o976o523n457l135j160
56078I75547l00P25K391L439L745M748O200O169N016N515Q047R780R672R944J1409
$$ y = [707939, 728351, 751323, 776971, 806604, 841253, 880582, 924517, 974781, 1033661, 1102619, 1183369, 1278948, 1392305, 1525090, 1679063, 1856834, 2058915, 2280573, 2512714, 2744626, 2965024, 3163238, 3333111, 3476117, 3599327, 3710693, 3816305, 3919039, 4016203, 4098962, 4156828, 4183732, 4179973, 4150477, 4103062, 4046303, 3985331, 3918639, 3839588, 3740333, 3614112, 3456811, 3269859, 3061408, 2842790, 2624027, 2413162, 2217256, 2040991, 1885140, 1748603, 1631072, 1531890, 1447934, 1375372, 1312706, 1259903, 1215576, 1177449, 1144694, 1117386, 1094382, 1074033, 1056241, 1041586, 1029204, 1017690, 1007248, 998798, 991822, 985299, 979842, 976707, 975547, 975247, 975972, 978363, 981802, 985547, 990295, 996495, 1002664, 1007680, 1013195, 1021242, 1031022, 1040694, 1050638, 1062047]
56063A062047J1934J1014J1218J3350J4761J4349J4575J6527J7664J6691J6026
56052A220156J7136J8057J7808J8617K1310K3171K2909K3047K5009K6457K6098
56041A459775K6203K7881K8705K7765K8022L0983L3947L5103L6114L7148L5161
56030A806807L0071K6785K7898L0102L0908L2795L7310M1362M3224M5919N0865
56019B204046N4540N5404N7460O2788O7348O8697P0669P5598P9120P8141P6845
56008B950656P9118Q1942Q2176Q2919Q7097R1516R3388R5990J01934J07769J11226
55997C965731J16427J25941J35285J41511J49140J61214J73106J81956J93204
55988E343515K10480K28363K42807K59027K81036L03602L23093L45633L75370
$$ y = [1062047, 1073981, 1084995, 1096213, 1109563, 1124324, 1138673, 1153248, 1169775, 1187439, 1204130, 1220156, 1237292, 1255349, 1273157, 1291774, 1313084, 1336255, 1359164, 1382211, 1407220, 1433677, 1459775, 1485978, 1513859, 1542564, 1570329, 1598351, 1629334, 1663281, 1698384, 1734498, 1771646, 1806807, 1836878, 1863663, 1891561, 1921663, 1952571, 1985366, 2022676, 2064038, 2107262, 2153181, 2204046, 2258586, 2313990, 2371450, 2434238, 2501586, 2570283, 2640952, 2716550, 2795670, 2873811, 2950656, 3029774, 3111716, 3193892, 3276811, 3363908, 3455424, 3548812, 3644802, 3746736, 3854505, 3965731, 4082158, 4208099, 4343384, 4484895, 4634035, 4795249, 4968355, 5150311, 5343515, 5553995, 5782358, 6025165, 6284192, 6565228, 6868830, 7191923, 7537556, 7912926]
55979G912926M05770M32140M61249M98403N37243N73358O15132O69525P30556
55970A2836302P94255Q70756R68402J081152J205902J356024J542925J762548
55962B2418266K017075K330786K727074L212226L801973M538108N453686O548513
55954E3047707P827708R338492J1144662J3308291J5942955J9248115K3420572
55947A53278502K8480983L4044695L8978660M1163696L8012931K8021857J2348177
55940C74329501n207970k0194095k9876114l4081586l4271758l2154546k8978392
55933A89565040k5507810k2162069j9109676j6385021j3997087j1943433j0183454
55926G0276490q665211p367329o281137n373991m604279l953875l415688k966408
$$ y = [7912926, 8318696, 8750836, 9212085, 9710488, 10247731, 10821089, 11436221, 12105746, 12836302, 13630557, 14501313, 15469715, 16550867, 17756769, 19112793, 20655718, 22418266, 24435341, 26766127, 29493201, 32705427, 36507400, 41045508, 46499194, 53047707, 60875415, 70213907, 81358569, 94666860, 110609815, 129857930, 153278502, 181759485, 215804180, 254782840, 295946536, 333959467, 361981324, 374329501, 369121531, 348927436, 319051322, 284969736, 250697978, 218543432, 189565040, 164057230, 141895161, 122785485, 106400464, 92403377, 80459944, 70276490, 61611279, 54243950, 47962813, 42588822, 37984543, 34030668, 30614980, 27648572]
55918B7648572k579255k248692j977589j752992j556606j386241j245840j125949
55910A3775408j013507r10330q23707p48580o75822o08610n54312n08655m63134
55901G468751m20040l85854l57355l27862k99983k79189k61618k40837k20127
55892D675886k06027j95791j82706j68109j57040j47529j34830j21248j11621
55883C250985j03995r4165q4485p8822p3824o4429n3246m5583l9898l2119k4876
55872B555543k3522k6942l0728l5404m3234n0862n3472n2900n3792n5260n3908
55861B075519n1544n2107n4230n4288n3668n5644n8274n7742n5618n5466n5220
55850A471718n0493m2935l7838l5566l2343k7640k3832k0266j4339p011j001M988
$$ y = [27648572, 25069317, 22820625, 20843036, 19090044, 17533438, 16147197, 14901357, 13775408, 12761901, 11851571, 11027864, 10279284, 9603462, 8994852, 8440540, 7931885, 7468751, 7048711, 6662857, 6305502, 5977640, 5677657, 5398468, 5136850, 4896013, 4675886, 4469859, 4274068, 4091362, 3923253, 3766213, 3618684, 3483854, 3362606, 3250985, 3146990, 3052825, 2968340, 2889518, 2815694, 2751265, 2698019, 2652436, 2612538, 2580419, 2555543, 2532021, 2505079, 2474351, 2438947, 2395713, 2344851, 2291379, 2238479, 2184687, 2129427, 2075519, 2023975, 1971868, 1917638, 1863350, 1809682, 1754038, 1695764, 1638022, 1582404, 1526938, 1471718, 1421225, 1378290, 1340452, 1304886, 1272543, 1244903, 1221071, 1200805, 1186466, 1179455, 1178454, 1183442]
55838A183442J4204K5289L3219L5292L1266K0053K253j5935k7440l1893l3605
55827A236145l4064l1867k8215k6344k6427k6241k5887k6875k7871k6275k2887
55816I33192k0323j8144j4193r272n753l016J113N911R425J2924J8820K5715L0497
55803I66896L3957L9156M5326M8545M7553M3954L7465K6117J0910m300j7421k8723
55791A249435l7635m3243m7204n1852n5963n6499n3840n1068m8862m5413m0865
55780G16991l7382l5021l1690k7251k3798k1986k0549j9204j8550j7625j5083
55769D48852j2244j1500j2272j1993j0381r203q575p234n745n629n999m843l053
55756C40181l260n173o020n293n143o235o979o869o952o953n381k603o28N5M38
$$ y = [1183442, 1197646, 1222935, 1256154, 1291446, 1322712, 1342765, 1345018, 1329083, 1301643, 1269750, 1236145, 1202081, 1170214, 1141999, 1115655, 1089228, 1062987, 1037100, 1010225, 982354, 956079, 933192, 912869, 894725, 880532, 871260, 865507, 862491, 863604, 869515, 878940, 891864, 910684, 936399, 966896, 1000853, 1040009, 1085335, 1133880, 1181433, 1225387, 1262852, 1288969, 1299879, 1295579, 1278158, 1249435, 1211800, 1168557, 1121353, 1069501, 1013538, 957039, 903199, 852131, 803269, 757856, 716991, 679609, 644588, 612898, 585647, 561849, 539863, 519314, 500110, 481560, 463935, 448852, 436608, 425108, 412836, 400843, 390462, 381259, 372684, 365450, 359705, 354076, 348077, 343234, 340181, 336921, 331748, 325728, 320435, 315292, 309057, 302078, 295209, 288257, 281304, 275923, 273320, 272692, 272747, 273185]
55741B73185L67q57j944j115M54K78j028p54J056J770J023J182K857L896L315
55726B83685K559K348J769R62J398K987M024M330N334O877P156O093N431N305
55712C40258L943J204r10j737k749m353n005m160l202k855k382j684j522j443
55698C13403l35R46N02j032r14J488M166O268R015J2440J4770J5825J7739K1381
55684D15662K5286K8893L3627L9759M5356M9500N3601N8196O1203O0601N6301
55673I27985M8435L6505K1592O864n376j5058k2083k5269k4618k2108j8959j4317
55661H93593p710n89N723J1407J6363J9145J8782J5819J0504J884j0203k3826
55649I50892l6508m6671n3207n5616n5047n3458n1314m7751m3067l8803l5260
$$ y = [273185, 273552, 272695, 270751, 269636, 270090, 270368, 269340, 268586, 269642, 271412, 272435, 273617, 276474, 280370, 283685, 286244, 288592, 290361, 291323, 292721, 295708, 299732, 304062, 309396, 316273, 323429, 329522, 334953, 340258, 344201, 345405, 344495, 342758, 340009, 335656, 330651, 326491, 323289, 320434, 318052, 316368, 314846, 313403, 313068, 314014, 314516, 313484, 312570, 314058, 318224, 324492, 333507, 345947, 360717, 376542, 394281, 415662, 440948, 469841, 503468, 543227, 588583, 638083, 691684, 749880, 811083, 871684, 927985, 976420, 1012925, 1034517, 1041381, 1036005, 1020947, 998864, 973595, 948977, 926869, 907910, 893593, 885883, 885294, 891017, 902424, 918787, 937932, 956714, 972533, 983037, 984921, 974718, 950892, 914384, 867713, 814506, 758890, 703843, 650385, 599071, 551320, 508253, 469450, 434190]
55638D34190l1290k6919k3705k2009k0330j7889j5565j3748j1723r710q962r215
55626B23125q561o546m914m528m131l015k313k675l125l205l771m732m459k591
55612A64559r48o38o86m89j069k571l189j968l39M46J019J715J340l30j304m24
55596A55124P26P30P82K142L410K755J088N51J261J779J748J962K631L325L976
55581A83990M534M481L814L616M556N941P084Q411J0287J2135J3728J5883J8770
55568B97230K0993K1435K0535J8698J5095R321K829k724p314j1500j4911j6995
55556C52692j7988j8036j6607j3863j1255r599p909n235k188M79L302O777J0030
55543B70600J2226J4081J6670J9881K3290K7279L1978L6305L9268M1129M2078
$$ y = [434190, 402900, 375981, 352276, 330267, 309937, 292048, 276483, 262735, 251012, 241302, 232340, 223125, 214564, 208018, 203104, 198576, 194445, 191430, 189117, 186442, 183317, 180112, 176341, 171609, 167150, 164559, 163611, 162973, 162287, 161798, 160729, 158158, 154969, 153001, 152662, 153108, 154127, 155842, 157182, 156852, 155548, 155124, 155850, 156580, 157362, 159504, 162914, 165669, 166757, 167308, 168569, 170348, 172096, 174058, 176689, 180014, 183990, 188524, 193005, 196819, 200435, 204991, 210932, 218016, 226427, 236714, 248849, 262577, 278460, 297230, 318223, 339658, 360193, 378891, 393986, 403307, 406136, 403412, 396098, 384598, 369687, 352692, 334704, 316668, 300061, 286198, 274943, 265344, 257435, 252200, 250012, 250491, 253793, 260570, 270600, 282826, 296907, 313577, 333458, 356748, 384027, 416005, 452310, 491578, 532707, 574785]
55532E74785M1056L7116L0710K2399J1669j508j5132k6686l5341m1443m4916m5524
55520E07185m3918m1161l7875l4573l1866k9541k6642k3215k0581j9028j6918
55509A81867j3290r718q090p952p657o914o452o208n574m726m260m007l492k934
55495I0593k770k818k816k971l212k843j730q06o69q37j017j648k425k021m03
55480F1607M12p81k405k540j675j307j346r10m73j028k023k098j233m24J25P98
55464D4699J245Q50N1k60j89l56o47o46o59j042j228o98j01j97m70o4P21J184
55446D2193J493J904J710M48p65p36r7j25m78N7J310K009J946K008K349K194J384
55429E8804O62M44M52M86N47M55J95J97N46N42n0k49O24J595J483Q15Q47J479
$$ y = [574785, 615841, 652957, 683667, 706066, 717735, 716227, 701095, 674409, 639068, 597625, 552709, 507185, 463267, 422106, 384231, 349658, 317792, 288251, 261609, 238394, 217813, 198785, 181867, 168577, 158859, 150769, 142817, 135160, 128246, 121794, 115586, 110012, 105286, 101026, 97019, 93527, 90593, 87823, 85005, 82189, 79218, 76006, 73163, 71433, 70627, 69958, 69121, 68104, 66456, 64031, 62010, 61607, 62019, 61238, 58833, 56293, 54618, 53311, 51965, 51055, 50582, 49554, 47531, 45433, 44200, 43776, 43901, 44699, 45944, 46794, 46845, 46585, 46396, 46040, 45393, 44747, 44088, 43046, 41818, 41120, 41019, 40822, 40352, 40288, 41009, 42193, 43686, 45590, 47300, 47748, 46983, 46247, 46150, 46025, 45547, 45604, 46914, 48923, 50869, 52877, 55226, 57420, 58804, 59466, 59910, 60362, 60848, 61395, 61850, 62045, 62242, 62788, 63330, 63280, 63031, 63655, 65250, 66733, 67548, 68395, 69874]
55411F9874J591R38K78L1Q0L96Q08O51k55j010j017j085j993k951k834k011j500
55394E9991j237p20m16r18j473j115n06r07j969k327j803j221o06N36J545J210
55378D8064j67j062r41n51k56J55K38p44k186k535j417M8J011J569J756J340O50
55361D4972K72op70j636j676r81m76m26l66k54l70l80J78P52N22j72m87o76j396
55342C6624k046j588n90n27j239j165p9N80K31l5M47R03P64N90P55P44L47J78
55324C4894M40N08J41j36k09n96j138q90K42J073R20M79N06P60Q37R02J003O96
55306D0432j01p95j024j034r06l96K73M66K33K98P35P87K29k36k90m80r88j093
55288C6110m47J59o4p85j156q98l34R4P0l75p80q34q63j196j348p93r1k27r74
$$ y = [69874, 71465, 72403, 72681, 72712, 72792, 73188, 73996, 74647, 74392, 73382, 72365, 71280, 69287, 66336, 63502, 61491, 59991, 58754, 58034, 57618, 56700, 55227, 54112, 53606, 52699, 50730, 48403, 46600, 45379, 44773, 45309, 46854, 48064, 47897, 46835, 45894, 45343, 45087, 45242, 45480, 44736, 42550, 40015, 38598, 38646, 39657, 41226, 42982, 44322, 44972, 45244, 45238, 44468, 42832, 41156, 40175, 39699, 39273, 38907, 38653, 38283, 37903, 38081, 38833, 39355, 39183, 38696, 38020, 36624, 34578, 32990, 32400, 31873, 30634, 29469, 29390, 29970, 30201, 30166, 30613, 31516, 32280, 32870, 33625, 34369, 34716, 34894, 35334, 35842, 35983, 35847, 35638, 35042, 33904, 33014, 33256, 34329, 35249, 35728, 36234, 36994, 37831, 38733, 39736, 40432, 40331, 39536, 38512, 37478, 36572, 36176, 36449, 36915, 37148, 37446, 38181, 38968, 39197, 38961, 38671, 38191, 37203, 36110, 35663, 35822, 35758, 34973, 33817, 32919, 32585, 32679, 32749, 32374, 31594, 30760, 29897, 28701, 27353, 26560, 26469, 26242, 25268]
55269B5268j205o50j15J5J76M85N20M01P41J401J445O61j16l28k35l3L72O35K88
55250B9726j86O5O39L63n13m55P60J467Q52K69Q48J523Q50n80j089l32N98Q87
55232C5692O56K85J00L38P85P44m1r25j241j091q36m60J37P94J382J919K075J363
55214D1676Q1p99r83j197j697j588k95J242J714J122M46K24K56K72J64j96p36
55197C9706j094j118j180j549j881j692j068n35m08n37m34K68J284J639O95r02
55181C1194j841j626q58k02J53J03l84q52p11o7N14R19J303J235K61q05n43R19
55163B8712J831J320N11N63R63O89m3l28m8K29K77L11L80L92M40N86O58N84N69
55144C8596P18Q85J097J562K166K533K691K943L052K411J191M00N09Q98R50P55
$$ y = [25268, 24063, 23413, 23298, 23313, 23489, 23974, 24494, 24895, 25636, 27037, 28482, 29143, 29027, 28699, 28464, 28431, 28803, 29438, 29726, 29540, 29605, 30244, 30607, 30094, 29639, 30399, 31866, 32718, 32987, 33835, 35358, 36208, 35628, 34539, 34207, 34805, 35692, 36348, 36633, 36733, 37071, 37856, 38600, 38559, 37634, 36393, 35302, 34466, 34006, 34143, 34937, 36319, 38238, 40313, 41676, 41757, 40958, 39975, 38778, 37081, 35493, 35198, 36440, 38154, 39276, 39722, 39946, 40202, 40474, 40638, 40442, 39706, 38612, 37494, 36314, 34765, 32884, 31192, 30124, 29589, 29181, 28644, 28210, 28478, 29762, 31401, 32096, 31194, 29353, 27727, 26869, 26667, 26820, 26923, 26539, 25687, 24976, 24909, 25423, 26342, 27645, 28880, 29141, 28336, 27793, 28712, 30543, 31863, 32374, 32937, 33900, 34589, 34546, 34218, 34170, 34399, 34676, 34987, 35367, 35759, 36199, 36785, 37443, 38027, 38596, 39314, 40199, 41296, 42858, 45024, 47557, 50248, 53191, 56243, 58654, 59845, 60245, 60754, 61652, 62602, 63357]
55128F3357M07m05j616k468k484j954j199j90O97O47l78j325j483j290j202q49
55112D8265l9M68Q6n56o22l20k83l92j91J20Q1j34p3R9q2m75n67k98JK81P42J289
55090D7400J567J445J015M35L3J93P36P67k94j829k611k109q58K46P41P41O03
55073D8221M10l8o29p55j05O93R10Q36J162J650J493Q44O85J135J290R80J161
55056E9943K114K680K103J344J585K504L010K860K514K092J492J032J068J334
55042H7675J344J053N56l43j641k696k863k201j166j63L25j47j258j976j829j493
55026G3177j614j910j923j879k089k169j653q25l08k52m32o64p12l12K86M34N5
55009E7210k12p5J06L09J025J988K007P93k65k4Q41J158J085J358J731J549J295
$$ y = [63357, 63764, 63359, 61743, 59275, 56791, 54837, 53638, 53448, 54145, 54792, 54414, 53089, 51606, 50316, 49114, 48265, 48226, 48694, 48780, 48224, 47602, 47282, 46999, 46607, 46416, 46536, 46617, 46483, 46410, 46509, 46427, 45952, 45385, 45087, 45088, 45369, 46111, 47400, 48967, 50412, 51427, 51862, 51895, 52088, 52824, 53591, 53297, 51468, 48857, 46748, 45890, 46136, 46877, 47618, 48221, 48631, 48593, 47964, 47209, 47104, 47797, 48707, 49543, 50705, 52355, 53848, 54692, 55377, 56512, 57802, 58782, 59943, 62057, 64737, 66840, 68184, 69769, 72273, 75283, 78143, 80657, 82749, 84241, 85273, 86341, 87675, 89019, 90072, 90628, 90285, 88644, 85948, 83085, 80884, 79718, 79555, 79880, 79733, 78475, 76499, 74670, 73177, 71563, 69653, 67730, 65851, 63762, 61593, 59940, 59115, 58807, 58555, 58123, 57459, 56747, 56435, 56721, 57155, 57210, 56998, 56923, 57029, 57338, 58363, 60351, 62358, 63151, 62886, 62862, 63703, 64861, 65946, 67304, 69035, 70584, 71879]
54992G1879K084L960N794O771P079P316Q008R442J1332J3012J4371J6107J8581
54979A95736K1187K3386K5377K6957K6744K3640J8291J2032N260j941q471j3054
54967C55144j5931j8216j9952k0247j9152j7845j6983j6085j4764j3302j1894
54956A70773j0347q739p461o458n242l784k576j752q55L88J765L069M231N082
54942A38094N567O279P996J0673J3465J5773J7714J9591K1425K2930K3398K1776
54930C24681J7482J1120L920l319j0232j6169k0345k2687k3779k3910k2800k0425
54918A93537j7541j5071j3257j1630r700p553n741m621l910l156k383j875j507
54905I5592r67n06o00r12n92K15L27n89j367j147o92j016j807k186k089j896j545
$$ y = [71879, 73963, 77923, 83717, 90488, 97567, 104883, 112891, 122333, 133665, 146677, 161048, 177155, 195736, 216923, 240309, 265686, 292643, 319387, 343027, 361318, 373350, 378610, 376669, 368198, 355144, 339213, 320997, 301045, 280798, 261646, 243801, 226818, 210733, 195969, 182667, 170773, 160426, 151687, 144226, 137768, 132526, 128742, 126166, 124414, 123559, 123947, 125712, 128781, 133012, 138094, 143661, 149940, 157936, 168609, 182074, 197847, 215561, 235152, 256577, 279507, 302905, 324681, 342163, 353283, 357203, 353884, 343652, 327483, 307138, 284451, 260672, 236762, 213962, 193537, 175996, 160925, 147668, 136038, 126338, 118785, 113044, 108423, 104513, 101357, 98974, 97099, 95592, 94625, 94119, 93519, 92607, 92015, 92230, 92557, 91968, 90601, 89454, 88762, 87746, 85939, 83753, 81664, 79768, 78223]
54888G8223j061j192k289l289k997j823j101j218j534j644j599j271o69m25r27
54873E5184j446j227q72j318k048j765n17M47P54J259K250K871K631K204K264
54858F0671K582K679K548K323J973J516J002K91o10j185j083q69j187j518q26
54843F8307P15J799J812J478J556J926K238K504K824L242M053N603P638R625J1536
54828A26856J3673J5785J7348J8596K0354K2613K4285K4431K2968J9981J5331
54817C42221R276K743l424q984j3907j7911k0543k1353k0191j7713j5331j3897
54805B00986j2768j0910q598p070o658o435n743m954m424l649j995K94K306L357
54791A33739L540L603M267N493O670P707R380J2105J5130J7571J9610K1754K3615
$$ y = [78223, 77162, 75970, 73681, 70392, 67395, 65572, 64471, 63253, 61719, 60075, 58476, 57205, 56536, 56111, 55184, 53738, 52511, 51639, 50321, 48273, 46508, 45991, 46438, 47192, 48451, 50701, 53572, 56203, 58407, 60671, 63253, 65932, 68480, 70803, 72776, 74292, 75294, 75585, 74975, 73790, 72707, 71838, 70651, 69133, 68307, 69022, 70821, 72633, 74111, 75667, 77593, 79831, 82335, 85159, 88401, 92454, 98057, 105695, 115320, 126856, 140529, 156314, 173662, 192258, 212612, 235225, 259510, 283941, 306909, 326890, 342221, 351497, 354240, 350816, 341832, 327925, 310014, 289471, 268118, 247927, 230214, 214883, 200986, 188218, 177308, 168710, 161640, 154982, 148547, 142804, 137850, 133426, 129777, 127782, 128076, 130382, 133739, 137279, 140882, 145149, 150642, 157312, 165019, 174399, 186504, 201634, 219205, 238815, 260569, 284184]
54778B84184K4488K4483K3788K1436J6345R405K991j580m789p253q885r855j0839
54765C63919j1865j2193j1824j1941j3293j5184j6540j7131j7182j6695j5666
54754B04405j4342j2926j1471j0261r567r041q024o575n441m930m622m159l601
54741I9445k976k254j696j487j215n19R8Q8L2P17J437Q23q27j700j135l51k57
54724H8223k31L87J126J455J649J905J802J309J118J376J301O20K18O23J074Q50
54708A04805L98L31M49M74O93J107R81P9o84o99o37j157j684j517j068r87r25
54691I9959l59K56L39M50J429K755L079K124R87P01J315K239K835K828K636K945
54675A26518L628L731K969K425L029M210M944N358O194P298P875Q012Q711J0441
$$ y = [284184, 308672, 333155, 356943, 378379, 394724, 404129, 407120, 405540, 400751, 393498, 384613, 374758, 363919, 352054, 339861, 328037, 316096, 302803, 287619, 271079, 253948, 236766, 220071, 204405, 190063, 177137, 165666, 155405, 145838, 136797, 128773, 122198, 116757, 111827, 107205, 103046, 99445, 96469, 94215, 92519, 91032, 89817, 89298, 89396, 89484, 89516, 90233, 91670, 92493, 91666, 89966, 88831, 88480, 88223, 87992, 88379, 89505, 90960, 92609, 94514, 96316, 97625, 98743, 100119, 101420, 102040, 102258, 102881, 103955, 104805, 105203, 105534, 105983, 106457, 107150, 108257, 109238, 109317, 108633, 107934, 107297, 106140, 104456, 102939, 101871, 100884, 99959, 99600, 99856, 100195, 100645, 102074, 104829, 107908, 110032, 111019, 111720, 113035, 115274, 118109, 120937, 123573, 126518, 130146, 133877, 136846, 139271, 142300, 146510, 151454, 156812, 163006, 170304, 178179, 186191, 194902, 205343]
54661B05343J2587J4458J6068J7792J9812K1960K3655K3953K2031J7674J1270
54650D06603L669l887j0267j5243j9318k2524k4042k3409k1469j9497j7888j6311
54638B16417j4603j2921j1326r854q695p843o936n831m871m265l716l184l203
54625A19169l854m070k911j013J25R5r3M77J526K169K004J443J230J656K174J979
54609A22106J058L10M60J257J969K225K064J648J214R83Q22M26p9k18K0J72K09
54592A36646O11J261J245L64k55K31R67N89q67k268l086l654m058l847k919j829
54576A19131j069o32l93l74n61q03r67r55p07l28m0J94O79J415J900J806J548
54559A19844J823K794L953M643M572M107M084M977O285P199P789Q866J0625J2289
$$ y = [205343, 217930, 232388, 248456, 266248, 286060, 308020, 331675, 355628, 377659, 395333, 406603, 410272, 406385, 396118, 380875, 361557, 339033, 314991, 291582, 270113, 250616, 232728, 216417, 201814, 188893, 177567, 167713, 159018, 151175, 144239, 138408, 133537, 129272, 125556, 122372, 119169, 115315, 111245, 108334, 107321, 107446, 107541, 107448, 107925, 109451, 111620, 113624, 115067, 116297, 117953, 120127, 122106, 123164, 123474, 123934, 125191, 127160, 129385, 131449, 133097, 134311, 135294, 136116, 136542, 136463, 136245, 136265, 136437, 136646, 137257, 138518, 139763, 140127, 139872, 140103, 141070, 141659, 140792, 138524, 135438, 131784, 127726, 123879, 120960, 119131, 118062, 117430, 117037, 116663, 116102, 115299, 114332, 113377, 112670, 112342, 112302, 112496, 113175, 114590, 116490, 118296, 119844, 121667, 124461, 128414, 133057, 137629, 141736, 145820, 150797, 157082, 164281, 172070, 180936, 191561, 203850]
54545B03850J3216J3550J3470J2585J0582P722M390P48k860n827p967r567j0556
54532B43336j0495r621q950q904q778q059p276p006o969o691o142n217l546j507
54518A44175l42n19j012q86n21m27r4Q75J632J332O38O35J064J012O40P82J303
54501A50287J278N44k07o28q89r19n56j65j44j16L70Q06L66p03j507j922k491
54484A43404l152l212k465j355l04K99j39j572k665k183p04J22k16q86j365j859
54468A21748k248j972j223r70j519k089k080j752j496j286j145j301j633j666
54454I9368j226n61J44P56R03M25q0M8M39K40n36j118j286j525j905j862j223
54437I1001n22j19J22K85K52J35J56Q3m25j066j253j088j122j291j032l68J14
$$ y = [203850, 217066, 230616, 244086, 256671, 267253, 274975, 279365, 280113, 277253, 271426, 263459, 253892, 243336, 232841, 223220, 214270, 205366, 196588, 188529, 181253, 174247, 167278, 160587, 154445, 149228, 145682, 144175, 143833, 143314, 142302, 141416, 140895, 140468, 140374, 141249, 142881, 144213, 144851, 145486, 146550, 147562, 148202, 148984, 150287, 151565, 152109, 151902, 151274, 150385, 149466, 148910, 148745, 148601, 148485, 148855, 149661, 150027, 149324, 147817, 145895, 143404, 140252, 137040, 134575, 133220, 132916, 133215, 133076, 131504, 128839, 126656, 125952, 126074, 125858, 124972, 123607, 121748, 119500, 117528, 116305, 115335, 113816, 111727, 109647, 107895, 106399, 105113, 103968, 102667, 101034, 99368, 98142, 97581, 97725, 98481, 99384, 99809, 99729, 99777, 100216, 100456, 99920, 98802, 97516, 95991, 94086, 92224, 91001, 90479, 90360, 90482, 90767, 91019, 91154, 91310, 91393, 90968, 89902, 88649, 87561, 86439, 85148, 84116, 83748, 83862]
54420H3862K97O26J075J085N56P2jJ46L37N66O82O62R56J706K011J081k73n89
54402I4857L1J95m56q50n90o07j205j150L62K196K776K068J120N03J90K61P36
54385A00437J169J199J134J345J552J302P97O53R80J277J051L17m30o67m57m97
54369A11162j173j821j537n97j88p77j575j768j429j013p58q59j413j897j493
54354I2864k73O49M70m15j205j654j904j966j860j715j496j078p40r65j618j997
54338G5097j865j677j635j340o75j80j53j54J09K04k12p36q52o99o41o56n43m05
54320F2987m05n20p62j170j373p82L70R55L01q88j466j208o71k77n9l9k64n65
54302E4164o65m57p6J91K8n32r07n44L56J074J295J255J064N71p3m39n20o82r18
$$ y = [83862, 84159, 84785, 85860, 86945, 87501, 87573, 87572, 87718, 88055, 88621, 89303, 89965, 90921, 92627, 94638, 95719, 95446, 94857, 94888, 95083, 94627, 93777, 93187, 92580, 91375, 90225, 90587, 92783, 95559, 97627, 98747, 99250, 99440, 99701, 100437, 101606, 102805, 103939, 105284, 106836, 108138, 108935, 109588, 110568, 111845, 112896, 113213, 112783, 112116, 111659, 111162, 109989, 108168, 106631, 106034, 105846, 105069, 103494, 101726, 100297, 99284, 98526, 97667, 96254, 94357, 92864, 92591, 93240, 93710, 93295, 92090, 90436, 88532, 86566, 84706, 82991, 81495, 80417, 79677, 78712, 77094, 75097, 73232, 71555, 69920, 68580, 67905, 67725, 67572, 67418, 67527, 67731, 67519, 66783, 65931, 65232, 64591, 63935, 63392, 62987, 62582, 62062, 61300, 60130, 58757, 57975, 58345, 59300, 59601, 58713, 57247, 56039, 55368, 55091, 55032, 54993, 54729, 54164, 53499, 53042, 52966, 53157, 53185, 52653, 51746, 51202, 51558, 52632, 53927, 55182, 56246, 56817, 56744, 56305, 55785, 55103, 54185]
54283E4185q38m82l76o08o43k70P9K14N16J073J297Q95M00K95K68r8n71p02n19
54264E4115l44k98l76n79p37o25m54o69j112j059l06M96Q12Q14P36M29m7j86R5
54245E0705J31m88j206j332r85o84n64m57l15j50J10L80M29K67O6l25j057j545
54227D2980r58L43R74M49j49M0L59r1q95j038m66P0K53L35L66J21l69p32p04k47
54207D0641M63R63Q02J42l94n35n11l86l9J03o13j803k166j314l47j16q5M04R56
54188C6165J056J071J286J039k6q47m06M64K23r90j604r45N0M06J57j86k92m5
54170C6576L78M89J56k4L70P65M99jO1L79k4j072j580r85q5K02j03m37l99J46
54150C5311J041J751J832J625J882K640K995K225O28q35j429j090k90L97P75J017
$$ y = [54185, 53347, 52865, 52489, 51881, 51238, 50968, 51047, 51261, 51777, 52850, 54147, 55042, 55442, 55737, 56005, 55907, 55336, 54634, 54115, 53771, 53473, 53097, 52518, 51781, 51156, 50702, 50033, 48921, 47862, 47556, 48052, 48864, 49678, 50414, 50843, 50796, 50610, 50705, 50836, 50348, 49142, 47810, 46825, 46141, 45577, 45120, 44805, 44655, 44765, 45145, 45574, 45841, 45907, 45582, 44525, 42980, 42022, 42365, 43339, 43788, 43639, 43679, 44038, 43947, 43052, 42014, 41548, 41618, 41871, 42206, 42572, 42693, 42324, 41592, 40888, 40641, 41104, 42067, 42869, 43011, 42617, 42082, 41571, 41185, 41146, 41249, 40636, 38833, 36667, 35353, 35006, 34890, 34805, 35209, 36165, 37221, 38292, 39578, 40617, 40591, 39744, 39338, 39802, 40025, 39035, 37431, 36486, 36536, 36942, 37099, 36913, 36621, 36576, 36954, 37443, 37599, 37575, 37945, 38710, 39209, 39208, 39269, 39648, 39624, 38552, 36972, 35987, 35902, 36104, 36001, 35564, 35165, 35311, 36352, 38103, 39935, 41560, 43442, 46082, 49077, 51302, 51930, 51095, 49666, 48576, 48286, 48683, 49458, 50475]
54134E0475J190J082P25N86R01J192Q79P1p24j277j540j254l07P21R65J68j178
54117E2675k383k910k524j525o75m80p28r13p59j78P23J404J234M53K0J59p7j192
54099D2324k151j777m66N35Q53R23P87K16l35k02K89K39k51j93O20J194Q66K21
54081D3692M9K68K90l5l34k04M24J197J593J460J144R11N62k7m25k10L23O47Q03
54062E2128J072J243R35L23j84o86j428j952j584n78J21J68J9m9j65j22N58J659
54044E1478K224J850J231J164J581J896J791J321P65N50R70J751K236K117J725
54029G4650J538J697K089K609L193L738M051L930L455L184L572M159L936K756
54015A18557J704J658K215K550K618K728K628J896Q81L15L01M04M25L14j94j074
$$ y = [50475, 51665, 52747, 53472, 54058, 54959, 56151, 57030, 57101, 56377, 55100, 53560, 52306, 51999, 52720, 53685, 53853, 52675, 50292, 47382, 44858, 43333, 42658, 42178, 41450, 40537, 39778, 39600, 40323, 41727, 42961, 43414, 43434, 43593, 43516, 42324, 40173, 38396, 37930, 38465, 39318, 40241, 41028, 41244, 40909, 40707, 40996, 41235, 40984, 40791, 41411, 42605, 43471, 43692, 43741, 44009, 44299, 44264, 43930, 43726, 44150, 45347, 46940, 48400, 49544, 50455, 51017, 50990, 50565, 50355, 50678, 51325, 52128, 53200, 54443, 55378, 55701, 55517, 54831, 53403, 51451, 49867, 49289, 49410, 49578, 49597, 49548, 49383, 49261, 49819, 51478, 53702, 55552, 56783, 57947, 59528, 61424, 63215, 64536, 65301, 65851, 66821, 68572, 70808, 72925, 74650, 76188, 77885, 79974, 82583, 85776, 89514, 93565, 97495, 100950, 104134, 107706, 111865, 115801, 118557, 120261, 121919, 124134, 126684, 129302, 132030, 134658, 136554, 137435, 137750, 138051, 138455, 138880, 139194, 139000, 137926]
53999A37926j584j275r25j474k443k615j958j615k006k315j987j502j346j231
53985A13650q60n71p67j268j615j659j559j540j675j702j283o99q00j773k548
53970I3331k235j563j833k885l282k371j005j92j12n21j113j352q79j64K3k24
53954G3623k01J21Q4m30q10q08p61o52NJ067J650J349P24L50K53M39J068J800
53936G8871J951J499J158J228J236R51Q63J378K250L028L369K937J803Q48R40
53921A04310J734K257K425K839L268K812J677J209J850K591K900L563M927N844
53907A44206N411M494M426N122N632N683N674N695N579N447N426N194M358K976
53893B15323J359j03p17N2J503J972P89q78j598j336r43r01j223j942k907l662
$$ y = [137926, 136342, 135067, 134142, 132668, 130225, 127610, 125652, 124037, 122031, 119716, 117729, 116227, 114881, 113650, 112790, 112219, 111452, 110184, 108569, 106910, 105351, 103811, 102136, 100434, 99151, 98452, 97652, 95879, 93331, 91096, 89533, 87700, 84815, 81533, 79162, 78157, 77965, 77853, 77332, 76219, 74867, 73988, 73824, 73847, 73623, 73422, 73543, 73627, 73197, 72387, 71579, 70818, 70166, 70171, 71238, 72888, 74237, 74961, 75311, 75564, 76003, 77071, 78871, 80822, 82321, 83479, 84707, 85943, 86894, 87757, 89135, 91385, 94413, 97782, 100719, 102522, 103370, 104310, 106044, 108301, 110726, 113565, 116833, 119645, 121322, 122531, 124381, 126972, 129872, 133435, 138362, 144206, 149617, 154111, 158537, 163659, 169291, 174974, 180648, 186343, 191922, 197369, 202795, 207989, 212347, 215323, 216682, 216579, 215862, 215914, 217417, 219389, 220178, 219300, 217702, 216366, 215423, 214522, 213299, 211357, 208450, 204788]
53877B04788m013m214m298l950l314l008k970k396j300q66j592k313k020j427
53863A67107j606k183k237k102k722l792m088l411k797k851l083k985k745k724
53849A27781k919l105l040k546j802j372j497j693j503j213j318j689j851j740
53835A00493j603j458j208j005r89j017j021j163j322j008k45J44k38o33k80M08
53819H7855O73O97J100J629J496O91k1j98K5N28J238J674J372O38K57N51J216
53802A01421J810J919J305M33L35J270K114J949J511K038L215L589K743J747J523
53787A28922J932K594L385L911L560K426J423J122J181J124R81R00P44M21J22
53772A54748M2J90M84O64J98j177k864l883l906l360k652j914j414j495j975k264
$$ y = [204788, 200775, 196561, 192263, 188313, 184999, 181991, 179021, 176625, 175325, 174459, 172867, 170554, 168534, 167107, 165501, 163318, 161081, 158979, 156257, 152465, 148377, 144966, 142169, 139318, 136235, 133250, 130505, 127781, 124862, 121757, 118717, 116171, 114369, 112997, 111500, 109807, 108304, 107091, 105773, 104084, 102233, 100493, 98890, 97432, 96224, 95219, 94230, 93213, 92192, 91029, 89707, 88699, 88454, 88598, 88360, 87727, 87447, 87855, 88528, 89225, 90325, 91954, 93450, 94141, 94120, 93922, 93947, 94475, 95713, 97387, 98759, 99397, 99654, 100205, 101421, 103231, 105150, 106455, 106888, 107223, 108493, 110607, 112556, 114067, 116105, 119320, 122909, 125652, 127399, 128922, 130854, 133448, 136833, 140744, 144304, 146730, 148153, 149275, 150456, 151580, 152561, 153461, 154205, 154626, 154748, 154790, 154980, 155464, 156128, 156326, 155149, 152285, 148402, 144496, 141136, 138484, 136570, 135156, 133661, 131686, 129422]
53756A29422k119j820j616j519j596j883j996j521q26p74j494k106j951j394j096
53741A05711j036p55k12R1j83q23j323j416j268j221j395j592j585j346r70o57
53725I0020p24j304j919j819r65k10k37p50j056r96q09n61k61j64m25o86n49j83
53707G6402ON4K19L72J92k00m13l91l78l55rP89J770K455K380J473L55k14l78
53688H4129j013k168k628j624j38M45K55L83J006J308J004P27R58J502K059K417
53672H8622K213J395P19R06J470J377O60K49L78M15K41N19J312J746J479J303
53656A05004J731K080J624Q32O17J092J688K052K101J700Q56J2l08m3M89Q91Q38
53639A23256L48N7O31J692J973R55k33j46J127K064J571J28r79j142p97n09k32
$$ y = [129422, 127303, 125483, 123867, 122348, 120752, 118869, 116873, 115352, 114526, 113752, 112258, 110152, 108201, 106807, 105711, 104675, 103920, 103708, 103799, 103616, 102793, 101470, 100054, 98786, 97565, 96170, 94578, 92993, 91647, 90677, 90020, 89296, 87992, 86073, 84254, 83289, 83079, 82842, 82092, 81036, 80040, 79231, 78670, 78409, 78245, 77820, 77134, 76585, 76402, 76408, 76462, 76681, 77053, 77245, 77045, 76632, 76241, 75863, 75508, 75499, 76288, 78058, 80513, 82893, 84366, 84721, 84507, 84129, 83116, 80948, 78320, 76696, 76558, 77003, 77258, 77641, 78647, 79955, 80959, 81686, 82644, 84146, 86205, 88622, 90835, 92230, 92949, 93855, 95325, 96702, 97362, 97611, 97989, 98404, 98645, 99164, 100476, 102222, 103701, 105004, 106735, 108815, 110439, 111271, 111888, 112980, 114668, 116720, 118821, 120521, 121377, 121389, 121081, 121038, 121527, 122418, 123256, 123604, 123661, 124292, 125984, 127957, 128912, 128679, 128533, 129660, 131724, 133295, 133423, 132444, 131302, 130505, 129996, 129764]
53622A29764K36N10P9o37o18J29K87q20k023j984j167q30q36j06J121J339J72
53605A24616r76j141r97j184j019M9J019P28k70m82L39J095J101P43M65J94j1
53588A24269L32J368K420K685K183J622J485J564J497J413J751K445K762K235
53574A50031J357R39J082J320J471J663J734J395J002J292K277L104L173K713
53560A74553K030J135K87J36P68J355J277R02P06L25p19j879k052j102n3K13j48
53543A77734m70m41k30p4q5l23p71j215j366j259j349j882k292j813p28k89j028
53526A62119j860j507k54O22O35L53J78j4j37R4M02J90k99j40Q15J676J929K055
53508A66857K405K560K251J948K018K143K125K402L214M059M569N049N662N958
$$ y = [129764, 130000, 130510, 130589, 129952, 129334, 129463, 129750, 128930, 126907, 124923, 123756, 122926, 122090, 121984, 123105, 124444, 124616, 123640, 122499, 121502, 120318, 119299, 119348, 120367, 121095, 120825, 120343, 120682, 121777, 122878, 123621, 124086, 124280, 124269, 124601, 125969, 128389, 131074, 133257, 134879, 136364, 137928, 139425, 140838, 142589, 145034, 147796, 150031, 151388, 152327, 153409, 154729, 156200, 157863, 159597, 160992, 161994, 163286, 165563, 168667, 171840, 174553, 176583, 177718, 178005, 178141, 178909, 180264, 181541, 182443, 183149, 183474, 182755, 180876, 178824, 177722, 177669, 177882, 177734, 177264, 176823, 176593, 176519, 176434, 176111, 175340, 174125, 172759, 171500, 170151, 168269, 165977, 164164, 163436, 163147, 162119, 160259, 158752, 158498, 159120, 159755, 160108, 160286, 160272, 160135, 160229, 160631, 160821, 160522, 160382, 161197, 162873, 164802, 166857, 169262, 171822, 174073, 176021, 178039, 180182, 182307, 184709, 187923, 191982, 196551, 201600, 207262, 213220]
53494B13220N791N842O492P101P204P464Q468R449R375Q712Q854J0175J1756J2820
53480C32723J3399J3766J4109J4711J5684J6622J7200J7726J8438J8617J7466
53469E10461J5531J4301J4458J5481J6849J8498K0054K0768K0681K0912K2261
53458G10255K4129K5221K4891K3451K1660K0186J9261J8434J6922J4441J1562
53447I30413R225Q037Q028Q730R561J0339J1399J2891J4164J4241J2956J1134
53435A061118R669Q754Q096P376O302M526J829j597n147q074r950j1004j1911
53422A059987j3061j4255j5243j6254j7625j9164k0306k0716k0464j9729j8830
53411H64340j8333j8607j9374k0055k0579k1249k1943k2000k1043j9371j7434
$$ y = [213220, 219011, 224853, 231345, 238446, 245650, 253114, 261582, 271031, 280406, 289118, 297972, 308147, 319903, 332723, 346122, 359888, 373997, 388708, 404392, 421014, 438214, 455940, 474378, 492995, 510461, 525992, 540293, 554751, 570232, 587081, 605579, 625633, 646401, 667082, 687994, 710255, 734384, 759605, 784496, 807947, 829607, 849793, 869054, 887488, 904410, 918851, 930413, 939638, 947675, 955703, 964433, 973994, 984333, 995732, 1008623, 1022787, 1037028, 1049984, 1061118, 1070787, 1079541, 1087637, 1095013, 1101315, 1105841, 1107670, 1106073, 1100926, 1092852, 1082902, 1071898, 1059987, 1046926, 1032671, 1017428, 1001174, 983549, 964385, 944079, 923363, 902899, 883170, 864340, 846007, 827400, 808026, 787971, 767392, 746143, 724200, 702200, 681157, 661786, 644352]
53400F44352j5344j3162j1215r819q870p939o646m883k788o42J406L452N521P324
53386E80747Q601R674J1215J3345J5423J6836J7667J8316J8908J9362J9836K0638
53374G70568K1758K2858K3757K4702K6013K7696K9595L1706L4125L6642L8723
53363A088143M0055M0929M1909M3188M4507M5585M6338M6711M6605M6131M5626
53352A575727M5258M4829M4052M2753M0774L8108L5269L3146L2123L1628L0930
53341A994597L0103K9835L0421L1458L2405L2977L2953L2033K9911K6173K0096
53330B322962J1093l85j2681k3983l3329m0540m5620m8767n0719n2375n3895n4741
53318A917020n4763n4672n5003n5227n4621n3629n3412n4086n4520n4086n3572
$$ y = [644352, 629008, 615846, 604631, 594812, 585942, 578003, 571357, 566474, 563686, 563044, 564450, 567902, 573423, 580747, 589348, 599022, 610237, 623582, 639005, 655841, 673508, 691824, 710732, 730094, 749930, 770568, 792326, 815184, 838941, 863643, 889656, 917352, 946947, 978653, 1012778, 1049420, 1088143, 1128198, 1169127, 1211036, 1254224, 1298731, 1344316, 1390654, 1437365, 1483970, 1530101, 1575727, 1620985, 1665814, 1709866, 1752619, 1793393, 1831501, 1866770, 1899916, 1932039, 1963667, 1994597, 2024700, 2054535, 2084956, 2116414, 2148819, 2181796, 2214749, 2246782, 2276693, 2302866, 2322962, 2334055, 2333670, 2320989, 2297006, 2263677, 2223137, 2177517, 2128750, 2078031, 2025656, 1971761, 1917020, 1862257, 1807585, 1752582, 1697355, 1642734, 1589105, 1535693, 1481607, 1427087, 1373001, 1319429]
53307A319429n3733n3928n3060n1228m9376m7764m5891m3695m1684l9828l7367
53296H01875l3843k9575k5030k0558j6751j4111j2221j0198q167p119p080o594
53284F10628m729k487j335j227r93o2J134K104K753L191L728M790O350P818Q952
53269F40615J0232J1785J2725J2407J1724J2066J3438J4709J5365J5841J6282
53258G87189J6260J5914J6185J7548J9331K0688K1498K1929K1783K0848J9480
53247I98653J8411J8196J9011K0646K2424K3533K3680K3197K2290K0528J7489
53236A228058J3612R960P071M371Q84l629q505j3054j7175k0954k4089k6305k8063
53223A122182l0193l2710l4696l5438l5063l3844l1727k8948k6447k4960k4188
$$ y = [1319429, 1265696, 1211768, 1158708, 1107480, 1058104, 1010340, 964449, 920754, 879070, 839242, 801875, 768032, 738457, 713427, 692869, 676118, 662007, 649786, 639588, 631421, 624302, 617222, 610628, 605899, 603412, 602077, 600850, 599857, 599795, 600929, 603033, 605786, 608977, 612705, 617495, 623845, 631663, 640615, 650847, 662632, 675357, 687764, 699488, 711554, 724992, 739701, 755066, 770907, 787189, 803449, 819363, 835548, 853096, 872427, 893115, 914613, 936542, 958325, 979173, 998653, 1017064, 1035260, 1054271, 1074917, 1097341, 1120874, 1144554, 1167751, 1190041, 1210569, 1228058, 1241670, 1251630, 1258701, 1263072, 1263956, 1260327, 1251822, 1238768, 1221593, 1200639, 1176550, 1150245, 1122182, 1091989, 1059279, 1024583, 989145, 954082, 920238, 888511, 859563, 833116, 808156, 783968]
53212G83968k3452k2753k2558k3052k4165k5912k7999k9544k9950k9786k9976
53201D94821l0376k9939k8153k5520k2732k0092j7724j5623j3502j1190r095p711
53189B63164o855o039n414n468n916n837m999m229m198m627m882m697m072l194
53175A92737k652l066m162m796m290l205k519k509k767k859k544j787r10n14q71
53160A53286j559j944j855j610j531j579j445r88o06r15j880k592k299j356p39
53145A30388q50j273j466j131k48O37M35j246l131l476k240j059r93j461j611
53130A11275j522j478j159l93J10k91j063j216p45m42n78o34l10L0P4L8K74P66
53112A02736J269J598J613J216N14j24l87l60l52m46l79j0L17J57l62n99k79J17
$$ y = [783968, 760516, 737763, 715205, 692153, 667988, 642076, 614077, 584533, 554583, 524797, 494821, 464445, 434506, 406353, 380833, 358101, 338009, 320285, 304662, 291160, 279970, 270875, 263164, 256309, 250270, 244856, 239388, 233472, 227635, 222636, 218407, 214209, 209582, 204700, 200003, 195931, 192737, 190085, 187019, 182857, 178061, 173771, 170566, 168047, 165538, 162771, 159912, 157368, 155581, 154671, 154157, 153286, 151727, 149783, 147928, 146318, 144787, 143208, 141763, 140775, 140169, 139254, 137374, 134782, 132483, 131127, 130388, 129538, 128265, 126799, 125668, 125420, 126057, 126492, 125246, 122115, 118639, 116399, 115340, 114347, 112886, 111275, 109753, 108275, 107116, 106723, 106833, 106542, 105479, 104263, 103518, 103076, 102498, 101864, 101554, 101584, 101658, 101696, 101970, 102736, 104005, 105603, 107216, 108432, 108946, 108822, 108435, 108075, 107723, 107277, 106898, 106888, 107205, 107362, 107000, 106401, 106122, 106239]
53094A06239J00j45j85k5J39M92J235J844J500K57r28j388j343j154p32k8M83
53077A06361K30p35j769k175j731r27o80j392k328k356j339l13j57o70j058q87
53061H8074k83L13L85k95j351k120k337k201j837j181m04J25L39M56L69k74j272
53044G6506j791j341l29N03P73M56j76n59l77j40n34j182r70K55J324J394R14
53027G4726M57k44j269j685q07M03M95m03r00n08j77n89j073p37J07L30n16j615
53009F5995j847j081l07m57j326j871j504o24P4K93J13k05k47J46M33J6o51m89
52991E6461M30O82l93j466j081K75J063R38P49Q26O72J80j17j36l38o35l08P06
52973E8508J408J050M4p87j120r18j61P54J015M00k68j88L13M05L4j63m4k32j080
$$ y = [106239, 106339, 106194, 106009, 105984, 106123, 106615, 107850, 109694, 111194, 111451, 110523, 109135, 107792, 106638, 105906, 105878, 106361, 106591, 105856, 104087, 101912, 100181, 99254, 98574, 97182, 94854, 92498, 91159, 90846, 90689, 90019, 88961, 88074, 87791, 88104, 88489, 88194, 86843, 84723, 82386, 80185, 78348, 77167, 76763, 76888, 77227, 77683, 78052, 77778, 76506, 74715, 73374, 73045, 73548, 74321, 74777, 74601, 74042, 73665, 73525, 72991, 71809, 70839, 71094, 72418, 73812, 74726, 75183, 74939, 73670, 71985, 71178, 71581, 72076, 71673, 70773, 70265, 70088, 69499, 68426, 67689, 67796, 68126, 67610, 65995, 64148, 63067, 62760, 62303, 60977, 59106, 57602, 56978, 57052, 57345, 57458, 57253, 57006, 57152, 57585, 57601, 56950, 56461, 56891, 57573, 57180, 55714, 54633, 54908, 55971, 56909, 57658, 58484, 59156, 59336, 59219, 59083, 58745, 58110, 57802, 58508, 59916, 60966, 61010, 60223, 59103, 58185, 58024, 58778, 59793, 60193, 59925, 59737, 60050, 60455, 60489, 60326, 60282, 60050, 58970]
52954E8970j954j980j187m44l48n70m92j09J16J15L38Q85J089L42r82j909j898
52937D9982j206l48K66L47j77r49j386j206n71J83P66R83Q40N70L99L69M73P09
52919E0044R03P67L65J40K26J26m77j120j312j357j673j766r26L09N37m89j416
52902D2881j183k71L82P37J113J202O51R3M48J399J565L09j467k506k435j648
52886D1270o55O2J41j74PJ173K550K847J798M89P2O18J320J481J047M65K66O06
52868E5383J024Q76J85k10L17J245J447N62n89r83m10N61J288J593J839K536L658
52851G0322M320L509J261j152k415k307j633j304j592k108k317k189k235k738
52837E7422l129k671j612r88j212j531j167l04M60R45J135P42k44j019q33j59
$$ y = [58970, 57016, 55036, 53849, 53405, 53057, 52487, 51995, 51886, 52002, 52117, 52455, 53340, 54429, 54771, 53789, 51880, 49982, 48776, 48428, 48694, 49041, 48864, 47915, 46529, 45323, 44752, 44935, 45701, 46684, 47524, 48094, 48493, 48862, 49335, 50044, 50947, 51714, 52079, 52219, 52445, 52571, 52094, 50974, 49662, 48305, 46632, 44866, 43940, 44249, 44786, 44297, 42881, 41698, 41427, 41809, 42546, 43659, 44861, 45512, 45605, 46053, 47452, 49017, 49326, 47859, 45353, 42918, 41270, 40615, 40677, 40818, 40644, 40651, 41824, 44374, 47221, 49019, 49508, 49580, 50198, 51518, 52999, 54046, 54511, 54777, 55383, 56407, 57283, 57468, 57258, 57575, 58820, 60267, 60829, 60240, 59257, 58847, 59408, 60696, 62289, 64128, 66664, 70322, 74642, 78151, 79412, 78260, 75845, 73538, 71905, 70601, 69009, 66901, 64584, 62395, 60160, 57422, 54293, 51622, 50010, 49022, 47810, 46279, 45112, 44808, 45268, 46213, 47348, 48090, 47846, 46827, 45994, 45835]
52821D5835j27q99j430r48R0Q06R28O80J85m67r02p63k61L0pJ74R47J742J598
52802D7211M32p13r33n78n69r40p96L41J772K493K237J374L68l53m03J44P02P96
52784E2585M87p1r20j815k029j259k62L3l30o31n80l69J4P21J398J402O85j06
52766D8953m46l37KK88J08o57j416j438p52R4R66K032K865K641J505P99J465K880
52748E9552L734L504K651J881J637J865J878Q11j366l516m412l931k910k149j855
52733E7374j815j655j165n84m12p46j026p09K4N41N08P2n12j081j481j566j342
52716D4425r30m18R0M47O33Q25J085J133P09J20J1M81P61J14j078j584q12M20
52698D6432R47P46P67J346J638Q55n73j613j908j796j438p37O2M56M48N03P12
$$ y = [45835, 45708, 44809, 43379, 42431, 42521, 43327, 44255, 44935, 45120, 44653, 43751, 42988, 42727, 42757, 42750, 42924, 43871, 45613, 47211, 47643, 46930, 45997, 45419, 44850, 43910, 43114, 43455, 45227, 47720, 49957, 51331, 51699, 51346, 50943, 51087, 51789, 52585, 53072, 53001, 52081, 50266, 48237, 46978, 46716, 46749, 46419, 45788, 45208, 44839, 44853, 45574, 46972, 48374, 49059, 48953, 48507, 48170, 48172, 48460, 48568, 47911, 46495, 45057, 44305, 44399, 45365, 47397, 50262, 52903, 54408, 55207, 56672, 59552, 63286, 66790, 69441, 71322, 72959, 74824, 76702, 77513, 76147, 72631, 68219, 64288, 61378, 59229, 57374, 55559, 53904, 52739, 52155, 51743, 50997, 49971, 49262, 49286, 49827, 50335, 50407, 49895, 48814, 47333, 45767, 44425, 43495, 43077, 43167, 43614, 44247, 45072, 46157, 47290, 47999, 48119, 48130, 48611, 49372, 49486, 48408, 46824, 46012, 46432, 47379, 48125, 48892, 50238, 51876, 52731, 52158, 50545, 48637, 46841, 45403, 44666, 44728, 45184, 45632, 46135, 46847]
52681D6847O09L5n01n49k50J16N55R52Q28lr22j138o46p9J43N4k74q35j341j253
52661D2348l96P33J395J317Q33M43K84J03k25l72Q8J002J641J501Q45K80L4j07
52643E1747k65k43P3L84K41l38q13p54m12l84q05j132q99k94K07N12P96R92Q20
52624D9433K71l26p48j006j077r21p45q09r00n17K87P99O09K26L36Q45J108Q82
52606D7747M62P8l85r13j105o07L24R41P02j44p32m10N71J279J071L04j40J20
52588D9163N41L64m80j269j296n84K90Q77J175J297J205Q86N79N27O61P67Q50
52571E5553J053J280J237Q46M24L32N85Q72Q61N43L34P11J599K268K140J471J000
52554G3109R67R54O89M63N59O76L37l23o78m78k38n19j086j136l55N76P35L7p57
$$ y = [46847, 47456, 47491, 46990, 46441, 46191, 46307, 46862, 47814, 48642, 48639, 47717, 46579, 45933, 45854, 45997, 46051, 45777, 44942, 43601, 42348, 41952, 42685, 44080, 45397, 46230, 46673, 46957, 47060, 46835, 46463, 46551, 47553, 49194, 50695, 51540, 51820, 51854, 51747, 51482, 51239, 51312, 51696, 51937, 51599, 50786, 50032, 49620, 49236, 48431, 47299, 46400, 46106, 46313, 46825, 47621, 48613, 49433, 49704, 49378, 48630, 47624, 46547, 45626, 44881, 44072, 43172, 42655, 42942, 43741, 44350, 44576, 44912, 45757, 46865, 47747, 48209, 48287, 47902, 46989, 45884, 45277, 45601, 46542, 47244, 47100, 46368, 45958, 46529, 47808, 48879, 49183, 49043, 49163, 49704, 50068, 49588, 48319, 47023, 46439, 46729, 47606, 48781, 50078, 51283, 52169, 52748, 53275, 53936, 54703, 55553, 56606, 57886, 59123, 59969, 60393, 60725, 61310, 62182, 63043, 63586, 63920, 64631, 66230, 68498, 70638, 72109, 73109, 74076, 75030, 75719, 76182, 76741, 77417, 77754, 77431, 76753, 76275, 76037, 75518, 74432, 73296, 72941, 73517, 74252, 74289, 73532]
52535G3532r88o90k55J17M15N82N53L00k59j115j859j860j002O6O28N73J33n41
52517F8330j232j504j193p70p12q23o67l54k66l22j66N9j15o00p65m02kK3j86
52498E8333l86n91p53n67O9Q59J458J796J891J689J186N01j97o96p55m52k50l83
52480F2752m39l9L84K01k67l8J015J846J582N15n17j055j041n97j74l73j217j924
52462F0614j721o28O34J275R51P2m45j42L81L53K5J95O77M50n58j049k06J077
52444F1955J525J146P86P62Q09R30J347J832J859J315O35K39K36N02P45O27O2
52427G7312o92j335j629j316m22L91M20r4k11L14Q08Q88R68J148Q21p0m81J47
52409G6967P81K69q50j202n72J43M76O77Q16P72R03J582K217J829N50n77j154
$$ y = [73532, 72544, 71854, 71599, 71716, 72131, 72713, 73266, 73566, 73307, 72192, 70333, 68473, 67471, 67537, 68165, 68738, 68871, 68330, 67098, 65594, 64401, 63631, 62919, 62096, 61429, 61075, 60809, 60487, 60321, 60380, 60265, 59665, 58900, 58498, 58496, 58519, 58333, 57947, 57356, 56603, 56036, 56105, 56964, 58422, 60218, 62109, 63798, 64984, 65485, 65288, 64592, 63837, 63385, 63135, 62752, 62313, 62274, 62658, 62859, 62592, 62554, 63569, 65415, 66997, 67512, 66995, 65940, 64899, 64302, 64128, 63755, 62538, 60614, 58893, 58265, 58899, 60174, 61125, 61197, 60752, 60610, 60991, 61344, 61369, 61564, 62241, 62691, 62133, 61084, 60878, 61955, 63480, 64626, 65412, 66174, 66983, 67913, 69260, 71092, 72951, 74266, 74901, 75140, 75376, 75878, 76623, 77250, 77312, 76620, 75285, 73656, 72340, 71918, 72309, 72729, 72635, 72424, 72738, 73546, 74434, 75402, 76550, 77371, 77301, 76820, 76967, 77748, 78017, 77167, 75965, 75393, 75536, 76012, 76689, 77505, 78277, 79180, 80762, 82979, 84808, 85358, 84781, 83627]
52392H3627j637j990j453l3R84O02o46j573j703j254m45M34P75J71r55j718j647
52375G1539r47r7N02O27L35k0o7K47O61Q42O78L38P5p3k78n39n11N5R24J590J789
52354G7670J609J261R09O29L29p5l31p3N30Q58Q23J168K226L036K480R28j61j42
52336I3674K15P8l06k31M02J020J136Q18N08N20O87N69M9n41q99j075j022m37
52318I5165N67J099N38m60p34j66K84N4l97m60j23L31O93P83N31K97O29J500K217
52299A02348K236J605O67k44p27m96K51J015J589K081K410K358K135K255K751
52284A22234L056K855K509K443K591K679K589K345K088K175K769L268K756J253
52270A57610n1q7R69K132K744K814K628K346J943J393R53J031J498J525O27m01
$$ y = [83627, 81990, 80000, 78547, 78514, 79498, 80100, 79454, 77881, 76178, 74924, 74479, 74913, 75688, 75859, 74904, 73186, 71539, 70592, 70495, 70997, 71624, 71959, 71939, 71872, 72119, 72780, 73622, 74300, 74638, 74713, 74640, 74362, 73823, 73312, 73367, 74291, 75881, 77670, 79279, 80540, 81449, 82078, 82407, 82332, 82001, 81928, 82458, 83316, 84139, 85307, 87533, 90569, 93049, 93977, 93816, 93674, 93889, 93967, 93661, 93430, 93832, 94852, 95988, 96806, 97314, 97834, 98521, 99090, 99139, 98598, 97699, 96624, 95602, 95165, 95732, 96831, 97369, 96909, 96175, 96009, 96293, 96347, 95950, 95490, 95367, 95698, 96391, 97174, 97705, 98002, 98631, 100131, 102348, 104584, 106189, 106856, 106612, 105885, 105389, 105640, 106655, 108244, 110325, 112735, 115093, 117228, 119483, 122234, 125290, 128145, 130654, 133097, 135688, 138367, 140956, 143301, 145389, 147564, 150333, 153601, 156357, 157610, 157559, 157472, 158441, 160573, 163317, 166131, 168759, 171105, 173048, 174441, 175394, 176425, 177923, 179448, 180075, 179674]
52254A79674l59O99J603J775J736J763J288J43p52p05l48n23q46m00O98J505J714
52237A88665J874K295K683K869L034L108K782K215K055K484K927K942K816K920
52223B25669L051K853K465K252K149J852J510J712K572L340L199K233J316J146
52209B57319J695K497L065L037K288J222O15Q53J521J983K142K305K545K677K677
52194B88441K620K352J755J235J368K005K416K392K537L237M025M304M083L598
52180C26368K843J973J669K402L646M454M538M287L978L640L396L359L202K528
52166C72283J633J231J423J581J408J406J925K358J903P23k08l45q9m8l17o07
52150C86260o91n53k88j77n32j307j964k103j970k063k342k305j809j228p09K2
$$ y = [179674, 179315, 180014, 181617, 183392, 185128, 186891, 188179, 188322, 187570, 186865, 186517, 185994, 185148, 184748, 185446, 186951, 188665, 190539, 192834, 195517, 198386, 201420, 204528, 207310, 209525, 211580, 214064, 216991, 219933, 222749, 225669, 228720, 231573, 234038, 236290, 238439, 240291, 241801, 243513, 246085, 249425, 252624, 254857, 256173, 257319, 259014, 261511, 264576, 267613, 269901, 271123, 271738, 272591, 274112, 276095, 278237, 280542, 283087, 285764, 288441, 291061, 293413, 295168, 296403, 297771, 299776, 302192, 304584, 307121, 310358, 314383, 318687, 322770, 326368, 329211, 331184, 332853, 335255, 338901, 343355, 347893, 352180, 356158, 359798, 363194, 366553, 369755, 372283, 373916, 375147, 376570, 378151, 379559, 380965, 382890, 385248, 387151, 387874, 387666, 387321, 387232, 387184, 386867, 386260, 385569, 385016, 384728, 384551, 384019, 382712, 380748, 378645, 376675, 374612, 372270, 369965, 368156, 366928, 366219, 366241]
52134C66241Q51R69Jj071j006m0L94l91j530j968j707j341j099r29j020j526k104
52117C52724k308k231k279k429k300j907j750k061k392k217j617j118j046j280
52103C25789j545j677j638j524j571j967k515k652k097j317j078j506j889j553
$$ y = [366241, 367092, 368061, 368062, 366991, 365985, 365945, 366339, 365948, 364418, 362450, 360743, 359402, 358303, 357374, 356354, 354828, 352724, 350416, 348185, 345906, 343477, 341177, 339270, 337520, 335459, 333067, 330850, 329233, 328115, 327069, 325789, 324244, 322567, 320929, 319405, 317834, 315867, 313352, 310700, 308603, 307286, 306208, 304702, 302813, 301260]
$$ [...]
##END NTUPLES=NMR SPECTRUM
##END=
