##TITLE=NES1010_Conilon_9232912_cuLHfhc4Ys
##JCAMPDX= 6.0         $$ Bruker NMR JCAMP-DX V2.0
##DATA TYPE= NMR SPECTRUM
##DATA CLASS= NTUPLES
##ORIGIN= BRUKER
##OWNER= Administrator
$$ 1.72 TOPSPIN		Version 2.1
$$ 2015-08-24 16:50:40.155 -0700  Administrator@X
$$ Compression mode = diff/dup
##.OBSERVE FREQUENCY= 400.02188249412
##.OBSERVE NUCLEUS= ^1H
##.ACQUISITION MODE= SIMULTANEOUS (DQD)
##.ACQUISITION SCHEME= undefined
##.AVERAGES= 8
##.DIGITISER RES= 22
##SPECTROMETER/DATA SYSTEM= spect
##.PULSE SEQUENCE= zg30
##.SOLVENT NAME= COFFEE_meoh
##.SHIFT REFERENCE= INTERNAL, COFFEE_meoh, 1, 14.98509
##AUDIT TRAIL= $$ (NUMBER, WHEN, WHO, WHERE, PROCESS, VERSION, WHAT)
$$ ##TITLE= Audit trail, TOPSPIN		Version 2.1
$$ ##JCAMPDX= 5.01
$$ ##ORIGIN= Bruker BioSpin GmbH
$$ ##OWNER= Administrator
$$ $$ E:\/data/COFFEE/nmr/NES1010_Conilon_9232912_cuLHfhc4Ys/30/pdata/1/auditp.txt
$$ ##AUDIT TRAIL=  $$ (NUMBER, WHEN, WHO, WHERE, PROCESS, VERSION, WHAT)
(   1,<2015-08-24 16:50:32.967 -0700>,<Administrator>,<X>,<go>,<TOPSPIN 2.1>,
      <created by zg
	started at 2015-08-24 16:49:27.076 -0700,
	POWCHK enabled, PULCHK disabled,
       configuration hash MD5:
       21 0F 79 D6 B3 7B B4 F6 88 20 88 DB 03 48 BD 9F
       data hash MD5: 64K
       D2 06 7D 83 6A 54 3E AB F8 0B 5A 92 53 CA E1 2D>)
(   2,<2015-08-24 16:50:36.030 -0700>,<Administrator>,<X>,<proc1d>,<TOPSPIN 2.1>,
      <Start of raw data processing
       efp LB = 0 FT_mod = 6 PKNL = 1 PHC0 = 0 PHC1 = 0 SI = 32K 
       data hash MD5: 32K
       0D 0A 3E D0 7E DB 93 DC 24 A4 C0 1B 35 E9 EE 54>)
(   3,<2015-08-24 16:50:36.311 -0700>,<Administrator>,<X>,<proc1d>,<TOPSPIN 2.1>,
      <pk PHC0 = 91.6095 PHC1 = 0 
       data hash MD5: 32K
       A3 0C 45 9D EB 2E 1D 14 87 1A 6C 6A A1 2D 30 1F>)
(   4,<2015-08-24 16:50:36.420 -0700>,<Administrator>,<X>,<proc1d>,<TOPSPIN 2.1>,
      <abs ABSG = 1 
       data hash MD5: 32K
       D8 D4 E4 62 22 EF 46 67 99 12 93 1D 28 97 F3 42>)
(   5,<2015-08-24 16:50:36.498 -0700>,<Administrator>,<X>,<proc1d>,<TOPSPIN 2.1>,
      <abs ABSG = 2 
       data hash MD5: 32K
       51 59 B9 64 C1 96 58 FD 2F 63 6F 08 AF B9 A4 1E>)
(   6,<2015-08-24 16:50:36.561 -0700>,<Administrator>,<X>,<proc1d>,<TOPSPIN 2.1>,
      <abs ABSG = 3 
       data hash MD5: 32K
       78 14 3B E8 EC CC 4F 9A D6 97 E9 AF 9B BA E2 99>)
(   7,<2015-08-24 16:50:36.623 -0700>,<Administrator>,<X>,<proc1d>,<TOPSPIN 2.1>,
      <abs ABSG = 4 
       data hash MD5: 32K
       A9 D7 A5 21 7B A5 36 33 26 8B 74 61 F4 8A 07 BF>)
(   8,<2015-08-24 16:50:36.686 -0700>,<Administrator>,<X>,<proc1d>,<TOPSPIN 2.1>,
      <abs ABSG = 5 
       data hash MD5: 32K
       98 E6 78 DC 2F DD 12 22 99 5E AF 55 86 81 59 C6>)
$$ ##END=
$$ 
$$ $$ hash MD5
$$ $$ 95 96 DA 8E C9 CB DB DF A1 4B 3C EA 7A 53 EE CE
##$RELAX= 
##$RELAX= 
##$RELAX= 
##$RELAX= 
##$RELAX= 
##$RELAX= 
##$RELAX= 
$$ Bruker specific parameters
$$ --------------------------
##$DU= <E:\>
##$EXPNO= 30
##$NAME= <NES1010_Conilon_9232912_cuLHfhc4Ys>
$$ [...]
##$TP= (0..7)
150 150 150 150 150 150 150 150
##$TP07= 0
##$TPNAME0= <>
##$TPNAME1= <>
##$TPNAME2= <>
##$TPNAME3= <>
##$TPNAME4= <>
##$TPNAME5= <>
##$TPNAME6= <>
##$TPNAME7= <>
##$TPOAL= (0..7)
0.5 0.5 0.5 0.5 0.5 0.5 0.5 0.5
##$TPOFFS= (0..7)
0 0 0 0 0 0 0 0
##$TUNHIN= 0
##$TUNHOUT= 0
##$TUNXOUT= 0
##$USERA1= <user>
##$USERA2= <user>
##$USERA3= <user>
##$USERA4= <user>
##$USERA5= <user>
##$V9= 5
##$VALIST= <valist>
##$VCLIST= <CCCCCCCCCCCCCCC>
##$VD= 0
##$VDLIST= <DDDDDDDDDDDDDDD>
##$VPLIST= <PPPPPPPPPPPPPPP>
##$VTLIST= <TTTTTTTTTTTTTTT>
##$WBST= 2048
##$WBSW= 25
##$XGAIN= (0..3)
0 0 0 0
##$XL= 0
##$YL= 0
##$YMAX_a= 602240
##$YMIN_a= -503333
##$ZGOPTNS= <>
##$ZL1= 120
##$ZL2= 120
##$ZL3= 120
##$ZL4= 120
##$ABSF1= 14.98509
##$ABSF2= -5.573092
##$ABSG= 5
##$ABSL= 3
##$ALPHA= 0
##$AQORDER= 0
##$ASSFAC= 0
##$ASSFACI= 0
##$ASSFACX= 0
##$ASSWID= 0
##$AUNMP= <proc_prof1d_extract_pilot.lims>
##$AXLEFT= 0
##$AXNAME= <>
##$AXNUC= <1H>
##$AXRIGHT= 0
##$AXTYPE= 0
##$AXUNIT= <>
##$AZFE= 0.1
##$AZFW= 0.1
##$BCFW= 0
##$BC_mod= 0
##$BYTORDP= 0
##$COROFFS= 0
##$CY= 15
##$DATMOD= 1
##$DC= 0
##$DFILT= <>
##$DTYPP= 0
##$F1P= 0
##$F2P= 0
##$FCOR= 0.5
##$FTSIZE= 32768
##$FT_mod= 6
##$GAMMA= 0
##$GB= 0
##$INTBC= 1
##$INTSCL= 1
##$ISEN= 128
##$LB= 0
##$LEV0= 0
##$LPBIN= 0
##$MAXI= 10000
##$MC2= 0
##$MEAN= 0
##$ME_mod= 0
##$MI= 0
##$NCOEF= 0
##$NC_proc= -8
##$NLEV= 6
##$NOISF1= 0
##$NOISF2= 0
##$NSP= 0
##$NTH_PI= 0
##$NZP= 0
##$OFFSET= 14.98509
##$PC= 1
##$PHC0= 91.6095
##$PHC1= 0
##$PH_mod= 1
##$PKNL= yes
##$PPARMOD= 0
##$PPDIAG= 0
##$PPIPTYP= 0
##$PPMPNUM= 2147483647
##$PPRESOL= 1
##$PSCAL= 4
##$PSIGN= 0
##$PYNMP= <proc.py>
##$REVERSE= no
##$SF= 400.02
##$SI= 32768
##$SIGF1= 0
##$SIGF2= 0
##$SINO= 400
##$SIOLD= 32768
##$SPECTYP= <>
##$SREGLST= <1H.CDCl3>
##$SSB= 0
##$STSI= 32768
##$STSR= 0
##$SW_p= 8223.68421052631
##$SYMM= 0
##$S_DEV= 0
##$TDeff= 65536
##$TDoff= 0
##$TI= <>
##$TILT= no
##$TM1= 0
##$TM2= 0
##$TOPLEV= 0
##$USERP1= <user>
##$USERP2= <user>
##$USERP3= <user>
##$USERP4= <user>
##$USERP5= <user>
##$WDW= 1
##$XDIM= 32768
##$YMAX_p= 441024140
##$YMIN_p= -653467
##$CURPLOT= <Network HP LaserJet P1505>
##$CURPRIN= <$Network HP LaserJet P1505>
##$DFORMAT= <normdp>
##$LAYOUT= <+/1D_H.xwp>
##$LFORMAT= <normlp>
##$PFORMAT= <normpl>
##$SURQMSG= 1
$$ End of Bruker specific parameters
$$ ---------------------------------
##NTUPLES= NMR SPECTRUM
##VAR_NAME=  FREQUENCY,     SPECTRUM/REAL,   SPECTRUM/IMAG
##SYMBOL=    X,             R,               I
##VAR_TYPE=  INDEPENDENT,   DEPENDENT,       DEPENDENT
##VAR_FORM=  AFFN,          ASDF,            ASDF
##VAR_DIM=   32768,         32768,           32768
##UNITS=     HZ,            ARBITRARY UNITS, ARBITRARY UNITS
##FACTOR=    0.250966925370066, 1,           1
##FIRST=     8223.43324360094, 79486,        88344
##LAST=      0,             -247387,         -109400
##MIN=       0,             -653467,         0
##MAX=       8223.43324360094, 441024140,    0
$$ Real data points
##PAGE= N=1
##DATA TABLE= (X++(R..R)), XYDATA
$$ [...]
23786 111687 54845 -175943 -134888 75204 11927 -33363 -15965 -43155 -28199 -370896 -642892
23775 -642892 110115 135149 -109712 -257331 69950 190883 -11232 -137920 -433667 128716
23764 20885 -86962 129536 91810 38614 -187914 -28135 34712 -36645 22527 -322728 -192154
23753 -192154 -57110 -132183 306163 -295250 152659 -239622 -387341 -97937 -182913 265424
23742 311359 -156130 -196401 -68768 -13425 263123 -6546 -112315 -205246 -328907 105234 -105393
23730 42414 81153 -146507 -213967 324097 -299847 35080 34737 -50888 28523 22124 -176875
23718 -131711 176244 72415 209719 102572 55072 277446 297029 96652 -224904 -84201
23707 100542 24407 50603 85082 313001 -148012 -320370 -205954 54644 -192256 83534
23696 -104998 140332 175937 94803 42750 171116 -261464 239958 -63029 39318 -252991
23685 -23435 193148 -104481 -140625 -154898 -91337 -63798 -3268 14845 -67917 202232 130886
23674 130886 -81528 -168288 247498 45933 226232 238644 -162817 -27252 -106495 179026 37641
23662 278147 279119 -23513 190845 165469 -126659 -39990 22675 -23295 -1141 -127750 252767
23650 109559 167571 193789 7454 165744 150146 316714 150106 -304622 -249994 -186210 14377
23638 -278472 322315 -16012 -160190 -34250 116451 53682 69992 356614 162853 219496
23628 219496 140626 -29380 -54727 58049 -31449 -114333 -40800 -313921 -19772 -50783 -17639
23616 35257 -1948 -375192 -152561 -178322 -39686 192160 -25447 -229520 256471 -228346 -47778
23604 1670 88638 -28862 -110448 72659 82376 381026 54209 58506 328460 -67659 170201 183733
23592 183733 -109548 119426 -375238 147350 -191841 86277 51634 82838 50692 229153
23582 229153 161509 -343284 252063 182921 15189 -253133 -72321 134807 77539 -15442 -85867
23571 -85867 53151 -215852 206786 -82824 -152284 144376 -47271 66402 83572 -186094 156107
23559 -9653 203411 -68729 -271830 7671 183206 -136762 -7783 -19057 18941 -130952 -54740
23547 -50192 -19565 -7872 -289216 54914 243303 20245 -63606 32896 -28704 -153970 -156145
23536 -156145 -52868 -182067 -424652 34203 -71183 -194948 -326237 311493 29303 -542390
23525 -384429 -154673 -655 251705 -3291 58317 -56653 51903 90308 48910 -109114 -36137
23513 -525483 -53469 196543 358414 -198758 -147245 -367180 -9146 -161888 -40454 318530
23502 -267486 -38190 157837 -125185 -104711 212147 10537 -162381 -174919 -101200 -63283 168223
23490 -287269 -129349 169474 -164396 -331385 -259920 -150515 -3026 -349685 -213101 -306641
23480 -306641 -47645 123349 145827 180170 134961 -29431 6163 -35955 15682 -101519 -37787
23468 -106683 -5983 202566 -282337 105442 -250611 224671 195205 -223742 -142561 335262
23457 278821 241666 52595 46237 -269064 -524016 -309612 -115156 -234821 -254804 111239
23446 214994 -75342 -8087 128766 -29400 -283574 -43060 349376 107446 -343228 50430 -189078
23434 -63598 222203 -26454 131344 80390 -18531 -106961 -169000 182145 237832 -8208 120295
23422 -330788 166450 -19571 368150 209080 16992 -138504 78650 -107864 -25790 -155033
23412 -155033 -77173 -80326 169171 156041 -24658 -121343 53339 86305 46575 -205399 -154328
23401 -154328 99236 60575 -224235 247213 172013 47700 70733 -67431 -266223 -217088 -43923
23389 79801 -122521 139096 -21087 -28436 158616 4010 -27369 -9492 143138 107197 53642
23378 53642 53680 241274 127694 7226 -3822 -307492 72569 -118417 35908 -186601 -130639 73207
23365 54992 162151 -120756 128364 -291909 -313810 -259106 200981 -372544 -120567 -529403
23355 -529403 -34449 -63209 -293755 -223214 114349 97079 -210554 -9999 -166076 274322 -152921
23343 -107710 -289639 70085 44067 97213 57218 -14827 198387 -329 -84401 -193307 373500
23331 124123 74813 288649 508 -296955 25415 -236256 -73870 -162906 -133077 -40854 -124125
23320 -124125 -305648 76212 218322 -84423 339554 30821 -81701 16925 48117 13606 101940
23309 101940 -152006 -62551 78951 -235412 -66793 -83535 -392824 57989 83243 -108109 190890
23297 -40358 -207765 174211 8905 65171 -119372 -162235 6887 -176793 19877 76369 66115
23286 66115 149501 214711 10377 -54887 -188321 63172 -60476 -90593 -88712 260827 33165
23274 -288813 -47881 -50278 -164391 111460 -207094 -147126 -251433 -137460 -35106 -186566
23264 -186566 56243 143367 72782 -225453 -78488 -75085 -102783 -246261 84068 190746 -47075
23252 57442 33198 115309 -419967 -63721 203239 70039 373645 -121835 88341 140772 -153718
23240 -72111 105437 -321580 -288 38237 12482 -102941 7626 -372841 -438743 -79760 -179495
23229 -179495 221688 5186 92157 -13691 99380 25789 -5109 -109530 77330 80523 111983 16671
23216 57605 -1231 -329729 225320 -32801 143178 -301179 120773 -220080 219117 -87564
23205 10032 -425570 78312 175092 -229293 512 4843 202696 111474 -137960 41544 -59874
23193 109781 183953 16843 -391270 57533 -111148 -108475 -130700 59351 63104 -165449 44139
23181 -10932 -149531 51710 -60114 -416280 -58400 15963 297083 110479 131068 88348 -61408
23169 -178063 18501 -2974 -66176 -166613 -298314 -93688 148184 184307 130550 -325810 -80852
23157 113539 154705 -64177 112807 -76952 -128559 93445 -84654 -91706 -15629 158001 96844
23146 96844 -112433 -210071 -128223 156886 -152138 -175643 -278888 28265 6328 185901 388597
23135 388597 158589 146521 35211 -66442 106067 -25346 13431 -111484 -159938 -235996 40772
23123 324204 36921 -279004 -240324 11066 81694 -122907 209630 353653 -270268 126928
23112 71010 225745 66041 -431236 -168043 123858 131960 -202038 -189375 78439 326105 -154087
23100 -14818 322825 185985 -232518 80802 191435 271062 4749 211355 -114742 233316
23089 112578 30012 -87126 -228056 17034 -127193 148021 -98333 2294 -160912 -183510 -87159
23077 -235474 115934 -4055 -181686 -120641 271568 15370 227781 -191195 -97727 -86010 124962
23065 57860 -113516 -147036 3774 -86765 -27210 -105326 13356 177448 147692 -298290 -162228
23054 -162228 279532 -153370 156139 -20679 -72815 49396 279356 -276658 296470 51888
23043 27219 104193 143413 39134 -14413 190272 3005 47937 -40814 182074 -196772 43354
23031 -109462 -39912 94925 97095 -313385 -476016 159013 -21588 28515 -156513 112581 -287243
23019 124119 30564 -302365 105154 220841 -13608 -165949 -245714 73426 269029 -116999
23008 193886 -200541 217081 78315 -63715 -49207 -377821 23108 9005 -206228 -158266 -59712
22996 33070 -79960 -231278 -160533 86695 -168234 -23730 102849 -22915 277747 -113545 -433253
22985 -433253 58360 -272676 -30955 138501 -244484 22391 52069 -109184 -37882 292046
22974 -214197 -40279 48582 23889 -271534 61900 89212 115841 -367881 -81666 -88908 27943
22962 210749 333253 -133672 428804 40464 -8913 -69217 -21361 -128014 -222400 -81919 41717
22950 149057 -317622 -31018 -215932 -172897 -142159 3750 -74955 234281 -417740 78373 -19990
22938 92613 -186787 221359 -34871 -200380 264301 156961 122929 -84521 -96180 -190857 178815
22926 412080 -18368 -60159 90415 -34573 -360539 -26 87385 -124140 -53591 120382 28220
22914 -153047 -125535 27627 -119851 299379 62459 23540 -292130 -240343 80943 103697 63383
22903 63383 24540 -562016 -148970 40386 -158457 -54526 -269640 -5616 -174365 -266411 -65835
22891 145149 -70450 -54804 -71774 75401 208728 -228767 152618 -291693 -24785 -214659
22881 -214659 -205829 325536 160543 -161177 229667 -232798 253418 327926 5434 -61139 -47924
22870 -47924 -146180 -3256 -170733 345043 -222294 -220099 217839 -196493 -209115 -138831 87749
22858 -120858 139130 -97208 -55892 -437 -219638 -226521 138282 180701 -136059 -304430 183571
22846 180498 121318 -618208 -199199 103070 9283 4159 -81004 -212524 -79890 -30152 35707
22834 257809 132001 237303 -402 -202504 124907 265785 -48425 -178185 65303 -138539
22823 77725 -73356 86815 -101378 -354652 24597 -196733 37942 233810 62215 144953 -78704
22811 -275092 -81413 -191810 51982 -62833 108846 2499 -238975 165029 -90817 51878 34018
22800 34018 -7392 -288631 -102770 -156794 243600 168381 34636 -169046 -4174 -109265 -250706
22789 -250706 66752 -27460 -133180 49760 -128702 -23009 150809 -126419 -75649 -220904
22779 -220904 -114041 62320 -150675 -68359 58854 2033 10521 157925 -94704 -70587 -439028
22768 -439028 56154 -80804 332765 -142112 -153791 127138 -69314 -158534 -124264 -139381 78534
22756 232615 -337890 -121883 -95001 84837 80985 -72406 -111650 -179412 -104478 187091 -336896
22744 -796 23261 152776 -288356 -110294 68912 -212601 -9377 -145543 -421115 -76668 -197011
22733 -197011 -21926 9653 -8713 2652 -13386 -431475 -175231 63489 178675 -167198 -52687
22721 174111 13464 205246 -235432 -196373 11178 163702 50 -78770 -86003 96841 66710 -232954
22708 101508 5171 -463231 32787 -194467 -8426 39784 -65363 67544 -108291 128988 205190
22697 205190 -164382 -218884 -119814 -43743 213028 -240683 -2919 -198585 89868 13627 -26968
22685 -277487 -92298 -98212 80683 -182948 208342 51698 66250 -101690 -56770 -42786 -382806
22674 -382806 113245 -306873 -48615 182321 -255400 -4237 -252061 -221656 284349 42709
22663 -224472 98935 -213263 -239232 -159299 -136702 -157228 -352429 -194694 -119159 73789 -42513
22651 -84355 308890 172068 -229810 318025 -254962 20586 -79513 -88803 132789 -149062
22640 237900 58137 -51086 173468 -287604 101798 -239865 -11585 -59295 127695 142088
22630 142088 247117 -54457 -72684 49174 -96176 -120316 127710 132119 53688 173485 -50046
22618 -27583 -117832 -154705 -61702 -49160 104288 119023 -60286 262686 -164092 54296 -11879
22606 218952 -163447 -136941 -133176 -87246 208820 -109244 -160836 345487 14411 -53238 -186576
22595 -186576 -236585 54483 242014 -120596 -378848 -83338 -155460 148771 12827 -176902
22584 214134 -175387 -1377 358042 -20113 -13384 -346165 -103876 -52184 325 -205976 132676
22572 -211894 -210948 241273 153814 -134072 -276776 -355630 2318 -76563 255571 252795 -59743
22560 -198917 -45856 -113368 240442 -92387 -175741 305202 -108940 -94553 54368 116526 126354
22549 126354 -153379 185587 316620 174961 14056 31523 -330932 -140734 214265 267333
22539 267333 329706 -141986 -327099 -177308 -156791 -422214 50072 -47936 -38761 246010 49800
22527 52593 101429 -41986 68242 -261351 129829 -280073 -194497 47576 -150763 124175 106956
22516 106956 -218915 112139 -52853 -122002 -106534 -43417 40499 133786 -190538 -268440 136740
22504 364604 -25138 25542 259355 -145090 -122902 -85864 -232805 -221455 -87117 -174963 -180804
22493 -180804 181859 -136645 146886 27281 -391003 63713 116457 -102291 -111664 116018
22482 79867 -130997 316635 -20497 -45790 -81662 -118142 -408267 58123 -169754 -131629 21307
22470 74845 -92701 167632 -87626 -160948 -65324 -177646 -58462 157797 -1763 -195121 9573
22458 -7819 -7617 108270 127731 -153669 72065 165511 -195531 -339946 -82875 -108510 -120877
22447 -120877 27577 342549 21765 -45220 -98090 -156534 -158964 -69494 -87352 -59827 -77490
22436 -77490 208313 -38745 210687 -88329 -337740 -2427 -432990 -120799 1866 211427 -213807
22424 -97744 72785 -31191 13776 -128918 -193619 -69154 -4391 -127931 -248658 -462800 -105926
22412 -85739 -286165 -122108 -103599 177888 -43519 240057 -155702 -173171 -27586 88224 117508
22401 117508 -63051 205730 -292568 -244922 -159793 -149020 -275194 -132917 -587 35541 160119
22390 160119 -47851 -312310 77363 77598 -187100 -95844 -104184 96718 472 163628 -44101 -188745
22378 -188745 80346 -272216 118278 1389 -157444 -331856 -80537 154351 -283750 -182682
22368 -182682 65132 -256870 -354410 250142 -119649 -424317 -119982 -65135 -44088 -438427
22358 -438427 188841 25251 -166539 109995 179392 -56868 -117574 300144 -236048 -221475
22348 -221475 -464226 93409 131527 133402 -182787 145411 228878 -59375 11985 111957 -303969
22336 60134 125374 125364 353567 -164054 64578 -253680 135127 -63404 -276257 -378199 -122883
22324 -88683 -223364 -138701 -122897 -167702 5880 -318287 -108709 171817 88729 122082 -5024
22312 297049 -64167 5739 -128414 -36243 -31237 -230701 -43768 -209189 -52039 -51475 -58432 7533
22299 -202568 200113 -24528 -455295 8081 -94523 267150 -108995 -175138 -289450 185039
22288 -78365 229637 -150628 31499 34853 149210 697 -308923 52338 -97782 133095 -275865
22276 -152671 122819 188335 151265 -220190 55719 118698 181187 316155 -146052 22549 -131536
22264 84386 268604 16084 161974 -420826 -157277 -143113 -85524 -180287 -226998 -315213 74881
22252 -68417 -197073 232473 380658 243808 -69851 -245770 -78097 71971 -92502 -412803
22242 -412803 -125502 120776 -26417 -161457 -88366 71013 -119972 264204 43375 125403
22232 125403 -77953 -272952 209679 228176 188840 -190015 -216119 50252 -252605 -206994 -165791
22221 -165791 -11287 -164828 -95074 142428 11027 -238098 103768 -351884 -42418 82347
22210 -207490 92943 112881 35101 -48250 -99898 -315282 -124217 -725 -57198 -56677 161748 185820
22198 185820 301199 -114616 -97964 -186930 -253888 136441 20828 485345 -178924 -237511
22188 -237511 16032 -79710 227515 -116251 -86694 -47934 135690 -35498 98313 48837 44637
22177 44637 -122631 67910 -412940 -39609 -252053 40056 -262240 -288357 67632 -123723 -423066
22166 -423066 160421 187345 -202770 64627 -409267 79080 -195936 -219490 -95309 -16355 156844
22154 -212221 -99351 -109302 4591 109391 -23261 -112458 -252916 147340 107817 -214780 -126007
22143 -126007 6610 201235 -40433 -6742 -47987 100627 -60852 -3567 329018 -69651 253840
22131 148609 -427120 57030 -51500 -216284 191522 79465 -163212 148272 195812 243914
22121 243914 123248 -221142 -365445 176578 133812 -278931 16109 186086 -60192 66606
22110 -19232 -235463 -124744 -235145 -45168 -92244 10751 -106851 16211 256373 -193531
22099 -284433 116399 -41462 -348898 -232434 -67365 -1326 -68252 91825 -128943 18571 146954
22088 146954 96233 -92932 -252808 -314005 -43097 -92438 -271208 -275435 149759 -12504 -270294
22077 -270294 -50803 201772 -148800 -231981 -80384 129467 164589 -146230 -8742 -112560 35283
22065 17161 -19297 -59175 -55920 -332886 -54107 -63128 -146449 51929 111080 82740 379960 144362
22052 379820 -133158 -4632 -132726 187308 -45082 233970 -10816 -308693 102877 45315
22041 -650402 -115149 -48311 -218907 -6095 11410 294090 21914 236089 -105674 -307882
22031 -307882 -227956 -95556 -66192 9122 433320 164965 -21744 -32508 -231722 122857 -13462
22019 -94434 47233 28194 300134 61085 423195 -456258 242181 -55061 75557 989 -336980
22007 91105 -278656 -15928 227540 54071 -186249 -77940 10003 -173693 -85138 -96810 -98682
21996 -98682 -161845 65956 -77596 -391642 -18838 -30398 -206489 8104 -75780 21591 -54185
21984 -315118 -226332 71287 24733 124885 -67486 -134018 -195908 215304 -185162 77993 -188235
21972 -2375 99689 68452 -209472 -133075 -105033 -345429 -279201 145252 -51494 -168496 -277893
21961 -277893 -135940 -24904 35048 -449127 42773 -214702 183455 -201268 -217539 -179022
21951 -179022 90871 -238778 -64935 -181642 173749 -269166 -177994 135195 236079 -175907
21940 256758 455721 -22612 -151792 242154 -94882 10379 -18409 49748 -77427 157932 97420
21929 97420 9920 -41243 -41766 -88691 308580 123247 29111 -131210 233677 -215287 273837
21917 -106032 -338869 -159362 -4560 111484 -35829 -151299 264173 162342 30311 -4973 62280
21905 45447 -58068 86593 -173669 -293113 -96967 -163157 30218 -50901 -212174 -149259 277339
21893 9859 -87366 17284 -321086 2008 88480 -214950 62740 -242540 -55123 -44602 173529
21881 -58835 224355 -64340 251798 -83948 -330058 18829 183622 52129 -42000 -150123 -244646
21870 -244646 -249607 -177027 -486781 -307219 -109068 -190342 -210295 -112282 62167 184813 -148518
21858 54998 -62866 -278415 -161407 -221909 -249351 -249092 51189 -166661 94081 -100192 73555
21846 91344 74353 -313930 51456 -207706 -195072 -111602 361895 40938 93977 -194356 -57441
21834 -206902 43022 -106178 290617 -150958 121056 111759 -26503 -69965 -66361 25759 -2290
21822 -300713 -284147 251204 -254228 -208084 1038 -137732 -14363 -21059 111825 26438 107424
21811 107424 108374 3058 28583 90963 273492 -186339 153595 -193063 -200590 -80973 205375
21799 -132749 -25008 -180302 -220097 -83632 -259386 209619 146237 -114596 -59160 1175 -7718
21787 -283354 -17718 34919 -153443 7286 310475 -39989 -20082 31344 -275778 -188065 191847
21775 -439570 65106 -75633 -23272 17817 -28342 56327 -201529 17892 -1781 -102903 90881
21763 -76478 162034 -93984 -471684 -309968 -256090 318890 203024 218081 238088 67668 -84987
21751 69097 -255346 341479 59474 19810 301936 -207871 -165088 -75815 -404811 -131746
21740 64704 148990 139600 -104362 -207845 161348 -109433 -281449 -201587 108885 33880 454523
21729 454523 -78859 93608 -184852 61349 -67256 89303 153985 138978 -30176 -24419 90972
21717 274426 -20141 -273159 181944 30839 -45429 -27059 22667 90429 -444616 -11166 143904
21705 -153589 -39343 -164854 -134899 28555 105847 61447 -210804 -20389 244078 -161334 -243961
21694 -243961 -693 -142774 -67699 24861 -296209 26808 191275 24152 152777 160774 -23949
21682 33166 -6895 -224316 38973 -25135 -382736 54884 424914 -278890 -11465 -60006 -107120
21671 -107120 123854 129660 6188 -66986 -121179 52765 54279 45692 -488185 -438904 173421 -23383
21658 8918 164364 -136884 -21077 88684 23438 204835 5685 -182342 111053 44560 -224479
21646 -16699 229528 -47032 -379554 -155723 277202 172477 -90134 -58156 -279247 -212995
21636 -212995 194833 -294316 65190 -296205 -158821 -140999 -27553 122278 213061 60585
21625 -156129 -24941 -228905 -21760 77874 -322061 -166086 120199 40666 -163726 18736
21614 -2324 -238051 -45071 251598 35984 33034 -23733 192213 53778 256099 305560 -266712
21602 -276088 155515 -186642 22543 -148001 -187449 -395271 66271 -224567 -64060 72091
21591 21603 53316 -11039 143340 -223297 124002 16005 66454 144377 158619 -197413 -121666
21580 -121666 -351712 -352273 63827 -54431 -119786 -96758 85858 -90149 102109 -32720 -235798
21569 -235798 118191 8840 -194691 -519211 -161106 14795 -42411 -319361 21673 -54061 -135030
21558 -135030 -184326 181169 48614 -3751 -42798 51760 -147708 -419661 163395 -100703 -59295
21547 -59295 146790 67536 -108496 178108 -39539 -89548 397061 29177 55782 115953 -160621
21535 93809 -27247 -142065 -195066 27288 48853 -51760 -338422 -238639 138587 -203272 -70847
21523 -340077 84140 28597 50869 -16831 -143007 -262224 -132567 -90864 -105873 -68245 -397323
21512 -397323 -136962 -295123 15849 239106 12811 -309112 25785 83439 12575 -46523 -106132
21501 -106132 114422 76251 -160506 141298 -70688 18718 17072 234681 -275978 -64845 -293846
21490 -293846 -320979 72964 -543945 88477 -106918 71055 135250 138634 -67045 -65991 80560
21478 -94487 104271 -101359 -192819 -56351 61470 -284590 63750 -51297 89089 -94836 -77851
21467 -77851 79724 -241559 -93179 141867 -141354 -203500 -36474 213730 -178983 216215
21456 19458 24813 -124826 4901 -188607 -34852 8286 126717 -26852 27298 -39870 -121147 16778
21443 388123 86815 -21316 250324 22395 -35205 -83199 225106 319819 317986 431211 695629
21432 695629 282512 539330 267096 564923 249664 358256 125066 -185384 4900 273727
21422 273727 74995 -69821 9799 -149564 102154 -45325 -264804 -238340 -128775 -140333 170856
21410 -83863 239466 -182562 -139137 221394 -108096 31130 -76781 -218503 218383 60431
21399 16099 -138541 -60597 43435 -112869 -121852 -237047 20202 -54985 275667 -179478 18502
21387 239765 146995 -7692 -239912 123211 -102789 106576 -216106 -8299 -175142 -61060 -192014
21376 -192014 -44115 -79317 -23207 -84626 3242 183138 -57782 -25207 -154890 -286708 -103420
21364 125649 -35351 -146952 -5234 -56691 124920 -106321 -120538 199140 186852 -89219 77888
21352 -69448 179596 -282430 -51689 25367 110226 36860 45627 19940 163363 131301 42035
21340 86879 -2303 -60251 228346 -65665 -208210 213027 -55421 -188238 -94277 119532 41777
21328 41826 289438 -226721 11895 197696 -244016 75592 -219340 344994 -192142 -66857
21317 -1572 28951 -93381 177039 83459 -49224 182013 -40593 163901 -28018 99146 -265380
21305 311984 199752 -14422 36284 -136517 -60394 -237313 84814 -291428 -77388 -85477 50299
21293 -540 102387 -409629 -38584 -35704 3031 -101632 -113179 9612 -168590 -27283 -198680 196589
21280 -5382 -145736 -44762 136344 168878 -130927 -148220 183534 -215991 51734 -256141 68170
21268 21548 178987 -4262 -98864 -175345 -2014 -152722 78753 170909 -71272 -221959 -62247
21256 -184574 -205114 -15236 -52888 -134497 -79368 -188804 35340 83631 -164631 -151079 2245
21244 -45551 -154249 -92110 -115873 8873 52745 30844 -397071 126132 -81635 -267097 -385857
21233 -385857 -68468 37859 -176265 -355095 -116136 -191108 -63231 66375 127709 -44649 -30071
21222 -30071 -37200 -170589 -193707 -314623 -477221 -15814 -46377 -105764 -236107 268514 157859
21211 157859 -211775 113793 23268 235327 -341712 81985 -144868 240172 -85947 109779
21200 -102573 -86083 -19702 -47841 145658 -140495 -112032 -91346 4622 255756 -65791 -125637
21189 -125637 295827 -375642 330091 -97069 241218 -238889 -70345 -56710 151556 -3373
21178 88720 -167093 158910 -57616 71736 169755 2646 -196538 -70656 106716 -158484 -210757
21167 -210757 -75559 114399 -216025 99440 -33405 -31035 93569 9896 175870 248216 -140649
21155 15330 -73950 155060 148450 -26862 -68625 -158474 -60175 208315 80159 224587 -44437
21143 -116230 120777 -131283 -293442 -347447 -361525 -227731 -73644 64638 9649 -261082 -106821
21131 38777 -210333 59078 -25281 41373 350114 -386884 -147251 -4664 -95960 90173 37320
21119 62485 -32444 -332075 22916 -546649 -33903 20325 -150783 83293 -313593 75098 -10310
21107 -96341 90111 -107796 -150568 -119980 -127715 78577 10051 32792 20086 -31921 -42058 -102974
21095 -102974 -225690 -64199 16239 -113959 -85099 -8095 -370747 -107468 63552 -227749 -12667
21083 -131954 -143378 -52613 -82710 20931 -45954 -51042 -33463 -112256 -209798 -345045 -16072
21071 -395006 -77753 96368 -213500 -43908 -49536 41804 -247587 -76797 6538 100394 -186127
21059 107753 107580 190890 -223686 -26432 -117456 -37724 67445 210487 -52675 -172514 -153761
21048 -153761 24712 120174 -18697 73487 -260560 -63918 20528 -323609 -128449 -216136 -5063
21036 -281397 329498 81330 71358 53953 -298704 82620 -182638 -100436 -124025 -106064 56757
21024 -85919 52177 -68532 -253388 -60525 -119029 231021 -345662 -88820 34289 -91329 -224876
21013 -224876 26783 -47491 -22981 -86111 -173057 88729 173615 -34754 -155556 -272899 -61075
21001 -38836 -46869 -159234 -227074 -203103 95126 50808 307783 19417 412397 179924 47392
20989 -69339 117323 258210 -496176 -243569 -206616 -144442 -149977 -171655 17357 -61044 -307170
20978 -307170 -98345 -5370 55988 29116 -49526 109343 -209251 -201326 -60798 -152438 92510
20966 -161771 -232216 241973 27152 136555 -25483 -120089 -459671 93738 -149121 -38794 272225
20954 261836 1866 -205568 -56906 73029 196271 4718 -239019 -201910 -106178 -46009 -103303
20943 -103303 -165173 -152000 -350913 202457 219553 141707 -192608 -156469 63429 194422 295816
20932 295816 284048 121104 108985 174064 -232114 -137116 -7203 -13214 -90135 -212920 -241917
20921 -241917 -33583 -106790 70698 60167 -128074 -143082 59071 478759 30604 -120163 35795
20909 53552 -17673 -66439 -308003 -384793 305159 135660 249568 268017 -39513 97753 -210753
20897 -81742 -128128 51914 -164215 72154 9541 -149939 -45715 -179514 -265155 -177891 -15767
20885 -37935 -174682 53075 -358246 62651 -95670 13996 -102832 46480 23692 -63013 332458
20873 112886 189191 88886 10183 204000 28305 86333 60518 329803 -133758 36757 -224003
20861 242268 87457 292471 488114 -159508 -149609 -213898 -70443 206131 183375 139251 -168426
20849 33090 -205204 -82169 53841 -97855 -39092 133710 196534 -107380 47301 -404620 -72971
20837 348957 274304 -11053 -420272 34817 -41470 160022 -29850 70290 -182555 -28173 -247570
20826 -247570 -140137 -170925 -14621 318021 54380 -35776 261944 32970 18417 310618 -202818
20814 24359 52290 27841 24384 -84961 -2138 -379187 -189696 100166 -234304 70668 5301
20802 -290871 -54748 -81452 83601 -348040 -213416 -88176 52591 91302 185202 6302 38674
20791 38674 142498 42385 -103232 -307585 68325 -371618 -72305 77131 -297978 194940
20780 56098 321831 118624 -43775 270754 -238418 88178 -108116 -179059 -197396 -102885 -28691
20768 -26196 -249943 93420 -215189 -486724 -165669 32221 -90354 70273 -8384 74275 38993
20757 38993 145343 26459 187617 73111 -41351 8220 171565 -235508 -121380 -38456 -50877
20746 -50877 -104306 -49477 -58821 -150763 70691 31534 -201726 282498 151799 -255698 140917
20734 -41033 108016 -111492 -84043 -239021 -554201 -114747 -451509 -255720 -245363 42396
20723 43064 -266592 58938 -187138 -145077 -436346 71312 -66027 4645 -171042 -217495 237630
20711 -207427 322233 -5254 -403410 152020 -33301 148204 -260436 22299 176968 498881
20701 498881 -159004 -3131 314832 -48194 -81552 -64255 -445890 91474 7390 -137022 -10243
20689 28755 63749 -110648 142224 -323415 -257335 -60150 -288170 -266768 -62199 247711 -309320
20677 -79849 217475 -107603 117619 11685 87238 -158466 -263433 89224 -330642 -236907
20667 -236907 155866 -168003 410654 -173162 -27049 -204612 3178 33768 -113567 -79347
20657 -79347 -246018 114616 374391 60621 -171899 -215950 -165899 89659 -257097 77261 -353933
20645 137604 -135963 29449 -148568 -53383 2931 -118337 -515212 -224433 -129902 -36159 98106
20633 100712 -33849 124506 -334336 -157026 5731 -508502 -35615 -89976 -372011 -113704
20622 -70081 279719 132377 -207384 106725 -20530 -239679 -250006 96259 396524 31478
20611 -20897 -301868 118319 45450 -71903 -215236 57555 -349167 -78301 -129604 -13416 64554
20599 -243120 -91894 -295470 -23688 35257 -317598 154297 -74632 -233560 -151185 28860 -206310
20587 38282 -41600 211950 90589 -224525 123855 -33766 -174171 -8666 -5817 -13164 -8848 -146507
20575 -146507 274746 -160693 -74254 36738 -40996 -14206 -68223 67087 -259525 -245219 113309
20563 50699 -68631 59192 122121 -348552 109712 -188832 -43252 -157273 28811 -52182 -52453
20552 -52453 2322 9189 94897 -90873 -284993 -266493 2224 125887 119618 -195251 293803 -129156
20539 -84439 -41595 138274 183203 -297376 -174206 132704 -109717 -32977 -258787 52507
20528 159399 105175 -181260 233322 135738 -58500 56150 -58441 159533 18446 -10428 203807
20516 -367547 -2224 -113964 -166442 124851 146029 -126596 -175056 -172692 80923 112464 -193816
20504 50827 10947 327027 -151369 -21678 38796 -93007 -12405 -88429 -161231 -136156 -42984
20492 -77300 -357467 -163965 -261852 -90556 17659 -164186 -158218 -239026 152032 -184873 -12442
20480 -33791 49389 -561 88751 -172166 -114223 -186708 -207296 -50474 84552 -123813 -218059 -175370
20468 -175370 123103 -123828 105952 11702 34010 10171 231477 29657 -104145 81543
20457 -165010 117243 41390 186377 330259 -93304 -197851 -192522 207636 14477 242044
20447 242044 -100466 -209835 -263045 -165442 20865 29284 -153020 18225 124014 58653 -325727
20435 -546970 -162521 160321 -336822 -130676 -258452 -11936 -85827 -78603 235748 -52053
20424 -93295 35022 167722 -191321 -193048 -75792 230460 -66930 -50577 -75409 21409 105146
20413 105146 -208570 96920 -154428 -97717 11891 140388 -379266 -10797 52259 -202825
20402 78880 -163421 16839 -72074 -76383 182056 34378 66540 -110542 -317171 175638 75684
20390 -241609 90017 38361 232256 178673 -251636 -158742 50325 55034 -69769 -80098 -146245
20379 -146245 -64736 -38470 154709 -41138 219816 -267594 84768 -54550 -21709 -70996 -76325
20368 -76325 8424 59544 100632 -72622 -48911 5651 -285904 311009 -47248 115935 91932
20357 91932 -69663 311838 -410328 -274946 -21796 -67149 -111706 -399650 89579 -160780 -17380
20345 335511 170102 -2601 89663 -280732 -212887 -104348 36815 155203 -54594 -289022 -28154
20333 -123198 -20747 49089 -354551 -52093 66477 -371640 32848 -122026 182215 -76783 77980
20321 81542 -184531 -246917 23859 19076 -146955 -283951 -246468 -132819 -25885 16166 324811
20310 324811 -47973 -111698 -145802 -320719 -215293 179355 -118033 -102898 -87046 -47579 -278257
20299 -278257 -328965 -229782 152872 351704 9273 107129 -80351 -68715 15382 -104450 75681
20287 -77222 166908 -25058 -264459 -71363 -74356 -146160 -138275 -123171 7730 -59884 -241602 135985
20274 -195382 231403 -37902 -257912 -103884 63958 133321 -401706 155186 177014 -182349
20263 -278057 -180912 79781 76748 159704 195828 73878 -157919 5792 119320 139276 -14514
20251 -62142 -212116 45518 -55497 -8692 -55234 -88679 127129 101017 -9125 126368 -160215
20239 -53040 -87050 34322 -18111 36272 -323352 5274 -65229 -227853 122770 70680 3563
20227 -131335 126780 -16213 206456 55722 -262741 -159611 -34973 -127386 -275209 -93300
20216 -158463 156862 77446 -126796 -213762 -37059 -370659 -218973 230652 211154 -141843
20205 -210354 142916 -143577 -142218 165085 -46683 -190505 127130 -57996 331799 -213671
20194 -105971 2157 143691 77693 -2071 -30942 -89286 54380 -190162 -123617 -23213 -93421
20183 -93421 20141 -910 -135610 145973 51636 -250060 -250617 4170 53533 14633 -85240 8709
20170 85728 169588 -155583 203345 51366 -51022 -54518 34354 -359721 74966 -419307 -226379
20159 -226379 -74283 170692 103427 -70165 196849 126811 242029 -40556 92945 -143958 74189
20147 -178083 276864 45301 -20975 175434 291162 248750 -213974 42301 -64991 95754 530654
20136 530654 183171 189729 -24072 351780 312153 -52640 192488 273745 -107820 -7039 128842
20124 -313742 -357862 -110697 -146765 148295 -25704 162435 299709 248351 -93936 326880
20113 136729 201919 140302 56248 314921 83788 -116926 -314559 319890 -52542 -133690 -150683
20102 -150683 -184504 112878 28291 -116357 175782 -72963 -41621 -32344 2505 -95881 -131203
20091 -131203 28866 73602 31718 -41539 40984 58754 42507 91761 38272 319011 -6069
20079 -155780 236179 47862 -165336 -31825 -96826 201202 -58354 24214 -272772 -98975 -171095
20068 -171095 51620 -140861 -222736 -314354 -157718 -139200 -50498 -70273 -140159 -119604 -137342
20057 -137342 389487 -7936 -167265 -209125 -281800 -270901 162429 -82208 -27911 -123850 93566
20045 212730 21425 188789 -248985 -155098 -233827 57271 32345 116949 -254139 -280183 -80651
20033 6179 -190452 -179934 -225893 -69310 -45233 -129082 -239191 67330 -70644 -321092 -105540
20021 101061 -20805 -147638 -343117 -75939 31447 -75748 -81813 -151421 122520 144155 -55388
20009 -559 -214378 160190 -200398 122717 -6166 -243704 -205302 -109629 1972 39401 -178739
19997 -399730 45915 91216 -313730 24472 99771 -65887 -124168 18617 116541 162206 294116
19986 294116 260016 -42408 312397 -64675 188741 130466 -38773 -177126 -72867 -21234 -213840
19975 -213840 176453 -270123 194229 -23367 258665 -13803 -147727 -170393 -26156 -209403
19965 -209403 -71869 -140254 102741 -48030 213032 173444 75168 55569 15952 121338 182747
19954 182747 99199 353673 81961 33881 13431 -60069 104917 96245 268648 112331 20862
19942 -48152 -29904 75273 -187067 128011 -117209 -292088 -273621 -277519 104193 -239433 -143535
19931 -143535 -12296 -300624 -58305 -226932 266769 -105154 253542 176967 250244 64001
19920 119537 -89313 -188521 131187 -179875 165648 -276264 175907 -203293 50437 171981
19910 171981 182029 -170145 79986 187718 -52676 -7149 -180392 -137359 -60324 76668 -101870
19898 209778 -170598 16509 53667 -254826 148411 -212110 5836 115290 -257539 167159
19887 -542918 -108001 -116080 29563 -112626 -173333 -252714 -26620 233154 21838 -38276 -104989
19876 -104989 65890 -113815 -98931 -6939 185784 -22430 -82188 -26086 -376657 128456 245108
19865 245108 201541 103707 -53201 29810 -110681 -28644 -78694 -148305 -25480 -223700 -48831
19853 176934 -221347 -430644 -86746 -24384 131349 -33648 70698 -368281 143299 -161582
19842 -31985 -174757 63123 112251 -325783 158976 108054 -36034 -54827 -123381 -160185 -275868
19831 -275868 134983 -120463 203867 27782 42719 -54621 36164 -52392 -116146 -275286 -39413
19819 212318 10641 -112837 -131785 32925 58647 -216406 -19316 168244 75165 63860 134189
19808 134189 177047 -236605 -173926 -98049 -121732 199494 -16827 -59320 13835 -50495 -143515
19797 -143515 112803 -8585 116797 -251227 -38505 205070 -94641 120474 -150865 -84236
19787 -84236 -193321 -173502 -192692 -73195 57211 38252 -65247 -140259 84002 166648 -14364
19775 110341 123953 108498 -109155 -124447 169122 246918 -151440 48396 -140519 177953
19764 31787 -600545 4461 -92089 247497 232332 -3941 -63284 156213 113276 -92069 -317607
19753 -317607 38931 51346 62758 128832 -329553 -298911 122676 -103835 -8789 -125114 59766
19741 -174170 -63629 126669 141065 -398235 -4151 108782 -57091 13274 379672 21430 116059
19730 116059 350627 297276 700416 334010 354821 263064 -285913 132880 -115063 -191247
19720 -191247 157101 -274484 1966 -167543 -139078 -182138 -180549 -207556 105039 -98751 -71631
19709 -71631 141235 -238230 -84578 115149 485972 7807 -45723 121704 -212898 -187245 215950
19697 423395 152608 242628 260381 185623 202630 246496 200022 -49568 -29484 300951 81099
19685 155461 -204492 85535 -299470 -29513 -176695 10332 52071 -50698 53018 -208299 -268459
19674 -268459 111710 312276 61838 -154832 250286 -8568 208051 101406 -175680 101634
19663 137196 -321244 27095 32632 42251 34882 -140563 312861 -275657 153647 -124586 -217790
19652 -217790 -25433 -62861 -95444 144620 -130140 219040 -173106 65367 -172320 -145095
19642 -145095 -17547 81971 -206658 -216163 194488 -275449 -185424 -53757 -592259 -172628 55774
19630 -108789 -1946 157570 51011 114000 -101245 359686 52528 -373796 -27835 -276071 100943
19618 -260391 -315976 24532 -356561 -236779 -354103 -74754 10368 -173327 -65177 -244269
19608 -244269 -113289 204936 -3886 -177977 -392744 40680 -26637 -236030 -297783 -157625
19598 -157625 -128744 215460 -311819 -176737 108810 -39662 -177664 -134265 -124063 -73468
19588 -73468 60074 79746 184391 72342 -323543 -36157 16552 -178784 -79242 189397 -108513
19576 97264 -25958 23026 -333088 246206 -167538 16767 -199335 314081 49007 -39043 -207219
19565 -207219 -5754 35006 -264599 -38943 -93956 -106445 -25657 215364 -136906 55571 -177290
19553 58512 -17300 -55300 443022 100297 163282 -256634 -230259 -191355 254523 -42723 94357
19541 -92336 86028 -208414 -95067 153706 -229450 -333545 -98300 44357 10511 -58143 -292686
19530 -292686 -82909 -352649 120253 -375329 206260 -67075 22579 89414 104937 253622
19520 253622 135592 126270 -52238 392420 -172820 36620 -228681 -83219 123406 180496 31871
19508 455151 160989 61707 96759 102971 -458093 -2146 -67930 -170723 -47820 181723 -33391
19496 -39292 333742 -154459 75956 -354750 -99506 -151560 -109412 91832 -78860 -190147 105620
19484 -240202 -341458 -115273 -190134 -112987 -49529 -121651 233935 100328 171196 -93921 161269
19472 79675 -154530 -78648 85260 31665 -90962 -15477 29167 -89400 -266113 -70253 -161934
19461 -161934 -47451 96247 -23349 26637 150014 -355853 -330511 -607076 -160862 -66238 -80138
19450 -80138 -229322 -188470 40059 -95965 157408 151378 4669 -343870 -431898 -208706 -243968
19439 -243968 91927 -30083 14443 145163 -122516 -242101 -140950 -101484 -189521 -202848 -330007
19428 -330007 29147 -145517 44301 20779 -232647 -103518 -197080 119292 -154960 -185052
19418 -185052 82 47755 -205810 382535 -111654 452182 227912 57898 166952 -50622 -118352
19407 -118352 -75140 -9974 -219035 239567 -78976 -159200 -184415 -85784 -36280 -244549 -270115
19396 -270115 -112674 -113647 464638 170617 -138151 55757 -21644 80875 -31300 -172884 -266966
19385 -266966 -143774 -20630 284210 -23211 -211986 151960 -8365 -180875 -6004 6647 -165457
19373 35530 -112176 11865 -252257 65109 -185020 -26833 -272106 -122080 18038 125035
19363 125035 -152647 -180053 -135353 31882 -145588 -15523 77476 -67667 -72493 -67115 -258061
19352 -258061 -147735 302443 -159335 -158743 129494 -276195 -190258 -167287 -96892 3879 -79750
19340 229130 -13654 -97662 -63682 -491119 79731 -109196 74878 -137101 -61798 -184795 -52815
19328 222560 31198 -134434 -174355 -343625 102838 175193 -176842 -52153 -28156 150942
19317 -219220 -91821 -186869 58127 -257890 -116837 -19944 -12105 174366 -315279 77681 -310597
19305 86008 -209170 -138064 -167093 -133912 73392 -146803 68590 232409 -31307 -201898 -349411
19294 -349411 -382296 -277131 42359 -125602 5920 152018 18754 -248050 211873 -82850 27595
19282 -132478 309970 165688 -107294 -352983 -104053 26317 -318911 41194 -136930 -9313
19271 -64249 -341213 71184 -96574 95482 -7949 -32397 -61944 -131394 -60794 -128960 8499 -12515
19258 435 -188284 80094 -322189 -148797 -125725 130920 -237945 16109 -79787 -212070 -136261
19247 -136261 19690 -26142 -45204 35047 -32362 217865 -46346 -12934 100745 -84257 -210190
19236 -210190 -64377 -127603 103657 20022 167830 336957 -158419 110728 74502 -111682
19225 96561 113025 -226501 -87483 -90215 78530 -68705 -316168 -113133 -14517 -162335 -27023
19213 58933 -301257 70455 -59605 -168444 -39502 144502 275954 -213051 -158339 -178446 -96852
19202 -96852 56695 -289994 -34918 89335 -163318 -198885 24232 -31557 -457798 -166020 -251267
19191 -251267 -101495 -189521 127537 -181922 -87953 229154 -222728 199536 -223515 26754
19180 -58308 -256268 46203 54058 -139036 191841 -102448 -20121 -253471 -306932 -182303 -28411
19168 185132 -80407 -154451 3749 -177155 418838 64874 -15668 18063 -49145 34501 6593
19156 -109638 -248066 -76204 -242449 -46855 85060 91568 25504 82072 39177 -52525 -249222
19145 -249222 -49732 -363266 -58108 -245052 22136 56414 -109657 -123771 -286051 -8246 -106642
19134 -106642 -70809 -173621 -298776 144235 -2189 184573 140104 -242480 314095 100321
19123 42895 11938 -227213 70932 35453 -67687 -81118 -220045 -100147 -127126 -49537 45540
19111 173918 -65829 -276301 401653 27495 -118161 139905 -101927 -115598 -281361 -199397
19101 -199397 -4002 -46076 -226837 -58311 -16423 -211110 204298 -288906 -67501 80668 -55702
19089 -9567 -29642 124325 -273117 232606 -53574 -116100 -249886 220986 79525 -106539 -201776
19078 -201776 167774 24679 -93197 85183 -47733 157149 -113960 -143688 -39456 -155528 105244
19066 -81322 446770 -57429 72455 45315 -204937 -260612 -5114 -121360 -365547 -32827 -87727
19055 -87727 9202 80195 -173237 30544 -45920 -155492 -327182 24436 -153488 117457 285715
19044 285715 -269223 143730 -30961 -94408 -40104 44165 -37034 -186777 -196804 -187046 34497
19032 -50872 -20768 -2388 -156469 -85230 137068 12308 242416 -163060 -142126 -11778 146279
19020 -338721 -130163 74335 -114843 -51928 29485 -210608 -351829 -177587 389147 39000
19009 83037 126710 97109 -106345 -234492 57595 6522 240819 148507 -174899 -405051 -253318
18998 -253318 71103 157024 -43816 -204567 8084 68817 81533 -144430 24892 -58498 -54666
18987 -54666 -32356 170794 1555 69907 -83004 97848 -181434 -149212 -208863 -64476 -44110
18976 -44110 232778 -197605 83084 -106685 89841 -359401 -3104 -171189 154504 -5337 -380796
18965 -380796 210554 52467 -234203 -18725 146495 -172489 475342 295837 -4930 -86800
18955 -86800 88488 231708 78785 -144997 -129726 -311273 -23906 129125 72796 -195529 -200888
18944 -200888 -200922 -153337 -213522 199675 173289 -146887 -107562 166535 -1623 -122565 10411
18932 -30263 -261311 -119852 -134602 -198750 -97962 -48359 134293 -178994 90856 -83361 -113371
18921 -113371 79210 -60187 90128 149866 319737 55136 136079 55949 -81798 319182 181412
18910 181412 -517186 211839 -43975 -42949 -296667 -25606 -185321 108718 -14572 -101634 -52180
18899 -52180 -87422 -129199 119645 -70821 192565 155059 -379303 -132385 -122569 -142412 -80472
18888 -80472 130423 -269142 -114520 -306382 -72455 -234297 -82781 -97096 -90640 -279082 -328877
18877 -328877 14520 -141632 104768 -469715 1418 -131751 -215065 -215492 132792 -251309 -235687
18866 -235687 -37667 112338 -66717 119269 139554 317705 392645 -138768 -167866 -135529 -100974
18855 -100974 94684 -44237 217553 -335821 28092 124696 -289959 19594 23159 -261680 -327889
18844 -327889 -92778 -69094 181036 283366 -91346 -11369 82024 -375614 -17396 -48563 105663
18832 71362 105268 118207 85592 16207 -105127 -88151 -35840 103202 -129670 80833 175004
18821 175004 -343764 -44042 -153782 159501 -99501 235070 -190995 -178484 84031 -65445
18810 62121 39948 31152 188190 -139425 21179 266894 -144639 179509 -47710 131896 -56991
18798 56456 281344 224787 -79591 171219 20093 -9557 64426 1618 -372023 -47979 -402378
18787 -402378 -14757 25907 -160610 63472 -153381 53865 -245179 120293 -244539 2789 -43503
18775 214101 -76564 136204 -307922 -89024 -288922 -231114 -238840 -134298 -8462 49322 -137225
18763 -315508 -238907 97784 203361 138434 -121211 -108733 -225100 -310524 -159965 -41092 -286518
18752 -286518 56980 -291272 -67913 -284664 -134461 -239993 55560 36842 125534 174908 -8119
18740 -255965 -194996 -196277 -179564 172324 94666 134005 6877 -265511 -35661 -185801 -140051
18729 -140051 -53652 231276 -48419 -92349 -59632 -186224 -55991 -171225 -255330 21819 55758
18718 55758 12147 -178518 84044 88079 58476 -80946 -292893 -317635 267091 33990 -149708
18706 42692 67761 -85877 -55931 -14122 120059 -66435 -271616 -18113 381738 -259463 -404425
18695 -404425 412548 -78017 -101158 88547 -165837 -223699 131501 44905 -168382 -44083 136035
18683 -40776 293546 65822 97928 -147776 -113976 -217524 205154 241359 -74628 161184 -101098
18671 -88279 206056 -386476 -72964 -153837 -217767 -121745 164985 -392362 -15775 25415 -40061
18659 -99323 -124147 -144687 -44271 73613 150750 196127 -76705 -78959 10733 157433 -220814
18647 -167576 -213321 -135086 -402353 -228677 65659 45026 72678 85885 394686 -159009 -177272
18636 -177272 109770 -109233 -73424 -117317 -178457 49841 -35081 5658 -187652 -100287 -184089
18625 -184089 -23012 203012 -260020 36031 -286094 -175866 12495 -154242 -255125 -329770
18615 -329770 -62961 312877 173404 12097 -245333 256938 -88393 969 9091 16520 -51499
18603 -51352 -128995 -149300 97501 -260357 82873 244833 -108055 102359 -127654 177346
18592 113343 -189095 -402057 102873 -20559 90029 -238815 -177714 54569 -303210 -177367
18582 -177367 100004 -51382 68196 -259704 -148465 22399 -183322 -44811 -50713 -43150 42023
18570 -183215 20989 13342 -61695 -154821 -422610 211483 -42382 141041 -18497 -221191 -407297
18559 -407297 -126553 -46075 187479 -262883 -207594 99496 171953 -146969 -129221 -73345 -158901
18548 -158901 234896 -316359 -199617 -167971 320486 -162341 246510 32499 -31795 120922
18537 -67008 -384068 144456 -42205 -125584 22230 -300234 -262742 -62830 -109909 63115 20633
18525 117264 -48013 106682 -36398 73363 8146 -88989 -94930 133229 -257289 -73750 189966
18513 -377909 -160425 -247625 -293786 -50464 -335063 -174552 99467 -25224 -93943 -104398 86337
18501 276025 -238531 -226799 186625 252133 -215166 191187 259430 -21016 -48824 -159816
18491 -159816 51641 470492 8312 -314128 -28552 185271 -31412 24837 -443456 -73394 -14765
18479 -161309 -34598 -360396 -85939 -28068 -93599 -17346 -48471 -341264 93160 41710 -55107
18467 -21721 25422 -69394 123460 -44087 26729 -35270 -42021 -178952 154805 43652 154486
18456 154486 -162914 61409 -270130 222331 -68810 -132902 -4852 -78136 308426 7474 -199280
18444 -274212 -98199 -217827 207810 278576 -99846 -90363 -71606 -18663 18674 -130292 134130
18432 -239557 60226 -148685 27813 -36318 -5488 -286827 -207497 20083 -94145 -99227 -190628
18421 -190628 -3106 259623 300496 27962 -276109 -259849 9267 46205 176024 49076 -148696
18409 158227 -280680 241377 -26060 68656 -119261 17066 -309893 185137 -181160 91500
18398 8574 -217732 -42300 -221557 212670 -135763 105205 239845 -61199 -66580 106453 89021
18387 89021 -24101 -43778 227683 -100582 -361267 43975 -201846 -241355 -41336 22367 -26566
18375 -7110 250253 -58692 -41750 159187 -64877 -64942 228127 12068 -183486 -283626 -541004
18364 -541004 -293175 -189016 -64298 -99104 -21241 -367293 -39807 -237837 23131 -85159 404206
18352 41135 -4094 22304 -77054 -5826 -409933 128106 -37109 -158138 -192695 214790 103629
18340 -69819 -277850 -248741 -297890 128818 -124367 -235709 154038 41499 333224 -195087
18329 166254 -40495 -170516 62297 -114890 -33055 100052 -28287 -265764 -156137 -4978 -40218
18318 -40218 -294110 -208808 -3382 -58866 84640 -43558 -31748 199696 -186133 135004 -113536
18306 -203774 155539 69294 61816 -86471 -43070 169772 272431 -9622 95226 -170825 119066
18294 219376 -266035 -144716 120114 -40844 4669 -38965 -189603 27102 -217613 -40276 -160040
18283 -160040 -29007 29145 -304064 208897 193893 4025 -517659 -298902 270096 -288513
18272 -147917 -39651 404098 179944 244410 237807 -21481 -22821 -353382 306774 -191446 -27032
18260 -8191 -178265 -212022 -259519 81101 -216531 -94115 43808 180596 107030 25613 -99523
18248 39005 -387991 -40905 -88230 -2547 62578 -6399 -149226 -42277 -293759 110877 274413
18237 274413 -112594 -45733 327665 28742 -286473 -4725 -59164 -248829 194680 -31565 -221059
18226 -221059 79761 -332766 69155 299556 -78937 -197620 73678 149368 -276375 149137
18215 -383656 -39963 77518 74696 10677 28980 -70203 -213567 -165696 -171595 -226243 -84416 -185099
18203 -185099 -22815 -133610 -182039 -14575 -4559 -37193 278729 58135 -159599 78476 218618
18192 218618 -125223 98582 -216187 71493 239126 36248 -48317 -29576 213151 194668 -224264
18180 11153 65883 -79590 2024 -18100 -325888 6434 -406583 278294 -116384 102783 97674
18169 97674 113341 -190514 -56434 297419 -50131 75703 67764 -88522 -127077 -59446 -171191
18158 -171191 -259424 -113620 -196618 90236 248542 92120 -227322 -82381 130632 -8172 -217995
18147 -217995 55013 -133740 -9510 -231831 143735 -120960 -231940 189345 -117521 79868
18136 -1038 217113 -143224 10258 -213584 110025 -118604 234597 58608 -96423 -13335 113991
18124 -71972 -75476 108267 -86812 -166324 115212 -6501 -33574 -21631 195160 -233012 -50894
18112 96852 252058 -205588 44055 -88060 -58992 -3570 104260 117005 27076 -171797 -78275
18100 -779 -105136 -74924 -75288 -257629 -176570 74456 4680 415357 -416614 -260341 -239470 34515
18087 -39081 157769 25106 -225224 56924 170341 14935 -103086 98548 -96416 -357099 -303844
18076 -303844 323199 -55240 34866 230529 166036 83983 109572 66155 -148124 -39983 320124
18064 -330631 -308624 343644 -219096 -2859 50149 252 53218 -423373 -8989 14394 -153824
18052 92551 -26979 184315 394027 124838 -77436 42632 -35281 38042 -199465 -217363 271412
18040 -33751 -136846 170790 132860 2646 -96925 43060 6000 -88776 57250 -75819 47492 18757
18027 17550 -204478 -260789 -42970 208237 -136478 127697 317041 -151237 92415 40057
18016 108435 51217 147738 -141845 43085 -74301 221972 144519 -5977 105911 47750 -115566
18004 21462 97222 57187 335622 -446648 57782 -235819 -142787 234208 4441 -66765 42025
17992 -178268 -45957 177997 150660 1318 -209892 -125110 -25298 -142672 -174741 -115642 116820
17980 21420 36875 250715 174741 136462 -16875 51877 77177 -148761 -60930 -57166 100253
17968 251906 -260331 275385 75572 91886 -111801 -182742 394664 299956 -247128 44635
17957 434901 184412 234925 109900 41485 -151254 114064 22661 -431382 -379988 43272
17946 257308 -236512 -135036 -48031 -143502 90913 -36577 -444215 -58330 1819 -38236 -112626
17935 -112626 28481 406514 14764 172855 -48819 177691 439 232584 29642 -5386 -38196
17924 -38196 15438 -18728 410083 179011 285864 -117480 -118742 34881 -301161 -85692 -1533
17912 -114635 -119117 129229 -135490 23854 -43929 -178059 149843 203126 81733 -224986 -242413
17901 -242413 -250416 -117774 138451 -142081 -142340 -81473 294832 254892 -63418 154015 274320
17890 274320 90378 -5249 38348 151147 110125 -53139 -35725 5952 17823 114657 326697
17879 326697 -76467 -158862 9198 240438 140878 2724 -80892 157560 -120817 82011 -238479
17867 181499 66493 -140983 -37414 -134774 -258059 -155934 -177649 15153 372830 66906 176923
17856 176923 168804 83719 68011 145213 -43247 48529 -248134 133455 -274528 320086 116919
17844 38476 200610 137968 213585 350266 68401 16926 -56363 123194 146352 51406 367860
17833 367860 521616 -192241 265425 56719 -68274 -84805 53216 459469 -220749 -302782
17823 -302782 38124 129761 97894 -190564 -278908 194664 58227 277082 -58885 -93679 239200
17811 123186 -96689 248807 164704 164619 64123 39162 342491 143531 31348 -229390 -66732
17799 -100667 100909 -87340 -42022 223775 -2731 -108037 183686 33577 52937 157297 186227
17788 186227 1459 -69616 -85000 -41798 364054 86056 247926 259449 23217 -23006 -126551
17777 -126551 101655 -1671 -6013 49811 119222 194810 125276 -77459 -8971 -9930 130218 68902
17765 68902 71721 -231355 -70768 45257 247378 40554 -195593 64505 50191 293561 134413
17753 125759 -16051 -39871 20572 50166 211677 195207 -141968 126732 28408 -44200 -333638
17742 -333638 -214816 151526 147379 278529 -198954 120190 121284 100148 -160349 47108 157806
17731 157806 144058 194524 169747 135891 48990 326083 239055 83641 101641 -73563 81934
17719 -141384 38219 20123 399539 -106886 -73506 -137368 -111645 246960 -452794 -12867 -281337
17708 -281337 -183590 24672 -273670 55441 186972 45514 298718 274219 34263 348332 157850
17696 296414 148514 61361 -67515 243356 185786 198239 -147437 15157 -156883 148627
17685 477156 -41299 -161772 13970 12669 13099 152850 107589 233418 195050 -89318 219216
17673 -168222 -69090 108987 326564 151264 207338 80590 -63057 -308892 -139554 305335
17662 265261 356430 -128338 -83779 54161 23003 -24408 130278 146910 103628 -166817 -61793
17650 91299 -51789 240535 101861 84564 202432 281847 125389 360302 119129 106432
17640 106432 -18292 306796 117851 56368 -164869 -185417 166323 106027 137486 15586 255837
17629 255837 -236372 189790 34644 106262 23955 271481 216504 118880 150601 -147476 18505
17617 374633 -293 208446 313828 106812 147976 146621 279983 -248673 96366 312464 62233
17605 92903 352813 -10908 33807 122200 82624 289301 28723 56267 -26308 57655 102623
17594 102623 -61502 -246210 28091 167755 337400 87789 -76087 284198 182281 197704
17584 197704 239335 -315361 175264 240615 -275469 136083 -124257 79540 167412 187884
17574 187884 111039 285535 98755 -68690 314144 198899 242034 136042 195705 227154 -101607
17562 53327 161095 140467 134541 304795 195876 115534 169680 368899 323467 -44278 77942
17550 -235009 139926 -10832 -29211 -30917 -33508 -84121 -214739 199123 120043 381201 145903
17538 -160261 415710 17246 69740 -8225 -217272 96150 -1998 58941 166641 644735 395490
17527 395490 258270 69786 -82883 542783 216355 200608 340525 396160 168115 42293
17516 -191223 185555 237193 -72630 363819 121149 -95182 46510 121407 169724 129433 -20172
17504 194900 119971 63547 351952 154232 233425 -33127 139912 -894 -116410 344119 285572
17493 285572 357351 84081 -209455 291091 233279 230724 101984 266663 302990 151088 138183
17482 138183 88081 179046 228661 250333 452905 94463 213153 175288 187364 414443 254291
17471 254291 169760 116022 264596 245359 411369 113457 71896 449653 126227 445263
17461 445263 409713 -162723 89252 247887 287251 321360 455076 78196 210448 33572 408346
17450 408346 33041 229230 221870 440587 292183 327847 516303 453801 395146 283326 232890
17439 232890 302401 368032 406903 479310 350562 632157 541513 287159 452298 85370 152139
17428 152139 504805 364346 288956 655114 225526 385027 56428 504897 169782 323298
17418 323298 219816 490899 390433 600388 529084 474907 196084 358576 502580 280112
17408 280112 420575 524571 406259 147844 76493 265159 148167 389544 364927 148472
17397 149085 352586 171493 70694 -17528 72669 238760 379730 400367 93897 479939
17387 479939 464671 172334 173367 150965 171942 212177 131217 104104 -60799 323245 671159
17376 671159 203875 -92310 242978 288672 318258 360079 199641 512194 559679 476165 372308
17365 372308 -101224 169858 323592 -25779 298529 286086 202154 383051 232291 -70701
17354 119552 120313 442767 196261 111650 273004 329407 174480 82388 427561 99827 338380
17343 338380 451962 469923 338666 -98983 237398 395878 433648 388363 264568 269182 316899
17332 316899 416487 362816 157070 258889 248804 200555 250622 422972 370532 433118 348197
17321 348197 391775 246373 43178 337496 144020 -33228 542371 413312 378551 197448
17311 197448 228168 301161 447914 315423 342513 217707 109856 454654 616807 257198
17300 534485 82431 422540 137070 238385 311314 61813 611962 156336 293794 410503
17290 410503 292544 274915 91606 411407 36006 211374 415953 243640 651359 277412
17279 386944 695462 294552 544907 111237 388747 271091 428995 403251 344588 368750
17269 368750 350053 60575 385047 401368 426248 299692 510508 389553 547165 540112 480904
17258 480904 93295 316190 474882 198442 478944 262240 263524 541201 200541 470274
17248 470274 422350 333997 205729 269582 557183 689177 506597 374497 452507 523542
17238 523542 434303 468071 581681 578349 393173 254605 413373 623393 464013 102357
17227 352926 492319 588909 285941 529574 493142 389858 483050 283493 657138 194335
17216 293166 958856 431789 462249 587041 341841 359650 376820 782989 454664 425561
17206 425561 229172 743816 597043 490315 264753 293619 330898 814563 697676 403506
17196 403506 400022 470343 658633 528628 422927 679863 761647 769757 670111 516084 383561
17185 383561 635807 705760 344146 479147 480811 399377 533484 629711 534283 435070 741682
17174 741682 538745 442545 447316 405838 756584 606251 319188 493320 594083 486797
17164 486797 695713 650701 491618 683717 629675 544909 656314 600302 461306 410109
17154 410109 649855 357372 452522 539859 391496 699415 672971 668309 675797 370436 696029
17143 696029 606415 526103 675643 534180 466350 549109 416926 687925 779580 420222
17133 420222 628630 261951 774216 954178 955508 530832 793272 396000 451835 545346
17123 545346 595898 1003493 804238 667370 497776 965558 796185 757513 1011413 1026674
17113 1026674 1140883 829659 398647 557650 1111031 1096209 702405 913092 905077 828950
17103 828950 626206 846188 815571 724917 674152 675303 1049070 708605 815139 697647
17093 697647 865395 925638 964074 990701 879880 829731 686432 1059642 736258 1183740
17083 1183740 845634 1157346 926820 921567 720248 814720 1299388 1009503 1195134 1191446
17073 1191446 887975 956791 785559 1121840 756109 837603 1201916 1080500 1037762 1196523
17063 1196523 1070834 1363102 1080293 1128951 706276 985675 888726 664013 1173711 1093134
17053 1093134 967843 1080868 1234881 871873 934293 997248 1096655 1220436 1222089 1064605
17043 1064605 1384518 1403254 899979 815446 1026429 1042563 1065851 1115727 1279760 1258524
17033 1258524 1246294 658212 1026268 1138629 1200082 1235222 1314893 1275921 1046046 1014980
17023 1014980 1095674 1276895 1319180 1224545 1380275 1009151 1170321 1101253 1293151 1287985
17013 1287985 1387964 1326282 1380459 1319752 1243824 1288643 1552446 1295816 1626260 1619209 1408569
17002 1408569 1601697 1436023 1776086 1615533 1276563 1376374 1250315 1726457 1446651 1872064
16992 1872064 1632514 1729873 1514138 1593949 1564277 1552822 1434973 1655644 1823671 1950816
16982 1950816 1720997 1754716 1562906 1612801 1477432 1891655 1470028 1838261 1842157 1812941
16972 1812941 1723673 1639461 2060585 1967567 1938825 2005065 2290943 2006540 2038731 2006413 1924503
16961 1924503 1938801 1796317 2184680 1887258 2145556 2095174 2368330 1864421 2244446 2201959
16951 2201959 2029292 2252830 2259086 2122987 2282949 2400551 2221271 2229883 2329790 2402677
16941 2402677 2255339 2146751 2480913 2549767 2425151 2563760 2455479 2327222 2447330 2424362
16931 2424362 2657971 2749832 2343522 2607393 2756066 2585863 2362042 2718168 2593886 2955065
16921 2955065 2839723 2673407 3188041 3091446 2913133 2881452 3101150 3061882 3015672 3037829
16911 3037829 3029236 2922117 3606768 3494295 3094378 3224740 3255034 3517792 3167707 3213046
16901 3213046 3291497 3510854 3582113 3491985 3589918 3862338 3692155 3694570 3662115 3806041 3711014
16890 3711014 3385651 3902516 4035502 3970514 3881630 3974714 4015954 4106658 4532041 4413439
16880 4413439 4256802 4334705 4448935 4380155 4257399 4540557 4322243 4589698 4848384 4603993
16870 4603993 4775652 5148895 4997698 4996569 5095672 5005038 5423064 5154588 5592666 5386337
16860 5386337 5625481 5899923 5540635 5590485 5916554 5860917 6032023 5951132 6319709 6104970
16850 6104970 6217113 6251569 6315534 6572153 6925255 6778227 6651281 7134101 7129513 7006290
16840 7006290 7351477 7263253 7405356 7564679 8145908 7903770 7779297 8168744 8236289 8389509
16830 8389509 8362233 8449889 8729169 8888127 8935835 9052099 9552624 9165462 9436543 9644408
16820 9644408 9788468 10022968 10343939 10595127 10242108 10793153 11131733 11182583 11218265 11449178
16810 11449178 11760950 11992348 12292289 12303155 12695191 12730239 13119148 13149379 13679101 13896897
16800 13896897 14286065 14627050 14710450 15017213 15337292 15883907 15698616 16159913 16657676
16791 16657676 16815904 17485768 17786069 18128575 18590772 19021313 19125382 19930093 20161302
16782 20161302 20611552 21294166 21545363 22024333 22528898 23139747 23874980 24437223 24674267
16773 24674267 25429658 25999027 26745668 27460995 28019797 28769858 29620582 29971378 31146164
16764 31146164 31807574 32672079 33388906 34340206 35145804 36260321 37060476 37998835 38984826
16755 38984826 40185795 41055883 42435494 43688125 44623953 45633161 47160400 48492728
16747 48492728 49611175 50779170 52304088 53615688 55091144 56475301 57821416 59562685
16739 59562685 60550243 62686354 64029823 65672681 67459744 68932856 70358109 71993532
16731 71993532 73731903 75535017 76838418 78482155 79669814 80924480 82568974 83541569
16723 83541569 84975591 86092452 86701276 88079653 89055266 89790326 90166498 90597730 91283612
16714 91283612 91650844 91747656 91957930 91671906 91645496 91292265 90760081 89884975 89092415 88677923
16704 88677923 87295133 86306441 85150970 83895518 82692766 81281942 79967770 78035460
16696 78035460 77024801 75651539 73554246 72313956 70557148 69029925 67619304 66097106
16688 66097106 64444588 62547159 61252095 59416468 57896565 56553217 54849771 53740255
16680 53740255 52078876 50696353 49424228 47790618 46691731 45588635 44308491 43194947
16672 43194947 41957170 40895647 39635938 38704240 37633872 36871533 35595728 34502307
16664 34502307 34028890 32721116 31989849 31113189 30672005 30136861 28656878 28235058 27545963
16655 27545963 26740792 26521121 25401106 24895868 24243471 23672843 23184049 22784902 22357231
16646 22357231 21579384 21060489 20322477 20026536 19608984 19329239 19087632 18479209 18231093
16637 18231093 17842467 17205945 17126975 16520876 16144220 15997081 15768495 15201592 14578828
16628 14578828 14517430 14278147 14092294 13799067 13369921 13274444 12734960 12709139 12660107 12284213
16618 12284213 12064965 11929400 11375609 11387801 10980994 10838343 10619662 10449963 10275990
16609 10275990 10656576 10105854 9672650 9588165 9785838 9476560 9055363 9052959 8806492 8650329
16599 8650329 8740815 8435306 8513922 8141971 7997800 7623058 7616327 7582499 7431453 7605026
16589 7605026 7196429 7077125 6981626 7254159 6856516 7143401 6654246 6711084 6757499 6338815
16579 6338815 6385529 6388741 5880699 5982607 5789411 5796680 5606128 5831874 5639991 5747577
16569 5747577 5314518 5491644 5230996 5219791 5215630 5290993 5276545 4660566 4982138 5060050
16559 5060050 4712387 4651680 4694608 4582797 4477950 4746952 4388906 4326103 4407656 4299571
16549 4299571 4356926 4148555 4233806 4179775 4096847 3992820 3997840 4052740 3979517 3849980 3411664
16538 3411664 3676806 3644925 3687171 3434537 3538067 3744825 3170985 3635967 3116568 3305945
16528 3305945 3436416 3208211 3166769 2824931 3350548 3125656 3116848 3136424 3223541 3005454
16518 3005454 3022983 2861266 2854838 3088590 2538602 3070028 2870607 3134147 2820495 2608588
16508 2608588 2570082 2738025 2481692 2762656 2732252 2669056 2430946 2464957 2434597 2496842
16498 2496842 2139841 2471103 2137098 2477633 2646014 2567023 2440675 2542566 2292054 2141042
16488 2141042 2550386 2352535 2165412 2102336 2112237 2178920 2213949 1972861 2142605 1852394
16478 1852394 2028571 1901708 2005898 2032330 1855434 1714275 1797991 1899757 1488092 1884787
16468 1884787 1755310 1997390 1650115 1735776 1728433 1809493 1926009 1613309 2020346 1909401
16458 1909401 1623883 1552705 1811788 1694895 1552082 1463116 1614992 1448061 1359041 1470554
16448 1470554 1450998 1497634 1325444 1314098 1495369 1610507 1548213 1379787 1269758 1573483
16438 1573483 1235699 977294 1353309 1385844 1471069 1205195 1622707 1281633 1358778 993201
16428 993201 1257426 1327322 1892967 1302787 1638507 1072473 1292812 1226853 1297236 1383244
16418 1383244 1192771 1156018 1356426 1214495 1010661 1237871 1212680 1126950 984258 1128138
16408 1128138 829166 1164070 1325953 1282746 1214310 1061358 1058585 1156993 991689 1083067
16398 1083067 1103044 1093613 746544 886797 979400 784876 1126496 1034492 972422 907732 896493
16387 896493 1207634 1069092 1105069 883587 1212768 1304834 1180214 1081967 1093288 894933
16377 894933 629303 1046099 914802 985066 943771 825922 824082 711840 879300 848445
16367 848445 703786 850135 1090625 670084 530471 418921 684284 915023 569141 907599
16357 907599 973567 1132901 944544 807649 883975 772785 860860 745207 885459 393292
16346 619876 715634 928918 916194 433488 587264 744761 734987 976452 823143 657032
16336 657032 468530 934226 1016398 569540 799378 636890 827779 795230 215067 286019
16326 286019 679680 833414 740333 771248 540319 937435 832543 103897 854178 666225
16316 666225 702817 712772 764202 424593 744770 729307 645211 325619 469781 604736 385521
16305 385521 461845 691455 232734 489883 502404 888428 545583 678290 543990 493348
16295 493348 176057 785586 639442 644986 404094 546672 538451 586178 699358 556357
16285 556357 360846 729186 526689 535615 363163 522922 341485 309474 459860 584270
16275 584270 453133 478449 651577 634997 645004 501810 586553 339631 432308 700109
16265 700109 307512 532487 27319 515502 327009 627821 447573 723522 367111 282861
16255 282861 390341 355737 535677 605985 596379 457680 507110 526876 536987 564327 330837
16244 330837 474175 421030 211125 543478 489451 340399 340880 422432 534186 680709 528631
16233 528631 216737 810445 532244 144814 336579 133560 518034 385525 186298 346677
16223 346677 57867 419870 -24705 407850 419541 221048 418208 266335 118938 137720
16213 137720 369518 464382 312695 29705 347415 599635 270715 213094 172310 333856
16203 333856 243040 628823 72404 480863 562833 312217 375502 242895 388569 80905
16192 299149 461001 359809 344890 29956 168791 190033 255124 381448 85319 14561 -72271
16180 44834 254235 -202556 512200 316587 85357 -46180 115924 310365 298748 279258
16170 279258 235687 316050 407603 517782 106795 186546 237881 381043 166025 343706
16160 343706 338671 -64567 414741 86693 22998 400183 403976 225454 209924 334329 147308
16148 -72803 92676 92899 117110 280518 273386 145378 119929 193844 329593 114006 399941
16137 399941 253960 686339 437321 165857 312388 362145 118638 200228 352755 133981
16126 45257 445384 228270 247548 98563 302558 -45608 373538 163322 49631 -46279 284765
16114 -48846 298533 171815 298913 -68159 86683 484967 66284 32182 247920 81981 349795
16103 349795 -74066 222695 67831 -118503 258997 -125834 43641 -79102 128611 270857
16093 270857 84008 441999 13421 279205 -117070 73077 294634 167748 140954 477278
16083 477278 324895 219167 63234 113352 161648 255472 233558 186391 12142 175526 102559
16072 102559 409339 234280 230436 152362 252009 72523 207844 28281 -224175 172796 174709
16061 174709 473480 268140 67026 -71117 277987 -62149 284153 75020 178931 66238
16050 -9272 346431 210790 156105 -55838 26114 3217 78686 86660 119325 137121 442615 -152950
16037 114891 91229 28196 81823 209000 87690 234642 167544 159569 368483 -131418 252096
16025 168810 131895 62053 275021 196957 339337 244435 267546 -110305 -23622 41385 -77287
16013 -6644 126614 173714 -98409 119304 -74016 94562 326360 223069 30709 -98628 301859
16001 293786 155338 220148 69900 -2478 278396 312972 144692 318036 -74135 218548 350514
15990 350514 -102842 388596 -67553 597469 525939 217898 323975 1069041 611176 249861
15979 299868 491859 190723 415725 43082 233341 51733 107938 195030 149410 -41328 283950
15967 -62712 74435 -188899 124041 229942 -168118 181209 145149 -37981 -155544 -178726
15957 -178726 251499 -20052 -97967 236552 -75015 93538 33896 46687 195032 258560 118971
15945 72151 -47686 80127 163897 38429 -188355 165765 152242 67877 72876 69180 95043 -212439
15932 33345 309193 -2332 -204268 248949 166342 -202682 4586 121402 -206239 116089 208604
15921 208604 17374 228245 -29172 114334 174330 132571 -119110 -12609 141634 210905 -208041
15909 122851 -405492 278646 -93622 -49077 188050 211590 81584 366980 105059 -120180
15898 33030 -53083 204303 18625 257831 -67269 158252 -145877 -145198 10764 11103 160239
15887 160239 11294 195187 -145176 5000 130903 214663 84386 156592 -50212 -165604 -116987
15876 -116987 305392 17749 184841 137100 -234154 -263936 -43217 -39795 -200437 -245871 -25315
15864 209456 -146323 -1129 -11711 89418 25870 -161034 39254 -18875 -313573 -2172 -314160
15853 -314160 85599 59761 -30930 -14805 186573 -241314 102396 -166101 195031 316026
15843 316026 -30363 200664 -285363 41430 45173 -70899 416813 258184 280698 -43378 84174
15831 -65569 251708 148518 -138138 158092 -73855 -36352 313114 296492 -89875 -400210
15821 -400210 -315653 21230 337444 226030 19707 -41712 76024 113312 -59580 261677 95754
15809 107593 -154051 -94799 67864 -165253 145866 22328 150841 184215 127415 -74257 65775
15797 -37330 97155 69677 -76204 -113274 -127095 -136713 -205709 -106129 179460 16529 -1172 -133865
15785 -133865 35222 -77606 200720 256851 -291487 -34240 174650 -268375 -179071 107665
15774 41879 -10318 -248083 -14560 307242 274703 -76990 1366 -10079 54254 -131117 -10736
15762 -183628 244275 -121644 -124573 -295611 232205 -319817 -62408 177103 292780 -29478
15751 40466 -304978 -169677 -196016 -181575 309053 -3598 7558 45928 -270912 -75468 114476
15739 -78558 127766 226678 192206 -138420 63127 125727 -103560 -17037 -47089 -247076 104051
15727 213833 9745 -71644 206417 -90001 -30929 -58211 -32165 -245746 -142039 -62521 5332
15715 274849 -65771 234517 -70744 -19902 293142 192758 -76369 -280424 -130151 -179520
15705 -179520 -120403 -53209 446503 -80314 125863 146750 105954 -154293 62811 -293023 -72461
15693 -69420 -115352 -290204 309447 -84634 16747 20891 93527 206300 270772 -90877 -173194
15682 -173194 -153266 -52704 -98433 75747 -96330 -11708 -53034 -230355 -254738 -49075 151927
15670 61499 -72047 312177 -148479 -217635 23606 -277435 -135242 51816 22861 -42040 -60452
15659 -60452 -451235 -3476 228626 10892 -249148 -39247 -3938 58344 -30167 -60053 297337
15647 189100 -61483 181037 -39117 142099 41867 -221554 108894 -139211 -34103 192493
15636 93135 -255609 -152895 -89463 118636 -109550 49257 136871 -17587 -12434 -20437 -41335
15625 -41335 -101183 -118626 -235980 136099 123166 -167163 -137427 79733 398559 -18629 -96956
15614 -96956 93281 -143771 -177021 -30648 276239 -324113 -200501 13108 142194 20115 -122861
15602 54332 88902 31566 86012 -354608 -118 -103094 -255905 -71668 175026 -125676 57249
15590 296778 68000 46693 -58907 91507 -235183 -42891 83050 59823 65237 323183 197811
15579 197811 -178667 -15411 29048 -44700 1602 180465 -123172 146618 81319 -131951 261794
15567 270091 -57030 32204 215678 -315517 -81760 28601 77996 256208 85303 222139 -134087
15555 68545 119541 89836 4787 464489 -278414 -15985 47213 208470 222707 -111803 209515
15543 145626 106431 -137021 127376 335396 1489 141583 -214721 -92331 -19295 94802 231239
15532 231239 -304446 123428 -276313 186268 -242406 266989 -98473 9174 224373 65396
15521 141183 45845 103045 211277 23360 211312 -227180 154021 154339 -108057 39861 -79040
15509 249450 87752 235971 -85522 59256 148123 12575 -215324 -141704 -147239 155599 58054
15497 167900 219485 -177632 1687 88697 134312 -18458 154082 150687 -96008 163262 -139655
15485 108522 -23180 10928 -144824 111491 74698 239458 -302864 -52603 51393 -145397
15474 -300186 128669 -43309 54375 -203193 152518 -70368 51501 14830 258526 -227166
15463 213364 38937 71498 40384 28977 -1379 -21209 339879 367199 -82357 10576 201711
15452 201711 -49811 -89462 160885 -35320 145233 57254 -193883 11170 -40297 179557 -175079
15440 66194 -121049 -131152 195997 -156741 18397 97512 -230385 -329502 -123919 405875
15429 101500 88744 -198414 170755 12080 103965 211727 82851 -169199 38999 -144606
15418 94644 -259188 163787 27744 -81628 -250415 -165306 28672 -147301 171412 -185778
15407 55763 72152 -141937 -30126 -119757 19624 -177637 -7768 154199 49366 230183 192579
15396 192579 433750 182390 32852 153436 28880 163352 119090 169509 240205 -919 -20042
15385 -20042 28142 -296474 42245 13209 -155334 -262410 -106404 -15324 118780 180254 80155
15373 47419 12167 2478 51228 25282 -64508 -37836 267228 212625 -292655 -149374 -24572
15361 144150 -277964 -337252 263695 41981 -206967 -47085 3809 183858 192883 36054 -69134
15349 -205639 -229774 -158573 28952 378769 -225687 224399 -58342 25735 18430 253468 -139349
15337 353403 63932 -88329 173780 52804 -12738 -105532 107649 -249713 -40178 -40111 -119848
15326 -119848 56968 138966 -165033 -159380 244740 -317847 65236 41258 -154954 338146 24830
15314 -81207 -56723 231102 63899 149709 -133493 61760 318069 59757 36695 225497 -221202
15302 120287 -37470 36739 115480 -226791 257680 91161 21221 -13728 81837 -18425 -56706
15291 -56706 -49226 -117322 -100227 -175668 2429 89726 137333 177528 218910 237631 -148529 89905
15278 -93167 67550 -153753 121135 55543 21174 -124028 -59578 406422 2370 81918 -113336
15266 129110 111153 128446 -128824 45274 187379 104252 93397 -25929 27410 319690 49101
15254 208846 237314 50352 254624 61617 72475 458386 -108397 271124 199737 537709
15244 537709 84414 473448 542260 256368 1174772 2047377 3844221 2781743 3003719 3281799
15234 3281799 1230589 490442 56902 18238 97141 343629 -138336 245691 152563 -56839
15223 190044 7099 -128055 -32738 1897 199615 156383 136780 278986 304619 -127209 314836
15211 -202874 19613 50424 132539 248130 155978 -219799 284199 397719 -262646 -183578
15201 -183578 181305 248318 32808 -88104 105723 657457 122904 407037 77973 -232360
15190 138288 367452 144853 82404 251917 -50231 155225 200579 31492 8519 189925 150245
15179 150245 128250 119839 332353 199781 117178 -116692 123664 90999 -62774 77555 -28820
15167 62099 310059 295328 -64681 -50822 -1659 7961 -73583 63364 158907 205789 -80684 90594
15154 -128766 -8207 210831 159848 368153 45725 147929 110924 151554 -70465 97798 260667
15143 260667 107458 140638 -47548 -195207 50776 215439 33133 164365 -138685 -91911
15133 -91911 -20687 -51994 91846 187895 -172469 261888 149372 12939 -141151 455717 260369
15122 260369 249414 229476 108037 49611 358629 471994 -209003 -177402 280566 525587
15112 525587 109043 -41831 -122678 142470 275493 91038 -33173 -84146 -285712 12776 47044
15101 47044 177380 22683 268624 178163 375821 81227 -130428 69879 119062 -156994 62726
15089 -543 150717 144211 -170473 290915 309994 187291 -153948 -213898 -28850 208424 411425
15078 411425 160 69923 340699 106458 252514 123620 271795 297889 94124 112150 154953
15067 154953 -15054 57098 126876 152027 -110376 347329 203283 -46870 -56798 160597 -236206
15055 193666 -44701 -325501 483280 -59764 336453 215404 218187 249518 -46419 181936 366655
15044 366655 121613 184678 209339 503561 155242 124731 121401 -94913 -31649 121092 -107497
15032 140294 153338 307477 37617 -108721 -27358 101878 180611 226062 235861 -134325 463502
15020 469482 46925 216956 125578 372988 186124 483028 280833 571176 63887 484588
15010 484588 368991 291512 116096 206277 290729 423030 529716 113978 -360047 -178893
14999 339734 315109 248942 213618 408665 441881 123161 144981 401224 72024 350489 149075
14987 -70304 428525 261710 297800 137970 450486 70893 269097 303121 117255 315618
14977 315618 279792 148532 510687 391293 130292 -138666 474394 289709 121988 171650
14967 171650 120593 440289 219350 314050 188282 320784 380518 516444 169006 24365
14956 320057 431710 -143617 -44929 317109 130610 217283 340789 292488 172048 103035
14946 103035 27105 351767 212183 351350 154814 289672 -162837 361885 153328 115298
14936 115298 486166 227108 424224 72286 535457 270476 175485 207225 209365 326703
14926 326703 463070 488217 499674 344771 545423 456921 -43256 176423 327100 395910
14916 395910 341902 322955 230990 420298 178272 116693 420831 433153 458989 592038 469976
14905 469976 278062 19450 293883 -111323 193665 356510 501162 132913 281589 83757
14894 359501 270343 331015 221155 371371 316801 198505 -29174 256655 492472 114451
14883 370614 282114 -10412 417451 467235 457506 381588 56925 185088 229823 360883 161130
14871 359516 318831 186039 275152 300187 390425 65819 138011 229696 325782 71991 560700
14860 560700 230105 237623 237818 520573 373135 564922 213974 455997 430215 267112 623987
14849 623987 384605 160043 263727 391118 523885 371510 419180 197856 452381 475188
14839 475188 650023 666876 52839 587809 543089 481830 392126 314971 252067 533859 461117
14828 461117 368266 490515 337722 464242 332350 569638 512854 754771 545328 510651
14818 510651 437300 654867 447105 222612 423381 694085 538363 384936 632064 416743
14808 416743 483442 430034 450272 215480 327552 568499 465853 838026 632187 390066
14798 390066 505187 672792 123783 141621 418787 673092 384252 396685 489805 489926 692701
14787 692701 786051 628305 503117 918554 657461 589805 430586 767086 487399 258135
14777 258135 743081 392248 619253 378198 803757 441193 525155 571914 588484 545159
14767 545159 694563 754333 836168 899879 619939 611456 888044 458285 665828 317288
14756 471519 315129 939261 456009 572012 606040 974463 700669 863811 668371 888926
14746 888926 606743 984147 515959 968544 874456 802831 531095 454006 920424 771427
14736 771427 885336 906657 585562 781569 392417 530023 713437 645762 662791 890319
14726 890319 517843 784349 874754 921479 805606 709650 770478 542405 909357 579108
14716 579108 748651 913542 1038383 560847 625673 1033409 648086 754775 897668 1126423
14706 1126423 829984 835347 922723 759793 621284 258068 916302 559239 919316 657834
14696 657834 739101 651835 740311 755472 770841 1022563 1060265 942440 1190463 1608772 1257545
14685 1257545 962949 989654 786566 863446 742180 778104 1069721 969873 958080 876049
14675 876049 685401 937201 883080 804894 1019634 900229 1152706 984987 960716 1143289
14665 1143289 1023045 925098 1075083 924592 892416 1063945 1093572 1416751 928512 1072995
14655 1072995 1250175 867835 678222 977094 1239244 1004062 1159368 1178904 920623 1333062
14645 1333062 1438434 1721940 1587150 2024256 1797796 1222672 1318427 1283466 1419289 950046
14635 950046 1292892 1457979 1166907 1122486 951688 1047245 896488 1058042 1145256 1076947
14625 1076947 1247278 1471076 2022722 1771037 1631315 1403981 1241352 1469607 1127977
14616 1127977 1340940 1578833 1417770 1548000 1250335 1556585 1395236 1300499 1469358 1305330
14606 1305330 1563602 1216478 1211686 1578226 1662173 1331695 1456841 1433093 1279402 1649136
14596 1649136 1745561 1779740 1513146 1244480 1635769 1529380 1609766 1973037 1453020 1986423
14586 1986423 1355726 1565450 1770564 1816780 1646957 1752398 1728565 1707695 2091514 1708491
14576 1708491 1790534 1830795 1834395 2079478 2269581 2795282 2704704 2406710 2045633 2025458
14566 2025458 2157491 2173491 2083861 2668809 2272377 2574018 1959490 2614736 2178157 2620110
14556 2620110 2739856 3085634 3054082 3520344 3915156 4309393 4708873 7032541 10714729
14547 10714729 17656728 37132892 43765261 17367753 8265935 4385013 3055870 2377322
14539 2377322 1920012 1989233 2075132 2200635 3052917 5243072 9142132 4306825 2564471
14530 2564471 2236313 1952840 2380394 2458089 2226562 2231481 2260690 1923718 2119928 2097646
14520 2097646 2279304 2210344 2373469 2196348 2106196 2600000 2354855 2215649 2477234 2300903
14510 2300903 2392554 2383016 2611163 2486381 2860404 2300326 2642838 2965965 3061214 2939896
14500 2939896 3226556 2810566 2533098 3050092 2815514 2833930 2966654 2691428 3019597 3324377
14490 3324377 2929045 3085112 3128795 2998348 3270230 3244597 3187225 3401043 3680639 3227835
14480 3227835 3566420 3351680 3292580 3350963 3280223 3560361 3524118 3479977 3991712 3556303
14470 3556303 3691004 3788077 3693791 3897704 3918573 4065179 3738302 4096401 4035216 4443497
14460 4443497 4573615 4381885 4279935 4285262 4729909 4320726 4363973 4336805 4595726 4602831
14450 4602831 4785306 5041724 4807303 5020919 4855851 4912431 4917101 5061560 5186158 5175364
14440 5175364 5355662 5294946 5514383 5902055 5285030 5671565 5497896 5802932 5763738 6260360
14430 6260360 5789226 5972853 6192743 6250824 6263663 6579424 6308629 6798977 6743285 6812469
14420 6812469 6779733 7119871 7352499 7160695 7517174 7448212 7405868 7794439 7558967 7806724
14410 7806724 7839905 8020038 8125213 8058442 8395504 8087403 8994320 8606107 8966192 9477075
14400 9477075 9205619 9339484 9695733 9866570 9692375 10119277 10171584 10400533 10367737 10524198
14390 10524198 10763429 10760240 11333412 11505610 11598119 11913486 12555740 12268037 12325796 12728750
14380 12728750 13162813 12986594 13670244 13603575 14082339 14247766 14448563 14881767 15114664
14371 15114664 15601109 15645324 16072028 16491334 16873853 16906629 17390891 17747265 17977278 18592637
14361 18592637 19078135 19461761 19832841 20247464 20477583 21077463 21579813 21860561 22690435
14352 22690435 23076679 23900669 24052029 24736695 25784973 26250555 26874925 27758186 28468820
14343 28468820 28961494 29640350 30464923 31457881 32095119 33296713 34118350 34867929 36163004
14334 36163004 37145328 38567938 39427553 40665359 41743989 43363053 44683115 46126602
14326 46126602 47856377 49254374 51336935 52637704 54499373 56459728 58401695 60712406
14318 60712406 62773774 65061413 67735032 70326516 73082455 76082727 78719941 82138012
14310 82138012 85221980 89232603 93151002 96983270 101061831 105864563 110711259 115845980
14302 115845980 121417053 127085230 132910302 139669224 146521389 154107989 161869710 169996280
14294 169996280 178791150 188252432 198057088 208782648 219698879 231157768 243225912
14287 243225912 255998853 269201570 283052308 297190153 311545408 326235407 340905648
14280 340905648 355539937 370549897 384828338 398705812 411478727 422904263 431846092
14273 431846092 436550218 437174561 437984284 439819368 441024140 432527928 427809390 423054843
14265 423054843 415846014 406238213 394583548 381173866 366324961 350781466 334817445
14258 334817445 319325725 303448708 288498681 273793573 259391722 246165943 233121620
14251 233121620 221029843 209298221 198386422 188222644 178220950 168849601 160222553
14244 160222553 155110541 148918629 141061621 134063620 127160620 121343759 115809154 110965094
14236 110965094 105840464 100914412 96543905 92446378 88623170 85260300 81810303 78251808
14228 78251808 75388467 72151768 69576796 66902964 64362374 62079063 59783688 58142364
14220 58142364 55658109 53899927 52462435 50194778 48684002 46936091 45792607 44406145
14212 44406145 42930325 41743361 40085847 39101902 38237098 37527368 36556188 35194265 34267572
14203 34267572 33219892 32153196 31463546 30878977 29781135 28980988 28357843 27489121 27019473
14194 27019473 26225011 25874380 25136315 24443449 24089858 23388858 22559108 22098059 21185020
14185 21185020 20854973 20402360 19991033 19980964 18892469 19227330 18197885 18163407 17924280
14176 17924280 17486789 16976735 16535024 16168389 16083068 15536681 15580162 15208405 14731999 15064164
14166 15064164 14185656 14069565 13724540 13686363 13231482 13136350 12707361 12645539 12661364 12215075
14156 12215075 11906341 11571204 11503795 11562813 11307234 10949173 10686565 10531359 10672397 10280386
14146 10280386 10233132 10085508 9935955 9777386 9693282 9450884 9465752 9462250 9339346 8976808
14136 8976808 8897225 8999246 8564499 8620997 8091036 8022288 8178291 7900045 7718570 7606548
14126 7606548 7493333 7259737 7370856 7185843 7004819 7039010 6902243 6616240 7003313 6809914
14116 6809914 6320841 6696295 6489059 6022009 6203221 6218239 6118068 6333021 6070823 6073919
14106 6073919 5973040 5826465 5588164 5425987 5563823 5617495 5443285 5367516 5462967 5430427
14096 5430427 5602990 4763658 5184328 4917936 4815455 4861776 4692922 4468647 4359309 4932756
14086 4932756 4466437 4371392 4297594 4351955 4610761 4168865 4583339 4271122 4161128 4201638
14076 4201638 4565941 4159107 3974561 4068269 4048974 3789424 3801411 3791275 3608062 3563219
14066 3563219 3583677 3820819 3295866 3677013 3516829 3678683 3684886 3842443 3300148 3468806
14056 3468806 3678485 3331890 3061453 3193518 3379262 3077524 3073647 3135623 3128214 2907911
14046 2907911 2998639 2959764 2993648 2748112 3188465 2971666 2748760 2505265 2819911 2814180
14036 2814180 2927052 2522966 2311056 2706229 2669481 2532921 2970491 2568625 2715699 2643292
14026 2643292 2711958 2563712 2354407 2432568 2428641 2521898 2503187 2516149 2364033 2462820 2453612
14015 2453612 2216023 2151373 2321069 2078094 2421898 2063489 1960284 1957229 2188261 2095511
14005 2095511 2048132 1729893 1997193 2067483 2023052 2271997 1923533 1915956 2025839 2110276
13995 2110276 1846404 1970215 1840796 1880325 1978535 2271198 2601068 4829242 9263893
13986 9263893 21432376 50279625 27594008 14935269 8920588 5642449 4534672 3850509
13978 3850509 3128421 2594086 2750963 2824696 2416643 2628864 2405564 2283066 2248962 1916744
13968 1916744 2033151 2161990 2011378 1848347 1997780 1837900 2103476 2031301 1992917 1986863
13958 1986863 2121954 1759534 1690373 1749447 1875314 1926653 1722200 1651448 1629413 1638505 1613464
13947 1613464 1633360 1887945 1661436 1630384 1436527 1652838 1867334 1752993 1368324 1371025
13937 1371025 1277795 1656898 1387284 1630478 1384542 1694802 1680406 1397745 1296476 1342962
13927 1342962 1323307 1220105 1748323 1157130 1337010 1217345 1284446 1396657 1351527 1062679
13917 1062679 1446522 1361816 1397938 1778301 1485614 1216703 1672410 1125257 1566804 1156547
13907 1156547 1545966 1313515 1440597 1127304 1256020 1423171 1177589 1089721 1347291 1045509
13897 1045509 902180 958504 903936 1198631 1295674 1340624 992897 1307855 1112413 1557958
13887 1557958 770764 978093 1082484 915195 1177502 1317736 1174866 1087130 1051502 908868
13877 908868 1361942 1178176 1415749 1111178 1008522 904025 1047523 1197190 751656 1302515
13867 1302515 1069007 911094 1046565 830207 1086060 984024 1147548 743408 1295846
13858 1295846 960860 1022965 1104051 1060000 849718 890321 918027 1044986 1013875 967224 886160
13847 886160 947606 897581 680455 624860 844439 867759 1141830 712765 991777 729942
13837 729942 889081 543192 1052746 947659 611828 935553 710009 544038 943276 855126
13827 855126 609434 677098 773370 605451 806542 640035 822406 815752 756897 665441 912212
13816 912212 736412 734688 606818 537797 670920 584798 686959 752178 673191 823706 429695
13805 429695 925726 664611 362959 835122 791558 762485 406088 701463 668627 486731
13795 486731 511367 786291 991261 696360 406817 842305 608318 1204911 713439 775600
13785 775600 820868 847878 610390 692486 403163 755622 671825 334765 452709 636964
13775 636964 666904 742068 457649 177818 511166 412308 784025 842223 538357 684233
13765 684233 467078 490852 775220 750678 808321 579238 742994 907438 750441 466833
13755 466833 741964 369768 360172 777940 456937 797781 1027301 725587 690514 757609
13745 757609 484683 736697 258888 720201 547719 585223 877535 824083 442023 341638
13735 341638 594386 464995 405419 583604 486511 325842 598040 617657 363254 482951
13725 482951 364259 686170 250705 261147 260528 165004 512298 135163 632672 222358
13714 452451 482319 350622 223138 287981 783314 370638 514371 609118 315375 713419
13704 713419 610673 586906 471065 244002 196920 362237 411570 388784 260059 580341
13694 580341 507328 446784 443058 436320 315734 316519 213164 607564 500384 239294 366796
13683 366796 252998 439547 752667 571533 218204 231771 292147 361096 464660 366082
13673 366082 586915 501562 314415 286768 301116 393236 405510 506365 641072 427658
13663 427658 599753 181024 413541 682378 586833 568057 493781 651943 559104 464598
13653 464598 428619 110688 452699 430167 432488 529752 409386 304759 400028 620991 552681
13642 552681 365464 450273 298391 360425 349785 377916 540467 329920 530840 376806
13632 376806 387946 229377 122924 218227 401439 414572 231301 331500 518823 227595
13621 556669 229511 298829 300400 361337 435771 227173 292435 77915 334201 487899 128073
13609 668866 336055 431024 117978 263364 133013 331937 530027 329479 509878 463405
13599 463405 221260 191628 371181 544664 168879 288766 287451 39704 444901 438252 227855
13588 227855 243824 229112 194084 389927 662957 349250 341962 219655 110541 201962 112133
13577 112133 451975 89022 377329 166263 528930 277795 27715 87446 325338 212258
13567 212258 366392 431359 240377 144832 116261 378340 -105974 254529 277117 325448
13557 325448 101259 399710 414609 389965 519524 218095 227756 199449 451561 151653
13546 137181 146764 -263225 147689 26062 63808 286849 492226 276631 315037 410367 301722
13535 301722 343653 319142 378633 185934 112857 281301 296859 274949 206706 341784 337109
13524 337109 127333 255641 343610 458526 167892 184711 -33000 529076 13753 203225
13514 203225 264333 129290 5588 271003 173994 356442 269988 598158 100981 229414
13504 229414 325289 456576 303169 191088 69728 108552 178345 175565 479459 482172 -36054
13492 263441 85966 201365 234314 438198 58548 171581 93693 -11683 188229 366792
13482 366792 38475 179902 327219 382366 35611 199969 245962 206362 221395 325473 137361
13470 416948 338579 150194 577057 93564 -56696 -13533 76782 306608 111229 98452 226157
13459 226157 460879 194295 491172 171670 311435 359880 -67691 284697 251429 89442
13448 280130 115599 265869 78485 361873 249629 49916 -176272 36687 289411 -108008
13437 53163 -122722 264214 -15724 -187811 362766 206661 125503 133073 176894 -86472 145519
13425 244795 446872 378537 301119 248659 472101 88187 130648 -146699 176699 115616 19144
13413 331897 -140769 348819 -310890 17852 -56776 265144 323950 -33270 35069 -52121 131856
13401 5755 169844 -239281 374160 146512 112756 70716 126050 37693 272879 302668 -131110
13389 287740 -166449 241072 39420 26263 262362 315374 198891 68990 352847 303438
13379 303438 297356 127972 -70458 156768 48652 138575 199441 425732 -11918 267178 -57889
13367 270008 197363 206588 100539 121543 258215 322605 38789 -169087 477131 258859 203222
13356 203222 143754 124577 195408 408358 207750 438252 275517 324741 237235 429527
13346 429527 475476 236575 324085 383338 -46202 92322 72813 236437 50908 111361 -80367
13334 527023 172365 222384 285402 297196 215565 362296 174809 68209 281585 204096 122728
13323 122728 413748 -91098 161856 146941 -67887 103043 82901 401273 15458 221735
13313 221735 153664 305931 205537 227469 5215 109238 127430 311910 22819 261242 247581
13302 247581 336211 -134246 -198766 58652 348316 464143 255514 285877 85823 88995 79496
13291 79496 205750 222565 450191 273437 -27024 414157 96795 -132112 9944 67689 139655
13280 139655 98675 290942 23471 885 197386 214507 150595 -122256 134447 -103728 99971
13268 209389 40707 497145 136526 -2662 -27977 -1416 -211496 19337 -334844 92410 325992
13257 325992 -20253 157821 38322 32231 64865 -115918 -157512 134812 139218 37650 104866
13246 104866 102350 70758 -183216 99349 277157 -62076 -16038 -173827 -145205 138601 201145
13235 201145 -302175 323083 96928 -172640 39681 107091 -148974 -54239 222501 17302
13224 18134 97792 326409 -82160 133947 24646 171539 -6315 221290 -126580 179602 324258
13213 324258 108493 243183 505425 332223 -39078 64458 52639 -284901 155222 316866
13203 316866 216327 -83624 584450 -57642 -71667 134864 -4390 78817 362977 168614 39539
13191 128620 223970 255099 -65095 201380 56169 253279 236851 188666 474381 -190852 -186006
13180 -186006 -62631 10805 273286 174904 273414 69793 220249 438124 212432 -218360
13169 26006 37336 -305561 199230 126986 297224 63097 -263515 186230 123480 41093 -280562
13157 -90014 -206977 334841 149676 83804 266978 315036 29469 162901 149037 -15939 232252
13145 189797 171851 375995 -132214 304510 434027 -120061 338115 235987 -9584 27620
13134 46356 -217906 193758 37448 144375 -2487 -264058 35625 37636 251562 -167183 109981
13122 -80088 3704 34607 94285 -150735 12823 235218 23751 -252127 -158981 331448 42578
13110 -37692 58324 393190 440637 -5681 -130852 361225 36494 52672 216621 260876 19883
13098 218911 345783 94253 -130494 -56688 108523 -80076 98602 -155122 122675 85234
13088 85234 -85318 289419 386001 96842 -161696 -172671 -119634 209469 173520 313299 150715
13076 228221 100439 141720 -2190 245104 89584 173258 93487 135828 138354 -6272 204240
13064 462416 -239089 55120 57119 253716 -155247 -3577 -22705 -899 -87806 183227 301620
13053 301620 22976 -162397 157043 -54636 144622 -37983 -159349 37990 318889 -227731
13042 -197201 106713 312218 137486 217742 209565 -38138 223593 147273 108759 556191 27530
13030 46930 258232 62390 22857 46387 -129391 -3244 56320 36491 78168 -157194 57790
13018 166170 104768 -165173 139365 -15581 188191 -178812 -155866 290130 175299 -102602
13007 -43134 175295 384474 -93379 -20792 27351 168147 4010 346970 -26475 -39676 -94165
12996 -94165 88923 75450 -281729 -46649 217801 257025 -290860 -32983 -182247 -48465 304142
12984 -94309 -176991 171217 -13174 31409 -227752 383976 -7958 10540 39259 -49274 271962
12972 311741 84760 153469 140721 75796 -227757 8688 246236 -62803 -168939 211727 11825
12960 19078 72691 -167235 263582 -70413 432536 -260209 338849 -66690 -34728 129862
12949 -26541 -40780 67358 -10295 -183138 37871 90382 -413638 29422 113621 280817 -6099
12937 -50950 49684 95738 92319 -55342 -239181 76725 -262200 85225 -148139 115967 -75769
12925 460784 27560 -238788 273623 145571 371048 -108155 -141158 -140546 26425 -98490 -271888
12914 -271888 -96727 18104 -116619 -1064 -182398 -147084 -191362 -63457 -115368 -214458 138128
12902 65804 -231151 -255583 84377 224400 185921 242201 29780 191217 111280 -45780 16436
12890 244984 -13685 170390 -230696 -126420 118058 66111 67018 -191057 69284 -212446 152941
12878 -88766 88242 41069 12781 -220647 219644 -76300 84097 -282558 127705 -114141 -294234
12867 -294234 -22261 -178086 58411 -132952 -103018 -20604 -46512 217506 121354 -131758 246031
12855 -153835 13580 -85918 26798 148108 -111715 144389 -12901 -319498 -231777 185808
12844 505885 -334 -256214 247308 -104300 -119576 -357096 -29665 -260756 231652 -158149
12833 102953 -111430 -214625 -124038 14129 -115456 134881 119320 197117 9668 -116137 76413
12821 127532 -348270 -250265 -151828 134728 17916 81566 -226798 -5202 -68965 68143 -383077
12809 -141862 -45262 -58556 -79555 142057 199423 -253277 69182 -45600 69489 -76922 -87354
12798 -87354 135474 130294 59304 296531 214176 -170691 11610 294538 246196 -310807 -48040
12786 -145486 -377279 137968 84332 -233398 -59405 -13473 -44223 -218399 357588 78869
12775 69023 54170 122486 197820 167775 -105875 88994 311535 -59905 184164 196305 -128998
12763 -45555 -51810 -169089 106027 31421 243482 358194 127790 68848 -322343 163539
12752 -121792 69104 67229 3673 107815 -315648 183662 195674 -245137 93320 335539 77504
12740 142266 -73109 -82607 21949 172877 61023 154243 -130395 297749 187851 -107966 195293
12728 11144 123169 157794 197859 5160 52772 77219 -93201 -100541 2671 31291 98149 123280
12716 123280 -35683 -5798 215869 -139832 -31846 182809 -91673 -54993 146779 84754 391862
12705 391862 5141 189262 -215417 156687 -264967 321327 245369 -54198 24245 -4064 73643
12693 -54281 244833 184674 133190 165930 -194090 -179673 49223 20595 45977 -32099 30854
12681 -136839 54955 294145 -83779 180926 134609 -123136 65987 45593 74810 -57202 311064
12669 -242588 -5618 125915 -76752 139777 187638 159209 -172928 -453849 285439 -69261 90023
12657 -88325 290692 88051 -19633 18783 -193524 -213531 237033 -226052 -167462 256987 -5460
12645 92596 -191886 -234347 40884 -131675 -99001 190377 171191 -18488 -312877 60520 181327
12634 181327 -137254 -194204 -222 31647 170786 246451 79585 223119 -38394 -113649 48155
12622 -216634 4339 -239371 311358 221984 124950 -110300 -253857 162946 183064 -182976
12611 37411 -31804 7272 -121847 -105540 180803 -235982 154891 -209755 -14140 -88281 303134
12599 -102363 122700 77780 -234254 232579 -44822 -143739 63222 -79383 107554 -59648 -147324
12588 -147324 83188 -187329 68985 -128936 94959 7477 -202510 48782 -176497 -158526 165600
12576 237524 -135297 -82159 14792 52797 158019 -136624 -84936 -214127 -287606 -174204
12566 -174204 -259175 241433 26719 257232 48368 -83019 219412 -80727 12269 331059 179121
12555 179121 467028 415824 388764 -80300 -85858 91281 128656 -208489 -431464 41922 -39549
12543 -65617 153167 -271819 16664 -32250 -18528 335535 -133998 -64863 -53106 -134707 34842
12531 -151269 -215832 94875 298392 313981 144188 285646 437175 183205 103350 86770
12521 86770 -3419 41828 -346532 276535 -153526 -104725 -207170 221706 -189118 227681
12510 159389 -74983 99595 -127571 149296 -91622 -68764 -139869 -284977 -71116 -169520 208108
12498 44606 212132 238772 140580 211521 517172 285090 -422695 234092 61952 -71061 -86580
12487 -86580 111197 57317 -2639 111817 -224622 98700 -210641 26134 -205716 -14427 206571
12475 -29601 -65850 72764 175460 -200441 -103604 -58536 10633 -44228 -39844 -134451 127583
12463 36648 -154737 123590 65327 33264 63154 240923 -62026 -76834 23387 144319 -63028
12451 167203 280179 -74811 -250710 119851 24044 277252 -67800 14323 101946 84711 -124155
12439 -137088 -64983 410870 -69462 -56896 420186 -169516 -47569 -151391 -137892 58226 102325
12428 102325 -126871 -20881 -134893 290106 -275409 -239452 19211 72941 43251 -37596 -262576
12417 -262576 88371 105076 -69769 -89097 -81220 -120898 -309280 234249 -366139 -26985 -13896
12406 -13896 71839 93375 140104 -141209 -34196 -306254 -125992 24092 73221 53803 424873
12395 424873 35092 230399 -24842 67786 -268571 -228883 293176 39935 150507 195242 -80876
12383 344021 39036 -58341 40063 -552 153019 198597 -20091 -85473 -42751 131128 140540 24289
12370 -263984 -110312 40218 -47859 47661 -196933 -489499 207814 -244803 -210065 110344
12359 268982 141275 -18771 99056 306240 -61599 34156 147535 -72619 266255 -69325 199546
12347 -116454 -51429 92359 142917 46996 13579 -188726 -74702 24121 -166935 38797 -109230
12335 240421 486830 -58215 -300311 388760 110507 59230 613304 -67148 368490 374034
12325 374034 96270 -44265 220739 430719 68866 79534 140719 320601 129133 90506 236988
12314 236988 118305 69166 -26866 172212 90639 21173 36169 -134677 277337 -207052
12303 -130763 311460 163604 92768 -76415 -50088 -71848 -15251 -207874 -36901 125707 181610
12292 181610 296404 -118951 -212993 -127472 -358750 37264 -172468 380429 -179269 -130432
12282 -130432 -126740 216472 106937 -207660 57922 115425 283821 -18749 105008 -401755
12271 93125 325445 97983 289909 38628 -45762 -168670 -4394 94676 -86356 -161542 -447885
12260 -447885 114503 -63428 71757 117981 135843 276250 126899 95321 15292 -21664 -204397
12249 -204397 82250 196818 391200 -276872 -46659 -144664 41005 14504 220436 127304 -73020
12237 272645 143023 -92675 -71342 145259 -243446 -70117 -150837 110194 -8323 21789 292421
12226 292421 359379 -25174 -46096 -93883 158216 137177 212020 240222 -29235 -113387 284788
12214 55392 123661 -18556 136780 312552 190926 297756 552780 154572 137727 171131
12204 171131 76271 24831 160215 10342 -88714 -52815 29117 560858 175522 34393 303670
12193 303670 82470 183740 249003 322633 20498 200390 385392 141711 263031 -117636
12182 177816 164241 224164 125297 61979 238638 255943 797558 70854 50852 141375 500210
12171 500210 -31163 62712 -198258 196595 -18996 146942 -131888 332429 -46813 -47346 -90120
12160 -90120 181040 -27140 281033 -163521 69150 215942 57195 337119 207175 323453
12150 323453 142041 2104 131070 -54863 49494 94198 -119145 32395 -144529 131690 60403
12138 -109388 298501 32166 -169171 395479 -75951 -208235 391083 70486 -40921 288270
12127 74480 387131 -1912 55414 333049 277499 70824 334542 375195 6317 97778 157151
12116 157151 -17964 452137 225642 118330 -80685 359658 27331 -27184 156245 282655
12106 282655 219045 -139387 4597 -121778 50571 31193 -288245 -302705 -95325 -15881 -196315
12095 -196315 84486 114913 63290 95 11349 157801 177451 -151350 390627 110309 178507
12084 178507 -264417 89306 248321 38026 -1338 -98574 358520 -28714 -83250 -279199 188325
12072 -43101 -164178 25992 191502 -66539 -180717 -113657 331740 54196 103229 -1050 139446
12060 69902 -51621 -60532 -6004 -107259 -83269 -180298 -72504 57977 -122111 -87295 -58441 181917
12047 3410 177707 -509573 -166373 85214 -58293 39312 21961 -179123 -120598 181154 -18631
12035 -155935 -217759 25462 -168010 -68011 194494 -44601 -226587 37539 115430 -157797 -524127
12024 -524127 -211910 -22852 39065 247823 -91550 110124 64212 -51408 -322123 -68689 -52722
12013 -52722 138734 -70873 21802 -73266 -207623 -192020 -186303 29359 -40666 69131 -92474
12001 -117740 -400226 -212606 -41015 -53642 -183537 -200429 -70864 -222966 -93889 -61722 -204857
11990 -204857 -64236 -113429 -101232 -80785 -15038 188382 -297749 -33760 413487 22539 -63113
11978 -233656 138459 -92773 6941 81787 -50139 87826 70666 64849 432972 71206 -237947
11966 258596 34280 34642 -32406 38499 -357349 133091 12094 -180327 118365 -170689 118443
11954 -3311 -134006 -39068 86991 81346 -225050 -50243 109060 120281 50866 -162356 147468
11942 -58205 -189881 29718 -111048 555 -151987 -95335 -25405 168698 443951 139796 -44027
11930 -81969 -209168 -182108 -14699 -345562 153193 20076 -100595 -134889 -55295 -25978 60474
11918 30446 -29091 273131 -84382 -123474 -192883 84519 228379 -45720 150585 4538 89809
11907 89809 -60785 25808 5145 -206251 13788 -61240 -73261 -162834 -195450 15289 137146
11896 137146 -153167 63469 116026 -213596 -85095 -85679 170778 117540 -59655 143726 -249042
11884 -312441 157537 20166 19481 42727 -298037 -109278 25921 -91402 -324335 36565 78849
11873 78849 164136 -166395 68455 94423 158663 -109066 21581 17210 -66918 -69756 11144 -313512
11860 -125122 -85869 -157113 -149107 -171235 -310075 -242172 129202 -4241 -21765 29468 -193510
11848 169668 208630 -173881 -140384 2482 -217336 -157658 118344 -140472 7265 -108724 79865
11836 -135851 -208388 62443 22659 -248803 136393 314902 158563 -28531 -286899 -375656
11826 -375656 18669 -319991 -185398 -18954 92065 -230724 -104647 189546 -33036 -232436
11816 -232436 104404 149815 2325 -478142 33701 179236 119428 -241828 54153 114767 -289486
11804 -76086 -4832 62831 -294115 -77462 -270312 -61208 -134152 -212599 -267894 -249182 93240
11792 -263266 148413 -263662 84752 -11839 -321588 -187972 58705 235500 -37995 -295332
11782 -295332 45401 113771 -211429 4281 330611 142870 384891 152938 72430 -43245 110617
11770 -42449 44505 159003 -39778 -82036 -310215 -272336 -24375 67781 -233309 -64215 -138425
11759 -138425 192074 12664 -156414 -216932 -96520 100507 108937 -26330 56272 -139012 -318019
11748 -318019 229363 -332158 -142984 -121187 -296664 178061 -201587 -38138 -138453 -168059
11738 -168059 -103103 -191987 -52231 -14230 -59649 19629 -108387 -290523 84970 -323992 -68306
11726 -218484 55067 -188630 152069 -263849 -184920 -129440 -226295 -86110 -276700 42784 -239650
11714 -74520 -81844 342067 65329 -48853 68063 157225 -213461 -51161 26637 -81335 67993
11702 -203392 -13343 -141133 -21302 -55252 -311047 -254604 -31181 -64322 -210251 13519 33968
11691 33968 -194727 91129 -19822 -106107 186843 -283355 -106540 -82175 -103020 9910 -219610
11679 -32941 10284 -196993 207591 -282127 -100948 -43005 -205337 -110012 67254 44320 -106557
11667 -196450 -6350 104780 -191905 -181059 -291685 116447 120276 -134926 73032 29731 -237032
11655 -98494 -166984 -91977 92659 -74785 363889 -228465 -4981 -10261 -4128 -154326 67923 -235467
11642 81966 -326823 -211303 -159428 -58182 -89686 -168644 -174733 -180557 20564 -171589 -32082
11630 141751 -99250 -176473 -192994 -121397 95336 12098 97234 28042 322743 208470 -288213
11618 235659 -377922 102632 23229 -223273 276728 -56448 206865 -280965 -58911 12319
11607 -50041 58813 -144926 -318611 -17639 306482 -114758 245583 -81970 -99167 279219
11596 -74504 -48997 32159 -160260 -34683 -141712 219266 -192504 -359982 282942 -17080
11585 -59471 -203179 -23003 402420 -181415 195995 -148303 -54050 -174735 -191031 321556
11574 267952 61582 -81362 -48089 -120613 -128096 -1040 143487 261319 -206984 -45879 161048
11562 293872 14643 -228544 117644 -40924 -54706 88712 -157657 -119047 -130362 164564 44406
11550 -103329 146845 -105499 314978 -94928 -262245 -31256 -178446 19546 -5212 91368 -20921
11538 4296 180952 179349 -21221 -130938 10299 226323 -8616 -147113 84710 -119054 42494
11526 13905 369850 23150 73362 117302 144939 308335 192128 212449 -9140 -69412 -13464
11514 -189782 -174110 126372 84774 -81706 106583 -64313 -117204 -220416 -142130 331425 8721
11502 29350 115576 -105412 76664 -54467 73550 81462 -23073 -113918 -41375 92478 -171991
11490 -240971 -134733 109889 231351 49282 -22798 148760 213668 -69492 -8397 72191 -278745
11478 251424 -331032 361107 -77955 -461862 -35087 40556 27276 -23546 135151 250187
11468 250187 -136482 178635 150085 108429 42863 -119655 58119 233161 196981 -121909
11457 342445 169854 -40917 -188940 66850 -113423 -80380 -223451 -233621 309712 -117542
11446 80815 310171 -88863 -99813 -239475 -148575 -225327 128917 -135516 87947 182645 -53237
11434 376686 61498 262778 -29137 75012 141617 56171 -64228 -12603 -171287 -22971 360390
11422 171787 259249 -57053 152903 -16024 -123199 31501 58010 -237282 163504 231740 -42137
11410 147752 -183302 181393 332830 -41238 -265736 -115562 163078 278 -53526 47301 -310529
11398 202763 220621 -127612 -101153 -154589 74652 164818 -193395 144201 -65669 -264607 -262139
11387 -262139 10809 -48263 -88172 260305 110603 38731 61519 152687 126509 -364178 129691
11375 478794 -124485 -1137 64033 -39002 -14613 206403 57283 -287436 134869 31052 89067
11364 89067 111910 -340083 -109343 64023 49121 8051 209733 -250033 -36690 -57112 58162
11352 -82705 333703 -26743 -149773 -213421 -187030 -203786 -283909 -128806 183378 -176868 -77776
11340 3709 120360 -124588 -39047 -272490 -288878 -38755 -311595 -108122 -396883 275225
11329 -28530 76538 31432 -99395 201803 208167 19923 -45490 -227140 45358 -216557 99613
11317 -31881 -338552 -267802 -38819 -54432 28730 -214476 -44188 12095 155339 -97751 109702
11305 84514 -127451 -42521 -121619 118408 -56447 -26989 25146 22059 -83850 156673 -117951
11293 62142 -55620 -83359 110860 -280783 -418250 125433 -151220 97885 -52596 -218768
11283 -218768 201530 -241379 -33756 170207 -559882 -264476 -222527 -198873 -74562 57256
11272 -116014 -250534 -30825 -442123 -425244 -127053 262665 -191998 45957 -26443 -18548 -163239
11261 -163239 22909 87477 -129478 -354085 3757 337648 -70601 79588 -40957 -1363 98714
11249 75089 -75753 -44339 -310518 -50070 -227972 -74787 41576 -331993 -99939 328145 -91917
11237 -158871 -4326 109993 165990 232359 -274645 -90197 65185 -188805 -3538 -94025 -67569
11226 -67569 -9705 89890 -33599 -194854 -45596 -98375 84370 11013 -76080 -223069 206434
11214 -383444 15867 -76263 49743 -24793 36487 -191434 -326929 140091 34761 -230051 -331615
11203 -331615 6088 -229936 182652 -24737 56098 -224637 174664 75526 139726 -41255 14741
11191 -399476 -17840 -87616 205565 123457 83933 -75476 -53144 -291891 -124536 -169841 -440913
11180 -440913 -91822 -222280 -89764 -170316 25484 -280010 -332930 -213020 -86388 46961 -330127
11168 -130816 136445 74021 -55594 151903 -192288 -133261 -137715 -132946 109688 63347 -70853
11156 -97130 -9073 -183839 62689 113589 128814 9157 155312 386872 101630 112462 -120709
11144 52827 -23864 26182 83407 -353426 -68037 -79009 106508 -163590 278048 134526 -100876
11132 34324 -3955 -8744 40872 210336 75537 -71096 395971 93231 61115 -17938 -127436
11121 -127436 104409 -372423 291640 170719 137643 -64001 -129708 79806 125684 20724 139430
11110 139430 -71669 -162875 21489 253162 -44186 193331 137302 3839 139206 18901 -219596
11098 277471 -87126 87741 222736 52793 -229882 233987 189514 15521 -18017 -283216 431316
11086 212585 290118 162949 198559 -26816 282126 212034 68978 170892 189306 99100 8888
11074 292103 517925 73062 -45852 46976 -27585 215595 50428 183174 421676 34537 27853
11063 27853 50732 537662 164501 102372 330036 208613 168849 606165 390338 132956
11052 72162 318287 529144 377473 193030 676999 204012 439841 505623 643136 759167
11042 759167 781641 676935 683229 644228 577270 722995 765725 643081 583020 670772 686327
11031 686327 590150 503694 693279 666423 800022 448723 398607 601508 704046 651834
11021 651834 409894 496221 431175 495485 577809 697264 462558 662815 577660 447866
11011 447866 371500 486087 208815 499433 448290 726484 501827 281454 708742 493378
11001 493378 515240 343878 747475 470231 395654 647205 86398 435750 588019 573405
10991 573405 574811 302779 545762 435960 332412 469105 424722 641612 309270 448945
10981 448945 245921 500030 453607 629747 478134 746914 678054 776784 805003 727860
10971 727860 720078 1077160 746406 1043682 964769 1213064 1217642 1299201 1884520 1954626 2091279
10960 2091279 2423249 2238306 2282974 2011321 1540919 1677773 1047979 1209184 1024823 1040237
10950 1040237 628008 637378 640251 849049 919030 668440 824494 461069 465067 289835 125605
10938 339898 316921 103122 133865 -167516 -43250 -24752 43170 6462 22182 -201263 12299
10926 170870 194949 -80211 129683 298556 -58122 133470 52217 199710 26599 -4148 -162033
10915 -162033 -88254 -26131 -235157 -143319 141008 106247 -169027 115821 294132 43945
10904 93035 20427 4606 -88900 -274009 111120 -222924 190305 226045 -79262 -123946 -320290
10893 -320290 -110422 58595 -95779 -116717 77164 152362 -108558 -196900 -138707 135062 60785
10881 -101177 -293211 -137742 179590 -261489 -287094 -202726 118509 -137870 -11610 376687
10870 117855 30299 -204777 6931 7710 19767 11507 102099 178808 -69337 -153679 74407 66839
10858 66839 -196844 299363 -60488 -169703 -37925 -141177 -230754 -232136 28071 -17344 93161
10846 -199280 -95678 12739 110872 -211234 -147719 289299 -297748 -242628 -222473 60546 -281660
10834 -195853 -103823 -318039 -142087 -162884 -175649 -280321 -157823 45068 -89893 148111
10823 107065 -690 196135 293653 211766 185879 -37217 61517 35411 342944 -392202 37120
10811 -146954 -202702 240090 5813 -300008 -451895 84138 -15145 -228288 -28128 33421 -33371
10799 276251 -255866 -72948 -210648 -71721 324468 123651 -306761 -116559 304636 248473
10789 248473 -234378 -55563 -23821 67050 27938 -55407 -12845 52195 18335 -60386 -352640
10778 -352640 95279 309906 204970 -265651 -643655 -16190 8328 129148 -200496 -149559
10768 -149559 59349 -307531 -72609 250355 -369535 -93393 -228913 331328 -114482 -192706
10758 -192706 -2499 -188112 -104679 86720 -114245 -115262 32754 -39548 -39141 37474 -31628 -245994
10746 -245994 78961 -208266 202987 48988 -232990 -278380 -38784 -203961 -178936 -79551 114728
10734 45838 15875 -79205 -186004 105412 274518 23568 -6257 83995 -144456 109585 -118709
10722 -53699 -108637 91518 -96654 -158696 -381515 -151066 -5952 -104272 274841 -126739 161464
10710 181837 -5037 8792 -175122 17314 -69633 -71825 -74071 -160810 396636 -216236 -60684 -63834
10698 -63834 -26597 7794 -145073 125515 25557 90225 46875 246428 41012 -107505 66788
10686 35304 -84698 35067 -1191 -205987 -478624 7873 40158 45563 -319017 -92819 -146466 -156558
10674 -156558 -102085 -159026 -231984 -90879 -117481 -134572 123964 361932 -288509 77407 107224
10663 107224 54031 107965 -148055 -490307 99174 -124538 212940 -56252 71653 -70763 -268636
10652 -268636 -45407 -73554 12655 -218231 -221373 -209846 -364077 212306 -86339 42686 -51939
10640 -123179 -254385 -124589 78740 -149242 -156177 -16117 -93792 -46256 -259813 -199425 -88448
10628 -67188 -31545 -187293 -313518 140895 -45698 28057 8509 -163117 -119276 280480 -206698
10616 -265988 -296909 -118618 -246057 119161 244954 -208201 -323230 -257048 -90681 -224502
10606 -224502 324322 -112748 129757 183033 -303554 1958 12053 144235 91031 -138116
10595 -17191 -136817 -85410 123246 -220303 -26981 1364 -122676 -138382 -34705 97302 161376
10584 161376 -85422 -12236 -50440 -40754 -158859 238041 -106425 -136491 -152729 -54800 -194813
10573 -194813 302507 9582 -61003 -197952 -94241 29292 -77637 -272753 -140974 3652 -106618
10561 37787 -219226 -241873 -171813 -116741 -124655 -218508 -100349 -218468 -356457 73844 -123918
10549 -12958 96804 62506 -106190 -50482 58982 47331 -25190 43237 -71243 27055 -29066
10537 5947 -288296 -188257 -354165 18290 -105089 -199107 13061 -124189 -314275 -61300 320234
10525 143998 -244931 33743 103440 66069 -234106 -207467 -255104 108804 38997 -69184 216053
10513 9090 21718 41189 -302591 -215310 -366908 -28479 16964 66554 -39016 -55750 -45409
10502 -45409 43306 213296 235604 -233331 17524 59714 -68966 57657 -62883 -140044 98452
10490 813 -8568 73231 137721 78763 25010 17026 183730 -108061 21595 -8074 238663 65685
10477 76339 99232 186943 -320136 -223274 -95549 -83902 -78206 52270 -24093 8006 55608 -186522
10464 -202519 140032 -11901 166790 -177409 -58630 -79806 101947 139712 -242672 13509
10453 78875 -147400 207263 -150209 282945 -171973 -3988 -123197 190954 -2035 19202 -77164
10441 -157712 -183618 -279906 150577 -104397 106380 32135 38315 312491 -117836 377780
10430 59546 111886 38731 51676 311042 144999 -185110 37552 313397 -265893 -319557 -167307
10419 -167307 42919 63851 79827 -251050 -337346 97573 -37970 -224094 -211867 -71091 -324202
10408 -324202 21985 -164862 187236 191847 -114569 -542410 -21710 -150101 -23753 75692 -165875
10396 164070 -341732 -137708 -102019 47375 35035 7267 71291 -39599 59502 170572 186583
10385 186583 275608 -152651 236444 -846 -104725 22256 80135 89754 -195716 88715 -32125
10373 -46230 6899 -288880 -49109 133364 128237 359701 42779 273024 683916 45758 107193
10362 107193 287521 483694 251126 304276 329337 640344 590244 374512 89798 315673
10352 315673 38263 15044 304152 -97 139580 96560 46188 134245 578925 317856 331483
10341 331483 300075 374584 15726 -71307 -42259 -58617 -120287 136042 175940 -25948 -48634
10330 -48634 -124530 76749 265283 247374 172239 -12513 100741 346076 -88583 270403 43154
10318 73434 83129 -96862 114948 9035 325451 -223658 25345 -178140 218982 -202500 -181645
10307 -181645 -145945 -91313 53207 46923 21121 -71656 -130724 -317891 -178494 135968 -161400
10295 32718 -4868 -10540 352148 66944 141590 73182 205818 -227733 -51160 -100766 154101
10283 -274693 68188 -73078 142934 -277076 -60204 -272581 -182309 -87172 78845 13540 -198656
10271 303152 -38454 -112967 497342 103428 154062 -68922 5986 -154002 14581 -62577 213341
10259 74677 -253649 -280053 -102569 193772 50499 4068 -136238 84414 159866 -163988 94798
10247 166689 -132738 259119 175471 348400 214734 155675 221915 -167991 16527 91048
10237 91048 -118962 -66196 183748 -124761 168827 225559 139248 -86532 2006 352466 66668
10225 63788 163730 184814 288834 64260 -197633 7569 -36888 -47010 -55651 295623 1993 -353240
10212 -76750 -176671 -47751 20090 -88625 132732 -22363 -148493 -326482 -145137 -121291 26765
10200 -30572 -90693 249785 -46330 -86513 -392015 -78906 -243770 -238772 95052 -117481 -226627
10189 -226627 248351 -12040 50941 44549 -117481 73935 166810 -371429 -20571 6332 115601
10178 115601 -30573 -144162 56609 -47297 -83109 -85831 -37929 -203725 -493889 -196705 -222993
10167 -222993 140027 160582 -20677 -243805 283145 -136117 -109628 -353916 -216023 85125
10156 130795 -105688 164880 -103565 -195057 15607 -83789 -228188 -181493 -176216 -12537 161547
10144 55107 -305277 -107581 122996 78212 -195782 -143933 126355 284157 -484610 -85459
10133 -213293 -40182 -42302 -86373 -344696 -250688 -131851 101701 66163 -57258 14784 -250539
10121 -75036 1281 -135510 -59346 -58983 11983 -77271 144097 -397223 80299 -40680 34070 -279251
10108 -105789 -123124 38234 -64978 74589 -8410 -252545 15935 -240129 33096 -61414 53573
10096 -30756 -177279 118993 -61672 108851 -104870 -192069 257355 399354 3024 138741
10086 138741 131956 167340 90126 45766 77392 -106415 20006 -155781 -112444 618 -245781
10074 -122042 -163323 215028 538 -110777 -82206 13645 -161033 -106259 -100812 -44531 -348935
10063 -348935 -67273 -334175 17842 20691 41309 150025 -135672 22216 -202549 -324188 -3680
10051 -363056 -56998 -232333 -124590 102649 64926 -49864 -207034 -138702 -97820 -228288
10041 -228288 124666 25550 -61014 -221794 28710 12287 -121959 -302895 -496373 -307384
10031 -307384 -268338 11795 -197910 -115118 -76664 -377795 -81952 -346936 -286814 164797 -41783
10019 -239830 107343 -86007 216065 -298521 -196685 40584 -465861 36850 5954 -264479
10008 147732 41748 6462 66487 105452 -267088 -94485 -117237 218591 -111823 50226 126393
9997 126393 168110 283732 -43240 -235215 78713 -487217 -255644 -94164 164451 -107607
9986 -65603 -195218 -179976 -57682 -40736 -121226 135003 96073 -161636 -232357 -210878 -14251
9974 -86756 -176148 -62575 256171 266228 179151 -140118 -93301 41112 -143183 53003 19700
9962 150577 -256191 400309 103449 226934 176408 10752 9253 -617489 173215 -55822 -427753
9951 -427753 79532 166618 -143013 62610 -196777 210938 -68739 211640 -91004 105511 -196810
9939 107225 -124307 -118454 -127509 111508 -240318 4097 -61572 69881 -83944 -79955 -46583 -231111
9927 -231111 -61015 -126433 -408716 -147896 -34267 28783 -387721 -41447 -111805 -113025 215703
9915 -105516 -497391 -584054 -111759 -44940 38911 300500 170064 339344 76390 -205858
9904 91163 -103835 -103773 -18430 397457 123297 23154 121125 -12306 -271967 64037 124584 -110429
9891 -126006 -350853 -252098 -100061 -144031 -130431 -14734 -89420 -110814 -34664 -39705 -403343
9880 -403343 71791 30518 -243111 134553 -98554 -129493 32752 -85529 326036 35262 -115992
9868 -46581 -225632 -51706 -442414 -23100 -219379 70021 5597 1301 -147527 -414961 85019
9856 -216935 238720 -81619 -161788 -277839 -240371 -97625 -40148 501779 -289592 125467 -56369
9844 -69714 147743 265265 -137797 -99318 10095 116825 -219338 -38906 -28446 -182657 -157355
9833 -157355 -352482 114511 41290 66622 -541 -24581 -437040 -216230 -192537 -38760 -122353
9822 -122353 90476 223657 -11786 -13116 -6769 -381051 -94380 -195926 9037 165912 93937
9811 93937 -147663 175958 185362 -35467 100616 -187342 84099 -205163 88439 -221351 -65863
9799 257017 -57775 109637 34702 -361713 237627 276192 -147927 -205165 91869 -104409 -65937
9788 -65937 -289965 -55915 140083 92143 -245654 -174955 -6634 -72513 -7875 -56629 166783
9776 37817 -51251 117317 56243 -22452 -92431 -307177 297312 -49935 -77328 -175039 156181
9764 -309278 158033 -188372 -165568 -234415 -5608 132580 -113211 -39973 -240864 -53944 -109282
9753 -109282 -21252 97565 -90121 -3350 20572 52385 -295146 -48088 -46150 -118979 36554 61574
9741 61574 90979 45433 -123489 -170675 52609 -203402 -84278 96960 90103 -168 -102538 -85802
9729 -85802 143564 -308775 -118487 -138815 -291067 -61262 -256094 -58107 -7856 -129039 4913
9717 269872 23383 -218893 217341 -181117 65108 -119709 -54384 -189705 -416320 -289885
9707 -289885 -126681 136682 -96008 197068 -316464 -1256 22072 94425 -129014 -355999 -331074
9696 -331074 9720 184678 -111206 -480858 -395919 -122650 68909 -6126 7117 -115434 242456
9684 101851 -126531 28366 -76722 8632 -114855 98112 -365126 -56144 -102267 -216214 -58993
9672 208471 -282530 -63931 -106137 146493 -164082 -254877 70118 192358 -137746 -251768
9662 -251768 -111068 -293970 -281475 39681 -26625 -61747 -26860 -371240 -356223 -360767 -251963
9651 -251963 19133 41677 70814 29480 -195676 -87890 -1662 -81719 -147306 272551 235677
9640 235677 181338 122228 -159611 -85969 -358695 -5850 22870 71361 -206178 -161081 -136290
9629 -136290 -74470 -113114 -56744 -28755 -30196 80883 -99441 -167493 -23053 -296124 145125
9617 130367 -235550 -260191 -44923 -228197 -308298 -315072 72215 15220 -22527 28985 227561
9606 227561 90292 -152362 -174757 -345451 39456 151692 150007 96150 -318499 181627 -174591
9594 35553 -296847 -178076 102310 -146929 -69562 103297 -486115 -173938 100071 -211863
9583 68867 243664 159081 -71490 50866 -95648 -70261 -211405 -484463 -17976 -32356 166404
9571 -44873 -292483 -4576 -281324 137836 -304949 -156979 -185146 -26125 -105656 21525 -122139
9559 -354190 -129024 16534 -137370 -46749 -13638 -303768 121242 78271 -134025 107681
9548 -62544 -96737 102750 33341 50417 -229405 77638 206369 -154854 -365698 212843 -116267
9536 -109431 -23651 -40530 -2235 93335 198338 -34626 191055 -162635 98021 140875 -168223
9524 -104669 -138344 -45473 -174179 -163192 -281559 -152681 36877 -78444 -104532 -63336 -75923
9513 -75923 142204 -246131 -149584 34396 81947 -321442 -6641 -105281 -55551 34661 -111133
9501 -222359 -164010 -208023 -160435 -236868 -52181 -64572 -84330 -272432 -278752 -77625 47740 -80665
9488 -10778 -152288 18946 -51308 -205663 127584 -238035 222128 -396426 -108956 -415637
9478 -415637 -160041 -13074 -223169 -227520 33129 -202665 -165135 117956 -228620 -57592 -114251
9467 -114251 17869 -7044 164996 -48730 59811 -65965 -306523 97861 -254367 12484 -40176
9455 -114678 128475 271409 192931 -168898 66265 69004 51664 -53079 119786 -247553 10513
9443 -56061 -24983 -30873 -255429 326236 -54207 -17152 -68664 -73189 -48107 89911 -191256 108993
9430 -207290 -160145 -181445 88281 -264950 -354574 -133938 -184673 -30209 -9308 -135597 -38653
9418 -85372 17853 -190949 -200173 -51717 -74117 -278195 21814 -216892 -89712 113862 -87562
9406 426998 -438199 -305975 -11739 -16216 16901 24643 45857 -85860 -41284 128081 -227015
9394 -7299 -154854 -223866 -284944 276296 114979 9660 -341063 24465 -48881 83629 168137
9383 168137 -15479 -76198 -115625 9722 -145438 -269496 -255722 323229 9641 -193716 190772
9371 -83118 158221 -476144 60921 2683 -94719 50452 -191355 -113277 31834 -75777 40840
9359 183904 -84398 -68140 91439 4573 -13187 -302243 -84989 -178530 -102694 -223240 -33846
9347 -116521 -216649 120043 -92898 107979 100913 370661 -112932 -438887 -112337 171074
9336 191020 -231043 22053 185883 -37306 -2870 79817 103209 -98325 -265644 -246516 -49215
9324 50678 -141127 -74500 -150167 -366165 21464 -127199 -252153 -144102 111160 -244329
9313 -13095 182500 55182 -164060 -202878 75255 -301364 -180233 -269798 469337 -172704 -299066
9302 -299066 -13053 -122027 364834 -261884 354781 3762 -269189 -115694 -124296 -86799 147712
9290 180013 -202248 -11091 156018 -298464 -128999 127923 53131 -167879 -101484 -287385
9280 -287385 132272 -115644 -168511 -197141 -11771 -227918 -215441 70517 -167628 -45229 -136398
9269 -136398 -244189 120173 75080 -73672 -99505 -162346 62806 -110355 44365 166749 -34317
9257 112242 146520 -172125 335515 153534 -213009 173154 104544 -216033 -96980 -166107
9247 -166107 -163952 -160109 32493 -275131 197684 -121446 -132983 148592 60949 -19854 -32485
9236 -32485 -47830 -178949 152972 -98661 -66820 -169818 111607 -147687 218882 -58212 231336
9224 -82564 -247642 -72362 77963 -58585 -90891 -159402 -33394 -98061 115206 102353 -29774
9212 353042 -98634 -27219 -196249 40407 -116939 -24776 -454961 153411 51416 -24040 195672
9200 -65371 -198062 -189201 -51438 86570 69986 121483 -30432 74263 58012 -219471 -293394 -344607
9188 -344607 -142186 -112061 62742 51829 200273 91401 -21136 -283388 -5647 1464 -46950
9176 81486 -145768 -89013 -126391 -124579 -144353 -71555 -22442 -131881 -232632 -396125 -325762
9165 -325762 -210844 -138851 360339 -392558 -196583 67324 97351 57689 -97334 -136384 -76835
9154 -76835 -296820 -94056 247676 48659 144042 -95814 181145 -15569 143870 170453 127066
9143 127066 -260017 90852 -297618 71869 -219863 114236 -2824 -476553 224725 -66166 -52358
9132 -52358 -395649 79320 -8054 -460468 98117 -314770 50971 153586 41670 -221203 167828
9120 -76804 56419 182341 -89291 -304729 93007 1638 77204 232077 -22478 302720 4736
9108 -156920 -66616 32500 -118957 -136811 -76949 -218711 -203084 -242165 -327892 214259 -233289
9096 -214561 -44671 29429 164000 131480 -279153 -103637 -119656 120989 133891 -167484 -117070
9085 -117070 -200129 127074 -81461 313721 -241150 -53198 -19159 6108 80252 1075 -314476
9073 3935 -2890 -63198 -263353 290211 -241706 187351 50316 -220980 295986 -29305 75253
9061 -242214 -19319 -100919 -54202 285076 179835 -101857 15837 -15448 -140046 217489 -221507
9049 41949 90271 -58677 -99774 90313 -67639 172046 119436 -76139 -81924 -43944 -208146 138307
9036 -172333 -70052 69818 -345359 -157925 -3694 -119045 -185261 47074 -164009 -154785 -8318
9024 -87048 -4725 -10991 -90260 75722 -200977 -88252 183424 26335 98913 104759 301373 -94756
9011 -184428 -27661 -6073 -15750 -341906 27367 464 73364 135500 -106069 -263901 122222 79782
8999 79782 38560 51162 95489 125357 -157734 75624 58310 -153569 -109882 -326180 -5930
8987 92520 -91719 125645 90400 -206041 908 77299 -151043 2501 -178272 102881 -110289
8975 31225 -220163 -71024 -72264 -303306 -135546 85273 -314923 4360 222210 22018 -210245
8963 49957 -99396 -58736 97978 -9490 196224 -485049 -145070 96351 -54296 -89311 34014
8951 -112782 3699 -235413 78292 125429 -155987 126713 -334669 -81752 -160561 -199978 -58127
8939 -66440 183495 -299483 -130338 -200186 35027 -95006 -56243 65412 -171174 4634 -140301
8927 -2725 188228 -228409 -233968 -25593 40657 122083 -11359 58770 386913 117788 523350
8916 523350 3026729 2688846 716936 258722 46345 89116 123582 -331287 -110623 143516
8905 -376795 -109957 -70117 44588 -122557 117217 -208485 284875 -151123 87102 26923
8894 129096 82847 -314989 182655 -167237 133095 -249819 231568 46235 -226160 234191
8883 -94535 183611 72237 130172 -224335 -126976 233093 -253303 92254 64467 -87577 -32354
8871 -281543 322945 190824 -261263 -20895 -92763 207847 -55051 147425 -155295 79444
8860 -139302 26035 2877 -35721 -412390 -186583 10120 357326 63643 -259955 76359 -136060
8848 -262222 -100551 -150874 -4070 -249074 87654 -83261 111727 -68158 36903 33831 -23767
8836 -57911 258056 139638 -80528 105117 -21698 -392898 297208 -106316 -164971 -170878 -3568
8824 -22262 -133567 44320 -178933 -183497 184166 -20418 -158984 212066 -71976 -247785 -161918
8813 -161918 -52548 -4920 25365 -128502 -200148 15278 -10474 -287018 -30599 11314 -52313
8801 -208316 -405861 -163206 -136778 -195247 211158 216543 47157 -294230 23620 103546 -94816
8789 -357205 158586 -85241 -140672 -10297 -35057 -5132 -125277 288371 -50948 -103482 -101610
8778 -101610 -230374 -193783 -36242 -334364 -152939 -134656 -273880 -46197 -182725 -265278 -200420
8767 -200420 -101048 -94432 290209 -244567 54189 -242293 210301 -228729 199945 -135672
8756 -81151 -192895 -4522 -71743 -18144 146706 259226 -419478 13904 -108619 -129631 -166764
8745 -166764 -34293 257130 74167 -33853 114514 -148304 104220 132210 395098 -133689
8734 71861 146273 -87605 -120592 -136113 -109519 209776 27783 -210290 -66614 141136 406407
8723 406407 -211727 -15090 56074 -129397 -3254 -92608 295114 -8192 63048 142037 72832
8712 72832 209467 -309482 3138 -114173 -273358 180842 -64549 -323622 60513 -243396 -243858
8701 -243858 348883 291930 66304 112248 55371 -110123 116894 -129546 -153120 -310022 -262036
8690 -262036 334179 311578 118454 -350210 144531 -168686 17652 -7491 36580 166892 -92306
8678 -31125 -300764 442112 93672 -110978 -33423 -222581 -28668 -10059 -111216 -198694 6867
8666 92814 -197653 -173999 129396 -423742 -79185 72387 -117829 132949 241472 -81071 -185457
8655 -185457 -19015 11809 195893 73764 78539 953 -18436 248342 154546 -320199 -144430
8643 -29956 -370017 292319 202642 145764 236158 25832 -5215 -112451 81139 57385 -338090
8631 -25965 -42629 38948 76272 62094 -154834 -132921 -218520 -322777 -221280 14701 -307828
8619 -1706 -320534 299960 158361 43733 -21504 61198 -227381 287421 203043 -24495 -169949
8608 -169949 -3645 142833 321313 189962 -194201 -79362 -207755 -207967 -207423 116462 242254
8597 242254 -121631 63354 -50970 318396 -18676 -150089 46225 132141 44651 -215890 75568
8585 -210696 144314 -38521 -191259 -24359 73110 -328149 -82516 157800 -209042 -7604 138937
8573 416730 -97657 -24540 121606 64320 10894 189699 19146 -67534 -53222 -207639 37896
8561 -76463 -79104 101880 -49803 -233964 -33772 -217516 -138359 -77741 -16114 -147771 -87507
8550 -87507 -147952 -83518 23573 55287 -17344 -217559 137418 49848 187828 66113 71362
8539 71362 -176022 149936 166431 28971 -55790 -191477 -211867 105157 -274762 78948 172481
8528 172481 22010 -68832 -111796 -70766 269552 -16857 152898 -48450 -240388 -104470 -55750
8517 -55750 -16841 -87307 -379655 27398 183300 -39896 -28507 -91843 -188018 8635 -324902
8505 -51288 -42983 -287001 -150870 -70778 -258507 -45259 53509 126600 -64422 -180139 140880
8493 -63538 133473 116135 24232 261306 -315746 -157957 -325728 -57657 -98643 186561 30499
8481 -464621 -318307 -299471 1592 -150127 -142485 75368 240531 121319 -52023 69009 -34564
8469 -124006 -184388 155369 -286956 -327888 -35962 -76590 116988 221539 -168475 -397790
8459 -397790 100077 126952 480101 -80883 226759 -68999 -361614 -75143 74165 -98038 165771
8447 187353 -147788 192128 -32943 -31418 -249472 -263605 -123290 -325069 213877 -85822 -43364
8436 -43364 -1360 -129575 202321 -411842 -180475 -169080 -25502 -252370 38723 -50745 -210098
8425 -210098 -203525 -251155 54895 3009 30426 -75768 83813 89991 -31136 -246925 -189870 58934
8412 118797 145461 -47109 58562 -44936 321020 217118 -142346 160484 -100667 57807 -171131
8400 -77886 195777 -160853 30858 129777 71002 21461 210466 -101611 -73865 216823 6116
8388 123038 -155634 -356450 1492 -2569 -4831 250078 26195 60298 172112 59032 174530
8377 174530 -108287 214671 -45533 31311 -64162 24391 -262226 29216 -170799 -145456 -4119
8365 -224743 -352312 7654 -88412 182594 -232045 85856 28592 63257 65251 -207901 -81491
8353 -72677 -40082 220055 -236605 27658 -221262 28068 -82970 200536 115462 116319 60561
8342 60561 156417 -26812 -27360 -89993 104423 -390852 -37317 -96306 116811 -11838 -151410
8331 -151410 -205684 170436 -188692 314490 253729 -33631 -238652 -182719 278124 115941
8320 -202252 70080 -389178 -938 64976 -146986 136418 -204186 -17645 -191840 125519 -292190
8308 16747 97471 -139462 -137898 56498 -22160 -40620 105934 -69012 -208861 141062 -338910
8296 162070 -51421 57943 -43332 65540 -18346 -93096 181177 -184696 -97987 143340 -218514
8284 -165049 -87555 -53643 52132 -173406 -515159 -220391 -95050 -7597 160631 207957 -132525
8272 201534 -88238 -215403 -40749 -58735 37644 87339 -13976 -117416 -252994 17006 19819
8261 19819 -88707 4219 144043 -24939 44325 111771 73605 57932 -154128 30908 158923
8250 158923 -155042 -31528 -125640 -154806 -54815 -74066 -103481 66350 107017 33847 -51626
8238 122734 -240414 66927 29988 -62616 -290245 -25337 216446 -136124 -146304 38682 123463
8227 123463 61159 -72193 89732 -188657 -104613 20303 -145468 -371231 29400 61293 106618
8216 106618 -226697 -99505 159825 -154803 -17031 23733 -168901 132915 21415 240063
8206 240063 -180312 105290 -135704 8846 151595 70053 -270835 -55673 -25477 -73783 52665
8194 -30610 -347647 -9221 -268869 110938 -167411 -270437 -10474 -98467 -243769 175080 127619
8183 127619 131190 -42244 121731 -71482 244176 215842 5539 -50846 115805 180195 -257424
8171 -237864 -232816 -116568 -103652 -118064 -162102 -55260 232278 -231787 -215776 -87072 -152774
8160 -152774 29732 -55914 -166044 -19140 -154846 -60675 -173225 -216508 19291 -138290 187897
8148 -339495 -24140 16398 62665 -181106 87347 100078 193954 -128463 136868 -216645 -343533
8137 -343533 -123798 -110705 -143274 -230289 -191634 -114124 35660 165965 291839 -201680 -71144
8125 -135098 205854 86843 -219442 -102495 82714 209880 -113526 -22932 39308 -170386
8114 111562 -242064 -210801 108465 -77063 -75928 27828 -161990 35068 45446 -51746 -203631
8103 -203631 95720 -36264 129361 50033 155496 -131350 -166779 -392633 -169365 167336
8092 159450 229055 -40070 59343 124812 38106 -460457 -8956 15750 -42694 -202761 27812
8080 167625 -70668 -34808 53746 194256 -65612 -274342 -65354 -255835 -68959 15235 -291434
8068 160440 -143246 -64151 -221032 -58884 27681 96678 34926 -154921 67150 307140 -54143
8056 -45636 -248782 63151 126039 -56985 95902 -315146 157686 -251740 211919 -236670 -57898
8044 -396603 -279847 -200336 -286570 -29905 441322 -230657 -236971 105724 256337 -184847 -148488
8033 -148488 175731 347576 -138750 -292153 23512 -131387 249334 -22912 -146705 123543
8022 -162020 230165 -71685 275038 -92888 335043 200697 262364 3671 -48613 -58290 114540
8010 177755 36801 -52505 3970 -272603 -304207 256546 -166179 39085 -118888 -77765 -5992
7998 41353 216382 210017 -64101 -309961 -87874 112846 -131597 -197452 -145183 -127557 22641
7986 137094 -289232 -113101 -37120 283801 -100528 72441 107314 39276 -63549 -151398 -15676
7974 144009 53900 52463 1054 -140637 -62744 27484 -48114 -60395 -271237 -33610 -83003 -311464
7962 -311464 2059 -97518 15675 -85276 93454 -148717 -61621 -15520 -213233 87925 -19131
7950 38051 -132843 26815 73024 191528 -179890 -96226 75607 -158682 -351012 -148931 54217
7938 -409954 -4511 40279 -242687 -22336 -78404 46504 -193366 -191797 -404691 -178328 17784
7926 -60111 -98614 -55812 -101882 25007 271606 83757 -4997 -144317 7805 39134 -251504 21309
7913 127872 -213968 -334947 -268643 -120416 39844 -170107 -25254 102287 -129681 104459
7902 112173 -226491 141275 45970 17880 280209 147043 -59739 -72498 97607 -231564 279852
7890 -61766 -76123 153439 669 231316 -135672 95885 85556 -4230 -222972 7420 -197550 -128650
7878 -128650 311284 -320472 -94407 -104045 9380 9434 -250225 -143055 -175032 352507 -21304 -65952
7866 -65952 -83518 44734 127077 108067 80884 -68306 -41676 -80908 -235353 -73234 17029 -95341
7853 -372004 -156812 9876 -150878 278561 -12288 -257499 -218010 -194894 -181046 -529981 -51505
7841 -180779 -31813 -19684 70458 -114338 -118634 -69456 383912 -29586 98125 175789 -84564
7829 -106266 -45739 -153320 86508 77103 -310462 -76904 65930 -355880 163659 -153621 291391
7817 -107205 50110 14236 245351 123225 191957 -185228 79521 -50781 270879 180949 -20611
7805 -142254 179910 -40798 -107713 74968 -163774 -270059 -58455 137204 85034 100223 -317549
7793 105829 -166219 -84173 309571 43756 -135567 -295544 234403 -191388 113618 -294179
7782 -37793 -355498 -199205 48212 -163519 210385 -82951 33476 -171246 -331838 120897
7771 34858 -21543 -424008 7204 -196659 194236 -48538 -530978 -203264 -40815 99458 -129236
7759 209282 -313952 -246957 -44741 -4275 15783 -218431 229488 222748 -163015 -184176 8168
7747 -18322 -277920 -143416 101528 104637 67076 -163293 117934 184517 -114431 -22210 -177753
7736 -177753 -17497 31541 84956 11382 148344 15234 91798 112818 217703 -246461 58571
7724 -285858 -219112 292022 37796 -156507 -78124 -136061 -156881 -145611 -189134 54188 -169993
7712 -58318 -27761 -283297 -66183 14650 -164439 33645 -248253 -299050 -103849 -47186 154271
7700 -216252 -108100 237216 45201 -85178 -238361 -193434 241976 -311015 -3690 -94184 -57384
7689 -57384 -250885 -261879 5232 174191 -117045 -235219 -95033 -225913 36812 53023 -110907
7677 -90026 -108840 14602 92657 -152066 -313565 268602 21593 -27432 -237119 -61343 -31759
7666 -31759 -55634 -274823 -320776 -120655 9876 89591 19249 49733 178356 -43679 12597
7654 -226153 -45734 -177043 122576 -38520 41786 -246599 -294872 -112270 242183 61366 217464
7643 217464 -98572 -173712 -63274 -151569 316326 -35689 210215 -8593 63972 230305 178284
7632 178284 -24495 17151 -40803 142598 -124485 99885 119513 -190542 104046 265841 -278017
7620 111038 9888 -146099 223661 150622 -103546 -15549 -275238 -103471 -152044 37975 -79352
7608 -191743 -365385 34896 167866 -99382 48090 79957 -65546 -34458 83022 -58252 -147649
7597 -147649 -121190 95957 -110565 -14370 105143 467501 -165863 -36726 -146142 21069 44447
7586 44447 -141837 -27931 13470 -51783 57987 153422 41065 -160268 -30349 -206822 15000
7574 -20914 131463 -109779 31692 -314620 -39401 -138109 -227364 -274290 73593 -97558 260499
7562 -117242 212279 -124793 57007 207669 -168969 -16487 -251139 196741 -53047 -447705
7552 -447705 -2878 -143257 -11653 -254056 81617 -3242 26543 145465 44774 -7871 94847 25999
7539 68218 -29838 -23949 82435 -8993 432919 -1170 -11789 4521 -133826 159216 -37849 -152933
7527 -152933 -10281 98206 -34293 37690 78886 -101497 26557 -155314 37627 8655 -311898
7515 -206981 -173594 96887 279016 -36067 105940 10603 -243658 23361 -53750 -74239 270817
7503 33663 -33301 79689 134517 -108727 127747 245802 148367 28011 202675 165849 -227910
7491 -270827 -214784 125477 -3043 317208 -166358 84905 -161470 108383 13472 55383 -57321
7479 54499 -294733 -66314 99224 142354 36397 18495 37895 118324 -231690 -109968 -304210
7468 -304210 -112540 165937 -162504 92881 212856 -298988 -30096 -135375 -70413 333208
7457 -35195 53341 82766 -7375 26280 -95572 154 86186 58936 203533 4028 -78496 -91835
7445 -91835 -43189 -220931 -129854 23971 -186854 112481 -81749 193832 -34164 15109 -270228
7433 -157395 -291160 -137633 -41967 -332093 -22962 312929 -197310 78646 439300 -107487
7422 -128179 22153 97813 -253810 394483 -9605 -175820 139083 -49849 -81826 2237 -291891
7410 -108231 31937 -52089 -106070 221894 -173832 -163195 -100783 -116578 160373 -67429 -130722
7399 -130722 -217531 200351 81768 -241263 -517 355935 -131570 106884 28268 -29682 -30047
7388 -30047 65330 -113239 -225962 119213 -97889 35 -102457 -153273 -42421 -105175 112591
7376 118719 -209296 272945 -146761 63042 -5809 141577 -145033 -146565 208710 -181029 -45683
7364 -230012 -400756 -160914 -77330 -114799 198117 -63677 107364 5564 -77179 43915 -76185
7352 -45345 -39415 -125990 -257347 -10094 -118391 90163 163846 -126416 2125 -253438 122171
7340 -80917 -117065 5517 -31307 60183 -110004 54081 110835 -36525 76348 36774 -201980 -208699
7328 -208699 59306 -74241 61898 27970 104785 329556 -148213 133741 151487 -163602 -118948
7317 -118948 5494 -30510 -99513 -47695 167530 -212905 -204650 -56677 -55326 -128923 -92048 -7256
7304 15875 -165339 -111611 -229054 182662 196354 -491958 47643 105340 188531 -95771 214836
7292 -153217 -122635 75270 136815 -290577 -71275 9146 258446 151896 -14101 -78434 37818
7280 107063 13920 -123920 -55036 -207701 -113771 248030 239568 261660 -5735 -200487 -75166
7268 -169781 35418 -356176 183418 -45390 145303 26989 38357 -216513 -270627 71394 -151049
7256 67656 129714 204948 176816 -236208 170611 -81858 -262342 79199 -334925 177928 -203805
7244 14487 -32441 279410 -81222 -351944 235850 -84193 136950 -19484 32915 109183 -73315
7232 -230390 -148865 -183066 124910 -131812 -170677 3576 -242180 212075 -87089 62969 294318
7221 294318 3941 -85493 237504 130272 -138582 69771 -169065 243430 -105878 -163523 -90986
7210 -90986 271785 -259428 215729 -135868 -295569 -162081 13139 -142872 94963 114353
7200 114353 -5485 104897 55741 -51514 -166195 205545 -254053 -150274 -16318 -26379 -148118
7189 -148118 -28704 -140027 52130 24361 19413 -37233 140417 110517 -132699 -372118 187213
7177 63587 -73379 -17447 -49100 120150 193002 200556 -107412 -111765 391744 152435 -37359
7165 312093 296225 168312 -225261 282648 -93108 -17372 267712 -39311 8492 -182410 -84402
7153 321611 167622 167343 -73762 107987 -319613 -51365 124826 -196637 -126432 -77238 -90252
7142 -90252 -179390 -123900 -109185 -329568 -87901 208617 -255181 -331434 -44883 -73354 565578
7130 -77653 -36378 -113302 85629 191168 -122837 160736 21319 -196637 -62251 -73806 -134655
7119 -134655 -348714 52905 81542 -21359 -39728 38452 81647 -213046 144381 -275403 164004
7107 2001 90440 135256 -95473 -124890 137236 -232795 73629 -37667 -111765 -25407 -79914 -163848
7095 -163848 53216 128412 72960 -225248 -8832 -123166 -261316 -52310 -190428 161614 -216904
7083 7124 181654 -174866 152566 62845 202417 -69519 31044 -63836 15342 -77845 138014
7071 111872 9644 232309 -77049 195590 2621 -52898 -439178 -58234 20524 114346 132894
7060 132894 -113736 214809 53279 -86676 71760 22206 -188190 36668 192345 -241815 431298
7048 228377 -297525 -51615 31681 44927 -8945 270350 111592 -61156 -189015 -318032 84388
7036 -153276 -24422 81570 3532 124341 110872 -140600 -245397 -142086 -26156 203292 -111679
7024 -21372 44066 -28919 124159 338638 49028 -329547 -33384 58592 -318182 -275243 294240
7012 111112 -73514 60563 -78048 2587 89333 145932 113008 -36399 21588 -368031 -2014 -179515
7000 -179515 -22419 77995 322176 82955 -14659 -211440 99460 -2744 8281 -316985 84582
6988 -306694 21126 -30421 6931 -111012 -155067 82575 -33725 -138873 -36326 155860 -44994
6976 64022 295668 342555 -44306 -202215 -110604 43461 80514 13456 -314048 25527 116978
6965 116978 -216158 -149811 -28380 177997 24822 -145743 4966 286399 -279511 195342 203876
6954 203876 20592 -265611 175804 -245092 -174172 79592 24726 -414266 95169 -198204 -15898
6942 95758 -12251 171167 125234 -179801 -25772 -34037 -89291 67376 -27697 -185657 -162855
6931 -162855 24049 70855 67388 -198314 70632 155862 82430 58264 -246538 135448 -25081
6919 -362798 -199164 237281 -75444 183188 188725 32439 -64050 221988 78008 -56002 -67867
6908 -67867 106510 -167943 -138317 -25132 36947 118392 -234930 90543 -304760 43946 106738
6897 106738 -152424 124746 154254 -144089 -158830 -72538 -194478 55016 139226 116835 -104599
6885 -33367 -227049 -82913 -407542 277320 -184013 146934 16470 233981 31682 -71010 -143547
6874 -143547 -199466 -29292 -112756 149156 -125692 -215919 183690 96811 -38001 -107704 -138575
6863 -138575 -109288 215663 -116643 108973 -72520 362412 62244 -171833 -80067 -99378 -188252
6852 -188252 260534 -216628 127255 -302933 -192018 40084 88590 252053 164794 -20063
6841 -335256 274768 -89140 45160 88317 -311426 92283 169464 96182 -223915 -140518 -468711
6830 -468711 96222 156057 -70920 329426 371421 -181753 179117 -155024 41203 -3514 -160024
6819 -160024 -133495 -242846 -186607 240216 -3750 103246 304311 -11313 33849 -194170 65644
6807 81619 64875 -224431 108535 311209 297099 -5686 93616 42660 -152984 -444 -88381 132580
6794 -19855 -129473 -357955 58133 -120305 -199184 93804 -85450 43815 -244857 135740 -330110
6782 117753 32949 -227011 -85831 235115 -119063 95032 71829 66586 114969 -46436 21725
6770 -39667 54443 67450 340735 -41397 65094 91525 187741 211230 321715 71139 -33661
6758 -312539 124496 51540 222676 40658 -198334 194310 -157368 135091 14931 -78524
6747 142114 184539 225373 -153311 -348262 369980 -24806 -74374 122971 -167382 142595
6736 -75319 108622 -54446 -37727 -3194 7033 21198 -23390 -175595 31610 -94657 100650 171727
6724 171727 29238 66625 -302771 -145091 -316014 333112 80760 135542 -123242 315067
6713 218764 -91436 -101743 -257035 -94676 -79646 189930 -360934 93426 -105061 -83498 461903
6701 222385 93416 214335 -1232 91536 -232774 -91458 -50834 -86188 -77191 216771 106433
6689 -75946 -154262 -91654 -231255 290802 -90792 -27459 265826 -176824 17178 -80254 -35813
6677 23445 -266923 -94838 246541 7273 -332122 -304968 -128540 100816 -80483 -515 209830
6665 -85003 -388267 -112216 237012 70728 -72815 211963 -67136 -69701 154053 180696 -210457
6653 -211838 5628 -6012 88539 75635 267118 -131920 87975 29285 82605 -436567 111674
6641 -97839 54615 105123 -121683 90313 -55890 127637 78438 -32762 284826 245984 -236730
6629 -76078 -162846 -232306 88033 56464 158105 83097 -82866 103919 40227 -119652 -141646
6618 -141646 -74029 -122658 -194863 -65938 83703 195759 -213924 13353 -151469 -210914 90179
6606 43936 -289025 -134904 161223 -98611 24702 -277764 -68002 105428 -215683 150608
6595 -133461 -9779 -190022 -16740 -5827 248941 -268765 -23862 -101116 81296 -121392 36784
6583 124820 7902 141903 20180 -50270 127148 160500 -160811 -288458 129328 336746 -205402
6571 -118021 -103746 262909 -140722 173213 76458 353709 26930 290797 119028 -117974
6560 409251 -155223 -23266 34142 -124649 18999 -101246 455248 186316 232811 -187527
6549 224767 -21760 256771 -111205 -4084 -34948 -187127 -90254 -147689 95421 -33640 -123124
6538 -123124 -151371 160342 375250 36002 -218364 243971 79894 -8869 99714 -254450 -157361
6527 -157361 271521 -183988 -6255 37482 63710 -34222 123937 127303 -189526 74127 -89559
6515 -214034 18998 223488 -429370 79309 271145 264742 -151668 -9887 -158320 -229723 138703
6503 108242 -49663 -210309 -90992 83589 -101215 -256870 57365 -57351 -45206 190456 -271078
6491 39811 -104955 85432 -212267 -224208 61861 -431753 183947 -76471 -391418 -325597 -315608
6480 -315608 105596 50206 158831 -72683 174308 271466 38355 -98784 37037 -13553 261070
6468 -45526 10701 10718 95986 -79157 239514 120064 2901 -119396 -152618 -317771 -318721 -205128
6456 -205128 251712 143572 33281 71323 174266 -67192 40410 60520 307694 187493 974
6444 -182771 68116 77740 178666 -128522 67174 -42639 -245116 -11393 -10015 26409 29422 -244260
6431 -287724 21196 -63163 -124206 211010 -78287 -116114 -227045 -111353 -118552 234750 1334
6419 -103505 -184723 -166348 -259642 -71813 108924 -15008 -72847 68976 -104649 146038 18985
6407 -77031 -120663 -219663 45486 -84460 144819 78764 66198 251112 16322 -93845 -90264 73654
6394 -191313 -53337 76943 -48838 106132 -225364 -23786 23491 24720 -51718 202702 9191
6382 123363 124185 97371 84550 28560 73452 -138117 119844 -110671 -5108 -165073 306796
6370 -131887 117225 148240 -34457 109975 213900 -128342 185137 -115755 371590 -117740
6359 29995 -356421 -68921 -82834 -5010 -108669 -125600 -22731 37635 5676 -53854 253585 43606
6346 1376 -99703 -46261 -147246 136647 81902 -2197 -165900 188655 160231 -30618 -151021
6335 -151021 263953 -95897 -95885 -231036 108369 -82358 40395 91363 -109532 -204474 -245375
6324 -245375 108565 -33905 60660 -66745 80316 1949 435570 -104155 45662 -215761 -103937
6312 240689 23860 -63361 -192647 -56678 -242877 -15470 119284 -79066 8993 -72790 -195369
6301 -195369 -115993 -27991 -133484 -252239 -9091 -100719 193589 -196214 -108801 58946 -47477
6289 181322 101824 320358 167218 -95258 -138767 69802 -20241 256818 99909 -228542 -80347
6277 202451 -232880 79919 -17413 -203421 -60162 -180111 262558 -114926 -234350 -78293
6266 99252 -34149 -10137 -188405 194204 -57051 -77081 1760 46500 -193866 101090 214105
6255 214105 -192287 -1920 19743 27017 -105873 -19308 170954 155155 168771 -36391 -14223
6243 -31675 -27341 -139886 -45290 -33886 -189009 -83599 127694 334810 24163 -330677 102246
6231 -237961 406752 -182068 65747 136853 -31640 211736 71739 226409 -34618 -174168 62103
6219 -67462 -376346 69762 267244 -97295 28987 -151025 -60747 -40508 4628 -104312 235166
6207 -448765 -362038 90734 -198631 93117 16211 -46255 127597 134167 32379 95077 -33653
6195 -63191 279385 76471 -72748 42226 -20610 130607 514851 134177 -147949 69157 9924
6183 220683 -251803 66769 227 -50068 214716 171966 -180625 27089 169702 -147049 255281
6171 31720 -298076 -209926 21862 288514 -314661 -3719 98770 321293 134937 -1768 108936
6159 143959 -142548 30541 84040 -30356 4620 -678 10529 915 -208041 -235863 12152 -152074
6146 -206756 115850 -239954 -24468 -185220 36919 -125579 142461 -62745 394941 -54024
6135 -225510 -90936 264760 9840 -261786 -63373 -165322 46843 -62330 279019 -105406 -37502
6123 114249 -389227 -219337 11263 -189888 -272648 106650 -32738 112515 3672 285217 121535
6111 -92608 21168 -18624 112303 -109105 257916 -968 156141 219395 -90074 -244801 57016
6099 39092 -260260 407314 75921 30951 -206126 -25821 -144414 136443 76846 -6638 29910
6087 -37394 151195 -253109 -17236 -66948 -102898 38609 170776 216503 235970 189489 25946
6075 -56151 115890 119990 -89848 -319943 -354222 43508 -339975 -138672 251957 175391 192597
6064 192597 -33303 -100102 5222 -27142 -81824 3739 91426 -127907 -5370 -109546 55327 -197040
6051 -168363 -148260 54028 286748 24480 -401211 117439 -37849 -171794 -70287 67655 -59596
6039 85578 -138499 -53360 113261 -183077 85675 148806 196798 -162444 404106 -243878 89178
6027 61622 -8112 154267 -93381 -252804 37044 8999 32043 -54767 131119 150111 -45450 -160650
6015 -160650 60292 -59015 -70005 25571 -147565 86330 55170 170932 83815 -110671 7005
6003 -105177 -165658 17189 -173621 -171654 -276965 -65983 10535 107312 -206236 29629 102470
5992 102470 202259 -24350 -360420 -156828 -54092 -230195 -20794 -190583 -195916 67864 249893
5981 249893 -50101 68660 72197 -110078 -63330 71389 103385 -173314 -247958 -1286 124376
5969 38446 146576 -266459 -185101 180302 -316981 -17632 94985 295208 -455 -150452 -79883
5958 -79883 201421 -89089 -326542 5941 192333 153771 102614 131499 243623 -300987 81865
5946 320888 -134996 -167925 55879 125299 49191 -113550 95789 -85384 -91735 -129954 -13300
5934 -15390 -141474 -208941 48288 62505 196211 403438 262034 264603 33454 341040 -149492
5922 -314788 124586 203135 82418 -32233 149817 18561 80911 -128951 16615 701 -81012
5910 -302399 -226297 -191846 -17897 46555 198373 237270 133104 168880 -7412 81514 -15382
5898 185238 121304 133315 2238 -188547 -315311 -13335 -72529 128549 86798 -300643 -65487
5886 25561 34218 143328 -323679 -99005 -112187 -3939 -157810 95936 368996 -48090 144725
5874 -214125 170078 -9746 12078 49347 127533 -61368 28818 186838 -23586 -159661 155700
5862 152377 89551 261968 116951 424649 -18098 -255865 -173794 120848 -127831 -84183
5852 -84183 -108554 123809 -69775 95984 -64030 -97559 418950 -24520 -142748 -287606 62569
5840 92300 -243159 86898 135299 -37298 142358 72248 -250727 -113227 99160 -159282 41972
5828 -36212 -37428 141151 -46246 98900 -244232 48650 517935 22243 -205816 129033 18541
5816 240299 109782 -172177 -250071 -37329 115984 73752 -39497 -532 -16236 -2121 55484 195981
5804 195981 -176337 146193 84666 213131 118470 -134632 -256664 40509 -237662 4129 5036
5793 5036 -73374 105354 -17620 -135203 -270182 -34653 -236697 18177 -153158 -47140 -76586
5782 -76586 -311832 -209207 22167 -331690 -175874 247493 98745 -48823 87043 213519 2889
5770 209774 -155475 75884 -122622 68310 -143423 117612 63971 -236611 -18638 25414 -155337
5758 100773 -185925 -178920 -60753 169599 97430 3193 13766 -30955 -42079 18770 239484
5747 239484 -44671 -43367 -6485 104873 36952 156114 198017 15208 24412 200461 150193 127307
5735 127307 9750 155413 -163217 -118231 49218 295480 232294 74061 213977 244661 -1566
5723 -128542 33610 -237616 -31200 -64592 -111643 -134669 -67014 68244 -137853 -121671 275358
5711 -29939 -179009 140223 257244 16320 193868 -83792 62005 333714 14594 -35391 -127065
5700 -127065 -77908 -19371 103065 -79610 -74378 -19079 -420376 228592 178502 218518 158620
5689 158620 217904 82982 143087 248760 -231094 6294 24459 420631 -97251 -81146 -156692
5678 -156692 262413 -23661 -189062 211949 -337084 -230324 -31754 88992 -298980 -251142
5668 -251142 246951 143838 -185468 50454 -105653 -88279 281027 113151 102486 -66178
5657 2325 -129028 10973 117355 204629 84382 -253421 122782 -87752 -147909 -90438 -172173
5646 -172173 25587 -150662 -95065 44119 -85704 60234 86664 -13770 -138633 333111 -76635
5634 266511 137699 183500 125370 -81389 -212568 -248370 -85997 118247 -63442 -8015 -87224
5623 -87224 127675 11562 185396 23296 47567 59187 -408879 -68945 -58299 -209389 210165
5611 -171092 -213823 141464 106922 -248483 -189276 135170 200584 -10283 3419 -175224 -20032
5599 -146220 29891 136811 -144362 -164247 -10093 229777 57180 -331942 102085 77822 -118469
5587 -152908 43855 100676 -94590 -47876 79705 -188149 76786 -112000 -180614 53091 -64149
5575 -202709 -177780 9298 -160099 99047 228075 -35973 -22306 -253515 -3156 109440 -261942
5563 216425 61887 -123132 334866 58226 -149681 -99289 -106625 -181630 79961 -6594 97140
5551 117216 14338 -114986 -6671 -69531 35369 142013 -280572 -266064 217042 -45468 138347
5539 199999 61750 170934 -136025 -94733 -259306 -107340 213573 170428 235050 232075 -293822
5527 145887 -18221 41250 -18842 355284 -369543 -115051 200722 -180399 -139345 -321757
5517 -321757 -74681 -436848 72261 -60748 36892 158059 92230 92839 -90658 406215 139635
5505 -90793 207519 -76642 -160396 -198318 -114921 163096 -162373 330887 89289 102013 30317
5493 303767 110313 139586 202586 -244495 15873 -5308 100448 37835 -140669 258666 169277
5482 169277 140858 165544 -26218 199680 35781 93056 238446 38579 357477 -82858 -30540
5470 -77923 210178 168591 24968 12975 40947 -69755 12677 -17955 -138928 -171 -97638 163907
5457 -104194 138619 125766 61728 129037 124611 -258484 -146095 -282075 -28483 -73752 129237
5445 255615 -12439 221614 -136407 -188629 -83158 -358030 78565 -9841 -55409 189217 -98725
5433 -131590 -9552 -173856 -253759 -5448 274025 345472 233407 136757 185228 -23201 -103163
5422 -103163 -43023 -206769 122677 -78955 -138494 -208969 49604 123141 -403993 -199337 -118171
5411 -118171 46606 193964 -181946 189808 107703 -54434 290230 -84378 -243100 1733 -39057
5399 18886 156577 -210588 -208159 146234 88734 198963 61334 -346533 120013 -119143 -37635
5387 24785 -79328 267131 109480 -73929 17674 -32170 156017 -271245 37314 249822 -42774
5375 -154710 -177890 206436 -91681 104835 20290 197620 216609 321925 9325 -176914 -41615
5363 234456 -1378 -40744 -39963 101983 17707 -63147 -110069 76454 -103217 -257218 -42687 -86005
5351 -86005 361353 -113221 70382 -84323 -79878 -110716 -30558 -90557 -244657 -152386 28762
5339 -54973 222978 -130259 151620 83394 -171149 -290929 -196225 23644 217877 57793 -193399
5327 22367 125139 -60233 -21053 147269 -203712 141784 18578 -90175 72943 173130 -161877
5315 -320903 -11053 -60554 -138237 45203 113630 -42775 -146709 -38820 204423 291487 175631
5304 175631 -5261 -181613 -120055 86335 -80343 -36019 82533 5196 54526 98526 62750 70881
5292 70881 39075 282766 -200974 -404531 436612 229582 -53312 -264420 -116093 14484
5281 119558 -316222 258264 -116385 -193379 -134762 78760 302480 -62822 34705 -36099 74520
5269 -77591 -48859 270596 -13448 63286 -112033 168057 -118640 163723 -8474 268767 100942
5257 124296 253909 -455779 -261769 387026 -110265 159720 -245027 295205 91606 -95930
5246 254622 188037 -43652 79861 142780 -46736 144978 28624 -235596 363657 363134 296990
5235 296990 -50521 -139030 -1874 89197 -87083 -77475 42544 112404 130560 -107894 -154827 85604
5222 194909 -161047 45758 -77696 59766 30516 -307212 129860 243690 -167945 37051 181935
5211 181935 104168 118481 -237986 58961 -406685 -21425 198428 -3295 22910 -119213 69969
5199 391290 -157917 -83060 1836 -128693 -412592 -39018 204472 61313 -10299 147831 -118815
5187 156325 -11712 -91038 -11708 -80705 -51102 -122697 96096 135446 -82005 -226449 -19874
5175 47331 -68072 13064 -163036 -148161 -183893 269304 309411 406651 31766 -156639 174358
5163 181786 -141418 -26370 139354 101586 -30768 60362 -125396 -190449 -80203 -91612 -86600
5152 -86600 -122564 -136230 -38203 -434538 -273997 -182553 272091 -43321 24590 -281927 82661
5140 62399 -7610 158685 317151 31343 155137 75042 145750 8364 -158609 190143 136128
5129 136128 -238368 284564 242996 -144591 17336 218508 175135 76648 211276 -240435
5118 93816 -2812 95949 -150926 16258 66154 -119025 83208 8224 -116368 41204 160448
5107 160448 399516 -78886 -65663 -249925 -41587 -65336 166015 105628 143327 75891 95369
5096 95369 68023 41295 -267792 -147782 71159 3886 -334679 -10440 354745 -27020 -170995
5085 -170995 181768 7524 -321539 -39111 -59856 49597 205435 -303921 -34511 -357360 389592
5073 44363 -98837 -72735 21638 4832 -305710 83741 -238093 87588 312199 35171 18696
5062 18696 -162855 -127570 -58770 176316 340221 147325 54426 100026 124954 44964 47453
5051 47453 292764 214773 -190607 74034 -244390 -63838 310598 -12237 266509 541 -34357
5039 -199495 -155870 -74467 -264735 109795 -149533 -41488 -99708 138111 18022 -6988 36240
5027 133439 -115659 217205 -2713 -109245 26002 272081 309834 -430465 -154370 -245063 240125
5015 11944 -10911 177368 -153012 271716 -290152 41528 -126125 -12697 222500 -85219 9938
5003 149524 115300 145180 -14443 -53128 180823 11684 172071 -308056 -4495 -258612 188130
4991 198754 -234783 -191919 136344 -236195 -156822 49818 319256 -70293 -85471 -74817 128343
4979 -388323 -15158 -107658 -79183 -76711 3480 25331 -142289 134509 55760 69318 211473
4968 211473 238250 1008 54038 -66241 127412 348484 -146717 313597 -30656 75725 204444
4957 204444 -71570 -25636 -48704 55965 -71892 -314697 -142540 -210001 29361 183523 26136
4945 13520 -263119 114059 375219 -10017 -28120 106971 -403554 40758 -232616 -91621 206374
4933 -91281 -180748 43379 101285 55904 198033 -177055 -63564 -134615 226555 -22326 119120
4921 -426267 309725 -87817 37303 1703 102169 -142295 59170 -183857 202879 132995 58300
4909 -28831 -230413 148953 28825 205141 178068 104032 -89348 -186157 -117348 80023 -78423
4897 36785 42942 104428 15879 165647 71504 139521 90549 98868 138299 -131663 -125579 -120101
4885 -120101 220585 33096 -41561 20932 126267 109636 -112932 -118915 -246326 -176914 -24755
4873 255998 -19514 207251 208772 88993 -36599 -168917 -116724 -186353 -52499 221714 72008
4861 83110 -40228 12738 -47822 -4854 57874 -210861 103569 8281 45809 33278 -18387 49975
4848 -217541 143836 -152876 17558 106386 163913 46347 51538 -118354 -84175 101231 -291453
4836 26009 -209927 -355263 105380 -31004 310875 53123 -189182 131545 79251 108996 -145776
4824 -101405 71913 -323619 68245 82807 -96997 169733 87593 -100715 -201169 -198792 134706
4812 246519 111419 5588 53285 117951 41166 243981 -300262 106105 -82236 136829 -21823
4800 14718 -56534 -85599 -230118 91756 -99044 -12904 318710 104763 15490 -22682 13238
4788 51714 28041 -282013 44908 63800 116224 -60194 133216 -83580 287275 17548 218263
4777 218263 430488 -87627 -62671 206941 213536 -132128 241634 -260029 -443945 46470 12587
4765 32797 73152 -153437 -53355 37966 -104343 546 -167079 -95406 -314895 -192553 -7851
4753 167828 73209 11554 -14060 7566 85458 -130125 190525 53924 182860 106139 212683
4742 212683 -400064 -235438 166006 119612 -310334 105829 -54929 212211 35969 -224110
4731 127521 -177379 -232018 183878 12575 215897 202335 54948 107240 112915 -347935 63401
4719 125958 115356 -104024 264397 127970 -134449 -57942 149704 -180425 29003 -164184
4708 -13220 181955 -318726 151089 -210327 204224 7902 -79020 -38122 -141257 -77760 304827
4696 59754 -155805 172745 -15076 -188110 -69085 -35028 -113732 214756 -13962 -177155 -72176
4684 22093 104688 194976 60971 -192727 -285247 218258 -186739 -12318 68401 25783 -55137
4672 72268 248610 -104458 -177604 -224289 257339 98986 -181439 -116934 -218543 62995 -156638
4660 -120533 239702 -94207 -161495 -214347 -41584 -110025 -60147 168380 86144 57267 -19592
4648 33670 9163 -163484 98632 31482 -22244 264963 150808 60395 7003 123540 397425
4637 397425 -12664 273247 215701 -59386 -6067 -174130 -76468 54715 10716 185163 -127190
4625 -75725 -179350 313113 273156 -134661 52363 -78440 -150466 -210456 129216 189813 145719
4614 145719 105718 -97745 211127 35659 308790 69361 -82905 -27457 -217472 -256477 101330
4602 -39421 280122 135456 24102 -16191 164465 -49795 64106 -139581 189430 133433 311129
4591 311129 241738 -7534 72857 -53431 22495 206166 -176206 -67222 70643 -123427 131103
4579 -121870 -119390 77778 256036 324228 18142 156065 172989 -75776 3795 93703 33530 -84661
4566 59205 92084 70298 -246111 -67011 2216 114968 -199133 -226377 5280 149432 -260926
4554 -187577 100701 192433 -105874 206432 -78295 -29763 129794 -1209 188428 23001 74278
4543 74278 -18512 -195423 59327 69200 -95271 -35109 -45956 169538 252249 60930 -124409
4531 155112 -148309 190849 -98440 58475 221975 -22392 -8755 -12001 -101070 -164398 -236404
4520 -236404 -36831 -8873 -167528 91138 -33434 -67771 22972 -127938 -29349 102730 -63525
4508 -29793 251388 170604 26450 -136738 -13490 60078 -213795 -53480 66341 63931 -120507
4496 139067 -46056 1912 -273740 116258 -167900 -75968 179811 91583 -96818 300668 -405818
4484 147928 105338 -4955 -47546 -125471 -13920 227203 -125276 -128947 42949 44596 -138913 -108993
4472 -108993 118099 30482 -223844 -20020 -46248 237560 -177602 360173 -79837 194482
4461 134873 282508 8072 -15417 -142181 -135325 139496 200483 -153612 -218732 -474229 -135629
4449 -34198 197591 349869 62926 -97851 243829 116584 66474 188310 -3447 -82665 -151138
$$ [...]
##END NTUPLES=NMR SPECTRUM
##END=
