##TITLE=NES1012_872015020_9232956_eXCmcOgfq0
##JCAMPDX= 6.0         $$ Bruker NMR JCAMP-DX V2.0
##DATA TYPE= NMR SPECTRUM
##DATA CLASS= NTUPLES
##ORIGIN= BRUKER
##OWNER= Administrator
$$ 1.72 TOPSPIN		Version 2.1
$$ 2015-06-17 21:51:40.144 -0700  Administrator@X
$$ Compression mode = diff/dup
##.OBSERVE FREQUENCY= 400.02188249412
##.OBSERVE NUCLEUS= ^1H
##.ACQUISITION MODE= SIMULTANEOUS (DQD)
##.ACQUISITION SCHEME= undefined
##.AVERAGES= 64
##.DIGITISER RES= 22
##SPECTROMETER/DATA SYSTEM= spect
##.PULSE SEQUENCE= noesygpps1d.comp
##.SOLVENT NAME= COFFEE_meoh
##.SHIFT REFERENCE= INTERNAL, COFFEE_meoh, 1, 14.962
##AUDIT TRAIL= $$ (NUMBER, WHEN, WHO, WHERE, PROCESS, VERSION, WHAT)
$$ ##TITLE= Audit trail, TOPSPIN		Version 2.1
$$ ##JCAMPDX= 5.01
$$ ##ORIGIN= Bruker BioSpin GmbH
$$ ##OWNER= Administrator
$$ $$ E:\/data/COFFEE/nmr/NES1012_872015020_9232956_eXCmcOgfq0/12/pdata/1/auditp.txt
$$ ##AUDIT TRAIL=  $$ (NUMBER, WHEN, WHO, WHERE, PROCESS, VERSION, WHAT)
(   1,<2015-06-17 21:51:34.722 -0700>,<Administrator>,<X>,<go>,<TOPSPIN 2.1>,
      <created by zg
	started at 2015-06-17 21:40:05.034 -0700,
	POWCHK enabled, PULCHK disabled,
       configuration hash MD5:
       21 0F 79 D6 B3 7B B4 F6 88 20 88 DB 03 48 BD 9F
       data hash MD5: 64K
       38 0A 87 85 08 15 63 B3 69 16 3C 5F F8 66 E1 F1>)
(   2,<2015-06-17 21:51:38.097 -0700>,<Administrator>,<X>,<proc1d>,<TOPSPIN 2.1>,
      <Start of raw data processing
       efp LB = 0.3 FT_mod = 6 PKNL = 1 PHC0 = 0 PHC1 = 0 SI = 128K 
       data hash MD5: 128K
       9D F0 2A F6 68 C3 BD 0F BD 55 54 C6 DC B1 01 C6>)
(   3,<2015-06-17 21:51:38.987 -0700>,<Administrator>,<X>,<proc1d>,<TOPSPIN 2.1>,
      <pk PHC0 = -85.06714 PHC1 = 0 
       data hash MD5: 128K
       FC 93 ED 39 FD 38 4C 25 AB 47 86 6F D5 13 1D 9F>)
(   4,<2015-06-17 21:51:39.331 -0700>,<Administrator>,<X>,<proc1d>,<TOPSPIN 2.1>,
      <abs ABSG = 1 
       data hash MD5: 128K
       61 C3 92 8F CC 12 3E 3F 69 57 24 92 13 7D BC 88>)
(   5,<2015-06-17 21:51:39.441 -0700>,<Administrator>,<X>,<proc1d>,<TOPSPIN 2.1>,
      <abs ABSG = 2 
       data hash MD5: 128K
       95 69 26 EB B1 B7 65 BC 19 4D 4A 69 AD B0 BA A2>)
(   6,<2015-06-17 21:51:39.519 -0700>,<Administrator>,<X>,<proc1d>,<TOPSPIN 2.1>,
      <abs ABSG = 3 
       data hash MD5: 128K
       E4 74 D5 33 B3 92 3A 68 ED 0D 14 7E 17 B3 EC 6F>)
(   7,<2015-06-17 21:51:39.612 -0700>,<Administrator>,<X>,<proc1d>,<TOPSPIN 2.1>,
      <abs ABSG = 4 
       data hash MD5: 128K
       27 38 59 DB 04 90 06 68 92 54 C2 F4 70 57 BD 75>)
(   8,<2015-06-17 21:51:39.706 -0700>,<Administrator>,<X>,<proc1d>,<TOPSPIN 2.1>,
      <abs ABSG = 5 
       data hash MD5: 128K
       50 7F D7 64 B9 E1 85 C0 C2 D3 29 08 85 C6 4D 8D>)
$$ ##END=
$$ 
$$ $$ hash MD5
$$ $$ 22 C1 58 A4 C4 96 4B 69 50 7D 73 B5 E5 8B 77 3A
##$RELAX= 
##$RELAX= 
##$RELAX= 
##$RELAX= 
##$RELAX= 
##$RELAX= 
##$RELAX= 
##$RELAX= 
$$ Bruker specific parameters
$$ --------------------------
##$DU= <E:\>
##$EXPNO= 12
$$ [...]
150 150 150 150 150 150 150 150
##$TP07= 0
##$TPNAME0= <>
##$TPNAME1= <>
##$TPNAME2= <>
##$TPNAME3= <>
##$TPNAME4= <>
##$TPNAME5= <>
##$TPNAME6= <>
##$TPNAME7= <>
##$TPOAL= (0..7)
0.5 0.5 0.5 0.5 0.5 0.5 0.5 0.5
##$TPOFFS= (0..7)
0 0 0 0 0 0 0 0
##$TUNHIN= 0
##$TUNHOUT= 0
##$TUNXOUT= 0
##$USERA1= <user>
##$USERA2= <user>
##$USERA3= <user>
##$USERA4= <user>
##$USERA5= <user>
##$V9= 5
##$VALIST= <valist>
##$VCLIST= <CCCCCCCCCCCCCCC>
##$VD= 0
##$VDLIST= <DDDDDDDDDDDDDDD>
##$VPLIST= <PPPPPPPPPPPPPPP>
##$VTLIST= <TTTTTTTTTTTTTTT>
##$WBST= 2048
##$WBSW= 25
##$XGAIN= (0..3)
0 0 0 0
##$XL= 0
##$YL= 0
##$YMAX_a= 6226096
##$YMIN_a= -11695267
##$ZGOPTNS= <>
##$ZL1= 120
##$ZL2= 120
##$ZL3= 120
##$ZL4= 120
##$ABSF1= 14.962
##$ABSF2= -5.596182
##$ABSG= 5
##$ABSL= 3
##$ALPHA= 0
##$AQORDER= 0
##$ASSFAC= 0
##$ASSFACI= 0
##$ASSFACX= 0
##$ASSWID= 0
##$AUNMP= <proc_prof1d_extract.lims>
##$AXLEFT= 0
##$AXNAME= <>
##$AXNUC= <1H>
##$AXRIGHT= 0
##$AXTYPE= 0
##$AXUNIT= <>
##$AZFE= 0.1
##$AZFW= 0.1
##$BCFW= 0
##$BC_mod= 0
##$BYTORDP= 0
##$COROFFS= 0
##$CY= 15
##$DATMOD= 1
##$DC= 0
##$DFILT= <>
##$DTYPP= 0
##$F1P= 0
##$F2P= 0
##$FCOR= 0.5
##$FTSIZE= 131072
##$FT_mod= 6
##$GAMMA= 0
##$GB= 0
##$INTBC= 1
##$INTSCL= 1
##$ISEN= 128
##$LB= 0.3
##$LEV0= 0
##$LPBIN= 0
##$MAXI= 10000
##$MC2= 0
##$MEAN= 0
##$ME_mod= 0
##$MI= 0
##$NCOEF= 0
##$NC_proc= -2
##$NLEV= 6
##$NOISF1= 0
##$NOISF2= 0
##$NSP= 0
##$NTH_PI= 0
##$NZP= 0
##$OFFSET= 14.962
##$PC= 1
##$PHC0= -85.06714
##$PHC1= 0
##$PH_mod= 1
##$PKNL= yes
##$PPARMOD= 0
##$PPDIAG= 0
##$PPIPTYP= 0
##$PPMPNUM= 2147483647
##$PPRESOL= 1
##$PSCAL= 4
##$PSIGN= 0
##$PYNMP= <proc.py>
##$REVERSE= no
##$SF= 400.020009237736
##$SI= 131072
##$SIGF1= 0
##$SIGF2= 0
##$SINO= 400
##$SIOLD= 131072
##$SPECTYP= <>
##$SREGLST= <1H.CDCl3>
##$SSB= 0
##$STSI= 131072
##$STSR= 0
##$SW_p= 8223.68421052631
##$SYMM= 0
##$S_DEV= 0
##$TDeff= 65536
##$TDoff= 0
##$TI= <>
##$TILT= no
##$TM1= 0
##$TM2= 0
##$TOPLEV= 0
##$USERP1= <user>
##$USERP2= <user>
##$USERP3= <user>
##$USERP4= <user>
##$USERP5= <user>
##$WDW= 1
##$XDIM= 131072
##$YMAX_p= 373299769
##$YMIN_p= -12429
##$CURPLOT= <Network HP LaserJet P1505>
##$CURPRIN= <$Network HP LaserJet P1505>
##$DFORMAT= <normdp>
##$LAYOUT= <+/1D_H.xwp>
##$LFORMAT= <normlp>
##$PFORMAT= <normpl>
##$SURQMSG= 1
$$ End of Bruker specific parameters
$$ ---------------------------------
##NTUPLES= NMR SPECTRUM
##VAR_NAME=  FREQUENCY,     SPECTRUM/REAL,   SPECTRUM/IMAG
##SYMBOL=    X,             R,               I
##VAR_TYPE=  INDEPENDENT,   DEPENDENT,       DEPENDENT
##VAR_FORM=  AFFN,          ASDF,            ASDF
##VAR_DIM=   131072,        131072,          131072
##UNITS=     HZ,            ARBITRARY UNITS, ARBITRARY UNITS
##FACTOR=    0.0627417313425164, 1,          1
##FIRST=     8223.62146879497, 3097,         -44549
##LAST=      0,             4084,            -44451
##MIN=       0,             -12429,          0
##MAX=       8223.62146879497, 373299769,    0
$$ Real data points
##PAGE= N=1
##DATA TABLE= (X++(R..R)), XYDATA
$$ [...]
63560D14532J4873J5327J5407J4771J3110J0398O875K941q49l862n792o906p579
63547D83246p687o855n266l689k630j967j654k277m427p776j1183j3585j4563
63534C99687j4343j3601j3072j2935j2686j1925j1071j0784j0951j0816j0086
63523B67417r319q964q704q050p053o059n140m267l711l700l890l686l021k375
63509A89478k054j932j824j697j464j009n19l50m94n99n46n12m02R9P94J002O37
63492A78608N23J100J640J481J238J791K600K389J250O25J114J667J376P93P32
63477A98927Q72N19j44m80n08o03n83r2N53P61O64Q38J278J654K248L590N216
63460B14710N985N731N503N960O590O830O860O817O221M959L948M043M914N780
$$ y = [414532, 429405, 444732, 460139, 474910, 488020, 498418, 505293, 508234, 507385, 503523, 497731, 490825, 483246, 475559, 468704, 463438, 459749, 457119, 455152, 453498, 451221, 446794, 439018, 427835, 414250, 399687, 385344, 371743, 358671, 345736, 333050, 321125, 310054, 299270, 288319, 277503, 267417, 258098, 249134, 240430, 232380, 225327, 219268, 214128, 209861, 206150, 202450, 198560, 194874, 191853, 189478, 187424, 185492, 183668, 181971, 180507, 179498, 178979, 178629, 178135, 177536, 176990, 176478, 176076, 176175, 176969, 177971, 178608, 179131, 180231, 181871, 183352, 184590, 186381, 188981, 191370, 192620, 193245, 194359, 196026, 197402, 198195, 198927, 199799, 200318, 200174, 199694, 199186, 198583, 198000, 197908, 198461, 199222, 199886, 200724, 202002, 203656, 205904, 209494, 214710, 220695, 226426, 231929, 237889, 244479, 251309, 258169, 264986, 271207, 276166, 280114, 284157, 289071, 294851]
63446B94851O573P527Q213Q064P519P634Q663R963J1202J2732J4721J6786J8733
63433D33181K0842K3111K4884K5673K5747K5571K5036K3624K0952J6895J1602
63422F77118N796O28l194n934q137r684r996q956p210n562m542m575o040q879
63408F00833j2334j5371j7398j8570j9323j9734j9430j8175j6399j4810j3609
63397D15680j2375j0832r347q332p567o439m801l107j750o03P12K356M172N923
63383C63690P515R066J0713J2264J3239J3442J3338J3608J4370J5157J5599J5836
63371E17837J6247J7083J8321J9513J9742J8188J4933J0900O891L055o29l829
63359F58252o153p524p936p183n388l468k489k645l398m536o440r223j2198j4556
$$ y = [294851, 301424, 308951, 317164, 325228, 332747, 340381, 349044, 359007, 370209, 382941, 397662, 414448, 433181, 454023, 477134, 502018, 527691, 553438, 579009, 604045, 627669, 648621, 665516, 677118, 682914, 683542, 680348, 674414, 666277, 656593, 646597, 637641, 630431, 624869, 620327, 615752, 609712, 600833, 588499, 573128, 555730, 537160, 517837, 498103, 478673, 460498, 444099, 429289, 415680, 403305, 392473, 383126, 374794, 367227, 360788, 355987, 352880, 351130, 350527, 351239, 353595, 357767, 363690, 371205, 380271, 390984, 403248, 416487, 429929, 443267, 456875, 471245, 486402, 502001, 517837, 534084, 551167, 569488, 589001, 608743, 626931, 641864, 652764, 659655, 662710, 662081, 658252, 652099, 644575, 636639, 629456, 624068, 620600, 618111, 615466, 612068, 607532, 601092, 591869, 579671, 565115]
63345E65115j6116j7150j7741j7699j6932j5641j4137j2655j1284r981q705p537
63333C99537o635o031n602n276n050m844m568m386m585n111n508n511n400n518
63319C25512n636n187m013k623j609j084o96p6P82J520J737J382Q32N66P92J260
63303C13459J395O87q03k355l272l619m030m688m996m462l531l077l341l766l823
63288B69778l507l076k685k388k215k126k022j857j639j442j504k051k809k957
63274B37500k065q15k34l09j17O69J235R72N40Q71J720K092J859J942K818L693
63258B52371L691L133L021L601M138M090L837M042M749N471N966O452P122P769
63244C19453Q142Q387Q939J0036J1519J3077J4497J5721J6862J8196J9912K1747
$$ y = [565115, 548999, 531849, 514108, 496409, 479477, 463836, 449699, 437044, 425760, 415779, 407074, 399537, 392902, 386871, 381269, 375993, 370943, 366099, 361531, 357145, 352560, 347449, 341941, 336430, 331030, 325512, 319876, 314689, 310676, 308053, 306444, 305360, 304664, 304588, 305370, 306890, 308627, 310009, 310841, 311407, 312199, 313459, 314854, 315541, 314738, 312383, 309111, 305492, 301462, 296774, 291778, 287316, 283785, 280708, 277367, 273601, 269778, 266271, 263195, 260510, 258122, 255907, 253781, 251759, 249902, 248263, 246821, 245317, 243266, 240457, 237500, 235435, 234620, 234386, 234077, 233960, 234629, 235864, 236836, 237376, 238247, 239967, 242059, 243918, 245860, 248678, 252371, 256062, 259195, 262216, 265817, 269955, 274045, 277882, 281924, 286673, 292144, 298110, 304562, 311684, 319453, 327595, 335982, 344921, 354957, 366476, 379553, 394050, 409771, 426633, 444829, 464741, 486488]
63232D86488K3038K3349K3009K2809K3181K3724K3709K2856K1597K0636K0345
63221G34741K0672K1388K2334K3346K4142K4415K4040K3125K1839K0230J8188
63210I78460J5442J1637O615P13n280j0694j5428j9755k3707k6810k8556k9011
63198H53626k8796k8491k8111k7231k5406k2453j8494j3936r402n457k261M08
63186F43996K850N174P414R637J1896J4078J5948J7324J8165J8612J9014J9715
63174H03823K0672K1342K1205K0348J9368J8661J8048J7106J5638J3631J1013
63163A000855P770M188O09l098p478j2666j7864k1970k4627k6341k7577k8245
63151H43556k8154k7521k6622k5286k3217k0706j8480j6851j5432j3770j1883
$$ y = [486488, 509526, 532875, 555884, 578693, 601874, 625598, 649307, 672163, 693760, 714396, 734741, 755413, 776801, 799135, 822481, 846623, 871038, 895078, 918203, 940042, 960272, 978460, 993902, 1005539, 1012154, 1012867, 1007587, 996893, 981465, 961710, 938003, 911193, 882637, 853626, 824830, 796339, 768228, 740997, 715591, 693138, 674644, 660708, 651306, 645849, 643588, 643996, 646846, 652020, 659434, 669071, 680967, 695045, 710993, 728317, 746482, 765094, 784108, 803823, 824495, 845837, 867042, 887390, 906758, 925419, 943467, 960573, 976211, 989842, 1000855, 1008625, 1012813, 1013422, 1010324, 1002846, 990180, 972316, 950346, 925719, 899378, 871801, 843556, 815402, 787881, 761259, 735973, 712756, 692050, 673570, 656719, 641287, 627517, 615634]
63140F15634r942p960n979m270k968j764k90J306K428K608J876P51q5l30m78j368
63124E89169l084m604m897m104l210k878k992l199l276l058k578k210k218k202
63110E44659j597o30j25k55k39M89J482K054K268K573K974L137L077L094L223
63095E66184L219L046K920K898K808K593K400K301K261K341K632L008L219L220
63081F05050L139K973K650K416K780L876N170N958O047N870O030O764P769Q549
63067F75041R025R700J1051J2888J4619J6077J7718J9892K2311K4437K6058K7349
63055H86166K8561K9981L1987L4772L8051M1225M3849M5796M7096M7800M7993
63044A323277M7757M7117M6188M5248M4538M3996M3419M2887M2788M3327M4192
$$ y = [615634, 605692, 597732, 591753, 587483, 584515, 582751, 582461, 583767, 586195, 588803, 590679, 591430, 591345, 591015, 590537, 589169, 586085, 581481, 576584, 572480, 569270, 566392, 563400, 560201, 556925, 553867, 551289, 549079, 546861, 544659, 543062, 542432, 542307, 542052, 541813, 542302, 543784, 545838, 548106, 550679, 553653, 556790, 559867, 562961, 566184, 569403, 572449, 575369, 578267, 581075, 583668, 586068, 588369, 590630, 592971, 595603, 598611, 601830, 605050, 608189, 611162, 613812, 616228, 619008, 622884, 628054, 634012, 640059, 645929, 651959, 658723, 666492, 675041, 684066, 693766, 704817, 717705, 732324, 748401, 766119, 786011, 808322, 832759, 858817, 886166, 914727, 944708, 976695, 1011467, 1049518, 1090743, 1134592, 1180388, 1227484, 1275284, 1323277, 1371034, 1418151, 1464339, 1509587, 1554125, 1598121, 1641540, 1684427, 1727215, 1770542, 1814734]
63033A814734M4726M4315M2528L9208L4499K8721K1950J3851M095p094j8921l0440
63021B032172m0885m9728n6716o1893o5398o7208o7210o5452o2201n7736n2332
63010A385413m6396m0308l4110k7652k1098j4928r293l772J871P147J1488J5138
62998A223500J8823K2655K5951K8212K9702L0871L1721L2076L2095L2115L2166
62987A539887L1970L1272K9970K7948K5014K0918J5407Q501Q04o792j4030k1579
62975A689290k9996l8628m6072n1656n5897n9510o2439o4128o4245o2887o0387
62964A093445n7260n4115n1245m8404m5190m1601l7973l4550l1381k8532k6084
62953F37110k3925k1776j9531j7397j5671j4536j3965j3703j3317j2504j1384
$$ y = [1814734, 1859460, 1903775, 1946303, 1985511, 2020010, 2048731, 2070681, 2084532, 2088627, 2081533, 2062612, 2032172, 1991287, 1941559, 1884843, 1822950, 1757552, 1690344, 1623134, 1557682, 1495481, 1437745, 1385413, 1339017, 1298709, 1264599, 1236947, 1215849, 1200921, 1191628, 1187856, 1189727, 1196874, 1208362, 1223500, 1242323, 1264978, 1290929, 1319141, 1348843, 1379714, 1411435, 1443511, 1475606, 1507721, 1539887, 1571857, 1603129, 1633099, 1661047, 1686061, 1706979, 1722386, 1730887, 1731691, 1724899, 1710869, 1689290, 1659294, 1620666, 1574594, 1522938, 1467041, 1407531, 1345092, 1280964, 1216719, 1153832, 1093445, 1036185, 982070, 930825, 882421, 837231, 795630, 757657, 723107, 691726, 663194, 637110, 613185, 591409, 571878, 554481, 538810, 524274, 510309, 496606, 483289, 470785, 459401]
62942D59401j0268r193p943o598n623n246n014m331l279k533k537l021l354l165
62928C87296k554j904j569j582j705j785k017k637l479m028l953l438k895k625
62914C51125k669k834k799k408j942j837k150k480k548k506k517k332j591m42
62900C20070M98Q01O60N83P74Q66L67o42j397j259m96M4Oj31R1M91O86P74J051
62881C23837J335J115L21m66o52j83N08Q79O68J24k10j25K3j10k97r7L95O49M54
62862C28168J01j82m95q86j202j421j766k252k528k325j834j458j426j761k357
62847C06376k888k969k541j921j381r49o77p17r36q43k42L27J87n89j265j294
62831B87678p53L8Q73J609K019K008J835J911K363K902L187L249L442L913M309
$$ y = [459401, 449133, 439940, 431997, 425399, 419776, 414530, 409516, 405185, 401906, 399373, 396836, 393815, 390461, 387296, 384742, 382838, 381269, 379687, 377982, 376197, 374180, 371543, 368064, 364036, 360083, 356645, 353750, 351125, 348456, 345622, 342823, 340415, 338473, 336636, 334486, 332006, 329458, 326952, 324435, 322103, 320512, 320070, 320568, 321369, 322029, 322612, 323386, 324252, 324619, 323977, 322580, 321321, 320825, 320869, 320875, 320744, 320835, 321326, 322012, 322786, 323837, 325172, 326287, 326608, 326142, 325490, 325307, 325815, 326694, 327362, 327486, 327276, 327151, 327174, 327064, 326767, 326670, 327065, 327714, 328168, 328269, 328087, 327592, 326706, 325504, 324083, 322317, 320065, 317537, 315212, 313378, 311920, 310494, 308733, 306376, 303488, 300519, 297978, 296057, 294676, 293727, 293050, 292333, 291397, 290554, 290312, 290639, 290826, 290237, 288972, 287678, 286925, 286963, 287836, 289445, 291464, 293472, 295307, 297218, 299581, 302483, 305670, 308919, 312361, 316274, 320583]
62816C20583M147L424K683K397K476K512K433K737L911N637O862O866O189O086
62802C78943P081Q468R416J0061J1101J2722J4501J6187J7991K0131K2595K5335
62790E54532K8275L1171L3960L7187M1481M6560N1364N5357N9097O3300O7917
62779A070201P2495P6943Q1277Q4886Q6579Q5519Q1838P6241O9112O0091M8677
62768A893859L5196K0800O368q114k2647l6263m7766n7110o5135p2020p7048p9975
62756A490145q1432q1675q0045p6367p1820o7717o4151o0579n6943n3312m9150
62745G46954m3998l8568l4140l1103k8848k6772k4626k2170j9369j6760j4835
62734D45765j3280j1513r747q586p877o918n621m521l629k385p88M95J331K372
$$ y = [320583, 324730, 328154, 330837, 333234, 335710, 338222, 340655, 343392, 347303, 352940, 359802, 366668, 372857, 378943, 386024, 394492, 403908, 413969, 425070, 437792, 452293, 468480, 486471, 506602, 529197, 554532, 582807, 613978, 647938, 685125, 726606, 773166, 824530, 879887, 938984, 1002284, 1070201, 1142696, 1219639, 1300916, 1385802, 1472381, 1557900, 1639738, 1715979, 1785091, 1845182, 1893859, 1929055, 1949855, 1956223, 1948109, 1925462, 1889199, 1841433, 1784323, 1719188, 1647168, 1570120, 1490145, 1408713, 1327038, 1246993, 1170626, 1098806, 1031089, 966938, 906359, 849416, 796104, 746954, 702956, 664388, 630248, 599145, 570297, 543525, 518899, 496729, 477360, 460600, 445765, 432485, 420972, 411225, 402639, 394762, 387844, 382223, 377702, 374073, 371688, 370900, 371395, 372726, 375098]
62720C75098L829N055N773O699Q331R978J0827J1287J2493J4889J8010K1391K4848
62707E28508K8077L0701L2873L5372L8874M3288M7912N2101N5811N9485O3310
62696A016312O6700O8782O9232O8268O5822O1347N4584M5983L6053K4864J2595
62685A590542J36j1511k2181l2358m2094n0680n7431o2372o5894o8039o8475o7130
62673A042513o4571o1547n8242n4343m9902m5677m2255l9182l5581l1528k8023
62662E31662k5509k3222k0424j7560j5567j4461j3444j2193j1271j1056j0992
62651C55963j0295r063q168q081q221p603o012m263l350l494m042m130l383k166
62637B73692j329j478k305k773k198j024k73l99j036j636j906j651p74M32J420
$$ y = [375098, 378927, 383982, 389755, 396454, 404785, 414763, 425590, 436877, 449370, 464259, 482269, 503660, 528508, 556585, 587286, 620159, 655531, 694405, 737693, 785605, 837706, 893517, 953002, 1016312, 1083012, 1151794, 1221026, 1289294, 1355116, 1416463, 1471047, 1517030, 1553083, 1577947, 1590542, 1590678, 1579167, 1556986, 1524628, 1482534, 1431854, 1374423, 1312051, 1246157, 1178118, 1109643, 1042513, 977942, 916395, 858153, 803810, 753908, 708231, 665976, 626794, 591213, 559685, 531662, 506153, 482931, 462507, 444947, 429380, 414919, 401475, 389282, 378011, 366955, 355963, 345668, 336605, 328437, 320356, 312135, 304532, 298520, 294257, 290907, 287413, 283371, 279241, 275858, 273692, 272363, 270885, 268580, 265807, 263609, 262585, 262312, 261913, 260877, 259241, 257335, 255684, 254910, 255342, 256762]
62622B56762J940K167K221J996J645J717K573L876M977N604N975O445P202Q167
62608C13267R110R892J0674J1722J3184J5130J7625K0379K2617K3974K5332K8008
62596E20914L2029L6002L8882M1002M2901M4029M3395M0954L7534L3614K8948
62585I40204K3212J6424Q735M62p757j5206k1606k7011l1335l4396l6373l7683
62573G77670l8429l8304l7153l5210l2833l0248k7669k5271k2999k0675j8375
62562D50504j6432j5003j3799j2409j0745r117p976p482p310o930o186n447n084
62549C26584m987m830m594m439m222l608k680j999j931k235k453k364j880q14
62535B83548Q32K488L341L182K683K724L630N172P115R360J1660J3590J5016J6305
$$ y = [256762, 258702, 260869, 263090, 265086, 266731, 268448, 271021, 274897, 279874, 285478, 291453, 297898, 305100, 313267, 322377, 332269, 342943, 354665, 367849, 382979, 400604, 420983, 443600, 467574, 492906, 520914, 552943, 588945, 627827, 668829, 711730, 755759, 799154, 840108, 877642, 911256, 940204, 963416, 979840, 988575, 989037, 981280, 966074, 944468, 917457, 886122, 851726, 815353, 777670, 739241, 700937, 663784, 628574, 595741, 565493, 537824, 512553, 489554, 468879, 450504, 434072, 419069, 405270, 392861, 382116, 372999, 365023, 357541, 350231, 343301, 337115, 331668, 326584, 321597, 316767, 312173, 307734, 303512, 299904, 297224, 295225, 293294, 291059, 288606, 286242, 284362, 283548, 284380, 286868, 290209, 293391, 296074, 298798, 302428, 307600, 314715, 324075, 335735, 349325, 364341, 380646]
62521C80646J7836J9603K1476K3612K6181K8860L1041L2581L3922L5497L7285
62510F88540L8838L9388L8092L4711L0058K5180K0130J4100O897n15p152j2950
62498I15317j8151k2442k5415k7421k9160l0654l1206l0404k8686k6945k5855
62487F18978k5406k4866k3448k1261j9280j8017j6794j4804j2536j1294j1419
62476D19853j1762j1034r157p133n935n714n837n583m870m176l733l191k322j546
62462C37860j262j059k45J121K407L427M454N384N690N406N348O047P032P574
62448C89184P636P734Q141Q579Q593P993P001N935M714K896L94k183m277o105
62434D46235q028r538r820r123q670q989r358r113q605q316p920o946n693m760
$$ y = [380646, 398482, 418085, 439561, 463173, 489354, 518214, 549255, 581836, 615758, 651255, 688540, 727378, 766766, 804858, 839569, 869627, 894807, 914937, 929037, 935934, 935419, 928267, 915317, 897166, 874724, 849309, 821888, 792728, 762074, 730868, 700464, 671778, 644833, 618978, 593572, 568706, 545258, 523997, 504717, 486700, 469906, 455102, 442566, 431272, 419853, 408091, 397057, 387900, 380767, 374832, 369118, 363281, 357698, 352828, 348652, 344919, 341728, 339406, 337860, 336598, 335539, 335294, 336415, 338822, 342249, 346703, 352087, 357777, 363183, 368531, 374578, 381610, 389184, 396820, 404554, 412695, 421274, 429867, 437860, 444861, 450796, 455510, 458406, 458800, 456617, 452340, 446235, 438207, 428669, 418849, 409726, 401056, 392067, 382709, 373596, 364991, 356675, 348755, 341809, 336116, 331356]
62420C31356m149l540k955k470j651j35J452K065J643J180J336J731J823J770
62406C29456K051K678L214L407L434L570L838M074M277M724N536O230O106N273
62392C87868M733N084N621N362M587M438N110N478M745L609L250L901M921N798
62378D54505O422O824P314Q553J0753J3076J4558J5449J6881J9281K2013K4629
62366F20258K7512L0873L4054L6372L8007L9315L9827L8768L6236L3062K9562
62355A003846K5177J9468J2899O518J265k413m758o691r222j2721j6832k0937
62343I95599k4383k6569k7382k7485k7616k7669k7013k5637k4215k3009k1570
62332G13051j9719j8044j6979j6142j5092j4093j3635j3621j3615j3459j3114
$$ y = [331356, 327207, 323667, 320712, 318242, 316591, 316456, 317908, 319973, 321616, 322796, 324132, 325863, 327686, 329456, 331507, 334185, 337399, 340806, 344240, 347810, 351648, 355722, 359999, 364723, 370259, 376489, 382595, 387868, 392601, 397685, 403306, 408668, 413255, 417693, 422803, 428281, 433026, 436635, 439885, 443786, 448707, 454505, 460927, 467751, 475065, 483618, 494371, 507447, 522005, 537454, 554335, 573616, 595629, 620258, 647770, 678643, 712697, 749069, 787076, 826391, 866218, 904986, 941222, 974284, 1003846, 1029023, 1048491, 1061390, 1067908, 1069173, 1066760, 1062002, 1055311, 1046089, 1033368, 1016536, 995599, 971216, 944647, 917265, 889780, 862164, 834495, 807482, 781845, 757630, 734621, 713051, 693332, 675288, 658309, 642167, 627075, 612982, 599347, 585726, 572111, 558652, 545538]
62321E45538j2396j1378j0649j0508j0280r125p221n470m250l201k128j385j164
62308D56383j034m01Q51K272L196L297K981L046L688M189L918L263L072L502M045
62293D96268M409M675M765M504M206M481N420O453P091P270P087O724O651P228
62279E77232Q046Q296P824P328P429Q149R355J1071J3173J5351J7590K0195K3153
62266G34192K5989K8387L0566L2851L5317L7920M0484M2460M3094M1989L9183
62255A132432L4787K9108K2972J7248J1949O510R79l883p847j1754j6412k1700
62243A194389k6960l1596l4928l6335l6103l5387l4786l3613l1164k8025k5322
62232H40170k3241k1145j8803j6626j4867j3336j1910j0681r602q435p098n759
$$ y = [545538, 533142, 521764, 511115, 500607, 490327, 481202, 473981, 468511, 464261, 461060, 458932, 457547, 456383, 455349, 454948, 455799, 458071, 461267, 464564, 467545, 470591, 474279, 478468, 482386, 485649, 488721, 492223, 496268, 500677, 505352, 510117, 514621, 518827, 523308, 528728, 535181, 542272, 549542, 556629, 563353, 570004, 577232, 585278, 593574, 601398, 608726, 616155, 624304, 633659, 644730, 657903, 673254, 690844, 711039, 734192, 760181, 788568, 819134, 851985, 887302, 925222, 965706, 1008166, 1051260, 1093249, 1132432, 1167219, 1196327, 1219299, 1236547, 1248496, 1255006, 1255985, 1252102, 1244255, 1232501, 1216089, 1194389, 1167429, 1135833, 1100905, 1064570, 1028467, 993080, 958294, 924681, 893517, 865492, 840170, 816929, 795784, 776981, 760355, 745488, 732152, 720242, 709561, 699959, 691524, 684426, 678667]
62220F78667m606l754l253k895k266j245k12M48Q34J277J868K565L384M234M743
62205F79789M636M012L143K340K113K870M156M906M811M793N587O655P195P522
62191G44528Q389R531J0075J0124J0707J2103J3320J3550J3157J2848J2705J2486
62179H83523J2352J2770J4016J6036J8591K1294K3861K6337K8796L0875L2069
62168A120520L2422L2347L1680K9539K5443K0045J4480R439N169J861n32k618
62156A319795n131q198j1308j3972j6138j7970j9479k0467k0768k0403j9460j7927
62144A128574j5823j3534j1709j0574r619q292o868o171o421o912o944o663o637
62131A012407o930p008o549n892n483n047l703j065K077M437N526N791N497M173
$$ y = [678667, 674061, 670307, 667054, 664159, 661893, 660648, 660436, 660884, 661718, 662995, 664863, 667428, 670812, 675046, 679789, 684425, 688437, 691580, 693920, 696033, 698903, 703059, 707965, 712776, 717569, 723156, 729811, 737006, 744528, 752917, 762448, 772523, 782647, 793354, 805457, 818777, 832327, 845484, 858332, 871037, 883523, 895875, 908645, 922661, 938697, 957288, 978582, 1002443, 1028780, 1057576, 1088451, 1120520, 1152942, 1185289, 1216969, 1246508, 1271951, 1291996, 1306476, 1315915, 1321084, 1322945, 1322413, 1319795, 1314664, 1306466, 1295158, 1281186, 1265048, 1247078, 1227599, 1207132, 1186364, 1165961, 1146501, 1128574, 1112751, 1099217, 1087508, 1076934, 1067315, 1059023, 1052155, 1045984, 1039563, 1032651, 1025707, 1019044, 1012407, 1005477, 998469, 991920, 986028, 980545, 975498, 971795, 970730, 972807, 977244, 982770, 988561, 994058, 998231]
62117I98231J511j656l976m895m771l914k305l82O34l09l119o750j0078j2348
62103I45873j3178j2603j1125r474q175p331o721o064n203m129k922j726p44o6
62089H56412M89J171J925K492K930L693M966O302P233P877Q600R399J0087J0807
62075I34383J1838J3106J4432J5997J7986J9853K0668K0174J8906J7217J4922
62064A119482J2042R062O179K872j233n569r172j1741j3731j5628j7592j9654
62052A055317k1801k3853k5532k6687k7379k7661k7410k6381k4555k2375k0433
62041G81250j8778j6920j4773j3208j3016j3563j3372j2039j0665j0124r838q884
62029F26070p590p091p679q507q814q669q402q055p689p612p848p770o804n327
$$ y = [998231, 999742, 998086, 994110, 989215, 984444, 980530, 978225, 977843, 978477, 978168, 975049, 968299, 958221, 945873, 932695, 920092, 908967, 899493, 891318, 883987, 877266, 871202, 865999, 861870, 858948, 857222, 856478, 856412, 856901, 858072, 859997, 862489, 865419, 869112, 874078, 880380, 887613, 895490, 904090, 913489, 923576, 934383, 946221, 959327, 973759, 989756, 1007742, 1027595, 1048263, 1068437, 1087343, 1104560, 1119482, 1131524, 1140586, 1146765, 1149637, 1148404, 1142835, 1133663, 1121922, 1108191, 1092563, 1074971, 1055317, 1033516, 1009663, 984131, 957444, 930065, 902404, 874994, 848613, 824058, 801683, 781250, 762472, 745552, 730779, 717571, 704555, 690992, 677620, 665581, 654916, 644792, 634954, 626070, 618480, 611389, 603710, 595203, 586389, 577720, 569318, 561263, 553574, 545962, 538114, 530344, 523540, 518213]
62015E18213m416m538n004m944m394m032m001l748l024k367k180j997j270l95
62001D71903j96o49r78r41j063j534j789j562j468k043k900l437l771m305m821
61986D40446m762m165l596l303l091k839k626k315j636p15n7J10O1P4Q8l3j93
61969D11448j23M15J429K492K902K352J452J162J774K752L542M078M462M645M694
61954D49476N014N947P270Q342Q717Q519Q299Q632R710J1271J2853J4169J5126
61941E73345J5646J5759J5773J6089J6801J7666J8485J9234J9780J9824J9354
61930G67756J8862J8861J9351J9972K0568K1278K2217K3373K4815K6773K9363
61919A013189L2462L5930L9793M4128M8840N3716N8650O3721O9020P4529Q0116
$$ y = [518213, 513797, 509259, 504255, 499311, 494917, 490885, 486884, 483136, 480112, 477745, 475565, 473568, 472298, 471903, 471707, 471058, 470080, 469139, 468076, 466542, 464753, 463191, 461723, 459680, 456780, 453343, 449572, 445267, 440446, 435684, 431519, 427923, 424620, 421529, 418690, 416064, 413749, 412113, 411398, 411341, 411451, 411512, 411586, 411674, 411641, 411448, 411325, 411740, 413169, 415661, 418563, 420915, 422367, 423529, 425303, 428055, 431597, 435675, 440137, 444782, 449476, 454490, 460437, 467707, 476049, 484766, 493285, 501584, 510216, 519926, 531197, 544050, 558219, 573345, 588991, 604750, 620523, 636612, 653413, 671079, 689564, 708798, 728578, 748402, 767756, 786618, 805479, 824830, 844802, 865370, 886648, 908865, 932238, 957053, 983826, 1013189, 1045651, 1081581, 1121374, 1165502, 1214342, 1268058, 1326708, 1390429, 1459449, 1533978, 1614094]
61908A614094Q5608R0774R5356R9234J02525J05407J07780J09082J08512J05454
61898B623826R9733R1487Q0788O7460N1324L2742J2763p449k7293m6639o5014
61887B913728q1123r3592j02150j07847j11884j14368j14413j11463j06301j00543
61877A870044r5184q9935q4088p7729p1685o6432o1546n6453n1296m6679m2751
61866A126266l9048l5176l1243k7483k3853k0224j6757j3745j1142q540n644k600
61854H90811J82K424M162N569O712P454P656P382O821N975M672K942J183k62j472
61839I52211k585l262k994j904p24K08J460L618O249Q272R211R578J0022J0488
61825I99848J0298Q787N807J846k214n652q265j0130j1119j0980r874q488p455
$$ y = [1614094, 1699702, 1790476, 1885832, 1985066, 2087591, 2192998, 2300778, 2409860, 2518372, 2623826, 2723559, 2815046, 2895834, 2963294, 3014618, 3047360, 3060123, 3052674, 3025381, 2978742, 2913728, 2832605, 2739013, 2636863, 2529016, 2417132, 2302764, 2188351, 2076888, 1970587, 1870044, 1774860, 1684925, 1600837, 1523108, 1451423, 1384991, 1323445, 1266992, 1215696, 1169017, 1126266, 1087218, 1052042, 1020799, 993316, 969463, 949239, 932482, 918737, 907595, 899055, 893411, 890811, 890993, 893417, 897579, 903148, 909860, 917314, 924970, 932352, 939173, 945148, 949820, 952762, 953945, 953683, 952211, 949626, 946364, 943370, 941466, 940742, 940950, 942410, 946028, 952277, 960549, 969760, 979338, 989360, 999848, 1010146, 1018933, 1024740, 1026586, 1024372, 1018720, 1010455, 1000325, 989206, 978226, 968352, 959864, 952409]
61812I52409o773n877m169j472J831N100P991J0585J2964J4973J6685J8710K1449
61799A044406K4325K6484K8138L0344L3428L6593L9410M2604M6782N1311N5334
61788A459159N9279O4286P0600P7455Q4316R1266R8326J05429J13086J22086J32311
61777B477599J42625J52249J61490J70738J79443J86552J91481J94147J94294
61768D050618J91133J83542J70466J51455J27054R8346O6082L0689o743m3984
61758E018658p8684j09540j36176j58279j75364j87253j94302j97150j96538j93238
61748C392134j87784j80308j70946j60449j50027j40419j31362j22183j12825
61739B035831j03988r6329q9703q3432p7165p1171o5793o0907n6121n1324m6726
$$ y = [952409, 945636, 939759, 935590, 934118, 935949, 941049, 949040, 959625, 972589, 987562, 1004247, 1022957, 1044406, 1068731, 1095215, 1123353, 1153697, 1187125, 1223718, 1263128, 1305732, 1352514, 1403825, 1459159, 1518438, 1582724, 1653324, 1730779, 1815095, 1906361, 2004687, 2110116, 2223202, 2345288, 2477599, 2620224, 2772473, 2933963, 3104701, 3284144, 3470696, 3662177, 3856324, 4050618, 4241751, 4425293, 4595759, 4747214, 4874268, 4972614, 5038696, 5069385, 5062642, 5018658, 4939974, 4830434, 4694258, 4535979, 4360615, 4173362, 3979060, 3781910, 3585372, 3392134, 3204350, 3024042, 2853096, 2692647, 2542620, 2402201, 2270839, 2148656, 2035831, 1931843, 1835514, 1745811, 1662379, 1585214, 1514043, 1448250, 1387343, 1331222, 1279898, 1233172]
61728A233172m2580l9002l5977l3338l0856k8511k6535k4986k3539k1937k0357
61717I05554j9004j7663j6185j5074j4944j5474j5575j4718j3490j2672j2346
61706G38409j2124j1747j1191j0530r964r665r455q924q033p205o707o347o000
61693F20517n968o496p283p802p876p663p295o766o110n452m977m805m805m588
61679E32631m013l507l469l500k838j651j132k042l755n078n561n665n983o705
61665D77732p483p601o689n428m996n551n893m995l226j535j19J322K596L237
61651D31371L476M091N158N780N181L557J625j85j812l170l985m067l731l769
61637D39520m692n912o129m844l050k039j966k085k025k027k128j975j554j395
$$ y = [1233172, 1190592, 1151590, 1115613, 1082275, 1051419, 1022908, 996373, 971387, 947848, 925911, 905554, 886550, 868887, 852702, 837628, 822684, 807210, 791635, 776917, 763427, 750755, 738409, 726285, 714538, 703347, 692817, 682853, 673188, 663733, 654809, 646776, 639571, 632864, 626517, 620517, 614549, 608053, 600770, 592968, 585092, 577429, 570134, 563368, 557258, 551806, 546829, 542024, 537219, 532631, 528618, 525111, 521642, 518142, 515304, 513653, 512521, 510479, 506724, 501646, 496085, 490420, 484437, 477732, 470249, 462648, 455959, 450531, 445535, 439984, 434091, 429096, 425870, 424335, 424216, 425538, 428134, 431371, 434847, 438938, 444096, 449876, 455057, 458614, 460239, 460054, 458242, 455072, 451087, 447020, 443289, 439520, 434828, 428916, 422787, 417943, 414893, 412854, 410888, 408803, 406778, 404751, 402623, 400648, 399094, 397699]
61623C97699j753k092j774r05j90o4l04l75o0L16K32m98j567k567l330l834l979
61606C74955l719l253k900k802k864k860k559j985j580j762k220k058r61K59O56
61591C44347L65K64P29J329J678J939K392K986L584M305N351O573P379P221O255
61576C96697N412N493O249O829P181Q234J0368J2404J2951J2306J2096J3207J4919
61563E24346J6145J6655J6784J6657J6165J5341J4289J2929J1109Q909O638M654
61551F80621L198K321J842J479R95L48k30l16K49R07P55m17j781k469k513k437
61535F82552k370k139j978k410l378m114l985l114k068j346j112j093o46P00K673
61520F56172M514N807O798P884R149J0426J1697J3305J5786J9283K3053K5938
$$ y = [397699, 395946, 393854, 392080, 391175, 390985, 390921, 390617, 390242, 390182, 390498, 390730, 390232, 388665, 386098, 382768, 378934, 374955, 371236, 367983, 365083, 362281, 359417, 356557, 353998, 352013, 350433, 348671, 346451, 344393, 343432, 343691, 344347, 344712, 344976, 345705, 347034, 348712, 350651, 353043, 356029, 359613, 363918, 369269, 375842, 383221, 390442, 396697, 402109, 407602, 413851, 420680, 427861, 436095, 446463, 458867, 471818, 484124, 496220, 509427, 524346, 540491, 557146, 573930, 590587, 606752, 622093, 636382, 649311, 660420, 669329, 675967, 680621, 683819, 686140, 687982, 689461, 690456, 690804, 690574, 690258, 690507, 691414, 692169, 691752, 689971, 687502, 684989, 682552, 680182, 678043, 676065, 673655, 670277, 666163, 662178, 659064, 656996, 655650, 654538, 653445, 652799, 653499, 656172, 660686, 666493, 673291, 681175, 690324, 700750, 712447, 725752, 741538, 760821, 783874, 809812]
61508H09812K7689K9416L2302L6231M0235M3972M7935N2363N6755O0624O3971
61497A301305O6743O8493O8993O8629O7766O5936O2159N6015M8122L9563L0977
61486A944701K2316J3473M917k552q613j3560j7526k0110k1088k0971k0333j9113
61474A841541j7152j5075j3767j3282j3090j3223j4309j6436j8862k1030k3102
61463A662213k5271k7178k8310k8408k7326k5060k2172j9509j7229j4642j1248
61452A415860p412l699j47L414O813R828J2662J5683J8903K2068K5095K8099L1000
61439A578167L3314L4244L2969K9005K2531J4406N933j411o501r163j0106r946
61427A713442q633o201l577j769n10J377M272P306R718J1684J3425J4263J3068
$$ y = [809812, 837501, 866917, 899219, 935450, 975685, 1019657, 1067592, 1119955, 1176710, 1237334, 1301305, 1368048, 1436541, 1505534, 1574163, 1641929, 1707865, 1770024, 1826039, 1874161, 1913724, 1944701, 1967017, 1980490, 1985407, 1982855, 1974242, 1960682, 1943156, 1923046, 1901958, 1880987, 1860654, 1841541, 1824389, 1809314, 1795547, 1782265, 1769175, 1755952, 1741643, 1725207, 1706345, 1685315, 1662213, 1636942, 1609764, 1581454, 1553046, 1525720, 1500660, 1478488, 1458979, 1441750, 1427108, 1415860, 1408448, 1404749, 1404602, 1408016, 1414829, 1424657, 1437319, 1453002, 1471905, 1493973, 1519068, 1547167, 1578167, 1611481, 1645725, 1678694, 1707699, 1730230, 1744636, 1750569, 1749158, 1742657, 1733494, 1723388, 1713442, 1704809, 1698608, 1695031, 1693262, 1692752, 1694129, 1698401, 1705707, 1715425, 1727109, 1740534, 1754797, 1767865]
61414A767865R103K207p063j7006k5266l0402l2768l3462l2985l1333k8835k6168
61402A513887k3745k1655j9973j8710j7565j6154j4451j2679j0912r015o900m636
61390A337492k346k2K531N563R001J2425J5672J9241K3635K8515L3073L7127M1144
61377A563051M5284M9200N2714N5921N8481N9753N9834N9556N9060N7245N3144
61366B173243M7078L9914L2041K3625J5150O832j817j1098k0235k8187l4933m1150
61354B200463m6966n1803n5331n7807n9532o0499o0606n9806n8205n6195n4231
61343A579482n2208m9472m5806m1875l8344l5030l1532k8147k5378k2912j9896
61332A188882j6134j2279q979o365m262k363k19K338M831O684Q075R743J1970
$$ y = [1767865, 1776968, 1779175, 1772112, 1755106, 1729840, 1699438, 1666670, 1633208, 1600223, 1568890, 1540055, 1513887, 1490142, 1468487, 1448514, 1429804, 1412239, 1396085, 1381634, 1368955, 1358043, 1349028, 1342128, 1337492, 1335146, 1335124, 1337655, 1343218, 1352219, 1364644, 1380316, 1399557, 1423192, 1451707, 1484780, 1521907, 1563051, 1608335, 1657535, 1710249, 1766170, 1824651, 1884404, 1944238, 2003794, 2062854, 2120099, 2173243, 2220321, 2260235, 2292276, 2315901, 2331051, 2337883, 2336066, 2324968, 2304733, 2276546, 2241613, 2200463, 2153497, 2101694, 2046363, 1988556, 1929024, 1868525, 1807919, 1748113, 1689908, 1633713, 1579482, 1527274, 1477802, 1431996, 1390121, 1351777, 1316747, 1285215, 1257068, 1231690, 1208778, 1188882, 1172748, 1160469, 1151490, 1145125, 1140863, 1138500, 1138281, 1140619, 1145450, 1152134, 1160209, 1169952, 1181922]
61319A181922J4218J5830J6685J7126J7478J7700J7379J6212J4488J2804J1286
61308A353128R600P835O686O358O100N411N024N766P001P203N925M199L046K462
61294A435744J913R90o10l017n796q066r263r489r125q476p774p098o314n384
61280A358235m659m431m357l846k837j703n26Q79K309L163L186K646J722L19j429
61265A348671l096m605o305q130r201q706o825m445k248l55J386L218N491Q494
61251A313344J2186J6223K0308K4445K8829L3523L8323M2920M7083N0362N1708
61240A679254M9727M3644L3965K2189J0082r04j0006j7335k3478k8682l2520l4518
61228A691418l4684l3288l0495k6559k2019j7297j2381p298k775k3m4l193r140
$$ y = [1181922, 1196140, 1211970, 1228655, 1245781, 1263259, 1280959, 1298338, 1314550, 1329038, 1341842, 1353128, 1362728, 1370563, 1377249, 1383607, 1389707, 1395118, 1400142, 1405908, 1412909, 1420112, 1426037, 1430236, 1433282, 1435744, 1437657, 1438647, 1438037, 1435020, 1429224, 1421158, 1411895, 1402406, 1393281, 1384805, 1377031, 1369933, 1363619, 1358235, 1353576, 1349145, 1344788, 1340942, 1338105, 1336402, 1335876, 1336755, 1339064, 1342227, 1345413, 1348059, 1349781, 1350100, 1348671, 1345575, 1340970, 1334665, 1326535, 1317334, 1308628, 1301803, 1297358, 1295110, 1294755, 1296141, 1299359, 1304850, 1313344, 1325530, 1341753, 1362061, 1386506, 1415335, 1448858, 1487181, 1530101, 1577184, 1627546, 1679254, 1728981, 1772625, 1806590, 1828779, 1838861, 1837957, 1827951, 1810616, 1787138, 1758456, 1725936, 1691418, 1656734, 1623446, 1592951, 1566392, 1544373, 1527076, 1514695, 1507397, 1504622, 1504599, 1504555, 1501362, 1492222]
61215A492222j6793k4536l0883l4999l6573l5659l2834k8987k4647j9805j4716
61204A191790j0267p234n605n020n231n636n130l345j480r97j719k242j953j694
61190A134237k335l723n337p081r029j0875j2170j2876j3362j3987j4798j5588
61178A013076j6120j6287j6032j5275j4151j3211j2921j2951j2494j1383j0235
61167H62016r385q459p311o527o395o263n595m976n248o334p764r691j2382j5136
61153G50550j6870j7523j7908j8385j8613j8384j7780j6646j4800j2705j1135
61142E69801j0236r613r083q641p943o663n236m390m153l973l626l189k491j443
61128D89121m94Q8J000K902M963N753N377N456O884Q763R776R650R026Q682Q994
$$ y = [1492222, 1475429, 1450893, 1420010, 1385011, 1348438, 1312779, 1279945, 1250958, 1226311, 1206506, 1191790, 1181523, 1174289, 1168684, 1163664, 1158433, 1152797, 1147667, 1144322, 1142842, 1141845, 1140126, 1137884, 1135931, 1134237, 1131902, 1128179, 1122842, 1115761, 1106732, 1095857, 1083687, 1070811, 1057449, 1043462, 1028664, 1013076, 996956, 980669, 964637, 949362, 935211, 922000, 909079, 896128, 883634, 872251, 862016, 852631, 844172, 836861, 830334, 823939, 817676, 812081, 807105, 801857, 795523, 787759, 778068, 765686, 750550, 733680, 716157, 698249, 679864, 661251, 642867, 625087, 608441, 593641, 580936, 569801, 559565, 549952, 540869, 532228, 524285, 517622, 512386, 507996, 503843, 499870, 496244, 493055, 490564, 489121, 488627, 488715, 489715, 492617, 497580, 503333, 508710, 514166, 521050, 529813, 539589, 549239, 558265, 566947, 575941]
61113E75941R567R445Q274O886O074N358L961K388J678J645J291O07L83M91M3
61098F34032q35j150j042j793l584n002n182m835m590m054l184k938l721m545
61084E87577m647m599n010n362n043m382l757k801j377l91n86j395j798j631j292
61069E43506q63l14J16K78M48R00J676K844M276N194M970M335M614N785O605O733
61053E91103P058P722P629O489N662O245P789R493J1160J2364J2419J1919J2605
61040G09657J4869J7073J8202J9406K1951K5466K9244L3488L7989M1366M2923
61029A011634M3744M4836M5927M7135M9871N4865O1311O9090P9458R2172J04633
61018A704676J15697J27828J43809J64325J90698K26259K72041L24824L82789
$$ y = [575941, 585508, 594953, 603227, 610113, 616187, 621545, 625506, 627894, 629572, 631217, 632508, 633115, 633498, 633989, 634032, 633197, 632047, 631005, 629212, 625628, 620626, 615444, 610609, 606019, 601965, 598781, 595843, 592122, 587577, 582930, 578331, 573321, 567959, 562916, 558534, 554777, 551976, 550599, 550208, 549622, 548227, 546429, 544798, 543506, 542643, 542329, 542445, 542723, 543171, 544071, 545747, 548591, 552867, 558061, 563031, 567366, 571980, 577765, 584370, 591103, 598161, 605883, 613512, 620001, 625663, 631908, 639697, 649190, 660350, 672714, 685133, 697052, 709657, 724526, 741599, 759801, 779207, 801158, 826624, 855868, 889356, 927345, 968711, 1011634, 1055378, 1100214, 1146141, 1193276, 1243147, 1298012, 1359323, 1428413, 1507871, 1600043, 1704676, 1820373, 1948201, 2092010, 2256335, 2447033, 2673292, 2945333, 3270157, 3652946]
61009C652946M49240N27082O15080P15695Q41318J004652J208230J452269J738892
61000A2205404K036320K230703K153155J707908R90085K53965k57334m54209l88346
60991B0477651j46483J95951N23406O51256M19332j65771r03615j533958j901761
60982A7616008k006710j933167j765725j560865j355123j169221j006726q62318
60974E956153p33424o20921n23325m37255l62279l00342k51278k12532j82143
60965B332654j58692j39578j22571j08130r7341q8621p9374o9810o2071n6307
60955A350159n0785m5408m2116m1598m2207m2396m2010m1003l8945l6194l3799
60944H93698l1905k9788k7517k5978k5177k4027k2051j9900j8005j6067j3940
$$ y = [3652946, 4102186, 4629268, 5244348, 5960043, 6801361, 7806013, 9014243, 10466512, 12205404, 14241724, 16472427, 18625582, 20333490, 21323575, 21577540, 21320206, 20865997, 20477651, 20331168, 20527119, 21050525, 21701781, 22121113, 21955342, 21051727, 19517769, 17616008, 15609298, 13676131, 11910406, 10349541, 8994418, 7825197, 6818471, 5956153, 5222729, 4601808, 4078483, 3641228, 3278949, 2978607, 2727329, 2514797, 2332654, 2173962, 2034384, 1911813, 1803683, 1706342, 1617721, 1538347, 1468537, 1406466, 1350159, 1299374, 1253966, 1211850, 1170252, 1128045, 1085649, 1043639, 1002636, 963691, 927497, 893698, 861793, 832005, 804488, 778510, 753333, 729306, 707255, 687355, 669350, 653283, 639343]
60933F39343j1818r502o688m051k714k635k658k282k137k610l176l313l042k502
60919E80215j897j864k824l978m078l240k835l469m267m421m302m604n315n980
60905E27141o265n935m945l813l256l329l500l545l619l511k791j741j246j516
60891D78129j740j292n12k3K7k12n61p03m18o0k14p74j051q60o94p66o26n4N34
60872D68130P88Q60Q33N37J91M82J542K501K558J934J273O75j30j037j543j298
60856D78296m03O53J201Q82O6n67r50j584k507l040k878k741l342m327m841m798
60840D49120m858n357n940o188o080n706m990l899k691j810j537j814k303k642
60826C93305k653k340j726q75j9N38O88N36K49J4M3L49N78L87K8J15P96J508J744
$$ y = [639343, 627525, 618023, 611335, 607284, 604570, 601935, 599277, 596995, 594858, 592248, 589072, 585759, 582717, 580215, 578318, 576454, 573630, 569652, 565574, 562334, 559499, 556030, 551763, 547342, 543040, 538436, 533121, 527141, 520876, 514941, 509996, 506183, 502927, 499598, 496098, 492553, 488934, 485423, 482632, 480891, 479645, 478129, 476389, 475097, 474585, 474562, 474589, 474377, 473816, 473113, 472695, 472635, 472421, 471647, 470596, 469736, 469042, 468276, 467650, 467596, 468130, 468918, 469778, 470611, 471148, 471339, 471821, 473363, 475864, 478422, 480356, 481629, 482304, 482174, 481137, 479594, 478296, 477893, 478546, 479747, 480629, 480695, 480128, 479178, 477594, 475087, 472047, 469169, 466428, 463086, 458759, 453918, 449120, 444262, 438905, 432965, 426777, 420697, 414991, 410001, 406102, 403411, 401601, 400064, 398250, 395947, 393305, 390652, 388312, 386586, 385711, 385692, 386230, 386918, 387454, 387703, 387717, 387760, 388109, 388687, 389074, 389102, 389217, 390013, 391521, 393265]
60807C93265J670J756K072K293K154J685J073N18K02J59K14J57j3j40j59j78l05
60790D06423m52m13j50J15K03K63M91O34K02p46j489j588j514j951k809l433l542
60773C90244l391l150k760k374k338k637k849k744k468k102j543r68q37j209j501
60758C57373j270p59l89q3M87J265J811J877J643J522J813K400K645J858J50j449
60742C70894k028j750j418j373j279r67q53j292j856j743q40j2j23r71j525j213
60726C51651o48q15j816k837l283l357l381l143k381j562j470k103k584k374j957
60711C17940j987k222j905r74k40l00q68j318j455j396j171q09n40m43k01M30
60695C02541J086J259J103J155J404J279O42J51L95J193J967K349K278J950J877
$$ y = [393265, 394935, 396691, 398763, 401056, 403210, 404895, 405968, 406486, 406688, 406847, 407061, 407218, 407205, 407065, 406906, 406728, 406423, 405971, 405558, 405408, 405523, 405726, 405989, 406480, 407114, 407316, 406570, 405081, 403493, 401979, 400028, 397219, 393786, 390244, 386853, 383703, 380943, 378569, 376231, 373594, 370745, 368001, 365533, 363431, 361888, 360920, 360083, 358874, 357373, 356103, 355344, 354955, 354872, 355359, 356624, 358435, 360312, 361955, 363477, 365290, 367690, 370335, 372193, 372343, 370894, 368866, 367116, 365698, 364325, 363046, 362079, 361226, 359934, 358078, 356335, 355495, 355483, 355360, 354389, 352864, 351651, 351003, 350188, 348372, 345535, 342252, 338895, 335514, 332371, 329990, 328428, 326958, 324855, 322271, 319897, 317940, 315953, 313731, 311826, 310852, 310612, 310312, 309444, 308126, 306671, 305275, 304104, 303295, 302755, 302312, 302111, 302541, 303627, 304886, 305989, 307144, 308548, 309827, 310469, 310620, 311015, 312208, 314175, 316524, 318802, 320752, 322629]
60680C22629K433L253L593L484L718M462M781M083L218L215L661L354K103Q65
60666C68852K57L4o3J22O23J178J768K500K956K485J380Q72J568K609K829K150
60650C92120J307P28K58l47j172k227l327m016l960l375k885k949l518m093m057
60635C58487l166j849p65q4N73J357J785J338J85r79j583j506r22k28O7l64j323
60618C51023k275k856l120l241l138k545j460l66J95K45K70N38Q39R73J094J271
60602C37447J149M35n44j212j471j571j554j330j160j427j894j837r83J08P09
60587C24865O02O3m28m05K05R43J353J530J726J728J270Q94J412K541L028K389
60571C43716J609J692K395K940L244L670M116M186L944L807L862L816L570L385
$$ y = [322629, 325062, 328315, 331908, 335392, 339110, 343572, 348353, 352436, 355654, 358869, 362530, 365884, 367987, 368852, 369109, 369143, 369080, 369202, 369825, 371003, 372771, 375271, 378227, 380712, 382092, 382964, 384532, 387141, 389970, 392120, 393427, 394155, 394413, 394066, 392894, 390667, 387340, 383324, 379364, 375989, 373104, 370155, 366637, 362544, 358487, 355321, 353472, 352707, 352623, 353196, 354553, 356338, 357676, 357861, 356882, 355299, 353793, 352871, 352643, 352710, 352346, 351023, 348748, 345892, 342772, 339531, 336393, 333848, 332388, 332022, 332217, 332462, 332732, 333270, 334109, 335082, 336176, 337447, 338596, 339031, 338487, 337275, 335804, 334233, 332679, 331349, 330189, 328762, 326868, 325031, 324048, 324156, 324865, 325467, 325530, 325102, 324697, 324902, 325845, 327198, 328728, 330454, 332182, 333452, 334346, 335758, 338299, 341327, 343716, 345325, 347017, 349412, 352352, 355596, 359266, 363382, 367568, 371512, 375319, 379181, 382997, 386567, 389952]
60557C89952L570M232N234O136O509O498O788P771R147J0554J2090J3837J5521
60544D97839J7188J9736K3876K8948L3551L7235M0808M4960M9309N2896N4751
60533I01097N3765M8755L9324K6467J1932k807j6703k8611l7253m2056m3696m3515
60521H66699m2301l9875l5990l1223k6611k2560j8655j4579j0609o996l410N18
60509F14408M528Q093J1205J4396J8062K2250K6947L2108L7415M2258M5985M7956
60497I25611M7493M4111L7726K8587J7279N016o385j5291k0938k3201k2134j8103
60485I99771j2051m955K879J1516K0614K9583L8431M7689N7266O5697P0720P0322
60473A397482O3418N0208L2108J0997j1536l3960n4108o9537p9026q3229q3614
$$ y = [389952, 393522, 397754, 402988, 409124, 415633, 422131, 428919, 436690, 445837, 456391, 468481, 482318, 497839, 515027, 534763, 558639, 587587, 621138, 658373, 699181, 744141, 793450, 846346, 901097, 954862, 1003617, 1042941, 1069408, 1081340, 1078533, 1061830, 1033219, 995966, 953910, 910214, 866699, 824398, 784523, 748533, 717310, 690699, 668139, 649484, 634905, 624296, 617300, 613890, 614408, 618936, 627029, 638234, 652630, 670692, 692942, 719889, 751997, 789412, 831670, 877655, 925611, 973104, 1017215, 1054941, 1083528, 1100807, 1105823, 1099438, 1084147, 1063209, 1040008, 1017874, 999771, 987720, 982765, 985644, 997160, 1017774, 1047357, 1085788, 1133477, 1190743, 1256440, 1327160, 1397482, 1460900, 1511108, 1543216, 1554213, 1542677, 1508717, 1454609, 1385072, 1306046, 1222817, 1139203]
60462A139203q1143p6295o9805o2770n6088n0138m4931m0348l6220l2397k8728
60451E60340k4994k1074j7230j3999j1656r927q431p219o638o704o851o362n113
60438D14142l796l273l611l882l191j709m01J45J95J78R7j99n80p73p61p20p99
60421C91062j040j369j494j127n04l04q42j577j759j271m75N09J893L646N281
60406C90629O232O225N397M386M104M978O391P360P732Q231R222J0124J0360J0287
60392D91658J0636J1275J1310J0267Q657P173N946M802L860L414L422L430L073
60379E78923K434J907J805K068K270J983J270O40M61N31M88L84N19P91P53L49
60363E97576R0K75M78K54n7K31J079J704J599J078P38Q34J350K180K853K547Q57
$$ y = [1139203, 1058060, 981765, 911960, 849190, 793102, 742964, 698033, 657685, 621465, 589068, 560340, 535346, 514272, 497042, 483043, 471387, 461460, 453029, 445810, 439172, 432468, 425617, 419255, 414142, 410346, 407073, 403462, 399580, 396389, 394680, 394279, 394424, 394619, 394797, 394894, 394695, 394115, 393342, 392581, 391861, 391062, 390022, 388653, 387159, 386032, 385528, 385224, 384382, 382805, 381046, 379775, 379300, 379809, 381702, 385348, 390629, 396861, 403086, 408483, 412869, 416973, 421951, 428342, 435702, 443434, 451665, 460887, 471011, 481371, 491658, 502294, 513569, 524879, 535146, 543803, 550976, 556922, 561724, 565584, 568998, 572420, 575850, 578923, 581357, 583264, 585069, 587137, 589407, 591390, 592660, 593300, 593761, 594292, 594780, 595164, 595683, 596474, 597227, 597576, 597666, 597941, 598419, 598673, 598616, 598847, 599926, 601630, 603229, 604307, 605045, 605879, 607229, 609409, 612262, 614809, 615666]
60346F15666j532l347l929l758l839m731o056o798o179m490k907k301k400k422
60332E60977k261k507l364m263m763n217o073o993p264o832o305o025n702n064
60318D88344m254l399k299r22J40K30n32j349j576j128q1J566L617N534O981Q312
60302D99184J0068J1991J2917J1843Q947N296J708j779n401q995j2074j4290j5529
60289E03886j5712j4829j3157j1182r235p399n765m524l739l223k749k217j646
60276D08509j044l90M50J625K986M006M350M355M535M736M451L920M101N201O143
60261D57934O021N388N328N775N788N070M234L597K818J888J466J873K498K750
60247E12428K925L626M820O059P193Q328R308R935J0496J1571J3228J4852J5803
$$ y = [615666, 614134, 610787, 606858, 603100, 599261, 594530, 588474, 581676, 575497, 571007, 568100, 565799, 563399, 560977, 558716, 556209, 552845, 548582, 543819, 538602, 532529, 525536, 518272, 511440, 505135, 499110, 493408, 488344, 484090, 480691, 478392, 477470, 477610, 477840, 477308, 475959, 474383, 473255, 473174, 474740, 478357, 483891, 490872, 499184, 509252, 521243, 534160, 546003, 554950, 560246, 561954, 560175, 554774, 545779, 533705, 519415, 503886, 488174, 473345, 460188, 449006, 439771, 432372, 426607, 422083, 418344, 415121, 412372, 410155, 408509, 407465, 407075, 407525, 409150, 412136, 416142, 420492, 424847, 429382, 434118, 438569, 442489, 446590, 451791, 457934, 463955, 469343, 474671, 480446, 486234, 491304, 495538, 499135, 501953, 503841, 505307, 507180, 509678, 512428, 515353, 518979, 523799, 529858, 537051, 545379, 554687, 564622, 575118, 586689, 599917, 614769, 630572]
60234F30572J6049J6128J6691J8030J9853K1584K3040K4711K7167L0279L3302
60223H77406L5666L7506L9411M1832M4697M7421M9285M9882M9272M7720M5408
60212A365506M2410L8834L4844L0639K6444K2373J8210J3550Q368L273j016m387
60200A599048p279r869j1609j1770j0342q073n589k706J075N618J0163J4303J8388
60187A581358K2722K6904L0490L3908L7922M2331M5881M7559M7452M6173M4057
60176B006757M1083L7176L2265K6399J9957J3309O312j441r747j7809k5249l2363
60164B096649l9053m4214m6868m7444m7199m6615m5028m1779l7136l1991k6944
60153A642378k1876j6333j0299m462N33M972R683J4663J8751K0933K1460K1215
$$ y = [630572, 646621, 662749, 679440, 697470, 717323, 738907, 761947, 786658, 813825, 844104, 877406, 913072, 950578, 989989, 1031821, 1076518, 1123939, 1173224, 1223106, 1272378, 1320098, 1365506, 1407916, 1446750, 1481594, 1512233, 1538677, 1561050, 1579260, 1592810, 1601178, 1604451, 1603435, 1599048, 1591769, 1581900, 1570291, 1558521, 1548179, 1540106, 1534517, 1531811, 1532886, 1538504, 1548667, 1562970, 1581358, 1604080, 1630984, 1661474, 1695382, 1733304, 1775635, 1821516, 1869075, 1916527, 1962700, 2006757, 2047840, 2085016, 2117281, 2143680, 2163637, 2176946, 2183258, 2181817, 2172070, 2154261, 2129012, 2096649, 2057596, 2013382, 1966514, 1919070, 1871871, 1825256, 1780228, 1738449, 1701313, 1669322, 1642378, 1620502, 1604169, 1593870, 1589408, 1589941, 1594913, 1604596, 1619259, 1638010, 1658943, 1680403, 1701618]
60141A701618K0524J9004J6231J2074O741R41m364q766j2652j6311j9280k0993
60129A694767k1460k0747j8442j4416r564m830J25O289J3588K0946K7953L5446
60117A709655M4168N3739O3219P1995P9919Q7201R4362J01739J08765J14277J17602
60106B646641J18830J18057J14951J09310J01397R1505P9694O6146N1327L5580
60096C533438J9019J890j5280l2007m7855o2210p4444q4339r1875r6802r9015
60085B950520r9175r8095r5645r1134q4752p7652p0416o2556n3818m4941l6521
60074B135815k8193j9621j1458m497J458O973J1733J4846J6038J5789J4507J2295
60062B165685R399O220K919n73m281q256j2723j7683k2644k7119l1185l5200l9161
$$ y = [1701618, 1722142, 1741146, 1757377, 1769451, 1776192, 1777133, 1772769, 1764003, 1751351, 1735040, 1715760, 1694767, 1673307, 1652560, 1634118, 1619702, 1610138, 1605308, 1605433, 1611722, 1625310, 1646256, 1674209, 1709655, 1753823, 1807562, 1870781, 1942776, 2022695, 2109896, 2204258, 2305997, 2414762, 2529039, 2646641, 2765471, 2883528, 2998479, 3107789, 3209186, 3300691, 3380385, 3446531, 3497858, 3533438, 3552457, 3554347, 3539067, 3507060, 3459205, 3396995, 3322551, 3238212, 3146337, 3049535, 2950520, 2851345, 2753250, 2657605, 2566471, 2481719, 2404067, 2333651, 2271095, 2217277, 2172336, 2135815, 2107622, 2088001, 2076543, 2072046, 2073504, 2080477, 2092210, 2107056, 2123094, 2138883, 2153390, 2165685, 2175084, 2181304, 2184223, 2183650, 2179369, 2171113, 2158390, 2140707, 2118063, 2090944, 2059759, 2024559, 1985398]
60049A985398m2702m5486m7254m7745m6966m5330m3243m0721l7617l3900k9504
60038A524930k4349j8708j3078p439j305N227J1239J6333K1404K7321L3616L9349
60026A614540M4556M9628N3863N5945N5782N4438N2227M8138M1507L3116K4070
60015B127810J4568M406o036j6066k5410l4030m1455m6922n0100n1345n1254n0147
60003A774019m7926m4350l9482l3900k8281k2900j7606j2211o653r12M941J0751
59991A535490J6624K3033L0230L7796M5153N2305N9446O6142P1473P4910P6355
59980B088957P5520P1999O6042N8492M9867M0208K9833J9416R160j297j1888k1797
59968B474512l0502l8293m5339n0957n4406n5779n5586n3864n0393m5311l9097
$$ y = [1985398, 1942696, 1897210, 1849956, 1802211, 1755245, 1709915, 1666672, 1625951, 1588334, 1554434, 1524930, 1500581, 1481873, 1468795, 1461356, 1460051, 1465278, 1476517, 1492850, 1514254, 1541575, 1575191, 1614540, 1659096, 1708724, 1762587, 1818532, 1874314, 1928752, 1980979, 2029117, 2070624, 2103740, 2127810, 2142378, 2146784, 2140748, 2124682, 2099272, 2065242, 2023787, 1976865, 1926765, 1875420, 1824166, 1774019, 1726093, 1681743, 1642261, 1608361, 1580080, 1557180, 1539574, 1527363, 1520710, 1519798, 1524739, 1535490, 1552114, 1575147, 1605377, 1643173, 1688326, 1740631, 1800077, 1866219, 1937692, 2012602, 2088957, 2164477, 2236476, 2302518, 2361010, 2410877, 2451085, 2480918, 2500334, 2509494, 2508197, 2496309, 2474512, 2444010, 2405717, 2360378, 2309421, 2255015, 2199236, 2143650, 2089786, 2039393, 1994082, 1954985]
59957A954985l2197k5068j8142j1364m242L206J0105J5857K1125K6988L3481L9647
59945B014381M4707M8412N0562N0973M9908M7909M5176M1602L7311L2684K7965
59934B491590K3311J9081J5500J2260R073O478N475O401Q901J2851J8487K5552
59922B654960L3137M0688M8504N6921O5637P4075Q1884Q8675R3839R6985R8051
59911C433356R6580R1460Q1940O8607N2788L5342J6523l201k2848m1334n7696
59900C751517p1036q0834q7341r1222r2747r1724q8248q3023p6740o9572o1501
59889B857529n2801m3863l4755k5329j5652o060L187J2037K0493K8563L6351M3853
59877B823553N0583N5735N8989O0894O2070O2194O0245N5752M9270M1375L1776
$$ y = [1954985, 1922788, 1897720, 1879578, 1868214, 1863972, 1867178, 1877283, 1893140, 1914265, 1941253, 1974734, 2014381, 2059088, 2107500, 2158062, 2209035, 2258943, 2306852, 2352028, 2393630, 2430941, 2463625, 2491590, 2514901, 2533982, 2549482, 2561742, 2570815, 2577293, 2582768, 2589169, 2598070, 2610921, 2629408, 2654960, 2688097, 2728785, 2777289, 2834210, 2899847, 2973922, 3055806, 3144481, 3238320, 3335305, 3433356, 3529936, 3621396, 3703336, 3771943, 3824731, 3860073, 3876596, 3873395, 3850547, 3809213, 3751517, 3680481, 3599647, 3512306, 3421084, 3328337, 3236613, 3148365, 3065342, 2988602, 2919030, 2857529, 2804728, 2760865, 2726110, 2700781, 2685129, 2679069, 2682256, 2694293, 2714786, 2743349, 2779700, 2823553, 2874136, 2929871, 2988860, 3049754, 3111824, 3174018, 3234263, 3290015, 3339285, 3380660, 3412436]
59866C412436J9980O496p462k1365l5683n0421o4083p4716q1607q5372q6583q5164
59854B846456q1155p5300o8400o0681n2422m4880l9708l7268l6060l4164l0925
59843B285493k6904k2586j7822j2525p293k960J51K261L705M831O236Q629J2260
59830B233476J6649K1006K4893K8353L1415L3537L3640L0907K5582J8764J1404
59819B509626L692m334j2004j8275k2695k5703k7877k9316k9865k9651k9188k9095
59807B255315k9722l0822l1626l1493l0562k9436k8265k6673k4696k3178k2745
59796A946097k2869k2577k1799k1324k1517k1785k1405k0265j8557j6300j3510
59785A724189j0453p260l535J199O789J2621J8502K4955L2446M0692M8967N6974
$$ y = [3412436, 3432416, 3438912, 3431450, 3410085, 3374402, 3323981, 3259898, 3185182, 3103575, 3018203, 2931620, 2846456, 2765301, 2690001, 2621601, 2560920, 2508498, 2463618, 2423910, 2386642, 2350582, 2316418, 2285493, 2258589, 2236003, 2218181, 2205656, 2198363, 2195403, 2195554, 2197815, 2201520, 2206351, 2212587, 2221216, 2233476, 2250125, 2271131, 2296024, 2324377, 2355792, 2389329, 2422969, 2453876, 2479458, 2498222, 2509626, 2513318, 2508984, 2496980, 2478705, 2456010, 2430307, 2402430, 2373114, 2343249, 2313598, 2284410, 2255315, 2225593, 2194771, 2163145, 2131652, 2101090, 2071654, 2043389, 2016716, 1992020, 1968842, 1946097, 1923228, 1900651, 1878852, 1857528, 1836011, 1814226, 1792821, 1772556, 1753999, 1737699, 1724189, 1713736, 1706476, 1702941, 1704140, 1710929, 1723550, 1742052, 1767007, 1799453, 1840145, 1889112, 1946086]
59773A946086O5088P3833Q3365R3541J04013J14061J22358J27102J26241J17544
59763B973232R9090P0572L4565l876l9290o7815q7718r8944j02635j00638r4711
59752B581832q6019p5487o4369n3931m4700l6415k8772k1840j5695j0116m870
59741B139618L9M626R133J3763J8420K3024K7901L3471L9590M5557N0971N6289
59729B462402O2292O9184P6484Q3778R1233R9323J08398J18760J30698J43985
59719C446537J57525J70154J81834J93370K04839K14841K21710K24871K24599
59710E240280K20889K13239K01377J85850J68049J50083J34098J21029J10086
59701F744980J00017R0661Q2689P6109O9982O3609N7079N0508M3500L5764K7599
$$ y = [1946086, 2011174, 2085007, 2168372, 2261913, 2365926, 2479987, 2602345, 2729447, 2855688, 2973232, 3072322, 3142894, 3177459, 3173583, 3134293, 3066478, 2978760, 2879816, 2777181, 2676543, 2581832, 2495813, 2420326, 2355957, 2302026, 2257326, 2220911, 2192139, 2170299, 2154604, 2144488, 2139618, 2139657, 2144283, 2153416, 2167179, 2185599, 2208623, 2236524, 2269995, 2309585, 2355142, 2406113, 2462402, 2524694, 2593878, 2670362, 2754140, 2845373, 2944696, 3053094, 3171854, 3302552, 3446537, 3604062, 3774216, 3956050, 4149420, 4354259, 4569100, 4790810, 5015681, 5240280, 5461169, 5674408, 5875785, 6061635, 6229684, 6379767, 6513865, 6634894, 6744980, 6844997, 6935658, 7018347, 7094456, 7164438, 7228047, 7285126, 7335634, 7379134, 7414898, 7442497]
59690G442497J9405J1306L593l003p880j1002j2493j2320j0574p477k633N117
59678G414536J6460L0653M6283O2550P9260R6033J12377J28319J44165J59505
59668H290141J73074J83661J90653J93630J91817J84212J70034J49013J21336
59659I847571Q7399M7688L170m4213r1758j36917j77713k12393k39418k58211
59649H825205k69305k73217k69801k59357k43837k26094k08290j92004j79562
59640F703738j74053j77616j90194k09703k32456k53535k68208k74097k71791
59631D652085k63212k49962k33340k14950j96359j78397j61308j45311j30619
59622B878627j17131j04570r2876q2176p2539o3978n6561n0226m4720l9948l6200
$$ y = [7442497, 7461902, 7473208, 7476801, 7473798, 7465918, 7454916, 7442423, 7430103, 7419529, 7412052, 7409419, 7414536, 7430996, 7461649, 7507932, 7570482, 7649742, 7745775, 7858152, 7986471, 8130636, 8290141, 8463215, 8646876, 8837529, 9031159, 9222976, 9407188, 9577222, 9726235, 9847571, 9934970, 9982658, 9985828, 9941615, 9849857, 9712940, 9535227, 9322834, 9083416, 8825205, 8555900, 8282683, 8012882, 7753525, 7509688, 7283594, 7075304, 6883300, 6703738, 6529685, 6352069, 6161875, 5952172, 5719716, 5466181, 5197973, 4923876, 4652085, 4388873, 4138911, 3905571, 3690621, 3494262, 3315865, 3154557, 3009246, 2878627, 2761496, 2656926, 2564050, 2481874, 2409335, 2345357, 2288796, 2238570, 2193850, 2153902, 2117702]
59611B117702l3691l1965l0070k7452k4452k1892k0295j9590j9455j9694k0159
59600A848987k0533k0573k0562k1042k1869k2021k0810j8875j7429j6718j5908
59589A632647j4494j3107j2742j3621j5053j6072j5992j4727j2726j0538q397
59578A485178o343m551l155j945o55O15J708K983M947P440R792J1820J3897J6072
59564A537803J7989J9823K2395K5835K8939L0543L1031L1825L3750L6476L9361
59553A855770M2206M5178M8344N1419N4082N6524N9462O3169O6950P0156P3298
59542B486558P6817P8839P5819O6388N3462M1516L2542K5586J9224J3004O788
59531B976543K48o644j3458j9894k5920l1450l6437m1213m5981n0101n2568n3227
$$ y = [2117702, 2084011, 2052046, 2021976, 1994524, 1970072, 1948180, 1927885, 1908295, 1888840, 1869146, 1848987, 1828454, 1807881, 1787319, 1766277, 1744408, 1722387, 1701577, 1682702, 1665273, 1648555, 1632647, 1618153, 1605046, 1592304, 1578683, 1563630, 1547558, 1531566, 1516839, 1504113, 1493575, 1485178, 1478835, 1474284, 1471129, 1469184, 1468529, 1469144, 1470852, 1473835, 1478782, 1486222, 1496014, 1507834, 1521731, 1537803, 1555792, 1575615, 1598010, 1623845, 1652784, 1683327, 1714358, 1746183, 1779933, 1816409, 1855770, 1897976, 1943154, 1991498, 2042917, 2096999, 2153523, 2212985, 2276154, 2343104, 2413260, 2486558, 2563375, 2642214, 2718033, 2784421, 2837883, 2879399, 2911941, 2937527, 2956751, 2969755, 2976543, 2976791, 2970147, 2956689, 2936795, 2910875, 2879425, 2842988, 2801775, 2755794, 2705693, 2653125, 2599898]
59519B599898n2809n1835n0148m7454m3636l8436l1713k4101j6658r666k413N728
59507B236757J4632K4027L3941M4199N4208O3678P2913Q1892Q9640R5072R8026
59496B908985R8761R6823R1191Q1508O8531N3205L5913J6889l041k2603m0853
59485C385309n7436p1946q3420r0842r4114r4153r1890q7473q0728p2036o2356
59474B498915n2451m2516l2588k2906j3769n249K757J0214J6730K1603K4316K5082
59462B430138K4692K3551K1142J6670J0086K089o606j5514k4228l2548m0669m8570
59450B360233n5369o0078o3013o5550o8211o9854o9349o7249o4997o3047o0688
59439A652828n7571n4288n1351m8445m5172m1841l8911l6074l2597k8524k4793
$$ y = [2599898, 2547089, 2495254, 2445106, 2397652, 2354016, 2315580, 2283867, 2259766, 2243108, 2233442, 2231029, 2236757, 2251389, 2275416, 2309357, 2353556, 2407764, 2471442, 2544355, 2626247, 2715887, 2810959, 2908985, 3007746, 3104569, 3195760, 3277268, 3345799, 3399004, 3434917, 3451806, 3448765, 3426162, 3385309, 3327873, 3255927, 3172507, 3081665, 2987551, 2893398, 2801508, 2714035, 2633307, 2561271, 2498915, 2446464, 2403948, 2371360, 2348454, 2334685, 2329436, 2332193, 2342407, 2359137, 2380740, 2405056, 2430138, 2454830, 2478381, 2499523, 2516193, 2526279, 2528368, 2521762, 2506248, 2482020, 2449472, 2408803, 2360233, 2304864, 2244786, 2181773, 2116223, 2048012, 1978158, 1908809, 1841560, 1776563, 1713516, 1652828, 1595257, 1540969, 1489618, 1441173, 1396001, 1354160, 1315249, 1279175, 1246578, 1218054, 1193261]
59428A193261k1952j9419j6411j3127j0268p694m445k01M267Q407J2675J7067
59416A142160J9610J7679J1034K573m101p230p079m709j235K558O665J1564J6674
59403A206163J9504J7271R749j0p946j1775j1732r296n760j815K163N891R263
59390A221670J2397J5400J8178K0654K3082K5904K9256L2835L6280L9429M2250
59379A517335M4831M7557N0843N4452N7428N9106O0006O1231O3175O5274O7099
59368B148337O9181P2497P7447Q3616R0472R8056J06953J17620J29813J42706
59358C136698J55569J68163J80341J91437K00353K06256K08841K07864K02851
59349D858373J93602J80668J65005J47285J27888J07411Q6624O5899M5067K3967
$$ y = [1193261, 1171309, 1151890, 1135479, 1122352, 1112084, 1104390, 1099945, 1099744, 1104011, 1112418, 1125093, 1142160, 1161770, 1179449, 1190483, 1193056, 1188955, 1181725, 1174646, 1169937, 1168702, 1171260, 1177925, 1189489, 1206163, 1225667, 1242938, 1252687, 1252677, 1244731, 1232956, 1221224, 1211928, 1206168, 1204353, 1206516, 1212407, 1221670, 1234067, 1249467, 1267645, 1288299, 1311381, 1337285, 1366541, 1399376, 1435656, 1475085, 1517335, 1562166, 1609723, 1660566, 1715018, 1772446, 1831552, 1891558, 1952789, 2015964, 2081238, 2148337, 2217518, 2290015, 2367462, 2451078, 2541550, 2639606, 2746559, 2864179, 2993992, 3136698, 3292267, 3460430, 3640771, 3832208, 4032561, 4238817, 4447658, 4655522, 4858373, 5051975, 5232643, 5397648, 5544933, 5672821, 5780232, 5866856, 5932755, 5977822, 6001789]
59339F001789K787j8230l9073n9756q0235j00674j21285j41581j60197j75942
59329E107603j88671j98667k05510k08295k06774k01659j93870j84174j73484
59320C346499j62682j52004j41197j30436j20340j11013j01811r2385q3179p4555
59310B176897o6287n8396n1645m6429m1746l6147k9373k2541j7190j4767j6265
59299A776111k1202k7148l1338l2751l2063k9934k6473k2223j8302j5212j2410
59288A507055r453o710m534k547k05K451N207Q262J1776J5335J8350K0824K3161
59275A588972K5444K7305K8327K8262K7038K4912K2412J9713J6271J1467N519
59264A825642o78o596j2438j8411k4089k8816l2440l5288l7592l9319m0475m1124
$$ y = [6001789, 6004576, 5986346, 5947273, 5887517, 5807282, 5706608, 5585323, 5443742, 5283545, 5107603, 4918932, 4720265, 4514755, 4306460, 4099686, 3898027, 3704157, 3519983, 3346499, 3183817, 3031813, 2890616, 2760180, 2639840, 2528827, 2427016, 2334631, 2251452, 2176897, 2110610, 2052214, 2000569, 1954140, 1912394, 1876247, 1846874, 1824333, 1807143, 1792376, 1776111, 1754909, 1727761, 1696423, 1663672, 1631609, 1601675, 1575202, 1552979, 1534677, 1519465, 1507055, 1497602, 1490892, 1486358, 1483811, 1483606, 1486057, 1491264, 1499526, 1511302, 1526637, 1544987, 1565811, 1588972, 1614416, 1641721, 1670048, 1698310, 1725348, 1750260, 1772672, 1792385, 1808656, 1820123, 1825642, 1824964, 1818368, 1805930, 1787519, 1763430, 1734614, 1702174, 1666886, 1629294, 1589975, 1549500, 1508376]
59252A508376m1043l9818l7588l5269l3555l2091l0106k7618k5267k3143k0652
59241A162226j7666j4858j2555j0193p381m709k812j364K75K028L574N219P367
59228A109151R528J0928J1843J3249J5302J7279J8923K0767K3050K5354K7578
59217A302952L0236L3571L7156M0739M4596M8876N3397N8414O4643P2071P9601
59206A866252Q6442R3088J00397J08349J16269J23556J29566J33275J33850J31188
59196C022232J25369J15883J02052Q3965O2517L8666J3147j3205l9249o3657q5173
59185C362547j02958j16770j26620j32278j33560j31042j25898j18937j10467
59176B264017j01204r2345q4275p6068o6908n7398m8754m1244l4249k7502k1468
$$ y = [1508376, 1467333, 1427515, 1389927, 1354658, 1321103, 1289012, 1258906, 1231288, 1206021, 1182878, 1162226, 1144560, 1129702, 1117147, 1106954, 1099573, 1094864, 1092052, 1090688, 1090963, 1092991, 1096565, 1101784, 1109151, 1118679, 1129607, 1141450, 1154699, 1170001, 1187280, 1206203, 1226970, 1250020, 1275374, 1302952, 1333188, 1366759, 1403915, 1444654, 1489250, 1538126, 1591523, 1649937, 1714580, 1786651, 1866252, 1952694, 2045782, 2146179, 2254528, 2370797, 2494353, 2623919, 2757194, 2891044, 3022232, 3147601, 3263484, 3365536, 3449501, 3512018, 3550684, 3563831, 3550626, 3511377, 3447720, 3362547, 3259589, 3142819, 3016199, 2883921, 2750361, 2619319, 2493421, 2374484, 2264017, 2162813, 2070468, 1986193, 1910125, 1843217, 1785819, 1737065, 1695821, 1661572, 1634070, 1612602]
59165A612602j6557j2667r487o793m483k719j957k523m251o754r782j3060j6106
59152A505463j8639k0933k3360k5762k7642k8747k9156k8921k8036k6634k4948
59141A222685k3190k1569k0213j8930j7296j5190j2916j0734q582o403m301k265
59129A061096k60J301J841J622J756K759L786L881L312K945K935K840K647K787
59115A095248L270L637L728L805L937L836L300K437J490P97P24J198J538J247
59101A130192P04N97Q74R44P55R57J939L284M393N153N906P058Q811J1014J3137
59086A195718J4651J5468J5954J6561J7583J9038K0593K1703K1999K1421K0040
59075A400729J8021J5823J3879J1889Q972M870M54l356o686j0207j4027j7679
$$ y = [1612602, 1596045, 1583378, 1573891, 1567098, 1562615, 1559896, 1557939, 1555416, 1551165, 1544411, 1534629, 1521569, 1505463, 1486824, 1465891, 1442531, 1416769, 1389127, 1360380, 1331224, 1302303, 1274267, 1247633, 1222685, 1199495, 1177926, 1157713, 1138783, 1121487, 1106297, 1093381, 1082647, 1074065, 1067662, 1063361, 1061096, 1060836, 1062137, 1063978, 1065600, 1067356, 1070115, 1073901, 1077782, 1081094, 1084039, 1086974, 1089814, 1092461, 1095248, 1098518, 1102155, 1105883, 1109688, 1113625, 1117461, 1120761, 1123198, 1124688, 1125485, 1126209, 1127407, 1128945, 1130192, 1130896, 1131493, 1132367, 1133311, 1134066, 1135023, 1136962, 1140246, 1144639, 1149792, 1155698, 1162756, 1171567, 1182581, 1195718, 1210369, 1225837, 1241791, 1258352, 1275935, 1294973, 1315566, 1337269, 1359268, 1380689, 1400729, 1418750, 1434573, 1448452, 1460341, 1469313, 1474183, 1474637, 1471281, 1464595, 1454388, 1440361, 1422682]
59063A422682k0837k3433k5263k6162k6412k6508k6636k6697k6625k6305k5436
59052A142368k3965k2406k1328k0721k0195j9541j8738j7727j6581j5548j4612
59041I31006j3406j1884j0506r425q121o373m884m236l938l226k255j558j030
59028H50164l79j18q93k167k767k575k511k989l406l243k658j922j180p09n93
59013H22054k79O85J615J529Q14Q68K021L125L413L523M210N276O286P320Q446
58998H70906R283R757J0486J1881J3617J5469J7879K0978K3830K5456K6142K6991
58986A082675K8525L0345L1817L2473L1935L0085K7266K3968K0348J6260J1596
58975A367293O387Q59m479r008j2455j5030j7049j8711k0150k1298k1646k0730
$$ y = [1422682, 1401845, 1378412, 1353149, 1326987, 1300575, 1274067, 1247431, 1220734, 1194109, 1167804, 1142368, 1118403, 1095997, 1074669, 1053948, 1033753, 1014212, 995474, 977747, 961166, 945618, 931006, 917600, 905716, 895210, 885785, 877664, 871291, 866407, 862171, 858233, 855007, 852752, 851194, 850164, 849785, 849667, 848774, 846607, 843840, 841265, 838754, 835765, 832359, 829116, 826458, 824536, 823356, 822647, 822054, 821775, 822460, 824075, 825604, 826418, 827286, 829307, 832432, 835845, 839368, 843578, 848854, 855140, 862460, 870906, 880189, 889946, 900432, 912313, 925930, 941399, 959278, 980256, 1004086, 1029542, 1055684, 1082675, 1111200, 1141545, 1173362, 1205835, 1237770, 1267855, 1295121, 1319089, 1339437, 1355697, 1367293, 1373680, 1374539, 1370060, 1361052, 1348597, 1333567, 1316518, 1297807, 1277657, 1256359, 1234713, 1213983]
58963A213983j8902j7172j6112j5351j4291j2803j1086r341p828o797o135n420
58951A072745m411l109j404P50K765L794L850L897M575N502O221P037Q380R932
58937A120524J1108J1953J2902J3929J4616J4974J5587J6874J8728K0939K3568
58926A295702K6656K9812L2495L4769L7480M1375M6158N0683N4143N6532N7819
58915A763624N7272N4133M8642M1930L5286K9949K7084K7094K9191L2233L5865
58904B182303M0221M4985M9710N4754O0860O7787P4353P9918Q4970R0144R5589
58893B925594J01392J07694J14134J20015J25176J29854J33522J34807J32845
58884D025033J27843J20224J10188R8412Q6090P3819O1353M8805L6984K6015J4727
$$ y = [1213983, 1195081, 1177909, 1161797, 1146446, 1132155, 1119352, 1108266, 1098925, 1091097, 1084300, 1078165, 1072745, 1068334, 1065225, 1063821, 1064571, 1067336, 1071130, 1074980, 1078877, 1083452, 1088954, 1095175, 1102212, 1110592, 1120524, 1131632, 1143585, 1156487, 1170416, 1185032, 1200006, 1215593, 1232467, 1251195, 1272134, 1295702, 1322358, 1352170, 1384665, 1419434, 1456914, 1498289, 1544447, 1595130, 1649273, 1705805, 1763624, 1820896, 1875029, 1923671, 1965601, 2000887, 2030836, 2057920, 2085014, 2114205, 2146438, 2182303, 2222524, 2267509, 2317219, 2371973, 2432833, 2500620, 2574973, 2654891, 2739861, 2830005, 2925594, 3026986, 3134680, 3248814, 3368829, 3494005, 3623859, 3757381, 3892188, 4025033, 4152876, 4273100, 4383288, 4481700, 4567790, 4641609, 4702962, 4751767, 4788751, 4814766, 4829493]
58873D829493K174j1158k4328l7185m9806o1558p1816q0990q9897r8456j05797
58862D200676j11345j15077j17105j17715j17506j16871j15620j13564j11079
58853C164794j08568j05808j02464r8746r4992r0881q5807p9852p3834o8559o4190
58842B191093o0210n5735n0385m4911m0471l7084l3575k9296k5006k1539j8606
58831A774275j5556j2470r671o909l967j362M69K082M153O327P964R493J1785
58818A766613J4604J6922J8551K0245K2190K3648K4260K4565K5069K5663K6317
58807B008647K7545K9814L3082L7149M1894M6950N1858N6651O1799O7420P3096
58796B535905P8658Q4476R0748R7042J02860J08117J12721J16191J18185J19062
$$ y = [4829493, 4831667, 4820509, 4796181, 4758996, 4709190, 4647632, 4575816, 4494826, 4404929, 4306473, 4200676, 4089331, 3974254, 3857149, 3739434, 3621928, 3505057, 3389437, 3275873, 3164794, 3056226, 2950418, 2847954, 2749208, 2654216, 2563335, 2477528, 2397676, 2323842, 2255283, 2191093, 2130883, 2075148, 2024763, 1979852, 1939381, 1902297, 1868722, 1839426, 1814420, 1792881, 1774275, 1758719, 1746249, 1736578, 1729669, 1725702, 1724340, 1724809, 1726891, 1731044, 1737371, 1745335, 1754828, 1766613, 1781217, 1798139, 1816690, 1836935, 1859125, 1882773, 1907033, 1931598, 1956667, 1982330, 2008647, 2036192, 2066006, 2099088, 2136237, 2178131, 2225081, 2276939, 2333590, 2395389, 2462809, 2535905, 2614563, 2699039, 2789787, 2886829, 2989689, 3097806, 3210527, 3326718, 3444903, 3563965]
58786C563965J19386J18983J16972J12724J06394R8347Q8472P6396O2292M6889
58776D510820L0594J3027o143k6158m5548o3394p9594r3884j05388j13516j18849
58765C901967j22566j25319j26967j27225j26155j24132j21499j18243j14046
58756B795815j08871j03401r8488r4147q9596q4299p8495p2639o6891o1324n6130
58745A881534n1350m6908m2968l9769l6991l3954l0576k7472k4951k2705k0659
58734A503231j9222j8309j6990j4717j2114j0049q443o541l745K10N225J0493
58722A409029J4850J7772J9375J9198J6109R910J928o593j5512k4488l2023l7027
58710A392528m0240m2828m4473m4269m2734m1220l9925l7936l5014l1787k8413
$$ y = [3563965, 3683351, 3802334, 3919306, 4032030, 4138424, 4236771, 4325243, 4401639, 4463931, 4510820, 4541414, 4554441, 4548298, 4522140, 4476592, 4413198, 4333604, 4239720, 4134332, 4020816, 3901967, 3779401, 3654082, 3527115, 3399890, 3273735, 3149603, 3028104, 2909861, 2795815, 2686944, 2583543, 2485055, 2390908, 2301312, 2217013, 2138518, 2065879, 1998988, 1937664, 1881534, 1830184, 1783276, 1740308, 1700539, 1663548, 1629594, 1599018, 1571546, 1546595, 1523890, 1503231, 1484009, 1465700, 1448710, 1433993, 1421879, 1411830, 1403387, 1396846, 1393101, 1393311, 1398536, 1409029, 1423879, 1441651, 1461026, 1480224, 1496333, 1506243, 1508171, 1501578, 1486066, 1461578, 1429555, 1392528, 1352288, 1309460, 1264987, 1220718, 1177984, 1136764, 1096839, 1058903, 1023889, 992102, 963689]
58699I63689k4528k0464j7052j4150j0670o358k262Q87L616O496Q894R523P707
58686I05328L709j723p803j3944j9605k3943k5972k5550k3707k1485j8875j5597
58674G10833j2305r984q446o531l835j232M15J219J818K547L218L214J901n83
58660F82249l127m760n657o491p211p299o797o260n865n493n418o014o971p630
58646E97256p908p999p512n987m102l118l142l067k313j428q30j26Q85J610J625
58631E53844J448J794K590L276L565L639L842M396N124N455N083M540M624N373
58617F08593O103O427O603P012P790Q956J0345J1492J2078J2378J2845J3467J4084
58604G38173J4999J6585J8508K0077K1190K2279K3577K5036K6785K8968L1287
$$ y = [963689, 939161, 918697, 901645, 887495, 876825, 870467, 868205, 869092, 872708, 879204, 888098, 897621, 905328, 909037, 907314, 899511, 885567, 865962, 842019, 816047, 790497, 766790, 745305, 726430, 710833, 698528, 688544, 680098, 673567, 669732, 668500, 668915, 670134, 671952, 674499, 677717, 680931, 682832, 682249, 679122, 674362, 668705, 662214, 655003, 647704, 640907, 634647, 628782, 623289, 617871, 611857, 604886, 597256, 589348, 581349, 573837, 567850, 563748, 560630, 557488, 554421, 552108, 550680, 549850, 549724, 550609, 552219, 553844, 555292, 557086, 559676, 562952, 566517, 570156, 573998, 578394, 583518, 588973, 594056, 598596, 603220, 608593, 614696, 621123, 627726, 634738, 642528, 651484, 661829, 673321, 685399, 697777, 710622, 724089, 738173, 753172, 769757, 788265, 808342, 829532, 851811, 875388, 900424, 927209, 956177, 987464]
58593I87464L3306L4921L6054L6328L5693L4832L4183L3132L0966K7952K4563
58582A349394K0315J4603Q123K172k980p764j1892j4693j6495j8145j9460j9668
58570A283510j9205j9369k0250k0586j9840j8786j7915j6883j5827j5589j6186
58559A083074j6470j5912j5366j5510j5829j5714j5528j5933j6979j8352j9650
58548I01831k0300k0033j9476j9277j8803j7000j4430j2795j2312j1346r079o818
58536G20162n923o090o495p213q453r659j0389j1028j1822j2175j1739j1151j0848
58523E97177j0241q871p436o716o348n629m716m078l503k574j591j138j142j048
58509E32146o13O3Q82J721K386K901L453L931M117M278M921N901O627P080P677
$$ y = [987464, 1020770, 1055691, 1091745, 1128073, 1163766, 1198598, 1232781, 1265913, 1296879, 1324831, 1349394, 1369709, 1384312, 1392435, 1394607, 1391627, 1383863, 1371971, 1357278, 1340783, 1322638, 1303178, 1283510, 1264305, 1244936, 1224686, 1204100, 1184260, 1165474, 1147559, 1130676, 1114849, 1099260, 1083074, 1066604, 1050692, 1035326, 1019816, 1003987, 988273, 972745, 956812, 939833, 921481, 901831, 881531, 861498, 842022, 822745, 803942, 786942, 772512, 759717, 747405, 736059, 726980, 720162, 714239, 708149, 701654, 694441, 685988, 676329, 665940, 654912, 643090, 630915, 619176, 608025, 597177, 586936, 578065, 570629, 563913, 557565, 551936, 547220, 543142, 539639, 537065, 535474, 534336, 533194, 532146, 531533, 531596, 532478, 534199, 536585, 539486, 542939, 546870, 550987, 555265, 560186, 566087, 572714, 579794, 587471]
58494E87471Q188P942P201P016P456P315N980M265K943J736L41p79j308j760k564
58479F41443l501m395n406o171n939m957m511n025n431m981m302m031l773l235
58465E75785k980l183k937j822q91j006j393j013k88k21o92q76o76n54m79j14
58449E56660M08P46R49J146J110P10K79Q7N3K36Q61J595J723J435J748K786L341
58432E75873K704J816J867K857M094N153N658N235M260L679L629L344K743K699
58418F25611L313L442K643K054K529L342L603L523L483L270L108L921N662O860
58404F76364O768O417O606O565N770N309O050O995O981O517O489O453N777N191
58390G64252N504N953N495M674M617N043M784L503J549j012l863n761n664l945
$$ y = [587471, 595659, 603601, 610802, 617818, 625274, 632589, 638569, 642834, 645777, 647513, 647854, 647075, 645767, 644007, 641443, 637942, 633547, 628141, 621970, 616031, 611074, 606563, 601538, 596107, 591126, 586824, 582793, 579020, 575785, 572805, 569622, 566685, 564863, 563972, 562966, 561573, 560560, 560272, 560051, 559359, 558483, 557807, 557253, 556774, 556660, 557068, 557814, 558763, 559909, 561019, 561729, 562008, 562095, 562148, 562384, 563245, 564840, 566563, 567998, 569746, 572532, 575873, 578577, 580393, 582260, 585117, 589211, 594364, 600022, 605257, 609517, 613196, 616825, 620169, 622912, 625611, 628924, 632366, 635009, 637063, 639592, 642934, 646537, 650060, 653543, 656813, 659921, 663842, 669504, 676364, 683132, 689549, 696155, 702720, 708490, 713799, 719849, 726844, 733825, 740342, 746831, 753284, 759061, 764252, 769756, 775709, 781204, 785878, 790495, 795538, 800322, 803825, 805374, 804362, 800499, 794738, 789074, 785129]
58376G85129j630P30K742L872M335N045O004O131N386N267O288O920O210N459
58362H47888N922O754O824O721P251P766P736Q117R389J0086R239Q394R140J0473
58348I61700J0777J0627J1153J1495J0470R248R545J0480J0097Q851Q749R868
58336A083060J0527J0355J0512J1267J1756J1848J2167J2593J2630J2737J3551
58325A213003J4461J4632J4585J5105J5630J5456J5401J6447J7898J8736J9565
58314A390919K1228K2892K3503K3745K4574K5239K4857K4419K5012K5632K5047
58303A657067K4115K3889K3240K0983J8679J8457J9640K0289K0535K1527K2737
58292A891158K3225K4103K6695K9735L1238L1644L2324L2890L2879L4027L7426
$$ y = [785129, 783499, 784229, 786971, 790843, 795178, 800223, 806227, 812358, 817744, 823011, 829299, 836219, 842429, 847888, 853810, 860564, 867388, 874109, 881360, 889126, 896862, 904979, 914368, 924454, 933693, 942087, 951227, 961700, 972477, 983104, 994257, 1005752, 1016222, 1025470, 1035015, 1045495, 1055592, 1064443, 1073192, 1083060, 1093587, 1103942, 1114454, 1125721, 1137477, 1149325, 1161492, 1174085, 1186715, 1199452, 1213003, 1227464, 1242096, 1256681, 1271786, 1287416, 1302872, 1318273, 1334720, 1352618, 1371354, 1390919, 1412147, 1435039, 1458542, 1482287, 1506861, 1532100, 1556957, 1581376, 1606388, 1632020, 1657067, 1681182, 1705071, 1728311, 1749294, 1767973, 1786430, 1806070, 1826359, 1846894, 1868421, 1891158, 1914383, 1938486, 1965181, 1994916, 2026154, 2057798, 2090122, 2123012, 2155891, 2189918, 2227344]
58281B227344M0566M0762L9574M0089M1926M2974M3989M6992N0839N2950N3969
58270B721974N6284N9319O0852O1589O3797O6677O7895O8413P0922P4591P6382
58259C448695P6591P8094Q1035Q3242Q5108Q8876R3984R8041J01650J07238J14052
58248D456606J19448J24140J30898J39165J46301J52960J61721J71643J80018
58239E782900J88037J98837K11363K22450K33389K47729K64278K79366K94436
58230G922785L13791L36401L57879L79195M05118M35316M65682M97357N35427
58221A1648951N79741O26321O76700P36134Q03792Q75188R53101J045258J152468
58212A9097654J270774J404002J561518J744720J949368K180536K451454K769492
$$ y = [2227344, 2267910, 2308672, 2348246, 2388335, 2430261, 2473235, 2517224, 2564216, 2615055, 2668005, 2721974, 2778258, 2837577, 2898429, 2960018, 3023815, 3090492, 3158387, 3226800, 3297722, 3372313, 3448695, 3525286, 3603380, 3684415, 3767657, 3852765, 3941641, 4035625, 4133666, 4235316, 4342554, 4456606, 4576054, 4700194, 4831092, 4970257, 5116558, 5269518, 5431239, 5602882, 5782900, 5970937, 6169774, 6381137, 6603587, 6836976, 7084705, 7348983, 7628349, 7922785, 8236576, 8572977, 8930856, 9310051, 9715169, 10150485, 10616167, 11113524, 11648951, 12228692, 12855013, 13531713, 14267847, 15071639, 15946827, 16899928, 17945186, 19097654, 20368428, 21772430, 23333948, 25078668, 27028036, 29208572, 31660026, 34429518]
58204C4429518L139419L578961M112926M752038N496120O356598P354122Q494911
58196G7714613R774812J1208423J2829151J4661863J6724371J9046423K1632766
58189A83592422K4383877K7062820K9279455L0378579K9350190K5124407J7313520
58182C66485270O814499m410543j4298810k1586323k6011662k7957885k8041916
58175B50992630k6894084k5048128k2873638k0587309j8324196j6179048j4199798
58168A06886429j2395227j0769471r332591q080216o990462o046633n243222m566976
58160D3461631l992056l498556l079816k728056k427795k167133j942334j748111
58152B1877774j575083j419304j283419j166142j060465r63486q77999q03104
$$ y = [34429518, 37568937, 41147898, 45260824, 50012862, 55508982, 61865580, 69219702, 77714613, 87489425, 98697848, 111526999, 126188862, 142913233, 161959656, 183592422, 207976299, 235039119, 264318574, 294697153, 324047343, 349171750, 366485270, 373299769, 368889226, 354590416, 333004093, 306992431, 279034546, 250992630, 224098546, 199050418, 176176780, 155589471, 137265275, 121086227, 106886429, 94491202, 83721731, 74389140, 66308924, 59318462, 53271829, 48028607, 43461631, 39469575, 35971019, 32891203, 30163147, 27735352, 25568219, 23625885, 21877774, 20302691, 18883387, 17599968, 16433826, 15373361, 14409875, 13531876, 12728772]
58144A2728772p33099o67144o10637n65269n26311m90913m60522m33801m05825
58135G835251l76144l49722l28119l07231k85314k65695k49751k34348k18363
58126E220564k04881j94733j84301j72065j61270j53810j47020j38881j31185
58117C732418j25284j19501j12891j07125j02883r8468r3521q9920q7726q4341
58107B710758p9012p4145p1029o8179o4901o2429o0605n7470n3143n0132m8820
58096B020893m6711m3099m0377l9613l8865l7082l5737l5330l4105l1570k9625
58085A608779k8945k7867k6075k5634k7047k8002k7458k7310k8422k8596k6439
58074A306984k3918k3104k3276k3070k2786k2789k2118k0434j8979j8306j7322
$$ y = [12728772, 11995673, 11328529, 10717892, 10152623, 9626312, 9135399, 8674877, 8241076, 7835251, 7459107, 7109385, 6781266, 6474035, 6188721, 5923026, 5673275, 5438927, 5220564, 5015683, 4820950, 4636649, 4464584, 4303314, 4149504, 4002484, 3863603, 3732418, 3607134, 3487633, 3374742, 3267617, 3164734, 3066266, 2972745, 2882825, 2795099, 2710758, 2631746, 2557601, 2486572, 2418393, 2353492, 2291063, 2230458, 2172988, 2119845, 2069713, 2020893, 1974182, 1931083, 1890706, 1851093, 1812228, 1775146, 1739409, 1704079, 1669974, 1638404, 1608779, 1579834, 1551967, 1525892, 1500258, 1473211, 1445209, 1417751, 1390441, 1362019, 1333423, 1306984, 1283066, 1259962, 1236686, 1213616, 1190830, 1168041, 1145923, 1125489, 1106510, 1088204, 1070882]
58063A070882j5760j5053j5576j5669j4611j4001j4814j5676j5444j5087j5546
58052I03645j5989j5566j4856j4334j3496j2445j2219j2631j2055j0278r145r419
58040G51212r539q569p781q014q022o944n995o239o832o977p398q408q747p833
58026F43914p108p590q157p686o884o472n646m011l018l719m799m692l905l622
58012E66605l512k753j777j301q21L64J775K681L218L487K981K021K215M138O157
57997E85478O826O922P629Q324P970P287P685Q995J0004J0392J0744J1331J2293
57984G01880J4201J7274K0679K3560K6003K8194K9719L0522L1366L2436L2649
57973I88483L1334K9267K6988K3537J8070J1451M919j736r258j7272k4751l1210
$$ y = [1070882, 1055122, 1040069, 1024493, 1008824, 994213, 980212, 965398, 949722, 934278, 919191, 903645, 887656, 872090, 857234, 842900, 829404, 816959, 804740, 792109, 780054, 769776, 760631, 751212, 741673, 733104, 725323, 717309, 709287, 702343, 696348, 690109, 683277, 676300, 668902, 660494, 651747, 643914, 636806, 629216, 621059, 613373, 606489, 600017, 594371, 590360, 587342, 583623, 578824, 574132, 570227, 566605, 563093, 560340, 558563, 557262, 556441, 556805, 558580, 561261, 564479, 567966, 570947, 572968, 575183, 579321, 585478, 592304, 599226, 606855, 615179, 623149, 630436, 638121, 647116, 657120, 667512, 678256, 689587, 701880, 716081, 733355, 754034, 777594, 803597, 831791, 861510, 892032, 923398, 955834, 988483, 1019817, 1049084, 1076072, 1099609, 1117679, 1129130, 1134049, 1132313, 1123055, 1105783, 1081032, 1049822]
57961A049822l6248l9010l9290l8270l7053l5420l2994l0486k8516k6377k3276
57950F82882j9799j6945j4553j1992r421p208n020k720j148q99j216j295j570
57937E89096k540l412l360l074l540m220l968k935k062j404m71N19J194K138L999
57922E65960O174P762R149J1131J3133J3994J3829J3536J2881J0854P587M132
57910F90122O17l690q459j2218j4382j5874j7412j8581j8961j8931j8844j8337
57898E25050j7047j5340j3877j2948j2449j2125j1751j1334j1072j0912j0529
57887C85666r911r500r358q860p727o547n732m789l417k403k397k630k042r67
57873C09386l65jJ065K560L160K601K143K671L633M178M245M085L576K603J507
$$ y = [1049822, 1013574, 974564, 935274, 897004, 859951, 824531, 791537, 761051, 732535, 706158, 682882, 663083, 646138, 631585, 619593, 610172, 602964, 597944, 595224, 594076, 593177, 591961, 590666, 589096, 586556, 583144, 579784, 576710, 573170, 568950, 564982, 562047, 559985, 558581, 558110, 558629, 559823, 561961, 565960, 572134, 579896, 589045, 600176, 613309, 627303, 641132, 654668, 667549, 678403, 685990, 690122, 690739, 687049, 678590, 666372, 651990, 636116, 618704, 600123, 581162, 562231, 543387, 525050, 508003, 492663, 478786, 465838, 453389, 441264, 429513, 418179, 407107, 396195, 385666, 375755, 366255, 356897, 348037, 340310, 333763, 328031, 323242, 319825, 317422, 315025, 312395, 310353, 309386, 309021, 309020, 310085, 312645, 315805, 318406, 320549, 323220, 326853, 331031, 335276, 339361, 342937, 345540, 347047]
57858C47047O96J57l71r49j371j369r72p04j136k102k742k623k231k043j737q92
57842C26658J74R29J452K038K447K294J837J588J466J061L73k91q30j219j204
57827C38773p98n54q21j136j024p97q37o74L44J862K855K787J785J19j675k657
57811C37552k299j119K01J716L594N277O293P268R022J1223J3077J4776J7000
57798D23581J9396K0926K1529K2077K2695K2472K0862J8146J4532R890M580n32
57786F20154n127r559j3815j7301j9775k1595k2860k3195k2579k1610k0752j9970
57774D02016j9152j8162j6591j4302j2133j1191j1332j1298j0376r005p666o303
57762B54505n023m374m391m285l497k434j642j051m27j5j15l99k35N15J346J720
$$ y = [347047, 347743, 347900, 347529, 346580, 345209, 343840, 342868, 342164, 341028, 338926, 336184, 333561, 331330, 329287, 327550, 326658, 326832, 327761, 329213, 331251, 333698, 335992, 337829, 339417, 340883, 341944, 342317, 342026, 341196, 339977, 338773, 337975, 337421, 336600, 335464, 334440, 333643, 332806, 332132, 332476, 334338, 337193, 339980, 341765, 341884, 340209, 337552, 335253, 334134, 334335, 336051, 339645, 344922, 351215, 358483, 367505, 378728, 391805, 406581, 423581, 442977, 463903, 485432, 507509, 530204, 552676, 573538, 591684, 606216, 616106, 620686, 620154, 615027, 605468, 591653, 574352, 554577, 532982, 510122, 486927, 464348, 442738, 421986, 402016, 382864, 364702, 348111, 333809, 321676, 310485, 299153, 287855, 277479, 268474, 260808, 254505, 249482, 245108, 240717, 236432, 232935, 230501, 228859, 227808, 227381, 227366, 227251, 226852, 226617, 227132, 228478, 230198]
57746B30198J571J249J033Q13M34L00J108K759M107M289L711L248L051K837K747
57731B63455K975L103K807K781L757M981M982L697K505K077J573K70j270k155
57717B95538k312k113j722j230q05l50L02P49L45o17r52j36J024J682K062K818
57701B94283L974N074N713N541M337K650J742K303L657M646N009N398O363P779
57687C58469R115R960J0469J1340J3128J5557J7916K0013K2310K5146K8472L2382
57675E74277L7217M3003M9370N6200O3777P2261Q1676R2478J04880J16778J22823
57664A414740J16770R5512O1634K2667j2380l7221n0571n5108n4570n1859m8890
57653A400724m6743m5537m4828m4386m4178m3764m2647m1199m0245l9621l8232
$$ y = [230198, 231769, 233018, 234051, 234864, 235298, 235598, 236706, 239465, 243572, 247861, 251572, 254820, 257871, 260708, 263455, 266430, 269533, 272340, 275121, 278878, 283859, 288841, 292538, 295043, 297120, 298693, 298963, 297693, 295538, 293226, 291113, 289391, 288161, 287356, 287006, 287308, 288057, 288402, 287785, 286833, 286697, 287721, 289403, 291465, 294283, 298257, 303331, 309044, 314585, 318922, 321572, 323314, 325617, 329274, 333920, 338929, 344327, 350690, 358469, 367584, 377544, 388013, 399353, 412481, 428038, 445954, 465967, 488277, 513423, 541895, 574277, 611494, 654497, 703867, 760067, 823844, 896105, 977781, 1070259, 1175139, 1291917, 1414740, 1531510, 1627022, 1688656, 1711323, 1698943, 1661722, 1611151, 1556043, 1501473, 1449614, 1400724, 1353981, 1308444, 1263616, 1219230, 1175052, 1131288, 1088641, 1047442, 1007197, 967576, 929344]
57642I29344l5849l3615l2266l0944k8631k5653k2907k0416j7810j5495j4139
57631F51619j3335j1964r847q003p178o883o073m270j879K30J406J850K484L983
57617E92140O076Q087R814J1444J2982J4241J5306J6465J7774J9191K0940K3248
57605G67708K5771K7764K8874K9259K8981K7756K5492K2585J9521J6429J3156
57594A033296R456N014m29o655j2839j8093k2162k5466k8476l1161l3073l3836
57582H35576l3519l2514l1254l0032k9033k8299k7658k6742k5239k3143k0809
57571E27334j8692j7023j5774j4927j4587j4580j4199j2801j0639q647p348o552
57559C71565o150o450p223p309n898l799k524k403k464k011j400j136j064p42
$$ y = [929344, 893495, 859880, 827614, 796670, 768039, 742386, 719479, 699063, 681253, 665758, 651619, 638284, 626320, 616473, 608470, 601292, 594409, 588336, 584066, 582187, 582417, 583823, 585673, 588157, 592140, 598216, 606303, 616117, 627561, 640543, 654784, 670090, 686555, 704329, 723520, 744460, 767708, 793479, 821243, 850117, 879376, 908357, 936113, 961605, 984190, 1003711, 1020140, 1033296, 1042752, 1047766, 1047337, 1040682, 1027843, 1009750, 987588, 962122, 933646, 902485, 869412, 835576, 802057, 769543, 738289, 708257, 679224, 650925, 623267, 596525, 571286, 548143, 527334, 508642, 491619, 475845, 460918, 446331, 431751, 417552, 404751, 394112, 385465, 378117, 371565, 365415, 358965, 351742, 344433, 338535, 334736, 332212, 329809, 327345, 325334, 323934, 322798, 321734, 320992]
57545C20992j16N00Q09Q02Q30J287J990K174J561J003J465K721L855M672N601
57530C50146O446O446N714N453O380P897R184J0161J0983J1518J1871J2629J4040
57517D68868J5578J6858J8235K0009K1715K2837K3535K4125K4396K4155K3799
57506G04110K3643K3117K1455J8831J6035J3261R917N573N28m500q860j2285j5006
57493G95819j7464j9672k1194k1877k2178k2461k2549k2319k2162k2198k1653
57482E60092j9784j7132j5030j3978j3205j1843r984q443p804p811p540o276m303
57469D16959k562j441m09R77K337L247M169N818P950R564J0219J0493J1137J2358
57455D90816J3901J5458J6843J8057J9152J9925K0048J9661J9448J9708J9806
$$ y = [320992, 320876, 321376, 322185, 322987, 323817, 325104, 327094, 329268, 330829, 331832, 333297, 336018, 339873, 344545, 350146, 356592, 363038, 368752, 374205, 380585, 388482, 397666, 407827, 418810, 430328, 442199, 454828, 468868, 484446, 501304, 519539, 539548, 561263, 584100, 607635, 631760, 656156, 680311, 704110, 727753, 750870, 772325, 791156, 807191, 820452, 830369, 835942, 836470, 831970, 823110, 810825, 795819, 778355, 758683, 737489, 715612, 693434, 670973, 648424, 626105, 603943, 581745, 560092, 540308, 523176, 508146, 494168, 480963, 469120, 459136, 450693, 442889, 435078, 427538, 421262, 416959, 414397, 412956, 412547, 413524, 415861, 419108, 423277, 429095, 437045, 446609, 456828, 467321, 478458, 490816, 504717, 520175, 537018, 555075, 574227, 594152, 614200, 633861, 653309, 673017, 692823]
57444F92823J9020J7540J5997J4312J1754Q031L556j191n948j0294j3779j6505
57432G35316j9011k1368k3025k3740k4086k4665k5231k5074k4022k2690k1706
57421D80698k1002k0020j8540j7036j6027j5222j3822j1736r962r389r593r403
57409C08946q375p134o309n840n425n095m994m907m420l502k664k397k574k577
57395B42733k152j868k369l262l384k367j270j231j980k388k064j562j167m75
57381B15194N58J070M02p25r04K10J517J906J484J063Q83N57P9R0Q61J665J719
57364B27629J259J032J094Q90L46o3k67o36r59m48Q06J502R37K38Q20K266K872
57347B39318J941N12j55Q3N74Q16Q15Q65J224J782K115J998J687J528J520J515
$$ y = [692823, 711843, 729383, 745380, 759692, 771446, 779477, 783033, 781842, 775894, 765600, 751821, 735316, 716305, 694937, 671912, 648172, 624086, 599421, 574190, 549116, 525094, 502404, 480698, 459696, 439676, 421136, 404100, 388073, 372851, 359029, 347293, 337331, 327942, 318349, 308946, 300571, 293437, 287128, 281288, 275863, 270768, 265774, 260867, 256447, 252945, 250281, 247884, 245310, 242733, 240581, 238713, 236344, 233082, 229698, 227331, 226061, 224830, 222850, 220462, 218398, 216836, 215669, 215194, 215752, 216822, 217224, 216499, 215595, 215805, 217322, 219228, 220712, 221775, 222658, 223215, 223294, 223384, 224245, 225910, 227629, 228888, 229920, 231014, 231904, 232250, 232187, 231920, 231284, 230325, 229877, 230683, 232185, 233122, 233360, 234180, 236446, 239318, 241259, 241771, 241616, 241699, 242273, 243089, 243904, 244769, 245993, 247775, 249890, 251888, 253575, 255103, 256623, 258138]
57331B58138J521J588J644J731J995K202J845J048O99J188J691J468J139J726
57317B79623K926L517L222K969L337L866M082M193M465M726M854N066N370N391
57303C37607M994M644M775N293N910O523P072P468P797Q252Q751R005Q999R000
57289D36090R055Q987Q821Q708Q447P711O824O567P086P527P076N727L949K158
57275E34733P62N7j92n44j031j109o49k60l18l62K8N03N99N85R38J451J602J491
57257E38284J720K510L496M262M632M592M430M718N651O641P092P312Q007R051
57243F12398R548R205Q818R173J0095J0958J1618J2312J3015J3437J3529J3583
57231G47689J3844J4369J5158J6125J6951J7378J7679J8440J9707K0793K1163
$$ y = [258138, 259659, 261247, 262891, 264622, 266617, 268819, 270664, 271712, 272411, 273599, 275290, 276758, 277897, 279623, 282549, 286066, 289288, 292257, 295594, 299460, 303542, 307735, 312200, 316926, 321780, 326846, 332216, 337607, 342601, 347245, 352020, 357313, 363223, 369746, 376818, 384286, 392083, 400335, 409086, 418091, 427090, 436090, 445145, 454132, 462953, 471661, 480108, 487819, 494643, 501210, 508296, 515823, 522899, 528626, 532575, 534733, 535495, 535552, 535360, 534816, 533785, 532676, 532027, 531767, 531449, 531087, 531115, 531618, 532217, 532802, 533740, 535191, 536793, 538284, 540004, 542514, 546010, 550272, 554904, 559496, 563926, 568644, 574295, 580936, 588028, 595340, 603347, 612398, 621946, 631151, 639969, 649142, 659237, 670195, 681813, 694125, 707140, 720577, 734106, 747689, 761533, 775902, 791060, 807185, 824136, 841514, 859193, 877633, 897340, 918133, 939296]
57220I39296K1170K1488K2074K2266K1871K1544K1950K2962K4014K4826K5534
57209A188995K6334K7338K8544K9724L0493L0753L0857L1135L1487L1608L1355
57198A518623L0694K9611K8387K7581K7322K6926K5727K4003K2569K1677K0887
57187A804007J9972J9268J9084J9264J9410J9231J8560J7441J6206J5245J4632
57176B002320J4276J4222J4475J4753J4809J4847J5144J5476J5451J5256J5378
57165B166407J5722J5633J4848J3825J3071J2718J2731J2926J2806J2038J1119
57154B313844J0868J1236J1365J0890J0301R906R392Q770Q768R704J0799J1202
57142B437045J1092J1139J1482J1930J2646J3869J5261J6237J6753J7212J7787
$$ y = [939296, 960466, 981954, 1004028, 1026294, 1048165, 1069709, 1091659, 1114621, 1138635, 1163461, 1188995, 1215329, 1242667, 1271211, 1300935, 1331428, 1362181, 1393038, 1424173, 1455660, 1487268, 1518623, 1549317, 1578928, 1607315, 1634896, 1662218, 1689144, 1714871, 1738874, 1761443, 1783120, 1804007, 1823979, 1843247, 1862331, 1881595, 1901005, 1920236, 1938796, 1956237, 1972443, 1987688, 2002320, 2016596, 2030818, 2045293, 2060046, 2074855, 2089702, 2104846, 2120322, 2135773, 2151029, 2166407, 2182129, 2197762, 2212610, 2226435, 2239506, 2252224, 2264955, 2277881, 2290687, 2302725, 2313844, 2324712, 2335948, 2347313, 2358203, 2368504, 2378410, 2387802, 2396572, 2405340, 2415044, 2425843, 2437045, 2448137, 2459276, 2470758, 2482688, 2495334, 2509203, 2524464, 2540701, 2557454, 2574666, 2592453]
57131B592453J8332J8821J9381K0056K0798K1576K2307K3003K4195K6649L0365
57120B837936L4410L8170M2187M7114N2457N7155O1110O5310P0682P7789Q7477
57109C471797J00872J18333J39105J62345J88140K17384K51195K90725L37322
57100E277218L92300M56480N30055O12894P04889Q05655R13666J025923J139065
57091A1858145J250744J359328J462112J554422J630320J682896J703155J680038
57083B4181160J603645J469327J278914J039250P61036M58562J48222j54544m37470
57074C0348102o91674r11402j094393j241660j355954j440270j497470j530119
57066B0585160j539726j526462j490270j432390j355750j264421j163146j056970
$$ y = [2592453, 2610785, 2629606, 2648987, 2669043, 2689841, 2711417, 2733724, 2756727, 2780922, 2807571, 2837936, 2872346, 2910516, 2952703, 2999817, 3052274, 3109429, 3170539, 3235849, 3306531, 3384320, 3471797, 3572669, 3691002, 3830107, 3992452, 4180592, 4397976, 4649171, 4939896, 5277218, 5669518, 6125998, 6656053, 7268947, 7973836, 8779491, 9693157, 10719080, 11858145, 13108889, 14468217, 15930329, 17484751, 19115071, 20797967, 22501122, 24181160, 25784805, 27254132, 28533046, 29572296, 30333332, 30791894, 30940116, 30785572, 30348102, 29656428, 28745026, 27650633, 26408973, 25053019, 23612749, 22115279, 20585160, 19045434, 17518972, 16028702, 14596312, 13240562, 11976141, 10812995, 9756025]
57058I756025r50576q47599p50617o61490n81371n10553m48601l94775l48328
57049D262115l08575k74887k46545k22603k02113j84516j69649j57192j46302
57040B349733j35978j25658j15400j05506r6074q6728p6863o6274n5354m4162
57030A441736l1529j6337n79R594P602p868l1086n3366o8735p5998p6848p3495
57018A023091o7944o2011n6784n2153m7465m2577l7979l4059l0748k7859k5322
57007E38190k2942k0418j7815j5659j4267j3285j2284j1455j1320j1833j2287
56996C74625j2095j1286j0178q919p535o154m960m019l216k295j006N89K006K725
56982C08282K726K320J451l81l267o272q117q351p571o556n640m899m409m089
$$ y = [9756025, 8805449, 7957850, 7207233, 6545743, 5964372, 5453819, 5005218, 4610443, 4262115, 3953540, 3678653, 3432108, 3209505, 3007392, 2822876, 2653227, 2496035, 2349733, 2213755, 2088097, 1972697, 1867191, 1771117, 1684389, 1607526, 1541252, 1485898, 1441736, 1410207, 1393870, 1393291, 1402885, 1410487, 1402619, 1371533, 1318167, 1249432, 1173434, 1096586, 1023091, 955147, 893136, 836352, 784199, 736734, 694157, 656178, 622119, 591371, 563512, 538190, 515248, 494830, 477015, 461356, 447089, 433804, 421520, 410065, 398745, 386912, 374625, 362530, 351244, 341066, 332147, 324612, 318458, 313498, 309479, 306263, 303968, 302962, 303551, 305557, 308282, 311008, 313328, 314779, 314398, 311131, 304859, 296742, 288391, 280820, 274264, 268624, 263725, 259316, 255227]
56968B55227l559k543j214J25J520L122M635N563N975O582P751Q981R592R469
56954C11226Q641O652L112j307n152p598q975r792r881q880p037n096l600k571
56940B59742j722p01P37K570M589O642Q586J0111J1006J1616J2444J3126J2349
56927C51095R192M159j434o604j0781j3438j4388j4289j4101j3977j3302j1814
56915B50318j0139r079q766q674q181p054n579m321l544k984k316j714j574j842
56901A74551k057j939j561r51j5J104J980K356K423K653L520N259P519R395J0250
56886B14487J0400J0509J0395R175O626L662J176q84k803m150m319l645l129l075
56872B44425k729j361Q53L231N393P304Q918J0259J1732J3854J6558J9134K0954
$$ y = [255227, 251668, 249125, 247911, 248036, 249556, 252678, 257313, 262876, 268851, 275433, 283184, 292165, 301757, 311226, 319867, 326519, 329631, 328324, 323172, 315574, 306599, 296807, 286926, 278046, 271009, 265913, 262313, 259742, 258020, 257319, 258056, 260626, 265215, 271857, 280443, 290554, 301560, 313176, 325620, 338746, 351095, 360287, 364446, 363012, 356408, 345627, 332189, 317801, 303512, 289411, 275434, 262132, 250318, 240179, 231100, 222334, 213660, 205479, 198425, 192846, 188525, 184981, 181997, 179681, 177967, 176393, 174551, 172494, 170555, 168994, 168043, 168028, 169132, 171112, 173468, 175891, 178544, 182064, 187323, 194842, 204237, 214487, 224887, 235396, 245791, 254966, 261592, 265254, 266430, 265546, 262743, 258593, 254274, 250629, 247500, 244425, 241696, 240335, 241188, 244419, 249812, 257116, 266034, 276293, 288025, 301879, 318437, 337571, 358525]
56859C58525K1956K2154K0997J7744J2403N873p90o785j1248j3378j3294j2248
56847D01909j1280j0044p602m075n94K272N185Q879J3182J7567K1961K6440L0604
56834D94404L3994L6638L8379L7766L2639K2330Q844m541j5604k3912k9713l2954
56822E98270l3509l1813k8759k5071k1045j6824j2576q324l945N60M986R220J3381
56809D44551J7501K1257K4171K5760K5284K1712J4582M918n153j3876k0723k5807
56797E34177k8933k9656k8090k5215k2161j9336j6494j3511j0727q380o043l119
56785C22512K75L441O098Q654J1216J3014J3175J1546Q338L503k695q911j3496
56772C76670j6012j7288j7938j7681j6345j4626j3328j2408j1356j0170r317q878
$$ y = [358525, 380481, 402635, 423632, 441376, 453779, 459652, 458862, 452077, 440829, 427451, 414157, 401909, 390629, 380585, 372983, 368908, 368314, 370586, 375771, 384650, 397832, 415399, 437360, 463800, 494404, 528398, 565036, 603415, 641181, 673820, 696150, 704994, 700453, 684849, 660937, 631224, 598270, 564761, 532948, 504189, 479118, 458073, 441249, 428673, 420349, 416404, 416964, 421950, 431170, 444551, 462052, 483309, 507480, 533240, 558524, 580236, 594818, 599736, 594583, 580707, 559984, 534177, 505244, 475588, 447498, 422283, 400122, 380786, 364292, 350781, 340054, 331674, 325631, 322512, 322787, 326228, 332326, 340980, 352196, 365210, 378385, 389931, 398269, 401772, 399077, 390166, 376670, 360658, 343370, 325432, 307751, 291406, 276780, 263452, 251044, 239688, 229518, 220201, 211323]
56760B11323q352p367o185n278m666l973l067k325k151k413k675k787k932l076
56746A54076k903k435k163k274k250j648q35m10l79m35n93q38o07M31J404J122
56730A39263j80r91n68K68N89N66Q36J576K608L650M023K989R28o36p47q4L26
56713A54416N41J056J499J123K05j70L29R38J010P62O37O18L91j48p09p39J30
56696A61889J504K302J853P43Q6J88M19L18K01O62J833L295M414M740M300L490
56680A92237K640J825J129O80K77m76j364j472m29Q68J390J300J423J834J978
56665B03840J764J568J313O77J25M71J395J530M50n77m02M79Q32L45m24j084j562
56648B10740j666j357j104j303j596j422j005j059j699k329k544k450k087j288
$$ y = [211323, 202971, 195604, 189419, 184141, 179475, 175502, 172435, 170110, 167959, 165546, 162871, 160084, 157152, 154076, 151173, 148738, 146575, 144301, 142051, 140403, 139568, 139158, 138779, 138344, 137751, 136913, 136306, 136737, 138141, 139263, 139083, 138092, 137524, 137792, 138381, 138947, 139783, 141359, 143967, 147617, 151640, 154629, 155557, 154921, 154174, 154090, 154416, 154957, 156013, 157512, 158635, 158840, 158670, 158999, 159937, 160947, 161709, 162346, 162964, 163355, 163207, 162498, 161759, 161889, 163393, 165695, 167548, 168291, 168377, 168565, 168984, 169302, 169503, 170165, 171998, 175293, 179707, 184447, 188747, 192237, 194877, 196702, 197831, 198511, 198788, 198312, 196948, 195476, 195047, 195915, 197305, 198605, 200028, 201862, 203840, 205604, 207172, 208485, 209162, 209287, 209758, 211153, 212683, 213133, 212556, 212154, 212633, 213465, 213810, 213386, 212302, 210740, 209074, 207717, 206613, 205310, 203714, 202292, 201287, 200228, 198529, 196200, 193656, 191206, 189119, 187831]
56634A87831l25k6q37k149k892k609j675o86J9M13O78J008J346J356Q47J08m26
56617A81981p29j048j209o74M70J108L35j176j821j070j8K06k52p11j147j834
56601A72411k403k208j436q71o60k33N02R17Q32R83J785K491K315J731J760K384
56585A80300K566J864J087J137J823K287K155J801J585J370R11M10K91N80Q80
56570B01047J046J472K484L737M591M898M973M975M825M603M516M427M052L616
56556B55262L741M439M875M468L653L141K914K517J904J418J121P15L4q87k113
56541B87202l650n072n813n855n792o105o706p221p387p105o427n607m952m526
56527B04984m147l737l419l222k952k474j987j784j871j973j907j770j696j580
$$ y = [187831, 187506, 187480, 186643, 184494, 181602, 178993, 177318, 176632, 176651, 177064, 177742, 178750, 180096, 181452, 182299, 182407, 181981, 181252, 180204, 178995, 178321, 178791, 179899, 180234, 179058, 177237, 176167, 176149, 176355, 176103, 175392, 174245, 172411, 170008, 167800, 166364, 165493, 164833, 164600, 165102, 166019, 166851, 167834, 169619, 172110, 174425, 176156, 177916, 180300, 182866, 184730, 185817, 186954, 188777, 191064, 193219, 195020, 196605, 197975, 198886, 199296, 199587, 200167, 201047, 202093, 203565, 206049, 209786, 214377, 219275, 224248, 229223, 234048, 238651, 243167, 247594, 251646, 255262, 259003, 263442, 268317, 272785, 276438, 279579, 282493, 285010, 286914, 288332, 289453, 290168, 290202, 289315, 287202, 283552, 278480, 272667, 266812, 261020, 254915, 248209, 240988, 233601, 226496, 220069, 214462, 209510, 204984, 200837, 197100, 193681, 190459, 187507, 185033, 183046, 181262, 179391, 177418, 175511, 173741, 172045, 170465]
56513A70465j207o76l71m28m98k41J80L78L09J49j36o08q48l44N90R99N42p4k56
56494A67925l16o99j094j002o56n90p18n64k20k31n99n96L03J814L165L630K954
56477A72506J701J032J512K394K594K147J860J807J262K07k95L35J217J245N53
56462A92077N0N8J73J39J00J71L27O02R43J009N62m7k44N2M82Q63J299J763K047
56443B02426K108K050J683O87p13j672j681j263j309j960k443k063r70R2N73M10
56427A95955k38j198k161k623k255j311n26n13j265k175k499j875n65P55J489
56412A78995J460R23L77L20Q46J467J573J229J158J655K020J451K42n40l69L12
56396A93119Q92J205J284J138J007J311K086K759K752K042J035K14k5M11J074
$$ y = [170465, 169258, 168582, 168211, 167783, 167285, 167044, 167224, 167602, 167911, 168060, 167924, 167316, 166468, 166124, 166714, 167713, 168255, 168181, 167925, 167609, 166910, 165816, 164814, 164158, 163568, 162850, 162286, 162066, 161835, 161236, 160640, 160943, 162757, 165922, 169552, 172506, 174207, 175239, 176751, 179145, 181739, 183886, 185746, 187553, 188815, 189022, 188727, 189062, 190279, 191524, 192077, 192127, 192185, 192358, 192497, 192597, 192768, 193095, 193697, 194640, 195649, 196211, 196164, 195920, 195972, 196454, 197317, 198616, 200379, 202426, 204534, 206584, 208267, 208954, 208241, 206569, 204888, 203625, 202316, 200356, 197913, 195850, 194880, 194972, 195545, 195955, 195717, 194519, 192358, 189735, 187480, 186169, 185643, 185130, 183865, 181690, 179191, 177316, 176751, 177506, 178995, 180455, 181378, 181755, 182075, 182921, 184388, 185961, 187190, 188348, 190003, 192023, 193474, 193716, 193176, 192807, 193119, 194011, 195216, 196500, 197638, 198645, 199956, 202042, 204801, 207553, 209595, 210630, 210844, 210819, 211230, 212304]
56381B12304J347J150R05Q29P52O93R74J481J449M78p52j298j083p26n93n44m08
56364B16958j93P1L46N57P16R57J214J257J163J340J835K137K012J916K114K070
56348B36470J367O93R43J827K283K022J687J609J430J038Q68J098J353J466J708
56333B57862K061K038J571J359J855K623L077L278L442L342K834K463K815L478
56319B94098L491K754K290K862L925M296L611K754K769L652M494M688M600M820
56305C45104N200N156M670M329M394M534M621N058N990O762O746O240O025O248
56291D21077O374O076N645N441N423N393N424N793O567P438Q034Q387Q937J0028
56277E16037J1474J2836J4027J5402J7266J9519K1884K4236K6712K9595L3112
$$ y = [212304, 213651, 214801, 215706, 216535, 217287, 217980, 218954, 220435, 221884, 222362, 221610, 220312, 219229, 218503, 217910, 217366, 216958, 216765, 216836, 217182, 217739, 218455, 219412, 220626, 221883, 223046, 224386, 226221, 228358, 230370, 232286, 234400, 236470, 237837, 238530, 239473, 241300, 243583, 245605, 247292, 248901, 250331, 251369, 252237, 253335, 254688, 256154, 257862, 259923, 261961, 263532, 264891, 266746, 269369, 272446, 275724, 279166, 282508, 285342, 287805, 290620, 294098, 297589, 300343, 302633, 305495, 309420, 313716, 317327, 320081, 322850, 326502, 330996, 335684, 340284, 345104, 350304, 355460, 360130, 364459, 368853, 373387, 378008, 383066, 389056, 395818, 402564, 408804, 414829, 421077, 427451, 433527, 439172, 444613, 450036, 455429, 460853, 466646, 473213, 480651, 488685, 497072, 506009, 516037, 527511, 540347, 554374, 569776, 587042, 606561, 628445, 652681, 679393, 708988, 742100]
56266G42100L7127M1209M5225M9725N5317O1815O8582P5570Q3334R1867J00220
56255A452091J07607J14184J20265J25397J28833J30422J30331J28167J23052
56246B560349J14469J02530Q7639P0403N1779L2722J3687n077k2923l9068n3304
56235B913206o5884p6597q4744r0230r4077r7398j00251j01924j02050j00992
56225A999059r9202r6737r3533q9780q5804q1687p7294p2685o8234o4199o0297
56214A109607n6000n1170m6171m1390l6948l2932k9522k6731k4282k1941j9772
56203G22748j7818j5858j3706j1628j0118r347r023q694q039o988n850n087m805
56190E95787m600m069l265k466j761j162q05o72l84K99R96J253J408K284M026
$$ y = [742100, 779227, 820436, 865661, 915386, 970703, 1032518, 1101100, 1176670, 1260004, 1351871, 1452091, 1559698, 1673882, 1794147, 1919544, 2048377, 2178799, 2309130, 2437297, 2560349, 2674818, 2777348, 2864987, 2935390, 2987169, 3019891, 3033578, 3028501, 3005578, 2966510, 2913206, 2847322, 2770725, 2685981, 2595751, 2501674, 2404276, 2304025, 2202101, 2100051, 1999059, 1899857, 1803120, 1709587, 1619807, 1534003, 1452316, 1375022, 1302337, 1234103, 1169904, 1109607, 1053607, 1002437, 956266, 914876, 877928, 844996, 815474, 788743, 764461, 742520, 722748, 704930, 689072, 675366, 663738, 653620, 644273, 635250, 626556, 618517, 611529, 605679, 600592, 595787, 591187, 587118, 583853, 581387, 579626, 578464, 577659, 576987, 576603, 576902, 577898, 579151, 580559, 582843, 586869]
56175E86869N745O568O526O296O377O816P447Q205R250J0769J2522J3740J3892
56162G01022J3534J3863J5326J7153J8487J9480K0907K3205K6403L0593L5752
56151I35725M1220M6241N1165N7445O5963P5768Q4932R2244R7354R9433R6710
56140A744200Q7995P4403N9161M5775L6469L1837L1083L2203L2468K9399K1875
56129B226868J0719j560j1777j7608j8881j7765j7702k1735l1222m5307o1354
56118A992676p6085q6892r2578r3325r0130q4130p6196o7072n7686m8938m1095
56107A178549l3773k6781k0563j5542j1432p790m860l130k262j263K68J794K843
56094A056058L627M455N299O239P682R755J1912J3474J4184J4108J3542J3160
$$ y = [586869, 592614, 599182, 605708, 612004, 618381, 625197, 632644, 640849, 650099, 660868, 673390, 687130, 701022, 714556, 728419, 743745, 760898, 779385, 798865, 819772, 842977, 869380, 899973, 935725, 976945, 1023186, 1074351, 1131796, 1197759, 1273527, 1358459, 1450703, 1548057, 1647490, 1744200, 1832195, 1906598, 1965759, 2011534, 2048003, 2079840, 2110923, 2143126, 2175594, 2204993, 2226868, 2237587, 2236027, 2224250, 2206642, 2187761, 2169996, 2152294, 2130559, 2099337, 2054030, 1992676, 1916591, 1829699, 1737121, 1643796, 1553666, 1469536, 1393340, 1326268, 1268582, 1219644, 1178549, 1144776, 1117995, 1097432, 1081890, 1070458, 1062668, 1057808, 1054678, 1052416, 1051153, 1051421, 1053215, 1056058, 1059685, 1064140, 1069439, 1075678, 1083360, 1093115, 1105027, 1118501, 1132685, 1146793, 1160335, 1173495]
56082A173495J3643J4827J5792J6033J5905J5699J5071J3876J2732J2127J1703
56071A330903J1128J1023J2057J3668J4618J4641J4556J4918J5478J5972J6600
56060A485562J7473J8311J8932J9616K0677K2041K3397K4571K5552K6383K7094
56049A729609K7776K8594K9746L1174L2465L3240L3644L4160L4979L5882L6683
56038B087952L7375L7893L8247L8879M0304M2331M4256M5902M7741M9967N2196
56027B563043N4236N6373N8734O1220O4065O7574P1219P4102P6394P9131Q2341
56016C308432Q4901Q6560Q8559R1696R5338R9050J03500J08874J14115J18861
56006D299886J24413J31528J38883J45236J51521J59146J67701J76136J84831
$$ y = [1173495, 1187138, 1201965, 1217757, 1233790, 1249695, 1265394, 1280465, 1294341, 1307073, 1319200, 1330903, 1342031, 1353054, 1365111, 1378779, 1393397, 1408038, 1422594, 1437512, 1452990, 1468962, 1485562, 1503035, 1521346, 1540278, 1559894, 1580571, 1602612, 1626009, 1650580, 1676132, 1702515, 1729609, 1757385, 1785979, 1815725, 1846899, 1879364, 1912604, 1946248, 1980408, 2015387, 2051269, 2087952, 2125327, 2163220, 2201467, 2240346, 2280650, 2322981, 2367237, 2413139, 2460880, 2510847, 2563043, 2617279, 2673652, 2732386, 2793606, 2857671, 2925245, 2996464, 3070566, 3146960, 3226091, 3308432, 3393333, 3479893, 3568452, 3660148, 3755486, 3854536, 3958036, 4066910, 4181025, 4299886, 4424299, 4555827, 4694710, 4839946, 4991467, 5150613, 5318314, 5494450, 5679281]
55997E679281J94598K04935K15193K26227K38989K52679K66435K81514K99608
55988G859459L20108L41373L63617L88125M14853M43355M75090N12012N53699
55979A1671691N98664O47726P03297P66115Q35603R12877J000560J100234J212958
55970A9449725J341665J490303J661751J859621K091052K364574K686827L064969
55962C6010487L510588M036954M653994N370174O197003P146222Q224813R439377
55954H4589612J0804490J2341556J4071764J6013465J8173140K0512661K2901760
55947A99408448K5071508K6561796K6686693K4636489J9821910J2330836L132426
55940C37650106o226782j4267477k0107909k3579119k5003928k4905277k3807910
$$ y = [5679281, 5873879, 6078814, 6294007, 6520234, 6759223, 7011902, 7278337, 7559851, 7859459, 8179567, 8520940, 8884557, 9272682, 9687535, 10130890, 10605980, 11117992, 11671691, 12270355, 12918081, 13621378, 14387493, 15223096, 16135973, 17136533, 18236767, 19449725, 20791390, 22281693, 23943444, 25803065, 27894117, 30258691, 32945518, 36010487, 39521075, 43558029, 48212023, 53582197, 59779200, 66925422, 75150235, 84589612, 95394102, 107735658, 121807422, 137820887, 155994027, 176506688, 199408448, 224479956, 251041752, 277728445, 302364934, 322186844, 334517680, 337650106, 331423324, 317155847, 297047938, 273468819, 248464891, 223559614, 199751704]
55933A99751704k2140573k0203867j8186105j6202072j4321598j2581605j0997436
55926H5118448r575988q319284p220416o265324n440349m733694m130921l615263
55918C5817209l173186k795393k472641k194945j955014j748403j570014j413890
55910A8493723j276384j156240j051382r58455q75381q01509p35361o74911o19785
55901A0344315n70593n26335m85114m47034m13635l84618l57787l32208l08802
55892F518189k87743k67809k48645k31289k15950k01330j86682j72888j61189
55883D544664j52321j46792j44334j42989j40446j36327j31842j27418j22414
55874C299781j16902j11774j07053j01846r6119r0839q6275q1810p7409p3621
$$ y = [199751704, 177611131, 157407264, 139221159, 123019087, 108697489, 96115884, 85118448, 75542460, 67223176, 60002760, 53737436, 48297087, 43563393, 39432472, 35817209, 32644023, 29848630, 27375989, 25181044, 23226030, 21477627, 19907613, 18493723, 17217339, 16061099, 15009717, 14051262, 13175881, 12374372, 11639011, 10964100, 10344315, 9773722, 9247387, 8762273, 8315239, 7901604, 7516986, 7159199, 6826991, 6518189, 6230446, 5962637, 5713992, 5482703, 5266753, 5065423, 4878741, 4705853, 4544664, 4392343, 4245551, 4101217, 3958228, 3817782, 3681455, 3549613, 3422195, 3299781, 3182879, 3071105, 2964052, 2862206, 2766087, 2675248, 2588973, 2507163, 2429754, 2356133]
55864B356133p0095o5932o1578n8520n6834n4853n1689m8359m5859m3788m1544
55853A757082l9467l8058l7184l6646l6504l6428l5845l4904l4222l3516l1858
55842A362450k9484k7876k7530k7174k5791k4042k2871k2014k0842j9613j8846
55831A096367j8215j7056j5402j3732j2156j0527q927p496o127m803l902l841
55819I74183m622n837o835p003o464o320p474r314j0467j0815j1609j3482j5445
55806H58496j6286j5933j5018j3992j3263j3288j3870j4050j3234j1876j0609
55795G07077r422q213p376p058o399m447j681R7n65l502p233j0191j1698j2006
55781F17383j1641j0953j0284j0026j0129r954r146q236p796p481o751o089o264
$$ y = [2356133, 2286038, 2220106, 2158528, 2100008, 2043174, 1988321, 1936632, 1888273, 1842414, 1798626, 1757082, 1717615, 1679557, 1642373, 1605727, 1569223, 1532795, 1496950, 1462046, 1427824, 1394308, 1362450, 1332966, 1305090, 1277560, 1250386, 1224595, 1200553, 1177682, 1155668, 1134826, 1115213, 1096367, 1078152, 1061096, 1045694, 1031962, 1019806, 1009279, 1000352, 992856, 986729, 981926, 978024, 974183, 969561, 963724, 956889, 949886, 943422, 937102, 929628, 920314, 909847, 899032, 887423, 873941, 858496, 842210, 826277, 811259, 797267, 784004, 770716, 756846, 742796, 729562, 717686, 707077, 697655, 689442, 682066, 675008, 668609, 664162, 662481, 662578, 662013, 658511, 651278, 641087, 629389, 617383, 605742, 594789, 584505, 574479, 564350, 554396, 545250, 537014, 529218, 521737, 514986, 508897, 502633]
55768E02633o722o009l893j715m08M72J357J681J033J42j92l34j174k875n057
55753D78939p586j0390j2978j4805j5871j6486j6857j7173j7546j7534j6346j3972
55741C01395j1470r700q444p208o155n574n145m487l771l157k247q96L8k68j328
55726B31583k011k163k518l238l583l106k324j970k205k677k956k803k360j971
55712A95698j577o46Q76K027J930J109Q04J215J372Q05K60M26Q37O07k75j064
55696B04404j305j131p32n7Q27J595J985K048J939J676J241Q04O59R27J513K277
55680B18670L111L789M008L722L276L062L085L057K725K037J205P05R54J706K085
55665B57197J596P78M19M41J19q50k112l377m643n712o179n960n299m300l093
$$ y = [502633, 495911, 489902, 486009, 484294, 483886, 484358, 485715, 487396, 488429, 488571, 488379, 488045, 486871, 483996, 478939, 471353, 460963, 447985, 433180, 417309, 400823, 383966, 366793, 349247, 331713, 315367, 301395, 289925, 280225, 271781, 264573, 258418, 252844, 247699, 243212, 239441, 236284, 234037, 233141, 233179, 232911, 231583, 229572, 227409, 224891, 221653, 218070, 214964, 212640, 210670, 208465, 205788, 202832, 200029, 197669, 195698, 194121, 193475, 194351, 196378, 198308, 199417, 200221, 201436, 202808, 203613, 203873, 204299, 205136, 205743, 205468, 204404, 203099, 201968, 201236, 201179, 202006, 203601, 205586, 207634, 209573, 211249, 212490, 213294, 213953, 214880, 216393, 218670, 221781, 225570, 229578, 233300, 236576, 239638, 242723, 245780, 248505, 250542, 251747, 252452, 253406, 255112, 257197, 258793, 259571, 259990, 260431, 260550, 259700, 257588, 254211, 249568, 243856, 237677, 231717, 226418, 222118, 219025]
55650B19025k286k378k728k118n17P79J065J185J983K978L381L551M300N412N908
55635B39540N467M606L652K442R19p27k420m034m999m770l652k520j818j372j069
55620B29245j061j320j552j617j557j325j004j146k308m205n939p028p682q077
55606A83424q083p804p680p755p464o495n406m944n061n073m600m002l873m310
55592A00874m769m548l497k180j274r20p97p17q03j114j372j231o45N4L92J10
55576G7563n08p43j11J067J979K185J926J670J590J556J342P26l56j630k532k656
55560H3068k088j270o02j77J79O91J413K120K452K232J650J106Q61Q40Q08P36
55544I4019P74R10Q38L79k06n49o77q61j108j227j280j494j781j809j655j835
$$ y = [219025, 216739, 214361, 211633, 209515, 208998, 209777, 210842, 212027, 214010, 216988, 220369, 223920, 228220, 233632, 239540, 245007, 249613, 253265, 255707, 256626, 255899, 253479, 249445, 244446, 239676, 236024, 233504, 231686, 230314, 229245, 228184, 226864, 225312, 223695, 222138, 220813, 219809, 218663, 216355, 212150, 206211, 199183, 191501, 183424, 175341, 167537, 159857, 152102, 144638, 138143, 132737, 127793, 122732, 117659, 113059, 109057, 105184, 100874, 96105, 91557, 88060, 85880, 84606, 83686, 82889, 82172, 81369, 80255, 78883, 77652, 77007, 77061, 77453, 77563, 77055, 76312, 76201, 77268, 79247, 81432, 83358, 85028, 86618, 88174, 89516, 90242, 89886, 88256, 85724, 83068, 80980, 79710, 79108, 78931, 79110, 79801, 81214, 83334, 85786, 88018, 89668, 90774, 91635, 92475, 93283, 94019, 94793, 95703, 96541, 96920, 96714, 96165, 95488, 94627, 93519, 92292, 91012, 89518, 87737, 85928, 84273, 82438]
55528H2438k535l294l637l568l280k849k416k194j977j272j51N61M34J34L88R02
55512E7684J006R08J350K255K676K152J331J062J507K346L292M173M850N347N767
55497I7706O065O110N944N655N100M133K971J964J024k32j813l287m360n094n579
55482A16307n848o150o691p067o605n450m675m926n468n139l899k837k746l217
55468D5589l316k779k192k103k219j836q77j44k79r28j328j408j658k015j730
55453B0777n18P73J152O92K63L25N52N38L29J39p9n12j100j489j362p46L2N86
55435B0352O60K81k25m15j47K11K12r8k52m4J58J4k78l37j75j29l60p51j140j370
55415A6167j240p87m30m74o30m32K2K39J50J36K97L00J14K04O95R54M58l15m65
$$ y = [82438, 79903, 76609, 72972, 69404, 66124, 63275, 60859, 58665, 56688, 55416, 55265, 55826, 56260, 56394, 56782, 57684, 58690, 59598, 60948, 63203, 65879, 68031, 69362, 70424, 71931, 74277, 77569, 81742, 86592, 91939, 97706, 103771, 109881, 115825, 121480, 126580, 130713, 133684, 135648, 136672, 136440, 134627, 131340, 126980, 121886, 116307, 110459, 104309, 97618, 90551, 83946, 78496, 73821, 68895, 63427, 58288, 54389, 51552, 48806, 45589, 42273, 39494, 37302, 35199, 32980, 31144, 30267, 30123, 29844, 28916, 27588, 26180, 24522, 22507, 20777, 20259, 21032, 22184, 22876, 23139, 23464, 24016, 24554, 24883, 25022, 24943, 24431, 23331, 21842, 20480, 19734, 19766, 20352, 21012, 21293, 21068, 20653, 20506, 20717, 20929, 20831, 20579, 20535, 20693, 20707, 20429, 20092, 19917, 19788, 19428, 18677, 17537, 16167, 14927, 14140, 13710, 13236, 12606, 12174, 12196, 12435, 12585, 12721, 13018, 13318, 13432, 13636, 14331, 15285, 15743, 15428, 14963]
55396A4963J26O72N55L1k21Q1O50J091J294J331J177O61k06j091j606j662j389
55379A6457q36o7N13M04l43j024j123r03q93r68m56Q02J957K085J270M31J07l5
55361A7378l87o50l41K56L53k33q59j067j153j436j596j264p87p46j012r36l96
55344E124L7k7k74j50M59J156J379Q52m7n34l01Q5Lk69l6O30R39N95J22q7k68
55323I388n54n37K2O26O96K79k55p72j084o89N39J697J671M86p40j135q19l36
55305H483K0J54m6n10q63p40j81M57Q74J021R89Q36O55O77J136J818J974J091
55287A7845k64r24n61j31n12j271j414r53p87j151j211m40M62O35K70P0J0m04
55269I269r70q56L9P51N84j9l33l53l56j33M73P64o4j496k052j190P2O38N76M44
$$ y = [14963, 15089, 15761, 16316, 16347, 16126, 16207, 16857, 17948, 19242, 20573, 21750, 22411, 22205, 21114, 19508, 17846, 16457, 15621, 15554, 16067, 16471, 16128, 15104, 13981, 13078, 12185, 11217, 10761, 11563, 13520, 15605, 16875, 17306, 17413, 17378, 16991, 16341, 16000, 16256, 16609, 16376, 15517, 14450, 13297, 11861, 10265, 9001, 8214, 7468, 6456, 5520, 5124, 5161, 5134, 4860, 4710, 5169, 6325, 7704, 8556, 8509, 7975, 7674, 7759, 7762, 7493, 7457, 8087, 9026, 9621, 9743, 9656, 9388, 8834, 8297, 8319, 8945, 9641, 9920, 9665, 8893, 7809, 7120, 7659, 9356, 11027, 11513, 10773, 9638, 8819, 8483, 8503, 8657, 8611, 8101, 7238, 6498, 6317, 6774, 7648, 8669, 9658, 10494, 11149, 11826, 12962, 14780, 16754, 17845, 17581, 16657, 16096, 15965, 15453, 14182, 12768, 11815, 11028, 9877, 8666, 8226, 8688, 9323, 9593, 9663, 9673, 9269, 8299, 7443, 7482, 8233, 8817, 8798, 8465, 8112, 7756, 7623, 8096, 8860, 8796, 7300, 5248, 4058, 4130, 4768, 5344, 5788]
55249E788K94lo5M71J148J209P42N36Q19R61N14r8k31O6J70l06j022j247o42K58
55229I362N68J40k17J33O73M73m02r02m41L57N26j42j081j606j341l94O67J226
55211G599J179Q73N29J01k92l41j20j40n36p13k89J27k93j255j512m80R42J475
55193F854R10J37r8J01K48K11K11M24Q35J370J786J588N40q05j529j442j249j461
55175H631j720j495r02l67R0O57J126J105O39J36j96l89m51m66o71r38o23M76
55157D642J474J470Q67O32O56P6r42j186l26M76M08J36M10O96K00o32p20O7R16
55138I320J294J286R92M43j6NL22L64n7o67j214j592j611j140m30J40N12Q81J261
55119A0093J485J432R83J3j194j877j601q93n53n30m0J240K708L586L686L315
$$ y = [5788, 6082, 6079, 6014, 6485, 7633, 8842, 9584, 10120, 10939, 11900, 12414, 12316, 12085, 12151, 12321, 12015, 10993, 9746, 9104, 9362, 9930, 10070, 9853, 9986, 10659, 11132, 10730, 9828, 9387, 9744, 10270, 10128, 9047, 7441, 6100, 5706, 6373, 7599, 8778, 9651, 10180, 10281, 9989, 9648, 9528, 9388, 8852, 8139, 7850, 7977, 7684, 6429, 4917, 4437, 5379, 6854, 7764, 7901, 7803, 7904, 8152, 8363, 8574, 8998, 9833, 11203, 12989, 14577, 15117, 14312, 12783, 11341, 10092, 8631, 6911, 5416, 4514, 4147, 4237, 4894, 6020, 7125, 7764, 7900, 7704, 7315, 6864, 6398, 5727, 4789, 4166, 4642, 6116, 7586, 8453, 9085, 9741, 9817, 8875, 7689, 7363, 7839, 8247, 8383, 8793, 9489, 9689, 9057, 8337, 8404, 9320, 10614, 11900, 12892, 13335, 13319, 13324, 13646, 14010, 13953, 13286, 12072, 10480, 8869, 7729, 7299, 7439, 7951, 8832, 10093, 11578, 13010, 13993, 14006, 12812, 10935, 9334, 8441, 7888, 7358, 7318, 8558, 11266, 14852, 18538, 21853]
55103B1853K779K219J678J199Q33N70K40l15r09j130r28o99o62n01K4M83K63n33
55085B6464j145j001k33N50P35J70o17q37k99L93O29M47R0m70j128j310o71J58
55067B1925L15m9K9Q90J704J484J64j418k213j690k78R05J098O17K20N8k40o67
55049B2854p90n58m61p12r58r46q84q94o80m1P08J216J600K071K410K214J470
55032B7619N18l62j080j482j391q73l14k9P6L76J015J616J614R22J04k42j00R3
55014B8080K1k54n14o20n05j82K59O61Q39O32J25j78K32J127J586J101K60l4K60
54995C2896M60J72l45p71j110j380j402j031l75L28Q02Q11L65j26j87K33P35R50
54977C1025Q25N77M81O64Q94Q26M62J58M7j34m43m36R7O46O97M98M64L30l55j212
$$ y = [21853, 24632, 26851, 28529, 29728, 30561, 31131, 31371, 31056, 30147, 29017, 28089, 27390, 26728, 26227, 26251, 26734, 26997, 26464, 25319, 24318, 24085, 24635, 25370, 25540, 24923, 24086, 23787, 24180, 24809, 25256, 25346, 24876, 23748, 22438, 21767, 21925, 22240, 22191, 22220, 23110, 24814, 26298, 26462, 25044, 22831, 21141, 20863, 21768, 22866, 23483, 23703, 23761, 23521, 22854, 22064, 21506, 21045, 20333, 19375, 18429, 17545, 16651, 15971, 15930, 16638, 17854, 19454, 21525, 23935, 26149, 27619, 28137, 27775, 26695, 25213, 23822, 22949, 22635, 22606, 22682, 23058, 24073, 25689, 27303, 28225, 28329, 28087, 27987, 28080, 28101, 27847, 27333, 26713, 26208, 26026, 26285, 26946, 27785, 28417, 28542, 28364, 28596, 29723, 31309, 32410, 32670, 32636, 32896, 33356, 33528, 33183, 32412, 31302, 29922, 28520, 27489, 27114, 27442, 28244, 29055, 29420, 29294, 29107, 29340, 30075, 31025, 31850, 32427, 32908, 33572, 34466, 35292, 35754, 35912, 35959, 35825, 35382, 34946, 35043, 35689, 36386, 36884, 37348, 37678, 37323, 36111]
54957C6111j428r36l86k7M10Q43Q72P39J233K309K878K417J817K119L181M307
54941E6459N410O791Q188Q960R008Q799Q535P881O479M309J583j366m073o092
54927A20871p271p773p895p836p544o783n581m457l944l889l681l114k490j910
54913D6703j129k74O7j90l63q4J28m5J49J393K925L454L060L027L800M375M062
54896G1058L757M648O476P848P930P019N632L865J829p5j656l274n184o874p613
54881I5386p507p340p336o757n127l285k526l006l657l634l122k655k218j480
54867C5736m86L17O22N61N18P24J002R71N51J67J91L44N5o93j285j290q26j62
54849C7017N09P58j3j776l520m143l455k177j150p79q86q94l97K59L58r3j83O47
$$ y = [36111, 34683, 33747, 33361, 33334, 33744, 34587, 35459, 36198, 37431, 39740, 42618, 45035, 46852, 48971, 52152, 56459, 61869, 68660, 76848, 85808, 94816, 103615, 112150, 120031, 126510, 130819, 132402, 131036, 126963, 120871, 113600, 105827, 97932, 90096, 82552, 75769, 70188, 65731, 61787, 57898, 54217, 51103, 48613, 46703, 45574, 45300, 45367, 45177, 44814, 44730, 44858, 44813, 44962, 46355, 49280, 52734, 55794, 58821, 62621, 66996, 71058, 74815, 79463, 85939, 93787, 101717, 108736, 114368, 118233, 120062, 119987, 118331, 115057, 109873, 102999, 95386, 87879, 80539, 73203, 66446, 61319, 58034, 55508, 52502, 48845, 45211, 42089, 39434, 37216, 35736, 35250, 35567, 36189, 36750, 37268, 37992, 38994, 39965, 40516, 40683, 40874, 41218, 41273, 40580, 39295, 38005, 37179, 37017, 37526, 38284, 38271, 36495, 32975, 28832, 25377, 23200, 22050, 21271, 20385, 19491, 19094, 19353, 19711, 19618, 19435, 20082]
54831B0082J666J702O44m87p90l34J96L25J50Q7L03M43J32k85j2J031J870J648
54813B8371O73j50m72m99k71L09R31J106R16Q38R24P57L10J34M67Q05P23N72Q97
54794C7341J536J909J957K306L374M767N704N840N500N268N551O434P660Q630
54780A03777Q640P419N400L315J486k55k074l835n295o225o320n342l601j941
54766I5149r70n83l80k11q3J73O46J053J076Q61P79Q88R86J067J227J217O53l01
54748A03247r82j075r55r38o99K50J792L297M344N013N440N453M752L314J451
54733A33704m58k219l808n211o397p346q008q180p680o633n462m519l866l486
54719F0431l430l525l258k298j059l52m44q45j083j291j673j807j015M77J437
$$ y = [20082, 21748, 23450, 24094, 23607, 22817, 22483, 22679, 23004, 23154, 23241, 23544, 23987, 24119, 23834, 23822, 24853, 26723, 28371, 29044, 28894, 28422, 27923, 27652, 27961, 28892, 29998, 30914, 31752, 32676, 33433, 33743, 33877, 34344, 35149, 35872, 36444, 37341, 38877, 40786, 42743, 45049, 48423, 53190, 58894, 64734, 70234, 75502, 81053, 87487, 95147, 103777, 112417, 119836, 125236, 128551, 130037, 129782, 127708, 123873, 118578, 112353, 106033, 100691, 97090, 95149, 94179, 93596, 93216, 93005, 92922, 93095, 93741, 94794, 95870, 96731, 97510, 98398, 99384, 100451, 101678, 102895, 103548, 103247, 102265, 101190, 100235, 99297, 98598, 98848, 100640, 103937, 108281, 113294, 118734, 124187, 128939, 132253, 133704, 133246, 131027, 127219, 122008, 115611, 108265, 100257, 92077, 84397, 77764, 72302, 67783, 63917, 60431, 57001, 53476, 50218, 47920, 46861, 46509, 46065, 45220, 44137, 42846, 41173, 39366, 38351, 38828, 40265]
54704D0265R78k48q22l22L02J51m86q70r50j096j101l73R10J786J809J580J627
54687D3140J518O48n97j215q88l19k34n32n06K72J421K051J668O86p2k36k5L41
54669D7121P21O65k49j483j726m98J115J894J936J995K036J557R30J195K482L705
54653F3396M089M098M466N086N472N707O283P176P709P407O516N516M369K602
54639A39892J40k325m065n207o375p504p654o320m374l147k975l216l295l118
54625H0457k638j827j038p42p98n70J24O76N04k79j150j721j868j660j411j507
54609F4552k012k606k960k928k459j621p76l45l52m69n02n21n78o59q67j251j475
54592D2171j187o42l65k20N12J778K370J368m63j498j180m63l86q52j085p86l92
$$ y = [40265, 41243, 40995, 40173, 39851, 40153, 40304, 39818, 38948, 37998, 36902, 35801, 35428, 36338, 38124, 39933, 41513, 43140, 44658, 45306, 44709, 43494, 42606, 42287, 42053, 41521, 41015, 41287, 42708, 44759, 46427, 47113, 47041, 46805, 46780, 47121, 47842, 48507, 48258, 46775, 45049, 44551, 45666, 47560, 49496, 51491, 53527, 55084, 56014, 57209, 59691, 63396, 67485, 71583, 76049, 81135, 86607, 92314, 98597, 105773, 113482, 120889, 127405, 132921, 137290, 139892, 140032, 137707, 133642, 128435, 122060, 114556, 106902, 100582, 96208, 93061, 90086, 86870, 83575, 80457, 77819, 75992, 74954, 74212, 73414, 72844, 72968, 73644, 74148, 73869, 72719, 70998, 69130, 67470, 66059, 64552, 62540, 59934, 56974, 54046, 51587, 49966, 49190, 48845, 48493, 48024, 47522, 47001, 46423, 45764, 44897, 43646, 42171, 40984, 40342, 39977, 39757, 40269, 42047, 44417, 45785, 45322, 43824, 42644, 42181, 41795, 40943, 39858, 39072, 38680]
54575C8680l03l65k20J36M39O56R41J167R29K21l96n51n22o08n84k50p4n40j119
54556C7637p79N71J903K342J943J173L48k57m01j87J10N77J439K313K428J818
54540E2978J405J679K127K247K386K937L476L366K761K318K260K285K009J126
54526H5360m46k157l064k996k898l435l911l395k342k000k498k696j971j029p17
54511D9805r25j094j059r10n65J2M88N31K35q1l27n17m61qN30N46j37r25j026
54492D4112l17N10P20L12q7r8L7l4j88j08J83L80M46O35R71J070P02K37K90R49
54472E0722J591J502O92q0j69K37M45K05o9rJ47Ll71n48l13J51M76L25l07q58
54452E3772n87M68J320J180M63J18L00L90J05j69k13l48p96j251j369j130n81
$$ y = [38680, 38377, 38012, 37792, 37928, 38367, 39023, 39964, 41131, 42060, 42281, 41885, 41334, 40812, 40204, 39620, 39370, 39296, 38756, 37637, 36858, 37429, 39332, 41674, 43617, 44790, 45138, 44881, 44480, 44293, 44403, 44980, 46419, 48732, 51160, 52978, 54383, 56062, 58189, 60436, 62822, 65759, 69235, 72601, 75362, 77680, 79940, 82225, 84234, 85360, 84914, 82757, 79693, 76697, 73799, 70364, 66453, 63058, 60716, 58716, 56218, 53522, 51551, 50522, 49805, 48880, 47786, 46727, 45817, 45252, 45264, 45752, 46283, 46518, 46437, 46110, 45593, 45132, 45124, 45654, 46200, 46063, 45138, 44112, 43795, 44305, 45025, 45337, 45250, 45152, 45189, 45155, 44967, 44859, 45042, 45422, 45868, 46503, 47474, 48544, 49246, 49483, 49773, 50722, 52313, 53815, 54507, 54427, 54258, 54495, 54940, 55145, 55076, 55067, 55214, 55217, 54846, 54298, 53985, 54136, 54612, 54937, 54630, 53772, 53185, 53653, 54973, 56153, 56616, 56734, 57034, 57424, 57529, 57360, 57147, 56799, 56003, 54752, 53383, 52253, 51672]
54435E1672K67R77P94l19j288j116j18O21O55L70J5n72j178j038Q1J264J507J098
54417E3692J219K230L028K438P13p56j095p25m90m52QJ077K053K116J307L79j30
54400F6612l23m49m70l51m26r61j502j232j07R05R82M39R6R7k9l54l88K8L26q
54380F2885p65j438j799j745j041J93J137J006M9p00o73k07J51L11L94L49N9l39
54362E7827n95n91l58P1O25J105J286J097P04M23M96Q58J136J048P44N80O07M86
54344F7549l6q00j431j683j491r19k06K98M00K55J11l5l99j006j525j571j108
54327E6403n21l00o15j181j518j383r52o02n76q56j244j416j001P3J247J565O34
54310D7757p43j286o77Q3qo95r86o27l81p67j182p68L47J171J102N08Q3P1K63
$$ y = [51672, 51939, 52916, 53710, 53391, 52103, 50987, 50869, 51490, 52145, 52515, 52530, 51958, 50780, 49742, 49823, 51087, 52594, 53692, 54911, 57141, 60169, 62607, 63320, 62564, 61469, 60744, 60254, 59802, 59810, 60887, 62940, 65056, 66363, 66742, 66612, 66289, 65840, 65370, 65019, 64593, 63632, 62130, 60898, 60791, 61696, 62678, 63117, 63213, 63310, 63281, 62927, 62539, 62567, 62893, 62885, 62120, 60682, 58883, 57138, 56097, 56290, 57427, 58433, 58482, 57782, 57109, 56902, 57053, 57364, 57758, 58107, 58166, 57827, 57232, 56641, 56283, 56354, 56979, 58084, 59370, 60467, 61171, 61594, 62090, 62948, 64084, 65132, 65876, 66456, 67063, 67549, 67513, 66713, 65282, 63599, 62108, 61189, 60983, 61281, 61681, 61936, 62047, 62012, 61613, 60607, 59082, 57511, 56403, 55882, 55582, 54967, 53786, 52268, 50885, 49933, 49331, 48755, 47899, 46655, 45239, 44238, 44311, 45558, 47123, 47757, 47014, 45728, 45051, 45134, 45126, 44431, 43445, 42818, 42437, 41670, 40488, 39720, 40067, 41238, 42340, 42848, 42931, 43002, 43265]
54291D3265M50N49N28M15L56M44M85K33j41p1O08J166P47l74q60K0J300J443K89
54272E0852q16q09n0M82M72K68J70K79P14J353J565Q69j94m68L34J183J029R9
54254E7332n37m02n5j58n62o24r7N85Q34M73k71j003j331j033k97M12Q58J211
54236E5335J556J508P71j46m38j77k47r80j567j223l55R8l7j60N9L67N72P75Q63
54217E6574M36m64j097r00k99k55j067j979k041j243n15o13j180j211m18L82M25
54200D4535Q9K23P56P47j49j047j025l72n8l18m48O3Q04J066P79M22J87k76j188
54181D4790k049k092j212j62K42j04o63q43m51K08N74L23k77o50o36o45r34j093
54163C4326n63N41J528J871J573R27L00QL6r2p83j737k199j843j112n71l14j14
$$ y = [43265, 43715, 44264, 44792, 45207, 45563, 46007, 46492, 46725, 46584, 46513, 47121, 48287, 49034, 48660, 47800, 47820, 49120, 50563, 50852, 50036, 49227, 49177, 49659, 50131, 50399, 50569, 50848, 51562, 52915, 54480, 55349, 55155, 54687, 55021, 56204, 57233, 57332, 56795, 56393, 56338, 56180, 55618, 54994, 54897, 55482, 56316, 56789, 56518, 55515, 54184, 53151, 52854, 53266, 54124, 55335, 56891, 58399, 59170, 59024, 58586, 58409, 58162, 57182, 55615, 54392, 54037, 54135, 54098, 53938, 53997, 54364, 54936, 55711, 56574, 57010, 56546, 55449, 54549, 54250, 53995, 52928, 50949, 48908, 47665, 47150, 46537, 45357, 44146, 43728, 44110, 44535, 44624, 44847, 45603, 46350, 46201, 45154, 44129, 43757, 43699, 43381, 42933, 42996, 43800, 44866, 45645, 46067, 46254, 45978, 44790, 42741, 40649, 39437, 39275, 39517, 39413, 38750, 37907, 37456, 37664, 38238, 38561, 38284, 37634, 36998, 36353, 35419, 34326, 33763, 34304, 35832, 37703, 39276, 40203, 40503, 40511, 40547, 40455, 39672, 37935, 35736, 33893, 32781, 32210, 31896, 31782]
54145C1782J76N13P91R35R55R44Q96O61K39nK57P67R09N00n6m00o01p78p77m97
54125C7211j84j00j63j35j5P5J56K75K21k24q21r72m16M11Q52P44M76M11M64L43
54105C8609L7j43J3L41N61N61L70k3n41q88p31p9O71J027Q11L93M88J472K731
54086D5680L091K114O88NK52O79O85K68l35r04j091o88k7L29L60N78J150J644
54068E4478J727J524J138M06n51j115r40m47j24J74P77J423J533J083O12M27L42
54051F2467J75R1K84O46R03R46R55J238J961K916L701M094M202M214M292M666
54035I7751N454O237O253N322M226L718L544K938J815Q54M60K98Pk00P5P38J213
54018A40703J017J96p23j214j297j568k452l553m066l806l389l338l460l353l089
$$ y = [31782, 31958, 32471, 33262, 34197, 35152, 36096, 36992, 37653, 37892, 37887, 38144, 38911, 39820, 40320, 40264, 39864, 39263, 38485, 37708, 37211, 37027, 36927, 36764, 36629, 36614, 36689, 36845, 37120, 37341, 37117, 36296, 35324, 34908, 35319, 36171, 36915, 37391, 37802, 38266, 38609, 38646, 38503, 38516, 38857, 39418, 39979, 40349, 40326, 39785, 38897, 38166, 38087, 38758, 39785, 40596, 40989, 41477, 42949, 45680, 48771, 50885, 51573, 51578, 51830, 52509, 53194, 53462, 53127, 52223, 51132, 50444, 50417, 50746, 51106, 51684, 52834, 54478, 56205, 57729, 58867, 59273, 58722, 57607, 56667, 56220, 56096, 56270, 57047, 58470, 60003, 61086, 61698, 62125, 62467, 62642, 62733, 63017, 63663, 64566, 65512, 66467, 67705, 69666, 72582, 76283, 80377, 84579, 88793, 93085, 97751, 103205, 109442, 115695, 121017, 125243, 128961, 132505, 135443, 137258, 138112, 138572, 138870, 138877, 138677, 138752, 139490, 140703, 141720, 141916, 141193, 139979, 138682, 137114, 134662, 131109, 127043, 123237, 119848, 116510, 113050, 109697, 106608]
54003A06608l047l239l260k840k168j631j469j650j948k140k175k198k234k049
53989G4560j448o84k55l33n82o62o37p68j056j212j004m58K00O97Q41O87N37O86
53971F9109J133J533J436N90p02j530j035N02J586J066l98j055k45Q78J041M68
53955G4377K61P62J274J207P65N22Q05J536K329K762K788K793K969K993K732K830
53939A03705L874N288N913N605N374N817O382O401N989N413M467L127K109K017
53925A71481K411K416J912J462J364J491J820K404K928L017K934L330M290N186
53911B08446N528N344M729L584K067O31m89j440k171k295j836j551k036k904l373
53896B12234l384l570m269n106n578n539n057m262l571l591m473n481n671m863
$$ y = [106608, 103561, 100322, 97062, 94222, 92054, 90423, 88954, 87304, 85356, 83216, 81041, 78843, 76609, 74560, 73112, 72428, 72173, 71840, 71258, 70596, 69959, 69191, 68135, 66923, 65919, 65461, 65661, 66358, 67199, 67886, 68423, 69109, 70242, 71775, 73211, 73801, 73099, 71569, 70534, 71036, 72622, 73688, 73290, 72235, 71990, 72868, 73909, 74377, 74638, 75400, 76674, 77881, 78646, 79168, 79973, 81509, 83838, 86600, 89388, 92181, 95150, 98143, 100875, 103705, 107579, 112867, 118780, 124385, 129759, 135576, 141958, 148359, 154348, 159761, 164228, 167355, 169464, 171481, 173892, 176308, 178220, 179682, 181046, 182537, 184357, 186761, 189689, 192706, 195640, 198970, 203260, 208446, 213974, 219318, 224047, 227631, 229698, 230329, 229840, 228400, 226229, 223934, 222098, 220547, 218511, 215607, 212234, 208850, 205280, 201011, 195905, 190327, 184788, 179731, 175469, 171898, 168307, 163834, 158353, 152682, 147819]
53882A47819l746l037k830k825k826k869l051l388l756l878l533k905k476k430
53868A04269k372j957j555j829k735l388l059j995j031p04q86j150j243j276j523
53853G7566k035k451k342j700r05k76R0R3l97j162j572j119O0J271J808J418M61
53836F8808l41m96j37L06O24P82O29J51j48K63J051J318R00O00R21J331J248R41
53818G8751R24J082J087J147J543J909J714J183R47J111J437K088L315M550M837
53803A07625M179L544L450L445L133K785K610K336J882J684J854J732Q87j5p5
53788A41056N91J097R50L90k10o72q97r72j303k157l143l625l544l410l496l570
53772A17085l412l199l116k988k598k106j907k065k172j895j463j384j696j800
$$ y = [147819, 144073, 141036, 138206, 135381, 132555, 129686, 126635, 123247, 119491, 115613, 112080, 109175, 106699, 104269, 101897, 99940, 98385, 96556, 93821, 90433, 87374, 85379, 84348, 83644, 82758, 81608, 80365, 79089, 77566, 75531, 73080, 70738, 69038, 68133, 67857, 67947, 68040, 67643, 66481, 64909, 63790, 63850, 65121, 66929, 68347, 68808, 68467, 67971, 67834, 68140, 68764, 69546, 70175, 70326, 70178, 70441, 71492, 72810, 73710, 74310, 75231, 76562, 77810, 78751, 79675, 80757, 81844, 82991, 84534, 86443, 88157, 89340, 90287, 91398, 92835, 94923, 98238, 102788, 107625, 111804, 115348, 118798, 122243, 125376, 128161, 130771, 133107, 134989, 136673, 138527, 140259, 141146, 141131, 141056, 141647, 142744, 143694, 144084, 143874, 143202, 142305, 141333, 140030, 137873, 134730, 131105, 127561, 124151, 120655, 117085, 113673, 110474, 107358, 104370, 101772, 99666, 97759, 95694, 93522, 91627, 90164, 88780, 87084, 85284]
53758H5284j320p80r67j735k083j513o98m61p21r37j054j246j175l52P78J083
53742G2103K49p06p36L6P76R85O53j01r32j188n64L40O73L89J01R6J15N9J93N60
53722G3101P95P65P84J017J244J430J830K242J891O55l39j11P26Q31J18k20M62
53705H7221J461J924J853J561J064N03M45J110J828J847J293Q34P69R54J285J720
53689A07672K044K137K247K544K700K371J856J645J559R61k15j272j643j409q65
53674A22332j93L40L63n8l04Q1P75J078P22P1l87n04m54l89k71l2J63K7m18p66
53654A22176o58j24O02J314J691J290P9j212j749j486r63m55J72P58P17j57j164
53637A20831j382o87J99O00N72O81J178J664J669J365J349J680J664Q84n6k10
$$ y = [85284, 83964, 83184, 82217, 80482, 78399, 76886, 76188, 75727, 75006, 74069, 73015, 71769, 70594, 70242, 71020, 72103, 72352, 71646, 70910, 70946, 71722, 72707, 73360, 73259, 72327, 71139, 70575, 70915, 71588, 71977, 72078, 72174, 72289, 72348, 72541, 73101, 73896, 74661, 75445, 76462, 77706, 79136, 80966, 83208, 85099, 85754, 85415, 85304, 86030, 86861, 86979, 86759, 87221, 88682, 90606, 92459, 94020, 95084, 95587, 96032, 97142, 98970, 100817, 102110, 102944, 103713, 104667, 105952, 107672, 109716, 111853, 114100, 116644, 119344, 121715, 123571, 125216, 126775, 127736, 127521, 126249, 124606, 123197, 122332, 122139, 122479, 122842, 122784, 122480, 122561, 123336, 124414, 125136, 125207, 124820, 124316, 123862, 123473, 123202, 123170, 123333, 123360, 122942, 122176, 121518, 121394, 121996, 123310, 125001, 126291, 126370, 125158, 123409, 121923, 120960, 120505, 120677, 121435, 122152, 121995, 120831, 119449, 118762, 118961, 119561, 120133, 120814, 121992, 123656, 125325, 126690, 128039, 129719, 131383, 132267, 132211, 132001]
53621A32001O15J828K790L087K455J147J79M42J578K343K133J505J199J309J563
53606A56174J840K064K147K217K538K999L153K943K858L190L546L404K764J997
53592A93834J390J079J088J226J181R16P09P14P72P49O55M27l3m65m33k6J21l01
53574B03603q86j241j507j871k040j682j011n09l24k74k20j10K8k0m33q90p74
53557A89839j42J27m95j348j484r48n69p00q29m10M21J028R58L88QK72Q85J305
53539A88306J616K262K935K683J497P31J311K363K533J965J831K416L006L390
53525B18845M196N531O535O632O326O216O091N548M930N003N999P429Q719R657
53511C07657J0384J1114J1869J2400J2517J2436J2554J2981J3597J4464J5687
$$ y = [132001, 132616, 134444, 137234, 140321, 142776, 143923, 144102, 144544, 146122, 148465, 150598, 152103, 153302, 154611, 156174, 158014, 160078, 162225, 164442, 166980, 169979, 173132, 176075, 178933, 182123, 185669, 189073, 191837, 193834, 195224, 196303, 197391, 198617, 199798, 200714, 201423, 202137, 202909, 203658, 204313, 204740, 204707, 204242, 203809, 203783, 203904, 203603, 202717, 201476, 199969, 198098, 196058, 194376, 193365, 192856, 192532, 192258, 192038, 191928, 191956, 191936, 191503, 190613, 189839, 189697, 189824, 189329, 187981, 186497, 185549, 184980, 184280, 183451, 183041, 183462, 184490, 185448, 185836, 185844, 186116, 187001, 188306, 189922, 192184, 195119, 197802, 199299, 200030, 201341, 203704, 206237, 208202, 210033, 212449, 215455, 218845, 223041, 228572, 235107, 241739, 248065, 254281, 260372, 265920, 270850, 275853, 281852, 289281, 298000, 307657, 318041, 329155, 341024, 353424, 365941, 378377, 390931, 403912, 417509, 431973, 447660]
53500D47660J6946J7682J7883J8157J8836J9398J9157J8143J7033J6439J6479
53489F43813J6874J7193J7166J6865J6622J6662J6919J7216J7442J7526J7366
53478H31664J6870J6064J5199J4743J4973J5446J5259J4164J3085J3041J3749
53467I94257J3951J2937J1147R307P619O018M504L009J356l98k004l518n274p177
53453A045734q590r187r421r843j0440j0933j1283j1545j1679j1913j2741j4119
53441I14040j5119j5010j4289j3995j4323j4593j4386j3973j3680j3463j3146
53430G58063j2449j0840q077n006l097k866l273l019j976r41m11j15M64J518K818
53415G10793L889M407M603N159O522Q387J0081J1263J2076J2805J3671J4836J6235
$$ y = [447660, 464606, 482288, 500171, 518328, 537164, 556562, 575719, 593862, 610895, 627334, 643813, 660687, 677880, 695046, 711911, 728533, 745195, 762114, 779330, 796772, 814298, 831664, 848534, 864598, 879797, 894540, 909513, 924959, 940218, 954382, 967467, 980508, 994257, 1008208, 1021145, 1032292, 1041599, 1049218, 1055236, 1059740, 1062749, 1064105, 1063707, 1061703, 1058185, 1052911, 1045734, 1037144, 1027957, 1018536, 1008693, 998253, 987320, 976037, 964492, 952813, 940900, 928159, 914040, 898921, 883911, 869622, 855627, 841304, 826711, 812325, 798352, 784672, 771209, 758063, 745614, 734774, 726697, 721691, 718594, 715728, 712455, 709436, 707460, 706519, 706108, 705993, 706457, 707975, 710793, 714682, 719089, 723692, 728851, 735373, 743760, 753841, 765104, 777180, 789985, 803656, 818492, 834727]
53402H34727J7444J8021J8059J8227J9177K0991K3133K4903K6034K6985K8470
53391A076171L0570L2603L4052L5262L6787L8384L9382L9892M0712M1962M2658
53380A488435M2117M1020M0450M0394L9986L8876L7565L6445L5252L3581L1364
53369A905485K8725K5812K2860K0130J7665J5399J3412J1653R506O149J470l753
53357B074513q687j3085j7150k1210k5575l0122l3988l6211l6910l7226l7909
53346A776440l8495l8244l7263l6227l5442l4749l4010l3160l2032l0636k9455
53335A396727k9041k9361k9912l0299l0365k9922k8811k7204k5502k3874k2129
53324A090307j9983j7383j4687j2614j1664j1470j1049r952q839q629r454j0756
$$ y = [834727, 852171, 870192, 888251, 906478, 925655, 946646, 969779, 994682, 1020716, 1047701, 1076171, 1106741, 1139344, 1173396, 1208658, 1245445, 1283829, 1323211, 1363103, 1403815, 1445777, 1488435, 1530552, 1571572, 1612022, 1652416, 1692402, 1731278, 1768843, 1805288, 1840540, 1874121, 1905485, 1934210, 1960022, 1982882, 2003012, 2020677, 2036076, 2049488, 2061141, 2070647, 2076796, 2078266, 2074513, 2065826, 2052741, 2035591, 2014381, 1988806, 1958684, 1924696, 1888485, 1851575, 1814349, 1776440, 1737945, 1699701, 1662438, 1626211, 1590769, 1556020, 1522010, 1488850, 1456818, 1426182, 1396727, 1367686, 1338325, 1308413, 1278114, 1247749, 1217827, 1189016, 1161812, 1136310, 1112436, 1090307, 1070324, 1052941, 1038254, 1025640, 1013976, 1002506, 991457, 981505, 972666, 964037, 954583, 943827]
53312I43827j1999j2813j2840j2041j0991j0387j0293j0266r938r133p667n609
53300H19850l556k124j203k37R39J971K611L033L529M358N739P632R565J1088
53286H63195J2283J3502J4801J5986J6953J7573J7544J6925J6434J6592J6873
53275A038661J6394J5207J4090J3323J2520J1503J0434R134P224N047L417K358
53263A159312J043p99k500l794n480q123j1007j3129j4556j6057j7872j9517k0564
53250A026957k0961k0848k0451k0051j9798j9708j9859k0240k0418j9961j9178
53239H05484j8750j8572j7803j6314j5147j5055j5544j5890j6239j6925j7428
53228F21817j6980j5682j4218j2901j1700j0797j0270r610q314o779n791n412
$$ y = [943827, 931828, 919015, 906175, 894134, 883143, 872756, 862463, 852197, 842259, 833126, 825459, 819850, 816294, 814170, 812967, 812730, 813669, 815640, 818251, 821284, 824813, 829171, 834910, 842542, 852107, 863195, 875478, 888980, 903781, 919767, 936720, 954293, 971837, 988762, 1005196, 1021788, 1038661, 1055055, 1070262, 1084352, 1097675, 1110195, 1121698, 1132132, 1141266, 1148490, 1153537, 1156954, 1159312, 1160355, 1159556, 1157056, 1153262, 1147782, 1139659, 1128652, 1115523, 1100967, 1084910, 1067038, 1047521, 1026957, 1005996, 985148, 964697, 944646, 924848, 905140, 885281, 865041, 844623, 824662, 805484, 786734, 768162, 750359, 734045, 718898, 703843, 688299, 672409, 656170, 639245, 621817, 604837, 589155, 574937, 562036, 550336, 539539, 529269, 519659, 511345, 504566, 498775, 493363]
53216D93363n107m750m760n315o153p083q067q951r610j0283j1213j2158j2677
53203C87236j2642j2052j0744q968p795q053r157r750r341q464p542o611o047
53190B70070o350p152p444p044o831p266p725p623p272p060o687n872n089m805
53176A75850m609l839k660j767j330r57o09p46j535k448k859k687k328k149k160
53161A43167k090j729j185p80o65o83o38n07m40o43j236j995k350j975j312j097
53145A23842j402j623j479j393j625j663r74J28Q68J021R30P16J15p95j349j023
53129A14294j21N72O68M48L19L52L22J20j82n25q95j156j060o32k58k72n87r40
53111A10467j272j568j538q99J04P97Q10L15l32q70j062q08l95k48l81m40l73
$$ y = [493363, 488256, 483506, 478746, 473431, 467278, 460195, 452128, 443177, 433567, 423284, 412071, 399913, 387236, 374594, 362542, 351798, 342830, 335035, 326982, 317825, 308075, 298734, 290270, 282728, 276117, 270070, 263720, 256568, 249124, 242080, 235249, 227983, 220258, 212635, 205363, 198303, 191616, 185744, 180655, 175850, 171241, 167402, 164742, 162975, 161645, 160688, 160079, 159333, 157798, 155350, 152491, 149804, 147476, 145327, 143167, 141077, 139348, 138163, 137383, 136718, 136035, 135397, 134890, 134450, 133807, 132571, 130576, 128226, 126251, 124939, 123842, 122440, 120817, 119338, 117945, 116320, 114657, 113683, 113811, 114679, 115700, 116630, 117346, 117461, 116666, 115317, 114294, 114173, 114745, 115413, 115861, 116180, 116532, 116854, 116974, 116792, 116267, 115372, 114216, 113156, 112524, 112266, 111994, 111407, 110467, 109195, 107627, 106089, 105190, 105294, 106091, 106901, 107216, 106884, 106014, 104952, 104144, 103749, 103501, 103120, 102680, 102307]
53094A02307n58j150j729j814j393p42j34J00l06j093j498j113l33K64O38J018
53078I2464J268J060M61j30m58n55m57j95Q6K97N62R30J113Q98N81N68P32O31
53060I9856K87J47L34M67L32J81J63J1m24p62o63m31n96j037j043k97O21R25O04
53041I8675L58O33J003P29j77p96l47Q39J705J715J430J676K473L018K661J655
53025A17250Q71Q93J479J926J822J372J025R61J006R17O08J45k89m28p2P00J410
53008A31596J453N31r68k091k070j110k53k43o72n92J84Q60P76K52oJ47L66N83
52990A28743J019J493J349L70p03r65l56M62R62J069Q34L45l9O1M60N72L19L40
52972A36335R76J529J120j6p56m61L99J041J142P51M7n27l87M64J153Q70n6n38
$$ y = [102307, 101749, 100599, 98870, 97056, 95663, 94921, 94787, 94887, 94581, 93488, 91990, 90877, 90544, 90808, 91446, 92464, 93732, 94792, 95253, 95123, 94665, 94110, 93653, 93458, 93544, 93841, 94403, 95333, 96446, 97344, 97925, 98493, 99225, 99856, 100143, 100290, 100624, 101091, 101423, 101604, 101767, 101778, 101354, 100592, 99929, 99498, 98902, 97865, 96822, 96525, 97146, 98071, 98675, 99033, 99666, 100669, 101398, 101221, 100425, 100078, 100917, 102622, 104337, 105767, 107443, 109916, 112934, 115595, 117250, 118121, 119014, 120493, 122419, 124241, 125613, 126638, 127599, 128605, 129522, 130130, 130275, 129986, 129558, 129486, 130186, 131596, 133049, 133580, 132612, 130521, 128451, 127341, 127088, 126845, 126173, 125581, 125765, 126625, 127401, 127653, 127647, 127794, 128160, 128743, 129762, 131255, 132604, 132974, 132271, 131306, 130950, 131412, 132374, 133443, 134277, 134622, 134583, 134644, 135104, 135676, 135995, 136335, 137311, 138840, 139960, 139944, 139188, 138727, 139126, 140167, 141309, 142060, 142107, 141580, 141193, 141657, 142810, 143680, 143624, 143086]
52954A43086j10N59N95m1o74q12n55k40pK01M14O20Q67J192J428J297P28j4o41
52935A47893j044j129o93K11R93J018L91j75l50n36j070j508j177j90N66M45l25
52918A43320r96j029m24L69P40L81m11r53p75mQ27J225J014L33n36j327j816j785
52900A38153j115oJ026J501J336P86J59l15n25n78p38j087j361j332j130r11l96
52883A33467O75J807K050J259M30M60J047J333J169J128J474J846J980K111K407
52868A54643K515J988Q45n42j855k865l313l098k482j909j676j827k206k468k335
52853A33415k004k039k624l199l210k863k692k626k118j113k86j69o35j327k029
52838A04481k421k039r28J19M07J33j0K47O11P61N42j07j085j975k372k232j683
$$ y = [143086, 142976, 143535, 144130, 144089, 143415, 142603, 142048, 141808, 141801, 142002, 142416, 143036, 143903, 145095, 146523, 147820, 148548, 148534, 147893, 146849, 145720, 145027, 145238, 146231, 147249, 147640, 147465, 147115, 146579, 145509, 144001, 142824, 142634, 143200, 143645, 143320, 142324, 141295, 140871, 141240, 141980, 142361, 141950, 140997, 140222, 140218, 141045, 142270, 143284, 143617, 143081, 141754, 139938, 138153, 137038, 137032, 138058, 139559, 140895, 141681, 141840, 141525, 141000, 140422, 139684, 138597, 137236, 135904, 134774, 133863, 133467, 134142, 135949, 137999, 139258, 139688, 140148, 141195, 142528, 143697, 144825, 146299, 148145, 150125, 152236, 154643, 157158, 159146, 159991, 159449, 157594, 154729, 151416, 148318, 145836, 143927, 142251, 140424, 138218, 135750, 133415, 131411, 129372, 126748, 123549, 120339, 117476, 114784, 112158, 110040, 108927, 108641, 108472, 107837, 106510, 104481, 102060, 100021, 99093, 99212, 99619, 99752, 99742, 99989, 100600, 101361, 101903, 101796, 100711, 98736, 96364, 94132, 92449]
52821I2449p87K05O80L15l24l52K80Q38Q78O62M90K89Pj84k70m59o19k92M62Q63
52801I5131M75m7J25P73J041P01L46L51M13K24J5Q6K86K34j51o06q37o86j67M49
52781I8156P22M03l08r76j329j325r20p0R94J752J864J562J341J295J001J84q06
52764A03540j314j086l93L28P65O97Q5p55j265j138n95q6J83L91P98J342J564
52747A03061J093K09l08l5N82R10R73J190J458J201L64k43R7J114J915J886J062
52730A16529J6l99L85J942K979K582J161j13n45l01J70N43O14L32q3l01k06J02
52712A25407M28M69p9j089j877j832j083k60L00O96J026J167J092J044J246J620
52696A28275J811J508P63P8m2K96N21M05L55O37Q31N07J8mL50M70K12o1l38r66
$$ y = [92449, 91662, 91867, 92547, 92862, 92538, 92186, 92466, 93304, 94182, 94844, 95334, 95623, 95630, 95446, 95176, 94717, 94098, 93806, 94268, 95131, 95606, 95559, 95684, 96457, 97498, 98199, 98545, 98896, 99309, 99533, 99548, 99634, 99920, 100154, 100003, 99397, 98560, 97874, 97707, 98156, 98878, 99281, 98973, 97997, 96668, 95343, 94423, 94353, 95347, 97099, 98963, 100525, 101866, 103161, 104162, 104346, 103540, 102226, 101140, 100747, 101075, 101840, 102537, 102622, 101867, 100602, 99464, 98869, 98783, 98966, 99357, 100155, 101497, 103061, 104154, 104363, 104055, 104020, 104602, 105512, 106485, 107675, 109133, 110334, 110698, 110455, 110552, 111666, 113581, 115467, 116529, 116545, 116146, 116531, 118473, 121452, 124034, 125195, 125082, 124537, 124236, 124406, 124949, 125563, 125895, 125812, 125511, 125305, 125407, 125835, 126304, 126225, 125136, 123259, 121427, 120344, 120084, 120384, 121080, 122106, 123273, 124365, 125409, 126655, 128275, 130086, 131594, 132357, 132435, 132393, 132689, 133210, 133615, 133970, 134607, 135438, 135945, 135963, 135959, 136309, 136779, 136991, 136930, 136592, 135626]
52676A35626j832k282k113j884j953j971j670j473j723j958j614j010q73j132
52662A12138r59p9P41O70j40q55r94q51r12j168j151o25O1M62O87J135J730J890
52644A11780J460J067J267J770J946J742J566J484J162N72J29N2K5k50n82o42
52628A24548m89n34j066j963k740k823k015q01L8K25K31N53J090J440J479J274
52612A18447O91l09j137j013q2N92M73L74J231K596L206K732K042J782J664J460
52596A34749J581K110K087P53j051j763j093j95Q8R5K88L22k51j067j416j208
52580A34029r14p88o18k07L56Q01Q73M47l30j105j571j582j032J4R88J115K68
52563A30744p63j165r49o29m52m15o54j241j771j735j272r75r73p88k56N9l01
$$ y = [135626, 133794, 131512, 129399, 127515, 125562, 123591, 121921, 120448, 118725, 116767, 115153, 114143, 113270, 112138, 111179, 111100, 111841, 112511, 112371, 111516, 110522, 109671, 108759, 107591, 106440, 105815, 105876, 106338, 107025, 108160, 109890, 111780, 113240, 114307, 115574, 117344, 119290, 121032, 122598, 124082, 125244, 125816, 125945, 125997, 126022, 125772, 125190, 124548, 124059, 123525, 122459, 120496, 117756, 114933, 112918, 112117, 112155, 112380, 112611, 113164, 114254, 115694, 117173, 118447, 119138, 118829, 117692, 116679, 116597, 117189, 117662, 118036, 119267, 121863, 125069, 127801, 129843, 131625, 133289, 134749, 136330, 138440, 140527, 141280, 140229, 138466, 137373, 137178, 137266, 137361, 137649, 137971, 137720, 136653, 135237, 134029, 133115, 132327, 131709, 131502, 131858, 132659, 133532, 133979, 133649, 132544, 130973, 129391, 128359, 128373, 129361, 130476, 130744, 129981, 128816, 127867, 127238, 126786, 126371, 125717, 124476, 122705, 120970, 119698, 118723, 117750, 116962, 116706, 116765, 116464]
52546A16464r58j221j059r68j045q16j25L28j28j031j224m10L47J22n34m08N05
52529A07839R70L52n11o42k75j76l52l11j42l40p50p27k89k47q88j460j304p74
52511I9973n19m55j24L74M44p4o62p54k98L62Q55R53O58J70l01o97j028j206j100
52492I6571o82j10L47M55K14r7k06j27k8J32M81Q29P45J98k37l9O31J173J188
52473A01438O88p3p33r83q36o01m46k08J47K08l87j291j704j242l47K17J00m06
52455I3541o93m74j01j52o53r66n62L18R72R33K61n46p77k8J198J770J218K94
52437I5553r5m2j63m51m04m5R7j8J30N88O76Mq56j098n46L93J184J370Q97L76
52417I7550N30J183J442J037O96Q54Q80J88o21n65K49Q40P34K95j17n20q59q85
$$ y = [116464, 115506, 114285, 113226, 112258, 111213, 110397, 110272, 110600, 110472, 109441, 108217, 107807, 108154, 108276, 107742, 107334, 107839, 108809, 109161, 108650, 108008, 107733, 107557, 107205, 106894, 106752, 106412, 105662, 104935, 104646, 104399, 103511, 102051, 100747, 99973, 99454, 98999, 98875, 99249, 99693, 99619, 98957, 98203, 97905, 98267, 99122, 100075, 100733, 100903, 100602, 99905, 98877, 97671, 96571, 95889, 95779, 96126, 96581, 96795, 96698, 96492, 96365, 96337, 96469, 96950, 97779, 98524, 98722, 98485, 98446, 99077, 100250, 101438, 102126, 102053, 101320, 100337, 99501, 98900, 98454, 98246, 98393, 98601, 98214, 96923, 95219, 93977, 93630, 93847, 93947, 93541, 92848, 92374, 92273, 92121, 91468, 90502, 89940, 90258, 91230, 92163, 92424, 91878, 91101, 91073, 92271, 94041, 95259, 95553, 95458, 95416, 95253, 94802, 94398, 94353, 94450, 94432, 94562, 95150, 95826, 95830, 94974, 93876, 93330, 93723, 94907, 96277, 97174, 97550, 98080, 99263, 100705, 101742, 102438, 103292, 104172, 104360, 103739, 103174, 103423, 104263, 104997, 105292, 105175, 104655, 103796, 102911]
52399A02911n75j83J79N80Q75P91M50L68P63J248J267P00k0k38L37J197J512J106
52381A13268P08Q61J160J012O90Q06J168J047M84L01Q03J339J384J223J258J343
52365A28855J271J255J511J831J872J565J024M57K59P17J430J718J587J722K279
52350A49353K566K218J802J746J568R14M90J093K252K886K884K997L401L420K777
52335A82367K139K187K792L390L685L775L932M360M987N452N581N673O048O581
52321B42949P038P554Q308R040R462R874J0687J1633J2152J2440J3235J4647J6032
52308C85051J7019J7811J8363J8245J7580J7206J7518J7891J7749J7393J7293
52297E79119J7230J6793J6144J5618J4921J3514J1500R537Q011O807N725M655
$$ y = [102911, 102336, 102153, 102332, 102912, 103787, 104578, 105028, 105396, 106159, 107407, 108674, 109374, 109354, 109116, 109453, 110650, 112162, 113268, 113976, 114837, 115997, 117009, 117699, 118505, 119673, 120720, 121204, 121505, 122308, 123647, 125031, 126254, 127512, 128855, 130126, 131381, 132892, 134723, 136595, 138160, 139184, 139641, 139900, 140617, 142047, 143765, 145352, 147074, 149353, 151919, 154137, 155939, 157685, 159253, 160167, 160657, 161750, 164002, 166888, 169772, 172769, 176170, 179590, 182367, 184506, 186693, 189485, 192875, 196560, 200335, 204267, 208627, 213614, 219066, 224647, 230320, 236368, 242949, 249987, 257541, 265849, 274889, 284351, 294225, 304912, 316545, 328697, 341137, 354372, 369019, 385051, 402070, 419881, 438244, 456489, 474069, 491275, 508793, 526684, 544433, 561826, 579119, 596349, 613142, 629286, 644904, 659825, 673339, 684839, 694376, 702387, 709194, 714919, 719574]
52285G19574L421J966N58n48j567k830m101m690m339l590l157l221l441l501l454
52270F87080l475l420k776j273O41K217L268M180N195O174P180Q593J0293J1409
52256G35286J1412J1046J1466J2790J4124J4753J4721J4294J3591J2809J2187
52245H78479J1640J0820R722Q758Q135P539O581N266L771K107K02j753l377m492
52231I43398n371o521q121r681j0473j0390j0107j0264j0789j1272j1637j1998
52219H26774j2105j1545j0458r517r092q874q381p463o208m775l505k783k615
52206G29453k513k003j091j07O74J187J503J722J829J722J451J272J265J063L76
52191G37803m62q62p93p38q64q56n91l68l69n15r74k097l554m245l609k494k162
$$ y = [719574, 722995, 724961, 725519, 724971, 723404, 720574, 716473, 711783, 707444, 703854, 700697, 697476, 694035, 690534, 687080, 683605, 680185, 677409, 676136, 676777, 678994, 682262, 686442, 691637, 697811, 704991, 713584, 723877, 735286, 746698, 757744, 769210, 782000, 796124, 810877, 825598, 839892, 853483, 866292, 878479, 890119, 900939, 910661, 919419, 927554, 935093, 941674, 946940, 950711, 952818, 953020, 951267, 947890, 943398, 938027, 931506, 923385, 913704, 903231, 892841, 882734, 872470, 861681, 850409, 838772, 826774, 814669, 803124, 792666, 783149, 774057, 765183, 756802, 749339, 743131, 738356, 734851, 732068, 729453, 726940, 724937, 723846, 723739, 724413, 725600, 727103, 728825, 730654, 732376, 733827, 735099, 736364, 737427, 737803, 737341, 736479, 735686, 734948, 734084, 733228, 732637, 732269, 731900, 731385, 730411, 728314, 724760, 720515, 716906, 714412, 712250]
52174G12250k834l720m111l899l342k862k846l187l245k746k323k662l477l958
52160F67038l927l721l271k248j114r18j848k818k879k295j836j762j930k254
52146F34217k469j995p22M63O00j67r12j113r50o15q2L99L31l26r49r48l57L92
52128F24797R85J383J780K497L669M948N830O307O898P889Q920R570J0062J1036
52114G06571J2717J4655J6286J7476J8405J9130J9472J9371J9153J9267J9781
52103I02284K0332K0641K0790K0844K0442J9120J6989J4775J3057J1736J0270
52092A091280Q263N776L274J279j27j443l153n031o404p119p802q956j0231j0940
52078A048666j0976j0810j0685j0361r621q650p711o722n432l918k651j891j222
$$ y = [712250, 709416, 705696, 701585, 697686, 694344, 691482, 688636, 685449, 682204, 679458, 677135, 674473, 670996, 667038, 663111, 659390, 656119, 653871, 652757, 651839, 649991, 647173, 644294, 641999, 640163, 638401, 636471, 634217, 631748, 629753, 629031, 629494, 630094, 629927, 629015, 627902, 626952, 626337, 626255, 626654, 626985, 626659, 625710, 624762, 624405, 624797, 625782, 627165, 628945, 631442, 635111, 640059, 645889, 652196, 659094, 666983, 675903, 685473, 695535, 706571, 719288, 733943, 750229, 767705, 786110, 805240, 824712, 844083, 863236, 882503, 902284, 922616, 943257, 964047, 984891, 1005333, 1024453, 1041442, 1056217, 1069274, 1081010, 1091280, 1099543, 1105319, 1108593, 1109872, 1109745, 1108302, 1105149, 1100118, 1093714, 1086595, 1078793, 1069837, 1059606, 1048666, 1037690, 1026880, 1016195, 1005834, 996213, 987563, 979852, 973130, 967698, 963780, 961129, 959238, 958016]
52065I58016N3J985L801M860N435O184P115P726Q024Q611R638J0417J0466J0240
52051A052571J0287J0321R744Q568P157N519L609J939J036N09m33j753k856l893
52037A102325n685q160j0140j1037j1683j2916j4308j5080j5393j5803j6132j5942
52025I50046j5691j6291j7673j8747j8802j8088j7075j5997j5250j5356j6179
52014G64897j6837j6722j6123j5619j5392j5381j5581j5845j5854j5627j5640
52003E90276j6145j6716j6829j6504j6030j5486j4996j4924j5312j5474j4923
51992D16937j4266j4376j4885j4481j2817j1047j0194r952r602r157q828q096
51980B79236o411m488l810m838o560p729p847o995n633m706n003o055o458n637
$$ y = [958016, 958069, 960054, 963855, 968715, 974150, 980334, 987449, 995175, 1003199, 1011810, 1021448, 1031865, 1042331, 1052571, 1062858, 1073179, 1082923, 1091491, 1098648, 1104167, 1107776, 1109715, 1110751, 1111260, 1110827, 1109074, 1106218, 1102325, 1096640, 1088480, 1078340, 1067303, 1055620, 1042704, 1028396, 1013316, 997923, 982120, 965988, 950046, 934355, 918064, 900391, 881644, 862842, 844754, 827679, 811682, 796432, 781076, 764897, 748060, 731338, 715215, 699596, 684204, 668823, 653242, 637397, 621543, 605916, 590276, 574131, 557415, 540586, 524082, 508052, 492566, 477570, 462646, 447334, 431860, 416937, 402671, 388295, 373410, 358929, 346112, 335065, 324871, 314919, 305317, 296160, 287332, 279236, 272825, 268337, 264527, 259689, 253129, 245400, 237553, 230558, 224925, 220219, 215216, 209161, 202703, 197066]
$$ [...]
##END NTUPLES=NMR SPECTRUM
##END=
