##TITLE=NES1013_LH_9233048_mQcQn3gpvg
##JCAMPDX= 6.0         $$ Bruker NMR JCAMP-DX V2.0
##DATA TYPE= NMR SPECTRUM
##DATA CLASS= NTUPLES
##ORIGIN= BRUKER
##OWNER= Administrator
$$ 1.72 TOPSPIN		Version 2.1
$$ 2015-06-17 22:14:56.159 -0700  Administrator@X
$$ Compression mode = diff/dup
##.OBSERVE FREQUENCY= 400.02188249412
##.OBSERVE NUCLEUS= ^1H
##.ACQUISITION MODE= SIMULTANEOUS (DQD)
##.ACQUISITION SCHEME= undefined
##.AVERAGES= 8
##.DIGITISER RES= 22
##SPECTROMETER/DATA SYSTEM= spect
##.PULSE SEQUENCE= zg30
##.SOLVENT NAME= COFFEE_meoh
##.SHIFT REFERENCE= INTERNAL, COFFEE_meoh, 1, 14.98509
##AUDIT TRAIL= $$ (NUMBER, WHEN, WHO, WHERE, PROCESS, VERSION, WHAT)
$$ ##TITLE= Audit trail, TOPSPIN		Version 2.1
$$ ##JCAMPDX= 5.01
$$ ##ORIGIN= Bruker BioSpin GmbH
$$ ##OWNER= Administrator
$$ $$ E:\/data/COFFEE/nmr/NES1013_LH_9233048_mQcQn3gpvg/10/pdata/1/auditp.txt
$$ ##AUDIT TRAIL=  $$ (NUMBER, WHEN, WHO, WHERE, PROCESS, VERSION, WHAT)
(   1,<2015-06-17 22:14:49.019 -0700>,<Administrator>,<X>,<go>,<TOPSPIN 2.1>,
      <created by zg
	started at 2015-06-17 22:13:42.284 -0700,
	POWCHK enabled, PULCHK disabled,
       configuration hash MD5:
       21 0F 79 D6 B3 7B B4 F6 88 20 88 DB 03 48 BD 9F
       data hash MD5: 64K
       61 31 43 3D 2B AA 3E 1B E3 06 EE 40 5A 4A 17 E8>)
(   2,<2015-06-17 22:14:52.128 -0700>,<Administrator>,<X>,<proc1d>,<TOPSPIN 2.1>,
      <Start of raw data processing
       efp LB = 0 FT_mod = 6 PKNL = 1 PHC0 = 0 PHC1 = 0 SI = 32K 
       data hash MD5: 32K
       E6 83 88 7A 72 C8 A5 6D F6 4F 82 4D CA 00 7B 84>)
(   3,<2015-06-17 22:14:52.409 -0700>,<Administrator>,<X>,<proc1d>,<TOPSPIN 2.1>,
      <pk PHC0 = 93.75732 PHC1 = 0 
       data hash MD5: 32K
       BC 00 D3 99 0C FC 69 FA B2 02 8C A4 90 A1 0C F5>)
(   4,<2015-06-17 22:14:52.519 -0700>,<Administrator>,<X>,<proc1d>,<TOPSPIN 2.1>,
      <abs ABSG = 1 
       data hash MD5: 32K
       55 0E C1 8B 3D 48 DD DD 64 8C 52 3F F9 B7 5C 2B>)
(   5,<2015-06-17 22:14:52.581 -0700>,<Administrator>,<X>,<proc1d>,<TOPSPIN 2.1>,
      <abs ABSG = 2 
       data hash MD5: 32K
       D6 10 AE 4F 25 21 CE 85 F5 54 43 B8 4D 11 58 46>)
(   6,<2015-06-17 22:14:52.644 -0700>,<Administrator>,<X>,<proc1d>,<TOPSPIN 2.1>,
      <abs ABSG = 3 
       data hash MD5: 32K
       BC B3 F2 01 51 05 84 73 9A 57 BD 5C E3 AC 67 95>)
(   7,<2015-06-17 22:14:52.706 -0700>,<Administrator>,<X>,<proc1d>,<TOPSPIN 2.1>,
      <abs ABSG = 4 
       data hash MD5: 32K
       56 FA 06 E1 EF B9 AD EF 4E 8C B6 69 A5 14 1D 23>)
(   8,<2015-06-17 22:14:52.769 -0700>,<Administrator>,<X>,<proc1d>,<TOPSPIN 2.1>,
      <abs ABSG = 5 
       data hash MD5: 32K
       00 B8 09 8F E4 DB 70 31 FA C6 58 CE 25 6F 90 99>)
$$ ##END=
$$ 
$$ $$ hash MD5
$$ $$ 8C 59 9C 8D B9 3D 3F 74 68 A9 42 85 A7 89 D4 40
##$RELAX= 
##$RELAX= 
##$RELAX= 
##$RELAX= 
##$RELAX= 
##$RELAX= 
##$RELAX= 
$$ Bruker specific parameters
$$ --------------------------
##$DU= <E:\>
##$EXPNO= 10
##$NAME= <NES1013_LH_9233048_mQcQn3gpvg>
##$PROCNO= 1
$$ [...]
##$TP= (0..7)
150 150 150 150 150 150 150 150
##$TP07= 0
##$TPNAME0= <>
##$TPNAME1= <>
##$TPNAME2= <>
##$TPNAME3= <>
##$TPNAME4= <>
##$TPNAME5= <>
##$TPNAME6= <>
##$TPNAME7= <>
##$TPOAL= (0..7)
0.5 0.5 0.5 0.5 0.5 0.5 0.5 0.5
##$TPOFFS= (0..7)
0 0 0 0 0 0 0 0
##$TUNHIN= 0
##$TUNHOUT= 0
##$TUNXOUT= 0
##$USERA1= <user>
##$USERA2= <user>
##$USERA3= <user>
##$USERA4= <user>
##$USERA5= <user>
##$V9= 5
##$VALIST= <valist>
##$VCLIST= <CCCCCCCCCCCCCCC>
##$VD= 0
##$VDLIST= <DDDDDDDDDDDDDDD>
##$VPLIST= <PPPPPPPPPPPPPPP>
##$VTLIST= <TTTTTTTTTTTTTTT>
##$WBST= 2048
##$WBSW= 25
##$XGAIN= (0..3)
0 0 0 0
##$XL= 0
##$YL= 0
##$YMAX_a= 627215
##$YMIN_a= -522259
##$ZGOPTNS= <>
##$ZL1= 120
##$ZL2= 120
##$ZL3= 120
##$ZL4= 120
##$ABSF1= 14.98509
##$ABSF2= -5.573092
##$ABSG= 5
##$ABSL= 3
##$ALPHA= 0
##$AQORDER= 0
##$ASSFAC= 0
##$ASSFACI= 0
##$ASSFACX= 0
##$ASSWID= 0
##$AUNMP= <proc_prof1d_extract_pilot.lims>
##$AXLEFT= 0
##$AXNAME= <>
##$AXNUC= <1H>
##$AXRIGHT= 0
##$AXTYPE= 0
##$AXUNIT= <>
##$AZFE= 0.1
##$AZFW= 0.1
##$BCFW= 0
##$BC_mod= 0
##$BYTORDP= 0
##$COROFFS= 0
##$CY= 15
##$DATMOD= 1
##$DC= 0
##$DFILT= <>
##$DTYPP= 0
##$F1P= 0
##$F2P= 0
##$FCOR= 0.5
##$FTSIZE= 32768
##$FT_mod= 6
##$GAMMA= 0
##$GB= 0
##$INTBC= 1
##$INTSCL= 1
##$ISEN= 128
##$LB= 0
##$LEV0= 0
##$LPBIN= 0
##$MAXI= 10000
##$MC2= 0
##$MEAN= 0
##$ME_mod= 0
##$MI= 0
##$NCOEF= 0
##$NC_proc= -8
##$NLEV= 6
##$NOISF1= 0
##$NOISF2= 0
##$NSP= 0
##$NTH_PI= 0
##$NZP= 0
##$OFFSET= 14.98509
##$PC= 1
##$PHC0= 93.75732
##$PHC1= 0
##$PH_mod= 1
##$PKNL= yes
##$PPARMOD= 0
##$PPDIAG= 0
##$PPIPTYP= 0
##$PPMPNUM= 2147483647
##$PPRESOL= 1
##$PSCAL= 4
##$PSIGN= 0
##$PYNMP= <proc.py>
##$REVERSE= no
##$SF= 400.02
##$SI= 32768
##$SIGF1= 0
##$SIGF2= 0
##$SINO= 400
##$SIOLD= 32768
##$SPECTYP= <>
##$SREGLST= <1H.CDCl3>
##$SSB= 0
##$STSI= 32768
##$STSR= 0
##$SW_p= 8223.68421052631
##$SYMM= 0
##$S_DEV= 0
##$TDeff= 65536
##$TDoff= 0
##$TI= <>
##$TILT= no
##$TM1= 0
##$TM2= 0
##$TOPLEV= 0
##$USERP1= <user>
##$USERP2= <user>
##$USERP3= <user>
##$USERP4= <user>
##$USERP5= <user>
##$WDW= 1
##$XDIM= 32768
##$YMAX_p= 442503489
##$YMIN_p= -744697
##$CURPLOT= <Network HP LaserJet P1505>
##$CURPRIN= <$Network HP LaserJet P1505>
##$DFORMAT= <normdp>
##$LAYOUT= <+/1D_H.xwp>
##$LFORMAT= <normlp>
##$PFORMAT= <normpl>
##$SURQMSG= 1
$$ End of Bruker specific parameters
$$ ---------------------------------
##NTUPLES= NMR SPECTRUM
##VAR_NAME=  FREQUENCY,     SPECTRUM/REAL,   SPECTRUM/IMAG
##SYMBOL=    X,             R,               I
##VAR_TYPE=  INDEPENDENT,   DEPENDENT,       DEPENDENT
##VAR_FORM=  AFFN,          ASDF,            ASDF
##VAR_DIM=   32768,         32768,           32768
##UNITS=     HZ,            ARBITRARY UNITS, ARBITRARY UNITS
##FACTOR=    0.250966925370066, 1,           1
##FIRST=     8223.43324360094, -1526,        -46447
##LAST=      0,             227003,          57195
##MIN=       0,             -744697,         0
##MAX=       8223.43324360094, 442503489,    0
$$ Real data points
##PAGE= N=1
##DATA TABLE= (X++(R..R)), XYDATA
$$ [...]
$$ plain form
19462 -264703 122127 -117880 -113532 -314099 -262043 182196 -35345 51202 -137814 217691
19451 -274924 -6595 74143 -48607 -73464 -173139 127697 78915 -59605 -27142 -403798 30226
19439 51831 -154719 -73573 16116 66860 92062 13052 264210 -21501 -41855 -132236 10241
19427 -199718 -278316 -243082 402868 195705 -152570 -267732 -44110 -96091 -90069 -279043 180031
19415 -133391 -173740 137711 -223393 89233 -47088 -239203 53601 132128 -83172 -15341 -220532
19404 -220532 55235 -380004 127259 -16629 203223 -36711 103226 -37940 -62426 -382426
19394 -382426 -125430 -341644 -209547 -331892 -192955 -59499 -317205 -32683 -212532 48513
19383 70653 57214 -49642 -14335 165106 -269543 259336 -445560 -317153 44902 -254789
$$ packed form
19462b64703A22127a17880M348k00567N2056A82196c5345E1202a37814B17691
19451b74924f595G4143d8607k4857r9675A27697m8782e9605b7142l76656C0226
19439E1831a54719g3573A6116N0744K5202A3052K51158b1501k0354r0381A0241
19427a99718p8598L5234D02868A95705a52570j15162d4110n1981O022j88974A80031
19415a33391m0349A37711b23393H9233d7088j92115E3601P8527h3172a5341k05191
19404b20532E5235c80004A27259a6629B03223c6711A03226c7940k4486l20000
19394c82426a25430k16214J32097j22345J38937e9499k57706c2683j79849D8513
19383G0653j3439d9642a4335A65106b69543B59336d45560J28407D4902b54789
$$ plain form
19372 96709 163580 -193536 -258520 -133814 -47492 41797 -124754 -27167 -385335 -77142 13799
19360 -255240 41073 -89504 -111126 -35893 -186157 161226 -155995 1426 -259295 134782 -248353
19348 -126137 126571 -103445 -147018 351001 249973 171245 82822 48933 -368215 -36924
19337 -65676 50612 -173693 28263 -334574 140523 -277370 14151 -26274 -118225 -164367 -103641
19326 -103641 -166602 -342021 -96240 -456993 -274741 -203053 -220688 145042 115884 -218196
19315 192992 -333907 -49978 -32924 -206244 -189048 -106298 -248178 -223082 228282 -213717
19304 199437 27703 -238687 155291 18090 -218363 -98951 -249235 -319744 61841 -113997
19293 8734 -155554 -197052 6171 -207211 -84649 104783 146998 6128 -192922 193297 -299962
$$ packed form
19372I6709O6871a93536o4984J24706d7492D1797a24754b7167l58168g7142A3799
19360b55240D1073h9504k1622c5893j50264A61226a55995A426b59295A34782b48353
19348a26137A26571a03445m3573C51001j01028p8728H2822l3889c68215c6924
19337f5676E0612a73693B8263c34574A40523b77370A4151b6274r1951m6142O0726
19326a03641o2961j75419i6240l60753J82252P1688j7635A45042k9158b18196
19315A92992c33907d9978J7054j73320J7196Q2750j41880K5096B28282b13717
19304A99437B7703b38687A55291A8090b18363i8951j50284p0509F1841a13997
19293H734a55554m1498F171b07211h4649A04783M2215F128a92922A93297b99962
$$ plain form
19281 -58372 -263794 143565 -124434 137107 -139130 280097 55546 -68095 -94871 87844
19270 -154987 -81103 -90093 -147345 -518858 -73836 -216730 -281031 -21714 -55638 47407 -255111
19258 26921 -217269 -13463 318729 -117828 -596 23032 -239922 -169570 -68986 184198 63941
19246 -290095 -217293 -226364 -361676 -174863 -259191 -228225 49519 124325 -185152 -355285 1044
19234 -210348 -52568 -220935 -38604 -314822 116489 -75083 -217529 250105 -44911 -329506
19224 -329506 -193445 -136309 -173123 -67305 -136641 -130058 79523 -64299 120866 -81490 -45516
19213 -45516 253345 144298 -124083 -62402 15656 -241158 165187 -230337 125380 -296447
19202 289538 -279594 55910 80603 -347281 -273211 -181010 -60603 202544 -96062 57597 185411
$$ packed form
19281e8372k05422A43565a24434A37107a39130B80097E5546f8095k6776H7844
19270a54987P3884q990n7252l71513g3836j42894o4301b1714l3924D7407b55111
19258B6921b17269a3463C18729a17828e96B3032b39922P0352f8986A84198F3941
19246b90095P2802r071j35312a74863q4328L0966D9519P4806a85152j70133A044
19234b10348e2568j68367c8604k76218A16489g5083j42446B50105d4911k84595
19224c29506J36061N7136l6814f7305o9336O583G9523f4299A20866h1490L5974
19213d5516B53345j09047a24083O1681A5656b41158A65187b30337A25380b96447
19202B89538b79594E5910K4693c47281P4070R2201f0603B02544i6062E7597J27814
$$ plain form
19191 185411 -150394 68902 -242226 -6061 -102885 -190940 83855 -214956 -161343 -22481 124497
19179 -226635 68764 -61628 43510 48392 -128989 314882 219476 -178137 32451 -100746 -177098
19168 -177098 58366 -73360 -18522 -26381 -177171 134706 18512 -285290 36870 162998 -60754
19156 -59744 128188 67711 -281116 -108286 -119350 -9279 147537 65910 -18353 162161 -61178
19144 65071 -268792 -290826 -29458 -279857 -604272 -370500 -60755 -24335 34482 -2464 -19753
19133 -19753 -231711 -44161 -87557 -9921 65222 -236692 -111412 104283 22983 -21647 94768
19121 150306 -104950 103763 -61844 176747 -114413 62869 100222 -187400 60189 -129956
19110 -351890 41679 -229236 -132446 -105116 13999 -132995 -125920 66567 -33441 -109116 -273791
$$ packed form
19191A85411a50394F8902b42226f061r6824q8055H3855b14956N3613b2481A24497
19179b26635F8764f1628D3510M882a28989C14882r5406a78137C2451a00746p6352
19168a77098E8366g3360a8522p859j50790A34706A8512b85290C6870J26128f0754
19156e9744A28188o0477b81116a08286j1064i279A47537F5910a8353A62161f1178
19144F5071b68792k2034b9458k50399l24415K33772f0755b4335C4482b464j7289
19133a9753k11958d4161m3396i921F5222b36692a11412A04283B2983b1647I4768
19121A50306a04950A03763f1844A76747a14413F2869L7353a87400F0189a29956
19110c51890D1679b29236R6790K7330A3999a32995P075F6567c3441p5675j64675
$$ plain form
19099 -273791 74984 -107087 -130257 42876 66699 -38073 -38772 -256774 -276015 -117679 6019
19087 -191515 34847 6806 -95878 153597 47728 1140 -52317 278824 -217528 -25992 153432
19075 226000 -76407 -326147 73756 126606 -16190 -181694 165252 -143566 -420718 -156582
19064 -116613 2100 -234012 119436 -99682 -12576 -255199 -255615 242101 -102618 -341712 134700
19052 -73918 7643 147065 -313598 -170963 -239091 -85685 -216223 -16257 -256105 -466031 -55584
19040 -168074 -28863 -64873 -7865 70032 -957 -152641 -262841 122493 -246657 243 -1706 -219941
19028 -219941 -148706 -211420 -36722 -31280 -31850 30513 -68077 60290 -128226 228467 -122301
19016 151195 421716 -120248 -376061 299535 -86868 -70164 -182465 -347377 -298861 44603
$$ packed form
19099b73791G4984a07087k3170D2876K3823c8073o99k18002j9241a17679F019
19087a91515C4847F806i5878A53597D7728A140e2317B78824b17528b5992A53432
19075B26000g6407k49740G3756N2850a6190j65504A65252a43566k77152a56582
19064a16613B100b34012A19436i9682a2576k42623m16B42101a02618k39094A34700
19052g3918G643J39422c13598J42635o8128h5685j30538a6257k39848k09926e5584
19040a68074b8863l6010g865G0032i57j51684j10200A22493b46657B43a706k18235
19028b19941P1235o2714c6722N442n70C0513f8077F0290a28226B28467a22301
19016A51195K70521a20248k55813B99535h6868J6704j12301j64912M8516D4603
$$ plain form
19005 -23912 88205 -204386 -3812 -361998 2285 -40331 175287 -54430 -134340 161017 -301933
18993 68295 -109104 516027 -101159 -175468 -266510 -100215 -390742 118690 -106611 95065
18982 236423 120525 -309065 120355 -121622 121156 -148056 -8536 316487 -126687 289828
18971 443771 699855 800149 477244 203666 -365360 218290 -259090 -98653 -95041 171344
18960 -228179 79454 -282572 7305 -252929 -36728 36982 -33527 -217265 -223845 65751 -260666
18948 356039 255266 -198822 -193070 -158833 170570 -250612 -28158 92057 -152772 19909 -96647
18936 -121762 80175 -51870 -179407 293939 58108 60113 -280611 -297932 109294 -50693 -59741
18925 -59741 -91876 93558 -172303 3487 -222474 259242 137989 65997 -94882 -428045 -378219
$$ packed form
19005b3912H8205b04386c812l58186B285d0331A75287e4430p9910A61017c01933
18993F8295a09104E16027a01159p4309r1042a00215k90527A18690a06611I5065
18982B36423j15898c09065A20355a21622A21156a48056h536C16487a26687B89828
18971D43771K56084J00294l22905B03666c65360B18290b59090i8653L612A71344
18960b28179G9454b82572G305b52929c6728C6982c3527j83738o580F5751b60666
18948C56039j00773a98822N752L4237A70570b50612b8158I2057a52772A9909i6647
18936a21762H0175e1870j27537B93939E8108K005b80611j7321A09294e0693r048
18925e9741l2135I3558a72303C487b22474B59242j21253F5997i4882l33163M9826
$$ plain form
18914 -378219 -62463 -246102 -178018 161961 -24617 367496 668260 692076 471584 202597
18903 124099 328947 -161920 -99098 -96778 20549 122528 -114128 65941 4594 352499 34295
18891 1758 -87056 -57102 -46909 -88975 276524 -328896 -89545 111221 -97661 -423502 112881
18879 -86765 24859 -69215 53843 126905 114112 -8064 143051 -336958 -70329 -215103 60019
18867 -326915 -158814 -258789 85649 87423 -9305 -68287 4068 -24566 -96433 -167524 -4753 341993
18854 -31167 -215212 -53489 26200 8069 -189355 -176200 -381900 -177489 -258215 -85432 -82143
18843 -82143 72976 -297307 4780 36476 147170 129401 159424 192208 -201836 -90445 77524
18831 103374 53160 -134409 -212036 -283916 -73802 -291728 320282 83013 -246020 118203
$$ packed form
18914c78219f2463j83639O8084A61961b4617C67496L00764K3816k20492B02597
18903A24099K04848a61920O2822K320B0549J01979a14128F5941D594L47905C4295
18891A758h7056K9954J0193m2066B76524c28896h9545A11221i7661l25841A12881
18879h6765B4859f9215E3843P3062j2793h064A43051c36958g0329j44774F0019
18867c26915a58814r9975H5649J774i305n8982D068b4566p1867p1091d753C41993
18854c1167j84045e3489B6200H069a89355J3155k05700a77489q0726h5432L289
18843h2143G2976b97307D780L1696J10694j7769L0023L2784b01836i0445G7524
18831A03374n0214a34409p7627p1880g3802k17926C20282H3013b46020A18203
$$ plain form
18820 -143986 -380031 -130381 254704 331368 112789 -137318 76245 238612 1077 -130946
18809 318876 -214915 24398 190992 230941 19332 377401 -53516 -34314 -26771 -63006 20960
18797 -133054 -218679 26392 6195 -114753 -212596 -68122 -203811 -192421 -306870 -177743 -253751
18786 -253751 11141 -17363 239573 -43425 105285 -90268 464664 -265174 -108402 -20081
18775 96176 -99471 -158324 -29964 184201 96881 53139 -164361 148668 96800 175984 16267
18763 205628 -14551 -26737 -645971 192509 -217044 -16884 -165098 -144364 22197 -39739 -167487
18752 -167487 -210801 -279879 -111491 -419013 122886 185131 -534790 -244051 -336375 75188
18741 -101455 8180 -30701 67535 -55114 -226413 -170124 266333 -195367 -90654 -30091 -61765
$$ packed form
18820a43986k36045a30381B54704P6664A12789a37318G6245J62367A077a30946
18809C18876b14915B4398J66594L9949A9332L58069e3516J9202P543l6235B0960
18797a33054q5625B6392F195a14753r7843f8122j35689J1390j14449J29127p6008
18786b53751A1141a7363B39573d3425A05285i0268D64664b65174a08402b0081
18775I6176i9471n8853b9964A84201q7320m3742a64361A48668n1868P9184A6267
18763B05628a4551j2186o19234A92509b17044a6884j48214K0734B2197c9739j27748
18752a67487m3314o9078a11491l07522A22886O2245e34790b44051r2324G5188
18741a01455H180c0701F7535e5114j71299N6289B66333a95367i0654c0091l1674
$$ plain form
18730 -61765 77461 189953 -285979 37958 220208 64283 -159454 -177088 -273740 60851 3551
18718 -297771 -290883 -84763 168133 160663 61885 -298511 180726 100242 -38947 -348421 -168790
18706 -114947 -39188 -188166 55781 128003 -20451 257098 14568 -304089 -64254 -395990 -326605
18695 -326605 -167895 -7061 -178427 -297048 181141 -87139 44926 -642061 -189509 -31786
18684 -173970 -7621 -191226 -79477 138900 27828 148946 -32149 151425 178032 91792 74570
18673 74570 -190754 34076 -173535 -68564 116767 -154240 27485 -250226 12858 -193413
18662 58743 -150883 -210048 250732 -73900 -105375 -300645 10883 -107193 -97722 109161 -46749
18650 -343913 533582 -77383 -125255 -34328 -55272 -31761 -181584 42082 -12719 125307 47526
$$ packed form
18730f1765G7461J12492b85979C7958J82250F4283a59454j7634r6652F0851C551
18718b97771O888h4763A68133p470F1885b98511A80726q0484c8947l09474a68790
18706a14947c9188j48978E5781P2222b0451B57098A4568c04089f4254l31736O9385
18695c26605J58710g061j71366j18621A81141h7139D4926f42061a89509c1786
18684a73970g621j83605g9477A38900B7828J21118c2149A51425K6607q6240j7222
18673G4570a90754C4076a73535f8564A16767a54240B7485b50226A2858a93413
18662E8743a50883n9165B50732g3900l1475j95270A0883a07193R471A09161d6749
18650c43913E33582g7383m7872c4328k0944K3511j49823D2082a2719A25307D7526
$$ plain form
18638 102724 -220992 116252 266019 -108333 31181 22557 69316 117195 62087 -136359 -283380
18627 -283380 -97617 -173253 -250256 -162545 138272 78338 -49048 32885 87129 -333360 -366971
18616 -366971 -148938 -201288 -373738 10499 -111590 -291117 156417 -205202 -188275 405579
18605 -15121 -111768 -42152 -14723 -128453 108145 -164395 148925 -131691 -69123 -2442 146801
18593 270209 134790 -144756 403477 -9417 93743 -354992 160719 -45140 -220123 -198794
18583 -198794 -96447 -173919 -94747 -299634 -61078 -73345 110238 -121546 -280077 -325757 86680
18571 -262737 238664 191690 113401 -356303 -106309 -70386 91057 64866 21436 15351 -104857
18559 -474144 -70248 11515 146474 -37991 114829 -29168 24918 -109686 -153292 -183617 23166
$$ packed form
18638A02724b20992A16252J49767a08333C1181q624M6759M7879n5108a36359j47021
18627b83380i7617p5636p7003Q7711A38272n9934d9048C2885N4244c33360l3611
18616c66971a48938n2350j72450A0499a11590j79527A56417b05202J6927D05579
18605a5121r6647d2152a4723j13730A08145a64395A48925a31691O2568b442A46801
18593B70209A34790a44756D03477i417I3743c54992A60719d5140j74983K1329
18583a98794i6447p7472P9172k04887f1078j2267A10238a21546j58531m5680H6680
18571b62737B38664m6974p8289c56303a06309L5923I1057k6191B1436o085a04857
18559d74144g0248A1515J34959c7991A14829b9168B4918a09686m3606l0325B3166
$$ plain form
18547 -224520 -280090 69681 -865 -81151 -279176 -66549 -31689 -231356 -165439 -248514 -363693
18536 -363693 111918 46418 -173193 -100838 347031 -180217 -280934 -280446 -277947 188842 66771
18524 21335 -151101 -88563 -138995 -113039 849 124466 -131893 -41084 89222 50130 139467
18513 139467 -80812 -190036 -297796 -216924 -173052 280279 -9897 -71593 56133 223307 16764
18501 338007 -212607 8926 98665 -89817 143774 110797 -235527 -70134 -44526 -38225 -105881
18490 -105881 -137378 -205306 -63900 177185 -80094 -16265 -188224 -172211 61764 -146172 -141102
18479 -141102 -117750 -385372 -28192 -269428 1055 -359972 23665 294950 -211903 -295979 -110339
18467 -300956 -450767 173487 -193598 -141715 -14474 -89399 -46793 -110366 -249988 74759 -25804
$$ packed form
18547b24520n5570F9681h65q0286j98025f6549c1689j99667O5917q3075j15179
18536c63693A11918D6418a73193P2355C47031a80217j00717M88K499A88842F6771
18524B1335a51101O2538n0432K5956H49J23617a31893d1084H9222l9092Q9337
18513A39467h0812j09224j07760Q0872M3872B80279i897o1696E6133J67174A6764
18501C38007b12607H926Q9739h9817A43774l2977b35527g0134K5608O301o7656
18490a05881l1497o7928f3900A77185h0094a6265j71959J6013F1764a46172N070
18479a41102K3352k67622b8192k41236A055c59972B3665K71285b11903q4076a10339
18467c00956j49811A73487a93598N1883a4474p4925M2606o3573j39622G4759b5804
$$ plain form
18455 122469 -67074 -84064 -256024 202153 76259 -180561 226786 -226304 146232 -260002
18444 -325517 -28058 16811 36615 153901 -155174 205189 246571 -259532 -102157 3752 999
18432 -165147 182496 -129990 -169 -36913 33130 -275822 -191291 100164 -255570 141084 179365
18421 179365 -136388 103025 -21018 -143085 -198612 -189518 -36003 -322014 -63383 -216391 -19222
18409 229551 98223 115909 26233 -42662 219428 84711 -13951 1497 -41533 -156194 154309
18397 326861 -37978 22062 37688 144747 109387 164238 3559 94464 -235380 -251925 -181402
18386 -181402 218847 126581 -205917 -114086 -65881 7716 39335 64245 206628 102046 -329636
18374 5597 -274884 -74089 -159747 -82374 -217483 5767 11765 -202942 177223 346723 232281
$$ packed form
18455A22469f7074j6990j71960B02153G6259a80561B26786b26304A46232b60002
18444c25517b8058A6811J9804J17286a55174B05189M1382b59532a02157C752I99
18432a65147A82496a29990a69l6744C3130b75822Q4531A00164b55570A41084L8281
18421A79365a36388A03025b1018j22067n5527R094c6003k86011f3383j53008a9222
18409B29551I8223J7686B6233d2662B19428H4711a3951A497d1533j14661A54309
18397C26861c7978B2062J5626J07059l5360N4851C559R0905b35380j6545P0523
18386a81402B18847r2266b05917R1831M8205G716L1619K4910J42383A02046c29636
18374E597b74884g4089q5658P7373j35109E767N998b02942A77223J69500j14442
$$ plain form
18363 232281 -111027 164058 169783 -376908 -20296 -45223 45150 84453 54072 -247347 -174463
18352 -174463 148186 250346 51185 96057 127665 -199905 -184917 183165 27081 -124220
18341 -80855 -141466 -317760 -186864 151978 -145061 -58869 -362911 195773 77931 28588
18330 14549 87705 -356330 32130 171080 -35218 -139780 28332 -37239 -109367 -45631 102327
18318 -111785 -47546 5456 135265 63516 -185104 46589 -48412 -218573 -72127 -213355 70952
18306 -89318 -49332 -112729 6548 221571 374179 9589 128458 33194 54153 362529 -319535
18294 -142609 303904 136544 52626 131592 67464 101382 -155127 90236 413665 88225 -16974
18282 -239360 -171308 -29229 79966 -141697 -4473 -173768 106942 -304166 100992 -108660
$$ packed form
18363B32281a11027A64058N725c76908b0296k4927D5150L9303l0381b47347P2884
18352a74463A48186J02160E1185M4872L1608a99905J4988A83165B7081a24220
18341h0855o0611j76294J30896A51978a45061e8869l04042A95773G7931B8588
18330A4549P3156c56330C2130J38950c5218j04562B8332c7239p2128d5631A02327
18318a11785d7546E456J29809F3516a85104D6589d8412j70161g2127j41228G0952
18306h9318L9986o3397F548K15023J52608I589J18869C3194K0959L08376c19535
18294a42609C03904A36544E2626P8966o4128L3918a55127I0236L23429H8225a6974
18282b39360O8052b9229G9966a41697d473j69295A06942c04166A00992a08660
$$ plain form
18271 152861 113393 -172819 93990 -6253 -199474 -287768 -319790 -44285 61777 -197102 101444
18259 213690 -176246 -105360 74292 -106522 -192841 -130660 188618 -122016 -233352 279270
18248 -480670 171435 81489 10991 -115064 -18782 388924 -57358 -100866 -139107 -237294 -122573
18237 -122573 23042 -178013 6781 5667 -65278 -255770 382061 28421 138529 170680 -2088
18225 -19596 165800 52380 -112836 -268038 -99368 -356975 -35247 17349 -100277 174982
18214 -48056 -221377 56141 168236 -82986 83375 -238045 -253197 -104544 -177763 57874 -165212
18202 -180084 -97417 -206856 281499 -92134 44942 -3881 -10547 -181693 81879 -47534 -72848
18191 -72848 100601 57172 -174754 -90451 -37093 -223631 -69504 -223518 -247824 344459 27154
$$ packed form
18271A52861l9468a72819I3990f253j93221q8294l2022d4285F1777a97102A01444
18259B13690a76246P0886G4292a06522q6319O2181A88618a22016j11336B79270
18248d80670A71435H1489A0991a15064a8782C88924e7358m3508l8241r8187J14721
18237a22573B3042a78013F781j114f5278j90492C82061B8421J10108L2151b088
18225a9596A65800E2380a12836j55202i9368k57607c5247A7349a00277A74982
18214d8056j73321E6141J12095h2986H3375b38045j5152a04544p3219E7874a65212
18202a80084Q2667j09439B81499i2134D4942c881o666j71146H1879d7534k5314
18191g2848A00601m3429a74754Q4303c7093j86538f9504j54014k4306C44459B7154
$$ plain form
18179 219064 -93259 161175 85380 -116524 -214452 74711 -19168 39154 -445715 -354044 -151945
18167 8322 73955 -174672 118769 -296999 63045 220673 71824 -21710 163278 228610 -246446
18155 -259431 185283 -382297 -435662 -54350 128750 84561 -40652 118228 -321519 163382
18144 219909 84533 359235 -148369 20030 -144937 -108595 -10117 324182 46020 113016 149720
18133 149720 54380 118357 53275 -184432 179885 68663 -234946 -52084 161626 238549 59834
18121 56134 -203688 141011 36699 57724 -154138 88071 143440 10893 150314 -109328 -165350
18110 -165350 -204904 242890 169289 60646 17006 101280 -260918 270515 -75997 -133191 4608
18098 8371 320643 -87012 -198566 115893 100745 -149791 298227 5436 -252118 -117324 38263
$$ packed form
18179B19064i3259A61175p5795a16524r7928G4711a9168C9154d45715R1671a51945
18167H322O5633a74672A18769b96999F3045J57628G1824b1710A63278O5332b46446
18155b59431A85283c82297n3365e4350A28750m4189d0652A18228c21519A63382
18144B19909H4533K74702a48369B0030a44937L6342a0117C24182D6020O6996L6704
18133A49720E4380O3977E3275a84432A79885F8663b34946e2084A61626P6923E9834
18121E6134b03688A41011C6699K1025a54138H8071N5369A0893J39421a09328n6022
18110a65350l9554B42890p3601F0646A7006Q4274b60918B70515g5997n7194D608
18098H371L12272h7012j11554A15893j5148a49791B98227E436b52118a17324C8263
$$ plain form
18086 -121815 -80846 -217462 259670 107714 -194588 97537 56270 -44504 118140 46471
18075 61783 -131024 225935 295153 13751 -161656 336046 -357477 67539 167257 -88802 130853
18063 -93005 -393987 166005 -7528 107306 9714 296908 -223190 -217255 -292071 -19299 172477
18051 -293615 -202531 191518 175922 -106242 -6623 363964 -169206 268026 -63690 392053
18040 13068 86291 -256737 118874 -217737 -166949 -117126 117818 14026 302598 -171508
18029 -301098 -351346 22177 -28425 -11245 2403 -29383 -46914 90028 56508 -161240 -150520
18018 -150520 103629 123380 -8925 -318711 168032 26038 203894 171064 223906 127984 79224
18007 79224 -81909 -147829 424380 44651 -150287 25826 -24342 -21674 329129 47386 179037
$$ packed form
18086a21815M0969j36616B59670A07714a94588I7537m1267d4504A18140D6471
18075F1783a31024B25935O9218A3751a61656C36046c57477F7539R9718h8802A30853
18063i3005l00982A66005g528A07306I714K87194b23190N935p4816a9299A72477
18051b93615R1084A91518j5596a06242f623C63964a69206B68026f3690C92053
18040A3068P3223b56737A18874b17737N0788M9823A17818A4026K88572a71508
18029c01098n0248B2177b8425a1245B403b9383j7531I0028l3520a61240J0720
18018a50520A03629J9751h925l09786A68032B6038J77856l2830N2842r5922m8760
18007G9224h1909o5920D24380D4651a50287B5826b4342K668C29129D7386J31651
$$ plain form
17996 179037 234245 -218906 -379451 -27737 207898 269856 82348 30422 -135305 149893
17985 166453 7768 -7157 32105 -20023 -44863 278703 54419 -101719 -20621 -177533 17567
17973 -360139 153097 130106 57197 -41257 -76932 -34250 -66337 201976 -342131 48613 -81475
17961 201898 130253 -90615 -87006 -281098 -55836 213396 13998 168270 51986 83297 203798
17950 203798 2050 -200879 -338561 11546 23405 54077 86588 -213170 35957 264529 22025
17938 193773 136412 -195617 141234 1660 64269 320837 120299 219000 -11852 8532 94492
17927 94492 38851 -263211 -263984 -270487 5398 -220205 -31806 -45936 140035 -126247 36222 7030
17914 -17907 164744 -13453 -196601 -111799 106457 134314 -252386 -50980 235350 6042 -93159
$$ packed form
17996A79037N5208b18906j60545b7737B07898O1958H2348C0422a35305A49893
17985A66453G768g157C2105b0023k4840B78703E4419a01719b0621j56912A7567
17973c60139A53097k2991E7197d1257l5675c4250l2087B01976c42131D8613h1475
17961B01898p1645i0615L609j94092e5836B13396A3998J54272E1986L1311J20501
17950B03798B050b00879j37682A1546J1859L0672L2511b13170C5957K28572B2025
17938A93773n7361a95617A41234A660O2609K56568A20299R8701a1852H532Q5960
17927I4492C8851b63211p73o503E398b20205c1806j4130A40035a26247C6222G030
17914a7907A64744a3453j83148Q4802A06457K7857b52386e0980B35350F042i3159
$$ plain form
17902 322524 -28430 -8312 -189236 -107642 21623 -210729 155316 -190071 214112 -3094 286852
17890 32780 -11337 31359 -99510 331552 -346078 257442 20070 452676 -192796 -440353
17880 -440353 234778 -126518 185809 101000 57499 -105920 23909 154924 279828 -91752
17869 234941 97702 -118857 137889 -141892 175090 120591 226994 56525 169457 232070
17859 232070 62071 49985 -415774 -38324 -155371 341779 16668 193855 -342288 -236827
17849 -236827 -211999 99071 111683 -178801 -254936 -159835 63696 -79202 -149238 44484 76791
17838 76791 157863 -35811 23850 -163944 87509 353752 -2715 113712 -50930 142943 267271
17827 267271 85934 -109980 81467 102226 503647 -54286 -120033 487497 266616 4784 180787
$$ packed form
17902C22524b8430h312j80924Q1594B1623b10729A55316a90071B14112c094B86852
17890C2780a1337C1359i9510C31552c46078B57442B0070M32606a92796k47557
17880d40353B34778a26518A85809q4809m3501a05920B3909J31015J24904i1752
17869B34941I7702a18857A37889a41892A75090n4499J06403E6525J12932O2613
17859B32070F2071j2086d15774c8324j17047C41779A6668J77187c42288J05461
17849b36827K4828I9071J2612a78801p6135R5101F3696g9202p0036D4484L2307
17838G6791Q1072c5811B3850a63944H7509K66243b715A13712e0930A42943J24328
17827B67271H5934a09980H1467K0759M01421e4286o5747D87497k20881D784J76003
$$ plain form
17816 180787 14294 -27906 124159 37217 -194752 10697 56775 -123830 -200503 178759 -198128
17804 286089 224366 176347 192085 377908 -43335 -36231 269256 -15359 385087 147224 306625
17793 306625 -6651 75071 -118888 412689 -116907 349010 -34551 189205 48973 -16753 91286
17781 226755 139690 327558 237984 -11971 -74290 -22599 -25391 39018 310339 -35986 114874
17769 83391 -106204 178274 -36135 338039 78921 -42793 101770 27169 -92848 223115 -198668
17757 -11260 -34557 25627 146763 -181548 104544 -71798 299696 76182 92687 63696 136163
17746 136163 218262 154760 359698 142093 14989 30451 357725 70753 304 176850 -46705
17734 5737 221164 119437 -75449 -128580 171910 -111065 -23741 -74895 -42328 225728 78306
$$ packed form
17816A80787A4294b7906A24159C7217a94752A0697M6078a23830p6673A78759a98128
17804B86089o1723m8019J5738J85823d3335P104B69256a5359C85087A47224J59401
17793C06625f651G5071a18888D12689a16907C49010c4551A89205D8973a6753I1286
17781B26755q7065J87868q9574a1971o2319b2599k792C9018K71321c5986A14874
17769H3391a06204A78274c6135C38039G8921d2793A01770B7169i2848B23115a98668
17757a1260k3297B5627J21136a81548A04544g1798B99696G6182J6505k8991P2467
17746A36163Q2099o3502K04938A42093A4989J5462L27274G0753C04J76546d6705
17734E737K15427j01727g5449n3131A71910a11065b3741n1154L2567B25728G8306
$$ plain form
17722 -148221 -84849 47307 54878 257930 -43170 233388 175569 355809 77747 67486 -192308
17710 10757 348137 -68044 72387 -53404 -43692 245220 66238 -202895 257826 -25666 27300
17698 122074 42538 -67912 110627 -3501 1347 -192026 -223389 1220 271373 41819 99869
17687 99869 461031 254599 125664 397079 -193740 -125356 232774 432621 -98656 233252
17676 -63964 220578 114518 -38362 125510 27433 112373 258609 -196101 489617 -199587
17665 -66815 389745 -20572 37509 315608 214023 97839 169349 -76414 125327 189903 -251997
17653 -29515 -43159 62225 12596 119100 28770 323347 55952 -69552 151789 -42454 -8606
17641 311603 -872 169304 475512 187495 -228689 252159 181225 253960 -65184 353664 -58740
$$ packed form
17722a48221O3372D7307P571K03052d3170B33388n7819J80240G7747j0261a92308
17710A0757L37380f8044G2387e3404R712B45220F6238b02895B57826b5666B7300
17698A22074D2538f7912A10627c501A347a92026l1363A220K70153D1819N8050
17687I9869L61162k06432A25664K71415a93740O8384B32774J99847i8656B33252
17676f3964B20578j06060c8362A25510B7433Q4940J46236a96101D89617a99587
17665f6815C89745b0572C7509K78099j01585I7839P1510g6414A25327O4576b51997
17653b9515j3644F2225A2596J06504B8770K94577E5952f9552A51789d2454h606
17641C11603h72A69304L06208A87495b28689B52159p0934P2735f5184C53664e8740
$$ plain form
17629 190158 -68744 164014 30189 -97412 233357 216086 -37371 29445 321959 204946 -55929
17617 39307 203677 195254 19790 326284 133802 11339 -67012 260909 355657 -178846 179857
17605 -78176 90926 248615 313104 325996 174296 60404 81252 309026 -24697 227962 184849
17594 184849 -7203 122922 282802 429661 8714 -69175 316596 426065 -43100 61268 55827
17583 55827 -33765 163171 -56402 -37867 198796 63456 -115001 175473 272937 107922 88345
17572 88345 19711 208892 193337 429180 426118 144443 178004 25157 181301 37440 71584
17561 71584 16227 104039 259835 167839 334252 205197 147238 80222 441884 241381 218722
17550 218722 219414 584655 341861 -103272 -125348 476 425334 130266 -73649 -81491 530527
$$ packed form
17629A90158f8744A64014C0189i7412B33357j7271c7371B9445K92514j17013e5929
17617C9307J64370q423A9790L06494A33802A1339f7012B60909R4748a78846A79857
17605g8176I0926J57689O4489J2892j51700F0404K0848K27774b4697B27962m3113
17594A84849g203A22922J59880J46859H714f9175C16596J09469d3100F1268n441
17583E5827c3765A63171e6402J8535A98796F3456a15001A75473R7464A07922j9577
17572H8345A9711J89181j5555K35843l062A44443L3561B5157J56144C7440L4144
17561G1584A6227Q7812J55796r1996J66413j29055n7959o7016L61662k00503k2659
17550B18722O92L65241k42794a03272k2076D76M24858A30266g3649p842E30527
$$ plain form
17538 227013 392957 336005 216981 296920 196767 517453 430833 440852 698421 334564
17527 493904 765740 1130316 1135591 1091567 1010234 752503 692723 737554 577673 358243 477969
17516 477969 502963 667993 363716 929432 648258 1274571 1002387 1030860 1130518 1125001
17506 1125001 813168 691233 290690 259185 387822 39487 252290 148474 240346 289904
17496 289904 286528 476410 531119 497256 329716 461449 32878 424696 198918 278481 283523
17485 283523 354041 -12643 171280 520306 260773 206883 557354 606717 436116 372257
17475 372257 221578 542660 173056 210194 299540 503236 399475 446307 229737 337852
17465 337852 -166783 146890 291313 90471 188604 380207 214386 125690 307515 118875
$$ packed form
17538B27013J65944n6952j19024P9939j00153L20686q6620J0019K57569C34564
17527D93904K71836L64576N275m4024q1333k57731n9780M4831j59881k19430J19726
17516D77969K4994J65030l04277N65716k81174O26313k72184K8473R9658n517
17506A125001l11833j21935B90690l1505J28637C9487K12803j03816R1872M9558
17496B89904l376J89882N4709l3863j67540J31733C2878L91818A98918P9563N042
17485B83523P0518a2643A71280L49026k59533n3890L50471M9363j70601o3859
17475C72257j50679L21082A73056L7138Q9346K03696j03761M6832k16570J08115
17465C37852a66783A46890J44423I0471R8133J91603j65821q8696J81825A18875
$$ plain form
17454 42976 142614 471186 1763 275088 222695 324477 231985 280124 636519 608517 469585
17443 469585 400816 537489 422345 345585 533684 261089 784086 164342 393464 540655
17433 540655 450701 104995 247720 419527 438074 433812 722070 144800 394031 395533 351605
17422 351605 324292 175922 224174 588023 472048 190572 506296 363164 694814 398060
17412 398060 253503 497591 726644 446356 217728 363886 267369 344700 281658 363187
17402 363187 308542 36578 126256 243197 436970 247207 29200 528451 179938 102594
17392 102594 376685 240535 279422 483638 632345 469464 267606 315619 -169151 97895
17381 253798 282963 584582 241538 359556 458197 294522 198177 353439 304372 475261
$$ packed form
17454D2976R9638L28572A763K73325n2393J01782r2492M8139L56395k8002j38932
17443D69585o8769J36673j15144p6760J88099B61089N22997A64342K29122J47191
17433E40655q9954A04995J42725J71807J8547m262K88258A44800K49231J502m3928
17422C51605k7313j48370M8252L63849j15975A90572L15724j43132L31650k96754
17412C98060j44557K44088K29053k80288B17728J46158r6517P7331o3042Q1529
17402C63187n4645C6578Q9678J16941J93773j89763B9200M99251A79938p7344
17392A02594K74091j36150L8887K04216J48707j62881k01858M8013a69151I7895
17381B53798K9165L01619B41538J18018R8641j63675r6345J55262m9067J70889
$$ plain form
17371 475261 151295 378028 204903 268865 262122 410968 351149 257702 315766 296277 -12030
17359 375344 598491 56679 392826 364664 407949 298936 330026 350799 372618 116153 676877
17348 676877 411617 562273 252343 420524 676409 625511 286352 547428 171629 211864
17338 211864 566110 502265 348283 161169 476293 363089 492712 50088 393108 486280
17328 486280 321866 108573 147083 457647 357588 465792 174566 197914 104402 258842
17318 258842 -24643 357193 266967 371609 161544 498341 248478 363674 349677 270207
17308 270207 333062 249345 333532 447102 329851 394400 302271 210086 241784 189397 455204
17297 455204 89221 367804 669911 182647 193868 262577 343892 553889 362797 125566
$$ packed form
17371D75261A51295K26733j73125O3962o743J48846n9819r3447N8064j9489a2030
17359C75344K23147E6679L36147k8162M3285j09013L1090K0773K1819A16153N60724
17348F76877k65260J50656B52343J68181K55885n0898B86352K61076A71629M0235
17338B11864L54246o3845j53982A61169L15124j13204J29623E0088L43020R3172
17328D86280j64414A08573L8510L10564j00059J08204A74566K3348r3512J54440
17318B58842b4643C57193r0226J04642A61544L36797B48478J15196j3997p9470
17308B70207O2855q3717Q4187J13570j17251O4549r2129r2185L1698n2387K65807
17297D55204H9221K78583L02107A82647J1221O8709Q1315K09997j91092A25566
$$ plain form
17286 -168423 184016 387388 -60492 149566 437853 186619 575298 430751 532554 116635
17275 424555 439073 258536 370619 500538 478316 555402 318576 729905 355790 230064
17265 230064 238089 344311 419988 349024 391305 636041 103775 138369 663069 453991 690992
17254 690992 654727 356311 577557 354797 334669 439169 595075 481924 609342 504739
17244 504739 89702 521681 530171 493768 402906 507965 664945 748022 540144 383465 274337
17233 274337 537212 464675 539300 437367 327893 418384 305129 402493 419022 294751
17223 294751 208897 426741 388541 327733 622468 267434 722366 740938 956212 859205
17213 859205 181835 231123 526149 699530 598653 431368 691647 196950 574986 707738
$$ packed form
17286a68423A84016K03372f0492A49566K88287A86619L88679j44547J01803A16635
17275D24555J4518j80537J12083J29919k2222P7086k36826M11329C55790j25726
17265B30064Q025J06222P5677p0964M2281K44736A03775L4594N24700k09078K37001
17254F90992l6265k98416K21246k22760k0128J04500J55906j13151J27418j04603
17244E04739H9702M31979Q490l6403r0862J05059J56980Q3077k07878j56679j09128
17233B74337K62875p2537P4625j01933j09474R0491j13255R7364J6529j24271
17223B94751q5854K17844l8200o0808K94735B67434M54932J8572K15274r7007
17213H59205A81835M9288K95026J73381j00877j67285K60279A96950L78036J32752
$$ plain form
17203 707738 596056 504888 709360 697805 581313 278149 790335 182514 480814 320563
17193 320563 339901 398558 468015 460603 570213 493502 348891 597679 633789 605551 604011
17182 604011 545129 473805 880294 840744 725684 12506 -27769 399532 423586 313816 822435
17171 822435 791730 522140 492225 687562 509528 418158 432907 757107 798783 354685
17160 528406 742728 307816 838121 712623 676448 518634 586709 480482 563716 790404
17150 790404 483587 767106 897241 641605 868586 778755 419941 568689 654682 525406
17140 525406 692455 743646 530494 994922 733334 858066 811764 917344 433263 513441
17130 513441 550167 850747 559500 747946 627555 626594 985355 899711 815700 906085 847858
$$ packed form
17203G07738j11682r1168K04472j1555j16492B78149N12186A82514K98300j60251
17193C20563J9338N8657O9457p412J09610p6711j44611K48788L6110k8238j540
17182F04011n8882p1324M06489l9550j15060A2506b7769C99532K4054j09770N08619
17171H22435l0705k69590k9915J95337j78034r1370J4749L24200M1676C54685
17160E28406K14322C07816N30305j25498l6175j57814O8075j06227Q3234K26688
17150G90404l06817K83519J30135k55636K26981q9831l58814J48748Q5993j29276
17140E25406J67049N1191k13152M64428k61588J24732m6302J05580D33263Q0178
17130E13441L6726L00580k91247J88446j20391r61L58761q5644q4011R0385n8227
$$ plain form
17119 847858 716591 885432 996868 749428 661961 606869 764557 659893 878402 768061
17109 768061 829693 835320 755521 737346 796902 858955 755637 883069 974094 871169 729905
17098 729905 1001329 701881 833044 983772 692827 708418 915710 916224 955029 885508 821457
17087 821457 812869 1261021 648229 881532 1197474 915560 901750 808631 758224 935762
17077 935762 1185588 1098808 1473251 1281036 1054229 972039 1504620 944714 970281 1000105
17067 1000105 1063203 893449 969380 818313 1293132 1030435 697542 984913 1272048 1062779
17057 1062779 1001162 1234661 1030861 867371 1052272 1061828 1539625 1216220 808384 1079901
17047 1079901 1266515 1290391 1113546 1029834 1210089 1341816 1218565 1270072 1566738 1507154
$$ packed form
17119H47858j31267J68841J11436k47440q7467n5092J57688j04664K18509j10341
17109G68061O1632N627p9799j8175N9556O2053j03318J27432R1025j02925j41264
17098G29905K71424k99448J31163J50728k90945J5591K07292N14L8805o9521o4051
17087H21457q588M48152o12792K33303L15942k81914j3810r3119n0407J77538
17077I35762K49826q6780L74443j92215k26807q2190N32581n59906K5567K9824
17067A000105O3098j69754P5931j51067M74819k62697l32893K87371K87135k09269
17057A062779o1617K33499k03800j63490J84901R556M77797l23405m07836K71517
17047A079901J86614K3876j76845q3712J80255J31727j23251N1507K96666n9584
$$ plain form
17037 1507154 1460074 1378414 1161726 1199355 1333736 1284219 1229441 1226788 1628635 1527473 1582873
17026 1582873 976958 1727254 1239071 1378469 1384119 1489881 1648861 1575932 1302799 1407518
17016 1407518 1321033 1585999 1552346 1589063 1284834 1523171 1437284 1321147 1186582 1671972
17006 1671972 1543197 1413828 1580951 1684535 1553485 1447818 1498795 1563098 1604220 1902455
16996 1902455 1895362 1659056 1900392 1606740 1731132 1581216 1905519 1702250 1789478 1548181
16986 1548181 1913856 1825632 1877824 1651706 2136534 1841186 1844355 2176386 2081008 1998338
16976 1998338 1904169 2090165 2186596 2023204 2049075 2241905 1898539 1828719 2007934 2307278
16966 2307278 2180621 1987259 2166901 2214137 2247549 2050239 2251803 2343609 2476202 2382896
$$ packed form
17037A507154m7080q1660k16688L7629J34381m9517n4778k653M01847j01162N5400
17026A582873o05915P50296m88183J39398N650J05762J58980p2929k73133J04719
17016A407518q6485K64966l3653L6717l04229K38337q5887j16137j34565M85390
17006A671972j28775j29369J67123J03584j31050j05667N0977O4303M1122K98235
16996A902455p093k36306K41336k93652J24392j49916L24303k03269Q7228k41297
16986A548181L65675q8224N2192k26118M84828k95348L169L32031r5378q2670
16976A998338r4169J85996R6431j63392K5871J92830l43366o9820J79215K99344
16966B307278j26657j93362J79642M7236L3412j97310K01564R1806J32593r3306
$$ plain form
16956 2382896 2223574 2382263 2449132 2145151 2294223 2723742 2881104 2265362 2567120 2293411
16946 2293411 2247594 2790675 2473932 2668871 2727211 2992882 2865769 2779379 2696073 2495460
16936 2495460 3039295 2540429 2706041 2756844 2771134 2621916 3031157 2993599 3202114 3043529
16926 3043529 3099932 3099915 2947816 3086718 3214224 3164695 3190677 3248657 3663496 3701172 3245701
16915 3245701 3875804 3244413 3609900 3483513 3610821 3837236 3704171 3847000 3983165
16906 3983165 3387264 3963543 3786616 4156027 4156371 4230626 4228518 4399546 4026312 4231586
16896 4231586 4148928 4660644 4353434 4591437 4641954 4772184 4779403 4816662 4611900 4661610
16886 4661610 4378850 4902402 5009079 4944176 5227466 5092911 5375358 5330283 5212009 5648997
$$ packed form
16956B382896j59322J58689O6869l03981J49072M29519J57362o15742L01758k73709
16946B293411m5817N43081l16743J94939N8340K65671j27113q6390q3306k00613
16936B495460N43835m98866J65612N0803J4290j49218M09241l7558K08515j58585
16926C043529N6403j7j52099J38902J27506m9529K5982N7980M14839L7676m55471
16915C245701O30103o31391L65487j26387J27308K26415j33065J42829J36165
16906C983165n95901N76279j76927L69411L44P4255k108J71028l73234K05274
16896D231586q2658N11716l07210K38003N0517J30230P219L7259k04762M9710
16886D661610k82760N23552J06677o4903K83290j34555K82447m5075j18274M36988
$$ plain form
16876 5648997 5385952 5456684 5587805 5493877 6024081 5779297 5894393 6052926 5984833 6279528
16866 6279528 6211187 6247964 6436551 6214129 6525062 6717766 6767956 7078349 7063309 6903725
16856 6903725 7232556 7506101 7417112 7310943 7664098 7633499 7891179 7911373 8392499 8199254
16846 8199254 8716101 8453670 8490556 8763753 8942590 9075623 8992406 9496887 9671585 9834491
16836 9834491 9829006 9946793 10204574 10433242 10331187 10806425 10877852 10899452 11258806 11315489
16826 11315489 11709460 11732907 12331893 12242714 12604657 12570525 13057182 12934349 13414318 13738084
16816 13738084 14223310 14228856 14800779 14681022 14967543 15632081 16042335 15961745 16497525 16803363
16806 16803363 17332571 17345739 17612560 17931819 18522294 19343414 19501255 19924523 20414050
$$ packed form
16876E648997k63045P0732J31121r3928N30204k44784J15096J58533o8093K94695
16866F279528o8341L6777J88587k22422L10933J92704N0190L10393j5040j59584
16856F903725L28831K73545q8989j06169L53155l0599K57680K0194M81126j93245
16846H199254N16847k62431L6886K73197J78837J33033q3217N04481J74698J62906
16836I834491n485J17787K57781K28668j02055M75238P1427K1600L59354N6683
16826A1315489L93971K3447N98986q9179L61943l4132M86657j22833M79969L23766
16816A3738084M85226N546N71923j19757K86521O64538M10254q0590N35780L05838
16806A6803363N29208J3168K66821L19259N90475Q21120J57841M23268M89527
$$ plain form
16797 20414050 20579684 21018264 21495869 22271867 22509953 23252096 23538612 24276827 24834106
16788 24834106 25134766 25851800 26480574 27152083 27922737 28461301 28995278 29514873 30814907
16779 30814907 31264652 32272251 32778332 33615098 34491547 35413053 36162832 37209751 38074489
16770 38074489 39214836 39959613 40946336 41856404 43274258 44182938 45388863 46188449 47594032
16761 47594032 48604216 49618981 50976685 52257227 53614136 54762829 56047493 57559065
16753 57559065 58845809 59959509 61450609 62473167 63694517 65294260 66594365 67943481
16745 67943481 69277044 70347906 71612964 72698240 74150815 74991686 76175173 77236074
16737 77236074 78299652 78922087 79733623 80311015 81167910 81552666 81959258 82792103 82271328
$$ packed form
16797B0414050J65634M38580M77605P75998K38086P42143K86516P38215N57279
16788B4834106L00660P17034O28774O71509P70654N38564N33977N19595J300034
16779C0814907M49745J007599N06081Q36766Q76449R21506P49779J046919Q64738
16770C8074489J140347P44777R86723R10068J417854R08680J205925P99586J405583
16761D7594032J010184J014765J357704J280542J356909J148693J284664J511572
16753E7559065J286744J113700J491100J022558J221350J599743J300105J349116
16745F7943481J333563J070862J265058J085276J452575Q40871J183487J060901
16737G7236074J063578O22435Q11536N77392Q56895L84756M06592Q32845n20775
$$ plain form
16728 82271328 82598730 83046138 82715255 82629046 82547356 81886485 81948582 81556055 80790824 79687195
16718 79687195 79406973 78193612 77735874 76624993 75768892 74482788 73570483 72419175 71137952
16709 71137952 69815111 68638043 67358797 66107284 64671728 63521515 62507796 60886404
16701 60886404 59651055 58371806 57178667 55451196 54678186 53373480 51923488 50702640
16693 50702640 49612729 48599326 47522097 46108418 44999784 44009920 42901615 41864694
16685 41864694 40605017 39825682 38892119 38169249 37044457 36413704 35318526 34775666 33750844
16676 33750844 32895075 32036683 31412586 30899997 29947318 29277226 28464499 28286720 27529671
16667 27529671 26547144 26289956 25707305 25320721 24420883 24070654 23289428 23006275 22685030
$$ packed form
16728H2271328L27402M47408l30883q6209q1690o60871O2097l92527p65231j103629
16718G9687195k80222j213361m57738j110881q56101j286104r12305j151308j281223
16709G1137952j322841j177068j279246j251513j435556j150213j013719j621392
16701F0886404j235349j279249j193139j727471p73010j304706j449992j220848
16693E0702640j089911j013403j077229j413679j108634r89864j108305j036921
16685D1864694j259677p79335r33563p22870j124792o30753j095178n42860j024822
16676C3750844q55769q58392o24097n12589r52679o70092q12727j77779p57049
16667B7529671r82527k57188n82651l86584q99838l50229p81226k83153l21245
$$ plain form
16658 22685030 22021778 21353780 21459539 20980077 20007930 20145756 19503747 18851278 18762662
16649 18762662 18228107 18004937 17519680 17378728 16777752 16634636 16440399 15988862 15386993
16640 15386993 15369794 15218329 15109545 14630235 14520595 13732745 13623111 13606870 13457151 13179006
16630 13179006 12864584 12991093 12698336 12281985 11991695 12128689 11430189 11434652 11222372 11535860
16620 11535860 11228002 10791179 10576105 10360457 10309850 9897702 10273042 9923463 9883235 9834922
16610 9834922 9173638 9128191 9143419 8851429 8985273 8601845 8476819 8420439 8462083 8531775
16600 8531775 8467968 7953224 7902597 8095114 7597873 7550394 7776318 7535843 7422116 7197368
16590 7197368 7173260 7101529 7004313 6597720 6844745 6602739 6405318 6032543 6456189 6267312
$$ packed form
16658B2685030o63252o67998J05759m79462r72147J37826o42009o52469q8616
16649A8762662n34555k23170m85257j40952o00976j43116j94237m51537o01869
16640A5386993j7199j51465j08784m79310j09640p87850j09634j6241j49719k78145
16630A3179006l14422J26509k92757m16351k90290J36994o98500M463k12280L13488
16620A1535860l07858m36823k15074k15648n0607m12148L75340l49579m0228m8313
16610I834922o61284m5447J5228k91990J33844l83428j25026n6380M1644O9692
16600H531775o3807n14744n0627J92517m97241m7479K25924k40475j13727k24748
16590G197368k4108p1731r7216m06593K47025k42006j97421l72775M23646j88877
$$ plain form
16580 6267312 6347946 5999099 6044287 6065441 6106283 5982968 5676655 5746950 5358788 5649817
16570 5649817 5557728 5441797 5297574 5510545 5251646 5334182 4925953 5059579 5026958 5084228
16560 5084228 4973489 5006411 5026194 4745068 4642140 4692511 4371307 4745784 4203984 4839114
16550 4839114 4508994 4406745 4305771 4345819 4192764 4316843 4309191 4180482 4182511 4230371
16540 4230371 3895587 4214720 4071175 3920028 3739841 3923058 3571020 3627303 3696857 3675662
16530 3675662 3515996 3604607 3738787 3437080 3247882 3414749 3310323 3132779 3523117 3455642
16520 3455642 3117856 3511189 3443252 3552046 2958773 2978660 3309917 3044307 2959641 2882017
16510 2882017 2960787 3083213 2863709 2813034 3073278 2946862 2996987 2798524 2724150 2784213
$$ packed form
16580F267312Q0634l48847M5188K1154M0842j23315l06313P0295l88162K91029
16570E649817r2089j15931j44223K12971k58899Q2536m08229J33626l2621N7270
16560E084228j10739L2922J9783k81126j02928N0371l21204L74477n41800O35130
16550D839114l30120j02249j00974M0048j53055J24079p652j28709K029M7860
16540D230371l34784L19133j43545j51147j80187J83217l52038N6283O9554k1195
16530C675662j59666Q8611J34180l01707j89198J66867j04426j77544L90338o7475
16520C455642l37786L93333o7937J08794n93273J9887L31257k65610q4666p7624
16510B882017P8770J22426k19504n0675K60244j26416N0125j98463p4374O0063
$$ plain form
16500 2784213 2716544 2811037 2482243 3020110 2275534 2857328 2563203 2835501 2521447 2826930
16490 2826930 2562371 2496155 2548658 2630924 2328070 2454580 2599665 2520886 2559626 2304890
16480 2304890 2515787 2158318 2507694 2134154 1980022 2499148 1960020 2128385 2403494
16471 2403494 2305898 2261713 2234040 2371838 1999462 2382643 2152794 2224517 2299833 2441288
16461 2441288 1997266 2169904 2172405 1841583 1994340 1901112 1997081 1595442 1984899 1942266
16451 1942266 1909101 1678581 1929315 1958786 1615818 1858546 1674969 1839236 2185763 1742421
16441 1742421 1738664 1327818 1815913 1784206 1631097 1993595 1553085 1520094 1529858 1595420 1738729
16430 1738729 1788867 1873697 1740771 1695081 1624991 1452216 1600733 1598716 1789478 1475199
$$ packed form
16500B784213o7669R4493l28794N37867p44576N81794k94125K72298l14054L05483
16490B826930k64559o6216N2503Q2266l02854J26510J45085p8779L8740k54736
16480B304890K10897l57469L49376l73540j54132N19126n39128J68365K75109
16471B403494r7596m4185k7673J37798l72376L83181k29849P1723P5316J41455
16461B441288m44022J72638K501l30822J52757r3228R5969m01639L89457m2633
16451A942266l3165k30520K50734K9471l42968K42728j83577J64267L46527m43342
16441A742421l757m10846M88095l1707j53109L62498m40510l2991R764O5562J43309
16430A738729N0138Q4830j32926m5690p0090j72775J48517k017J90762l14279
$$ plain form
16420 1475199 1662502 1647946 1689106 1379673 1646748 1539904 1655625 1431340 1677148 1673808
16410 1673808 1134415 1271173 1747229 1174954 1540597 1805526 1369369 1183001 1480621
16401 1480621 1391231 1227136 1421565 1350288 1379691 1325230 1524771 1496410 1534400 1358711
16391 1358711 1226088 1437117 1676569 1449724 1228279 1032812 1228399 1319897 1271409 1337855
16381 1337855 1190419 1250315 983029 938036 927634 1331530 1148453 1253028 1302859 1050405
16371 1050405 860583 1226380 1195861 1212649 902030 1062647 1321266 1126017 1007814 1086483
16361 1086483 1242861 1204864 1068449 1175143 1138359 889389 984161 1055454 1172987 1058026
16351 1058026 952111 943092 821127 1170043 981356 1107737 1019477 1038959 981846 742466
$$ packed form
16420A475199J87303j4556M1160l09433K67075j06844J15721k24285K45808l340
16410A673808n39393J36758M76056n72275L65643K64929m36157j86368K97620
16401A480621q9390j64095J94429p1277K9403n4461J99541k8361L7990j75689
16391A358711j32623K11029K39452k26845k21445j95467J95587R1498m8488O6446
16381A337855j47436N9896k67286m4993j0402M03896j83077J04575M9831k52454
16371A050405j89822L65797l0519J6788l10619J60617K58619j95249j18203P8669
16361A086483J56378l7997j36415J06694l6784k48970R4772P1293J17533j14961
16351A058026j05915r019j21965L48916j88687J26381q8260J9482n7113k39380
$$ plain form
16341 742466 1122923 1234602 997094 1008124 840914 1166154 609983 832335 611986 1019312
16331 1019312 1047039 1081227 958052 874275 572043 958444 956563 568151 613906 677833 887380
16320 887380 1106240 917235 860097 828106 692694 673251 793546 1174025 916957 1064376
16310 1064376 1114027 954352 979363 751811 644284 912210 769490 993817 1170616 928691
16300 928691 811961 548662 818817 1002240 847260 810701 824440 718037 927490 560380
16290 560380 497408 1078538 992477 559969 845055 742023 717140 613348 579734 652634
16280 652634 791976 595349 710096 729688 980464 814479 717203 617068 775224 753888
16270 753888 634029 473418 420282 609534 714646 904773 772511 333879 849617 666334
$$ packed form
16341G42466L80457J11679k37508J1030j67210L25240n56171K22352k20349M07326
16331A019312K7727L4188j23175q3777l02232L86401j881l88412M5755O3927K09547
16320H87380K18860j89005n7138l1991j35412j9443J20295L80479k57068J47419
16310A064376M9651j59675K5011k27552j07527K67926j42720K24327J76799k41925
16300I28691j16730k63299K70155J83423j54980l6559J3739j06403K09453l67110
16290E60380o2972N81130q6061m32508K85086j03032k4883j03792l3614P2900
16280F52634J39342j96627J14747J9592K50776j65985r7276j00135J58156k1336
16270G53888j19859j60611n3136J89252J05112J90127j32262C33879N15738j83283
$$ plain form
16260 666334 333308 326406 537305 804418 509103 613514 745055 523274 824611 624412
16250 624412 740173 625560 693841 648297 483433 461777 864709 403640 445881 570257
16240 570257 523181 661306 34953 543847 862834 774492 641388 455033 177048 518836
16230 518836 606343 469023 677669 206885 550696 354534 447247 485052 343663 683509
16220 683509 444237 63471 122839 505337 340768 682365 763106 751451 221922 499028
16210 499028 368882 348607 472316 542732 473980 489288 821110 528221 260105 280770
16200 280770 603156 579344 373902 692067 301927 602932 406069 394304 347377 247723
16190 247723 643580 177533 507920 262284 577986 160716 597399 183863 216525 197963
$$ packed form
16260F66334l33026o902K10899K67113k95315J04411J31541k21781L01337k00199
16250F24412J15761j14613O8281m5544j64864k1656M02932D03640M2241J24376
16240E70257m7076J38125C4953N08894L18987q8342j33104j86355A77048L41788
16230E18836Q7507j37320K08646B06885L43811j96162R2713L7805j41389L39846
16220F83509k39272F3471N9368L82498j64569L41597Q0741j1655B21922K77106
16210D99028j30146k0275J23709P0416o8752J5308L31822k92889B60105K0665
16200B80770L22386k3812k05442L18165C01927L01005j96863j1765m6927r9654
16190B47723L95857A77533L30387k45636L15702A60716M36683A83863L2662j8562
$$ plain form
16180 197963 657948 303865 89528 522724 516457 696949 340081 329629 626992 163744
16169 250206 266710 7506 423428 678102 531187 252319 463691 328766 474566 38273
16158 388927 506113 702045 422036 74050 399956 167614 149960 177097 218393 381038
16148 381038 119736 302498 415597 404611 167365 101447 443906 390311 593041 226188
16137 610566 414673 358649 133096 87579 19161 697742 633358 81677 315893 21753 38007
16126 38007 296169 -13304 555659 158274 258831 488013 74230 230229 379886 270885
16116 270885 259915 475173 392712 106737 355352 247911 256100 207115 477927 17570 45150
16105 45150 159150 318527 411920 431942 203591 500918 112100 113233 6999 222298 473932
$$ packed form
16180A97963M59985C03865H9528M33196o267J80492C40081j0452K97363A63744
16169B50206J6504G506M15922K54674j46915B52319K11372j34925J45800C8273
16158C88927J17186J95932k80009G4050L25906A67614j7654K7137M1296J62645
16148C81038A19736J82762J13099j0986A67365o5918L42459n3595K02730B26188
16137F10566j95893n6024A33096m5517A9161O78581o4384H1677K34216B1753J6254
16126C8007K58162a3304E55659A58274J00557K29182G4230J55999J49657j09001
16116B70885j0970K15258q2461A06737K48615j07441Q189m8985K70812A7570K7580
16105D5150J14000J59377R3393K0022B03591K97327A12100J133F999K15299K51634
$$ plain form
16094 473932 410761 245977 620690 163140 485688 84125 164698 200959 395614 82867
16083 235352 37527 109449 296390 173735 391777 -149206 328547 240229 355186 197275
16073 197275 407935 105378 65103 463954 197806 299109 5700 306190 180636 236357
16063 236357 248821 -204080 156184 155847 76639 348648 264773 -53264 57332 83275 235236
16052 235236 196412 356272 73277 211360 428744 149919 85580 148902 266158 327333
16042 327333 125060 146622 214862 -52374 55353 361041 -105982 169429 142495 345811
16032 345811 37784 -6949 -114440 284346 149762 89352 368025 225962 161482 88768 345853
16021 345853 49553 174774 302804 162217 378050 351853 270878 37229 19186 27232 21420
$$ packed form
16094D73932o3171j64784L74713A63140L22548H4125Q0573L6261J94655H2867
16083B35352C7527P1922J86941j22655K18042a49206C28547q8318J14957j57911
16073A97275K10660A05378m0275L98851A97806J01303E700L00490j25554N5721
16063B36357J2464b04080A56184l37G6639K72009q3875e3264E7332K5943J51961
16052B35236l8824J59860G3277J38083K17384A49919o4339O3322J17256O1175
16042C27333A25060K1562O8240e2374E5353L05688a05982A69429k6934K03316
16032C45811C7784f949j07491B84346j34584o0410K78673j42063o4480p2714K57085
16021C45853D9553J25221J28030j40587K15833k6197q0975C7229j8043Q046n812
$$ plain form
16010 21420 521945 101929 -198636 586108 261737 416965 163511 148232 166200 46494
15999 165109 17307 47705 286311 180832 460315 201541 -292006 384890 468115 382449
15989 382449 665791 481078 1030291 1268703 1118765 1128487 1055021 565149 575041 478571 -47495
15977 266687 -16767 329456 101325 329125 48319 158648 -6773 256111 258801 171189 128909
15966 128909 72386 -172244 -97166 173728 85356 245577 308712 -46109 307742 184176
15956 184176 282043 109875 51151 102667 -375024 -282789 22337 156130 2689 2680 -48458 126196
15943 -103456 62387 168286 93941 93115 18104 11039 -131727 86986 -22969 -137076 284514
15931 375706 150010 11516 178354 -83243 -67193 -186717 96659 143190 177576 198253 -21831
$$ packed form
16010B1420N00525A01929a98636E86108B61737J55228A63511j5279J7968D6494
15999A65109A7307L0398K38606j05479K79483B01541b92006C84890Q3225q5666
15989C82449K83342j84713N49213K38412j49938R722p3466m89872R892r6470d7495
15977B66687a6767C29456A01325K27800D8319J10329f773B56111K690q7612m2280
15966A28909n6523a72244P5078A73728H5356J60221O3135d6109C07742j23566
15956A84176R7867A09875E1151N1516c75024R2235B2337J33793B689rd8458A26196
15943a03456F2387J05899p4345q26A8104p065a31727H6986b2969j14107B84514
15931C75706A50010A1516J66838h3243J6050j19524I6659M6531L4386K0677b1831
$$ plain form
15919 -76072 86242 -115403 22300 111913 28460 167759 -82637 -69987 152984 52764 60378
15908 60378 25277 -12264 151968 234749 -232336 213119 -35371 -151306 -28700 120277 56697
15896 409432 -36236 81498 188563 -33300 -97498 146841 -41372 -223853 -84219 166806 211508
15885 211508 -95431 34219 151448 552991 -85275 112493 -135944 29076 -233152 -122179
15875 -122179 96334 -158340 95163 -22400 305596 -73373 -144458 -29619 351827 -115638 -356716
15864 -356716 -3237 34071 72610 24561 138196 48161 62005 -76980 -50069 126193 366533
15853 366533 -181638 -61760 3785 9661 -45352 -27176 198143 45845 -200407 -60544 -1486
15841 70017 -39893 75251 198789 29066 -134964 292883 -243890 107923 -201985 -181998
$$ packed form
15919g6072H6242a15403B2300Q9613B8460J39299h2637J2650A52984E2764P614
15908F0378B5277a2264A51968Q2781b32336B13119c5371j15935b8700A20277E6697
15896D09432c6236H1498J07065c3300o4198A46841d1372j82481h4219A66806M4702
15885B11508i5431C4219J17229M01543h5275A12493a35944B9076b33152J10973
15875a22179I6334a58340I5163b2400C05596g3373p1085b9619C51827a15638k41078
15864c56716c237C4071L8539B4561J13635D8161J3844g6980K6911A26193K40340
15853C66533a81638f1760C785N876d5352J8176A98143D5845b00407f0544a486
15841G0017c9893G5251J23538B9066a34964B92883b43890A07923b01985J9987
$$ plain form
15831 -181998 -105121 -173810 76416 -96388 -84974 127634 348454 300727 15632 160839 -57436
15819 17613 253000 95258 308244 -165059 -74985 -52325 162223 252124 -105291 384011
15808 -37178 201561 103247 -112405 -165349 103661 -27185 179358 180957 -126937 -49646 110539
15796 -220114 -33569 115911 162974 82950 50220 -173042 241298 -354644 38545 -1329 -21052
15785 -21052 -129920 468843 53297 104995 -3673 311333 322545 92298 -6349 143935 143038 -46855
15772 14368 26702 -87913 -228185 212605 487457 73653 -166286 -162104 81763 228220 238946
15761 238946 -28211 97700 28297 165451 -391979 -49762 14726 239472 425047 -212189
15750 49843 -65130 138366 -45789 -143805 -271877 397677 51817 -46514 -22292 273796 203811
$$ packed form
15831a81998P6877o8689G6416i6388J1414A27634K20820m7727A5632J45207e7436
15819A7613K35387I5258K12986a65059g4985K2660A62223Q9901a05291C84011
15808c7178B01561r8314a12405n2944A03661b7185A79358J599a26937d9646A10539
15796b20114c3569A15911M7063q0024l2730a73042B41298c54644C8545a329j9723
15785b1052j08868D68843E3297N1698c673C11333J1212I2298f349A43935q97d6855
15772A4368J2334h7913j40272B12605K74852G3653a66286M182H1763J46457J0726
15761B38946b8211I7700B8297J37154c91979d9762A4726K24746J85575b12189
15750D9843f5130A38366d5789r8016j28072C97677E1817d6514b2292B73796o9985
$$ plain form
15739 203811 -3890 351314 -134545 -91735 -132670 -6834 43063 -247260 213753 116530 -188460
15727 -373575 118165 -174406 -106354 -89670 137399 -252678 -51184 -359061 168473 147024
15717 147024 131090 74640 -295332 24042 -12746 21716 110833 -7894 -50821 -132688 155835
15705 41685 -253291 -62923 89825 -21761 151515 -52073 -133166 267068 271052 379587 57702
15693 -7346 -41487 -62345 -402681 128678 91017 -149701 -89552 -214749 -185367 60459 -32687
15681 154410 -182801 159447 -21558 88640 178273 5617 -46477 201728 -52611 53802 -3912
15669 164445 -80716 -203203 -212146 103790 158859 104169 358345 64627 -251358 -193660 -273530
15658 -273530 94633 225934 66430 -31641 184149 113784 64797 14495 59189 -8913 90733
$$ packed form
15739B03811c890C51314a34545M2810m0935f834D3063b47260B13753r7223a88460
15727c73575A18165a74406O8052J6684A37399b52678e1184l07877A68473k1449
15717A47024j5934n6450b95332B4042a2746B1716Q9117g894m2927q1867A55835
15705D1685b53291f2923H9825b1761A51515e2073q1093B67068L984J08535E7702
15693g346l4141k0858l40336A28678l7661a49701O0149j25197K9382F0459c2687
15681A54410a82801A59447b1558H8640Q9633E617d6477B01728e2611E3802c912
15669A64445h0716j22487q943A03790N5069n4690K54176F4627b51358N7698p9870
15658b73530I4633J31301F6430c1641A84149p0365m8987A4495M4694h913I0733
$$ plain form
15646 118858 66910 -137244 -12537 98537 255255 -29544 -57285 66784 -254740 -155699 112895
15634 -98969 447283 -120626 219364 77766 18959 -143766 185983 -228127 -13579 -2868 93444
15622 315481 -190757 -20982 -88618 14199 -173641 206892 -122761 314286 -193644 -54694
15611 -293518 -80714 -42526 -99947 -44955 -89426 -2280 -89813 -103900 -7569 -27396 -170882 -55595
15598 -339758 222558 -217985 213374 117098 10694 -173192 -106514 64566 -328228 207170
15587 94687 -35020 -113146 -47496 65717 -19050 84733 -30821 -17406 112814 59858 -428963
15575 222061 25695 186655 -152456 30597 -203852 70657 -43226 28479 66151 26252 82303
15564 82303 104670 -15380 100 -172121 26329 182813 150096 -54494 184334 126812 -173596
$$ packed form
15646A18858n1948a37244a2537I8537J56718b9544k7741F6784b54740R9041A12895
15634i8969D47283a20626B19364G7766A8959a43766A85983b28127a3579b868I3444
15622C15481a90757b0982o7636A4199a73641B06892a22761C14286a93644e4694
15611b93518h0714L8188n7421d4955m4471b280q7533j4087g569j9827j43486e5595
15598c39758B22558b17985B13374r6276A0694a73192O6678F4566c28228B07170
15587I4687c5020p8126d7496F5717a9050H4733c0821J3415A12814n2956d28963
15575B22061B5695J60960a52456C0597b03852G0657d3226B8479L7672B6252N6051
15564H2303K2367a5380A00a72121B6329J56484l2717e4494A84334n7522a73596
$$ plain form
15552 -256658 200151 -14532 95200 293702 -33985 -140890 259071 -185930 107934 -86100
15541 283007 114713 225719 -34153 -104820 123133 88153 208076 -67933 313834 -54121
15530 365265 386258 208918 -109101 196794 -228005 192851 -105097 78296 -76310 329998
15519 117375 -117698 181387 223750 258019 -288553 84181 64827 -169014 392874 194392
15508 470169 44977 314107 176234 125608 -53933 -112535 157098 -109075 83195 301702
15498 301702 330073 108827 146528 -380449 -223070 -70212 -299146 194322 -88557 87220
15487 357110 -295845 168095 20645 110442 361212 70562 256790 509951 574493 575108 902984
15476 902984 797722 371909 437061 231602 50785 -60050 171086 62998 161975 -233315
$$ packed form
15552b56658B00151a4532I5200J98502c3985j06905B59071a85930A07934h6100
15541B83007A14713J11006c4153p0667A23133l4980J19923f7933C13834e4121
15530C65265K0993j77340a09101A96794b28005A92851a05097G8296g6310C29998
15519A17375a17698A81387M2363L4269b88553H4181j9354a69014C92874A94392
15508D70169D4977K69130j37873n0626e3933n8602A57098a09075H3195K18507
15498C01702K8371A08827L7701c80449J57379g0212k28934A94322h8557H7220
15487C57110b95845A68095B0645Q9797K50770G0562J86228K53161O4542O15L27876
15476I02984j05262C71909O5152k05459E0785f0050A71086F2998R8977b33315
$$ plain form
15465 -358660 481614 119186 -202189 83950 59605 129618 92753 174254 -24334 30841 311306
15454 311306 85581 865 -428231 118110 13249 305241 232498 674588 1171820 1504535 1316114
15443 1316114 971906 583384 388213 84648 243612 202507 114919 278691 89769 -6099
15432 -11474 18442 -82511 210010 54276 90449 -134977 -154158 -70550 -225562 123608 98006
15421 98006 64899 -59433 22576 331784 292426 51292 98189 -51248 18763 -100013 -188 -185458
15409 -185458 -8896 15204 -157941 290005 13001 -89793 93757 -52372 -374910 139831 -49247
15397 -151327 -156551 55914 25067 -215177 393051 72967 -253230 58558 -139631 126788 236044
15386 236044 206763 135678 120117 -38348 72286 220969 51192 34747 287552 130035 159025
$$ packed form
15465c58660D81614A19186b02189H3950k4345P0013l6865Q1501b4334C0841K80465
15454C11306H5581H65d28231A18110A3249K91992p2743M42090M97232L32715j88421
15443A316114l44208l88522j95171H4648J58964m1105q7588J63772H9769f099
15432a1474A8442h2511B10010E4276L6173a34977j9181g0550j55012A23608k5602
15421I8006l3107e9433B2576L09208l9358E1292M6897e1248A8763a00013a88j85270
15409a85458h896A5204a57941B90005A3001h9793I3757e2372l22538A39831d9247
15397a51327n224E5914B5067b15177C93051G2967b53230E8558a39631A26788J09256
15386B36044k9281p1085j5561c8348G2286J48683E1192j6445K52805A30035K8990
$$ plain form
15375 159025 219615 78745 187319 93861 469907 -46189 331506 54141 -135862 297588
15364 153854 50149 279 150688 -127613 383695 384917 111182 280757 21505 235916 100867
15352 194746 -19492 239420 209821 231500 388949 35942 133342 -171409 84429 685253 249551
15340 330528 235862 263243 258083 -99835 420206 -178801 -226351 -34061 330487 86276 141716
15329 141716 80263 47061 193518 105387 22817 354921 148316 64221 -38479 166885 228283
15318 228283 -203663 263980 214834 117528 -68107 97755 343912 184563 145474 -67636 -115417
15307 -115417 379951 344895 99482 -102213 779 -105234 -20380 -77589 245016 194325 230103
15296 230103 149609 100117 59812 314966 227664 159157 244030 152622 71639 51594 -133694
$$ packed form
15375A59025O0590G8745J08574r3458L76046d6189C31506E4141a35862B97588
15364A53854E0149B79J50409a27613C83695J222A11182J69575B1505K14411A00867
15352A94746a9492B39420k9599K1679J57449C5942R7400a71409H4429O00824B49551
15340C30528r4666K7381n160i9835D20206a78801m7550c4061C30487H6276N5440
15329A41716o1453l3202J46457q8131B2817L32104A48316F4221c8479A66885O1398
15318B28283b03663B63980m9146r7306f8107I7755K46157j59349l9089f7636m7781
15307a15417C79951l5056I9482a02213G79a05234b0380n7209B45016n0691L5778
15296B30103q0494m9492m0305K55154q7302o8507Q4873r1408G1639k0045a33694
$$ plain form
15284 -294395 187075 32124 -179310 -108477 232756 -235834 -33791 -360217 204527 250014
15274 250014 -270772 352268 -28817 -20159 -88481 -94517 -237291 -166043 127012 -45371 -19838
15262 398625 -171415 154261 -51967 -77659 116393 148368 -54383 185557 -99418 -248188
15252 -248188 202784 1645 219547 -121736 88379 84948 251859 15490 154630 70546 529426
15241 529426 953242 1900546 1906720 1500285 1871058 886235 629281 270624 -15543 -38960
15231 -38960 296758 -183261 374329 -89322 234840 30183 -161170 -6931 258945 -135252
15220 7711 65040 209329 172407 -2632 -17151 100032 152282 -478166 -456074 396392 350508
15209 350508 147957 -113025 210744 133368 369169 155808 -153344 336458 -8619 -221601
$$ packed form
15284b94395A87075C2124a79310P0833B32756b35834c3791l26426B04527M5487
15274B50014b70772C52268b8817Q658o8322o036j42774P1248A27012d5371a9838
15262C98625a71415A54261e1967k5692A16393L1975e4383A85557i9418j48770
15252b48188B02784A645K17902a21736H8379l431J66911A5490J39140G0546M58880
15241E29426M23816R47304O174m06435L70773H86235k56954B70624a5543k3417
15231c8960B96758a83261C74329h9322B34840C0183a61170f931B58945a35252
15220G711N7329J44289l6922b632j4519A00032N2250d78166K2092C96392m5884
15209C50508A47957a13025B10744p7376K35801A55808a53344C36458h619k12982
$$ plain form
15199 -221601 -214649 59989 191007 -36232 147375 186540 9928 -383016 -174525 163459 -41655
15187 -108468 376010 -80739 72800 -37807 251519 178603 -59061 59791 307262 -130064 265438
15175 -38267 466795 330865 -340218 96697 44663 410008 -124281 222848 -32544 -123753
15165 -123753 -7075 476379 386479 82455 274783 303471 -258742 376745 -198037 111584
15154 -288501 8188 -29582 75785 8328 -122026 249502 436364 12786 -33393 214773 -2554
15142 252067 101040 210379 16774 -165392 228964 157057 -50262 -273848 37611 171363
15132 171363 -191394 -63917 253256 -94163 88200 269499 369484 289360 -95936 26365 230315
15121 230315 270521 213295 493058 212694 365488 462983 465546 331947 269229 -25582 88221
$$ packed form
15199b21601O952E9989J31018c6232A47375L9165I928c83016a74525A63459d1655
15187a08468C76010h0739G2800c7807B51519p2916e9061E9791K47471a30064B65438
15175c8267D66795j35930c40218I6697D4663L65345a24281B22848c2544r1209
15165a23753g075D76379q9900H2455J92328K8688b58742C76745a98037A11584
15154b88501H188b9582G5785H328a22026B49502J86862A2786c3393B14773b554
15142B52067A01040J09339A6774a65392B28964p1907e0262k23586C7611J33752
15132A71363a91394f3917B53256i4163H8200J81299R9985q0124i5936B6365K03950
15121B30315M0206n7226K79763B12694J52794R7495K563j33599o2718b5582H8221
$$ plain form
15109 126356 -131035 -165616 199567 122861 152005 184064 192461 245233 294382 3084 102965
15098 102965 284357 -21427 -171527 365144 327090 -135949 154309 137307 -221919 58165
15087 297305 -154975 -82994 64777 325006 198582 217068 -29111 -10351 131241 92816 271404
15076 271404 134333 408869 206709 69490 274102 534127 5724 -76943 -188440 85792
15065 -61499 201413 485697 330089 266178 39041 246664 326929 383070 352375 440598 75716
15053 371694 214942 102086 146520 452202 62466 332787 95824 335810 632707 282536
15042 372850 56311 268521 23884 267201 528008 114374 464948 244418 184180 366665
15032 366665 351085 457564 627523 719144 569615 856324 430218 232857 565751 467604
$$ packed form
15109A26356a31035l4581A99567p6706K9144L2059Q397N2772M9149C084R9881
15098A02965J81392b1427j50100C65144l8054a35949A54309j7002b21919E8165
15087B97305a54975P1981F4777K60229j26424J8486b9111a0351A31241l8425J78588
15076B71404A34333K74536k02160F9490K04612K60025E724g6943j11497H5792
15065f1499B01413K84284j55608o3911C9041K07623Q0265N6141l0695Q8223G5716
15053C71694j56752A02086M4434L05682F2466K70321I5824K39986K96897B82536
15042C72850E6311K12210B3884K43317K60807A14374L50574k20530o0238J82485
15032C66665j5580J06479J69959R1621j49529K86709m26106j97361L32894r8147
$$ plain form
15022 467604 718931 652870 753573 461515 761791 759501 316618 297985 502032 733050
15012 733050 180842 596352 496352 394177 386514 453895 472703 496020 68292 339908 335444
15001 335444 162185 274559 919410 681531 353149 604155 415594 425695 547162 261897
14990 470109 347363 390020 381573 547840 533735 563543 663568 330552 1016772 664700
14980 664700 1292755 877515 715011 529430 458193 703687 436392 853508 501610 288877
14970 288877 976947 563060 548963 794388 164040 165608 436562 311934 234821 21137
14959 432828 260251 166412 286572 353126 139260 348961 239850 342233 324748 682270
14949 682270 571502 688273 466928 744756 553733 374026 85347 657494 525877 560359
$$ packed form
15022D67604K51327o6061J00703k92058L00276k290C16618j8633K04047K31018
15012G33050A80842M15510j00000j02175p663O7381J8808K3317F8292K71616m464
15001C35444A62185J12374O44851k37879l28382K51006j88561J0101J21467B61897
14990D70109j22746M2657q447J66267j4105K9808J00025C30552O86220l52072
14980F64700O28055m15240j62504j85581p1237K45494k67295M17116l51898k12733
14970B88877O88070m13887j4097K45425A64040J568K70954j24628p7113B1137
14959D32828j72577r3839J20160O6554A39260K09701j09111J02383j7485L57522
14949F82270j10768J16771k21345K77828j91023j79707H5347N72147j31617L4482
$$ plain form
14939 560359 770220 830688 338372 691488 835681 733254 1234370 1109852 1150317 1505530
14929 1505530 1349020 1450007 2092080 1870939 1415503 1208943 1605697 1545323 2509990 2667144
14919 2667144 2661317 2213264 1688754 1715945 1516238 966981 661756 953588 534686 638479
14909 638479 293992 382171 577117 442286 520666 432211 392465 474952 245627 69999 99488
14898 99488 189763 256972 193680 426165 435981 665373 478538 490106 691857 906300 705550
14887 705550 916659 792723 967514 885962 959683 893862 822715 517622 705883 315786
14876 309578 453702 330282 617504 685870 639404 370019 768552 776205 389728 758845
14866 758845 975917 743799 210590 757757 389266 379589 190979 232844 364103 365059 436510
$$ packed form
14939E60359K09861O0468C38372L53116J44193j02427N01116j24518M0465L55213
14929A505530j56510J00987O42073k21141m55436k06560L96754o0374R64667J57154
14919B667144n827m48053n24510K7191j99707n49257l05225K91832m18902J03793
14909F38479B93992Q8179J94946j34831P8380q8455l9746Q2487k29325F9999K9489
14898I9488R0275O7209o3292K32485R816K29392j86835J1568K01751K14443k00750
14887G05550K11109j23936J74791q1552P3721o5821p1147l05093J88261C15786
14876C09578J44124j23420K87222O8366m6466k69385L98533P653l86477L69117
14866G58845K17072k32118B10590N47167l68491r677j88610M1865J31259R56P1451
$$ plain form
14855 436510 515574 462249 295981 416177 654261 574016 796936 724848 1197060 917832
14845 917832 895453 1409612 1198444 1078654 970873 931450 835512 884893 875469 376729 475112
14834 475112 850908 691575 441416 248518 382209 316183 474559 332880 422737 605633
14824 605633 751699 685857 743014 991225 726639 775285 797553 500588 524632 306396
14814 306396 516715 316760 652131 474552 527370 651811 731583 1190936 983146 967537
14804 967537 764620 629766 702678 926868 768885 608220 705106 659946 421462 566101
14794 566101 543317 491798 786010 471076 552429 428424 561432 865772 921531 955157
14784 955157 607702 571667 615116 525303 697592 761058 770163 683928 670835 619914 550589
$$ packed form
14855D36510P9064n3325j66268J20196K38084q0245K22920p2088M72212k79228
14845I17832k2379N14159k11168j19790j07781l9423r5938M9381r424C76729R8383
14834D75112L75796j59333k50159j92898J33691o6026J58376j41679Q9857J82896
14824F05633J46066o5842N7157K48211k64586M8646K2268k96965K4044k18236
14814C06396K10319j99955L35371j77579N2818J24441P9772M59353k07790j5609
14804I67537k02917j34854P2912K24190j57983j60665R6886m5160k38484J44639
14794E66101k2784n1519K94212l14934Q1353j24005J33008L04340N5759L3626
14784I55157l47455l6035M3449q9813J72289O3466R105q6235j3093n0921o9325
$$ plain form
14773 550589 649003 587222 647273 715510 521799 382757 389497 556489 605665 558269 487541
14762 487541 532276 343823 549240 765879 553768 590196 111202 255263 856758 357465
14751 562156 633815 615518 672579 700017 367987 573425 688965 681936 511921 490200 908175
14740 908175 527341 584500 803317 707316 652358 641518 705551 1010710 635351 1143312
14730 1143312 1426599 1467751 2024452 2266390 1822083 1557990 907205 1002990 1136437 876041
14720 876041 802229 821089 991316 290316 671909 691699 739337 791423 1119660 1069817 808275
14709 808275 948644 1126187 1073989 939645 1148069 1508579 2030504 2091945 1767809 1611947
14699 1611947 1461436 1317781 1058079 645767 637666 770351 1011570 1080142 899245 808678
$$ packed form
14773E50589R8414o1781O0051O8237j93711j39042O740J66992M9176m7396p0728
14762D87541M4735j88453K05417K16639k12111L6428A11202J44061O01495C57465
14751E62156P1659j8297N7061K7438l32030K05438J15540p029j70015k1721M17975
14740I08175l80834N7159K18817r6001n4958j0840O4033L05159l75359N07961
14730A143312K83287M1152N56701K41938m44307k64093o50785R5785J33447k60396
14720H76041p3812J8860J70227B90316L81593J9790M7638N2086L28237m9843k61542
14709H08275J40369J77543n2198j34344K08424L60510N21925O1441l24136j55862
14699A611947j50511j43655k59702m12312q101J32685K41219O8572j80897r0567
$$ plain form
14689 808678 693251 1171000 1034674 875104 855105 1012530 962671 810163 1115593 686458
14679 686458 769110 860050 872925 783059 791236 836951 641642 905008 1050599 899353 949342
14668 949342 963257 1027002 943275 921402 942344 1161396 1383806 888059 1061386 1006496 1396824
14657 1396824 1017075 989963 1120153 1175934 1333289 1274683 1266448 814598 1365847 1081447
14647 1081447 1214372 975863 1038429 1272281 831873 1234790 1076517 1058944 1119729 1065995
14637 1065995 1315192 1230882 1130861 1026345 1323450 1260758 1095940 951377 1002797 1319502
14627 1319502 1193585 1040461 1130476 1148154 1322669 940984 951265 1301500 1278878 1586609
14617 1586609 1325793 1126834 1440357 945793 1214545 1137347 1362920 1489586 1342485 1465748
$$ packed form
14689H08678j15427M77749j36326j59570j9999J57425m9859j52508L05430m29135
14679F86458Q2652R0940J2875q9866Q177M5715j95309K63366J45591j51246M9989
14668I49342J3915O3745q3727k1873K0942K19052K22410m95747J73327n4890L90328
14657A396824l79749k7112J30190N5781J57355n8606q235m51850N51249k84400
14647A081447J32925k38509O2566K33852m40408M02917j58273j7573O0785n3734
14637A065995K49197q4310j00021j04516K97105o2692j64818j44563N1420L16705
14627A319502j25917j53124R0015J7678J74515l81685J0281L50235k2622L07731
14617A586609k60816j98959L13523m94564K68752p7198K25573J26666j47101J23263
$$ plain form
14607 1465748 1591659 1511124 1316312 1234583 1398553 1193302 1644237 1553038 1438186 1452681
14597 1452681 1607115 1527238 1786618 1517017 1686921 1609381 1938455 1544349 1509445 1565402
14587 1565402 1786171 1512349 1696390 2003773 1676701 1672251 1872716 1795874 1920847 1605034
14577 1605034 1850526 1806557 1831850 2053019 1752831 1801473 1827997 2135818 2306087 1974803
14567 1974803 2034273 1939367 2229244 2461734 2262002 2475189 2187574 2205357 2470812 2453668
14557 2453668 2576343 2795950 2833089 2871152 3342693 3864739 4451641 4737036 6949026 10511543
14547 10511543 18924364 36993154 44966806 18251699 7811308 3660885 2176478 1886883
14539 1886883 2152026 2333198 3037179 4723770 4921265 2392702 2261692 1830284 2107366
$$ packed form
14607A465748J25911q0535j94812q1729J63970k05251M50935r1199j14852J4495
14597A452681J54434p9877K59380k69601J69904p7540L29074l94106l4904N5957
14587A565402K20769k73822J84041L07383l27072m450K00465p6842J24973l15813
14577A605034K45492m3969K5293K21169l00188M8642K6524L07821J70269l31284
14567A974803N9470r4906K89877K32490j99732K13187k87615J7783K65455j7144
14557B453668J22675K19607L7139L8063M71541N22046N86902K85395K211990L562517
14547A0511543Q412821J8068790P973652A8251699G811308C660885j484407k89595
14539A886883K65143J81172P03981J686591J97495B392702j31010m31408K77082
$$ plain form
14530 2107366 2119307 2098426 2163584 2181696 2341660 2163921 1897035 1959009 2015964 2342610
14520 2342610 2079801 2245316 2269092 2232616 2343681 2506981 2406805 2353939 2523803 2505035
14510 2505035 2704913 2600961 2549049 2626499 2696754 2762801 2382098 2939840 2780986 3024371
14500 3024371 2812868 2840573 2867349 3000782 2890823 2885462 2596393 2968630 3034710 2969855
14490 2969855 2935808 3098144 3250782 3267788 2782918 3091972 3218433 3717777 3452146 3246466
14480 3246466 3374343 3398378 3532042 3517001 3552885 3730157 3529978 3627205 3855964 3926146
14470 3926146 3934800 3663863 3992191 4209439 4369248 3914234 3804385 4138807 4103315 4359608
14460 4359608 4367208 4472875 4442432 4661072 4470446 4586807 4312477 4547433 4831167 5061796
$$ packed form
14530B107366J1941k0881O5158J8112J59964j77739k66886O1974N6955L26646
14520B342610k62809J65515K3776l6476J11065J63300j00176n2866J69864j8768
14510B505035J99878j03952n1912P7450P0255O6047l80703N57742j58854K43385
14500C024371k11503K7705K6776J33433j09959n361k89069L72237O6080o4855
14490B969855l4047J62336J52638J7006m84870L09054J26461M99344k65631k05680
14480C246466J27877K4035J33664j5041L5884J77272k00179R7227K28759P0182
14470C926146Q654k70937L28328K17248J59809m55014j09849L34422l5492K56293
14460D359608P600J05667l0443K18640j90626J16361k74330K34956K83734K30629
$$ plain form
14450 5061796 4822523 4810577 5257748 5110939 5202220 5067158 5333593 5530616 5333852 5579146
14440 5579146 5767369 5750867 5792058 5842711 6172136 5838528 6033197 6050701 6416975 6184322
14430 6184322 6455824 6580630 6722690 6984852 7159376 6983685 7673517 7601096 7248614 7143015
14420 7143015 7217086 7612927 7779581 7827627 7961106 8066283 8196756 8182930 8688862 8691593
14410 8691593 8830154 8755864 8862976 9256655 8548382 8827236 9096947 9320023 9243207 9337396
14400 9337396 9519813 9901894 9890533 10090732 10379485 9932413 10698255 10962204 11296848 10801572
14390 10801572 11614761 11336779 11898091 12196427 12582106 12563530 12581825 12870239 13328826 13052345
14380 13052345 13199546 13735194 13737042 14140459 14100859 14773877 15444927 15574797 15652136 16283431
$$ packed form
14450E061796k39273j1946M47171j46809R1281j35062K66435J97023j96764K45294
14440E579146J88223j6502M1191N0653L29425l33608J94669J7504L66274k32653
14430F184322K71502J24806J42060K62162J74524j75691O89832p2421l52482j05599
14420G143015P4071L95841J66654M8046J33479J05177J30473j3826N05932K731
14410H691593J38561p4290J07112L93679p08273K78854K69711K23076p6816R4189
14400I337396J82417L82081j1361K00199K88753m47072P65842K63949L34644m95276
14390A0801572Q13189k77982N61312K98336L85679j8576J8295K88414M58587k76481
14380A3052345J47201N35648J848M03417l9600O73018O71050J29870P7339O31295
$$ plain form
14370 16283431 16632351 16750013 17130476 17006299 17480757 17768656 18308840 18725124 19051318
14361 19051318 19693674 19921912 20500821 20833506 21276478 21992090 22469835 22833283 22993329
14352 22993329 24172146 24453674 25046504 25769147 26344061 26967458 27835322 28886985 29299540
14343 29299540 29989589 30884991 31745788 32571069 33425166 34376139 35093551 36203882 37600261
14334 37600261 38452674 39560638 40803182 42160719 43477677 44775299 46229015 47855766
14326 47855766 49241497 51122904 52868952 54818292 56471292 58202240 60387760 62647054
14318 62647054 64910762 67155595 69601012 72227565 75325263 78299374 81255861 84934889
14310 84934889 88139257 91542195 95840403 99384186 104352557 108968134 113797263 119349747
$$ packed form
14370A6283431L48920J17662L80463j24177M74458K87899N40184M16284L26194
14361A9051318O42356K28238N78909L32685M42972P15612M77745L63448J60046
14352B2993329J178817K81528N92830P22643N74914O23397Q67864J051663M12555
14343B9299540O90049Q95402Q60797Q25281Q54097R50973P17412J110331J396379
14334C7600261Q52413J107964J242544J357537J316958J297622J453716J626751
14326D7855766J385731J881407J746048J949340J653000J730948K185520K259294
14318F2647054K263708K244833K445417K626553L097698K974111K956487L679028
14310H4934889L204368L402938M298208L543783M968371M615577M829129N552484
$$ plain form
14302 119349747 124658226 130475896 136884706 143140870 150221726 157612181 165694930 173803462
14294 173803462 182379577 192008883 201546920 211916597 222416564 233455938 245159786
14287 245159786 257409943 270102698 283547949 297171291 311151866 325583140 340336654
14280 340336654 354475763 368730245 382450277 395719242 408042576 419357886 428721209
14273 428721209 435288322 437708349 438895038 440461789 442503489 439122383 436929088 434114271
14265 434114271 427155208 417350537 405888959 393210794 379422195 364722974 349573615
14258 349573615 334504075 319417046 304491288 290049656 275971832 262058943 248948780
14251 248948780 236733615 224704870 213048187 202102802 192099868 184735905 176126352
$$ packed form
14302A19349747N308479N817670O408810O256164P080856P390455Q082749Q108532
14294A73803462Q576115R629306R538037J0369677J0499967J1039374J1703848
14287B45159786J2250157J2692755J3445251J3623342J3980575J4431274J4753514
14280C40336654J4139109J4254482J3720032J3268965J2323334J1315310R363323
14273D28721209O567113K420027J186689J566751K041700l381106k193295k814817
14265D34114271o959063r804671j1461578j2678165j3788599j4699221j5149359
14258C49573615j5069540j5087029j4925758j4441632j4077824j3912889j3110163
14251B48948780j2215165j2028745j1656683j0945385j0002934p363963q609553
$$ plain form
14244 176126352 167343720 159144503 151388705 144264116 137281890 130899477 125365195 120216281
14236 120216281 114680445 109701365 104938271 100225552 96099656 93067338 89149248 85496068
14228 85496068 82440807 78715372 76073625 73114131 70435724 67965579 65414549 63297602
14220 63297602 61369052 59281745 56846609 55079563 53318794 51693084 50037322 48853468
14212 48853468 47358661 45556762 44273403 43197492 42023660 41196464 39941369 38605288
14204 38605288 37377346 36491963 35259522 34484788 33621378 33055937 32033518 31100082 29914191
14195 29914191 29453373 29006380 28263605 27720071 26731309 26128067 25487371 24974177 24369346
14186 24369346 23757234 23322254 22519192 22272959 21999912 21522939 21096993 20200818 20276168
$$ packed form
14244A76126352q782632q199217p755798p124589o982226o382413n534282n148914
14236A20216281n535836m979080m763094m712719m125896l032318l918090l653180
14228H5496068l055261l725435k641747k959494k678407k470145k551030k116947
14220F3297602j928550k087307k435136j767046j760769j625710j655762j183854
14212D8853468j494807j801899j283359j075911j173832q27196j255095j336081
14204C8605288j227942q85383j232441p74734q63410n65441j022419r33436j185891
14195B9914191m60818m46993p42775n43534r88762o03242o40696n13194o04831
14186B4369346o12112m34980q03062k46233k73047m76973m25946q96175P5350
$$ plain form
14177 20276168 19714093 19315838 19025567 18337063 18308469 17543054 17421488 17164257 16876628
14168 16876628 16296681 16443043 15937692 15729903 15334205 15309496 14715797 14393556 14320247 14009084
14158 14009084 13785410 13368424 13285068 13256147 12945302 12801756 12515246 12432130 12019706 12043029
14148 12043029 11635988 11452228 11268024 11243314 11043634 10646302 10576768 10256920 10156777 10184406
14138 10184406 10123808 9592031 9744758 9408208 9278692 8921232 9121942 8945864 8810338
14129 8810338 8697438 8590369 8479681 8035423 8343032 7906398 8043128 7669753 7697570 7608635
14119 7608635 7816751 7473554 7694758 7078268 7020784 7251668 6910710 6883033 7067669 6622540
14109 6622540 6399728 6539130 6374690 6446634 6364886 6048428 6572498 5870478 5912156 5815312
$$ packed form
14177B0276168n62075l98255k90271o88504k8594p65415j21566k57231k87629
14168A6876628n79947J46362n05351k07789l95698k4709n93699l22241p3309l11163
14158A4009084k23674m16986q3356k8921l10845j43546k86510q3116m12424K3323
14148A2043029m07041j83760j84204k4710j99680l97332o9534l19848j00143K7629
14138A0184406o0598n31777J52727l36550j29516l57460K00710j76078j35526
14129H810338j12900j07069j10688m44258L07609m36634J36730l73375K7817q8935
14119G608635K08116l43197K21204o16490n7484K30884l40958k7677J84636m45129
14109F622540k22812J39402j64440P1944q1748l16458N24070p02020M1678r6844
$$ plain form
14099 5815312 6179144 6083593 5890222 5787213 5830864 5416563 5651674 5342768 5350076 5216520
14089 5216520 5386246 5567212 5287019 5170805 4991654 5270744 5066791 5091269 4850672 4874169
14079 4874169 4849267 4654355 4746243 4710224 4685888 4434590 4658347 4749117 4548825 4433768
14069 4433768 4450884 4037170 3861223 3894798 4208623 3788410 4299943 4281457 4202320 3780856
14059 3780856 4197721 3880700 4082806 3687291 4095361 3858517 3632525 3538410 3878664 3742840
14049 3742840 3731813 3964127 3463860 3581515 3222219 3052016 2812474 3276485 3186115 3325619
14039 3325619 3238087 3229680 3023858 3057208 3006559 3198426 3282785 3091130 3352406 3034080
14029 3034080 3206131 2934504 2770717 2766957 2889904 2556493 2757442 2868612 2819114 2933053
$$ packed form
14099E815312L63832r5551j93371j03009M3651m14301K35111l08906P308j33556
14089E216520J69726J80966k80193j16214j79151K79090k03953K4478k40597K3497
14079D874169k4902j94912R1888l6019k4336k51298K23757R0770k00292j15057
14069D433768J7116m13714j75947L3575L13825m20213N11533j8486p9137m21464
14059C780856M16865l17021K02106l95515M08070k36844k25992r4115L40254j35824
14049C742840j1027K32314n00267J17655l59296j70203k39542M64011r0370J39504
14039C325619q7532q407k05822L3350n0649J91867Q4359j91655K61276l18326
14029C034080J72051k71627j63787l760J22947l33411K00949J11170m9498J13939
$$ plain form
14019 2933053 2704787 2530503 2416959 2896500 2531747 2583693 2660927 2396716 2096559 2427111
14009 2427111 2489635 2304249 2586383 2336823 2308371 2354763 2057141 1885118 2467512 2227693
13999 2227693 2091446 2259647 2342886 2044381 2184813 1952612 1885198 2076674 2131727 2208491
13989 2208491 3075836 5355034 10992387 25751806 47972026 29761872 15019806 8422952
13981 8422952 5829510 4836168 4297111 3512164 3268932 2794911 2799817 3059663 2720192 2444781
13971 2444781 2096189 2488411 2799034 2359472 2053161 2562349 2418948 2369279 2446527 2031401
13961 2031401 2198393 2479814 1932475 2212268 2467539 2002352 1903494 1718331 2021072 1995628
13951 1995628 2011114 2117014 2000771 1659328 1908585 1848853 1877737 1664140 1809988 1828596
$$ packed form
14019B933053k28266j74284j13544M79541l64753N1946P7234k64211l00157L30552
14009B427111O2524j85386K82134k49560k8452M6392k97622j72023N82394k39819
13999B227693j36247J68201Q3239k98505J40432k32201o7414J91476N5053P6764
13989B208491Q67345K279198N637353J4759419K2220220j8210154j4742066o596854
13981H422952k593442r93342n39057p84947k43232m74021M906K59846l39471k75411
13971B444781l48592L92222L10623m39562l06311N09188j43401m9669P7248m15126
13961B031401J66992K81421n47339K79793K55271m65187r8858j85163L02741k5444
13951A995628J5486J05900j16243l41443K49257n9732K8884k13597J45848J8608
$$ plain form
13941 1828596 1599305 1621258 1601763 1635036 2131233 1400748 1621118 1777598 2027154 1552620
13931 1552620 1557287 1539420 1859351 1644603 1577691 1533935 1698377 1445495 1703165 1568314
13921 1568314 1450203 1709000 1722680 1563418 1301409 1222262 1369492 1447965 1318194 1351514
13911 1351514 1438437 1308406 1438981 1412461 1506487 1600116 1569390 1425884 1304250 1167889
13901 1167889 1295155 1354626 1146651 1360817 1183926 1067995 1117134 1349437 978468 1250421
13891 1250421 1030140 1046609 1306606 971346 1186695 1220319 1015244 1276292 1189856 1074479
13881 1074479 1042588 1367339 1489768 1093445 1303611 855631 908602 1085970 1258467 1162242
13871 1162242 1025148 1258829 1269016 1395075 1025572 1303230 937276 1075977 1115000 1185451
$$ packed form
13941A828596k29291K1953j9495L3273M96197p30485K20370J56480K49556m74534
13931A552620M667j7867L19931k14748o6912m3756J64442k52882K57670j34851
13921A568314j18111K58797J3680j59262k62009p9147J47230P8473j29771L3320
13911A351514Q6923j30031J30575k6520R4026R3629l0726j43506j21634j36361
13901A167889J27266N9471k07975K14166j76891j15931M9139K32303l70969K71953
13891A250421k20281J6469K59997l35260K15349L3624k05075K61048q6436j15377
13881A074479l1891L24751J22429l96323K10166m47980N2971J77368J72497r6225
13871A162242j37094K33681J0187J26059l69503K77658l65954J38701L9023P0451
$$ plain form
13861 1185451 1227492 997664 1252786 864836 1035318 1010914 1338171 922178 862682 765191
13851 765191 1073014 1262603 812250 962787 944801 916318 878523 697395 1157140 1190443
13841 1190443 1054442 790476 664554 948433 999500 1013331 1330528 1151611 1033700 781323
13831 781323 1128208 1027177 1164745 777328 848609 820654 891867 1102679 987129 775434
13821 775434 927207 972059 1162769 939383 1134653 985144 966047 901384 649439 840513
13811 840513 698303 577964 724466 867866 793185 1060113 994718 973271 523296 775191
13801 775191 1009352 677982 904809 1076874 849493 696276 880371 963325 259192 946456
13791 946456 1183015 784868 879125 491810 763741 622541 820260 707274 887424 793816
$$ packed form
13861A185451M2041k29828K55122l87950J70482k4404L27257m15993n9496r7491
13851G65191L07823J89589m50353J50537j7986k8483l7795j81128M59745L3303
13841A190443j36001k63966j25922K83879N1067J3831L17197j78917j17911k52377
13831G81323L46885j01031J37568l87417P1281k7955P1213K10812j15550k11695
13821G75434J51773M4852J90710k23386J95270j49509j9097o4663k51945J91074
13811H40513j42210j20339J46502J43400p4681K66928o5395k1447m49975K51895
13801G75191K34161l31370K26827J72065k27381j53217J84095Q2954B59192O87264
13791I46456K36559l98147R4257l87315K71931j41200J97719j12986J80150r3608
$$ plain form
13781 793816 646513 964809 732034 747059 1160800 688283 638375 821049 887022 751417
13771 751417 569948 837801 932490 567051 806157 701287 877892 453398 588557 705424
13761 705424 604001 564296 615583 663395 664135 446547 529803 752915 674225 871069 627910
13750 627910 844142 952549 474388 561393 470715 616741 574954 621281 660773 867224
13740 867224 723124 844424 1024321 889246 709922 666401 898947 715495 726685 458872
13730 458872 568573 898929 647115 937813 888225 742812 315878 779281 523646 656184
13720 656184 433217 710452 416506 477082 666035 520778 615519 610659 640125 624513 400648
13709 400648 531037 562905 625679 568986 450315 280735 425619 501734 763821 532916
$$ packed form
13781G93816j47303L18296k32775J5025M13741m72517m9908J82674O5973j35605
13771G51417j81469K67853R4689l65439K39106j04870J76605m24494J35159J16867
13761G05424j01423l9705N1287M7812P40k17588Q3256K23112p8690J96844k43159
13750F27910K16232J08407D74388Q7005r0678J46026m1787M6327L9492K06451
13740H67224j44100J21300J79897j35075j79324m3521K32546j83452J1190k67813
13730D58872J09701L30356k51814K90698m9588j45413C15878M63403k55635J32538
13720F56184k22967K77235k93946O0576J88953j45257R4741m860K9466j5612k23865
13709D00648J30389L1868O2774n6693j18671j69580J44884P6115K62087k30905
$$ plain form
13699 532916 603805 567927 497556 341673 742422 513304 626801 559725 821444 698253
13689 698253 528386 649388 341645 403083 614213 468558 209673 565537 315794 529296
13679 529296 242603 568423 394675 448671 699016 589279 664598 442314 634502 700475
13669 700475 660085 424259 112037 483721 498025 622138 443192 258073 248993 687300
13659 687300 542525 607424 536872 418825 469474 489811 642699 456463 319795 482120
13649 482120 529281 274524 685957 476771 501483 476266 233235 243209 331280 453907 556541
13638 556541 563789 312483 425795 308318 300965 533351 95925 373385 171690 566741
13628 566741 633244 351659 249951 500831 503555 528734 350578 405334 364361 133349 625425
$$ packed form
13699E32916P0889l5878p0371j55883M00749k29118J13497o7076K61719j23191
13689F98253j69867J21002l07743O1438K11130j45655B09673L55864k49743K13502
13679E29296B42603L25820j73748N3996K50345j09737P5319k22284J92188O5973
13669G00475m0390k35826A12037L71684J4304J24113j78946j85119r080M38307
13659F87300j44775O4899p0552j18047N0649K0337J52888j86236j36668J62325
13649D82120M7161k54757M11433k09186K4712k5217B33235R974Q8071J22627J02634
13638E56541P248k51306J13312j17477p353K32386I5925K77460A71690L95051
13628E66741O6503k81585j01708K50880K724K5179j78156N4756m0973A33349M92076
$$ plain form
13617 625425 58713 381168 77502 627972 580310 449173 253228 431353 439730 238748
13607 238748 431359 481894 464172 576782 433401 333776 222441 179464 493315 391051
13597 391051 231415 479814 324044 425212 363264 391715 412809 246497 571846 240342
13586 239930 228275 218114 -141689 117484 199829 422210 328954 344880 392677 304355 443502
13575 443502 227049 93954 406754 439999 287707 253216 151976 192582 346889 470269
13565 470269 375424 627403 275427 368359 113403 298207 406811 483597 193706 201388
13555 201388 167119 271424 265212 330541 276437 46701 328888 161834 233578 335137 45526
13543 234333 105679 415102 187874 109164 176056 215010 195299 193130 189919 480734 331949
$$ packed form
13617F25425E8713L22455G7502N50470m7662j31137j95945J78125Q377k00982
13607B38748J92611N0535j7722J12610j43381r9625j11335m2977L13851j02264
13597C91051j59636K48399j55770J01168o1948K8451K1094j66312L25349B40342
13586B39930j1655j0161a41689A17484Q2345K22381r3256J5926M7797q8322J39147
13575D43502k16453I3954L12800L3245j52292l4491j01240M0606J54307J23380
13565D70269r4845K51979B75427R2932A13403J84804J08604P6786A93706P682
13555B01388l4269J04305o212O5329n4104D6701K82187A61834P1744J01559D5526
13543B34333A05679L09423A87874p8710O6892L8954j9711k169l211K90815j48785
$$ plain form
13532 331949 65321 73597 -183936 62392 275029 434708 637897 380190 348385 172568
13521 -141510 350162 285899 113317 264516 518846 194485 253351 164435 76485 230708
13511 230708 288854 226354 285714 135892 340399 308708 474390 611641 442272 173740
13500 324258 371003 409548 50437 284444 85391 233042 218951 412074 280936 325284 278029
13489 278029 494920 347706 388377 178912 341642 344627 496626 268301 282241 -313809
13478 232964 611769 114958 -90954 125114 266092 106548 693942 412318 343867 212268
13468 212268 505273 181811 164820 114782 32721 -87300 302651 260743 36913 -116286 278628
13456 177755 414454 173163 181543 120849 228125 359146 231863 385118 196677 465616
$$ packed form
13532C31949F5321Q276a83936F2392K12637J59679K03189k57707l1805A72568
13521a41510C50162o4263A13317J51199K54330A94485N8866q8916G6485J54223
13511B30708N8146o2500N9360A35892K04507l1691J65682J37251j69369A73740
13500C24258M6745L8545E0437K34007H5391J47651j4091J93123j31138M4348m7255
13489B78029K16891j47214M0671A78912J62730K985J51999k28325J3940c13809
13478B32964L78805A14958i0954A25114J40978A06548N87394k81624o8451j31599
13468B12268K93005A81811j6991n0038C2721h7300C02651m1908C6913a16286B78628
13456A77755K36699A73163Q380o0694J07276J31021j27283J53255j88441K68939
$$ plain form
13446 465616 145127 270784 350063 156921 75198 247863 1021 257924 152570 -189123
13435 232816 215625 156823 262166 688673 105845 387296 392913 466979 175981 -17 277154
13423 154788 319816 356337 318141 123003 -45338 165218 -143416 10272 112833 170788
13413 170788 342935 -33760 21671 395409 214151 142528 438310 116117 94714 176964
13403 176964 111509 188969 172016 387995 94168 301341 203931 531428 225318 -41569 203303
13391 353122 -61755 90148 280973 333255 346225 322800 82303 156617 350429 198316 181360
13380 181360 41421 86565 297179 -53214 39981 446481 156810 200169 338395 87230 246357
13369 246357 -96338 303774 337956 406037 20838 50151 244770 109534 320733 27095 -79782
$$ packed form
13446D65616A45127J25657P9279A56921G5198J72665A021K56903j05354a89123
13435B32816j7191n8802J05343M26507A05845K81451N617P4066A75981a7B77154
13423A54788J65028L6521l8196A23003d5338A65218a43416A0272J02561N7955
13413A70788J72147c3760B1671L73738j81258p1623K95782A16117k1403Q2250
13403A76964o5455P7460j6953K15979I4168K07173r7410L27497B25318d1569B03303
13391C53122f1755I0148J90825N2282J2970k3425H2303P4314J93812j52113j6956
13380A81360D1421M5144K10614e3214C9981M06500A56810M3359J38226H7230J59127
13369B46357i6338C03774L4182O8081B0838K9313J94619A09534K11199B7095g9782
$$ plain form
13357 -174587 242345 4363 150880 142685 -74030 102134 59714 205596 61854 -174555 117395
13345 464919 -100659 137307 476284 305835 -92365 479574 486221 481205 328181 150447
13334 203247 255266 305714 359256 359832 506838 571903 196668 583194 -47881 310007 245070
13323 245070 309606 97768 432846 299344 367546 275324 91561 103102 161537 233093 145737
13312 145737 219601 426115 301842 326865 459647 -12611 128820 167849 220967 126586 317943
13301 317943 88037 143844 237521 86600 -39806 25481 261873 188672 396249 82261 294812
13290 294812 130667 83832 226834 0 209275 -35913 -292685 159635 -303666 192720 24420
13278 142789 170358 205913 -29556 387398 132560 24211 -57329 122652 180693 274270 -23437
$$ packed form
13357a74587B42345D363J46517q195g4030A02134m2420J45882F1854a74555A17395
13345D64919a00659A37307L38977j70449i2365D79574O647n016j53024A50447
13334B03247N2019N0448N3542N76J47006O5065A96668L86526d7881C10007o4937
13323B45070O4536I7768L35078j33502O8202r2222I1561J1541N8435P1556q7356
13312A45737P3864K06514j24273K5023J32782a2611A28820L9029N3118r4381J91357
13301C17943H8037N5807R3677H6600c9806B5481K36392p3201K07577H2261K12551
13290B94812A30667m6835J43002@B09275c5913k56772A59635c03666A92720B4420
13278A42789K7569L5555b9556C87398A32560B4211e7329A22652N8041R3577b3437
$$ plain form
13266 185206 -207722 -71970 23338 129748 -147642 248813 -159312 321100 356719 -51836
13255 -21346 -14674 285463 -95072 8734 153202 532476 68589 212511 349948 323749 263099
13244 263099 -11376 113829 97297 -239945 -30989 146213 14601 -74133 156926 200855 13769
13232 226558 -144009 -38612 -151231 -120207 143063 46639 155227 173291 75400 -17247 429694
13220 179446 49442 2591 -178042 188845 347815 -207830 101882 -101057 220060 -215401
13209 79336 -29607 109349 -34228 41498 -72568 46074 -144416 93395 264298 -96028 206817
13197 144317 34085 4907 -87706 -32170 185115 -95540 195641 -140534 285909 -53419 -447652
13186 -447652 -13505 24257 184165 -38127 197862 17268 146997 137165 -129046 63300 -11267
$$ packed form
13266A85206b07722g1970B3338J06410a47642B48813a59312C21100L5619e1836
13255b1346O672B85463i5072H734J44468L79274F8589J43922J37437k6199o0650
13244B63099a1376A13829j6532b39945c0989A46213A4601g4133A56926M3929A3769
13232B26558a44009c8612j12619L1024A43063D6639J08588J8064G5400a7247D29694
13220A79446D9442B591a78042A88845J58970b07830A01882a01057B20060b15401
13209G9336b9607A09349c4228D1498g2568D6074a44416I3395J70903i6028B06817
13197A44317C4085D907h7706c2170A85115i5540A95641a40534B85909e3419l94233
13186d47652a3505B4257J59908c8127A97862A7268J29729r832a29046F3300a1267
$$ plain form
13174 -131845 248689 -140034 60825 270004 182788 -217344 133549 -66634 55498 195534
13164 195534 -42719 275082 118979 -118091 68694 301713 -14496 -299702 163491 -298459
13153 53400 209668 224544 -116284 32661 116615 112064 143733 101996 32521 332475 196941
13142 196941 27467 -238033 -232113 289510 140753 -11092 85595 103878 -384710 281345 -42235
13130 -17615 268364 143615 174776 -235225 51953 -2410 191162 137044 -125603 281996 324512
13119 324512 104741 40677 -94446 -56343 139135 51194 -1569 -119256 -173767 65373 147379
13108 147379 -75749 65187 -142832 -39416 -168592 -30526 244314 210486 191143 334555 120327
13096 233900 388653 -117573 81471 61396 347479 83320 224299 32425 143476 -340882
$$ packed form
13174a31845B48689a40034F0825K09179q7216b17344A33549f6634E5498J40036
13164A95534d2719B75082A18979a18091F8694K33019a4496k85206A63491b98459
13153E3400J56268J4876a16284C2661Q3954m551L1669m1737C2521K99954j35534
13142A96941B7467b38033N920B89510A40753a1092H5595J8283c84710B81345d2235
13130a7615B68364j24749L1161b35225E1953b410A91162n4118a25603B81996M2516
13119C24512A04741D0677i4446L8103A39135E1194a569j17687n4511F5373Q2006
13108A47379g5749F5187a42832c9416j29176c0526B44314l3828j9343J43412A20327
13096B33900J54753a17573H1471k0075K86083H3320J40979C2425J11051c40882
$$ plain form
13085 291118 -113764 166649 61809 30033 -172110 -168094 114641 98510 4843 -7062 -300252
13074 -300252 -160635 168312 -252389 79462 79956 -84050 -124532 201057 116197 120941 133959
13063 133959 -125468 99577 61029 17649 6047 784 -101870 58553 -229885 227681 236567
13052 236567 341533 376140 -43839 242664 -152712 -155857 208202 56335 111352 188981 184716
13041 184716 -45392 -281217 149152 206273 46470 143148 73904 65134 19942 38776 123104
13030 123104 46540 90081 120257 162025 -33038 4242 -80628 216877 88098 -45376 -152875
13019 -152875 95400 112034 64865 136257 286856 442996 12578 -226699 310854 -64567 160281
13007 232767 380013 53020 -132578 242585 120025 307241 25513 -13529 2670 149737
$$ packed form
13085B91118a13764A66649F1809C0033a72110M016A14641j6131D843g062k93190
13074c00252J39617A68312b52389G9462M94h4050m0482B01057q4860M744J3018
13063A33959a25468I9577l8548A7649F047G84a01870E8553b29885B27681Q886
13052B36567J04966L4607d3839B42664a52712l145B08202E6335N5017P7629m265
13041A84716d5392k35825A49152N7121D6470R6678o9244q770A9942J8834Q4328
13030A23104D6540M3541L0176M1768c3038D242h0628B16877H8098d5376j07499
13019a52875I5400J6634m7169P1392J50599J56140A2578b26699C10854f4567A60281
13007B32767J47246E3020a32578B42585A20025J87216B5513a3529B670J47067
$$ plain form
12997 149737 224190 -125730 347487 119255 136930 323269 -84267 -109795 120873 376289
12987 376289 136880 277740 248456 -97877 110873 2187 151262 -112410 -378247 103288
12976 139728 -84994 214 232726 -19934 255752 40287 162687 -30043 -267404 37558 -56352
12964 -39432 426503 79214 -23556 429871 -18359 57287 175697 190047 -26519 137345 -119054
12952 -59215 129854 -29250 71719 187581 -37765 287477 -9809 130393 -87190 44857 -353875
12940 149120 -117522 -226712 -37407 -5615 127542 -325415 78774 267171 169676 -277823
12929 291020 -162197 -129497 -143893 295919 -27951 106173 172981 -45022 218118 39291 -111303
12917 115993 69548 34654 48575 44575 66089 -269691 -145287 86002 180192 33650 -153302
$$ packed form
12997A49737P4453a25730C47487A19255J7675J86339h4267k5528A20873K55416
12987C76289A36880J40860k9284i7877A10873B187J49075a12410k65837A03288
12976A39728h4994B14K32512a9934B55752D0287J22400c0043k37361C7558e6352
12964c9432D26503G9214b3556D29871a8359E7287J18410J4350b6519A37345a19054
12952e9215A29854b9250G1719J15862c7765B87477i809A30393h7190D4857c53875
12940A49120a17522j09190c7407e615A27542c25415G8774J88397r7495b77823
12929B91020a62197L2700j4396B95919b7951A06173O6808d5022B18118C9291a11303
12917A15993m6445C4654J3921m000K1514b69691J24404H6002R4190C3650a53302
$$ plain form
12905 95781 78761 -91388 246185 31241 -3902 137365 315886 -112731 263099 -409316 -16556
12893 -281840 63645 66786 -38757 -153343 107547 -51299 -93580 -252923 206200 38993 171111
12882 171111 219559 -60196 -198860 -40470 -222303 -21881 67404 138774 132918 -22596 -89920
12871 -89920 236778 -67019 93660 -239627 -79834 -144312 10367 49583 53732 -144664 -13768
12859 -121855 -78721 64947 -161191 -40091 23434 190388 -51751 260737 86480 77865 66640
12848 66640 54357 215389 -102356 31789 45405 55939 53986 -11761 -26912 -213866 14716
12836 -100680 190619 -73423 28524 -78653 -19705 343337 171396 -11756 213198 -90881 -274283
12825 -274283 200950 160274 57348 288216 -233588 120375 -77658 220322 -46543 21962
$$ packed form
12905I5781j7020i1388B46185C1241c902A37365J78521a12731B63099d09316a6556
12893b81840F3645L141c8757j14586A07547e1299m2281j59343B06200C8993J32118
12882A71111M8448f0196j38664d0470j81833b1881F7404P1370n856b2596o7324
12871h9920B36778f7019I3660b39627g9834o4478A0367L9216M149a44664a3768
12859a21855M3134F4947a61191d0091B3434J66954e1751B60737H6480q615j1225
12848F6640j2283J61032a02356C1789J3616J0534j953a1761j5151j86954A4716
12836a00680A90619g3423B8524g8653a9705C43337A71396a1756B13198i0881j83402
12825b74283B00950m0676E7348K30868b33588A20375g7658B20322d6543B1962
$$ plain form
12814 -111174 -46451 348428 369858 -241273 224795 214286 -228777 -55220 -73616 63103 77400
12803 77400 218392 229556 -14240 404540 351949 123693 -5104 -130336 -40121 177960 2235
12791 -56870 -4274 -28673 -390718 25745 109730 -58479 -12383 -10333 179782 -350360 -155793
12779 -198246 58794 -14500 -200645 72549 424016 156883 -82799 -13934 116634 -164445
12768 6516 106858 -192448 -221945 -22871 -170439 -175964 -235902 1783 153810 173514 -39141
12756 106780 -233059 -9024 -92123 -37524 176933 -17200 -68885 -8860 -105514 85236 103595
12745 103595 -238672 -214680 -108871 175931 -181492 -80324 240405 -4777 -145117 -274031
12735 -274031 -8998 165159 176407 140999 103723 -163597 -124077 -215584 194038 -328163 -73160
$$ packed form
12814a11174d6451C48428K1430b41273B24795j0509b28777e5220j8396F3103J4297
12803G7400J40992J1164a4240D04540n2591A23693e104j25232d0121A77960B235
12791e6870d274k4399l62045B5745Q3985e8479a2383K050A79782c50360a55793
12779a98246E8794a4500j86145G2549L51467A56883h2799a3934A16634a64445
12768F516J00342a92448k9497b2871j47568n525n9938A783J52027J9704c9141
12756A06780b33059i024q3099c7524A76933a7200n1685h860r6654H5236J8359
12745A03595b38672K3992J05809A75931a81492h0324B40405d777j40340j28914
12735b74031h998A65159J1248l5408l7276a63597L9520r1507A94038c28163g3160
$$ plain form
12723 -191704 -273894 -224660 222421 -204945 -100791 -251911 357973 -50252 -40706 23328 85595
12712 85595 139924 241878 83176 136210 110929 419154 227918 -129839 53800 107258 -91256
12700 14695 -463526 11692 258894 -207985 82197 -39163 -28863 -62322 105769 -17131 14003
12688 82336 9112 148683 100424 276251 67414 -159893 216325 113099 133867 227480 207785
12677 207785 252304 111337 32911 124116 103835 148158 54264 21394 -174593 -100414 216679
12665 350559 -93072 117005 274012 78911 -67874 166681 -6230 -835 181490 235510 -44216
12653 -41386 6606 63260 78114 254188 -34203 170453 -19334 232061 -29891 203362 -125568
12641 -306445 102348 -35112 -251235 52605 21010 -261239 54526 137932 213531 -57041 215833
$$ packed form
12723a91704q2190M9234B22421b04945a00791j51120C57973e0252R546B3328O2267
12712H5595N4329J01954H3176N3034k5281L08225j91236a29839E3800N3458i1256
12700A4695d63526A1692K47202b07985H2197c9163J0300l3459A05769a7131A4003
12688H2336I112J39571m8259J75827F7414a59893B16325j03226K0768R3613j9695
12677B07785M4519A11337C2911R1205k0281M4323E4264B1394a74593P4179B16679
12665C50559i3072A17005J57007G8911f7874A66681f230h35A81490N4020d4216
12653d1386F606N6654J4854J76074c4203A70453a9334B32061b9891B03362a25568
12641c06445A02348c5112k16123E2605B1010b61239E4526Q3406P5599e7041B15833
$$ plain form
12629 119028 -115236 257193 -121253 254604 -10395 -209826 14769 134131 -15674 1740
12618 54974 -301294 103843 178924 112899 187803 232884 27264 -240152 -347812 -160498 -328279
12607 -328279 -114454 -278442 -313439 208889 208204 402297 -173386 70274 -86614 -6861 -3310
12595 108037 342322 -154733 20292 -26104 61311 33713 66170 -2485 -141158 66874 -84613
12583 -47247 -266342 445279 -37161 -70100 9500 253408 -157316 -30797 11181 -60956 -18187
12571 -207967 26114 -405120 -224591 180597 -61340 -17618 -185017 -371253 294096 149633
12561 149633 25974 152974 126625 -194011 25385 41978 -288151 -295524 216058 -132181 -29834
12549 148781 -63985 -18062 -307423 125040 35785 202688 -193187 149383 28318 -245535
$$ packed form
12629A19028a15236B57193a21253B54604a0395j99431A4769J19362a5674A740
12618E4974c01294A03843P5081o6025P4904M5081B7264b40152j07660a60498j67781
12607c28279a14454j63988l4997B08889o85J94093a73386G0274h6614f861c310
12595A08037K34285a54733B0292b6104F1311k7598L2457b485j38673F6874h4613
12583d7247k19095D45279c7161l2939I500K43908a57316c0797A1181f0956a8187
12571b07967B6114d05120J80529A80597f1340a7618j67399j86236B94096j44463
12561A49633B5974J27000k6349a94011B5385J6593b88151p373B16058a32181b9834
12549A48781f3985a8062k89361A25040C5785J66903a93187A49383B8318b45535
$$ plain form
12538 -5472 393964 435638 203166 84851 -108072 -129420 962 -41507 72664 -71641 -51235 -99146
12526 -99146 116494 -132368 -36355 -173953 -127324 55008 11994 -151760 222605 334864
12516 334864 54025 304405 -3459 2499 -137014 -7898 61328 52422 -243791 -24333 -76312 16017
12503 -213448 -120696 102866 12762 -164477 60263 52897 -3626 8709 284427 23594 -102385
12491 203538 200106 193699 223460 -131645 100962 95658 91232 55238 -97854 314464 -148431
12479 356168 -166261 265258 -428351 -190810 63181 -222950 -86728 -148894 -76248 -288839
12469 -288839 32274 -338 72343 -74814 53049 -65064 -143546 234991 151959 527657 194356
12457 184252 276408 162679 19400 -4529 -101823 -163808 65766 4781 210719 167321 -136907
$$ packed form
12538e472C93964M1674B03166H4851a08072k1348I62d1507G2664g1641K0406m7911
12526i9146A16494a32368c6355j37598M6629E5008A1994a51760B22605J12259
12516C34864E4025K50380c459B499a37014g898F1328q906b43791b4333n1979A6017
12503b13448R2752A02866A2762a64477F0263p366c626H709K75718B3594a02385
12491B03538l432o407K9761a31645A00962n304m426l5994i7854C14464a48431
12479C56168a66261B65258d28351a90810F3181b22950h6728o2166P2646k12591
12469b88839C2274c38G2343g4814E3049f5064p8482B34991q3032L75698A94356
12457A84252R2156j13729A9400d529r7294o1985F5766D781K05938m3398a36907
$$ plain form
12445 170220 104052 -302452 -2387 -33498 -246429 -182231 -339247 -122738 -184713 -41191 123994
12433 143875 10056 226067 28622 71263 -217378 -6851 -200114 -111906 158897 -246460 81368
12421 119019 -61664 -12594 267704 43797 -129981 -70730 -287792 -633106 -37022 -114669 13468
12409 -345398 -69976 204955 -76283 59861 9304 -296406 -212257 103854 -41583 23517 -26832
12397 -14585 111962 172270 94049 -250889 85528 157672 217007 30115 -217294 153985 348586
12386 348586 -174999 -157952 17550 241728 9758 155256 -135233 70344 14982 58509 -122747
12374 240487 175256 6894 38292 75084 68982 -122161 -167214 -37388 384682 17021 444083
12363 444083 96743 373094 -120683 -150047 -56279 -393493 48544 412197 -64756 149066
$$ packed form
12445A70220o6168c02452b387l1111k12931O4198j57016a22738o1975d1191A23994
12433A43875A0056K16011B8622M2641b17378f851j93263Q8208A58897b46460H1368
12421A19019f1664a2594B67704D3797a29981N9251k17062l45314c7022p7647A3468
12409c45398f9976B04955g6283E9861I304b96406Q4149A03854d1583B3517b6832
12397a4585A11962O0308p8221b50889H5528P2144N9335C0115b17294A53985J94601
12386C48586a74999J7047A7550K24178I758J45498a35233G0344A4982M3527a22747
12374B40487o5231F894L1398L6792o102a22161m5053c7388C84682A7021M27062
12363D44083I6743K76351a20683k9364e6279l37214D8544L63653f4756A49066
$$ plain form
12352 374204 323187 -12524 6547 256080 -35722 137922 -411033 78169 72820 115864 -63472
12340 -23503 -60086 237848 -42267 -2421 -226435 204905 380106 79727 431838 204779 194557
12329 194557 233948 274667 348771 -85922 -109481 263993 -104194 515510 17731 -159168 83618
12317 109343 119892 278432 148483 181161 131714 -149836 116892 278560 252470 -285944
12306 98091 204695 380179 378653 -27852 158059 80303 81243 293628 266064 158602 -4520
12294 174651 20004 259245 146058 1912 299115 -84408 43503 299925 128263 176990 149870
12283 149870 -46917 -33002 528611 89845 -191199 281681 174454 302187 416558 312825
12273 312825 293250 330016 148584 -92382 -55025 290340 -200860 218281 107142 168440
$$ packed form
12352C74204n1017a2524F547K49533c5722A37922d11033G8169n349M3044f3472
12340b3503l6583B37848d2267b421k24014B04905J75201G9727L52111B04779j0222
12329A94557L9391M0719P4104h5922k3559B63993a04194E15510A7731a59168H3618
12317A09343J0549J58540j29949L2678m9447a49836A16892J61668k6090b85944
12306I8091J06604J75484j526b7852A58059p7756R40K12385k7564j07462d520
12294A74651B0004K39241j13187A912K97203h4408D3503K56422A28263M8727k7120
12283A49870d6917J3915E28611H9845a91199B81681j07227J27733J14371j03733
12273C12825j9575L6766A48584i2382L7357B90340b00860B18281A07142O1298
$$ plain form
12263 168440 150836 194988 142746 57168 40198 -160129 73573 111126 137482 156957 130691
12252 130691 281797 537240 -26376 119765 129484 -103174 -361015 -109993 -91997 292583
12241 62908 88257 160128 8395 175643 181511 457315 160539 64486 54116 108342 130914
12230 130914 -180607 201260 150144 210737 235847 192031 256112 -15318 4092 344030 121362
12218 -244626 108352 58733 264628 25253 -91558 280437 590989 203697 -561 -134310 382638
12206 91539 -66444 466739 178438 37406 86891 124640 -21248 299075 -44683 -82477 17972
12194 234629 45418 1320 -118841 55126 300233 131201 -120175 267642 238890 192444 371813
12183 371813 425913 400466 285875 37631 86203 293512 260478 250175 247020 110893 72916
$$ packed form
12263A68440j7604M4152n2242E7168j6970a60129G3573L7553K6356J9475k6266
12252A30691J51106K55443b6376A19765R719a03174k57841a09993J7996B92583
12241F2908K5349P1871H395J67248N868K75804A60539F4486j0370N4226K2572
12230A30914a80607B01260n1116O0593K5110m3816O4081a5318D092L39938A21362
12218b44626A08352m9619K05895B5253i1558B80437L10552B03697e61j33749C82638
12206I1539f6444D66739A78438C7406M9485L7749b1248B99075d4683l7794A7972
12194B34629D5418A320a18841E5126K45107A31201a20175B67642k8752m6446J79369
12183C71813N4100k5447j14591C7631M8572K07309l3034j0303l155A10893l7977
$$ plain form
12172 72916 352998 87446 212870 72310 -382621 344437 166852 100659 235743 41706
12161 198231 142629 -30476 -123878 318962 -84848 54759 130286 -11477 106448 145331 276751
12150 276751 44909 134852 345715 161727 141512 -2290 -148363 306484 85620 111168 -230073
12138 11283 -195682 225187 -27097 -266669 -108589 5740 166427 102822 429886 -38609 248046
12126 261211 325385 92495 436691 107669 453100 119131 76928 493752 114007 77156
12116 77156 123053 17646 50515 -4493 -61070 293442 183501 213612 45143 215732 168445
12105 168445 -120986 -70359 52785 49108 -57321 276955 -80386 -55898 210671 230382 148824
12094 148824 46231 -46692 61534 69949 17841 216725 -58233 -43553 197554 105015 167144
$$ packed form
12172G2916K80082H7446J25424G2310c82621C44437A66852o6193J35084D1706
12161A98231n5602c0476r3402C18962h4848E4759P5527a1477A06448L8883J31420
12150B76751D4909Q9943K10863A61727k0215b290j46073C06484H5620K5548b30073
12138A1283a95682B25187b7097k39572a08589E740J60687o3605L27064c8609B48046
12126B61211O4174I2495L44196A07669L45431A19131m2203M16824A14007l6851
12116G7156M5897A7646L2869d493n6577B93442j09941L0111D5143J70589m7287
12105A68445a20986N0627E2785l677e7321B76955h0386K4488B10671J9711q1558
12094A48824D6231d6692F1534Q415A7841J98884e8233J4680A97554r2539O2129
$$ plain form
12083 167144 51858 -249229 195566 157700 -283209 212511 542375 389862 -126583 198203
12072 197784 146275 231366 28260 73997 -47700 44326 270006 -15231 16567 -9029 66007
12060 -83055 -193838 139515 181510 222234 332805 15437 444584 -68727 128009 -37545 88952
12048 205365 30432 28327 7692 266802 74878 -225733 -386 79022 132250 61349 31859 373506
12036 373506 170412 182331 420950 -25351 44684 -41864 23830 132363 167391 45477 143413
12025 143413 53498 -77978 305151 252909 -56167 -5743 223970 -96756 111732 109572 79537
12014 79537 310595 118114 -216686 342869 58153 83458 -79565 86148 121827 74170 -349357
12002 -110918 217881 99636 39776 99948 -31969 -89374 -84036 38665 133422 94340 -27983
$$ packed form
12083A67144E1858b49229A95566l7866b83209B12511L29864j52513a26583A98203
12072A97784n1509Q5091B8260M5737d7700D4326K25680a5231A6567i029F6007
12060h3055j10783A39515M1995M0724J10571A5437M29147f8727A28009c7545H8952
12048B05365C0432k105G692K59110G4878b25733c86G9022N3228F1349k9490L41647
12036C73506A70412J1919K38619b5351D4684d1864B3830J08533L5028D5477R7936
12025A43413E3498g7978C05151n2242e6167e743B23970i6756A11732k160l0035
12014G9537K31058A18114b16686C42869E8153K5305g9565H6148L5679m7657c49357
12002a10918B17881I9636C9776O0172c1969n7405N338C8665R4757l9082b7983
$$ plain form
11990 -106101 124008 16396 -165603 114232 82205 -116359 469574 202358 -143098 21273
11979 62236 220897 -109486 341120 -331445 282793 360219 115331 -118458 160200 -122053
11968 -26902 145894 -330027 -5620 225432 111041 251788 15298 -4769 239369 -145663 64367
11956 214969 359450 -407265 257653 118875 -314606 -16664 -241030 -265960 78789 136822
11946 136822 -42805 183226 -254613 -144646 129044 42451 -249240 49226 275927 -91913
11935 119676 123882 -46814 -226816 331432 -41465 -96225 -34692 -196348 -109334 -408116 -304386
11924 -304386 -454810 -181114 -143492 -5747 126632 -78335 26409 153585 -131527 -209202 -45793
11912 33511 39190 -226481 201958 37424 63291 4514 56023 124211 112319 7047 18848 -466273
$$ packed form
11990a06101A24008A6396a65603A14232l2027a16359D69574B02358a43098B1273
11979F2236J58661a09486C41120c31445B82793P7426A15331a18458A60200a22053
11968b6902A45894c30027e620B25432A11041J40747A5298d769B39369a45663F4367
11956B14969J44481d07265B57653A18875c14606a6664k24366k4930G8789N8033
11946A36822d2805A83226b54613J09967A29044D2451b49240D9226K26701i1913
11935A19676M206d6814j80002C31432d1465n4760c4692j61656Q7014k98782J03730
11924c04386j50424a81114L7622e747A26632g8335B6409J27176a31527p7675d5793
11912C3511N679b26481B01958C7424K5867D514N1509O8188j1892G047J1801d66273
$$ plain form
11899 160902 -25807 -22051 63248 58121 55693 -26324 9968 179391 52222 61401 -212869 -56536
11886 -70105 32364 293819 -93777 -312618 100957 -111924 -242664 -231928 -92784 -132076 80216
11874 -150435 -220975 40339 235302 -239086 -18761 13138 287656 -31169 -272423 -97280 -159006
11863 -159006 -134004 -57235 82710 100952 -26607 -208445 -236150 -37642 -112054 -153119 -250253
11852 -250253 -245757 -188157 -30209 103057 -2256 -33607 -14144 115909 162606 3087 -76840 -114250
11840 -114250 -57789 -329820 -218148 -398898 -152020 79243 -100945 -330861 -128224 -220593
11830 -220593 123012 -141057 21992 -235897 -319615 -135708 -115972 240204 287610 -272400
11819 268956 138738 12149 -118595 -92186 -105237 -151190 -367182 142112 -7941 196968 -26396
$$ packed form
11899A60902b5807L756F3248n127k428b6324I968J69423E2222R179b12869e6536
11886g0105C2364K61455i3777k18841A00957a11924j30740J0736i2784l9292H0216
11874a50435p0540D0339J94963b39086a8761A3138K74518c1169k41254i7280o1726
11863a59006K5002e7235H2710J8242b6607j81838k7705c7642p4412m1065r7134
11852b50253M496N7600c0209A03057b256l1351a4144A15909M6697C087g6840l7410
11840a14250N6461k72031J11672j80750a52020G9243a00945k29916a28224r2369
11830b20593A23012a41057B1992b35897q3718a35708J9736B40204M7406b72400
11819B68956j30218A2149a18595K6409j3051m5953k15992A42112g941A96968b6396
$$ plain form
11807 -86889 -138075 -360550 -17703 -275310 -183375 -30776 162196 -161584 -95299 -76160 -2389
11795 -204288 107554 265625 -4163 -81306 34704 68331 -279963 -116381 -256367 -249880 341925
11783 -98226 -148139 -20414 216854 -82806 -55405 113021 -307464 -212289 -18810 -21212 117092
11771 -57457 235710 129495 -74354 -143947 -190900 464064 -207187 -212387 73754 -436934 79975
11759 -84744 -111744 46858 -654 415757 -102205 9078 24324 -119664 -139272 50149 -755 47110
11746 114091 -23704 28799 87653 52806 -19163 -44010 -181556 -48505 113551 -2029 -205778
11735 -205778 213967 -42409 -42232 -96693 71833 -157972 101211 58388 73893 -86446 271637
11723 176638 -196588 88845 -2050 54584 30845 396154 107483 -120612 -244525 92412 -122320
$$ packed form
11807h6889n1186k22475a7703k57607R1935c0776A62196a61584O6285J9139b389
11795b04288A07554J58071d163p7143C4704L3627b79963a16381j39986O487C41925
11783i8226m9913b0414B16854h2806K7401A13021c07464R5175a8810k402A17092
11771e7457B35710j06215g4354o9593m6953D64064b07187n200G3754d36934G9975
11759h4744k7000D6858f54D15757a02205I078J5246a19664j9608E0149g55D7110
11746A14091b3704B8799N8854l4847a9163k4847j37546d8505A13551b029k03749
11735b05778B13967d2409J77n4461G1833a57972A01211m2823J5505h6446B71637
11723A76638a96588H8845b050E4584k3739L65309A07483a20612j23913I2412a22320
$$ plain form
11711 -408322 -112696 -54144 36959 13471 -52796 43712 260553 -59755 -179396 112469 -94352
11699 -69574 -242283 -5861 -54702 -139135 195854 121697 -195639 38751 181399 142723 -206338
11687 95501 301728 -54225 242586 70868 -367443 -150081 -226430 24068 212090 -5197 -43489
11676 -43489 99926 -137729 80834 24757 241134 362856 182135 81613 -124005 -18053 55593
11664 143676 224990 7689 -135596 52857 245348 81780 190620 -28975 -115130 -194395 79425
11652 -182982 355621 207925 565652 84223 -119866 18104 63861 -1747 98594 149214 -105666
11640 105701 -242367 -93578 -232966 -65672 -151497 99970 80183 -4986 79672 153188 166805
11629 166805 -214090 50000 -137824 -118639 337824 295886 -182699 151908 103499 188360
$$ packed form
11711d08322a12696e4144C6959A3471e2796D3712K16841e9755j19641A12469i4352
11699f9574j72709e861m8841q4433A95854p4157a95639C8751J42648l8676b06338
11687I5501K06227e4225B42586G0868c67443a50081p6349B4068J88022e197l8292
11676d3489I9926a37729H0834B4757K16377J21722j80721H1613a24005a8053E5593
11664A43676Q1314G689a35596E2857J92491H1780J08840b8975q6155p9265G9425
11652a82982C55621j47696L57727H4223a19866A8104M5757a747I8594N0620a05666
11640A05701b42367i3578j39388f5672q5825I9970j9787d986G9672P3516J3617
11629A66805b14090E0000a37824J9185C37824m1938a82699A51908m8409Q4861
$$ plain form
11619 188360 -105378 -67615 153972 -49803 98841 63781 50240 -15507 -145650 7750 -45854
11607 -54139 31304 -236418 33801 -10349 108462 47935 -127802 -137745 -214066 276189 77205
11595 228365 242806 -60714 -79314 167910 -17861 -136294 50244 9729 -156705 158659 151657
11584 151657 -98610 218291 -179958 -133758 -227279 255663 84684 65572 27326 70275 236750
11573 236750 3986 171455 139976 5976 59661 -131546 91159 152000 191325 193880 326412
11562 326412 198694 139219 143693 -44306 -232530 66762 -9270 -4586 -12371 -3626 -18369 -12626
11550 -12626 316361 -156335 -1596 136523 -152155 28048 -105651 66653 63212 -163347 472096
11538 38045 127548 267737 -108163 -188396 -235005 -125799 -138332 145887 -47437 176341 -46489
$$ packed form
11619A88360a05378L7763A53972d9803I8841l5060j3541a5507j30143G750d5854
11607e4139C1304b36418C3801a0349A08462D7935a27802r943p6321B76189G7205
11595B28365J4441f0714j8600A67910a7861j18433E0244I729a56705A58659p002
11584A51657i8610B18291a79958M6200r3521B55663H4684j9112B7326M2949J66475
11573B36750C986J67469l1479E976N3685a31546I1159O0841L9325K555J32532
11562C26412j27718n9475M474d4306j88224F6762i270d586p785c626j4743N743
11550a2626C16361a56335a596A36523a52155B8048a05651F6653l441a63347D72096
11538C8045Q9503J40189a08163q0233m6609J09206j2533A45887d7437A76341d6489
$$ plain form
11526 27596 70818 48778 307307 413912 -46819 264846 151894 45086 139082 398754 245422
11515 245422 274807 189384 -453710 57150 120573 -146018 299598 356468 -33844 -153945 386053
11503 205543 116915 288420 -91628 64326 197153 71431 101179 130304 89022 305101 -47401
11491 143300 104762 44775 76983 125617 196397 66084 68794 68857 -78514 -121682 266973 -16352
11478 90950 55373 -77156 -93190 -89705 345362 188400 199571 211279 100546 7216 -16954
11466 -46490 28113 -34631 133852 370306 1095 -170444 30008 185154 143998 -112913 -109960
11455 -109960 85586 -89847 72144 -61959 2818 -160414 108282 16495 19964 -13419 140524
11443 -198503 -68701 42320 131439 -193540 -289469 -55576 -9100 160505 -77741 -99924 405192
$$ packed form
11526B7596M3222k2040K58529J06605d6819B64846j12952D5086R3996K59672j53332
11515B45422K9385q5423d53710E7150O3423a46018B99598N6870c3844j20101C86053
11503B05543q8628J71505i1628F4326J32827G1431K9748K9125m1282K16079d7401
11491A43300l8538D4775L2208M8634P0780F6084K710O3g8514m3168B66973a6352
11478I0950l5577g7156j6034L485C45362j56962J1171J1708A00546G216a6954
11466d6490B8113c4631A33852K36454A095a70444C0008J55146m1156a12913K953
11455a09960H5586h9847G2144f1959B818a60414A08282A6495L469a3419A40524
11443a98503f8701D2320Q9119a93540r5929e5576i100A60505g7741k2183D05192
$$ plain form
11431 -28674 -33226 369080 65815 19887 53467 97512 245829 300258 173982 31968 -283567
11419 -167357 -142682 161406 -14389 -59358 -39497 178646 220955 175673 173278 203357 111635
11408 111635 134290 -261280 81600 -41822 137419 9159 4734 57776 28188 -50207 -60003 92518
11395 -117955 295700 -132895 254128 -210447 46467 -67163 -192001 -82 118757 17035 -13191
11383 -378940 -346622 94823 72350 -23376 -46911 -68315 262167 2818 273516 -96903 -513432
11372 -513432 22394 -89740 -35015 -77118 16634 -271197 71453 15028 -4159 86251 12667
11360 -39649 103375 -105422 266454 -31444 44634 191761 32834 108426 46039 -53542 -343566
11349 -343566 -308635 -26783 -26714 -112087 61063 -251941 161461 -49634 268152 13045 24583
$$ packed form
11431b8674m552C69080F5815A9887L3580M4045J48317N4429j26276C1968b83567
11419a67357K4675A61406a4389m4969J9861A78646M2309m5282k395L0079r1722
11408A11635K2655b61280H1600d1822A37419I159m425N3042B8188e0207r796I2518
11395a17955B95700a32895B54128b10447D6467f7163j24838h2A18757A7035a3191
11383c78940L2318I4823k2473b3376k3535k1404B62167B818K70698i6903m16529
11372e13432B2394h9740c5015m2103A6634b71197G1453A5028d159H6251A2667
11360c9649A03375a05422B66454c1444D4634J47127C2834P5592D6039e3542k90024
11349c43566L4931b6783O9q5373F1063b51941A61461d9634B68152A3045J1538
$$ plain form
11338 24583 234575 -48180 -295446 -77588 202258 -7423 25994 84703 -51540 -167102 96152
11326 72611 -168883 -192036 172375 72570 -121792 93465 59495 1495 -166317 -217905 -29890
11314 41711 -3567 342469 149687 -6556 408090 -67685 184302 -128756 -248126 76295 26804
11302 92317 20124 -57702 -198341 11088 -19144 216593 -65506 -38157 -247674 -393143 -101576
11290 -77316 177385 -377579 -239437 -44382 -34377 13305 -21578 -115882 215965 -29192 -67900
11279 -67900 385329 -222635 404573 -133589 -291507 -62993 72091 18260 122150 9793 -26499
11267 -204191 -68603 -34524 -71924 193610 -282673 -127855 -430877 -161000 -54450 171501
11256 160533 -192562 68460 354856 23843 10790 40234 -24883 254888 -239805 -384555
$$ packed form
11338B4583K09992d8180k47266g7588B02258g423B5994N8709e1540j15562I6152
11326G2611a68883k3153A72375G2570a21792I3465l3970A495a66317n1588b9890
11314D1711c567C42469A49687f556D08090f7685A84302a28756j19370G6295B6804
11302I2317B0124e7702j40639A1088a9144B16593f5506K7349k09517j45469a01576
11290g7316A77385c77579J38142d4382J0005A3305b1578r4304B15965b9192l8708
11279f7900C85329b22635D04573a33589j57918f2993G2091A8260J03890I793b6499
11267b04191f8603L4079l7400A93610b82673a27855l03022a61000e4450A71501
11256A60533a92562F8460K86396B3843A0790K9444b4883B54888b39805j44750
$$ plain form
11246 -384555 -84581 -234399 31425 -87999 -90118 359368 367302 -38710 29899 -283992 -76818
11234 54350 -253322 58889 6940 97168 6124 -117071 -144585 -455136 -75809 -277518 168039
11222 -67298 86018 -143387 197011 -141541 -223911 36638 236702 -222073 155144 154783 13753
11210 148794 183703 -267117 -41519 126721 -9633 -70790 162310 -81242 -294611 -101583 -350936
11199 -350936 -113207 308486 153820 -138645 -261046 -173857 -106197 144291 -246294 -53541
11188 -173515 -345322 -194996 -113893 -192306 34076 298315 -2589 -312222 122494 -381659
11177 -46668 -377709 -177172 -114871 -210594 -4396 -10638 97777 245972 84930 160416 -93265
11165 -132426 -69916 -490029 142468 -43942 -71841 -132365 -95116 -29689 -118295 43172 5002
$$ packed form
11246c84555h4581j49818C1425h7999k119C59368P934c8710B9899b83992g6818
11234E4350b53322E8889F940R0228F124a17071k7514l10551g5809k01709A68039
11222f7298H6018a43387A97011a41541q2370C6638K00064b22073A55144l61A3753
11210A48794L4909b67117d1519A26721i633o1157A62310h1242k13369a01583k49353
11199c50936a13207C08486A53820a38645j22401Q7189O7660A44291b46294e3541
11188a73515j71807J50326Q1103p8413C4076K64239b589l09633A22494c81659
11177d6668l31041a77172O2301r5723d396o242I7777J48195H4930P5486i3265
11165a32426O2510m20113A42468d3942k7899o0524L7249b9689q8606D3172E002
$$ plain form
11153 38467 123979 -249968 -73796 -277045 -31031 -450539 71222 -58846 32037 -388456 -56910
11141 -148650 -59949 48450 -66261 431580 -471729 -174168 -175973 98709 74577 40766 -154612
11129 202007 233251 69234 -93685 134664 -55332 -83937 108794 -298457 304510 -215959
11118 237069 -93781 7988 42685 137908 157429 -12513 130880 65259 -74284 343683 -244371
11106 155150 -168944 -192593 3595 95662 -12717 -30689 131101 88656 -125594 -18722 153544
11094 -259187 151757 318543 349944 264916 304254 32780 232106 -78076 147597 125583 236702
11083 236702 310138 84884 235361 356893 493373 -14952 220839 342703 134612 238526
11073 238526 270185 -116735 291629 331576 119116 -194921 240706 309122 244992 323090
$$ packed form
11153C8467Q5512b49968g3796k03249c1031m19508G1222e8846C2037c88456e6910
11141a48650e9949D8450f6261D31580d71729a74168j805I8709k4132l3811a54612
11129B02007L1244F9234i3685A34664e5332k8605A08794b98457C04510b15959
11118B37069i3781G988L4697R5223J9521a2513A30880F5259g4284C43683b44371
11106A55150a68944k3649C595R2067a2717j7972A31101m2445a25594a8722A53544
11094b59187A51757J66786L1401q5028L9338C2780J99326g8076A47597k2014J11119
11083B36702P3436H4884J50477J21532J36480a4952B20839J21864A34612J03914
11073B38526L1659a16735B91629L9947A19116a94921B40706O8416o4130P8098
$$ plain form
11063 323090 137065 82158 384160 241423 287712 284904 338051 360494 535781 339801 242560
11052 242560 682911 430436 663710 267773 466854 544646 623179 438513 545356 1012856
11042 1012856 812210 678393 629570 511057 959847 557058 668137 1067801 382696 645217
11032 645217 741531 616832 245894 937091 979363 675798 840616 887211 812695 652007
11022 652007 518080 790309 620709 538735 668305 503919 722048 283855 542246 640999
11012 640999 425196 333297 778459 543279 493996 444038 518152 382556 494700 478331
11002 478331 380463 638859 329017 487827 337986 194388 337167 910850 561951 404615
10992 404615 451926 772223 745442 1022406 473269 370423 461005 819031 778639 422533
$$ packed form
11063C23090A37065n4907L02002j42737M6289k808N3147K2443J75287j95980r7241
11052B42560M40351k52475K33274B67773J99081P7792P8533j84666J06843M67500
11042A012856k00646j33817m8823j18513M48790m02789J11079L99664C82696K62521
11032F45217R6314j24699B45894O91197M2272l03565J64818M6595p4516j60688
11022F52007j33927K72229j69600q1974J29570j64386K18129B83855K58391R8753
11012F40999k15803r1899M45162k35180m9283m9958P4114j35596J12144j6369
11002D78331r7868K58396l09842J58810j49841j43598J42779N73683l48899j57336
10992D04615M7311L20297k6781K76964D73269j02846R0582L58026m0392l56106
$$ plain form
10982 422533 841557 594604 538047 501999 884910 882687 1115905 733854 912723 1139825
10972 1139825 772122 1018259 1341406 1712895 1737559 1858825 2009311 1944927 2416149 2668763
10962 2668763 2353048 2493937 2660121 2529362 2198102 1870564 1345980 1270432 1129537 1272712
10952 1272712 1102384 1152360 1042145 1204823 1424139 996360 1547823 882909 809236 766906
10942 766906 701882 760244 694276 210415 724928 371620 339235 51377 92095 649814 114297
10930 -183794 227375 165975 149450 -129497 -340378 339571 432551 -80677 60942 386776
10920 386776 22702 -158456 35363 166626 -137999 108391 -139301 -53783 131218 -413 -49447
10909 -49447 -130616 -190206 -184719 -181359 -332107 30622 455800 73095 8450 -305596 -241259 312788
$$ packed form
10982D22533M19024k46953n6557l6048L82911k223K33218l82051J78869K27102
10972A139825l67703K46137L23147L71489K4664J21266J50486o4384M71222K52614
10962B668763l15715J40889J66184j30759l31260l27538n24584p5548j40895J43175
10952A272712j70328M9976j10215J62678K19316m27779N51463o64914p3673m2330
10942G66906o5024N8362o5968B10415N14513l53308l2385E1377M0718N57719A14297
10930a83794B27375o1400j6525a29497k10881C39571R2980h0677F0942L25834
10920C86776B2702a58456C5363J31263a37999A08391a39301e3783A31218d13m9034
10909d9447q1169n9590N487L360j50748C0622M25178G3095H450c05596O4337C12788
$$ plain form
10896 -276659 -133430 -17680 71227 255253 -132229 125865 -224901 363187 -73579 40113
10885 -112843 197260 239356 -378273 9680 154469 156878 46269 -380165 -20750 -139991 -229355
10874 -229355 122595 -339787 -313289 236168 -251359 -124756 -84983 -128235 78865 -258678
10863 -134757 -47593 -232371 132024 53417 -69331 51159 -188691 85396 -142711 277047
10852 -150382 -135718 -222633 -151779 -183605 -235381 -159017 -48291 -16815 -220739 47203 186613
10841 186613 177366 120106 -352967 -144968 17786 214624 105150 -102203 25074 105230 375619
10830 375619 -311884 229554 27003 -144294 15820 -111909 153145 -182718 -57143 70901
10819 -59141 -37540 -81574 -41394 88874 32668 8512 -141515 193629 134845 -211592 -172642
$$ packed form
10896b76659a33430a7680G1227J84026a32229A25865b24901C63187g3579D0113
10885a12843A97260M2096c78273I680J44789K409D6269c80165b0750j19241q9364
10874b29355A22595c39787K6498B36168b51359a24756L9773m3252G8865b58678
10863a34757d7593j84778A32024E3417f9331E1159a88691H5396a42711B77047
10852a50382J4664q6915P0854l1826n1776P6364d8291a6815k03924D7203J39410
10841A86613r247n7260c52967a44968A7786J96838A05150a02203B5074Q0156K70389
10830C75619c11884B29554B7003a44294A5820a11909A53145a82718e7143G0901
10819e9141K1601m4034M0180H8874C2668H512a41515A93629n8784b11592L8950
$$ plain form
10808 -172642 5224 432053 -269014 38114 -145552 -216131 -11569 -90297 -229479 -196945 -50721
10796 94902 -226288 110527 13762 -126236 9919 -119409 18536 37259 16238 97726 9962
10784 -48074 51642 -195793 -51573 -153367 -53525 204573 133941 33210 -248855 153662 -97690
10772 -113804 -55839 204075 -12530 237066 -43075 -259735 -29835 27273 -394215 -45317 -61747
10761 -61747 -165314 -99529 -151038 -316266 58248 -2220 -30923 38228 15031 -87927 -199954
10750 -199954 248769 -249733 12683 -129300 -182939 -260839 -341468 -133956 -25881 -93286 -145488
10739 -145488 240548 -232849 -77330 -84406 49338 -64767 -401039 -142864 -3921 190108 -94338
10727 -195892 -220772 -18905 -41859 -47722 298157 -389939 147497 68907 -126434 -519550 -6607
$$ packed form
10808a72642E224M26829b69014C8114a45552p0579a1569p8728j39182L2534e0721
10796I4902b26288A10527A3762a26236I919a19409A8536J8723A6238Q1488I962
10784d8074E1642a95793e1573j01794e3525B04573p0632C3210b48855A53662i7690
10772a13804e5839B04075a2530B37066d3075k16660b9835B7273c94215d5317j6430
10761f1747j03567O5785n1509j65228E8248b220k8703C8228A5031h7927j12027
10750a99954B48769b49733A2683a29300n3639p7900q0629a33956b5881o7405n2202
10739a45488B40548b32849g7330p076D9338f4767l36272a42864c921A90108i4338
10727a95892k4880a8905k2954n863B98157c89939A47497F8907a26434l93116f607
$$ plain form
10715 -94979 -282575 -258835 -321178 -8069 -106923 39809 211378 -170852 -80221 90820 -147673
10703 -173546 18067 -148638 -114763 -15004 126375 23467 -169886 -102353 129139 -71733 176323
10691 -367458 47971 -54539 197179 50122 -172379 -16273 -182002 -121177 109778 -34601 151569
10679 -72792 -112382 74960 50837 -10127 64023 -177430 -234489 -87608 157567 117925 -61976
10667 -138904 -237883 37888 -283801 -91757 -357366 -439847 5906 -61291 199419 45793 21440
10655 122197 105167 173868 68438 125499 -3959 -215563 144764 159037 -82567 323308 -108261
10643 -12225 -15876 60197 -57801 235466 -252316 -158328 -139999 -288942 106571 -54093 -261576
10632 -261576 55244 -155172 -78342 189617 -19130 -198497 126844 -99490 218424 -303916
$$ packed form
10715i4979j87596K3740o2343h069r8854C9809J71569a70852h0221I0820a47673
10703a73546A8067a48638L3875a5004A26375B3467a69886O7533A29139g1733A76323
10691c67458D7971e4539A97179E0122a72379a6273j65729O0825A09778c4601A51569
10679g2792l9590G4960k4123a0127F4023a77430n7059h7608A57567l9642f1976
10667a38904r8979C7888b83801i1757k65609q2481E906f1291A99419D5793B1440
10655A22197j7030O8701F8438N7061c959k11604A44764J4273h2567C23308a08261
10643a2225l651F0197e7801B35466b52316R3988J8329j48943A06571e4093k07483
10632b61576E5244a55172P6830A89617a9130j79367A26844i9490B18424c03916
$$ plain form
10621 -223111 -214042 -87373 -157910 -22017 84042 55935 -172515 291696 -73887 -43608 -196705
10610 -196705 177402 -287580 65302 102339 -194353 13253 -384724 168961 -338568 -68200
10599 -87687 -133466 -116546 -337044 107944 87623 -104182 -289418 -55903 -261630 -202872 152587
10587 -187701 -198959 -85159 -77668 14675 36015 115427 -72407 -46414 -234567 -471827 -296648
10576 -296648 70859 309268 -89118 -46834 -250927 -174354 306341 173757 -151685 -137097
10566 -137097 -37429 -217962 -305029 -65566 165117 -4840 -37811 -306621 -156397 261711 20756
10554 13500 157521 221996 -19971 -48718 84678 -581076 47996 189086 155421 -33518 142403
10542 -127627 265923 174703 -183085 266160 182008 -101581 232705 30724 246641 -38968
$$ packed form
10621b23111R069h7373p0537b2017H4042k8107a72515B91696g3887L0279j53097
10610a96705A77402b87580F5302L7037a94353A3253c84724A68961c38568f8200
10599h7687m5779J6920k20498A07944k0321a04182j85236e5903k05727N8758A52587
10587a87701j1258h5159P491A4675K1340P9412g2407K5993j88153k37260J75179
10576b96648G0859K38409h9118M2284k04093P6573C06341j32584a51685J4588
10566a37097c7429j80533q7067f5566A65117d840l2971k68810J50224B61711B0756
10554A3500J44021O4475a9971k8747H4678e81076D7996J41090l3665c3518A42403
10542a27627B65923r1220a83085B66160q4152a01581B32705C0724K15917c8968
$$ plain form
10531 86883 -114310 -64384 -158583 90118 12931 205982 -52831 -30731 39168 -180533 104551
10519 128920 88372 -133924 -127349 -106141 -360716 -145241 35254 -191890 220203 -43457 -72414
10508 -72414 -374527 -167362 -228054 179835 101546 -146570 -79806 107182 -144291 -384927
10498 -384927 -157916 -164976 -76354 183903 -323932 -24492 -208810 -43769 1685 -401696 -191951
10486 87384 -264460 -66442 -504 -200695 -62407 88985 952 -194016 -127751 -120263 -16275 127569
10473 276564 11083 -227655 181760 294641 424039 217700 315138 270629 237058 -125576
10462 148992 152187 289570 83080 60807 72814 -277939 242365 6898 20937 16485 106514
10451 106514 63706 -70878 -176379 -150439 393266 -333423 149013 -266220 -146407 47493
$$ packed form
10531H6883a14310M9926r4199I0118A2931J93051e2831K2100C9168a80533A04551
10519A28920m0548a33924O575K1208k54575a45241C5254a91890B20203d3457k8957
10508g2414l02113a67362o0692A79835p8289a46570O6764A07182a44291k40636
10498c84927a57916p060g6354A83903c23932b4492j84318d3769A685d01696a91951
10486H7384b64460f6442e04k00191f2407H8985I52a94016O6265P488a6275A27569
10473B76564A1083b27655A81760J12881J29398k06339R7438m4509l3571a25576
10462A48992L195J37383H3080k2273J2007b77939B42365F898J4039m452R0029
10451A06514m2808g0878j05501K5940C93266c33423A49013b66220J19813D7493
$$ plain form
10440 -299745 49134 -11411 -68198 -25267 -240177 234234 -106403 -351741 -197445 -187037
10430 -187037 -93994 -134536 -224222 -194107 -244869 -232765 -201610 -286662 218994 -17907 4841
10418 -217046 101650 -175782 -291064 -12781 -22174 -309623 351876 35524 -164457 41135
10407 -249766 157945 -308145 -54306 -325210 -241775 72955 -86246 -127332 -66341 -196 304405
10395 320876 -13917 -82716 -12444 -165077 77352 117469 -48276 172235 86026 245518 99148
10383 150394 98832 41928 -53259 -60606 -73728 82821 255549 150341 174393 30786 186030
10372 186030 -189151 276683 278937 281517 -26111 507289 309506 435893 -24734 362802 232456
10361 232456 719289 358486 418314 594768 436886 -104110 161418 546582 -5354 277745
$$ packed form
10440b99745D9134a1411n6787b5267k14910B34234a06403k45338J54296J0408
10430a87037R3043m0542q9686L0115n0762J2104L1155q5052B18994a7907D841
10418b17046A01650a75782j15282a2781r393k87449C51876C5524a64457D1135
10407b49766A57945c08145e4306k70904Q3435G2955h6246m1086O0991a96C04405
10395C20876a3917o8799a2444j52633G7352M0117d8276A72235H6026J59492I9148
10383A50394n1562D1928e3259p347j3122H2821J72728j05208K4052C0786J55244
10372A86030a89151B76683K254K580b6111E07289j97783J26387b4734C62802j30346
10361B32456M86833C58486N9828J76454j57882a04110A61418L85164e354B77745
$$ plain form
10350 141643 -87621 -68826 261443 719022 559084 508757 395088 414870 354205 501281
10340 501281 -137108 44463 295412 282160 219318 311722 512262 243225 103938 61962
10330 61962 207912 454265 14209 25135 37259 92563 -135654 91421 310809 -312630 42395
10318 280313 76706 422798 296544 341379 289456 221447 231853 -86624 25426 -33887 -21573
10307 -21573 -169735 27458 -152531 -115714 110548 172839 -93088 -20077 89946 -77046 -280081
10296 -280081 -142588 -300784 63230 -265738 -413411 -7890 39548 114652 82755 -160762 -179676
10285 -179676 107448 25848 -113063 -163755 -153657 -163289 -46536 -91780 -126175 215969 -107447
10273 -173151 -148358 170783 -64396 -91839 -131677 -49019 438805 79091 453837 40365 -51112
$$ packed form
10350A41643h7621J8795B61443M57579j59938n0327j13669J9782o0665J47076
10340E01281a37108D4463K50949j3252o2842R2404K00540B43225A03938m1976
10330F1962J45950K46353A4209J0926J2124N5304a35654I1421K19388c12630D2395
10318B80313G6706L46092j26254M4835n1923o8009J0406h6624B5426c3887J2314
10307b1573j48162B7458a52531L6817A10548O2291i3088b0077H9946g7046k03035
10296b80081J37493j58196F3230b65738j47673g890C9548P5104l1897a60762j8914
10285a79676A07448B5848a13063n0692J0098r632d6536m5244l4395B15969a07447
10273a73151K4793A70783f4396k7443l9838d9019D38805G9091L74746D0365e1112
$$ plain form
10261 157457 -339183 -164634 -199101 -31116 -45467 151427 -157477 -240666 -511 266872 -307846
10249 -92640 70492 276514 420941 125727 357233 148345 -97790 -24760 90023 18490 -171425
10237 389339 -118184 -290978 148839 -136071 -86628 24607 -287708 125019 -289742 -391028
10227 -391028 -37794 -181060 -208370 -94735 314386 -172114 -327085 181209 243881 -453818
10216 88064 32800 127796 -151655 -5614 -286118 284158 -250325 -299047 -22493 -176622 -176258
10205 -176258 -63390 -2404 12059 14961 71447 -114987 -60075 54796 74691 -84459 -176672 -430374
10193 -430374 -67891 -231321 89157 182717 -25943 -76310 -95341 3062 -14974 43868 -5687 115903
10180 -147697 -309343 239868 -335865 -362017 -272341 121995 107184 150911 -62582 -70960 223083
$$ packed form
10261A57457c39183a64634l4467c1116j4351A51427a57477q3189e11B66872c07846
10249i2640G0492K06022J44427A25727K31506A48345i7790b4760I0023A8490a71425
10237C89339a18184j72794A48839a36071M9443B4607b87708A25019b89742j01286
10227c91028c7794j43266k7310i4735C14386a72114j54971A81209O2672d53818
10216H8064C2800R4996a51655e614k80504B84158b50325m8722b2493j54129L64
10205a76258f3390b404A2059K902N6486a14987N4912E4796J9895h4459r2213k53702
10193d30374f7891j63430H9157R3560b5943n0367j9031C062a4974D3868e687A15903
10180a47697j61646B39868c35865k6152Q9676A21995j4811M3727f2582q378B23083
$$ plain form
10168 32237 -219532 -126663 -86359 -144979 -66614 -19846 -120192 -112813 -399918 92375 -260871
10156 131678 -32674 5390 -97928 200023 225802 -196060 36365 -21805 -95365 -43510 -193196
10145 -193196 -266693 281255 -367191 -301345 198050 -36953 -7795 108568 -277986 -30010 -33335
10134 -33335 61678 -259881 251018 229126 -8425 -213311 -220700 -14165 -366478 318926 22251
10122 -228935 -405543 -28402 -230655 -21550 35941 -26028 -96749 -46863 -147742 -164554 -32605
10110 -14768 -41330 -202545 209570 -170618 -335444 -87139 -101476 -66919 -105780 164878 -122997
10098 132350 213419 150721 -87975 6388 -67493 -30155 -34918 -12667 -238323 -227011 -188898 -8814
10085 -7738 234578 -287371 -42003 151944 -133807 -104365 -108582 -141749 -132428 46574 -259889
$$ packed form
10168C2237b19532R2869M0304n8620f6614a9846j00346P379k87105I2375b60871
10156A31678c2674E390i7928B00023K5779a96060C6365b1805p3560d3510j49686
10145a93196p3497B81255c67191O5846A98050c6953g795A08568b77986c0010l325
10134c3335F1678b59881B51018k1892h425k04886p389a4165l52313C18926B2251
10122b28935j76608b8402k02253b1550C5941b6028p0721d6863j00879j6812c2605
10110a4768k6562j61215B09570a70618j64826h7139j4337L4557l8861A64878a22997
10098A32350Q1069o2698h7975F388f7493c0155m763a2667k25656J1312L8113h814
10085g738B34578b87371d2003A51944a33807K9442m217l3167R321D6574b59889
$$ plain form
10073 -168326 -44801 165223 -88341 -15227 -37644 38392 -158906 221458 56558 105610 -15518
10061 -205571 20790 -42243 -99291 -140793 102557 159289 2110 -132183 -313508 -234089 -361076
10050 -361076 -439431 -125651 -162946 19407 -195882 111056 -292317 62145 -150964 -92772
10040 -92772 171253 156287 -71358 13868 -107190 -291406 73930 111103 11608 277020 -188901
10028 -206623 -44717 276796 -106149 71580 25341 -47242 137346 64890 -56391 12325 -175110
10016 -328295 197215 30262 -179762 11433 130895 -277534 196729 -306744 2976 -111903
10005 17113 -268686 -33473 -77819 -315726 -45349 -32948 74888 45542 -170166 -244516 -272561
9994 -272561 -252036 -201943 -355586 -199901 -129961 -72140 -51605 251195 -127251 14910 -39538
$$ packed form
10073a68326d4801A65223h8341a5227k2417C8392a58906B21458E6558M9052a5518
10061b05571B0790d2243n7048m1502A02557N6732B110a32183j81325P9419j26987
10050c61076p8355a25651l7295A9407a95882A11056b92317F2145a50964N8192
10040i2772A71253j4966g1358A3868a07190j84216G3930L7173A1608K65412a88901
10028b06623d4717B76796a06149G1580B5341d7242A37346F4890e6391A2325a75110
10016c28295A97215C0262a79762A1433J19462b77534A96729c06744B976a11903
10005A7113b68686c3473m4346k37907d5349J2401G4888k9346a70166p4350k8045
9994b72561K0525N0093j53643J55685O9940N7821K0535B51195a27251A4910c9538
$$ plain form
9982 303331 -329563 16910 -313009 249969 -89435 78176 141382 -178945 143351 269819
9972 269819 -235718 -524895 17638 -225035 -174658 -251757 -178907 -321662 -49873 -71716 178098
9960 18267 99377 -194330 208455 -230912 -26792 -24112 -203432 -93177 404098 -121106 -76829
9949 -76829 -40983 27418 -61521 144475 95277 236213 158217 -232750 14126 115385 -10345
9937 248454 -1939 -112798 64341 22995 -48278 65844 -193409 -82046 -47098 141524 -137941
9925 -198177 157763 -177517 381817 157539 121736 110027 -46121 -195739 -194958 -73061 291030
9913 -177232 29783 -37451 35825 195831 36431 -320108 54880 323731 -315221 -74146 175743
9901 -53941 -78106 -131169 19864 115252 22660 180732 -222510 152032 46123 -271840 -75338
$$ packed form
9982C03331c29563A6910c13009B49969h9435G8176O3206a78945A43351J26468
9972B69819b35718k89177A7638b25035N0377p7099P2850j42755d9873k1843A78098
9960A8267Q1110a94330B08455b30912b6792K680j79320i3177D04098a21106M4277
9949g6829L5846B7418f1521A44475m9198J40936p7996b32750A4126J01259a0345
9937B48454a939j10859F4341B2995d8278F5844a93409h2046L4948A41524a37941
9925a98177A57763a77517C81817A57539l5803j1709d6121j49618P81g3061B91030
9913a77232B9783c7451C5825J60006C6431c20108E4880K68851c15221g4146A75743
9901e3941k4165n3063A9864R5388B2660J58072b22510A52032D6123b71840g5338
$$ plain form
9889 202661 -160183 -316452 148674 -140756 -31932 322620 -91590 -28106 178027 111195
9879 111195 -258528 -268929 -71380 -94248 -249707 -483429 89323 -158526 -171166 137093 -96276
9867 -42504 -398950 -332316 -202457 -163158 151314 -89236 -103167 -23831 154660 284357 158192
9856 158192 -200302 -264326 -212198 -181581 -42872 367158 -250303 -208936 307471 37542 99109
9845 99109 -145323 149158 12172 393930 -164474 -43945 -57158 -284273 12731 -26372 66022
9833 -161084 -95938 -161226 -146868 9349 142163 -232241 -149297 343077 71556 -214515 -288999
9822 -288999 -62095 -88537 -84244 90898 -143282 -306545 -127253 89908 -43558 -42483 -133961
9811 -133961 -8739 -118805 -18347 -67889 20350 -258113 -25474 17898 -195766 190338 -78318
$$ packed form
9889B02661a60183j56269A48674a40756c1932C22620i1590b8106A78027o6832
9879A11195b58528j0401g1380k2868j55459k33722H9323a58526j2640A37093i6276
9867d2504l56446O6634J29859L9299A51314h9236j3931b3831A54660J29697j26165
9856A58192b00302o4024N2128L0617d2872C67158b50303M1367C07471C7542O1567
9845I9109a45323A49158A2172L81758a64474d3945j3213k27115A2731b6372F6022
9833a61084O5146o5288J4358I349J32814b32241Q2944C43077G1556b14515p4484
9822b88999f2095k6442M293I0898a43282j63263a27253H9908d3558J075r1478
9811a33961h739j10066a8347m9542B0350b58113b5474A7898a95766A90338g8318
$$ plain form
9799 -59071 -98162 87009 -172992 -32329 42144 -205652 -283903 10780 88540 -52039 -250855
9788 -250855 -201806 176995 -51774 -33506 -262677 156995 -47182 -260499 22037 96291 15625
9776 -71544 187286 -285332 -139412 -34602 -409046 95543 -147556 -63317 304729 -51961 -68742
9765 -68742 -257056 -207567 -146861 -116728 217949 66000 -780 -40507 -34286 -82952 -138856 -81399
9753 -81399 -173088 -46905 -251132 -134990 164 -250593 148465 -193865 -119576 -146328 -180557
9742 -180557 127876 -239637 -86139 -150228 -123120 46664 97405 168636 -24006 -51966 -104032
9731 -104032 -88527 -104012 -112538 -144000 127797 -182302 186933 -247888 17841 -313864 -237779
9720 -237779 19349 -342619 -90320 67096 115518 372 198840 136211 -332741 -33777 -456995
$$ packed form
9799e9071l9091H7009a72992c2329D2144b05652p8251A0780P7760e2039j98816
9788b50855M9049A76995e1774J8268k29171A56995d7182k13317B2037P4254A5625
9776g1544A87286b85332a39412c4602l74444I5543a47556f3317C04729e1961j6781
9765f8742j88314M9489O0706L0133B17949F6000g80l9727O221m8666n5904N7457
9753h1399r1689d6905k04227J16142A64b50593A48465a93865P4289k6752l4229
9742a80557A27876b39637h6139o4089K7108D6664N0741P1231b4006k7960n2066
9731a04032J5505j5485q526l1462A27797a82302A86933b47888A7841c13864P6085
9720b37779A9349c42619i0320F7096M8422C72J98468o2629c32741c3777m23218
$$ plain form
9709 -456995 -88190 128065 -249520 -276921 93978 -7964 -127417 -59036 64137 -125458 -168498
9698 -168498 84703 119503 -188129 -179587 -446175 -55190 -160107 -9947 -52543 -115963 -260455
9687 -260455 218680 -68577 -262909 38638 188717 67577 -191220 80221 -178317 -77487 -117647
9676 -117647 -37610 -23470 53723 -215091 83077 -51549 156302 -153893 -79854 23291 191671
9665 191671 16138 -190238 -76474 23164 141512 13360 -114336 -149484 78463 -34727 -94503
9654 -94503 34302 -318822 27150 -11486 -83870 122538 -4088 -268152 -169249 -52712 -77097
9643 -77097 -145072 74679 -143029 29036 -284046 260053 220140 119137 -502751 111692 133462
9632 133462 92103 -3453 40160 159185 -325845 -116937 -342969 22270 -161640 40427 -319355
$$ packed form
9709d56995h8190A28065b49520k7401I3978g964j19453e9036F4137a25458m3040
9698a68498H4703L4800a88129Q542k66588e5190j04917i947m2596o3420j44492
9687b60455B18680f8577j94332C8638J50079F7577a91220H0221a78317g7487m0160
9676a17647c7610J4140E3723b15091H3077e1549A56302a53893P4039B3291J68380
9665A91671A6138a90238g6474B3164J18348A3360a14336l5148G8463c4727n9776
9654i4503C4302c18822B7150a1486p2384A22538d088k64064R8903e2712k4385
9643g7097o7975G4679a43029B9036b84046B60053l9913j01003e02751A11692K1770
9632A33462m1359c453D0160J19025c25845a16937k26032B2270a61640D0427c19355
$$ plain form
9620 -47843 -3880 -37204 -26901 52444 66136 164808 65837 20167 -380039 346040 -377991
9608 195759 92553 202080 -200095 129971 83217 -296916 514362 -488226 -373830 -162080
9597 -11700 -121474 -41868 141730 87501 56207 198010 152946 -234374 -89247 -135427 -176915
9586 -176915 12727 330 38991 176520 -400055 -131060 -165055 -5980 -61943 -96437 -110346 -264979
9574 -264979 -105281 -27718 36158 -190862 253108 246583 182183 -224098 268906 8163 -129535
9562 2776 -108620 -430761 -147459 130465 -4545 -300435 77404 195163 -363930 -409522 8696
9550 -82545 140287 -93581 -82164 204899 25245 33250 -7173 -146103 -240606 30492 72155 357148
9538 357148 -364396 -165490 -182735 26928 67660 -51406 288085 -207997 -54065 -12691 -36544
$$ packed form
9620d7843c880l3324J0303E2444J3692R8672F5837B0167c80039C46040c77991
9608A95759I2553J09527b00095A29971m6754b96916E14362d88226J14396a62080
9597a1700j09774d1868A41730n4229l1294J41803m5064b34374h9247m6180m1488
9586a76915A2727C30L8661J37529d00055a31060l3995e980n5963l4494j3909j54633
9574b64979a05281b7718C6158a90862B53108o525o4400b24098B68906H163a29535
9562B776a08620l22141a47459A30465d545k95890G7404J17759c63930m5592H696
9550h2545A40287i3581J1417B04899B5245Q005g173j38930r4503C0492M1663K84993
9538C57148c64396a65490j7245B6928M0732e1406B88085b07997e4065a2691k3853
$$ plain form
9527 -36544 -308733 -135206 -153617 15363 189805 -78889 -191405 -79213 153099 -116994 40655
9515 -300728 -4056 175393 -256657 -258690 20196 109087 -206017 129350 -67155 -394917 89170
9503 -16849 -25874 -131207 195119 -89670 -67081 -106059 186489 145257 -173968 115185 20117
9491 -138999 -39888 -197715 -172987 88373 -174625 -213738 -46472 -74842 12141 -120181 -207557
9480 -207557 117585 -97339 -388837 -68062 18166 -191040 100066 -60157 75383 -48432 -45136
9469 -45136 -56093 -288692 61937 262498 105021 -54391 -493545 40970 -122350 23768 -456653
9457 -89107 -74449 -184037 -65496 -29731 182624 11673 -357624 -237380 -135746 -156753 -5627
9445 109687 -39975 149503 95350 -2626 -254781 -367609 -208574 35171 -22326 -38052 19384
$$ packed form
9527c6544k72189a35206j8411A5363J74442g8889j12516g9213A53099a16994D0655
9515c00728d056A75393b56657k033B0196Q8891b06017A29350f7155l27762H9170
9503a6849r025j05333A95119h9670K2589l8978A86489m1232a73968A15185B0117
9491a38999c9888j57827K4728H8373a74625l9113d6472k8370A2141a20181q7376
9480b07557A17585i7339k91498f8062A8166a91040A00066f0157G5383d8432L296
9469d5136j0957k32599F1937K00561A05021e4391m39154D0970a22350B3768d56653
9457h9107J4658j09588f5496b9731A82624A1673c57624J20244J01634k1007e627
9445A09687c9975A49503n4153b626k52155j12828J59035C5171b2326j5726A9384
$$ plain form
9433 104223 -195499 321989 -15345 -367128 -212173 -60034 -33846 71001 -33027 -214646 41022
9421 -193564 -183999 -253701 264227 49028 181816 -93737 -57671 -14184 -131000 -443920 177549
9409 197682 121206 -32624 210506 -32244 101460 112999 285061 55356 -60077 -133371 -178772
9398 -178772 -219811 58266 -51377 114883 -233012 -17874 -129385 53926 -113720 -84474 -178210
9387 -178210 -20232 232234 -8670 -41018 -179200 -98134 170963 55863 -329889 -197041 150689
9375 115174 57909 135905 200378 -649 -462445 -256683 -231951 185352 -31557 -233632 27851
9363 -278921 -91733 -117703 -73351 -80963 -79026 67629 -157944 -185346 -242081 17861 -52577 -208073
9351 -208073 -265328 -6643 -118622 -138518 -46568 69486 -46866 -56757 -174535 29857 267756
$$ packed form
9433A04223a95499C21989a5345l51783J54955f0034K6188G1001c3027j81619D1022
9421a93564R565o9702B64227D9028J32788i3737L6066a4184j16816l12920A77549
9409A97682p6476c2624B10506c2244A01460J1539J72062E5356f0077p3294m5401
9398a78772m1039E8266e1377A14883b33012a7874j11511E3926a13720K9246r3736
9387a78210b0232B32234h670l2348j38182Q1066A70963E5863c29889J32848A50689
9375A15174n7265P7996O4473f49m61796K05762K4732A85352c1557k02075B7851
9363b78921i1733k5970M4352p612J937F7629a57944k7402n6735A7861e2577j55496
9351b08073n7255f643j11979j9896d6568F9486d6866r891j17778B9857K37899
$$ plain form
9340 267756 -262803 -247109 -21016 103201 -176593 -213586 -107066 84051 241742 -369671
9329 -145343 -138166 -152798 -23567 14805 -100286 168388 180087 -384243 -174447 -387095 -268693
9318 -268693 -143922 -257216 -172992 -33938 -192886 373332 -118196 22271 -205513 -171343
9308 -171343 -244235 -87090 268354 -306710 84594 -89907 32991 -361780 91063 -388964 -103077
9296 265844 -53326 143543 -497697 -114179 318043 -247719 14727 -224662 -120892 78882
9285 27141 57694 -189930 -53903 -214877 118928 -88880 -221741 23470 -32810 -15942 -270741
9274 -270741 -236314 117333 -36755 81409 277896 -248745 -106612 37575 -77430 2199 -28797
9262 -24023 -120299 -345881 154657 -327075 88646 292933 63510 -163880 -83390 -16483 35395
$$ packed form
9340B67756b62803J5694b1016A03201a76593l6993J06520H4051J57691c69671
9329a45343P177j4632b3567A4805a00286A68388J1699c84243a74447k12648J18402
9318b68693J24771j13294Q4224c3938j58948C73332a18196B2271b05513L4170
9308a71343p2892h7090B68354c06710H4594h9907C2991c61780I1063c88964a03077
9296B65844e3326A43543d97697a14179C18043b47719A4727b24662J03770G8882
9285B7141L0553a89930e3903j60974A18928h8880j32861B3470c2810a5942k54799
9274b70741L4427A17333c6755H1409J96487b48745a06612C7575g7430B199b8797
9262b4023r6276k25582A54657c27075H8646K04287F3510a63880Q0490a6483C5395
$$ plain form
9250 -320509 54179 12876 50031 -2714 -247920 -95548 -239045 -180303 -35470 -187561 -127075
9239 -127075 -363497 121717 -241693 202875 -21273 -80722 -189938 -155760 -65598 22258 -1028
9227 53680 -288891 -315747 -280768 11912 -316483 -4548 -44837 -130021 188592 69646 47148
9216 47148 -11415 294846 125934 -102081 -214814 -204088 -316809 -418462 -506966 -25063 228729
9204 -19324 12220 76294 -10554 267783 -16645 -221694 303887 30473 158408 -50498 106975
9192 -10865 43600 -37450 -181942 -97805 -186174 -163524 39772 -181966 386479 -206736 -183943
9181 -183943 185479 -313319 140679 -105616 25190 -343072 -305918 4857 -16293 -87738 -28922
9169 88465 -164809 -290911 -4280 134778 -155508 -192082 -6455 -43109 -309104 -67918 -277894
$$ packed form
9250c20509E4179A2876L7155b714k45206i5548j43497N8742c5470j52091O0486
9239a27075k36422A21717b41693B02875b1273n9449j09216L4178f5598B2258a028
9227E3680b88891k6856L4979A1912c16483d548m0289q5184A88592F9646k2498
9216D7148a1415B94846A25934a02081j12733J0726j12721j01653q8504b5063B28729
9204a9324A2220O4074a0554B67783a6645k05049C03887C0473J27935e0498A06975
9192a0865D3600c7450j44492Q4137q8369K2650C9772a81966C86479b06736K2793
9181a83943A85479c13319A40679a05616B5190c43072L7154D857a6293p1445b8922
9169H8465a64809j26102d280A34778a55508l6574f455l6654k65995f7918k09976
$$ plain form
9158 -277894 31007 -62138 85115 -85233 -22821 158268 -211246 213997 163434 59454 10906
9146 182050 -31369 76764 -13046 -28989 -221842 117604 -21608 -4331 22368 50527 -153049
9134 147815 70765 -44323 -332382 292676 -149853 -236199 -41747 -198537 307954 -21284 -437703
9123 -437703 184587 -129775 251432 95235 425182 53829 -231258 -43357 61592 -266924
9112 -42221 230370 177646 24134 -119428 15686 154333 -71469 -46645 -324294 196984 -169564
9100 45040 -320689 -451510 -101992 -96723 -196850 -118144 -5399 96605 -294424 -121995 -131858
9089 -131858 -176713 -303527 -126940 -148819 -8949 -146257 41424 -87182 43613 -387423 -277136
9078 -277136 -82556 55356 -200387 -162627 -63837 -17632 -113743 -171597 47448 -46769 -16379
$$ packed form
9158b77894C1007f2138H5115h5233b2821A58268b11246B13997n0563E9454A0906
9146A82050c1369G6764a3046j5943j92853A17604b1608d331B2368K8159a53049
9134A47815G0765d4323k88059B92676a49853q6346d1747j56790C07954b1284m16419
9123d37703A84587a29775B51432I5235L29947E3829b31258d3357F1592b66924
9112d2221B30370n2724B4134a19428A5686J38647g1469K4824k77649A96984a69564
9100D5040c20689j30821a01992N269j00127P8706e399I6605b94424a21995r863
9089a31858m4855j26814a26940k1879h949j37308D1424h7182D3613c87423J10287
9078b77136h2556E5356b00387L7760f3837a7632r6111n7854D7448d6769a6379
$$ plain form
9066 -128472 -46573 36249 54482 -280570 89907 -27637 -529445 -105855 128092 -171670 -63987
9054 -90750 -241350 -110368 -200472 -105715 -26804 -399860 -154554 51168 -77260 -166751 -110771
9043 -110771 -99515 -68789 407966 34438 331988 -74205 -80610 278659 -199380 58196 76038
9032 76038 84232 394299 157917 20741 -328941 67914 -199795 -16557 -387234 22332 -101713
9020 -151903 51648 -92385 51752 -193782 31011 120976 -11051 82929 -258518 -123822 55320
9008 -5079 -127017 85202 -25736 50690 453877 7991 46191 -185436 -220518 -11546 -263397
8997 -263397 -73249 -58964 -7401 -129604 209248 -70961 -227586 -45176 -39407 -7077 -140751
8986 -140751 -117789 57697 -345983 -111204 -383440 -335952 20149 -437882 103842 204723
$$ packed form
9066a28472d6573C6249J8233b80570H9907b7637n01808a05855A28092a71670f3987
9054i0750j50600a10368r0104R4757b6804l73056a54554E1168g7260q9491N5980
9043a10771J1256L0726D07966C4438K97550g4205o405B78659a99380E8196J7842
9032G6038Q194L10067A57917B0741c28941F7914a99795a6557l70677B2332a01713
9020a51903E1648i2385E1752a93782C1011Q9965a1051H2929b58518a23822E5320
9008e079j21938H5202b5736E0690M03187G991L8200a85436l5082a1546k51851
8997b63397g3249J4285g401j22203B09248g0961j56625d5176N769g077j33674
8986a40751K2962E7697c45983a11204k72236M7488B0149d37882A03842J00881
$$ plain form
8976 204723 -148820 -274765 140831 -174688 107857 -147590 104798 -111404 -11141 -278479
8966 -278479 -110911 -45306 14039 335371 -121820 103555 -143303 -19756 -119295 -114587 -85907
8955 -85907 -258941 -88836 -154386 106729 252038 98459 -199571 276302 -143512 -60502 1680
8943 145727 -333067 145854 -35114 97959 -129086 -116123 -211718 444430 -300822 -452301
8933 -452301 226240 -171828 415674 76350 192475 101253 -130350 -118542 -119421 181570 23164
8921 -424445 187900 -70198 198868 25701 909616 843416 273376 -193151 103861 -245925
8910 227932 -82403 -2896 -145794 232752 -147968 -8271 81933 -368527 -133368 -56694 80107
8898 60002 -44481 144290 -45394 82758 168259 -48623 -215589 -6334 42252 -495 -14976 -239288
$$ packed form
8976B04723a48820j25945A40831a74688A07857a47590A04798a11404a1141k67338
8966b78479a10911d5306A4039L21332a21820A03555a43303a9756r9539M708K8680
8955h5907j73034h8836o5550A06729J45309I8459a99571B76302a43512f0502A680
8943A45727c33067A45854c5114I7959a29086J2963r5595D44430c00822j51479
8933d52301B26240a71828D15674G6350J16125r1222a30350J1808q79A81570B3164
8921d24445A87900g0198A98868B5701Q83915o6200B73376a93151A03861b45925
8910B27932h2403b896j42898B32752a47968h271H1933c68527a33368e6694H0107
8898F0002d4481A44290d5394H2758Q5501d8623j66966f334D2252d95j4481k24312
$$ plain form
8886 -239288 -349728 28773 -105980 -89499 128701 -5547 -119561 -248516 -163886 87955 127043
8875 127043 -67497 -112077 126726 -422988 265203 -77653 29526 202096 -226131 80170 -227104
8863 101486 -217817 37908 -277176 -110342 -22556 -298945 -58598 -38913 -45602 -53900 -200923
8852 -200923 1743 -237794 242605 42698 165134 38598 88188 11054 -99653 45385 -261088
$$ packed form
8886b39288j10440B8773a05980J6481A28701e547j14014j28955Q4630H7955L9088
8875A27043f7497m4580A26726d22988B65203g7653B9526J72570b26131H0170b27104
8863A01486b17817C7908b77176a10342b2556k76389e8598J9685o689q298j47023
8852b00923A743b37794B42605D2698J22436C8598M9590A1054i9653D5385b61088
$$ [...]
##END NTUPLES=NMR SPECTRUM
##END=
