##TITLE=NES1013_LH_9233048_mQcQn3gpvg
##JCAMPDX= 6.0         $$ Bruker NMR JCAMP-DX V2.0
##DATA TYPE= NMR SPECTRUM
##DATA CLASS= NTUPLES
##ORIGIN= BRUKER
##OWNER= Administrator
$$ 1.72 TOPSPIN		Version 2.1
$$ 2015-06-17 22:28:00.050 -0700  Administrator@X
$$ Compression mode = diff/dup
##.OBSERVE FREQUENCY= 400.02188249412
##.OBSERVE NUCLEUS= ^1H
##.ACQUISITION MODE= SIMULTANEOUS (DQD)
##.ACQUISITION SCHEME= undefined
##.AVERAGES= 64
##.DIGITISER RES= 22
##SPECTROMETER/DATA SYSTEM= spect
##.PULSE SEQUENCE= noesygpps1d.comp
##.SOLVENT NAME= COFFEE_meoh
##.SHIFT REFERENCE= INTERNAL, COFFEE_meoh, 1, 14.96397
##AUDIT TRAIL= $$ (NUMBER, WHEN, WHO, WHERE, PROCESS, VERSION, WHAT)
$$ ##TITLE= Audit trail, TOPSPIN		Version 2.1
$$ ##JCAMPDX= 5.01
$$ ##ORIGIN= Bruker BioSpin GmbH
$$ ##OWNER= Administrator
$$ $$ E:\/data/COFFEE/nmr/NES1013_LH_9233048_mQcQn3gpvg/12/pdata/1/auditp.txt
$$ ##AUDIT TRAIL=  $$ (NUMBER, WHEN, WHO, WHERE, PROCESS, VERSION, WHAT)
(   1,<2015-06-17 22:27:54.581 -0700>,<Administrator>,<X>,<go>,<TOPSPIN 2.1>,
      <created by zg
	started at 2015-06-17 22:16:24.816 -0700,
	POWCHK enabled, PULCHK disabled,
       configuration hash MD5:
       21 0F 79 D6 B3 7B B4 F6 88 20 88 DB 03 48 BD 9F
       data hash MD5: 64K
       BC 4D 3A F0 5C 3D 18 6B 3E D4 63 5A 4A CF 18 22>)
(   2,<2015-06-17 22:27:57.987 -0700>,<Administrator>,<X>,<proc1d>,<TOPSPIN 2.1>,
      <Start of raw data processing
       efp LB = 0.3 FT_mod = 6 PKNL = 1 PHC0 = 0 PHC1 = 0 SI = 128K 
       data hash MD5: 128K
       B3 1F 89 F6 F1 A9 C5 72 10 67 AC E7 4E 4A E6 46>)
(   3,<2015-06-17 22:27:58.847 -0700>,<Administrator>,<X>,<proc1d>,<TOPSPIN 2.1>,
      <pk PHC0 = -84.12781 PHC1 = 0 
       data hash MD5: 128K
       F1 CB 42 75 FB 3B B0 E8 EA 72 AA 87 87 D4 0B 86>)
(   4,<2015-06-17 22:27:59.253 -0700>,<Administrator>,<X>,<proc1d>,<TOPSPIN 2.1>,
      <abs ABSG = 1 
       data hash MD5: 128K
       C6 7A 51 D8 2B C2 83 F6 4B DC 28 14 9D BA 49 AF>)
(   5,<2015-06-17 22:27:59.347 -0700>,<Administrator>,<X>,<proc1d>,<TOPSPIN 2.1>,
      <abs ABSG = 2 
       data hash MD5: 128K
       50 65 73 D8 76 09 49 B4 FA 35 5D 57 3E 3D A9 AC>)
(   6,<2015-06-17 22:27:59.425 -0700>,<Administrator>,<X>,<proc1d>,<TOPSPIN 2.1>,
      <abs ABSG = 3 
       data hash MD5: 128K
       67 B9 28 4C 6C E8 C4 F2 AE 70 22 13 3E 13 B8 64>)
(   7,<2015-06-17 22:27:59.519 -0700>,<Administrator>,<X>,<proc1d>,<TOPSPIN 2.1>,
      <abs ABSG = 4 
       data hash MD5: 128K
       41 28 0A 6E B8 44 EC 8B F0 78 8C BA ED 06 46 9B>)
(   8,<2015-06-17 22:27:59.644 -0700>,<Administrator>,<X>,<proc1d>,<TOPSPIN 2.1>,
      <abs ABSG = 5 
       data hash MD5: 128K
       82 4F 39 ED B0 0F 94 E0 6B 41 35 6A 20 97 A4 79>)
$$ ##END=
$$ 
$$ $$ hash MD5
$$ $$ 57 D6 F8 99 BF 8E 93 C3 5A CD 33 1D 05 E7 3A 44
##$RELAX= 
##$RELAX= 
##$RELAX= 
##$RELAX= 
##$RELAX= 
##$RELAX= 
##$RELAX= 
##$RELAX= 
$$ Bruker specific parameters
$$ --------------------------
##$DU= <E:\>
##$EXPNO= 12
$$ [...]
##$TP07= 0
##$TPNAME0= <>
##$TPNAME1= <>
##$TPNAME2= <>
##$TPNAME3= <>
##$TPNAME4= <>
##$TPNAME5= <>
##$TPNAME6= <>
##$TPNAME7= <>
##$TPOAL= (0..7)
0.5 0.5 0.5 0.5 0.5 0.5 0.5 0.5
##$TPOFFS= (0..7)
0 0 0 0 0 0 0 0
##$TUNHIN= 0
##$TUNHOUT= 0
##$TUNXOUT= 0
##$USERA1= <user>
##$USERA2= <user>
##$USERA3= <user>
##$USERA4= <user>
##$USERA5= <user>
##$V9= 5
##$VALIST= <valist>
##$VCLIST= <CCCCCCCCCCCCCCC>
##$VD= 0
##$VDLIST= <DDDDDDDDDDDDDDD>
##$VPLIST= <PPPPPPPPPPPPPPP>
##$VTLIST= <TTTTTTTTTTTTTTT>
##$WBST= 2048
##$WBSW= 25
##$XGAIN= (0..3)
0 0 0 0
##$XL= 0
##$YL= 0
##$YMAX_a= 8037907
##$YMIN_a= -17423061
##$ZGOPTNS= <>
##$ZL1= 120
##$ZL2= 120
##$ZL3= 120
##$ZL4= 120
##$ABSF1= 14.96397
##$ABSF2= -5.594212
##$ABSG= 5
##$ABSL= 3
##$ALPHA= 0
##$AQORDER= 0
##$ASSFAC= 0
##$ASSFACI= 0
##$ASSFACX= 0
##$ASSWID= 0
##$AUNMP= <proc_prof1d_extract.lims>
##$AXLEFT= 0
##$AXNAME= <>
##$AXNUC= <1H>
##$AXRIGHT= 0
##$AXTYPE= 0
##$AXUNIT= <>
##$AZFE= 0.1
##$AZFW= 0.1
##$BCFW= 0
##$BC_mod= 0
##$BYTORDP= 0
##$COROFFS= 0
##$CY= 15
##$DATMOD= 1
##$DC= 0
##$DFILT= <>
##$DTYPP= 0
##$F1P= 0
##$F2P= 0
##$FCOR= 0.5
##$FTSIZE= 131072
##$FT_mod= 6
##$GAMMA= 0
##$GB= 0
##$INTBC= 1
##$INTSCL= 1
##$ISEN= 128
##$LB= 0.3
##$LEV0= 0
##$LPBIN= 0
##$MAXI= 10000
##$MC2= 0
##$MEAN= 0
##$ME_mod= 0
##$MI= 0
##$NCOEF= 0
##$NC_proc= -2
##$NLEV= 6
##$NOISF1= 0
##$NOISF2= 0
##$NSP= 0
##$NTH_PI= 0
##$NZP= 0
##$OFFSET= 14.96397
##$PC= 1
##$PHC0= -84.12781
##$PHC1= 0
##$PH_mod= 1
##$PKNL= yes
##$PPARMOD= 0
##$PPDIAG= 0
##$PPIPTYP= 0
##$PPMPNUM= 2147483647
##$PPRESOL= 1
##$PSCAL= 4
##$PSIGN= 0
##$PYNMP= <proc.py>
##$REVERSE= no
##$SF= 400.020008448562
##$SI= 131072
##$SIGF1= 0
##$SIGF2= 0
##$SINO= 400
##$SIOLD= 131072
##$SPECTYP= <>
##$SREGLST= <1H.CDCl3>
##$SSB= 0
##$STSI= 131072
##$STSR= 0
##$SW_p= 8223.68421052631
##$SYMM= 0
##$S_DEV= 0
##$TDeff= 65536
##$TDoff= 0
##$TI= <>
##$TILT= no
##$TM1= 0
##$TM2= 0
##$TOPLEV= 0
##$USERP1= <user>
##$USERP2= <user>
##$USERP3= <user>
##$USERP4= <user>
##$USERP5= <user>
##$WDW= 1
##$XDIM= 131072
##$YMAX_p= 442016457
##$YMIN_p= -12275
##$CURPLOT= <Network HP LaserJet P1505>
##$CURPRIN= <$Network HP LaserJet P1505>
##$DFORMAT= <normdp>
##$LAYOUT= <+/1D_H.xwp>
##$LFORMAT= <normlp>
##$PFORMAT= <normpl>
##$SURQMSG= 1
$$ End of Bruker specific parameters
$$ ---------------------------------
##NTUPLES= NMR SPECTRUM
##VAR_NAME=  FREQUENCY,     SPECTRUM/REAL,   SPECTRUM/IMAG
##SYMBOL=    X,             R,               I
##VAR_TYPE=  INDEPENDENT,   DEPENDENT,       DEPENDENT
##VAR_FORM=  AFFN,          ASDF,            ASDF
##VAR_DIM=   131072,        131072,          131072
##UNITS=     HZ,            ARBITRARY UNITS, ARBITRARY UNITS
##FACTOR=    0.0627417313425164, 1,          1
##FIRST=     8223.62146879497, 1061,         -56306
##LAST=      0,             3241,            -56573
##MIN=       0,             -12275,          0
##MAX=       8223.62146879497, 442016457,    0
$$ Real data points
##PAGE= N=1
##DATA TABLE= (X++(R..R)), XYDATA
$$ [...]
60924B473039j55205j38209j21860j06381r2273p9834o9365o1349n6093n3345
60914A539125n2403n2346n2083n0619m7832m4646m2049m0042l7922l5301l2468
60903A051414k9880k7836k6425k5308k3709k1215j8497j6587j5512j4394j2850
60892H19201j1452j0582r762q606p585p161o824n829m473l714l693l512k481q54
60878G32673Q38K476M089N393O097O439P007Q103R446J0487J0843J0505R800R158
60864H33354Q782Q526Q106P488O943O657O494O326O420P112Q006Q080O952N691
60850I34937N664O759P345O141L575J055o78k037l710n689p251p784p494p101
60836I23732o893o386n187l840l275l634m224m484m326l591j984K24K188L457
$$ y = [2473039, 2317834, 2179625, 2057765, 1951384, 1859111, 1779277, 1709912, 1648563, 1592470, 1539125, 1486722, 1434376, 1382293, 1331674, 1283842, 1239196, 1197147, 1157105, 1119183, 1083882, 1051414, 1021534, 993698, 967273, 941965, 918256, 897041, 878544, 861957, 846445, 832051, 819201, 807749, 797167, 787405, 778799, 771214, 764053, 757229, 751400, 746927, 743213, 739520, 736008, 733527, 732673, 733511, 735987, 740076, 745469, 751566, 758005, 765012, 773115, 782561, 793048, 803891, 814396, 824196, 833354, 842136, 850662, 858768, 866256, 873199, 879856, 886350, 892676, 899096, 906208, 914214, 922294, 929246, 934937, 940601, 947360, 954705, 960846, 964421, 965476, 964798, 962761, 959051, 953362, 946111, 938327, 930833, 923732, 916839, 910453, 905266, 901426, 898151, 894517, 890293, 885809, 881483, 877892, 875908, 876132, 878320, 881777]
60822H81777M256M552L730J711l81j468j851k540l631m303m184l869m008m608
60808H65183n232n428m860l570k163j275q31j71J020K386L515M482N553O719P737
60793H73065Q418Q747Q816Q758Q656Q503Q262P901P369O692O143O080O486O882
60779I80778O945O889P003P059O611N656M592L621K528J078o19k216l419m260
60765A022246n146o523q311r954j1053j1735j2192j2310j2030j1701j1590j1397
60753H98304j0700r667q813q315q098q290q980r614r424q404p294o471n561m228
60739G84445k680j151M83K168L290L364K798K505K924L735M438M724M391L256
60725H18690J432n47k109l222m427o131p965r090r198r022r573j1047j2635j3358
$$ y = [881777, 886033, 890585, 894315, 896026, 895645, 894177, 892326, 889786, 886155, 881852, 877668, 873799, 869791, 865183, 859951, 854523, 849663, 846093, 843930, 842655, 841824, 841653, 842673, 845059, 848574, 853056, 858609, 865328, 873065, 881483, 890230, 899046, 907804, 916460, 924963, 933225, 941126, 948495, 955187, 961330, 967410, 973896, 980778, 987723, 994612, 1001615, 1008674, 1015285, 1020941, 1025533, 1029154, 1031682, 1032760, 1032141, 1029925, 1026506, 1022246, 1017100, 1010577, 1002266, 992312, 981259, 969524, 957332, 945022, 932992, 921291, 909701, 898304, 887604, 877937, 869124, 860809, 852711, 844421, 835441, 825827, 816403, 807999, 800705, 794234, 788673, 784445, 781765, 780614, 781097, 783265, 786555, 789919, 792717, 795222, 798146, 801881, 806319, 811043, 815434, 818690, 820122, 819575, 817466, 814244, 809817, 803686, 795721, 786631, 777433, 768411, 758838, 747791, 735156, 721798]
60711G21798j2888j1662j0408r570r012q287p206n983m851l858l154l028l340
60698F28551l305k412j288r89j602k125j798q40K42J417K816M209N227N864O344
60683F40311O762P212Q100R766J1863J3546J4442J5052J5962J6978J7417J7124
60671G94535J6660J6460J6272J5733J5026J4484J3884J2792J1498J0783J0670
60660I48797J0113Q445O387N152M879M698L999K962J875N82j245l638o345r037
60646I77624j1416j3295j4642j5499j5941j6121j6172j5997j5414j4550j3793
60635H14784j3162j2237j0926r765r066q298o918n385m498m070l146j512l0P19
60621G26490J292K431L919M937N284N625O579P923Q916R190R173R519J0290J0954
$$ y = [721798, 708910, 697248, 686840, 677270, 668258, 659971, 652765, 646782, 641931, 638073, 634919, 631891, 628551, 625246, 622834, 621546, 620557, 618955, 616830, 615032, 614192, 614434, 615851, 618667, 622876, 628103, 633967, 640311, 647073, 654285, 662385, 672151, 684014, 697560, 712002, 727054, 743016, 759994, 777411, 794535, 811195, 827655, 843927, 859660, 874686, 889170, 903054, 915846, 927344, 938127, 948797, 958910, 967355, 973742, 978894, 983773, 988471, 992470, 995432, 997307, 997889, 996644, 993006, 986661, 977624, 966208, 952913, 938271, 922772, 906831, 890710, 874538, 858541, 843127, 828577, 814784, 801622, 789385, 778459, 768694, 759628, 751330, 744412, 739027, 734529, 730459, 727313, 725801, 725771, 726490, 727782, 730213, 734132, 739069, 744353, 749978, 756557, 764480, 773396, 782586, 791759, 801278, 811568, 822522]
60607H22522J1165J1191J1424J1764J1785J1229J0152Q866P906P605P425O144
60595I39178L195o00m043o892r618j2373j4923j7219j9112j9867j8943j7159j6057
60582G85567j5988j5845j4796j3309j2072j0913r489q250p920q383q695q111o677
60569F45119n047l944l639l697l416k582j578p61j30K69J88l23o86m21K91R02
60553F20545J113J039J001J288J902K488K848L422M848O947Q783R867J0729J1994
60539F88814J3606J5375J7673K0940K4832K8577L1999L5635L9859M4422M8865
60528A010597N2960N6445N8562N8164N4373M7147L7139K5035J1265l381j7125
60517A391181k7818l4321l7011l6852l4470l0345k5381k0740j7105j4422j2313
$$ y = [822522, 833687, 844878, 856302, 868066, 879851, 891080, 901232, 910098, 918004, 925609, 933034, 939178, 942373, 941773, 937730, 930838, 921220, 908847, 893924, 876705, 857593, 837726, 818783, 801624, 785567, 769579, 753734, 738938, 725629, 713557, 702644, 693155, 684905, 676985, 668602, 659907, 651796, 645119, 640072, 636128, 632489, 628792, 625376, 622794, 621216, 620455, 620325, 620594, 620782, 620459, 619773, 619352, 619643, 620545, 621658, 622697, 623698, 624986, 626888, 629376, 632224, 635646, 640494, 647441, 656224, 666091, 676820, 688814, 702420, 717795, 735468, 756408, 781240, 809817, 841816, 877451, 917310, 961732, 1010597, 1063557, 1120002, 1178564, 1236728, 1291101, 1338248, 1375387, 1400422, 1411687, 1408306, 1391181, 1363363, 1329042, 1292031, 1255179, 1220709, 1190364, 1164983, 1144243, 1127138, 1112716, 1100403]
60506A100403j0594r369q721q270p185m815j308K606O338R795J3138J6630K0672
60493A119320K5532L0998L6654M2493M8800N5390O1436O6126O9055O9966O8845
60482A694615O6594O4983O5509O8793P5431Q6747J03952J26919J54514J86053
60472B694110K21764K61691L04653L48068L87832M17733M29640M15619L71042
60463E852152K96297J96196P8486m6797j67692k72177l51472m02250m25988m26860
60453D329895m10341l82592l49313l14376k79692k46319k15171j86871j61655
60444A783565j39689j20964j04841r0313p6969o5282n5770m8300m2291l7184l2572
60433I69390k8324k4699k1908j9619j7305j5083j3492j2495j1405r928q482p336
$$ y = [1100403, 1089809, 1080440, 1071719, 1063449, 1056264, 1051449, 1050141, 1052747, 1059085, 1068880, 1082018, 1098648, 1119320, 1144852, 1175850, 1212504, 1254997, 1303797, 1359187, 1420623, 1486749, 1555804, 1625770, 1694615, 1761209, 1826192, 1891701, 1960494, 2035925, 2122672, 2226624, 2353543, 2508057, 2694110, 2915874, 3177565, 3482218, 3830286, 4218118, 4635851, 5065491, 5481110, 5852152, 6148449, 6344645, 6423131, 6376334, 6208642, 5936465, 5584993, 5182743, 4756755, 4329895, 3919554, 3536962, 3187649, 2873273, 2593581, 2347262, 2132091, 1945220, 1783565, 1643876, 1522912, 1418071, 1327758, 1250789, 1185507, 1129737, 1081437, 1039146, 1001962, 969390, 941066, 916367, 894459, 874840, 857535, 842452, 828960, 816465, 805060, 795132, 786650, 779314]
60421G79314o224n151m639m715m540l625k731k806l671m512n136n863o587o769
60407G12345o286n544m788l948l075k407j920j232p5J380K638L215L088K906L480
60392F99777M804N923O050N464M997M911M764M112L013J868J063O29K08m64j042
60377G46077r84m36j47l69n60m21m37r54j500j585j532j721j671p19P50J715J880
60360G37386J930K491L527M666N552N923N840N704N723N657N437N539O179O647
60346H08201O190N193M598M471M094L350K931L063L025K288J413J386K511M228
60332H56942N699O339O161N735N588N610N324M597L736K926K076J173M09j31m87
60317I11697o09m45j94q7L8M66J000J095O21N3j03K27P76J066N67p55k122k633
$$ y = [779314, 773090, 767939, 763300, 758585, 754045, 750420, 747689, 744883, 741212, 736700, 731564, 725701, 719114, 712345, 706059, 700515, 695727, 691779, 688704, 686297, 684377, 683145, 683070, 684450, 687088, 690303, 693391, 696297, 699777, 704581, 710504, 716554, 722018, 727015, 731926, 736690, 740802, 743815, 745683, 746746, 747375, 747583, 747119, 746077, 745093, 744657, 744510, 744141, 743581, 743160, 742723, 741769, 740269, 738684, 737152, 735431, 733760, 733041, 733791, 735506, 737386, 739316, 741807, 745334, 750000, 755552, 761475, 767315, 773019, 778742, 784399, 789836, 795375, 801554, 808201, 814391, 819584, 824182, 828653, 832747, 836097, 839028, 842091, 845116, 847404, 848817, 850203, 852714, 856942, 862641, 868980, 875141, 880876, 886464, 892074, 897398, 901995, 905731, 908657, 910733, 911906, 912315, 912184, 911697, 911088, 910643, 910449, 910362, 910400, 910866, 911866, 912961, 913582, 913635, 913532, 913759, 914535, 915601, 916168, 915413, 913291, 910658]
60299I10658k328k162k863m200n409n931n751n337n268n588n601m667l103j803
60285H50647j081l77P85K168L277M013M648N445O453P508Q348Q919R500J0331
60271I20584J1270J2104J2996J4281J5880J7399J8698K0012K1578K3472K5741
60260A114015K8240L0547L2424L4234L6447L8871M1019M3069M5774M9312N3015
60249A546967N6410O0013O4735P0947P8428Q6892R6144J05882J15538J24346J31602
60238B537904J36925J40255J41468J40172J36062J29259J20040J08527R4905P9675
60228C765192O3331M6074K8299J0979m969j9414l2478m3624n1958n7161n9371
60217C644900n8400n4024m6958l8525k9170j8193n206R051K3637L8461N3931P0123
$$ y = [910658, 908330, 906168, 903305, 899105, 893696, 887765, 882014, 876677, 871409, 865821, 860220, 855553, 852450, 850647, 849566, 849189, 849974, 852142, 855419, 859432, 864080, 869525, 875978, 883486, 891834, 900753, 910253, 920584, 931854, 943958, 956954, 971235, 987115, 1004514, 1023212, 1043224, 1064802, 1088274, 1114015, 1142255, 1172802, 1205226, 1239460, 1275907, 1314778, 1355797, 1398866, 1444640, 1493952, 1546967, 1603377, 1663390, 1728125, 1799072, 1877500, 1964392, 2060536, 2166418, 2281956, 2406302, 2537904, 2674829, 2815084, 2956552, 3096724, 3232786, 3362045, 3482085, 3590612, 3685517, 3765192, 3828523, 3874597, 3902896, 3913875, 3908906, 3889492, 3857014, 3813390, 3761432, 3704271, 3644900, 3586500, 3532476, 3485518, 3446993, 3417823, 3399630, 3394424, 3403475, 3427112, 3465573, 3519504, 3589627]
60205C589627Q6612J02755J17800J31166J42655J51979J58137J59880J56826J49445
60195D946882J37984J22283J02810Q0890N7479L2629O614j9299m3828o6566q7214
60184E270664j04682j17888j26851j32095j33336j29737j21314j09177r4408p7484
60174D123692n8901l9531k0064m98J9486L9865O0076P9154R5965J09427J18735
60163D527406J23327J22777J16843J05700R0109P1392N1110L0536J0392q838k6453
60152E214301m1605n3668o2162o6458o6055o1152n2414m0161k4469o109J3503
60141D753551L3759N5575P9978J06523J33838J61348J89720K19630K50809K82341
60131F267072L13444L43775L73186M01203M26536M47284M61881M69715M70589
$$ y = [3589627, 3676239, 3778994, 3896794, 4027960, 4170615, 4322594, 4480731, 4640611, 4797437, 4946882, 5084866, 5207149, 5309959, 5390849, 5448328, 5480957, 5487571, 5468272, 5424444, 5357878, 5270664, 5165982, 5048094, 4921243, 4789148, 4655812, 4526075, 4404761, 4295584, 4201176, 4123692, 4064791, 4025260, 4005196, 4004698, 4024184, 4064049, 4124125, 4203279, 4299244, 4408671, 4527406, 4650733, 4773510, 4890353, 4996053, 5086162, 5157554, 5208664, 5239200, 5249592, 5240754, 5214301, 5172696, 5119028, 5056866, 4990408, 4924353, 4863201, 4810787, 4770626, 4746157, 4740048, 4753551, 4787310, 4842885, 4922863, 5029386, 5163224, 5324572, 5514292, 5733922, 5984731, 6267072, 6580516, 6924291, 7297477, 7698680, 8125216, 8572500, 9034381, 9504096, 9974685]
60122I974685M63914M48895M25311L93606L54247L07497K53915J94709J31427
60113A2948206O5530j707o9101j35380j98845k57257l08339l50482l82799m04548
60103A0905278m14996m14043m02837l83498l58222l28622k95669k60010k22253
60094G825128j83005j42764j01862o0683j9911J9402N5986Q8517J15762J36637
60084G733207J50161J55408J51720J39225J19124R3233O3292L0778k683l5273
60074H598192o5675r3709j19916j44500j66895j86285k02133k14066k21682k24723
60064F958608k23220k17169k06481j91716j74483j56421j37843j18120r7195p5808
60054E360152n4107l1203o733J7964M1127O2536Q3349J04207J24271J41887J55517
$$ y = [9974685, 10438599, 10887494, 11312805, 11706411, 12060658, 12368155, 12622070, 12816779, 12948206, 13013736, 13012029, 12942928, 12807548, 12608703, 12351446, 12043107, 11692625, 11309826, 10905278, 10490282, 10076239, 9673402, 9289904, 8931682, 8603060, 8307391, 8047381, 7825128, 7642123, 7499359, 7397497, 7336814, 7316903, 7336305, 7392291, 7480808, 7596570, 7733207, 7883368, 8038776, 8190496, 8329721, 8448845, 8542078, 8605370, 8636148, 8633465, 8598192, 8532517, 8438808, 8318892, 8174392, 8007497, 7821212, 7619079, 7405013, 7183331, 6958608, 6735388, 6518219, 6311738, 6120022, 5945539, 5789118, 5651275, 5533155, 5435960, 5360152, 5306045, 5274842, 5268109, 5286073, 5327200, 5389736, 5473085, 5577292, 5701563, 5843450, 5998967]
60043E998967J64062J67062J64659J57064J43974J24980J00403P1433L9565O246
60033G138415k7163n9570r0270j18645j43941j65578j83161j95845k02284k01953
60023E750005j96007j86123j72860j56090j36516j15636r4338p2559n0285k7819
60013D541772n027J8553M2669O6389Q9454J12681J36757J61361J85605K08326
60003E558540K27727K41765K49371K50525K44842K31175K09197J80526J47660
59994G541328J12377P5536L7578j294m0619p8815j13482j43098j67616j86865
59984G035030j99378k03760k00567j91893j79611j64784j48159j30141j10479
59975E506258q8838o5698m2071j8504N059K8685N2254P5530R7875J18080J34989
$$ y = [5998967, 6163029, 6330091, 6494750, 6651814, 6795788, 6920768, 7021171, 7092604, 7132169, 7138415, 7111252, 7051682, 6961412, 6842767, 6698826, 6533248, 6350087, 6154242, 5951958, 5750005, 5553998, 5367875, 5195015, 5038925, 4902409, 4786773, 4692435, 4619876, 4569591, 4541772, 4536745, 4555298, 4597967, 4664356, 4753810, 4866491, 5003248, 5164609, 5350214, 5558540, 5786267, 6028032, 6277403, 6527928, 6772770, 7003945, 7213142, 7393668, 7541328, 7653705, 7729241, 7766819, 7765525, 7724906, 7646091, 7532609, 7389511, 7221895, 7035030, 6835652, 6631892, 6431325, 6239432, 6059821, 5895037, 5746878, 5616737, 5506258, 5417420, 5351722, 5309651, 5291147, 5296206, 5324891, 5377145, 5452675, 5550550, 5668630, 5803619]
59964E803619J48018J56751J60467J58697J51928J41095J26715J09080Q9010O7725
59954G113105M6215K5276O010j0350k2939l1124l4226l1997k5058j4094J233K1906
59942G043957M8109P8864J13133J50631J91433K35306K81616L29542L78148M26311
59932I277050M72502N14547N49634N74654N86214N80383N53300N02827M29622
59923A4040733L36395K26800J05766j9679j41257k51762l46406m22307m77662
59914A3050621n11911n26370n24050n08521m82733m48740m08523l64637l19559
59905H955577k74377k28810j82753j37176r3115n0417q187L3889P5260J15178
59895H205069J52962J87734K18282K43063K60095K67319K63623K49074K23808
$$ y = [5803619, 5951637, 6108388, 6268855, 6427552, 6579480, 6720575, 6847290, 6956370, 7045380, 7113105, 7159320, 7184596, 7190606, 7180256, 7157317, 7126193, 7091967, 7059970, 7034912, 7020818, 7022051, 7043957, 7092066, 7170930, 7284063, 7434694, 7626127, 7861433, 8143049, 8472591, 8850739, 9277050, 9749552, 10264099, 10813733, 11388387, 11974601, 12554984, 13108284, 13611111, 14040733, 14377128, 14603928, 14709694, 14690015, 14548758, 14296996, 13950590, 13528283, 13050621, 12538710, 12012340, 11488290, 10979769, 10497036, 10048296, 9639773, 9275136, 8955577, 8681200, 8452390, 8269637, 8132461, 8039346, 7988929, 7980742, 8014631, 8089891, 8205069, 8358031, 8545765, 8764047, 9007110, 9267205, 9534524, 9798147, 10047221, 10271029]
59886A0271029J87292J39463Q2201J8978m6604j11247j71586k24767k69594l06325
59876I568840l35271l56265l69422l75504l75297l69336l58330l43181l24393
59867F361841l02210k77559k52136k27127k02416j77481j52674j29146j07758
59858D533334q8545p1234n6041m3945l6108l3020l4159l8493m5145n3345o2021
59847C971278o9779p5365p8047p7731p4894p0199o3964n6167m7082l7463k7741
59836C292846j7502o249N630J7276K8498L9757N1093O1696P0641P7530Q2266Q4664
59824C788146Q4513Q1650P5862O6955N5255M1931K8755J7391Q710K753n62r15
59812D250444J895P025J3064J9724K8500M1233N8543P9986J05095J33481J64435
$$ y = [10271029, 10458321, 10597784, 10679985, 10698963, 10652359, 10541112, 10369526, 10144759, 9875165, 9568840, 9233569, 8877304, 8507882, 8132378, 7757081, 7387745, 7029415, 6686234, 6361841, 6059631, 5782072, 5529936, 5302809, 5100393, 4922912, 4770238, 4641092, 4533334, 4444789, 4373555, 4317514, 4273569, 4237461, 4204441, 4170282, 4131789, 4086644, 4033299, 3971278, 3901499, 3826134, 3748087, 3670356, 3595462, 3525263, 3461299, 3405132, 3358050, 3320587, 3292846, 3275344, 3269095, 3274725, 3292001, 3320499, 3360256, 3411349, 3473045, 3543686, 3621216, 3703482, 3788146, 3872659, 3954309, 4030171, 4097126, 4152381, 4194312, 4223067, 4240458, 4249168, 4251921, 4251359, 4250444, 4252339, 4259364, 4272428, 4292152, 4320652, 4361885, 4420428, 4500414, 4605509, 4738990, 4903425]
59801D903425J97239K31843K68786L08689L51967L98137M44233M83643N06742
59792H094704N02735M61876L78895K57268J10780m0728j78559k89924l68554m13756
59782H514737m29553m22844m00717l68755l31087k90828k50180k10831j74373
59773E635569j41759j12575q5750o1088l9280k0408l495J2284K6921M0559N4193
59762E305171O8797Q4334J00232J16447J33517J51856J71359J91676K12736K35088
59752F771213K59695K87139L17174L49289L83379M19549M57564M97066N37787
59743A0279855N78723O17325O50360O75382O90507O93142O80307O50595O05173
59734A6121369N47113M81014M13352L51512L01450K66608K49119K50758K71921
$$ y = [4903425, 5100664, 5332507, 5601293, 5909982, 6261949, 6660086, 7104319, 7587962, 8094704, 8597439, 9059315, 9438210, 9695478, 9806258, 9765530, 9586971, 9297047, 8928493, 8514737, 8085184, 7662340, 7261623, 6892868, 6561781, 6270953, 6020773, 5809942, 5635569, 5493810, 5381235, 5295485, 5234397, 5195117, 5174709, 5171214, 5183498, 5210419, 5250978, 5305171, 5373968, 5458302, 5558534, 5674981, 5808498, 5960354, 6131713, 6323389, 6536125, 6771213, 7030908, 7318047, 7635221, 7984510, 8367889, 8787438, 9245002, 9742068, 10279855, 10858578, 11475903, 12126263, 12801645, 13492152, 14185294, 14865601, 15516196, 16121369, 16668482, 17149496, 17562848, 17914360, 18215810, 18482418, 18731537, 18982295, 19254216]
59725A9254216L10660L63572M27220M98193N72556O46104P14903P75000Q21928
59716B4384352Q51041Q58227Q40246P95101P22867O26217N10124L81337K48023
59707C0217535J18845J501r7994j74932k25817k49069k45243k16032j63457r0133
59697B8875204N06J05035K20812L45599M76925O12342P49770Q86834J019825J143524
59687C4436376J251462J335681J386299J391970J341612J226782J044171P97486
59679D4211839M97994J63607j82985n17134q16095j062742j247320j367260j426859
59670C8253045j437227j415061j379582j348810j336042j346431j374894j408081
59662B7206917j430643j431883j408613j363838j303560j233852j159302j083202
$$ y = [19254216, 19564876, 19928448, 20355668, 20853861, 21426417, 22072521, 22787424, 23562424, 24384352, 25235393, 26093620, 26933866, 27728967, 28451834, 29078051, 29588175, 29969512, 30217535, 30336380, 30337881, 30239887, 30064955, 29839138, 29590069, 29344826, 29128794, 28965337, 28875204, 28875710, 28980745, 29201557, 29547156, 30024081, 30636423, 31386193, 32273027, 33292852, 34436376, 35687838, 37023519, 38409818, 39801788, 41143400, 42370182, 43414353, 44211839, 44709833, 44873440, 44690455, 44173321, 43357226, 42294484, 41047164, 39679904, 38253045, 36815818, 35400757, 34021175, 32672365, 31336323, 29989892, 28614998, 27206917, 25776274, 24344391, 22935778, 21571940, 20268380, 19034528, 17875226, 16792024]
59654A6792024j008368r36989q69742q06074p45741o89308o36878n87384n39838
59645I971702m94560m52389m13273l76427l41348l08039k76545k47071k20063
59636F841987j95501j72502j50286j29234j10222r3304p7948o4350n3533m6083
59626E749024m1590l9610m0459m4732n2455o2920p5032q7534r9181j09005j16456
59615D980050j21339j23701j23749j21652j17464j11282j03379r4130q3890p3009
59605C906455o1901n1027m0754l1229k2240j3456m975K609Q905J4193J8721K1909
59593C747210K3012K2391K1357K0755K0588K0967K2432K5026K8066L1402L5968
59582D019174M2486N0404N8825O7747P7574Q8045R8642J09770J22459J37102J53159
$$ y = [16792024, 15783656, 14846667, 13976925, 13170851, 12425110, 11735802, 11098924, 10511540, 9971702, 9477142, 9024753, 8611480, 8235053, 7893705, 7585666, 7309121, 7062050, 6841987, 6646486, 6473984, 6323698, 6194464, 6084242, 5990938, 5912990, 5848640, 5795107, 5749024, 5707434, 5667824, 5627365, 5582633, 5530178, 5467258, 5392226, 5304692, 5205511, 5096506, 4980050, 4858711, 4735010, 4611261, 4489609, 4372145, 4260863, 4157484, 4063354, 3979464, 3906455, 3844554, 3793527, 3752773, 3721544, 3699304, 3685848, 3680873, 3683482, 3692387, 3706580, 3725301, 3747210, 3770222, 3792613, 3813970, 3834725, 3855313, 3876280, 3898712, 3923738, 3951804, 3983206, 4019174, 4061660, 4112064, 4170889, 4238636, 4316210, 4404255, 4502897, 4612667, 4735126, 4872228, 5025387]
59571E025387J70176J88317K07782K28286K49312K70566K91943L13124L33260
59562G278153L51059L65403L75813L82080L83511L79152L68802L53328L33753
59553A0571054L10712K85050K58240K31659K05916J81346J58698J38972J23093
59544A2464740J12200J07534J09133J15003J22459J30327J39302J50013J60976
59535A3611687J68168J66288J50910J20138P4586J6059n3207j30020k09919k88127
59525A3626563l60529m23610m74242n10487n32283n40811n37622n24814n05356
59516I216809m82141m56671m29204l99957l69589l38846l08397k78903k50654
59507E902447k23400j97007j71938j48512j26049j03633q1367o0024l9591j9151
$$ y = [5025387, 5195563, 5383880, 5591662, 5819948, 6069260, 6339826, 6631769, 6944893, 7278153, 7629212, 7994615, 8370428, 8752508, 9136019, 9515171, 9883973, 10237301, 10571054, 10881766, 11166816, 11425056, 11656715, 11862631, 12043977, 12202675, 12341647, 12464740, 12576940, 12684474, 12793607, 12908610, 13031069, 13161396, 13300698, 13450711, 13611687, 13779855, 13946143, 14097053, 14217191, 14291777, 14307836, 14254629, 14124609, 13914690, 13626563, 13266034, 12842424, 12368182, 11857695, 11325412, 10784601, 10246979, 9722165, 9216809, 8734668, 8277997, 7848793, 7448836, 7079247, 6740401, 6432004, 6153101, 5902447, 5679047, 5482040, 5310102, 5161590, 5035541, 4931908, 4850541, 4790517, 4750926, 4731775]
59497D731775J792K2736M3217O3635Q4651J06453J28967J52360J76777K01793
59487E714156K26492K50111K72364K93063L11509L26299L35724L38181L32081
59478H399980L15635K87456K47533J97276J38491P2853K578o8987j37964k00972
59468I253879k55453k99664l32942l55689l68724l72850l69264l59763l46004
59459F193526l28954l09443k88684k67664k46520k25201k04367j84860j66639
59450C971194j49039j31964j16041j01675q8647p6701o5879n6150m7159l8561
59440C099378l0253k2296j4849q206k620J900N570Q714J1671J4514J6822J8225
59428C098570J9269K1130K4193K7577L0452L3165L6631M1344M7630N6052O6391
$$ y = [4731775, 4733567, 4756303, 4799520, 4863155, 4947806, 5054259, 5183226, 5335586, 5512363, 5714156, 5940648, 6190759, 6463123, 6756186, 7067695, 7393994, 7729718, 8067899, 8399980, 8715615, 9003071, 9250604, 9447880, 9586371, 9659224, 9661802, 9592815, 9454851, 9253879, 8998426, 8698762, 8365820, 8010131, 7641407, 7268557, 6899293, 6539530, 6193526, 5864572, 5555129, 5266445, 4998781, 4752261, 4527060, 4322693, 4137833, 3971194, 3822155, 3690191, 3574150, 3472475, 3383828, 3307127, 3241248, 3185098, 3137939, 3099378, 3069125, 3046829, 3031980, 3023774, 3021154, 3023054, 3028624, 3037338, 3049009, 3063523, 3080345, 3098570, 3117839, 3138969, 3163162, 3190739, 3221191, 3254356, 3290987, 3332331, 3379961, 3436013, 3502404]
59417C502404P6583Q3783Q6869Q7542Q9134R4686J05669J21703J41341J63617
59407D553331J88726K17138K48372K81002L13501L44932L75588M07621M44312
59398G374523M87839N37739N91630O46465O98343P42145P72840P87322P84496
59389A3423342P64350P28012O78374O19560N55713M90692M28171L70750L19060
59380A8378024K72474K30150J90489J50257J05909N5794J22o0760j26414j94504
59370A9001541k60352l18816l65811l98278m14335m14409m01604l80543l56259
59361A5691134l33754l17132l08339l07306l13382l25880l43226l62848l82360
59352A2696907m00165m14744m24535m29059m29232m25942m19069m08447l94987
$$ y = [3502404, 3578987, 3662770, 3749639, 3837181, 3926315, 4021001, 4126670, 4248373, 4389714, 4553331, 4742057, 4959195, 5207567, 5488569, 5802070, 6147002, 6522590, 6930211, 7374523, 7862362, 8400101, 8991731, 9638196, 10336539, 11078684, 11851524, 12638846, 13423342, 14187692, 14915704, 15594078, 16213638, 16769351, 17260043, 17688214, 18058964, 18378024, 18650498, 18880648, 19071137, 19221394, 19327303, 19383097, 19383219, 19322459, 19196045, 19001541, 18741189, 18422373, 18056562, 17658284, 17243949, 16829540, 16427936, 16047393, 15691134, 15357380, 15040248, 14731909, 14424603, 14111221, 13785341, 13442115, 13079267, 12696907, 12296742, 11881998, 11457463, 11028404, 10599172, 10173230, 9754161, 9345714, 8950727]
59343H950727l80044l64132l46988l28516l09151k89480k70039k51215k33038
59334F178124k15146j97188j79308j62127j46308j32001j18600j05310r2109p9781
59324D750246o8662n7932m6724l5301k4371j3775k918P957J8151K7942L8308M9180
59312D642101N9354O8247P6456Q4240R0849R5944J00436J05089J09262J11850
59302E543828J12698J12282J10845J08653J06556J05321J04799J04464J04411
59293F513857J05122J06497J07746J08062J06806J03100R5780Q3794O6492M3678
59283G440934J5694j6482n1278q6663j20434j50749j76432j96615k10393k17326
59273F230256k18135k14241k06608j95567j81698j66069j49356j31378j11906
$$ y = [8950727, 8570683, 8206551, 7859563, 7531047, 7221896, 6932416, 6662377, 6411162, 6178124, 5962978, 5765790, 5586482, 5424355, 5278047, 5146046, 5027446, 4922136, 4830027, 4750246, 4681584, 4623652, 4576928, 4541627, 4517256, 4503481, 4500563, 4508520, 4526671, 4554613, 4592921, 4642101, 4701455, 4769702, 4846158, 4930398, 5021247, 5117191, 5217627, 5322716, 5431978, 5543828, 5656526, 5768808, 5879653, 5988306, 6094862, 6200183, 6304982, 6409446, 6513857, 6618979, 6725476, 6833222, 6941284, 7048090, 7151190, 7246970, 7330764, 7397256, 7440934, 7456628, 7440146, 7388868, 7302205, 7181771, 7031022, 6854590, 6657975, 6447582, 6230256, 6012121, 5797880, 5591272, 5395705, 5214007, 5047938, 4898582, 4767204, 4655298]
59264D655298r1600p2122n5602m3725l6549l1969k6888j9096p772P352K6326M8440
59252D352093P2504R7980J25226J54442J85353K18230K54168K93675L35745L78948
59242F468364M22675M66490N08590N45639N73959N90301N91623N74825N37228
59233A1279694M77618L97076K98980J88012O9139n2492j71273k81417l77684m55768
59223A1371885n12599n47210n61194n57749n40309n12383m77765m39468l98590
59214F824618l55466l11862k70655k33191j98402j65110j33928j06100q1607n9478
59204D908819l9345k1835p715K699R604J3522J4780J3046P890j60r797k0263l1713
59191D839532m4074n6485o8112p8692q7862r4907r9621j02566j03975j03285j00292
$$ y = [4655298, 4563698, 4491576, 4435974, 4392249, 4355700, 4323731, 4296843, 4277747, 4269975, 4277327, 4303653, 4352093, 4424597, 4522577, 4647803, 4802245, 4987598, 5205828, 5459996, 5753671, 6089416, 6468364, 6891039, 7357529, 7866119, 8411758, 8985717, 9576018, 10167641, 10742466, 11279694, 11757312, 12154388, 12453368, 12641380, 12710519, 12658027, 12486754, 12205337, 11827653, 11371885, 10859286, 10312076, 9750882, 9193133, 8652824, 8140441, 7662676, 7223208, 6824618, 6469152, 6157290, 5886635, 5653444, 5455042, 5289932, 5156004, 5049904, 4968297, 4908819, 4869474, 4847639, 4839924, 4842623, 4852227, 4865749, 4880529, 4893575, 4901465, 4901305, 4891508, 4871245, 4839532, 4795458, 4738973, 4670861, 4592169, 4504307, 4409400, 4309779, 4207213, 4103238, 3999953, 3899661]
59180C899661r5935r1295q6474q1093p5154o8845o2100n4956m7761m0623l3254
59169C162171k5822j9102j3257p297m56O641J3013J8823K5018L1904L8883M5268
59157C275787N0802N5637O0278O5121O9652P2701P3855P3968P3725P2426O8895
59146D012847O2900N4991M5549L4835K3524J2300J214r883k0476k9607l6649m1419
59134D110126m3914m4352m3156m0262l4870k6374j5235k431J1575K6835M3301
59123C941243O0680P8629R6693J14426J31859J49336J66669J82927J97430K10135
59113E330027K20578K27262K28652K24050K12742J92967J62767J21745P1524J5020
59103G007334m4123j02080j55740k03054k42271k71618k90419k99898l02002k97833
$$ y = [3899661, 3803726, 3712431, 3625957, 3544864, 3469710, 3400865, 3338765, 3283809, 3236048, 3195425, 3162171, 3136349, 3117247, 3103990, 3096693, 3096237, 3102878, 3115891, 3134714, 3159732, 3191636, 3230519, 3275787, 3326589, 3382226, 3442504, 3507625, 3577277, 3649978, 3723833, 3797801, 3871526, 3943952, 4012847, 4075747, 4130738, 4176287, 4211122, 4234646, 4246946, 4248160, 4238277, 4217801, 4188194, 4151545, 4110126, 4066212, 4021860, 3978704, 3938442, 3903572, 3877198, 3861963, 3859532, 3871107, 3897942, 3941243, 4001923, 4080552, 4177245, 4291671, 4423530, 4572866, 4739535, 4922462, 5119892, 5330027, 5550605, 5777867, 6006519, 6230569, 6443311, 6636278, 6799045, 6920790, 6992314, 7007334, 6963211, 6861131, 6705391, 6502337, 6260066, 5988448, 5698029, 5398131, 5096129, 4798296]
59093D798296k87986k73777k57015k38840k19746k00612j82601j65969j49946
59084B821804j34207j19757j07791r8122q9301q0384p1953o5071n9456n3595m6815
59073A895352m0349l5575l2002k8139k3802k0123j7487j5140j2974j2076j2959
59062A644726j4724j6569j8769k1425k3660k4967k6105k7671k8847k8661k7378
59051A385950k5638k3204j9732j5822j2189q606m696r55K199N484R669J4119J7639
59038A324218K0110K2114K3639K4263K4036K2971K0450J6303J1782Q146N070J823
59026A524925p84j347k36Q50J494K957N854R094J1524J3289J5020J6707J7828
59013A617175J7877J6576J4014J0657O846K546j982n789q236r813j1214j2211
$$ y = [4798296, 4510310, 4236533, 3979518, 3740678, 3520932, 3320320, 3137719, 2971750, 2821804, 2687597, 2567840, 2460049, 2361927, 2272626, 2192242, 2120289, 2055218, 1995762, 1942167, 1895352, 1855003, 1819428, 1787426, 1759287, 1735485, 1715362, 1697875, 1682735, 1669761, 1657685, 1644726, 1630002, 1613433, 1594664, 1573239, 1549579, 1524612, 1498507, 1470836, 1441989, 1413328, 1385950, 1360312, 1337108, 1317376, 1301554, 1289365, 1280759, 1276063, 1275108, 1277307, 1282791, 1292460, 1306579, 1324218, 1344328, 1366442, 1390081, 1414344, 1438380, 1461351, 1481801, 1498104, 1509886, 1518032, 1523102, 1524925, 1524141, 1522794, 1522558, 1523408, 1524902, 1527859, 1533713, 1542807, 1554331, 1567620, 1582640, 1599347, 1617175, 1635052, 1651628, 1665642, 1676299, 1683145, 1685691, 1683709, 1677920, 1669684, 1659871, 1648657, 1636446]
59001A636446j2324j1940j1606j0840q841o029l590j806p2J778L388M883O716
58988A586163Q646R981J0710J1380J2065J2559J3295J4936J7266J9600K2013K4990
58976A763604K8183L0743L2738L4926L7297L9123M0337M1533M2683M3100M2762
58965B177029M2453M2561M2854M3348M4253M5213M5888M7119N0196N4933N9770
58954B695617O3823O7557P1497P5726Q0733Q7313R5296J03643J11968J20876J30630
58943C704679J40835J51547J63382J76388J90162K05176K22560K42338K63481
58934E460548K85976L11306L40246L71780M04972M40469M79238N21051N65220
58925I180806O11856O61346P13156P65828Q17565Q66222R09289R44158R67690
$$ y = [1636446, 1624122, 1612182, 1600576, 1589736, 1580895, 1574866, 1571276, 1569470, 1569398, 1571176, 1574564, 1579447, 1586163, 1594809, 1604790, 1615500, 1626880, 1638945, 1651504, 1664799, 1679735, 1697001, 1716601, 1738614, 1763604, 1791787, 1822530, 1855268, 1890194, 1927491, 1966614, 2006951, 2048484, 2091167, 2134267, 2177029, 2219482, 2262043, 2304897, 2348245, 2392498, 2437711, 2483599, 2530718, 2580914, 2635847, 2695617, 2759440, 2826997, 2898494, 2974220, 3054953, 3142266, 3237562, 3341205, 3453173, 3574049, 3704679, 3845514, 3997061, 4160443, 4336831, 4526993, 4732169, 4954729, 5197067, 5460548, 5746524, 6057830, 6398076, 6769856, 7174828, 7615297, 8094535, 8615586, 9180806, 9792662, 10454008, 11167164, 11932992, 12750557, 13616779, 14526068, 15470226, 16437916]
58916A6437916R75287R61381R21508Q53352P55984O29540M76546L02805J16328
58907B2430647p4019k58840m28890n77079o99729p95521q63998r05715r23148
58898A6903708r20315r01368q69819q28773p81351p30690o79507o29602n81943
58889I980340n37462m97359m62076m30528m01193l73705l48525l25362l03039
58880F301091k80836k58965k37823k17744j99401j83183j68207j53111j37942
58871D463879j24042j12004j00990r0259q0018p0434o1094n2014m3928l6980l0148
58860C661968k2604j4736p247q2P235J4884K2843L1049L9216M7101N5071O3682
58848C898380P2718Q1617R0805J01361J13295J25422J37278J49784J63649J78449
$$ y = [16437916, 17413203, 18374584, 19296092, 20149444, 20905428, 21534968, 22011514, 22314319, 22430647, 22356628, 22097788, 21668898, 21091819, 20392090, 19596569, 18732571, 17826856, 16903708, 15983393, 15082025, 14212206, 13383433, 12602082, 11871392, 11191885, 10562283, 9980340, 9442878, 8945519, 8483443, 8052915, 7651722, 7278017, 6929492, 6604130, 6301091, 6020255, 5761290, 5523467, 5305723, 5106322, 4923139, 4754932, 4601821, 4463879, 4339837, 4227833, 4126843, 4036584, 3956566, 3886132, 3825038, 3773024, 3729096, 3692116, 3661968, 3639364, 3624628, 3617381, 3617299, 3624534, 3639418, 3662261, 3693310, 3732526, 3779627, 3834698, 3898380, 3971098, 4052715, 4143520, 4244881, 4358176, 4483598, 4620876, 4770660, 4934309, 5112758]
58838E112758J93916K10868K29964K50704K72497K95844L21649L50136L81288
58829G619624M15597M53598M95145N39750N87211O37299O89154P41365P92185
58820A2970928Q39432Q80519R12507R31605R32740R10622Q61613P84183O78036
58811B0702185N44138L85937K09712K3512j63715l42528n04319o43032p55357
58802A9456533q39771q96624r28746r40171r33943r12380q79202q39313p95917
58793A1490466p49474p00147o49703o00342n53109n08337m66420m27393l90884
58784F444657l57052l26477k98685k72220k46684k23336k03108j85507j70288
58775D161300j58579j51268j47350j44763j41778j36982j29384j19503j09272
$$ y = [5112758, 5306674, 5517542, 5747506, 5998210, 6270707, 6566551, 6888200, 7238336, 7619624, 8035221, 8488819, 8983964, 9523714, 10110925, 10748224, 11437378, 12178743, 12970928, 13810360, 14690879, 15603386, 16534991, 17467731, 18378353, 19239966, 20024149, 20702185, 21246323, 21632260, 21841972, 21865484, 21701769, 21359241, 20854922, 20211890, 19456533, 18616762, 17720138, 16791392, 15851221, 14917278, 14004898, 13125696, 12286383, 11490466, 10740992, 10040845, 9391142, 8790800, 8237691, 7729354, 7262934, 6835541, 6444657, 6087605, 5761128, 5462443, 5190223, 4943539, 4720203, 4517095, 4331588, 4161300, 4002721, 3851453, 3704103, 3559340, 3417562, 3280580, 3151196, 3031693, 2922421]
58766B922421r9959r1235q2734p5029o8306o1639n4701m8703m4493m1039l7009
58755B217574l2598k8591k4842k1037j7844j5940j4853j4007j3998j5556j8089
58744B000219k0499k2650k4842k6639k7465k7720k8170k8851k9517l0457l1936
58733A701473l3510l4803l6120l7446l7834l6737l5060l3848l2799l1068k8624
58722A323624k5879k2931k0203j8796j9108j9908j9948j9556j9603j9857j9627
58711A098208j9075j8606j7751j5971j3923j2770j2689j3133j3807j4488j4631
58700I31364j4109j3607j3450j2919j1588j0195r273q125o295m742m223l718j984
58687H17136M09K213L685N930Q870J1439J3129J3828J2910J0119O819M727L937
$$ y = [2922421, 2822462, 2731227, 2648493, 2573464, 2505158, 2443519, 2388818, 2340115, 2295622, 2254583, 2217574, 2184976, 2156385, 2131543, 2110506, 2092662, 2076722, 2061869, 2047862, 2033864, 2018308, 2000219, 1979720, 1957070, 1932228, 1905589, 1878124, 1850404, 1822234, 1793383, 1763866, 1733409, 1701473, 1667963, 1633160, 1597040, 1559594, 1521760, 1485023, 1449963, 1416115, 1383316, 1352248, 1323624, 1297745, 1274814, 1254611, 1235815, 1216707, 1196799, 1176851, 1157295, 1137692, 1117835, 1098208, 1079133, 1060527, 1042776, 1026805, 1012882, 1000112, 987423, 974290, 960483, 945995, 931364, 917255, 903648, 890198, 877279, 865691, 855496, 846223, 838098, 831803, 827061, 822838, 819120, 817136, 817545, 819758, 823443, 829373, 838243, 849682, 862811, 876639, 889549, 899668, 906487, 911214, 915151]
58674I15151L631M011N873Q761J1284J3080J5025J7584K0231K2147K2423J9977
58662A079178J4505P314K48n696j0033j2019j1473r474p017l806L90M338O822
58649A053277Q684J1560J5454J9248K2883K7099L1551L5259L8696M3444M9769
58638A356924N6274O2086O7970P5056Q3729R3890J05285J17609J31044J46364
58628B296231J63719J81961K00138K18753K38430K58090K75678K89718K98671
58619D421389K99704K89848K67777K33263J86118J27666O2342m263o8393j27458
58609E687993j77709k15354k39857k53730k59272k57647k50779k41308k30193
58600C562144k16731k01361j86136j71869j57108j40928j24797j10541r8122q6571
$$ y = [915151, 918782, 922793, 928666, 937427, 948711, 961791, 976816, 994400, 1014631, 1036778, 1059201, 1079178, 1093683, 1100997, 1101245, 1095549, 1085516, 1073497, 1062024, 1052550, 1045533, 1041727, 1042117, 1046455, 1053277, 1061961, 1073521, 1088975, 1108223, 1131106, 1158205, 1189756, 1225015, 1263711, 1307155, 1356924, 1413198, 1475284, 1543254, 1618310, 1702039, 1795929, 1901214, 2018823, 2149867, 2296231, 2459950, 2641911, 2842049, 3060802, 3299232, 3557322, 3833000, 4122718, 4421389, 4721093, 5010941, 5278718, 5511981, 5698099, 5825765, 5888107, 5883844, 5815451, 5687993, 5510284, 5294930, 5055073, 4801343, 4542071, 4284424, 4033645, 3792337, 3562144, 3345413, 3144052, 2957916, 2786047, 2628939, 2488011, 2363214, 2252673, 2154551, 2067980]
58590B067980p5791o6280n8049n0961m5458m2009m0184l8899l7325l5384l3437
58579A544203l1627k9390k5919k1283j6535j2442q972o462o134q584j2760j7463
58567A346632k2654k8173l2466l4251l4402l4423l3948l1558k7381k2969j9110
58556A025297j5597j2524j0106p737n077l483m395o833q498q981r735j1174j1983
58543I09174j1397j0176r157q512q491r322j0375j0881j1210j2080j2981j3028
58531G81564j2757j3265j4052j3679j2143j0688r656q485p317o622n734l875k126
58518F61165k005k694k089k41Q82P68Q03J430J737J839K932M679N397N141N812
58503F85556P715Q882Q615Q800J0629J2538J2707J1401R652P636N558M292L953
$$ y = [2067980, 1992189, 1925909, 1867860, 1816899, 1771441, 1729432, 1689248, 1650349, 1613024, 1577640, 1544203, 1512576, 1483186, 1457267, 1435984, 1419449, 1407007, 1398035, 1391573, 1385439, 1376855, 1364095, 1346632, 1323978, 1295805, 1263339, 1229088, 1194686, 1160263, 1126315, 1094757, 1067376, 1044407, 1025297, 1009700, 997176, 987070, 979333, 974256, 970773, 966378, 959545, 951047, 942066, 932331, 921157, 909174, 897777, 887601, 878444, 869932, 861441, 852119, 841744, 830863, 819653, 807573, 794592, 781564, 768807, 755542, 741490, 727811, 715668, 704980, 695324, 686839, 679522, 672900, 667166, 663291, 661165, 659160, 656466, 654377, 654136, 655018, 655786, 656589, 658019, 659756, 661595, 664527, 669206, 674603, 679744, 685556, 693271, 702153, 710768, 719568, 730197, 742735, 755442, 766843, 776495, 784131, 789689, 793981, 797934]
58490G97934L349J740k59k117m090o065p317p928q824j0062j0745j0871j1356
58477G23389j2045j1751j0569j0067j0679j1097j0635j0091r797q908p301o083
58465F04366n611n046m260m112m354l493j405J88M84O41J434K124K483L650N989
58450E93078Q135R161R765J0498J0670R823Q476O762M098P64k041m078o065p616
58436F51430p458n942m877m566l569j766q35j039m77J515L119L343L724N476P506
58421F45584Q762R977J1710J2798J2361J1210J0108Q540O242L936J649j502n092
58408G36283p274p706q071q930q790p228o060o188o099m795l463k854j784K89
58394F57330J847K037K166K977L037J496n8j96L22O20J491L585O203R246J3844
$$ y = [797934, 801283, 803023, 802764, 800647, 796557, 790492, 783175, 775247, 766423, 756361, 745616, 734745, 723389, 711344, 699593, 689024, 678957, 668278, 657181, 646546, 636455, 626658, 617750, 610449, 604366, 598755, 593709, 589449, 585337, 580983, 577490, 576085, 576273, 576757, 577398, 578832, 580956, 583439, 587089, 593078, 601213, 610374, 620139, 630637, 641307, 651130, 659606, 666368, 670466, 671230, 669189, 665111, 659046, 651430, 643972, 638030, 633153, 628587, 625018, 623252, 622417, 621378, 620901, 622416, 625535, 628878, 632602, 638078, 645584, 654346, 664323, 676033, 688831, 701192, 712402, 722510, 731050, 737292, 741228, 742877, 741375, 736283, 729009, 721303, 713232, 704302, 695512, 688284, 682224, 676036, 669937, 665142, 661679, 658825, 657041, 657330, 659177, 661214, 663380, 666357, 669394, 670890, 670832, 670636, 670958, 671578, 673069, 676654, 682857, 692103, 705947]
58379G05947J9688K4115K5213K3506J9720J3854P445L467K474J979R58J458M252
58366H54076O712P153P492R215J0331R092P340P131P024M901J745l28j474k722
58352I27688l494l139k722k882k234q9J744K118K799N177P483P781P140P345Q039
58337I62754Q447R262J0505J0377Q587P841R655J1774J2190J2415J3961J5020
58325A092788J3769J1844J1253J0835Q914O586N268L958J897R13K027K879J739
58312A174670Q34K426M896O102P216R705J1844J2032J2290J4526J6627J6141J4754
58299A304063J5109J6275J6321J6319J7823J9422J9700K0500K3451K6515K7798
58288A523296K9287L2956L6843L8917M0824M3648M4315M0845L6782L5422L4031
$$ y = [705947, 725635, 749750, 774963, 798469, 818189, 832043, 839488, 842955, 845429, 847408, 848366, 849824, 854076, 860788, 867941, 875433, 884648, 894979, 904071, 911411, 918542, 925566, 930467, 932212, 931884, 930410, 927688, 924194, 921055, 918333, 915451, 913217, 913128, 914872, 916990, 919789, 924966, 932449, 940230, 947370, 954715, 962754, 971201, 980463, 990968, 1001345, 1009932, 1017773, 1027428, 1039202, 1051392, 1063807, 1077768, 1092788, 1106557, 1118401, 1129654, 1140489, 1149403, 1155989, 1161257, 1165215, 1167112, 1168025, 1170052, 1172931, 1174670, 1175504, 1177930, 1182826, 1188928, 1196144, 1205849, 1217693, 1229725, 1242015, 1256541, 1273168, 1289309, 1304063, 1319172, 1335447, 1351768, 1368087, 1385910, 1405332, 1425032, 1445532, 1468983, 1495498, 1523296, 1552583, 1585539, 1622382, 1661299, 1702123, 1745771, 1790086, 1830931, 1867713, 1903135, 1937166]
58277A937166K9135K3140J9962J8339J5550J3683J5849J9886K2121K3870K7963
58266B166664L2432L4099L4876L8050M1911M3440M4595M8320N2219N3037N3487
58255B643130N7497O2711O4954O6139P0111P4806P6483P7617Q2473Q8842R2535
58244C457298R5805J02808J10978J15886J20260J28820J38702J44756J49773J59213
58234D724299J70468J78058J84864J96966K11925K23866K35465K52699K72511
58225F651121K88466L03880L25895L51596L74106L97355M29717M68228N05017
58216A0095381N43958N94045O51920P09420P72755Q54487R52323J057288J176889
58207A7408466J326860J506327J707244J942770K238199K600853L032115L563759
$$ y = [1937166, 1966301, 1989441, 2009403, 2027742, 2043292, 2056975, 2072824, 2092710, 2114831, 2138701, 2166664, 2199096, 2233195, 2268071, 2306121, 2348032, 2391472, 2436067, 2484387, 2536606, 2589643, 2643130, 2700627, 2763338, 2828292, 2894431, 2964542, 3039348, 3115831, 3193448, 3275921, 3364763, 3457298, 3553103, 3655911, 3766889, 3882775, 4003035, 4131855, 4270557, 4415313, 4565086, 4724299, 4894767, 5072825, 5257689, 5454655, 5666580, 5890446, 6125911, 6378610, 6651121, 6939587, 7243467, 7569362, 7920958, 8295064, 8692419, 9122136, 9590364, 10095381, 10639339, 11233384, 11885304, 12594724, 13367479, 14221966, 15174289, 16231577, 17408466, 18735326, 20241653, 21948897, 23891667, 26129866, 28730719, 31762834, 35326593]
58199C5326593M244971N096566O117548P331883Q783915J0498956J2514584J4953427
58191A04868443J7998554K1809527K6554855L2437918L9289764M5755118M8982376
58184C37696555M5721454L4412298J6608417l540995k1369467l3768414m0003814
58177C35756034m1185696l9142852l5502184l1323977k7175207k3328733j9889820
58170A18207565j6858680j4196332j1879896r902248q240727o853089n699324
58163D4577269m747030l958239l290466k713083k209834j764545j356066r68890
58155B3569116n97682k35750J35304N39650R96317J525994K170500K974958L891502
58146C4969909M665857M863126M108523K384982J13172k078068l692291m551409
$$ y = [35326593, 39571564, 44668130, 50785678, 58117561, 66901476, 77400432, 89915016, 104868443, 122866997, 144676524, 171231379, 203669297, 242959061, 288714179, 337696555, 383418009, 417830307, 434438724, 430897729, 409528262, 375759848, 335756034, 294570338, 255427486, 219925302, 188601325, 161426118, 138097385, 118207565, 101348885, 87152553, 75272657, 65370409, 57129682, 50276593, 44577269, 39830239, 35872000, 32581534, 29868451, 27658617, 25894072, 24538006, 23569116, 22971434, 22735684, 22870988, 23410638, 24406955, 25932949, 28103449, 31078407, 34969909, 39635766, 44498892, 48607415, 50992397, 51105569, 49027501, 45335210, 40783801]
58138D0783801m754526m527216m090328l593784l110086k665351k271044j931103
58130A3840363j638178j381888j160190r74387q18286o82836n67472m76550m07619
58121E732957l52953l09787k79488k58996k42237k28042k18136k09282j95821
58112C438215j78357j61877j46834j29821j11465r5819q3055p0174n8191n1641
58102B350981n1556n5096o1053o9474p7065p9423p7167p4275p1556o7251o2388
58091A604677n9420n6864n1454m4449l9853l7538l4183k9914k7909k8051k7165
58080A167877k5149k4949k6610k6935k5148k3595k2923k1619k0065k0048k0491
58069I10345j8625j5200j3530j3718j2814j0499r442r934r340p250o265p123p682
$$ y = [40783801, 36029275, 31502059, 27411731, 23817947, 20707861, 18042510, 15771466, 13840363, 12202185, 10820297, 9660107, 8685720, 7867434, 7184598, 6617126, 6140576, 5732957, 5380004, 5070217, 4790729, 4531733, 4289496, 4061454, 3843318, 3634036, 3438215, 3259858, 3097981, 2951147, 2821326, 2709861, 2614042, 2530987, 2460813, 2402622, 2350981, 2299425, 2244329, 2183276, 2113802, 2036737, 1957314, 1880147, 1805872, 1734316, 1667065, 1604677, 1545257, 1488393, 1436939, 1392490, 1352637, 1315099, 1280916, 1251002, 1223093, 1195042, 1167877, 1142728, 1117779, 1091169, 1064234, 1039086, 1015491, 992568, 970949, 950884, 930836, 910345, 891720, 876520, 862990, 849272, 836458, 825959, 816517, 806583, 797243, 789993, 783728, 776605, 768923]
58056G68923p319p925r823j0933j0637j0531j0850r968p899o549o107m837k715
58043F62830j594j594r21N86J355J529K724M417M476L411L962O238P271N974M466
58028G05130L787K356l21k191k174j795k203k579k489k876l790l981l443l575
58014F79856m307l994k649k225l171l760l459l909n752p495q314r215j0584j1374
58000E99648j1435j1918j2694j2157j0308r183r451r279p417m684j692K179O579
57987E08188R634J0576J0586J0215Q542N654L439K830K613J900J465J783J988
57974E79413J670J536J584P71q92k097k654l775n429o034n339n049n747n836m526
57959E37596l192k676j834k0J375J414J372K507M044M858N315O031O429N850M702
$$ y = [768923, 761604, 753679, 743856, 732923, 722286, 711755, 700905, 690937, 683038, 676489, 670382, 665545, 662830, 661236, 659642, 658721, 659307, 660662, 662191, 664915, 669332, 673808, 677219, 681181, 687419, 694690, 700664, 705130, 708917, 711273, 710952, 708761, 706587, 704792, 702589, 700010, 697521, 694645, 690855, 686874, 683431, 679856, 675549, 671555, 668906, 666681, 663510, 659750, 656291, 652382, 646630, 639135, 630821, 621606, 611022, 599648, 588213, 576295, 563601, 551444, 541136, 531953, 522502, 513223, 505806, 501122, 499430, 501609, 508188, 517822, 528398, 538984, 549199, 557741, 563395, 566834, 569664, 572277, 574177, 575642, 577425, 579413, 581083, 582619, 584203, 584974, 584082, 581985, 579331, 575556, 570127, 564093, 558754, 553705, 547958, 542122, 537596, 534404, 531728, 529894, 529874, 531249, 532663, 534035, 536542, 540586, 545444, 550759, 556790, 563219, 569069, 573771]
57944E73771L398J598o35k424l611n190p496r567j0902j2145j3397j3712j2886
57931D86802j2002j1524j0719r496q821q734q018o513n562n419m527k288k33P19
57917C93665J754L640N083N128N115O365P919Q369Q398R553J1713J3491J4171
57904D94364J3849J2718J1333J0579J0306R133O505L652J593k47k446m195m840
57891E62304n346o866q915j0309j0792j0737j0194r325q696q231p033n001l283
57878D57576k304q47J776M274N329N579O298P383Q072Q498R077R389Q962Q305
57864E37367P885P093N316L209J666N62m83j152j413k324m516o841p854p794p753
57849E22968p748p055n818m946m712m615m284l650k672j613j130j399j768j862
$$ y = [573771, 577169, 578767, 578132, 575708, 572097, 566907, 559411, 549844, 538942, 526797, 513400, 499688, 486802, 474800, 463276, 452557, 443061, 434240, 425506, 417488, 410975, 405413, 399994, 395467, 393179, 392946, 393665, 395419, 399059, 404142, 409270, 414385, 420750, 428669, 437038, 445436, 454989, 466702, 480193, 494364, 508213, 520931, 532264, 542843, 553149, 562282, 568787, 572439, 574032, 573785, 571339, 567144, 562304, 556958, 550092, 541177, 530868, 520076, 509339, 499145, 489820, 481124, 472893, 465860, 460859, 457576, 455272, 454425, 456201, 460475, 465804, 471383, 477681, 485064, 493136, 501634, 510711, 520100, 529062, 537367, 545252, 552345, 557661, 560870, 562536, 563098, 562615, 561463, 560050, 557726, 553210, 546369, 538515, 530721, 522968, 515220, 508165, 502347, 497401, 492689, 488074, 483790, 480140, 477468, 475855, 474725, 473326, 471558, 469696]
57835D69696k247l407m900o195p405q554r149r191r598j0738j1613j1354j0498
57822C64847r892r387q630q043p945p652o603n500n206n279m761l658k605j711
57808B77975p35J77R12J855L155M278N030O113P817R205R538R577J0336J1614
57794C56847J2848J4361J6463J8161J8291J7189J5803J3728R736L972j799o139
57782D89461q954j0709j1658j1969j1849j1434j0928j0565j0145r098p431n905
57770C68816m885l744j998j44J233K320L387M129M435M886N696O111N731N426
57756D01399N979O791O917O523O245O025N735O040P405Q972R699R929J0666J1951
57742E10276J3133J4128J5255J6344J7136J7943J8927J9477J9396J9868K1956
$$ y = [469696, 467449, 464042, 459142, 452947, 445542, 436988, 427839, 418648, 409050, 398312, 386699, 375345, 364847, 354955, 345568, 336938, 328895, 320950, 313298, 306695, 301195, 295989, 290710, 285949, 282291, 279686, 277975, 277240, 277417, 278329, 280184, 283339, 287617, 292647, 298760, 306577, 315782, 325320, 334897, 345233, 356847, 369695, 384056, 400519, 418680, 436971, 454160, 469963, 483691, 493427, 497399, 495600, 489461, 480507, 469798, 458140, 446171, 434322, 422888, 411960, 401395, 391250, 382152, 374721, 368816, 363931, 360187, 358189, 358045, 359278, 361598, 364985, 369114, 373549, 378435, 384131, 390242, 395973, 401399, 407378, 414169, 421086, 427609, 433854, 439879, 445614, 451654, 459059, 468031, 477730, 487659, 498325, 510276, 523409, 537537, 552792, 569136, 586272, 604215, 623142, 642619, 662015, 681883, 703839]
57731G03839K4935K7439K9524L2115L5114L7769M0508M4638N0392N6716O2999
57720A145988O9618P6909Q4859R3808J04206J15752J27920J41279J57111J75659
57710B293109J95879K16897K38649K60908K82553L01786L16219L22783L18293
57701D747076L00232K66805K17244J53303Q0175M672o7551j32562j87050k28506
57691E153838k56538k72707k78775k75993k65996k51084k33309k13950j93942
57682B911544j74055j54542j35304j16496r8556q1698o5765n0322l4536j7576
57672A982694M39J8546L6684N6589P9962J05981J30708J47826J49677J30257R0319
57661B929682L9518q403m3221o1243o3120n1594l1062o381J9484M5891P2686R9273
$$ y = [703839, 728774, 756213, 785737, 817852, 852966, 890735, 931243, 975881, 1026273, 1082989, 1145988, 1215606, 1292515, 1377374, 1471182, 1575388, 1691140, 1819060, 1960339, 2117450, 2293109, 2488988, 2705885, 2944534, 3205442, 3487995, 3789781, 4106000, 4428783, 4747076, 5047308, 5314113, 5531357, 5684660, 5764835, 5769507, 5701956, 5569394, 5382344, 5153838, 4897300, 4624593, 4345818, 4069825, 3803829, 3552745, 3319436, 3105486, 2911544, 2737489, 2582947, 2447643, 2331147, 2232591, 2150893, 2085128, 2034806, 2000270, 1982694, 1983133, 2001679, 2038363, 2094952, 2174914, 2280895, 2411603, 2559429, 2709106, 2839363, 2929682, 2969200, 2960797, 2917576, 2856333, 2793213, 2741619, 2710557, 2704176, 2723660, 2769551, 2842237, 2941510]
57649B941510J25507J51872J78150K02976K24917K42852K55016K58786K51788
57640D833374K32522K00025J54275R7381L3548l2337r5619j51956j98087k32893
57630D840233k56875k70628k74751k70953k61802k49111k33653k16474j99156
57621B606830j82623j66800j51694j37677j24652j12149j00420r0345q1956p4262
57611A384252o6670n9538n3174m7486m2696l9164l6272l2868k9038k6057k4326
57600I26963k2740k0514j8166j6156j4030j1631r823r126q808q097p238o522n429
57587G68683l607j794p89l26L40J424K896M910P229R038J0081J1232J3328J6127
57573H38772J9013K1872K4649K6968K8959L1616L5580M0354M5421N1180N7979
$$ y = [2941510, 3067017, 3218889, 3397039, 3600015, 3824932, 4067784, 4322800, 4581586, 4833374, 5065896, 5265921, 5420196, 5517577, 5551125, 5518788, 5423169, 5271213, 5073126, 4840233, 4583358, 4312730, 4037979, 3767026, 3505224, 3256113, 3022460, 2805986, 2606830, 2424207, 2257407, 2105713, 1968036, 1843384, 1731235, 1630815, 1540470, 1458514, 1384252, 1317582, 1258044, 1204870, 1157384, 1114688, 1075524, 1039252, 1006384, 977346, 951289, 926963, 904223, 883709, 865543, 849387, 835357, 823726, 813903, 804777, 795969, 787872, 780634, 774112, 768683, 765076, 763282, 762493, 762167, 762507, 763931, 766827, 771737, 778966, 788004, 798085, 809317, 822645, 838772, 857785, 879657, 904306, 931274, 960233, 991849, 1027429, 1067783, 1113204, 1164384, 1222363]
57562A222363O5249P2614Q0979R1254J02779J14264J25805J38638J53147J68319
57552B335411J83057J96898K09350K19247K24829K23893K14111J93919J63135
57543D163850J22543P3542J8887l6836q8575j32760j67641j92515k07674k14673
57533C338148k15434k10986k01819j89153j74776j59705j44106j28630j14579
57524A798960j02408r1131p9909o9364o0553n3216m5978l8143l0495k4159j9207
57513A184397j4642r562l954J603O803J1946J7489K3449K9428L5111M0647M6542
57501A369257N3263O1011O9778P9534R0257J01857J14238J27527J41907J57096
57491B365725J72155J86086J98218K07584K12144K09275J97068J74744J42033
$$ y = [1222363, 1287612, 1360226, 1441205, 1532459, 1635238, 1749502, 1875307, 2013945, 2167092, 2335411, 2518468, 2715366, 2924716, 3143963, 3368792, 3592685, 3806796, 4000715, 4163850, 4286393, 4359935, 4378822, 4341986, 4253411, 4120651, 3953010, 3760495, 3552821, 3338148, 3122714, 2911728, 2709909, 2520756, 2345980, 2186275, 2042169, 1913539, 1798960, 1696552, 1605421, 1525512, 1456148, 1395595, 1342379, 1296401, 1258258, 1227763, 1203604, 1184397, 1169755, 1160193, 1156239, 1157842, 1164645, 1176591, 1194080, 1217529, 1246957, 1282068, 1322715, 1369257, 1422520, 1483531, 1553309, 1632843, 1723100, 1824957, 1939195, 2066722, 2208629, 2365725, 2537880, 2723966, 2922184, 3129768, 3341912, 3551187, 3748255, 3922999, 4065032]
57482D065032R9112M7647q523o4285j15044j57777j91033k14344k27832k32348
57472C000605k29731k22256k11449j97779j81954j65831j51141j37706j24176
57463A378582j10466r8215q8542q0611p3036o5611n8937n3147m7943m3292l9162
57452F19620l5056l0644k6524k3592k1850k0586j9440j8570j7888j6955j5658
57441C72857j4366j3348j2543j1879j1337j0647r505q243p719q208q794q316o726
57428B41226n156m552m653m525l893l493l973m909n297m779l909l307l054k926
57414A82800k736k360j795j349j377j749j903j575j100q76j002j429k094k664
57400A58791k677k107j429r80o08j40K78M86N47N23L60K02L82Q89J253J149P70
$$ y = [4065032, 4164144, 4211791, 4203268, 4138983, 4023939, 3866162, 3675129, 3460785, 3232953, 3000605, 2770874, 2548618, 2337169, 2139390, 1957436, 1791605, 1640464, 1502758, 1378582, 1268116, 1169901, 1081359, 1000748, 927712, 862101, 803164, 750017, 702074, 658782, 619620, 584564, 553920, 527396, 503804, 481954, 461368, 441928, 423358, 405470, 388515, 372857, 358491, 345143, 332600, 320721, 309384, 298737, 289232, 280989, 273270, 265062, 256268, 247952, 241226, 236070, 231518, 226865, 222340, 218447, 214954, 210981, 206072, 200775, 195996, 192087, 188780, 185726, 182800, 180064, 177704, 175909, 174560, 173183, 171434, 169531, 167956, 166856, 165980, 164978, 163549, 161455, 158791, 156114, 154007, 152578, 151598, 150990, 150850, 151128, 151614, 152161, 152684, 153044, 153246, 153628, 154517, 155770, 156919, 157689]
57383A57689M57L97P67J612K388K290J286L31J94N84P76N00j09q65j417j287n86
57366A65007j48n06j106j151p15m77o47q38p66n13j89K25O99J222J835K448K804
57349A67184K910L199L955M796N102M735M080L607L575L908M170M032L823M207
57335B23283N223O155O616P026P736Q411Q767R226J0190J1238J1705J1709J1903
57322C39188J2607J3750J5320J7235J9097K0576K1813K3016K4091K5095K6506
57311E58294K8483L0385L1638L2550L3582L4415L4542L4174L3637L2377K9556
57300I13633K5215J9794J3061M750m129j2056j8997k6107l3359l9043m2089m3469
57288G57204m4542m5131m4232m1716l8324l4559l0506k6395k2576j9058j5709
$$ y = [157689, 158146, 158543, 159310, 160922, 163310, 165600, 166886, 167217, 167411, 167995, 168771, 169271, 169162, 168297, 166880, 165593, 165007, 164859, 164353, 163247, 162096, 161381, 160904, 160257, 159419, 158653, 158140, 157951, 158176, 158875, 160097, 161932, 164380, 167184, 170094, 173293, 177248, 182044, 187146, 191881, 195961, 199568, 203143, 207051, 211221, 215253, 219076, 223283, 228506, 234661, 241277, 248303, 256039, 264450, 273217, 282443, 292633, 303871, 315576, 327285, 339188, 351795, 365545, 380865, 398100, 417197, 437773, 459586, 482602, 506693, 531788, 558294, 586777, 617162, 648800, 681350, 714932, 749347, 783889, 818063, 851700, 884077, 913633, 938848, 958642, 971703, 976453, 972324, 960268, 941271, 915164, 881805, 842762, 800673, 757204, 712662, 667531, 623299, 581583, 543259, 508700, 478194, 451799, 429223, 410165, 394456]
57277C94456j2716j0324q295o131l816j885p70l83l14j65K82R77J591J821J709
57262C56037J611J838K341K756K724K236J694J605K221L355M483N063N016M872
57248C97852N246O158P183Q163R243J0138J0070Q900P745P878R382J1355J3106
57235E12419J4496J5459J5905J6016J6088J6157J6252J6771J7900J8976J9139
57224F95578J8572J8362J9086K0260K1246K2052K3025K4277K5629K6745K7261
57213I42093K7229K7391K8519L0419L2080L2824L2784L2330L1665L1145L1318
57202A279797L2328L3649L4749L5710L6995L8826M0928M2783M4149M5460M7490
57191A712864N0421N3504N5966N7882N9711O1433O2816O4156O5883O7653O8687
$$ y = [394456, 381740, 371416, 363121, 356990, 353174, 351289, 350519, 350136, 349822, 349657, 349939, 350916, 352507, 354328, 356037, 357648, 359486, 361827, 364583, 367307, 369543, 371237, 372842, 375063, 378418, 382901, 387964, 392980, 397852, 403098, 409256, 416439, 424602, 433845, 443983, 454053, 462953, 470698, 478576, 487958, 499313, 512419, 526915, 542374, 558279, 574295, 590383, 606540, 622792, 639563, 657463, 676439, 695578, 714150, 732512, 751598, 771858, 793104, 815156, 838181, 862458, 888087, 914832, 942093, 969322, 996713, 1025232, 1055651, 1087731, 1120555, 1153339, 1185669, 1217334, 1248479, 1279797, 1312125, 1345774, 1380523, 1416233, 1453228, 1492054, 1532982, 1575765, 1619914, 1665374, 1712864, 1763285, 1816789, 1872755, 1930637, 1990348, 2051781, 2114597, 2178753, 2244636, 2312289, 2380976]
57180B380976O8959O9164O9563O9773O9874P0797P3222P6546P9052P8679P3989
57169C180594O5414N5687M8052M3787M1961M1381M1664M2419M2804M2500M2053
57158C688316M1726M0957L9551L8357L7969L7630L6278L4025L1751K9849K8216
57147D084625K7024K6495K6144K5034K2825K0049J7439J5293J3412J1353Q911
57136D298604O482M560K990J127j185l480n583p821j0097j1546j1596j0615r173
57123D242667p317n003k508l5K345M051M130K536L89j262j988r28L397J1350K1347
57108D273171L1633M2026N3207O5564P9928R8574J24410J59867K07218K68626
57098E404224L44823M35100N39950O62557Q06378R72308J159038J363814J580672
$$ y = [2380976, 2449935, 2519099, 2588662, 2658435, 2728309, 2799106, 2872328, 2948874, 3027926, 3106605, 3180594, 3246008, 3301695, 3349747, 3393534, 3435495, 3476876, 3518540, 3560959, 3603763, 3646263, 3688316, 3730042, 3770999, 3810550, 3848907, 3886876, 3924506, 3960784, 3994809, 4026560, 4056409, 4084625, 4111649, 4138144, 4164288, 4189322, 4212147, 4232196, 4249635, 4264928, 4278340, 4289693, 4298604, 4305086, 4309646, 4312636, 4313763, 4312578, 4309098, 4303515, 4295694, 4285597, 4274051, 4262455, 4251840, 4242667, 4235350, 4230347, 4227839, 4227804, 4230149, 4234200, 4238330, 4240866, 4241255, 4239993, 4238005, 4237077, 4240474, 4251824, 4273171, 4304804, 4346830, 4400037, 4465601, 4545529, 4644103, 4768513, 4928380, 5135598, 5404224, 5749047, 6184147, 6724097, 7386654, 8193032, 9165340, 10324378, 11688192, 13268864]
57089A3268864J799956K012300K210916K385379K513694K566607K526066K403971
57081C1687753K246071K114671K053120K049016K026548J886066J566822J081241
57073D6711308M95966j12490o85426j184736j590867j905724k149658k346267
57065C7232106k506722k626762k694584k699892k639286k518168k349240k148428
57057A7049024j931388j712100j501896j307920j133041r78028q43276p28313
57049F913062o31066n48804m79445m21272l72108l29703k92745k60861k33730
57040C343328k10617j90529j72498j55906j40824j27791j17000j07899r9755r2281
57030A928228q5518p9361p3549o7990o2884n8578n5252n2664n0198m7346m4188
$$ y = [13268864, 15068820, 17081120, 19292036, 21677415, 24191109, 26757716, 29283782, 31687753, 33933824, 36048495, 38101615, 40150631, 42177179, 44063245, 45630067, 46711308, 47207274, 47094784, 46409358, 45224622, 43633755, 41728031, 39578373, 37232106, 34725384, 32098622, 29404038, 26704146, 24064860, 21546692, 19197452, 17049024, 15117636, 13405536, 11903640, 10595720, 9462679, 8484651, 7641375, 6913062, 6281996, 5733192, 5253747, 4832475, 4460367, 4130664, 3837919, 3577058, 3343328, 3132711, 2942182, 2769684, 2613778, 2472954, 2345163, 2228163, 2120264, 2020509, 1928228, 1842710, 1763349, 1689800, 1621810, 1558926, 1500348, 1445096, 1392432, 1342234, 1294888, 1250700]
57019A250700m1181l8564l6169l3768l1396k9297k7734k6706k5771k4310k2186
57008I13618j9920j7919j5868j3197r817n852j027N043J2161K0003K9287M1612
56996I38124N7811P7082R8338J21974J49687J81974K14955K38777K39747K06841
56986B525310J39417N0325l9129j09466j51491j67723j67335j59511j49716j39805
56976A630876j29798j19267j07950r6093q4358p3294o2957n3255m4291l6184k8934
56965G94495k2768j8221j5281j2794r350m570R86O899J3026J8537K1591K0287
56953G92837J3745K579j0960k3421l1781l5185l4859l2373k8580k4130j9908j6410
56941E51554j3264r918o388k929O13M636R177J3876J8531K3452K9080L5000L9039
$$ y = [1250700, 1209519, 1170955, 1134786, 1101018, 1069622, 1040325, 1012591, 985885, 960114, 935804, 913618, 893698, 875779, 859911, 846714, 836897, 831045, 830018, 835061, 847222, 867225, 896512, 938124, 995935, 1073017, 1171355, 1293329, 1443016, 1624990, 1839945, 2078722, 2318469, 2525310, 2664727, 2715052, 2675923, 2566457, 2414966, 2247243, 2079908, 1920397, 1770681, 1630876, 1501078, 1381811, 1273861, 1177768, 1093410, 1020116, 957159, 903904, 859613, 823429, 794495, 771727, 753506, 738225, 725431, 716081, 711511, 712497, 719396, 732422, 750959, 772550, 792837, 806582, 809161, 798201, 774780, 742999, 707814, 672955, 640582, 612002, 587872, 567964, 551554, 538290, 528372, 521984, 519055, 519668, 524304, 533481, 547357, 565888, 589340, 618420, 653420, 692459]
56928F92459L7862K9305J4490k715j8289k9921l6934l9663l9193l6833l3322k8975
56916E08271k4546k1085j8657j6215j3183j0348q581p537o349m956l903l358l066
56903C66487k885k654j863k56J498K493K698K832L350M154N012N761O240O657
56889C99524P757J0034J3046J5962J8387J9890J9207J5000P513j301r365j5541
56877E00113j9349k0589j9543j6939j3406r388n553k575l43K057N379R615J4447
56864D23926J9703K5252L1038L7527M5357N3874O0165O0190N1273L3933J1755
56853H53993j0304k8097l9570m4700m4617m0923l5276k8894k2253j5408q599k166
56841E33186L987J0499J7996K6655L6271M6649N8085P1362Q6310R9420J03486
$$ y = [692459, 730321, 759626, 774116, 771401, 753112, 723191, 686257, 646594, 607401, 570568, 537246, 508271, 483725, 462640, 443983, 427768, 414585, 404237, 395656, 388119, 381770, 376814, 372911, 369553, 366487, 363602, 360948, 359085, 358829, 360327, 362820, 365518, 368350, 371700, 375854, 380866, 386627, 392867, 399524, 407281, 417315, 430361, 446323, 464710, 484600, 503807, 518807, 526320, 525019, 515654, 500113, 480764, 460175, 440632, 423693, 410287, 400899, 395346, 392771, 392428, 394485, 399864, 409479, 423926, 443629, 468881, 499919, 537446, 582803, 636677, 696842, 757032, 808305, 842238, 853993, 843689, 815592, 776022, 731322, 686705, 645782, 610506, 581612, 559359, 543951, 535352, 533186, 537173, 547672, 565668, 592323, 628594, 675243, 733328, 804690, 891000, 990420, 1093906]
56830A093906R1526O2374K2401j8377n1786p3979q4697q5869q0669p2365o3059
56819G39406n3446m3664l4020k4880j6336q261n00P285J5749K5502L6658M8917
56807F92410O1663P3035P8650P2635N1824J9517j5632m4970o4158p3110p3692
56796G78172o8536o0750n2808m5357l7765k9770k1959j4898q667l262J367N810
56784D41577J1007J7404K4727L2400L9381M3512M1972L3070J7607j359j9654l3367
56772F48277m0440m1585l9297l5664l1477k7134k3360k0567j8269j5821j3266
56761C41397j1100r538q475p736p057o156n139m540m588m798m535l731k772k011
56747B59221j628j684k016k349k622k929l059k662j919j623k183l057l450l160
$$ y = [1093906, 1185432, 1247806, 1270207, 1251830, 1200044, 1126065, 1041368, 955499, 874830, 802465, 739406, 685960, 642296, 608276, 583396, 567060, 558799, 558299, 565584, 581333, 606835, 643493, 692410, 754073, 827108, 905758, 978393, 1030217, 1049734, 1034102, 989132, 924974, 851864, 778172, 709636, 648886, 596078, 550721, 512956, 483186, 461227, 446329, 437662, 434400, 435767, 441577, 452584, 469988, 494715, 527115, 566496, 610008, 651980, 685050, 702657, 701298, 681644, 648277, 607837, 566252, 526955, 491291, 459814, 432680, 409320, 388753, 370484, 354663, 341397, 330297, 320759, 312284, 304548, 297491, 291335, 286196, 281656, 277068, 272270, 267735, 264004, 261232, 259221, 257593, 255909, 253893, 251544, 248922, 245993, 242934, 240272, 238353, 236730, 234547, 231490, 228040, 224880]
56733B24880k477j697j046p18o14m42k62n01j138j461j011k11M03Q48J153P48
56717B16454o43k070k258j310o18j017j823j901j025J05P21N85N0k82o3M98R31
56700B06334J015Q96Q17Q79R55P06m3q60r98l60K19J4p34j344j649j780j556q25
56682B01686j58k49p68p09N6N07m3j089j816k076j956j251j8R23Q38R0l85l14
56664A93268j41j20j16k33q41j785k289j889r24P1R00J351R80j37r80n81O73J472
56646A88679J208N12J05r2m49q26q31n00j87M4M57J103J593J539R89M15K66N14
56628A94539O54L60K8L02J073J453J011M22M56Q72Q66L09j90k69j71j59k05k71
56610B01080m28o21p57r32j162j078l84M90Q19O23N85R70J294J172P91M14Q5k0
$$ y = [224880, 222403, 220706, 219660, 218942, 218328, 217886, 217624, 217123, 215985, 214524, 213513, 213302, 213705, 214553, 215706, 216454, 215811, 213741, 211483, 210173, 209555, 208538, 206715, 204814, 203789, 203894, 204615, 205200, 205250, 204968, 204905, 205403, 206334, 207349, 208245, 209062, 209941, 210896, 211602, 211559, 210699, 209701, 209341, 209560, 209574, 208840, 207496, 205847, 204067, 202511, 201686, 201528, 201279, 200511, 199802, 199858, 200365, 200322, 199233, 197417, 195341, 193385, 192134, 192116, 193039, 193877, 193967, 193582, 193268, 193127, 193007, 192891, 192658, 191817, 190032, 187743, 185854, 184930, 185001, 185901, 187252, 188232, 188095, 187115, 186534, 187207, 188679, 189887, 190399, 190504, 190412, 189963, 189137, 188306, 187806, 187619, 187663, 188120, 189223, 190816, 192355, 193344, 193759, 194025, 194539, 195193, 195553, 195581, 195883, 196956, 198409, 199420, 199842, 200298, 201170, 202036, 202345, 202155, 201886, 201715, 201556, 201351, 201080, 200652, 200031, 199274, 198342, 197180, 196102, 195718, 196208, 197027, 197650, 198235, 199205, 200499, 201671, 202462, 202876, 202961, 202941]
56592B02941L55R47J159J009J184J840K166J603P65N09P92J020J047J067J003
56577B19407P33N84R44J566J885J833J742J639J268P46N56Q85J461K068K755L462
56561B43534L881L885L761L872M282M748M964M740M136L426K816K196J301Q1j121
56546B90502j784j612q94l57n71j429k388l097l550l759l694l498l359l163k770
56531B54577k585l181m254m686l945k783k052j520n33P03J293R61L11j43n53j152
56515B30458j652j675j398j426j955k415k100j124l90m69q58o40L38J414K061
56500B18169K299K255J926J453J089P77L55J57P07J720K152J599Q20N05L04l60
56484B35927j123j116j57J046J719J581Q50J25j2M05P91P90O49O62P84J019J531
$$ y = [202941, 203296, 204243, 205402, 206411, 207595, 209435, 211601, 213204, 213969, 214478, 215270, 216290, 217337, 218404, 219407, 220140, 220724, 221668, 223234, 225119, 226952, 228694, 230333, 231601, 232347, 232903, 233788, 235249, 237317, 240072, 243534, 247415, 251300, 255061, 258933, 263215, 267963, 272927, 277667, 281803, 285229, 288045, 290241, 291542, 291623, 290502, 288718, 287106, 286212, 285855, 285284, 283855, 281467, 278370, 274820, 271061, 267367, 263869, 260510, 257347, 254577, 251992, 248811, 244557, 239871, 235926, 233143, 231091, 229571, 229038, 229741, 231034, 231995, 232306, 232163, 231610, 230458, 228806, 227131, 225733, 224307, 222352, 219937, 217837, 216713, 216323, 215854, 214996, 214356, 214694, 216108, 218169, 220468, 222723, 224649, 226102, 227191, 227968, 228323, 228480, 229187, 230907, 233059, 234658, 235478, 235983, 236287, 235927, 234804, 233688, 233531, 234577, 236296, 237877, 238727, 238852, 238840, 239245, 240036, 240826, 241475, 242137, 242921, 243940, 245471]
56467B45471K113K239J962K033K634K861K102J087P86R47O79q6o73q25p84n42
56451B62004O4P01R04Q86J165J607J701J618J974K591K499J426L25O5K94O6q91
56434B78999j986k549k475k139j907j777j555j327j441j898k208k074j777j538
56420B52348j025l2Q30Q09J48k27PK05k44j121j721j609r80m44m09n73l02M24
56402B46084R61J066J333K073K473J668J64o28j40R22J709K044K070J813J318
56387B64930Q12N97Q61J533K158K236J861J673J936K133J835J356J143J008O62
56372B86734M19O99J201J360J300J563K039K026J290N31O62J971L878N343N733
56357C16749N483N642O546P555Q159Q552Q808Q421P302O315O003N663M527L112
$$ y = [245471, 247584, 249823, 251785, 253818, 256452, 259313, 261415, 262502, 263288, 264235, 264914, 264828, 264155, 263330, 262546, 262004, 262068, 262769, 263673, 264559, 265724, 267331, 269032, 270650, 272624, 275215, 277714, 279140, 279465, 279530, 279824, 279890, 278999, 277013, 274464, 271989, 269850, 267943, 266166, 264611, 263284, 261843, 259945, 257737, 255663, 253886, 252348, 251323, 251291, 252121, 252930, 253078, 252851, 252858, 253063, 252819, 251698, 249977, 248368, 247388, 246944, 246535, 245962, 245660, 246084, 247045, 248111, 249444, 251517, 253990, 255658, 255822, 255194, 255054, 255976, 257685, 259729, 261799, 263612, 264930, 265742, 266339, 267200, 268733, 270891, 273127, 274988, 276661, 278597, 280730, 282565, 283921, 285064, 286072, 286734, 287153, 287852, 289053, 290413, 291713, 293276, 295315, 297341, 298631, 299162, 299824, 301795, 305673, 311016, 316749, 322232, 327874, 334420, 341975, 350134, 358686, 367494, 375915, 383217, 389532, 395535, 401198, 405725, 408837]
56343D08837K319J906J013l00j194j450j562j725j706j539j503j619j865k497
56329C97115l424l816l256k642k906l430l011j870j305j583j643r33j98j94o59
56314C66245q87m89M59J482J935J733J624K154K807K928K885L422M391N135N667
56299D01491O292O660O307N796O037O848P351P509P987Q851R688J0687J2205J3608
56285E17317J3934J3662J4273J6162J8283J9808K0853K1679K2553K4339K7837
56274G30700L2452L6792M0589M4740M9629N4796O0268O6687P3960Q1208Q8155
56263A359976R5362J02973J10407J17290J23444J28073J30281J30297J28893J25713
56253B552709J19598J10382R8934Q5746P1123N6480M3536L2178K1039J0251J571
$$ y = [408837, 411156, 413062, 414075, 413775, 412581, 411131, 409569, 407844, 406138, 404599, 403096, 401477, 399612, 397115, 393691, 389875, 386619, 383977, 381071, 377641, 374630, 372760, 371455, 369872, 368229, 367296, 367098, 366904, 366245, 365358, 364869, 365328, 366810, 368745, 370478, 372102, 374256, 377063, 379991, 382876, 386298, 390689, 395824, 401491, 407783, 414443, 420750, 426546, 432583, 439431, 446782, 454291, 462278, 471129, 480817, 491504, 503709, 517317, 531251, 544913, 559186, 575348, 593631, 613439, 634292, 655971, 678524, 702863, 730700, 763152, 799944, 840533, 885273, 934902, 989698, 1049966, 1116653, 1190613, 1271821, 1359976, 1455338, 1558311, 1668718, 1786008, 1909452, 2037525, 2167806, 2298103, 2426996, 2552709, 2672307, 2782689, 2881623, 2967369, 3038492, 3094972, 3138508, 3170686, 3191725, 3201976, 3203547]
56242C203547m426r267j4238j9050k3442k8245l4084m0618m7758n6201o6020p6003
56230B784195q4935r2460r8446j02825j06248j09439j11738j11702j09218j05417
56220A751767j00661r4543q7836q2135p7151p0745o2362n4242m8160m3195l7806
56209I92931l2237k7444k3268j9078j5066j1775r222p291o063n247m384l890m574
56196H23392o060p113p632q577r888j0409j0133j0320j1075j1059j0102r656j0022
56183G01346r606p865o447o312o133m880l597l197k688j226J69N70Q78J979K999
56168F55990L052L030L991N356O227O928P840Q265P861P643Q228Q713Q558Q821
56154G50503J0239J1846J2986J4823J8292K2340K5701K8795L2387L6165M0251
$$ y = [3203547, 3199121, 3189854, 3175616, 3156566, 3133124, 3104879, 3070795, 3030177, 2982419, 2926218, 2860198, 2784195, 2699260, 2606800, 2508354, 2405529, 2299281, 2189842, 2078104, 1966402, 1857184, 1751767, 1651106, 1556563, 1468727, 1386592, 1309441, 1238696, 1176334, 1122092, 1073932, 1030737, 992931, 960694, 933250, 909982, 890904, 875838, 864063, 854841, 847550, 841487, 836240, 831856, 827966, 823392, 817332, 810219, 802587, 794010, 784122, 773713, 763580, 753260, 742185, 731126, 721024, 711368, 701346, 691740, 683875, 677428, 671116, 664983, 660103, 656506, 653309, 650621, 649395, 649564, 650134, 651012, 652991, 655990, 659042, 662072, 666063, 671419, 677646, 684574, 692414, 700679, 708540, 716183, 724411, 733124, 741682, 750503, 760742, 772588, 785574, 800397, 818689, 841029, 866730, 895525, 927912, 964077, 1004328]
56143A004328M6369N5951O8655Q4074J02959J25207J48546J70872J92029K11540
56133B210530K26559K33895K32461K22226K03230J77862J52120J31944J19065
56124C909892J11569J06230R8468Q2705N6263K2425j2097m1686o2991p4679p9126
56113D116973q2853r2360j09797j33600j61141j88547k10179k21545k22318k14838
56103B479795k01043j82587j62138j42106j23058j05097q9268p6030o4117n2785
56093A281566m3356l6738l1368k5636k0308j6577j3746j0946q943q181p230n277
56081A053260l828l744l184q70J362J837K069L636M957M393L743N150P168P544
56067A083493P422Q948J1040J1526J1413J2924J5192J5908J5535J6012J6917J6757
$$ y = [1004328, 1050697, 1106648, 1175303, 1259377, 1362336, 1487543, 1636089, 1806961, 1998990, 2210530, 2437089, 2670984, 2903445, 3125671, 3328901, 3506763, 3658883, 3790827, 3909892, 4021461, 4127691, 4226159, 4308864, 4365127, 4387552, 4375455, 4333769, 4270778, 4196099, 4116973, 4034120, 3941760, 3831963, 3698363, 3537222, 3348675, 3138496, 2916951, 2694633, 2479795, 2278752, 2096165, 1934027, 1791921, 1668863, 1563766, 1474498, 1398468, 1334351, 1281566, 1238210, 1201472, 1170104, 1144468, 1124160, 1107583, 1093837, 1082891, 1073948, 1065767, 1058537, 1053260, 1049432, 1045688, 1042504, 1041634, 1042996, 1044833, 1046902, 1050538, 1055495, 1059888, 1063631, 1068781, 1075949, 1083493, 1090915, 1099863, 1110903, 1122429, 1133842, 1146766, 1161958, 1177866, 1193401, 1209413, 1226330, 1243087]
56055A243087J6408J7482J8914J8905J8503J9491K0618J9768J8062J7853J8489
56044A447580J8094J7578J8766K0481K0707K0817K3231K6719K8303K8149K8281
56033A698706K8490K7822K8059L1089L4845L6517L7574M0840M4913M6649M7021
56022B102525M9108N2285N3869N4618N7145O0653O2707O4289O7658P1224P2039
56011B768120P1345P2137P3561P3359P3262P6022P9849Q1933Q4436R0595R8185
56000C642804J03590J08897J17638J27258J33688J39580J49565J61189J69493
55991D853702J76769J88287K02197K13786K25717K43376K63900K81268K98369
55982F947371L21974L49749L75001M00307M32713M69553N03797N39420N85666
$$ y = [1243087, 1259495, 1276977, 1295891, 1314796, 1333299, 1352790, 1373408, 1393176, 1411238, 1429091, 1447580, 1465674, 1483252, 1502018, 1522499, 1543206, 1564023, 1587254, 1613973, 1642276, 1670425, 1698706, 1727196, 1755018, 1783077, 1814166, 1849011, 1885528, 1923102, 1963942, 2008855, 2055504, 2102525, 2151633, 2203918, 2257787, 2312405, 2369550, 2430203, 2492910, 2557199, 2624857, 2696081, 2768120, 2839465, 2911602, 2985163, 3058522, 3131784, 3207806, 3287655, 3369588, 3454024, 3544619, 3642804, 3746394, 3855291, 3972929, 4100187, 4233875, 4373455, 4523020, 4684209, 4853702, 5030471, 5218758, 5420955, 5634741, 5860458, 6103834, 6367734, 6649002, 6947371, 7269345, 7619094, 7994095, 8394402, 8827115, 9296668, 9800465, 10339885, 10925551]
55973A0925551O40220O95129P55362Q32996R27145J029802J147547J295344J472874
55964A9721970J671903J903977K194287K552350K980348L508096M184128N031970
55956D3749029O052784P269712Q726091J0446698J2465590J4901031J7939242
55949A21550177K1751963K6526961L2509081L9610112M6552056N0442027M7794449
55942C86736826L6716023J8563608k410608k1206677l4383592m1056472m2372372
55935C00586736m0277938l6505461l2181165k7907131k3968341k0464427j7383524
55928A01898749j4679156j2325834j0312987q614308p190068o008935n045217
55921C7722244m261926l617398l084952k650152k293952j994640j741794j532741
$$ y = [10925551, 11565771, 12260900, 13016262, 13849258, 14776403, 15806205, 16953752, 18249096, 19721970, 21393873, 23297850, 25492137, 28044487, 31024835, 34532931, 38717059, 43749029, 49801813, 57071525, 65797616, 76244314, 88709904, 103610935, 121550177, 143302140, 169829101, 202338182, 241948294, 288500350, 338942377, 386736826, 423452849, 442016457, 439605849, 418399172, 384015580, 342959108, 300586736, 260308798, 223803337, 191622172, 163715041, 139746700, 119282273, 101898749, 87219593, 74893759, 64580772, 55966464, 48776396, 42767461, 37722244, 33460318, 29842920, 26757968, 24107816, 21813864, 19819224, 18077430, 16544689]
55913A6544689j358263j205448j070984r57854q61815p73874o93237o25181n68397
55904H429636n16249m68276m28735l95702l62798l30350l03903k83038k62091
55895E078494k40782k23922k11292j97688j82603j70528j61813j52157j41114
55886C396595j32471j26235j18415j08852j01442r6489r0403q2983p7588p3975
55876B387742o8336o0653n4999n2223m9117m5017m2517m1372l8361l3733l1319
55865A870095l1781l1983l1462l3140l6925l8931l8016l7234l7760l7201l4978
55854A480684l3743l4013l2754k8628k3834j9488j4050p638l350l013n767j1460
55842A262946k0872l1663l8824m0557l9692l8408l5806l1639k7905k5343k2307
$$ y = [16544689, 15186426, 13980978, 12909994, 11952140, 11090325, 10316451, 9623214, 8998033, 8429636, 7913387, 7445111, 7016376, 6620674, 6257876, 5927526, 5623623, 5340585, 5078494, 4837712, 4613790, 4402498, 4204810, 4022207, 3851679, 3689866, 3537709, 3396595, 3264124, 3137889, 3019474, 2910622, 2809180, 2712691, 2622288, 2539305, 2461717, 2387742, 2319406, 2258753, 2203754, 2151531, 2102414, 2057397, 2014880, 1973508, 1935147, 1901414, 1870095, 1838314, 1806331, 1774869, 1741729, 1704804, 1665873, 1627857, 1590623, 1552863, 1515662, 1480684, 1446941, 1412928, 1380174, 1351546, 1327712, 1308224, 1294174, 1286536, 1283186, 1280173, 1274406, 1262946, 1242074, 1210411, 1171587, 1131030, 1091338, 1052930, 1017124, 985485, 957580, 932237, 909930]
55831I09930j8462j5784j4739j3247j0626q846q702q463p574q032j0651j3289
55819G71515j4297j4629j5212j5206j4216j3409j3275j2791j1741j1270j1447
55808F24022j0897r520q885r372r609r231r359r818q867o346m300l886m242m935
55794E14755o646q917j0074r940r947j0192r300p472o521o335m698j361Q74J79
55780D24405k276n178q812j2756j4901j4336j2733j1584j0456q984q051p872p254
55767B99212n946n338n825n860m692l670l712l853l427l391m244m787m155l143
55753B37169k463j641n11K73J001L002O035P831P320O062N370M252J619j425l040
55738B70854k950k062j231j207k360l687l523j851k75O02J834L665M637M001K984
$$ y = [909930, 891468, 875684, 860945, 847698, 837072, 828226, 819524, 811061, 803487, 795455, 784804, 771515, 757218, 742589, 727377, 712171, 697955, 684546, 671271, 658480, 646739, 635469, 624022, 613125, 603605, 594720, 585348, 575739, 566508, 557149, 547331, 538464, 532118, 527818, 523932, 519690, 514755, 508109, 499192, 489118, 479178, 469231, 459039, 449739, 442267, 435746, 429411, 424713, 423352, 424226, 424405, 422129, 416951, 408139, 395383, 380482, 366146, 353413, 341829, 331373, 322389, 314338, 306466, 299212, 293266, 287928, 282103, 276243, 271551, 267881, 264169, 260316, 256889, 253498, 249254, 244467, 240312, 237169, 234706, 233065, 232554, 232827, 233828, 236830, 242865, 250696, 258016, 264078, 269448, 273700, 275319, 273894, 270854, 267904, 265842, 264611, 263404, 261044, 257357, 253834, 251983, 251708, 252310, 254144, 257809, 262446, 266447, 269431]
55723B69431K744K911K992L358L961L925L239L033L360K611M0k941m887o000o862
55708B80915p192o785o064n055l329j439o53r29j000q20j703l535m293l088j351
55693B33679k21R25K358K902K166J662K332L067K915K650K831K448J049J69J015
55678B61947K477L004K774K528J958P43k84n08o59j300j746j689k263m036n599
55663B57347n650n023n105n619n565n122n045n228n160m934m693m089l192k787
55649A90135k968k873k502l145m988o170n459m144l856m176l958l460l464l547
55635A35425k944k067j715j758j883k447l407l567k270o65rN9L19L70l38j089
55619A12014j014n63n16o55o01p93j376j345k25O63P6j194j715j606j699j713
$$ y = [269431, 272175, 275086, 278078, 281436, 285397, 289322, 292561, 295594, 298954, 301565, 301605, 298664, 293777, 287777, 280915, 273723, 266938, 260874, 255819, 252490, 251051, 250398, 249469, 248469, 247649, 245946, 242411, 238118, 235030, 233679, 233458, 234383, 236741, 239643, 241809, 243471, 245803, 248870, 251785, 254435, 257266, 259714, 260763, 260932, 261947, 264424, 267428, 270202, 272730, 274688, 275431, 275147, 274639, 273980, 272680, 270934, 269245, 266982, 262946, 257347, 251697, 246674, 241569, 235950, 230385, 225263, 220218, 214990, 209830, 204896, 200203, 196114, 192922, 190135, 187167, 184294, 181792, 178647, 173659, 167489, 162030, 157886, 154030, 149854, 145896, 142436, 138972, 135425, 132481, 130414, 128699, 126941, 125058, 122611, 119204, 115637, 113367, 112702, 112693, 112752, 113071, 113441, 113103, 112014, 111000, 110437, 109921, 109266, 108665, 107872, 106496, 105151, 104926, 105589, 105665, 104471, 102756, 101150, 99451, 97738]
55603I7738r58J2K24n0J04N56O21M36N62Q21P71O81Q54Q20L12J34Q75J701J701
55584A07915J430J795K358K221J715J741K145K239K158K459K883K900K871L480
55570A40310M587N626O578P615Q572R498J0761J1756J0810P424L399N56j383l440
55556B22669n317o152o192o102n758n072m855n438n615m510l198k852k695j669
55542A57244p34j340k752l197k815l098m137m678m502m496m737m534m097m178
55528A07949m408l901l103l074l378k756j588j407k164k240j281p21j178j505
55514G5245r82m68p37j271j422j374j298q77k45k19r72j531j069N7Q84Q11r0j110
55496F3332j322o10j3l24q71o26O9Q4o68j206j039n08J05O64P06qp66q69p77j175
$$ y = [97738, 96780, 96792, 97016, 96966, 97070, 97626, 98247, 98683, 99245, 100066, 100837, 101518, 102372, 103192, 103504, 103638, 104513, 106214, 107915, 109345, 111140, 113498, 115719, 117434, 119175, 121320, 123559, 125717, 128176, 131059, 133959, 136830, 140310, 144897, 150523, 157101, 164716, 173288, 182786, 193547, 205303, 216113, 223537, 226936, 227492, 226109, 222669, 217352, 211200, 205008, 198906, 193148, 188076, 183221, 177783, 172168, 167658, 164460, 161608, 158913, 157244, 156510, 155170, 152418, 149221, 146406, 143308, 139171, 134493, 129991, 125495, 120758, 116224, 112127, 107949, 103541, 99640, 96537, 93463, 90085, 87329, 85741, 84334, 82170, 79930, 78649, 77928, 76750, 75245, 74263, 73795, 73058, 71787, 70365, 68991, 67693, 66816, 66571, 66352, 65380, 63849, 62780, 62837, 63721, 64532, 64442, 63332, 62010, 61400, 61387, 61063, 60192, 59566, 59635, 59719, 59051, 57845, 56806, 56298, 56403, 57067, 57773, 57765, 56999, 56130, 55353, 54178]
55476E4178j564j121k96k3l3M44R10M25m46m20J33j70j018o74R43J806Q81m69
55458E3486p75k94J59M56N43Q3n67m88J90K38n94r81j67Q80J168J034J010P37
55440E6118K2l12K78R78P89m7p66j308j897k128j464j62J010J676J945J980J886
55423E8598J729J382P51J70P0K55J85q2j8K95K27k20k75L30R13R68Q14P65N77
55404F7434J45k9M13J070J315R41K7j245k460l083k917k119r40J95O35K46j39
55387E9489K59J068J488J573J780J733P88m98r66p19r19j737k177j880j570j374
55371E6338n35P83J091k30j844k367k006j471o35O20J454J139L12k1J9k97q69
55354E1481j015p72q67j464j805j231k2R43J115P49N21P15R46Q24M93K73R9k01
$$ y = [54178, 52614, 51493, 51197, 51174, 51141, 51585, 52495, 52920, 52474, 52054, 52187, 52017, 50999, 50325, 51268, 53074, 53955, 53486, 52711, 52417, 52576, 53032, 53575, 53658, 53091, 52603, 52793, 53031, 52437, 51456, 51289, 52169, 53337, 54371, 55381, 56118, 56140, 55828, 56106, 57084, 57873, 57826, 57060, 55752, 53855, 51727, 50263, 50101, 51111, 52787, 54732, 56712, 58598, 60327, 61709, 62460, 62630, 62700, 62955, 63140, 63058, 63040, 63335, 63562, 63342, 63067, 63397, 64310, 65278, 66092, 66857, 67434, 67579, 67550, 67963, 69033, 70348, 71289, 71316, 70071, 67611, 64528, 61611, 59492, 58552, 58747, 59382, 59628, 59489, 59748, 60816, 62304, 63877, 65657, 67390, 68178, 67680, 66714, 65995, 65076, 63339, 61162, 59282, 57712, 56338, 55803, 56586, 57677, 57447, 55603, 53236, 51230, 49759, 49124, 49744, 51198, 52337, 52649, 52628, 52647, 52350, 51481, 50466, 49694, 48827, 47363, 45558, 44327, 44305, 45248, 46363, 47112, 47633, 48348, 49294, 50118, 50611, 50884, 50983, 50782]
55336E0782m60n36o61q62o41K4J27q56j653q16R33J616Q80J84K66L05j26k48K86
55317D8544N97J48l44k33J09K75M79O66K40o79j070o62m54r33j185n81P8jk82
55298D4712p8J84n3k81Q0N15L36m7J00N47O21L16r2p83j722k013j008M93J229
55279D3056J140J012J035P81L34L05Q43J359J324P18o1m54j84K59R1o02q65l15
55261D9776K86L29K53N18O90L92K34P87J422J222N10K48M54K95m48j064r86l82
55243E4536K79O22M36q2l71j97o5m64j137j523j537j378j012l63L44Q86J298J504
55225E1776J141L09j67K61J059J366J021M07j98n83m58Q5M79M85N13P43O45n2
55207E8832o81o50l16k15j60Q8L1o89j297q87Q6L87k43r00r09m57l5K4l86q99
$$ y = [50782, 50322, 49786, 49125, 48263, 47622, 47646, 47773, 46917, 45264, 44448, 45381, 46997, 47877, 48061, 48327, 48632, 48506, 48258, 48544, 49141, 49289, 48945, 48712, 48821, 49096, 49575, 50241, 50481, 49802, 48732, 48070, 47616, 46683, 45498, 44917, 44995, 44994, 44712, 44634, 44818, 44765, 44484, 44564, 45079, 45415, 45368, 45468, 46015, 46636, 46952, 46860, 46077, 44355, 42342, 41334, 41827, 43056, 44196, 45208, 46243, 47024, 47358, 47663, 48506, 49865, 51189, 51907, 51846, 51392, 51208, 51467, 51558, 50956, 50091, 49776, 50062, 50391, 50644, 51162, 51852, 52244, 52478, 53265, 54687, 55909, 56419, 56667, 57121, 57416, 56968, 55904, 54918, 54536, 54815, 55437, 55873, 55791, 55420, 55223, 55158, 54694, 53557, 52034, 50497, 49119, 48107, 47744, 48088, 48974, 50272, 51776, 52917, 53226, 53059, 53320, 54379, 55745, 56766, 57173, 56975, 56392, 55934, 56019, 56498, 56983, 57496, 58239, 58884, 58832, 58151, 57501, 57185, 56970, 56810, 56898, 56929, 56240, 54943, 54056, 54142, 54529, 54286, 53386, 52477, 52020, 51985, 52009, 51623, 50724]
55187E0724p30K77J092P16l98r31m29L88P70N90O4m37l69M04J169J067J80o95
55169E3452j052r17l61M43R33O10k26q09q03m37L7M20M13nk59J71R86J502J612
55150E5710J737K015K137J965J683J542J722K292K897K909K177J273O24l6r12
55135G9735j568j701j819k346k700k186j265q89j029r70o77p01q95m77N59J240
55119F2311J027M50J01j20m66p42o95l87M8O09J180J526J588J410Q63m5o80l32
55101F7646P23J377J056L05k06m95p61o70J57J277J731J273P02P93J293J378R00
55084G8479N21O11O95K93k26k87o1%J27Q00J601J635J004O89Q89P76R0l66k54
55065H7016l04p59o02P37K195K609K297K017J524M44m06j09O94P10l5n44o11p37
$$ y = [50724, 49994, 50271, 51363, 52079, 51681, 50750, 50321, 50709, 51479, 52069, 52133, 51696, 51327, 51731, 52900, 53967, 54147, 53452, 52400, 51483, 51122, 51565, 52498, 53108, 52882, 52073, 51270, 50833, 50870, 51290, 51703, 51698, 51439, 51610, 52596, 54098, 55710, 57447, 59462, 61599, 63564, 65247, 66789, 68511, 70803, 73700, 76609, 78786, 80059, 80683, 80647, 79735, 78167, 76466, 74647, 72301, 69601, 67415, 66150, 65261, 64232, 63262, 62585, 61884, 60989, 60512, 61071, 62311, 63338, 63788, 63889, 63769, 63303, 62561, 61866, 61479, 61527, 62136, 63316, 64842, 66430, 67840, 68703, 68658, 67978, 67646, 68369, 69746, 70802, 71107, 70901, 70406, 69645, 68975, 69132, 70409, 72140, 73413, 74115, 74908, 76201, 77579, 78479, 79000, 79611, 80306, 80599, 80373, 80086, 80025, 80025, 80152, 80952, 82553, 84188, 85192, 85881, 86770, 87546, 87636, 87270, 87016, 86712, 85953, 85351, 86088, 88283, 90892, 93189, 95206, 96730, 97174, 96768, 96659, 97353, 98063, 98028, 97484, 96873, 96136]
55047I6136p40L1J268J893J618J015K79q46k018k530k568k891l311k793j237J15
55031H3421L47k06q68j450j857j880j662j600j621j381j060j094j209p86j21j22
55015F6851o88p31OM94J87r0L35Q11N47o4j81J57L58L74N95R87J039N59r3l93
54995G1060j05N93J216J425J394J562K101K837L575M071M034L629L643M522N537
54980A11094N781N655O325P880R246R995J0931J2496J3813J3974J3234J2184J0507
54967B43115P499L314j089m957q117j0555j2164j2892j2801j2080j1082j0148
54955A58043r306q399p480o734o081n248m257l367k580j690q20l27j93j7L45O93
54939A02582J009J421J765J813K016L168N286P434Q898R801J0462J0803J0676
$$ y = [96136, 95396, 95427, 96695, 98588, 100206, 101221, 101500, 100654, 98636, 96106, 93538, 90647, 87336, 84543, 83306, 83421, 83768, 83562, 82694, 81244, 79387, 77507, 75845, 74245, 72624, 71243, 70183, 69089, 67880, 67094, 66973, 66851, 66163, 65432, 65438, 65932, 66119, 66029, 66364, 67175, 67722, 67658, 67477, 67634, 67992, 68366, 68961, 69948, 70987, 71546, 71453, 71060, 70955, 71548, 72764, 74189, 75583, 77145, 79246, 82083, 85658, 89729, 93763, 97392, 101035, 105557, 111094, 116875, 122530, 128855, 136735, 145981, 155976, 166907, 179403, 193216, 207190, 220424, 232608, 243115, 250614, 253928, 252839, 247882, 239765, 229210, 217046, 204154, 191353, 179273, 168191, 158043, 148737, 140338, 132858, 126124, 120043, 114795, 110538, 107171, 104591, 102901, 102081, 101754, 101561, 101544, 101889, 102582, 103591, 105012, 106777, 108590, 110606, 113774, 119060, 126494, 135392, 145193, 155655, 166458, 177134]
54926A77134J0062Q797O638L891J264j014l382o050q557j0379j1346j1337j0283
54913A45438q695p542p220p208o924o329n536m482l311k467k146k008j698j115
54899G8757k57O87J103N45m64r99r73j019j197r30l17k01o96q76m04j27m99o51
54881G1482M0P00K96o64j031p92p70j026q48r6N23M84q8q80j622j951j676j113
54863F0968o52j67N92J335J527J199Q84Q83J096J383J652J724J551J386J324J000
54847G7685J95n96p98o95j025j777k097j403m2J252K026K165J760J166Q57J021
54831G9694J423J730J856K006K466L391M604N695O394O842P450Q531J0071J1712
54817A53865J2931J3367J2969J1731R519O381K882k89k948n274p151q215q507
$$ y = [177134, 187196, 195993, 202631, 206522, 207786, 206772, 203390, 197340, 188783, 178404, 167058, 155721, 145438, 136743, 129201, 121981, 114773, 107849, 101520, 95984, 91502, 88191, 85724, 83578, 81570, 79872, 78757, 78500, 79187, 80290, 80835, 80371, 79372, 78399, 77380, 76183, 75253, 74936, 74735, 74039, 73163, 72759, 72632, 72133, 71482, 71522, 72222, 72518, 71854, 70823, 70031, 69261, 68235, 67387, 67291, 67814, 68298, 68210, 67330, 65708, 63757, 62081, 60968, 60316, 60149, 60741, 62076, 63603, 64802, 65686, 66569, 67665, 69048, 70700, 72424, 73975, 75361, 76685, 77685, 77880, 77284, 76486, 75791, 74766, 72989, 70892, 69489, 69447, 70699, 72725, 74890, 76650, 77816, 78673, 79694, 81117, 82847, 84703, 86709, 89175, 92566, 97170, 102865, 109259, 116101, 123551, 132082, 142153, 153865, 166796, 180163, 193132, 204863, 214382, 220763, 223645, 223356, 220408, 215134, 207983, 199768, 191261]
54804A91261q523q524q395q192q161q071p250n618l969k896k105j271p62q99j115
54789A15510o57K64Q56J021J405K293L241L939M703N816O965P721Q269R201J0704
54774A81251J2281J3271J3343J2449J0629Q159N609L378J242j156l395m495m246
54761B48320l678l811m519n067n214n146m936m808n442p085q751r228q660q092
54747A63883p798p203o298n788n708n196l942k735k185j960j682j544j593j368
54733A08883q17o10j052j474j327r58p66m14M30J256J325N97m71j539k274k300
54717I8489j695j043o89m61l04l96m63NO37M57l52k96J078K111J371j60n32N16
54699I8273J666K097K063J842J398R61Q51R15Q40P17O14J64o52r64k09Q06J041
$$ y = [191261, 182738, 174214, 165819, 157627, 149466, 141395, 134145, 128527, 124558, 121662, 119557, 118286, 117524, 116625, 115510, 114853, 115117, 115973, 116994, 118399, 120692, 123933, 127872, 132575, 138391, 145356, 153077, 161346, 170547, 181251, 193532, 206803, 220146, 232595, 243224, 251383, 256992, 260370, 261612, 260456, 257061, 252566, 248320, 244642, 240831, 236312, 231245, 226031, 220885, 215949, 211141, 205699, 198614, 189863, 180635, 171975, 163883, 156085, 148882, 142584, 136796, 131088, 125892, 121950, 119215, 117030, 115070, 113388, 111844, 110251, 108883, 108066, 107456, 106404, 104930, 103603, 102645, 101879, 101465, 101895, 103151, 104476, 105073, 104602, 103063, 100789, 98489, 96794, 95751, 95062, 94601, 94297, 93901, 93438, 93443, 94080, 94537, 94185, 93889, 94967, 97078, 98449, 98289, 97757, 98273, 99939, 102036, 104099, 105941, 107339, 108300, 109151, 110066, 110906, 111623, 112237, 112401, 111749, 110785, 110576, 111382, 112423]
54682A12423Q39J203K018K304J920J690J999K529L232M314N261N174M252L702
54668A52860L984M190L561K616K280K677L265L654L875M139M635N335N968O454
54654B09493P167Q406R788J0679J0915J0626R599P478M493J322j712m692p548
54641B76014r995j1954j3421j4095j3715j2668j1611j0657r463p996o582n355
54629A48502m311l725l837m242m215l556k543j263L06J708K278J978J376R14O55
54614A30025O46Q33P82J58o08p63k47K56J99m85j606k705l121k678k133k158k366
54597A14029j980j137o42o98q66j045j473j902j810j383j314j617j672j409j434
54582I3647j812j764q63L43J150J412J270Q33K79k31p54j142q02L66J238P81k26
$$ y = [112423, 113262, 114465, 116483, 118787, 120707, 122397, 124396, 126925, 130157, 134471, 139732, 144906, 149158, 152860, 156844, 161034, 164595, 167211, 169491, 172168, 175433, 179087, 182962, 187101, 191736, 197071, 203039, 209493, 216660, 225066, 234854, 245533, 256448, 267074, 276673, 284151, 288644, 289966, 288254, 283562, 276014, 266019, 254065, 240644, 226549, 212834, 200166, 188555, 177898, 168435, 160439, 153857, 148502, 144191, 140466, 136629, 132387, 128172, 124616, 122073, 120810, 121116, 122824, 125102, 127080, 128456, 129370, 130025, 130671, 131504, 132286, 132444, 131836, 131073, 130826, 131082, 131281, 130796, 129190, 126485, 123364, 120686, 118553, 116395, 114029, 112049, 110912, 110270, 109572, 108706, 107661, 106188, 104286, 102476, 101093, 99779, 98162, 96490, 95081, 93647, 91835, 90071, 89208, 89551, 90701, 92113, 93383, 94216, 94495, 94264, 93510, 92368, 91566, 91932, 93170, 93951, 93725]
54565I3725j29J136J942J448O06L63M07L35O08J447J982J502O94O64J414K187
54549A10331K736L329L967M345M391M289M220M411N025N662N524M483L397K930
54535A69040K637J751K97j178k540m010n428o193n987n168m504m442m609m086
54521A25580k614j239j140j977k299j568p39n79o01j88K23jm74l62K79O68M73
54504A13442J13k6OL0qn4M3L59O49N10n3n71p69q07q08o29l16k07l37l62k37l63
54482A09605p46p95l17L6j89m77k22K24J26n59j280j698j787j527j065q26q84
54465I7619o43K79J274J417O38l09p40m39L82J084J016L81J79P40J032J96r29
54448A03177q97K07Q97M18m36p71p44r01j214j305j097q06n99m87l69o2M62Q74
$$ y = [93725, 93596, 94732, 96674, 98122, 98728, 99091, 99498, 99833, 100441, 101888, 103870, 105372, 106066, 106730, 108144, 110331, 113067, 116396, 120363, 124708, 129099, 133388, 137608, 142019, 147044, 152706, 158230, 162713, 166110, 169040, 171677, 173428, 173725, 172547, 170007, 165997, 160569, 154376, 148389, 143221, 138717, 134275, 129666, 125580, 122966, 121727, 120587, 118610, 116311, 114743, 114004, 113425, 112824, 112636, 112859, 112858, 112384, 112022, 112301, 112969, 113442, 113555, 113529, 113535, 113565, 113557, 113503, 113546, 113905, 114554, 115064, 115011, 114440, 113671, 112864, 112056, 111427, 111111, 110904, 110567, 110205, 109968, 109605, 108859, 108064, 107747, 107783, 107594, 107117, 106895, 107119, 107245, 106686, 105406, 103708, 101921, 100394, 99329, 98503, 97619, 96976, 97255, 98529, 99946, 100584, 100275, 99535, 99096, 99478, 100562, 101578, 101959, 102138, 102878, 103910, 104106, 103177, 102280, 102487, 103384, 103802, 103366, 102595, 101851, 100950, 99736, 98431, 97334, 96528, 95929, 95442, 95073, 95011, 95473, 96347]
54430I6347Q47N80N59P98P79K69k43j20O40J440J721J425R21O21O50Q91J216J549
54412A10890J760J748J803K388L447M224M130L443K871K653K538K418K418K483
54398A49214K339J941J505J031J73j194k564l186k868k203j919k122k337k280
54384A35530k275k644l007k730j973j600j983k455k268j560r14m95j20J34J0l86
54368A11264o19m85j81J10L90O03N23K7o56j047p51J60J125J542J314Q98Q17J215
54350A16249J820K155J896J270R35J191J570J528J336J514J745J175j16r90q14
54335A32464l04l87j059j859k676l420l610l008k210j874j825j548j144j118j572
54320A04850k221k892l401l329k551j687j386j410j112n14k59o05j170j515j453
$$ y = [96347, 97194, 97774, 98333, 99131, 99910, 100179, 99936, 99816, 100456, 101896, 103617, 105042, 105963, 106584, 107234, 108125, 109341, 110890, 112650, 114398, 116201, 118589, 122036, 126260, 130390, 133833, 136704, 139357, 141895, 144313, 146731, 149214, 151553, 153494, 154999, 156030, 156203, 155009, 152445, 149259, 146391, 144188, 142269, 140147, 137810, 135530, 133255, 130611, 127604, 124874, 122901, 121301, 119318, 116863, 114595, 113035, 112121, 111626, 111506, 111640, 111650, 111264, 110645, 110160, 109979, 110089, 110479, 111082, 111605, 111632, 110976, 109929, 109178, 109338, 110463, 112005, 113319, 114217, 115034, 116249, 118069, 120224, 122120, 123390, 124325, 125516, 127086, 128614, 129950, 131464, 133209, 134384, 134268, 133278, 132464, 132160, 131773, 130714, 128855, 126179, 122759, 119149, 116141, 113931, 112057, 110232, 108684, 107540, 106422, 104850, 102629, 99737, 96336, 93007, 90456, 88769, 87383, 85973, 84861, 84347, 84088, 83483, 82313, 80798, 79345]
54305G9345r22j43L48K81O7J18J56k09o01m17J05K30p1j92m7k16p80r99m64K30
54285G5819L19k06q07j046p82j44M64P08P67J039J426J429R39L67m8m34p12m81
54267G8617K33Q23R42R63J204J296Q05M4k94j7N03R23J138J044N22l07j132j725
54249H5582k003j922j482q47l05q4k48o46r47r29p32o63p52o75k17M12Q62J067
54231G5471J174J255J220R80N24j02p39j049p62m8M95L91j81o31o99o96q67q57
54213G4879k39O87J150R28N20K76l2n15p21m05j11l77p47l27Q22J637J408N15
54195G9348k80p15r56j128j218j223j131q73m11K01Q35J260J268R60Q35J267J964
54178H0003K228J739Q56J30j64r4J27K86L19L74N82Q18Q17M93j3n35r65j193j182
$$ y = [79345, 78423, 78280, 78628, 78909, 78976, 79094, 79250, 79041, 78440, 78023, 78128, 78358, 78287, 78095, 78048, 77832, 77052, 76053, 75589, 75819, 76138, 75932, 75125, 74079, 73297, 73153, 73617, 74325, 75092, 76131, 77557, 78986, 79925, 80292, 80244, 79810, 79098, 78617, 78850, 79673, 80615, 81578, 82782, 84078, 84883, 84927, 84633, 84616, 85119, 86042, 87180, 88224, 88746, 88439, 87307, 85582, 83579, 81657, 80175, 79328, 79023, 78939, 78691, 78045, 77098, 76169, 75437, 74774, 74022, 73347, 73130, 73542, 74404, 75471, 76645, 77900, 79120, 80100, 80624, 80522, 79783, 78734, 77972, 77924, 78419, 78810, 78629, 77998, 77299, 76603, 75736, 74879, 74640, 75327, 76477, 77405, 77925, 78201, 78169, 77654, 76933, 76528, 76417, 76040, 75293, 74966, 75788, 77425, 78833, 79348, 79068, 78353, 77397, 76269, 75051, 73828, 72697, 71824, 71413, 71614, 72449, 73709, 74977, 75937, 76772, 78039, 80003, 82231, 83970, 84826, 84956, 84792, 84698, 84825, 85111, 85430, 85804, 86386, 87204, 88021, 88514, 88501, 87966, 87001, 85808, 84626]
54159H4626j074j078j167j084o29M8M79L27j41k14L81R79Q03J33J8P43J395J205
54141H5750O14M13N05K61l27o75n41k17P9M03O82O92M45J43k09o82j089j165j029
54122H4053r23p07j72L39K35l48o22l05o7n68j521k004j499l64M78L46n61j280
54104G4510j087l11J08k37q56j059p16k40j13l72n21m3Q32J236P24j20n25n15
54086G0695n70p48p90p29p01m49L21J202J531J312J025O89J1p23q70n40m56o43
54068F9567l32N85J144Q46M91Q42J347J077K93P4P56J607J903J614J027L48k02
54051H2987l40L2O53J121J234J210J456K003K282J765P96L01O44J277J630J815
54035A00866K167K639L007L354L847M317M493M469M561M812M947M786M394L895
$$ y = [84626, 83552, 82474, 81307, 80223, 79594, 79642, 80121, 80448, 80307, 80093, 80474, 81453, 82256, 82389, 82407, 83150, 84545, 85750, 86364, 86777, 87282, 87543, 87216, 86541, 86000, 85783, 85862, 86265, 86947, 87639, 88084, 88227, 88018, 87336, 86247, 85082, 84053, 83130, 82423, 82251, 82590, 82825, 82477, 81855, 81550, 81483, 80915, 79394, 77390, 75891, 75527, 76005, 76351, 75790, 74510, 73423, 73112, 73220, 72983, 72127, 71068, 70352, 70112, 69999, 69627, 69106, 69063, 69895, 71131, 71855, 71735, 71210, 70695, 70125, 69377, 68587, 67858, 67157, 66708, 67029, 68231, 69762, 71074, 72099, 72788, 72799, 72076, 71206, 70666, 70210, 69567, 69235, 69820, 70964, 71810, 72301, 73143, 74490, 75567, 75860, 75934, 76690, 78297, 80200, 81814, 82841, 83189, 82987, 82647, 82679, 83332, 84453, 85687, 86897, 88353, 90356, 92638, 94403, 95199, 95500, 96144, 97421, 99051, 100866, 103033, 105672, 108679, 112033, 115880, 120197, 124690, 129159, 133720, 138532, 143479, 148265, 152659, 156554]
54021A56554L326K783K454K407K368J921R94Q9k04O4K84R0k62n06p95j241j508
54004A68818j420j498k192k977l031k567k512k966k989k160j259j085j392j537
53990A39233j480j530j627j449r39l03L00Q11J245J738K215K129J031m42j002
53975A39930l71K85N4m56j86O89J075N61k03n53n08l42j89j65m57j090j810k279
53957A33985k254j726j059p65q89q35j72O17O69l2m47L02J901L163L304K630K029
53940A40421J986K275K530K798L303L933M290M150L547K507J100k65j005j010
53926A70560p63p25q07o02J21J168K017K181J814J749K615L920M578M241L578
53911A95645L281L333L440L628M077M761N472N920N791N022M025L216K379J085
$$ y = [156554, 159880, 162663, 165117, 167524, 169892, 171813, 172807, 172896, 172692, 172756, 173040, 173130, 172868, 172362, 171567, 170326, 168818, 167398, 165900, 163708, 160731, 157700, 155133, 152621, 149655, 146666, 144506, 143247, 142162, 140770, 139233, 137753, 136223, 134596, 133147, 132208, 131905, 132205, 133016, 134261, 135999, 138214, 140343, 141374, 140932, 139930, 139559, 139844, 139898, 139442, 139256, 139945, 141020, 141581, 141378, 140825, 140317, 139975, 139786, 139621, 139164, 138074, 136264, 133985, 131731, 130005, 128946, 128181, 127292, 126457, 126285, 126902, 127571, 127539, 127092, 127394, 129295, 132458, 135762, 138392, 140421, 142407, 144682, 147212, 150010, 153313, 157246, 161536, 165686, 169233, 171740, 172840, 172575, 171570, 170560, 169797, 169072, 168265, 167663, 167784, 168952, 170969, 173150, 174964, 176713, 179328, 183248, 187826, 192067, 195645, 198926, 202259, 205699, 209327, 213404, 218165, 223637, 229557, 235348, 240370, 244395, 247611, 249990, 251075]
53897B51075l75j149j068r49j425k124k340k025j714j923k852m205n200n223m598
53882B13905m180m211m258m234m531m972m762l864l333l675l939l239k229k108
53868A60370k819l373l339l055k705k230j938k306l212m071m506m372l465j997
53854A16982r18r66j586j645j009n69q03j257j406j301j136r43q11q69r58q18
53838I9987n93n72n47n5P14R83M96n8p5J69J02k06j78L23P24N07J3N4P71J250
53818A03809P07k88m25N31J407J293P21O99J296J897K263K549K684K542K431K683
53802A26799K954K665J971J633J904K286K328K143K129K565L403M133M068L149
53788A64130K155J709J504J094Q42J294J991J938J050K12l8K3J32L96P16O59J37
$$ y = [251075, 250700, 249551, 248483, 247534, 246109, 243985, 241645, 239620, 237906, 235983, 233131, 228926, 223726, 218503, 213905, 209725, 205514, 201256, 197022, 192491, 187519, 182757, 178893, 175560, 171885, 167946, 164707, 162478, 160370, 157551, 154178, 150839, 147784, 145079, 142849, 140911, 138605, 135393, 131322, 126816, 122444, 118979, 116982, 116064, 115098, 113512, 111867, 110858, 110289, 109486, 108229, 106823, 105522, 104386, 103443, 102632, 101763, 100805, 99987, 99394, 98822, 98275, 98220, 98934, 99917, 100413, 100355, 100280, 100449, 100551, 100345, 100167, 100490, 101214, 101721, 101734, 101788, 102559, 103809, 104516, 104228, 103803, 104334, 105741, 107034, 107755, 108454, 109750, 111647, 113910, 116459, 119143, 121685, 124116, 126799, 129753, 132418, 134389, 136022, 137926, 140212, 142540, 144683, 146812, 149377, 152780, 156913, 160981, 164130, 166285, 167994, 169498, 170592, 171434, 172728, 174719, 176657, 177707, 177919, 177881, 177904, 178036, 178432, 179148, 179807, 179944]
53771A79944m55r07j407j987k395k547k527k115j040K16O34j65j505k538k911
53756A58295k562j605o13l30q21j408j628j622j586j458j366j652k206k446k151
53741A34841j736j466j126p07p09j299j854j810j376j036q41o89p86j229j577
53726A16600j335p00l04l72m84j16P83J699J969J487Q47N99N63L54K40O78J137
53709A23645N42r76j856j136L05J168J441J755J934J345L31L8Q84K086K762K757
53693A37025K331J797J554J813K117J694N38l66j74Q45J786K160K182K164K087
53678A59553J784J308R40R18J190J543J868K218K592K808K642K096J466J124J164
53663A85214J254R98N50N91J469K563K919K360J504Q48L86P7N1J17k42r83j221
$$ y = [179944, 179489, 178582, 177175, 175188, 172793, 170246, 167719, 165604, 164564, 164780, 165414, 165249, 163744, 161206, 158295, 155733, 154128, 153515, 153185, 152364, 150956, 149328, 147706, 146120, 144662, 143296, 141644, 139438, 136992, 134841, 133105, 131639, 130513, 129806, 129097, 127798, 125944, 124134, 122758, 121722, 120881, 120192, 119406, 118177, 116600, 115265, 114565, 114261, 113889, 113405, 113289, 114072, 115771, 117740, 119227, 120074, 120673, 121236, 121590, 121830, 122508, 123645, 124187, 123211, 121355, 120219, 120524, 121692, 123133, 124888, 126822, 128167, 128498, 128536, 129420, 131506, 134268, 137025, 139356, 141153, 142707, 144520, 146637, 148331, 148869, 148503, 148329, 149174, 150960, 153120, 155302, 157466, 159553, 161337, 162645, 163585, 164503, 165693, 167236, 169104, 171322, 173914, 176722, 179364, 181460, 182926, 184050, 185214, 186468, 187466, 188016, 188607, 190076, 192639, 195558, 197918, 199422, 200270, 200656, 200733, 200784, 200901, 200659, 199676, 198455]
53646A98455l40R90J515Q45k29p83n79N4O25P42L19k93n84l78N0L33L26J40m8
53627B01160j43k29m53p63q45m72J47M77J40p21j473j453n63N65J158J107R95
53610A98634J260J678J789J578J445J679K175K614K699K318J733J482J894K646
53596B25624L075K930K641K755L319L950M373M661M975N265N386N327N148M741
53582B84170L995L174K849L252L945M296M141L726L292K930K796L025L457L652
53568C32700L265K339J266N58N27J082J889K755L597L985L211J165j166k538k597
53553C52038j932j227q01p35r11r62o48j93J6q7l84q97j517j734j266o76p49j416
53535C35919j990k229k345k088q92R53K198K091J180M18J40K99Q83J640J974J706
$$ y = [198455, 198115, 199105, 200620, 201465, 201236, 200453, 199874, 199928, 200553, 201295, 201614, 201321, 200737, 200359, 200409, 200742, 201068, 201208, 201160, 201017, 200788, 200335, 199572, 198727, 198255, 198402, 198879, 199019, 198298, 196825, 195372, 194809, 195374, 196532, 197639, 198634, 199894, 201572, 203361, 204939, 206384, 208063, 210238, 212852, 215551, 217869, 219602, 221084, 222978, 225624, 228699, 231629, 234270, 237025, 240344, 244294, 248667, 253328, 258303, 263568, 268954, 274281, 279429, 284170, 288165, 291339, 294188, 297440, 301385, 305681, 309822, 313548, 316840, 319770, 322566, 325591, 329048, 332700, 335965, 338304, 339570, 340128, 340655, 341737, 343626, 346381, 349978, 353963, 357174, 358339, 357173, 354635, 352038, 350106, 348879, 348078, 347343, 346432, 345470, 344822, 344629, 344645, 344558, 344174, 343277, 341760, 340026, 338760, 338084, 337335, 335919, 333929, 331700, 329355, 327267, 326375, 327328, 329526, 331617, 332797, 333215, 333355, 333654, 334537, 336177, 338151, 339857]
53519C39857J396J559J957K129K109K171K349K667L465M941O559P511P600P320
53505C93590P194P305P509P823Q520R797J1278J2161J2135J1928J2375J3263J3757
53492E28635J3838J4310J5414J6406J6864J7327J8159J8800J8811J8813J9593
53481G16970K0884K1878K2416K2848K3200K3214K2971K2726K2449K2078K1873
53470I63507K1917K1757K1236K1128K2147K3696K4565K4563K4492K4666K4503
53459A218177K3638K2411K1123J9606J7810J6143J4869J3795J2754J1951J1570
53448A403847J1446J1307J1036J0561R898R289Q904Q311O770M151J199j295l192
53435A492232m731o107p504r203j1263j3317j4981j6366j7901j9644k1043k1505
$$ y = [339857, 341253, 342812, 344769, 346898, 349007, 351178, 353527, 356194, 359659, 364600, 371159, 378670, 386270, 393590, 400784, 408089, 415598, 423421, 431941, 441738, 453016, 465177, 477312, 489240, 501615, 514878, 528635, 542473, 556783, 572197, 588603, 605467, 622794, 640953, 659753, 678564, 697377, 716970, 737854, 759732, 782148, 804996, 828196, 851410, 874381, 897107, 919556, 941634, 963507, 985424, 1007181, 1028417, 1049545, 1071692, 1095388, 1119953, 1144516, 1169008, 1193674, 1218177, 1241815, 1264226, 1285349, 1304955, 1322765, 1338908, 1353777, 1367572, 1380326, 1392277, 1403847, 1415293, 1426600, 1437636, 1448197, 1458095, 1467384, 1476288, 1484599, 1491369, 1495520, 1496719, 1495424, 1492232, 1487501, 1481394, 1473890, 1464687, 1453424, 1440107, 1425126, 1408760, 1390859, 1371215, 1350172, 1328667]
53423A328667k1206k1114k2059k3791k5274k5871k5830k5585k5021k3882k2441
53412A066593k1240k0393j9543j8387j6826j4804j2509j0551r440q872q011o472
53400H99545m682l153j836k28K014M592O667P636Q004R139J1798J5228J8079J9821
53386I92624K0754K1098K0986K1112K2348K4553K6584K7797K8738L0148L1913
53375A268655L3495L4809L6180L7753L9442M1208M3039M4818M6510M8253N0034
53364A724196N1549N2622N3546N4653N5724N6182N5788N4898N4042N3395N2623
53353B319218N1137M8557M5071M1293L7766L4657L1993K9866K8199K6507K4223
53342B718487K1247J7982J4734J1338P465L181j144n483j0474j6821k4455l2501
$$ y = [1328667, 1307461, 1286347, 1264288, 1240497, 1215223, 1189352, 1163522, 1137937, 1112916, 1089034, 1066593, 1045353, 1024960, 1005417, 987030, 970204, 955400, 942891, 932340, 922900, 914028, 906017, 899545, 894863, 891710, 889874, 889646, 891660, 896252, 902919, 910555, 918559, 927698, 939496, 954724, 972803, 992624, 1013378, 1034476, 1055462, 1076574, 1098922, 1123475, 1150059, 1177856, 1206594, 1236742, 1268655, 1302150, 1336959, 1373139, 1410892, 1450334, 1491542, 1534581, 1579399, 1625909, 1674162, 1724196, 1775745, 1828367, 1881913, 1936566, 1992290, 2048472, 2104260, 2159158, 2213200, 2266595, 2319218, 2370355, 2418912, 2463983, 2505276, 2543042, 2577699, 2609692, 2639558, 2667757, 2694264, 2718487, 2739734, 2757716, 2772450, 2783788, 2791253, 2794434, 2793290, 2787807, 2777333, 2760512, 2736057, 2703556]
53330B703556m0063m6681n2114n6011n8165n8870n8783n8457n8078n7525n6544
53319B102265n4983n3041n1200m9832m9048m8858m9217m9730m9707m8770m7151
53308A550728m5231m3065m0598l7998l5385l2556k9353k6092k3191k0640j8258
53297A198361j6195j4703j3562j2408j1362j0795j0489r785q580p501o910o402
53285A069669n555m566l740k840j528n6J006J674K545L870N095N656N928O956
53271A084114R232J2061J4384J5999J7557J9460K1201K2094K2204K2243K2699
53260A283248K3469K4221K4770K5064K5052K4660K3803K2529K1103J9837J8728
53249A536484J7537J6328J5498J5124J4624J3439J1643R576P204M331J165j896
$$ y = [2703556, 2663493, 2616812, 2564698, 2508687, 2450522, 2391652, 2332869, 2274412, 2216334, 2158809, 2102265, 2047282, 1994241, 1943041, 1893209, 1844161, 1795303, 1746086, 1696356, 1646649, 1597879, 1550728, 1505497, 1462432, 1421834, 1383836, 1348451, 1315895, 1286542, 1260450, 1237259, 1216619, 1198361, 1182166, 1167463, 1153901, 1141493, 1130131, 1119336, 1108847, 1099062, 1090482, 1082981, 1076071, 1069669, 1064114, 1059548, 1055808, 1052968, 1051440, 1051384, 1052390, 1054064, 1056609, 1060479, 1065574, 1071230, 1077158, 1084114, 1093346, 1105407, 1119791, 1135790, 1153347, 1172807, 1194008, 1216102, 1238306, 1260549, 1283248, 1306717, 1330938, 1355708, 1380772, 1405824, 1430484, 1454287, 1476816, 1497919, 1517756, 1536484, 1554021, 1570349, 1585847, 1600971, 1615595, 1629034, 1640677, 1650253, 1657457, 1661788, 1662953, 1661057]
53237A661057m862q011j1331j4589j7830k1214k4436k6859k8283k9078k9619l0100
53225A414845l0808l1975l3231l3744l3097l1620k9793k7803k5861k4341k3448
53214A089124k3007k2904k3297k4250k5383k6156k6263k5701k4706k3684k2946
53203H20827k2364k1455j9840j7533j4841j2355j0821j0549j0907j0899j0320
53192F58943r870j0036j0448j0561j0497j0704j1139j1317j1043j0698j0636j0642
53180E31352j0212r306q549q459q734q671q197p983q337q669q448q058q071q200
53166D11458p796p074o837p149p229o768o343o318o150n299m137l420l389l741
53152C29808m087m139l879l829m668o228p358p193o129n205m890m906m874m622
$$ y = [1661057, 1656195, 1648184, 1636853, 1622264, 1604434, 1583220, 1558784, 1531925, 1503642, 1474564, 1444945, 1414845, 1384037, 1352062, 1318831, 1285087, 1251990, 1220370, 1190577, 1162774, 1136913, 1112572, 1089124, 1066117, 1043213, 1019916, 995666, 970283, 944127, 917864, 892163, 867457, 843773, 820827, 798463, 777008, 757168, 739635, 724794, 712439, 701618, 691069, 680162, 669263, 658943, 649073, 639037, 628589, 618028, 607531, 596827, 585688, 574371, 563328, 552630, 541994, 531352, 521140, 511834, 503285, 494826, 486092, 477421, 469224, 461241, 452904, 444235, 435787, 427729, 419658, 411458, 403662, 396588, 389751, 382602, 375373, 368605, 362262, 355944, 349794, 344495, 340358, 336938, 333549, 329808, 325721, 321582, 317703, 313874, 309206, 302978, 295620, 288427, 282298, 277093, 272203, 267297, 262423, 257801]
53138B57801m150l742l848m465m856m378l359k723k854l260l364l128k854k650
53124B08170k357j873j340j065j241j738k172k191j701r46l92l58o76q31o10l75
53108A88304m76p24p61p22r69j328j196m81J15l8p90j500j703j374q86p78j245
53091A73448j757j557o43J28K0q18j662j932j581j071j008j508j947j764j322
53076A55026j443k136k480j922j010n00m03k50N5J34l43j305k216k327j357RO33
53059A38165J11q87j477j368p76j36R1k07m77j22N44O42P5k49K08Q42R31O92O87
53040A37289Q13M91m24j494k134j944r36K44P32M42K08O54J377J586J123M08j20
53023A38315j77L55J150J657J837K189K745K753J846R39J141K228K882K278Q79
$$ y = [257801, 253651, 249909, 246061, 241596, 236740, 232362, 229003, 226280, 223426, 220166, 216802, 213674, 210820, 208170, 205813, 203940, 202600, 201535, 200294, 198556, 196384, 194193, 192492, 191546, 191154, 190796, 190120, 189289, 188679, 188304, 187828, 187104, 186343, 185621, 184652, 183324, 182128, 181647, 181762, 181724, 180934, 179434, 177731, 176357, 175471, 174693, 173448, 171691, 170134, 169491, 169619, 169639, 168821, 167159, 165227, 163646, 162575, 161567, 160059, 158112, 156348, 155026, 153583, 151447, 148967, 147045, 146035, 145535, 145132, 144882, 144937, 145071, 144728, 143423, 141207, 138880, 137523, 137532, 138165, 138276, 137389, 135912, 134544, 133768, 133632, 133723, 133516, 133039, 132917, 133461, 134103, 134178, 133929, 134137, 134979, 135910, 136602, 137289, 138102, 138593, 138169, 136675, 134541, 132597, 131661, 131905, 132637, 133079, 133287, 133941, 135318, 136904, 138027, 138435, 138315, 138138, 138493, 139643, 141300, 143137, 145326, 148071, 150824, 152670, 153609, 154750, 156978, 159860, 162138, 163017]
53008A63017k32m22nO7p70j942k427k170k125k719l146k646j689j193j334j730
52992A38534k224k703k744k240j817j914j902j004L34R04L13o76j173r23k26K86
52976A20825P4n94p29R1R86R70L06p6O2L16N39P68O66N7m00j8P57R83P30Q31J459
52955A28603J980K082J955J485M19p31j002l21M67Q28R36Q57N04L33R55J942K141
52938A43433J279K21m20q24r80n15K52L39k84m13N75J734K079J941J995J981J394
52921A53787O69O32J208J564J226M99k3J28R16J559J253L19OP87J677J771J471
52904A69449J527J730J501J121J313J978K334K083J650J452J635K298L326M148
52890A97545M284L971L723L539L100K502K079J778J317Q21N80L92k04j051j477
$$ y = [163017, 162785, 162363, 162358, 162425, 161655, 159713, 157286, 155116, 152991, 150272, 147126, 144480, 142791, 141598, 140264, 138534, 136310, 133607, 130863, 128623, 126806, 124892, 122990, 121986, 122320, 123224, 123537, 122861, 121688, 120765, 120539, 120825, 120899, 120305, 119576, 119667, 120653, 121623, 121929, 121853, 121915, 122231, 122770, 123538, 124204, 124261, 123861, 123843, 124600, 125583, 126313, 127144, 128603, 130583, 132665, 134620, 136105, 136524, 135793, 134791, 134470, 134937, 135765, 136701, 137558, 138062, 138395, 139350, 141292, 143433, 144712, 144933, 144513, 143689, 142709, 142194, 142446, 142785, 142501, 142088, 142663, 144397, 146476, 148417, 150412, 152393, 153787, 154456, 155088, 156296, 157860, 159086, 159585, 159562, 159690, 160606, 162165, 163418, 163737, 163743, 164530, 166207, 167978, 169449, 170976, 172706, 174207, 175328, 176641, 178619, 180953, 183036, 184686, 186138, 187773, 190071, 193397, 197545, 201829, 205800, 209523, 213062, 216162, 218664, 220743, 222521, 223838, 224659, 225239, 225631, 225427, 224376, 222899]
52875B22899j231p71n81o91r21j085r56m87l2M5q7j06k09q12j621j801j153m65
52857B09935l58m57q7P15J363J527J353J020N52L9k75k05J88N90O34J71n64j150
52839B14991j360j283j113r92j063j411j862k072j921j624j360j028n83l44o05
52824A96370j037j007m39l4l80j197j700j483p93j31J11j88p35r29m89P3N0m83
52806A85579q07o73o07r09j064o07K0P3m10q32r97j137j148o60J59N67J82o00
52788A76129j267j758k146k283j981j317n18J72M71K41k41m97l87j79p5j08m08
52771A63848j128k025k616k809k878k844k422j690j182j107j082q82q75j324j827
52756A37157j849j413p82L4J006J705J749J397J217J311J314J067Q44J004J614
$$ y = [222899, 221668, 220897, 220316, 219625, 218704, 217619, 216663, 216176, 216144, 216189, 216102, 215996, 215787, 214975, 213354, 211553, 210400, 209935, 209577, 209120, 209033, 209748, 211111, 212638, 213991, 215011, 215563, 215602, 215327, 215122, 215310, 215900, 216534, 216705, 216141, 214991, 213631, 212348, 211235, 210243, 209180, 207769, 205907, 203835, 201914, 200290, 198930, 197902, 197319, 196975, 196370, 195333, 194326, 193887, 193853, 193473, 192276, 190576, 189093, 188300, 188169, 188280, 188092, 187357, 186428, 185939, 186012, 186062, 185579, 184772, 184099, 183492, 182583, 181519, 180912, 180932, 181005, 180595, 179763, 178766, 177629, 176481, 175821, 175980, 176547, 176729, 176129, 174862, 173104, 170958, 168675, 166694, 165377, 164859, 165031, 165502, 165743, 165502, 165005, 164618, 164439, 164364, 164256, 163848, 162720, 160695, 158079, 155270, 152392, 149548, 147126, 145436, 144254, 143147, 142065, 141183, 140308, 138984, 137157, 135308, 133895, 133113, 133147, 134153, 135858, 137607, 139004, 140221, 141532, 142846, 143913, 144757, 145761, 147375]
52741A47375K413K940K849K256J611J095M22o90k063l297m141m497m379m044l825
52726A34025l691l325k755k473k641k791k570k289k273k248j892j537j620j842
52712A00078j568q12j62J18J98Q5l94r79j103p20m37o51j043j170j011p72m76
52695H9181r9J95K41J34R0R4o3m81q87q50k33N14P53L65j26k55j70k62n49p20
52675H6872o47m22q7K69K84l13j121j369r31n58q48j429j520r69l09J17N09J029
52657G8557J359J249J098J494K227K460J941J431J556J872J779J775K922N077
52643A06797O658O328M196J215j778m089n062m656l688k965k558k139j579q48
52629I5832J01R19R38J47m77j96M83O63L41P4p1l52n44k67J25k9n00m59J68O33
$$ y = [147375, 149788, 152728, 155577, 157833, 159444, 160539, 160961, 160271, 158208, 154911, 150770, 146273, 141894, 137850, 134025, 130334, 127009, 124254, 121781, 119140, 116349, 113779, 111490, 109217, 106969, 105077, 103540, 101920, 100078, 98510, 97698, 97536, 97654, 97852, 97937, 97543, 96564, 95461, 94741, 94304, 93653, 92610, 91440, 90429, 89657, 89181, 89082, 89277, 89518, 89652, 89742, 89836, 89773, 89292, 88405, 87555, 87322, 87836, 88589, 88954, 88828, 88573, 88403, 88141, 87592, 86872, 86225, 85803, 85716, 85985, 86269, 85956, 84835, 83466, 82535, 81977, 81129, 79700, 78180, 77211, 76902, 77019, 77528, 78557, 79916, 81165, 82263, 83757, 85984, 88444, 90385, 91816, 93372, 95244, 97023, 98798, 101720, 106797, 113455, 119783, 123979, 125194, 123416, 119327, 114265, 109609, 105921, 102956, 100398, 98259, 96680, 95832, 95933, 96852, 97790, 97937, 97460, 97264, 97747, 98410, 98751, 98825, 98754, 98402, 97858, 97591, 97716, 97687, 97187, 96728, 96896, 97529]
52609I7529O71Q50J415J808J612J121O06j18r50j176m69M67Q90J062J551K054
52593A08923J739O14k56m2R01J534J264M23j98k05R7K03J45L94J065J565J313
52576A19479N06n4J96J076J858J870J060Q0l12j9M29O40P04P66O90M37L63P08
52558A30477J093R59M46K97Q07J279Q51l44j204r44o7K49l92j112r66j27M66M02
52540A32170J61J84L04K11J6j4Q9J81L89R08J607K061K018J522P48m0m69k81K70
52521A42035N62K26l93n08L30J688K554K291J342P47R69J379J085O5p75o62J60
52504A53095P26M43l10o87m25n2p4k41j2M78L94o89k107k749k211j080j82J45
52486A44462J14L2n8l33p73j038q89o39q52j563k069j779r56l94m79q43r01m52
$$ y = [97529, 98200, 99050, 100465, 102273, 103885, 105006, 105612, 105494, 104544, 103368, 102899, 103366, 104256, 105318, 106869, 108923, 110662, 111276, 111020, 110978, 111879, 113413, 114677, 115100, 114902, 114697, 114794, 114997, 115142, 115536, 116601, 118166, 119479, 119985, 119931, 120127, 121203, 123061, 124931, 125991, 126071, 125759, 125740, 126169, 126809, 127513, 128279, 128969, 129406, 129769, 130477, 131570, 132529, 132975, 133272, 134079, 135358, 136209, 135865, 134661, 133717, 133650, 133899, 133507, 132395, 131429, 131302, 131768, 132170, 132331, 132515, 132819, 133030, 133046, 133032, 133121, 133302, 133691, 134599, 136206, 138267, 140285, 141807, 142555, 142515, 142046, 141765, 142035, 142597, 142823, 142430, 141922, 142252, 143940, 146494, 148785, 150127, 150874, 151843, 153222, 154307, 154372, 153597, 152935, 153095, 153821, 154264, 153954, 153267, 152842, 152790, 152716, 152475, 152463, 152941, 153335, 152646, 150539, 147790, 145579, 144499, 144317, 144462, 144576, 144608, 144550, 144217, 143444, 142406, 141517, 140878, 140026, 138463, 136394, 134615, 133659, 133265, 132786, 131943, 131042, 130590]
52468A30590K47P76Q60M88j55q70j542k004j923j090K04J202J335P52J97K41P81
52451A30089J233J156N91j17o71q94p18k12L34O14N84M69M53M87M65L89K99J35
52433A34686j31k80L4Q55J742K103J747J038N76P84J619K551K845K135Q12k64
52417A52852n91l80r1J20L10L96K62M9jJ00K32N31J122J597J367O41L94J068J907
52398A61885K043J660J526J758J779J336Q70P46P50N40K86M54J151J843J852J098
52382A81577K55P7N46R61Q56M73K09R6Q6M00J121J724J609R60M92M68M68J86q6
52363A92478J04P74J546K028K042J778J662J910K224K143J646J129Q23N71J28
52348B12986m88j038j149n40O11J648K020J858J662J591J394R14L13j36j88K76
$$ y = [130590, 130837, 131613, 132473, 132961, 132806, 131936, 130394, 128390, 126467, 125377, 125581, 126783, 128118, 128870, 129067, 129308, 130089, 131322, 132478, 133069, 132952, 132281, 131387, 130669, 130457, 130791, 131405, 131989, 132458, 132911, 133398, 133863, 134252, 134551, 134686, 134555, 134275, 134309, 135164, 136906, 139009, 140756, 141794, 142370, 143154, 144773, 147324, 150169, 152304, 153116, 152852, 152261, 151881, 151790, 151910, 152220, 152616, 152878, 152927, 152926, 153026, 153258, 153789, 154911, 156508, 157875, 158516, 158910, 159978, 161885, 163928, 165588, 167114, 168872, 170651, 171987, 172857, 173603, 174353, 174893, 175179, 175633, 176784, 178627, 180479, 181577, 181832, 181909, 182455, 183416, 184272, 184745, 184954, 185050, 185136, 185536, 186657, 188381, 189990, 190950, 191442, 191910, 192378, 192564, 192478, 192582, 193356, 194902, 196930, 198972, 200750, 202412, 204322, 206546, 208689, 210335, 211464, 212287, 212858, 212986, 212498, 211460, 210311, 209771, 210382, 212030, 214050, 215908, 217570, 219161, 220555, 221469, 221782, 221646, 221458, 221734]
52332B21734Q94Q88o7j206j458p27K12R18J597K227K259J497N88J99K44K67J74
52315B30240K26N88J178J706J743J106K42j01K38P42J047J327J715J939J901J947
52299B47784K237K358K099K089K981M375N166M851L977L351L306L741M381M935
52285B97631N158M946M350L613L188L484M416N471O294O888P197O962O317O048
52271C71963O744P924Q501Q001P042O630P288Q689R942J0319R916R510R613R973
52257D92055J0107J0051J0221J0756J1399J1833J1938J1760J1497J1332J1157
52246F14106J0704J0005R386Q836P902O551N564N524N842N460M248L056K490K318
52232G01992K036J421N24m10r68j033j114j739k584k806k231j477q18K61K030
$$ y = [221734, 222628, 223516, 223449, 222243, 220785, 220058, 220270, 221188, 222785, 225012, 227271, 228768, 229356, 229555, 229799, 230066, 230240, 230466, 231054, 232232, 233938, 235681, 236787, 237029, 236928, 237166, 237908, 238955, 240282, 241997, 243936, 245837, 247784, 250021, 252379, 254478, 256567, 259548, 263923, 269089, 273940, 277917, 281268, 284574, 288315, 292696, 297631, 302789, 307735, 312085, 315698, 318886, 322370, 326786, 332257, 338551, 345439, 352636, 359598, 365915, 371963, 378707, 386631, 395132, 403133, 410175, 416805, 424093, 432782, 442724, 453043, 462959, 472469, 482082, 492055, 502162, 512213, 522434, 533190, 544589, 556422, 568360, 580120, 591617, 602949, 614106, 624810, 634815, 644201, 653037, 660939, 667490, 673054, 678578, 684420, 689880, 694128, 697184, 699674, 701992, 704028, 705449, 705973, 705563, 704595, 703562, 702448, 700709, 698125, 695319, 693088, 691611, 690793, 691054, 693084]
52217F93084L744M574M786N318O423P413P748P786Q210R120R969J0280J0137R957
52203G98549J0012J0216J0370J0352J0066R433Q572P836P431P043O149M732L356
52190I04117K484J899J050k88j875l440m927o283p269p653p572p467p696q265
52176H46815q959r573r988j0152j0183j0362j0871j1520j1875j1607j0616r084
52164G22025p546o763p056p833q145p724p124o790o569o207n763n254m446l437
52150F31368k910l225l651l205k048j301j531k140k343k069j705j453j333j361
52136F01093j399j166p11o15j348k582l513l688l317k852k617k740l112l417l448
52121E64568l439l772m312m372l532k293j632k026l112m130m503m060l113k348
$$ y = [693084, 696828, 701402, 706188, 711506, 717929, 725342, 733090, 740876, 749086, 758206, 768175, 778455, 788592, 798549, 808561, 818777, 829147, 839499, 849565, 858998, 867570, 875406, 882837, 889880, 896029, 900761, 904117, 906601, 908500, 909550, 909262, 907387, 903947, 899020, 892737, 885468, 877815, 870243, 862776, 855080, 846815, 837856, 828283, 818295, 808143, 797960, 787598, 776727, 765207, 753332, 741725, 731109, 722025, 714479, 707716, 700660, 692827, 684682, 676958, 669834, 663044, 656475, 650268, 644505, 639251, 634805, 631368, 628458, 625233, 621582, 618377, 616329, 615028, 613497, 611357, 609014, 606945, 605240, 603787, 602454, 601093, 599694, 598528, 597817, 597202, 595854, 593272, 589759, 586071, 582754, 579902, 577285, 574545, 571433, 568016, 564568, 561129, 557357, 553045, 548673, 545141, 542848, 541216, 539190, 536078, 531948, 527445, 523385, 520272, 517924]
52107E17924k270k639k752k385k099k353k719k410j378l74K0n0j21N9M51Q73J143
52090D98920J337J953L379N169O307O326N800N543N732O084O500P102P868Q595
52076E76615R180R697J0242J0886J1657J2416J2932J3163J3361J3773J4414J5232
52064G23568J6171J6994J7281J6877J6147J5551J5152J4699J4093J3503J3083
52053H93119J2738J2178J1179R902Q764P859O697M878K877J597J120N91o01k158
52039I70740l620n033o464p464p703p666q105r134j0320j1365j2105j2214j1537
52026H58010j0541r845r416q774p829o959o355n800n094m217l116j821o16K68
52012G77895J079K120L138L642L818M499O110Q062R372R557Q890Q096P822Q100
$$ y = [517924, 515654, 513015, 510263, 507878, 505779, 503426, 500707, 498297, 496919, 496545, 496565, 496515, 496394, 496453, 496904, 497777, 498920, 500257, 502210, 505589, 510758, 517065, 523391, 529191, 534734, 540466, 546550, 553050, 560152, 568020, 576615, 585795, 595492, 605734, 616620, 628277, 640693, 653625, 666788, 680149, 693922, 708336, 723568, 739739, 756733, 774014, 790891, 807038, 822589, 837741, 852440, 866533, 880036, 893119, 905857, 918035, 929214, 939116, 947880, 955739, 962436, 967314, 970191, 971788, 972908, 973499, 972898, 970740, 967120, 962087, 955623, 948159, 940456, 932790, 924685, 915551, 905231, 893866, 881761, 869547, 858010, 847469, 837624, 828208, 819434, 811605, 804646, 798291, 792491, 787397, 783180, 780064, 778243, 777627, 777895, 778974, 781094, 784232, 787874, 791692, 796191, 802301, 810363, 819735, 829292, 838182, 846278, 854100, 862200]
51998H62200Q315P807O491M778L194K213J985J837N90k095n122p340r028j1133
51984H64692j3515j5071j5530j5862j6783j7852j8474j8841j9448k0335k1303
51973F71678k2239k2863k2700k1782k0864k0554k0586k0326j9478j8058j6181
51962D46047j4307j3173j3031j3263j3131j2497j1528j0234q762p671p309p266
51950C13875o944o331n769n243m538l803l387l190k747j918j059n02l23m98r08
51935B66715j168r88o40p18j300j799j737j264p66l73j15k61j065k194k891k754
51919B46682k201j947k199k573k706k669k680k738k778k936l321l664l519k864
51905B07887k144j744j699j916k270k475k238j727j473j648j768j385p41m04m59
$$ y = [862200, 870515, 878322, 884813, 889591, 892785, 894998, 896983, 898820, 899410, 897315, 892193, 884853, 875825, 864692, 851177, 836106, 820576, 804714, 787931, 770079, 751605, 732764, 713316, 692981, 671678, 649439, 626576, 603876, 582094, 561230, 540676, 520090, 499764, 480286, 462228, 446047, 431740, 418567, 405536, 392273, 379142, 366645, 355117, 344883, 336121, 328450, 321141, 313875, 306931, 300600, 294831, 289588, 285050, 281247, 277860, 274670, 271923, 270005, 268946, 268444, 268121, 267623, 266715, 265547, 264559, 263919, 263201, 261901, 260102, 258365, 257101, 256335, 255962, 255847, 255586, 254521, 252327, 249436, 246682, 244481, 242534, 240335, 237762, 235056, 232387, 229707, 226969, 224191, 221255, 217934, 214270, 210751, 207887, 205743, 203999, 202300, 200384, 198114, 195639, 193401, 191674, 190201, 188553, 186785, 185400, 184659, 184255, 183796]
51890A83796m78j58L02N12L47L4j25j18k79q40j430j324l61O79Q80K41m28n34
51872A80716k56l0Q2K45L84K78J06L82J194J901J946J648J682J935J667Q19L40
51855A95039Q39J625J702J111O19M67L12J26K83P56J034R14O65L74j81q15q81
51838B03989k01N69Q00N45J44k38m05n0O66J039P01J03k48m98r04j099n46N29
51820B04896J250J050J56p07q65j40Q88J313Q64K35K01O96J057R06M24L9J19P73
51802B13155J653K183K243K250K427K360J661O30j58n45n89j01J010K187K676
51787B33042K460K195K271K421K247J768J385J523K302L306L833L565K823J989
51773B67130J033j14j097j559j720j989k295k266j937j659j524j428j530k047
$$ y = [183796, 183318, 183160, 183462, 183974, 184321, 184355, 184230, 184112, 183833, 182993, 181563, 180239, 179878, 180557, 181437, 181678, 181250, 180716, 180460, 180430, 180512, 180757, 181141, 181419, 181525, 181907, 183101, 185002, 186948, 188596, 190278, 192213, 193880, 194699, 195039, 195878, 197503, 199205, 200316, 200935, 201402, 201714, 201840, 202123, 202879, 203913, 204827, 205492, 205866, 205685, 204870, 203989, 203788, 204357, 205157, 205702, 205846, 205608, 205203, 205153, 205819, 206858, 207559, 207662, 207414, 206916, 206012, 204913, 204367, 204896, 206146, 207196, 207352, 206645, 205780, 205640, 206528, 207841, 208705, 208940, 209141, 209837, 210894, 211800, 212224, 212263, 212382, 213155, 214808, 216991, 219234, 221484, 223911, 226271, 227932, 228562, 228404, 227859, 227270, 227169, 228179, 230366, 233042, 235502, 237697, 239968, 242389, 244636, 246404, 247789, 249312, 251614, 254920, 258753, 262318, 265141, 267130, 268163, 268049, 266952, 265393, 263673, 261684, 259389, 257123, 255186, 253527, 252003, 250575, 249045, 246998]
51759B46998k567k304j059N39J756K276J968Q22p19j858k146j786j222p31m70
51744B39497m67m61j54K80L44m0l77l64l23o35j107j239q46j09O93J264J290O75
51726B37921l02j265k024k511k629k394k084k025k209k311k038j453r07o99p88
51711B12282q91q62q66j111j516j861k112k329k351j910j076l41j19l58p32j041
51695A92806j319j645j910j773r66L03J421K040K469L140L933M466M861N651O851
51680B20328P711P533O327M463K197m4j501j796j557j800k630l195k907k242k005
51665B28882k259k396k065j616j556j993k687l381l863l860l256k377j817j889
51651A93867k326k634k570k205j645r05q6M82M71l9n29o20n07o11q93r11o15m87
$$ y = [246998, 244431, 242127, 241068, 241607, 243363, 245639, 247607, 248429, 247710, 245852, 243706, 241920, 240698, 239967, 239497, 239030, 238569, 238415, 238695, 239039, 238999, 238622, 238258, 237935, 237300, 236193, 234954, 234108, 233999, 234692, 235956, 237246, 237921, 237619, 236354, 234330, 231819, 229190, 226796, 224712, 222687, 220478, 218167, 216129, 214676, 213769, 213070, 212282, 211391, 210529, 209663, 208552, 207036, 205175, 203063, 200734, 198383, 196473, 195397, 195056, 194937, 194579, 193847, 192806, 191487, 189842, 187932, 186159, 185193, 185496, 186917, 188957, 191426, 194566, 198499, 202965, 207826, 213477, 220328, 228039, 235572, 241899, 246362, 248559, 248515, 247014, 245218, 243661, 241861, 239231, 236036, 233129, 230887, 228882, 226623, 224227, 222162, 220546, 218990, 216997, 214310, 210929, 207066, 203206, 199950, 197573, 195756, 193867, 191541, 188907, 186337, 184132, 182487, 181582, 181496, 181978, 182449, 182410, 181881, 181261, 180754, 180143, 179250, 178339, 177724, 177237]
51633A77237p12p71l58j56r04k047k222j084K77Q29O41K27k24n50l81K42N97K87
51615A70928j01O9M07J28p22j374j445j188q60n05k14m3K45Q22J429J800K175
51598A71551K763L059K495J554J378K232L245L744M000M398M634M199L230K417
51584B14899K293K859L698M281M355M045L529K737J657P02L62O34J181J763K097
51569B51092J628J93j298j670q79J13P80J442K201K564K450K659L672M756M907
51554B74610M161L321K842K584K377K207J956J462P91J65l40q70j630k716l871
51539B87049m508m277l633l359l426l003j821q22r80j981k730k762k464k164j713
51524B47406j029m54l56p20j226j543j439q64r2L97K94k47q04j129j309j457j391
$$ y = [177237, 176525, 175754, 175396, 175240, 174336, 172289, 170067, 168983, 169260, 170089, 170730, 170957, 170733, 170183, 169802, 170044, 170641, 170928, 170827, 170896, 171303, 171431, 170709, 169335, 167890, 166702, 165842, 165337, 165123, 165080, 165325, 166147, 167576, 169376, 171551, 174314, 177373, 179868, 181422, 182800, 185032, 188277, 192021, 196021, 200419, 205053, 209252, 212482, 214899, 217192, 220051, 223749, 228030, 232385, 236430, 239959, 242696, 244353, 245055, 245417, 246051, 247232, 248995, 251092, 252720, 252913, 251615, 249945, 249066, 249179, 249959, 251401, 253602, 256166, 258616, 261275, 264947, 269703, 274610, 278771, 282092, 284934, 287518, 289895, 292102, 294058, 295520, 296311, 296476, 296136, 295266, 293636, 290920, 287049, 282541, 278264, 274631, 271272, 267846, 264843, 263022, 262200, 261220, 259239, 256509, 253747, 251283, 249119, 247406, 246377, 245923, 245567, 244847, 243621, 242078, 240639, 239775, 239683, 240080, 240374, 240127, 239323, 238194, 236885, 235428, 234037]
51507B34037r00k80j26m84o84l70j12n22j135j006j41N39N70L89L45J55l71q73
51489B29031j063j103j003m23N62J170R72O26R75J875K525K568K324K175K244
51474B43455K480K716K783K819L170L761M063L895L792M177M716M860M528L886
51460B95101K966K026J645J937K104J381k4j461k747l923m672m782m787n283n897
51445B73584n792m912l924l183k630k448k814l158k653j532q87j096j351j008
51431B36196m91m30p33r26q39n78k76k28q03j886k855l296l361l311l138k888
51415B10157k872l234l702l970l983l772l437l322l657l912l252j858j025j531
51401A66630k540k755k040j298j160j520k075k569k651k131j383r40q07o00l51
$$ y = [234037, 233137, 232857, 232731, 232247, 231563, 231193, 231081, 230559, 229424, 228418, 228277, 228816, 229386, 229775, 230120, 230275, 229904, 229031, 227968, 226865, 225862, 225439, 226001, 227171, 228143, 228769, 229744, 231619, 234144, 236712, 239036, 241211, 243455, 245935, 248651, 251434, 254253, 257423, 261184, 265247, 269142, 272934, 277111, 281827, 286687, 291215, 295101, 298067, 300093, 301738, 303675, 305779, 307160, 307136, 305675, 302928, 299005, 294333, 289551, 284764, 279481, 273584, 267792, 262880, 258956, 255773, 253143, 250695, 247881, 244723, 242070, 240538, 239651, 238555, 237204, 236196, 235705, 235275, 234542, 233616, 232777, 232199, 231923, 231695, 230892, 229006, 226151, 222855, 219494, 216183, 213045, 210157, 207285, 204051, 200349, 196379, 192396, 188624, 185187, 181865, 178208, 174296, 171044, 169186, 168161, 166630, 164090, 161335, 159295, 157997, 156837, 155317, 153242, 150673, 148022, 145891, 144508, 143568, 142761, 142161, 141810]
51386A41810n17j100j402q90L3M86P3p99j456j520j092n97m57q43j530k005j758
51369A26436p15N20J037M48p21j581j713j278n15M34J255J529J343J429K239L139
51353A33286L035J798N50L80J178K027K389K413K311K015J586J435J876K607K989
51338A61875K666J829R14K36j98n73r97j361j577j864k477l253l678l580l280
51323A44682l021k615j942j327j090j020q05o29q70j341j416r00k91j00l54q05
51307A26156j271j579j559j243q66n70l06o3K7q7k91m63n85o41n81m42l47l20
51289A14969k63r0K39O73R56P73K48P8O95J524J586Q07J22J91N43L44m67j212
51271A21716j393j142q48o72m93k04O2N9k07l96l17k10l63n75m78j95j60l16j36
$$ y = [141810, 141293, 140193, 138791, 137901, 137934, 138420, 138493, 137694, 136238, 134718, 133626, 133029, 132572, 131729, 130199, 128194, 126436, 125721, 126241, 127278, 127726, 127005, 125424, 123711, 122433, 121918, 122352, 123607, 125136, 126479, 127908, 130147, 133286, 136321, 138119, 138669, 139049, 140227, 142254, 144643, 147056, 149367, 151382, 152968, 154403, 156279, 158886, 161875, 164541, 166370, 167284, 167520, 167322, 166749, 165752, 164391, 162814, 160950, 158473, 155220, 151542, 147962, 144682, 141661, 139046, 137104, 135777, 134687, 133667, 132862, 132233, 131363, 130022, 128606, 127706, 127415, 127315, 126961, 126156, 124885, 123306, 121747, 120504, 119638, 119068, 118762, 118699, 118726, 118639, 118348, 117885, 117300, 116659, 116078, 115636, 115289, 114969, 114706, 114616, 114855, 115528, 116484, 117257, 117505, 117583, 118278, 119802, 121388, 122195, 122317, 122508, 123051, 123395, 122928, 121716, 120323, 119181, 118333, 117661, 117168, 116964, 117026, 117085, 116878, 116482, 116165, 115955, 115592, 115017, 114539, 114344, 114184, 113868, 113732]
51252A13732M06O22J67k95oP62J102P42K57J30K09K13J88K82L83L29K34L06M34
51233A20197K32l42p17k93P40J529J570J236J135J236J124Q18P73J081J248R84
51217A32551O43O79R86J147J012P30M82L97N67R02J073R12N90L17K8l74p00o43
51199A41299j87L57O50N98M48O16J151J456Q97k20q50n75j23k42o49o87m52n30
51181A42957r01r78n77j50n8k03m17o31o53l61j34m39r50p82K04J086J107N99
51163A38719K55K04K14L19N55N55L2n71n91j77j29p34j437j730j844k159k451
51146A29030k157j352q70j290k008j804m07R78J091K66o2N57R36M2j402j895j173
51129A18480k20L12O74R92Q06%p23p72m54l02k34K7K83K74L16Q20J485J660J351
$$ y = [113732, 114138, 114760, 114927, 114632, 114626, 115388, 116490, 117232, 117489, 117619, 117828, 118041, 118229, 118511, 118894, 119223, 119457, 119763, 120197, 120429, 120087, 119370, 119077, 119817, 121346, 122916, 124152, 125287, 126523, 127647, 128465, 129238, 130319, 131567, 132551, 133194, 133873, 134859, 136006, 137018, 137748, 138230, 138627, 139194, 140096, 141169, 142081, 142671, 142988, 143016, 142642, 141942, 141299, 141112, 141469, 142119, 142717, 143165, 143781, 144932, 146388, 147285, 147065, 146215, 145640, 145517, 145275, 144626, 143939, 143487, 142957, 142056, 141078, 140501, 140351, 140293, 140090, 139673, 139042, 138389, 138028, 137894, 137455, 136505, 135723, 135927, 137013, 138120, 138719, 138974, 139178, 139392, 139711, 140266, 140821, 140853, 140282, 139691, 139514, 139385, 138651, 137214, 135484, 133640, 131481, 129030, 126873, 125521, 124651, 123361, 121353, 119549, 119142, 120120, 121211, 121477, 121415, 121972, 122908, 122950, 121548, 119653, 118480, 118260, 118572, 119246, 120238, 121044, 121044, 120321, 119549, 119095, 118793, 118559, 118586, 118869, 119143, 119459, 120279, 121764, 123424, 124775]
51110A24775J118J106Q92L77N6K21N33O39O68Q36J023J074J108J219J191R31P70
51093A38537J053J559J746J355N30m36j115r88N9J311J800J322N68K20K82L92
51077A48195M64P04J196J672J736J248M81j60n36q63j303j608j355m99M21P27
51061A50520K05o64j106p33J06O66N64M1l97m89k67P0K38K6m74r00j022q99n43
51042A44942K54J431K318K167J073o8m64j06N11J062J605K296K980L185K611J630
51026A67427J022J145J624K011K310K614K618K049J324J151J560J911J841J681
51012A92288J828K226K661L039L162K739J942J535K003K899L430L514L721M333
50998B31320M958N221N376N904O746P383P630P997R011J0508J1916J3122J4553
$$ y = [124775, 125893, 126999, 127891, 128268, 128324, 128545, 129078, 129717, 130385, 131221, 132244, 133318, 134426, 135645, 136836, 137767, 138537, 139590, 141149, 142895, 144250, 144780, 144344, 143229, 142241, 142300, 143611, 145411, 146733, 147301, 147521, 147803, 148195, 148659, 149363, 150559, 152231, 153967, 155215, 155696, 155536, 155000, 154137, 152834, 151226, 149871, 149372, 149793, 150520, 150725, 150061, 148955, 148222, 148328, 148994, 149558, 149599, 149202, 148713, 148446, 148516, 148754, 148780, 148306, 147406, 146384, 145485, 144942, 145196, 146627, 148945, 151112, 152185, 152117, 151653, 151547, 152058, 153120, 154725, 157021, 160001, 163186, 165797, 167427, 168449, 169594, 171218, 173229, 175539, 178153, 180771, 182820, 184144, 185295, 186855, 188766, 190607, 192288, 194116, 196342, 199003, 202042, 205204, 207943, 209885, 211420, 213423, 216322, 219752, 223266, 226987, 231320, 236278, 241499, 246875, 252779, 259525, 266908, 274538, 282535, 291546, 302054, 313970, 327092, 341645]
50985C41645J6368J8152J9610K1097K3078K5416K7733L0183L3244L6938M0782
50974F34246M4442M7833N0586N2145N2601N2846N3581N4465N4470N2782M9197
50963A199194M4042L7923L1358K4521J7506J0810N068K80m200q720j2894j6299
50951A328589j8960k0834k1364k0215j8062j6060j4675j3622j2780j2587j3404
50940A146026j4966j6713j8357k0018k1909k4148k6687k9321l1742l3715l5200
50929H73250l6285l6867l6517l4915l2434l0018k8227k6697k4841k2723k0774
50918E42952j8925j6692j4001j1336r044p126n700m955m506l557j968m64M50J072
50904D46200J694K063K124K389K970L034K030Q06N53J158J600J547J519J729J897
$$ y = [341645, 358013, 376165, 395775, 416872, 439950, 465366, 493099, 523282, 556526, 593464, 634246, 678688, 726521, 777107, 829252, 881853, 934699, 988280, 1042745, 1097215, 1149997, 1199194, 1243236, 1281159, 1312517, 1337038, 1354544, 1365354, 1370422, 1370702, 1366502, 1357782, 1344888, 1328589, 1309629, 1288795, 1267431, 1247216, 1229154, 1213094, 1198419, 1184797, 1172017, 1159430, 1146026, 1131060, 1114347, 1095990, 1075972, 1054063, 1029915, 1003228, 973907, 942165, 908450, 873250, 836965, 800098, 763581, 728666, 696232, 666214, 637987, 611290, 586449, 563726, 542952, 524027, 507335, 493334, 481998, 472954, 465828, 460128, 455173, 450667, 447110, 445142, 444678, 445128, 446200, 447894, 449957, 452081, 454470, 457440, 460474, 462504, 463310, 463863, 465021, 466621, 468168, 469687, 471416, 473313]
50889D73313K112K813L825M308L925L311L236L911N198O763P989Q461Q663R472
50875E47300J0927J2305J3531J5429J8292K1269K3743K6360K9944L4222L8496
50864G91818M2950M8241N4271O0485O7097P4888Q3689R2119R9174J05334J11584
50853A631650J17897J23173J26344J27032J25207J20660J12903J01558Q6828O9662
50843B742914N1346L2950J5138j577j6729l0026m1290n0045n5455n7031n5360
50832B534835n1724m6951m0962l3709k6271k0522j7672j7497j9176k2498k7795
50821B210058l4916m2782n0181n6706o2701o8483p3816p8063q0634q1290q0182
50810A500304p7701p4244p0055o5189n9599n3320m6659m0143l4142k8610k3295
$$ y = [473313, 475425, 478238, 482063, 486371, 490296, 493607, 496843, 500754, 505952, 512715, 520704, 529165, 537828, 547300, 558227, 570532, 584063, 599492, 617784, 639053, 662796, 689156, 719100, 753322, 791818, 834768, 883009, 937280, 997765, 1064862, 1139750, 1223439, 1315558, 1414732, 1520066, 1631650, 1749547, 1872720, 1999064, 2126096, 2251303, 2371963, 2484866, 2586424, 2673252, 2742914, 2794260, 2827210, 2842348, 2840771, 2824042, 2794016, 2752726, 2702681, 2647226, 2590195, 2534835, 2483111, 2436160, 2395198, 2361489, 2335218, 2314696, 2297024, 2279527, 2260351, 2237853, 2210058, 2175142, 2132360, 2082179, 2025473, 1962772, 1894289, 1820473, 1742410, 1661776, 1580486, 1500304, 1422603, 1348359, 1278304, 1213115, 1153516, 1100196, 1053537, 1013394, 979252, 950642, 927347]
50799I27347j8155j3401r090m918n98L755P753J1256J4519J7685K0334K1809K2071
50786A000367K1871K1776K1236J9191J5602J1760Q774O269L139q22m785q211j1477
50773A104690j4965j8302k0909k2824k4463k5818k6406k5907k4557k2890k1322
50762H56327j9944j8558j6869j4724j2116r034n509j842J566M742Q180J2149J6300
50749H00668K0218K4004K7912L1780L5424L9387M4531N0732N6804O2020O7188
50738A260668P3502Q0749Q7218R1385R2993R2458Q9796Q4569P6583O6012N2982
50727B148915L7536K0272K720j3379k7202l8938m8710n5722n8891n8192n4928
50716A853481n0503m5326l9241l2649k6648k2031j8719j6372j5134j5482j7571
$$ y = [927347, 909192, 895791, 886701, 881783, 881185, 884940, 892693, 903949, 918468, 936153, 956487, 978296, 1000367, 1022238, 1044014, 1065250, 1084441, 1100043, 1111803, 1120577, 1126846, 1129985, 1129163, 1124378, 1116167, 1104690, 1089725, 1071423, 1050514, 1027690, 1003227, 977409, 951003, 925096, 900539, 877649, 856327, 836383, 817825, 800956, 786232, 774116, 765082, 759573, 757731, 759297, 764039, 772219, 784368, 800668, 820886, 844890, 872802, 904582, 940006, 979393, 1023924, 1074656, 1131460, 1193480, 1260668, 1334170, 1414919, 1502137, 1593522, 1686515, 1778973, 1868769, 1953338, 2029921, 2095933, 2148915, 2186451, 2206723, 2209443, 2196064, 2168862, 2129924, 2081214, 2025492, 1966601, 1908409, 1853481, 1802978, 1757652, 1718411, 1685762, 1659114, 1637083, 1618364, 1601992, 1586858, 1571376, 1553805]
50705A553805k1089k5622l0784l6118m1085m5263m8275m9769m9696m8415m6258
50694A111431m3113l8861l4009k9363k5073k0609j5843j1450p985n025j728K221
50682H80593O609J1278J6216K1295K6326L1296L6160M0592M4226M6905M8412M8357
50670A258265M6794M4571M2348L9604L5363K9829K4374J9832J5647J1014O033
50659A573674J279l086p219j1070j4565j7957k1391k4320k5929k6034k5085k3349
50647A374948k0634j6877j2526q198m210n35L079O940J1110J5128J8241K0049
50635A386515K0725K0607J9804J8356J6498J4477J2333J0176Q547Q100Q761R674
50623A554573J0282J1207J3570J7432K1357K3648K3724K2090J9350J5647J0938
$$ y = [1553805, 1532716, 1507094, 1476310, 1440192, 1399107, 1353844, 1305569, 1255800, 1206104, 1157689, 1111431, 1068318, 1029457, 995448, 966085, 941012, 920403, 904560, 893110, 885125, 880100, 878372, 880593, 887202, 898480, 914696, 935991, 962317, 993613, 1029773, 1070365, 1114591, 1161496, 1209908, 1258265, 1305059, 1349630, 1391978, 1431582, 1466945, 1496774, 1521148, 1540980, 1556627, 1567641, 1573674, 1574953, 1571867, 1564648, 1553578, 1539013, 1521056, 1499665, 1475345, 1449416, 1423382, 1398297, 1374948, 1354314, 1337437, 1324911, 1316713, 1312503, 1311968, 1315047, 1321987, 1333097, 1348225, 1366466, 1386515, 1407240, 1427847, 1447651, 1466007, 1482505, 1496982, 1509315, 1519491, 1528038, 1536138, 1544899, 1554573, 1564855, 1576062, 1589632, 1607064, 1628421, 1652069, 1675793, 1697883, 1717233, 1732880, 1743818]
50612A743818N355p17o691j1901j5975j9111k1730k3912k5395k6191k6770k7581
50600A543199k8687l0079l2021l4667l7605m0143m2050m3577m4825m5388m4938
50589A119219m3740m2259m0421l7780l4396l1157k8829k7087k4869k1628j7806
50578G69247j4157j1024q395o145m007j623J037L621N949Q293J0799J3073J4788
50565G81456J6280J8023J9816K1228K2590K4628K7188K9224L0325L1342L3084
50554A055184L5104L6421L6886L7119L7407L7399L6760L5578L4142L2774L1785
50543A446559L1257L0870L0346K9964L0201L0902L1244L0652K9410K8256K7730
50532A777391K8109K9624L2324L5739L9034M1578M3366M4767M5965M6664M6425
$$ y = [1743818, 1749173, 1748456, 1741765, 1729864, 1713889, 1694778, 1673048, 1649136, 1623741, 1597550, 1570780, 1543199, 1514512, 1484433, 1452412, 1417745, 1380140, 1339997, 1297947, 1254370, 1209545, 1164157, 1119219, 1075479, 1033220, 992799, 955019, 920623, 889466, 860637, 833550, 808681, 787053, 769247, 755090, 744066, 735671, 729526, 725519, 723896, 724933, 728554, 734503, 742796, 753595, 766668, 781456, 797736, 815759, 835575, 856803, 879393, 904021, 931209, 960433, 990758, 1022100, 1055184, 1090288, 1126709, 1163595, 1200714, 1238121, 1275520, 1312280, 1347858, 1382000, 1414774, 1446559, 1477816, 1508686, 1539032, 1568996, 1599197, 1630099, 1661343, 1691995, 1721405, 1749661, 1777391, 1805500, 1835124, 1867448, 1903187, 1942221, 1983799, 2027165, 2071932, 2117897, 2164561, 2210986]
50521B210986M5084M2697L9089L3825K6718J8283R341L35q769j7967k6821l4770
50509B338031m1599m7464n2449n6271n8424n8545n6538n2502m6812m0299l4055
50498A793073k8780k4308k0098j6015j2495r911q106o533m656k132J019M287O825
50485A672170P889P046M042j184q247j6395k4989l3663m1928m9033n4504n8458
50473A402746o1033o1857o0520n7487n3913n0569m7320m3767m0017l6528l3465
50462H56270l0455k7030k3196j9485j6450j4028j1589q752o061m457m050l716
50450F87001k245L68L084N198P041R140J1198J2495J3113J4082J6025J8334K0138
50437H14972K1581K3422K5705K7649K8953L0314L2275L4271L5406L5753L6139
$$ y = [2210986, 2256070, 2298767, 2337856, 2371681, 2398399, 2416682, 2426023, 2426358, 2417589, 2399622, 2372801, 2338031, 2296432, 2248968, 2196519, 2140248, 2081824, 2023279, 1966741, 1914239, 1867427, 1827128, 1793073, 1764293, 1739985, 1719887, 1703872, 1691377, 1681466, 1673360, 1666827, 1662171, 1660039, 1661058, 1665345, 1672170, 1680059, 1687105, 1691147, 1689963, 1681716, 1665321, 1640332, 1606669, 1564741, 1515708, 1461204, 1402746, 1341713, 1279856, 1219336, 1161849, 1107936, 1057367, 1010047, 966280, 926263, 889735, 856270, 825815, 798785, 775589, 756104, 739654, 725626, 714037, 705285, 699224, 694767, 690717, 687001, 684756, 685124, 688208, 693406, 700447, 709587, 720785, 733280, 746393, 760475, 776500, 794834, 814972, 836553, 859975, 885680, 913329, 942282, 972596, 1004871, 1039142, 1074548, 1110301, 1146440]
50426A146440L6964L7837L8419L8963L9836M0913M1719M1978M1833M1583M1415
50415A587900M1381M1571M2037M2433M1918L9748L6008L1402K6346K0660J4357
50404A965761Q105K426l172r587j6904k4316l1250l7900m4477n0514n5290n8641
50392A644241o1033o2929o4283o4617o3435o0724n6973n2738m8166m3143l7737
50381A028463l2292k7053k2005j7109j2485q239m333o43K970O639J0186J2881
50369I36980J3847J2983J1103Q997O545L126j377o274j0780j4643j8016k0910
50357I21581k2963k3773k3471k2841k2755k3269k3540k2787k1137j9260j7379
50346F78406j5132j2419r844p999o703n414m087l120k511j692l58J058K048K806
$$ y = [1146440, 1183404, 1221241, 1259660, 1298623, 1338459, 1379372, 1421091, 1463069, 1504902, 1546485, 1587900, 1629281, 1670852, 1712889, 1755322, 1797240, 1836988, 1872996, 1904398, 1930744, 1951404, 1965761, 1973866, 1976292, 1973120, 1963533, 1946629, 1922313, 1891063, 1853163, 1808686, 1758172, 1702882, 1644241, 1583208, 1520279, 1455996, 1391379, 1327944, 1267220, 1210247, 1157509, 1109343, 1066200, 1028463, 996171, 969118, 947113, 930004, 917519, 909280, 904947, 904304, 907274, 913913, 924099, 936980, 950827, 963810, 974913, 983910, 990455, 993581, 992204, 985930, 975150, 960507, 942491, 921581, 898618, 874845, 851374, 828533, 805778, 782509, 758969, 736182, 715045, 695785, 678406, 663274, 650855, 641011, 633012, 626309, 620895, 616808, 613688, 611177, 609485, 609127, 610185, 612233, 615039]
50332F15039L852N064N676N341M782N105O637Q705J0445J1652J2697J3813J4728
50319G23536J5091J5065J5182J5619J5916J5644J5037J4713J4920J5350J5692
50308H91765J5958J6167J6011J5091J3504J1995J1312J1326J0984R442P215N645
50296A036415N167M637K839O4k427m222o170r048j2664j6358j9742k2575k4629
50283I31287k5959k6911k7521k7356k6242k4697k3342k2242k1173k0161j9382
50272F66301j8711j7727j5990j3342j0257p863p018p150o716n130l564l320m153
50259E45360m838m832m528m221l820l353k975k541j836j186j129j563j973k304
50245E04261k868l334k845j398j55J9l56l39R7L95N97J346K740L948M172L583
$$ y = [615039, 618891, 623955, 629631, 634972, 639754, 644859, 651496, 660201, 670646, 682298, 694995, 708808, 723536, 738627, 753692, 768874, 784493, 800409, 816053, 831090, 845803, 860723, 876073, 891765, 907723, 923890, 939901, 954992, 968496, 980491, 991803, 1003129, 1014113, 1023555, 1030770, 1036415, 1041582, 1046219, 1049058, 1049122, 1046695, 1042473, 1036303, 1027255, 1014591, 998233, 978491, 955916, 931287, 905328, 878417, 850896, 823540, 797298, 772601, 749259, 727017, 705844, 685683, 666301, 647590, 629863, 613873, 600531, 590274, 582411, 575393, 568243, 561527, 556397, 552833, 549513, 545360, 540522, 535690, 531162, 526941, 523121, 519768, 516793, 514252, 512416, 511230, 510101, 508538, 506565, 504261, 501393, 498059, 495214, 493816, 493661, 493680, 493324, 492985, 493082, 493477, 494074, 495420, 498160, 502108, 506280, 509863]
50229E09863L085L318M115M792M843M349L845L825M313M771M546L445J960P36
50215E61806o0o46j101j290j318j492j721j536r40o19r35j255r08k53j7o6K95
50198E47944J056J549J703K270L606N088O004O356O422O240N841N433M962M064
50184F08538K741J625J195J177J062P39K78l69j069j339r78m76l14k47J49N40
50168F13252J88r06j848j886j116j39N53P59N16P7l12o51j105j584j739j457j129
50151F01473j156j358j114j54J028J687J686J568J790K190K426K581L026L741
50137F19414M250M234L921L692L559L201K416J404O51N11Q29J048P87J56n12j022
50121F48539j215r19l14m8m63r94q30RR37J906L477N740Q023R811J1257J2587
$$ y = [509863, 512948, 516266, 520381, 525173, 530016, 534365, 538210, 542035, 546348, 551119, 555665, 559110, 561070, 561806, 561746, 561100, 559999, 558709, 557391, 555899, 554178, 552642, 551702, 551083, 550148, 548893, 547985, 547732, 547715, 547649, 547944, 549000, 550549, 552252, 554522, 558128, 563216, 569220, 575576, 581998, 588238, 594079, 599512, 604474, 608538, 611279, 612904, 614099, 615276, 616338, 617077, 617355, 616986, 615917, 614578, 613600, 613124, 612810, 612563, 612712, 613252, 613440, 612534, 610686, 608800, 607684, 607545, 608098, 608857, 609373, 609450, 609138, 608487, 607382, 605798, 604059, 602602, 601473, 600317, 598959, 597845, 597691, 598719, 600406, 602092, 603660, 605450, 607640, 610066, 612647, 615673, 619414, 623664, 627898, 631819, 635511, 639070, 642271, 644687, 646091, 646742, 647253, 648082, 649130, 649917, 650073, 649561, 648539, 647324, 646405, 646091, 646043, 645580, 644586, 643756, 643765, 644702, 646608, 650085, 655825, 663848, 673659, 684916, 697503]
50105F97503J3825J5350J7938K1755K5921K9686L3412L7916M3413M9736N6995
50094A043450O5215P3580Q0826Q6274Q9849R1292Q9981Q5629P8647O9903O0534
50083A915180N1905M5180M0781L8442L7656L7685L7231L4670K8739J8953N484
50072B291906j0949k9095m7372o4173p8017q7816r3333r5218r4275r0844q5182
50061A515632p8117p0690o3360n6002m8739m2148l6643l2065k8082k4617k1739
50050A013430j9474j7831j6804j6202j5679j5039j4360j3706j2943j1887j0614
50039H48891r508q948q819q396p035m986l190k170j551q44j46L93J196K654M195
50024H01736M784M282L583L390L551L710L854M005L926L499K954K443J836J185
$$ y = [697503, 711328, 726678, 744616, 766371, 792292, 821978, 855390, 893306, 936719, 986455, 1043450, 1108665, 1182245, 1263071, 1349345, 1439194, 1530486, 1620467, 1706096, 1784743, 1854646, 1915180, 1967085, 2012265, 2053046, 2091488, 2129144, 2166829, 2204060, 2238730, 2267469, 2286422, 2291906, 2280957, 2251862, 2204490, 2140317, 2062300, 1974484, 1881151, 1785933, 1691658, 1600814, 1515632, 1437515, 1366825, 1303465, 1247463, 1198724, 1156576, 1119933, 1087868, 1059786, 1035169, 1013430, 993956, 976125, 959321, 943119, 927440, 912401, 898041, 884335, 871392, 859505, 848891, 839383, 830435, 821616, 813220, 806185, 801199, 798009, 795839, 794288, 793444, 793298, 793691, 794887, 797541, 801736, 806520, 810802, 814385, 817775, 821326, 825036, 828890, 832895, 836821, 840320, 843274, 845717, 847553, 848738]
50010H48738R45J348J976K329K492K903L652M444N060N565O108O897Q135R756
49996I10348J1357J2694J4129J6162J8626K0792K2370K3982K6456K9916L3875
49985A140707L8012M2498M7651N3614O0477O8424P7556Q7764R8837J10406J21459
49974A947405J30152J34758J34921J31625J25831J17675J07332R6224Q6651Q0191
49964C092765P6812P5425P4693P3153O9032O0573M6708K7435L676k2949n0284
49953C527039p5845r7495j14204j26293j34777j40497j43890j45238j44690j42023
49943B262087j36975j29956j22001j13813j05348r6645q8313q0691p3116o4949
49933A250280n6931n0450m5517m0600l4787k9077k4968k2547k0779j9062j7577
$$ y = [848738, 849683, 851031, 853007, 855336, 857828, 860731, 864383, 868827, 873887, 879452, 885560, 892457, 900592, 910348, 921705, 934399, 948528, 964690, 983316, 1004108, 1026478, 1050460, 1076916, 1106832, 1140707, 1178719, 1221217, 1268868, 1322482, 1382959, 1451383, 1528939, 1616703, 1715540, 1825946, 1947405, 2077557, 2212315, 2347236, 2478861, 2604692, 2722367, 2829699, 2925923, 3012574, 3092765, 3169577, 3245002, 3319695, 3392848, 3461880, 3522453, 3569161, 3596596, 3600272, 3577323, 3527039, 3451194, 3353699, 3239495, 3113202, 2978425, 2837928, 2694038, 2548800, 2404110, 2262087, 2125112, 1995156, 1873155, 1759342, 1653994, 1557349, 1469036, 1388345, 1315229, 1250280, 1193349, 1142899, 1097382, 1056782, 1021995, 992918, 967950, 945403, 924624, 905562, 887985]
49922H87985j6383j5148j3969j3647j4720j6585j8009j8328j7879j7329j6940
49911G09048j6569j6105j5611j5077j4325j3299j2256j1427j0614r428p890o494
49899E59953n611n122m707m258l823l360k763k059j387r13p74r63j103o16O31
49884E23125K002K711K724K730L164L718L938L995M469N468O421O871P142P924
49870E86402R353J0913J2271J3778J5911J8494K0951K3270K6326L0983L7164M4010
49858H49826N0833N7598O4596P1978P9692Q7416R4217R8540R9007R5359Q8371
49847A737433P8989O8025N6693M6780L9712L5660L3867L3532L3752L2868K8666
49836B225977J9658N855j1714l1758n2845p3184r0855j04307j12712j16044j14967
$$ y = [887985, 871602, 856454, 842485, 828838, 814118, 797533, 779524, 761196, 743317, 725988, 709048, 692479, 676374, 660763, 645686, 631361, 618062, 605806, 594379, 583765, 574337, 566447, 559953, 554342, 549220, 544513, 540255, 536432, 533072, 530309, 528250, 526863, 525950, 525176, 524213, 523110, 522494, 523125, 525127, 527838, 530562, 533292, 536456, 540174, 544112, 548107, 552576, 558044, 564465, 571336, 578478, 586402, 595755, 606668, 618939, 632717, 648628, 667122, 688073, 711343, 737669, 768652, 805816, 849826, 900659, 958257, 1022853, 1094831, 1174523, 1261939, 1356156, 1454696, 1553703, 1649062, 1737433, 1816422, 1884447, 1941140, 1987920, 2027632, 2063292, 2097159, 2130691, 2164443, 2197311, 2225977, 2245635, 2251490, 2239776, 2208018, 2155173, 2081989, 1991134, 1886827, 1774115, 1658071, 1543104]
49825A543104j10415j03277r4497q5252p6521o8488o0793n3427m6814m0974l5338
49814G67308k9716k4848k1483j9357j7567j5618j3618j1746j0137r033q518q188
49802E77479p572o734o092n792n704n828o237o691o809o612o437o296n772m644
49788D90259l297k416k357k852l189k821j961j339j272j318j013n66l75l64k99
49773D64820l75q22j245j031l17J91K51K86M86M83O6l47k63K63P35P38K44l55
49755D63808m87K4Q00J441J962K414K426J788J065R83J350J357Q79O72J283K491
49739D84256L778M715M852M043K870K048J399K74r98j190Q2J701K494K431J949
49724E14704J144K52JO47J275Q97k66j314j891k170k083j458o70l52n17o62o05
$$ y = [1543104, 1432689, 1329412, 1234915, 1149663, 1073142, 1004654, 943861, 890434, 843620, 802646, 767308, 737592, 712744, 691261, 671904, 654337, 638719, 625101, 613355, 603218, 594185, 585667, 577479, 569907, 563173, 557081, 551289, 545585, 539757, 533520, 526829, 520020, 513408, 506971, 500675, 494903, 490259, 486962, 484546, 482189, 479337, 476148, 473327, 471366, 470027, 468755, 467437, 466424, 465858, 465483, 465119, 464820, 464445, 463623, 462378, 461347, 461030, 461221, 461472, 461758, 462244, 462727, 462793, 462446, 462183, 462446, 463181, 463919, 464163, 463808, 463321, 463345, 464145, 465586, 467548, 469962, 472388, 474176, 475241, 476224, 477574, 478931, 479810, 480482, 481765, 484256, 488034, 492749, 497601, 501644, 504514, 506562, 507961, 508235, 507237, 506047, 506129, 507830, 510324, 512755, 514704, 515848, 516100, 516101, 516748, 518023, 518920, 518654, 517340, 515449, 513279, 511196, 509738, 509068, 508716, 508199, 507537, 506932]
49707E06932o38q69j025r33p55o24m54j45K02L84K66p4l82n04n49o52o41l64j41
49688D99034l20n27l9R70J486J061L37j61p18j409j408k35J170J606J250J041
49672E03138J025M87m78q13j2J216J982K149K055J987K171K702L311L650L794
49657E28364M048M304M215L911L931M267M256L545K664K281K398K557K529K461
49643E75731K586L035L752M414M640M400M103M193M699N255N495N415N335N391
49629F38444N284M716M064M083M877N632N632N003M186L312K512K284K843L572
49615F96444L769L570L536L658L565L432L876M987O228P174P826Q261Q622R306
49601G74254J0448J1425J1545J1165J1299J2273J3479J4492J5468J6497J7361
$$ y = [506932, 506294, 505425, 504400, 503467, 502712, 502088, 501634, 501489, 501691, 502075, 502341, 502267, 501885, 501381, 500832, 500180, 499539, 499175, 499034, 498714, 498187, 498148, 499118, 500604, 501665, 502002, 501841, 501123, 499714, 498306, 498071, 499241, 500847, 502097, 503138, 504163, 504650, 504172, 503359, 503347, 504563, 506545, 508694, 510749, 512736, 514907, 517609, 520920, 524570, 528364, 532412, 536716, 540931, 544842, 548773, 553040, 557296, 560841, 563505, 565786, 568184, 570741, 573270, 575731, 578317, 581352, 585104, 589518, 594158, 598558, 602661, 606854, 611553, 616808, 622303, 627718, 633053, 638444, 643728, 648444, 652508, 656591, 661468, 667100, 672732, 677735, 681921, 685233, 687745, 690029, 692872, 696444, 700213, 703783, 707319, 710977, 714542, 717974, 721850, 726837, 733065, 740239, 748065, 756326, 764948, 774254, 784702, 796127, 807672, 818837, 830136, 842409, 855888, 870380, 885848, 902345, 919706]
49590I19706J8144J9246K0632K1801K2651K3556K4476K4857K4755K5145K6671
49579A171640K8843L0889L2725L4549L6161L7281L8146L9170M0353M1421M2234
$$ y = [919706, 937850, 957096, 977728, 999529, 1022180, 1045736, 1070212, 1095069, 1119824, 1144969, 1171640, 1200483, 1231372, 1264097, 1298646, 1334807, 1372088, 1410234, 1449404, 1489757, 1531178, 1573412]
$$ [...]
##END NTUPLES=NMR SPECTRUM
##END=
