##TITLE=NES1013_LH_9233048_mQcQn3gpvg
##JCAMPDX= 6.0         $$ Bruker NMR JCAMP-DX V2.0
##DATA TYPE= NMR SPECTRUM
##DATA CLASS= NTUPLES
##ORIGIN= BRUKER
##OWNER= Administrator
$$ 1.72 TOPSPIN		Version 2.1
$$ 2015-08-24 19:50:37.498 -0700  Administrator@X
$$ Compression mode = diff/dup
##.OBSERVE FREQUENCY= 400.02188249412
##.OBSERVE NUCLEUS= ^1H
##.ACQUISITION MODE= SIMULTANEOUS (DQD)
##.ACQUISITION SCHEME= undefined
##.AVERAGES= 8
##.DIGITISER RES= 22
##SPECTROMETER/DATA SYSTEM= spect
##.PULSE SEQUENCE= zg30
##.SOLVENT NAME= COFFEE_meoh
##.SHIFT REFERENCE= INTERNAL, COFFEE_meoh, 1, 14.98509
##AUDIT TRAIL= $$ (NUMBER, WHEN, WHO, WHERE, PROCESS, VERSION, WHAT)
$$ ##TITLE= Audit trail, TOPSPIN		Version 2.1
$$ ##JCAMPDX= 5.01
$$ ##ORIGIN= Bruker BioSpin GmbH
$$ ##OWNER= Administrator
$$ $$ E:\/data/COFFEE/nmr/NES1013_LH_9233048_mQcQn3gpvg/20/pdata/1/auditp.txt
$$ ##AUDIT TRAIL=  $$ (NUMBER, WHEN, WHO, WHERE, PROCESS, VERSION, WHAT)
(   1,<2015-08-24 19:50:30.155 -0700>,<Administrator>,<X>,<go>,<TOPSPIN 2.1>,
      <created by zg
	started at 2015-08-24 19:49:23.701 -0700,
	POWCHK enabled, PULCHK disabled,
       configuration hash MD5:
       21 0F 79 D6 B3 7B B4 F6 88 20 88 DB 03 48 BD 9F
       data hash MD5: 64K
       8E C0 C8 87 6F AD 0F 6D D3 D5 91 F8 C3 0C E8 89>)
(   2,<2015-08-24 19:50:33.358 -0700>,<Administrator>,<X>,<proc1d>,<TOPSPIN 2.1>,
      <Start of raw data processing
       efp LB = 0 FT_mod = 6 PKNL = 1 PHC0 = 0 PHC1 = 0 SI = 32K 
       data hash MD5: 32K
       A9 2E B6 53 DE D7 9D AD 4E 9E C9 A7 3A 89 34 7D>)
(   3,<2015-08-24 19:50:33.655 -0700>,<Administrator>,<X>,<proc1d>,<TOPSPIN 2.1>,
      <pk PHC0 = 89.41772 PHC1 = 0 
       data hash MD5: 32K
       75 D2 5A 4B 23 0D D1 D0 4E 4E 85 EC 95 24 B8 C7>)
(   4,<2015-08-24 19:50:33.780 -0700>,<Administrator>,<X>,<proc1d>,<TOPSPIN 2.1>,
      <abs ABSG = 1 
       data hash MD5: 32K
       B4 E7 FB AB F1 E9 DA 9E C7 6F BD 81 9F A2 B8 2B>)
(   5,<2015-08-24 19:50:33.842 -0700>,<Administrator>,<X>,<proc1d>,<TOPSPIN 2.1>,
      <abs ABSG = 2 
       data hash MD5: 32K
       4B E0 AC 23 CE 06 0D F1 3D AC AF 80 41 DD 6A 8F>)
(   6,<2015-08-24 19:50:33.905 -0700>,<Administrator>,<X>,<proc1d>,<TOPSPIN 2.1>,
      <abs ABSG = 3 
       data hash MD5: 32K
       EB 73 AD A9 D8 41 94 5C A5 74 80 82 ED 65 E8 F1>)
(   7,<2015-08-24 19:50:33.967 -0700>,<Administrator>,<X>,<proc1d>,<TOPSPIN 2.1>,
      <abs ABSG = 4 
       data hash MD5: 32K
       75 89 6D 0F ED CB 6E 48 DE E8 B7 42 42 D6 1D 06>)
(   8,<2015-08-24 19:50:34.030 -0700>,<Administrator>,<X>,<proc1d>,<TOPSPIN 2.1>,
      <abs ABSG = 5 
       data hash MD5: 32K
       9D 12 50 AE AB 51 26 E9 AB EE 6C 3C 1E 7E 28 A0>)
$$ ##END=
$$ 
$$ $$ hash MD5
$$ $$ 8B BE 18 B4 08 46 14 98 0E 18 FB 79 79 11 4B 64
##$RELAX= 
##$RELAX= 
##$RELAX= 
##$RELAX= 
##$RELAX= 
##$RELAX= 
##$RELAX= 
$$ Bruker specific parameters
$$ --------------------------
##$DU= <E:\>
##$EXPNO= 20
##$NAME= <NES1013_LH_9233048_mQcQn3gpvg>
##$PROCNO= 1
$$ [...]
150 150 150 150 150 150 150 150
##$TP07= 0
##$TPNAME0= <>
##$TPNAME1= <>
##$TPNAME2= <>
##$TPNAME3= <>
##$TPNAME4= <>
##$TPNAME5= <>
##$TPNAME6= <>
##$TPNAME7= <>
##$TPOAL= (0..7)
0.5 0.5 0.5 0.5 0.5 0.5 0.5 0.5
##$TPOFFS= (0..7)
0 0 0 0 0 0 0 0
##$TUNHIN= 0
##$TUNHOUT= 0
##$TUNXOUT= 0
##$USERA1= <user>
##$USERA2= <user>
##$USERA3= <user>
##$USERA4= <user>
##$USERA5= <user>
##$V9= 5
##$VALIST= <valist>
##$VCLIST= <CCCCCCCCCCCCCCC>
##$VD= 0
##$VDLIST= <DDDDDDDDDDDDDDD>
##$VPLIST= <PPPPPPPPPPPPPPP>
##$VTLIST= <TTTTTTTTTTTTTTT>
##$WBST= 2048
##$WBSW= 25
##$XGAIN= (0..3)
0 0 0 0
##$XL= 0
##$YL= 0
##$YMAX_a= 587201
##$YMIN_a= -491041
##$ZGOPTNS= <>
##$ZL1= 120
##$ZL2= 120
##$ZL3= 120
##$ZL4= 120
##$ABSF1= 14.98509
##$ABSF2= -5.573092
##$ABSG= 5
##$ABSL= 3
##$ALPHA= 0
##$AQORDER= 0
##$ASSFAC= 0
##$ASSFACI= 0
##$ASSFACX= 0
##$ASSWID= 0
##$AUNMP= <proc_prof1d_extract_pilot.lims>
##$AXLEFT= 0
##$AXNAME= <>
##$AXNUC= <1H>
##$AXRIGHT= 0
##$AXTYPE= 0
##$AXUNIT= <>
##$AZFE= 0.1
##$AZFW= 0.1
##$BCFW= 0
##$BC_mod= 0
##$BYTORDP= 0
##$COROFFS= 0
##$CY= 15
##$DATMOD= 1
##$DC= 0
##$DFILT= <>
##$DTYPP= 0
##$F1P= 0
##$F2P= 0
##$FCOR= 0.5
##$FTSIZE= 32768
##$FT_mod= 6
##$GAMMA= 0
##$GB= 0
##$INTBC= 1
##$INTSCL= 1
##$ISEN= 128
##$LB= 0
##$LEV0= 0
##$LPBIN= 0
##$MAXI= 10000
##$MC2= 0
##$MEAN= 0
##$ME_mod= 0
##$MI= 0
##$NCOEF= 0
##$NC_proc= -8
##$NLEV= 6
##$NOISF1= 0
##$NOISF2= 0
##$NSP= 0
##$NTH_PI= 0
##$NZP= 0
##$OFFSET= 14.98509
##$PC= 1
##$PHC0= 89.41772
##$PHC1= 0
##$PH_mod= 1
##$PKNL= yes
##$PPARMOD= 0
##$PPDIAG= 0
##$PPIPTYP= 0
##$PPMPNUM= 2147483647
##$PPRESOL= 1
##$PSCAL= 4
##$PSIGN= 0
##$PYNMP= <proc.py>
##$REVERSE= no
##$SF= 400.02
##$SI= 32768
##$SIGF1= 0
##$SIGF2= 0
##$SINO= 400
##$SIOLD= 32768
##$SPECTYP= <>
##$SREGLST= <1H.CDCl3>
##$SSB= 0
##$STSI= 32768
##$STSR= 0
##$SW_p= 8223.68421052631
##$SYMM= 0
##$S_DEV= 0
##$TDeff= 65536
##$TDoff= 0
##$TI= <>
##$TILT= no
##$TM1= 0
##$TM2= 0
##$TOPLEV= 0
##$USERP1= <user>
##$USERP2= <user>
##$USERP3= <user>
##$USERP4= <user>
##$USERP5= <user>
##$WDW= 1
##$XDIM= 32768
##$YMAX_p= 435816649
##$YMIN_p= -688060
##$CURPLOT= <Network HP LaserJet P1505>
##$CURPRIN= <$Network HP LaserJet P1505>
##$DFORMAT= <normdp>
##$LAYOUT= <+/1D_H.xwp>
##$LFORMAT= <normlp>
##$PFORMAT= <normpl>
##$SURQMSG= 1
$$ End of Bruker specific parameters
$$ ---------------------------------
##NTUPLES= NMR SPECTRUM
##VAR_NAME=  FREQUENCY,     SPECTRUM/REAL,   SPECTRUM/IMAG
##SYMBOL=    X,             R,               I
##VAR_TYPE=  INDEPENDENT,   DEPENDENT,       DEPENDENT
##VAR_FORM=  AFFN,          ASDF,            ASDF
##VAR_DIM=   32768,         32768,           32768
##UNITS=     HZ,            ARBITRARY UNITS, ARBITRARY UNITS
##FACTOR=    0.250966925370066, 1,           1
##FIRST=     8223.43324360094, -201906,      -39777
##LAST=      0,             41240,           -278656
##MIN=       0,             -688060,         0
##MAX=       8223.43324360094, 435816649,    0
$$ Real data points
##PAGE= N=1
##DATA TABLE= (X++(R..R)), XYDATA
$$ [...]
19483b9258A31785a28436k81389a16973A60756B8102e0190j1878A36072g4553
$$ -29258 131785 -128436 -409825 -116973 160756 28102 -50190 -62068 136072 -74553
19472b15816m3189B04741a72148g3741l012I4403J15580J3143b25196a06057K5059
$$ -215816 -259005 204741 -172148 -73741 -76753 94403 209983 223126 -225196 -106057 -80998
19461h0998G009e0798j81683R5125A02099e7004j67131o9932B79291b7100A44608
$$ -80998 7009 -50798 -232481 -137356 102099 -57004 -224135 -294067 279291 -27100 144608
19449b2428D8051J08081b33487J1046n7671a28310E0818J48029q7613a99939d9769
$$ -22428 48051 156132 -233487 -222441 -280112 -128310 50818 198847 111234 -199939 -49769
19437a14545Q37a2125l4882B05873e8342j3223m6568D4050a84118A21344A7679
$$ -114545 -113708 -12125 -47007 205873 -58342 -71565 -118133 44050 -184118 121344 17679
19425b09590R2130k518A16791K0249g3726k7832C0401a77182g3451k33449O3865
$$ -209590 -117460 -119978 116791 137040 -73726 -101558 30401 -177182 -73451 -306900 -243035
19414b43035F3500k3166g8189L823a1521D8110a14520l0226k1391g1189j92505
$$ -243035 63500 40334 -78189 -74366 -11521 48110 -114520 -144746 -166137 -71189 -263694
19403b63694B9355a7368j97660N0446I9075i0736o6806B32225c45911B80359a34517
$$ -263694 29355 -17368 -215028 -164582 99075 -90736 -157542 232225 -345911 280359 -134517
19391D1399b7115j60781A90091a1698A51405B3430a24094k19713R3926J22020
$$ 41399 -27115 -187896 190091 -11698 151405 23430 -124094 -343807 -249881 -127861
19381a27861L5580c1196I6847M4426c22583I014J54624a28867A58140a83932O6623
$$ -127861 -92281 -31196 96847 141273 -322583 9014 163638 -128867 158140 -183932 -117309
19370a17309j69804A9966a84954j55695B0584Q3696B7781K3534b00719A46648
$$ -117309 -287113 19966 -184954 -340649 20584 104280 27781 51315 -200719 146648
19359c02627A0415Q8301K03472b3453G6706a52819A30755c83248f2020k49953
$$ -302627 10415 98716 302188 -23453 76706 -152819 130755 -383248 -62020 -311973
19349c11973a52324G5982a02959a7940j63597Q8812n5048A07010f9970l5372L1484
$$ -311973 -152324 75982 -102959 -17940 -181537 -92725 -147773 107010 -69970 -105342 -73858
19338g3858L2881l70930a66634L1068I9702a88243A91218a90963j25403N2250
$$ -73858 -40977 -411907 -166634 -135566 99702 -188243 191218 -190963 -316366 -264116
19328b64116a05787m7737k45646a9088r597A81606a65593B03867d1574k10714
$$ -264116 -105787 -153524 -399170 -19088 -28685 181606 -165593 203867 -41574 -252288
19318b52288B1821b79225K1294n3015A50695h0585n8390d1706C2074b71712L9707
$$ -252288 21821 -279225 -257931 -310946 150695 -80585 -138975 -41706 32074 -271712 -232005
19307b32005I9178O5007a87038l95385K82226a31981C17900A47956k638a11356
$$ -232005 99178 164185 -187038 -582423 -300197 -131981 317900 147956 145318 -111356
19296i8047m0648A13163F453f8379A06047g8063k45969N868P3985E5371i4672
$$ -98047 -138695 113163 6453 -68379 106047 -78063 -324032 -318164 -244179 55371 -94672
19284A54214a24737j51754f8892E9328h9449j5941d9387J9169A69148a96k53425
$$ 154214 -124737 -276491 -68892 59328 -89449 -105390 -49387 -30218 169148 -196 -253621
19273b53621a21551j3592N8842N147A86768F2601c5642k77216a33712F5878k4604
$$ -253621 -121551 -135143 -76301 -71154 186768 62601 -35642 -312858 -133712 65878 41274
19262D1274j3953e1052k00713A985c6983A49180a70664k6892B8447a66492f1040
$$ 41274 27321 -51052 -251765 1985 -36983 149180 -170664 -197556 28447 -166492 -61040
19250a19208l9726j4473D7022L23087A7748J23749k6243b53241R1809e7576j14070
$$ -119208 -158934 -173407 47022 370109 17748 141497 115254 -253241 -161432 -57576 -171646
19239a71646b5566F8211k9570f6364l5503A2667g017k69530j6785k2512a23983
$$ -171646 -25566 68211 38641 -66364 -101867 12667 -7017 -276547 -293332 -315844 -123983
19227b03547k5691B1171O5650d24139A25404o0712J20579c0562j07193B6557M9319
$$ -203547 -229238 21171 86821 -424139 125404 64692 185271 -30562 -137755 26557 75876
19216G5876c7178F8637a42373G2359c11306i068j46805r5721J4232H318J71218
$$ 75876 -37178 68637 -142373 72359 -311306 -9068 -155873 -251594 -237362 8318 179536
19205A79536c02575E0752a56480O6110B46453a90213D9768A6996c4951p0837q785
$$ 179536 -302575 50752 -156480 -90370 246453 -190213 49768 16996 -34951 -105788 -114573
19194a14573D4306e335k02119J88P6901A42730O344j6461c67430C17564d2195
$$ -114573 44306 -5335 -207454 -207266 -130365 142730 149074 132613 -367430 317564 -42195
19182D6611e596l21042i6607n682j2127B5310O435a23983m7712P0736l9726l2138
$$ 46611 -5596 -326638 -96607 -102289 -114416 25310 31745 -123983 -171695 -100959 -140685 -172823
19170a72823m889Q5531C3280J58132B0765c34754C9257a50673m1748a4242C3077
$$ -172823 -177712 -92181 33280 191412 20765 -334754 39257 -150673 -192421 -14242 33077
19158A17957d0772n994n9819A35499B0399c06085J45117b3354j83440f0109B459
$$ 117957 -40772 -46766 -106585 135499 20399 -306085 -160968 -23354 -206794 -60109 2459
19146c36717L0741I5727a05955A24069e1875k03231b0298l30604H2322a21120
$$ -336717 -305976 95727 -105955 124069 -51875 -255106 -20298 -350902 82322 -121120
19135A48376e1312m8N625k12144F8717O4161m3132o65a34144j99585J09210j26642
$$ 148376 -51312 -51360 -45735 -257879 68717 132878 89746 89081 -134144 -333729 -224519 -351161
19123c51161J24479L9801A89543k886a90990e0388a8587B17769c2577j10145b9176
$$ -351161 -226682 -186881 189543 186657 -190990 -50388 -18587 217769 -32577 -142722 -29176
19111b19370Q4988A11661r056a70481l1506g4326C61794b41821P7274C53796G0738
$$ -219370 -134382 111661 102605 -170481 -201987 -74326 361794 -241821 -164547 353796 70738
19099a49551O8282E0668a75725d1653H9037a879F1592J01482G680e0724A27042
$$ -149551 -81269 50668 -175725 -41653 89037 -1879 61592 163074 7680 -50724 127042
19087c09667J51043a3016k31897M4072p8057B9284a08348k82337c0844G7703J79370
$$ -309667 -158624 -13016 -244913 -200841 -278898 29284 -108348 -390685 -30844 77703 257073
19076B57073b23258B72788r7830c70787D9940L66382b57770J00954I979f3098
$$ 257073 -223258 272788 174958 -370787 49940 416322 -257770 -156816 9979 -63098
19065F23M9867P8628c40498B79268b00607b3216j53760A10649a73241f7562a974
$$ 623 50490 129118 -340498 279268 -200607 -23216 -176976 110649 -173241 -67562 -1974
19053I1764a97406a5580D2513J3234d57898a71950A5983b08222d7847j33891h5582
$$ 91764 -197406 -15580 42513 55747 -457898 -171950 15983 -208222 -47847 -181738 -85582
19041b53246A11094M8491C8918A0192L35511b69450j13820a11192k62116K9040
$$ -253246 111094 159585 38918 10192 345703 -269450 -383270 -111192 -373308 -344268
19031c44268A25957a45551a9940o6286A7423Q6724a6840o0552B5652K51655g2725
$$ -344268 125957 -145551 -19940 -86226 17423 104147 -16840 -77392 25652 277307 -72725
19019d5947C8828a11444J0592D34809L8498f9649F967J44149a50952j65946A31381
$$ -45947 38828 -111444 -100852 434809 473307 -69649 6967 151116 -150952 -316898 131381
19007A99447K2369C6811R4357M65261B5741a2170r1596l12246B81289a66488f7437
$$ 199447 221816 36811 131168 596429 25741 -12170 -103766 -416012 281289 -166488 -67437
18995a01747A27465a9579A86812F5856f6939b0695I9649a49802D2282a18545B55321
$$ -101747 127465 -19579 186812 65856 -66939 -20695 99649 -149802 42282 -118545 255321
18983a73913p7818D2503d97k39766j9301R2528N614D5147j1128e6099D0174J39956
$$ -173913 -251731 42503 -497 -240263 -259564 -167036 -161422 45147 34019 -56099 40174 180130
18971A80130P3767J59718M5352k26801L9060I1868f8744m0765A3856a77705O2463
$$ 180130 253897 413615 458967 232166 271226 91868 -68744 -109509 13856 -177705 -115242
18960a15242L1453j2775j47438q3107d1035A94681a59800I7802K52391b3038o228
$$ -115242 -83789 -96564 -244002 -327109 -41035 194681 -159800 97802 350193 -23038 -29266
18949b9266l6878K8354j93840A23495j2074b7050A58586p0453b17079A01657e16102
$$ -29266 -66144 -37790 -231630 123495 111421 -27050 158586 88133 -217079 101657 -516102
18937d16918K05782c7305m8427A7519K3344c40894b0579B28871d84331d9475e10
$$ -416918 -211136 -37305 -85732 17519 40863 -340894 -20579 228871 -484331 -49475 -510
18925i0686A41142b7902p5918j45898F898a02745J1457g728M83j33507n7971q2617
$$ -90686 141142 -27902 -103820 -249718 6898 -102745 -91288 -7728 -7245 -140752 -198723 -281340
18913b81340E4059i6819p08o9506I5343B949M93800L95501C41176A64395o9359
$$ -281340 54059 -96819 -97527 -167033 95343 2949 496749 892250 341176 164395 95036
18902I5036B2550a32500l5961G0705L5350J39895d305k82061A3484a13532r2483
$$ 95036 22550 -132500 -168461 70705 106055 245950 -4305 -286366 13484 -113532 -206015
18891b06015i368m3100j94161c266F6965e6031r3696g434A4685h3919A34764a53635
$$ -206015 -9368 -52468 -246629 -3266 66965 -56031 -149727 -7434 14685 -83919 134764 -153635
18878G5484a41947A55244e251k66565J00143O365A57568a8415j56531B0741O3922
$$ 75484 -141947 155244 -5251 -271816 -171673 -165308 157568 -18415 -174946 20741 84663
18867H4663h6434K1187P045B00133F1415a48486A3329f4036B7919K5210e2681
$$ 84663 -86434 -65247 -58202 200133 61415 -148486 13329 -64036 27919 53129 -52681
18855G0502e1273a7830o4783l48281d4975G7270B3602a42069e9804A2960Q8361
$$ 70502 -51273 -17830 -82613 -430894 -44975 77270 23602 -142069 -59804 12960 101321
18844A01321a00524G7989J9569g9125J3765A48013J8075i967A07002a40914B3791
$$ 101321 -100524 77989 97558 -79125 -65360 148013 166088 -9967 107002 -140914 23791
18832A47404a57111a6680j17762c1226A45547p0977h103j22365n400q6651a8834
$$ 147404 -157111 -16680 -134442 -31226 145547 74570 -8103 -130468 -135868 -222519 -18834
18820c58135F8616b48096d0169A33953N9526b7907j44981Q4028l18063a72292
$$ -358135 68616 -248096 -40169 133953 193479 -27907 -172888 -88860 -406923 -172292
18809c10193d7220A22398g7314J9156B42422a18651b0932p6547k6319A36807E5532
$$ -310193 -47220 122398 -77314 -58158 242422 -118651 -20932 -97479 -123798 136807 55532
18797a65336d4558m83382a1949I2646b9362j50193A07237a04411a9570j03544
$$ -165336 -44558 -527940 -11949 92646 -29362 -179555 107237 -104411 -19570 -123114
18787a23114P065A36048e4051C3320h5956a6060m0979j39409H3626j6192a75525
$$ -123114 -116049 136048 -54051 33320 -85956 -16060 -57039 -196448 83626 67434 -175525
18775e1479r7880K8031I7658a58050B03212p5073g6748I5972J07727c641l642
$$ -51479 -149359 -121328 97658 -158050 203212 128139 -76748 95972 203699 -3641 -7283
18764g283I7437l3567b6464A31448c10615F6416b56525a06587j91224D2583G811
$$ -7283 97437 63870 -26464 131448 -310615 66416 -256525 -106587 -297811 42583 7811
18752b26945j43366A88070h9845p0973j71181f2938C9825i6218m2707n5022A33719
$$ -226945 -370311 188070 -89845 -160818 -331999 -62938 39825 -96218 -138925 -193947 133719
18740a26920o1330C1394P5513M5124k7653L5518B692a09053K0165A55231d18782
$$ -126920 -188250 31394 106907 152031 124378 159896 2692 -109053 -88888 155231 -418782
18728B60274a05467a4230k47284J18745A41982c13384Q1733n2509N4787b5942
$$ 260274 -105467 -14230 -261514 -142769 141982 -313384 -231651 -284160 -229373 -25942
18717a94544A82369a28896r2251P3775H3359b77803g4825A07601c60485I2104
$$ -194544 182369 -128896 -221147 -147372 83359 -277803 -74825 107601 -360485 92104
18706A31506b55253j2875J6146a211p3891j45547C60653b09658P0358C03372F5135
$$ 131506 -255253 -268128 -251982 -1211 -75102 -220649 360653 -209658 -139300 303372 65135
18694h8995J720c0092F2460N0005a88755n1395O1902o3467A31531d7423C21326
$$ -88995 -87275 -30092 62460 112465 -188755 -240150 -178248 -241715 131531 -47423 321326
18682A3731J46047c37088g4367c2496A63043L2339B3235h4056m5312G1425Q146
$$ 13731 159778 -337088 -74367 -32496 163043 195382 23235 -84056 -129368 71425 79571
18671G9571g8781M295p1311O9810I6483C6443q360L438c05859e6384j80675k2352
$$ 79571 -78781 -74486 -145797 -75987 96483 36443 28083 31521 -305859 -56384 -237059 -259411
18659b59411e3571a984E1281c3404C9492b79615C7023b45484A31145m3457a33897
$$ -259411 -53571 -1984 51281 -33404 39492 -279615 37023 -245484 131145 87688 -133897
18647c7995j10498C2330b0794B91443g2003A75841m1983c9884l6490I881a49983
$$ -37995 -148493 32330 -20794 291443 -72003 175841 133858 -39884 -76374 9881 -149983
18635a02193a2266A53337a1572l2686j71526n8965o6601J08331j11054c2095C46215
$$ -102193 -12266 153337 -11572 -44258 -215784 -274749 -341350 -233019 -344073 -32095 346215
18623a86801B03918a91064G3146b95635d0041k30229J11899A33200b32154j85326
$$ -186801 203918 -191064 73146 -295635 -40041 -270270 -158371 133200 -232154 -417480
18613d17480A66928b15453j64883A14854g4637B19280i9496E292M5144M6195N0424
$$ -417480 166928 -215453 -380336 114854 -74637 219280 -99496 5292 50436 96631 147055
18602A47055E4085j4225K0193a5678l04846a4061q2059k8308A12144O2971A1739
$$ 147055 54085 39860 60053 -15678 -320524 -14061 -96120 -124428 112144 175115 11739
18590a31633o4182i3007o8164E2993a0115l71019I1979a38125M8231j08891C20050
$$ -131633 -195815 -93007 -161171 52993 -10115 -381134 91979 -138125 -89894 -198785 320050
18578A50356a08991n6027j61916i8565m9571M4865K2664c9644A08498J81674b13328
$$ 150356 -108991 -165018 -326934 -98565 -148136 -103271 -80607 -39644 108498 290172 -213328
18566H7906a07970A00080f6633D8164b84202J39634p5182N6946P1893k67032J58750
$$ 87906 -107970 100080 -66633 48164 -284202 -144568 -219750 -162804 -90911 -357943 -199193
18555a99193C01692I7210g5403B26755k9069E2371k3711h05A10073D7027a61518
$$ -199193 301692 97210 -75403 226755 197686 52371 28660 -805 110073 47027 -161518
18543B87282d4115j61526B79569b08189A8032L04682a47660A09778J78938a74737
$$ 287282 -44115 -205641 279569 -208189 18032 322714 -147660 109778 288716 -174737
18532B42860F0062b44324N9294d1708B66322b28891L1364j30130B10493b8854
$$ 242860 60062 -244324 -185030 -41708 266322 -228891 -197527 -327657 210493 -28854
18521b23381j8696m2584C54207d24241G9727M2289D6531J82418H865J29806E5343
$$ -223381 -242077 -284661 354207 -424241 79727 122016 46531 228949 8865 138671 55343
18509A3744a30064M5509r2084I7253M0103M8055l0385c2832I7384a10995m219
$$ 13744 -130064 -84555 -176639 97253 137356 185411 155026 -32832 97384 -110995 -115214
18498a15214A99213i2131A39685a88284N0790A28676b40081K6448B16385E0333
$$ -115214 199213 -92131 139685 -188284 -137494 128676 -240081 -213633 216385 50333
18487A08426e456l6931k2958B97662A13337P9126a60405j27550a7504p0078J1378
$$ 108426 -5456 -42387 -65345 297662 113337 192463 -160405 -287955 -17504 -87582 -76204
18476g6204A45424f4500A29040a64369a4813A16004a86912n098a1129l08206a00275
$$ -76204 145424 -64500 129040 -164369 -14813 116004 -186912 -192010 -11129 -319335 -100275
18464d0650G3887d0110j29194M4543g062l1593C3537K17392A2941a08345A55319
$$ -40650 73887 -40110 -169304 -124761 -7062 -38655 33537 250929 12941 -108345 155319
18452a94258H3833b51405D15J93842a76579e4375D0000f9753c3280p2582G6953
$$ -194258 83833 -251405 415 194257 -176579 -54375 40000 -69753 -33280 -105862 76953
18440a48803o2319J04775p9594E8229c36469c19l8436H7251L7837a14649A3258
$$ -148803 -211122 -106347 -185941 58229 -336469 -319 -38755 87251 125088 -114649 13258
18428A3533d5183p7373k36698J73969B74260Q4589a69430B61139e8215A19811
$$ 13533 -45183 -122556 -359254 -185285 274260 358849 -169430 261139 -58215 119811
18417b59567a5946A87360d3248B25278d9232l10404D7199Q4168e5591k85858I108
$$ -259567 -15946 187360 -43248 225278 -49232 -359636 47199 131367 -55591 -341449 9108
18405e8582A09798b62033Q0568e6937B35951A06286c1284B08577C873g8316B48526
$$ -58582 109798 -262033 -181465 -56937 235951 106286 -31284 208577 3873 -78316 248526
18393c9087C3661b5451j65520c7297p262J1504p7455m9640J9033F726K02340L5924
$$ -39087 33661 -25451 -190971 -37297 -44559 -33055 -110510 -160150 -141117 6726 209066 244990
18381B44990a88667c6035A80914a53158q459o4960b4200A47719a37332B6642K41443
$$ 244990 -188667 -36035 180914 -153158 -161617 -226577 -24200 147719 -137332 26642 268085
18370B68085c47464E7751a68394C09053j01107L7336H7664a70115e1762I3427
$$ 268085 -347464 57751 -168394 309053 207946 245282 87664 -170115 -51762 93427
18359I9326f3002o9973j7226O1457C0853a90870k5176B20583E1940a42332F4773
$$ 99326 -63002 -132975 -150201 -88744 30853 -190870 -216046 220583 51940 -142332 64773
18347f0608k19074J39103q7476B07320E7789c08824G4008b09703g4203b766m3050
$$ -60608 -279682 -140579 -228055 207320 57789 -308824 74008 -209703 -74203 -2766 -45816
18336d5816r586A49157c23462a27957l7990I6559Q2102C065J28313b6128l848
$$ -45816 -55402 149157 -323462 -127957 -165947 96559 178661 3065 131378 -26128 -29976
18325b9976p5242R099G1331a76932d255j59474J2105j35823d173k65593e6934
$$ -29976 -105218 -96119 71331 -176932 -4255 -163729 -151624 -287447 -4173 -269766 -56934
18313A01136J33817h8864K2034j62349i5759j80747f0351J9488j09538O6525B40233
$$ 101136 234953 -88864 -66830 -229179 -95759 -276506 -60351 -40863 -150401 -83876 240233
18301b056n6808C0848J73664K09410E6759J40322m7315F7404J12690l8072a03776
$$ -2056 -58864 30848 204512 413922 56759 197081 149766 67404 180094 142022 -103776
18289b241j26884A59920a31734m7064E0992k3084O6997J8678j6605L16858h6071
$$ -2241 -129125 159920 -131734 -178798 50992 27908 94905 113583 96978 413836 -86071
18277C0762K36675b36977D6102K9807a59224B72534d6218l40297C8281d0504k66445
$$ 30762 267437 -236977 46102 75909 -159224 272534 -46218 -386515 38281 -40504 -306949
18266c06949e9517l51909J93347H6093d1724A75441b16703e3646B24138Q1970
$$ -306949 -59517 -411426 -218079 86093 -41724 175441 -216703 -53646 224138 306108
18256C06108b528m0016n2632I4416J2177J13919c91238A52050J12375I4832i4271
$$ 306108 -2528 -42544 -95176 94416 106593 220512 -391238 152050 264425 94832 -94271
18244G9384g6501J368j54476g7820A80750g1450B58806j6973b03846A6317J8590
$$ 79384 -76501 -75133 -229609 -77820 180750 -71450 258806 241833 -203846 16317 34907
18233C4907J24015F9333g168C6764c2020j52272h742G3094i2309j09143f4222
$$ 34907 158922 69333 -7168 36764 -32020 -184292 -8742 73094 -92309 -201452 -64222
18221e6115r2778b4098D1487b87368P1361A1737L502i5564B23106d49651d0345
$$ -56115 -148893 -24098 41487 -287368 -216007 11737 15239 -95564 223106 -449651 -40345
18209B72146a22153I7610b64926a0598q4476D0277a89569M7129A87333b2341j51787
$$ 272146 -122153 97610 -264926 -10598 -95074 40277 -189569 -142440 187333 -22341 -174128
18198a74128k8716I7754d69241E400J34268e816D7813a0442j39817B2406b8750
$$ -174128 -202844 97754 -469241 5400 139668 -5816 47813 -10442 -150259 22406 -28750
18186A28267c6766B5299J7190N8025a40118E1234g4845k44782b8036q6173a3062
$$ 128267 -36766 25299 42489 100514 -140118 51234 -74845 -319627 -28036 -114209 -13062
18174I1740a24869J4649d0556k04469a4067r6104A62561c00999A20348j4214a28611
$$ 91740 -124869 -110220 -40556 -245025 -14067 -110171 162561 -300999 120348 106134 -128611
18162A96621c11011a1422G78c60789B2759b83012e8522k1487q8064Q2988A08205
$$ 196621 -311011 -11422 778 -360789 22759 -283012 -58522 -80009 -168073 -85085 108205
18150c8650G3592b7529A03508k6737a62760b608B36091b34965g3172B53427c03692
$$ -38650 73592 -27529 103508 76771 -162760 -2608 236091 -234965 -73172 253427 -303692
18138A36296K4674E0353i0570p0771B6345a71056G7867k2996i9640r8693J7607
$$ 136296 160970 50353 -90570 -161341 26345 -171056 77867 54871 -99640 -198333 -180726
18127a80726d3193k2486o700r1450O9791J059B50144f4571j8429I5627a10293
$$ -180726 -43193 -65679 -72379 -163829 -94038 -92979 250144 -64571 -83000 95627 -110293
18115g8488a8471A6610a16565j99302b3687j28208E2489g3264K7344N309D0235
$$ -78488 -18471 16610 -116565 -315867 -23687 -151895 52489 -73264 -45920 -40611 40235
18103B6440g6013I5161k3129C5092a17485A1796K86953e7307n9701j14585r254
$$ 26440 -76013 95161 72032 35092 -117485 11796 298749 -57307 -117008 -231593 -240847
18092b40847C61914g6149p8432B94373I0191B6361i2828o4490a7837c304k81811
$$ -240847 361914 -76149 -154581 294373 90191 26361 -92828 -157318 -17837 -3304 -285115
18081b85115a3193B93308D1827B0351K32124J9392a26963A78778p5076P204a68499
$$ -285115 -13193 293308 41827 20351 252475 271867 -126963 178778 103702 110906 -168499
18069D10064A47739n3692d9378A96930E0489e0847q7037E220P5366J12907A6497
$$ 410064 147739 94047 -49378 196930 50489 -50847 -137884 5220 80586 193493 16497
18057b6257j6999A43124n8467O2728b4746n9852k0871D9887A4825d9780I4387
$$ -26257 -43256 143124 84657 147385 -24746 -84598 -105469 49887 14825 -49780 94387
18045C5611J02862c19305H1595M8001J9782J96085a81906F9848c0439m9731C8066
$$ 35611 138473 -319305 81595 129596 149378 345463 -181906 69848 -30439 -80170 38066
18033a92121c4141I5543a53450A12i9871C3500e4982A16004M0884K15969a5180
$$ -192121 -34141 95543 -153450 112 -99871 33500 -54982 116004 156888 372857 -15180
18021A56476b2150o5367p8410D9085F898g792A17204b15488B69691c6781l9218
$$ 156476 -22150 -87517 -165927 49085 6898 -7792 117204 -215488 269691 -36781 -75999
18010g5999B17710o0527L9239G3136K2820I693R1359D4095i4983A25669J33702
$$ -75999 217710 157183 196422 73136 95956 9693 101052 44095 -94983 125669 259371
17999B59371I2368a9079A10288a66115C39433b80367C03787h1225A04807D9102
$$ 259371 92368 -19079 110288 -166115 339433 -280367 303787 -81225 104807 49102
17988c1995n9419a6730B6900j30M7161b36675c2937A39435c24502F3068B9047
$$ -31995 -91414 -16730 26900 26770 73931 -236675 -32937 139435 -324502 63068 29047
17976A7597g6176k12294j39483A2719b27360I9866J1617a71226A24692K82774
$$ 17597 -76176 -288470 -427953 12719 -227360 99866 111483 -171226 124692 407466
17966D07466A49512c25825f4023J9055j15549j34324a40728C5742K021a24977
$$ 407466 149512 -325825 -64023 -44968 -160517 -294841 -140728 35742 37763 -124977
17955I4354d5778p6406H0176b63828e9850A2988O2741f9261B65257c30088a8281
$$ 94354 -45778 -122184 80176 -263828 -59850 12988 75729 -69261 265257 -330088 -18281
17943a06331I2300L695a47265A21389i5677j10104k4659C9270a78349I1348C8472
$$ -106331 92300 95995 -147265 121389 -95677 -205781 -230440 39270 -178349 91348 38472
17931A556f5972G8045e8010a6475A23017J4519E8245J15937q2683a26689L0617
$$ 1556 -65972 78045 -58010 -16475 123017 137536 58245 174182 91499 -126689 -96072
17920i6072B84261d2154F3638a34652B07822a92872A68381b71990B33616i5260
$$ -96072 284261 -42154 63638 -134652 207822 -192872 168381 -271990 233616 -95260
17909h8445k94876A57678R5290M0004a44316J3086B05696a9067l1156B70169i3258
$$ -88445 -383321 157678 252968 292972 -144316 -131230 205696 -19067 -50223 270169 -93258
17897a90463B97168e1229l28705A45401m6151J22788Q8848A1566f6511K6673G8906
$$ -190463 297168 -51229 -379934 145401 99250 222038 310886 11566 -66511 -39838 78906
17885B37381c80627a80927K3404b1224E0655e924q5969D0340J01677J89944b72474
$$ 237381 -380627 -180927 -157523 -21224 50655 -5924 -91893 40340 142017 331961 -272474
17873C58167b33291C54161B2850K20768E8067b5864I3742r295g2832J4536D925
$$ 358167 -233291 354161 22850 243618 58067 -25864 93742 84447 -72832 -58296 4925
17861B61991D3403c04334A75619m8353a17210m4080i586A30135j8962g8824H324
$$ 261991 43403 -304334 175619 127266 -117210 -161290 -9586 130135 111173 -78824 8324
17849B02428b9534B75555a69467l5281N2320e424F7800i656E8037B8770i6831
$$ 202428 -29534 275555 -169467 -204748 -152428 -5424 67800 -9656 58037 28770 -96831
17837e677r2193a2732j89813A56371O9163F2418c8113k1967l05620e3903C05350
$$ -5677 -97870 -12732 -202545 156371 225534 62418 -38113 -60080 -365700 -53903 305350
17825a34I6451d7946B8700A2829a54319A10471b6900H9562l9921J38027L1589
$$ -134 96451 -47946 28700 12829 -154319 110471 -26900 89562 49641 187668 219257
17814B19257h747j16523F9462o716K47466I0124a79808h113m5117B42344b83084
$$ 219257 -8747 -125270 69462 62746 310212 90124 -179808 -8113 -53230 242344 -283084
17802A56772f9686C08732G1780J17866b80455M1486j38138a41973A38002M6302
$$ 156772 -69686 308732 71780 189646 -280455 -238969 -377107 -141973 138002 184304
17792A84304n2293J1065J35622I5627D5712d0322E53773A01913B393M344R6180
$$ 184304 132011 143076 278698 95627 45712 -40322 553773 101913 2393 6737 102917
17781A02917H927A466P664N0916J25381c5284l4153L1533A76774K34537A35197
$$ 102917 8927 1466 9130 60046 185427 -35284 -69437 -37904 176774 411311 135197
17769C28339A8913d8430A80121b7762A32234J59826a70350g7391B86584C8253
$$ 328339 18913 -48430 180121 -27762 132234 292060 -170350 -77391 286584 38253
17758A01221a33856F6075j6124a56105D05840A33146F3611P8496k6509b76103
$$ 101221 -133856 66075 49951 -156105 405840 133146 63611 142107 115598 -276103
17747D13191a44596D26765f0553a4062A8638M7760J89917a16389A8303J9043J52217
$$ 413191 -144596 426765 -60553 -14062 18638 66398 256315 -116389 18303 37346 189563
17736A89563J14132h9643F759J83565p1449e7531h632j34858A6349P1059L00488
$$ 189563 303695 -89643 6759 190324 118875 -57531 -8632 -143490 16349 87408 387896
17725C87896D5466j2461J09451i0049A44411f7767A90329a26036C01317D4483
$$ 387896 45466 33005 142456 -90049 144411 -67767 190329 -126036 301317 44483
17714B43237C1049f5746E3272J26344J08552l3014H9903l8602a39183A24926K7557
$$ 243237 31049 -65746 53272 179616 288168 255154 89903 51301 -139183 124926 152483
17703A52483J78258c2298A50072f2058A62520h4371a7282A55063c587A24071l1614
$$ 152483 330741 -32298 150072 -62058 162520 -84371 -17282 155063 -3587 124071 92457
17692I2457j5433b70608A70177F8116H686J5861i2378a3024r290A14670b36513
$$ 92457 77024 -270608 170177 68116 8686 24547 -92378 -13024 -22314 114670 -236513
17680C50420j55181I6086K54184I262J38742J46116b9235n8814C6971Q9630P2782
$$ 350420 195239 96086 350270 9262 148004 294120 -29235 -88049 36971 126601 199383
17669A99383k3351J73460D4668J19767f2306A52326D0324P7615k9869L61998i5786
$$ 199383 176032 349492 44668 164435 -62306 152326 40324 117939 88070 450068 -95786
17657i1383C21097Q382a41157A96607A418K30438k6806J544a43040A73323G9900
$$ -91383 321097 329479 -141157 196607 1418 231856 205050 206594 -143040 173323 79900
17645D91Q7915A2299N4679K49837a03284F6811J06922j113K51670a04552H7687
$$ 491 88406 12299 66978 316815 -103284 66811 173733 172620 424290 -104552 87687
17633C6650J17943P071N247p3209q073J22292d8378H8218f2557e782r1218A47896
$$ 36650 154593 161664 166911 93702 85629 207921 -48378 88218 -62557 -5782 -97000 147896
17620C46507r0719j04079b00446B1403K24769E5635J42971A7794K01951M9366
$$ 346507 255788 151709 -200446 21403 246172 55635 198606 17794 219745 269111
17610B69111a97559B9953a5620A22423a33220k11094a58534A75602J85511j58558
$$ 269111 -197559 29953 -15620 122423 -133220 -344314 -158534 175602 361113 202555
17600B02555k3615L10879j01773C2977R1632O0237k5967p5786g29B46309F2735
$$ 202555 178940 489819 388046 32977 124609 184846 158879 83093 -729 246309 62735
17588I1179M9783J49318J08405C5115a14607A82218J32869p2716J10458j59627
$$ 91179 140962 290280 398685 35115 -114607 182218 315087 242371 352829 193202
17578A93202M6320f1388H8923k7929b0111A09774M0639K47931A06536D5947J39795
$$ 193202 239522 -61388 88923 60994 -20111 109774 150413 398344 106536 45947 185742
17567A85742j652a11826B9496P9041J01552J16271G7884J00186L22664A49459
$$ 185742 184090 -111826 29496 108537 210089 326360 77884 178070 500734 149459
17556A61444M42162b14807i8033A69503j6447L20234A59956c19282C5100L79042
$$ 161444 603606 -214807 -98033 169503 153056 473290 159956 -319282 35100 414142
17546D14142q714A10188K40162j44756J42709A59644a23401C47477R3301j87378
$$ 414142 405428 110188 350350 205594 348303 159644 -123401 347477 440778 253400
17536B53400O8180E9463J52957R4659r0250l0195L65065j89874P640q1023K84614
$$ 253400 321580 59463 212420 307079 216829 186634 551699 361825 369465 288442 573056
17525E73056K19477J68587m8115J01347l72582J34842l35712A32760K92080k11689
$$ 573056 792533 961120 913005 1014352 641770 776612 440900 132760 424840 213151
17515B13151O0272L86784l07623N7539K61311K67752J13383j42895n2293m07053
$$ 213151 273423 660207 352584 410123 671434 939186 1052569 909674 857381 450328
17505D50328A56317O11955a01285B64541j03964J65455A25247J86116n3175K8133
$$ 450328 156317 768272 -101285 264541 160577 326032 125247 311363 258188 286321
17495B86321K23613B48354L11304O7992k96316n0808K18059A54147L18854A61420
$$ 286321 509934 248354 559658 627650 331334 280526 498585 154147 473001 161420
17484A54739J00839J37469j28683M11371H7868K49286H1980A0075K29285K5729
$$ 154739 255578 393047 264364 675735 87868 337154 81980 10075 239360 265089
17474B65089M2244K0205A01509L2397J55338o3285K25364A97298K47165j25798
$$ 265089 307333 327538 101509 133906 289244 225959 451323 197298 444463 318665
17464C18665J4202j65502J9170l4775P9632L4045k3569J15153K1096m969J59005
$$ 318665 332867 167365 186535 151760 231392 265437 241868 357021 378117 373148 532153
17453E32153B51588B6983K14059b26022B77659K71962j87005b1728F79422J4376
$$ 532153 251588 26983 241042 -226022 277659 549621 362616 -21728 679422 693798
17443F93798L9946j52222k41028K6647j67056M37101B84095K08723J03137r3419
$$ 693798 733744 581522 340494 367141 200085 637186 284095 492818 595955 502536
17433E02536j03962j28620J67749R1053j99464R5897K78848B97699J273J8316
$$ 502536 398574 269954 437703 528756 329292 425189 704037 297699 298972 317288
17423C17288A45903K71710k06904n1250L11252L931J32327b6131C34022J44818
$$ 317288 145903 417613 210709 159459 470711 474642 606969 -26131 334022 478840
17413D78840l1144L61797k64383B69551O5422K19693k65472R0138L6478I5350
$$ 478840 447696 809493 545110 269551 334973 554666 289194 379332 415810 95350
17402C25221Q9889j3171L3113A89091O252e130k4497B61280K02311d3241C14081
$$ 325221 415110 401939 435052 189091 195343 -5130 -29627 261280 463591 -43241 314081
17390B32798o8464L2370l5900K24234j40950k4167M5933M0289L2843H4515M9551
$$ 232798 164334 196704 160804 385038 244088 219921 265854 306143 338986 84515 134066
17379A34066M34840B41718p4976J49124r1886Q9932M3770C4952L11918K41915
$$ 134066 568906 241718 166742 315866 223980 313912 357682 34952 346870 588785
17369E88785j94450A55763J35148j39386O6107N5285p9051R4995r1192H7860J48926
$$ 588785 394335 155763 290911 151525 217632 272917 193866 288861 197669 87860 236786
17358B36786B997c7195B92921a3413D07420A80325R8805J17572j40799j19159
$$ 236786 2997 -37195 292921 -13413 407420 180325 279130 396702 255903 136744
17348A36744A6318K94678j0684R2652j79120O0980B1661M64884m2256b4588A66692
$$ 136744 16318 310996 300312 392964 213844 274824 21661 486545 444289 -24588 166692
17336F05550B37035A04539D326J92291q9135J59336q6701J76552k5310A16934
$$ 605550 237035 104539 4326 196617 107482 266818 180117 356669 331359 116934
17325C53522J21596p8106A9865B142K53818J43420r2413n232J94193K076A71433
$$ 353522 475118 397012 19865 2142 255960 399380 306967 301735 495928 498004 171433
17313I9994K05459J09244k7358G462J19962L04622j2527j41258K95078A05323
$$ 99994 305453 414697 387339 7462 127424 432046 419519 278261 573339 105323
17302D90461m8400L0040A78432J64818j37730J9790l6245A9335L85028A67723
$$ 490461 442061 472101 178432 343250 205520 225310 189065 19335 404363 167723
17291B08102M03886j23955B39186j16837J09018r3787L75527n5229B23430J80147
$$ 208102 611988 488033 239186 122349 231367 137580 513107 457878 223430 403577
17281D03577r4361P0638j42097n7822J42538L91043k79486J36969B67206J82377
$$ 403577 309216 379854 237757 179935 322473 713516 434030 570999 267206 449583
17271D49583q3961K10018j31346k09825k0637A00572J66002P4897K32097P8709
$$ 449583 365622 575640 444294 234469 213832 100572 266574 341471 573568 652277
17261F52277k4826j11649k43054k1068M1453L1658J33529j8533J9295j52109k9354
$$ 652277 627451 515802 272748 251680 293133 324791 458320 439787 459082 306973 277619
17250B77619N7455A04189K12783G6294K98809j48895m1153K13189N0018J37006
$$ 277619 335074 104189 316972 76294 375103 226208 185055 398244 448262 585268
17240E85268j95996M9573K5438r532l5281J52187k43630m084J14068n6027m9550
$$ 585268 389272 438845 464283 454751 419470 571657 328027 323943 438011 381984 332434
17229C32434N3868K02718j44933K2752m9630j03895J37076K18992j82653J88502
$$ 332434 386302 589020 444087 466839 417209 313314 450390 669382 486729 675231
17219F75231k33291p6167J64116k42113K27839J7050j40518J06970Q2175k30238
$$ 675231 441940 365773 529889 287776 515615 532665 392147 499117 581292 351054
17209C51054K29563p145b25133C02517K2480c6481F30154k76216M17213j70804
$$ 351054 580617 573472 -225133 302517 324997 -36481 630154 353938 771151 600347
17199F00347j49049G5828M37726P3007j53798N8514j08715L71157l69061K38070
$$ 600347 451298 75828 513554 586561 432763 491277 382562 753719 384658 622728
17189F22728k2450B52446N09853K7078C58791J10459K34270C39176K33871j29264
$$ 622728 600278 252446 762299 789377 358791 469250 703520 339176 573047 443783
17179D43783J74203j86623Q0337N119j26215J10862k00758L81505j40870J08093
$$ 443783 617986 431363 511700 516819 390604 501466 300708 682213 541343 649436
17169F49436K16365C84257Q7388l7775K14251k30600M2006K96694k40130J82262
$$ 649436 865801 384257 471645 433870 648121 417521 459527 756221 516091 698353
17159F98353k16655N57192k75205k50924J30160k40990J60787J74071C28469L71949
$$ 698353 481698 1038890 763685 512761 642921 401931 562718 736789 328469 700418
17149G00418l44461K45110J24273l3331J1048m3990M314j57501J51376C18342
$$ 700418 355957 601067 725340 692009 703057 659067 663381 505880 657256 318342
17138F19498K17807L223n0805l2684j48485L1430k12467K50722k8273k30399M64713
$$ 619498 837305 840528 789723 757039 608554 639984 427517 678239 649966 419567 884280
17127H84280l71154J5778J97491l37017K75890k49487J46997k09328L00937o3096
$$ 884280 513126 528904 726395 389378 665268 415781 562778 353450 654387 591291
17117E91291P3746J10597L9342l1791p8500R7752j01910M1534C35736M31454j25747
$$ 591291 665037 775634 814976 783185 704685 802437 700527 742061 335736 767190 641443
17106F41443J00478j90707k7157K38847j49159l7332J11324R6420j79604L66461
$$ 641443 741921 551214 524057 762904 613745 576413 687737 784157 604553 971014
17096I71014l35881M08310D82946L68422j41437K77546l68625J15656P3093j16873
$$ 971014 635133 1043443 482946 851368 709931 987477 618852 734508 807601 690728
17086F90728K48320k0526N1082J8237j09809j85727J1819J42314j31301j7004
$$ 690728 939048 918522 969604 987841 878032 692305 704124 846438 715137 698133
17076F98133O1958J94881k70282M01068j82459r9938J19275k22995K44336M4800
$$ 698133 760091 954972 684690 1085758 903299 803361 922636 699641 943977 988777
17066I88777j60971o9545Q7346J56914Q1490M04371l95830r7342J58524j80661
$$ 988777 827806 758261 845607 1002521 1084011 1488382 1092552 995210 1153734 973073
17056I73073j31514K36689J31545n52673L72111L321j89592J38177k6689j84034
$$ 973073 841559 1078248 1209793 657120 1029231 1032552 842960 981137 954448 770414
17046G70414J22123K64937k26520n1948J42445J7896K6866j57247L14357j21492
$$ 770414 892537 1157474 930954 879006 1021451 1039347 1066213 908966 1223323 1101831
17036A101831j18128J34715n6490J47037k31248M54915K20639m20284j02066J88490
$$ 1101831 983703 1118418 1061928 1208965 977717 1432632 1653271 1232987 1130921 1319411
17026A319411j316r4468q9387N7435J70784j93937r4924L39365l25838M570M29085
$$ 1319411 1318095 1223627 1134240 1191675 1362459 1168522 1073598 1412963 1087125 1091695 1520780
17015A520780m07455R649j52028O86225j94494m11797N64756k61385J13055j0979
$$ 1520780 1113325 1122974 970946 1657171 1462677 1050880 1615636 1354251 1467306 1456327
17005A456327j6943m0821l19376J72358J48391n3629K4556j7157J03409J278J40353
$$ 1456327 1439384 1398563 1079187 1251545 1399936 1346307 1370863 1353706 1457115 1458393 1598746
16994A598746K10237m62500L64816K8522j04149K1314K14596l51411m7464L2865
$$ 1598746 1808983 1346483 1711299 1739821 1635672 1656986 1871582 1520171 1472707 1505572
16984A505572l0263J81085J81626j00925j90481J60883l08785K54439P9439K63930
$$ 1505572 1475309 1656394 1838020 1737095 1546614 1707497 1398712 1653151 1732590 1996520
16974A996520J3338m72766L12328j92614J33875j45191M21930m5960o9400k05050
$$ 1996520 2009858 1537092 1849420 1656806 1790681 1645490 2067420 2021460 1952060 1747010
16964A747010J04642k78899K58971J41737M111J75307o7916p8753p209J60942
$$ 1747010 1851652 1572753 1831724 1973461 1977572 2152879 2084963 2006210 1999001 2159943
16954B159943M163k48362M33560k99403J28826j607j39719K99772j60651O8687
$$ 2159943 2164106 1915744 2349304 2049901 2178727 2177120 2037401 2337173 2176522 2245209
16944B245209K29133l85921K63101r2445L44678m7974p6925K8852k18770M26670
$$ 2245209 2474342 2088421 2351522 2259077 2603755 2555781 2478856 2507708 2288938 2715608
16934B715608q1588k14026J74951J74224k75242J04391K9523J5092J474Q6795
$$ 2715608 2634020 2419994 2594945 2769169 2493927 2598318 2627841 2642933 2644407 2731202
16924B731202L00986n12317O11038l16315K81597n59302N49420k02699K19633
$$ 2731202 3032188 2519871 3130909 2814594 3096191 2536889 3086309 2883610 3103243
16915C103243l52942M09909O4986k82567M55181k26853J70797l3761p5452J48230
$$ 3103243 2750301 3160210 3225196 2942629 3397810 3170957 3341754 3307993 3232541 3380771
16905C380771l48393K07873J0360M03635o5598j32316J93519L17851k81139j35041
$$ 3380771 3032378 3240251 3250611 3654246 3588648 3456332 3649851 3967702 3686563 3551522
16895C551522N14188m03779J39981j75701L53406J03748K93711l82598J60463
$$ 3551522 4065710 3661931 3801912 3626211 3979617 4083365 4377076 3994478 4154941
16886D154941j012J88323q217l11257K54416L2962N836J86323j53063R0407K33674
$$ 4154941 4153929 4342252 4334035 4022778 4277194 4310156 4315992 4502315 4349252 4439659 4673333
16875D673333J57589l0580J37595R4696j85133K85446K93466r9996m7390k1233
$$ 4673333 4830922 4800342 4937937 5032633 4847500 5132946 5426412 5326416 5279026 5257793
16865E257793L62683j41801J81155k16457J06006K99088J13276J14600K09165
$$ 5257793 5620476 5478675 5659830 5443373 5549379 5848467 5961743 6076343 6285508
16856F285508K1590j07979J77436m0261M13960j47560J20472J13032K78785n9611
$$ 6285508 6307098 6199119 6376555 6336294 6750254 6602694 6723166 6836198 7114983 7055372
16846G055372P2572Q5012P78L46273j55004K16747N50636m08036M43880N123J43417
$$ 7055372 7127944 7212956 7213734 7560007 7405003 7621750 8172386 7764350 8208230 8213353 8356770
16835H356770J33248j1850M48031M20764n13692P43578l0711J09991J47090L98231
$$ 8356770 8490018 8478168 8926199 9346963 8833271 9576849 9546138 9656129 9803219 10201450
16825A0201450N1720M4816J40177n1768M20243L40174J01491J12217L68530K03110
$$ 10201450 10253170 10297986 10438163 10386395 10806638 11146812 11248303 11360520 11729050 11932160
16815A1932160J64115Q4665O37746K20644R7769K60525N63545k08599J97978M81544
$$ 11932160 12096275 12180940 12818686 13039330 13137099 13397624 13961169 13752570 13950548 14432092
16805A4432092J88989N45620K81697J00157O46102M95155N77315J15322K74542
$$ 14432092 14621081 15166701 15448398 15548555 16194657 16689812 17267127 17382449 17656991
16796A7656991K99338N10562M25460L31275M35287N44748K15054P59899M62230
$$ 17656991 17956329 18466891 18892351 19223626 19658913 20203661 20418715 21178614 21640844
16787B1640844Q14939J00910O34867M75915P39315O01873O13840O07905Q35711
$$ 21640844 22455783 22556693 23191560 23667475 24406790 25008663 25622503 26230408 27066119
16778B7066119O99225K12827J211939N61460Q30938M70334J156935O60148J094519
$$ 27066119 27765344 27978171 29190110 29751570 30582508 31052842 32209777 32869925 33964444
16769C3964444O31014J186649R09600Q93991J039364J079790R24292J051680J245539
$$ 33964444 34595458 35782107 36691707 37585698 38625062 39704852 40629144 41680824 42926363
16760D2926363J285963J221447Q75203J527180J187152J145601J444951J329970
$$ 42926363 44212326 45433773 46308976 47836156 49023308 50168909 51613860 52943830
16752E2943830J116364J741855J290212J438056J492236J410920J554745J218888
$$ 52943830 54060194 55802049 57092261 58530317 60022553 61433473 62988218 64207106
16744F4207106J669463J575177J044304J720873J432318J416363J193922J144117
$$ 64207106 65876569 67451746 68496050 70216923 71649241 73065604 74259526 75403643
16736G5403643J274592J080831J363036Q18122J114431P31484R37743M00003O79911
$$ 75403643 76678235 77759066 79122102 79940224 81054655 81786139 82723882 83123885 83803796
16727H3803796O60427J26413K61944J72625j74779p6819k14795m12131l76284
$$ 83803796 84464223 84590636 84852580 85025205 84850426 84773607 84558812 84146681 83770397
16718H3770397n14966r38993p01936r59021j203259p03944j089051j172505j321050
$$ 83770397 83255431 82316438 81614502 80655481 79452222 78748278 77659227 76486722 75165672
16709G5165672j509532r81909j399401j479482j097258j725819j325003j671565
$$ 75165672 73656140 72674231 71274830 69795348 68698090 66972271 65647268 63975703
16701F3975703j203905j575328j599864j542847j288042j319656j186177j466394
$$ 63975703 62771798 61196470 59596606 58053759 56765717 55446061 54259884 52793490
16693E2793490j281000j186330j621448j083665j220077j207344j330431r88926
$$ 52793490 51512490 50326160 48704712 47621047 46400970 45193626 43863195 42874269
16685D2874269j155841j189859j145683o78642p94265j336978j197752p18064
$$ 42874269 41718428 40528569 39382886 38704244 37909979 36573001 35375249 34657185
16677C4657185p34914r15300r80831p87987r12439o10216o33126p24446q38326
$$ 34657185 33922271 33006971 32026140 31238153 30325714 29715498 29082372 28357926 27519600
16668B7519600l56845q89124o03559k74585r42382j85301j174178p6194q85213
$$ 27519600 27162755 26273631 25670072 25395487 24453105 24267804 23093626 23017432 22132219
16659B2132219j49417m93943o84864k34703o49053k48405p12943j2560m67557
$$ 22132219 21982802 21488859 20803995 20569292 19920239 19671834 18958891 18946331 18478774
16650A8478774q00589n5910o73403N4994n94947m68543j87589l96197n3624j21758
$$ 18478774 17678185 17622275 16948872 17003866 16408919 15940376 15752787 15356590 15302966 15181208
16640A5181208l47194o23161N1511n93745k06732m18319J26916o45193J8477k69298
$$ 15181208 14834014 14210853 14262364 13668619 13461887 13043568 13170484 12525291 12543768 12274470
16630A2274470k17393J14772l05149j36413m52578k36828k89981m1800n5507n78127
$$ 12274470 12057077 12171849 11866700 11730287 11277709 11040881 10750900 10709100 10653593 10075466
16620A0075466R4961k11830j93424m4682L1177k07118j92123J4487k96366k69709
$$ 10075466 10170427 9958597 9765173 9720491 9751668 9544550 9352427 9366914 9070548 8800839
16610H800839J77992m66661J9478m08985L706J08459l7302j78100k93949j98470
$$ 8800839 8978831 8512170 8531648 8122663 8126369 8234828 8197526 8019426 7725477 7527007
16600G527007k11226N0061k24525k987q3928j30741k66947J48493l16334P9283
$$ 7527007 7315781 7365842 7141317 7138330 7054402 6923661 6656714 6805207 6488873 6568156
16590F568156K4436k45449R5334j42900j07852p748r6211k47422j8171j30317
$$ 6568156 6592592 6347143 6442477 6299577 6191725 6183977 6087766 5840344 5822173 5691856
16580E691856j42164J69694m9505l14820m3001K29910o4156l83782L08541m74123
$$ 5691856 5549692 5719386 5669881 5355061 5312060 5541970 5477814 5094032 5402573 4928450
16570D928450k04793o6419Q2095N866N1318K24234k35487o1592j77361n8954K556
$$ 4928450 4723657 4657238 4739333 4745199 4796517 5020751 4785264 4723672 4546311 4487357 4489913
16559D489913j23269K75260l81406J28388r4757L0781k06548P5552q7799j09620
$$ 4489913 4366644 4641904 4260498 4388886 4294129 4324910 4118362 4193914 4106115 3996495
16549C996495Q8835j88330K6579j28220L34674l03291j66377n6452J5506l8063
$$ 3996495 4085330 3897000 3923579 3795359 4130033 3826742 3660365 3603913 3619419 3581356
16539C581356k2307j5497o1647j80305K30570M1916j76035J91641k50797J7690
$$ 3581356 3559049 3543552 3481905 3301600 3532170 3574086 3398051 3589692 3338895 3356585
16529C356585O9362K4228j66272O7224k72694r3238J95471l36916J80466M8773
$$ 3356585 3425947 3450175 3283903 3351127 3078433 2985195 3180666 2843750 3024216 3072989
16519C072989l3159j01707j6915K00410j15956J3713L4612k51124R5150r7366
$$ 3072989 3039830 2938123 2921208 3121618 3005662 3019375 3053987 2802863 2898013 2800647
16509B800647j68751K3923J18151p2524N2684l22093o3955J80097k9376N2388
$$ 2800647 2631896 2655819 2773970 2701446 2754130 2432037 2368082 2548179 2518803 2571191
16499B571191J26773l02648j35198M12543k63411M4777j7465o4176m9225J60491
$$ 2571191 2697964 2395316 2260118 2672661 2409250 2454027 2436562 2372386 2323161 2483652
16489B483652k22871K45861j24654j87879L6218o7336J13560j43669j83978K99390
$$ 2483652 2260781 2506642 2381988 2194109 2230327 2162991 2276551 2132882 1948904 2248294
16479B248294l20697J63202K38914k95615r2920K74789m16877K63114l3129k84052
$$ 2248294 1927597 2090799 2329713 2034098 1941178 2215967 1799090 2062204 2029075 1745023
16469A745023J49688n2077J07551m2496j53180K43112r3555k0121O696r8876l0429
$$ 1745023 1894711 1842634 1950185 1907689 1754509 1997621 1904066 1883945 1890641 1791765 1761336
16458A761336J96645j04508M2932l8492K33278n40126M25096J41608j88154j01337
$$ 1761336 1957981 1853473 1896405 1857913 2091191 1551065 1976161 2117769 1929615 1828278
16448A828278k47931J42138m4568j36926J46938L9721n8271m7604l3401j05091
$$ 1828278 1580347 1722485 1677917 1540991 1687929 1727650 1669379 1621775 1588374 1483283
16438A483283J24984J63779j091m03075L46047j29872K4608j40178J9956n5745
$$ 1483283 1608267 1772046 1770955 1367880 1713927 1584055 1608663 1468485 1488441 1432696
16428A432696k93661K89114r1956j46737L12056q7617M3492Q5771j10240K72600
$$ 1432696 1139035 1428149 1336193 1189456 1501512 1413895 1457387 1543158 1432918 1705518
16418A705518m68965K07076n9731p3267O8769L565n9110N1482j1061j19751j43026
$$ 1705518 1236553 1443629 1383898 1310631 1379400 1382965 1323855 1375337 1364276 1244525 1101499
16407A101499J16808J35188j12596j89991N09517q4477j6049j66120l5301q2007
$$ 1101499 1218307 1353495 1240899 1050908 1560425 1475948 1459899 1293779 1258478 1176471
16397A176471J28958q6277j89405K62610J14646r5963M049k06011j41902K35403
$$ 1176471 1305429 1219152 1029747 1292357 1407003 1311040 1315089 1109078 967176 1202579
16387A202579n5876k56861K61139j13170m0248L17872m38357J18917L0944J3378
$$ 1202579 1146703 889842 1150981 1037811 997563 1315435 877078 995995 1026939 1040317
16377A040317O7660k61199J2208k25422R7608O07550m04705N20560n03189k5580
$$ 1040317 1107977 846778 858986 633564 731172 1338722 934017 1454577 951388 925808
16367I25808L85491l27292K82938j34266j17309k36544J75920M3009K70660k08633
$$ 925808 1311299 984007 1266945 1132679 1015370 778826 954746 997755 1268415 1059782
16357A059782j38730J20498m7706l51454M82523j66001l2848j01363P9968J31064
$$ 1059782 921052 1041550 993844 642390 1124913 958912 926064 824701 904669 1035733
16347A035733k32543L68860l90460j26146L23018K98618m13210j84228K1503J04220
$$ 1035733 803190 1172050 781590 655444 978462 1277080 863870 679642 701145 805365
16337H05365M1628N0313J70103l95573J75333j60455K41490k23066L38020l57746
$$ 805365 846993 897306 1067409 671836 847169 686714 928204 705138 1043158 685412
16327F85412O46917F47513O61244j39315m73113J52517m7497L25518l10801J27247
$$ 685412 1332329 647513 1308757 1169442 696329 848846 801349 1126867 816066 943313
16317I43313k51470K7861J75197k9143j2695j81532J96639k41657K78400o2788
$$ 943313 691843 719704 894901 865758 853063 671531 868170 626513 904913 842125
16307H42125o9245k33906R813K5341L24930C86357L60416J6750C30027K53169
$$ 842125 772880 538974 548787 574128 899058 386357 746773 763523 330027 583196
16297E83196R5002k234A69300L11691K9731l4683J59382J8945K60752l7166j74543
$$ 583196 678198 675964 169300 480991 510722 476039 635421 654366 915118 877952 703409
16286G03409r5663j80514L42683N7568j86247B65734N52594k07987K4361k57981
$$ 703409 607746 427232 769915 827483 641236 265734 818328 610341 634702 376721
16276C76721K79569L09927L5389l57548M4286k75717K80799L29600m45971m9005
$$ 376721 656290 966217 1001606 644058 688344 412627 693426 1023026 577055 528050
16266E28050p0409l7141o3491K14482K3418k5123O0880l6606R187p844k82243
$$ 528050 457641 420500 357009 571491 594909 569786 630666 594060 603247 595403 313160
16255C13160J31988J305l3364J88791j96261J15947j37931J14004k2313j00233
$$ 313160 445148 446453 413089 601880 405619 521566 383635 497639 475326 375093
16245C75093K49613F3865P02199j99381B73936M38288n7451j64899k1811m4528
$$ 375093 624706 63865 766064 566683 273936 712224 654773 489874 468063 423535
16235D23535L40350A51461L06305N09478m11490q1981J41636k77693P5726L58
$$ 423535 763885 151461 457766 967244 555754 473773 615409 337716 413442 413800
16225D13800K21300j89700k0298K24001j77519j19387O7777R7507j66065J75350
$$ 413800 635100 445400 425102 649103 471584 352197 419974 517481 351416 526766
16215E26766k52397K41842B28419n1380l5184L77642A31592K78495l318k0047
$$ 526766 274369 516211 228419 177039 141855 519497 131592 410087 406769 386722
16205C86722L30583l07159K95703A44162K65534A99146J84142L2377J29979N678
$$ 386722 717305 410146 705849 144162 409696 199146 383288 415665 545644 551322
16195E51322K4647k45043j06731B9741L22391J97607j49986n2916p0306Q2689
$$ 551322 575969 330926 224195 29741 352132 549739 399753 346837 276531 359220
16185C59220L37797r1529B42812L30674k40303P352m7692k97L8814K79589j16183
$$ 359220 697017 605488 242812 573486 333183 340535 292843 292546 331360 610949 494766
16174D94766o0076K4979A73891R579J02591J08001j10422A09413L98803j35096
$$ 494766 434690 459669 173891 183470 286061 394062 283640 109413 508216 373120
16164C73120m9105j00903J28109b23331B41481P3693p0752Q8827j57257J56481
$$ 373120 324015 223112 351221 -223331 241481 315174 244422 333249 175992 332473
16154C32473J05129j02784J64079j33443M5006J33909j23095A57808L02884A62962
$$ 332473 437602 334818 498897 365454 410460 544369 421274 157808 460692 162962
16143A53593c5104B34307M6613Q1874j73810P793P5950N8548j54809Q102J72403
$$ 153593 -35104 234307 280920 362794 188984 196777 272727 331275 176466 184568 356971
16132C56971m9750N8557j64199l3954K28735b8376A83080L13518B20934g7036
$$ 356971 307221 365778 201579 167625 396360 -28376 183080 496598 220934 -77036
16121D57206A09785r001c2886j864D51324D0662J70577G2307K12537o3846K9549
$$ 457206 109785 100784 -32886 -34750 451324 40662 211239 72307 284844 220998 250547
16110B50547p3521m7448J56025b50766A57537e179j76137A08446L75871A94456
$$ 250547 177026 129578 285603 -250766 157537 -5179 -181316 108446 484317 194456
16099B58650Q5604j26839J78915i2733B98357J50157h3306K1217B49272A0577
$$ 258650 344254 217415 396330 -92733 298357 448514 -83306 -62089 249272 10577
16088B47364P3215A03423N0220G5888L40702o090j93685H2398N1678K55101e7753
$$ 247364 320579 103423 153643 75888 416590 410500 216815 82398 134076 389177 -57753
16076I9311J89957K66973A69826J42839Q2385A05727L0337J44830h7105D44117
$$ 99311 289268 556241 169826 312665 395050 105727 136064 280894 -87105 444117
16065D167L73931A87579J02475A07358K28405c2048B21952F7973J9696k6736L0112
$$ 4167 378098 187579 290054 107358 335763 -32048 221952 67973 87669 60933 91045
16054I1045Q237R7275d1054A99351D3221L10996G4351M3071K67855j48996J42917
$$ 91045 99282 196557 -41054 199351 43221 354217 74351 117422 385277 236281 379198
16043C79198A63055L9096K7163L51636i3938A26426J61666F849b57630R294C5468
$$ 379198 163055 202151 229314 580950 -93938 126426 288092 6849 -257630 -248336 35468
16031A68040J7665B7714J57628p8974L27539F4915L5583D5073i0806B80036m8937
$$ 168040 185705 27714 185342 106368 433907 64915 100498 45073 -90806 280036 231099
16020B31099o7435j0386M3661J2807E0743K5793L08315j58511H8453M8164F6959
$$ 231099 163664 153278 196939 209746 50743 76536 384851 226340 88453 136617 66959
16008B10087j00945k3500l5290M39365b59546C15390q2455F8997K42345A1826
$$ 210087 109142 85642 50352 489717 -259546 315390 232935 68997 311342 11826
15997D03099n0340c2760C0383J57819g3869D53326j49283L36583B70992J16124
$$ 403099 352759 -32760 30383 188202 -73869 453326 304043 640626 270992 387116
15987C87116m9120N28097J1923Q6998o4201m36987N6081I8738M9450P7509d2147
$$ 387116 337996 866093 878016 965014 900813 463826 519907 98738 148188 225697 -42147
15975A83505q7333a7542A56121O6244a27673A9879a5502p9167L3994E6754a62841
$$ 183505 96172 -17542 156121 222365 -127673 19879 -15502 -94669 -60675 56754 -162841
15963C5163b43637A33060J55817B2945J90551m857r965f171E45857d8149A35294
$$ 35163 -243637 133060 288877 22945 213496 208639 198674 -6171 545857 -48149 135294
15951A94320E6023a75494A27340f564A86007a41786m848G1070K68139q0242G2201
$$ 194320 56023 -175494 127340 -6564 186007 -141786 -146634 71070 339209 258967 72201
15939A25358N4025d5585k6907B36499J93969A01463l3809J86635A13804L8358
$$ 125358 179383 -45585 -72492 236499 430468 101463 67654 254289 113804 152162
15929A52162l4060J96093o5732D3978J29584g6386h537B36649b9512B30021K6761
$$ 152162 118102 314195 248463 43978 173562 -76386 -8537 236649 -29512 230021 256782
15918B56782o6086C330K97484F9027N8469f88060B1303O7704c27690F952a20193
$$ 256782 190696 3330 300814 69027 127496 -688060 21303 89007 -327690 6952 -120193
15906A58104M7243p5439E5132J42933a86118B25537c5344C1066R8115E2436N559
$$ 158104 205347 129908 55132 198065 -186118 225537 -35344 31066 129181 52436 57995
15895E7995b57562f4119B01674a10382B06850j00741j0569c1548A0719J439a55927
$$ 57995 -257562 -64119 201674 -110382 206850 106109 95540 -31548 10719 12158 -155927
15883b27614H7541a16532D62166a08066A58701i4438a346C70668b28126f3487
$$ -227614 87541 -116532 462166 -108066 158701 -94438 -1346 370668 -228126 -63487
15872h5924C06453k0420e6228B22574B4521O041a26632B10609q3901c3162j5021
$$ -85924 306453 286033 -56228 222574 24521 30562 -126632 210609 126708 -33162 -48183
15861d8183b1993k02596A23398J35941d47580A31351P1131b9444A94516h0226
$$ -48183 -21993 -224589 123398 259339 -447580 131351 202482 -29444 194516 -80226
15850a33187C77331A19592M02587A75725M6321B2555d1748j13972e1881k5383
$$ -133187 377331 119592 522179 175725 222046 22555 -41748 -155720 -51881 -77264
15840g7264e710F5754K23252G7633e5360k6709K708C37927e4378b3654n17853
$$ -77264 -5710 65754 289006 77633 -55360 -82069 -79361 337927 -54378 -23654 -541507
15829e41507a40053H0103a36683C58038a60148B4756R1879J29991o8375R2451
$$ -541507 -140053 80103 -136683 358038 -160148 24756 116635 246626 178251 270702
15819B70702j34481J13214F199K92205b83616A89634f379q0979B16841A5116P5661
$$ 270702 136221 249435 6199 298404 -283616 189634 -6379 -87358 216841 15116 90777
15808I0777Q8823P0971O9414q2172a9633r3024l2990B00948a08514C08193d766
$$ 90777 179600 250571 319985 237813 -19633 -112657 -145647 200948 -108514 308193 -4766
15796B34898D2885l527c01343A25404J2570B5277P7921c69421I0104A2826K19616
$$ 234898 42885 39358 -301343 125404 137974 25277 103198 -369421 90104 12826 232442
15785B32442a68256l5536F3069J99815b05800K1667e6279a7154l0243o7101C42179
$$ 232442 -168256 -203792 63069 262884 -205800 -184133 -56279 -17154 -47397 -114498 342179
15773g8824K0983D76214a92086O7684j13594d7189I8071Q5519b6051h896k13822
$$ -78824 -57841 476214 -192086 -124402 -237996 -47189 98071 183590 -26051 -8896 -222718
15762b22718h3948i868D2626f1666D7539b0919l4114a4668A46825J16226b30668
$$ -222718 -83948 -9868 42626 -61666 47539 -20919 -55033 -14668 146825 263051 -230668
15750a14921A35041c0929H4545K54776i1599a5637m4341B49124a79028B9313A3898
$$ -114921 135041 -30929 84545 339321 -91599 -15637 -59978 249124 -179028 29313 13898
15738i0262I1402i4806c1854A37596c41068h6457D8906J27499b8116A28995a61435
$$ -90262 91402 -94806 -31854 137596 -341068 -86457 48906 176405 -28116 128995 -161435
15726B7114a89732R2987I3176b90222I668L72634r5700c7707B1187a36285D185
$$ 27114 -189732 -96745 93176 -290222 9668 382302 286602 -37707 21187 -136285 4185
15714c15282a22871D4097i0138n1655m5269D1235J92652H7772d4054r2476A74061
$$ -315282 -122871 44097 -90138 -141793 -187062 41235 233887 87772 -44054 -136530 174061
15702f087A74106c39678B5370J81180a06432A59607b60868A31934L0349F5624
$$ -6087 174106 -339678 25370 206550 -106432 159607 -260868 131934 162283 65624
15691a99863H0854R0424p5943B0599c37341e5672l2876o1381P2503B9391b4954
$$ -199863 80854 171278 95335 20599 -337341 -55672 -88548 -149929 -77426 29391 -24954
15679a55625c0815A09509e0774E3483J44541b856k65983A7716L2932N8406J83753
$$ -155625 -30815 109509 -50774 53483 198024 -2856 -268839 17716 50648 109054 292807
15668B92807a39522L1686C2430b10614e286j33800A27845k4807a64894F8487c05250
$$ 292807 -139522 -107836 32430 -210614 -5286 -139086 127845 103038 -164894 68487 -305250
15656B0956K91692a41344k8289A19928J80940I2752b59863i9095j77370d16A57553
$$ 20956 312648 -141344 -169633 119928 300868 92752 -259863 -99095 -276465 -416 157553
15644b2256C1332i0791H1516J11792h3873K143J240i098p9432q9279C30301h3770
$$ -22256 31332 -90791 81516 193308 -83873 -81730 -80490 -9098 -88530 -177809 330301 -83770
15631f0423G0903f9346J2500C32680A50486a30932j8161A86584a68211J8938e2966
$$ -60423 70903 -69346 -56846 332680 150486 -130932 -149093 186584 -168211 -149273 -52966
15619a0157k41909A81245D3710a64344A97339C8271f2969a9296n6740j85302E4251
$$ -10157 -252066 181245 43710 -164344 197339 38271 -62969 -19296 -76036 -261338 54251
15607a96322A56589b03805o7170A62046B1205R2063k0434d3620B74620b16747
$$ -196322 156589 -203805 -270975 162046 21205 113268 92834 -43620 274620 -216747
15596A32441a11875E7174J60751M8169A20174i1786A83386d992B04083e7913K4494
$$ 132441 -111875 57174 217925 266094 120174 -91786 183386 -4992 204083 -57913 -33419
15585c3419p5010a8642m0583A61046E9656J48787d3380j19949e4643j13310H3081
$$ -33419 -108429 -18642 -59225 161046 59656 208443 -43380 -163329 -54643 -167953 83081
15573G8869c03224a3970I3976h6745l7516A24917k5238J72791q8757I0601M2559
$$ 78869 -303224 -13970 93976 -86745 -124261 124917 99679 272470 183713 90601 133160
15562A33160c1381B86480H0813O2701F467L64080A26633d00501a60070B71117
$$ 133160 -31381 286480 80813 143514 6467 370547 126633 -400501 -160070 271117
15551a9235A58838i6513D45301D1427a8623j11601j12949h1150H1576K14829b52954
$$ -19235 158838 -96513 445301 41427 -18623 -130224 -243173 -81150 81576 296405 -252954
15539B73977A8947K08507a67899A80278a91327C00022d79148f3342A49026J00984
$$ 273977 18947 227454 -167899 180278 -191327 300022 -479148 -63342 149026 250010
15529B50010b68757C5365K54974A13933L8701b6981C10580r2513E9714K97179
$$ 250010 -268757 35365 290339 113933 152634 -26981 310580 218067 59714 356893
15519C56893k3182m9153H7130A4479N0017k4464g8799F387J91786a96813c0540
$$ 356893 333711 284558 87130 14479 64496 40032 -78799 6387 198173 -196813 -30540
15507C17474r2410a3152B13906G0606J91052g8863A66795g7218G2188k2809Q0981
$$ 317474 225064 -13152 213906 70606 261658 -78863 166795 -77218 72188 49379 130360
15496A30360Q1726A0622a98964A35809F0698K24934m3750B5681a21207A35233
$$ 130360 212086 10622 -198964 135809 60698 285632 241882 25681 -121207 135233
15485D43753a87273C57731j13233K34763F1153L04227O268j46657M15534j05970
$$ 443753 -187273 357731 244498 479261 61153 365380 371648 224991 640525 534555
15475E34555A44118K43890j83659d8873B89493n7748b99571A61608A5004K08109
$$ 534555 144118 388008 204349 -48873 289493 231745 -299571 161608 15004 223113
15465B23113k4820b19750B13410m5181o0630Q0398G2245a61453A27344a66504
$$ 223113 198293 -219750 213410 168229 107599 187997 72245 -161453 127344 -166504
15454B33253c19335F5960K58919A07564J41982A04003J47807q7190O6426L26259
$$ 233253 -319335 65960 324879 107564 249546 104003 251810 164620 231046 557305
15444E57305K81455J62731o7100B67766N6394A26374b02253P1094C40694p5132
$$ 557305 838760 1001491 934391 267766 324160 126374 -202253 -131159 340694 265562
15434B65562d1878F8694J67752C3669R209f4178B46758F6652e2041j04755A75254
$$ 265562 -41878 68694 236446 33669 42878 -64178 246758 66652 -52041 -156796 175254
15422B32219C4442J65872B1637a91377P2339A32529c92938F3567h2036k08951
$$ 232219 34442 200314 21637 -191377 -119038 132529 -392938 63567 -82036 -290987
15412b90987A59256g3661j65460B93851H4337k9648N5551b96736F2022g7032A43227
$$ -290987 159256 -73661 -239121 293851 84337 54689 110240 -296736 62022 -77032 143227
15400B1711P3795b09798E3111Q2672c4001E966K48212A05728a93385I3123N5122
$$ 21711 95506 -209798 53111 135783 -34001 5966 254178 105728 -193385 93123 148245
15389A48245a62910A02850a33855B98335j33590b72161J22351A3487L4554c015
$$ 148245 -162910 102850 -133855 298335 164745 -272161 -149810 13487 48041 -3015
15378A78487a9161j9863A01355R3336I2267a22378D36110A23202M9153a61759
$$ 178487 -19161 -39024 101355 194691 92267 -122378 436110 123202 172355 -161759
15367C06565A32175k7003J28504D1005K06847m0048m7615j3191F1514J30554g5385
$$ 306565 132175 105172 233676 41005 247852 207804 160189 146998 61514 192068 -75385
15355C00653e4519B21805f9287D03231m8288G7122Q3459L02246A76442l0918M12376
$$ 300653 -54519 221805 -69287 403231 354943 77122 160581 462827 176442 145524 557900
15344E57900a5953C13057A05749M76851B26289L2235N3189l6325n4367r1484m6206
$$ 557900 -15953 313057 105749 582600 226289 258524 311713 275388 221021 129537 83331
15333H3331b4770A15394N5358E0894j5713h8366H7551K81218D2366b3384o2157
$$ 83331 -24770 115394 170752 50894 35181 -88366 87551 368769 42366 -23384 -85541
15322h5541I4992J80707r4879P657J2641k0616H7449J64902J33507h8753A14011
$$ -85541 94992 275699 180820 188477 201118 180502 87449 252351 385858 -88753 114011
15310a96504C78042A84770I923N8912a32314d7163p2678A75506o8510j9362M3316
$$ -196504 378042 184770 9923 68835 -132314 -47163 -119841 175506 106996 87634 130950
15299A30950a8828A15635O4851H3549k3654K63217a4146A9825J12790m6615c78
$$ 130950 -18828 115635 180486 83549 59895 323112 -14146 19825 132615 86000 -378
15287F9251K7849j8626f1710j6560I1097n686R9546L0955Q2912q4914b09305A32202
$$ 69251 97100 78474 -61710 -78270 91097 85411 184957 215912 298824 213910 -209305 132202
15274a7550j07121A04086r400N2513o8597J04987q6260l305b99986a39698L5640
$$ -17550 -124671 104086 94686 147199 78602 183589 97329 94024 -299986 -139698 -104058
15263a04058H0802j3270J964L77601h7259A77635a28561H5490L7945a64615M0531
$$ -104058 80802 67532 69496 447097 -87259 177635 -128561 85490 123435 -164615 -124084
15252a24084A43933a00695B48835b32964R6033B01374K346I8912L1828M34615
$$ -124084 143933 -100695 248835 -232964 -136931 201374 203720 98912 130740 565355
15242E65355J305333m49629j0488N49117H96468l68404A86370J27027G4620a66205
$$ 565355 1870688 1421059 1410571 1959688 896468 528064 186370 313397 74620 -166205
15231a47865C64860a16364A54554G1884f6997A4239a88868c6193o1909B30151
$$ -147865 364860 -116364 154554 71884 -66997 14239 -188868 -36193 -98102 230151
15220A413b85981c2224A75326b49674A51976M4585A1816a00649B16082K3040l2628
$$ 1413 -285981 -32224 175326 -249674 151976 196561 11816 -100649 216082 239122 206494
15209B06494c64626A89138n4376J41282D7830f0846D67401a98668a2063r561A03522
$$ 206494 -364626 189138 134762 276044 47830 -60846 467401 -198668 -12063 -21624 103522
15197g2671C5016r362J33879d7898q0196A30210B1055b632B2416O2007K8073R6013
$$ -72671 35016 25654 159533 -47898 -128094 130210 21055 -2632 22416 84423 112496 208509
15185B08509n5892b6222C77208j45280A06898G964J60912g6722B86364G8652e2227
$$ 208509 152617 -26222 377208 231928 106898 7964 168876 -76722 286364 78652 -52227
15173I3080O8105M1155a97475A71384d1104p5502A15398a06262D37600j62197
$$ 93080 161185 202340 -197475 171384 -41104 -116606 115398 -106262 437600 275403
15163B75403j15324a55780E9334J39190b61072H9264k5631J92780a37251j8984
$$ 275403 160079 -155780 59334 198524 -261072 89264 63633 256413 -137251 -156235
15153a56235B91095q2488F5278K92610E8572J51031L9383j19879p228m8628K9714
$$ -156235 291095 208607 65278 357888 58572 209603 248986 129107 121879 73251 102965
15142A02965D2737f6503A47748K3144J94710F8389g4479A78066h5721D67626G7496
$$ 102965 42737 -66503 147748 170892 365602 68389 -74479 178066 -85721 467626 77496
15130A42035a35549B50808D3687A6575d9254C88040A9750N6311K75245p8138A30004
$$ 142035 -135549 250808 43687 16575 -49254 388040 19750 76061 351306 273168 130004
15118A31257B3473M32008B25513J22930j72308p9274J57816q8441r731j8809a3544
$$ 131257 23473 455481 225513 348443 176135 96861 254677 166236 156505 137696 -13544
15106a66669B34579k9260d9225C04691A46400J94531b02989A00436c37702B68829
$$ -166669 234579 205319 -49225 304691 146400 340931 -202989 100436 -337702 268829
15095a61650M8112A86468c8214A3125J75684F7423J71767a57695E3019C927P0871
$$ -161650 -113538 186468 -38214 13125 188809 67423 239190 -157695 53019 3927 74798
15084G4798a341H9688J93617a35788B30302J96771j97334J12422j23951d8129
$$ 74798 -1341 89688 283305 -135788 230302 427073 229739 342161 218210 -48129
15073C84629j89114a32299I389J3107K34810j04003j099m6273a7470j1281o7457
$$ 384629 195515 -132299 9389 22496 257306 153303 152204 105931 -17470 -28751 -96208
15062i6208B42797j09602k1401K33708A11930J35992L181J93186j69837k7263
$$ -96208 242797 133195 111794 345502 111930 247922 251103 444289 274452 247189
15052B47189A16351J9481K15448q4138O9642A53181K13904n709n8909r7977K519
$$ 247189 116351 135832 351280 267142 336784 153181 367085 361376 302467 204490 207009
15041B07009G3408R5333J78572J4393K16392k02667j85708L88734j80595j44279
$$ 207009 73408 168741 347313 361706 578098 375431 189723 578457 397862 253583
15031B53583K15622M1104j06547L94996K1481o8061k21493o5853j99715J65472
$$ 253583 469205 510309 403762 798758 820239 752178 530685 464832 265117 430589
15021D30589L55091C69611K98259k04593k7207l8219K046n4463O7736A74748L83987
$$ 430589 785680 369611 667870 463277 436070 397851 399897 345434 413170 174748 558735
15010E58735j75564P4167Q4688N5349r1552J207j73253j33762E8451L70659m3738
$$ 558735 383171 457338 542026 597375 505823 507030 333777 200015 58451 429110 385372
14999C85372j857J08389J87074k88329j3244q5018N2466L81156k97814J053J3951
$$ 385372 383515 491904 678978 390649 377405 292387 344853 726009 428195 429248 443199
14988D43199m349N9471j13756J10869p2306O7002J52990M4598j59353l2053r1244
$$ 443199 438850 498321 384565 495434 423128 490130 643120 687718 528365 496312 405068
14977D05068J29326o8579A92301L81478n9803L7789r1207K28564j95291J7345
$$ 405068 534394 465815 192301 573779 513976 551765 460558 689122 493831 511176
14967E11176j83172P9626A44765L2058J51303R7110j10805M862n9969A24188Q5633
$$ 511176 328004 407630 144765 176823 328126 425236 314431 319293 259324 124188 209821
14956B09821K70836A01613K51342M01195B19958K38706B7465L25268q4980L04071
$$ 209821 480657 101613 352955 754150 219958 458664 27465 352733 267753 571824
14946E71824K38805j50067k48924J28221B59254M1276M20777j23189j56165j08287
$$ 571824 810629 660562 411638 539859 259254 300530 721307 598118 441953 333666
14936C33666K92238j75391J35682J27835J94177k28180J35470K93096M3005J10976
$$ 333666 625904 450513 586195 714030 908207 680027 815497 1108593 1151598 1262574
14926A262574K51634j86489j97438J43910J98413L11808o261L17866k83137n07170
$$ 1262574 1514208 1327719 1130281 1274191 1472604 1784412 1778151 2096017 1812880 1305710
14916A305710K26978l57001n351l07528Q7898j21760C64859P2380J37101k39241
$$ 1305710 1532688 1175687 1170336 862808 950706 828946 364859 437239 574340 335099
14906C35099l0771K60757n8718k9961K23153A75863K01482J76299B42341n8244
$$ 335099 304328 565085 506367 476406 699559 175863 377345 553644 242341 184097
14896A84097J76352K55661A11489M9339M43647j32669j86667L31049j37795L28793
$$ 184097 360449 616110 111489 160828 604475 471806 285139 616188 478393 807186
14886H07186k73396K55291k554J11249l06197J08370O6562k48851r2644R3249
$$ 807186 533790 789081 786527 897776 591579 699949 766511 517660 425016 518265
14876E18265J1623q9982L07784k68342A09805K41832A46278M60865J57938p1006
$$ 518265 529888 439906 747690 479348 109805 351637 146278 607143 765081 694075
14866F94075M3096q4696k961B71686p8980L1343j4552J98492A05114M8748j6947
$$ 694075 737171 652475 649514 271686 192706 224049 209497 407989 105114 153862 136915
14855A36915K57348o7796J61319k23575N22333C28105K01063O869O3756M31116
$$ 136915 394263 326467 487786 264211 786544 328105 529168 536037 599793 1030909
14845A030909K789J73685J25878l39632Q6790L73317q0107k18388m17949P3518
$$ 1030909 1033698 1207383 1333261 993629 1080419 1453736 1373629 1155241 737292 810810
14835H10810k40379L2983k53409j28160K73368J79120k4793j83256A44868K54534
$$ 810810 570431 603414 350005 221845 495213 674333 649540 466284 144868 399402
14825C99402M18805k95632L106N3716B79519N25766k42644M8179J16256B72197
$$ 399402 818207 522575 525681 579397 279519 805285 562641 610820 727076 272197
14814F22587j35823n5383j35442J25411J00473K27962k76676M25018K22393j14200
$$ 622587 486764 431381 295939 421350 521823 749785 473109 898127 1120520 1006320
14804A006320l39214L94779k07245k47326J9868n7827J8793K3598r2174m328n8407
$$ 1006320 667106 1061885 854640 607314 627182 569355 588148 611746 519572 515244 456837
14793D56837j10886L90426L1973l75605J64223O2746k28836K13905J89579j51343
$$ 456837 345951 736377 768350 392745 556968 619714 390878 604783 794362 643019
14783F43019n8882J58151k59156m7749k3481p3915L68271L07987l10351R9527
$$ 643019 584137 742288 483132 435383 411902 337987 706258 1014245 703894 803421
14773H03421J03478C04239K92564P0999j1001j37827j83967M81059C69550m9124
$$ 803421 906899 304239 596803 667802 656801 518974 335007 816066 369550 320426
14763C20426J6747K00871m507J81791l44848N43676o5079j30360k06582K45109
$$ 320426 337173 538044 533537 715328 370480 914156 849077 718717 512135 757244
14753G57244o0723l11742J25081j59963N86281l44789J29761j82370k60764K63027
$$ 757244 696521 384779 509860 349897 936178 591389 721150 538780 278016 541043
14743E41043L79104l62021P2718j99189K13817J02154k09710N22531m10005J16501
$$ 541043 920147 558126 630844 431655 645472 747626 537916 1060447 650442 766943
14733G66943K32972k16929K89823E08730R05649j50483J8915K97328j50205m3027
$$ 766943 999915 782986 1072809 508730 1414379 1263896 1282811 1580139 1429934 1386907
14723A386907k06721K668k44270J84592q0894m071r8616j56259j08099O1117L32955
$$ 1386907 1180186 1182854 938584 1123176 1042282 1038211 939595 783336 675237 736354 1069309
14712A069309l34282K20414j54067P5552j74278L23076J56655p9316k45905M57062
$$ 1069309 735027 955441 801374 876926 702648 1025724 1182379 1103063 857158 1314220
14702A314220M92757R9813o9859k73079o90850J68210p6373k85523P49635n39447
$$ 1314220 1806977 1906790 1836931 1563852 873002 1041212 964839 679316 1428951 889504
14692H89504k36612K3698K3904L57359m70930L17765M9724m3769j48366N5671
$$ 889504 652892 676590 700494 1057853 586923 904688 954412 910643 762277 817948
14682H17948l6930L49560n54528O07663m66406p3410M5355J80208J71809m14522
$$ 817948 781018 1130578 576050 1183713 717307 643897 689252 869460 1041269 626747
14672F26747J24809J10800l943J91558k51678M30571j54850J75202k91245O0123
$$ 626747 751556 862356 858413 1049971 798293 1228864 1074014 1249216 957971 1018094
14662A018094j71424J62850K23883j00985o6792k98016m5018K57503j11897J60292
$$ 1018094 846670 1009520 1233403 1132418 1065626 767610 722592 980095 868198 1028490
14652A028490L58433n8470k52244L48006m20911K9667j8331L20384k24124O3995
$$ 1028490 1386923 1328453 1076209 1424215 1003304 1032971 1014640 1335024 1110900 1174895
14642A174895n29386P65443o18018J70714j80515K20947L49736l82428J11125
$$ 1174895 645509 1410952 792934 963648 783133 1004080 1353816 971388 1082513
14633A082513N0660j32022j43892j23433L99655J26475j19084j61389J49789M24595
$$ 1082513 1133173 1001151 857259 733826 1133481 1259956 1140872 979483 1129272 1553867
14623A553867m50950J831K75554j36735q6352M1097j3606L7811Q9195K29070m05178
$$ 1553867 1102917 1104748 1380302 1243567 1157215 1198312 1184706 1222517 1311712 1540782 1135604
14612A135604L67740k27972k41997M00622k77295J80495K6719j0131Q6943J91916
$$ 1135604 1503344 1275372 1033375 1433997 1156702 1337197 1363916 1353785 1440728 1632644
14602A632644l73152K31227l1265J20352j92742o2227o8490L07065j25074l2967
$$ 1632644 1259492 1490719 1459454 1579806 1387064 1324837 1256347 1563412 1438338 1405371
14592A405371j3502L24829p9908k41093J27937K74015k39379J6622J27786l29546
$$ 1405371 1391869 1716698 1636790 1395697 1523634 1797649 1558270 1574892 1702678 1373132
14582A373132M61327j78362o3204Q3470N9712J57980l19844L23795L08440l94555
$$ 1373132 1834459 1656097 1592893 1676363 1736075 1894055 1574211 1898006 2206446 1811891
14572A811891K64073P174j14882p6475M3639O977M92338k13213k76427K87783
$$ 1811891 2075964 2083138 1968256 1891781 1935420 1942397 2434735 2221522 1945095 2232878
14562B232878R2888k61856M45255O0441j34670k16604N04469J69553J08525M65474
$$ 2232878 2325766 2063910 2509165 2569606 2434936 2218332 2722801 2892354 3000879 3466353
14552C466353J27983P09373N77406J820490L582079P883291K0927187J561448
$$ 3466353 3594336 4303709 4881115 6701605 10283684 18166975 39094162 40655610
14544D0655610A5594297F943123l075610q97798l00024N76713K103131j756966
$$ 40655610 15594297 6943123 3867513 2969715 2669691 3246404 5349535 3592569
14536C592569j468350l25477J63914j99490K96936j14616k50298J03937L6260
$$ 3592569 2124219 1798742 1962656 1763166 2060102 1945486 1695188 1799125 1835385
14527A835385j9580N33246m7804m0814k57531J49736n3672L11775k35806m5872
$$ 1835385 1815805 2349051 2301247 2260433 2002902 2152638 2098966 2410741 2174935 2129063
14517B129063K55817j40893P1272R2689l1254q4534K38895J94585j51903j63720
$$ 2129063 2384880 2243987 2315259 2407948 2376694 2292160 2531055 2725640 2573737 2410017
14507B410017j65293L69251J02577m6041J08725M7144l35319K99981j27527J3642
$$ 2410017 2244724 2613975 2716552 2670511 2779236 2826380 2491061 2791042 2663515 2677157
14497B677157K61084R5202k80921K54720k24411K76999r8196J40177l08211K63392
$$ 2677157 2938241 3033443 2752522 3007242 2782831 3059830 2961634 3101811 2793600 3056992
14487C056992J89795n2765M4894j70171J53121L50702k67742R1523j55124J01708
$$ 3056992 3246787 3194022 3238916 3068745 3221866 3572568 3304826 3396349 3241225 3342933
14477C342933M91655k51510P7796j56866J37640j55674M74938k65509j06945L77875
$$ 3342933 3834588 3583078 3660874 3504008 3641648 3485974 3960912 3695403 3588458 3966333
14467C966333K50967k11653j31999J59690J62890K01540m36840M42558K5114K5
$$ 3966333 4217300 4005647 3873648 4033338 4196228 4397768 3960928 4403486 4428600 4428625
14457D428625p9716L82246l89482L84680j13035J02772O5500J516J5478j87562
$$ 4428625 4348909 4731155 4341673 4726353 4613318 4716090 4781590 4783106 4798584 4611022
14447D611022J78078M24738R0115J67979l84003N4366M02954j83593J59422L66719
$$ 4611022 4789100 5213838 5303953 5471932 5087929 5142295 5545249 5361656 5521078 5887797
14437E887797m2976o7320K33722k02886M39103p2822O5212K45863l06356K70147
$$ 5887797 5844821 5777501 6011223 5808337 6247440 6174618 6239830 6485693 6179337 6449484
14427F449484K18880l2235L56390R4273L57042j88967L5084q1612n5170J40083
$$ 6449484 6668364 6636129 6992519 7086792 7443834 7254867 7289951 7208339 7153169 7293252
14417G293252K65026M2238j90637M45479R5435J5748k2101L03887M39508l2274
$$ 7293252 7558278 7600516 7409879 7855358 7950793 7966541 7944440 8248327 8687835 8655561
14407H655561L98582k12771R975L38946m31590O14333J09289j22113K41571J27874
$$ 8655561 9054143 8841372 8851347 9190293 8758703 9373036 9482325 9360212 9601783 9729657
14397I729657L77767n0610J32596R7580M70984J30230P6587J34628n8468K33161
$$ 9729657 10107424 10056814 10189410 10286990 10757974 10888204 10964791 11099419 11040951 11274112
14387A1274112L27254M92078J96550K86137l1375M49701j54977N57484L1287L68569
$$ 11274112 11601366 12093444 12289994 12576131 12544756 12994457 12839480 13396964 13428251 13796820
14377A3796820n1569N68385M75225k38494P57541J12768L72037L18812N74351
$$ 13796820 13745251 14313636 14788861 14550367 15307908 15420676 15792713 16111525 16685876
14368A6685876K57417K62569J57699L63922K66243O34945O16814k31400N03718
$$ 16685876 16943293 17205862 17363561 17727483 17993726 18628671 19245485 19014085 19517803
14359A9517803P31814M53169J67990Q12447J13173J022117K64427N22668O74545
$$ 19517803 20249617 20702786 20870776 21683223 21796396 22818513 23082940 23605608 24280153
14350B4280153M91754P31873Q08215N48877R27448K93987J118534L95571J205953
$$ 24280153 24771907 25503780 26311995 26860872 27788320 28082307 29200841 29596412 30802365
14341C0802365O87198O54089R78805R53467R33583J045227R21940J327483R15255
$$ 30802365 31489563 32143652 33122457 34075924 35009507 36054734 36976674 38304157 39219412
14332C9219412Q97788J698621J113785J588223J118289J511534J835920J665588
$$ 39219412 40117200 41815821 42929606 44517829 45636118 47147652 48983572 50649160
14324E0649160J810791J606069J634902K034662K001116K366024K277281J969815
$$ 50649160 52459951 54066020 55700922 57735584 59736700 62102724 64380005 66349820
14316F6349820K617436K530278K882792L143182K985812L126351L439384L508815
$$ 66349820 68967256 71497534 74380326 77523508 80509320 83635671 87075055 90583870
14308I0583870L947763M432876M411873M189447N028678N335654N260736O074381
$$ 90583870 94531633 98964509 103376382 107565829 112594507 117930161 123190897 129265278
14300A29265278O082627O814743O970981P305767Q073800Q201402Q826657R515196
$$ 129265278 135347905 142162648 149133629 156439396 164513196 172714598 181541255 191056451
14292A91056451R686681J0425616J1538811J1391680J2131943J2489952J3211400
$$ 191056451 200743132 211168748 222707559 234099239 246231182 258721134 271932534
14285B71932534J3409427J4011337J4130498J4460674J4835749J4592046J4373670
$$ 271932534 285341961 299353298 313483796 327944470 342780219 357372265 371745935
14278C71745935J3773102J3253419J1667119J0491207Q381588M873587J186763
$$ 371745935 385519037 398772456 410439575 420930782 429312370 434185957 435372720
14271D35372720M43929j52120k212446n872183o795064p151546q501750j0510274
$$ 435372720 435816649 435664529 433452083 427579900 420784836 413633290 405131540 394621266
14263C94621266j2122527j3754001j4768175j5100325j5216534j5249865j5157143
$$ 394621266 382498739 368744738 353976563 338876238 323659704 308409839 293252696
14256B93252696j4784252j4002322j3763476j3008277j2537005j1820194j1151979
$$ 293252696 278468444 264466122 250702646 237694369 225157364 213337170 202185191
14249B02185191j0378910q165652r653316q746108q260072p591882p392688o704740
$$ 202185191 191806281 183640629 173987313 165241205 156981133 149389251 141996563 135291823
14241A35291823o711791o063893n672398m861666n274509m500965m542477m438441
$$ 135291823 128580032 122516139 116843741 111982075 106707566 102206601 97664124 93225683
14233I3225683m089377l176667l348154l161868l412323l000491l248754k433076
$$ 93225683 89136306 85959639 82611485 79449617 76037294 73036803 69788049 67354973
14225F7354973k716660k179891k080980k397333j785275k148232j766866j607416
$$ 67354973 64638313 62458422 60377442 57980109 56194834 54046602 52279736 50672320
14217E0672320j837516j367130j987839p02267j296075j555600j550135j298548
$$ 50672320 48834804 47467674 45479835 44777568 43481493 41925893 40375758 39077210
14209C9077210r23083r87810m38084j472239r90986j203177j127584o20158p86755
$$ 39077210 38154127 37166317 36728233 35255994 34265008 33061831 31934247 31314089 30527334
14200C0527334k96758j003200j277718q27889n16110m37503k09373r83472n95179
$$ 30527334 30230576 29227376 27949658 27121769 26605659 26168156 25958783 24975311 24380132
14191B4380132p28385m71988n97308k72421r43962o5071q38240l89503l67949
$$ 24380132 23651747 23179759 22582451 22310030 21366068 21300997 20462757 20073254 19705305
14182A9705305m11227k56870o68645l25776l72272m17798k51857o37298j92323
$$ 19705305 19294078 19037208 18368563 18042787 17670515 17252717 17000860 16363562 16171239
14173A6171239m39009J4890l65366j52711n36713m51632q2759l12477K2141n96067
$$ 16171239 15732230 15747120 15381754 15229043 14692330 14240698 14157939 13845462 13867603 13271536
14163A3271536j8101l42334L6079m23925k42189k83322L1284j60667m16050j70782
$$ 13271536 13253435 12911101 12947180 12523255 12281066 11997744 12029028 11868361 11452311 11281529
14153A1281529j61633n4748l46394l71744K76861n12612j64091p9730j41279r3487
$$ 11281529 11119896 11065148 10718754 10347010 10623871 10111259 9947168 9867438 9726159 9632672
14143I632672j48818O2098k53449l12987K759k56892K2896m70024L54145k31121
$$ 9632672 9483854 9545952 9292503 8979516 8982275 8725383 8748279 8278255 8632400 8401279
14133H401279m69955J88337m79127j43706J65823J3492m07279K3051k11984K00663
$$ 8401279 7931324 8119661 7640534 7496828 7662651 7676143 7268864 7291915 7079931 7280594
14123G280594l41236r1361j32226o4171l5620o6537m6678K69448n01763l05025
$$ 7280594 6939358 6847997 6715771 6651600 6615980 6549443 6502765 6772213 6270450 5965425
14113E965425J09509J23154j47069l8511k2548j87242j75711M95532m99121k63148
$$ 5965425 6074934 6198088 6051019 6012508 5989960 5802718 5627007 6122539 5623418 5360270
14103E360270L74834m17164K2823j78778n5717j5617o4016kK20270k79694j1248
$$ 5360270 5735104 5317940 5340763 5161985 5106268 5090651 5026635 5026633 5246903 4967209 4955961
14092D955961j86013J112r1270r0617j99542M51940J538l04654q2130j08520Q3693
$$ 4955961 4769948 4771060 4679790 4589173 4389631 4841571 4843109 4538455 4456325 4347805 4431498
14081D431498j01843j50366q1914j9386J55696l02725J23057j98211J24304l77944
$$ 4431498 4329655 4179289 4097375 4077989 4233685 3930960 4054017 3855806 3980110 3602166
14071C602166l0630L78261l36274O4984k27355P4194J33519L06167j32339j30575
$$ 3602166 3571536 3949797 3613523 3678507 3451152 3525346 3658865 3965032 3832693 3702118
14061C702118N5199j2435K0277l66419J7056p6336j30981K7632J80657m29038
$$ 3702118 3757317 3744882 3765159 3398740 3415796 3339460 3208479 3236111 3416768 2987730
14051B987730J98247k32099K9980M06038l65338R7716r9562j75650J78590k73009
$$ 2987730 3185977 2953878 2983858 3389896 3024558 3122274 3022712 2847062 3025652 2752643
14041B752643L58054j18597l04922M26631n37629J03727q6037n8746j17080L09331
$$ 2752643 3110697 2992100 2687178 3113809 2576180 2679907 2593870 2535124 2418044 2727375
14031B727375q2832p1807j55092L22662q8115k8836k48545R7896o6418j51378
$$ 2727375 2644543 2572736 2417644 2740306 2652191 2623355 2374810 2472706 2406288 2254910
14021B254910k31612K74030Q892J06347l57515L97228l84225K56405O0283j09744
$$ 2254910 2023298 2297328 2306220 2412567 2055052 2452280 2068055 2324460 2384743 2274999
14011B274999n5358J92492l32706n1619k765k73599N35483q9498k41943m5079
$$ 2274999 2219641 2412133 2079427 2027808 2025043 1751444 2286927 2197429 1955486 1910407
14001A910407m4551K42865j80215r1348L1709k43278K60102L2706k07313M25694
$$ 1910407 1865856 2108721 1928506 1837158 1868867 1625589 1885691 1918397 1711084 2136778
13991B136778l23772N14222L56320K045971N333621J6207064K1795134k3790626
$$ 2136778 1813006 2327228 2683548 4729519 10063140 26270204 48065338 24274712
13983B4274712j2017474m682095k079443j028165q78258n06439k47991j54353
$$ 24274712 12257238 7575143 5495700 4467535 3589277 3082838 2834847 2680494
13975B680494j22314q2873r9738l68838L82387l0074k91853J5957j94534r3578
$$ 2680494 2558180 2475307 2375569 2006731 2389118 2359044 2067191 2083148 1888614 1795036
13965A795036K38970j06842K32282l49978K21222k00762q4284J61131J2007q9858
$$ 1795036 2034006 1927164 2159446 1809468 2030690 1829928 1745644 1906775 1918782 1828924
13955A828924m3417j50527J65125J17415j73960k48234J54084Q9916j55394k72284
$$ 1828924 1785507 1634980 1800105 1917520 1743560 1495326 1649410 1739326 1583932 1311648
13945A311648J70543J687p701J42941k11810O1949K39081m12807L13772j61917
$$ 1311648 1482191 1483878 1476177 1619118 1407308 1469257 1708338 1295531 1609303 1447386
13935A447386l9896K83285k95800K26441k99368k32345J39979K82088k39521M33308
$$ 1447386 1407490 1690775 1394975 1621416 1322048 1089703 1229682 1511770 1272249 1705557
13925A705557m55132J03178j75359L53840j2678k4968k72735L74907l95533p8761
$$ 1705557 1250425 1353603 1178244 1532084 1519406 1494438 1221703 1596610 1201077 1122316
13915A122316L92526j22649R2704l07012k62496O87014k02488l6901l58070K99847
$$ 1122316 1514842 1392193 1484897 1177885 915389 1602403 1399915 1363014 1004944 1304791
13905A304791q6130j2886J11814l82370K33020r482K45097l43756Q6763o9447
$$ 1304791 1218661 1205775 1317589 935219 1168239 1158757 1403854 1060098 1146861 1077414
13895A077414Q1532K13331m55425K10061M80122E66695N56825j37342L12402k02831
$$ 1077414 1158946 1372277 916852 1126913 1607035 566695 1123520 986178 1298580 1095749
13885A095749l24071M86462n69493L72391l42901q8742N10016r4921J36634E19966
$$ 1095749 771678 1258140 688647 1061038 718137 629395 1139411 1044490 1181124 519966
13874F59750M84986k91974K33269j2633l42554q781M55007l58310K47698r8310
$$ 659750 1144736 852762 1086031 1073398 730844 722063 1177070 818760 1066458 968148
13864I68148L3823j20062M1267p6171M2522J23130J02171n04147K10945k5880
$$ 968148 1001971 881909 923176 847005 889527 1012657 1114828 610681 821626 795746
13854G95746J61651O8257M7476j45037j25990L00828k86396K78204m84703L52968
$$ 795746 957397 1025654 1073130 928093 802103 1102931 816535 1094739 610036 963004
13844I63004k85072l1611k57048N94160j74046l04039L02919j62831K35538J44445
$$ 963004 677932 646321 389273 983433 809387 505348 808267 645436 880974 1025419
13834A025419k29667K36030k00268j50127J86113k79487J42043N5568j6136q586
$$ 1025419 795752 1031782 831514 681387 867500 588013 730056 785624 769488 760902
13824G60902k35882K52192K00905r0174q092l1546q2190R7744j17294M4624k56686
$$ 760902 525020 777212 978117 887943 879851 848305 766115 863859 746565 791189 534503
13813E34503K12922M7616k5753K60591m17493R573k8947J46897J58972j94019
$$ 534503 747425 795041 769288 1029879 612386 621959 593012 739909 898881 704862
13803G04862j4428J26148l73315o2819J85276K43556n1158J17635C83460L75577
$$ 704862 690434 816582 443267 380448 565724 809280 758122 875757 383460 759037
13793G59037q581K3543j73814J30208O2585r8098j09876J5932j8673N5801j0968
$$ 759037 750456 773999 600185 730393 792978 694880 585004 600936 582263 638064 627096
13782F27096J6999p1210K42199j14768j21543Q9125M5972C32670J79003J85711
$$ 627096 644095 572885 815084 700316 578773 667898 713870 332670 511673 697384
13772F97384K04844l15768M1279r9445O1637K33164k85755j25152J44306K64729
$$ 697384 902228 586460 627739 528294 589931 823095 537340 412188 556494 821223
13762H21223l45865O8965j78135J91209l2869P9535B66284M19413k39205M25229
$$ 821223 475358 544323 366188 557397 524528 604063 266284 685697 446492 871721
13752H71721C68039K55601L105B88568L47336J74774B69690M74032j51135N980
$$ 871721 368039 623640 626745 288568 635904 810678 269690 743722 592587 598567
13742E98567j32303L27764l21084J05288B50669M64401j18044j27616J49127B88046
$$ 598567 466264 794028 472944 578232 250669 715070 597026 469410 618537 288046
13731D19871J71841k38092J96039o6316l6966J82757A72260K95436O4075p074
$$ 419871 591712 353620 549659 483343 446377 629134 172260 467696 531771 524697
13721E24697A62357Q9267K68860J47069B63176M77664l17583j68855L37755k81447
$$ 524697 162357 251624 520484 667553 263176 740840 423257 254402 592157 310710
13711C10710J47663j16526J40184j97565P4876m8197M02092k32409j82744J09045
$$ 310710 458373 341847 482031 284466 359342 311145 713237 480828 298084 407129
13701D07129j6277j16560J58324j39507l1208L39629B98527K40414r1629K19398
$$ 407129 390852 274292 432616 293109 261901 601530 298527 538941 447312 666710
13691F66710j87330M9902J2107l0233j59686K30788K5890O4193I3496L67847j26061
$$ 666710 479380 529282 541389 511156 351470 582258 608148 672341 93496 461343 335282
13680C35282m8514M4531A42732l6754J95541K5473n2501M67433k45409A58432
$$ 335282 286768 331299 142732 105978 301519 326992 274491 741924 496515 158432
13669E86005k77770J96040j99768J94354K1364j32739A58466P4012o4599M333
$$ 586005 308235 504275 304507 498861 520225 387486 158466 232478 167879 172212
13659A72212K03943J66095m0991K80717l65611j80220k3495L36291k61760R4996
$$ 172212 376155 542250 501259 781976 416365 236145 212650 548941 287181 382177
13649C82177J041J55411k41224M26397F9920B6181L89377P7087k01895q5130M616
$$ 382177 383218 538629 297405 723802 69920 26181 415558 492645 290750 205620 210236
13638B10236m5712K28620K43094J17486k78090l7090j35863n5124F1075b737B48833
$$ 210236 164524 393144 636238 753724 475634 438544 302681 247557 61075 -2737 248833
13626C64736m6075J85622j44837K14349P932j95051L20378l48974L4093J40098
$$ 364736 318661 504283 359446 573795 581727 386676 707054 358080 392173 532271
13616E32271a5153C21002g9903C50471L8575J41371I4829J73511J13270o0599
$$ 532271 -15153 321002 -79903 350471 389046 530417 94829 268340 381610 321011
13606C21011J96661C8982K09463r8529L92251A77028L05934A19735N4880G6281
$$ 321011 517672 38982 248445 149916 542167 177028 482962 119735 174615 76281
13595B31813q8602b1925D80268j59586k2304A22679L29369p1190r7394J64943
$$ 231813 143211 -21925 480268 320682 298378 122679 452048 380858 283464 448407
13585D48407j98615Q3297j174j39444J08810p6556Q1184L3244A48478r303a2884
$$ 448407 249792 333089 331915 192471 301281 224725 305909 339153 148478 139175 -12884
13573B99090A24468K82356M8295H8411m0669K00497K78044j53992r3212E0977
$$ 299090 124468 406824 455119 88411 47742 248239 526283 372291 279079 50977
13562D88664A32916J47976J10425j51074J28675j09261K46250A70422K42667A56195
$$ 488664 132916 280892 391317 240243 368918 259657 505907 170422 413089 156195
13551A54657O488A3047J27048K83220g0516D88645b48797A49006B0740L07031
$$ 154657 161145 13047 140095 423315 -70516 488645 -248797 149006 20740 327771
13541C27771r5107A560J44566K55570J7218O343M8240j09016d3024B62664J31695
$$ 327771 232664 1560 146126 401696 418914 425257 473497 364481 -43024 262664 394359
13530C94359B3624K78587j0868K40475M8527A70192J18877b1003C4744M88448
$$ 394359 23624 302211 291343 531818 580345 170192 289069 -21003 34744 523192
13520E23192k06734k7157J44545A57055J68142G4785J31478C3170L35834k7842
$$ 523192 316458 289301 433846 157055 325197 74785 206263 33170 369004 341162
13510C41162l0619J73857o7132j8494A36964b7560A74481J45272A28027h6851
$$ 341162 310543 484400 417268 398774 136964 -27560 174481 319753 128027 -86851
13499D42870j70197o906E8713L48099j5452A58640L4280r1216K31578g7632B16261
$$ 442870 272673 265767 58713 406812 391360 158640 192920 101704 333282 -77632 216261
13487d3716o2365C16068o0039A9876N0039L62648k07459O1383A00106J02271A2795
$$ -43716 -106081 316068 256029 19876 69915 432563 225104 286487 100106 202377 12795
13475B14724p8545m7098J62210l4658N1028m3652R2330J77457A1061J72437J47692
$$ 214724 136179 89081 251291 216633 267661 224009 316339 493796 11061 183498 331190
13464C31190Q4089j61259p5393k8536N6684D6486J99358F597a24453A90703K85616
$$ 331190 415279 254020 178627 150091 206775 46486 245844 6597 -124453 190703 476319
13453D76319B04267I4449P9198p0844c04304A72179J68619a00499B51520E5107
$$ 476319 204267 94449 173647 102803 -304304 172179 340798 -100499 251520 55107
13442a75405C76377A04420l4393J84006F2416Q5190J0320E5297K20420A14317
$$ -175405 376377 104420 70027 254033 62416 147606 157926 55297 275717 114317
13431G6234M8716a9264B12007A03181k8410J53680e1288C74520g5647B81978j9769
$$ 76234 124950 -19264 212007 103181 74771 228451 -51288 374520 -75647 281978 262209
13420B62209a8766A45850j0155D2336J25410K12367P742f6978K8166C43652A53716
$$ 262209 -18766 145850 135695 42336 167746 380113 387855 -66978 -38812 343652 153716
13408A69994E5047K12137I4674f5942B43901L5058g111A98890J03719j04421I3611
$$ 169994 55047 267184 94674 -65942 243901 278959 -7111 198890 302609 198188 93611
13396E4045Q1345j2785J2647L22860j78761C1139d2014B54431j3482g0358B32099
$$ 54045 135390 122605 135252 458112 279351 31139 -42014 254431 240949 -70358 232099
13384A73976n4929J76252O3911j07241R4544j14832o6721J01824o6828H6739k3216
$$ 173976 119047 295299 359210 251969 346513 231681 164960 266784 199956 86739 63523
13373F3523J93002a74556B82016J38980h1921A11988C955J45514L6574J69437
$$ 63523 256525 -174556 282016 420996 -81921 111988 3955 149469 186043 355480
13363C55480r3701O7380A37879a60701c159C8052O9773M08750B05118b21503B53466
$$ 355480 261779 329159 137879 -160701 -3159 38052 107825 516575 205118 -221503 253466
13351A97027l3403D4405N23979D6620L12133A76826k5759J17277c7584H0609J29318
$$ 197027 163624 44405 568384 46620 358753 176826 151067 268344 -37584 80609 209927
13340B09927J44132A55733K5086P6632j20057K14794J06587B5947J47190k8123
$$ 209927 354059 155733 180819 257451 137394 352188 458775 25947 173137 145014
13330A45014J09648N5796A53661K94947A82476L860J49335A22351K96919B3543
$$ 145014 254662 310458 153661 448608 182476 186336 335671 122351 419270 23543
13319B31504A01135a40188D58563A09010J16856c4365B45916L2877J12940n0966
$$ 231504 101135 -140188 458563 109010 225866 -34365 245916 278793 391733 340767
13309C40767j68437L88071a02291D49957h5713A86698c4108j3206B76430F0241
$$ 340767 172330 560401 -102291 449957 -85713 186698 -34108 -47314 276430 60241
13298D1438J9846J7716J17575G9054b71339B55336M0987j04290a01042b2561l3573
$$ 41438 61284 79000 196575 79054 -271339 255336 296323 192033 -101042 -22561 -56134
13287e6134B82269b48560A50928a55526F480J17265D6622B0665a65325B83537
$$ -56134 282269 -248560 150928 -155526 6480 123745 46622 20665 -165325 283537
13276C19486A47819k1588J26518A09346K34390Q3490G5656O5704R5244O9912L1136
$$ 319486 147819 126231 252749 109346 343736 427226 75656 141360 236604 306516 337652
13265C37652F4675k2989b24427d5135E0552L1046J84207b1073B0544a20864E9989
$$ 337652 64675 41686 -224427 -45135 50552 81598 265805 -21073 20544 -120864 59989
13253C82665I5275m1600F376J81853G9946B2081K12940c13561A84265H8130J78515
$$ 382665 95275 53675 6376 188229 79946 22081 235021 -313561 184265 88130 266645
13242B66645d3727A03907a2728A02497L0044N24O2889k0161o2841b8823B15919
$$ 266645 -43727 103907 -12728 102497 132541 133065 195954 175793 112952 -28823 215919
13230B80202a17422A41475a67419N4494A14299O2657n7549b88157A90046m9880
$$ 280202 -117422 141475 -167419 -112925 114299 176956 119407 -288157 190046 140166
13220A40166J4564B5387A2122K13969b2542H7080e4073A00918a22636M8407A50578
$$ 140166 154730 25387 12122 226091 -22542 87080 -54073 100918 -122636 -74229 150578
13208F7900J77984e5151k7848M0998B07916H3728a4249B82569a94354B50083E9651
$$ 67900 245884 -55151 -82999 -42001 207916 83728 -14249 282569 -194354 250083 59651
13196A05638a43204a4962I5917A4962i2607a8850D87762a4977A14756P2568e8813
$$ 105638 -143204 -14962 95917 14962 -92607 -18850 487762 -14977 114756 187324 -58813
13184b3813o2753E8518L5598J59707b13857A65297L6108A8791R2111J13095q4950
$$ -23813 -86566 58518 94116 253823 -213857 165297 201405 18791 110902 223997 139047
13173A39047J37394G7651R3403a60832K5910c7347E937a35915A38262M1295A4466
$$ 139047 276441 77651 171054 -160832 -134922 -37347 5937 -135915 138262 179557 14466
13161H3763K73992G963C304M68481a34430M2567B20420C5658Q6169g0128B19635
$$ 83763 357755 7963 3304 471785 -134430 -91863 220420 35658 121827 -70128 219635
13149g8146C28441e06804A66014K14518a42550j69177A55973K3598C5533K48788
$$ -78146 328441 -506804 166014 380532 -142550 -311727 155973 179571 35533 284321
13139B84321E7428e3609l83684F3666c7707j22587A59685F9617g364A7146k266
$$ 284321 57428 -53609 -437293 63666 -37707 -160294 159685 69617 -7364 17146 14880
13128A4880J27978f9034p1201q533f8123E6985K29712G4719G186b86786d9564
$$ 14880 142858 -69034 -140235 -148768 -68123 56985 286697 74719 7186 -286786 -49564
13116A30673d58390I3300a29735N5889K3797B7658h3133A09723G411L1430a87353
$$ 130673 -458390 93300 -129735 -73846 -50049 27658 -83133 109723 7411 38841 -187353
13104a28860e8234C3460b76292j51825J96060G5810K55761d6237A05037g1120
$$ -128860 -58234 33460 -276292 -428117 -232057 75810 331571 -46237 105037 -71120
13093I3238M3786D7143J35660o4110a61627k6857A78831o1560c2239m62273A87295
$$ 93238 137024 47143 182803 118693 -161627 -188484 178831 117271 -32239 -494512 187295
13081e4120A44277R2204d5589I8825J00642C9792c81384A03681L99114b18175
$$ -54120 144277 236481 -45589 98825 199467 39792 -381384 103681 502795 -218175
13070f7769f768m2562B5956e9037B92684A33852l6347d5099n1742b435l89593
$$ -67769 -6768 -49330 25956 -59037 292684 133852 97505 -45099 -96841 -2435 -392028
13059c92028B14993n4369D125J47003Q2029d2230D1580Q3276J98209I2966J24499
$$ -392028 214993 160624 4125 151128 233157 -42230 41580 124856 323065 92966 217465
13048B17465j07202b2468p9679B52858a78028e823k87903a6776j40049A4242d48
$$ 217465 110263 -22468 -102147 252858 -178028 -5823 -293726 -16776 -156825 14242 -448
13036A63166J16029b23614A9316Q1878a25701r834B85090A15323k2434i1410c1467
$$ 163166 279195 -223614 19316 101194 -125701 -135535 285090 115323 92889 -91410 -31467
13024a87044n3836a06150j41338B12823d8453A12606C7068f5197B48636a2958
$$ -187044 -240880 -106150 -247488 212823 -48453 112606 37068 -65197 248636 -12958
13013B93050j16868J69850a21976G689J64762b6242k5462j14697H1273f2636B52479
$$ 293050 176182 346032 -121976 7689 172451 -26242 -51704 -166401 81273 -62636 252479
13001A84389m9420c67124A21889H525N5666f8632D5453c0750n7348A93991g137
$$ 184389 134969 -367124 121889 8525 64191 -68632 45453 -30750 -88098 193991 -7137
12989C05675H4428H978c0408h93A53282Q1704b1591B49138a5389l77603C31291
$$ 305675 84428 8978 -30408 -893 153282 234986 -21591 249138 -15389 -392992 331291
12977a69547B74813b61886A89306i8071K4149B76912b3786q5412k2489j51158
$$ -169547 274813 -261886 189306 -98071 -73922 276912 -23786 -109198 -131687 -282845
12967b82845C85220A81773a75047O0245A34335K8493c16901a55545D15577F3762
$$ -282845 385220 181773 -175047 -114802 134335 162828 -316901 -155545 415577 63762
12956B0530K62203k3246a13297I2449B7781J41479C8389K6953K5969K29O8923
$$ 20530 282733 259487 -113297 92449 27781 169260 38389 65342 91311 91540 160463
12945A60463g6532A46674e00266A6867K10419F0203b80936B94543a5117H7168
$$ 160463 -76532 146674 -500266 16867 227286 60203 -280936 294543 -15117 87168
12934C3209b1868B65997J41288I3298b05958C0046e17607b40412d781j40525o0249
$$ 33209 -21868 265997 407285 93298 -205958 30046 -517607 -240412 -4781 -145306 -205555
12923b05555m5866D4063a35623E7039O1363b71041c2469A19263j832d3388A06048
$$ -205555 -251421 44063 -135623 57039 118402 -271041 -32469 119263 117431 -43388 106048
12911D06678b00800B3185a02677E682b05075B21401i0072k40207B12438C2828
$$ 406678 -200800 23185 -102677 5682 -205075 221401 -90072 -330279 212438 32828
12900a23789G7977B0242J6612Q3712D0724a52551b0753G523a36818C79493H435
$$ -123789 77977 20242 36854 120566 40724 -152551 -20753 7523 -136818 379493 8435
12888a43547B51595b45158A47180a40845D8177i2062A1542a57613B1845Q1179
$$ -143547 251595 -245158 147180 -140845 48177 -92062 11542 -157613 21845 103024
12878A03024J07264a62955B7374b33967i5663l46731a9310F2009a02150b1271
$$ 103024 210288 -162955 27374 -233967 -95663 -442394 -19310 62009 -102150 -21271
12867B0937L798i9221k12005H5156K3384b84000F593J52826c65943a0986B18557
$$ 20937 24735 -99221 -311226 85156 108540 -284000 6593 159419 -365943 -10986 218557
12855D06506c77097f4240j56200N699B3230g8984B23402J76209b40736J3580f2141
$$ 406506 -377097 -64240 -220440 -214741 23230 -78984 223402 399611 -240736 -227156 -62141
12843A80303a42655f0014a0974r6416M6874r865C48112a16871A2617a14379l585
$$ 180303 -142655 -60014 -10974 -107390 -60516 -70381 348112 -116871 12617 -114379 -117964
12832a17964k5949k8959c7864j65026A51400E6802a2938B44787G1063J9525J8831
$$ -117964 -143913 -172872 -37864 -202890 151400 56802 -12938 244787 71063 90588 109419
12821A09419L5880a76614D70617k10979A11727f2259o6204C11642g103j14601
$$ 109419 145299 -176614 470617 259638 111727 -62259 -128463 311642 -7103 -121704
12811a21704e0563k42311I0832a46346A70162b25954C26610D1349M7392P2059
$$ -121704 -50563 -292874 90832 -146346 170162 -225954 326610 41349 88741 160800
12801A60800c21024A47089a79625O1189A78363a629j29872i766k70299b304E73581
$$ 160800 -321024 147089 -179625 -118436 178363 -1629 -131501 -9766 -280065 -2304 573581
12789A92942b72844H2878J00622J6111a3812j76681B48653b6587k60805o4202
$$ 192942 -272844 82878 183500 199611 -13812 -190493 248653 -26587 -287392 -351594
12779c51594a58725E2883A3644a84766K8179P1037F1034J23607q581b8958k19231
$$ -351594 -158725 52883 13644 -184766 -156587 -85550 61034 184641 176060 -28958 -248189
12768b48189D6528a56409I2712a35414a5846r8899b5157o4272r9099F6905c38571
$$ -248189 46528 -156409 92712 -135414 -15846 -114745 -25157 -89429 -188528 66905 -338571
12756a36939j30575l0223e7716p7454j8795c7269e531B8077K0176e9107j31916
$$ -136939 -267514 -297737 -57716 -135170 -153965 -37269 -5531 28077 48253 -59107 -191023
12745a91023B08211c06715E8484a08524B04054C208K42544a15505I5327a24505
$$ -191023 208211 -306715 58484 -108524 204054 3208 245752 -115505 95327 -124505
12734A04072g1518H1600b92907G8492J06779L416F340h65n9644p9640A573b84109
$$ 104072 -71518 81600 -292907 78492 185271 188687 6340 -865 -60509 -140149 1573 -284109
12721b9765k80725J23152k30045A29883E9392L44807A48953J19706c08323A735
$$ -29765 -310490 -187338 -417383 129883 59392 404199 148953 268659 -308323 1735
12710C80931F9975c31557A27165N9753C3954K27689f4560j40034D8434h8192j03514
$$ 380931 69975 -331557 127165 186918 33954 261643 -64560 -204594 48434 -88192 -191706
12699a91706A34270b05007g1110A29208o871j7844f5748k1510A00568e9218E2497
$$ -191706 134270 -205007 -71110 129208 122337 104493 -65748 -87258 100568 -59218 52497
12687a50368j5145A42320d4321k7109A56144m2120L9455a18663o2781B60564J00002
$$ -150368 -165513 142320 -44321 -71430 156144 114024 153479 -118663 -181444 260564 360566
12676C60566l9619i6908C1599b41424E799a48877j27561R2620B23339C1715N6408
$$ 360566 320947 -96908 31599 -241424 5799 -148877 -276438 -183818 223339 31715 88123
12665H8123h0573A00448a28111B05740m9128a3589A60357b48835A49888K774K48024
$$ 88123 -80573 100448 -128111 205740 156612 -13589 160357 -248835 149888 152662 400686
12654D00686F939K73965r6205o3610D3375K30107f1544m4190G6440a49194B34184
$$ 400686 6939 280904 184699 121089 43375 273482 -61544 -105734 76440 -149194 234184
12642D5101J57327o8889k6008m7185R9828p1691K652L19594j68420r0169a02450
$$ 45101 202428 133539 107531 60346 160174 88483 91135 410729 242309 152140 -102450
12630a52549A71402L6757m7310b0007A96705q4305J40805F922c5353l44651C12395
$$ -152549 171402 208159 160849 -20007 196705 112400 253205 6922 -35353 -380004 312395
12618h1230B06241O7869K7023a30423G0000E387P3539d9208A86846E3158a49272
$$ -81230 206241 274110 301133 -130423 70000 5387 78926 -49208 186846 53158 -149272
12606A06872Q4978o8256a1261B75644B1420G537L91315b06841P9942C74375a11291
$$ 106872 191850 123594 -11261 275644 21420 7537 398852 -206841 -126899 374375 -111291
12594B05808a41169D04209A82239l7302R2852A10328b84128a1053q8457j63872
$$ 205808 -141169 404209 182239 144937 237789 110328 -284128 -11053 -99510 -263382
12584b63382D9256P3076C6554m753c9372j21347H3884c80870E0668j7870a45488
$$ -263382 49256 122332 36554 31801 -39372 -160719 83884 -380870 50668 32798 -145488
12572a5891j24544C5191J34763d3722A24435D5659b09368a00219k33343f0093
$$ -15891 -140435 35191 169954 -43722 124435 45659 -209368 -100219 -333562 -60093
12561C5644b27914K7691A08439d3072K0552E8753J31060b57081a3356k37211I8982
$$ 35644 -227914 -200223 108439 -43072 -22520 58753 189813 -257081 -13356 -250567 98982
12549A25619k4243a5555p8391B15525q1552D4587J6205a4024d843B8951M1656
$$ 125619 101376 -15555 -93946 215525 133973 44587 60792 -14024 -4843 28951 70607
12538G0607O1861f0333o6448D3429b76311B70078F4598b82787B56962I2976J75014
$$ 70607 132468 -60333 -126781 43429 -276311 270078 64598 -282787 256962 92976 267990
12527B67990A08947L1969a55593C12755A0933a03118g603o0984k38945E8248k1419
$$ 267990 108947 140916 -155593 312755 10933 -103118 -7603 -68587 -307532 58248 36829
12516C6829a9338o924A21840D9796d40521g8147D6610a21769F7264Q6119o6388
$$ 36829 -19338 -26262 121840 49796 -440521 -78147 46610 -121769 67264 153383 86995
12505H6995a22242d5953C65766O5763G7152P5693J17098b7179G41196C31583n0577
$$ 86995 -122242 -45953 365766 431529 77152 152845 269943 -27179 741196 331583 281006
12494B81006q4781q563i7786K8733E045K8665b86022B5267r395h6633j44623O7152
$$ 281006 196225 187662 -97786 -69053 5045 33710 -286022 25267 15872 -86633 -231256 -164104
12482a64104F1695L07487A16563g5690B04098a14534C93400c30519B8169a26876
$$ -164104 61695 369182 116563 -75690 204098 -114534 393400 -330519 28169 -126876
12471F6614g8351G5548O8159Q2944J94354A9411J32268L82827f5392K0256q6079
$$ 66614 -78351 75548 143707 226651 421005 19411 151679 534506 -65392 -45136 -131215
12460a31215H1385i7260A59044i6243b2046k02951d216B86236a62045P0643A78582
$$ -131215 81385 -97260 159044 -96243 -22046 -224997 -4216 286236 -162045 -91402 178582
12448c21357D2765b3255l1957k66672c8869l932A64187P0354d1421o018j7207
$$ -321357 42765 -23255 -55212 -321884 -38869 -42801 164187 234541 -41421 -47439 -64646
12437f4646h784A29792c84109a4466j90883p6879F8167J45304A4708d9887E2506
$$ -64646 -8784 129792 -384109 -14466 -205349 -282228 68167 213471 14708 -49887 52506
12425B2301b28267I9738h6258j69552A5702J46246a16565N4019D1324O5863c74515
$$ 22301 -228267 99738 -86258 -255810 15702 161948 -116565 -62546 41324 107187 -374515
12413c24019a27089A50464K9607a97989j75782f4941j91114J1202A52090k8660
$$ -324019 -127089 150464 180071 -197989 -373771 -64941 -256055 -244853 152090 123430
12403A23430a0236n552B32055H6328J58370a56171F7793J57022b9064j27898B606
$$ 123430 -10236 -15788 232055 86328 244698 -156171 67793 224815 -29064 -156962 2606
12391I8999a73690A14614a84804H3711l7073O6081D5173f5164D51109A02822M5887
$$ 98999 -173690 114614 -184804 83711 46638 112719 45173 -65164 451109 102822 148709
12380A48709b93214A08653O4503p2615K6443J02633j02683Q6387a30322j5305
$$ 148709 -293214 108653 173156 100541 126984 229617 126934 213321 -130322 -145627
12370a45627d7339o1014A31270a08180D8209a81305C9471c300j39021b9131p2991
$$ -145627 -47339 -108353 131270 -108180 48209 -181305 39471 -3300 -142321 -29131 -102122
12359a02122A21692M0466Q5508e4518A39564M449a01138B0211N0198A265K28521
$$ -102122 121692 162158 247666 -54518 139564 144013 -101138 20211 70409 1265 229786
12348B29786h2280n9291j5162C88249P4023a60785A5814K4772R5528B255J6601
$$ 229786 -82280 -141571 -156733 388249 462272 -160785 15814 40586 136114 2255 18856
12337A8856P5018K63069i2159A71460l5564i4772j02459C40393G9282J20987p4649
$$ 18856 93874 356943 -92159 171460 135896 -94772 -197231 340393 79282 200269 125620
12326A25620P2665Q42M72B0902I456L08674O8071A12044J66455p0546a87561B44337
$$ 125620 198285 199127 199599 20902 9456 318130 386201 112044 278499 207953 -187561 244337
12313f62F177Q322Q8601a12598N3364j04441a2954D15962A78014H8835J17337
$$ -662 6177 14499 103100 -112598 -59234 -163675 -12954 415962 178014 88835 206172
12302B06172c9214A05981J42853a11377k23610H9125a8233F777c23732D33372
$$ 206172 -39214 105981 248834 -111377 -334987 89125 -18233 6777 -323732 433372
12291C59237j40847H4665b72304A5212c17166A23456a31219I6422K17330A07697
$$ 359237 218390 84665 -272304 15212 -317166 123456 -131219 96422 313752 107697
12280h7744r870B52761b49178H3324J61569a0077j13758e5502r198B44659D4264
$$ -87744 -97614 252761 -249178 83324 244893 -10077 -123835 -55502 -64700 244659 44264
12268A79684J00739A19043c1607k08723A9527M1111H462b27535a4925p3155B66680
$$ 179684 280423 119043 -31607 -240330 19527 60638 8462 -227535 -14925 -88080 266680
12256a88439C7000J48172E713a5975B07761c5184A87702a51272P4191B70933J8493
$$ -188439 37000 185172 5713 -15975 207761 -35184 187702 -151272 -77081 270933 289426
12245B89426c16722A24705a39039B57042p164A00393b22762B57918k0861b13343
$$ 289426 -316722 124705 -139039 257042 249878 100393 -222762 257918 237057 -213343
12234A65680a03094A78197e5130A37706A0519e2194A95933I2938J59719d7475
$$ 165680 -103094 178197 -55130 137706 10519 -52194 195933 92938 252657 -47475
12223a88885C58539n866b9355A67909L8925J1780K95567K6634k27356q8518J39980
$$ -188885 358539 352673 -29355 167909 206834 218614 514181 540815 313459 224941 364921
12212C64921J47332D1435J58299a3668A00891i1260B17938a51479B89133q4824
$$ 364921 512253 41435 199734 -13668 100891 -91260 217938 -151479 289133 204309
12202B04309D8441a70327D2623K20181K90747A50455L0663L00641j20164J73862
$$ 204309 48441 -170327 42623 262804 553551 150455 181118 481759 361595 535457
12192E35457A70927J33065k1175m074j26408J29837k0921A12670P8655M0702C9965
$$ 535457 170927 303992 282817 278743 152335 282172 261251 112670 191325 232027 39965
12180B17262p9424L43607A93365b5508B9280a79590C60900p7983j05627K3204
$$ 217262 137838 481445 193365 -25508 29280 -179590 360900 282917 177290 200494
12170B00494r3611L03064A46959J07243H2838a44867A59723a91668A32644E9031
$$ 200494 106883 409947 146959 254202 82838 -144867 159723 -191668 132644 59031
12159A28917m7623d4939B98731a01887E2894L27142i1907k06594H2987J46688
$$ 128917 81294 -44939 298731 -101887 52894 380036 -91907 -298501 82987 229675
12149B29675o8709K3323R9590J8105j19665q0176d8377b878A57597G6614a41415
$$ 229675 160966 184289 283879 301984 182319 102143 -48377 -2878 157597 76614 -141415
12137B97147j34310Q6769i6529C53902E589K25450i2010K4901C68880a09631F14140
$$ 297147 162837 249606 -96529 353902 5589 231039 -92010 -67109 368880 -109631 614140
12125D19124a02997C23384j38655J78232A2507K43708A22958J45972j27649J62062
$$ 419124 -102997 323384 184729 362961 12507 256215 122958 268930 141281 303343
12115C03343H8420J65296c453D6379a70924A07905m1553a3709L190C19353f1453
$$ 303343 88420 253716 -3453 46379 -170924 107905 66352 -13709 -10519 319353 -61453
12103e8755A17123m7250A3039K02897a30659N0905B70358D0337K31874c01591
$$ -58755 117123 69873 13039 215936 -130659 -79754 270358 40337 272211 -301591
12092H2142e347C12422A42194k2168g1967p654B55349a9854C76931A4159J02620
$$ 82142 -5347 312422 142194 120026 -71967 -79621 255349 -19854 376931 14159 116779
12081A16779f8697k93151A53360a63799j1231E0155B0054a8556j33128M5215j75553
$$ 116779 -68697 -361848 153360 -163799 -175030 50155 20054 -18556 -151684 -106469 -282022
12070b82022a11271B03094a20234b2161C7823O8047J00299d7845D51075a4360
$$ -282022 -111271 203094 -120234 -22161 37823 105870 206169 -47845 451075 -14360
12059c15794C4569R6531p691C6116n495i3945I00L26944J821H1565O8124a79735
$$ -315794 34569 131100 123409 36116 30621 -93945 900 327844 329665 81565 149689 -179735
12046A59233J4193a8726A56014a93885K3868C42687a6174k72228B51880E882a73045
$$ 159233 173426 -18726 156014 -193885 -170017 342687 -16174 -288402 251880 5882 -173045
12034A38903a74847A160L4178g2704j02515j7402A1167g9793n1020H3031a62490
$$ 138903 -174847 1160 35338 -72704 -175219 -192621 11167 -79793 -130813 83031 -162490
12022A52877K8749a43916G6286R138c50983a20170A62195a24752D300J33870i2352
$$ 152877 181626 -143916 76286 85424 -350983 -120170 162195 -124752 4300 138170 -92352
12010b15678A98370a97624h1548j23366J9904i2394C12393A4691a44602B12570
$$ -215678 198370 -197624 -81548 -204914 -185010 -92394 312393 14691 -144602 212570
11999a59246j42015i1148o2298a9554H5297b04795a0981D953K4391a73257N6365
$$ -159246 -301261 -91148 -153446 -19554 85297 -204795 -10981 4953 29344 -173257 -116892
11988a16892q3713A3780O2493O0281a39681B41556a55670C8611A4794g161B29727
$$ -116892 -200605 13780 76273 136554 -139681 241556 -155670 38611 14794 -7161 229727
11976i1813I5854J5244P9460e6127F5405b72923h8367C8934a0831G3953j124a01828
$$ -91813 95854 111098 190558 -56127 65405 -272923 -88367 38934 -10831 73953 72829 -101828
11963e568k52102B0680e9943o0930A74377C5387d7604n6877C15132a32017k63378
$$ -5568 -257670 20680 -59943 -120873 174377 35387 -47604 -104481 315132 -132017 -395395
11952c95395A5648J08182a22478Q93A30620B4714c5139D3407b95076p2723A41419
$$ -395395 15648 123830 -122478 -121585 130620 24714 -35139 43407 -295076 -367799 141419
11940A03155m2605d44779A52507b39162C14733b08199d6113A30715J04469A07374
$$ 103155 60550 -444779 152507 -239162 314733 -208199 -46113 130715 235184 107374
11929a77826d4461A16944j2588l6377M1980a56519D5858k2298c5924k65124J18160
$$ -177826 -44461 116944 104356 67979 109959 -156519 45858 23560 -35924 -301048 -182888
11918a82888A42527a28081B9091k701K39459A08226A5810O4867a40441q4014B63945
$$ -182888 142527 -128081 29091 26390 265849 108226 15810 80677 -140441 -224455 263945
11906A50893O9113a91446A95985a17774D21J070a29240A89855c5712k19285B562
$$ 150893 220006 -191446 195985 -117774 421 1491 -129240 189855 -35712 -254997 2562
11894A60467d8911l3188j42758k835R9191A15005c68887D1382J11046m2923b91886
$$ 160467 -48911 -82099 -224857 -227692 -128501 115005 -368887 41382 152428 109505 -291886
11882a36452q1650G8236N4769J14270b85714Q583Q6442i1252A9342b25533b8025
$$ -136452 -218102 78236 133005 247275 -285714 -277131 -190689 -91252 19342 -225533 -28025
11870b7731l10514D01647e69551A02667j5213l4196g6206A27454A1623k52g1241
$$ -27731 -338245 401647 -569551 102667 87454 53258 -76206 127454 11623 11371 -71241
11858a49211A17819h8811k5591A01978c61053B84276dB66519a62032B74606q0015
$$ -149211 117819 -88811 -114402 101978 -361053 284276 -4 266519 -162032 274606 194591
11847A94591a0407I7780h131k12178m0678R8000b1329F2942h7760g824l06089
$$ 194591 -10407 97780 -8131 -220309 -260987 -162987 -21329 62942 -87760 -7824 -313913
11836c13913A61672F6235B3162b50248B63440b371G162a47860L3399A68841a6809
$$ -313913 161672 66235 23162 -250248 263440 -2371 7162 -147860 -114461 168841 -16809
11824A08558M3322a02066n0818a2130l5093o7731A41090m4285b4001j52496A979
$$ 108558 151880 -102066 -152884 -12130 -47223 -114954 141090 96805 -24001 -176497 1979
11812d3098r4980M198a7557B33658a39699b7204A03331b33152G8236A3236a943
$$ -43098 -138078 -133880 -17557 233658 -139699 -27204 103331 -233152 78236 13236 -1943
11800a06597k68434A631i4625r7917D5127J6539M3642d07921i6728C9507a9390
$$ -106597 -375031 1631 -94625 -192542 45127 61666 105308 -407921 -96728 39507 -19390
11788g1473A9145J7806J84680M6358a18932I8091J81401b05726i3209L6145r5516
$$ -71473 19145 36951 221631 267989 -118932 98091 279492 -205726 -93209 -57064 -152580
11777a52580j32572a797l1811j70091A42845e8430l0540F6212M344J63175G1082
$$ -152580 -285152 -1797 -33608 -203699 142845 -58430 -88970 66212 70556 233731 71082
11765d9076l14064B3695a43305B35851h9241b2132B27116O456I4382f0989k36864
$$ -49076 -363140 23695 -143305 235851 -89241 -22132 227116 233572 94382 -60989 -297853
11754b97853J14648A33621p088F344a7518l24787D88921b568B0172O4008j180
$$ -297853 -183205 133621 126533 6344 -17518 -342305 488921 -2568 20172 84180 83000
11743H3000a46675B57735B9151D948K62946H4532L12484a63404B6537b34965a1041
$$ 83000 -146675 257735 29151 4948 267894 84532 397016 -163404 26537 -234965 -11041
11731c39513A65015h8257G2367b93203F7707h33q0805j17304E6079b7965B88540
$$ -339513 165015 -88257 72367 -293203 67707 -833 -81638 -198942 56079 -27965 288540
11719A35850a15729I3286a16252A23336f3628D2351l20J77583q5284c4080A56769
$$ 135850 -115729 93286 -116252 123336 -63628 42351 42031 219614 134330 -34080 156769
11707a14213b7782B42471c18189A91949k3262c0231q9964a1416m8080I2251J646
$$ -114213 -27782 242471 -318189 191949 168687 -30231 -120195 -11416 -59496 92251 93897
11696I3897L05608B4019a14453j1878c3473n1851n6609q486H5173m0095J18241
$$ 93897 399505 24019 -114453 -126331 -33473 -85324 -141933 -150419 85173 45078 163319
11685A63319Q8171a10825A53796A0079J5358J4512a714A03847H914c86994k3843
$$ 163319 251490 -110825 153796 10079 25437 39949 -1714 103847 8914 -386994 -410837
11674d10837K05118b2323C7994F73J2718b7885A06109b89237E7874M9715l2854
$$ -410837 -205719 -22323 37994 673 13391 -27885 106109 -289237 57874 107589 74735
11663G4735K95468G1369l68a05075B72414e294C20898j46058q5520j231a41650
$$ 74735 370203 71369 71001 -105075 272414 -5294 320898 174840 89320 88089 -141650
11651B2420d60761i7038A47332f7624o2097k03803c8168B1751a15563b5615B27630
$$ 22420 -460761 -97038 147332 -67624 -129721 -333524 -38168 21751 -115563 -25615 227630
11639B20767j04363b841B2372J00244K08451i8109K6849k36865D96077B14757
$$ 220767 116404 -2841 22372 122616 331067 -98109 -71260 -308125 496077 214757
11628b02703K2602a5096C86200h1930C04435A09961e940C2188J1009h6369D0364
$$ -202703 -180101 -15096 386200 -81930 304435 109961 -5940 32188 43197 -86369 40364
11616A64999d19481I112a15453R74j08110C2871k507J45799G5171J48927q2885
$$ 164999 -419481 9112 -115453 -114479 -222589 32871 30364 176163 75171 224098 141213
11605A41213Q0997a11886D9004d9885j19832K6260o4332F9988a2750I0970f2038
$$ 141213 222210 -111886 49004 -49885 -169717 -143457 -207789 69988 -12750 90970 -62038
11593b79074A13822e531C2673h5152A79850q5617k9973b49714I9271a87459A80322
$$ -279074 113822 -5531 32673 -85152 179850 94233 64260 -249714 99271 -187459 180322
11581A03803J99111Q8342l0902A63655G1178Q5594d51075A5378b77744d3419a3580
$$ 103803 302914 391256 360354 163655 71178 156772 -451075 15378 -277744 -43419 -13580
11569a37600A32813G841b93650a41070d3375A42533P1933a90232A87924C3200
$$ -137600 132813 7841 -293650 -141070 -43375 142533 214466 -190232 187924 33200
11558a72609B11036G4205f7492H3320i0402B0974P7705i6340A96890F3917a23696
$$ -172609 211036 74205 -67492 83320 -90402 20974 98679 -96340 196890 63917 -123696
11546B46408a76387N8034p7241A13885k8479R3500b22395A57455a77646M5708
$$ 246408 -176387 -118353 -195594 113885 85406 178906 -222395 157455 -177646 -131938
11536a31938k1076G901a10482E3741J33449D8993C034c7384D14898a17097A65289
$$ -131938 -153014 7901 -110482 53741 187190 48993 3034 -37384 414898 -117097 165289
11524B32798h4357p5397A85721i6647H0711l8639J20001K1261c63016A63075a8647
$$ 232798 -84357 -159754 185721 -96647 80711 42072 162073 183334 -363016 163075 -18647
11512C07104b85610A07840B9536m729L97496A56239Q7391R1797F4554J83547j03715
$$ 307104 -285610 107840 29536 24807 422303 156239 243630 335427 64554 248101 144386
11501A44386a20126A86979J20837a44630b0184D382Q1417M10792k39702q2895
$$ 144386 -120126 186979 307816 -144630 -20184 4382 85799 496591 256889 173994
11491A73994b41644r8889E1972K30568p6807k457a85760B842L12618Q8497N6456
$$ 173994 -241644 -340533 51972 282540 205733 203276 -185760 2842 315460 403957 460413
11480D60413B18302p7311h0199A03614M8594m8103C3986a31701Q619A72924P946
$$ 460413 218302 140991 -80199 103614 152208 104105 33986 -131701 -123082 172924 180870
11469A80870c99581C2026a46596A05796k7959K17417j6248A02698N3341M809O6801
$$ 180870 -399581 32026 -146596 105796 77837 295254 279006 102698 156039 160848 227649
11458B27649p8354K1623k2720G434N4476R0166N2236D9936a01101B6685P0168
$$ 227649 149295 170918 148198 7434 61910 152076 204312 49936 -101101 26685 96853
11447I6853B0198J05106e3200A00062a3122A4525b2433B21188P983q3194k3810
$$ 96853 20198 125304 -53200 100062 -13122 14525 -22433 221188 229171 145977 122167
11436A22167A3751a75752I765J29387j9093P247E9681J99925a71543N8353J7509
$$ 122167 13751 -175752 9765 139152 120059 127306 59681 259606 -171543 -113190 -95681
11425i5681G5124A7269a28355a1555G6958a86950E1209P526a00612M7595A98558
$$ -95681 75124 17269 -128355 -11555 76958 -186950 51209 58735 -100612 -53017 198558
11413H3519J37068a42909i55j77842G1719f6697B96875C829L5153d2600j3823
$$ 83519 220587 -142909 -955 -178797 71719 -66697 296875 3829 38982 -42600 -56423
11402e6423j88148D5341K14342a79428A09167j8570b03690K0641f8235A27429
$$ -56423 -244571 45341 259683 -179428 109167 90597 -203690 -183049 -68235 127429
11391b9987k34284G8646a31438k73152O0077B05978C4245c5798A9900c16921a36563
$$ -29987 -264271 78646 -131438 -404590 -344513 205978 34245 -35798 19900 -316921 -136563
11379D2464a01964j13815D16111B04682a08038A20732A1740R0903c90603B4754
$$ 42464 -101964 -215779 416111 204682 -108038 120732 11740 102643 -390603 24754
11368A49802J5391N1271e6281j75449h7431j22741A70642L8118p5389K1475b00546
$$ 149802 165193 216464 -56281 -231730 -87431 -210172 170642 208760 133371 154846 -200546
11356a09657l18383J24143A15275m8055a56932k81267A76804b2364A84666c40631
$$ -109657 -428040 -303897 115275 67220 -156932 -438199 176804 -22364 184666 -340631
11345B19311D6918K8730b6265k45367i6949d2593E8687J1916a94153B10120H7775
$$ 219311 46918 75648 -26265 -271632 -96949 -42593 58687 70603 -194153 210120 87775
11333i6606M6770j1004j96217a04311A6088a66387A10276a61054D8495K9132b87973
$$ -96606 -49836 -60840 -257057 -104311 16088 -166387 110276 -161054 48495 77627 -287973
11321d0839j07787p9040A58196k1590J8485E9746j6094b41560l4810C814b48257
$$ -40839 -148626 -227666 158196 136606 155091 59746 43652 -241560 -276370 3814 -248257
11309A25844K0618a40273A41820O300d4432k36543G6163d93732d5823p4063K0962
$$ 125844 146462 -140273 141820 148120 -44432 -280975 76163 -493732 -45823 -119886 -98924
11298i8924b8487A47192C8985n135b98340c8388j75740e7796K6843k91652a8814
$$ -98924 -28487 147192 38985 33850 -298340 -38388 -214128 -57796 -30953 -322605 -18814
11286b80430A63696B0147a67295A39528a20500F4447a73161p4778a2521A35396
$$ -280430 163696 20147 -167295 139528 -120500 64447 -173161 -247939 -12521 135396
11275c646B71552A15327c5545A44500e3266A16702l1708c8427A16707a26648c5604
$$ -3646 271552 115327 -35545 144500 -53266 116702 84994 -38427 116707 -126648 -35604
11263A43156e7945k9222j59127A3100a3549r5992C5272L74981e2122j31034F9905
$$ 143156 -57945 -87167 -246294 13100 -13549 -109541 35272 410253 -52122 -183156 69905
11251f5444j46422M0190A02498l6197c73128D8448a05691K9926m70170A18535
$$ -65444 -211866 -171676 102498 66301 -373128 48448 -105691 -75765 -545935 118535
11240H3028c05102J31418j52897f8288I7222g5401K3230n9329j0418A51821b08903
$$ 83028 -305102 -173684 -326581 -68288 97222 -75401 -52171 -111500 -121918 151821 -208903
11228G7588j2599J37562B3958R317i7833p6934A21439J5559f5193o5677A33554
$$ 77588 64989 202551 23958 33275 -97833 -174767 121439 136998 -65193 -130870 133554
11216g7097A02361a37025A199K7610i77F4796f4126a4301A01253a45854g0574
$$ -77097 102361 -137025 1199 28809 -977 64796 -64126 -14301 101253 -145854 -70574
11204H6497b20449g2836A66105i1511q6091C8141k735J63891h2336j7601K142
$$ 86497 -220449 -72836 166105 -91511 -177602 38141 35406 199297 -82336 -99937 -97795
11193i7795k10903q3940J15362A23895a01798j43338r510A81252g7799A7541M4419
$$ -97795 -308698 -392638 -277276 123895 -101798 -245136 -254646 181252 -77799 17541 61960
11182F1960a30943B56517e94017F8467d61695a13579n3310d3532A24396F720a44388
$$ 61960 -130943 256517 -594017 68467 -461695 -113579 -166889 -43532 124396 6720 -144388
11170a48345A09796a47520k7349j14349h6950J2420E001P4983Q6772a93382g1403
$$ -148345 109796 -147520 -174869 -289218 -86950 -74530 5001 79984 166756 -193382 -71403
11158A32010a59148G1882g9682A23108n4863K15451b03727A12628c45219a59451
$$ 132010 -159148 71882 -79682 123108 68245 283696 -203727 112628 -345219 -159451
11147B2744b68300h8841A15163c13018J43370B00706l1917h3512A13099k017b58880
$$ 22744 -268300 -88841 115163 -313018 -169648 200706 168789 -83512 113099 111082 -258880
11135B31703a41392k36059C2399d875q400k57533L3869G5645K68068b87925D3985
$$ 231703 -141392 -377451 32399 -4875 -13275 -270808 -236939 75645 343713 -287925 43985
11123B51686b07620e0325A44494M6297Q9429e1689C13312a07179R974F8460J60124
$$ 251686 -207620 -50325 144494 190791 280220 -51689 313312 -107179 -97205 68460 228584
11112B28584a19187j79743a8735A33319M2635G3655L65853a12573o2422R63O1556
$$ 228584 -119187 -298930 -18735 133319 175954 73655 439508 -112573 -174995 -174032 -112476
11101a12476A18739M9262L6631A00976b28433B67823J03986e7869D63351a41551
$$ -112476 118739 168001 204632 100976 -228433 267823 371809 -57869 463351 -141551
11090D7656L99619p0976O0447J50083B01736G160J76617J00388A19971e0314A21787
$$ 47656 447275 376299 436746 586829 201736 7160 183777 284165 119971 -50314 121787
11078C53033O9738q1493A18737J21241N0351A27933m7219J05751m7644K43803
$$ 353033 422771 341278 118737 239978 290329 127933 80714 186465 138821 382624
11068C82624J33765A84644J5120N4K24893j91443K8327J55980K01223B33309A09775
$$ 382624 516389 184644 199764 199818 424711 233268 261595 417575 618798 233309 109775
11056D00832c476B79236J01916J97384P6871k1138M5162k1528Q2818J3299J2702
$$ 400832 -3476 279236 381152 578536 655407 634269 679431 657903 740721 754020 766722
11045G66722k4984K1108J44405p8707L381j26001m7393L44462m6086j58676m1850
$$ 766722 741738 762846 907251 828544 831925 705924 658531 1002993 956907 798231 756381
11034G56381J36719q2114l30470K12567L19112j49328K24699k98172K02292l96003
$$ 756381 893100 810986 480516 693083 1012195 862867 1087566 789394 991686 595683
11024E95683K34562k1385l45398M86439r2396J04421D73622L26122J43563l20051
$$ 595683 830245 808860 463462 949901 857505 961926 473622 799744 943307 623256
11014F23256L32771m37141M63202m46643J0141L62875l18498j57665K07205J81748
$$ 623256 956027 518886 982088 535445 545586 908461 589963 432298 639503 821251
11004H21251n2419o4398j2554J04654r9480j10366K65005k53940J48970j65565
$$ 821251 768832 704434 691880 796534 697054 586688 851693 597753 746723 581158
10994E81158P2656O4879m4530M8924O8520j38655j15694Q0424k06321M75745l80714
$$ 581158 653814 718693 674163 723087 791607 652952 537258 617682 411361 887106 506392
10983E06392J11094P4279P9556q179J29084K67041O5844m02927M28979j14644
$$ 506392 617486 691765 771321 763142 892226 1159267 1225111 822184 1251163 1136519
10973A136519L35583k71934N92360k26604J24902J92110P85590J77366K29742
$$ 1136519 1472102 1200168 1792528 1565924 1690826 1882936 2668526 2845892 3075634
10964C075634m496L99136r7177K7751k66819n56606j197834K61633j50229m4793
$$ 3075634 3071138 3470274 3373097 3400848 3134029 2577423 1379589 1641222 1490993 1446200
10954A446200J3641l24297K90529j56546j57221p5002L3093j92720j93846J71257
$$ 1446200 1459841 1135544 1426073 1269527 1112306 1037304 1070397 877677 683831 855088
10944H55088l97464L77983C11119G4927N6162P7740o6597J00380d0210C65183
$$ 855088 457624 835607 311119 74927 131089 208829 142232 242612 -40210 365183
10933c7592F0168J08280m7032K69941A20381j829D125a39905O5804F3773b11482
$$ -37592 60168 168448 121416 391357 120381 118552 4125 -139905 -74101 63773 -211482
10921A19272N2525B2403a29083h279I4918a7109H2192O957a9189A81284a36666
$$ 119272 171797 22403 -129083 -8279 94918 -17109 82192 89149 -19189 181284 -136666
10909A52374b93094A40239B6427K07186h1489j24225J01449j01669j08006B40762
$$ 152374 -293094 140239 26427 233613 -81489 -205714 -104265 -205934 -313940 240762
10898b54312C7951b56961A08099H156J35072J4431f1663a2859j67594F0605a60231
$$ -254312 37951 -256961 108099 8156 143228 157659 -61663 -12859 -180453 60605 -160231
10886C0911a8210E4798i7652j47003f4933j10126F6797R5580b01916i4200j67127
$$ 30911 -18210 54798 -97652 -244655 -64933 -175059 66797 162377 -201916 -94200 -261327
10875b61327A18762b40640B04548m0987C4807K62478I1904b33592O1520B5453
$$ -261327 118762 -240640 204548 163561 34807 297285 91904 -233592 -172072 25453
10864a7382o19I7850c38072A69225a93717l3244A84582n1767F2589b16674j22972
$$ -17382 -18001 97850 -338072 169225 -193717 -226961 184582 132815 62589 -216674 -339646
10853c39646a8182E9032b3503B8209b30299D6236b73160d4567o7660r9806c6358
$$ -339646 -18182 59032 -23503 28209 -230299 46236 -273160 -44567 -112227 -212033 -36358
10841A06288J03257a35723l48072g3294L2021o3460B13389g4669A18767d1165
$$ 106288 209545 -135723 -483795 -73294 -41273 -104733 213389 -74669 118767 -41165
10830F0864P9943i7131A48562J1015Q2056G7485b1737j15017r6343D3763N6614
$$ 60864 140807 -97131 148562 159577 241633 77485 -21737 -136754 -233097 43763 100377
10819A00377P110Q0954b72693A28375J04794c57810G0669J7743L13328a10205
$$ 100377 107487 188441 -272693 128375 233169 -357810 70669 88412 401740 -110205
10808A02490L16022b32682K8145q2826E5615a21489l4653e7809r3289e7480B51794
$$ 102490 418512 -232682 -204537 -287363 55615 -121489 -156142 -57809 -151098 -57480 251794
10796B17974C0376r75a06871k6120A67198a98461h6919c7537o1917C4425b86923
$$ 217974 30376 29401 -106871 -132991 167198 -198461 -86919 -37537 -99454 34425 -286923
10784I2569c20072I6884o466O6191b5973I6720b43601C5088a57140M9503c2708
$$ 92569 -320072 96884 90418 156609 -25973 96720 -243601 35088 -157140 -107637 -32708
10772C6611c9976j50925c6706f292A74907l6644b0529n9796n4521H5822a16852
$$ 36611 -39976 -190901 -36706 -6292 174907 138263 -20529 -80325 -134846 85822 -116852
10760A60847K7025q8394a89946A18415n1712K83947K9792a43751j39830a01565
$$ 160847 187872 99478 -189946 118415 66703 350650 380442 -143751 -283581 -101565
10749i9343A49045b94980k30404a17496e4160e072o2727j28106C4359a45036N7834
$$ -99343 149045 -294980 -525384 -117496 -54160 -5072 -67799 -195905 34359 -145036 -87202
10738h7202j33081B3258G169b44662B83139b13708J06569A7082M0860k297b51065
$$ -87202 -220283 23258 7169 -244662 283139 -213708 -107139 17082 57942 55645 -251065
10726b23584i3082A9711a34420B98469g9762l05602a09898A7766R3893l9291c57161
$$ -223584 -93082 19711 -134420 298469 -79762 -385364 -109898 17766 111659 72368 -357161
10714b00258A86192D0355a78354M5068j06535A72895M901f0259B69886i0507k2564
$$ -200258 186192 40355 -178354 -133286 -239821 172895 177796 -60259 269886 -90507 -113071
10703a13071p1819a660I3411a64378K1785q6588b0071l41144J70038N4653L0915
$$ -113071 -184890 -1660 93411 -164378 -142593 -229181 -20071 -361215 -191177 -136524 -105609
10692a05609A14043a4490A30358E8912J72156B5822c76369J82236a2505l2579
$$ -105609 114043 -14490 130358 58912 231068 25822 -376369 -194133 -12505 -45084
10682d5084B27925a13013B64286a16409d2666n08055K30035Q2365B40073b70081
$$ -45084 227925 -113013 264286 -116409 -42666 -550721 -320686 -238321 240073 -270081
10671A80932f0544H9577a94596B3552b12960l5302c0866h679j195j49346L3265
$$ 180932 -60544 89577 -194596 23552 -212960 -248262 -30866 -8679 -9874 -159220 -125955
10660a25955H8470i7555l1821B57746a37695A48503A2071e1654k35411C01136
$$ -125955 88470 -97555 -129376 257746 -137695 148503 12071 -51654 -287065 301136
10649B47374a80161Q0096F3462J30567p9288a16888L4380F7642a95983j29994
$$ 247374 -180161 -100065 63462 194029 114741 -116888 -82508 67642 -195983 -325977
10639c25977a52758c3882l87941a85554j49167C3616c84801a70660c3631l09066
$$ -325977 -152758 -33882 -421823 -185554 -334721 33616 -384801 -170660 -33631 -342697
10629c42697D3119a6060k66135e5476k59339d1987j91612B10654i2871A59762
$$ -342697 43119 -16060 -282195 -55476 -314815 -41987 -233599 210654 -92871 159762
10618g8172G6900l6882k139g5032A15755J587a23962a6326k5945a2995B60674
$$ -78172 76900 40018 37879 -75032 115755 117342 -123962 -16326 -42271 -12995 260674
10606A26506a58009k52265L718B14449b03941I7374L16921C6263Q8926F82b358
$$ 126506 -158009 -410274 -406556 214449 -203941 97374 414295 36263 125189 682 -2358
10594A3872e7037l3153g549p7630C08215a6363A14612j6520a27917A22664m2233
$$ 13872 -57037 -90190 -7549 -85179 308215 -16363 114612 98092 -127917 122664 80431
10583H0431a09146F4260b22053h0863j00921j3527j34932E0047a05049p8277f8012
$$ 80431 -109146 64260 -222053 -80863 -181784 -195311 -330243 50047 -105049 -183326 -68012
10571a02458M9045G7827N1708b47558B2369a10831j80743A6914o8a2880l5677
$$ -102458 -53413 77827 129535 -247558 22369 -110831 -291574 16914 16846 -12880 -48557
10560d8557l06036C26005A08447a00910A52974C1349J50818C1428a39451G432
$$ -48557 -354593 326005 108447 -100910 152974 31349 182167 31428 -139451 7432
10549B569K43033D767a89589j43155a20032a9720H6846O7166C942c0666m6149
$$ 2569 245602 4767 -189589 -332744 -120032 -19720 86846 154012 3942 -30666 -76815
10538g6815F1273b50266a6172a003j11891o7015J4177D962a77618p0812g0263
$$ -76815 61273 -250266 -16172 -1003 -112894 -179909 -165732 4962 -177618 -248430 -70263
10526a41695I5423b5215p4428A28416D3143b35616O4110H8860g1101l6295p7929
$$ -141695 95423 -25215 -99643 128416 43143 -235616 -171506 88860 -71101 -107396 -185325
10515a85325a9593o2088o0202N9113G680b31733h922l22070h6435q7600A63708
$$ -185325 -19593 -81681 -141883 -82770 7680 -231733 -8922 -330992 -86435 -174035 163708
10503a29211B21031g6483A38723f6723j6235C33729c2804k62852f2175n7839F5613
$$ -129211 221031 -76483 138723 -66723 -82958 333729 -32804 -295656 -62175 -120014 65613
10491c10450a48334k5933j42446b3187k11755e6233j7178B44816r2101E6993a91869
$$ -310450 -148334 -174267 -316713 -23187 -234942 -56233 -73411 244816 152715 56993 -191869
10479c08400J23614G7188d289D3834K22608r1637o079J7072J42399A54841k7135
$$ -308400 -184786 77188 -4289 43834 266442 174805 168726 185798 328197 154841 127706
10468A27706J01339q2926K88916A26173E5328I932i6920i868A22471g4159D8045
$$ 127706 229045 146119 435035 126173 55328 9932 -96920 -9868 122471 -74159 48045
10456c9760A85622a79017b003A20502d7277D4496a02969d6055J6906C9724Q795
$$ -39760 185622 -179017 -2003 120502 -47277 44496 -102969 -46055 -29149 39724 48519
10445D8519b41894d7796j87050N6022C0395c21890f9986A2723J59837q5422b49120
$$ 48519 -241894 -47796 -234846 -178824 30395 -321890 -69986 12723 172560 87138 -249120
10433a49635j60548k357B4381M6017c16589K5624P2222D1247J71415c11047A56359
$$ -149635 -310183 -312540 24381 70398 -316589 -290965 -218743 41247 212662 -311047 156359
10421h4189k12125B09824a52943K9705k5584A66723e4153j9739m9028G0507c76747
$$ -84189 -296314 209824 -152943 -123238 -148822 166723 -54153 -73892 -122920 70507 -376747
10409B5382g6629F1947a96378C5505b90365R9033Q9483B09988g8327j16337A11436
$$ 25382 -76629 61947 -196378 35505 -290365 -191332 -101849 209988 -78327 -194664 111436
10397b27534m1536f2518A20249a36370a066o5216A05282c31567C75906A67486
$$ -227534 -269070 -62518 120249 -136370 -1066 -66282 105282 -331567 375906 167486
10386B2399L44145e1947l4126B90844e8006B74149A19548i8459I9738o296R1139
$$ 22399 366544 -51947 -86073 290844 -58006 274149 119548 -98459 99738 93442 184581
10375A84581l2516M2697n201K62646j52445I8306A7775Q9008M6650G102M08939
$$ 184581 152065 194762 189561 452207 299762 98306 17775 106783 153433 7102 416041
10364D16041P1757A17453M88568k76448K17043m1464j64759A62232J4190J9644
$$ 416041 487798 117453 606021 329573 546616 505152 340393 162232 176422 196066
10354A96066O1858a15712d7620C21272A21123N8353K34963K10208k64707M48537
$$ 196066 257924 -115712 -47620 321272 121123 179476 414439 624647 359940 808477
10344H08477j07362C44729A19829Q343K9241K44057j95069L9088j12763F896d1222
$$ 808477 701115 344729 119829 128172 157413 401470 206401 245489 132726 6896 -41222
10332B24109n8545m4454K11228i566j39948B90381h4378C58407h0677B90584b43604
$$ 224109 165564 121110 332338 -9566 -149514 290381 -84378 358407 -80677 290584 -243604
10320i8644B80943H0855K02552j34901A2871K01394l8261n487b523l2367A48526
$$ -98644 280943 80855 283407 148506 12871 214265 176004 170517 -2523 -34890 148526
10308a14797j47241B27998m9735a10468A65469a24030N8381j8411I0850c56617
$$ -114797 -262038 227998 178263 -110468 165469 -124030 -65649 -84060 90850 -356617
10297C642a9248j6055A72448f1334J5878j03405H1273e3770a5000I9701R3186
$$ 3642 -19248 -35303 172448 -61334 -45456 -148861 81273 -53770 -15000 99701 192887
10286A92887p3355b76568J5590A23263a61122a2743j83014F3297b62178i8749
$$ 192887 119532 -276568 -260978 123263 -161122 -12743 -195757 63297 -262178 -98749
10275d293j71016B60803b7973A93684a53380A20132b40755f7691p4748d2660q7867
$$ -4293 -175309 260803 -27973 193684 -153380 120132 -240755 -67691 -142439 -42660 -130527
10264a30527A40158d64789g7707F3392d065B71792E588J28385m6697b40995B31245
$$ -130527 140158 -464789 -77707 63392 -4065 271792 5588 133973 87276 -240995 231245
10252b017o7398D39314A51461b12035D7316C944J46461D5120Q9397J9407J97903
$$ -2017 -69415 439314 151461 -212035 47316 3944 150405 45120 134517 153924 351827
10241C51827a08972j88305f199l02062H2193K7752d4980A91484a88977P2411A79069
$$ 351827 -108972 -297277 -6199 -308261 82193 109945 -44980 191484 -188977 -116566 179069
10229A72717a83808h6187A21100a31216k45062A25169a44777B8317F251b72547
$$ 172717 -183808 -86187 121100 -131216 -376278 125169 -144777 28317 6251 -272547
10218B7850h3670j48767A34652a29320H3145f18787B04545f5241b0434A72745
$$ 27850 -83670 -232437 134652 -129320 83145 -618787 204545 -65241 -20434 172745
10207h5412k8625j40264C26377m2664H2273Q7774b96285a10484b2117k56982A26032
$$ -85412 -114037 -254301 326377 283713 82273 170047 -296285 -110484 -22117 -279099 126032
10195c4856n3942j58675N4860H2822a06333a1424k96349K5193d9446h051A98528
$$ -34856 -88798 -247473 -192613 82822 -106333 -11424 -307773 -282580 -49446 -8051 198528
10183G5876c2467j22234N1655b02j79160O0950A38254b45813f3403m9663B8588
$$ 75876 -32467 -154701 -103046 -202 -179362 -118412 138254 -245813 -63403 -113066 28588
10171a66593G1458j6014a56320A72255a24779G2726J1712b4682n3908n0391l3499
$$ -166593 71458 55444 -156320 172255 -124779 72726 84438 -24682 -78590 -128981 -162480
10160a62480f7828j43580a00596B60014f28974a68604G1471a03287n6220k14897
$$ -162480 -67828 -211408 -100596 260014 -628974 -168604 71471 -103287 -159507 -374404
10150c74404a30394c5751G8079o842i5317q355A06168l3519d1942c714k73876
$$ -374404 -130394 -35751 78079 71237 -95317 -103672 106168 72649 -41942 -3714 -277590
10139b77590i8514L9299H4753C4379a28049a7778j75506c8239F8560a03512n3319
$$ -277590 -98514 -59215 84753 34379 -128049 -17778 -193284 -38239 68560 -103512 -156831
10128a56831P7102J1350p4387B34656A2003Q0825i9622A19969i658j62254B19432
$$ -156831 -79729 -68379 -142766 234656 12003 92828 -99622 119969 -9658 -171912 219432
10116c79843f0148C5776a41278j33260J14008O062d2627k31449H1194P7454b4589
$$ -379843 -60148 35776 -141278 -274538 -160530 -154468 -42627 -274076 81194 158648 -24589
10104b00256A09870d0244D9135c48170b548p8324A59371e1849K0686F3229R2267
$$ -200256 109870 -40244 49135 -348170 -2548 -80872 159371 -51849 -31163 63229 155496
10093A55496c98923A05779a08645I6084d3791A15172e4848A60409g0694k01430
$$ 155496 -398923 105779 -108645 96084 -43791 115172 -54848 160409 -70694 -272124
10083b72124b3099k09176h8017c7830D6000a45577o417K2880C79437i5072E5239
$$ -272124 -23099 -232275 -88017 -37830 46000 -145577 -151994 -129114 379437 -95072 55239
10071b97730J06633D5803a11868a1994k59947J08988L7701C3757M1494A7658M8699
$$ -297730 -191097 45803 -111868 -11994 -271941 -162953 -125252 33757 75251 17658 66357
10060F6357a35774k9006I986a01635k9084C16545i8018l3431k73592a88047E1404
$$ 66357 -135774 -164780 9986 -101635 -130719 316545 -98018 -131449 -405041 -188047 51404
10048b01618P1894d1363q7881B7641J42841f6869f734j57180b3386B877L399e0242
$$ -201618 -129724 -41363 -129244 27641 170482 -66869 -6734 -163914 -23386 2877 6276 -50242
10035A12739l8094C2952a98017p3682A26416a26595k3075O9510B55111a97659
$$ 112739 74645 32952 -198017 -271699 126416 -126595 -149670 -80160 255111 -197659
10024a65734b7867Q214C4264c32633I2110a61870E4432b93168a7785j87410F1863
$$ -165734 -27867 -19653 34264 -332633 92110 -161870 54432 -293168 -17785 -205195 61863
10012b15942k63987A77061E7869a43959r9615f387m35192a53744e7939B83150
$$ -215942 -479929 177061 57869 -143959 -243574 -6387 -441579 -153744 -57939 283150
10001a57986q5132j12330a21283m0234n8814N5690k8715j00845Q8663p9502g6732
$$ -157986 -243118 -355448 -121283 -161517 -220331 -164641 -193356 -294201 -205538 -285040 -76732
9989c7894O885B46547n4392A9690J08383J4647a46796b3726k14210k5347G5632
$$ -37894 -31009 246547 192155 19690 128073 142720 -146796 -23726 -237936 -263283 75632
9977A36648H175P1897b47512A16437a92206A14512a29464f3201L183D828b8329
$$ 136648 8175 80072 -247512 116437 -192206 114512 -129464 -63201 -60018 4828 -28329
9965a67989g3272l02783b9879J2474E0135a50800d8088l87410a31474G8777b47302
$$ -167989 -73272 -376055 -29879 -17405 50135 -150800 -48088 -435498 -131474 78777 -247302
9953a46808B2932H680J7971J48072A1865K88525H5730B7314c42637a44364A41546
$$ -146808 22932 8680 26651 174723 11865 300390 85730 27314 -342637 -144364 141546
9941A14851a40779C6038a38554E79058d838A33415c8823C9651l05a84194K978
$$ 114851 -140779 36038 -138554 579058 -4838 133415 -38823 39651 39346 -184194 -181216
9930a81216N1478B0745c7497C4554a49051d0196k3071C2955J5577a02938d8466
$$ -181216 -129738 20745 -37497 34554 -149051 -40196 -63267 32955 48532 -102938 -48466
9918h4604k09640h759j48093I6012g8135b404o2265l1372c2474k974k16471J24431
$$ -84604 -294244 -8759 -156852 96012 -78135 -2404 -64669 -96041 -32474 -35448 -251919 -127488
9906a27488H3111h9315K6379b1045j10590j3138b5896n9458B26043E3424C112
$$ -127488 83111 -89315 -62936 -21045 -131635 -144773 -25896 -85354 226043 53424 3112
9894H2614b30276J06599q9080c930B08458a12997L7417B9713L84464I2730g6671
$$ 82614 -230276 -123677 -212757 -3930 208458 -112997 -75580 29713 414177 92730 -76671
9882i6275A36848N3611p1388P8500b85507B39612a96739L0815B6531b86977J09693
$$ -96275 136848 190459 119071 197571 -285507 239612 -196739 -165924 26531 -286977 -177284
9871a77284e649j81979e3670F4903a25646j26263I2042b12946j999I5967b8446
$$ -177284 -5649 -187628 -53670 64903 -125646 -251909 92042 -212946 -214945 95967 -28446
9859D330K42972A16219c9507j76737N7753B7127b52587A39180C9748d09643A0051
$$ 4330 247302 116219 -39507 -216244 -158491 27127 -252587 139180 39748 -409643 10051
9847C15713b75808E3659c32180E77a43621K8245L7943q028j1631k1179o5692A31642
$$ 315713 -275808 53659 -332180 577 -143621 -115376 -77433 -85461 -97092 -118271 -183963 131642
9834H4206l871K102b36443a03021j87564A17522h4452m0763j4574K7544d1711
$$ 84206 80335 82437 -236443 -103021 -290585 117522 -84452 -125215 -139789 -112245 -41711
9822b26048F7775i0339j73558c3698j09595R403j84295E5208h5183D8749c2899
$$ -226048 67775 -90339 -263897 -33698 -143293 -133890 -318185 55208 -85183 48749 -32899
9810c29352G338J2089c8185j28450A43790J4467h868I7746i3466A58642a64505
$$ -329352 7338 19427 -38185 -166635 143790 158257 -8868 97746 -93466 158642 -164505
9798d1648o5540K0168A47765c76721l2619B39208B8685c6593G6006a71411e4469
$$ -41648 -107188 -87020 147765 -376721 -409340 239208 28685 -36593 76006 -171411 -54469
9786a62812j31d4701k05491L7997A214a77681j47623C6315F915b62402E5117a09947
$$ -162812 -162943 -44701 -250192 -212195 1214 -177681 -325304 36315 6915 -262402 55117 -109947
9773E4841a43707M2733C4529J55590a41194F9670i0696j09547f6090j81030J16080
$$ 54841 -143707 -100974 34529 190119 -141194 69670 -90696 -200243 -66090 -247120 -131040
9762a31040I3677J10447f1451k59832a50305m8857H3268b99745j93582a75803
$$ -131040 93677 204124 -61451 -321283 -150305 -199162 83268 -299745 -493327 -175803
9751b31122d549l91680J08122A26405J07146D4940e9512b0535B17190d15255J69055
$$ -231122 -4549 -396229 -288107 126405 233551 44940 -59512 -20535 217190 -415255 -246200
9740b46200A26600K1717D8847B4251O6515k4060b20839N1837O2921A24257P9962
$$ -246200 126600 148317 48847 24251 90766 66706 -220839 -169002 -106081 124257 204219
9729B04219G3137J42349b47497A54587f0761C30262g257k7539k90572d7620l30452
$$ 204219 73137 215486 -247497 154587 -60761 330262 -7257 -34796 -325368 -47620 -378072
9718c78072h5350a7518f707j67903O3457A05284i8098B77837b4325l14406o8902
$$ -378072 -85350 -17518 -6707 -174610 -111153 105284 -98098 277837 -24325 -338731 -407633
9707d07633i5094F5202e6713l1353j52281h2686k457j16367A57131i215k73748
$$ -407633 -95094 65202 -56713 -88066 -240347 -82686 -85143 -201510 157131 -9215 -282963
9696b82963m218A46893a06604a2768B2974L9842a40723k33071a81828c4900l1113
$$ -282963 -287181 146893 -106604 -12768 22974 62816 -140723 -373794 -181828 -34900 -66013
9685f6013F0154b21180j74821a97048f4199C1161g7143l85251F0011b88632B80850
$$ -66013 60154 -221180 -396001 -197048 -64199 31161 -77143 -462394 60011 -288632 280850
9673C327L02828A24554b20123O717O5122k11481a67394f52n150j96034A47121
$$ 3327 306155 124554 -220123 -213406 -148284 -359765 -167394 -652 -5802 -201836 147121
9661a10694F878b92897A09008E0197a59661A13061a85109A46966i877j78947A08013
$$ -110694 6878 -292897 109008 50197 -159661 113061 -185109 146966 -9877 -188824 108013
9649g1847C9857g3818J1474A63960C356a47424j58322H8637a19182G8585a00485
$$ -71847 39857 -73818 -62344 163960 3356 -147424 -305746 88637 -119182 78585 -100485
9637b60551B8793J02936b00363d3830d093A24820f4821I8325b70400a26952C5239
$$ -260551 28793 131729 -200363 -43830 -4093 124820 -64821 98325 -270400 -126952 35239
9625c5146k99509A77704a89299A05536a01636n1705C32469E096i8798b2253C3086
$$ -35146 -334655 177704 -189299 105536 -101636 -153341 332469 5096 -98798 -22253 33086
9613e97281B1891c33138J47503F6136a14452g95l35294B8093J0870a32280m0365
$$ -597281 21891 -333138 -185635 66136 -114452 -795 -336089 28093 38963 -132280 -172645
9602a72645G0702b07912L3328A69515d52818F193b87252a2812r763A95251a19229
$$ -172645 70702 -207912 -174584 169515 -452818 6193 -287252 -12812 -22575 195251 -119229
9590a54607D2727K4948i5612k23195H5594a15705j2217n3460g0975O101k16522
$$ -154607 42727 67675 -95612 -318807 85594 -115705 -127922 -181382 -70975 -64874 -281396
9579b81396j43948f9391k23507j21451A40000e7316J693l4879D9533a56864c7873
$$ -281396 -425344 -69391 -292898 -414349 140000 -57316 -55623 -90502 49533 -156864 -37873
9567a60561g0340j15799A19718a08083A28337e3446p5453d5740E4166a07493B7410
$$ -160561 -70340 -186139 119718 -108083 128337 -53446 -128899 -45740 54166 -107493 27410
9555a8595q6582j6591M4328A55630a35445C5316b68495m3922D5097r483h0038
$$ -18595 -105177 -121768 -77440 155630 -135445 35316 -268495 -312417 45097 35614 -80038
9543a15284M9772l4709j95972B65103g3513I9579D2433b40617B2166a85981J6665
$$ -115284 -65512 -100221 -296193 265103 -73513 99579 42433 -240617 22166 -185981 -169316
9532a69316k52885I7693b58510J07289L5736E8594c43026c4313C7539L4665a11037
$$ -169316 -422201 97693 -258510 -151221 -115485 58594 -343026 -34313 37539 72204 -111037
9520D9119A1704b7195l83006A26370d2992m237O585j96667B14736i4734B045R3099
$$ 49119 11704 -27195 -410201 126370 -42992 -47229 -40644 -237311 214736 -94734 2045 95144
9508I5144k314N9969a73436Q0773A42318N9509i2855M4082j19458B33192b55242
$$ 95144 92830 152799 -173436 -92663 142318 201827 -92855 -48773 -168231 233192 -255242
9496h6312k15827e5717k00284h7525K852p2709J7584A40180C4395l628K30029
$$ -86312 -302139 -55717 -256001 -87525 -84673 -157382 -139798 140180 34395 30767 260796
9485B60796a7494j93793F1172K0898L3612E5722h4948a2488l14778B5242L234
$$ 260796 -17494 -211287 61172 82070 115682 55722 -84948 -12488 -327266 25242 28476
9474B8476J53238b09255p5880d7198j19853j46429J30933E5382N9725b6322F8941
$$ 28476 181714 -209255 -285135 -47198 -167051 -313480 -182547 55382 115107 -26322 68941
9462I3541d9446j31130K9519L6806j71018h1024A56357G668f5862A63177a12701
$$ 93541 -49446 -180576 -151057 -114251 -285269 -81024 156357 7668 -65862 163177 -112701
9450b40297A80453d2671k6765m0936j12484J11337B404b03271A8265P1200a89657
$$ -240297 180453 -42671 -69436 -110372 -222856 -111519 2404 -203271 18265 89465 -189657
9438B38915a92879A78599D6958b05670A82442o2184c7942A8460a77562P555n7848
$$ 238915 -192879 178599 46958 -205670 182442 120258 -37942 18460 -177562 -170007 -227855
9427b27855g2499l279A4677O1539c07528h0286H3741a45212C40614A38061b92921
$$ -227855 -72499 -75778 14677 76216 -307528 -80286 83741 -145212 340614 138061 -292921
9415a56111m1695R438e3728j75584A2494N1869J03138e3317B03364d8364F7327
$$ -156111 -197806 -188368 -53728 -229312 12494 64363 167501 -53317 203364 -48364 67327
9403E0170h9667l52015K14727e6906j80626B30903a16837j78762P4576L6869C0869
$$ 50170 -89667 -441682 -226955 -56906 -237532 230903 -116837 -295599 -221023 -184154 30869
9391I923h3662B93954a37509B09562I3857b41785L8104Q8567K8506E3071f3588
$$ 9923 -83662 293954 -137509 209562 93857 -241785 -203681 -115114 -86608 53071 -63588
9379b18824A11224b18031A47298a60505j26539L5090C66354a11238j17763O4125
$$ -218824 111224 -218031 147298 -160505 -287044 -251954 366354 -111238 -229001 -164876
9369a64876A56086F3048B3220a47002k83262C7861N1715c27704B67404b48878
$$ -164876 156086 63048 23220 -147002 -430264 37861 89576 -327704 267404 -248878
9358c04770K0401D60593D015b43605d0249B20476a00975j48421F7734g4924l2180
$$ -304770 -284369 460593 4015 -243605 -40249 220476 -100975 -249396 67734 -74924 -107104
9347a07104p3203K9329J2996j95823L5151k13832I8183C2958f2360A10597C972
$$ -107104 -180307 -150978 -137982 -333805 -298654 -512486 98183 32958 -62360 110597 3972
9335a11130d539l38855g2452A88787a15089j54515Q9272A85076L126h3454D84914
$$ -111130 -4539 -343394 -72452 188787 -115089 -269604 -180332 185076 188202 -83454 484914
9323B5880c08533L1048C1885I731b608j12780A837L89a70754j29668J24712f2191
$$ 25880 -308533 -277485 31885 9731 -2608 -115388 1837 2226 -170754 -300422 -175710 -62191
9310h2763j00096I6614C5659L309a76185P9164J3043N335j02901A60620l8059
$$ -82763 -182859 96614 35659 38968 -176185 -97021 -83978 -78643 -181544 160620 122561
9299A22561b35120r1136n061i6520E1369J01484a81972k2966C9548a20410N4860
$$ 122561 -235120 -326256 -331317 -96520 51369 152853 -181972 -204938 39548 -120410 -65550
9288f5550m4349H5538a03761k5857n7656e7185j08408d2022B28152c43096r936
$$ -65550 -109899 85538 -103761 -129618 -187274 -57185 -165593 -42022 228152 -343096 -353032
9277c53032e6128H0970A7135a32041k5636B27848b56459A36121b39737B0899C654
$$ -353032 -56128 80970 17135 -132041 -157677 227848 -256459 136121 -239737 20899 3654
9265A68320c972k61654o3248d2167l38328J46905I3070b0694m2347A40633B1367
$$ 168320 -3972 -265626 -328874 -42167 -380495 -233590 93070 -20694 -63041 140633 21367
9253c01726A53268a66947k1417N6631F0816b65071k35414A66533d6980j8699G814
$$ -301726 153268 -166947 -188364 -131733 60816 -265071 -500485 166533 -46980 -65679 7814
9241h8257p5814j21563f7391f823o3977F0240b74364g9369j36539A52029R8883
$$ -88257 -164071 -285634 -67391 -6823 -70800 60240 -274364 -79369 -215908 152029 250912
9230B50912b40972a01910k76627J12594A71002i0597A43076c04372I6467a28601
$$ 250912 -240972 -101910 -378537 -265943 171002 -90597 143076 -304372 96467 -128601
9219A18382D9259b49484J17041c5398a0749A08629f7436m0504b5735A03124h9744
$$ 118382 49259 -249484 -132443 -35398 -10749 108629 -67436 -107940 -25735 103124 -89744
9207D0947K37377L6962c4879A20121C3416K36198F2877c30290J23177O1165A513
$$ 40947 278324 315286 -34879 120121 33416 269614 62877 -330290 -207113 -145948 1513
9195C76814F7268J20120G0550b13050A3104K40658b68732J0628g7515e356E4593
$$ 376814 67268 187388 70550 -213050 13104 253762 -268732 -258104 -77515 -5356 54593
9183a27383A12818b52457K3635J2867o6089c2653j79599I8324g2686A155a01178
$$ -127383 112818 -252457 -228822 -215955 -282044 -32653 -212252 98324 -72686 1155 -101178
9171A57642d5113j77919I6862e43247c856k07819b6524l19260J67145A56849b08906
$$ 157642 -45113 -223032 96862 -543247 -3856 -211675 -26524 -345784 -178639 156849 -208906
9159h0668M437l8834j12512D355b61695J17901A02356b39190J14996j2702O0216
$$ -80668 -76231 -115065 -227577 4355 -261695 -143794 102356 -239190 -124194 -136896 -76680
9148g6680j23523F0166d8287A05663a4066B56878a60321g3850E6884e0206o716
$$ -76680 -200203 60166 -48287 105663 -14066 256878 -160321 -73850 56884 -50206 -56922
9137e6922A75931F5622i9199A70581D2859N0167b10240E0601a7893k15371a07508
$$ -56922 175931 65622 -99199 170581 42859 93026 -210240 50601 -17893 -233264 -107508
9125A93986F6688a62406A60983J7986o8166A030R5401N1239J09037a79747R448
$$ 193986 66688 -162406 160983 178969 110803 1030 96431 147670 256707 -179747 -170299
9114a70299b3160q5009k50729E1735d3825b100B5559G557a14981k5887j29914
$$ -170299 -23160 -108169 -358898 51735 -43825 -2100 25559 7557 -114981 -140868 -270782
9103b70782A85624b0469j9035m54455a09774k84799I709g608k02975P9145e5051
$$ -270782 185624 -20469 -39504 -493959 -109774 -394573 9709 -7608 -210583 -131438 -55051
9091B13329b47866a04572n5640O8252K1054j02614J3911A52917a30327K0465r1291
$$ 213329 -247866 -104572 -160212 -91960 -70906 -173520 -159609 152917 -130327 -109862 -201153
9080b01153j1750A9450L4316a9514j06508A94897d59755A17521a14698E0448q661
$$ -201153 -212903 19450 53766 -19514 -126022 194897 -459755 117521 -114698 50448 41787
9069D1787J83455e4959m2825B1779c99468B70964A17897b61505h5628K2278K6679
$$ 41787 225242 -54959 -97784 21779 -399468 270964 117897 -261505 -85628 -63350 -36671
9058c6671m05542h0827R509k087o4137p9238A82482b66039c0079k9727l79244
$$ -36671 -442213 -80827 -71318 -73405 -137542 -216780 182482 -266039 -30079 -59806 -439050
9047d39050J95138A11811b5775B87201b83441e1235A65557o4511a46521p3771
$$ -439050 -243912 111811 -25775 287201 -283441 -51235 165557 101046 -146521 -220292
9037b20292C48052c15061c9309D7202c5129I4734c34846A16451a58457K582m1246
$$ -220292 348052 -315061 -39309 47202 -35129 94734 -334846 116451 -158457 -155875 -197121
9026a97121A587c5362l31849A22068b79178A35000d53099F9821c05760i9114E135
$$ -197121 1587 -35362 -367211 122068 -279178 135000 -453099 69821 -305760 -99114 5135
9014h1039k07985A34428b6186o9788j05718A77227p8199L13418H1187c97218B93497
$$ -81039 -289024 134428 -26186 -95974 -201692 177227 99028 412446 81187 -397218 293497
9002C7088J39530c40832D3557K6200b6228k12840F2152a78616j7858A78283f7914
$$ 37088 176618 -340832 43557 69757 -26228 -239068 62152 -178616 -196474 178283 -67914
8990A78256a12164d1826k04422b4591j70834L2831I9565A0760J65672b08324N4325
$$ 178256 -112164 -41826 -246248 -24591 -195425 -162594 99565 10760 176432 -208324 -153999
8979a53999j8820A54308f4123j65035A29057B4886m571L35364G8535K65552d6863
$$ -153999 -172819 154308 -64123 -229158 129057 24886 20315 355679 78535 344087 -46863
8967D6556J36841b49566h8100k71247A84195d15381a85048B02327a28958A76841
$$ 46556 183397 -249566 -88100 -359347 184195 -415381 -185048 202327 -128958 176841
8956E5108A3118b47382A49876h3918j72718b0973j41976C23975c29280A87360
$$ 55108 13118 -247382 149876 -83918 -256636 -20973 -162949 323975 -329280 187360
8945a25791K6928r0932k0408d5212I259K7332a31493d4122k77518J01011l1322
$$ -125791 -98863 -189795 -210203 -45212 9259 36591 -131493 -44122 -321640 -220629 -251951
8934b51951p7317A68139L4208b2130k76667F3345a92095A97171d70788J61533
$$ -251951 -329268 168139 202347 -22130 -298797 63345 -192095 197171 -470788 -309255
8924c09255J49930P113F7714a73675A55129K70810J963288J387177H86014C42905
$$ -309255 -159325 -152212 67714 -173675 155129 425939 2389227 3776404 886014 342905
8913B2619Q7154k4068K33005A0636Q5873M7072j0449J9487c37750B46248h3259
$$ 22619 109773 85705 318710 10636 96509 143581 133132 152619 -337750 246248 -83259
8901G7720b40210J16397d8453C40204E4364h7091k8830K816A89149i3545k5708
$$ 77720 -240210 -123813 -48453 340204 54364 -87091 -115921 -113105 189149 -93545 -119253
8890a19253A70869p5173a75149E9868k7749J13464b61236h6531B6854g7727A2261
$$ -119253 170869 95696 -175149 59868 32119 145583 -261236 -86531 26854 -77727 12261
8878a03007M4890A0134e4703B11200a90296B1712a27681A26501a04475C2098a59234
$$ -103007 -58117 10134 -54703 211200 -190296 21712 -127681 126501 -104475 32098 -159234
8866c8011l6084C2015O9317D4589K22324n6248A8704i1942C9121c34727E9156
$$ -38011 -74095 32015 101332 44589 266913 210665 18704 -91942 39121 -334727 59156
8854b71254A80224a70375G859J15638a05957q8217L8525B34749n0713e0249D6228
$$ -271254 180224 -170375 7859 123497 -105957 -194174 -155649 234749 184036 -50249 46228
$$ [...]
##END NTUPLES=NMR SPECTRUM
##END=
