##TITLE=NES1013_LH_9233048_mQcQn3gpvg
##JCAMPDX= 6.0         $$ Bruker NMR JCAMP-DX V2.0
##DATA TYPE= NMR SPECTRUM
##DATA CLASS= NTUPLES
##ORIGIN= BRUKER
##OWNER= Administrator
$$ 1.72 TOPSPIN		Version 2.1
$$ 2015-08-24 20:03:42.373 -0700  Administrator@X
$$ Compression mode = diff/dup
##.OBSERVE FREQUENCY= 400.02188249412
##.OBSERVE NUCLEUS= ^1H
##.ACQUISITION MODE= SIMULTANEOUS (DQD)
##.ACQUISITION SCHEME= undefined
##.AVERAGES= 64
##.DIGITISER RES= 22
##SPECTROMETER/DATA SYSTEM= spect
##.PULSE SEQUENCE= noesygpps1d.comp
##.SOLVENT NAME= COFFEE_meoh
##.SHIFT REFERENCE= INTERNAL, COFFEE_meoh, 1, 14.96346
##AUDIT TRAIL= $$ (NUMBER, WHEN, WHO, WHERE, PROCESS, VERSION, WHAT)
$$ ##TITLE= Audit trail, TOPSPIN		Version 2.1
$$ ##JCAMPDX= 5.01
$$ ##ORIGIN= Bruker BioSpin GmbH
$$ ##OWNER= Administrator
$$ $$ E:\/data/COFFEE/nmr/NES1013_LH_9233048_mQcQn3gpvg/22/pdata/1/auditp.txt
$$ ##AUDIT TRAIL=  $$ (NUMBER, WHEN, WHO, WHERE, PROCESS, VERSION, WHAT)
(   1,<2015-08-24 20:03:36.655 -0700>,<Administrator>,<X>,<go>,<TOPSPIN 2.1>,
      <created by zg
	started at 2015-08-24 19:52:06.639 -0700,
	POWCHK enabled, PULCHK disabled,
       configuration hash MD5:
       21 0F 79 D6 B3 7B B4 F6 88 20 88 DB 03 48 BD 9F
       data hash MD5: 64K
       43 FE 0B CE A5 AC B2 D5 F8 E2 0D 23 6F E9 8F 8C>)
(   2,<2015-08-24 20:03:40.155 -0700>,<Administrator>,<X>,<proc1d>,<TOPSPIN 2.1>,
      <Start of raw data processing
       efp LB = 0.3 FT_mod = 6 PKNL = 1 PHC0 = 0 PHC1 = 0 SI = 128K 
       data hash MD5: 128K
       2F 04 36 3D 0B C2 5F 2B A0 9A 1B E5 F7 B4 DD B3>)
(   3,<2015-08-24 20:03:41.045 -0700>,<Administrator>,<X>,<proc1d>,<TOPSPIN 2.1>,
      <pk PHC0 = -87.65442 PHC1 = 0 
       data hash MD5: 128K
       1D 92 9A 51 0F 22 34 C2 F5 EB 2D 1A F9 69 80 89>)
(   4,<2015-08-24 20:03:41.483 -0700>,<Administrator>,<X>,<proc1d>,<TOPSPIN 2.1>,
      <abs ABSG = 1 
       data hash MD5: 128K
       08 96 BC 90 DB 1C FB 50 B0 D3 CF F7 B1 F3 A6 D6>)
(   5,<2015-08-24 20:03:41.592 -0700>,<Administrator>,<X>,<proc1d>,<TOPSPIN 2.1>,
      <abs ABSG = 2 
       data hash MD5: 128K
       08 82 8F 7A BC F7 27 3D 13 C5 17 0E D9 94 98 A8>)
(   6,<2015-08-24 20:03:41.686 -0700>,<Administrator>,<X>,<proc1d>,<TOPSPIN 2.1>,
      <abs ABSG = 3 
       data hash MD5: 128K
       B5 17 12 D8 DB 53 B8 B4 57 44 D5 83 90 30 EF 14>)
(   7,<2015-08-24 20:03:41.795 -0700>,<Administrator>,<X>,<proc1d>,<TOPSPIN 2.1>,
      <abs ABSG = 4 
       data hash MD5: 128K
       AC 40 8F 41 7C 43 9A 38 41 A3 1C 99 43 8C 5B E9>)
(   8,<2015-08-24 20:03:41.920 -0700>,<Administrator>,<X>,<proc1d>,<TOPSPIN 2.1>,
      <abs ABSG = 5 
       data hash MD5: 128K
       5F 03 03 A2 26 F5 26 EA D2 30 3A CE AF A4 F6 07>)
$$ ##END=
$$ 
$$ $$ hash MD5
$$ $$ 0B 18 9D 81 4E 97 4D C6 02 4D 69 70 87 49 E0 CB
##$RELAX= 
##$RELAX= 
##$RELAX= 
##$RELAX= 
##$RELAX= 
##$RELAX= 
##$RELAX= 
##$RELAX= 
$$ Bruker specific parameters
$$ --------------------------
##$DU= <E:\>
##$EXPNO= 22
$$ [...]
##$TP07= 0
##$TPNAME0= <>
##$TPNAME1= <>
##$TPNAME2= <>
##$TPNAME3= <>
##$TPNAME4= <>
##$TPNAME5= <>
##$TPNAME6= <>
##$TPNAME7= <>
##$TPOAL= (0..7)
0.5 0.5 0.5 0.5 0.5 0.5 0.5 0.5
##$TPOFFS= (0..7)
0 0 0 0 0 0 0 0
##$TUNHIN= 0
##$TUNHOUT= 0
##$TUNXOUT= 0
##$USERA1= <user>
##$USERA2= <user>
##$USERA3= <user>
##$USERA4= <user>
##$USERA5= <user>
##$V9= 5
##$VALIST= <valist>
##$VCLIST= <CCCCCCCCCCCCCCC>
##$VD= 0
##$VDLIST= <DDDDDDDDDDDDDDD>
##$VPLIST= <PPPPPPPPPPPPPPP>
##$VTLIST= <TTTTTTTTTTTTTTT>
##$WBST= 2048
##$WBSW= 25
##$XGAIN= (0..3)
0 0 0 0
##$XL= 0
##$YL= 0
##$YMAX_a= 7895863
##$YMIN_a= -16260572
##$ZGOPTNS= <>
##$ZL1= 120
##$ZL2= 120
##$ZL3= 120
##$ZL4= 120
##$ABSF1= 14.96346
##$ABSF2= -5.594722
##$ABSG= 5
##$ABSL= 3
##$ALPHA= 0
##$AQORDER= 0
##$ASSFAC= 0
##$ASSFACI= 0
##$ASSFACX= 0
##$ASSWID= 0
##$AUNMP= <proc_prof1d_extract.lims>
##$AXLEFT= 0
##$AXNAME= <>
##$AXNUC= <1H>
##$AXRIGHT= 0
##$AXTYPE= 0
##$AXUNIT= <>
##$AZFE= 0.1
##$AZFW= 0.1
##$BCFW= 0
##$BC_mod= 0
##$BYTORDP= 0
##$COROFFS= 0
##$CY= 15
##$DATMOD= 1
##$DC= 0
##$DFILT= <>
##$DTYPP= 0
##$F1P= 0
##$F2P= 0
##$FCOR= 0.5
##$FTSIZE= 131072
##$FT_mod= 6
##$GAMMA= 0
##$GB= 0
##$INTBC= 1
##$INTSCL= 1
##$ISEN= 128
##$LB= 0.3
##$LEV0= 0
##$LPBIN= 0
##$MAXI= 10000
##$MC2= 0
##$MEAN= 0
##$ME_mod= 0
##$MI= 0
##$NCOEF= 0
##$NC_proc= -2
##$NLEV= 6
##$NOISF1= 0
##$NOISF2= 0
##$NSP= 0
##$NTH_PI= 0
##$NZP= 0
##$OFFSET= 14.96346
##$PC= 1
##$PHC0= -87.65442
##$PHC1= 0
##$PH_mod= 1
##$PKNL= yes
##$PPARMOD= 0
##$PPDIAG= 0
##$PPIPTYP= 0
##$PPMPNUM= 2147483647
##$PPRESOL= 1
##$PSCAL= 4
##$PSIGN= 0
##$PYNMP= <proc.py>
##$REVERSE= no
##$SF= 400.020008651983
##$SI= 131072
##$SIGF1= 0
##$SIGF2= 0
##$SINO= 400
##$SIOLD= 131072
##$SPECTYP= <>
##$SREGLST= <1H.CDCl3>
##$SSB= 0
##$STSI= 131072
##$STSR= 0
##$SW_p= 8223.68421052631
##$SYMM= 0
##$S_DEV= 0
##$TDeff= 65536
##$TDoff= 0
##$TI= <>
##$TILT= no
##$TM1= 0
##$TM2= 0
##$TOPLEV= 0
##$USERP1= <user>
##$USERP2= <user>
##$USERP3= <user>
##$USERP4= <user>
##$USERP5= <user>
##$WDW= 1
##$XDIM= 131072
##$YMAX_p= 428108535
##$YMIN_p= -13410
##$CURPLOT= <Network HP LaserJet P1505>
##$CURPRIN= <$Network HP LaserJet P1505>
##$DFORMAT= <normdp>
##$LAYOUT= <+/1D_H.xwp>
##$LFORMAT= <normlp>
##$PFORMAT= <normpl>
##$SURQMSG= 1
$$ End of Bruker specific parameters
$$ ---------------------------------
##NTUPLES= NMR SPECTRUM
##VAR_NAME=  FREQUENCY,     SPECTRUM/REAL,   SPECTRUM/IMAG
##SYMBOL=    X,             R,               I
##VAR_TYPE=  INDEPENDENT,   DEPENDENT,       DEPENDENT
##VAR_FORM=  AFFN,          ASDF,            ASDF
##VAR_DIM=   131072,        131072,          131072
##UNITS=     HZ,            ARBITRARY UNITS, ARBITRARY UNITS
##FACTOR=    0.0627417313425164, 1,          1
##FIRST=     8223.62146879497, 1398,         -61429
##LAST=      0,             3509,            -61506
##MIN=       0,             -13410,          0
##MAX=       8223.62146879497, 428108535,    0
$$ Real data points
##PAGE= N=1
##DATA TABLE= (X++(R..R)), XYDATA
$$ [...]
60947I763216j274390j068723q94572p48477o25886n23063m38333l70457l17159
60938C502156k75720k43538k17652j95241j75157j57712j42618j28395j14108
60929A852015j00296q7713p6400o6494n8863n4155n1937n1161n0815m9928m7829
60918A156424m4798m1752l9058l6319l3361l0529k7899k5212k2738k1185k0411
60907H13162j9322j7506j5957j5570j5796j5465j4208j2456j0677r232q380p872
60895F50721p083n963n230n125m747l337j517m56k59o2O57J611K383K836L020
60880F27449L151L573M325M999N357N712O248O479O046N538N758O444O543N695
60866G03317M628M125M219M555M896N149N251N194M909M223L216K392K074J897
$$ y = [9763216, 8488826, 7420103, 6525531, 5777054, 5151168, 4628105, 4189772, 3819315, 3502156, 3226436, 2982898, 2765246, 2570005, 2394848, 2237136, 2094518, 1966123, 1852015, 1751719, 1664006, 1587606, 1521112, 1462249, 1408094, 1356157, 1304996, 1254181, 1204253, 1156424, 1111626, 1069874, 1030816, 994497, 961136, 930607, 902708, 877496, 854758, 833573, 813162, 793840, 776334, 760377, 744807, 729011, 713546, 699338, 686882, 676205, 666973, 658593, 650721, 643638, 637675, 632445, 627320, 622573, 619236, 617719, 617263, 617004, 616942, 617599, 619210, 621593, 624429, 627449, 630600, 634173, 638498, 643497, 648854, 654566, 660814, 667293, 673339, 678877, 684635, 691079, 697622, 703317, 707945, 712070, 716289, 720844, 725740, 730889, 736140, 741334, 746243, 750466, 753682, 756074, 758148, 760045]
60852G60045J381Q50J010J763K130J513L97m43q22j015j201j422j806k546l765
60837G56069n394o979p688o970n190l250j576m1J191J502Q29J60L94J236J780
60822G26073J884K231L167M156M551M369L984L472K619J406J58p98j380j629j542
60807G52721j170p15l07J73Q52J451J511J100Q88J306J964K279K302K464K711
60792G69530K540J891J405J555K018K172J835J295Q93Q58J281J982K578K885L086
60777G97804L373L579L427K926K300J707J195P49K19o25j718k581k837k733k885
60762H03900l621m793o077p155p719p681p426p537q087q434p893o535n169m543
60748G11230m674n015n114m978m705m120l072j946j401j475j402o16M70J011Q57
$$ y = [760045, 761426, 762276, 763286, 765049, 767179, 768692, 769089, 768646, 767824, 766809, 765608, 764186, 762380, 759834, 756069, 750675, 743696, 736008, 729038, 723848, 720598, 719022, 718981, 720172, 721674, 722503, 722663, 723057, 724293, 726073, 727957, 730188, 733355, 737511, 742062, 746431, 750415, 753887, 756506, 757912, 758070, 757272, 755892, 754263, 752721, 751551, 750836, 750529, 750702, 751554, 753005, 754516, 755616, 756504, 757810, 759774, 762053, 764355, 766819, 769530, 772070, 773961, 775366, 776921, 778939, 781111, 782946, 784241, 785134, 785992, 787273, 789255, 791833, 794718, 797804, 801177, 804756, 808183, 811109, 813409, 815116, 816311, 817060, 817279, 816654, 814936, 812355, 809518, 806785, 803900, 800279, 795486, 789409, 782254, 774535, 766854, 759428, 751891, 743804, 735370, 727477, 720942, 715773, 711230, 706556, 701541, 696427, 691449, 686744, 682624, 679552, 677606, 676205, 674730, 673328, 672712, 673182, 674193, 675050]
60733F75050O17Q07J300J712J800J414M32j061k695m075n010n461n501n456n791
60718F48082o658p704q490q940r213r311r127q762q448q140p518o507n456m648
60704E39160l864k746j400l00K84M51L53J72L68J388K901L836L522K476J654J361
60688E49616J371J726K697M044N056N477N825O611P806R122J0412J1530J2354
60675F33647J3135J4366J6023J7399J7987J8004J7745J7009J5702J4448J3846
60664H09311J3470J2361J0384Q339O769N392L887K470J410M89o72k041l318m430
60650H63821n585o960q559j0311j2071j3548j4398j4501j4113j3734j3718j3946
60638G22377j3920j3243j1963j0504r278q381p562o453m981l580k713k278j789
$$ y = [675050, 675667, 676474, 677774, 679486, 681286, 682700, 683132, 682071, 679376, 675301, 670291, 664830, 659329, 653873, 648082, 641424, 633720, 625230, 616290, 607077, 597766, 588639, 579877, 571429, 563289, 555771, 549264, 543808, 539160, 535296, 532550, 531150, 530850, 531134, 531585, 531938, 532110, 532478, 533866, 536767, 540603, 544125, 546601, 548255, 549616, 550987, 552713, 555410, 559454, 564510, 569987, 575812, 582423, 590229, 599351, 609763, 621293, 633647, 646782, 661148, 677171, 694570, 712557, 730561, 748306, 765315, 781017, 795465, 809311, 822781, 835142, 845526, 853865, 860634, 866026, 869913, 872383, 873793, 874282, 873610, 871569, 868251, 863821, 858236, 851276, 842717, 832406, 820335, 806787, 792389, 777888, 763775, 750041, 736323, 722377, 708457, 695214, 683251, 672747, 663469, 655088, 647526, 641073, 636092, 632512, 629799, 627521, 625732]
60625F25732j197r08q79l05J257K997L812L805M057N084O336P277Q006Q583Q588
60610F82245P892P294P710R017J0277J0924J1210J1525J1758J1504J0558R054
60598H00968P212N131K795K08k497n140p614r873j1792j3140j3736j3660j3261
60585G25601j2866j2454j1726j0608r494q840q585q340q044p976q075p857p240
60572F03496o832p019p225o662n404m155l277k640k169j866j475p35J28P56J274
60557E56195J939K393K100J373J091J364J458J100R07J264J790K259L099M422
60543E82754N502N905O403P877J0022J1984J3780J6158J9275K2446K5213K7898
60531G55217L1099L5109L9764M4400M7979M9710M9402M6925M1655L3085K1866
$$ y = [625732, 624535, 623627, 622748, 622443, 623700, 626697, 630509, 634314, 638371, 643455, 649791, 657068, 665074, 673657, 682245, 690137, 697431, 705141, 714158, 724435, 735359, 746569, 758094, 769852, 781356, 791914, 800968, 808180, 813311, 816106, 816314, 813817, 808677, 801063, 791190, 779398, 766258, 752522, 738862, 725601, 712735, 700281, 688555, 677947, 668453, 659613, 651028, 642688, 634644, 626668, 618593, 610736, 603496, 596664, 589645, 582420, 575758, 570354, 566199, 562922, 560282, 558113, 556247, 554772, 554037, 554165, 554921, 556195, 558134, 560527, 562627, 564000, 565091, 566455, 567913, 569013, 569920, 571184, 572974, 575233, 578332, 582754, 588256, 594161, 600564, 608441, 618463, 630447, 644227, 660385, 679660, 702106, 727319, 755217, 786316, 821425, 861189, 905589, 953568, 1003278, 1052680, 1099605, 1141260, 1174345, 1196211]
60520A196211R663j990j2235k0440k5923k8358k8047k5711k2302j8911j6382j4802
60508I90773j3748j3005j2658j2431j1513r350o291l198n18K089N294R431J4145
60495I39020J8743K2954K7351L2684L8697M3848M6433M5902M2993L8705L3496
60484A330826K7507K1359J6363J3900J4713J8905K6293L6561M9301O4314Q1809
60473A701851J02011J24683J49552J77102K08281K43087K79739L15010L44512
60464C645828L62334L61606L36896K86560K12887J20807J7360q8119j84982k63910
60454D807267l19295l49899l58117l48799l27818l00573k70909k40992k11941
60445B078924j84676j60240j39307j21542j05903r1695p8993o7950n8332n0108
$$ y = [1196211, 1205874, 1203884, 1191649, 1171209, 1145286, 1116928, 1088881, 1063170, 1040868, 1021957, 1005575, 990773, 977025, 964020, 951362, 938931, 927418, 918068, 911777, 908579, 908061, 910150, 915444, 924875, 939020, 957763, 980717, 1008068, 1040752, 1079449, 1123297, 1169730, 1215632, 1258625, 1297330, 1330826, 1358333, 1379692, 1396055, 1409955, 1424668, 1443573, 1469866, 1506427, 1555728, 1620042, 1701851, 1803862, 1928545, 2078097, 2255199, 2463480, 2706567, 2986306, 3301316, 3645828, 4008162, 4369768, 4706664, 4993224, 5206111, 5326918, 5344278, 5256159, 5071177, 4807267, 4487972, 4138073, 3779956, 3431157, 3103339, 2802766, 2531857, 2290865, 2078924, 1894248, 1734008, 1594701, 1473159, 1367256, 1275561, 1196568, 1128618, 1070286, 1020178]
60435A020178m3763l9374l5833l1803k7180k2831j9195j6075j3669j2653j2974
60424G44828j3477j3191j2267j1265j0194q858p494o424n432m141k827k227k617
60411F44414l519m282m545m192l291k180j291p76m06J0L40K75k95j110j632j425
60395F16095n28N45J312J815K471L448M397M847M663L976K927J744Q89O68O18
60380F49887j72j849l327l459k426j402j093j223j343j309q81K63J697K234J362
60365F36959Q0l35J39O91J212K350M179N816O501O377N935N408M960M904N313
60350F90489N774N922N951O289O941P284O564M527J829k92j081j003j133j803
60336G36258k280j879q45J75J076K329M129N952O950O668N335L609J996O02o74
$$ y = [1020178, 976415, 937041, 901208, 869405, 842225, 819394, 800199, 784124, 770455, 757802, 744828, 731351, 718160, 705893, 694628, 684434, 675576, 668082, 661658, 656226, 652085, 649258, 647031, 644414, 640895, 636613, 632068, 627876, 624585, 622405, 621114, 620338, 619932, 619942, 620282, 620557, 620262, 619152, 617520, 616095, 615567, 616112, 617424, 619239, 621710, 625158, 629555, 634402, 639065, 643041, 645968, 647712, 648601, 649269, 649887, 649715, 647866, 644539, 641080, 638654, 637252, 636159, 634936, 633593, 632284, 631403, 631666, 633363, 635597, 636959, 637039, 636704, 636843, 637534, 638746, 641096, 645275, 651091, 657592, 663969, 669904, 675312, 680272, 685176, 690489, 696263, 702185, 708136, 714425, 721366, 728650, 735214, 739741, 741570, 741278, 740197, 739194, 738061, 736258, 733978, 732099, 731254, 731429, 732505, 734834, 738963, 744915, 751865, 758533, 763868, 767477, 769473, 770075, 769401]
60321G69401j770k476k713k649k588k829l483m228m441l861k997k537k473k185
60307G28171j368m15K36P26J515K701L824M317M066L519L236L300L307K984K505
60292G62624K027J284Pj522k738l444l742l598k948k136j642j384q42J63J246
60277G43355K086K758L353L805M190M774N656O727P928R159R992J0155J0216J1110
60263H35264J2819J4305J4963J5432J6582J8325J9981K1285K2490K3866K5616
60252A040928K7995L1074L4579L8270M2280M6797N1732N6981O2596O8407P3858
60241A575497P8733Q3644Q9253R5306J00922J05610J09374J11945J12571J10730
60231B573585J06537J00267R1893Q1382O9196N6215M3062K9697J5770J426j2421
$$ y = [769401, 767631, 765155, 762442, 759793, 757205, 754376, 750893, 746665, 742224, 738363, 735366, 732829, 730356, 728171, 726803, 726388, 726624, 727350, 728865, 731566, 735390, 739707, 743773, 747292, 750528, 753828, 757135, 760119, 762624, 764651, 765935, 765942, 764420, 761682, 758238, 754496, 750898, 747950, 745814, 744172, 742788, 741946, 742109, 743355, 745441, 748199, 751552, 755357, 759547, 764321, 769977, 776704, 784632, 793791, 803783, 813938, 824154, 835264, 848083, 862388, 877351, 892783, 909365, 927690, 947671, 968956, 991446, 1015312, 1040928, 1068923, 1099997, 1134576, 1172846, 1215126, 1261923, 1313655, 1370636, 1433232, 1501639, 1575497, 1654230, 1737874, 1827127, 1922433, 2023355, 2128965, 2238339, 2350284, 2462855, 2573585, 2680122, 2780389, 2872282, 2953664, 3022860, 3079075, 3122137, 3151834, 3167604, 3169030, 3156609]
60220C156609k4698l4910m3043m8920n2171n2852n1492m8334m2987l5267k5911
60209B696024j5946n574N826J8637L2391M6227N9688P2913Q6166R9209J11187
60198C206748J21207J28886J34066J36079J33966J27472J17319J04147Q7873O8548
60188D366311M7333K5828M708j6242l6864n6153p3109q7363r8660j06339j09704
60177C859746j08646j03666r5425q4537p1545n6907m1062k4645q301P792K3993
60166C296797M0482N6515P0664Q1738Q9234R2998R2782Q8404Q0160O8882N5619
60155D114275M1359K6905J2715j008j3913k5206l4198m1058m6451n0224n1026
60144C932170m7719m0664l1096j9564n750J0375K8109M6901O6946Q8561J11453
$$ y = [3156609, 3131911, 3097001, 3053958, 3005038, 2952867, 2900015, 2848523, 2800189, 2757202, 2721935, 2696024, 2680078, 2674504, 2680330, 2698967, 2731358, 2777585, 2837273, 2910186, 2996352, 3095561, 3206748, 3327955, 3456841, 3590907, 3726986, 3860952, 3988424, 4105743, 4209890, 4297763, 4366311, 4413644, 4439472, 4444180, 4427938, 4391074, 4334921, 4261812, 4174449, 4075789, 3969450, 3859746, 3751100, 3647434, 3552009, 3467472, 3395927, 3339020, 3297958, 3273313, 3265012, 3272804, 3296797, 3337279, 3393794, 3464458, 3546196, 3635430, 3728428, 3821210, 3909614, 3989774, 4058656, 4114275, 4155634, 4182539, 4195254, 4194246, 4180333, 4155127, 4120929, 4079871, 4033420, 3983196, 3932170, 3884451, 3843787, 3812691, 3793127, 3787377, 3797752, 3825861, 3872762, 3939708, 4028269, 4139722]
60133D139722J34988J58881J83339K08629K34684K60914K86427L10555L33013
60124F251152L53225L69680L80490L84614L81988L72478L55475L30716K98887
60115I478705K61134K18420J71692J22023P0255J6895l7223r0678j42138j90759
60105I878326k35395k73901l03905l24055l34184l34669l26291l10546k89371
60096G146009k64384k36642k07003j76300j45134j13812q2503n1397k0795Q815
60086E856854L6908O3035Q6480J05714J18770J24482J23077J15370J01869Q2960
60076F815519N9581L3248N707k1205m5895o7809q7594j06075j23240j38606j52035
60065F171596j63609j72964j79383j82424j81955j77809j70018j59335j46813
$$ y = [4139722, 4274710, 4433591, 4616930, 4825559, 5060243, 5321157, 5607584, 5918139, 6251152, 6604377, 6974057, 7354547, 7739161, 8121149, 8493627, 8849102, 9179818, 9478705, 9739839, 9958259, 10129951, 10251974, 10322229, 10339124, 10301901, 10211223, 10069085, 9878326, 9642931, 9369030, 9065125, 8741070, 8406886, 8072217, 7745926, 7435380, 7146009, 6881625, 6644983, 6437980, 6261680, 6116546, 6002734, 5920231, 5868834, 5848039, 5856854, 5893762, 5956797, 6043277, 6148991, 6267761, 6392243, 6515320, 6630690, 6732559, 6815519, 6875100, 6908348, 6914055, 6892850, 6846955, 6779146, 6691552, 6585477, 6462237, 6323631, 6171596, 6007987, 5835023, 5655640, 5473216, 5291261, 5113452, 4943434, 4784099, 4637286]
60056D637286j32836j16994r9049p9599n9610l9624j9561P86K1304M1593O1374
60045D215070Q0652R9153J15824J29384J39311J45621J47699J44203J34578J19851
60035E471346J01419P9797N5270K8962K256k4450n1314p7666j02046j23497j41761
60024E218316j56163j65342j68475j66125j59532j49693j37301j22994j07207
60015C885484r0101p1912n3099l4049j4931M076K2703M0890N8920P7268R6399
60004C921648J16558J37346J57585J75878J91217K02703K08994K08635K00972
59995E521536J86398J65885J40785J12829Q3561N3588K2848q364l9204o8974r7270
59984F073618j23155j44895j60985j71058j75440j74284j67643j56254j41660
$$ y = [4637286, 4504450, 4387456, 4288407, 4208808, 4149198, 4109574, 4090013, 4090799, 4112103, 4153696, 4215070, 4295722, 4394875, 4510699, 4640083, 4779394, 4925015, 5072714, 5216917, 5351495, 5471346, 5572765, 5652562, 5707832, 5736794, 5739050, 5714600, 5663286, 5585620, 5483574, 5360077, 5218316, 5062153, 4896811, 4728336, 4562211, 4402679, 4252986, 4115685, 3992691, 3885484, 3795383, 3723471, 3670372, 3636323, 3621392, 3625468, 3648171, 3689061, 3747981, 3825249, 3921648, 4038206, 4175552, 4333137, 4509015, 4700232, 4902935, 5111929, 5320564, 5521536, 5707934, 5873819, 6014604, 6127433, 6210994, 6264582, 6287430, 6279066, 6239862, 6170888, 6073618, 5950463, 5805568, 5644583, 5473525, 5298085, 5123801, 4956158, 4799904, 4658244]
59975D658244j25369j07972q9255o9099m8178k7590p860J1430L0902N0563O9737
59964D345553Q7430J02507J14030J21858J26575J28444J26733J20582J10220R6835
59954E480767Q1556O5159M8499L2417J7316L403q667j7996k4125k6879k5653j9653
59942E606144q840O077K4679M7179P3584J03236J35439J69946K06600K44937K84283
59931F893264L23780L62114L97618M28600M52964M67517M68409M52674M18920
59922A0665860L66651K95985K08839J09974O233r5347j88797k69582l34688l82590
59912A0382538m13030m26881m26206m13920l92870l65192l32552k96668k59316
59903G055903k21880j85024j48819j13198p8379m4729j2265J9415N0492Q0609
$$ y = [4658244, 4532875, 4424903, 4335648, 4266549, 4218371, 4190781, 4182921, 4194351, 4225253, 4275816, 4345553, 4432983, 4535490, 4649520, 4771378, 4897953, 5026397, 5153130, 5273712, 5383932, 5480767, 5562323, 5627482, 5675981, 5708398, 5725714, 5729117, 5720450, 5702454, 5678329, 5651450, 5625797, 5606144, 5597304, 5603381, 5628060, 5675239, 5748823, 5852059, 5987498, 6157444, 6364044, 6608981, 6893264, 7217044, 7579158, 7976776, 8405376, 8858340, 9325857, 9794266, 10246940, 10665860, 11032511, 11328496, 11537335, 11647309, 11653542, 11558195, 11369398, 11099816, 10765128, 10382538, 9969508, 9542627, 9116421, 8702501, 8309631, 7944439, 7611887, 7315219, 7055903, 6834023, 6648999, 6500180, 6386982, 6308603, 6263874, 6251609, 6271024, 6321516, 6402125]
59893F402125J09436J36987J62798J85176K01962K11772K13710K06311J87950
59884H018227J58469J19512P3176K1443l2917q6081j34689j77041k12324k39552
59874G508223k58082k68721k73463k74229k72224k68107k62124k54164k44136
59865E132973k32224k18637k03390j86693j69293j51957j34835j17652j00437
59856C617855q3703o8036n3814m1362l1213k4009k0214j9831k2495k7814l5405
59845C189959m4354n2902n9203o2496o3228o2096n9322n4909m9093m2325l5031
59834B605000k7494j9769j1750l461M832J3068K1646L0906M0555N0103N9535O8935
59822B832106P7580Q3977Q6767Q5082P8438O7235N3392L9542K7322J6987Q503
$$ y = [6402125, 6511561, 6648548, 6811346, 6996522, 7198484, 7410256, 7623966, 7830277, 8018227, 8176696, 8296208, 8369384, 8390827, 8357910, 8271829, 8137140, 7960099, 7747775, 7508223, 7250141, 6981420, 6707957, 6433728, 6161504, 5893397, 5631273, 5377109, 5132973, 4900749, 4682112, 4478722, 4292029, 4122736, 3970779, 3835944, 3718292, 3617855, 3534152, 3466116, 3412302, 3370940, 3339727, 3315718, 3295504, 3275673, 3253178, 3225364, 3189959, 3145605, 3092703, 3033500, 2971004, 2907776, 2845680, 2786358, 2731449, 2682356, 2640031, 2605000, 2577506, 2557737, 2545987, 2542526, 2547358, 2560426, 2582072, 2612978, 2653533, 2703636, 2763171, 2832106, 2909686, 2993663, 3080430, 3165512, 3243950, 3311185, 3364577, 3404119, 3431441, 3448428, 3456931]
59811C456931K064k604o436r944j2481j2830j0022l542O552J9499L4506N1692
59799C513385P1734R4606J19578J46614J76750K10828K48664K89721L33166L76332
59789E581378M13567M36922M37444M06418L38209K34699J07373k6004j47693k44767
59779G537546l10953l46496l56369l47157l24710k93963k59397k24355j90359
59770D883787j58007j28331j02509q0622o1636m4577k9164j5475l542O950J6959
59759D283833K7690L9398N1135O2193P3399Q6157J00776J16415J32485J49205
59749E122686J67092J86590K08052K31436K56260K82375L10489L41234L74130
59740G480344M08144M42820M77819N11506N41009N63665N77527N80413N69656
$$ y = [3456931, 3458995, 3456391, 3449955, 3440011, 3427530, 3414700, 3404678, 3401136, 3407688, 3427187, 3461693, 3513385, 3585119, 3679725, 3799303, 3945917, 4122667, 4333495, 4582159, 4871880, 5205046, 5581378, 5994945, 6431867, 6869311, 7275729, 7613938, 7848637, 7956010, 7930006, 7782313, 7537546, 7226593, 6880097, 6523728, 6176571, 5851861, 5557898, 5298501, 5074146, 4883787, 4725780, 4597449, 4494940, 4414318, 4352682, 4308105, 4278941, 4263466, 4259924, 4266874, 4283833, 4311523, 4350921, 4402056, 4464249, 4537648, 4623805, 4724581, 4840996, 4973481, 5122686, 5289778, 5476368, 5684420, 5915856, 6172116, 6454491, 6764980, 7106214, 7480344, 7888488, 8331308, 8809127, 9320633, 9861642, 10425307, 11002834, 11583247, 12152903]
59731A2152903N43623N03215M51797L94193L36028K83404K42109K16381K07911
59722A5331564K15924K38407K73430L19170L72904M30665M88280N42321N89647
59713A8802312O26481O48486O51802O33889N94010N33407M54957L62442K60503
59704B3568289J55241N3892l6862j12206j68891k04681k18820k12332j87000j44361
59694B2492269q6185j5130O6055J55688K52657L55228M61211N68970O77178P83470
59684B5711411Q83889R73334J045538J092553J105073J073801R91059Q52626O60009
59675C4389293M21852J53040j27763m00522o46180q49478j001092j097707j141189
59666B9700254j138551j102022j047472r91744r50263r34340r47406r82699j025868
$$ y = [12152903, 12696526, 13199741, 13651538, 14045731, 14381759, 14665163, 14907272, 15123653, 15331564, 15547488, 15785895, 16059325, 16378495, 16751399, 17182064, 17670344, 18212665, 18802312, 19428793, 20077279, 20729081, 21362970, 21956980, 22490387, 22945344, 23307786, 23568289, 23723530, 23777422, 23740560, 23628354, 23459463, 23254782, 23035962, 22823630, 22636630, 22492269, 22406084, 22390954, 22457009, 22612697, 22865354, 23220582, 23681793, 24250763, 24927941, 25711411, 26595300, 27568634, 28614172, 29706725, 30811798, 31885599, 32876658, 33729284, 34389293, 34811145, 34964185, 34836422, 34435900, 33789720, 32940242, 31939150, 30841443, 29700254, 28561703, 27459681, 26412209, 25420465, 24470202, 23535862, 22588456, 21605757, 20579889]
59657B0579889j061444j078368j072039j043923r99731r46254q88371q28655p69001
59648A1892103p11291o56546o04762n56053n11005m69590m30789l93815l58952
59639G199300l26687k96826k68916k42934k18929j96503j75239j55184j36501
59630E181581j18942j02187q6514p2660o0992n1086m2272l4645k9357k7596k9262
59619D526068l3208l8900m7067n8072p0330q1282q9550r5309r8946j00376r9601
59608C713427r6950r2682q7057q0625p3765o6164n7596m8856m0816l2974k4245
59597C011697j5030o982n63N527J2136J8334K2987K6243K8578K9588K8866K7134
59585C188515K5389K3546K1022J8268J6679J7143J9384K2757K6981L2148L8399
$$ y = [20579889, 19518445, 18440077, 17368038, 16324115, 15324384, 14378130, 13489759, 12661104, 11892103, 11180812, 10524266, 9919504, 9363451, 8852446, 8382856, 7952067, 7558252, 7199300, 6872613, 6575787, 6306871, 6063937, 5845008, 5648505, 5473266, 5318082, 5181581, 5062639, 4960452, 4873938, 4801278, 4740286, 4689200, 4646928, 4612283, 4582926, 4555330, 4526068, 4492860, 4453960, 4406893, 4348821, 4278491, 4197209, 4107659, 4012350, 3913404, 3813028, 3713427, 3616477, 3523795, 3436738, 3356113, 3282348, 3216184, 3158588, 3109732, 3068916, 3035942, 3011697, 2996667, 2989685, 2989122, 2994649, 3006785, 3025119, 3048106, 3074349, 3102927, 3132515, 3161381, 3188515, 3213904, 3237450, 3258472, 3276740, 3293419, 3310562, 3329946, 3352703, 3379684, 3411832, 3450231]
59574C450231M5671N3667O2220P1660Q2411R4310J06846J20111J34770J50891
59564D372788J67634J84388K01411K18818K35744K51132K64712K76463K85600
59555F458690K90821K91282K86747K77174K62829K44624K23700K00749J76190
59546H712806J50890J26257J03390Q2188O1136L8174J2573j3430l5128m7942m9739
59535I141175m0911k3007K318L3624O9615J08631J47875J83351K10869K26927
59525A0060467K28706K14124J82751J36477P8612J2385n9370j33460k06070k73507
59515A0241115l32785l81453m17443m39596m48357m45636m33808m14716l89631
59506F537690l59963l27695k94939k63248k33389k05518j79293j54153j29938
$$ y = [3450231, 3495902, 3549569, 3611789, 3683449, 3765860, 3860170, 3967016, 4087127, 4221897, 4372788, 4540422, 4724810, 4926221, 5145039, 5380783, 5631915, 5896627, 6173090, 6458690, 6749511, 7040793, 7327540, 7604714, 7867543, 8112167, 8335867, 8536616, 8712806, 8863696, 8989953, 9093343, 9175531, 9236667, 9274841, 9287414, 9273984, 9238856, 9190914, 9141175, 9100264, 9077257, 9079575, 9113199, 9182814, 9291445, 9439320, 9622671, 9833540, 10060467, 10289173, 10503297, 10686048, 10822525, 10901137, 10913522, 10854152, 10720692, 10514622, 10241115, 9908330, 9526877, 9109434, 8669838, 8221481, 7775845, 7342037, 6927321, 6537690, 6177727, 5850032, 5555093, 5291845, 5058456, 4852938, 4673645, 4519492, 4389554]
59497D389554j07097q6017o6308m7164k8180r350R504K8671M8054O7333Q6575
59486D285575J06150J26078J46011J65790J85407K04408K21958K37415K50215
59477E929007K59149K62469K58766K47205K26938J97169J58048J10913N7660N27
59467G707851n7487j12972j63226k06567k41686k67615k84580k93855k96473k92837
59457E490553k83871k71512k57474k42206k25628k08243j90929j74292j58667
59448C477731j44276j30854j17686j04530r2023q0813p0762o1444n2814m4937
59438B577592l7512l0252k3319j7042j1463o478k083J708M835O991P991Q487R581
59425B489036J1553J3564J4892J5857J7383K0325K5150L1244L6202L7128L3505
$$ y = [4389554, 4282457, 4196440, 4130132, 4082968, 4054788, 4045438, 4054942, 4083613, 4131667, 4199000, 4285575, 4391725, 4517803, 4663814, 4829604, 5015011, 5219419, 5441377, 5678792, 5929007, 6188156, 6450625, 6709391, 6956596, 7183534, 7380703, 7538751, 7649664, 7707324, 7707851, 7650364, 7537392, 7374166, 7167599, 6925913, 6658298, 6373718, 6079863, 5783390, 5490553, 5206682, 4935170, 4677696, 4435490, 4209862, 4001619, 3810690, 3636398, 3477731, 3333455, 3202601, 3084915, 2980385, 2888362, 2807549, 2736787, 2675343, 2622529, 2577592, 2540080, 2509828, 2486509, 2469467, 2458004, 2451526, 2449443, 2451151, 2455986, 2462977, 2470968, 2479455, 2489036, 2500589, 2514153, 2529045, 2544902, 2562285, 2582610, 2607760, 2639004, 2675206, 2712334, 2745839]
59414B745839K8097K4534K4617K8275L4897M3796N4278O6198P9900R4667J07977
59403C333075J17239J22153J24906J28592J35993J48894J67417J90192K15947
59394D684408K44710K77107L13150L52475L95142M41192M89645N38483N85256
59385H321568O26963O59889O80426O86185O76168O50731O12152N64630N12809
59376A3991521M60304M09881L64075L24544K91158K62501K36860K12178J85718
59367A6738740J54795J17716P3429K1087l9048j04619j71948k37518k98156l50854
59357A5903624l93971m28550m57275m82094n03447n21312n35697n46113n51577
59348A1483588n51281n44753n31705n12649m89396m63908m36868m08175l78407
$$ y = [2745839, 2773936, 2798470, 2823087, 2851362, 2886259, 2930055, 2984333, 3050531, 3130431, 3225098, 3333075, 3450314, 3572467, 3697373, 3825965, 3961958, 4110852, 4278269, 4468461, 4684408, 4929118, 5206225, 5519375, 5871850, 6266992, 6708184, 7197829, 7736312, 8321568, 8948531, 9608420, 10288846, 10975031, 11651199, 12301930, 12914082, 13478712, 13991521, 14451825, 14861706, 15225781, 15550325, 15841483, 16103984, 16340844, 16553022, 16738740, 16893535, 17011251, 17084680, 17105767, 17066719, 16962100, 16790152, 16552634, 16254478, 15903624, 15509653, 15081103, 14623828, 14141734, 13638287, 13116975, 12581278, 12035165, 11483588, 10932307, 10387554, 9855849, 9343200, 8853804, 8389896, 7953028, 7544853, 7166446]
59339G166446l48778l19868k91687k64858k40403k18269j97280j76845j57645
59330D950813j40340j24625j10006r6466q3974p2145o0837n0414m0940l1818k2629
59319D116619j3681n378K474J0188J7537K3964K9178L3216L6099L7672L7658L5857
59307D361403L2500K8207K3343J7637J1002M396p83m086o016o687n417j823L523
59294D457199J0003J7805K7289L8025M9097O0082P1088Q1790R0924R6959R9057
59283E099318R7161R1197Q0522O4501M3574J9331o516l2768n8166q0858r9198
59272E218098j13079j24112j34327j44696j54434j61419j63544j60194j52444
59263C909849j41870j29552j16255j02861r0057p7902o6092n4372m2535l0533
$$ y = [7166446, 6817668, 6497800, 6206113, 5941255, 5700852, 5482583, 5285303, 5108458, 4950813, 4810473, 4685848, 4575842, 4479376, 4395402, 4323257, 4262420, 4212006, 4171066, 4139248, 4116619, 4102938, 4097560, 4100034, 4110222, 4127759, 4151723, 4180901, 4214117, 4250216, 4287888, 4325546, 4361403, 4393903, 4422110, 4445453, 4463090, 4474092, 4478488, 4477705, 4473619, 4467603, 4460916, 4455499, 4453676, 4457199, 4467202, 4485007, 4512296, 4550321, 4599418, 4659500, 4730588, 4812378, 4903302, 5000261, 5099318, 5196479, 5287676, 5368198, 5432699, 5476273, 5495604, 5489088, 5456320, 5398154, 5317296, 5218098, 5105019, 4980907, 4846580, 4701884, 4547450, 4386031, 4222487, 4062293, 3909849, 3767979, 3638427, 3522172, 3419311, 3329254, 3251352, 3185260, 3130888, 3088353, 3057820]
59253C057820j8842q134J784J2002K3119L4618M6121N8351P2105Q7116J02957
59242C469017J20294J40158J62546J86906K13503K43089K75569L10221L46824
59233E468127L85231M23830M59676M90047N12662N24268N20521M98025M55990
59224I738377L95850L20073K31553J33436K9297p5992j75853k63520l34443l86960
59214I611818m21040m37247m36966m22718l97941l66613l32595k98481k65288
59205F232929k33752k05381j81351j61189j43897j29915j20369j14735j11064
59196D831276j08548j08040j09686j11838j13025j13406j13414j12376j09601
59187C831342j05699j01691r7631r3017q7907q2607p6917p0537o3806n7227n0746
$$ y = [3057820, 3038978, 3030844, 3032628, 3044630, 3067749, 3102367, 3148488, 3206839, 3278944, 3366060, 3469017, 3589311, 3729469, 3892015, 4078921, 4292424, 4535513, 4811082, 5121303, 5468127, 5853358, 6277188, 6736864, 7226911, 7739573, 8263841, 8784362, 9282387, 9738377, 10134227, 10454300, 10685853, 10819289, 10848586, 10772594, 10596741, 10333221, 9998778, 9611818, 9190778, 8753531, 8316565, 7893847, 7495906, 7129293, 6796698, 6498217, 6232929, 5999177, 5793796, 5612445, 5451256, 5307359, 5177444, 5057075, 4942340, 4831276, 4722728, 4614688, 4505002, 4393164, 4280139, 4166733, 4053319, 3940943, 3831342, 3725643, 3623952, 3526321, 3433304, 3345397, 3262790, 3185873, 3115336, 3051530, 2994303, 2943557]
59176B943557m4178l7952l2602k7783k2587j6730j0851n607r25L846R210J5039
59164B772437K0768K6068L1156L6220M0862M4563M7368M9515N0623N0034M7825
59153C217439M4605M0316L4197K6119J7037P842j462j1113k0869l0269l8978m6589
59141C238275n2595n6863n9596o0810o0447n8955n6933n4074m9418m2838l5445
59130B650301k8171k0876j3201n374K358J0377J9165K8655L8471M8391N8195O7635
59118B855926P6773Q5848R4666J02659J09615J15775J21273J26374J32184J39937
59108C961030J49395J58913J67258J73999J77746J75509J64713J44880J16544
59099E389987P9829L5405j3866o3525j09629j49700j82283k06665k22872k31281
$$ y = [2943557, 2899379, 2861427, 2828825, 2801042, 2778455, 2761725, 2750874, 2745267, 2744342, 2748188, 2757398, 2772437, 2793205, 2819273, 2850429, 2886649, 2927511, 2972074, 3019442, 3068957, 3119580, 3169614, 3217439, 3262044, 3302360, 3336557, 3362676, 3379713, 3387555, 3386093, 3374980, 3354111, 3323842, 3284864, 3238275, 3185680, 3128817, 3069221, 3008411, 2947964, 2889009, 2832076, 2778002, 2728584, 2685746, 2650301, 2622130, 2601254, 2588053, 2582679, 2585037, 2595414, 2614579, 2643234, 2681705, 2730096, 2788291, 2855926, 2932699, 3018547, 3113213, 3215872, 3325487, 3441262, 3562535, 3688909, 3821093, 3961030, 4110425, 4269338, 4436596, 4610595, 4788341, 4963850, 5128563, 5273443, 5389987, 5469816, 5505221, 5491355, 5427830, 5318201, 5168501, 4986218, 4779553, 4556681, 4325400]
59089D325400k32377k27281k17952k06234j93072j79065j65148j52061j39666
59080B612544j27570j16061j05720r6412q7419p8363o9472o1185n3941m8149m3708
59069A724544l9867l5977l2211k9070k6413k3469j9707j5311j0891p115m491l156
59057A476866k801k944l325m084n695q531j2326j6159j9336k1994k4384k5830
59045A329457k5183k2191j7747j2796p653k403K759P753J2508J6673J9956K2499
59033A323632K4259K4289K1712J7240J2626Q692N044J642p54j838k069j520J83
59020A433138K457L950M658O274R568J2893J4327J4039J3338J2528J0905Q083
59008A546158M208n52n727j0326j3754j6385j8573j9820j9638j8461j7004j5389
$$ y = [4325400, 4093023, 3865742, 3647790, 3441556, 3248484, 3069419, 2904271, 2752210, 2612544, 2484974, 2368913, 2263193, 2166781, 2079362, 2000999, 1931527, 1870342, 1816401, 1768252, 1724544, 1684677, 1648700, 1616489, 1587419, 1561006, 1537537, 1517830, 1502519, 1491628, 1484513, 1480022, 1476866, 1474065, 1471121, 1467796, 1463712, 1458017, 1449486, 1437160, 1421001, 1401665, 1379671, 1355287, 1329457, 1304274, 1282083, 1264336, 1251540, 1243887, 1241484, 1244243, 1251996, 1264504, 1281177, 1301133, 1323632, 1347891, 1372180, 1393892, 1411132, 1423758, 1432450, 1437494, 1439136, 1438382, 1436544, 1434475, 1432955, 1433138, 1435595, 1439545, 1444203, 1450477, 1460045, 1472938, 1487265, 1501304, 1514642, 1527170, 1538075, 1546158, 1550366, 1549814, 1544087, 1533761, 1520007, 1503622, 1485049, 1465229, 1445591, 1427130, 1410126, 1394737]
58996A394737j3588j1934j0423q397n611k823o02J506L814N546O085O211P034
58983A371555Q351R242R605J0065J0865J1881J3260J5148J7281J9493K2059K4933
58971A543738K7395K9155L0870L2803L4056L4024L3474L2993L1600K8417K4688
58960A883213K2447K1870K1655K1560K2707K5510K8940L2103L5194L8655M2400
58949B196254M6069M9400N2286N5071N8514O2908O7591P1976P6498Q1792Q7698
58938B906057R3940J01148J10092J20507J31731J43978J57818J72911J88474K04635
58928D331291K22267K41735K62818K85482L09830L35747L63516L94085M27778
58919G174549M63468N00052N37903N77480O17431O55437O90044P19797P41306
$$ y = [1394737, 1381149, 1369215, 1358792, 1350395, 1344784, 1341961, 1341359, 1342865, 1346679, 1352225, 1358310, 1364521, 1371555, 1379906, 1389148, 1398753, 1408818, 1419683, 1431564, 1444824, 1459972, 1477253, 1496746, 1518805, 1543738, 1571133, 1600288, 1631158, 1663961, 1698017, 1732041, 1765515, 1798508, 1830108, 1858525, 1883213, 1905660, 1927530, 1949185, 1970745, 1993452, 2018962, 2047902, 2080005, 2115199, 2153854, 2196254, 2242323, 2291723, 2344009, 2399080, 2457594, 2520502, 2588093, 2660069, 2736567, 2818359, 2906057, 2999997, 3101145, 3211237, 3331744, 3463475, 3607453, 3765271, 3938182, 4126656, 4331291, 4553558, 4795293, 5058111, 5343593, 5653423, 5989170, 6352686, 6746771, 7174549, 7638017, 8138069, 8675972, 9253452, 9870883, 10526320, 11216364, 11936161, 12677467]
58910A2677467P50071P42917P17831O72036O02680N09653L96031K65781J23216
58901A7457683k5040j70049l03842m21678n20749n98483o53355o86307p00260
58892A3377920o98581o84404o60538o29474n93775n56385n19836m85139m52211
58883H097577m21294l93088l67705l44577l23328l03667k84590k64990k45121
58874E149217k26250k08796j92042j75726j60542j46758j33676j20917j09069
58865C675441r8578q8983p9782p1171o3513n6708n0417m4292l7929l1214k4624
58854C028230j8486j2217n279J621P427J2614J8598K5448L1768L7022M2391M8811
58842C217948N5760O2526O9340P6568Q3942R1371R9513J08859J19115J29972J41717
$$ y = [12677467, 13427538, 14170455, 14888286, 15560322, 16163002, 16672655, 17068686, 17334467, 17457683, 17432643, 17262594, 16958752, 16537074, 16016325, 15417842, 14764487, 14078180, 13377920, 12679339, 11994935, 11334397, 10704923, 10111148, 9554763, 9034927, 8549788, 8097577, 7676283, 7283195, 6915490, 6570913, 6247585, 5943918, 5659328, 5394338, 5149217, 4922967, 4714171, 4522129, 4346403, 4185861, 4039103, 3905427, 3784510, 3675441, 3576863, 3487880, 3408098, 3336927, 3273414, 3216706, 3166289, 3121997, 3084068, 3052854, 3028230, 3009744, 2997527, 2992248, 2993869, 3001296, 3013910, 3032508, 3057956, 3089724, 3126746, 3169137, 3217948, 3273708, 3336234, 3405574, 3482142, 3566084, 3657455, 3756968, 3865827, 3984942, 4114914, 4256631]
58831D256631J54595J68458J83458K00244K19094K39677K62033K86911L14730
58822F285831L45030L77316M11703M48350M86964N27016N67685O07390O44171
58813A0701456O76497P02772P19929P23631P10093O76824O21761N43252M41687
58804A6517902L20321J84259L9627j06291k45743l72482m82497n72857o41201
58795A4641038o87045p12552p21180p16095p00048o75724o45507o11419n75361
58786H596107n38718n01716m64179m26984l91683l58766l27631k98331k71922
58777E016177k48912k28937k12225j99515j89959j80849j70376j59222j48610
58768C277572j38419j28303j18984j10978j03174r4273q4741p5981o8320o1099
$$ y = [4256631, 4411226, 4579684, 4763142, 4963386, 5182480, 5422157, 5684190, 5971101, 6285831, 6630861, 7008177, 7419880, 7868230, 8355194, 8882210, 9449895, 10057285, 10701456, 11377953, 12080725, 12800654, 13524285, 14234378, 14911202, 15532963, 16076215, 16517902, 16838223, 17022482, 17062109, 16955818, 16710075, 16337593, 15855096, 15282239, 14641038, 13953993, 13241441, 12520261, 11804166, 11104118, 10428394, 9782887, 9171468, 8596107, 8057389, 7555673, 7091494, 6664510, 6272827, 5914061, 5586430, 5288099, 5016177, 4767265, 4538328, 4326103, 4126588, 3936629, 3755780, 3585404, 3426182, 3277572, 3139153, 3010850, 2891866, 2780888, 2677714, 2583441, 2498700, 2422719, 2354399, 2293300]
58758B293300n4183m8047m2690l7460l1850k5778j9484j3588q759m963j724M63
58746B005237o5m239j0940j8148k4639k9990l3948l6555l8171l8722l7750l5684
58734A696386l3995l3452l3300l2896l2856l3707l4635l4799l4733l5162l5487
58723A321364l4827l3633l2752l1649k9275k6135k3775k2503k1128j8975j6620
58712A030092j4550j2428j0040p824o136m774l598k898k953l751n280p537j0177
58699I38146j2597j4438j5623j5965j5277j3872j2515j1731j1306j0543q872o396
58687G89011l909k177j105R8J945M260O758R369J1817J3416J3681J2723J0883
58674H66770Q454O017M475M329N291O788Q495J0198J1577J2223J1464Q465L176
$$ y = [2293300, 2239117, 2191070, 2148380, 2110920, 2079070, 2053292, 2033808, 2020220, 2011461, 2006498, 2004774, 2005237, 2005172, 2000933, 1989993, 1971845, 1947206, 1917216, 1883268, 1846713, 1808542, 1769820, 1732070, 1696386, 1662391, 1628939, 1595639, 1562743, 1529887, 1496180, 1461545, 1426746, 1392013, 1356851, 1321364, 1286537, 1252904, 1220152, 1188503, 1159228, 1133093, 1109318, 1086815, 1065687, 1046712, 1030092, 1015542, 1003114, 993074, 985250, 979114, 974340, 970742, 967844, 964891, 961140, 955860, 948323, 938146, 925549, 911111, 895488, 879523, 864246, 850374, 837859, 826128, 814822, 804279, 795407, 789011, 785102, 782925, 781820, 781918, 783863, 788123, 794881, 804250, 816067, 829483, 843164, 855887, 866770, 875224, 881241, 885716, 890045, 895336, 902124, 910619, 920817, 932394, 944617, 956081, 964546, 967722]
58661I67722k884p656j0379j1710j2184j1700j0470r221q090o460m212k018j39
58648H70599J935M260O129P409R005J1418J4027J6377J8898K1758K4287K6335
58636A032437K8908L2611L6620M0156M3827M8500N3966N9785O6430P4453Q3435
58625A601128R2850J03133J14854J27558J40488J53700J67446J81176J94037K05573
58615C081943K15071K20963K21772K16605K03897J80975J46516J02793N4196M253
58605D648984m4714q9962j28417j58351j79747j93035j98636j97626j91754j82604
58595C084138j71302j58782j45641j32000j18096j04722r2555q1593p1812o3707
58585A943928n7492n2343m7262m2199l7662l3702k9904k5930k1544j6672j1737
$$ y = [967722, 964838, 957182, 946803, 935093, 922909, 911209, 900739, 891518, 883428, 876968, 872756, 870738, 870599, 872534, 876794, 882923, 890332, 899337, 910755, 924782, 941159, 960057, 981815, 1006102, 1032437, 1061345, 1093956, 1130576, 1170732, 1214559, 1263059, 1317025, 1376810, 1443240, 1517693, 1601128, 1693978, 1797111, 1911965, 2039523, 2180011, 2333711, 2501157, 2682333, 2876370, 3081943, 3297014, 3517977, 3739749, 3956354, 4160251, 4341226, 4487742, 4590535, 4644731, 4648984, 4604270, 4514308, 4385891, 4227540, 4047793, 3854758, 3656122, 3458496, 3266742, 3084138, 2912836, 2754054, 2608413, 2476413, 2358317, 2253595, 2161040, 2079447, 2007635, 1943928, 1886436, 1834093, 1786831, 1744632, 1706970, 1673268, 1643364, 1617434, 1595890, 1579218, 1567481]
58574A567481p231k663K935Q995J3062J3141R236K077q198k0909l3815m4495n1998
58561A447618n6194n6785n4142m9885m5299m0105l4017k8282k4212k1264j8239
58550A019194j5450j4080j4106j4478j4695j4724j4078j2525j1086j0767j0922
58539H72283j0313r149q513q473q406q590r715j1202j1805j1570j1550j1847j1576
58526G39574j0638r847r379q573p332o314n701m965l889k736j532j35J143J961
58512F71637K634L510M216M485N075O660Q454R311R589J0540J2353J4309J6354
58499G79127J8945K1676K3501K4135K3887K2475J9401J5257J1284P864M556J242
58487I73350k035n819j0381j4608j7104j8046j8568j8828j8202j6938j6038j5739
$$ y = [1567481, 1560250, 1557587, 1560522, 1569517, 1582579, 1595720, 1604956, 1607033, 1598835, 1577926, 1544111, 1499616, 1447618, 1391424, 1334639, 1280497, 1230612, 1185313, 1145208, 1111191, 1082909, 1058697, 1037433, 1019194, 1003744, 989664, 975558, 961080, 946385, 931661, 917583, 905058, 893972, 883205, 872283, 861970, 852821, 844308, 835835, 827429, 818839, 809124, 797922, 786117, 774547, 762997, 751150, 739574, 728936, 719089, 709710, 701137, 693805, 687491, 681790, 676825, 672936, 670200, 668668, 668533, 669676, 671637, 674271, 677781, 681997, 686482, 691557, 698217, 706671, 715982, 725571, 736111, 748464, 762773, 779127, 798072, 819748, 843249, 867384, 891271, 913746, 933147, 948404, 959688, 967552, 972108, 973350, 971315, 965496, 955115, 940507, 923403, 905357, 886789, 867961, 849759, 832821, 816783, 801044]
58475H01044j5509j5222j4932j4038j2088r999q902q230o644m421l208l612m664
58462F79575n506n978n779m595k987j676k36K101M769O581P726R334J1387J2799
58448G07515J3405J4173J5528J7025J8474J9800K0022J8031J4149R481M138k221
58436H69520q435j2469j3890j4041j3857j3138j1831j0307q449n975l459j543
58424G52126M48L470O834R157J0789J3257J6644J9498K1228K2482K3240K2474
58412I21647J9777J5562R802K404n272j1150j4714j6910j8089j7849j6638j5559
58400H53011j4709j3485j2138j1193r866p127l961k351k358k351j778j401j198
58387G69095m46L65R3p52o39L72J202K588O419J2105J6512J7877J7390J6550J5439
$$ y = [801044, 785535, 770313, 755381, 741343, 729255, 719256, 710354, 702124, 695480, 691059, 687851, 684239, 679575, 674069, 668091, 662312, 657717, 654730, 653054, 652818, 654919, 659688, 666269, 673995, 683329, 694716, 707515, 720920, 735093, 750621, 767646, 786120, 805920, 825942, 843973, 858122, 867603, 871741, 869520, 861085, 848616, 834726, 820685, 806828, 793690, 781859, 771552, 763103, 757128, 753669, 752126, 752574, 756044, 762878, 772035, 782824, 796081, 812725, 832223, 853451, 875933, 899173, 921647, 941424, 956986, 966788, 969192, 963920, 952770, 938056, 921146, 903057, 885208, 868570, 853011, 838302, 824817, 812679, 801486, 791620, 784493, 780532, 778181, 775823, 773472, 771694, 770293, 769095, 768649, 769014, 769107, 768355, 767716, 768088, 769290, 771878, 778297, 790402, 806914, 824791, 842181, 858731, 874170]
58372H74170J4029J2855J1905J0756R939J0277J1119J1401J1970J4389J7888K0222
58360A030920K1150K2178K3173K2377J9603J6214J1999N556k091p763j0492j2253
58348A140571j3937j4055j2079r663p614m884j475Q72J855L350N991Q099R007
58335A106038J0360J2966J5294J6280J6867J7732J8128J8018J8752K0749K2995
58324A294179K5235K7987L0029K8994K4895K0056J5216R097K117l164o053q436
58312A460152j0794j1172q998o239l826n96L281N719O514P976J0705J2626J3242
58299A478590J4801J8027K0653K1504K2108K3209K3639K3772K5857K9794L2862
58288A734816L4751L8293M4047M8997N2014N5654O0832O4640O5193O3794O0556
$$ y = [874170, 888199, 901054, 912959, 923715, 933654, 943931, 955050, 966451, 978421, 992810, 1010698, 1030920, 1052070, 1074248, 1097421, 1119798, 1139401, 1155615, 1167614, 1173170, 1171079, 1163316, 1152824, 1140571, 1126634, 1112579, 1100500, 1090837, 1083223, 1078339, 1076864, 1077736, 1079591, 1082941, 1088932, 1097031, 1106038, 1116398, 1129364, 1144658, 1160938, 1177805, 1195537, 1213665, 1231683, 1250435, 1271184, 1294179, 1319414, 1347401, 1377430, 1406424, 1431319, 1451375, 1466591, 1475688, 1477805, 1474641, 1468588, 1460152, 1449358, 1438186, 1429188, 1422949, 1419123, 1418527, 1421808, 1427527, 1434041, 1442017, 1452722, 1465348, 1478590, 1493391, 1511418, 1532071, 1553575, 1575683, 1598892, 1622531, 1646303, 1672160, 1701954, 1734816, 1769567, 1807860, 1851907, 1900904, 1952918, 2008572, 2069404, 2134044, 2199237, 2263031, 2323587]
58277B323587N3069M1423K9648K0137J1562M077R94L158P017J0485J5410K2211
58265B542778K7881L1515L5885M1338M4368M4553M6269N0868N4125N4326N5697
58254C029603O0426O4671O6292O9066P5077Q0378Q2701Q6021R2734R8767J01421
58243C907157J04570J10971J17021J20515J25811J35673J45724J52775J60749
58234E080966J72518J83998J92442K02208K16093K29650K40451K53813K72822
58225G044961K92260L09285L29823L57153L85157M10623M40562M79020N19136
58216A0567980N57331O02160O59255P21697P86003Q62522R58427J066689J184803
58207A7966867J327064J504420J711398J948733K238740K602280L044368L581086
$$ y = [2323587, 2376656, 2418079, 2447727, 2467864, 2479426, 2483503, 2484497, 2487655, 2494672, 2505157, 2520567, 2542778, 2570659, 2602174, 2638059, 2679397, 2723765, 2768318, 2814587, 2865455, 2919580, 2973906, 3029603, 3090029, 3154700, 3220992, 3290058, 3365135, 3445513, 3528214, 3614235, 3706969, 3805736, 3907157, 4011727, 4122698, 4239719, 4360234, 4486045, 4621718, 4767442, 4920217, 5080966, 5253484, 5437482, 5629924, 5832132, 6048225, 6277875, 6518326, 6772139, 7044961, 7337221, 7646506, 7976329, 8333482, 8718639, 9129262, 9569824, 10048844, 10567980, 11125311, 11727471, 12386726, 13108423, 13894426, 14756948, 15715375, 16782064, 17966867, 19293931, 20798351, 22509749, 24458482, 26697222, 29299502, 32343870, 35924956]
58199C5924956M252627N086311O076368P227414Q589487J0233262J2245270J4784827
58191A04420522J8084982K2346702K7678169L4075656M1078503M7025168M8803899
58184C43513601M3161020K9106315R307626j1088705k7325177l7174014m0997424
58177C08503242m0462619l7356316l3080474k8559708k4281235k0434947j7085247
58170A07242696j4242409j1853113r830700q118268o686904n486303m447650l527925
58162D3049424k703385j924831j126830k74502O48540J675693K773186L670442
58154D5787737L870234K974918J066147j261950l275046m526725m991154m893562
58146C4750599m485166l943772l380946k862024k411186k025948j700769j434015
$$ y = [35924956, 40177583, 45263894, 51340262, 58567676, 67157163, 77390425, 89635695, 104420522, 122505504, 144852206, 172530375, 206606031, 247684534, 294709702, 343513601, 386674621, 415780936, 425088562, 413999857, 386674680, 349500666, 308503242, 268040623, 230684307, 197603833, 169044125, 144762890, 124327943, 107242696, 93000287, 81147174, 71316474, 63198206, 56511302, 51024999, 46577349, 43049424, 40346039, 38421208, 37294378, 37019876, 37668416, 39344109, 42117295, 45787737, 49657971, 52632889, 53699036, 52437086, 49162040, 44635315, 39644161, 34750599, 30265433, 26321661, 22940715, 20078691, 17667505, 15641557, 13940788, 12506773]
58138A2506773j218198j038721q85705p57803o52660n63178m86040m24663l79661
58129F100144l44257l13257k89004k73628k62290k49306k34917k20845k04867
58120C707773j85302j65783j50029j35973j20240j04376r1746q2091p4184p0134
58110B527915p1787p5759p6934p4488p0370o4608n6464m7736m0836l5719l2111
58099A881103l2019l6451m2285m6094m8503n1364n3426n2560m9774m7229m4558
58088A376840m0726l7158l5442l4172l1504k8722k7872k8075k7506k6813k7212
58077A031638k7388k5682k3245k1771k0224j7163j4062j2891j2515j0995r359
58066H36343r505j0337r709q314q034q099o757n057n232o660p248p459r165j1581
$$ y = [12506773, 11288575, 10249854, 9364149, 8606346, 7953686, 7390508, 6904468, 6479805, 6100144, 5755887, 5442630, 5153626, 4879998, 4617708, 4368402, 4133485, 3912640, 3707773, 3522471, 3356688, 3206659, 3070686, 2950446, 2846070, 2754324, 2672233, 2598049, 2527915, 2456128, 2380369, 2303435, 2228947, 2158577, 2093969, 2037505, 1989769, 1948933, 1913214, 1881103, 1849084, 1812633, 1770348, 1724254, 1675751, 1624387, 1570961, 1518401, 1468627, 1421398, 1376840, 1336114, 1298956, 1263514, 1229342, 1197838, 1169116, 1141244, 1113169, 1085663, 1058850, 1031638, 1004250, 978568, 955323, 933552, 913328, 896165, 882103, 869212, 856697, 845702, 836343, 826838, 816501, 806792, 798478, 790444, 782345, 775588, 770531, 765299, 758639, 751391, 743932, 734767, 723186]
58052G23186j2215j1059j0164r782q475o499n594n734n295m186l784m089l803
58039F32507k927k577k548j687k45O51J294K614L722K935P92n77o76p00q54k34
58023F31490R71J647J898K678L665L842L693M489N735N876N155N332O697P817
58009F90985Q131Q358Q326O742L357o60m596q623j2347j4897j6357j7481j8101
57996F32837j7555j6335j5439j4353j1725p813m330j887M21K816M079L348J186
57983E55250j300l183l703k759j333l93K00Q15J025O79Q85K343L708L415K144
57968E57793J542J438M91j196k355k875l521l838k737q42rn55j067q36m09J09
57952E41133J228K595L322L680M591N649N690N033M962N153L941J223j288k857
$$ y = [723186, 710971, 699912, 689748, 679966, 671491, 664992, 659398, 653664, 648369, 644183, 640399, 636310, 632507, 629580, 627003, 624455, 622768, 622523, 623174, 624468, 627082, 630804, 633739, 634531, 633954, 633278, 632578, 631724, 631490, 632461, 634108, 636006, 638684, 642349, 646191, 649884, 654373, 660108, 665984, 671139, 676471, 683168, 690985, 699116, 707474, 715800, 722542, 725899, 725239, 720643, 712020, 699673, 684776, 668419, 650938, 632837, 615282, 598947, 583508, 569155, 557430, 549617, 545287, 543400, 543821, 546637, 550716, 554064, 555250, 553950, 550767, 547064, 544305, 542972, 542579, 542779, 543594, 544619, 545298, 546183, 548526, 552234, 555649, 557793, 559335, 560773, 561264, 560068, 557713, 554838, 551317, 547479, 544742, 543900, 543891, 543336, 542269, 541433, 541024, 541133, 542361, 544956, 548278, 551958, 556549, 562198, 567888, 572921, 577883, 583036, 586977, 588200, 586912, 584055]
57938E84055m577o984q999r805r821r379q226o793o199o528o700o338o120o111
57924D81475n659n250o431r313j1871j2391j1040q533n082j257J709L393M633
57911D14383N959O846O980O932P086P147P091P275P383O706N808O223Q086R630
57897E13535R595Q636P672O385M248J725n02k486m400n869o582o780o733o465
57883E11979o247o428o592n900m446l228k640k149j465q29J0J645L662M864N110
57868D87346N576O746P615P315O166M735L106J563N95j64j632l540m440l961l448
57853E13578l752l997l322k322j767j292m57J51L5n9P79K176L144L416L300K885
57837E12496K241J738J409O20j002k969m674o104p322q093q489r060r909j0448
$$ y = [584055, 579478, 572494, 563495, 553690, 543869, 534490, 526264, 519471, 513272, 506744, 500044, 493706, 487586, 481475, 475816, 470566, 464135, 454822, 442951, 430560, 419520, 410987, 405905, 404648, 406357, 409750, 414383, 420342, 427188, 434168, 441100, 448186, 455333, 462424, 469699, 477082, 483788, 489596, 495819, 503905, 513535, 523130, 531766, 539438, 545823, 550071, 551796, 551294, 548808, 544408, 538539, 531957, 525177, 518444, 511979, 505732, 499304, 492712, 486812, 482366, 479138, 476498, 474349, 472884, 472055, 472065, 473710, 477372, 482236, 487346, 492922, 499668, 507283, 514598, 520764, 525499, 528605, 530168, 530763, 530599, 528967, 525427, 520987, 517026, 513578, 509826, 505829, 502507, 500185, 498418, 497126, 496669, 496820, 496855, 496796, 497575, 499751, 502895, 506311, 509611, 512496, 514737, 516475, 517884, 518504, 517502, 514533, 509859, 503755, 496433, 488340, 479851, 470791, 460882, 450434]
57823D50434j0460j0442j0507j0018q835p793p312o663n320m016l594l799l940
57810C57735l908l632k544n25J381K159K153K403L270M539O243Q595J1403J4173
57796D03445J6320J6971J5349J1932Q505O401N335M437L576K913K015L67j749
57783D95817l607m974o000o763p349q017q779r265r267q908q075o565m942m229
57769C99077m285l704j895j26L91K76Q05J922K660K849L130L711M255M692N190
57754D18948N513N297M809M654M896N093N008M784M609M693N248O113O744O920
57740D93329P054P466P917Q187Q471Q836R022R143R806J1049J2048J2489J3237
57727F18054J4915J6695J7524J7747J8494K0010K1688K3310K5229K7547L0048
$$ y = [450434, 439974, 429532, 419025, 409007, 400172, 392379, 385067, 378404, 373084, 369068, 365474, 361675, 357735, 353827, 350195, 347651, 347126, 348507, 350666, 352819, 355222, 358492, 363031, 369274, 377869, 389272, 403445, 419765, 436736, 452085, 464017, 472522, 478923, 484258, 488695, 492271, 495184, 497199, 497566, 495817, 492210, 487236, 481236, 474473, 467124, 459107, 450328, 441063, 431796, 422888, 414813, 408248, 403306, 399077, 394792, 391088, 389193, 389067, 389458, 389734, 390539, 392461, 395121, 397970, 401100, 404811, 409066, 413758, 418948, 424461, 429758, 434567, 439221, 444117, 449210, 454218, 459002, 463611, 468304, 473552, 479665, 486409, 493329, 500383, 507849, 515766, 523953, 532424, 541260, 550282, 559425, 569231, 580280, 592328, 604817, 618054, 632969, 649664, 667188, 684935, 703429, 723439, 745127, 768437, 793666, 821213, 851261]
57716H51261L2732L5730L8904M2177M6000N0917N6957O3900P1708Q0304Q9479
57705A460069R9543J11369J25241J40305J55780J71894J88840K05565K20425K32294
57695C111325K39992K41306K33655K15324J85467J43898R2343L5355k1290p3202
57685D404173j17703j52738j77032j91107j96699j95210j87710j76007j62094
57676B847873j46519j28605j08415q7187o5621m3065j8722P226L3728N8340P5856
57665B424889P8906O2103K6561j9363o3763r6570j13299j15312j07068r2984p6230
57654A907870n9069m2956k8215j4401j185J1499K3923L6497M9218O1857P4654
57643B019692Q8216J02772J18040J33683J49414J64669J78825J91417K01512K07000
$$ y = [851261, 883993, 919723, 958627, 1000804, 1046804, 1097721, 1154678, 1218578, 1290286, 1370590, 1460069, 1559612, 1670981, 1796222, 1936527, 2092307, 2264201, 2453041, 2658606, 2879031, 3111325, 3351317, 3592623, 3826278, 4041602, 4227069, 4370967, 4463310, 4498665, 4477375, 4404173, 4286470, 4133732, 3956700, 3765593, 3568894, 3373684, 3185974, 3009967, 2847873, 2701354, 2572749, 2464334, 2377147, 2311526, 2268461, 2249739, 2256965, 2290693, 2349033, 2424889, 2503795, 2565898, 2592459, 2573096, 2509333, 2412763, 2299464, 2184152, 2077084, 1984100, 1907870, 1848801, 1805845, 1777630, 1763229, 1762044, 1773543, 1797466, 1833963, 1883181, 1945038, 2019692, 2107908, 2210680, 2328720, 2462403, 2611817, 2776486, 2955311, 3146728, 3348240, 3555240]
57633C555240K05215J94221J73104J41586J00523N2656J963m7947r4191j33938
57623D148432j64775j86078j99039k04992k04569j98682j89270j78339j66826
57614B455862j54813j42387j29848j17589j06089r5739q6512p8074p0301o3285
57604A411225n6931n1074m5892m1612l7835l3869k9855k6763k5059k4036k2667
57593A015632k0603j8094j5579j3582j2460j1908j1140r762q041o269m455k730
57581H81009j497q71m43J88J061K083L175M149M934N853P176Q470R138R534J0647
57566I44606J2568J4333J5486J6861J9229K2136K4793K7366L0553L4439L8553
57555A200923M2835M7769N3656O0257O7196P4398Q2162R0936J00899J11727J22983
$$ y = [3555240, 3760455, 3954676, 4127780, 4269366, 4369889, 4422545, 4424508, 4376561, 4282370, 4148432, 3983657, 3797579, 3598540, 3393548, 3188979, 2990297, 2801027, 2622688, 2455862, 2301049, 2158662, 2028814, 1911225, 1805136, 1709397, 1622885, 1544811, 1474510, 1411225, 1354294, 1303220, 1257328, 1215716, 1177881, 1144012, 1114157, 1087394, 1062335, 1038299, 1015632, 995029, 976935, 961356, 947774, 935314, 923406, 912266, 902504, 894463, 888194, 883739, 881009, 879512, 878641, 878198, 878386, 879447, 881530, 884705, 888854, 893788, 899641, 906817, 915287, 924425, 933959, 944606, 957174, 971507, 986993, 1003854, 1023083, 1045219, 1070012, 1097378, 1127931, 1162370, 1200923, 1243758, 1291527, 1345183, 1405440, 1472636, 1547034, 1629196, 1720132, 1821031, 1932758, 2055741]
57544B055741J34658J46804J58594J68266J74147J75197J70470J58677J38731
57535C481285J10399P4566L3482r182m9457q4818j14336j37209j52276j59410
57525B993044j60299j57021j50518j41208j30192j18860j07803r7036q6840p7467
57515A765800o8493n9458n0881m3641l7601l1831k6089k0976j6675j2586q481
57504A389088m928k230K81L383P047J0876J4850J9178K3759K8324L2927L7958
57492A560513M3736N0348N7740O5815P4548Q4054R4396J05303J16419J27690J39143
57481B519705J50061J58862J63979J64411J59140J46449J24686R3905N6389J5397
57471C752984k6280o6383j02362j31463j52015j64284j69655j69231j63743j54591
$$ y = [2055741, 2190399, 2337203, 2495797, 2664063, 2838210, 3013407, 3183877, 3342554, 3481285, 3591684, 3666250, 3699732, 3690550, 3641093, 3556275, 3441939, 3304730, 3152454, 2993044, 2832745, 2675724, 2525206, 2383998, 2253806, 2134946, 2027143, 1930107, 1843267, 1765800, 1697307, 1637849, 1586968, 1543327, 1505726, 1473895, 1447806, 1426830, 1410155, 1397569, 1389088, 1384160, 1381930, 1382211, 1385594, 1392641, 1403517, 1418367, 1437545, 1461304, 1489628, 1522555, 1560513, 1604249, 1654597, 1712337, 1778152, 1852700, 1936754, 2031150, 2136453, 2252872, 2380562, 2519705, 2669766, 2828628, 2992607, 3157018, 3316158, 3462607, 3587293, 3681198, 3737587, 3752984, 3726704, 3660321, 3557959, 3426496, 3274481, 3110197, 2940542, 2771311, 2607568, 2452977]
57461B452977j43979j33558j23433j12958j02070r1368q1276p1863o3310n5917
57451A473245m9633m4179l9617l6188l3502l0587k7002k3312k0239j7833j5861
57440A135292j4359j3300j2161j0526q791p586o713n489m062l436l844m013k717
57427A038295n06R86J154R61J383K169K521K252J748J253Q73J004K096L905N538
57412A065632O331O388O166N916N674N423N187N089N429O353P444P991P811P380
57398A154214P106O929O821P114P879Q535Q577Q443Q900R833J0369J0181R905
57385A264806J0056J0287J0149J0010J0561J1642J2245J1727J0593R841R858J0242
57373A392017J0547J0849J1460J2307J2968J3286J3611J4262J4986J5289J5128
$$ y = [2452977, 2308998, 2175440, 2052007, 1939049, 1836979, 1745611, 1664335, 1592472, 1529162, 1473245, 1423612, 1379433, 1339816, 1303628, 1270126, 1239539, 1212537, 1189225, 1168986, 1151153, 1135292, 1120933, 1107633, 1095472, 1084946, 1076155, 1068569, 1061856, 1056367, 1052305, 1048869, 1045025, 1041012, 1038295, 1037789, 1038775, 1039929, 1040890, 1042273, 1044442, 1046963, 1049215, 1050963, 1052216, 1053089, 1054093, 1056189, 1060094, 1065632, 1071963, 1078351, 1084517, 1090433, 1096107, 1101530, 1106717, 1111806, 1117235, 1123588, 1131032, 1139023, 1146834, 1154214, 1161320, 1168249, 1175070, 1182184, 1190063, 1198598, 1207175, 1215618, 1224518, 1234351, 1244720, 1254901, 1264806, 1274862, 1285149, 1295298, 1305308, 1315869, 1327511, 1339756, 1351483, 1362076, 1371917, 1381775, 1392017, 1402564, 1413413, 1424873, 1437180, 1450148, 1463434, 1477045, 1491307, 1506293, 1521582, 1536710]
57362A536710J4909J4853J4811J4825J5368J6625J7836J7916J6741J5399J5007
57351A711000J5511J5873J5330J4211J3479J3665J4328J4610J4169J3492J3254
57340A868922J3610J4270J5100J6213J7485J8413J8779J9113K0026K1317K2224
57329B065472K2522K2745K3188K3425K3201K3176K4173K5943K7421K8031K8120
57318B337417K8179K8363K8864K9981L1538L2811L3511L4306L5924L8167M0321
57307B699382M2228M4218M6233M7698M8353M8599M8837M8867M8244M6908M5095
57296C214662M2804L9615L5091K9234K2446J5174P736M99n900j0847j4225j6368
57284C359921j7543j7709j6920j5520j3719j1344q337n233k677o52J379L698O132
$$ y = [1536710, 1551619, 1566472, 1581283, 1596108, 1611476, 1628101, 1645937, 1663853, 1680594, 1695993, 1711000, 1726511, 1742384, 1757714, 1771925, 1785404, 1799069, 1813397, 1828007, 1842176, 1855668, 1868922, 1882532, 1896802, 1911902, 1928115, 1945600, 1964013, 1982792, 2001905, 2021931, 2043248, 2065472, 2087994, 2110739, 2133927, 2157352, 2180553, 2203729, 2227902, 2253845, 2281266, 2309297, 2337417, 2365596, 2393959, 2422823, 2452804, 2484342, 2517153, 2550664, 2584970, 2620894, 2659061, 2699382, 2741610, 2785828, 2832061, 2879759, 2928112, 2976711, 3025548, 3074415, 3122659, 3169567, 3214662, 3257466, 3297081, 3332172, 3361406, 3383852, 3399026, 3406762, 3407261, 3401361, 3390514, 3376289, 3359921, 3342378, 3324669, 3307749, 3292229, 3278510, 3267166, 3258829, 3253596, 3250919, 3250267, 3251646, 3255344, 3261476]
57271C261476Q558J1101J3761J6209J8127J9476K0451K1358K2445K3565K4148
57260C460675K3946K3549K3683K4113K3941K3065K2487K2908K3753K4021K3534
57249C719675K2832K2300K2005K2058K2457K2798K2651K2171K1907K2119K2640
57238C965613K3185K3489K3391K3183K3567K4788K6073K6558K6432K6500K6790
57227D239569K6549K5592K4693K4362K4095K3343K2454K2036K1975K1784K1529
57216D497981K1694K2243K2559K2325K1988K2141K2801K3482K3768K3781K4124
57205D748887K5235K6751K7816K8077K8146K8652K9342K9542K9219K8920K8796
57194E059383K8453K7865K7641K8085K8593K8455K7755K6996K6280K5394K4371
$$ y = [3261476, 3270034, 3281135, 3294896, 3311105, 3329232, 3348708, 3369159, 3390517, 3412962, 3436527, 3460675, 3484621, 3508170, 3531853, 3555966, 3579907, 3602972, 3625459, 3648367, 3672120, 3696141, 3719675, 3742507, 3764807, 3786812, 3808870, 3831327, 3854125, 3876776, 3898947, 3920854, 3942973, 3965613, 3988798, 4012287, 4035678, 4058861, 4082428, 4107216, 4133289, 4159847, 4186279, 4212779, 4239569, 4266118, 4291710, 4316403, 4340765, 4364860, 4388203, 4410657, 4432693, 4454668, 4476452, 4497981, 4519675, 4541918, 4564477, 4586802, 4608790, 4630931, 4653732, 4677214, 4700982, 4724763, 4748887, 4774122, 4800873, 4828689, 4856766, 4884912, 4913564, 4942906, 4972448, 5001667, 5030587, 5059383, 5087836, 5115701, 5143342, 5171427, 5200020, 5228475, 5256230, 5283226, 5309506, 5334900, 5359271]
57183E359271K3337K2020K0094J7903J6195J5091J3994J2687J1732J1472J1294
57172E535090J0568R821J0235J2088J4467J6494J8218K0104K2232K4383K6527
57161E720227K8858L1610L5121L9862M5964N2631N8145O0536N8540N2329M3498
57150F227321L4039K5001J6268P595o07p610j2984j6512j8000j7780j6979j6639
57138F203113j6708j6522j6022j5749j5754j5455j4765j4451j5040j6093j7117
57127F029437j8467k0774k3860k6843k9000l0056k9915k8595k6091k1901j5033
57116E758902n111O746J8831L0412M1816N3225O4207P4596Q5144R7174J12189
57105F338131J31969J58472J93173K36799K89925L53684M30061N22095O33988
$$ y = [5359271, 5382608, 5404628, 5424722, 5442625, 5458820, 5473911, 5487905, 5500592, 5512324, 5523796, 5535090, 5545658, 5555479, 5565714, 5577802, 5592269, 5608763, 5626981, 5647085, 5669317, 5693700, 5720227, 5749085, 5780695, 5815816, 5855678, 5901642, 5954273, 6012418, 6072954, 6131494, 6183823, 6227321, 6261360, 6286361, 6302629, 6310224, 6309617, 6302007, 6289023, 6272511, 6254511, 6236731, 6219752, 6203113, 6186405, 6169883, 6153861, 6138112, 6122358, 6106903, 6092138, 6077687, 6062647, 6046554, 6029437, 6010970, 5990196, 5966336, 5939493, 5910493, 5880437, 5850522, 5821927, 5795836, 5773935, 5758902, 5753791, 5760537, 5779368, 5809780, 5851596, 5904821, 5969028, 6043624, 6128768, 6225942, 6338131, 6470100, 6628572, 6821745, 7058544, 7348469, 7702153, 8132214, 8654309, 9288297]
57096I288297P70338R34497J127251J346632J588448J847113K116495K389767
57088B1408838K657467K905382L114964L266316L340694L322074L200740K978508
57080D6194983K668047K281433J817082J261739O11163j08433q39933j518049
57072E2368032k095994k556252k902642l145506l292335l347296l315775l208326
57064B8503906l040698k830544k593972k344561k094206j853397j629966j427915
57056A0688647j247761j088125r47186q23444p15740o22776n42626m73119m12759
57047C815111l60917l16881k79220k46508k18332j94879j75731j59694j45726
57038A717223j33422j22462j12326j02753r3981q6166p8964p1982o5195n8689
$$ y = [9288297, 10058635, 10993132, 12120383, 13467015, 15055463, 16902576, 19019071, 21408838, 24066305, 26971687, 30086651, 33352967, 36693661, 40015735, 43216475, 46194983, 48863030, 51144463, 52961545, 54223284, 54834447, 54726014, 53886081, 52368032, 50272038, 47715786, 44813144, 41667638, 38375303, 35028007, 31712232, 28503906, 25463208, 22632664, 20038692, 17694131, 15599925, 13746528, 12116562, 10688647, 9440886, 8352761, 7405575, 6582131, 5866391, 5243615, 4700989, 4227870, 3815111, 3454194, 3137313, 2858093, 2611585, 2393253, 2198374, 2022643, 1862949, 1717223, 1583801, 1461339, 1349013, 1246260, 1152279, 1066113, 987149, 915167, 849972, 791283]
57028G91283n2412m6517m1550l7764l4656l1561k8451k5640k2978j9974j6606
57017D33174j3481j1145r632q621p632o095l641k88L943R355J6153K4065L3159
57004D59314M4636N9983P9781J04491J35286J70471J99213K02218J64122Q7862
56994A707377m228q4730j37066j59843j60422j47448j27798j06258q5437o6137
56984F28010m8611l3539k1939j4682j2223j4126j8718k3593k6922k8222k7920
56973C57515k6658k5021k3408k1761j9610j6663j3149r565o299l559j253J202
56961A91771M589R159J4478K0107K5853L0786L2542K8518J8218M149r649j9959
56949C50562k5565k6980k5563k2769j9759j7094j4600j1649p917l895m50K217
$$ y = [791283, 738871, 692354, 650804, 613040, 578384, 546823, 518372, 492732, 469754, 449780, 433174, 419693, 408548, 398916, 390295, 382663, 376568, 372927, 372639, 376582, 385937, 402090, 426155, 459314, 503950, 563933, 643714, 748205, 883491, 1053962, 1253175, 1455393, 1619515, 1707377, 1703149, 1618419, 1481353, 1321510, 1161088, 1013640, 885842, 779584, 694147, 628010, 579399, 545860, 523921, 509239, 497016, 482890, 464172, 440579, 413657, 385435, 357515, 330857, 305836, 282428, 260667, 241057, 224394, 211245, 201680, 195381, 191822, 190569, 191771, 196360, 205519, 219997, 240104, 265957, 296743, 329285, 357803, 376021, 380170, 370521, 350562, 324997, 298017, 272454, 249685, 229926, 212832, 198232, 186583, 178666, 174771, 174321, 176538]
56937A76538M833Q216J2439J7075K1980K7492L3758L9814M3198M0638L0084J2844
56925D68909o412k2395l2418l7006l7984l6572l3340k9121k5149k2193j9860j7177
56913A49282j3820j0566q302o932n687m298l267k878k665k119j378p54k04L18
56899H6730N06L23N27J833L841N483O367P005P935R374J1538J4539J7956K1125
56885A95082K3698K5049K3599J7973R086l0o952j1463j4206j5092j3941j1650
56873B21153r422p258m350p73K366M525O483R232J2911J7227K2382K8954L7079
56860C40509M5974N3987N8604N6744M6113K7209M117j7251l2351l9967m1568l9359
56848D62761l5024k9610k3735j7716j1737n890k2O239J2984J9890K6987L5304
$$ y = [176538, 181371, 189587, 202026, 219101, 241081, 268573, 302331, 342145, 385343, 425981, 456065, 468909, 462497, 440102, 407684, 370678, 332694, 296122, 262782, 233661, 208512, 186319, 166459, 149282, 135462, 124896, 116594, 109662, 103975, 99677, 96410, 93532, 90867, 88748, 87370, 86616, 86412, 86730, 87236, 87559, 88086, 89919, 93760, 99243, 105610, 112615, 120550, 129924, 141462, 156001, 173957, 195082, 218780, 243829, 267428, 285401, 294487, 294457, 287505, 276042, 261836, 246744, 232803, 221153, 211731, 204473, 200123, 199350, 201716, 206241, 212724, 221956, 234867, 252094, 274476, 303430, 340509, 386483, 440470, 499074, 555818, 601931, 629140, 633257, 616006, 583655, 543688, 502120, 462761, 427737, 398127, 374392, 356676, 344939, 339049, 339027, 345266, 358250, 378140, 405127, 440431]
56836D40431M6082N9462P4180Q8006R7344R6889Q1763N1680J2838k5111n4303
56825I69261p1620p8027p6452p0038o1206n1384m1391l1843k3184j5587q963k945
56813D36621L184J0178J8316K7534L8053N0214O3051P3174P5612O6268M4465J4112
56801I20782j7532m3307n9590o6843o7319o3044n5885m8070m1259l5416k9547
56790C92970k3420j7839j3293r187m593P75O648J2899J9768K7232L4041L7497
56778D63498L4726K4700R184q227k3840l4969m0430m0772l7872l3631k9034k4395
56766B58938k0091j6594j4052j2338j1356j0898j0410r307p517n486l772k835
56754A34282k877l502l865l489k735k244k109k070k014j903j488p07p1j14n76
$$ y = [440431, 486513, 545975, 620155, 708161, 805505, 902394, 984157, 1035837, 1048675, 1023564, 969261, 897641, 819614, 743162, 673124, 611918, 560534, 519143, 487300, 464116, 448529, 439566, 436621, 439805, 449983, 468299, 495833, 533886, 584100, 647151, 720325, 795937, 862205, 906670, 920782, 903250, 859943, 800353, 733510, 666191, 603147, 547262, 499192, 457933, 422517, 392970, 369550, 351711, 338418, 329231, 324638, 325413, 332061, 344960, 364728, 391960, 426001, 463498, 498224, 522924, 532108, 523881, 500041, 465072, 424642, 383870, 345998, 312367, 283333, 258938, 238847, 222253, 208201, 195863, 184507, 173609, 163199, 153892, 146375, 140889, 137117, 134282, 131405, 127903, 124038, 120549, 117814, 115570, 113461, 111391, 109377, 107474, 105986, 105279, 105208, 105094, 104518]
56739A04518p90o49n99p55p49m53j90j66j74j08k22o30r98r49n42r9J52Q5l77
56720I6305j101j668j669j087l12J95K32o0l87n76o15n38l50p6K79P35J134J084
56702I1525M59j55j1P92J392J408J488K243L258L680L343K811K520K395K151J584
56686A20883P20n3j85L39Q30O53r6r33j613k037k057j790j783k240k439j621k04
56669A06374N66J06r02j504j475j275j364j743j978j645q40j06J53L8j84m46p33
56652I3042r32r86r21o16KM96K56n16q71l91L21P47J174J831K176J733R17L08
56634I7770j42n17l30N64J327J356J376K156K878K169L05j082j200p03k19K59
56618A05967N60J63q35j659j867j644j125l35K98L64L23Q46J533J374M43k25l65
$$ y = [104518, 103728, 103079, 102480, 101725, 100976, 100523, 100333, 100167, 99993, 99885, 99663, 99033, 98035, 97086, 96544, 96445, 96597, 96682, 96305, 95204, 93536, 91867, 90780, 90468, 90663, 90895, 90835, 90448, 89872, 89257, 88719, 88369, 88293, 88572, 89307, 90441, 91525, 91984, 91829, 91818, 92610, 94002, 95410, 96898, 99141, 102399, 106079, 109422, 112233, 114753, 117148, 119299, 120883, 121603, 121550, 121365, 121704, 122534, 123187, 123091, 122158, 120545, 118508, 116451, 114661, 112878, 110638, 108199, 106578, 106374, 106940, 107046, 106144, 104640, 103165, 101890, 100526, 98783, 96805, 95160, 94320, 94214, 94367, 94405, 94221, 93775, 93042, 92110, 91124, 90203, 89587, 89589, 90085, 90341, 89825, 88954, 88563, 88884, 89631, 90805, 92636, 94812, 96545, 97462, 97770, 97628, 97111, 96781, 97345, 98672, 100028, 101404, 103560, 106438, 108607, 108912, 107830, 106630, 105927, 105708, 105967, 106527, 106690, 105855, 104196, 102329, 100685, 99560, 99225, 99523, 99887, 100210, 101056, 102589, 103963, 104406, 104181, 103816]
56601A03816o99j283j162o3R48J087Q80R68J064P98N98R38J527J940K266K562
56585A16185K429J788J324J524J899J839J492J283J097O55J49m8M5K25M68P21
56569A33075Q17R30J557K646L355L169K710K889L702M413M518M114L526L056K861
56554A77338K874K970L231L717M039L751L062K556K224J572P00K73K83j76j436
56539B06978k566k697k198j923k050k289k550k779k705k330k166k460k711k498
56525A73056k210k370k769k891k737k639k682k771k965l175k973k223j501j413
56511A37737j796k039j922j673j509j451j441j341j030o31l45k3O22J360J592
56496A26110J275J064J340J764J987K110K187J996J584J402J615J946K420L334
$$ y = [103816, 103117, 101834, 100672, 100609, 101557, 102644, 103524, 104492, 105556, 106354, 106952, 107890, 109417, 111357, 113623, 116185, 118614, 120402, 121726, 123250, 125149, 126988, 128480, 129763, 130860, 131515, 131664, 131616, 131661, 131886, 132354, 133075, 133892, 134822, 136379, 139025, 142380, 145549, 148259, 151148, 154850, 159263, 163781, 167895, 171421, 174477, 177338, 180212, 183182, 186413, 190130, 194169, 197920, 200982, 203538, 205762, 207334, 208034, 208307, 208590, 208414, 206978, 204412, 201715, 199517, 197594, 195544, 193255, 190705, 187926, 185221, 182891, 180725, 178265, 175554, 173056, 170846, 168476, 165707, 162816, 160079, 157440, 154758, 151987, 149022, 145847, 142874, 140651, 139150, 137737, 135941, 133902, 131980, 130307, 128798, 127347, 125906, 124565, 123535, 122904, 122559, 122536, 123158, 124518, 126110, 127385, 128449, 129789, 131553, 133540, 135650, 137837, 139833, 141417, 142819, 144434, 146380, 148800, 152134]
56482A52134M264M132K754J382J078J468J733J914K323K577K172J515J387J817
56468A82650K232K385K340J937J075K01j43r3j60n15j022j640k211k215j412m19
56452A82990p3l82o02k34N19J121J246J098J296K165L128L283K582J844J570J541
56436B03092J611J947K240J718M28n30n34k40l30m91l43l22q03j275j307j451
56420B03410k208k911k721k037j783j851j466o38j98n18j137j501j368p35J00
56405A82438N93O39P22R90Q51J5q42j050q72p07k56O62J315J114P15R99J625J687
56387A90638J214Q94Q33P51Q59J432J962J876J626J916K339K000J080N27N35O24
56371B11106Q78J758K806K997K304J730J743J902J999K326K751K675K124J807
$$ y = [152134, 156398, 160530, 163284, 164666, 165744, 167212, 168945, 170859, 173182, 175759, 177931, 179446, 180833, 182650, 184882, 187267, 189607, 191544, 192619, 192820, 192677, 192584, 192424, 191909, 190887, 189247, 187036, 184821, 183409, 182990, 182917, 182535, 181933, 181699, 182218, 183339, 184585, 185683, 186979, 189144, 192272, 195555, 198137, 199981, 201551, 203092, 204703, 206650, 208890, 210608, 211036, 210506, 209972, 209732, 209402, 208911, 208568, 208246, 207443, 206168, 204861, 203410, 201202, 198291, 195570, 193533, 191750, 189899, 188433, 187795, 187597, 187079, 185942, 184441, 183073, 182338, 182438, 183031, 183670, 184392, 185382, 186233, 186248, 185406, 184356, 183484, 182777, 182521, 183183, 184498, 185612, 186327, 187326, 188951, 190638, 191852, 192746, 193579, 194330, 195189, 196621, 198583, 200459, 202085, 204001, 206340, 208340, 209420, 209947, 210482, 211106, 211984, 213742, 216548, 219545, 221849, 223579, 225322, 227224, 229223, 231549, 234300, 236975, 239099, 240906]
56357B40906J927J982J892K248L187L974M052L698L361L147L202L832M900N743
56343B88051O016O116O517P139P514P254O326N151M350M068L731K826J664Q48
56329C57571L90q5o28j087j670k616l512l605k728j401k13M19K60l68o16o2O40
56312C40689P14L32J53K73M29P24J279J614J344J102J768K981L500K942K239K320
56296C64403L154M158M906N340N698O235O883P456Q242R746J1619J2763J2978
56283D63581J3391J4626J5784J6170J6772J8635K0940K2335K3376K5727K9468
56272F80805L3120L6167L9753M4636N0120N5400O0601O6058P1688P7509Q3889
56261A299746R0809R7511J03186J07437J10045J10744J09343J05737R9961R2452
$$ y = [240906, 242833, 244815, 246707, 248955, 252142, 256116, 260168, 263866, 267227, 270374, 273576, 277408, 282308, 288051, 294067, 300183, 306700, 313839, 321353, 328607, 334933, 340084, 344434, 348502, 352233, 355059, 356723, 357571, 357961, 357876, 357248, 356161, 354491, 351875, 348363, 344758, 342030, 340629, 340416, 340835, 341095, 340727, 340111, 340049, 340689, 341403, 341735, 341888, 342161, 342590, 343314, 344593, 346207, 347551, 348653, 350421, 353402, 356902, 359844, 362083, 364403, 367557, 371715, 376621, 381961, 387659, 393894, 400777, 408233, 416475, 426221, 437840, 450603, 463581, 476972, 491598, 507382, 523552, 540324, 558959, 579899, 602234, 625610, 651337, 680805, 713925, 750092, 789845, 834481, 884601, 940001, 1000602, 1066660, 1138348, 1215857, 1299746, 1390555, 1488066, 1591252, 1698689, 1808734, 1919478, 2028821, 2134558, 2234519, 2326971]
56251B326971Q3867P4320O3501N1874M0951L1680K3481J5529Q077J597m354j0326
56239B707168j5982k1031k6293l2591l9508m6409n3733o1899o9903p6487q1915
56228B181417q6994r1236r3603r4368r4528r3996r2046q8941q5400q1077p5300
56217A203928o8767o2739n7137n1170m5158l9985l5387l0724k6793k4729k3702
56206G37637k1957j9566j7869j6625j4327j1083q597p086m864j366J839L674M958
56193F24768O520P865Q476Q742Q852Q238O661M694K730P47j023k323l597n122
56179F76228n976n396m533m936n931n734m507l816l473j753J260L406L893M287
56165F43019N528O593O822P144Q064Q721Q765R164J0281J1101J1158J1370J2334
$$ y = [2326971, 2410838, 2485158, 2548659, 2600533, 2641484, 2673164, 2696645, 2712174, 2720251, 2721848, 2717494, 2707168, 2691186, 2670155, 2643862, 2611271, 2571763, 2525354, 2471621, 2409722, 2339819, 2263332, 2181417, 2094423, 2003187, 1909584, 1815216, 1720688, 1626692, 1534646, 1445705, 1360305, 1279228, 1203928, 1135161, 1072422, 1015285, 964115, 918957, 878972, 843585, 812861, 786068, 761339, 737637, 715680, 696114, 678245, 661620, 647293, 636210, 627613, 620527, 615663, 614297, 616136, 619810, 624768, 631288, 639153, 647629, 656371, 665223, 673461, 680122, 684816, 687546, 688293, 687270, 684947, 681350, 676228, 670252, 664856, 660323, 655387, 649456, 643722, 639215, 635399, 631926, 630173, 631433, 634839, 638732, 643019, 648547, 655140, 661962, 669106, 677170, 685891, 694656, 703820, 714101, 725202, 736360, 747730, 760064]
56152G60064J3539J4919J7371K1200K5634L0295L5569M1382M7431N4665O4681
56141A126750P7699R3148J11917J35239J61185J84787K01872K10410K08316J93697
56131B705020J68488J39192J12626R2643Q0837P6960P7152P4615O4247M5798K2478
56120C660056j316k0741l2221l6333l7673m1394n1216o9851r7712j30380j60203
56109B981016j81734j93744j96321j89467j75243j57834j39989j21829j03813
56100A521042q7850p4581o2617n1556m2809l6531l0812k4936k0370j7442j4364
56089A057174j0599p907o782n254k598p47n29L8J981L402L120K924M236N726O249
56074A050434O985Q616R494Q714P981Q484Q877Q327Q451J0182J1753J1987J2521
$$ y = [760064, 773603, 788522, 805893, 827093, 852727, 883022, 918591, 959973, 1007404, 1062069, 1126750, 1204449, 1297597, 1409514, 1544753, 1705938, 1890725, 2092597, 2303007, 2511323, 2705020, 2873508, 3012700, 3125326, 3217969, 3298806, 3375766, 3452918, 3527533, 3591780, 3637578, 3660056, 3658740, 3637999, 3605778, 3569445, 3531772, 3490378, 3439162, 3369311, 3271599, 3141219, 2981016, 2799282, 2605538, 2409217, 2219750, 2044507, 1886673, 1746684, 1624855, 1521042, 1433192, 1358611, 1295994, 1244438, 1201629, 1165098, 1134286, 1109350, 1088980, 1071538, 1057174, 1046575, 1038668, 1031886, 1026632, 1024034, 1023287, 1022758, 1022796, 1024777, 1028179, 1031299, 1034223, 1038459, 1044185, 1050434, 1057419, 1066035, 1075529, 1084243, 1092224, 1100708, 1109585, 1117912, 1126363, 1136545, 1148298, 1160285, 1172806]
56061A172806J4632J6717J7164J6971J7506J8269J8714J9586K0870K1226K0741
56050A375202K1259K2834K3315K2553K3126K5584K7194K6909K7164K8987K9899
56039A654026K8729K7851K8419K8086K5951K4971K6749K8648K8881K9817L3265
56028A965393L7149L9867M3211M7992N1497N2405N3406N5977N7527N6828N7005
56017B518257N9887O2650O3405O4689O8082P1023P2472P5709Q1896Q7049Q9208
56006C314327R2150R8017J03097J05264J08543J15404J21713J24488J27500J33835
55996D444338J40170J43944J48872J57676J66952J74826J85671K01358K16394
55987E980201K27935K41646K61214K81583K99475L20462L48050L76447M02206
$$ y = [1172806, 1187438, 1204155, 1221319, 1238290, 1255796, 1274065, 1292779, 1312365, 1333235, 1354461, 1375202, 1396461, 1419295, 1442610, 1465163, 1488289, 1513873, 1541067, 1567976, 1595140, 1624127, 1654026, 1682755, 1710606, 1739025, 1767111, 1793062, 1818033, 1844782, 1873430, 1902311, 1932128, 1965393, 2002542, 2042409, 2085620, 2133612, 2185109, 2237514, 2290920, 2346897, 2404424, 2461252, 2518257, 2578144, 2640794, 2704199, 2768888, 2836970, 2907993, 2980465, 3056174, 3138070, 3225119, 3314327, 3406477, 3504494, 3607591, 3712855, 3821398, 3936802, 4058515, 4183003, 4310503, 4444338, 4584508, 4728452, 4877324, 5035000, 5201952, 5376778, 5562449, 5763807, 5980201, 6208136, 6449782, 6710996, 6992579, 7292054, 7612516, 7960566, 8337013, 8739219]
55978H739219M32067M70601N11810N51971N98554O56728P20214P85916Q63544
55969A4330624R59768J068077J186281J327677J502391J705995J940839K229130
55961B6250782K590817L031872L570585M247347N087735O085720P247593Q623799
55953F6736250J0284338J2317817J4887912J8231042K2556201K7991964L4548640
55946B07554164M1728675M7769643M9458935M3533540K9102344Q961234j1671243
55939D16437292k8030073l7903940m1675515m1043949l7833664l3468648k8877418
55932A67604085k4550691k0685623j7344756j4528145j2180375j0221630q594106
55925E9498759p259462o167597n261405m504439l877013l353206k905455k523398
$$ y = [8739219, 9171286, 9641887, 10153697, 10705668, 11304222, 11960950, 12681164, 13467080, 14330624, 15290392, 16358469, 17544750, 18872427, 20374818, 22080813, 24021652, 26250782, 28841599, 31873471, 35444056, 39691403, 44779138, 50864858, 58112451, 66736250, 77020588, 89338405, 104226317, 122457359, 145013560, 173005524, 207554164, 249282839, 297052482, 346511417, 390044957, 419147301, 428108535, 416437292, 388407219, 350503279, 308827764, 267783815, 229950151, 196481503, 167604085, 143053394, 122367771, 105023015, 90494870, 78314495, 68092865, 59498759, 52239297, 46071700, 40810295, 36305856, 32428843, 29075637, 26170182, 23646784]
55917B3646784k205655j939360j706545j502920j331861j186704j055959r39349
55909A1778431q42382p60938o86086o18401n63235n17143m72485m30490l96877
55900F490394l69139l40300l11115k86986k66784k45570k24657k08574j95612
55891D041657j81115j66630j56531j49044j39610j29632j23204j18578j11354
55882B765959j02912r7355r3324q6808p9098p4124p0917o6276o1893o1229o2136
55871A909887o0093n6068n3922n2675m8662m2860l8850l5589k9409k1302j5297
55860A455160j1197n502J946Q346J3204J7076J6874Q846m794j8028k8563l7901
55848A415467m5669m9820n1267n2585n3087n0415m5825m2642m0655l7215l2781
$$ y = [23646784, 21441129, 19501769, 17795224, 16292304, 14960443, 13773739, 12717780, 11778431, 10936049, 10175111, 9489025, 8870624, 8307389, 7790246, 7317761, 6887271, 6490394, 6121255, 5780955, 5469840, 5182854, 4916070, 4670500, 4445843, 4237269, 4041657, 3860542, 3693912, 3537381, 3388337, 3248727, 3119095, 2995891, 2877313, 2765959, 2663047, 2565692, 2472368, 2385560, 2306462, 2232338, 2161421, 2095145, 2033252, 1972023, 1909887, 1849794, 1793726, 1739804, 1687129, 1638467, 1595607, 1556757, 1521168, 1491759, 1470457, 1455160, 1443963, 1438461, 1440407, 1448753, 1461957, 1479033, 1495907, 1504753, 1499959, 1481931, 1453368, 1415467, 1369798, 1319978, 1268711, 1216126, 1163039, 1112624, 1066799, 1024157, 983502, 946287, 913506]
55837I13506l0140k9060k6891k3643k1612k0671j8720j5999j4353j3063r939n802
55825F83613l425k837j970j071k036m243n427n882p518r657j0044r254r737j1257
55811E99255j1578j0827j0889j1214r742p316o684p579p263n620n205o335o648
55798D92355n569n069n660n766n331o163q233r339q862q286p725n526j834P87
55784D09779R22n61l119p133j1601j4322j4962j5196j5546j4820j2840j0957r603
55771B80041p964o221n633o222o740o784o732o075m274k640k679l266k315n48
55757B11948l67j572j663j81Q34Q22J610L864N846O350O007N104K898k55k648
55742B38597l717m548n550n818n153m502m215l874l718m146m148k590o36l86j485
$$ y = [913506, 883366, 854306, 827415, 803772, 782160, 761489, 742769, 726770, 712417, 699354, 689415, 683613, 680188, 677351, 675381, 674310, 672274, 668031, 662604, 656722, 649204, 639547, 629503, 620249, 610512, 599255, 587677, 576850, 565961, 554747, 545005, 537689, 531005, 523426, 516163, 510543, 505338, 499003, 492355, 486786, 481717, 476057, 470291, 464960, 458797, 450564, 441225, 432363, 424077, 416352, 410826, 408992, 409779, 410701, 410140, 407021, 399888, 388287, 373965, 359003, 343807, 328261, 313441, 300601, 289644, 280041, 272077, 265856, 260223, 254001, 247261, 240477, 233745, 227670, 223396, 220756, 218077, 214811, 212496, 211948, 211581, 210009, 208346, 208165, 208999, 209821, 211431, 215295, 221141, 227491, 233498, 238602, 241500, 241245, 238597, 234880, 230332, 224782, 218964, 213811, 209309, 205094, 201220, 197502, 193356, 189208, 186618, 185982, 185596, 184111]
55727A84111j824j194j355k619l369l041k698k520j641m68l01n14Q36L402M749
55712A71554M439M739O588Q042P703O744O444O271N584M806L866J701j649m471
55698B32361n748o246o627o484n732m975l952j723J178K910L016K954L517L921
55684B08370L771L609L121J137j981m173m475l885l088j674J7P18M83P25J513
55669B04188J219m94j917k272k919m694o445p138p124o413m164r55Q56L27p36
55654A61319q05p80j806l121l618l621l716l482k850k972m416n884o066n373m748
55639A08061m143l264k575k489k653k792l147l547l376k820k721k859k143p51
55625F8781j82p55j093o33m56r37q98rK24r57k077j838j122j197j702j704j276
$$ y = [184111, 182287, 181093, 179738, 177119, 173750, 170709, 168011, 165491, 163850, 163382, 163081, 162567, 163403, 166805, 171554, 175993, 180732, 187320, 195362, 203065, 209809, 216253, 222524, 228108, 232914, 236780, 238481, 236832, 232361, 226613, 220367, 213740, 207256, 201524, 196549, 192597, 190874, 192052, 194962, 197978, 200932, 204449, 208370, 212141, 215750, 218871, 220008, 218027, 213854, 209379, 205494, 202406, 200732, 200749, 201467, 201950, 202675, 204188, 205407, 204913, 202996, 200724, 197805, 193111, 186666, 179528, 172404, 165991, 161827, 160872, 161728, 162055, 161319, 160514, 159734, 157928, 154807, 151189, 147568, 143852, 140370, 137520, 134548, 130132, 124248, 118182, 112809, 108061, 103918, 100654, 98079, 95590, 92937, 90145, 86998, 83451, 80075, 77255, 74534, 71675, 69532, 68781, 68599, 67844, 66751, 66118, 65662, 64725, 63827, 63818, 64042, 63085, 61008, 59170, 58048, 56851, 55149, 53445, 52169]
55608E2169q17j82M82M32k87o09k32q9m37l52K81L20m17n52L63R97P83R20J833
55589E4606K011P61l47k51k05j214k047j634j136j598j825p06M73K98j62N12J339
55572D8875R18L78J478L171L083J438N22R14J077L58k56l03l74m98o2O66P69L30
55554F2484K01K08n68j855k253j317l9P62J210J510J602J679J966K137J927J892
55538G1546K505L014K435J159K99o7o07j173j023m15m45j392k459l107l435l366
55522F3469k721k051k231l162l829l695l132k551k015j630j501j348q52k69p2
55507C2410k04l59o17j143j572j460j083j096j642k287k476j746j27J328J299
55492A9225%p82j52N82M1j031j073j67L96K95L53Q20J095R15N41o7j006j592j052
$$ y = [52169, 51352, 51170, 51652, 52084, 51797, 51188, 50956, 50867, 50430, 50078, 50359, 50679, 50262, 49710, 50073, 51070, 51853, 52773, 54606, 56617, 57378, 57031, 56780, 56575, 55361, 53314, 51680, 50544, 48946, 47121, 46415, 46888, 47186, 47024, 47536, 48875, 49793, 50171, 51649, 54820, 57903, 59341, 59863, 60777, 61854, 62212, 61956, 61653, 61279, 60781, 60719, 61385, 62154, 62484, 62685, 62893, 62325, 60470, 58217, 56900, 56861, 57623, 58833, 60343, 61945, 63624, 65590, 67727, 69654, 71546, 74051, 77065, 79500, 80659, 80958, 80891, 80284, 79111, 78088, 77673, 77228, 75836, 73377, 70270, 66835, 63469, 60748, 58697, 56466, 53304, 49475, 45780, 42648, 40097, 38082, 36452, 34951, 33603, 32751, 32482, 32410, 32206, 31847, 31230, 30087, 28515, 27055, 25972, 24876, 23234, 20947, 18471, 16725, 16598, 17926, 19225, 19225, 18443, 18291, 18873, 18914, 17883, 16810, 16643, 17039, 17334, 17687, 18507, 19602, 20517, 21058, 20991, 19985, 18393, 17341]
55473A7341M9L03n53j337j117k41M64O17K70k83n55l61j84m91r47r61p23q30j091
55454I370o55O00J665J556M38n87n53M66J444J546J141J203J749J762Q49o3k14
55437B1717j63p07j550j924j762j438r70l35O6Q0K42Q36J223R27N83Q92J402J351
55419B0470R53Q09O86R5n30l74M44J151J513J793J820J226K76m41q17j000q26
55402B7248k33K35J30k17m05p09j331j678j271o56m99n36l38k23m90n93j57J29
55384A8406k28m58M1L33m44j227o60M49L96m29j55J300J939P99q51j776k214k552
55366A2669k305j259k47j2l01o00q41r47o30K9M94N58M27J60k45l45K52R93R89
55347H839L57m9j6j3r2R9L55K22J00P67J884K272J662Q62K24o33j506j526o73
$$ y = [17341, 17390, 17693, 17140, 15803, 14686, 14445, 14909, 15526, 15796, 15513, 14958, 14597, 14413, 13922, 12975, 12014, 11291, 10461, 9370, 8715, 9315, 10980, 12536, 12974, 12387, 11834, 12300, 13744, 15290, 16431, 17634, 19383, 21145, 21994, 21931, 21717, 21554, 20847, 19297, 17373, 15611, 14173, 13203, 12868, 12934, 13014, 13256, 14092, 15315, 16242, 16825, 17717, 19119, 20470, 21423, 22232, 22918, 23013, 22483, 22109, 22553, 23704, 25217, 27010, 28830, 30056, 30332, 29891, 29074, 28074, 27248, 27015, 27250, 27380, 27163, 26758, 26049, 24718, 23040, 21769, 21113, 20614, 20078, 19740, 19517, 19027, 18434, 18277, 18406, 18178, 17720, 17761, 18094, 17650, 16423, 15763, 16212, 16608, 16179, 16024, 17324, 19263, 20062, 19211, 17435, 15221, 12669, 10364, 9105, 8858, 8846, 8545, 7945, 7104, 6157, 5527, 5556, 6050, 6608, 7035, 7195, 6950, 6605, 6857, 7850, 8839, 9196, 9147, 9131, 9118, 9026, 9125, 9480, 9702, 9802, 10569, 12453, 14725, 16387, 17249, 17473, 16840, 15334, 13808, 13135]
55328A3135qm9j12L16Q45J113J302J312O44n00j129r14o05o33m40K71P62M53j34
55309A5629l00k10l27n53n65m90n42n37k34K23N46O59N29J17l75o23o57p55q19
55290A0716m32M68J398J896J817J195L89K8L24N57O9o32n72J51N06L9o72j037
55272A6208r68m98K22O45L77j08j31R9k8l25j88J92K15J62P02J382J098j0o67
55253A8379n06m24q27j118j120j388j741j163L15J262R63M57O93J165J103P13
55237A6763L95l6n29l83N28J199R29L03m1m11j023j124j91R58J276R13O61P28
55219B0915Q89J066J043L93n89q09MO46K66k64J21Q23O15k56n46r2L8o33j366
55200B2264j447j023n57k71k61m95n70l7R63J716J614O02q11j778j695q40j03
$$ y = [13135, 13127, 13078, 12966, 13282, 14127, 15240, 16542, 17854, 18498, 17998, 16869, 15955, 15350, 14717, 14277, 14548, 15310, 15763, 15629, 15329, 15119, 14792, 14239, 13674, 13184, 12642, 12105, 11871, 12094, 12640, 13299, 13828, 13945, 13570, 12947, 12290, 11535, 10716, 10284, 10752, 12150, 14046, 15863, 17058, 17447, 17475, 17799, 18356, 18425, 17793, 17221, 17372, 17878, 17917, 17245, 16208, 15240, 14742, 14964, 15609, 15986, 15878, 15747, 15846, 15818, 15493, 15305, 15497, 15712, 15874, 16576, 17958, 19056, 19046, 18379, 17873, 17449, 16622, 15504, 14384, 12996, 11255, 10092, 10407, 11669, 12632, 13089, 13782, 14947, 16050, 16763, 17158, 17122, 16593, 16210, 16738, 17937, 18866, 19169, 19128, 18717, 17694, 16570, 16379, 17337, 18613, 19526, 20187, 20915, 21804, 22870, 23913, 24306, 23717, 22908, 22912, 23558, 23824, 23560, 23681, 24504, 25119, 24863, 24317, 24225, 24263, 23630, 22264, 20817, 19794, 19237, 18966, 18705, 18210, 17640, 17603, 18566, 20282, 21896, 22498, 21687, 19909, 18214, 17374, 17271]
55183A7271J04K33O15Q17M13j76k64J40N44P71Q84O74r6j066j546j362r88q20
55165A6148p11l12L44P63M99k44p57o79l91k90j00N17J114J055O45P43J373J725
55147B1442J528J324J302J007L92J37N45J129J636K364L175L317K699K229K324
55132D6550K219J393N54L70K78m45j445j987k160k369k377j852j247j161j325
55117C4996j132o71l93j58M54J236J561J292P65J27o25j237j352r40k36N14R96
55100C5197J030R63J269J578R90l69j152o37K83N96O04R30J152N62m29q25m96
55083D1246o6J86L57L26j8l03k23j10k33j41M91J047R27O46J016J764K011J611
55065E0534J023M06r5J10J104J623N74j075j400k33Q27R31Q89J417K006K014J618
$$ y = [17271, 17375, 17608, 18223, 19040, 19453, 19277, 19013, 19153, 19697, 20468, 21352, 22026, 21930, 20864, 19318, 17956, 16968, 16148, 15437, 15125, 15469, 16232, 16731, 16487, 15730, 15051, 14660, 14370, 14270, 14787, 15901, 16956, 17601, 18344, 19717, 21442, 22970, 24294, 25596, 26603, 26995, 27132, 27677, 28806, 30442, 32806, 35981, 39298, 41997, 44226, 46550, 48769, 50162, 50716, 51086, 51364, 50919, 49474, 47487, 45327, 42958, 40581, 38729, 37482, 36321, 34996, 33864, 33193, 32800, 32642, 33096, 34332, 35893, 37185, 37950, 38077, 37452, 36215, 34863, 33923, 33687, 34201, 35197, 36227, 37190, 38459, 40037, 41027, 40658, 39506, 38869, 39152, 39748, 40352, 41282, 42434, 42996, 42567, 41742, 41246, 41180, 41366, 41723, 42049, 42031, 41728, 41505, 41395, 41162, 41021, 41512, 42559, 43486, 44132, 45148, 46912, 48923, 50534, 51557, 51963, 51868, 51978, 53082, 54705, 55279, 54204, 52804, 52571, 53398, 54329, 55218, 56635, 58641, 60655, 62273]
55048F2273J163N49k28q02j029j188j257q58p9M08L62L13N89P64M14k47q33j247
55030E9067j412j141o31m88r51j541j831j988k203k098j247J4P62M59n12j249
55014D3010j093j85O39O16k09j058j239p80k26K9J04L17O19O00J91O3P81J815
54996D3994K034J218L45K09N66Q77J068J140Q23K01p4J92L04p8j09R42K309K749
54978E8710K359K234K694L158L491M206N304O112O479P085Q317R709J0726J1379
54964A41963J1755J1565J0529Q681O184L237K08k633n416q268j0651j1739j1482
54951A43933j0662r913r177q202p027n871m980m556m492m257l482k498j863j570
54937F5383j232q15n64l73J37R54J688K155K437K565K650L169M498O349Q156R722
$$ y = [62273, 63436, 63985, 63757, 62955, 61926, 60738, 59481, 58623, 58544, 58952, 59314, 59627, 60216, 60980, 61394, 61147, 60314, 59067, 57655, 56514, 55883, 55395, 54444, 52903, 51072, 49084, 46881, 44783, 43536, 43550, 44312, 44771, 44259, 43010, 41917, 41732, 42371, 42987, 42778, 41720, 40481, 39701, 39475, 39504, 39608, 39925, 40544, 41144, 41335, 41398, 42179, 43994, 46028, 47246, 47591, 47800, 48366, 49243, 50311, 51451, 52274, 52475, 52401, 52593, 52897, 52819, 52710, 53652, 55961, 58710, 61069, 63303, 65997, 69155, 72646, 76852, 82156, 88268, 94747, 101832, 110149, 119858, 130584, 141963, 153718, 165283, 175812, 184493, 190677, 193914, 194122, 191489, 186073, 177805, 167154, 155415, 143933, 133271, 123358, 114181, 105979, 98952, 93081, 88101, 83545, 79053, 74796, 71314, 68816, 66953, 65383, 64151, 63336, 62772, 62399, 62536, 63490, 65178, 67333, 69770, 72335, 74985, 78154, 82652, 89001, 97157, 106879]
54921A06879J0933J1245J0293Q687P237N653L019n80l901o098p459q492r208r517
54907A18691r501r011p798o244n235n065n057m507l408k120j037o03r70j522j441
54892E5172q79p50j242j456q41j20j78p70r91o12k87n74j262j603j087j5P09N02
54874D3716k94r33j143j112r05m71o9n6l56o35q53j005o97K63J118R55J45p8N06
54855C8096P96Q4r23j228q04k65Mm2k49k67J24N48M92J66J77M07K14k76k15M32
54835C7271O60J57m9P13J641J869J807K059K043J014k37j55J370K830L088K545
54819E8626K183K360K829L357M051N251P118R270J0933J1712J1814J1412J0265
54806A51181Q359O345M696K880J24l262o057p551q114q353q319p734o614n374
$$ y = [106879, 117812, 129057, 139350, 148037, 155274, 160927, 163946, 163366, 159465, 153367, 145908, 137416, 128208, 118691, 109190, 100179, 92381, 86137, 80902, 75837, 70780, 66273, 62865, 60745, 59708, 59105, 58135, 56613, 55172, 54293, 53543, 52301, 50845, 50004, 49884, 49706, 48936, 47945, 47333, 47046, 46472, 45210, 43607, 42520, 42505, 43214, 43716, 43422, 42489, 41346, 40234, 39329, 38858, 38789, 38733, 38377, 37742, 36889, 35884, 35187, 35450, 36568, 37523, 37668, 37590, 38096, 38892, 38976, 38053, 36825, 36021, 35756, 35760, 35718, 35469, 35202, 35326, 35874, 36366, 36532, 36709, 37116, 37330, 37054, 36839, 37271, 37931, 38088, 38039, 38752, 40393, 42262, 44069, 46128, 48171, 49185, 48948, 48793, 50163, 52993, 56081, 58626, 60809, 63169, 65998, 69355, 73406, 78657, 85775, 95045, 105978, 117690, 129504, 140916, 151181, 159540, 165885, 170581, 173461, 173585, 170323, 164266, 156715, 148601, 140248, 131929, 124195, 117581, 112207]
54792A12207m482m075l800l190k252j594j669k109k070j153K06J255J635J617
54778I0526J690J966K104J969K160L406N516P468Q689R633J0940J2481J3676J4214
54764A86438J4112J3368J2008J0119P535L869o25m709p241q466r550j0979j2088
54751A93791j2226j1689j1182j0860j0337r410q298p216o161n230m779m893m965
54738H6545m222k731j420r51r96q72m30N5M27O28M11k83q83p71k12m2m73q54p51
54719G2175n63q25j432j823j672j115n14j11K28P69J316J218L86k09K16R76P95
54702F9815k74r48o62j27J41N82J297J357K07j176j509q33q5L50P02R22P01K12
54684G0672K1L36Q78J426J971K504L035L605L942L537K467J706J968K684K786
$$ y = [112207, 107725, 103650, 99850, 96660, 94408, 92814, 91145, 89036, 86966, 85813, 86019, 87274, 88909, 90526, 92216, 94182, 96286, 98255, 100415, 103821, 109337, 116805, 125494, 135127, 146067, 158548, 172224, 186438, 200550, 213918, 225926, 236045, 243580, 247449, 246824, 242115, 234874, 226408, 216858, 205879, 193791, 181565, 169876, 158694, 147834, 137497, 128087, 119789, 112573, 106412, 101182, 96403, 91510, 86545, 82323, 79592, 78172, 77221, 76225, 75353, 74923, 74978, 75405, 76033, 76444, 76161, 75278, 74507, 74295, 74253, 73780, 72926, 72175, 71612, 70787, 69355, 67532, 65860, 64745, 64231, 64120, 64348, 65117, 66433, 67651, 68037, 67828, 68044, 69020, 69815, 69541, 68593, 67931, 67804, 67945, 68527, 69824, 71181, 71388, 70212, 68703, 67870, 67785, 68135, 68837, 69759, 70460, 70672, 70693, 71029, 71907, 73333, 75304, 77808, 80843, 84448, 88390, 91927, 94394, 96100, 98068, 100752, 103538]
54669A03538K161J608J590J840K113K501K965L235L369L781M538N172N409N564
54655A49384O049O851P823R046J0509J1673J1837J0906R355P433M752R92l297
54642B43313p046r747j1729j3286j4097j3833j2867j1756j0406q400o034m275
54630A19837l618l586l519l242k804k092j086j51K44q4q93j498j034O16K246K357
54614A01693Q98o70j224j130j227j508j405q55l80m08r27j601j912j471n15K22
54598H7580L31J19rr4l21o26r83j539k198k442k046j487j296j302r86k37N54R28
54580G3946N99l64j371j673j165m75j31p2j36l77o40m58K11P12N84J80m5k71p34
54561F8320j038o44L23J317K030K294J842Q06O0L63J469K569L287L635L485K870
$$ y = [103538, 105699, 107307, 108897, 110737, 112850, 115351, 118316, 121551, 124920, 128701, 133239, 138411, 143820, 149384, 155433, 162284, 170107, 179153, 189662, 201335, 213172, 224078, 233433, 240866, 245618, 246610, 243313, 236267, 226520, 214791, 201505, 187408, 173575, 160708, 148952, 138546, 130146, 124112, 119837, 116219, 112633, 109114, 105872, 103068, 100976, 99890, 99739, 99983, 99899, 99006, 97508, 96474, 97090, 99336, 101693, 102591, 101921, 100697, 99567, 98340, 96832, 95427, 94572, 94192, 93784, 92857, 91256, 89344, 87873, 87358, 87580, 87911, 88030, 88021, 87927, 87606, 86980, 85997, 84458, 82260, 79818, 77772, 76285, 74989, 73687, 72701, 72464, 73018, 73946, 74545, 74181, 72810, 71137, 69972, 69497, 69366, 69294, 69158, 68781, 68141, 67683, 67894, 68606, 69190, 69370, 69325, 69054, 68320, 67282, 66638, 66961, 68278, 70308, 72602, 74444, 75250, 75310, 75673, 77142, 79711, 82998, 86633, 90118, 92988]
54545I2988K443K923M129N137N387N077M682M543M698M704L854K000r1j612k609
54530A38253l504m213m359m055l728l413k871k271k129k596l302l774l685k888
54516I1465j710r07q68j094q91k54L83Q40J091R11L33L8N31J246J323R09Q00R83
54498I5129N93n99j618j549n81M68J130J409J411J216R05N00m2p15j461k143k476
54481I1577k177j365n50l6L01M81K10m59r02p70m99m87l76J68O21M16mJ51P11
54462H7011Q85N39J73r2m67p09m19L9%l27k10J79m1q34j183p94n57r27j112n47
54442H0607N0j21n89m49J55L75M9j90m1ln39j322j500o36P38J595J497J040R20
54423H1636R35M22n02q82k42P69J307J343J397J652J787J483R15O89J306K473
$$ y = [92988, 95431, 98354, 102483, 107620, 113007, 118084, 122766, 127309, 132007, 136711, 140565, 142565, 142474, 140862, 138253, 134749, 130536, 126177, 122122, 118394, 114981, 112110, 109839, 107710, 105114, 101812, 98038, 94353, 91465, 89755, 88848, 87980, 86886, 85995, 85741, 86124, 86964, 88055, 88966, 89299, 89337, 89868, 91114, 92437, 93346, 94146, 95129, 95722, 95123, 93505, 91956, 91375, 91843, 92973, 94382, 95793, 97009, 97914, 98414, 98372, 97657, 96196, 94053, 91577, 89400, 88035, 87485, 87449, 87750, 88231, 88441, 87982, 87080, 86310, 85811, 85324, 84948, 85116, 85737, 86153, 86149, 86300, 87011, 87896, 88435, 88608, 88516, 88049, 87340, 86921, 86960, 86960, 86633, 86423, 86602, 86561, 85727, 84544, 83750, 83193, 82266, 81154, 80607, 80657, 80536, 79947, 79498, 79653, 80028, 80077, 79887, 79846, 79843, 79304, 77982, 76482, 75846, 76584, 78179, 79676, 80716, 81636, 82571, 82993, 82491, 81609, 81367, 82136, 83443, 84786, 86183, 87835, 89622, 91105, 92020, 92709, 94015, 96488]
54407I6488L154K694J673J208J554J966J870J478J120O66j08j011j551j368m97
54392A09336N18Q60K15q32j556k006k633l217l068k242j663j868k368k490k167
54377H4819j635r67k84J06J00j15m34q78j148p39L07J324J815J811J399N89j77
54360H5893j54O79J419J374Q41M43L87P15J612K877L697L551K888K408K099J577
54344A12306R08M37Q4m97j179j459j285j244j727k365k527k112j628j581j963
54329I4168k410k679k772k703k406j997j788j837j762j312p83n68o17p28j039
54314F8767j628k003j692j083r98j441j625j182n99l17j32K66P53R94P94J97m32
54297E8639n43q2J98k79q94o62J76M44j80q20r54j055j353j179j37J051J552J500
$$ y = [96488, 99642, 102336, 104009, 105217, 106771, 108737, 110607, 112085, 113205, 113871, 113763, 112752, 111201, 109833, 109336, 109854, 110714, 110929, 110097, 108541, 106535, 103902, 100685, 97617, 95375, 93712, 91844, 89476, 86986, 84819, 83184, 82217, 81933, 82039, 82139, 82024, 81590, 80712, 79564, 78825, 79132, 80456, 82271, 84082, 85481, 86070, 85893, 85739, 86418, 87837, 89211, 90052, 90495, 90882, 91597, 93209, 96086, 99783, 103334, 106222, 108630, 110729, 112306, 113214, 113651, 113735, 113238, 112059, 110600, 109315, 108071, 106344, 103979, 101452, 99340, 97712, 96131, 94168, 91758, 89079, 86307, 83604, 81198, 79201, 77413, 75576, 73814, 72502, 71719, 71151, 70534, 69806, 68767, 67139, 65136, 63444, 62361, 61363, 59922, 58297, 57115, 56516, 56199, 56067, 56333, 57086, 58080, 58874, 59071, 58639, 58096, 58014, 58212, 57933, 57039, 56377, 56553, 56997, 56817, 55997, 55043, 53988, 52635, 51456, 51319, 52370, 53922, 55422]
54279E5422J413J265Q08K39j03k39k81j65Qo0k55mP19J117P11J22J29O25J076
54260F2547J379J643J682J339Q51M21q1n75n51O1M75Q5o83j133j227j148o35L69
54242F4819J035N65o13j412j485j204o72K53J149J281O08j61n06m61j73J83J84
54225F3390m51j232j329o40J18L36M2m25p48o48n7O82J145J275J189P78K1n85
54207F2861m06M72J273J375P60k20j067j297q24k01l4k51k95N3M60N49K25m59
54189F2974j326j967j903j050J46J029J161O32M1p7J36N5n11j003r18m26lK11
54171E7201L14L12J76k4k55m66l13N12J518J700Q71M2J2L96M90L38K74Q3n39j202
54151F1440j311r26m74l6L35K60l29o98l84j24o94j403r91K96R23K88n27m30L30
$$ y = [55422, 56835, 58100, 58908, 59147, 59044, 58805, 58524, 58359, 58367, 58307, 58052, 58048, 58767, 59884, 60595, 60717, 60846, 61471, 62547, 63926, 65569, 67251, 68590, 69441, 69862, 69781, 69206, 68655, 68716, 69191, 69276, 68593, 67460, 66233, 65085, 64450, 64819, 65854, 66419, 65806, 64394, 62909, 61705, 61033, 61286, 62435, 63716, 64324, 64163, 63657, 63196, 63023, 63206, 63390, 62939, 61707, 60378, 59738, 59856, 60192, 60234, 59809, 59061, 58413, 58356, 59038, 60183, 61458, 62647, 63425, 63446, 62861, 62455, 62927, 64200, 65575, 66335, 66115, 65048, 63751, 62927, 62726, 62692, 62441, 62146, 62199, 62659, 63208, 63433, 62974, 61648, 59681, 57778, 56728, 56874, 57903, 59064, 59696, 59737, 59660, 59796, 59851, 59340, 58337, 57419, 56993, 56990, 57201, 57515, 57827, 58003, 57979, 57724, 57258, 56945, 57457, 58975, 60675, 61546, 61588, 61600, 61996, 62486, 62824, 63098, 63181, 62642, 61440, 60129, 59203, 58729, 58693, 59028, 59288, 58959, 58261, 57877, 57753, 57059, 55656, 54665, 54961, 55884, 56172, 55645, 55215, 55545]
54132E5545Q67P44N8q46j441j355q80o40p43p43m21KL22M79L28q2k11K48O56K72
54112E2159m40m07L00N26j00n85k30L39L61O6j0K6j23k88k86l71n96m08M25J076
54092E1434P31r6k53L20M90l65j409j419k43J090J535J017L53L02P64R69M76k48
54074E5448l71L20J197J473J004L53J39L80N59L51O3J58M90L76m88j465j521k76
54056E8190J519K614K436J545R13Q40Q94P37N05L46J80J28N20J218J518J233J137
54039G6473J796K558K522J986J961K625L248L457L594L841L903L693L496L373
54025A18526L105K742K553K400J922J314J163J459J636J573J673J844J421L22
54011A43653o86j171j495j774j482o47l69j329k579k777j969j252j152j320j516
$$ y = [55545, 56412, 57156, 57214, 56368, 54927, 53572, 52692, 52052, 51309, 50566, 50145, 50147, 50469, 50948, 51276, 51194, 50983, 51231, 51887, 52159, 51719, 51312, 51612, 52138, 52038, 51453, 51223, 51562, 51923, 51989, 51979, 52005, 51882, 51594, 51308, 50937, 50341, 49933, 50358, 51434, 52165, 52069, 51816, 52136, 52626, 52261, 50852, 49433, 49190, 50280, 51815, 52832, 53185, 53487, 54251, 55220, 55696, 55448, 55077, 55397, 56594, 58067, 59071, 59424, 59563, 59943, 60502, 60853, 60916, 61074, 61564, 61940, 61452, 59987, 58466, 58190, 59709, 62323, 64759, 66304, 67217, 68057, 68951, 69688, 70193, 70539, 70719, 70847, 71367, 72585, 74103, 75336, 76473, 78269, 80827, 83349, 85335, 87296, 89921, 93169, 96626, 100220, 104061, 107964, 111657, 115153, 118526, 121631, 124373, 126926, 129326, 131248, 132562, 133725, 135184, 136820, 138393, 140066, 141910, 143331, 143653, 142967, 141796, 140301, 138527, 137045, 136398, 136029, 134700, 132121, 129344, 127375, 126123, 124971, 123651, 122135]
53996A22135j893k381k582k391k137j992j782j387j001q01p35o75o48q28j358
53981I9544k044k333j830q69k35k19l70l23k68l49j88M17Q84N92m7o8O35J127
53963I4056P32j18o11n35k35J0J60K25K30L06M87N48L21R1L47J072J668J729J567
53944A02050J664J952K064K059K306K693K657K075J619J826K387K720K732K591
53930A33395K136J126j01p70l97P87K033K543K099J489J767K892L672L391K766
53915A58828K713L044L190L389M020M449L895K999L103M107M516L637K262J040
53901B05192k47j453j652p09Po10j926k675k627k333k100k083k674l816m600m384
53885A71310l791l764m119m036l501l276l630m032m034l724l287k795k420k360
$$ y = [122135, 120242, 117861, 115279, 112888, 110751, 108759, 106977, 105590, 104589, 103788, 103053, 102378, 101730, 100902, 99544, 97500, 95167, 93337, 92468, 92233, 92014, 91644, 91321, 91053, 90704, 90516, 90933, 91817, 92409, 92362, 92294, 92929, 94056, 94788, 94670, 94059, 93524, 93289, 93299, 93459, 93684, 93914, 94220, 94707, 95255, 95576, 95667, 96014, 97086, 98754, 100483, 102050, 103714, 105666, 107730, 109789, 112095, 114788, 117445, 119520, 121139, 122965, 125352, 128072, 130804, 133395, 135531, 136657, 136556, 135786, 135389, 136176, 138209, 140752, 142851, 144340, 146107, 148999, 152671, 156062, 158828, 161541, 164585, 167775, 171164, 175184, 179633, 183528, 186527, 189630, 193737, 198253, 201890, 204152, 205192, 204945, 203492, 201840, 201131, 201138, 200528, 198602, 195927, 193300, 190967, 188867, 186784, 184110, 180294, 175694, 171310, 167519, 163755, 159636, 155600, 152099, 148823, 145193, 141161, 137127, 133403, 130116, 127321, 124901, 122541]
53871A22541k511k590k524k400k213j986j909k012j897j259m22o1m76j394k249
53856I6638k456j787p42k25n53j136j349j228j007o51k90m11r80j010J12J398
53840H4323J360R7q32n09M12R64J023Q31L53l42o73k76K83J59n27q23l12L35M06
53821H6252J89M60J203J638J412J109J236J468J342J138J320J624J441R18P25
53806A03475R18R86R11J200J831K235K503L397M798N409M574L371L042L331L258
53791A45239K668K071J627J281J306J786K042J598J154J499J977J250o16k141
53777A62741k484k311k496k970l251l252l160l138l324l679l701k919j735j220
53763A23101j814k760l051k447j431n54r1j9j32k64m38o55o98m39j18m2j38j38
$$ y = [122541, 120030, 117440, 114916, 112516, 110303, 108317, 106408, 104396, 102499, 101240, 100818, 100757, 100281, 98887, 96638, 94182, 92395, 91653, 91428, 90875, 89739, 88390, 87162, 86155, 85504, 85214, 84803, 83823, 82813, 82925, 84323, 85683, 85780, 84948, 84439, 84851, 85815, 86838, 87669, 88022, 87680, 87007, 86731, 87014, 87173, 86646, 85823, 85511, 85846, 86252, 86441, 86901, 88104, 89742, 91154, 92263, 93499, 94967, 96309, 97447, 98767, 100391, 101832, 102750, 103475, 104393, 105379, 106290, 107490, 109321, 111556, 114059, 117456, 122254, 127663, 132237, 135608, 138650, 141981, 145239, 147907, 149978, 151605, 152886, 154192, 155978, 158020, 159618, 160772, 162271, 164248, 165498, 164882, 162741, 160257, 157946, 155450, 152480, 149229, 145977, 142817, 139679, 136355, 132676, 128975, 126056, 124321, 123101, 121287, 118527, 115476, 113029, 111598, 111044, 110953, 110934, 110802, 110538, 110100, 109445, 108747, 108308, 108190, 108148, 108010, 107872]
53745A07872n3m0p8r6k82p87j317j479j337j237j216j088q57o30k75K96P54P19
53727I8869L32n0m05q13r79o23o3K31L67O78R46P74M09L14J87n10j312j144k8
53708I7180Q30Q54Q24J412K010J726P19o3K8R73K296L279L430K991K629K537K428
53691A26083K380K818L500L538K773K206K511L065L094K893L077L420L362L116
53677A67836L234L474L160K424K114K541L167L532L689L631L134K350J874J952
53663B08112K158K071J832J747J784J724J487J108O34K56K74P20J170J152N99
53648B26828j68p21p37k24L17K18o31j528j730j211m88O9L84L13k46r22j111q66
53630B17546r84j867k805k957k552k407k507j988o19O82J125J074J256J605J577
$$ y = [107872, 107819, 107779, 107701, 107605, 107323, 106536, 105219, 103740, 102403, 101166, 99950, 98862, 98005, 97375, 97100, 97396, 98150, 98869, 99201, 99151, 98746, 97933, 96954, 96331, 96268, 96499, 96866, 97544, 98490, 99264, 99673, 99987, 100174, 99664, 98352, 97208, 97180, 98010, 98864, 99688, 101100, 103110, 104836, 105555, 105492, 105520, 106493, 108789, 112068, 115498, 118489, 121118, 123655, 126083, 128463, 131281, 134781, 138319, 141092, 143298, 145809, 148874, 151968, 154861, 157938, 161358, 164720, 167836, 171070, 174544, 177704, 180128, 182242, 184783, 187950, 191482, 195171, 198802, 201936, 204286, 206160, 208112, 210270, 212341, 214173, 215920, 217704, 219428, 220915, 222023, 222657, 222913, 223187, 223907, 225077, 226229, 226828, 226660, 225939, 225202, 224978, 225295, 225513, 224882, 223354, 221624, 220413, 219925, 219994, 220378, 220691, 220445, 219523, 218412, 217546, 216562, 214695, 211890, 208933, 206381, 203974, 201467, 199479, 198860, 199542, 200667, 201741, 202997, 204602, 206179]
53615B06179J161Q43P96P77P66J022J479J680J483J354J769K636L511M054M217
53600B33727M141M056M094M182M161M062M089M395M927N413N523N142M560M194
53586B96666M110M156M481N378O415O533N435M211L931M230M094L594L685M529
53572C61448N210N197N001N017M696L468J775O09L63N96N94l3j045j651j300n22
53556C89423m87j522k648k888k439k136k219k339k377k596k996l182k917k462
53542C56215k181k128k183k314k537k660k349j551o64j52j9N7J90J96Q0J19K88
53525C38407J08n27q94l14Q50J683J975K266K864L523M140M976O095P137P853
53510C80142Q304Q569Q661Q883R643J0803J1730J2097J2175J2277J2485J3008
$$ y = [206179, 207340, 208183, 208979, 209756, 210522, 211544, 213023, 214703, 216186, 217540, 219309, 221945, 225456, 229510, 233727, 237868, 241924, 246018, 250200, 254361, 258423, 262512, 266907, 271834, 277247, 282770, 287912, 292472, 296666, 300776, 304932, 309413, 314791, 321206, 327739, 333174, 337385, 341316, 345546, 349640, 353234, 356919, 361448, 366658, 371855, 376856, 381873, 386569, 390037, 391812, 392421, 392784, 393380, 393974, 393941, 392896, 391245, 389945, 389423, 388936, 387414, 384766, 381878, 379439, 377303, 375084, 372745, 370368, 367772, 364776, 361594, 358677, 356215, 354034, 351906, 349723, 347409, 344872, 342212, 339863, 338312, 337648, 337496, 337477, 337534, 337724, 337920, 338000, 338119, 338407, 338515, 337988, 337094, 336780, 337630, 339313, 341288, 343554, 346418, 349941, 354081, 359057, 365152, 372289, 380142, 388446, 397015, 405676, 414559, 424202, 435005, 446735, 458832, 471007, 483284, 495769, 508777]
53498E08777J4171J5870J7562J8947K0180K1282K2004K2411K3039K4175K5487
53487G33905K6570K7359K7915K8362K9085L0311L1404L1400L0436K9766L0034
53476A056547L0495L0460L0549L1690L3629L5360L6506L7413L8248L8752L8669
53465A438318L7729L5594L2437K9255K6903K5070K2910K0407J8334J7043J6188
53454A720188J5624J5764J6848J8445J9904K0879K1208K0668J9043J6357J2921
53443A917849R271N912K886j99l606p094j0355j3447j6477j9133k1037k2398k3906
53430A798266k5990k8545l1175l3386l4723l5154l5167l5222l5241l5059l5021
53419A433583l5548l6277l6267l5120l3378l1636k9853k7734k5367k3138k1154
$$ y = [508777, 522948, 538818, 556380, 575327, 595507, 616789, 638793, 661204, 684243, 708418, 733905, 760475, 787834, 815749, 844111, 873196, 903507, 934911, 966311, 996747, 1026513, 1056547, 1087042, 1117502, 1148051, 1179741, 1213370, 1248730, 1285236, 1322649, 1360897, 1399649, 1438318, 1476047, 1511641, 1544078, 1573333, 1600236, 1625306, 1648216, 1668623, 1686957, 1704000, 1720188, 1735812, 1751576, 1768424, 1786869, 1806773, 1827652, 1848860, 1869528, 1888571, 1904928, 1917849, 1927120, 1933032, 1935918, 1935719, 1932113, 1925019, 1914664, 1901217, 1884740, 1865607, 1844570, 1822172, 1798266, 1772276, 1743731, 1712556, 1679170, 1644447, 1609293, 1574126, 1538904, 1503663, 1468604, 1433583, 1398035, 1361758, 1325491, 1290371, 1256993, 1225357, 1195504, 1167770, 1142403, 1119265, 1098111]
53408A098111j9048j6358j3067r719o949m791k647K3L126O238R151J1889J4402
53395A070361J6709J9102K1810K4476K6430K7501K8136K8729K9278K9883L1071
53384A353486L3187L5724L7810L9351M1218M4054M7366N0208N2585N5390N8972
53373A849351O2445O4929O6748O8794P1098P3019P4494P6156P8057P9330P9392
53362B643813P8683P7840P6804P5107P2411O8506O3519N8586N5397N4426N4238
53351C379330N3285N1630N0201M8989M7075M4120M0718L7342L3690K9065K2623
53340C838068J3374P42j4653l1255m7478o1929p3130q0091q3396q5020q6648q8546
53328C200038r0084r0812r0660q9598q7553q4771q2111q0758q1255q2729q3479
$$ y = [1098111, 1079063, 1062705, 1049638, 1039919, 1032970, 1028179, 1025532, 1025555, 1028681, 1034919, 1044070, 1055959, 1070361, 1087070, 1106172, 1127982, 1152458, 1178888, 1206389, 1234525, 1263254, 1292532, 1322415, 1353486, 1386673, 1422397, 1460207, 1499558, 1540776, 1584830, 1632196, 1682404, 1734989, 1790379, 1849351, 1911796, 1976725, 2043473, 2112267, 2183365, 2256384, 2330878, 2407034, 2485091, 2564421, 2643813, 2722496, 2800336, 2877140, 2952247, 3024658, 3093164, 3156683, 3215269, 3270666, 3325092, 3379330, 3432615, 3484245, 3534446, 3583435, 3630510, 3674630, 3715348, 3752690, 3786380, 3815445, 3838068, 3851442, 3852184, 3837531, 3806276, 3758798, 3696869, 3623739, 3543648, 3460252, 3375232, 3288584, 3200038, 3109954, 3019142, 2928482, 2838884, 2751331, 2666560, 2584449, 2503691, 2422436, 2339707, 2256228]
53317B256228q2699q1136p9792p8466p6278p3048o9320o5225o0285n4414m8271
53306A487294m2509l7273l2602k8653k5381k2524k0076j8283j7023j5674j3805
53295A213491j1563r291p143n248l823k966k585k530k500j918l89J698L458M436
53281A173127M905N304N921P117R314J2483J6058J9432K2272K4403K5822K6870
53269A353028K7988K9274L0572L1893L3287L4471L5129L5506L6095L6721L6668
53258A720632L5723L4479L3505L2900L2734L3192L3994L4316L3627L2073K9775
53247B086950K6422K1831J6453J0876N290l32n968j1759j8008k4606l0859l6146
53235B040144m0441m3985m6904m9314n1320n2715n3147n2724n1834n0287m7383
$$ y = [2256228, 2173529, 2092393, 2012601, 1934135, 1857857, 1784809, 1715489, 1650264, 1589979, 1535565, 1487294, 1444785, 1407512, 1374910, 1346257, 1320876, 1298352, 1278276, 1259993, 1242970, 1227296, 1213491, 1201928, 1192637, 1185494, 1180246, 1176423, 1173457, 1170872, 1168342, 1165842, 1163924, 1163535, 1165233, 1168691, 1173127, 1178032, 1183336, 1189257, 1196374, 1205688, 1218171, 1234229, 1253661, 1275933, 1300336, 1326158, 1353028, 1381016, 1410290, 1440862, 1472755, 1506042, 1540513, 1575642, 1611148, 1647243, 1683964, 1720632, 1756355, 1790834, 1824339, 1857239, 1889973, 1923165, 1957159, 1991475, 2025102, 2057175, 2086950, 2113372, 2135203, 2151656, 2162532, 2167822, 2167490, 2161522, 2149763, 2131755, 2107149, 2076290, 2040144, 1999703, 1955718, 1908814, 1859500, 1808180, 1755465, 1702318, 1649594, 1597760, 1547473, 1500090]
53224A500090m3277l9448l7215l6439l6262l6446l7233l8452l9657m0901m2419
53213A072341m3788m4153m3272m1600l9323l6191l2394k8778k5864k3180k0131
53202F93667j7066j4945j4038j3534j2571j1266j0393j0259j0391j0374j0383
53191E58447j0540j0382r622r030r594j0889j1367j0415r132q634q627q323p872
53178D34020p934q460q939r390j0145j0895j0988j0526j0201j0061r431q195p220
53165C11635p115p394p270o694o077n544m921m200l531k962k472k118j968k004
53151B47365k219k597k946l038k975l101l393l391k900k358k208k189j707p15
53137B11628J78M45J56k26l61k48j22j50j90O6O15R93P93J55l52m01j99k09o57
$$ y = [1500090, 1456813, 1417365, 1380150, 1343711, 1307449, 1271003, 1233770, 1195318, 1155661, 1114760, 1072341, 1028553, 984400, 941128, 899528, 860205, 824014, 791620, 762842, 736978, 713798, 693667, 676601, 661656, 647618, 634084, 621513, 610247, 599854, 589595, 579204, 568830, 558447, 547907, 537525, 527903, 518873, 509279, 498390, 487023, 476608, 467476, 458842, 450215, 441892, 434020, 426086, 417626, 408687, 399297, 389152, 378257, 367269, 356743, 346542, 336481, 327050, 318855, 311635, 304520, 297126, 289856, 283162, 277085, 271541, 266620, 262420, 258889, 255927, 253455, 251337, 249369, 247365, 245146, 242549, 239603, 236565, 233590, 230489, 227096, 223705, 220805, 218447, 216239, 214050, 212343, 211628, 211806, 212251, 212407, 212181, 211820, 211572, 211450, 211300, 211110, 211176, 211791, 212784, 213577, 213732, 213380, 212979, 212780, 212571, 211914]
53118B11914j342j784j702j362j396k112l094l690l718l458l133k739k332k056
53104A77996j793j253n26j43l32n86l64J03J82j76m67n29p98j477k085k163j976
53087A63613k106k619l048l072k812k534k416k519k720k735k467k244k399k683
53073A27239k488j675q04m05l68k31J30L60J50l64p36o99l84q0J17K37J67k73
53055A19893q74r97k83P91J372J134M43k00o05p74p46n99m39l15k18j44o5N5P8
53036A17507k45q54j298j302j126j060r11m46k9j71o31p02l17j38m54p50n38q
53018A06527M45O83O03j0r91j691j712j327q61k49M40O38K4q59j275j198j015
53001I8172p42k58Q7j19m64j46P37J156N95k51n75n57p50r17k25J401K922L411
$$ y = [211914, 210572, 208788, 207086, 205724, 204328, 202216, 199122, 195432, 191714, 188256, 185123, 182384, 180052, 177996, 176203, 174950, 174424, 174281, 173949, 173363, 172999, 173102, 173284, 173108, 172641, 172112, 171314, 169837, 167752, 165589, 163613, 161507, 158888, 155840, 152768, 149956, 147422, 145006, 142487, 139767, 137032, 134565, 132321, 129922, 127239, 124751, 123076, 122272, 121867, 121499, 121268, 121398, 121758, 121908, 121544, 120808, 120109, 119725, 119645, 119762, 119999, 120166, 119893, 119019, 118022, 117739, 118530, 119902, 121036, 121479, 121279, 120674, 119900, 119154, 118555, 118116, 117801, 117583, 117439, 117374, 117429, 117507, 117262, 116408, 115110, 113808, 112682, 111622, 110711, 110265, 110236, 110065, 109434, 108732, 108415, 108277, 107823, 107073, 106535, 106527, 106972, 107655, 108258, 108248, 107257, 105566, 103854, 102527, 101666, 101417, 101857, 102495, 102519, 101660, 100385, 99187, 98172, 97430, 97172, 97259, 97140, 96676, 96530, 97267, 98423, 99018, 98767, 98192, 97635, 96885, 95968, 95743, 97144, 100066, 103477]
52983A03477L184L203L632L615K639J494J316K041K540K156J384Q53M19k54q75
52968A30824r44o24n29q09j053j009q27o24k86J67M98N87N81O16O63O46N05J45
52950A28527l37o01n22n66j196k035k230j647j008o83j31J056K191K303J486O87
52934A25294M46N21O73J059J636J858J352M40k51m76l52j7L64M70J79r3J85R77
52916A34265J729K031J885J334L70o83j181p98O8P96J155J219J054P68O15O93
52900A45320P63O07L89L16L25M11R22J957K774K512J381M61L10M57M00K64K67
52883A59836J85j04j87K73Q33P84J57l28j75M04R19J136J135J120J227J411J498
52866A70124J396J218J145J298J725K331K811K877K595K296K121J995J979K315
$$ y = [103477, 106661, 109864, 113496, 117111, 119750, 121244, 122560, 124601, 127141, 129297, 130681, 131534, 131953, 131699, 130824, 129880, 129256, 128727, 127918, 126865, 125856, 125029, 124405, 124119, 124286, 124784, 125371, 125952, 126568, 127231, 127877, 128382, 128527, 128190, 127589, 127067, 126501, 125305, 123270, 121040, 119393, 118385, 117702, 117571, 118627, 120818, 123121, 124607, 125294, 125740, 126261, 126934, 127993, 129629, 131487, 132839, 133279, 133028, 132552, 132200, 132183, 132547, 133017, 133196, 133103, 133288, 134265, 135994, 138025, 139910, 141244, 141614, 140931, 139750, 138952, 139020, 139816, 140971, 142190, 143244, 144012, 144627, 145320, 146083, 146690, 147079, 147395, 147720, 148131, 149053, 151010, 153784, 156296, 157677, 158138, 158448, 158905, 159305, 159569, 159836, 160021, 159917, 159730, 160003, 160836, 161620, 161777, 161449, 161274, 161678, 162597, 163733, 164868, 165988, 167215, 168626, 170124, 171520, 172738, 173883, 175181, 176906, 179237, 182048, 184925, 187520, 189816, 191937, 193932, 195911, 198226]
52852A98226K870K996K220R30M9J10O87P09n96k776m295m031k582j624j910k628
52836A88355k855k763k876k928k306j201m49l60n00n93q96j555k153k224j811
52821A62885j380j321j624j905j704r96l30k61o67r28p76o22r70j689k107j849
52805A43756j304j159j447j477q56k05l42j023j159l70N19P16M77M06M32J24m09
52788A36679o63n63n14p60j100j221r38l28J54m9q82j569j595j399j611k012j836
52771A19793r35L3L91o3j149k316k762k150j106n59p03j070j349j539j504j110
52755A01902o27m08k86O2L11j33j106j746j642j203q25m88j83p1l7J85M25K63
52737I4393j28j82l7m90j632k451k237j481r74p47n20m00m92m53p2K07Jk50J2
$$ y = [198226, 201096, 204092, 206312, 207242, 207291, 207401, 208088, 208797, 208201, 205425, 201130, 197099, 194517, 192893, 190983, 188355, 185500, 182737, 179861, 176933, 174627, 173426, 172977, 172617, 172117, 171524, 170628, 169073, 166920, 164696, 162885, 161505, 160184, 158560, 156655, 154951, 153955, 153625, 153364, 152697, 151769, 150993, 150371, 149401, 147712, 145605, 143756, 142452, 141293, 139846, 138369, 137513, 137308, 136966, 135943, 134784, 134414, 134933, 135649, 136126, 136532, 136964, 137088, 136679, 136016, 135453, 134939, 134179, 133079, 131858, 130920, 130592, 130746, 130697, 129815, 128246, 126651, 125252, 123641, 121629, 119793, 118858, 118891, 119282, 119219, 118070, 115754, 112992, 110842, 109736, 109177, 108474, 107404, 106055, 104516, 103012, 101902, 101275, 100867, 100581, 100643, 100954, 100821, 99715, 97969, 96327, 95124, 94299, 93811, 93628, 93557, 93520, 93705, 94130, 94393, 94265, 94083, 94046, 93556, 91924, 89473, 87236, 85755, 84781, 84034, 83514, 83114, 82622, 82169, 82097, 82304, 82305, 82055, 82067]
52718H2067M87N10J75J86O97J112J004O60N23O55Q33Q85Q47Q80R90Q01p9j256
52700I1977j665q88J07J46o21j105r41q87j422j916j568n58K43L73R5k31n66j026
52682G9547j486j658j429j105j167j630j853j213J7P77L46q08j579j395o76k19
52666F4469l53p58q75m08M43J160J400J318J308J430J335Q18K12l5nj22m30m48
52648G0459J73J212K212K963L552M179N038N948O069M491J416j653l311l505l050
52633I6193k415j579p28l54o42j289j899k151j728o58M37R38J003J191J464J258
52617H9041N14j64m30n37n65j31P75J472J517J354J483J534Q50l72j214j118l55
52600I3654M95J062J233J082Q39P06O73N78K70l19j046j491j300o94k61j44J16
$$ y = [82067, 82554, 83064, 83239, 83425, 84122, 85234, 86238, 86898, 87421, 88076, 88909, 89794, 90641, 91521, 92511, 93312, 93233, 91977, 90312, 89424, 89531, 89677, 89056, 87951, 87010, 86123, 84701, 82785, 81217, 80659, 80902, 81275, 81370, 81139, 80573, 79547, 78061, 76403, 74974, 73869, 72702, 71072, 69219, 68006, 68023, 68800, 69146, 68338, 66759, 65364, 64688, 64469, 64116, 63358, 62483, 62075, 62518, 63678, 65078, 66396, 67704, 69134, 70469, 71287, 71499, 71464, 71459, 71337, 70907, 70459, 70632, 71844, 74056, 77019, 80571, 84750, 89788, 95736, 101805, 106296, 107712, 106059, 102748, 99243, 96193, 93778, 92199, 91471, 91117, 90475, 89186, 87287, 85136, 83408, 82750, 83187, 84125, 85128, 86319, 87783, 89041, 89555, 89391, 88961, 88424, 87859, 87728, 88503, 89975, 91492, 92846, 94329, 95863, 96713, 96341, 95127, 94009, 93654, 94149, 95211, 96444, 97526, 98365, 99071, 99744, 100322, 100592, 100273, 99227, 97736, 96436, 95742, 95481, 95337, 95453]
52583I5453P76J367J389J039Q31P91N60J35q9P7L61M78M27L06J30m1n5J19K67
52564A04321J93K0N9L53N07J72l68m02L02J073J134N63J43L73J050J709K019J768
52546A14989R60K8m27k33L01Q08J090R61M63R9L16P62O79M7l79l12l22p53j062
52527A18015p17n9K87K53O5k95p82r45n53o5N9J29O01J180J267R96R75J193J059
52508A22663M49p2j74j94m62p82q43p21o58o48n00k02q0n35j540k425k424j522
52490A09330m98n3j58m47q00j228j584j700j563j095k14O89R00M01J10N64R72
52473A03626L69r13j746j784j512j075j86Q79J299R56O56Q98J214J104Q02P40
52457A05327Q58R17R03Q29N71L12N36J249J667J154Q3p44j141j420j517r60K30
$$ y = [95453, 96229, 97596, 98985, 100024, 100855, 101646, 102206, 102341, 102252, 102329, 102690, 103168, 103595, 103901, 104031, 103990, 103935, 104054, 104321, 104514, 104534, 104593, 104946, 105453, 105625, 105257, 104855, 105157, 106230, 107364, 107927, 108070, 108443, 109493, 111202, 113221, 114989, 115949, 115977, 115550, 115317, 115618, 116426, 117516, 118477, 118940, 119039, 119355, 120117, 120796, 120843, 120464, 120152, 119830, 119077, 118015, 117298, 117239, 117526, 117779, 117844, 117549, 116767, 115822, 115269, 115204, 115263, 115392, 115993, 117173, 118440, 119436, 120411, 121604, 122663, 123112, 123040, 122866, 122672, 122210, 121428, 120585, 119864, 119206, 118558, 118058, 117856, 117776, 117241, 115701, 113276, 110852, 109330, 108832, 108779, 108621, 108174, 107374, 106146, 104562, 102862, 101299, 100204, 99990, 100679, 101579, 101980, 102090, 102654, 103626, 103995, 103082, 101336, 99552, 98040, 96965, 96779, 97658, 98957, 99913, 100569, 101467, 102681, 103785, 104587, 105327, 106185, 107102, 108005, 108834, 109405, 109717, 110253, 111502, 113169, 114323, 114406, 113662, 112521, 111101, 109584, 108624, 108854]
52440A08854J208J213M81o2J06N67O82M38L33N91R47J206J538J981K177J943J677
52423A25880J742J872J685J426J540J747J346L68l18k03L01N78N00K01k78p65
52407A37622q63m16K46P11Q59O62P9o63j033p02N0O72Q35N37K7l04k04J10J78
52388A38403j04l96m51m08l84j94L74J158J703J615R20J52l5L84O95L53k49m04
52370A43132j53l4MM82J208J258M47j23M56J701K549K691K419J825R88M97R02
52353A60249J793K221J956J599J543J502J175P89P17J005J436J805J928J689J209
52338A82616Q01O29N52M24L61N56R37J224J335J461J655J486N34q74j782j739
52322A90176j293j067p98P1J228J752J449J006Q17M98j67o39m83JM56J120K132
$$ y = [108854, 110062, 111275, 111756, 111694, 111800, 112367, 113049, 113487, 113820, 114411, 115358, 116564, 118102, 120083, 122260, 124203, 125880, 127622, 129494, 131179, 132605, 134145, 135892, 137238, 137606, 137288, 137085, 137386, 137964, 138464, 138665, 138387, 137622, 136759, 136343, 136589, 137300, 138159, 138821, 138900, 138237, 137204, 136502, 136552, 137224, 138059, 138596, 138623, 138319, 138115, 138225, 138403, 138299, 137903, 137452, 137044, 136660, 136466, 136840, 137998, 139701, 141316, 142236, 142388, 142353, 142737, 143432, 143785, 143536, 143132, 142979, 142945, 142949, 143431, 144639, 145897, 146344, 146221, 146677, 148378, 150927, 153618, 156037, 157862, 158850, 159347, 160249, 162042, 164263, 166219, 167818, 169361, 170863, 172038, 172827, 173544, 174549, 175985, 177790, 179718, 181407, 182616, 183417, 184046, 184598, 185022, 185383, 185939, 186876, 188100, 189435, 190896, 192551, 194037, 194571, 193697, 191915, 190176, 188883, 187816, 187018, 187089, 188317, 190069, 191518, 192524, 193341, 193839, 193672, 193033, 192550, 192551, 193007, 194127, 196259]
52305A96259K874K784K316K320K839L294L521L807M123M187M182M533N036N056
52291B47131M650M593N152N695N823O021O722P530P966Q371R250J0176J0235R460
52277C48775Q936R360J0132J0265R720R383R883J0861J1484J1403J0987J0755
52265D71944J0792J0814J0601J0202R776R411R102Q749Q191P412O670O255O067
52252E85986N692M952M150L674L484L205K575J596M44n92j118r74n31l77o24q12
52236F10730n81j85k7L6N46J704L032L957M349M500M796N544O837Q339R396R632
52220F72605R422R529J0240J1013J1051J0152Q946Q293Q415Q695Q386P424O310
52207G90481N362M462L598L060K842K349J221J8n55q57j933l920n708o404o445
$$ y = [196259, 199133, 201917, 204233, 206553, 209392, 212686, 216207, 220014, 224137, 228324, 232506, 237039, 242075, 247131, 251781, 256374, 261526, 267221, 273044, 279065, 285787, 293317, 301283, 309654, 318904, 329080, 339315, 348775, 357711, 367071, 377203, 387468, 397188, 406571, 416454, 427315, 438799, 450202, 461189, 471944, 482736, 493550, 504151, 514353, 524129, 533540, 542642, 551391, 559582, 566994, 573664, 579919, 585986, 591678, 596630, 600780, 604454, 607938, 611143, 613718, 615314, 615758, 615166, 614048, 613074, 612543, 612166, 611542, 610730, 610149, 609964, 609937, 609973, 610519, 612223, 615255, 619212, 623561, 628061, 632857, 638401, 645238, 653577, 662973, 672605, 682027, 691556, 701796, 712809, 723860, 734012, 742958, 751251, 759666, 768361, 776747, 784171, 790481, 795843, 800305, 803903, 806963, 809805, 812154, 813375, 813393, 812838, 811981, 810048, 806128, 800420, 794016, 787571]
52192G87571o830p767q686r166r283r157q754q176p739p563p401p043o698o742
52178F76566p146p342o837n877n242n366n824n875n344m668m226l987l784l576
52164F01472l328k982k670k646k850k800k150j213o66q02j301j648j669j610j752
52149E71385j996j907j283n25k26m52p61q86j061j583k327k906l161l313l655
52134E45343m149m340l886l197l183m078m923m715l730l099l191l410l453l792
52120D92197m561m922m194k918k130k048k121k048k013k110k114j825j298p88
52106D57107o47r43j063k06J386K336J797P03N76J661L037M194N369O459O827
52091D88593O473O363P093Q063Q521Q794R717J1262J2535J3019J3168J3631J4401
$$ y = [787571, 780741, 772974, 764288, 755122, 745839, 736682, 727928, 719752, 712013, 704450, 697049, 690006, 683308, 676566, 669420, 662078, 655241, 649364, 644122, 638756, 632932, 627057, 621713, 617045, 612819, 608832, 605048, 601472, 598144, 595162, 592492, 589846, 586996, 584196, 582046, 580833, 580167, 579365, 578064, 576416, 574747, 573137, 571385, 569389, 567482, 566199, 565674, 565448, 564996, 564235, 563349, 562288, 560705, 558378, 555472, 552311, 548998, 545343, 541194, 536854, 532968, 529771, 526588, 522510, 517587, 512872, 509142, 506043, 502852, 499442, 495989, 492197, 487636, 482714, 478520, 475602, 473472, 471424, 469303, 467255, 465242, 463132, 461018, 459193, 457895, 457107, 456460, 455517, 454454, 454248, 455634, 457970, 459767, 460470, 461046, 462707, 465744, 469938, 475307, 481766, 488593, 495066, 501429, 508522, 516585, 525106, 533900, 543617, 554879, 567414, 580433, 593601, 607232, 621633]
52078F21633J5007J5282J5543J5973J6167J5647J4713J4314J4834J5379J4750
52067G89242J2993J1436J1118J1619J1645J0408Q242O011M271K997J956J060K85
52054H83283o28k012l737n119n618n468n389n824o684p654q409q723q632q418
52040H00968q182p640o651n719n420n584n545n117m703m407l718k359q31K66J026
52025G36384J981L294M613N590O176O453O483O319O062N832N737N815O030O301
52011H13070O503O418N845M897M004L385K689J474j30j655l033m532o019o950
51997H25966p309p913r367j1198j2562j3411j4344j5471j6164j6071j5827j6418
51985F69911j8078k0077k1454k1752k1110j9988j8903j8230j8012j7877j7305
$$ y = [621633, 636640, 651922, 667465, 683438, 699605, 715252, 729965, 744279, 759113, 774492, 789242, 802235, 813671, 824789, 836408, 848053, 858461, 866703, 872714, 876985, 879982, 881938, 882998, 883283, 882655, 880643, 876906, 871787, 866169, 860701, 855312, 849488, 842804, 835150, 826741, 818018, 809386, 800968, 792786, 785146, 778495, 772776, 767356, 761772, 756227, 751110, 746407, 742000, 738282, 735923, 735092, 735358, 736384, 738365, 741659, 746272, 751862, 758038, 764491, 770974, 777293, 783355, 789187, 794924, 800739, 806769, 813070, 819573, 825991, 831836, 836733, 840737, 844122, 846811, 848285, 848155, 846500, 843467, 838935, 832916, 825966, 818657, 810744, 801377, 790179, 777617, 764206, 749862, 734391, 718227, 702156, 686329, 669911, 651833, 631756, 610302, 588550, 567440, 547452, 528549, 510319, 492307, 474430, 457125]
51974D57125j6139j4759j3663j2969j2426j1838j1293j0954j0821j0728j0450
51963C21085r798q723p424o247n450n049m830m496l884l134k549k264k109j908
51949B53220j704j554j313q95n45n62q37j031j088j268j683k120k330k227j887
51934B32176j631j965k977l959m146l789l776m244m377l819l417l874m485m003
51920A81714k445j113r49j667k486k971k976k440j623j083j148j581j954k034
51906A55244j792j341j014j101j342j075j99M79K53m73p38l51j5k19n98o45m56
51889A44617m56p58j074j088o61J25Q70J090P81N39P55J007O31k71r18q42l17
51872A44030K14O64J103J510J882K243K380J981J211O86O26N06j11p65o99K5N90
$$ y = [457125, 440986, 426227, 412564, 399595, 387169, 375331, 364038, 353084, 342263, 331535, 321085, 311287, 302564, 295140, 288893, 283443, 278394, 273564, 269068, 265184, 262050, 259501, 257237, 255128, 253220, 251516, 249962, 248649, 247754, 247209, 246647, 245810, 244779, 243691, 242423, 240740, 238620, 236290, 234063, 232176, 230545, 228580, 225603, 221644, 217498, 213709, 209933, 205689, 201312, 197493, 194076, 190202, 185717, 181714, 179269, 178156, 177207, 175540, 173054, 170083, 167107, 164667, 163044, 161961, 160813, 159232, 157278, 155244, 153452, 152111, 151097, 149996, 148654, 147579, 147380, 147859, 148112, 147639, 146901, 146550, 146535, 146316, 145718, 145073, 144617, 144161, 143403, 142329, 141241, 140580, 140705, 141575, 142665, 143446, 143985, 144740, 145747, 146378, 146107, 145189, 144347, 144030, 144244, 144908, 146011, 147521, 149403, 151646, 154026, 156007, 157218, 157904, 158530, 159036, 158925, 158160, 157461, 157486, 158076]
51855A58076N80M30O55J084J162P37K56J81M53N90L12j28k85p5K26M55O84Q32
51837A66225N70j35p79q05j82O96J389J556J156O67P17J109Q11o24k054j972m19
51820A67926J039J184K99n37o22O9J087J796J840J498J324J441J527J450J407
51805A82728J429J421J644K540L817M395L718K540K036K424K967K950K195Q46
51791B17650p61k013k303j607n94n0k52q64j336j322q88l89j77k93l75k7N93P65
51773B05757J28n86l74N43Q91K10l77P6Q13N81l37o19j6M27J96p2l1k92j123j706
51753B04089j418r03j003j439j400p82q2M87R50J045M91m07j035j182j025p29
51737A95657m73n72j077j591j814j914k018j876j445j267j649k019j734j034n75
$$ y = [158076, 158656, 159086, 159741, 160825, 161987, 162724, 162980, 163161, 163614, 164204, 164516, 164388, 164103, 164028, 164254, 164709, 165393, 166225, 166795, 166660, 165881, 165076, 164894, 165590, 166979, 168535, 169691, 170358, 171075, 172184, 172995, 172371, 170317, 168345, 167926, 168965, 170149, 170448, 169911, 169289, 169358, 170445, 172241, 174081, 175579, 176903, 178344, 179871, 181321, 182728, 184157, 185578, 187222, 189762, 193579, 197974, 201692, 204232, 206268, 208692, 211659, 214609, 216804, 217650, 216889, 214876, 212573, 210966, 210372, 210322, 210070, 209206, 207870, 206548, 205660, 205271, 205094, 204801, 204426, 204399, 204992, 205757, 205885, 205299, 204925, 205468, 206359, 206569, 206192, 206268, 207081, 207662, 207325, 206706, 206690, 207117, 207313, 207241, 207210, 206918, 205795, 204089, 202671, 201768, 200765, 199326, 197926, 197144, 197062, 197549, 198499, 199544, 200035, 199628, 198593, 197411, 196386, 195657, 195184, 194612, 193535, 191944, 190130, 188216, 186198, 184322, 182877, 181610, 179961, 177942, 176208, 175174, 174599]
51722A74599m57m28n59r15r92l87L22K81k88m34j1J93j68n01l67j29k43n68p12
51703A68236n50j78J91K45k2pP95J872K227J769J358J396J315P52K61M18R58J372
51685A82408J679K157K745L164L151K344M53k049l942m533m353m278m406m323
51671A70217l899l283k559j940j899k457k779k132r40k38l14n33l85K9L85M82
51655A47755J69m76r87j005q38r93j340j318q60m08j03K62M27k55j626k453j887
51638A34064n57L28M39K70J25j36n20p93q81q61n63J81R93J146N54l6M1N88R40
51619A35322Q14M78K95L90O35Q07Q07Q10J100J643K040J995J680J481J539J689
51603A53525J720J577J414J491J948K568K966L040K983K772K111J050K73L15P86
$$ y = [174599, 174142, 173714, 173155, 172240, 171248, 170861, 171183, 171464, 171176, 170742, 170731, 170924, 170756, 170255, 169888, 169759, 169516, 168948, 168236, 167686, 167508, 167699, 167944, 167922, 167915, 168710, 170582, 172809, 174578, 175936, 177332, 178647, 179399, 179660, 180078, 181036, 182408, 184087, 186244, 188989, 192153, 195304, 197648, 198101, 196052, 192110, 187577, 183224, 178946, 174540, 170217, 166318, 163035, 160476, 158536, 156637, 154180, 151401, 149269, 148329, 148091, 147777, 147244, 146859, 146888, 147273, 147755, 147924, 147448, 146461, 145456, 144618, 143625, 142285, 140967, 140107, 139699, 139596, 139858, 140285, 140030, 138404, 135951, 134064, 133507, 133835, 134274, 134544, 134669, 134533, 134013, 133220, 132339, 131478, 130915, 131096, 132089, 133235, 133789, 133753, 133794, 134382, 135322, 136136, 136614, 136909, 137299, 137934, 138741, 139548, 140358, 141458, 143101, 145141, 147136, 148816, 150297, 151836, 153525, 155245, 156822, 158236, 159727, 161675, 164243, 167209, 170249, 173232, 176004, 178115, 179165, 179438, 179753, 180539]
51588A80539R02N06J10L4J60M41J079J962K575K649K493K463K458K232J802J349
51572B03754R26M87l2p22j526k042j879j282r51j152j478j630j786j992j833j178
51556A85684o38p56j184j248r04n85m49m05n40q39q61l87l5m80j228j126OJ117
51538A75142J390J131R58R68R88J027J073R50O81N82P16O98K93j78l17j68j5k
51520A85917r8j29J69P77J046L50q79j418q17J14N85Q60J370J660J102J29k00
51503A90538K77P31P36Q47J565K413K519J760Q54N44R21J496J771J679J553J678
51487B11882J993K273K409K400K254K120K270K673K789K121Q58l39j129j657k049
51472B30868k191k112k114k350k569k567k551k792l104l036k507j927j645j548
$$ y = [180539, 181441, 181947, 182057, 182091, 182251, 182692, 183771, 185733, 188308, 190957, 193450, 195913, 198371, 200603, 202405, 203754, 204680, 205167, 205135, 204413, 202887, 200845, 198966, 197684, 196733, 195581, 194103, 192473, 190687, 188695, 186862, 185684, 185046, 184290, 183106, 181858, 180954, 180369, 179920, 179515, 178975, 178136, 177275, 176888, 176853, 176373, 175145, 174019, 174025, 175142, 176532, 177663, 178621, 179589, 180577, 181604, 182677, 183627, 184308, 184890, 185606, 186304, 186597, 186419, 186102, 185934, 185919, 185917, 185819, 185690, 185859, 186636, 187682, 188032, 187153, 185735, 184918, 185032, 185617, 186477, 187847, 189507, 190609, 190738, 190538, 190815, 191546, 192282, 193129, 194694, 197107, 199626, 201386, 202240, 202784, 203705, 205201, 206972, 208651, 210204, 211882, 213875, 216148, 218557, 220957, 223211, 225331, 227601, 230274, 233063, 235184, 236042, 235703, 234574, 232917, 230868, 228677, 226565, 224451, 222101, 219532, 216965, 214414, 211622, 208518, 205482, 202975, 201048, 199403, 197855]
51458A97855j310q28k52K39N21M63J4o03j055j268j465j779k089k299k524k747
51442A80873k626j993j360j451k255k943k856k168j540j424j841k490k902k822
51428A50202k559k619k910k779k011j301j312j749j913j761j777j985j859j211
51414A22456n47l00k74r6J79K27k9l75n29l06K99R53J112N98j30n25n93p35j020
51395A20365j055o44j99k52p34j113j100q83o56l10K20O05M68p1m99n45k97K10
51377A13510J026J840J933J046n4l14L70J043Q69J2o65n49K65J219J788J767J341
51360A26447R07P69Q86Q58K94p68j822k401k510k476k397k043j316n97m15r42
51344A12474j825k433k214j116J99P76K65p05j270j254j136j228j314j065n29
$$ y = [197855, 196545, 195717, 195465, 195704, 196225, 196688, 196702, 196099, 195044, 193776, 192311, 190532, 188443, 186144, 183620, 180873, 178247, 176254, 174894, 173443, 171188, 168245, 165389, 163221, 161681, 160257, 158416, 155926, 153024, 150202, 147643, 145024, 142114, 139335, 137324, 136023, 134711, 132962, 131049, 129288, 127511, 125526, 123667, 122456, 121909, 121609, 121335, 121239, 121418, 121645, 121616, 121241, 120712, 120406, 120705, 121658, 122770, 123368, 123238, 122713, 122120, 121385, 120365, 119310, 118666, 118467, 118215, 117481, 116368, 115268, 114385, 113729, 113419, 113639, 114244, 114712, 114641, 114142, 113597, 113300, 113510, 114536, 116376, 118309, 119355, 119301, 118987, 119357, 120400, 121269, 121281, 120616, 120067, 120332, 121551, 123339, 125106, 126447, 127354, 128123, 129009, 129867, 130161, 129393, 127571, 125170, 122660, 120184, 117787, 115744, 114428, 113831, 113416, 112474, 110649, 108216, 106002, 104886, 105085, 105861, 106126, 105421, 104151, 102897, 101761, 100533, 99219, 98154, 97625]
51329I7625j02j26n82j097j246r80n87k30K41Q52J167Q17J94J09P70J561J874
51312A00260J686J201M86k59n62k30K63M15L60M44L99l49j535k055j357k24K46
51295I9189k8l18k72j72k02j00L00O27M38k45j007j458j409r26l79j93l13k04
51277I3328M05J058J135O35P3j98j85L9L42L92n2p14j049r28o46l33J31O46Q54
51258I4933P33O30O14K93m13q88n41M20J273J496J004P9o41n43K28Q10P27M85
51240A00699P05J153J194P77L39N6j09KM55P65N08J52M73J279J646J360J097J105
51222A13656P83r1p05l72M86J098J367J527J438J006P71J210J832J725Q83J76
51206A26790J12L40L73J41k68p56j051q33k47K15L21K82K26qm56q73j123j288
$$ y = [97625, 97523, 97397, 96815, 95718, 94472, 93492, 92905, 92675, 92916, 93768, 94935, 95752, 95946, 96055, 96825, 98386, 100260, 101946, 103147, 103633, 103374, 102812, 102582, 102845, 103260, 103620, 104064, 104463, 104114, 102579, 100524, 99167, 98943, 99189, 99161, 98843, 98571, 98399, 98197, 98097, 98397, 99024, 99462, 99217, 98210, 96752, 95343, 94417, 94038, 93845, 93532, 93328, 93733, 94791, 95926, 96561, 96634, 96436, 96251, 96290, 96632, 97024, 96972, 96258, 95209, 94281, 93635, 93302, 93433, 94079, 94933, 95666, 96296, 96910, 97203, 96790, 95902, 95361, 95781, 97054, 98550, 99554, 99633, 98992, 98449, 98677, 99487, 100214, 100699, 101404, 102557, 103751, 104528, 104867, 104923, 104814, 104816, 105271, 106036, 106544, 106696, 107169, 108448, 110094, 111454, 112551, 113656, 114439, 114348, 113643, 113271, 113757, 114855, 116222, 117749, 119187, 120193, 120964, 122174, 124006, 125731, 126614, 126790, 126902, 127242, 127615, 127756, 127488, 126732, 125681, 124848, 124601, 124816, 125137, 125419, 125645, 125637, 125181, 124308, 123185, 121897]
51188A21897j256p27J89R07J157J317J566J280q7j877k792k499j911j812j935
51173A13417j719j279j053r19l78M31O95N6p86r71n73l29n27p57o94n58o34p51
51155A02671n70o3N73J161J406Q57n10j873k281j736j068p73n95k91j59l85n16
51138I5848j12M64N45J76L0M11R17J161J226J306J334J252J234J449J750J885
51122A10876J840J794J884K014J857J100o7q10m23P00J388J081M31K85O14Q45
51106A25409P85O02K67l12p37m33M54J064R04M06K31M18N09J71n15j205j496j219
51088A25303o60k76j28J15N00N38j11j008j343q41Q5Q47J092P10j20q36q41j18
51070A22908P11J013P31K48k10p44j332j550r97K5O47M57N8K48Q78J038L67l96
$$ y = [121897, 120641, 119914, 120103, 121010, 122167, 123484, 125050, 126330, 126243, 124366, 121574, 119075, 117164, 115352, 113417, 111698, 110419, 109366, 108447, 108069, 108500, 109195, 109251, 108465, 107494, 106921, 106592, 106065, 105308, 104614, 104056, 103422, 102671, 102101, 102038, 102611, 103772, 105178, 106035, 105525, 103652, 101371, 99635, 98567, 97794, 97199, 96908, 96749, 96364, 95848, 95736, 96200, 96745, 96921, 96951, 97362, 98279, 99440, 100666, 101972, 103306, 104558, 105792, 107241, 108991, 110876, 112716, 114510, 116394, 118408, 120265, 121365, 121298, 120488, 120065, 120765, 122153, 123234, 123665, 123950, 124564, 125409, 126194, 126796, 127063, 126751, 126014, 125581, 126035, 127099, 128003, 128409, 128640, 129058, 129567, 129738, 129223, 128018, 126522, 125303, 124643, 124367, 124239, 124354, 124854, 125392, 125281, 124273, 122930, 122089, 122174, 123021, 124113, 124823, 124703, 123867, 123026, 122908, 123619, 124632, 125363, 125611, 125401, 124657, 123325, 121775, 120778, 120803, 121450, 121907, 121965, 122213, 123091, 124129, 124496, 124100]
51052A24100m22J82O97P57N94N26N83O36N95M99N59R23J290J088L39n9N90J708
51034A35185K079J470Q73J046J583J781J771K111K668K697K007J331J332J733
51020A59667J774J251O84N80R26J440J967K450K755K806K771K911L241L616M000
51005A92839M469M893M981M726M545M864N724O907Q054Q658Q367P534P075P389
50991B81025P813P687P543Q508J0642J2731J3862J4411J5202J6450J8049K0257
50979D34180K3294K6618K9361L1454L3638L6302L9051M1519M4019M6852M9487
50968H35775N0904N0688M9323M7396M4913M1459L6788L1114K5006J9059J3551
50957A245976Q278K812k923q392j2822j5829j7556j8348j8382j7676j6333j4674
$$ y = [124100, 123678, 123860, 124557, 125314, 125908, 126434, 127017, 127653, 128248, 128747, 129306, 130229, 131519, 132607, 132946, 132887, 133477, 135185, 137264, 138734, 139607, 140653, 142236, 144017, 145788, 147899, 150567, 153264, 155271, 156602, 157934, 159667, 161441, 162692, 163376, 163956, 164882, 166322, 168289, 170739, 173494, 176300, 179071, 181982, 185223, 188839, 192839, 197308, 202201, 207182, 211908, 216453, 221317, 227041, 233948, 242002, 250660, 259027, 266561, 273636, 281025, 288838, 296525, 304068, 312576, 323218, 335949, 349811, 364222, 379424, 395874, 413923, 434180, 457474, 484092, 513453, 544907, 578545, 614847, 653898, 695417, 739436, 786288, 835775, 886679, 937367, 986690, 1034086, 1078999, 1120458, 1157246, 1188360, 1213366, 1232425, 1245976, 1254254, 1257066, 1254143, 1245751, 1232929, 1217100, 1199544, 1181196, 1162814, 1145138, 1128805, 1114131]
50945A114131j3161j2196j1950j2332j3092j3958j4790j5799j7456k0048k3124
50934I46225k5693k7194k8105k9328l1053l2592l3329l3371l3078l2324l0701
50923F09457k8277k5776k3836k2310k0493j8026j5388j3348j2015j0724q918o934
50911D03412n509m764m083l013j783q01j08L65M54R6k70j27M36Q64R54J115J698
50894C88936K487K934K811K484K554L209L934M040L568L388M207N701O998P727
50880D44978Q158Q499Q619Q580Q906J0016J1732J3590J5404J7293J9368K1673
50868E96816K4257K7153L0316L3735L7547M1943M7034N2850N9355O6377P3735
50857A091118Q1442Q9556R7684J04901J10472J14467J17399J19262J19250J16423
$$ y = [1114131, 1100970, 1088774, 1076824, 1064492, 1051400, 1037442, 1022652, 1006853, 989397, 969349, 946225, 920532, 893338, 865233, 835905, 804852, 772260, 738931, 705560, 672482, 640158, 609457, 581180, 555404, 531568, 509258, 488765, 470739, 455351, 442003, 429988, 419264, 410346, 403412, 397903, 393139, 389056, 386043, 384260, 383459, 383351, 383716, 384170, 384266, 383996, 383869, 384305, 385169, 386123, 387238, 388936, 391423, 394357, 397168, 399652, 402206, 405415, 409349, 413389, 416957, 420345, 424552, 430253, 437251, 444978, 453136, 461635, 470254, 478834, 487740, 497756, 509488, 523078, 538482, 555775, 575143, 596816, 621073, 648226, 678542, 712277, 749824, 791767, 838801, 891651, 951006, 1017383, 1091118, 1172560, 1262116, 1359800, 1464701, 1575173, 1689640, 1807039, 1926301, 2045551, 2161974]
50847B161974J10245J00498Q7113P0626N2606L4958J8643L267j1768k6018l8097
50836B564047m6795n1754n3205n1607m7647m2157l5712k8574k1295j5103j1353
50825B158845j0583j2359j5966k0954k7072l3892m0835m7500n3896o0192o6240
50814A769356p1374p4841p6264p5557p2666o7808o1857n5861m9985m3465l5939
50803A083739k8200k1261j5159r285l453K075P422J3076J9008K4517K9111L2998
50791A134588L6456L9176M0592M0547L9344L7257L4131K9526K3287J6094R203
50780A480201L355j876p340j3082j8351k2738k6644l0543l4268l7347l9649m1472
50768A210246m3111m4460m4902m3736m0999l7701l4825l2199k8933k4818k0624
$$ y = [2161974, 2272219, 2372717, 2459830, 2530456, 2583062, 2618020, 2636663, 2639930, 2628162, 2602144, 2564047, 2517252, 2465498, 2412293, 2360686, 2313039, 2270882, 2235170, 2206596, 2185301, 2170198, 2158845, 2148262, 2135903, 2119937, 2098983, 2071911, 2038019, 1997184, 1949684, 1895788, 1835596, 1769356, 1697982, 1623141, 1546877, 1471320, 1398654, 1330846, 1268989, 1213128, 1163143, 1119678, 1083739, 1055539, 1034278, 1019119, 1009834, 1006381, 1008456, 1015878, 1028954, 1047962, 1072479, 1101590, 1134588, 1171044, 1210220, 1250812, 1291359, 1330703, 1367960, 1402091, 1431617, 1454904, 1470998, 1480201, 1483556, 1481680, 1474340, 1461258, 1442907, 1420169, 1393525, 1362982, 1328714, 1291367, 1251718, 1210246, 1167135, 1122675, 1077773, 1034037, 993038, 955337, 920512, 888313, 859380, 834562, 813938]
50757H13938j6932j3467r817o101k480J339N613J0003J4037J7784K1624K5632
50745H61173K9703L4004L8852M4312N0275N6684O3344O9728P5446Q0566Q5055
50734A489142Q8154Q8814Q6678Q2074P5221O5968N4328M0736K5676R634o470k1236
50722B078719l3471m2727m9066n2634n3621n2317m8959m3744l7197l0292k3906
50711A610785j8284j3320r337p120p151r061j2132j6015k0575k5223k9025l1611
50699A411931l3462l4981l5696l4809l2332k9079k5753k2472j9155j5858j2609
50688A115725r274n619j263M184J0598J7151K3285K9641L7267M5979N4425O1957
50676A384056O9360P7342Q5137R1330R5330R7311R7176R4367Q8512P9801O8982
$$ y = [813938, 797006, 783539, 773722, 767621, 765141, 766480, 772093, 782096, 796133, 813917, 835541, 861173, 890876, 924880, 963732, 1008044, 1058319, 1115003, 1178347, 1248075, 1323521, 1404087, 1489142, 1577296, 1666110, 1752788, 1834862, 1910083, 1976051, 2030379, 2071115, 2096791, 2106425, 2099955, 2078719, 2045248, 2002521, 1953455, 1900821, 1847200, 1794883, 1745924, 1702180, 1664983, 1634691, 1610785, 1592501, 1579181, 1569844, 1562724, 1555573, 1546512, 1534380, 1518365, 1497790, 1472567, 1443542, 1411931, 1378469, 1343488, 1307792, 1272983, 1240651, 1211572, 1185819, 1163347, 1144192, 1128334, 1115725, 1106451, 1100832, 1099569, 1103753, 1114351, 1131502, 1154787, 1184428, 1221695, 1267674, 1322099, 1384056, 1453416, 1530758, 1615895, 1707225, 1802555, 1899866, 1997042, 2091409, 2179921, 2259722, 2328704]
50665B328704N7307M5944L4988K3641J1789P26q509j6708k5416l4691m3180n0154
50653B324441n6177o1684o6065o8539o9007o7608o4266n9176n3095m6683l9947
50642A672194l2689k5087j7631j0837n237j146J741M078N989O907O507N274L862
50629A613925K440R92k04q24p72J37K268N467Q797J1515J3904J6408J8340J8320
50615A710713J5976J2333Q377M075p79n498r016j1200j2925j4859j6776j8215
50603A662206j9360k0894k3288k6638l0936l5922m0659m3930m5376m5852m6204
50592A283147m6159m4946m2683m0290l8087l5346l1562k7470k4241k2116k0396
50581I09851j8482j6366j4215j2147j0444r400q747p636n513k719O2K683N471
$$ y = [2328704, 2386011, 2431955, 2466943, 2490584, 2502373, 2503099, 2494590, 2477882, 2452466, 2417775, 2374595, 2324441, 2268264, 2206580, 2140515, 2071976, 2002969, 1935361, 1871095, 1811919, 1758824, 1712141, 1672194, 1639505, 1614418, 1596787, 1585950, 1580713, 1579567, 1581308, 1585386, 1591375, 1598282, 1604789, 1610063, 1613925, 1616365, 1617357, 1617153, 1616329, 1615557, 1615694, 1617962, 1623429, 1632226, 1643741, 1657645, 1674053, 1692393, 1710713, 1726689, 1739022, 1747399, 1751474, 1750695, 1745197, 1736181, 1724981, 1712056, 1697197, 1680421, 1662206, 1642846, 1621952, 1598664, 1572026, 1541090, 1505168, 1464509, 1420579, 1375203, 1329351, 1283147, 1236988, 1192042, 1149359, 1109069, 1070982, 1035636, 1004074, 976604, 952363, 930247, 909851, 891369, 875003, 860788, 848641, 838197, 828797, 820050, 812414, 806901, 804182, 804244, 806927, 812398]
50568H12398Q434J1138J3450J6055J9747K4498K9571L4496L9528M5115N1282N7637
50556A163349O3663O8807P2621P5051P6356P6464P4660P0229O3399N5370M7559
50545A907528M0947L5870L2042K8754K5433K2075J8969J6112J3217J0200P321
50534B158468M855L045K348L381O341J0726J5733K0782K5603L0002L3667L6116
50522B351067L6884L5879L3438K9796K4681J7707R097l96j0190k0082k9771l8728
50510B439382m6734n3978o0322o4922o6994o6699o4778o1510n6545m9775m1931
50499A805194l4132k7076k0849j5433j1035p751n039j875K315P020J1109J3887
50487A716335J5343J5446J3609R100J757p905j9076l0899m2440n2659o0608o5734
$$ y = [812398, 820832, 831970, 845420, 861475, 881222, 905720, 935291, 969787, 1009315, 1054430, 1105712, 1163349, 1227012, 1295819, 1368440, 1443491, 1519847, 1596311, 1670971, 1741200, 1804599, 1859969, 1907528, 1948475, 1984345, 2016387, 2045141, 2070574, 2092649, 2111618, 2127730, 2140947, 2151147, 2158468, 2163323, 2166368, 2168716, 2172097, 2178438, 2189164, 2204897, 2225679, 2251282, 2281284, 2314951, 2351067, 2387951, 2423830, 2457268, 2487064, 2511745, 2529452, 2538549, 2538153, 2527963, 2507881, 2478110, 2439382, 2392648, 2338670, 2278348, 2213426, 2146432, 2079733, 2014955, 1953445, 1896900, 1847125, 1805194, 1771062, 1743986, 1723137, 1707704, 1696669, 1688918, 1683879, 1682004, 1684319, 1691339, 1702448, 1716335, 1731678, 1747124, 1760733, 1769833, 1771590, 1763685, 1744609, 1713710, 1671270, 1618611, 1558003, 1492269]
50475A492269o8113o8394o7330o5314o2403n8753n4783n0852m6921m2748l8403
50464H68255l4433l1379k9050k6483k2869j8516j4559j1677r461p283n267l900
50452F53378l024j901k09J676L353M870O389P955R622J1429J3137J4525J5944
50439G37144J7979K0428K2262K3001K3466K4741K6852K9009L0783L2396L4091
50428A022152L5844L7607L9380M0945M1894M2011M1467M0705M0240M0433M1206
50417A463884M2063M2549M2643M2549M2275M1542M0005L7406L3714K9249K4489
50406A882368J9640J4528R048L351k528q877j5841k3083l0194l7125m3840m9878
50394A717569n4754n8584o1738o4032o4805o3838o1638n8709n4997n0297m4892
$$ y = [1492269, 1424156, 1355762, 1288432, 1223118, 1160715, 1101962, 1047179, 996327, 949406, 906658, 868255, 833822, 802443, 773393, 746910, 724041, 705525, 690966, 679289, 669828, 662545, 657278, 653378, 650354, 648453, 648244, 649920, 653273, 658143, 664532, 672487, 682109, 693538, 706675, 721200, 737144, 755123, 775551, 797813, 820814, 844280, 869021, 895873, 924882, 955665, 988061, 1022152, 1057996, 1095603, 1134983, 1175928, 1217822, 1259833, 1301300, 1342005, 1382245, 1422678, 1463884, 1505947, 1548496, 1591139, 1633688, 1675963, 1717505, 1757510, 1794916, 1828630, 1857879, 1882368, 1902008, 1916536, 1925584, 1928935, 1926407, 1917530, 1901689, 1878606, 1848412, 1811287, 1767447, 1717569, 1662815, 1604231, 1542493, 1478461, 1413656, 1349818, 1288180, 1229471, 1174474, 1124177, 1079285]
50383A079285l9501l4644l0215k5635k0478j5014r971n719j887K008N856R212
50371I13297J1906J3903J4713J3623J0567O246J244m324j0157j5371j9275k2034
50359I14338k4072k5295k5495k5204k5298k5768k5673k4451k2658k1032j9547
50348F49845j7811j5891j4062j2128r738p249n450m373l180j453J17P44P12R47
50334E61030J859L094M155M753M862M834N229O084O727O857P259Q680J0402J0990
50320F46815J0339R847J0463J1672J2702J3596J4540J5162J5270J5551J6579J7666
50308H10202J7576J6164J4551J3771J3882J4185J3797J2181R660P326N934N076
50296I54305L786J774m23k292l787n210p163j0340j4747j9184k2155k3327k3567
$$ y = [1079285, 1039784, 1005140, 974925, 949290, 928812, 913798, 903827, 898108, 896221, 898229, 904085, 913297, 925203, 939106, 953819, 967442, 978009, 984255, 985499, 981175, 971018, 955647, 936372, 914338, 890266, 864971, 839476, 814272, 788974, 763206, 737533, 713082, 690424, 669392, 649845, 632034, 616143, 602081, 589953, 580215, 572966, 567516, 563143, 559963, 558510, 558627, 559371, 560083, 561030, 562889, 565983, 570138, 574891, 579753, 584587, 589816, 595900, 602627, 609484, 616743, 625423, 635825, 646815, 657154, 667001, 677464, 689136, 701838, 715434, 729974, 745136, 760406, 775957, 792536, 810202, 827778, 843942, 858493, 872264, 886146, 900331, 914128, 926309, 935969, 943295, 949229, 954305, 958091, 959865, 959442, 957150, 953363, 948153, 940990, 930650, 915903, 896719, 874564, 851237, 827670]
50283H27670k3656k3602k3222k2629k1938k0980j9609j7964j6276j4695j3381
50272F09718j2421j1616j0712r857r408r313r070q413p589o874o249n606n004
50259D97586m522m186m047l989l518k266p29K9l13q62o08M19J457K003K151K181
50243D80786K335K823L643M375M487L904L102K615K598K864L140L248L099K651
50229E25670J943J131L82k39p12q92o68l45m83j093j445j052n74j045k383l319
50213E14876k967j787p91l36k2O04J621K772L646M007M114M498N323O273P097
50198E48928P871Q559Q886Q850Q924R249R127P840N735L841K512J141p45k648
50184F28070l716l790l502l427l481l162k303j368r42j012r63l38O58J591K403
$$ y = [827670, 804014, 780412, 757190, 734561, 712623, 691643, 672034, 654070, 637794, 623099, 609718, 597297, 585681, 574969, 565112, 555704, 546391, 537321, 528908, 521319, 514445, 508196, 502590, 497586, 493064, 488878, 484831, 480842, 477324, 475058, 474329, 474358, 474045, 473183, 472575, 472994, 474451, 476454, 478605, 480786, 483121, 485944, 489587, 493962, 498449, 502353, 505455, 508070, 510668, 513532, 516672, 519920, 523019, 525670, 527613, 528744, 529126, 528887, 528175, 527283, 526615, 526270, 525787, 524694, 523249, 522197, 521623, 520578, 518195, 514876, 511909, 510122, 509331, 508995, 508973, 509577, 511198, 513970, 517616, 521623, 525737, 530235, 535558, 541831, 548928, 556799, 565358, 574244, 583094, 592018, 601267, 610394, 618234, 623969, 627810, 630322, 631463, 630718, 628070, 624354, 620564, 617062, 613635, 610154, 606992, 604689, 603321, 602379, 601367, 600404, 600066, 600724, 602315, 604718]
50169F04718L294M182M730M895N063N452N789N779N545N384N269N055N010N639
50155F75804O913Q067Q496Q473Q695R262R626R484R317R864J1305J3135J4685
50142H03126J5716J6642J8175K0629K3624K6705L0067L4276L9397M5070N1455
50131A124882N9402O9353Q0766R3007J06145J20199J34229J46858J57075J63704
50121B255620J64589J57716J43285J23855J02442Q1384O2928M9400M1796L8832
50111C221847L7988L6976L3850K6410J2537q753l6692o8744j01001j29290j50842
50100B874286j64980j72152j72754j67331j57339j44888j31613j18186j04850
50091A540193r1966p9987o9213n9706n1303m3794l7153l1463k6574k2135j8085
$$ y = [604718, 608012, 612194, 616924, 621819, 626882, 632334, 638123, 643902, 649447, 654831, 660100, 665155, 670165, 675804, 682717, 690784, 699280, 707753, 716448, 725710, 735336, 744820, 754137, 764001, 775306, 788441, 803126, 818842, 835484, 853659, 874288, 897912, 924617, 954684, 988960, 1028357, 1073427, 1124882, 1184284, 1253637, 1334403, 1427410, 1533555, 1653754, 1787983, 1934841, 2091916, 2255620, 2420209, 2577925, 2721210, 2845065, 2947507, 3028891, 3091819, 3141219, 3183015, 3221847, 3259835, 3296811, 3330661, 3357071, 3369608, 3360855, 3324163, 3255419, 3154418, 3025128, 2874286, 2709306, 2537154, 2364400, 2197069, 2039730, 1894842, 1763229, 1645043, 1540193, 1448227, 1368240, 1299027, 1239321, 1188018, 1144224, 1107071, 1075608, 1049034, 1026899, 1008814]
50080A008814j4765j2358j0537q891p435o398n817n608n770o221o710p126p558
50067I03620p783p177n520l521k002r68KQ69J338J775K944M827O375O750O215
50052I07744N631N481N724O209O885P753Q757R776J0687J1547J2592J3872J5103
50039A027761J6064J6984J8142J9340K0168K0626K1053K1571K2183K3245K5160
50028A252297K7551K9526L0857L2254L4128L5909L7127L8588M1775M7329N4751
50017A662092O3389P3194Q4550R7935J13793J32218J52688J74442J97153K20604
50007B972058K43387K62217K73164K73787K64176K46392K23444J98824J76175
49998E133624J58414J46628J39874J35930J31978J24633J10133Q5485M9900N163
$$ y = [1008814, 994049, 981691, 971154, 962263, 954828, 948430, 942613, 937005, 931235, 925014, 918304, 911178, 903620, 895837, 888660, 883140, 879619, 877617, 876649, 876651, 877520, 878858, 880633, 883577, 888404, 894779, 901529, 907744, 913375, 918856, 924580, 930789, 937674, 945427, 954184, 963960, 974647, 986194, 998786, 1012658, 1027761, 1043825, 1060809, 1078951, 1098291, 1118459, 1139085, 1160138, 1181709, 1203892, 1227137, 1252297, 1279848, 1309374, 1340231, 1372485, 1406613, 1442522, 1479649, 1518237, 1560012, 1607341, 1662092, 1725481, 1798675, 1883225, 1981160, 2094953, 2227171, 2379859, 2554301, 2751454, 2972058, 3215445, 3477662, 3750826, 4024613, 4288789, 4535181, 4758625, 4957449, 5133624, 5292038, 5438666, 5578540, 5714470, 5846448, 5971081, 6081214, 6166699, 6216599, 6221762]
49988F221762m5135r6572j44624j85612k17756k41310k57542k67675k72667k73344
49978D219525k70253k63540k53370k40392k25486k09215j91903j74252j57348
49969B233766j41845j27483j13730j00682q9042p9286p1184o4190n7969n2406
49959A335949m7338m2624l8406l5016l2563l0744k9184k7861k7059k6927k7133
49948I71094k6976k5966k4271k2579k1361k0383j9146j7647j6306j5137j3550
49937G47772j1320r248q234p993p354n836m161l033k153r19M41J190J309J596
49923F92057K486L344L321K460J582J254J227Q76kr24j081k2J879L676M681N089
49907G21903N706P083R084J1244J3396J5830J8932K2741K6834L0780L4827L9961
$$ y = [6221762, 6176627, 6080055, 5935431, 5749819, 5532063, 5290753, 5033211, 4765536, 4492869, 4219525, 3949272, 3685732, 3432362, 3191970, 2966484, 2757269, 2565366, 2391114, 2233766, 2091921, 1964438, 1850708, 1750026, 1660984, 1581698, 1510514, 1446324, 1388355, 1335949, 1288611, 1245987, 1207581, 1172565, 1140002, 1109258, 1080074, 1052213, 1025154, 998227, 971094, 944118, 918152, 893881, 871302, 849941, 829558, 810412, 792765, 776459, 761322, 747772, 736452, 727204, 718970, 710977, 703623, 697787, 693626, 690593, 688440, 687521, 687962, 689152, 690461, 692057, 694543, 697887, 701208, 703668, 705250, 706504, 707731, 708607, 708605, 707681, 706600, 706578, 708457, 712133, 716814, 721903, 727609, 734692, 743776, 755020, 768416, 784246, 803178, 825919, 852753, 883533, 918360, 958321]
49895I58321M7017N5702O4956P4434Q5177R8458J14193J30995J47512J62980J76379
49884B116124J85726J88727J83949J71258J51605J27031J00833P7024N8968M8127
49874C409372M3725M3408M4240M3239L7328K3419m75l3682p2553j12037j47774
49863C278210j76841j97330k08208k09754k03704j92409j77916j61733j45054
49854A605261j28739j13211r8696q5630p4591o5718n8417n1836m5616l9971l5150
49843H07686l1066k7553k4674k2481k0628j8623j6450j4561j3211j2117j0944
49832E95378r797q963q417p936p538p396p391p096o361n604n318n471n590n369
49818D97131m930m468l907l087k139j444j142r93q12p96j161j685j922j810j703
$$ y = [958321, 1005338, 1061040, 1125996, 1200430, 1285607, 1384065, 1498258, 1629253, 1776765, 1939745, 2116124, 2301850, 2490577, 2674526, 2845784, 2997389, 3124420, 3225253, 3302277, 3361245, 3409372, 3453097, 3496505, 3540745, 3583984, 3621312, 3644731, 3644256, 3610574, 3538021, 3425984, 3278210, 3101369, 2904039, 2695831, 2486077, 2282373, 2089964, 1912048, 1750315, 1605261, 1476522, 1363311, 1264615, 1178985, 1104394, 1038676, 980259, 928423, 882807, 842836, 807686, 776620, 749067, 724393, 701912, 681284, 662661, 646211, 631650, 618439, 606322, 595378, 585581, 576618, 568201, 560265, 552727, 545331, 537940, 530844, 524483, 518879, 513561, 508090, 502500, 497131, 492201, 487733, 483826, 480739, 478600, 477156, 476014, 475021, 474209, 473413, 472252, 470567, 468645, 466835, 465132]
49803D65132j837k119k465k962l526l834l767l667l844m136m155l781l154k395
49789D19490j620j062q94j024j198j238j007l94L86P07J48q44j312q44j1M23L34
49772D10040J82K85N05O49R12J571K380K652K153J488J249J163O51m7j14M96Q96
49755D27111O91O27J277J959J739R04N05Q58J399J758K040K129J680Q91M78O66
49739D46712J010J377K237L499L891K351l61k225k144r75l27p69j603k105k399
49724D48169k903l328k957j872j198j667k538k532j488m40k27p44j414j744j438
49709D21679o26k5k36q56r06k15M31O10Q66J601K166J682K69j138j818j651q46
49692D20987J85R06J110J112J210J190P59K01J02O05J256J577J421R84O98R77
$$ y = [465132, 463295, 461176, 458711, 455749, 452223, 448389, 444622, 440955, 437111, 432975, 428820, 425039, 421885, 419490, 417870, 416808, 415914, 414890, 413692, 412454, 411447, 411053, 411439, 412146, 412294, 411450, 410138, 409294, 409283, 409706, 410040, 410222, 410507, 411012, 411661, 412573, 414144, 416524, 419176, 421329, 422817, 424066, 425229, 425880, 425833, 425719, 426215, 427111, 427802, 428429, 429706, 431665, 433404, 434308, 434813, 435671, 437070, 438828, 440868, 442997, 444677, 445568, 446046, 446712, 447722, 449099, 451336, 454835, 458726, 461077, 460716, 458491, 456347, 455372, 455045, 454276, 452673, 450568, 448169, 445266, 441938, 438981, 437109, 435911, 434244, 431706, 429174, 427686, 427246, 427019, 426275, 424861, 423117, 421679, 421053, 421028, 420792, 419936, 419030, 418815, 419246, 419856, 420722, 422323, 424489, 426171, 426440, 425302, 423484, 421833, 420987, 421172, 422078, 423188, 424300, 425510, 426700, 427459, 427660, 427762, 428367, 429623, 431200, 432621, 433605, 434303, 435280]
49676D35280J761K457K570K254J949J742J449J111J083J554K351L163L767M035
49662D66526L981L774L579L412L249L197L402L812M133M045L513K909K761L154
49648E15447L523L336K853K744L104L404L477L804M551N106N031M762M804M802
49634E70748M183L301L052L573M165M417M558M633M192L122K120J885K256K580
49620F18785K603K590K649K414J565N31L57J658L753N189N274M782M902N829O790
49605F69671P222P295P426P794Q436R365J0359J1023J1229J1359J1835J2648J3460
49592G99122J4044J4540J5249J6225J7112J7545J7694J8179J9336K0788K1934
49581I91768K2586K2931K3199K3712K4833K6491K7984K8775K9235L0018L1057
$$ y = [435280, 437041, 439498, 442068, 444322, 446271, 448013, 449462, 450573, 451656, 453210, 455561, 458724, 462491, 466526, 470507, 474281, 477860, 481272, 484521, 487718, 491120, 494932, 499065, 503110, 506623, 509532, 512293, 515447, 518970, 522306, 525159, 527903, 531007, 534411, 537888, 541692, 546243, 551349, 556380, 561142, 565946, 570748, 574931, 578232, 581284, 584857, 589022, 593439, 597997, 602630, 606822, 609944, 612064, 613949, 616205, 618785, 621388, 623978, 626627, 629041, 630606, 631137, 631494, 633152, 636905, 642094, 647368, 652150, 657052, 662881, 669671, 676893, 684188, 691614, 699408, 707844, 717209, 727568, 738591, 749820, 761179, 773014, 785662, 799122, 813166, 827706, 842955, 859180, 876292, 893837, 911531, 929710, 949046, 969834, 991768, 1014354, 1037285, 1060484, 1084196, 1109029, 1135520, 1163504, 1192279, 1221514, 1251532, 1282589]
49570A282589L1816L2351L3216L4330L4859L4453L3804L3551L3418L2943L2409
49559A649739L2325L2405L1815L0304K8522K7134K6149K5149K3896K2476K1063
49548A950977J9615J7851J5588J2991J0403P954N642L688K431J700P95p12k421
49535B046502l674m326m669m808m573l868k825j606l02J024K362L760N250O823
$$ y = [1282589, 1314405, 1346756, 1379972, 1414302, 1449161, 1483614, 1517418, 1550969, 1584387, 1617330, 1649739, 1682064, 1714469, 1746284, 1776588, 1805110, 1832244, 1858393, 1883542, 1907438, 1929914, 1950977, 1970592, 1988443, 2004031, 2017022, 2027425, 2035379, 2041021, 2044709, 2047140, 2048840, 2049635, 2048923, 2046502, 2042828, 2038502, 2033833, 2029025, 2024452, 2020584, 2017759, 2016153, 2015851, 2016875, 2019237, 2022997, 2028247, 2035070]
$$ [...]
##END NTUPLES=NMR SPECTRUM
##END=
