##TITLE=NES1015_877608_9233139_i2hfbBXd1r
##JCAMPDX= 6.0         $$ Bruker NMR JCAMP-DX V2.0
##DATA TYPE= NMR SPECTRUM
##DATA CLASS= NTUPLES
##ORIGIN= BRUKER
##OWNER= Administrator
$$ 1.72 TOPSPIN		Version 2.1
$$ 2015-06-19 07:42:56.878 -0700  Administrator@X
$$ Compression mode = diff/dup
##.OBSERVE FREQUENCY= 400.02188249412
##.OBSERVE NUCLEUS= ^1H
##.ACQUISITION MODE= SIMULTANEOUS (DQD)
##.ACQUISITION SCHEME= undefined
##.AVERAGES= 64
##.DIGITISER RES= 22
##SPECTROMETER/DATA SYSTEM= spect
##.PULSE SEQUENCE= noesygpps1d.comp
##.SOLVENT NAME= COFFEE_meoh
##.SHIFT REFERENCE= INTERNAL, COFFEE_meoh, 1, 14.96377
##AUDIT TRAIL= $$ (NUMBER, WHEN, WHO, WHERE, PROCESS, VERSION, WHAT)
$$ ##TITLE= Audit trail, TOPSPIN		Version 2.1
$$ ##JCAMPDX= 5.01
$$ ##ORIGIN= Bruker BioSpin GmbH
$$ ##OWNER= Administrator
$$ $$ E:\/data/COFFEE/nmr/NES1015_877608_9233139_i2hfbBXd1r/12/pdata/1/auditp.txt
$$ ##AUDIT TRAIL=  $$ (NUMBER, WHEN, WHO, WHERE, PROCESS, VERSION, WHAT)
(   1,<2015-06-17 18:49:31.144 -0700>,<Administrator>,<X>,<go>,<TOPSPIN 2.1>,
      <created by zg
	started at 2015-06-17 18:38:01.487 -0700,
	POWCHK enabled, PULCHK disabled,
       configuration hash MD5:
       21 0F 79 D6 B3 7B B4 F6 88 20 88 DB 03 48 BD 9F
       data hash MD5: 64K
       9C 5F C4 2E 72 4C 84 DD 89 85 DC 08 FE D7 F7 80>)
(   2,<2015-06-17 18:49:34.472 -0700>,<Administrator>,<X>,<proc1d>,<TOPSPIN 2.1>,
      <Start of raw data processing
       efp LB = 0.3 FT_mod = 6 PKNL = 1 PHC0 = 0 PHC1 = 0 SI = 128K 
       data hash MD5: 128K
       E2 4F 00 0F A2 9C A9 92 06 32 A3 74 AF E8 28 15>)
(   3,<2015-06-17 18:49:35.347 -0700>,<Administrator>,<X>,<proc1d>,<TOPSPIN 2.1>,
      <pk PHC0 = -84.28711 PHC1 = 0 
       data hash MD5: 128K
       0A 35 AA 69 CF 65 B4 2A 84 F1 4A 2D A2 FB 09 88>)
(   4,<2015-06-17 18:49:35.722 -0700>,<Administrator>,<X>,<proc1d>,<TOPSPIN 2.1>,
      <abs ABSG = 1 
       data hash MD5: 128K
       BB 28 79 BD D4 50 60 EB 7B 71 EB 68 D7 88 69 81>)
(   5,<2015-06-17 18:49:35.800 -0700>,<Administrator>,<X>,<proc1d>,<TOPSPIN 2.1>,
      <abs ABSG = 2 
       data hash MD5: 128K
       1F 36 26 33 70 03 53 BE 74 8D DB 3E DE E9 74 56>)
(   6,<2015-06-17 18:49:35.878 -0700>,<Administrator>,<X>,<proc1d>,<TOPSPIN 2.1>,
      <abs ABSG = 3 
       data hash MD5: 128K
       B7 17 8E 9F 9B CA 06 86 BD 8F 71 49 AC C7 02 7D>)
(   7,<2015-06-17 18:49:35.972 -0700>,<Administrator>,<X>,<proc1d>,<TOPSPIN 2.1>,
      <abs ABSG = 4 
       data hash MD5: 128K
       75 E9 FD CC 0F C4 1B 6F C6 54 4A 22 65 3D A0 39>)
(   8,<2015-06-17 18:49:36.050 -0700>,<Administrator>,<X>,<proc1d>,<TOPSPIN 2.1>,
      <abs ABSG = 5 
       data hash MD5: 128K
       62 1D A5 38 73 CF 50 2C BF 66 DA 50 0A EC 52 4D>)
(   9,<2015-06-17 18:49:38.050 -0700>,<Administrator>,<X>,<audit>,<TOPSPIN 2.1>,
      <user comment:
       ICON-NMR User ID: COFFEE
       data hash MD5: 128K
       62 1D A5 38 73 CF 50 2C BF 66 DA 50 0A EC 52 4D>)
$$ [...]
##$TP07= 0
##$TPNAME0= <>
##$TPNAME1= <>
##$TPNAME2= <>
##$TPNAME3= <>
##$TPNAME4= <>
##$TPNAME5= <>
##$TPNAME6= <>
##$TPNAME7= <>
##$TPOAL= (0..7)
0.5 0.5 0.5 0.5 0.5 0.5 0.5 0.5
##$TPOFFS= (0..7)
0 0 0 0 0 0 0 0
##$TUNHIN= 0
##$TUNHOUT= 0
##$TUNXOUT= 0
##$USERA1= <user>
##$USERA2= <user>
##$USERA3= <user>
##$USERA4= <user>
##$USERA5= <user>
##$V9= 5
##$VALIST= <valist>
##$VCLIST= <CCCCCCCCCCCCCCC>
##$VD= 0
##$VDLIST= <DDDDDDDDDDDDDDD>
##$VPLIST= <PPPPPPPPPPPPPPP>
##$VTLIST= <TTTTTTTTTTTTTTT>
##$WBST= 2048
##$WBSW= 25
##$XGAIN= (0..3)
0 0 0 0
##$XL= 0
##$YL= 0
##$YMAX_a= 7424500
##$YMIN_a= -15591843
##$ZGOPTNS= <>
##$ZL1= 120
##$ZL2= 120
##$ZL3= 120
##$ZL4= 120
##$ABSF1= 14.96377
##$ABSF2= -5.594412
##$ABSG= 5
##$ABSL= 3
##$ALPHA= 0
##$AQORDER= 0
##$ASSFAC= 0
##$ASSFACI= 0
##$ASSFACX= 0
##$ASSWID= 0
##$AUNMP= <proc_prof1d_extract.lims>
##$AXLEFT= 0
##$AXNAME= <>
##$AXNUC= <1H>
##$AXRIGHT= 0
##$AXTYPE= 0
##$AXUNIT= <>
##$AZFE= 0.1
##$AZFW= 0.1
##$BCFW= 0
##$BC_mod= 0
##$BYTORDP= 0
##$COROFFS= 0
##$CY= 15
##$DATMOD= 1
##$DC= 0
##$DFILT= <>
##$DTYPP= 0
##$F1P= 0
##$F2P= 0
##$FCOR= 0.5
##$FTSIZE= 131072
##$FT_mod= 6
##$GAMMA= 0
##$GB= 0
##$INTBC= 1
##$INTSCL= 1
##$ISEN= 128
##$LB= 0.3
##$LEV0= 0
##$LPBIN= 0
##$MAXI= 10000
##$MC2= 0
##$MEAN= 0
##$ME_mod= 0
##$MI= 0
##$NCOEF= 0
##$NC_proc= -2
##$NLEV= 6
##$NOISF1= 0
##$NOISF2= 0
##$NSP= 0
##$NTH_PI= 0
##$NZP= 0
##$OFFSET= 14.96377
##$PC= 1
##$PHC0= -84.28711
##$PHC1= 0
##$PH_mod= 1
##$PKNL= yes
##$PPARMOD= 0
##$PPDIAG= 0
##$PPIPTYP= 0
##$PPMPNUM= 2147483647
##$PPRESOL= 1
##$PSCAL= 4
##$PSIGN= 0
##$PYNMP= <proc.py>
##$REVERSE= no
##$SF= 400.02000852846
##$SI= 131072
##$SIGF1= 0
##$SIGF2= 0
##$SINO= 400
##$SIOLD= 131072
##$SPECTYP= <>
##$SREGLST= <1H.CDCl3>
##$SSB= 0
##$STSI= 131072
##$STSR= 0
##$SW_p= 8223.68421052631
##$SYMM= 0
##$S_DEV= 0
##$TDeff= 65536
##$TDoff= 0
##$TI= <>
##$TILT= no
##$TM1= 0
##$TM2= 0
##$TOPLEV= 0
##$USERP1= <user>
##$USERP2= <user>
##$USERP3= <user>
##$USERP4= <user>
##$USERP5= <user>
##$WDW= 1
##$XDIM= 131072
##$YMAX_p= 400681797
##$YMIN_p= -10795
##$CURPLOT= <Network HP LaserJet P1505>
##$CURPRIN= <$Network HP LaserJet P1505>
##$DFORMAT= <normdp>
##$LAYOUT= <+/1D_H.xwp>
##$LFORMAT= <normlp>
##$PFORMAT= <normpl>
##$SURQMSG= 1
$$ End of Bruker specific parameters
$$ ---------------------------------
##NTUPLES= NMR SPECTRUM
##VAR_NAME=  FREQUENCY,     SPECTRUM/REAL,   SPECTRUM/IMAG
##SYMBOL=    X,             R,               I
##VAR_TYPE=  INDEPENDENT,   DEPENDENT,       DEPENDENT
##VAR_FORM=  AFFN,          ASDF,            ASDF
##VAR_DIM=   131072,        131072,          131072
##UNITS=     HZ,            ARBITRARY UNITS, ARBITRARY UNITS
##FACTOR=    0.0627417313425164, 1,          1
##FIRST=     8223.62146879497, -511,         -47447
##LAST=      0,             799,             -47709
##MIN=       0,             -10795,          0
##MAX=       8223.62146879497, 400681797,    0
$$ Real data points
##PAGE= N=1
##DATA TABLE= (X++(R..R)), XYDATA
$$ [...]
67363 222158 221974 222121 223143 224844 226584 228081 229615 231449 233382 235034 236365 237655 239068 240516 241936
67348 241936 243412 244876 245973 246515 246870 247600 248749 249772 250191 250068 249853 250020 250889 252442 254207 255596
67332 255596 256547 257500 258610 259345 259289 259024 259700 261762 264519 266964 268649 269801 271006 272859 275506 278359
67316 278359 280572 281956 283111 284535 286091 287595 289377 291650 293667 294325 293638 292938 293333 294486 295284
67301 295284 295307 295191 295702 296960 298574 300170 301598 302844 303887 304660 305145 305517 306065 306835 307500 307830 308198
67284 308198 309291 311268 313525 315381 316747 317961 319301 320939 323071 325658 328131 329759 330416 330758 331610
67269 331610 333390 336045 339092 341672 343034 343323 343635 344961 347204 349526 351476 353375 355642 358169 360537
67254 360537 362603 364626 366870 369243 371344 372907 374209 375947 378532 381542 384101 385845 387298 389154
67240 389154 391430 393586 395294 396725 398065 399170 399992 401083 403218 406445 409880 412676 414986 417679
67226 417679 421161 424848 427896 430222 432530 435375 438458 440990 442691 444200 446356 449143 451668 453279
67212 453279 454386 455898 458084 460460 462663 464864 467198 469402 471376 473641 476697 480211 483368 485896
67198 485896 488226 490713 493290 495935 498922 502309 505645 508554 511339 514674 518791 523282 527512 530995
67184 530995 533522 535306 537061 539643 543362 547711 551854 555353 558427 561546 564858 568072 570885 573451
67170 573451 576318 579922 584294 589239 594598 600185 605615 610457 614637 618557 622753 627450 632490 637633
67156 637633 642805 647990 653021 657628 661768 665735 669815 673918 677721 681138 684449 687967 691699 695433
67142 695433 699092 702906 707263 712334 717791 722985 727573 731970 736928 742629 748375 753311 757358 761257
67128 761257 765741 770897 776343 781902 787842 794376 801150 807547 813469 819448 825822 832193 838086 843822
67114 843822 850216 857474 864993 872261 879342 886323 892919 899028 905171 911869 918893 925645 932011 938344
67100 938344 944840 951521 958707 966821 975584 983941 991083 997196 1003046 1009166 1015737 1022940 1031055 1040207
67086 1040207 1050170 1060394 1070195 1079081 1087070 1094631 1102267 1110231 1118615 1127440 1136535 1145526 1154225 1162926
67072 1162926 1172140 1182013 1192166 1202085 1211549 1220672 1229665 1238675 1247797 1257120 1266726 1276638 1286796
67059 1286796 1297046 1307192 1317165 1327230 1337883 1349335 1361104 1372375 1382839 1392979 1403450
67048 1403450 1414443 1425817 1437524 1449531 1461534 1473200 1484666 1496388 1508508 1520704 1532726
67037 1532726 1544718 1556915 1569323 1581827 1594323 1606685 1618882 1631214 1644067 1657282 1670150
67026 1670150 1682246 1693927 1705751 1717769 1729746 1741720 1753897 1766192 1778413 1790792 1803767
67015 1803767 1817210 1830353 1842655 1854357 1866041 1877972 1890114 1902480 1915159 1928042 1940796
67004 1940796 1953090 1964792 1975974 1986831 1997595 2008521 2019923 2032047 2044709 2057200 2068923
66993 2068923 2080162 2091887 2104586 2117548 2129538 2140021 2149492 2158810 2168530 2178803 2189500 2200318
66981 2200318 2210993 2221558 2232220 2242961 2253430 2263376 2272928 2282277 2291239 2299405 2306693 2313548 2320607
66968 2320607 2328292 2336660 2345408 2353996 2361962 2369211 2375893 2382059 2387702 2393125 2398914 2405314 2411894 2418022
66954 2418022 2423439 2428118 2431907 2434790 2437330 2440242 2443473 2446192 2447937 2449296 2451112 2453322 2454992 2455411
66940 2455411 2454725 2453523 2452085 2450294 2448117 2445941 2444242 2442943 2441379 2439075 2436414 2434149 2432298 2429933
66926 2429933 2426238 2421424 2416416 2411902 2407927 2404141 2400090 2395358 2389754 2383366 2376338 2368739 2360737 2352651
66912 2352651 2344612 2336378 2327762 2319036 2310614 2302481 2294266 2285737 2276936 2267876 2258446 2248578 2238302 2227772
66898 2227772 2217358 2207482 2198062 2188389 2177932 2167030 2156337 2145819 2134813 2122959 2110511 2097863
66886 2097863 2085390 2073616 2062786 2052176 2040572 2027627 2014124 2000787 1987618 1974676 1962590
66875 1962590 1951701 1941291 1930361 1918700 1906633 1894210 1881327 1868340 1855785 1843603 1831260
66864 1831260 1818535 1805633 1792676 1779636 1766753 1754439 1742712 1731153 1719457 1707687 1696014
66853 1696014 1684555 1673408 1662485 1651395 1639819 1627875 1615763 1603333 1590570 1578228 1567210
66842 1567210 1557292 1547220 1536226 1524769 1513550 1502491 1491115 1479408 1467803 1456622 1445931
66831 1445931 1435700 1425762 1415792 1405601 1395263 1384832 1374200 1363441 1353002 1343205 1333824 1324420
66819 1324420 1314928 1305639 1296754 1288215 1279842 1271406 1262644 1253419 1243820 1234041 1224261 1214632 1205164 1195645
66805 1195645 1185999 1176764 1168701 1161708 1154634 1146523 1137662 1128979 1120762 1112539 1103982 1095325 1086903 1078824
66791 1078824 1071131 1063866 1056834 1049644 1042121 1034518 1027294 1020815 1015140 1009834 1004119 997565 990595 983980
66777 983980 977802 971270 963623 954992 946298 938532 932081 926424 920478 913540 906033 899101 893459 888825
66763 888825 884389 879452 873629 866967 860070 853790 848462 843641 838734 833644 828577 823508 818202 812613
66749 812613 806988 801568 796375 791255 785974 780365 774539 768887 763697 758818 753834 748576 743342 738677
66735 738677 734939 731980 729129 725597 721107 716123 711333 706942 702552 697718 692505 687525 683449 680415
66721 680415 677819 674730 670634 665754 660647 655595 650536 645502 640894 637155 634286 631793 629152 626230
66707 626230 623208 620226 617318 614612 612272 610051 607216 603302 598788 594636 591193 588001 584750 581861
66693 581861 579809 578275 576426 573864 570901 567960 565057 561933 558444 554732 551075 547539 543785 539420
66679 539420 534616 530083 526204 522601 518893 515533 513250 511826 510131 507513 504512 501946 499855 497738
66665 497738 495389 492943 490328 487210 483542 479799 476584 474189 472520 471223 469837 468060 465975 463950
66651 463950 462245 460676 458662 455654 451675 447454 443830 440986 438437 435838 433438 431561 429944 428002
66637 428002 425588 423110 420975 419256 417877 416682 415277 413230 410591 407955 405766 403819 401644 399186
66623 399186 396913 395324 394518 394177 393795 392963 391575 389821 388047 386642 385901 385767 385714 385137 383910 382377
66607 382377 380805 379177 377558 376223 375211 374086 372455 370490 368646 367049 365496 363851 362125 360276
66593 360276 358330 356576 355263 354154 352772 351116 349714 348869 348209 347200 345848 344703 344253 344427 344632
66578 344632 344256 343214 341918 340625 338998 336598 333650 330913 328854 327354 326203 325328 324467 323220 321672
66563 321672 320487 320043 319897 319535 319147 319172 319398 319173 318320 317223 316068 314608 312775 310934 309350 307868
66547 307868 306387 305200 304477 303698 302061 299460 296729 294792 293749 292907 291675 290242 289281 289063 289129 288873
66531 288873 288154 287130 285788 284047 282175 280607 279274 277580 275241 272789 270960 269836 268930 267945 267108
66516 267108 266730 266729 266737 266491 265986 265266 264164 262419 260094 257745 255999 254942 254129 253207 252268 251474 250561 249033
66498 249033 246747 244080 241529 239435 238107 237883 238781 240201 241237 241342 240579 239288 237800 236490 235749
66483 235749 235638 235728 235608 235447 235696 236300 236624 236271 235568 235020 234620 234012 233064 231963 230939 230193 229909 229940 229654
66464 229654 228532 226845 225372 224488 223929 223411 222941 222473 221770 220866 220195 219987 219860 219332 218499 217892 217835 218143
66446 218143 218308 217832 216615 215176 214302 214244 214432 214124 213087 211469 209415 207190 205383 204495 204340 204243 203834
66429 203834 203353 203232 203713 204817 206340 207771 208538 208490 207962 207326 206677 206010 205420 204991 204611 204099 203416 202693
66411 202693 202151 202030 202477 203358 204186 204368 203615 202216 200892 200238 200180 199998 198987 197160 195291 194288 194465
66394 194465 195315 195903 195608 194530 193132 191538 189493 187000 184629 182879 181574 180279 179081 178432 178310
66379 178310 178127 177573 177093 177248 178000 178906 179691 180294 180592 180526 180418 180744 181509 182117 181963 180923 179250 177272
66361 177272 175390 174117 173764 174068 174343 174032 173047 171670 170376 169716 170015 170997 171934 172358 172368 172061 171085 169278
66343 169278 167440 166728 167186 167547 166747 165020 163238 161825 160873 160761 161815 163518 164835 165336 165417 165388 165024
66326 165024 164207 163408 163133 163267 163293 162931 162290 161528 160631 159515 158292 157446 157620 158938 160606 161572 161616 161411
66308 161411 161454 161440 160907 160019 159307 158939 158665 158306 157963 157836 158026 158372 158354 157477 156017 155011 155117 155765 155916
66289 155916 155441 155170 155689 156705 157631 158214 158380 157963 156930 155575 154228 153022 152073 151586 151569 151710 151737 151668
66271 151668 151510 151059 150284 149586 149211 148734 147610 146129 145168 144971 144798 144025 143035 142597 142775 142953 142764 142444
66253 142444 142261 142081 141639 140944 140230 139695 139399 139247 139038 138668 138334 138327 138643 138982 139158 139199 139045 138534 137891 137737
66233 137737 138292 138948 139095 139033 139455 140211 140284 139033 136869 134648 133017 132486 133358 135141 136579 136884 136595
66216 136595 136744 137496 138179 138332 138030 137306 136046 134591 133735 133822 134281 134335 133807 132985 132079 131183 130481 130109 129943
66197 129943 129745 129464 129212 129130 129396 130119 130978 131295 130800 130120 130099 130747 131275 131040 130061 128710 127439 126872 127538
66178 127538 129277 131261 132914 134391 135871 136848 136651 135447 134147 133337 132776 132043 131193 130619 130539 130843 131262
66161 131262 131535 131507 131207 130770 130262 129691 129207 129154 129875 131469 133645 135704 136845 136821 136235 135868 135741 135195
66143 135195 133890 132306 131113 130473 130139 129818 129197 128063 126725 125973 126165 126734 127025 127289 128194 129558 130308
66126 130308 129784 128532 127635 127698 128489 129155 128738 127022 124976 123914 124047 124428 124436 124609 125535 126597 126562 125201
66108 125201 123577 122781 122907 123314 123411 123028 122385 121977 122263 123305 124646 125613 125774 125208 124384 123677 122962 121882
66090 121882 120578 119798 120051 120931 121628 121863 121940 122015 121874 121401 120820 120318 119840 119383 119146 119206 119328 119320 119353 119687
66070 119687 120254 120688 120667 120085 119027 117774 116744 116241 116268 116638 117159 117648 117945 118045 118095 118144 118077 117927 118006 118427
66050 118427 118677 118091 116813 115789 115648 115917 115751 115192 115176 116222 117652 118409 118306 117978 117800 117450 116716 116134
66032 116134 116377 117329 118286 118947 119663 120689 121765 122638 123534 124711 125866 126446 126386 126098 125785 125231 124353 123630
66014 123630 123705 124701 126089 127163 127635 127849 128417 129546 130713 131131 130507 129217 127889 127096 127324 128704 130615
65997 130615 132022 132545 132877 133809 135177 136179 136461 136352 136173 135881 135412 134838 134114 133124 132029 131069 130019
65980 130019 128432 126543 125245 124809 124345 123075 121571 120953 121238 121300 120392 119008 118157 118375 119496 120878
65964 120878 121748 121783 121465 121496 121844 121822 121079 119985 118944 117944 116983 116374 116290 116455 116590 116747 116858 116430 115149
65945 115149 113520 112394 112047 112072 111990 111621 111007 110367 110030 110117 110387 110627 111035 111924 113251 114707 116069 117131
65927 117131 117515 117045 116240 115978 116605 117682 118631 119348 120184 121540 123447 125375 126563 126801 126754 127181 128018
65910 128018 128543 128356 127700 126916 126065 125214 124595 124300 124112 123776 123210 122397 121401 120566 120346 120763 121296 121449 121236
65891 121236 121005 120990 121124 121060 120374 119052 117834 117638 118491 119361 119302 118407 117447 116903 116779 117052 117779 118747 119444
65872 119444 119526 119084 118344 117334 115985 114507 113434 113162 113494 113771 113549 112983 112429 111867 111025 109995 109336
65855 109336 109374 109671 109405 108255 106787 105974 106305 107299 107970 107886 107626 108008 109094 110299 111290 112208 113006 113180
65837 113180 112387 110902 109205 107563 106227 105620 105943 106876 107982 109075 109972 110318 110069 109703 109494 109001 107874
65820 107874 106770 106664 107488 108271 108594 109020 109883 110517 110115 108750 107075 105521 104299 103771 104234 105492 107069
65803 107069 108723 110357 111626 112091 111747 111007 110175 109312 108567 108225 108312 108506 108614 108831 109315 109772 109764 109260 108616
65784 108616 108047 107454 106850 106644 107253 108521 109714 110176 109896 109416 109272 109626 110335 111175 111944 112447 112567 112302
65766 112302 111660 110552 108931 107035 105319 104079 103260 102732 102568 102828 103192 103097 102359 101416 100787 100448 99906
65749 99906 98840 97475 96319 95689 95572 95791 96206 96687 97010 96886 96231 95405 95025 95438 96345 97035 97020 96423
65731 96423 95762 95372 95104 94643 94027 93647 93633 93562 93089 92678 93180 94658 96109 96553 95987 95032 94116 93416 93176
65712 93176 93512 94057 94305 94185 93899 93390 92543 91779 91739 92354 92925 93214 93774 94910 96037 96495 96424 96290 96000
65693 96000 95183 94095 93532 93857 94597 95092 95173 95157 95460 96261 97353 98313 98955 99492 100104 100537 100379 99581 98414
65674 98414 97081 95683 94452 93679 93423 93516 93785 94045 94080 93987 94330 95510 97021 97851 97606 96814 96073 95472
65656 95472 95014 95064 95932 97324 98567 99232 99281 98816 98037 97316 96983 97010 97093 97042 96904 96767 96621 96466 96339 96213
65636 96213 95982 95637 95383 95452 95782 96037 96008 95964 96392 97364 98329 98667 98299 97569 96670 95517 94142 92887 92069
65617 92069 91672 91498 91430 91396 91302 91171 91242 91721 92448 93004 93083 92683 91970 91148 90489 90325 90852 91924 93076 93775
65597 93775 93737 93082 92241 91702 91715 92154 92632 92795 92517 91867 90979 90110 89712 90129 91086 91672 91114 89529 87742
65578 87742 86434 85672 85220 84998 85110 85577 86198 86646 86684 86360 85994 85913 86170 86591 87007 87380 87710 87990 88168
65559 88168 88083 87567 86744 86134 86173 86739 87438 88270 89562 91167 92221 92033 90941 89957 89704 89988 90278 90258 89904
65540 89904 89320 88648 88004 87427 86912 86491 86228 86157 86269 86571 87116 87990 89219 90559 91471 91534 90963 90489 90603
65521 90603 91082 91373 91206 90725 90310 90524 91883 94223 96481 97657 97963 98582 100178 102175 103670 104567 105430
65504 105430 106560 107703 108539 109076 109556 110216 111119 112010 112470 112425 112389 112937 114069 115362 116555 117526 117873 117228
65486 117228 116161 116057 117628 119957 121549 122014 122188 122847 123954 125218 126760 128959 131935 135418 138927
65471 138927 141960 144226 145801 146909 147554 147536 146840 145688 144180 142210 139851 137536 135652 134171 132838
65456 132838 131481 129990 128190 125942 123229 120068 116566 113153 110455 108775 107910 107569 107597 107592 106856 105155
65440 105155 103207 101878 101201 100649 100082 99758 99539 98856 97563 96169 95006 93798 92403 91421 91536 92547
65424 92547 93594 94205 94644 95210 95639 95435 94638 93987 94232 95334 96454 96781 96332 95825 95864 96408 97042 97535
65406 97535 98017 98686 99469 100055 100356 100848 102223 104499 106697 107713 107469 106932 107023 107784 108662 109293 109814 110587
65388 110587 111790 113314 114977 116840 119176 122045 125054 127719 129983 132203 134811 138224 142918 149209
65374 149209 156891 165346 173931 182002 188778 193684 196957 199463 201756 203587 204391 203915 202309 199973 197383
65359 197383 194720 191610 187648 183249 179454 176668 174142 171027 167480 164344 162112 160685 159811 159255 158677
65344 158677 157791 156576 155073 153198 151104 149451 148831 148991 149018 148242 146579 144180 141273 138375 136088 134440
65328 134440 132714 130184 126847 123347 120352 118077 116203 114113 111357 108072 104942 102658 101401 100780
65314 100780 100186 99185 97687 95864 94067 92796 92537 93305 94383 94855 94530 94059 94069 94475 94793 94785 94557 94283
65296 94283 94126 94174 94151 93464 91881 89949 88319 86946 85427 83910 82993 82713 82328 81372 80447 80575 82040
65279 82040 84129 85808 86413 85925 84947 84403 84941 86382 87752 88007 86897 85209 84008 83615 83431 82867 82187
65262 82187 82202 83318 85154 86967 88145 88400 87902 87270 87145 87629 88323 88878 89276 89611 89921 90306 90960 91989
65244 91989 93360 95006 96749 98128 98640 98290 97707 97595 98187 99162 99873 99733 98718 97508 96790 96407 95596
65227 95596 94075 92404 91075 89766 87931 85776 84138 83524 83667 83956 83972 83640 83187 83000 83293 83825 84074
65210 84074 83700 82755 81489 80136 78888 77919 77312 76984 76683 76129 75260 74385 73942 74034 74362 74679 75124 75940
65192 75940 76994 77834 78151 77993 77605 77256 77185 77448 77795 77932 77959 78279 78912 79250 78770 77863 77534 78292 79633
65173 79633 80695 81067 80783 79890 78490 77033 76138 76027 76458 77189 78167 79171 79749 79711 79442 79470 79990 80943
65155 80943 82197 83329 83653 82939 81854 81203 80973 80659 80316 80526 81297 81780 81346 80347 79487 79012 78865 79127
65137 79127 79727 80114 79827 79245 79219 80015 81095 81912 82412 82715 82782 82647 82641 83070 83793 84359 84509 84391 84321 84497
65117 84497 84956 85710 86808 88231 89745 90938 91509 91535 91429 91627 92277 93231 94347 95794 97952 100927 104205
65100 104205 106916 108512 109209 109816 111206 113813 117386 121147 124356 126808 128792 130601 132328 134084 136143
65085 136143 138609 141067 142785 143307 142755 141584 140105 138240 135652 132108 127728 122906 118014 113180 108338
65070 108338 103461 98786 94807 91934 90072 88666 87234 85744 84377 83167 82141 81595 81837 82657 83395
65055 83395 83519 82893 81563 79731 77940 76778 76242 75834 75451 75648 76681 77770 77886 77033 76233 76294 77053
65038 77053 77804 78040 77683 76922 76105 75653 75841 76585 77421 77821 77701 77561 77903 78531 78787 78541 78433 78867 79244
65019 79244 78721 77406 76214 75670 75464 75155 74715 74263 73826 73570 73787 74366 74684 74361 73855 73961 74876 76056
65001 76056 76769 76501 75059 72775 70610 69536 69589 69834 69489 68816 68624 69097 69568 69489 69148 69151 69507 69670 69390
64982 69390 69096 69373 70401 72031 74071 76258 78254 79872 81137 81924 81870 80962 79885 79287 78884 77892 76318
64965 76318 75148 75057 75479 75326 74237 72717 71358 70412 69965 70035 70412 70717 70762 70693 70750 71034 71456 71745 71523
64946 71523 70639 69487 68825 69173 70468 72228 73830 74648 74295 72979 71453 70386 69848 69538 69365 69575 70366
64929 70366 71656 73205 74760 75999 76578 76365 75572 74568 73583 72622 71608 70634 70112 70509 71757 73036
64913 73036 73471 73066 72647 72816 73327 73619 73576 73438 73271 72910 72353 71826 71523 71470 71569 71551 71090 70243 69598 69669 70269
64892 70269 70859 71295 71799 72303 72444 72218 72067 72228 72484 72687 72987 73329 73289 72728 72113 71895 71987 72215 72729 73513
64872 73513 73951 73462 72267 70982 69793 68612 67754 67701 68315 69047 69883 71341 73373 75063 75741 75759 75737 75638
64854 75638 75138 74495 74390 74998 75801 76328 76604 76755 76618 76000 75094 74283 73628 72832 71742 70615 69727 68963
64836 68963 68115 67498 67836 69335 71169 72261 72419 72368 72687 73140 73173 72740 72310 72182 72092 71600 70738 70086 70189
64817 70189 70923 71592 71690 71471 71587 72201 72708 72437 71454 70441 69836 69410 68802 68163 67895 67902 67594 66761 66018 66043
64797 66043 66732 67495 68123 68865 69791 70662 71413 72198 72863 72957 72452 71943 71891 72154 72521 73119 73886 74211 73685 72839
64777 72839 72499 72689 72747 72360 71810 71307 70718 70050 69616 69622 70008 70819 72275 74302 76278 77460 77494 76494 74880
64758 74880 73200 71852 70854 69971 69039 68112 67438 67436 68446 70229 71894 72668 72575 72188 71957 72060 72490 72767
64740 72767 71979 69815 67352 66045 66056 66337 66332 66635 67772 69266 70406 71232 72170 73162 73726 73665 73270 73005
64722 73005 73213 73943 74841 75407 75484 75259 74799 73977 72915 72062 71665 71591 71728 72055 72252 71886 71212 71109 71909
64703 71909 72930 73530 73905 74358 74528 74070 73505 73575 74132 74445 74291 73933 73329 72286 71309 71389 72767 74568
64685 74568 75809 76230 76088 75784 75811 76478 77414 77805 77334 76503 75870 75429 74947 74470 74161 73942 73622 73261 73132
64666 73132 73384 73837 74043 73630 72758 72250 72939 74837 77138 79059 80386 81130 81078 79969 77946 75591 73559
64649 73559 72305 72045 72781 74329 76373 78544 80475 81860 82507 82350 81480 80201 78931 77977 77447 77410 77920
64632 77920 78791 79527 79670 79154 78217 77145 76201 75580 75219 74858 74418 74064 73673 72689 70908 69088 68223 68397
64614 68397 68927 69420 69998 70527 70471 69815 69448 70166 71671 72981 73543 73621 73788 74382 75337 76246 76605 76202 75272
64595 75272 74283 73672 73738 74493 75483 75971 75554 74519 73538 73115 73341 73977 74683 75279 75849 76505 77178 77804 78599
64576 78599 79760 80981 81674 81741 81672 81778 81779 81383 80772 80189 79454 78345 77209 76715 77111 78069 79105 79859 80087
64557 80087 79785 79360 79396 80157 81383 82472 82797 82081 80703 79454 78791 78491 78245 78227 78731 79531 80100 80282
64539 80282 80246 79930 79158 78260 77854 77897 77633 76790 76121 76323 76936 76942 76096 75065 74488 74499 75048 76012 76969 77460
64519 77460 77599 77901 78407 78560 78131 77637 77476 77226 76371 75245 74599 74513 74491 74502 75076 76219 76970 76480 75056
64500 75056 73743 73194 73292 73615 73906 74256 75053 76583 78495 79957 80582 80849 81324 81863 82034 81967 82129 82459
64482 82459 82428 81946 81509 81290 80778 79628 78327 77553 77243 76789 75969 75185 74801 74619 74140 73206 72256 71923 72429
64463 72429 73418 74448 75465 76578 77550 77943 77777 77655 77998 78530 78760 78731 78926 79548 80183 80193 79319 77961
64445 77961 76922 76781 77362 77933 77943 77420 76671 75941 75488 75667 76564 77701 78480 78851 79305 80235 81470 82419
64427 82419 82549 81838 80894 80463 80651 80796 80311 79443 78895 78869 78899 78608 78177 77939 77892 77774 77410 76758 75785 74571
64407 74571 73430 72752 72687 73083 73754 74667 75797 76877 77473 77422 77080 76970 77235 77582 77725 77636 77341 76822 76267
64388 76267 76113 76539 77152 77415 77243 76923 76661 76508 76610 77116 77903 78699 79410 80003 80197 79713 78801 78067 77739
64369 77739 77581 77582 78128 79220 80067 79915 78951 78001 77576 77681 78280 79398 80853 82400 84127 86209 88201
64352 88201 89148 88685 87662 87308 87959 88922 89427 89347 89041 88859 88953 89324 89847 90326 90716 91289 92494 94554 97242
64333 97242 100057 102632 104947 107165 109256 110850 111516 111179 110184 108909 107376 105350 102791 100079 97743
64318 97743 96018 94738 93594 92486 91623 91257 91257 91034 90165 89134 89110 90723 93233 95273 96225 96482 96470 96067
64300 96067 95245 94720 95342 97028 98803 99916 100511 101157 102129 103379 104868 106588 108341 109813 110926 111966
64284 111966 113316 115139 117311 119543 121520 123011 123998 124689 125236 125407 124705 123015 121028 119735 119458 119624
64268 119624 119543 119087 118403 117378 115861 114217 113130 112786 112682 112328 111711 110982 110152 109421 109357 110366 112168
64251 112168 114136 115893 117266 117976 117928 117682 118075 119338 121079 123129 125817 129169 132398 134627 135834
64236 135834 136701 137714 138770 139555 139954 140084 140148 140252 140260 139860 138927 137690 136426 135132 133740 132536 132059
64219 132059 132494 133386 134052 134242 134362 135117 136909 139566 142659 145993 149594 153192 156083 157783 158627 159423
64203 159423 160586 161878 162928 163674 164234 164617 164702 164365 163597 162589 161727 161331 161338 161354 161020 160258 159184 157952
64185 157952 156714 155645 154945 154814 155328 156249 157124 157721 158261 159030 159922 160654 161357 162615 164866 167975 171466
64168 171466 174955 178351 181825 185648 189853 194081 198040 202062 206943 213125 220314 227935 235663 243392
64154 243392 250977 258181 264657 269880 273345 275009 275300 274555 272616 269113 263946 257398 250052 242765 236342
64139 236342 230913 225817 220358 214550 208830 203321 197752 192102 186920 182856 180025 177921 175940 173934
64125 173934 172228 171030 169957 168363 166132 163844 162141 161249 161187 162014 163608 165534 167394 169022 170198
64110 170198 170650 170765 171772 174536 178386 181776 183986 185642 187662 190401 193819 197718 201597 204867 207594
64095 207594 210590 214470 218948 223326 227236 230618 233310 235101 235983 236002 235050 233082 230414 227552 224816
64080 224816 222328 220154 218148 215892 213182 210560 208897 208410 208383 208028 207386 207181 207974 209677 211797 213920
64064 213920 215869 217595 219140 220725 222641 224957 227436 229939 232836 236860 242534 249795 257996 266116
64050 266116 273180 278918 284055 289626 295943 302534 309095 316017 323706 331856 339730 346919 353459 359476
64036 359476 365113 370647 376244 381701 386725 391369 395820 399941 403476 406591 409671 412576 414655 415595
64022 415595 415769 415552 414864 413655 412348 411414 410903 410804 411470 413157 415479 417954 420980 425552 431945 439251
64006 439251 446454 453531 461206 469971 479651 489787 500200 511222 523390 536766 550669 564470
63994 564470 578702 594900 614085 635773 658741 682426 707142 733320 761214 791325 824468
63983 824468 861083 900766 942690 986449 1032492 1081983 1136276 1196321 1262402 1334583 1413457
63972 1413457 1500494 1597813 1707826 1832954 1975432 2137530 2322404 2534723 2779992 3063031
63962 3063031 3387375 3756071 4172337 4638772 5155959 5721930 6332609 6982337 7664311
63953 7664311 8371184 9095258 9827385 10555039 11261399 11926583 12530398 13055109 13487128
63944 13487128 13817378 14040528 14153719 14155432 14044897 13822234 13489495 13052321 12521283 11911807
63934 11911807 11242514 10532825 9800785 9061694 8327826 7609272 6915203 6254360 5634363
63925 5634363 5060748 4536847 4064371 3643585 3272759 2948020 2664468 2417650 2203806
63916 2203806 2018977 1858674 1718790 1596410 1489305 1394997 1310847 1234894 1166076 1103705
63906 1103705 1047186 995964 949082 904824 861642 819600 780132 744073 710594 678483 647694
63895 647694 618899 592085 566505 541770 518214 496177 475630 456512 438841 422359 406542
63884 406542 391131 376323 362359 349211 336733 324903 313924 304213 296048 288985 281974 274515
63872 274515 267389 261627 257053 252641 248219 244843 243238 242701 241967 240542 238800 237262 236281 235973 235949 235447
63856 235447 234141 232636 231755 231541 231295 230367 228617 226351 224166 222613 221584 220154 217462 213724 210086
63841 210086 207457 205681 203801 200921 196820 191925 186771 181617 176723 172765 170395 169237 167906 165433
63827 165433 162290 159578 157611 155844 153887 151846 149723 147229 144462 142257 141466 142048 143099 143657 143381
63812 143381 142576 141721 140983 140179 139140 137940 136693 135367 134007 132852 131943 130817 129057 127058 125715
63797 125715 125266 124879 123680 121848 120424 120098 120442 120335 119100 117227 115941 115987 116860 117358 116792 115479 114180
63780 114180 113423 113359 113879 114610 115111 115337 115775 116827 118115 118717 118110 116694 115349 114668 114717 115318 116253 117233
63762 117233 117929 118242 118428 118833 119573 120636 122149 124242 126640 128689 129982 130761 131575 132742 134310 136278
63746 136278 138572 140965 143374 146269 150510 156650 164469 173201 182085 190719 199066 207218 215200 222973
63732 222973 230619 238289 245856 252670 257771 260356 260157 257669 254000 250066 245642 239571 231260 221677
63718 221677 212447 204276 196839 189967 184082 179298 174906 170191 165301 160858 157109 153862 150999 148545
63704 148545 146455 144779 143910 144194 145325 146496 147190 147462 147519 147532 148013 149831 153413 158152 163046 167827
63688 167827 173065 179157 185736 192291 199026 206645 215362 224487 233027 240403 246514 251410 255155 257783
63674 257783 259079 258456 255331 249693 242219 233864 225398 217217 209374 201800 194609 188155 182668 177983
63660 177983 173853 170349 167659 165549 163522 161558 160280 160126 160667 161092 161156 161359 162321 164289 167196 170903
63644 170903 175342 180582 186769 193907 201704 209789 218045 226612 235691 245457 256088 267598 279647
63631 279647 291712 303462 314731 325137 334016 340887 345778 348899 350161 349291 346382 342126 337459
63618 337459 333091 329389 326504 324490 323324 322853 322716 322329 321073 318625 315113 310931 306397 301586 296427
63603 296427 290952 285424 280237 275632 271525 267653 263875 260198 256564 252860 249282 246453 244919 244547
63589 244547 244732 245159 246076 247710 249730 251564 253124 254975 257770 261678 266432 271805 277958 285266 293813
63574 293813 303194 312973 323306 334833 347811 361502 374514 385607 394125 399940 403256 404349 403266
63561 403266 399949 394906 389555 385413 382949 381623 381079 381710 383818 386782 389701 392594 396277 400943 405483
63546 405483 408613 410293 411585 413292 415243 416946 418263 418968 417988 413775 405657 394510 381912 368889
63532 368889 355667 342277 328928 315788 302857 290287 278620 268408 259650 251846 244687 238487
63520 238487 233736 230338 227585 224940 222518 220602 219004 217349 215828 215058 215106 215246 215018 215050 216354 219144
63504 219144 222879 227252 232459 238517 245035 251935 259852 269403 280338 291801 303236 314741 326707
63491 326707 339408 352854 366590 379575 390574 398901 404675 408224 409377 407562 402577 395054 386081
63478 386081 376445 366347 355704 344546 333172 322135 312072 303339 295807 289140 283323 278601 274865
63465 274865 271457 267855 264299 261456 259715 259098 259669 261538 264555 268397 272975 278362 284394 290764 297636
63450 297636 305701 315438 326636 338821 351810 365580 379932 394687 410044 426370 443626 461262
63438 461262 478665 495386 510853 524105 534082 540174 542384 540985 536300 529016 520467 512188 504987
63425 504987 498761 493300 488863 485654 483110 480267 476685 472450 467328 460529 451502 440559 428580 416477
63411 416477 405016 394605 384963 375405 365786 356830 349292 343208 338310 334749 332843 332288 332205 332006 331906
63396 331906 332611 334761 338547 343566 349071 354679 360805 368143 376826 386421 396663 407744 419836 432728
63382 432728 446197 460470 476014 492884 510371 527232 542219 554546 564073 571076 575814 578318
63370 578318 578671 577437 575615 573992 572566 570830 568660 566622 565237 564187 562585 559808 555654 549869
63356 549869 542120 532499 521481 509294 495876 481690 467874 455171 443219 431373 419714 408632
63344 408632 397868 386841 375750 365600 357090 350108 344319 339596 335705 332237 329092 326593 324852
63331 324852 323422 321794 319884 317786 315492 313155 311279 310238 309807 309481 309097 308873 309006 309501 310284 311204
63315 311204 311983 312444 312698 312866 312685 311709 309973 308110 306604 305193 303285 300870 298615 296924 295295 292974
63299 292974 290067 287540 286084 285428 284914 284300 283651 282816 281555 280011 278624 277628 277023 276883 277185 277382 276747
63282 276747 275281 273771 272736 271778 270293 268437 267004 266564 267062 268134 269478 270993 272749 274799 276902
63267 276902 278571 279524 280007 280507 281227 281983 282501 282752 283078 283961 285505 287243 288693 290155 292499 296028
63251 296028 299936 303191 305677 308111 311147 314912 319203 323750 328368 333250 338985 345945 353739 361628
63237 361628 369392 377375 385737 394278 403160 413277 425448 439433 454078 468415 482468 496999
63225 496999 512580 528910 544999 560134 574680 589764 606105 623268 640140 656040 671253
63214 671253 686617 702742 719600 736723 753686 770302 786297 800922 813147 822267 828118 830595
63202 830595 829202 823333 812910 798561 781237 761846 741221 720108 699084 678620 659270 641646
63190 641646 626044 612297 600198 589978 582164 576983 574152 573250 574061 576500 580452 585854 592723 600850
63176 600850 609679 618806 628559 639679 652285 665443 677984 689628 701111 713292 726301 739549
63164 739549 752384 764540 775932 786197 794776 801516 806843 810977 813183 812252 807736 800223 790418
63151 790418 778534 764787 749853 734322 718160 701323 684553 668844 654287 640194 626443
63140 626443 613922 603385 594508 586507 579174 572826 567519 562878 558622 554887 551982 550020 548676 547194
63126 547194 544878 541862 539163 537696 537388 537576 537979 538850 540286 541926 543432 544777 545942 546724 547063 547275
63110 547275 547738 548547 549586 550705 551731 552560 553394 554591 556091 557324 557933 558311 559058 560184 561304 562435
63094 562435 564047 566241 568417 569998 571174 572650 574861 577650 580576 583257 585464 587132 588418 589697
63080 589697 591424 593907 597101 600569 603702 606114 607900 609553 611567 614066 616804 619598 622784 627071
63066 627071 632873 639855 647246 654520 661745 669397 678039 688042 699429 712002 725712 740830 757663
63053 757663 776328 796953 819821 844971 871859 899841 928877 959312 991105 1023827 1057368
63042 1057368 1091974 1127461 1163020 1198031 1232392 1265805 1297501 1327273 1356132 1385222 1414574
63031 1414574 1443690 1472856 1502760 1532947 1561763 1588048 1611953 1633644 1651976 1664985 1671193
63020 1671193 1669887 1660591 1642921 1616948 1583333 1543134 1497655 1448309 1396370 1342992 1289580 1237856
63008 1237856 1189305 1144686 1104248 1068157 1036501 1009152 985981 967132 952798 942849 936908 934638
62996 934638 935792 940160 947697 958456 972035 987268 1002861 1018217 1033400 1048493 1063437 1078368
62984 1078368 1093518 1108726 1123511 1137647 1151174 1163780 1174703 1183435 1189870 1193457 1192877 1187148
62972 1187148 1176597 1161990 1142998 1118467 1088243 1053850 1017063 978566 938521 897764 857636
62961 857636 818847 781362 745394 711710 680690 651810 624590 599589 577747 558931 541868
62950 541868 525629 510515 497151 485258 473923 462809 452434 443187 434709 426500 418709 411887
62938 411887 406231 401496 397435 393898 390556 387087 383727 381081 379187 377225 374498 371292 368339 365803
62924 365803 363390 361166 359553 358542 357566 356312 355025 353864 352619 351419 351108 352358 354710 356980 358342
62909 358342 358608 357780 355887 353108 349680 345795 341943 338934 337028 335313 332662 329133 325664 322521 318954
62894 318954 314638 310514 307744 306370 305558 304661 303561 302270 300768 299106 297377 295651 294047 292626 291136
62879 291136 289286 287429 286407 286406 286550 286122 285617 285889 286665 286797 285853 284595 283792 283283 282517 281438 280461 279894
62861 279894 279703 279728 279980 280740 282256 284212 285742 286360 286708 287846 289866 291836 293186 294463 296383 298732
62845 298732 300700 301952 302844 303782 304878 306126 307463 308604 309168 309106 308809 308735 308999 309320 309282 308670 307729 307039
62827 307039 307052 307734 308728 309752 310707 311523 312121 312536 312926 313442 314191 315329 317061 319467 322374 325430 328296
62810 328296 330865 333406 336408 340172 344529 349082 353669 358456 363512 368501 373024 377212 381782 387331
62796 387331 393660 400057 406325 413340 422345 433719 446751 460740 476058 493844 514791 538604
62784 538604 564774 593501 625504 661019 699412 740013 783120 829804 880664 935038 991656
62773 991656 1049859 1109806 1171396 1233319 1293408 1349734 1401025 1446109 1483457 1511628 1529970
62762 1529970 1538558 1537434 1526272 1504873 1473766 1434160 1387545 1335601 1280235 1223186 1165398 1107080
62750 1107080 1048568 990928 935521 883104 833671 787055 743400 702985 665847 631803 600698
62739 600698 572477 547072 524358 504195 486341 470281 455360 441282 428394 417273 407986 399917
62727 399917 392402 385413 379475 374984 371728 369033 366304 363486 361125 359943 360260 361808 364095 366769
62713 366769 369617 372590 376154 381291 388650 397759 407591 417875 429338 442679 457969 475295 495258
62700 495258 518325 544123 571891 601295 632382 665212 700103 737797 778494 820845 862732
62689 862732 903106 942253 980084 1015014 1044929 1068673 1086074 1096997 1100995 1097662 1086914 1069061
62677 1069061 1044971 1016035 983583 948311 910475 870565 829626 789006 749900 713014 678468
62666 678468 646164 616310 589376 565408 543714 523509 504661 487537 472328 458848 446768
62655 446768 435655 424926 414242 403949 394679 386443 378491 370210 361838 354091 347375 341549 336306
62642 336306 331552 327447 324143 321466 318872 315871 312489 309163 306137 303233 300211 297149 294308 291869
62628 291869 289949 288667 287912 287202 286047 284474 283031 282260 282318 283038 284157 285403 286557 287569 288635 290116
62612 290116 292341 295400 299077 303061 307350 312383 318643 326181 334677 343963 354277 365949 379042
62599 379042 393401 408905 425562 443459 462793 483822 506668 531206 557319 585142 614782
62588 614782 645728 676768 706620 734590 760502 784131 804831 821664 833811 840847 842767 839818
62576 839818 832318 820560 804810 785378 762766 737803 711569 685048 658821 633090 607914 583321
62564 583321 559379 536399 515020 495744 478367 462143 446582 431802 417989 404918 392321
62553 392321 380450 369795 360376 351718 343563 336184 329901 324595 319915 315699 312009 308898 306304 304030
62539 304030 301741 299171 296588 294920 295072 297015 299722 302093 303833 305332 306969 308902 311550 315739
62525 315739 321915 329340 336585 342983 349294 356800 366092 376983 389214 402677 417060 431836 446792
62512 446792 462322 479076 497513 517782 539665 562442 585027 606466 626226 644004 659494
62501 659494 672485 682924 690611 694924 695101 690825 682407 670475 655751 639194 622083 605487 589476
62488 589476 573110 555594 537490 520441 505600 492682 480828 469972 460781 453422 447068 440779
62476 440779 434348 428138 422573 418051 414876 412837 411121 409078 406915 405306 404495 404123 403813 403530 403418
62461 403418 403609 404161 404908 405417 405417 405294 405799 407224 409122 410879 412159 412662 411867 409427 405672 401310 396617
62444 396617 391241 384907 378051 371497 365700 360569 356019 352288 349515 347328 345203 343177 341823 341564
62430 341564 342355 344070 346758 350261 354002 357561 361252 365676 370804 375925 380466 384497 388401 392463
62416 392463 396939 402094 407845 413593 418789 423478 427991 432180 435395 437374 438768 440465 442531 444139
62402 444139 444611 444237 443877 443933 443961 443370 442260 441437 441626 442812 444380 445836 447277 449206 452034 455906 460880
62385 460880 467020 474237 482342 491419 501957 514364 528498 543955 560681 579035 599320 621628
62373 621628 646104 672900 701692 731563 761524 790904 819140 845616 869969 892273 912536
62362 912536 930165 944198 953927 959042 959413 955125 946758 935338 921934 907385 892233 876664 860515
62349 860515 843594 826009 808164 790477 773242 756614 740619 725296 710948 698053 686738
62338 686738 676610 667375 659301 652677 647089 641844 636985 633172 630388 627484 623476 618926 615477 614134
62324 614134 614357 614783 614449 613258 611614 609941 608480 607289 606220 604950 603208 601085 598991 597250 595910
62309 595910 594993 594723 595284 596538 598254 600518 603594 607460 611826 616609 622077 628418 635483 643033 651029
62294 651029 659533 668546 678037 687954 698117 708296 718472 728821 739358 749838 760154 770627
62282 770627 781768 793904 807119 821352 836432 852177 868630 886065 904721 924670 946017
62271 946017 968958 993541 1019657 1047485 1077644 1110528 1145612 1181687 1217705 1253011 1286823
62260 1286823 1317921 1345093 1367760 1386018 1400205 1410608 1417579 1421655 1423370 1422932 1420296 1415673 1409793
62247 1409793 1403441 1396912 1390202 1383663 1378030 1373788 1370978 1369802 1370914 1374675 1380426 1386991 1393797 1401086
62233 1401086 1409122 1417614 1426042 1434310 1442961 1452800 1464129 1476222 1487783 1498292 1508657 1520090
62221 1520090 1532526 1544834 1556545 1568573 1581898 1596295 1610988 1625984 1641945 1659001 1676573
62210 1676573 1694465 1713315 1733698 1755413 1778130 1802210 1828260 1856081 1884764 1913907 1944253
62199 1944253 1976924 2012308 2049887 2088812 2128444 2168524 2209056 2249908 2290297 2328776 2363915
62188 2363915 2394966 2421823 2444655 2463942 2480718 2496269 2511432 2526545 2542222 2559770 2580461
62177 2580461 2604525 2631173 2659564 2689441 2720775 2753041 2784996 2815149 2842423 2866490 2887537
62166 2887537 2905736 2921021 2933426 2943489 2952080 2959775 2966501 2971829 2975464 2977305 2977207 2974992 2970838
62153 2970838 2965531 2960082 2955040 2950320 2945781 2941735 2938594 2936108 2933368 2929766 2925637 2921633 2917687 2913050
62139 2913050 2907336 2901058 2894955 2889174 2883443 2877780 2872594 2868102 2864024 2859948 2855641 2850950 2845737 2840189
62125 2840189 2834931 2830446 2826502 2822479 2818197 2813997 2809965 2805515 2800063 2793785 2787323 2780862 2773902 2765985
62111 2765985 2757339 2748695 2740598 2732998 2725367 2717153 2708200 2698790 2689295 2679909 2670897 2662973 2657055 2653528
62097 2653528 2651990 2651865 2653015 2655449 2658493 2660502 2659556 2654572 2646024 2635855 2626585 2620081 2616694 2615180
62083 2615180 2613225 2608256 2598326 2582722 2561868 2536648 2507967 2477026 2445593 2415402 2387054 2359728
62071 2359728 2332052 2303142 2272847 2241354 2208828 2175382 2141200 2106701 2072517 2039052 2005985
62060 2005985 1972434 1937901 1902897 1868355 1834477 1800469 1765501 1729695 1694049 1659619 1626900
62049 1626900 1595803 1565980 1537176 1509465 1483169 1458520 1435454 1413788 1393424 1374220 1355756
62038 1355756 1337482 1319137 1300856 1282900 1265459 1248770 1233180 1218908 1205780 1193231 1180538
62027 1180538 1167129 1152935 1138545 1124874 1112491 1101347 1091132 1081747 1073329 1066063 1060091 1055432
62015 1055432 1051802 1048725 1046120 1044671 1045281 1048125 1052489 1057604 1063351 1069996 1077396 1084707 1090846 1095061
62001 1095061 1096948 1096077 1091924 1084293 1073514 1060019 1044024 1026064 1007606 990351 974767 959993
61989 959993 945551 932423 921845 913634 906594 900252 895242 892043 890307 889653 890256 892254 895215 898680
61975 898680 902781 907874 913913 920545 927531 934805 942458 950920 960747 971902 983638 995533 1008290
61962 1008290 1023020 1040004 1058660 1078568 1099997 1123458 1149121 1176740 1205932 1236729 1270027
61951 1270027 1307218 1348957 1394543 1442911 1493964 1548401 1606516 1667916 1732464 1800822 1873923
61940 1873923 1952444 2036957 2127993 2225646 2329695 2440616 2560262 2691101 2834906 2992500
61930 2992500 3164763 3353697 3562549 3794961 4053917 4341380 4659005 5009112 5394621
61921 5394621 5817895 6279786 6779652 7315455 7882940 8474338 9077748 9677221 10252814
61912 10252814 10780661 11234158 11586902 11816583 11908363 11856827 11666337 11350077 10928134 10424925
61902 10424925 9866318 9276899 8677925 8086387 7515171 6973731 6468552 6003084 5577690
61893 5577690 5190323 4837819 4516889 4224295 3956825 3711738 3487281 3282411 3095952
61884 3095952 2926291 2771877 2631649 2504750 2390115 2286588 2193317 2109757 2035279 1968977
61874 1968977 1909865 1857156 1810308 1768848 1732256 1700096 1672190 1648530 1628913 1612879 1600151
61863 1600151 1591001 1585849 1584534 1586321 1590641 1597495 1606986 1618751 1632077 1646379 1661305 1676505 1691497
61850 1691497 1705708 1718544 1729549 1738676 1746370 1753256 1759764 1766127 1772625 1779711 1787939 1797751 1809188
61837 1809188 1821787 1835019 1848970 1864352 1881606 1900193 1919013 1937437 1955748 1974777 1995370
61826 1995370 2018105 2043153 2070412 2100060 2132960 2170258 2212560 2259776 2311802 2369070 2432285
61815 2432285 2501897 2577981 2660600 2750193 2847730 2954477 3071450 3199164 3338183 3489919
61805 3489919 3656537 3840055 4041950 4263849 4508215 4778079 5076480 5406597 5772163
61796 5772163 6177189 6625409 7120465 7666543 8268155 8929021 9651431 10436533 11284206
61787 11284206 12191728 13152229 14153963 15179735 16205559 17199468 18122217 18930084 19578719
61778 19578719 20027664 20245874 20217169 19943134 19442181 18745948 17894754 16932706 15902741
61769 15902741 14842879 13784725 12753532 11768262 10841403 9979545 9185056 8457782 7795876
61760 7795876 7195954 6653386 6162943 5719512 5318559 4956133 4628525 4331984 4062835
61751 4062835 3817842 3594406 3390508 3204593 3035327 2881191 2740332 2611042 2492324
61742 2492324 2383666 2284225 2192608 2107621 2028849 1956163 1888955 1826281 1767676 1713401 1663835
61731 1663835 1618860 1577901 1540352 1505842 1474234 1445378 1418790 1393572 1368811 1344024 1319111
61720 1319111 1294024 1268733 1243388 1218046 1192277 1165564 1138287 1111786 1087036 1063664 1040794
61709 1040794 1018553 998007 979638 962562 945487 927919 910165 892693 875952 860521 846802
61698 846802 834511 822815 811096 799387 788117 777649 768067 759148 750437 741479 732146 722747 713741
61685 713741 705308 697143 688655 679483 669829 660234 651115 642697 635306 629265 624304 619494 614113 608394
61671 608394 603115 598669 594879 591470 588269 585086 581908 579105 576928 574885 572251 569238 567008 566295
61657 566295 566572 566841 566652 565974 564650 562531 559847 556975 554028 551026 548200 545694 543260 540681 538298
61642 538298 536614 535519 534375 532851 531258 530174 530049 531106 533199 535820 538550 541441 544634 547787
61628 547787 550382 552517 554944 558228 562143 565820 568165 568332 566239 562637 558272 553157 547055 540460
61614 540460 534356 529090 524272 519805 516137 513295 510593 507777 505639 504809 504610 503968 503053 503134 504930 507854
61598 507854 510940 513884 516985 520538 524538 528804 533275 538194 543879 550248 556758 563029 569268 575889
61584 575889 583042 590848 599710 609865 620825 631886 643194 655760 670307 686567 703864 721997
61572 721997 741318 762176 784523 807993 832286 857464 883760 911032 938672 966283 994059
61561 994059 1022050 1049381 1074921 1098691 1121942 1145738 1170119 1194790 1219805 1245078 1269895
61550 1269895 1293556 1316162 1338110 1359067 1378102 1394736 1409202 1421572 1431141 1436965 1438765 1437200
61538 1437200 1433393 1428219 1421857 1414035 1404802 1394929 1385362 1376461 1368213 1361022 1355759 1352924 1352374 1354111
61524 1354111 1358816 1367191 1379088 1393884 1411579 1433056 1459223 1490315 1526187 1566994 1613372 1666163
61512 1666163 1726165 1794062 1870435 1955804 2050748 2156009 2272497 2401173 2542892 2698317
61502 2698317 2867961 3052174 3250884 3463112 3686758 3918681 4154698 4389240 4615182
61493 4615182 4824326 5008291 5159297 5270908 5339028 5362627 5343462 5285080 5192191 5070686
61483 5070686 4927501 4769837 4604269 4436332 4270443 4109927 3957252 3814370 3682701
61474 3682701 3562882 3454948 3359050 3275770 3205629 3148526 3103845 3070798 3048429 3035627 3031494
61463 3031494 3035530 3047160 3065365 3089105 3117800 3150929 3187294 3225209 3263405 3301362 3338863
61452 3338863 3375677 3411664 3446737 3480704 3513611 3546305 3580219 3616530 3655879 3698796 3745698
61441 3745698 3796263 3849423 3904394 3961274 4020222 4080344 4139785 4196615 4249177 4295782 4334582
61430 4334582 4363868 4382369 4389426 4385115 4370084 4345110 4310942 4268785 4220667 4169031 4116018 4063310
61418 4063310 4012313 3964040 3918886 3877084 3839493 3807596 3782487 3764044 3751236 3743068 3739085 3739061
61406 3739061 3742472 3748483 3756385 3765855 3776664 3788189 3799410 3809350 3817377 3823220 3827066 3829759 3832660
61393 3832660 3837225 3844920 3857455 3876601 3903615 3939352 3985288 4043955 4117838 4208107 4314962
61382 4314962 4438927 4581104 4742205 4922001 5119904 5335392 5567276 5812742 6067327
61373 6067327 6325564 6581230 6827123 7055076 7256642 7424060 7551054 7633344 7668996 7658526
61363 7658526 7604532 7510744 7381028 7219122 7029120 6815841 6584402 6339550 6085665 5827274
61353 5827274 5569130 5315600 5070065 4834868 4611610 4401432 4205330 4024370 3859478
61344 3859478 3710845 3577675 3458741 3353233 3260938 3181667 3114770 3059407 3015167 2982102
61334 2982102 2960002 2947868 2944330 2948467 2959975 2978580 3003658 3034489 3070467 3110802 3154249 3199411
61322 3199411 3245204 3290838 3335456 3377959 3417019 3451102 3478761 3499246 3512786 3520177 3522339 3520493
61310 3520493 3516404 3511850 3507822 3504579 3502381 3501634 3502229 3503189 3503251 3501503 3497272 3489685 3477712 3460643 3438306
61295 3438306 3410883 3378646 3341930 3301252 3257405 3211352 3164025 3116252 3068813 3022476 2977857
61284 2977857 2935395 2895615 2859362 2827644 2801146 2779855 2763033 2749620 2738842 2730509 2724513 2719990
61272 2719990 2715171 2708125 2697450 2682414 2663149 2641035 2618307 2596653 2576392 2557432 2540593 2527415
61260 2527415 2519059 2516254 2520125 2532104 2552844 2582037 2619516 2665804 2721215 2785223 2857300 2937813
61248 2937813 3027437 3126032 3232674 3346415 3466092 3589216 3711586 3828226 3934391 4025528
61238 4025528 4096639 4142291 4157687 4140101 4089615 4008742 3901528 3773016 3629159 3476402
61228 3476402 3320632 3166160 3015564 2870406 2732066 2602033 2481513 2370832 2269421
61219 2269421 2176552 2092001 2015886 1948067 1888019 1835229 1789337 1749932 1716555 1688954 1666964
61208 1666964 1649925 1636418 1624575 1612603 1599238 1584239 1568492 1553215 1538929 1525488 1512982
61197 1512982 1502004 1492863 1485088 1477891 1470689 1462982 1454318 1444724 1434698 1424407 1413350 1401160 1388249
61184 1388249 1375181 1361807 1347570 1332343 1316495 1300421 1284534 1269457 1255626 1242907 1231098
61173 1231098 1220628 1212191 1205793 1200796 1196872 1194408 1193955 1195691 1199375 1204246 1208858 1211420 1210457 1204955
61159 1204955 1194077 1177390 1155552 1130320 1103648 1076906 1050840 1025798 1001798 978729 956646
61148 956646 935724 915984 897349 879956 864040 849505 835957 823191 811324 800482 790747 782383
61136 782383 775604 770040 764955 760134 756105 753294 751433 750045 749038 748468 748164 748059 748625 750498 753688
61121 753688 757504 761178 764333 766858 768495 768536 765952 760008 750889 739526 726787 713116 698957 685054
61107 685054 671936 659465 647319 635792 625671 617327 610267 603726 597536 592287 588657 586570 585111
61094 585111 583372 581311 579549 578373 577338 575968 574471 573477 573336 573937 575018 576325 577590 578679 579754
61079 579754 581163 583256 586347 590624 595914 601679 607442 613088 618715 624440 630514 637280 644755 652480
61065 652480 660017 667338 674511 681346 687728 694034 700809 708139 715688 723129 730303 737206 744167 751662
61051 751662 759498 766510 771733 775633 779568 784177 789001 793665 798603 804420 811056 817872 824170 829601
61037 829601 834444 839535 845498 852073 858630 865189 872262 879759 886839 893151 899549 907296 917036 928705
61023 928705 941839 955755 970006 984943 1001408 1019873 1040534 1064211 1092108 1124360 1159803
61012 1159803 1197752 1239086 1285001 1335578 1390427 1449958 1515033 1585820 1661614 1741274 1823279
61001 1823279 1906343 1991068 2080482 2178170 2286468 2407180 2542822 2695651 2866126 3053840
60991 3053840 3259760 3486865 3740136 4028029 4363307 4760455 5232812 5793829 6459605
60982 6459605 7247702 8175918 9267680 10558920 12095922 13928609 16110574 18689658
60974 18689658 21651316 24823667 27837119 30232093 31679349 32148148 31891135 31286825
60966 31286825 30691125 30377405 30506270 31053918 31748154 32130441 31763046 30444206 28273444
60957 28273444 25546755 22595839 19684884 16985430 14588136 12520791 10769628 9302084
60949 9302084 8081383 7070595 6234306 5542091 4969466 4494687 4096805 3757862 3464974
60940 3464974 3208914 2981981 2778170 2593868 2426877 2275212 2137406 2012929 1901359
60931 1901359 1801643 1712620 1633391 1562398 1496855 1433900 1372029 1311095 1251547 1194169 1139906
60920 1139906 1089272 1042193 998801 959849 925802 895958 868927 843716 820022 797876 777405
60909 777405 758640 741273 724863 709400 695290 682676 671293 661102 652399 645021 638128 631138
60897 631138 624299 617963 611915 605891 600221 595375 591273 587522 584046 581133 579138 578431 579200 580996 582856
60882 582856 584192 585215 586285 587377 588389 589393 590323 590963 591513 592494 593821 594785 595311 596342 598475 601132
60866 601132 603752 606802 610718 614647 617369 618860 619931 620898 621710 622834 624757 626957 628612 630120 632646
60851 632646 636275 639933 643198 646850 651325 655774 659186 661550 663426 665036 666138 666221 664650 661332 657436
60836 657436 654649 653439 652731 651571 650253 649425 648874 647859 646059 643677 641033 638581 636975 636623 637444
60821 637444 639291 642192 645902 649717 653191 656614 660330 663964 666809 668673 669819 670338 670139 669475 668909
60806 668909 668680 668424 667626 666092 663891 661065 657561 653523 649543 646454 644689 643923 643523 643220 643099 643093 642929
60789 642929 642531 642030 641270 639840 637851 636294 636222 637699 639764 641373 642287 643146 644712 646947 648941 649951
60773 649951 650309 650925 652126 653571 655182 657359 660058 662382 663510 663430 662429 660396 657245 653552 650155
60758 650155 647377 645147 643629 643049 643020 642670 641569 640053 638533 636859 634555 631394 627569 623422 619136
60743 619136 614641 609837 604997 600869 598112 596590 595405 593787 591862 590409 589771 589126 587009 582693 576935
60728 576935 571254 566570 562683 558847 554446 549190 543134 536745 530677 525251 520253 515306 510242 505100
60714 505100 500047 495367 491218 487281 482966 478176 473615 470087 467753 466223 465138 464331 463657 463032 462638
60699 462638 462836 463861 465691 468155 471067 474317 477875 481660 485414 488942 492473 496477 501052 505749
60685 505749 510150 514377 518893 524102 530240 537304 544887 552450 560106 568768 579112 590684 602517
60672 602517 614382 626799 639794 652339 663310 672600 680937 688911 696510 703514 709878 715531 720066
60659 720066 722959 724181 724345 724055 723233 721397 718508 715152 711667 707513 701833 694474 686053 677103 667579
60644 667579 657401 647109 637619 629334 621725 613889 605456 596893 589046 582514 577352 573132 569197 565096
60630 565096 560959 557394 554875 553344 552523 552398 553190 554955 557448 560309 563229 566114 569317 573509 578936
60615 578936 584969 590800 596494 602882 610531 619302 628940 639470 650798 662403 673774 684813 695656
60602 695656 706358 716896 727060 736152 743174 747524 749249 748468 744985 738754 730280 720310 709421
60589 709421 698204 687383 677307 667624 657884 648263 639295 631165 623640 616522 609769 603362 597424
60576 597424 592312 588081 584009 579118 573241 567184 561826 557365 553535 550159 547339 545222 543713 542403
60562 542403 540821 538946 537387 536837 537358 538346 539202 539829 540392 540804 540694 539943 539078 538916 539721 540942 541914
60545 541914 542656 543775 545834 549180 554156 560913 568994 577645 586728 596964 609138 623462 639784
60532 639784 657972 677911 699582 723361 749879 779423 811973 847938 888179 932816 980384
60521 980384 1028467 1074595 1116190 1150315 1174367 1186978 1188035 1178342 1159786 1135369 1108218 1080508
60509 1080508 1053507 1028138 1004805 983119 962620 943716 927311 913622 902062 892285 884800 880569
60497 880569 880508 885287 895042 909210 927110 948704 974414 1004281 1037681 1073584 1110391 1145603
60485 1145603 1176381 1200699 1217636 1226752 1227909 1221926 1210885 1197592 1184966 1175748 1172056 1174942
60473 1174942 1184809 1202331 1228565 1264212 1309441 1364655 1430897 1509286 1600606 1705843 1826755
60462 1826755 1965591 2124522 2305484 2510056 2738936 2991381 3264778 3553615 3847745
60453 3847745 4131485 4385129 4588541 4724848 4782708 4757044 4649141 4466811 4224254 3940354
60443 3940354 3635134 3326053 3026271 2744938 2487842 2257527 2053590 1873851 1715840
60434 1715840 1577654 1457897 1355058 1267037 1191466 1126582 1071425 1024843 984728 948840 916199
60423 916199 887001 861260 838206 817096 797874 780721 765492 751894 739784 728991 719167 710094
60411 710094 701798 694173 686804 679441 672368 666091 660813 656379 652480 648761 644975 641158 637595 634572
60397 634572 632327 631034 630543 630281 629861 629727 630637 632543 634561 636175 637834 640077 642676 644988 646723
60382 646723 647931 648557 648466 647774 646870 646190 645991 646150 646134 645489 644459 643721 643495 643346 643001 642817 643212 644094 645241
60363 645241 646841 649235 652373 655819 659125 662014 664469 666890 669893 673771 678296 683101 687921 692477
60349 692477 696623 700722 705299 710071 713903 716073 717053 717607 717694 716809 715038 713115 711683 710971 711051 711863
60333 711863 713126 714591 716339 718557 721220 724227 727567 731030 734107 736587 739004 742040 745660 749192
60319 749192 752052 754052 755302 756192 757177 758130 758199 756793 754409 751972 749689 747208 744654 742664 741381
60304 741381 740179 738582 736910 735843 735787 736781 738557 740544 742154 743207 743792 743790 742991 741663 740444 739561
60288 739561 738618 737291 735654 733682 731083 728114 726015 725957 727668 729636 730689 731057 731869 733981 737438
60273 737438 741848 746957 752794 759383 766545 774085 782079 790799 800395 810816 821983 833833 846223
60260 846223 859011 872282 886334 901397 917551 934977 954101 975405 999223 1025727 1054903
60249 1054903 1086498 1120194 1155997 1194377 1235957 1281222 1330566 1384354 1442733 1505557 1572826
60238 1572826 1645186 1723770 1809424 1902179 2001451 2106619 2217317 2333147 2453154 2575504
60228 2575504 2697681 2817060 2931348 3038583 3136883 3224437 3299747 3361700 3409349 3441890
60218 3441890 3459103 3461641 3450645 3427205 3392500 3348442 3297769 3243410 3188101 3134661 3086024
60207 3086024 3044499 3011270 2987126 2973499 2972335 2984990 3011789 3052692 3107935 3177736 3261689
60196 3261689 3358752 3467759 3587787 3717860 3856044 3998696 4140872 4277839 4406142 4523102
60186 4523102 4625710 4710668 4775414 4818550 4839306 4837264 4812773 4767094 4701955 4619506 4522932
60175 4522932 4416489 4304394 4190060 4076700 3968189 3868637 3781163 3707523 3648892 3606608
60165 3606608 3582081 3576181 3588763 3618683 3664235 3723643 3795175 3876961 3966770 4061658 4157575
60154 4157575 4249629 4333428 4406331 4467158 4514886 4548233 4566379 4569362 4557730 4532649 4496638
60143 4496638 4453469 4406903 4360062 4316222 4279295 4252888 4239485 4241103 4260115 4298682 4357915
60132 4357915 4438395 4541240 4667930 4819412 4996092 5198519 5427351 5682730 5964251 6271369
60122 6271369 6603176 6957743 7332072 7722356 8123642 8529365 8931846 9323360 9696482
60113 9696482 10043775 10357922 10632269 10861031 11039321 11163590 11231834 11242835 11195604 11090391
60103 11090391 10930052 10719671 10464988 10172205 9849311 9506334 9153462 8799201 8450528
60094 8450528 8114115 7796735 7504508 7241954 7011610 6814475 6650932 6521250 6425185 6361618
60084 6361618 6329033 6325990 6350533 6399419 6468634 6554398 6652728 6758078 6863490 6962443 7049997
60073 7049997 7122233 7175713 7208034 7218141 7205596 7170183 7112650 7035135 6940170 6829597 6704835
60062 6704835 6567664 6420124 6264055 6101399 5934841 5767719 5603383 5444811 5294506
60053 5294506 5154396 5026112 4911634 4813310 4732854 4670686 4626698 4601357 4595544 4609610 4643133
60042 4643133 4695479 4766028 4853855 4957625 5075774 5206289 5346115 5491007 5636098 5776473
60032 5776473 5907284 6023721 6121188 6195634 6243849 6263734 6254439 6216305 6150579 6059071 5943913
60021 5943913 5807726 5654217 5488577 5316854 5144603 4976053 4814479 4662925 4524344
60012 4524344 4401220 4295407 4208282 4140831 4093596 4066684 4059897 4072934 4105601 4157967 4230295
60001 4230295 4322824 4435653 4568695 4721532 4893122 5081589 5283923 5495581 5710530 5922106
59991 5922106 6123957 6310111 6474651 6612292 6719673 6795645 6840015 6852365 6832307 6780322
59981 6780322 6697860 6587000 6450687 6293324 6120690 5939148 5754993 5574222 5402245 5243457
59971 5243457 5101158 4977970 4876246 4798069 4744891 4717103 4713870 4733567 4774610 4835953 4916720
59960 4916720 5015367 5129240 5254786 5388111 5525454 5663442 5799084 5929523 6051781 6162776
59950 6162776 6259726 6340828 6405735 6455295 6490589 6512261 6521058 6519015 6509795 6497714 6486733 6480645
59938 6480645 6483927 6501900 6539845 6602069 6691767 6811466 6963379 7149468 7371331 7629940
59928 7629940 7925104 8254915 8615770 9003006 9411302 9834050 10262241 10684079 11085655
59919 11085655 11451894 11767360 12017467 12190261 12277799 12276476 12186953 12014347 11768111 11460951
59909 11460951 11107318 10722341 10320905 9916333 9519390 9138579 8781080 8452890 8158143
59900 8158143 7898900 7675788 7488725 7337335 7221403 7141117 7096481 7086443 7109051 7162535
59890 7162535 7245847 7357902 7496481 7657774 7836554 8026675 8221680 8415055 8599752 8767686
59880 8767686 8910219 9019302 9088155 9111506 9086219 9012012 8891066 8726804 8523446 8286568
59870 8286568 8023090 7740114 7444060 7141087 6837617 6539804 6252667 5979962 5724504
59861 5724504 5488225 5272198 5077036 4903122 4750247 4617235 4502210 4403060 4317488 4242810
59851 4242810 4176011 4113979 4053707 3992605 3928880 3861681 3790925 3717189 3641662 3565835 3491107
59840 3491107 3418796 3350306 3286888 3229293 3178096 3134260 3098896 3072514 3054998 3046366 3047044 3057421
59828 3057421 3077712 3108332 3149790 3202059 3264375 3335374 3412648 3492264 3569876 3642783 3710326
59817 3710326 3772231 3827534 3875368 3915646 3948185 3971981 3986133 3991007 3988054 3979400 3968433 3960082
59805 3960082 3959401 3969938 3993900 4033337 4090431 4167092 4265155 4386901 4534871 4711468 4919151
59794 4919151 5160513 5437470 5750660 6099718 6482746 6893505 7318230 7734939 8115230
59785 8115230 8427160 8639932 8731201 8693926 8537892 8285244 7964035 7603085 7228318 6860236
59775 6860236 6513236 6196500 5914996 5670211 5461401 5287072 5145285 5033096 4946896 4883755
59765 4883755 4841850 4819429 4814127 4823762 4847262 4884366 4934776 4997958 5073482 5161356 5262190
59754 5262190 5377131 5507347 5653644 5816933 5998916 6201731 6426861 6675085 6947617
59745 6947617 7246636 7574413 7932487 8322024 8744400 9200908 9692109 10217696 10776358
59736 10776358 11365042 11978143 12607513 13242966 13872700 14483858 15063679 15601040 16087930
59727 16087930 16520826 16901757 17238231 17541724 17825722 18104386 18391682 18700210 19039803
59718 19039803 19416696 19833567 20289802 20781308 21300165 21834920 22371897 22896765 23395341
59709 23395341 23853759 24259086 24600738 24871749 25069097 25193606 25250057 25247057 25196148 25110888
59699 25110888 25006699 24900610 24809742 24749438 24732939 24772450 24879480 25063701 25332029 25689130
59689 25689130 26138219 26680660 27314838 28035772 28835565 29703468 30624855 31579739 32541932
59680 32541932 33479404 34355582 35131238 35766915 36226205 36479621 36508181 36305810 35880333
59671 35880333 35252869 34455338 33526441 32507450 31438706 30356370 29288656 28252223
59663 28252223 27250128 26272305 25298882 24306501 23276488 22201655 21088431 19953912
59655 19953912 18820317 17709699 16640483 15626115 14675153 13791634 12975455 12223547 11531965
59646 11531965 10897229 10315853 9783481 9295470 8848232 8439288 8066164 7726011 7416285
59637 7416285 7134999 6880169 6649721 6442157 6256571 6091659 5945284 5815436 5701083
59628 5701083 5601641 5515907 5441973 5377902 5321988 5272330 5226495 5181733 5135461 5085647 5030859
59617 5030859 4970062 4902481 4827669 4745597 4656743 4562372 4464766 4366548 4269408 4173872 4080697
59606 4080697 3991918 3909795 3835198 3767948 3708469 3657948 3616814 3584154 3559084 3541816 3532863
59595 3532863 3531796 3537335 3548215 3563526 3582621 3605126 3630734 3658678 3687755 3717134 3746822 3777080
59583 3777080 3807820 3838944 3870975 3905100 3942893 3986167 4036624 4095177 4161935 4237136 4321826
59572 4321826 4417399 4524872 4644979 4778531 4926200 5088180 5264557 5455758 5662196 5883505
59562 5883505 6118450 6365410 6622536 6887572 7157828 7430252 7701219 7966424 8221401
59553 8221401 8462244 8685677 8888728 9068901 9224785 9356124 9463131 9545969 9604994 9641046
59543 9641046 9654957 9646709 9615637 9562210 9490121 9406692 9321166 9242464 9178243 9135254 9119661
59532 9119661 9136657 9189963 9281714 9412523 9581261 9784555 10016088 10266056 10521473 10767661
59522 10767661 10990111 11175486 11311725 11388375 11397495 11334422 11197926 10990194 10716919 10387028
59512 10387028 10011792 9603809 9176235 8741976 8312626 7897605 7503980 7136848 6799816
59503 6799816 6495243 6224166 5986204 5779979 5603975 5457041 5338058 5245550 5178004 5134399
59493 5134399 5114148 5116770 5141946 5189595 5259433 5350694 5462784 5595797 5749623 5922624 6111914
59482 6111914 6314765 6528821 6750803 6975794 7197999 7411342 7609061 7783628 7927845
59473 7927845 8035813 8102688 8124338 8098015 8023320 7902263 7738796 7538495 7308015 7054099
59463 7054099 6782980 6500754 6213745 5928025 5648777 5380277 5125843 4887153 4663876
59454 4663876 4454744 4259232 4078115 3912532 3762780 3627914 3506252 3396314 3297404 3209356
59444 3209356 3131850 3064208 3005768 2956065 2914577 2880616 2853570 2832986 2818439 2809616 2806488 2808861
59432 2808861 2815743 2825661 2837725 2851821 2867723 2884706 2902419 2921504 2942803 2966353 2991773 3019496
59420 3019496 3051103 3088107 3130186 3174471 3216907 3255098 3290182 3325869 3365822 3412343 3467062
59409 3467062 3531771 3608267 3697953 3801516 3917948 4043694 4174129 4306987 4444114 4589726
59399 4589726 4747769 4921415 5113912 5328633 5568482 5835978 6133688 6463957 6828595
59390 6828595 7229449 7669047 8150064 8674229 9241851 9851661 10500144 11180964 11885147
59381 11885147 12601471 13316552 14015781 14685648 15315722 15898644 16429293 16904907 17325542
59372 17325542 17693423 18011643 18283583 18512552 18700519 18846816 18948278 19000251 18996836 18930725
59362 18930725 18794206 18581086 18287878 17914005 17462142 16938822 16354253 15721220 15053781
59353 15053781 14365979 13670524 12978241 12298621 11640237 11009981 10412233 9849466 9323515
59344 9323515 8835803 8386740 7975714 7601563 7262560 6956254 6680032 6431696 6208972
59335 6208972 6008969 5829012 5667743 5524472 5397491 5283897 5181059 5087408 5001736 4922593
59325 4922593 4848592 4778636 4711641 4646574 4582865 4520276 4458334 4396477 4334770 4273815 4213959
59314 4213959 4155180 4097807 4042660 3990385 3941303 3896006 3855419 3820081 3790041 3765687 3748042
59303 3748042 3737913 3735277 3739801 3751612 3771383 3800121 3839028 3889007 3949980 4021083 4101708 4191964
59291 4191964 4291864 4400446 4515885 4635944 4757899 4878309 4993297 5099075 5192136 5269190
59281 5269190 5327202 5363611 5376715 5366211 5333456 5281045 5211986 5128981 5033853 4927109 4808423
59270 4808423 4678344 4539803 4397752 4257404 4123014 3997753 3883696 3781612 3691342 3612620
59260 3612620 3545298 3488943 3442951 3407243 3382276 3368114 3364047 3369451 3384595 3410183 3446389 3492771
59248 3492771 3549094 3615952 3694609 3786417 3892494 4013865 4151754 4307514 4482424 4677902
59238 4677902 4896024 5139369 5410279 5710697 6042722 6408388 6808150 7240034 7700682
59229 7700682 8186269 8691171 9205909 9717291 10210334 10669258 11077393 11418236 11677757
59220 11677757 11845613 11914640 11880790 11744459 11511389 11192008 10800345 10353249 9868848 9364126
59210 9364126 8853552 8349531 7862807 7401486 6970126 6570512 6203170 5867920 5563649
59201 5563649 5288471 5040291 4817108 4616997 4438002 4277923 4134220 4004518 3887275
59192 3887275 3781630 3686592 3600888 3523552 3454008 3391471 3334983 3284245 3239655 3201151 3167648
59181 3167648 3138057 3112214 3090317 3072037 3056781 3044379 3034816 3027573 3021768 3016756 3012046 3006817
59169 3006817 3000011 2990884 2979196 2964960 2948183 2928684 2905881 2878958 2847454 2811570 2771909 2729258
59157 2729258 2684640 2638977 2592396 2544368 2494939 2445329 2396862 2349686 2303170 2257261 2212802
59146 2212802 2170616 2130818 2093058 2057072 2022955 1991254 1962765 1937969 1916668 1898445 1883408
59135 1883408 1872133 1864887 1861229 1860532 1862712 1868359 1878305 1893155 1913176 1938432 1968923 2004553 2045093
59122 2045093 2090368 2140526 2195965 2256883 2322936 2393383 2467536 2545014 2625558 2708646 2793585
59111 2793585 2880268 2969781 3063854 3163671 3269675 3382590 3503870 3634460 3773536 3919047
59101 3919047 4069101 4221872 4374201 4521104 4656829 4775819 4872770 4942759 4982019 4988330
59091 4988330 4960543 4898335 4802890 4677584 4527667 4359231 4178250 3989969 3798774 3608581
59081 3608581 3423069 3245173 3076476 2917672 2769630 2633462 2509502 2396857 2294233
59072 2294233 2200765 2115919 2039129 1969815 1907393 1851094 1800080 1753861 1712260 1674965 1641610
59061 1641610 1612291 1587330 1566311 1547957 1531237 1516032 1502351 1489426 1476067 1461568 1445826
59050 1445826 1428868 1410759 1391833 1372624 1353621 1335330 1318543 1304257 1293224 1285598 1281035 1279198
59038 1279198 1280103 1283809 1289862 1297476 1306395 1316920 1328655 1339810 1348413 1353868 1356749 1357666 1357293 1357020
59024 1357020 1358230 1360841 1363611 1366028 1368963 1373369 1379381 1386904 1396034 1406455 1417240 1427687 1437610
59011 1437610 1446508 1453279 1457197 1458480 1457540 1454447 1449406 1442961 1435255 1425864 1414857 1403304 1392276
58998 1392276 1382016 1372554 1364418 1358168 1353779 1350928 1349350 1348619 1348253 1348434 1349955 1353143 1357591 1363219
58984 1363219 1370595 1379685 1389321 1398685 1408486 1419893 1433067 1447561 1463471 1481241 1500845 1521998
58972 1521998 1544763 1569198 1594846 1621272 1648696 1677434 1707203 1737582 1768643 1800377 1832012
58961 1832012 1862695 1892473 1921952 1951366 1980617 2009789 2039006 2068274 2098200 2130352 2166074
58950 2166074 2205241 2246871 2290593 2336871 2386269 2439274 2496442 2557962 2623350 2692257 2765219
58939 2765219 2842985 2925657 3013302 3106967 3208104 3317309 3434539 3560350 3696046 3842741
58929 3842741 4001111 4171932 4356081 4554059 4766242 4993557 5237398 5499087 5780037
58920 5780037 6082204 6407687 6757967 7134031 7536961 7967857 8427452 8916334 9435120
58911 9435120 9983681 10560383 11162476 11786522 12427502 13077838 13727985 14367434 14984172
58902 14984172 15563642 16089664 16546715 16920979 17200077 17373646 17435076 17382476 17218346 16949304
58892 16949304 16586020 16142210 15632896 15073349 14478658 13862682 13236884 12610680 11992726
58883 11992726 11390922 10811055 10256299 9728328 9228240 8756363 8312213 7895353 7505989
58874 7505989 7144332 6809668 6500285 6214167 5949699 5705827 5481582 5275548 5086106
58865 5086106 4912283 4753793 4609936 4479035 4359444 4250560 4152283 4064003 3984771 3914027
58855 3914027 3851507 3796902 3750252 3712129 3682615 3660637 3645124 3636235 3634434 3638984 3648690 3663829
58843 3663829 3685942 3715772 3752690 3796266 3847086 3905686 3971790 4045121 4126256 4216326 4316495
58832 4316495 4427931 4551657 4688259 4838276 5002938 5183871 5382053 5597683 5831164
58823 5831164 6083726 6357126 6653361 6974522 7322291 7697670 8101765 8536486 9003539
58814 9003539 9502851 10032849 10592063 11179132 11790894 12421209 13061843 13703484 14335449
58805 14335449 14944912 15516868 16034750 16481518 16841276 17100608 17248881 17278591 17187008 16977740
58795 16977740 16659867 16245374 15747813 15182673 14567110 13918149 13251068 12579005 11912868
58786 11912868 11261142 10630365 10026002 9452400 8912075 8405905 7934045 7495978 7089844
58777 7089844 6712790 6362289 6036486 5733260 5449910 5184082 4934522 4700860 4483140
58768 4483140 4281346 4094565 3920741 3758009 3606161 3465897 3336846 3217361 3106246
58759 3106246 3003560 2909534 2823655 2745059 2672994 2606664 2545408 2489136 2437878 2390985 2347572
58748 2347572 2307588 2271358 2238101 2206006 2173914 2141848 2109807 2077197 2043785 2010103 1976548
58737 1976548 1942938 1909209 1875656 1842333 1809107 1776367 1744545 1712792 1679393 1643826 1607338
58726 1607338 1571162 1535325 1499588 1464250 1429410 1394580 1359815 1326342 1295356 1266899 1240493
58715 1240493 1216140 1194165 1174708 1157730 1142836 1128891 1114687 1100355 1087214 1075940 1065867
58704 1065867 1056464 1048306 1041869 1036259 1029914 1021943 1012206 1000746 987769 973696 958871 943711 929268
58691 929268 916750 906242 896766 887893 880349 874656 870267 866658 864367 864243 866367 870186 875006 879878
58677 879878 883704 886046 887306 887908 887971 887961 888758 890748 893683 897647 903206 910236 917573 924163 929600 933268
58661 933268 934129 931868 927260 921013 913336 905048 897834 892740 889467 887753 888245 891304 896128 901929 908936
58646 908936 917484 927125 937565 949497 963623 979687 997330 1016989 1039070 1063083 1088550 1116101
58634 1116101 1146827 1181152 1219002 1260400 1305169 1352834 1403578 1458733 1519801 1587687 1663222
58623 1663222 1747367 1840231 1940848 2048688 2164617 2289824 2424838 2570138 2726542 2894076
58613 2894076 3071289 3256196 3446592 3638675 3826619 4004547 4167822 4311493 4428913
58604 4428913 4513444 4560866 4569296 4538139 4468798 4365737 4235383 4084193 3918362 3744227
58594 3744227 3567448 3392227 3222154 3060921 2911099 2773107 2646576 2531829 2428797
58585 2428797 2335452 2248971 2168007 2092558 2022236 1956068 1893604 1834869 1779595 1727626 1679617
58574 1679617 1636053 1596017 1558183 1522646 1490477 1461697 1434866 1408469 1381582 1353385 1323256
58563 1323256 1291438 1258813 1226051 1193572 1162018 1132015 1103741 1077348 1053399 1032281 1013646
58552 1013646 996995 982170 968683 955363 941475 927526 914148 900991 887604 874629 863063
58541 863063 852860 843208 833657 824208 814926 806234 798864 792695 786397 779054 771356 764422 758288 752440
58527 752440 746855 741533 735890 729661 723591 718325 713523 708907 705051 702171 699290 695703 692131 689318
58513 689318 686806 684243 682494 682028 681643 680440 679663 680737 682777 684102 685105 687448 691240 695228 699177
58498 699177 703925 709465 714866 719814 724539 728678 731853 734790 738182 741077 742073 741455 740390 738762 735681
58483 735681 731362 726589 721073 714412 707939 703304 699800 695415 690051 685334 681620 677714 673378 669602
58469 669602 666372 662613 658497 655407 653344 650710 647099 644081 642684 642125 641587 641340 641464 641290 640725 640613
58453 640613 641251 641913 642192 642488 643046 643938 645904 649625 654127 657591 659745 661861 664400 666454 667506 667936
58437 667936 667683 666253 664205 662823 662167 661183 659832 659309 660037 661287 662869 665361 668550 671494 674310
58422 674310 678054 682747 687431 692200 698131 705072 711570 717164 722637 727865 731739 734540 737951 742137
58408 742137 745176 746129 746422 747277 747951 747633 747160 747674 749119 751085 753689 756765 759569 762005 764872 768338
58392 768338 771580 774337 777321 780616 783136 784199 784217 783421 781253 777339 771812 764740 756847 750726 749420
58377 749420 753447 760728 769386 778867 788590 797827 807171 817956 829855 840985 850524 859229 867331
58364 867331 874292 880809 888620 897842 906812 914964 923480 932636 940955 947621 953399 958540 962141 964235
58350 964235 966286 968941 971533 974264 978529 984513 990914 997570 1005827 1015712 1025418 1034353 1044105 1055567
58336 1055567 1067746 1080184 1093819 1108477 1122259 1134573 1147187 1161149 1175240 1188573 1202122
58325 1202122 1216487 1230631 1244067 1257825 1272129 1285546 1297604 1309708 1322287 1333595 1342587
58314 1342587 1350640 1359247 1368382 1378171 1389650 1402726 1415762 1428235 1441479 1456053 1471035 1486623
58302 1486623 1504526 1524892 1545777 1566564 1588880 1613232 1637976 1662617 1688882 1717410 1746732
58291 1746732 1776601 1808855 1843802 1879367 1915128 1953544 1995716 2039613 2083916 2129869 2177777
58280 2177777 2225514 2272078 2318652 2364588 2406590 2443771 2479328 2515318 2550224 2583759 2619387
58269 2619387 2659430 2702024 2745548 2791726 2841621 2892960 2944392 2998275 3056529 3117916 3181997
58258 3181997 3251163 3325899 3402756 3480107 3561131 3648038 3738336 3830184 3926277 4028698 4135057
58247 4135057 4243737 4357947 4480412 4609016 4741994 4882414 5033060 5191789 5356514
58238 5356514 5529942 5714810 5909376 6112199 6326455 6554959 6796060 7049029 7318151
58229 7318151 7606783 7913001 8235838 8579886 8948869 9341108 9756720 10202704 10685342
58220 10685342 11204367 11760445 12361284 13014395 13721552 14486972 15323172 16242110 17249187
58211 17249187 18353390 19574784 20934928 22450148 24143230 26052504 28222012 30695373
58203 30695373 33530263 36808703 40625192 45079925 50295438 56424648 63630178 72073198
58195 72073198 81937694 93450443 106870751 122494151 140687926 161887734 186516322
58188 186516322 214873755 246946903 281926028 317472984 349399796 372528494 382604874
58181 382604874 378057354 360399528 333208905 300621965 266251890 232751805 201790194
58174 201790194 174210197 150265947 129855597 112689091 98391104 86570499 76866213
58167 76866213 68966399 62609261 57579424 53708551 50881398 49035752 48147603 48221653
58159 48221653 49296957 51396512 54339437 57520063 59938923 60613225 59085015 55593709
58151 55593709 50814125 45465871 40100575 35079512 30600716 26724041 23422278 20640351
58143 20640351 18316008 16374613 14740542 13357842 12187262 11190211 10331246 9590102
58135 9590102 8955066 8407067 7922285 7486057 7091964 6730588 6390447 6067238 5761983
58126 5761983 5472455 5195234 4933100 4691504 4470015 4264803 4076440 3907524 3755579
58117 3755579 3615920 3488903 3377024 3277212 3182723 3090363 2999541 2907166 2810437 2712622 2619640
58106 2619640 2532611 2449355 2370796 2299764 2235400 2174654 2117686 2066281 2018567 1970633 1921902
58095 1921902 1873984 1825944 1775634 1724102 1673912 1624741 1575285 1527669 1485218 1447447 1411849
58084 1411849 1378892 1350498 1325225 1299819 1274161 1250055 1226515 1201145 1175082 1151756 1131471
58073 1131471 1111716 1092135 1074732 1059632 1044897 1030214 1016881 1004462 991247 977683 965800
58062 965800 955617 945479 935461 927002 919647 911435 902085 892672 882761 871064 858364 846611 835718
58049 835718 824341 813195 804342 797736 791632 785885 781604 778029 773063 766761 761226 757120 753165 748971
58035 748971 745538 742990 740425 737868 735951 733940 730482 725916 721526 717105 711667 705812 700808 696043
58021 696043 690112 683716 678651 674577 669774 664526 660672 658172 655231 651648 649012 647636 646294 644990
58007 644990 645007 646053 646270 645316 644674 644598 643524 640872 637815 634811 630903 625907 620882 616020 610445 604447
57991 604447 599438 595218 589695 581956 573347 564945 556233 546990 538355 531199 525274 520587 517769 516546
57977 516546 515627 514624 514364 514917 515189 514898 515024 515742 515781 514442 512581 510928 509096 506786 504495 502490
57961 502490 500539 499030 498824 499691 500547 501566 504365 509618 516172 523041 530621 539311 548439 557345 566220
57946 566220 575186 583622 590803 596188 598963 598572 595829 592158 587573 580809 571475 560524 548560 535453
57932 535453 521884 509384 498241 487073 475132 463464 453142 443863 435075 427139 420608 415505
57920 415505 411990 410621 411326 413143 415463 418509 422314 426386 430811 436487 443830 452326 461699 472321
57906 472321 484072 495901 506878 516669 524821 530847 535195 538805 541413 541642 539055 534695 529294 522498
57892 522498 514376 506132 498609 491380 484027 477077 471036 465663 460875 457250 455026 453719 453298 454606
57878 454606 457991 462566 467396 472454 477917 483673 489998 497558 506227 514990 523410 531895 540055 546287
57864 546287 549740 551348 552042 551259 548228 543569 538443 532945 526398 518549 509657 500054 490382 481644 474376
57849 474376 468381 463591 460340 458377 456731 455148 454646 455929 458272 460628 462744 464434 464954 464187 463383
57834 463383 463507 463624 462102 458752 454606 450109 444769 438304 431041 423285 415179 407114 399578 392631 386083
57819 386083 380086 375046 371112 368138 366064 364969 364874 365585 366613 367325 367606 368298 370445 374226 379311 386052
57803 386052 395235 406596 418801 431273 444945 460585 477353 493639 508473 521452 532085 540059
57791 540059 545644 549305 551336 552188 552386 551654 548851 543309 535597 526574 516495 505539 494337 483285
57777 483285 472062 460569 449681 440299 432226 424711 417665 411658 407067 403906 402223 402113 403451 405824
57763 405824 408570 410963 412868 415202 419006 424042 429166 434096 439750 446568 453718 460487 467403 475224
57749 475224 483727 492204 500407 508393 516184 524109 532689 541658 550015 557612 565719 575270 585507 595219
57735 595219 604486 614279 625028 636465 648291 660283 672340 685156 700082 717652 736863 756604
57723 756604 776977 798586 821483 845709 872041 901223 933137 967560 1004940 1045560 1088915
57712 1088915 1134965 1185157 1241035 1302743 1370122 1444471 1527742 1620595 1722711 1834526 1957118
57701 1957118 2090730 2234893 2389811 2556108 2733131 2918718 3110481 3305854 3500653
57692 3500653 3688755 3863312 4017342 4143359 4234165 4284895 4293837 4261476 4190016 4084197
57682 4084197 3951396 3799962 3637545 3470739 3305220 3145620 2995665 2858648 2737289
57673 2737289 2633105 2546539 2477861 2427612 2396372 2384884 2394288 2424768 2472512 2527366 2573753
57662 2573753 2595247 2580875 2529617 2449910 2354496 2255014 2160104 2076048 2006920 1954011 1916494
57651 1916494 1893240 1883709 1887564 1904387 1933817 1975193 2027271 2089162 2161457 2245567 2342043 2450410
57639 2450410 2570401 2702121 2844893 2997005 3156761 3322542 3491257 3657541 3814881
57630 3814881 3956836 4077018 4169089 4227752 4249575 4232818 4177460 4086079 3964073 3818237
57620 3818237 3655064 3480390 3299763 3118340 2940423 2769335 2607475 2456226 2316048
57611 2316048 2186929 2068678 1960879 1862924 1774146 1693646 1620161 1552651 1490981 1435513 1386059
57600 1386059 1341741 1301792 1265731 1232767 1201920 1173003 1146689 1123223 1101805 1081658 1063029
57589 1063029 1046533 1032106 1019224 1007771 998028 989958 983053 976814 971102 966179 962646 961050 961253
57576 961253 962439 964086 966706 971271 978146 986914 997023 1008154 1020091 1032725 1046314 1061407 1078370
57563 1078370 1097147 1117615 1139968 1164638 1191872 1221598 1253811 1288977 1327897 1371153 1418951
57552 1418951 1471616 1529985 1595097 1667639 1747893 1836021 1932065 2035817 2146995 2265507 2391146
57541 2391146 2522999 2659303 2797723 2935307 3068123 3191322 3299813 3388869 3454209 3492031
57531 3492031 3499463 3475374 3421064 3340262 3238204 3120322 2991558 2856551 2719787 2585192
57521 2585192 2455774 2333836 2221026 2117846 2023579 1937416 1859547 1790738 1731078 1679748
57511 1679748 1635816 1598663 1567664 1542090 1521425 1505326 1493254 1484581 1479148 1477325 1479472 1485607
57499 1485607 1495529 1508929 1525492 1545297 1569044 1597502 1630877 1669115 1712599 1762060 1818006
57488 1818006 1880800 1951095 2029498 2115862 2209628 2310844 2420118 2537424 2661437 2790021
57478 2790021 2920638 3050108 3174462 3289174 3389104 3468447 3521755 3545494 3538372 3500473 3433004
57467 3433004 3339063 3223689 3092628 2951388 2805405 2659866 2518589 2383499 2255640 2136194
57457 2136194 2026148 1925637 1834220 1751468 1676872 1609636 1549018 1494625 1446050 1402630 1363840
57446 1363840 1329475 1299158 1272186 1248181 1227305 1209367 1193309 1178175 1164131 1151930 1141771
57435 1141771 1133262 1126068 1119914 1114292 1108920 1104276 1100979 1098784 1096883 1095049 1093724 1093043 1092593 1092331 1092955
57420 1092955 1094964 1097847 1100658 1103089 1105612 1108734 1112488 1116606 1120965 1125741 1131139 1137050 1143111 1149205
57406 1149205 1155716 1163033 1170844 1178231 1184581 1190258 1196242 1203194 1210973 1218972 1226759 1234356 1241980 1249759
57392 1249759 1257795 1266353 1275797 1286281 1297564 1309085 1320233 1330799 1341308 1352678 1365180 1377906
57380 1377906 1389609 1399980 1409788 1419891 1430627 1442087 1454313 1467018 1479603 1491759 1503704
57369 1503704 1515700 1527805 1540303 1553796 1568417 1583364 1597706 1611432 1625263 1639702 1654770
57358 1654770 1670458 1686767 1703240 1719039 1733833 1748408 1764045 1781296 1799518 1817655 1835329
57347 1835329 1852934 1870691 1888072 1904513 1920356 1936523 1953378 1970567 1987971 2006049 2024948
57336 2024948 2044070 2063086 2082814 2104402 2127931 2152474 2177339 2202582 2228417 2254806 2281778
57325 2281778 2309585 2338355 2367901 2398079 2429062 2461141 2494530 2529450 2566148 2604634 2644591
57314 2644591 2685697 2727894 2771139 2815063 2859171 2903367 2948030 2993377 3038919 3083786 3127484
57303 3127484 3169997 3211157 3250277 3286536 3319264 3347616 3370469 3387156 3398034 3403839 3404822 3401143
57291 3401143 3393822 3384433 3373923 3362573 3351182 3341275 3333860 3328834 3325991 3325778 3328480 3333485 3340090
57278 3340090 3348482 3359193 3372113 3386791 3403325 3422152 3443220 3466004 3490099 3515124 3540408
57267 3540408 3565577 3591193 3617973 3645413 3672115 3697525 3722559 3748340 3775057 3802298 3829781
57256 3829781 3857326 3884659 3911705 3938814 3966369 3994367 4022527 4050569 4078264 4105510 4132524
57245 4132524 4159778 4187608 4216027 4244857 4273719 4301996 4329296 4356083 4383389 4411638 4440119
57234 4440119 4467877 4494843 4521782 4549342 4577535 4606101 4635007 4664455 4694636 4725631 4757531
57223 4757531 4790406 4824033 4857801 4891168 4924138 4956989 4989532 5021082 5051364 5080966 5110558
57212 5110558 5140029 5168822 5196716 5223758 5249716 5274404 5298482 5323275 5349604 5377264 5405773
57201 5405773 5435148 5465804 5498093 5532185 5568238 5606621 5648126 5693661 5743196 5795125 5847209
57190 5847209 5898227 5948240 5997363 6045028 6090591 6133853 6174671 6212762 6248335 6282264 6314993
57179 6314993 6345743 6373422 6398020 6420459 6441318 6460302 6476872 6490728 6501672 6509552 6514530 6517046
57167 6517046 6517381 6515543 6511706 6506406 6500073 6492468 6482787 6470341 6455088 6437554 6418350 6397902 6376617
57154 6376617 6355036 6333494 6311737 6289341 6266657 6244975 6225453 6208126 6192194 6177071 6162797
57143 6162797 6149597 6137403 6125790 6114047 6101268 6086540 6069084 6048173 6023085 5993424 5959491
57132 5959491 5922220 5882753 5842193 5801699 5762600 5726320 5694107 5666603 5643575 5624296 5608356
57121 5608356 5595935 5587104 5581140 5576963 5574246 5573899 5577660 5587489 5605243 5632391 5669780 5717771 5776695
57108 5776695 5847242 5930816 6030129 6149694 6295604 6474858 6695213 6965737 7297345 7703000
57098 7703000 8197934 8800021 9529677 10409209 11462069 12711936 14180813 15886393 17840126
57089 17840126 20046437 22501914 25193670 28098044 31180372 34394421 37680581 40965171
57081 40965171 44163265 47182600 49924114 52281040 54145237 55424637 56062432 56043639
57073 56043639 55385932 54125935 52312856 50009844 47295337 44259884 41000544 37615940
57065 37615940 34201816 30846029 27623767 24594433 21800204 19265726 16999319 14996131
57057 14996131 13242225 11718023 10400745 9266383 8291321 7453216 6731320 6106955 5564116
57048 5564116 5089566 4672241 4302676 3972939 3676722 3409123 3166211 2944788 2742297
57039 2742297 2556684 2386207 2229355 2084933 1952166 1830562 1719548 1618090 1524804 1438528
57029 1438528 1358795 1285646 1219045 1158574 1103583 1053478 1007848 966490 929337 896211 866644
57018 866644 840035 815955 794202 774761 758053 745147 737343 735513 740251 752710 774738 808037
57006 808037 853889 914094 991533 1089481 1211459 1362296 1546241 1758411 1975094 2155172
56996 2155172 2257106 2259768 2170447 2015935 1827384 1630623 1443809 1277924 1137565 1022643
56986 1022643 930892 859590 805849 766485 738140 717341 700468 684166 666121 645408 622114
56975 622114 596770 570091 542941 516318 491222 468319 447617 428707 411556 396843 385310
56964 385310 377036 371778 369756 371445 376688 384748 395454 409595 427558 447727 466535 479900 484696
56951 484696 479688 465953 446392 424162 401267 378636 357193 338220 322654 310599 301779 296100
56939 296100 293517 293701 296216 300963 308244 318539 332402 350406 372785 398870 426684 452867 473075
56926 473075 483143 480827 466820 444067 416063 385769 355583 327331 301847 278978 258450 240513
56914 240513 225470 212991 202382 193352 185916 179693 173979 168591 164077 160850 158645 157049 156012
56901 156012 155542 155483 156024 157927 161557 166090 170420 174673 180024 187094 195325 204125 213899 225616 239841
56886 239841 256406 274442 292323 308025 320060 327897 331322 329934 323776 314135 303087 292254
56874 292254 282337 273685 266777 262116 260036 260776 264575 271617 281977 295631 312434 332279 355444
56861 355444 382578 414038 449165 486087 521745 551909 571869 578233 570573 551362 524488 493975
56849 493975 463475 435860 412795 394881 382307 375069 372775 374883 381390 392906 410034 433120
56837 433120 462716 499675 544448 596621 655091 717673 779669 833273 869682 882730 871188
56826 871188 838507 791021 735887 679298 625416 576504 533797 498091 469816 449016 435474
56815 435474 428731 428101 432948 443100 458873 480691 508766 543055 583171 627889 674230 716774
56803 716774 748271 762109 755316 729751 690603 643892 594943 547842 505036 467329 434705 407228
56791 407228 384922 367271 353616 344044 339191 339156 343248 350970 362550 378244 397577 419401 441994
56778 441994 462628 477622 483621 479011 464204 441121 412765 382602 353410 326515 302289 281063
56766 281063 263054 247736 234050 221449 210317 201219 194133 188526 183829 179642 175739 172140 169084
56753 169084 166793 165262 164267 163504 162703 161771 160811 159930 159048 158030 156935 155964 155132 154184 152899 151324 149679
56736 149679 148158 146899 146050 145746 146022 146714 147376 147316 145940 143268 140127 137657 136443 136048 135473 134097
56720 134097 132151 130287 128936 128237 128303 129115 130161 130613 130119 129146 128407 128166 128260 128482 128686 128699 128445 128000
56702 128000 127391 126558 125696 125310 125621 126226 126776 127731 129875 133088 136155 137877 138015 137194 136356 136355 137544 139402
56684 139402 140915 141544 141605 141598 141534 141168 140522 139811 139081 138239 137276 136167 134708 132867 131173 130349 130464 130787
56666 130787 130630 130082 129705 129677 129543 128808 127582 126473 125911 125650 124959 123318 120982 118912 118051 118526 119601
56649 119601 120455 120901 121203 121421 121360 121157 121355 122167 123026 123264 122919 122506 122248 121987 121687 121531 121599 121994 123169
56630 123169 125492 128354 130366 130737 130033 129287 128869 128580 128413 128585 129029 129394 129572 129833 130326 130826 131087 131205
56612 131205 131446 131819 131992 131633 130794 129900 129371 129294 129532 130005 130712 131484 131973 132019 131906 132167 133161 134811 136677
56593 136677 138306 139623 140928 142411 143778 144619 144999 145343 145768 145972 145883 145961 146648 147869 149333 151057 153249
56576 153249 155881 158629 161139 163202 164858 166447 168319 170318 171892 172957 174283 176680 180062 183767
56562 183767 187511 191429 195323 198549 200848 202837 205397 208811 212631 216150 218877 220808 222392 224140
56548 224140 226196 228299 230097 231339 231858 231658 230974 230010 228673 226809 224600 222329 219767 216303 211875
56533 211875 207290 203318 199818 196142 192152 188379 185304 182891 180844 178980 177256 175676 174270 172996
56519 172996 171665 170116 168516 167274 166581 166169 165577 164582 163324 162118 161173 160392 159452 158195 156967 156395
56503 156395 156749 157663 158502 158869 158710 158176 157557 157246 157545 158481 159812 161168 162282 163329 165031 168066 172150
56486 172150 176061 178789 180427 181674 182930 184334 186283 189112 192365 195149 197259 199268 201442 203374
56472 203374 204900 206582 208795 211097 213085 215171 217799 220442 222251 223347 224531 225917 226828 227009 227033
56457 227033 227300 227465 227204 226837 226763 226780 226427 225668 224897 224481 224522 224860 225198 225460 226045 227337 228977 230148 230732
56438 230732 231530 232946 234062 233631 231705 229698 228958 229736 231451 233362 234829 235364 234816 233453 231754 230060
56422 230060 228415 226657 224650 222428 220132 217835 215496 213073 210628 208346 206511 205354 204789 204390 203778
56407 203778 202972 202248 201791 201680 201999 202681 203371 203820 204247 205016 206027 206869 207476 208239 209517 211446 214089
56390 214089 217231 220078 221835 222659 223468 224701 225878 226564 227073 227880 228939 229994 231101 232392 233734
56375 233734 234990 236297 237741 239134 240408 241819 243416 244739 245529 246363 248113 250979 254450 257934 261007
56360 261007 263360 265030 266535 268378 270514 272640 274772 277178 279889 282739 285788 289337 293581 298464
56346 298464 303797 309322 314826 320405 326399 332857 339278 345162 350575 355922 361363 366663 371330 374674
56332 374674 376033 375330 373243 370622 367996 365768 364391 363904 363608 362636 360737 358264 355772 353949 353510
56317 353510 354598 356482 358241 359573 360597 361265 361547 361940 363143 365190 367342 368869 369698 370351 371488
56302 371488 373334 375400 377037 378457 380835 385001 390408 395840 400784 405668 411090 417358 424603 432817
56288 432817 441875 451857 463043 475244 487562 499473 511775 525832 542068 559902 578953 599557
56276 599557 622165 647023 674572 705499 740182 778546 820603 866700 917141 971990 1031321
56265 1031321 1095306 1163887 1236666 1313163 1392871 1475037 1558601 1642394 1725152 1805433 1881735
56254 1881735 1952663 2016897 2073235 2121018 2160401 2191981 2216308 2233883 2245284 2250955 2251101 2246066
56242 2246066 2236522 2222969 2205360 2183391 2156682 2124298 2084773 2037347 1982876 1922913 1858329
56231 1858329 1789505 1717464 1643856 1569877 1496004 1422790 1351213 1282166 1216212 1153935 1096034
56220 1096034 1042980 994933 951933 913811 879985 849763 822789 798903 777831 759385 743659
56209 743659 730536 719297 709235 700311 692692 686027 679891 674596 670752 668252 666550 665810 666841 669780
56195 669780 673689 677655 681656 686114 691175 696618 702043 706928 710816 713589 715372 716240 716228 715461 714039
56180 714039 711971 709480 707119 705298 703959 702959 702390 702295 702637 703871 706876 711845 717930 724579 732504
56165 732504 742575 754432 767113 780484 795091 811005 827773 845258 863729 883462 904971
56154 904971 929204 956740 987329 1020974 1058834 1102157 1151083 1205653 1267434 1338940 1421918
56143 1421918 1517417 1627205 1753894 1899971 2067570 2258119 2470066 2696493 2926004 3146207
56133 3146207 3346466 3519474 3663226 3782072 3884142 3976652 4063212 4143660 4213994 4266829
56123 4266829 4294829 4295417 4272029 4231247 4179632 4121865 4058694 3985300 3893080 3774261 3625114
56112 3625114 3446273 3242554 3022927 2798637 2579842 2373923 2186065 2019559 1875225
56103 1875225 1751948 1648109 1561651 1489399 1428163 1376565 1334309 1299845 1270629 1245669 1225837
56092 1225837 1211350 1200689 1192298 1185647 1180301 1175676 1172094 1170534 1170973 1172419 1174653 1178327 1183290 1188600
56078 1188600 1194282 1201265 1209512 1218102 1227235 1238018 1250131 1261913 1273114 1285318 1299183 1313509
56066 1313509 1327707 1342931 1360044 1378435 1397544 1417628 1438419 1458983 1479468 1501095 1523995
56055 1523995 1547089 1570361 1595019 1621074 1647241 1673645 1702072 1732977 1764846 1797124 1831069
56044 1831069 1866966 1903299 1939502 1976711 2014890 2052083 2087595 2123040 2159133 2194372 2228163
56033 2228163 2262357 2298506 2336466 2376931 2422166 2472727 2526420 2581942 2640488 2702439 2765795
56022 2765795 2829594 2895611 2964863 3035801 3107812 3183150 3263343 3346965 3432986 3522962 3617815
56011 3617815 3715941 3816765 3922609 4034728 4151108 4270651 4395862 4528689 4667369 4810214
56001 4810214 4958887 5115077 5277563 5445552 5621322 5806612 6000068 6201210 6413103
55992 6413103 6638150 6875228 7124105 7388565 7671963 7973929 8294647 8637897 9006578
55983 9006578 9400060 9819458 10270599 10758321 11283317 11848361 12461846 13131239 13859335
55974 13859335 14651303 15518778 16472585 17518926 18668124 19939732 21353963 22927155
55966 22927155 24682737 26658892 28900260 31453260 34378406 37758520 41689367 46276046
55958 46276046 51647961 57963556 65390569 74097582 84276843 96160502 110010778 126128889
55950 126128889 144896301 166776211 192237427 221647759 255076527 291780816 329412490
55943 329412490 363627997 388932941 400681797 396989389 379249540 351122293 316955018
55936 316955018 280613884 244984072 211904933 182315661 156508134 134384904 115636431
55929 115636431 99847224 86580368 75437315 66070182 58171711 51479976 45787057
55922 45787057 40926663 36755506 33153274 30028593 27309201 24928698 22829843 20972269
55914 20972269 19325403 17857741 16540641 15356164 14291616 13330293 12455066 11656409
55906 11656409 10929086 10264661 9654036 9093251 8579896 8107229 7668050 7260825 6885903
55897 6885903 6539191 6215491 5914657 5638274 5383149 5143928 4919515 4711238 4517030
55888 4517030 4332987 4158662 3995623 3842506 3696347 3557185 3426795 3304396 3187922
55879 3187922 3077994 2976421 2882035 2791848 2705033 2622241 2542521 2464530 2389474 2319398 2253797
55868 2253797 2191056 2131825 2077928 2029324 1985124 1946124 1913358 1885679 1861701 1842683 1830565
55857 1830565 1824517 1821900 1820601 1817389 1806091 1781383 1743636 1697164 1644955 1588050 1528549 1469526
55845 1469526 1412464 1357614 1306268 1259929 1217931 1178465 1141276 1107126 1075609 1045925 1018808
55834 1018808 995151 973690 952532 932001 913535 896836 880763 866106 854592 845718 837217 828272
55822 828272 819790 811868 803392 793958 784040 773508 761876 749729 738110 726884 715287 703455
55810 703455 691897 680304 668595 658066 649686 642275 634324 626464 620043 614352 607724 600542 594670
55797 594670 590408 586311 581579 576457 570689 563745 556283 549506 543441 537669 533053 530679 529508 527026
55783 527026 521759 513419 501477 485850 468432 451649 435841 420048 404767 391698 381177 372211
55771 372211 364686 359207 355052 350668 346102 342623 340002 336548 331962 327771 324669 321692 318493 316230
55757 316230 315510 315327 314693 313644 312110 309416 305475 300986 295882 288979 279653 268653 256852 244438
55743 244438 231696 219456 208403 198811 191007 185084 180286 175822 172144 170201 169654 169175 168401 168150
55729 168150 168772 169724 170801 172303 173857 174448 173819 172736 171804 171092 170785 170999 171161 170879 171136 173264 176953
55712 176953 180800 184568 189179 194607 199621 203848 208330 213624 218863 223090 226087 227518 226699 223732
55698 223732 219637 214868 208874 201476 193625 186362 180021 174720 170690 167864 165979 165127 165285 165479 164503
55683 164503 162409 160257 158537 157054 156168 156759 158885 161750 164971 168598 172033 174365 175840 177593 179907
55668 179907 182178 184586 188157 192841 197075 199608 200493 200115 198708 197109 196405 196373 195585 193451 190832 188333
55652 188333 185491 182092 178846 176049 172815 168337 162915 157208 151458 145879 140826 136185 131535 127087
55638 127087 123491 120600 117547 114162 111041 108204 105031 101690 99114 97323 95274 92745 90781 89787
55624 89787 88748 86963 85086 83732 82436 80723 78957 77494 76137 74954 74341 73797 72136 69588 68108
55609 68108 68713 69906 69718 68052 66006 64107 62338 60914 60022 59563 59808 61302 63500 64773 64550 64187
55593 64187 64821 65693 65716 65410 65906 67024 67682 67479 66690 65409 63850 62782 62553 62350 61434 60443 60398 61130
55575 61130 61793 62294 63011 63655 63749 63921 65531 69051 73660 78301 82321 85309 87107 87965 88181 87766 86782
55558 86782 85576 84276 82543 80250 77842 75615 73294 70848 68999 68292 68306 68386 68526 68911 69324 69673 70414
55541 70414 71690 72737 72950 72916 73567 74865 76140 77211 78352 79578 80733 81891 82981 83419 82811 81598
55525 81598 80414 79216 77617 75566 73143 70279 67231 64731 63030 61409 59187 56528 53654 50230
55511 50230 46364 43352 42288 42524 42499 41584 40116 38241 35866 33436 31578 30220 28988 28186 28362 29123
55495 29123 29378 28688 27557 26496 25696 25448 25976 26762 26845 25928 24675 23860 23631 23602 23290 22563 21803 21404 21018
55476 21018 19882 18109 16812 16513 16312 15341 14254 14258 15324 16340 16661 16552 16405 16433 16841 17506 17751 17158
55458 17158 16302 15981 16121 16207 16273 16578 16801 16550 16298 16765 17651 18037 17848 17898 18619 19752 21137 22714 23794
55439 23794 23507 22146 21082 21054 21401 21252 20703 20447 20834 21616 22237 22198 21446 20499 19871 19517 19171 19001 19421
55420 19421 20428 21630 22794 23838 24538 24782 24985 25694 26914 28261 29584 30926 32160 33135 33944 34560
55404 34560 34531 33586 32172 30871 29663 28357 27197 26397 25598 24547 23827 23993 24495 24411 23789 23222 22566 21369
55386 21369 20273 20528 22099 23561 24078 24284 24922 25731 26090 25794 24764 22840 20341 18116 16692 15879
55370 15879 15477 15707 16690 18089 19516 20764 21498 21353 20538 19801 19583 19589 19279 18400 17065 15849 15666 16915
55352 16915 18806 20160 20718 21029 21250 21030 20473 20216 20390 20448 20209 20145 20324 20050 18972 17758 17180 17224 17516
55333 17516 18011 18736 19376 19551 19178 18307 17073 16006 15787 16389 16952 16872 16522 16573 17068 17550 17746 17776 17913
55314 17913 18359 19044 19541 19441 18828 18119 17537 17157 17282 18146 19307 20060 20470 21275 22619 23605 23399 22179
55296 22179 20740 19694 19266 19283 19153 18402 17450 17255 18034 18972 19403 19553 19813 19970 19690 19171 18821 18665 18478
55277 18478 18145 17574 16653 15578 14860 14760 15096 15758 16823 17929 18216 17370 16213 15780 16206 16922 17508 17845
55259 17845 17882 17846 18365 19757 21308 21813 20856 19194 17890 17418 17577 17948 18277 18546 18800 18990 19056 19065 19132 19270
55239 19270 19484 19877 20395 20654 20374 19886 19805 20223 20636 20664 20405 20127 20029 20302 20937 21432 21172 20205 19247 18880
55219 18880 19123 19762 20562 21146 21232 21121 21387 22020 22376 22129 21726 21692 21943 21993 21441 20197 18655 17698 17987
55200 17987 19140 20162 20710 21330 22341 23249 23576 23593 23789 24111 24150 23741 23027 22213 21508 21022 20616 20156 19890
55181 19890 20197 20949 21619 21991 22209 22203 21793 21339 21534 22411 23306 23894 24405 24707 24166 22740 21265 20290 19560
55162 19560 19066 19490 20922 22159 22240 21850 22208 23186 23607 22967 21819 20723 19749 18932 18432 18240 18319 18905
55144 18905 20080 21260 21718 21556 21628 22572 24396 26902 29987 33484 37053 40231 42509 43657 44155 44957
55128 44957 46461 48044 48883 48820 48136 46979 45534 44254 43347 42363 40805 38874 37075 35521 34183 33420
55112 33420 33570 34246 34728 34818 34686 34157 32923 31346 30266 29977 30043 30178 30674 31806 33271 34401 34687 34160
55094 34160 33537 33824 35285 36935 37518 36940 36233 36215 36800 37658 38828 40351 41825 42759 43192 43627 44432 45515
55076 45515 46572 47456 48209 48750 48731 47958 46878 46339 46756 47719 48541 48896 48877 48764 48852 49146 49112 48197 46773
55057 46773 46102 47020 49104 51397 53442 55189 56476 57279 58122 59579 61503 63255 64502 65279 65514 65083
55041 65083 64262 63571 63135 62585 61582 60165 58713 57788 57777 58361 58594 57890 56671 55698 55115 54642 54291 54235
55023 54235 54149 53386 51812 49844 47765 45578 43528 42155 41636 41529 41308 40826 40221 39745 39694 40136 40676 40810
55005 40810 40560 40392 40471 40361 39580 38244 37001 36411 36481 36812 37237 38138 39859 41920 43374 44034 44694 45895
54987 45895 47193 48112 49114 50909 53314 55591 57520 59373 61200 63003 65343 68857 73298 77931 82814
54972 82814 88770 96062 104045 112278 121139 131013 141723 152995 164754 176505 187005 195031 199983
54959 199983 201468 198938 192367 182917 172272 161344 149953 137728 125119 113495 104280 97821 93135
54946 93135 88937 84810 81138 78129 75423 72625 69654 66518 63345 60790 59787 60577 62442 64665 67243
54931 67243 70305 73432 76168 78904 82569 87523 93338 99737 107187 116279 126739 137321 146517 153220
54917 153220 156842 157166 154356 149063 142297 134983 127513 119694 111107 101622 91664 82039 73528 66651
54903 66651 61674 58435 56115 53663 50936 49045 48968 50063 50714 50360 49966 50403 51351 52118 52589 52761 52295
54886 52295 51267 50645 51036 51554 50882 49079 47362 46421 45950 45623 45470 45343 44953 44520 44505 44612 43939 42298
54868 42298 40595 39670 39419 39258 38773 37727 36115 34528 33910 34622 36127 37694 38989 39926 40492 40894 41392
54851 41392 41871 42019 41940 42078 42493 42815 42920 43048 43182 43022 42687 42679 42954 42758 41739 40550 40014 40267 41021
54832 41021 42062 43112 43840 44448 45693 47887 50355 52381 54173 56347 58922 61466 63955 66865 70507
54817 70507 74752 79384 84319 89568 95350 102251 110907 121339 132640 143448 152764 160267 165788 168608
54803 168608 167804 163475 157137 150371 143479 136060 128450 121654 115991 110799 105556 100411 95477 90573
54789 90573 85989 82573 80672 79770 79562 80499 82666 85021 86537 87486 88832 90829 92999 95136 97602
54774 97602 100841 105207 111090 118679 127724 137855 148830 160164 170991 180757 189580 197411 203353
54761 203353 206525 207308 206994 206333 205061 202767 199595 196045 192526 189100 185410 180958 175708 170166 164604
54746 164604 158621 151867 144788 138043 131558 124849 118031 111784 106420 101701 97540 94134 91304 88430
54732 88430 85347 82722 81186 80420 79481 77870 76050 74933 74968 75695 76173 75836 74893 73933 73339 73136 73095 72808
54714 72808 71953 70741 69798 69364 68896 67812 66359 65394 65476 66498 67932 69056 69204 68279 66921 65867 65267
54697 65267 64953 65005 65553 66332 66995 67680 68632 69446 69465 68952 69112 70726 73341 76062 78541 80827 82750 84027
54679 84027 84784 85567 86830 88622 90727 92870 94812 96385 97533 98399 99349 100733 102458 104004 105102
54664 105102 106277 108309 111211 114174 116660 119128 122394 126588 131156 135739 140574 145981 151871 158078
54650 158078 164931 173080 182731 193404 204517 215881 227411 238705 249213 258517 265973 270318 270261
54637 270261 265616 257444 247080 235393 222940 210184 197352 184552 172257 161219 151753 143553
54625 143553 136430 130635 126191 122518 119171 116392 114490 113122 111770 110434 109227 107721 105404 102578
54611 102578 100046 98035 96111 94094 92350 91019 89505 87023 83467 79668 76909 75996 76556 77384 77652
54596 77652 77466 77002 75712 73013 69404 66134 63905 62518 61659 61274 61166 60936 60464 59948 59398 58581 57466
54579 57466 56245 54978 53806 53379 54306 56025 57077 56768 55904 55526 55585 55401 54893 54769 55663 57598 60108
54562 60108 62553 64396 65498 66061 66196 65756 64752 63697 63307 63944 65428 67154 68339 68585 68402 68933
54546 68933 70879 73919 77367 81038 85110 89414 93438 97061 100894 105697 111632 118199 124732 130809
54532 130809 136256 140945 144651 147081 147958 147119 144611 140721 135854 130307 124250 117930 111787 106286 101669
54517 101669 97869 94547 91282 87909 84711 82056 79862 77765 75821 74610 74449 74883 75197 75054 74406
54502 74406 73280 72059 71475 71751 72110 71730 70881 70443 70567 70584 70128 69531 69088 68700 68420 68654 69517 70533
54484 70533 71243 71651 71881 71837 71489 71099 70899 70811 70647 70300 69628 68504 67091 65782 64804 64126 63709 63380 62596
54465 62596 60933 58906 57711 57950 59112 60405 61513 62361 62807 62898 62894 62699 61840 60372 59204 59044 59533
54448 59533 59907 60025 60181 60392 60515 60725 61176 61436 60923 59766 58634 57860 57337 57211 57960 59678 61813 63791
54430 63791 65500 67038 68349 69244 69490 68837 67265 65333 63971 63812 64858 66758 69081 71332 73099
54415 73099 74411 75751 77543 79781 82244 84852 87610 90389 92998 95436 97904 100428 102604 103805
54401 103805 103799 103119 102687 102927 103316 102907 101272 98885 96598 94843 93362 91560 89051 85881 82327 78680
54385 78680 75283 72620 71100 70676 70858 71145 71337 71408 71302 70952 70369 69632 68898 68432 68388 68530 68391 67867 67398
54366 67398 67412 67848 68444 69261 70585 72450 74565 76698 78805 80836 82675 84314 85915 87628 89478 91377
54350 91377 93088 94289 94974 95726 97217 99286 100892 101247 100726 100294 100197 99685 98011 95233 91860 88233
54334 88233 84616 81518 79250 77308 74837 71822 69221 67671 66628 65182 63213 61215 59436 57899
54320 57899 56977 57074 57682 57587 56274 54535 53407 53054 53051 53156 53314 53273 52798 52096 51502 50898 49939 48751 47877
54301 47877 47458 46957 45908 44569 43614 43429 43958 45002 46330 47523 48088 47884 47283 46791 46595 46550 46490 46349
54283 46349 46084 45693 45309 45096 45029 45051 45389 46365 47763 48779 48887 48483 48348 48756 49428 50078 50519 50446 49706
54264 49706 48777 48509 49280 50777 52566 54401 55932 56712 56706 56443 56385 56452 56281 55707 54851 53995 53460 53314 53175
54245 53175 52652 51995 51850 52310 52757 52860 53179 54380 56260 57900 58566 58162 57101 56061 55553 55487 55347 55013
54227 55013 54993 55624 56492 57053 57446 58136 59055 59662 59723 59520 59334 59212 59243 59605 60167 60347 59588 57924 56049
54208 56049 54771 54287 54035 53455 52834 52985 54019 55024 55242 54990 54959 55075 54760 54007 53475 53557 53995 54442 54832
54189 54832 55132 55223 55173 55192 55164 54634 53468 52261 51829 52454 53724 54938 55580 55542 55039 54283 53290 52065 50901
54170 50901 50344 50828 52335 54266 55699 56073 55757 55637 56005 56260 55964 55655 56033 56780 56918 56228 55510 55363
54152 55363 55423 55062 54299 53607 53193 52834 52252 51410 50492 49735 49234 48942 48877 49138 49497 49247 47921 46003 44426
54133 44426 43414 42429 41316 40795 41471 42898 44067 44519 44581 44762 45292 46152 47182 48201 49213 50328 51398
54116 51398 51957 51770 51192 50752 50586 50566 50754 51271 51816 51797 51050 50067 49333 48688 47644 46167 44906 44593 45361
54097 45361 46678 47844 48402 48229 47461 46463 45676 45222 44717 43681 42202 41006 40770 41515 42700 43746 44337
54080 44337 44448 44325 44365 44773 45318 45612 45628 45778 46395 47353 48311 49170 50068 51040 51901 52523 53030 53649 54571 55961
54060 55961 57851 59814 61035 61057 60396 60076 60507 61129 61231 60876 60870 61949 64104 66585 68544 69797 70930
54043 70930 72457 74032 74798 74524 73949 73930 74736 76373 79032 82732 86902 90910 94882 99537 105232 111552
54027 111552 117816 123627 128905 133702 138071 141993 145389 148313 150964 153387 155391 156999 158674 160720
54013 160720 162642 163604 163436 162736 161989 161052 159560 157381 154514 150962 146966 143130 140037 137834 136229
53998 136229 134736 132897 130441 127336 123643 119494 115391 112243 110604 109888 108837 106847 104457 102484
53984 102484 101234 100702 100938 101721 102265 101787 100292 98443 96797 95507 94637 94267 94210 93976 93264 92343 91821
53967 91821 92071 92992 94240 95569 96863 97864 98102 97333 96023 95109 95092 95531 95703 95601 95961 97203 98704
53950 98704 99443 99188 98709 98788 99417 100163 100996 102346 104498 107385 110920 115060 119412 123276 126446 129614
53934 129614 133595 138329 142940 146604 149073 150561 151473 152158 152663 152845 152928 153645 155416 157686 159572 161009
53918 161009 162605 164544 166429 168314 171024 174999 179494 183499 186993 190693 194890 199290 203877 209083
53904 209083 214902 220403 224570 227266 229033 230196 230654 230427 229845 229043 227689 225491 222708 219855 217159
53889 217159 214612 212278 210032 207175 202971 197620 192086 186860 181505 175648 169680 164067 158603 152988
53875 152988 147619 143083 139229 135414 131507 127970 125149 123097 121892 121397 120778 119030 116010 112399 108756
53860 108756 105300 102476 100770 99773 98284 95692 92565 89634 86947 84397 82306 80965 80179 79809 80192
53845 80192 81440 82782 83252 82763 81961 81306 80775 80213 79442 78223 76656 75507 75575 76739 78010 78508 78134
53828 78134 77359 76741 76677 77312 78522 79989 81235 81698 81175 80290 80153 81267 83066 84749 86174 87596 88978
53811 88978 90147 91372 93148 95404 97421 98643 99240 99815 100857 102513 104648 107032 109590 112461 115705
53796 115705 119131 122560 126100 129882 133681 137123 140190 143215 146397 149542 152294 154401 155840 156864
53782 156864 157912 159256 160730 161916 162504 162367 161452 159799 157549 154728 151171 146881 142351 138289 135056
53767 135056 132473 130009 127088 123512 119854 117141 115803 115129 114106 112559 111048 109879 108805 107621
53753 107621 106408 105020 102943 99966 96649 93796 91746 90382 89525 88956 88277 87198 85989 85248 85149 85245
53737 85245 85206 85450 86641 88621 90290 90671 89761 88090 85876 83128 80337 78356 77419 76823 75866 74729
53721 74729 74133 74481 75648 77295 78994 80229 80670 80431 79864 79238 78782 78716 78990 79201 79149 79236 79936 81052
53703 81052 81981 82604 83382 84538 85612 86018 85717 85151 84787 84970 86005 88140 91413 95501 99712 103217
53687 103217 105485 106550 106854 106919 107210 108049 109414 110887 112041 112846 113589 114451 115397 116399 117548 118926
53671 118926 120499 122165 123853 125580 127376 129044 130095 130244 129978 130218 131254 132409 132973 133038 133060 133089 132958
53654 132958 132863 133092 133378 133197 132629 132307 132526 132987 133457 134028 134612 134817 134578 134381 134528 134661 134386 133973 133970 134356
53634 134356 134546 134143 133271 132192 130946 129532 128223 127476 127515 128131 128976 129999 131380 133052 134487 135157
53618 135157 135024 134432 133696 133047 132823 133343 134627 136412 138403 140315 141856 142926 143723 144388 144846 145321 146667
53601 146667 149458 152896 155437 156629 157561 159262 161438 163322 165102 167674 171290 175219 178748 181864
53587 181864 184789 187368 189293 190725 192357 194814 198086 201612 204865 207739 210354 212669 214514 215921
53573 215921 217191 218670 220698 223628 227429 231188 233574 234132 233782 233678 233863 233492 232143 230339 228799
53558 228799 227722 226982 226538 226354 226185 225800 225293 224859 224327 223220 221269 218626 215562 212283 209249 207295
53542 207295 207015 208035 209249 209828 209773 209491 209223 209062 209179 209633 210054 209879 208991 207946 207475 207828 208673 209607
53524 209607 210705 212411 214797 217151 218622 219229 219797 220887 222238 223493 225003 227442 230986 235274 239973
53509 239973 244901 249811 254590 259619 265485 272276 279522 286797 294053 301383 308843 316566 324776 333689
53495 333689 343571 354730 367108 380016 392738 405315 418323 431955 445822 459648 473679 488334
53483 488334 503870 520443 538070 556434 575143 594146 613473 632625 650874 668294 685810
53472 685810 703986 722348 740236 757762 775487 793652 812170 831028 850157 869173 887677
53461 887677 905671 923336 940549 956904 972047 985794 998178 1009635 1020828 1031994 1042706
53450 1042706 1052615 1062083 1071696 1081409 1090632 1098944 1106279 1112510 1117320 1120469 1121776 1120889 1117512 1111931
53436 1111931 1104977 1097245 1088575 1078409 1066554 1053520 1040147 1026893 1013498 999382 984379 968929
53424 968929 953550 938350 923122 907645 891831 875862 860325 845872 832416 818951 804513
53413 804513 789227 774217 760622 748925 739070 730889 724362 719555 716261 713858 711903 710810 711444
53400 711444 713883 717263 721152 726342 733652 742572 751948 761631 772487 784974 798713 813464 829522
53387 829522 846842 864734 882850 901763 922025 943270 964813 986687 1009461 1033415 1058522
53376 1058522 1085090 1113747 1144756 1177783 1212343 1248172 1285174 1323341 1362755 1403368 1444718
53365 1444718 1486126 1527224 1568100 1608926 1649683 1690277 1730642 1770560 1809490 1846698 1881524
53354 1881524 1913591 1942885 1969640 1994023 2015948 2035323 2052399 2067593 2080924 2091933 2100320
53343 2100320 2106345 2110328 2111947 2110400 2105195 2096371 2083815 2066740 2044173 2015896 1982693 1945683
53331 1945683 1905603 1862797 1817803 1771765 1726079 1681634 1638469 1596281 1555116 1515360 1477125
53320 1477125 1439938 1403135 1366352 1329501 1292498 1255285 1218089 1181497 1146250 1112978 1081961
53309 1081961 1053106 1026229 1001423 978982 958952 940950 924537 909572 896109 884219 873927
53298 873927 864937 856315 846993 836938 827360 819306 812505 806186 800518 796333 793643 791402 788890 786462
53284 786462 784750 783873 783768 784592 786360 788750 791668 795527 800626 806789 814010 822858 833683 845878
53270 845878 858612 871936 886549 902698 919915 937691 955755 973733 991170 1008009 1024670
53259 1024670 1041573 1058789 1076027 1092608 1107614 1120563 1131911 1142442 1152200 1160508 1167057 1172406
53247 1172406 1177197 1181319 1184137 1185152 1184124 1180807 1175025 1166957 1157054 1145633 1132645 1117853 1101099
53234 1101099 1082413 1061930 1039774 1015999 990712 964334 937734 911929 887454 863978 840725
53223 840725 817411 794666 773387 753783 735223 716909 698421 679729 661028 642661 624874
53212 624874 607591 590684 574408 559132 544611 530078 515316 501165 488645 478016 469021 461558
53200 461558 455556 450562 446056 441934 438165 434123 428968 422637 415901 409353 402885 396248 389602 383201
53186 383201 376886 370205 362917 355246 347732 340921 335009 329683 324374 318723 312812 307055 301939 297691
53172 297691 294007 290203 285756 280581 274761 268357 261721 255611 250506 246013 241378 236511 232027 228433
53158 228433 225755 223873 222647 221626 220160 217996 215435 212772 210015 207249 204786 202710 200656 198339
53144 198339 196022 194135 192669 191287 189861 188569 187495 186435 185179 183823 182686 181928 181321 180425 179012
53129 179012 177279 175642 174499 174210 175031 176767 178631 179828 180335 180818 181717 182747 183430 183858 184589 185851
53113 185851 187124 187659 187278 186503 185855 185254 184302 183000 181854 181199 180729 179830 178162 175779 172967 170146
53097 170146 167679 165541 163345 160846 158193 155525 152657 149427 146069 142911 139986 137217 134730 132602
53083 132602 130572 128416 126359 124653 123040 121149 119234 117919 117294 116795 115972 114887 113821 112982 112465
53068 112465 112015 111035 109258 107292 105916 104995 103741 101926 100148 98913 98179 97838 97862 97823 97037 95501 94003
53051 94003 93114 92738 92909 94129 96366 98377 98799 97568 95719 94182 93261 92963 93096 93114 92437 91070 89647
53034 89647 88803 88636 88738 88609 88094 87422 86779 86009 85008 84231 84272 84974 85493 85356 84908 84568 84228 83675 83120
53015 83120 82978 83479 84646 86184 87242 86946 85493 84127 83625 83380 82476 81036 79881 79358 79227 79387 79929
52998 79929 80592 80883 80788 80883 81644 82952 84229 84859 84583 83773 83197 83381 84352 85957 87939 89606 90127 89572
52980 89572 89047 89360 90154 90924 92164 94631 97961 101043 103548 106112 109100 112093 114707 117111 119563
52965 119563 122105 124810 127716 130386 132077 132483 131893 130631 128906 127083 125497 123993 122290 120687 119668
52950 119668 118856 117343 115243 113884 114037 114831 115031 114557 114020 113491 112662 111810 111616 112135 112772 113283 114099 115491
52932 115491 117031 118162 118891 119652 120695 121838 122729 123199 123384 123574 123878 124125 124136 124007 124029 124356 124889 125450
52914 125450 125991 126627 127526 128718 129981 130993 131672 132292 133241 134653 136197 137197 137148 136375 136004 136924 138770
52897 138770 140330 140974 141209 141639 142045 141965 141682 141934 142828 143760 144439 145291 146576 147744 148104 147801 147665 148208
52879 148208 149180 150063 150655 151110 151598 152078 152358 152384 152479 153111 154334 155621 156514 157248 158404 160086 161815 163268
52861 163268 164675 166367 168403 170816 173801 177284 180687 183549 186164 189146 192465 195342 197024 197309
52847 197309 196461 195034 193721 192956 192566 192157 191721 191490 191292 190651 189541 188425 187402 185946 183773 181375
52831 181375 179299 177332 174913 172060 169453 167729 166959 166640 165970 164352 161948 159559 157802 156566 155334
52816 155334 153694 151502 148995 146896 145838 145466 144744 143491 142836 143554 144628 144330 142298 139710 137666
52801 137666 136286 135249 134388 133735 133604 134473 136144 137249 136468 134208 132190 131397 131256 130956 130515 130215 129869
52784 129869 129207 128377 127589 126788 125993 125430 125013 124263 123105 122147 121754 121457 120753 119901 119309 118632 117214 115074
52766 115074 112861 111064 109795 109052 108580 107818 106581 105548 105347 105386 104442 102333 100146 98703 97689 96623
52750 96623 95854 95947 96608 96945 96660 96335 96558 97168 97549 97329 96616 95692 94704 93693 92791 92184 91811 91221 89953
52731 89953 88073 86190 84895 84293 84095 83941 83473 82362 80613 78824 77797 77743 78056 78095 77991 78358 79343
52714 79343 80387 81031 81511 82268 83191 83796 84027 84316 84843 85205 85083 84849 85176 86263 87779 89441 91233
52697 91233 93033 94453 95283 95853 96625 97533 98051 97959 97657 97554 97415 96687 95300 93661 91920 89770 87152
52680 87152 84638 82734 81190 79466 77624 76235 75571 75374 75368 75442 75352 74741 73622 72421 71417 70540 69832
52663 69832 69590 69827 70051 69914 69721 69899 70301 70486 70482 70718 71322 72041 72967 74797 77988 81940 85494 88208
52645 88208 90709 93554 96094 96949 95592 92981 90428 88301 86202 84025 82143 80640 79079 77258 75693
52630 75693 74949 74835 74689 74269 73978 74214 74825 75333 75553 75804 76413 77105 77126 76092 74567 73531 73403 73889
52612 73889 74609 75460 76357 77143 77920 79042 80538 81919 82859 83728 85108 86946 88557 89371 89396 88990 88527
52595 88527 88306 88550 89246 90001 90218 89646 88767 88450 89043 90062 90914 91599 92288 92639 92255 91711 92206 93965
52577 93965 95789 96586 96689 97124 98177 99305 100110 100664 101045 101220 101392 101986 103258 105144 107385 109502 110874
52560 110874 111201 110792 110112 109280 108349 107747 107944 108816 109851 110840 111852 112639 112651 111743 110405 109224 108493 108358
52542 108358 108872 109798 110746 111555 112234 112562 112226 111411 110771 110641 110703 110623 110584 110944 111656 112319 112532 112103 111133 110093
52522 110093 109526 109428 109210 108417 107313 106543 106501 107176 108347 109610 110455 110685 110677 110964 111581 112039 111897 111147 110124
52503 110124 109208 108642 108464 108599 109022 109730 110493 110883 110690 110192 109761 109329 108506 107220 105941 105218 105195 105629
52485 105629 106150 106424 106244 105651 104888 104106 103179 101935 100527 99417 98967 99163 99733 100340 100602 100133 98862
52468 98862 97263 96002 95270 94642 93741 92830 92563 93221 94396 95430 96003 96239 96433 96781 97302 97886 98376 98685
52450 98685 98879 99105 99380 99443 98955 97891 96693 95902 95733 96118 96981 98180 99226 99509 98947 98118 97508 96991
52432 96991 96337 95852 96003 96592 96939 96983 97569 99339 101761 103638 104350 104227 103897 103731 103944 104774 106249 107915
52414 107915 109000 108894 107513 105348 103234 101937 101731 102346 103332 104425 105509 106387 106840 106902 106832 106795 106782 106947
52396 106947 107704 109247 111124 112548 113106 112943 112453 112029 112000 112393 112816 112941 113105 113988 115605 117107 117772
52379 117772 117759 117600 117416 117115 117013 117670 119109 120703 121874 122551 122897 122953 122722 122312 121864 121471 121271 121459
52361 121459 122109 123082 124229 125606 127363 129386 131179 132191 132359 132218 132354 132807 133160 133168 133067 133286 134109
52344 134109 135614 137608 139536 140848 141633 142581 144112 145900 147479 148887 150377 151889 153265 154668 156238
52329 156238 157589 158230 158374 158724 159478 160159 160443 160566 160807 161148 161658 162637 164063 165410 166381 167501 169469
52312 169469 172130 174525 175978 176800 177849 179604 181820 184047 186284 188934 192134 195412 198257 200850
52298 200850 203877 207738 212235 216983 221719 226190 230128 233525 236681 239892 243292 247008 251227 256117
52284 256117 261930 269096 277754 287218 296380 304735 312542 319953 326610 332437 338226 344928 352693 361059
52270 361059 369759 378883 388468 398383 408478 418541 428305 437864 447794 458356 468798 478034 485989
52257 485989 493724 502204 511420 520803 529899 538437 546195 553197 559719 565840 571195 575494 579073 582530
52243 582530 585923 588739 590696 592239 593975 595768 596740 596205 594458 592475 590939 589772 588618 587496 586829
52228 586829 586997 588159 590409 593775 597951 602291 606320 610162 614362 619374 625374 632449 640638 649680
52214 649680 658943 667837 676330 684944 694233 704247 714443 724056 732624 740277 747476 754362 760465 765195
52200 765195 768575 771247 773726 775924 777456 778122 777825 776282 773144 768369 762248 755132 747293 738962 730322
52185 730322 721540 712930 704909 697546 690353 682838 675153 667759 660584 652985 644632 635966 627635 619923
52171 619923 612920 606765 601309 595883 589888 583502 577425 571960 566734 561333 555882 550828 546380 542366
52157 542366 538584 535132 532281 530095 528295 526553 524812 523144 521410 519275 516648 513911 511604 509967
52143 509967 508851 507948 507048 506120 505158 503936 502052 499398 496417 493644 491039 488142 484834 481521 478481
52128 478481 475504 472328 469011 465606 461913 457946 454307 451648 449917 448525 447010 445138 442610 439343
52114 439343 436035 433741 432596 431420 428979 425397 422009 420006 419503 419789 420094 420085 419918 420037 420816 422235
52098 422235 423957 425744 427713 430038 432507 434747 436937 439963 444538 450427 456958 464089 472316 481448
52084 481448 490261 497897 505122 513531 523727 534964 546536 558657 571699 585233 598437 611187
52072 611187 624139 637814 652072 666517 680985 695425 709646 723477 736985 750249 763023
52061 763023 774925 785912 796293 806214 815351 823147 829160 833224 835652 837318 839067 840751 841238 839802
52047 839802 837098 834217 831093 826684 820745 814520 809193 804239 797936 789286 778941 768396 758745 750190
52033 750190 742290 734444 726300 717945 709842 702645 696954 692959 690210 687996 686078 684880 684814 685684 687047
52018 687047 688917 691708 695500 699719 703707 707439 711531 716587 722607 729004 735175 740994 746717 752526
52004 752526 758332 763964 769211 773649 776753 778373 778806 778200 776169 772317 766884 760463 753139 744370 733722
51989 733722 721354 707653 692703 676335 658498 639377 619298 598744 578372 558648 539328
51978 539328 519535 498653 477126 456174 436642 418437 401147 384821 369777 355921 342765
51967 342765 330076 317948 306225 294367 282166 270193 259243 249650 241356 234337 228636 224177
51955 224177 220780 218146 215637 212449 208343 203982 200252 197415 195193 193361 191884 190702 189803 189304 189057
51940 189057 188423 186945 185105 183831 183290 182726 181550 180005 178566 177130 175198 172587 169636 166809 164269
51925 164269 161878 159535 157481 156113 155363 154506 152837 150441 147984 145851 143894 141905 139907 137887 135728
51910 135728 133581 131947 131160 131006 131029 130981 130752 130152 129058 127669 126385 125407 124596 123661 122434 120995 119587
51893 119587 118442 117662 117285 117307 117576 117749 117575 117118 116563 115908 115050 114074 113111 112055 110779 109611 109105 109256
51875 109256 109402 109130 108850 109157 109981 110786 111350 111902 112567 113233 113994 115251 117072 118738 119324 118684 117636
51858 117636 117174 117636 118646 119550 119844 119375 118415 117510 117070 117090 117351 117713 118027 117888 116913 115338 113978 113443
51840 113443 113642 114193 114948 115797 116309 116010 114955 113706 112757 112194 111850 111576 111360 111341 111613 111882 111559 110433
51822 110433 109149 108671 109285 110328 110880 110568 109759 109193 109354 110069 110727 110923 110736 110409 110094 109988 110259 110676
51804 110676 110854 111200 112895 116303 119945 121966 122322 122651 124166 126627 129365 132234 135271 138316 141396
51789 141396 144859 148733 152520 155922 159182 162479 165616 168624 171843 174911 176419 175321 172169 168273
51775 168273 164197 159907 155896 153019 151248 149597 147522 145592 144436 143765 142945 142026 141547 141490 141094 139862
51759 139862 138399 137894 138834 140445 141499 141497 140925 140510 140553 141006 141860 143208 145044 147182 149330 151240 152882
51742 152882 154545 156579 158986 161360 163242 164416 164910 165001 165201 165860 166663 166873 166267 165518 165441 166107 166963
51725 166963 167473 167375 166560 165123 163461 161993 160882 160229 160308 161246 162563 163509 163905 164351 165433 166997 168340
51708 168340 169012 169204 169356 169512 169209 168087 166417 164858 163754 162941 162241 161757 161540 161267 160586 159655 159106
51691 159106 159517 161050 163445 166181 168694 170732 172596 175009 178631 183465 188494 192057 192955 191369 188510
51676 188510 185395 182272 179156 176298 173851 171538 169130 166921 165270 163888 162116 159885 157928 156891
51662 156891 156569 156186 155220 153828 152552 151719 151112 150203 148659 146589 144370 142332 140527 138650 136307 133639
51646 133639 131542 130819 131097 131108 130191 128988 128353 128182 127811 127126 126583 126271 125690 124531 123204 122367 122223 122425
51628 122425 122488 122181 121638 121148 120823 120581 120477 120804 121655 122536 122725 121983 120727 119532 118683 118157 117872 117844 118153
51609 118153 118725 119173 119005 118056 116664 115410 114726 114675 114921 115038 115081 115705 117388 119723 121930 123861 125868
51592 125868 127739 128655 128405 127859 127895 128519 129371 130366 131321 131758 131652 131730 132363 132823 132364 131376 130651 130160 129547
51573 129547 129255 129995 131430 132615 133502 134852 136681 138090 138748 139366 140371 141181 141218 140741 140254 139903 139845
51556 139845 140390 141250 141430 140431 138978 138030 137585 137013 136093 135176 134702 134992 136187 137908 139259 139559 138915
51539 138915 137861 136818 136109 136121 136930 137993 138506 137989 136521 134700 133407 133165 133618 133988 134074 134262 134560
51522 134560 134391 133546 132634 132224 132183 132228 132438 132690 132285 130752 128587 126664 125376 124853 125378 126914 128657
51505 128657 129814 130486 131184 131866 132193 132396 133075 134358 135930 137705 139758 141797 143468 145005 146812 148470
51489 148470 148989 148171 147009 146602 147240 148588 150155 151546 152823 154698 157796 161710 165399 168519 171661
51474 171661 175187 178658 181609 184122 186323 188008 189201 190374 191694 192598 192606 192077 191673 191585 191732 192179 192762
51457 192762 192734 191508 189441 187253 184991 182283 179323 176790 174877 173279 172101 171884 172515 172990 172689 172181
51441 172181 172226 172594 172557 172116 171962 172347 172683 172285 171037 169249 167378 165957 165285 164978 164180 162491 160440
51424 160440 158794 157708 156736 155397 153469 151001 148426 146451 145368 144553 143065 140751 138345 136419 134723
51409 134723 132761 130611 128775 127462 126459 125679 125379 125659 126041 125920 125332 124923 125023 125059 124254 122747 121510
51392 121510 121057 120743 119685 117926 116182 114755 113321 111742 110396 109573 109073 108583 107978 107059 105547 103675
51376 103675 102303 102045 102558 103087 103374 103642 103962 104125 104001 103563 102716 101511 100424 100017 100403 101383 102920
51359 102920 104964 106925 107961 107940 107609 107618 107830 107801 107483 107115 106722 106169 105513 104933 104348 103455 102233 101166
51341 101166 100787 101104 101641 102014 102256 102467 102375 101603 100339 99301 98877 98665 98206 97741 97730 97895 97434 96187
51323 96187 94893 94114 93554 92758 91924 91494 91330 90876 89971 89007 88330 87937 87735 87693 87621 87237 86551 85980 85885 86221
51303 86221 86672 86968 86983 86720 86370 86184 86152 85990 85568 85207 85319 85867 86408 86633 86629 86613 86662 86757 86939 87270 87748
51282 87748 88347 89004 89473 89313 88262 86611 85080 84236 84070 84150 84110 83976 84050 84515 85196 85725 85908 85815 85521
51263 85521 84973 84246 83761 83976 84927 86228 87500 88595 89427 89926 90204 90539 91076 91767 92733 94341 96657
51246 96657 99031 100589 101134 101233 101383 101394 100782 99481 97966 96810 96392 96918 98317 99982 101002 101012 100661
51229 100661 100889 101812 102746 103281 103787 104673 105686 106401 106975 107838 108839 109378 109283 108978 108717 108301 107748 107631
51211 107631 108327 109339 109769 109241 108134 107187 107104 108152 109727 110641 110274 109318 109030 109920 111525 113163 114344
51194 114344 114588 113569 111654 109828 108767 108233 107593 106630 105590 104646 103721 102821 102197 101969 101759 100976 99547
51177 99547 98119 97361 97197 97006 96483 95945 95747 95804 95847 95804 95651 95205 94455 93903 94132 95069 95988 96267 95959 95622
51157 95622 95723 96202 96498 96128 95306 94807 95085 95713 95882 95190 93764 91940 90261 89485 89968 91051 91552 91037
51139 91037 90249 90145 90827 91537 91499 90578 89299 88355 88085 88364 88924 89605 90278 90801 91199 91635 92011 91898 91169
51120 91169 90434 90464 91406 92913 94714 96606 98175 99189 100128 101666 103676 105350 106270 106676 106652 105876 104506
51103 104506 103511 103651 104644 105830 107184 109091 111432 113521 114917 115819 116621 117329 117569 117084 116176 115614 115946
51086 115946 117007 118231 119294 120093 120312 119641 118504 117895 118197 118709 118702 118427 118577 119209 119810 120165 120501 120812
51068 120812 120664 119786 118526 117530 117128 117105 116962 116401 115623 115084 114973 115165 115654 116638 117930 118712 118351 117268
51050 117268 116570 116857 117780 118739 119635 120824 122561 124584 126185 126755 126312 125463 124757 124259 123886 123858 124514 125782
51032 125782 127179 128405 129684 131479 133947 136708 139061 140525 141283 142082 143637 146097 149002 151599 153320
51017 153320 154220 155008 156375 158303 160310 162336 164857 168010 171161 173667 175646 177616 179805 182291 185436
51002 185436 189643 194864 200763 207208 214158 221292 228216 234933 241738 248823 256406 264973 274867 285789
50988 285789 297276 309564 323378 339009 356307 375600 397834 423482 451874 482011 513690
50977 513690 547564 584368 624309 666940 711380 756784 802732 849079 895511 941443 986167
50966 986167 1028761 1067986 1102752 1132645 1157574 1177083 1190650 1198580 1201842 1200876 1195340 1185321
50954 1185321 1171997 1156729 1140246 1123260 1107111 1092938 1080627 1069309 1058548 1048279 1037911
50943 1037911 1026477 1013663 999837 984976 968336 949404 928418 905551 880206 851732 820460
50932 820460 787570 754090 720443 686806 653491 620995 589995 561225 535018 510962 488364
50921 488364 467090 447696 430640 415758 402704 391543 382473 375172 368945 363565 359436 356735 354797
50908 354797 352714 350320 348159 346684 345860 345550 345865 347041 349186 352139 355392 358192 360058 361236 362401
50893 362401 363992 366156 369193 373440 378558 383482 387458 390824 394530 399224 405115 412322 420803 430126
50879 430126 439821 450000 461305 474192 488554 504125 521066 540090 562009 587086 614883 644977
50867 644977 677853 714799 756824 804159 857082 916683 984107 1059208 1140575 1226920 1317933
50856 1317933 1413765 1514221 1618613 1725918 1834690 1943011 2048697 2149375 2242275 2324275
50846 2324275 2392497 2444998 2481047 2500993 2505914 2497237 2476548 2445752 2407219 2363560 2317369 2271308
50834 2271308 2228065 2189679 2156914 2129669 2107805 2090951 2077551 2064934 2050682 2033446 2012185
50823 2012185 1985280 1950993 1908451 1857759 1799486 1734561 1664310 1589993 1512380 1432253 1351182
50812 1351182 1271324 1194510 1121895 1054307 992358 936268 886120 842296 805063 773649 746368
50801 746368 722047 700977 684193 672138 664305 659817 657983 658453 661170 666112 672875 680674 688879
50788 688879 697371 706159 714801 722516 728784 733587 737122 739526 740885 741277 740696 739054 736290 732403 727340
50773 727340 720951 713117 703948 693795 682989 671547 659316 646580 634307 623450 614083 605649
50761 605649 598175 592697 590275 590955 594087 599272 606522 615818 627134 640878 657759 678144 701956
50748 701956 729232 760313 795451 834661 878166 926526 980124 1038815 1102323 1170500 1242855
50737 1242855 1318078 1394421 1470321 1544361 1614845 1679831 1737439 1785755 1822619 1846043 1855047
50726 1855047 1849908 1831732 1802182 1763624 1719008 1671289 1623076 1576772 1534495 1497470 1465732
50715 1465732 1438809 1416584 1399195 1386116 1375720 1365916 1355135 1342602 1327747 1309530 1286488
50704 1286488 1257535 1222712 1183086 1139950 1094316 1047172 999911 954158 911152 871448 835144
50693 835144 802188 772509 746185 723597 705208 691008 680301 672260 666697 664149 665284 670333
50681 670333 679056 691076 706175 724410 745976 770892 798730 828745 860241 892694 925437 957392
50669 957392 987339 1014420 1038321 1058943 1076103 1089588 1099453 1106183 1110494 1112833 1112997 1110402 1104999
50656 1104999 1097892 1090728 1084395 1078582 1072797 1067438 1063488 1061379 1060797 1061723 1065114 1072118 1082842 1096298
50642 1096298 1111439 1127893 1145641 1164415 1183610 1202573 1220727 1237526 1252560 1265709 1277048
50631 1277048 1286580 1294200 1300032 1304686 1309002 1313485 1318085 1322714 1327931 1334874 1344276 1355629 1367502
50618 1367502 1378591 1388148 1395414 1399229 1398643 1393695 1385210 1373938 1360258 1344551 1327358 1309112 1290168
50605 1290168 1271156 1252744 1234783 1216185 1195992 1174209 1151100 1126094 1098035 1066399 1031723
50594 1031723 994970 957128 919475 883429 849723 818105 788162 760061 734189 710501 688705
50583 688705 668850 651252 636004 622983 612201 603671 596982 591577 587548 585718 586656 589989 594894
50570 594894 600946 608190 616667 626301 637189 649635 663889 680147 698770 720181 744391 770853
50558 770853 798854 827889 857576 887508 917382 947026 976110 1004004 1030296 1055303 1079823
50547 1079823 1104414 1129266 1154663 1181059 1208549 1236673 1265069 1294099 1324594 1357142 1391850
50536 1391850 1428600 1467280 1507830 1550323 1594968 1641922 1691185 1742713 1796284 1851093 1905735
50525 1905735 1958864 2009606 2057079 2099942 2136910 2167425 2191193 2207216 2214025 2210888 2198227 2176745
50513 2176745 2146799 2108803 2063619 2012275 1955875 1896141 1835527 1776285 1719780 1666913 1618723
50502 1618723 1576060 1539021 1507215 1480290 1457869 1439324 1424214 1412652 1404762 1400052 1397908 1398430
50490 1398430 1402151 1409063 1418515 1429817 1442068 1453330 1460770 1461902 1455239 1439776 1414770 1380477
50478 1380477 1338497 1290884 1239251 1184992 1129778 1075173 1022047 970808 922077 876687 835242
50467 835242 798046 765227 736484 710890 687501 666194 647438 631301 617202 604815 594614
50456 594614 587142 582065 578464 576002 575319 577079 580935 585734 590697 596094 602681 610704 619785 629677
50442 629677 640829 653986 669388 686602 705084 724684 745526 767565 790532 814329 839302
50431 839302 865898 894116 923529 953967 985943 1020108 1056312 1093519 1130767 1168076 1206244
50420 1206244 1245849 1286702 1328272 1370415 1413396 1457177 1500925 1543412 1583764 1621530 1656120
50409 1656120 1686635 1712446 1733522 1749810 1760495 1764336 1760698 1749872 1732403 1708489 1678128 1641406
50397 1641406 1598408 1549190 1494269 1435116 1373869 1312468 1252105 1193423 1136990 1083482 1033508
50386 1033508 987481 945736 908637 876366 848696 825242 805969 791181 780887 774589 771913 773064
50374 773064 778191 786574 796964 808494 820645 832450 842503 849870 854313 855394 852066 843583 830324
50361 830324 813330 793475 771530 748537 725426 702427 679410 656692 635094 615348 597766
50350 597766 582285 568379 555169 542196 530068 519844 511849 505579 500671 497289 495448 494664 494551
50337 494551 495309 497193 499910 502842 505636 508192 510377 512158 513965 516597 520742 526662 534138 542537
50323 542537 551059 559274 567414 576020 585356 595297 605629 616238 627041 637984 649107 660504 672179
50310 672179 684078 696209 708618 721258 733910 746157 757439 767363 776173 784649 793246 801435
50298 801435 808303 813660 818061 821722 824000 824157 822137 818092 811618 802083 789622 775204 759670 743164
50284 743164 725626 707402 689161 671496 654839 639443 625234 611815 598850 586254 573953
50273 573953 561769 549822 538799 529424 521681 514887 508436 502271 496583 491338 486200 480832 475193
50260 475193 469567 464258 459281 454540 450343 447343 445702 444614 443061 440923 438884 437414 436368 435664
50246 435664 435731 436980 439232 442017 445219 449056 453494 457970 461797 464744 467185 469736 472754 476184 479816
50231 479816 483492 487048 490376 493717 497562 501843 505458 507196 507107 506427 506096 505962 505527 504822 504118 503352
50215 503352 502306 501037 499631 497907 495853 494099 493401 493736 494511 495596 497566 500712 504397 507790 511026
50200 511026 515192 521128 528477 536055 543016 549470 555931 562430 568381 573132 576308 577623 576853 574214
50186 574214 570506 566632 563069 559861 556868 553927 551032 548482 546532 544814 542556 539645 537017 535600
50172 535600 535232 535133 535083 535454 536203 536499 535521 533232 530262 527305 524641 521985 518828 515221 512044 510164
50156 510164 509382 508722 507698 506800 506631 507099 507736 508393 509305 510585 511925 512735 512604 511750 510996 511019 511693 512412
50138 512412 512950 513541 514083 513889 512591 510819 509554 509016 508626 507981 507436 507664 508864 510524 511872 512587 513146
50121 513146 514479 517215 521278 526222 531851 538444 546465 556261 568048 582036 598385 617016 637648
50108 637648 660204 685139 713204 744895 780348 819669 862960 909782 958934 1009049 1059180
50097 1059180 1108551 1156031 1200295 1240387 1275823 1306433 1332593 1355503 1376622 1396730 1415786
50086 1415786 1433468 1449210 1461648 1468698 1468510 1460135 1443301 1418134 1385336 1346217 1302316 1255219
50074 1255219 1206753 1158728 1112199 1067380 1024558 984669 948717 917038 889417 865513 844798
50063 844798 826571 810482 796800 785749 776886 769443 762921 756892 750660 743757 736572 729857 723762
50050 723762 717925 712306 707235 702692 698319 694263 691302 689843 689361 689152 689204 689950 691572 693905 696748
50035 696748 699882 703029 706156 709647 713830 718492 723148 727634 732014 735995 738869 740154 739980 738805
50021 738805 737124 735499 734491 734213 734208 734090 734144 734927 736409 738000 739510 741601 744975 749456 754361 759626
50005 759626 766055 774337 784287 795362 807597 821624 837838 856019 875975 898184 923498 952267
49993 952267 984095 1018556 1055917 1097041 1142778 1193653 1249937 1311676 1378560 1449934 1524865
49982 1524865 1601917 1678912 1753393 1823604 1888839 1948784 2002989 2051331 2094703 2134732 2172782
49971 2172782 2209293 2243638 2274064 2297929 2312511 2315795 2306436 2283448 2246637 2197289 2137757 2070128
49959 2070128 1995667 1915568 1831622 1745853 1659892 1575014 1492410 1413057 1337522 1266121 1199147
49948 1199147 1136858 1079445 1027099 979903 937605 899787 866173 836453 809830 785344 762728
49937 762728 742445 724752 709243 695446 683141 671873 660944 650380 641166 633857 627529 620858
49925 620858 613717 606871 600460 593753 586212 577893 568896 559356 549983 541667 534276 526642 518062 509155
49911 509155 500904 493517 486676 480408 475109 470975 467806 465309 463327 461836 460809 459940 458614 456531
49897 456531 454380 453393 454038 455598 457260 459059 461426 464274 467151 469998 473162 476720 480352 483975 488035
49882 488035 492973 498734 505063 512104 520364 530033 540615 551533 563110 576659 593380 613364 635965
49869 635965 661069 689571 722473 759880 801105 845574 893334 944662 999204 1055348 1110522
49858 1110522 1162364 1209788 1252791 1291336 1324823 1352842 1376085 1396089 1414209 1430976 1446150
49847 1446150 1458877 1467744 1470943 1466557 1452754 1428038 1391808 1344835 1289086 1227115 1161658 1095488
49835 1095488 1031061 970012 913064 860490 812526 769319 730748 696495 666160 639231 615178
49824 615178 593813 575444 560338 547996 537196 526938 517226 508801 502150 496898 492118 487129 482071
49811 482071 477772 474951 473382 471858 469233 465522 461772 458841 456590 454434 452306 450680 449711 448705
49797 448705 446569 442682 437362 431671 426748 423117 420533 418473 416642 414939 413184 411193 409074 407110
49783 407110 405384 403804 402501 401816 401722 401565 400627 398853 396849 395307 394580 394627 395135 395687 395940 395764 395303
49766 395303 394970 395269 396363 397746 398544 398280 397251 396143 395460 395377 395839 396581 397230 397619 397908 398247 398480 398415
49748 398415 398281 398551 399324 400208 400889 401529 402435 403520 404339 404597 404385 403968 403571 403433 403807 404689 405632 406099
49730 406099 406045 405940 406166 406577 406831 406942 407234 407751 408011 407456 406054 404317 402773 401533 400433 399508 399140
49713 399140 399566 400393 400889 400816 400739 401335 402613 403966 404814 404951 404503 403910 403866 404887 406900 409425 412093 414724
49695 414724 417027 418711 419902 421029 422212 423147 423795 424753 426635 429315 432050 434143 435320 435736 435982
49680 435982 436904 439079 442437 446519 450976 455609 460112 464177 467846 471500 475378 479359 483251 487093
49666 487093 491042 495087 499054 502923 507005 511723 517282 523595 530480 537680 544564 550101 553589 555492
49652 555492 557240 560042 564089 568924 574191 579693 585057 589911 594412 599177 604500 609880 614578 618474
49638 618474 622184 626384 631252 636529 641828 646753 651015 654750 658664 663398 668676 673415 676946 679828
49624 679828 683114 687112 691305 695348 699554 704266 709215 713754 717517 720741 724146 728511 734066 740173
49610 740173 745889 750972 756123 762150 769247 777222 786036 795778 806322 817312 828447 839590 850709
49597 850709 861825 872975 884220 895804 908216 921746 936011 950266 964215 978110 992037
49586 992037 1005767 1019434 1033712 1048907 1064515 1080142 1096334 1113817 1132341 1151034 1169618
49575 1169618 1188573 1208240 1228472 1249101 1270103 1291315 1312577 1334077 1356030 1378040 1399489
49564 1399489 1420469 1441635 1463041 1483932 1503919 1523617 1543716 1564053 1584030 1603478 1622594
49553 1622594 1641417 1659869 1678060 1696130 1713916 1731071 1747387 1762836 1777528 1791807 1806058
49542 1806058 1820148 1833401 1845346 1856234 1866520 1876229 1885189 1893620 1902030 1910663 1919382 1927944 1936123
49529 1936123 1943844 1951524 1960008 1969702 1980004 1990002 1999517 2008948 2018322 2027268 2035894 2044930 2054759 2064905
49515 2064905 2074813 2084564 2094448 2104195 2113106 2120688 2126798 2131332 2134227 2135695 2136137 2135769 2134564 2132498
49501 2132498 2129582 2125681 2120508 2113930 2106182 2097761 2089177 2080700 2072168 2063079 2053050 2042206 2030946
49488 2030946 2019357 2007070 1993785 1979729 1965431 1951151 1936709 1921886 1906778 1891650 1876521
49477 1876521 1861073 1845085 1828846 1812972 1797715 1782623 1767012 1750747 1734376 1718554 1703559
49466 1703559 1689406 1676179 1664016 1652883 1642501 1632474 1622441 1612245 1602082 1592401 1583472 1575135
49454 1575135 1567151 1559623 1552825 1546626 1540498 1534168 1528018 1522682 1518439 1515104 1512298 1509653 1507009 1504693
49440 1504693 1503533 1504268 1506816 1510093 1512473 1512560 1509869 1505029 1499199 1493140 1487005 1481040 1475969 1472294 1469587
49425 1469587 1467147 1465260 1465027 1466837 1469676 1472309 1474591 1477140 1480171 1483343 1486613 1490526 1495547 1501524
49411 1501524 1508030 1514861 1522028 1529517 1537311 1545458 1553915 1562469 1571043 1579924 1589480 1599649 1609984
49398 1609984 1620140 1630009 1639388 1647887 1655343 1662066 1668392 1674263 1679590 1684763 1690243 1695658 1699937 1702582
49384 1702582 1704348 1706354 1708945 1711878 1715227 1719385 1724283 1729251 1733841 1738287 1743030 1748251 1754138 1761113
49370 1761113 1769348 1778357 1787466 1796553 1805942 1815681 1825424 1835102 1845326 1856902 1870091 1884482 1899478
49357 1899478 1914813 1930731 1947796 1966440 1986547 2007408 2028205 2048621 2069005 2089935 2111713
49346 2111713 2134315 2157748 2182226 2207878 2234435 2261436 2288709 2316431 2344658 2373029 2401136
49335 2401136 2429181 2458037 2488541 2520665 2553435 2585764 2617362 2648714 2680153 2711223 2741197
49324 2741197 2770041 2798528 2827358 2856446 2885048 2912324 2937720 2961212 2983403 3005146 3026859
49313 3026859 3048301 3069007 3088668 3107004 3123733 3138985 3153428 3167577 3181224 3193855 3205387
49302 3205387 3216020 3225659 3234067 3241511 3248580 3255315 3261167 3266055 3270812 3276209 3282020 3287599 3293004 3298959
49288 3298959 3305805 3313067 3320101 3326775 3333376 3340215 3347413 3354871 3362240 3369031 3374898 3379810 3383909 3387231
49274 3387231 3389521 3390309 3389334 3386967 3383985 3380630 3375991 3368715 3358324 3345485 3330921 3314556 3295957
49261 3295957 3275287 3253356 3230858 3207949 3184556 3160724 3136515 3111754 3086046 3058995 3030441
49250 3030441 3000648 2970362 2940541 2911848 2884314 2857392 2830325 2802578 2774115 2745288 2716436
49239 2716436 2687680 2659211 2631597 2605454 2580805 2557076 2533781 2510945 2488738 2467029 2445560
49228 2445560 2424380 2403855 2384374 2366224 2349482 2333736 2318153 2302291 2286753 2272574 2259887
49217 2259887 2247662 2234859 2221401 2207870 2194798 2182670 2172044 2162951 2154345 2144889 2134441 2124164
49205 2124164 2114923 2106048 2096060 2084284 2071410 2058743 2047329 2037623 2029379 2021690 2013482 2004307 1994605
49192 1994605 1985125 1976205 1967646 1959104 1950521 1942215 1934621 1927816 1921347 1914691 1907825 1901071 1894422 1887416
49178 1887416 1879855 1872285 1865476 1859694 1854790 1850669 1847258 1844183 1841046 1837989 1835558 1833996 1833085 1832631
49164 1832631 1832587 1832661 1832444 1832202 1832955 1835341 1838823 1842438 1846072 1850494 1856421 1863998 1873023 1883196 1894219
49149 1894219 1906105 1919299 1934032 1949558 1964473 1977825 1989561 1999966 2009209 2017568 2025567 2033524
49137 2033524 2041263 2048548 2055593 2062921 2070831 2079157 2087403 2094972 2101418 2106618 2110612 2113301 2114522 2114435
49123 2114435 2113482 2111843 2109282 2105713 2101568 2097245 2092498 2086785 2080055 2072697 2064799 2056011 2046345 2036627
49109 2036627 2027791 2019861 2011982 2003429 1994335 1985447 1977452 1970657 1965107 1960732 1957417 1955130 1953964 1953869
49095 1953869 1954374 1954915 1955604 1957392 1961226 1967185 1974633 1982972 1991928 2001303 2010927 2020794 2030833 2040562
49081 2040562 2049425 2057551 2065728 2074486 2083621 2092778 2101941 2110968 2119029 2125093 2128924 2131301 2133329 2135671
49067 2135671 2138235 2140362 2141399 2141298 2140479 2139035 2136463 2132446 2127392 2121740 2115103 2106750 2096686 2085535
49053 2085535 2073437 2059871 2044674 2028467 2011773 1994339 1975744 1956141 1935977 1915419 1894552
49042 1894552 1873752 1853234 1832577 1811376 1790268 1770625 1753114 1737155 1721898 1707183 1693335
49031 1693335 1680561 1668966 1658733 1649838 1641852 1634457 1627995 1623043 1619657 1617482 1616474 1616927 1618782
49018 1618782 1621512 1624862 1629127 1634465 1640455 1646752 1653712 1661862 1671005 1680384 1689495 1698283 1706730 1714852
49004 1714852 1722997 1731585 1740511 1749338 1758013 1766853 1775795 1784360 1792511 1800857 1809605 1817992 1825267 1831799
48990 1831799 1838619 1846143 1853932 1861521 1868890 1876163 1883393 1890786 1898805 1907920 1918318 1929803 1941765
48977 1941765 1953396 1964203 1974333 1984311 1994511 2004920 2015146 2024497 2032421 2039085 2045256 2051285
48965 2051285 2056521 2060079 2061861 2062381 2061988 2060845 2059423 2058235 2057135 2055536 2053285 2050665 2047499 2043143
48951 2043143 2037535 2031581 2026152 2021339 2017051 2013654 2011449 2010058 2008952 2008293 2008653 2010143 2012433 2015475
48937 2015475 2019637 2025147 2031944 2040136 2050111 2062038 2075602 2090348 2106014 2122404 2139217 2156169
48925 2156169 2173183 2190283 2207469 2224768 2242373 2260618 2279842 2300283 2322034 2345030 2369008
48914 2369008 2393505 2418020 2442352 2466798 2491852 2517675 2544032 2570724 2597829 2625421 2653342
48903 2653342 2681501 2710168 2739769 2770564 2802823 2837020 2873431 2911535 2950256 2988922 3027749
48892 3027749 3067373 3108175 3150106 3192804 3235711 3278381 3320970 3364184 3408453 3453219 3497399
48881 3497399 3540535 3583117 3625623 3667558 3707754 3745482 3780886 3814278 3845438 3873868 3899482
48870 3899482 3922690 3943855 3963040 3980285 3995765 4009504 4021151 4030197 4036240 4039024 4038461 4034754
48858 4034754 4028183 4018610 4005505 3988773 3969300 3948307 3926304 3902993 3877930 3850840 3821466 3789745
48846 3789745 3756220 3721754 3686679 3650671 3613571 3575832 3537897 3499645 3460883 3422061 3384004
48835 3384004 3347181 3311636 3277425 3244639 3213119 3182739 3153973 3127662 3104075 3082655 3062845
48824 3062845 3044791 3029012 3015772 3005096 2997128 2992079 2989897 2990290 2993032 2998111 3005644 3015812 3028729
48811 3028729 3044164 3061484 3080051 3099581 3120056 3141566 3164518 3189733 3217737 3247936 3278896
48800 3278896 3309622 3340238 3371324 3402961 3434673 3465998 3496825 3527308 3557686 3588087 3618290
48789 3618290 3647816 3676470 3704694 3733150 3761975 3790631 3818540 3845696 3872603 3899661 3926706
48778 3926706 3953217 3979056 4004884 4031620 4059503 4087941 4116369 4144874 4173804 4203153 4232715
48767 4232715 4262622 4293246 4324575 4356068 4387151 4417534 4447016 4475330 4502303 4527903 4552002
48756 4552002 4574350 4594869 4613719 4630895 4645980 4658488 4668353 4675874 4681284 4684510 4685363 4683856 4680279
48743 4680279 4675005 4668191 4659626 4648822 4635298 4618930 4600175 4579829 4558249 4534790 4508466 4479383
48731 4479383 4449112 4419248 4389952 4360477 4330808 4301954 4274625 4248527 4223290 4199322 4177141
48720 4177141 4156323 4135804 4115106 4094735 4075449 4057621 4041350 4026807 4014206 4003519 3994206
48709 3994206 3985242 3975661 3965241 3954463 3943664 3932500 3920559 3908187 3896185 3884835 3873686 3862315
48697 3862315 3850778 3839203 3827473 3815649 3804330 3794116 3784719 3774939 3763653 3750763 3737195 3724081
48685 3724081 3711966 3700726 3690037 3679762 3669910 3660486 3651580 3643478 3636377 3629981 3623645 3616992 3610267
48672 3610267 3603985 3598405 3593386 3588554 3583484 3577957 3572235 3567016 3562886 3559817 3557375 3555347 3553882 3552910
48658 3552910 3551678 3549090 3544453 3537742 3529272 3519362 3508326 3496526 3484302 3471910 3459533 3447209
48646 3447209 3434762 3422040 3409229 3396663 3384243 3371450 3358116 3344809 3332049 3319464 3306183
48635 3306183 3291811 3276427 3259802 3241424 3221397 3200618 3179779 3158695 3136973 3114810 3092794
48624 3092794 3071329 3050684 3031161 3012787 2995184 2978277 2962797 2949529 2938231 2927853 2917634
48613 2917634 2907506 2897616 2888115 2879357 2871652 2864741 2858045 2851560 2845926 2841520 2838049 2835259 2833492 2833205
48599 2833205 2834400 2836887 2840669 2845604 2851138 2856956 2863706 2872380 2882883 2893783 2903752 2913000 2922996
48586 2922996 2934820 2948049 2961299 2973719 2985762 2998449 3012151 3026327 3040394 3054432 3068891
48575 3068891 3083901 3099150 3114305 3129319 3144344 3159556 3175081 3191002 3207484 3224943 3243874
48564 3243874 3264328 3285663 3307046 3328220 3349626 3371749 3394580 3417733 3440914 3464095 3487327
48553 3487327 3510546 3533584 3556284 3578592 3600627 3622630 3644768 3666888 3688599 3709697 3730410
48542 3730410 3750987 3771076 3789813 3806750 3822507 3838208 3854285 3870003 3884173 3896137 3906124
48531 3906124 3914865 3922960 3930458 3936931 3941930 3945371 3947428 3948243 3947912 3946632 3944487 3941075 3935694 3928113
$$ [...]
##END NTUPLES=NMR SPECTRUM
##END=
