##TITLE=NES1016_872015062_9265836_VDkpNgDeP0
##JCAMPDX= 6.0         $$ Bruker NMR JCAMP-DX V2.0
##DATA TYPE= NMR SPECTRUM
##DATA CLASS= NTUPLES
##ORIGIN= BRUKER
##OWNER= Administrator
$$ 1.72 TOPSPIN		Version 2.1
$$ 2015-07-09 15:01:06.566 -0700  Administrator@X
$$ Compression mode = diff/dup
##.OBSERVE FREQUENCY= 400.02188249412
##.OBSERVE NUCLEUS= ^1H
##.ACQUISITION MODE= SIMULTANEOUS (DQD)
##.ACQUISITION SCHEME= undefined
##.AVERAGES= 8
##.DIGITISER RES= 22
##SPECTROMETER/DATA SYSTEM= spect
##.PULSE SEQUENCE= zg30
##.SOLVENT NAME= COFFEE_meoh
##.SHIFT REFERENCE= INTERNAL, COFFEE_meoh, 1, 14.98509
##AUDIT TRAIL= $$ (NUMBER, WHEN, WHO, WHERE, PROCESS, VERSION, WHAT)
$$ ##TITLE= Audit trail, TOPSPIN		Version 2.1
$$ ##JCAMPDX= 5.01
$$ ##ORIGIN= Bruker BioSpin GmbH
$$ ##OWNER= Administrator
$$ $$ E:\/data/COFFEE/nmr/NES1016_872015062_9265836_VDkpNgDeP0/10/pdata/1/auditp.txt
$$ ##AUDIT TRAIL=  $$ (NUMBER, WHEN, WHO, WHERE, PROCESS, VERSION, WHAT)
(   1,<2015-07-09 15:00:59.331 -0700>,<Administrator>,<X>,<go>,<TOPSPIN 2.1>,
      <created by zg
	started at 2015-07-09 14:59:52.613 -0700,
	POWCHK enabled, PULCHK disabled,
       configuration hash MD5:
       21 0F 79 D6 B3 7B B4 F6 88 20 88 DB 03 48 BD 9F
       data hash MD5: 64K
       9C 35 25 CB BF 7E 59 78 25 C0 F3 C3 3B 23 1C A9>)
(   2,<2015-07-09 15:01:02.456 -0700>,<Administrator>,<X>,<proc1d>,<TOPSPIN 2.1>,
      <Start of raw data processing
       efp LB = 0 FT_mod = 6 PKNL = 1 PHC0 = 0 PHC1 = 0 SI = 32K 
       data hash MD5: 32K
       29 75 29 25 59 D5 C2 29 18 BC FF 1C 90 61 0C B2>)
(   3,<2015-07-09 15:01:02.738 -0700>,<Administrator>,<X>,<proc1d>,<TOPSPIN 2.1>,
      <pk PHC0 = 88.23669 PHC1 = 0 
       data hash MD5: 32K
       A2 5B 3E 8E C8 CB 11 00 17 56 AB 98 57 7A 74 17>)
(   4,<2015-07-09 15:01:02.847 -0700>,<Administrator>,<X>,<proc1d>,<TOPSPIN 2.1>,
      <abs ABSG = 1 
       data hash MD5: 32K
       AC CA D6 31 D0 49 42 44 52 85 EE CE 56 91 4B 52>)
(   5,<2015-07-09 15:01:02.910 -0700>,<Administrator>,<X>,<proc1d>,<TOPSPIN 2.1>,
      <abs ABSG = 2 
       data hash MD5: 32K
       38 5A AA 66 35 7C B9 F8 6F D5 D5 E9 95 35 F4 1D>)
(   6,<2015-07-09 15:01:02.972 -0700>,<Administrator>,<X>,<proc1d>,<TOPSPIN 2.1>,
      <abs ABSG = 3 
       data hash MD5: 32K
       EB C2 61 51 48 6D C2 15 E3 7D 8C B0 95 E9 0B A0>)
(   7,<2015-07-09 15:01:03.019 -0700>,<Administrator>,<X>,<proc1d>,<TOPSPIN 2.1>,
      <abs ABSG = 4 
       data hash MD5: 32K
       68 2C 0E A7 39 1A 91 CA D2 25 1B 29 B5 C8 C2 FE>)
(   8,<2015-07-09 15:01:03.081 -0700>,<Administrator>,<X>,<proc1d>,<TOPSPIN 2.1>,
      <abs ABSG = 5 
       data hash MD5: 32K
       44 34 22 18 C5 4E 8A FC 9D 9F 1F A8 53 C6 C2 40>)
$$ ##END=
$$ 
$$ $$ hash MD5
$$ $$ D1 D5 FD E7 CF 10 BD A5 56 E6 9A 23 6E 05 DF 0E
##$RELAX= 
##$RELAX= 
##$RELAX= 
##$RELAX= 
##$RELAX= 
##$RELAX= 
##$RELAX= 
$$ Bruker specific parameters
$$ --------------------------
##$DU= <E:\>
##$EXPNO= 10
##$NAME= <NES1016_872015062_9265836_VDkpNgDeP0>
$$ [...]
150 150 150 150 150 150 150 150
##$TP07= 0
##$TPNAME0= <>
##$TPNAME1= <>
##$TPNAME2= <>
##$TPNAME3= <>
##$TPNAME4= <>
##$TPNAME5= <>
##$TPNAME6= <>
##$TPNAME7= <>
##$TPOAL= (0..7)
0.5 0.5 0.5 0.5 0.5 0.5 0.5 0.5
##$TPOFFS= (0..7)
0 0 0 0 0 0 0 0
##$TUNHIN= 0
##$TUNHOUT= 0
##$TUNXOUT= 0
##$USERA1= <user>
##$USERA2= <user>
##$USERA3= <user>
##$USERA4= <user>
##$USERA5= <user>
##$V9= 5
##$VALIST= <valist>
##$VCLIST= <CCCCCCCCCCCCCCC>
##$VD= 0
##$VDLIST= <DDDDDDDDDDDDDDD>
##$VPLIST= <PPPPPPPPPPPPPPP>
##$VTLIST= <TTTTTTTTTTTTTTT>
##$WBST= 2048
##$WBSW= 25
##$XGAIN= (0..3)
0 0 0 0
##$XL= 0
##$YL= 0
##$YMAX_a= 569302
##$YMIN_a= -485743
##$ZGOPTNS= <>
##$ZL1= 120
##$ZL2= 120
##$ZL3= 120
##$ZL4= 120
##$ABSF1= 14.98509
##$ABSF2= -5.573092
##$ABSG= 5
##$ABSL= 3
##$ALPHA= 0
##$AQORDER= 0
##$ASSFAC= 0
##$ASSFACI= 0
##$ASSFACX= 0
##$ASSWID= 0
##$AUNMP= <proc_prof1d_extract_pilot.lims>
##$AXLEFT= 0
##$AXNAME= <>
##$AXNUC= <1H>
##$AXRIGHT= 0
##$AXTYPE= 0
##$AXUNIT= <>
##$AZFE= 0.1
##$AZFW= 0.1
##$BCFW= 0
##$BC_mod= 0
##$BYTORDP= 0
##$COROFFS= 0
##$CY= 15
##$DATMOD= 1
##$DC= 0
##$DFILT= <>
##$DTYPP= 0
##$F1P= 0
##$F2P= 0
##$FCOR= 0.5
##$FTSIZE= 32768
##$FT_mod= 6
##$GAMMA= 0
##$GB= 0
##$INTBC= 1
##$INTSCL= 1
##$ISEN= 128
##$LB= 0
##$LEV0= 0
##$LPBIN= 0
##$MAXI= 10000
##$MC2= 0
##$MEAN= 0
##$ME_mod= 0
##$MI= 0
##$NCOEF= 0
##$NC_proc= -8
##$NLEV= 6
##$NOISF1= 0
##$NOISF2= 0
##$NSP= 0
##$NTH_PI= 0
##$NZP= 0
##$OFFSET= 14.98509
##$PC= 1
##$PHC0= 88.23669
##$PHC1= 0
##$PH_mod= 1
##$PKNL= yes
##$PPARMOD= 0
##$PPDIAG= 0
##$PPIPTYP= 0
##$PPMPNUM= 2147483647
##$PPRESOL= 1
##$PSCAL= 4
##$PSIGN= 0
##$PYNMP= <proc.py>
##$REVERSE= no
##$SF= 400.02
##$SI= 32768
##$SIGF1= 0
##$SIGF2= 0
##$SINO= 400
##$SIOLD= 32768
##$SPECTYP= <>
##$SREGLST= <1H.CDCl3>
##$SSB= 0
##$STSI= 32768
##$STSR= 0
##$SW_p= 8223.68421052631
##$SYMM= 0
##$S_DEV= 0
##$TDeff= 65536
##$TDoff= 0
##$TI= <>
##$TILT= no
##$TM1= 0
##$TM2= 0
##$TOPLEV= 0
##$USERP1= <user>
##$USERP2= <user>
##$USERP3= <user>
##$USERP4= <user>
##$USERP5= <user>
##$WDW= 1
##$XDIM= 32768
##$YMAX_p= 443068950
##$YMIN_p= -697134
##$CURPLOT= <Network HP LaserJet P1505>
##$CURPRIN= <$Network HP LaserJet P1505>
##$DFORMAT= <normdp>
##$LAYOUT= <+/1D_H.xwp>
##$LFORMAT= <normlp>
##$PFORMAT= <normpl>
##$SURQMSG= 1
$$ End of Bruker specific parameters
$$ ---------------------------------
##NTUPLES= NMR SPECTRUM
##VAR_NAME=  FREQUENCY,     SPECTRUM/REAL,   SPECTRUM/IMAG
##SYMBOL=    X,             R,               I
##VAR_TYPE=  INDEPENDENT,   DEPENDENT,       DEPENDENT
##VAR_FORM=  AFFN,          ASDF,            ASDF
##VAR_DIM=   32768,         32768,           32768
##UNITS=     HZ,            ARBITRARY UNITS, ARBITRARY UNITS
##FACTOR=    0.250966925370066, 1,           1
##FIRST=     8223.43324360094, -74025,       -127328
##LAST=      0,             -284591,         -116793
##MIN=       0,             -697134,         0
##MAX=       8223.43324360094, 443068950,    0
$$ Real data points
##PAGE= N=1
##DATA TABLE= (X++(R..R)), XYDATA
$$ [...]
19524i946j06023c8336k11723H8508a11071H9636a93278h9074D6126J73655C8001
$$ -9946 -115969 -38336 -250059 88508 -111071 89636 -193278 -89074 46126 219781 38001
19512f9387I9583a42622b3562n8051o8492I1303k6301d4029j42516j14819g2858
$$ -69387 99583 -142622 -23562 -81613 -150105 91303 65002 -44029 -186545 -301364 -72858
19500B33495h0645r6363Q6863F8059a59267L7948C17869f9594B2086J70375c28809
$$ 233495 -80645 -177008 -90145 68059 -159267 -121319 317869 -69594 22086 192461 -328809
19488a42750A12335D60b076m2896B36448b94051A81143n07c42420H5101P2968
$$ -142750 112335 460 -2076 -44972 236448 -294051 181143 180636 -342420 85101 158069
19477A58069A8501a05256j9823F1962a08027c0804k04613L210n6375a08179E2345
$$ 158069 18501 -105256 -125079 61962 -108027 -30804 -235417 -232207 -288582 -108179 52345
19465a25988e1508a5467j08181j33321Q2926c2672E6970f8598c2232B27071a56877
$$ -125988 -51508 -15467 -123648 -256969 -174043 -32672 56970 -68598 -32232 227071 -156877
19453g6145C1892o100a35014B97402b53381f5071r1103A7219M0855a86590A61335
$$ -76145 31892 25792 -135014 297402 -253381 -65071 -156174 17219 58074 -186590 161335
19441D8612K02182b4321o8155l04538G9018c0998j78577m2322f3138k35427b1419
$$ 48612 250794 -24321 -92476 -397014 79018 -30998 -209575 -251897 -63138 -298565 -21419
19429b32625f8485n9768F3957a39682j31880g8247K3397l65437H8638a47653J3782
$$ -232625 -68485 -128253 63957 -139682 -271562 -78247 -54850 -420287 88638 -147653 -133871
19418a33871O3720m40718b41489F771a15498F3756J46484H3321a83638A86090
$$ -133871 -70151 -510869 -241489 6771 -115498 63756 210240 83321 -183638 186090
19407F4546a32274B00392a47465e0651n4311B64517e22772f7796p1888I0472a17013
$$ 64546 -132274 200392 -147465 -50651 -104962 264517 -522772 -67796 -139684 90472 -117013
19395A03817b60925a16070n5757q2524h8025G5547L86175c16007a40010b3618
$$ 103817 -260925 -116070 -171827 -254351 -88025 75547 461722 -316007 -140010 -23618
19384c8183p5371A65751L032N7219a85776g2277o8446N5006A18476b17416g486
$$ -38183 -113554 165751 168783 226002 -185776 -72277 -140723 -85717 118476 -217416 -7486
19372b99549a43292J4531j81813J10847P1800a5640j98123l16951I6628a10933
$$ -299549 -143292 -128761 -310574 -199727 -127927 -15640 -213763 -530714 96628 -110933
19361a27700H2176J22147g0126k0673J0301k37933B55660a89750h2995B18514
$$ -127700 82176 204323 -70126 -90799 -80498 -318431 255660 -189750 -82995 218514
19350d46034G6262j8885a23230d9519k41037A28437i8099l6854c5256l83470a40494
$$ -446034 76262 57377 -123230 -49519 -290556 128437 -98099 -134953 -35256 -418726 -140494
19338i6989l7517a8212k27571E3273g9429r5915H2265b29878j89692g049A54617
$$ -96989 -134506 -18212 -245783 53273 -79429 -175344 82265 -229878 -419570 -7049 154617
19326a60264m5492A30307i4211k1911K4125A7500e5786a5032n9431o2190B15596
$$ -160264 -205756 130307 -94211 -116122 -91997 17500 -55786 -15032 -74463 -136653 215596
19314e981j21191C7976K32096j06889c2580j17877q8862h4940J2945A41701a78516
$$ -5981 -127172 37976 270072 163183 -32580 -150457 -239319 -84940 -71995 141701 -178516
19302B39207h8576a3718j75451l91317K66660A39794o2765c36873A76908b69682
$$ 239207 -88576 -13718 -189169 -580486 -313826 139794 77029 -336873 176908 -269682
19291H6472C3555J51514a38819m08327K55713a26869f60j80859a0603m7553A03574
$$ 86472 33555 185069 -138819 -547146 -291433 -126869 -660 -181519 -10603 -58156 103574
19279a5345j03227l9378A07055Q7794b95713B09510a44064k04601e6993Q264A08760
$$ -15345 -118572 -157950 107055 194849 -295713 209510 -144064 -348665 -56993 -48729 108760
19267B97915h708j71682k767j2098l512j29915C39240e0389g395A8019f8873A30414
$$ 297915 -8708 -180390 -183157 -195255 -198767 -328682 339240 -50389 -7395 18019 -68873 130414
19254A36914g7306p0087g3196B86831G3222b08483O6359j89895a39319A32280
$$ 136914 -77306 -147393 -73196 286831 73222 -208483 -142124 -332019 -139319 132280
19243a61172A63584A6722N4380A9612h3423a2594j85541o1867h2548j83519G6084
$$ -161172 163584 16722 71102 19612 -83423 -12594 -198135 -260002 -82548 -266067 76084
19231b0065B28734a37151n2943B76940C8520m644a50013O4476D5177b39808c9484
$$ -20065 228734 -137151 -190094 276940 38520 33876 -150013 -85537 45177 -239808 -39484
19219a10390N3295r9433L7258A72211d4350l8425B13556d7259A12585a64959B01195
$$ -110390 -57095 -156528 -119270 172211 -44350 -82775 213556 -47259 112585 -164959 201195
19207a59917K7584j66653a04977C74455A46051a60160n1865c7073A18399f6895
$$ -159917 -132333 -298986 -104977 374455 146051 -160160 -212025 -37073 118399 -66895
19196B7832a55853I019O7760a47773o214j54081c5957A31326M8590o1210a41037
$$ 27832 -155853 9019 76779 -147773 -153987 -308068 -35957 131326 179916 118706 -141037
19184h1248E03231a86282P8976E766a44276N1623G6257b51911P4489m8702B49278
$$ -81248 503231 -186282 -107306 5766 -144276 -92653 76257 -251911 -177422 -226124 249278
19172B64496a04622j36205J19044J3292A22922K0845a38915m1342B51950j9843
$$ 264496 -104622 -240827 -121783 -108491 122922 143767 -138915 -180257 251950 232107
19162B32107l8276a46962N624g828j00246l5976f0525g074n0467j66769K8900
$$ 232107 193831 -146962 -141338 -7828 -108074 -144050 -60525 -7074 -57541 -224310 -195410
19151a95410A32695j6468a21135o6360B03653H2887J80558F229K8430a41836k46082
$$ -195410 132695 116227 -121135 -187495 203653 82887 263445 6229 34659 -141836 -387918
19140c87918a54086c4826A87321c3705l29951q1590B89064H822K92147f0409k12381
$$ -387918 -154086 -34826 187321 -33705 -363656 -445246 289064 8822 300969 -60409 -272790
19129b72790a1929B4112J18225O2360a02771j14073K7316i2593k1650j80781J02946
$$ -272790 -11929 24112 142337 204697 -102771 -216844 -189528 -92593 -114243 -295024 -192078
19118a92078j95176D9092e5475m73525a80209c838B7645a14830B4647M4026a73315
$$ -192078 -387254 49092 -55475 -529000 -180209 -3838 27645 -114830 24647 68673 -173315
19106d6850H8091a82183A18091E8414a78967b3945q9346C2115b46866O8892h3491
$$ -46850 88091 -182183 118091 58414 -178967 -23945 -113291 32115 -246866 -177974 -83491
19094b18184B822h18k54503b6097j52590k7197n4153F5828i0890k62128a33451
$$ -218184 2822 -818 -255321 -26097 -178687 -205884 -260037 65828 -90890 -353018 -133451
19082G5464a67010a8492k84727a19657F3883J7156J8897c8274p038k03933D2974
$$ 75464 -167010 -18492 -303219 -119657 63883 81039 99936 -38274 -45312 -249245 42974
19070a11855B5498a21371E5887R3183o8038c39234E6672i4330k37037A28029c13528
$$ -111855 25498 -121371 55887 149070 81032 -339234 56672 -94330 -331367 128029 -313528
19058a47030H5627d4616H4902O6008I125m268M4155J05289E850N1470b22828d098
$$ -147030 85627 -44616 84902 150910 9125 4857 49012 154301 5850 57320 -222828 -4098
19045b93278a5703j43649C05389A14357c03331G0653a30460N1668C10174c30068
$$ -293278 -15703 -159352 305389 114357 -303331 70653 -130460 -78792 310174 -330068
19034a76203q2779A27591K74182A49876F1632a33347k27733a20446F9440K13625
$$ -176203 -258982 127591 401773 149876 61632 -133347 -361080 -120446 69440 283065
19024B83065C9370a09184J7343B04857a18586F7126J65739D2475b54184a19718
$$ 283065 39370 -109184 -91841 204857 -118586 67126 232865 42475 -254184 -119718
19013a21881A82938b60300M5453A30120D9261b338I4368g8000C37822c54337a4780
$$ -121881 182938 -260300 -214847 130120 49261 -2338 94368 -78000 337822 -354337 -14780
19001A30736b02700M8920D2827A867b3558j85520P9077p0215h2084A02992a14565
$$ 130736 -202700 -153780 42827 1867 -23558 -209078 -130001 -200216 -82084 102992 -114565
18989A54949J41804p6256G2928J59851d01790C4445j0457a48003j1509r0799f1091
$$ 154949 296753 220497 72928 232779 -401790 34445 23988 -148003 -159512 -250311 -61091
18977A22966J51099H6973a6069j37672J8918j26764O71b4171A08096L37919H0331
$$ 122966 274065 86973 -16069 -153741 -134823 -261587 -260916 -24171 108096 446015 80331
18965a3497G8481P2899c2368A90748a90612P5256j1247J3972E636P178K21365
$$ -13497 78481 151380 -32368 190748 -190612 -115356 -126603 -112631 5636 12814 234179
18954B34179B8565j4133a87145j41263R6293e6918E2029J23550a56105n1263n0227
$$ 234179 28565 14432 -187145 -328408 -232115 -56918 52029 175579 -156105 -207368 -257595
18943b57595C17964E6325a32122H1763a93033d4284k52144G1099a89354A66977
$$ -257595 317964 56325 -132122 81763 -193033 -44284 -296428 71099 -189354 166977
18932a33251H7019a3389A58379g1901A43280b35542A04054b18496j10053R156
$$ -133251 87019 -13389 158379 -71901 143280 -235542 104054 -218496 -328549 -319393
18922c19393P3046O0818Q4351p041j49892f1999k8136m4815D32J48019J60929
$$ -319393 -246347 -185529 -101178 -108219 -258111 -61999 -90135 -134950 432 148451 309380
18911C09380d5369j64987j14122R0718e0944B10580j9427J5309D07a05900B16744
$$ 309380 -45369 -210356 -324478 -233760 -50944 210580 191153 206462 407 -105900 216744
18899f8337D6868K6580a63774j73717f1233G0118A6931a66369q2912F8896B1777
$$ -68337 46868 73448 -163774 -337491 -61233 70118 16931 -166369 -249281 68896 21777
18887a31754c4386k56834A75218p7119L4262b33271c019l75598i5801r4879d6016
$$ -131754 -34386 -291220 175218 98099 132361 -233271 -3019 -378617 -95801 -190680 -46016
18875B00686I527i6753q7636J5596C22960c98449B09187g4615c2209I1525a54621
$$ 200686 9527 -96753 -184389 -168793 322960 -398449 209187 -74615 -32209 91525 -154621
18863a05063B55421a68907A4833h9633b9316j05948B02807q142h465L391j30367
$$ -105063 255421 -168907 14833 -89633 -29316 -135264 202807 194665 -8465 -5074 -135441
18852a35441D07925c41376B42961j5127H7677a82243B59473i4329J7978a253D9471
$$ -135441 407925 -341376 242961 227834 87677 -182243 259473 -94329 -76351 -1253 49471
18840A89497g0160k6662c2317k66098J16248o0215d233o3118B7263a14384F528
$$ 189497 -70160 -96822 -32317 -298415 -182167 -242382 -4233 -67351 27263 -114384 6528
18828A35308C4938a5311n096k42850J7928I5914b60086P8519M3782G4707K42349
$$ 135308 34938 -15311 -20407 -263257 -245329 95914 -260086 -181567 -137785 74707 317056
18817C17056a67184O1009C11461i472A31334J04806f8500A075K65760j0494a9439
$$ 317056 -167184 -106175 311461 -9472 131334 236140 -68500 1075 266835 256341 -19439
18805B52025c4512C003J84222a17510m0283j50545K6356e3966a9039j3036J533
$$ 252025 -34512 3003 187225 -117510 -157793 -308338 -281982 -53966 -19039 -32075 -30542
18794c0542o8033D857K502h9652q6646k08864A21918p661b13671P3297D3239N4931
$$ -30542 -98575 4857 7359 -89652 -176298 -385162 121918 114257 -213671 -140374 43239 98170
18782I8170J47712d8391F560K5582a21292e9483o4221b744l03889A11721a4495
$$ 98170 245882 -48391 6560 32142 -121292 -59483 -123704 -2744 -306633 111721 -14495
18770b3803k74067J25607A23236n5700a20898r0223g2574a446B78655a7088q9680
$$ -23803 -297870 -172263 123236 67536 -120898 -211121 -72574 -1446 278655 -17088 -106768
18759a06768F7496j027P8397F1628L2572M8106a91731O579d7851k02326k05503
$$ -106768 67496 66469 144866 61628 94200 142306 -191731 -185152 -47851 -250177 -455680
18748d55680I0097b05495k31703g3354j12244I6208a16407j32450J9214a1329
$$ -455680 90097 -205495 -437198 -73354 -185598 96208 -116407 -248857 -229643 -11329
18737d8409o7622A8002L2173N0058c33347e1268j22748A10141a46329h058k65948
$$ -48409 -116031 18002 50175 100233 -333347 -51268 -174016 110141 -146329 -8058 -274006
18726b74006E1103r646c31303P4241f2424A14937a51944K3370I9534i9657b8620
$$ -274006 51103 41457 -331303 -257062 -62424 114937 -151944 -128574 99534 -99657 -28620
18714B9298K93803a41730O2267B03042a22340j87422a25497C10583G7428b786
$$ 29298 323101 -141730 -79463 203042 -122340 -309762 -125497 310583 77428 -2786
18703i3320D7719a00591B70465a21396A07809L9886b33448Q1042L6256H1900K28516
$$ -93320 47719 -100591 270465 -121396 107809 147695 -233448 -152406 -116150 81900 310416
18692C10416a75256F4623a19371B833J52925O056a97119j16249F519J54884a26894
$$ 310416 -175256 64623 -119371 2833 155758 161814 -197119 -313368 6519 161403 -126894
18680A24108d47491f6730q611B48304A115Q1263a43148A47857i298j52565d3267
$$ 124108 -447491 -66730 -75341 248304 1115 82378 -143148 147857 -9298 -161863 -43267
18668i0743j60000J0182A2777b10335k1177P2793P2316l04081a76238P2485D3725
$$ -90743 -250743 -240561 12777 -210335 -231512 -158719 -86403 -390484 -176238 -103753 43725
18656E0588a92513A20124M8681c6513A1778a17597b1469j40436M0041A22829d773
$$ 50588 -192513 120124 168805 -36513 11778 -117597 -21469 -161905 -121864 122829 -4773
18644G1393b21532I4601B7166b3910j48390g7100A87265d2787j15254j26020Q6086
$$ 71393 -221532 94601 27166 -23910 -172300 -77100 187265 -42787 -158041 -284061 -197975
18633a97975A58275b27737J11099C04646a23946B7619a57817j13316C6056N1719
$$ -197975 158275 -227737 -116638 304646 -123946 27619 -157817 -271133 36056 87775
18623H7775j6744d3121n3799A98941c43367j2434a59672g3507A60115c1493A32797
$$ 87775 71031 -43121 -96920 198941 -343367 -355801 -159672 -73507 160115 -31493 132797
18611A21582d88638h0423k81883A25372C3162i1539P181j49045j089A48311F4163
$$ 121582 -488638 -80423 -362306 125372 33162 -91539 -84358 -233403 -234492 148311 64163
18599a90264C6937a75076b1256B36636a17022j89400A38760a88026a8232j46621
$$ -190264 36937 -175076 -21256 236636 -117022 -306422 138760 -188026 -18232 -164853
18589a64853r7641K0898B37586d16554A40987a24510j2411f8396j9676A39152
$$ -164853 -262494 -241596 237586 -416554 140987 -124510 -136921 -68396 -88072 139152
18578a9496Q000j39650H2995B861a59902G5538j0153e2631p966A97211F3433J36460
$$ -19496 -11496 -151146 82995 2861 -159902 75538 65385 -52631 -60597 197211 63433 199893
18566A99893J68794G720a43022A23504A8000K19396J5767d3391b565j66671b0989
$$ 199893 368687 7720 -143022 123504 18000 237396 253163 -43391 -2565 -169236 -20989
18554b50856B04581a12230d7015k06593f5033a8331O226k19031d3126k20002H6031
$$ -250856 204581 -112230 -47015 -253608 -65033 -18331 -12105 -231136 -43126 -263128 86031
18542a33256A45772C5200Q8009K7265g6803E4558b26256N7018M3898N6177A37166
$$ -133256 145772 35200 123209 150474 -76803 54558 -226256 -169238 -125340 -69163 137166
18530b56107O8071h4539r8189a9455B06104a75851d0969B25627b00024k03869
$$ -256107 -188036 -84539 -182728 -19455 206104 -175851 -40969 225627 -200024 -403893
18520d03893B9327a22724B148J09158N5231g9251r3816A06761b35510a9771G6246
$$ -403893 29327 -122724 2148 111306 166537 -79251 -173067 106761 -235510 -19771 76246
18508A64582g4j46311f0460A29362a24099k40954f6895k09429M8466a2361r6695
$$ 164582 -74 -146385 -60460 129362 -124099 -365053 -66895 -276324 -227858 -12361 -109056
18497a09056J1462n8403A44296D531a63388N5514d9312m8207p3042c0461I4786
$$ -109056 -97594 -155997 144296 4531 -163388 -107874 -49312 -97519 -170561 -30461 94786
18485e6335o5019a08A28396K6665b44874J02399A72070i8216a0347A66510b9340
$$ -56335 -121354 -108 128396 155061 -244874 -142475 172070 -98216 -10347 166510 -29340
18473b30492A00158a64191e8331b5356j16675j11510Q7441A6935i6253B9773b8316
$$ -230492 100158 -164191 -58331 -25356 -142031 -253541 -166100 16935 -96253 29773 -28316
18461h5738A50952b11317B0567e7768k30031a32739d1460j80142o3562A03974
$$ -85738 150952 -211317 20567 -57768 -287799 -132739 -41460 -221602 -285164 103974
18450a14890o8426K1059A60661c72535A04657e0084n8040J3275H1864J68316n7583
$$ -114890 -183316 -162257 160661 -372535 104657 -50084 -108124 -94849 81864 250180 192597
18439A92597C6623a59457A51344a30671d179j7800j43676A05259m1238Q5707i6396
$$ 192597 36623 -159457 151344 -130671 -4179 -21979 -165655 105259 64021 149728 -96396
18427D0616g5919q8787c5193A7964J40978p2354c81541B7439J3289L3658e24717
$$ 40616 -75919 -164706 -35193 17964 158942 86588 -381541 27439 40728 74386 -524717
18415B42614f1413j97521d9702A44234Q134b22370d749B3902J34074A8036j041
$$ 242614 -61413 -258934 -49702 144234 152368 -222370 -4749 23902 157976 18036 16995
18404A6995a81222B34344J17837C7839j2691d0617j15884k04442a80090A20378
$$ 16995 -181222 234344 352181 37839 25148 -40617 -156501 -360943 -180090 120378
18393a07674A99998E8145K9066k8030p358K9974e2353A02526b42802A90116d30039
$$ -107674 199998 58145 87211 59181 51823 81797 -52353 102526 -242802 190116 -430039
18381A68025a1203I7040c8324j26746r8000L9867L9494C771a09958A41067a98626
$$ 168025 -11203 97040 -38324 -165070 -263070 -223203 -183709 3771 -109958 141067 -198626
18369a43556c2864m0171b6193B83340E2459d0641q5477k1356A88614a22418j71045
$$ -143556 -32864 -73035 -26193 283340 52459 -40641 -126118 -147474 188614 -122418 -293463
18358b93463J8699Q5100A22185R159d65734e4166m35534B69587j00652b20465
$$ -293463 -274764 -189664 122185 131344 -465734 -54166 -489700 269587 168935 -220465
18347C9791d19467E1505J28491l4266K7826a81183P7299a7087I9380e0489C3709
$$ 39791 -419467 51505 179996 145730 173556 -181183 -103884 -17087 99380 -50489 33709
18335A4650d6967j33002P5023k03568A11227b29568n8435a2416I1325c4479j79001
$$ 14650 -46967 -179969 -104946 -308514 111227 -229568 -288003 -12416 91325 -34479 -213480
18324b13480a02246n4740a9683j00607b7876E0834a5140A77865a67035N385A63431
$$ -213480 -102246 -156986 -19683 -120290 -27876 50834 -15140 177865 -167035 -161650 163431
18312A20126a9889B02218d5998A76765c39146a0854k1967A49853c02708i3636
$$ 120126 -19889 202218 -45998 176765 -339146 -10854 -32821 149853 -302708 -93636
18301c0142g617p5482B03809a50825O3092B8959a0932m2303A20952O6398d9524
$$ -30142 -7617 -83099 203809 -150825 -87733 28959 -10932 -53235 120952 187350 -49524
18289f9987k1776p4212h753n7037n8325D23031F2146N9651a28954M8360q5952
$$ -69987 -91763 -165975 -8753 -65790 -124115 423031 62146 121797 -128954 -80594 -166546
18278a66546n3742i9605A40364b97426A3969a93976A89631C4713J87046a20273
$$ -166546 -220288 -99605 140364 -297426 13969 -193976 189631 34713 221759 -120273
18267I9359l9492m290b21030e1165A62907b09800E3024Q1351a82326j9803D5781
$$ 99359 59867 55577 -221030 -51165 162907 -209800 53024 134375 -182326 -202129 45781
18255a21617m6928C7059a28435A66869g0173c2380l34848J82736G6063a2605B5132
$$ -121617 -168545 37059 -128435 166869 -70173 -32380 -367228 -184492 76063 -12605 25132
18243B27561b51995J06730A43573a79437j5935N5798k68574a70844B39710J9252
$$ 227561 -251995 -145265 143573 -179437 -195372 -139574 -408148 -170844 239710 258962
18233B58962f0906I1490h7291K0194KJ3603A50861a6288H4878K17327b6645l23468
$$ 258962 -60906 91490 -87291 -67097 -67095 -53492 150861 -16288 84878 302205 -26645 -350113
18221c50113A06921c80352a69065B19936a19191d2415A7598K11146b26805B14426
$$ -350113 106921 -380352 -169065 219936 -119191 -42415 17598 228744 -226805 214426
18210b9955l00728R7242B17823b25343A3352L2196P960J5704N3682m2240a66298
$$ -29955 -330683 -233441 217823 -225343 13352 45548 53508 69212 122894 80654 -166298
18198A21884J5241e6729A86153c4793I0726b40243a6929o4830j38496q9742I5315
$$ 121884 137125 -56729 186153 -34793 90726 -240243 -16929 -81759 -220255 -309997 95315
18186b30126d1869j38428a345o5289n340n8247L3017a9430j7605l5004K5145A6334
$$ -230126 -41869 -180297 -1345 -66634 -71974 -130221 -97204 -19430 -37035 -72039 -46894 16334
18173B63205J9078A38977e8697q8695j40229G5170J19384l2276b9606A19508a70114
$$ 263205 282283 138977 -58697 -147392 -287621 75170 194554 162278 -29606 119508 -170114
18161a70082b8637m1144k19257a31905l9092A04931c50846C9504i4487J1454A85484
$$ -170082 -28637 -69781 -289038 -131905 -170997 104931 -350846 39504 -94487 -83033 185484
18149A5020K1620J2398a65911p2666a03181k01528L4061E2620F750a63559J8630
$$ 15020 36640 49038 -165911 -238577 -103181 -304709 -270648 52620 6750 -163559 -144929
18138a44929G554f5852o2936A16611g2930I1861B6249d2432m3364M864j9823E6320
$$ -144929 7554 -65852 -128788 116611 -72930 91861 26249 -42432 -85796 -80932 -100755 56320
18125C27581A00344a50327k8095d1030A24914k5953a10077K3211A84246L5192
$$ 327581 100344 -150327 -178422 -41030 124914 98961 -110077 -86866 184246 219438
18115B19438G5714A8767b9102r7392C6671b40805a1933k98424g2966G9922l666
$$ 219438 75714 18767 -29102 -126494 36671 -240805 -11933 -310357 -72966 79922 76256
18104G6256a19921A11440a06708F4223K3796J02050a17716a8647A31194D2175
$$ 76256 -119921 111440 -106708 64223 88019 190069 -117716 -18647 131194 42175
18093A53001a88877C40357A06395a65017I4447e0548A23226b91582A9258a06901
$$ 153001 -188877 340357 106395 -165017 94447 -50548 123226 -291582 19258 -106901
18082h8164B15405D7321M94165i1636A41837r629b52814J23537m3421h4993C1395
$$ -88164 215405 47321 541486 -91636 141837 132208 -252814 -129277 -172698 -84993 31395
18070a72551H4556f2236E5364k0788a06840A1044K11122o3743a57334A03501c23341
$$ -172551 84556 -62236 55364 34576 -106840 11044 222166 158423 -157334 103501 -323341
18058a81037J0127A22285b32208e779A1650e184k78472A20243b17627A66958a9836
$$ -181037 -170910 122285 -232208 -5779 11650 -5184 -283656 120243 -217627 166958 -19836
18046A67682b29162A89133c39917B32467A7497i8964D3727E557K71891a3820B36928
$$ 167682 -229162 189133 -339917 232467 17497 -98964 43727 5557 277448 -13820 236928
18034A00599d7458J914A00379b25984b1268j08469L6040k7206N9328B2557J82353
$$ 100599 -47458 -45544 100379 -225984 -21268 -129737 -93697 -120903 -61575 22557 204910
18023B04910a0851A79477p6152J21441f7583k9050B0591Q3290d6955q723H1308
$$ 204910 -10851 179477 103325 224766 -67583 -96633 20591 103881 -46955 -55678 81308
18011A19250h6661o6038J1893M4667F5803B7456e961k07786N397B7966N0125b73692
$$ 119250 -86661 -152699 -140806 -96139 65803 27456 -5961 -213747 -208350 27966 78091 -273692
17998d61267a52555k5166m4401R489a01820j48582e1630j41090P3266A74204p7608
$$ -461267 -152555 -177721 -222122 -212633 -101820 -250402 -51630 -192720 -119454 174204 96596
17987I6596a82438G0094c5231q0282c0837j57300d694A2726a14634A23297k6802
$$ 96596 -182438 70094 -35231 -115513 -30837 -188137 -4694 12726 -114634 123297 96495
17976I6495K94521b59160H2487J66712D9607O529d6664J3864l1458l1496E1587
$$ 96495 391016 -259160 82487 249199 49607 56136 -46664 -32800 -64258 -95754 51587
17964a8200A19832g6510n131h595A82510a47865k189j04168A7265K0793K47774
$$ -18200 119832 -76510 -81641 -8595 182510 -147865 -150054 -254222 17265 38058 285832
17953B85832b47115F0533h2915e730k36490h4807O486c2766A0553a4122A49489
$$ 285832 -247115 60533 -82915 -5730 -242220 -84807 -78321 -32766 10553 -14122 149489
17941B9783a03753j7915j40726a11966J6912j78775A15057j6400K02781j13787
$$ 29783 -103753 -121668 -262394 -111966 -95054 -273829 115057 98657 301438 187651
17931A87651J0184e7223n9017j36785C7508Q3129b96789a10407H5650k2435c2933
$$ 187651 197835 -57223 -116240 -253025 37508 120637 -296789 -110407 85650 63215 -32933
17919C23534B2538i2968M4182j0744J3848A08647Q4601p4810C2590K08217A09586
$$ 323534 22538 -92968 -48786 -59530 -45682 108647 193248 118438 32590 240807 109586
17907A21700b38890A74376M4789b32001e8686A30855f6765j44852A50865F1414
$$ 121700 -238890 174376 219165 -232001 -58686 130855 -66765 -211617 150865 61414
17896h7865A55565N4769o0878A5401f7977j08623F6830k1563b40374I6131C3541
$$ -87865 155565 210334 149456 15401 -67977 -176600 66830 45267 -240374 96131 33541
17884a46085D4032J13606a53070M7927a9067j08697a7439F7716J8668J19999d6131
$$ -146085 44032 157638 -153070 -105143 -19067 -127764 -17439 67716 86384 206383 -46131
17872H806Q1844P1861c97467C34144a58509A35203a39533B17859a41864j58811
$$ 8806 90650 162511 -397467 334144 -158509 135203 -139533 217859 -141864 -300675
17862c00675a1760A947N0254b17641D5039F892K52674e475q420C01501i2495a2775
$$ -300675 -11760 1947 52201 -217641 45039 6892 259566 -5475 -13895 301501 -92495 -12775
17849g7455j64201R5454A53771J16013I1856a09445B5786K79345b8771h611A48256
$$ -77455 -241656 -146202 153771 269784 91856 -109445 25786 305131 -28771 -8611 148256
17837a01237j52915c7095G5376e6714A96015E1719k5837J77372C171e2233E3587
$$ -101237 -254152 -37095 75376 -56714 196015 51719 25882 203254 3171 -52233 53587
17825C89616A11719c49997J03404H200L80537A49546P6617c0583r8566B31144
$$ 389616 111719 -349997 -246593 8200 388737 149546 226163 -30583 -129149 231144
17814B63424a77555j66217a03248G7833B8584a85311A8435J00002e5985A02659
$$ 263424 -177555 -343772 -103248 77833 28584 -185311 18435 118437 -55985 102659
17803A9795p614K92109A26072M6327J89198b49691B02564a67176j30877g2527
$$ 19795 12181 304290 126072 172399 361597 -249691 202564 -167176 -298053 -72527
17792a94359C6626b45223g1624a3319m15800g8480A14705c24362A02246j4466
$$ -194359 36626 -245223 -71624 -13319 -429119 -78480 114705 -324362 102246 87780
17782H7780b0849I8218b68870c3401j93143A040L9410b59406k3360g9080l0537
$$ 87780 -20849 98218 -268870 -33401 -226544 1040 40450 -259406 -282766 -79080 -109617
17771a09617q8965m0006A39657A7362K24463j09371D583K1498P6158B8915a78175
$$ -109617 -198582 -238588 139657 17362 241825 132454 4583 26081 102239 28915 -178175
17759a93483o0014a19433F5605K43687f6530r0970O6620A18737a06771D1483f5507
$$ -193483 -253497 -119433 65605 309292 -66530 -157500 -90880 118737 -106771 41483 -65507
17747A37707Q8755A00702d1209A19682f4634r3203B3109K35494n0303a3808A04291
$$ 137707 226462 100702 -41209 119682 -64634 -157837 23109 258603 208300 -13808 104291
17735H014R5716i4532j45397J14873J6706A33847d744k31045B72976B7321L03844
$$ 8014 103730 -94532 -239929 -125056 -108350 133847 -4744 -235789 272976 27321 331165
17724C31165b28145i9860A30137N4552D5202O4270A529e8142E1328K1088r749
$$ 331165 -228145 -99860 130137 184689 45202 109472 1529 -58142 51328 72416 62667
17713F2667K8874f6443K1842A14033a07101b7135A04821C4378K43803a53827B3692
$$ 62667 91541 -66443 -44601 114033 -107101 -27135 104821 34378 278181 -153827 23692
17701C109L85159G7876R8586p7161a359A02251p434c83451C15749G8158a72495
$$ 3109 388268 77876 176462 99301 -1359 102251 94817 -383451 315749 78158 -172495
17689H5038L04990j69514k6738G0656g4726A65399n684b017D2622a90971H943
$$ 85038 390028 220514 193776 70656 -74726 165399 159715 -2017 42622 -190971 8943
17677f9539B33477f608C37072J3910A59669a3439A24498M5602k658O9592E9310
$$ -69539 233477 -6608 337072 350982 159669 -13439 124498 170100 167442 237034 59310
17665A32553j8478a56973J4302N927k31669B25863c9685D30106b5590c335A74193
$$ 132553 114075 -156973 -142671 -136744 -368413 225863 -39685 430106 -25590 -3335 174193
17653A84888L41288F2506J18153a02654C0877b18366E1781K83172a93003f9587
$$ 184888 526176 62506 180659 -102654 30877 -218366 51781 334953 -193003 -69587
17642a0254j49969B40057j11816M2259m0646R9292k2474e4148G1668J96999L2840
$$ -10254 -160223 240057 128241 170500 129854 229146 206672 -54148 71668 268667 301507
17631C01507a60303G4560N1661k4507g1171n5772A08965J28906a42523H9511k646
$$ 301507 -160303 74560 126221 101714 -71171 -126943 108965 237871 -142523 89511 86865
17620H6865J09614c07351G816J59704f924A57180G6473J79515q4362K6872C9341
$$ 86865 196479 -307351 7816 167520 -6924 157180 76473 255988 171626 198498 39341
17608B86652a60685l8596G1069C1148Q2977M1979b8341A31386J22100I6282a36861
$$ 286652 -160685 -199281 71069 31148 114125 156104 -28341 131386 253486 96282 -136861
17596a05851G0562J18485h5567C74519b52154C58548i9878G1955N117b08623A55313
$$ -105851 70562 189047 -85567 374519 -252154 358548 -99878 71955 77072 -208623 155313
17584A60919a19514A59038J44333n740a7204A96475i3522B91606d6484D85i363
$$ 160919 -119514 159038 303371 297631 -17204 196475 -93522 291606 -46484 485 -9363
17572A66330J4024O6666d9983D88022F5763f6697C23241G5399A6948a51516D64190
$$ 166330 180354 247020 -49983 488022 65763 -66697 323241 75399 16948 -151516 464190
17560a02032c5715F824a94989A29292l1702N0443c98951B60292A29207D5282L22335
$$ -102032 -35715 6824 -194989 129292 97590 148033 -398951 260292 129207 45282 367617
17549C67617j69736D808J92232j2836R0146G0833L3980g8762L5901C96620A41532
$$ 367617 197881 4808 197040 184204 274350 70833 104813 -78762 -42861 396620 141532
17537b55009A46182J07434D2315f5903C94802g2550A54196A7366L26759D2259
$$ -255009 146182 253616 42315 -65903 394802 -72550 154196 17366 344125 42259
17526A74462M1311k1828A0849K55894O8411L04801k64451K28759m402j41924A73618
$$ 174462 215773 193945 10849 266743 335154 639955 375504 604263 599861 457937 173618
17514E44140k58549k010j09705J42855M2880q8127k8860M32342p7098k20868j76415
$$ 544140 285591 283581 173876 316731 359611 271484 242624 674966 597868 377000 200585
17503B00585K36300A28805K21697A30489c47290e455B35763j07366L11441A0716
$$ 200585 436885 128805 350502 130489 -347290 -5455 235763 128397 439838 10716
17492A15871n1126k0409J43968C9400K58728F122K37748l0147j8632I4918G716
$$ 115871 64745 44336 188304 39400 298128 6122 243870 213723 195091 94918 7716
17480i9810c321C49175B3299N5938b68554N7243E6122N3797J60885j05137c1754
$$ -99810 -3321 349175 23299 79237 -268554 -211311 56122 109919 270804 165667 -31754
17468F1170M72881A29697K80198E3612L5158K5903J28169D7212Q3065K08114m9868
$$ 61170 534051 129697 409895 53612 88770 114673 242842 47212 130277 338391 288523
17457B88523n8016n4935K05886L2166h408I4488b87357C72135j71655b1524B19931
$$ 288523 230507 175572 381458 413624 -8408 94488 -287357 372135 200480 -21524 219931
17445A27539J65254L7187j46915l8269K21005J36227k32740J8364A37294n6707
$$ 127539 292793 329980 183065 144796 365801 502028 269288 287652 137294 80587
17435H0587K49210A43651P4407k1897m1938L93741H252M0322J3479O5565i906
$$ 80587 329797 143651 218058 196161 154223 547964 8252 48574 62053 127618 -9906
17423B98881k8527K7430j9894p1079B2963a10049B7132K31300Q3269J50101a72534
$$ 298881 270354 297784 277890 206811 22963 -110049 27132 258432 341701 491802 -172534
17411B35919J14211A59850J4783o7261J36189E0470L32214A46367J30336A32196
$$ 235919 350130 159850 174633 107372 243561 50470 382684 146367 276703 132196
17400A16029b62039C33953j24091N370J6007J68895j62496a6927j55953B75946
$$ 116029 -262039 333953 209862 215232 231239 400134 237638 -16927 -172880 275946
17389C23150j28891J26018d4369C21658F4203M00002j93794m7256A794J72825
$$ 323150 194259 320277 -44369 321658 64203 464205 270411 223155 1794 174619
17379A74619n3566E5942J45738L09438b6899j37559C22932j58360p973R5972j0065
$$ 174619 121053 55942 201680 511118 -26899 -164458 322932 164572 156599 252571 242506
17368B42506F8357d7184A38599J4484Q828M5752j03744J66576j29378H820J69457
$$ 242506 68357 -47184 138599 153083 161911 207663 103919 270495 141117 8820 178277
17357A78277M5998K33706m9389A0874J80126a7111j64082A51255m9342L0698K53648
$$ 178277 224275 457981 408592 10874 191000 -17111 -181193 151255 101913 132611 386259
17346C86259m4696M2552j12595a95485A56242Q9881r3127B3894a06968C97219
$$ 386259 341563 384115 271520 -195485 156242 246123 152996 23894 -106968 397219
17335A45501l8062M34064j76666B1227J69012P3889j11489M4920e0604B37544
$$ 145501 107439 541503 364837 21227 190239 264128 152639 197559 -50604 237544
17324D88659n9045A80687l6214N9226A4910L7855K33587A18357p015J24026k5957
$$ 488659 429614 180687 144473 203699 14910 52765 286352 118357 111342 235368 209411
17313B09411K06817A87172q3496M2769J74319C0047O1210K54183k2730E3167M6967
$$ 209411 416228 187172 103676 146445 320764 30047 91257 345440 322710 53167 100134
17302A00134J27349p9470P0190j6159J7516P9035A06233K39734j40311C9580J79114
$$ 100134 227483 148013 218203 202044 219560 298595 106233 345967 205656 39580 218694
17291B18694M6877r7001o2092J15314K66218A40392J22554B5101a9568A59785
$$ 218694 265571 168570 106478 221792 488010 140392 262946 25101 -19568 159785
17280E77425E6871c5882B04704G6471d2634c085B20811m0423J98108h5458C24156
$$ 577425 56871 -35882 204704 76471 -42634 -3085 220811 180388 378496 -85458 324156
17268i122A85689K79935A4935L33615j15857B3289K64638O2292j29950m6749L17665
$$ -9122 185689 465624 14935 348550 232693 23289 287927 350219 220269 173520 491185
17257D91185B6818J7424i851D88298j57959A49498f3234B18571E333M44811j78138
$$ 491185 26818 44242 -9851 488298 330339 149498 -63234 218571 5333 450144 272006
17246B72006O717C0036J78505K59564J66206A50424l2568J01159K0279J23154
$$ 272006 278723 30036 208541 468105 634311 150424 117856 219015 239294 362448
17236C62448r6210l678J49666L4271O1289A37905K21762J68128k37067H3348J17582
$$ 362448 266238 262560 412226 446497 507786 137905 359667 527795 290728 83348 200930
17225B00930Q1061J17404j85854J13267A60052K31922J4715J10316B13818J1290
$$ 200930 281991 399395 213541 326808 160052 391974 406689 517005 213818 225108
17215B25108J49957q0771K06373j79794A43096k7930L39645j19629K0256j36142
$$ 225108 375065 294294 500667 320873 143096 115166 454811 335182 355438 219296
17205B19296R1737o4770L894E1977L08620A36071d314B70942l7240m287J31955
$$ 219296 311033 246263 250157 51977 360597 136071 -4314 270942 233702 229415 361370
17194C61370J6390K51108k76045A59195O0904K41645N7038J43902m7190B24596
$$ 361370 377760 628868 352823 159195 220099 461744 518782 662684 615494 224596
17183B26612j01409J60224K10870j58034p888L31837k19137P1402J1023A77966
$$ 226612 125203 285427 496297 338263 330375 662212 443075 514477 525500 177966
17172D75571k09454J98060j12801A36299K27427l5186M6884J16429k11294L95953
$$ 475571 266117 464177 351376 136299 363726 328540 375424 491853 280559 676512
17162F76512B39673L89714A16601L89641L3778j51391A10438L22946N3639M4075
$$ 676512 239673 629387 116601 506242 540020 388629 110438 433384 487023 531098
17152E31098j2970k13404P5055K55796B49676J97060J37102j06771r8427q672
$$ 531098 518128 304724 379779 635575 249676 446736 583838 477067 378640 369968
17142C69968K76721l23151j40328K34535J69591J63582l70332o8639O1331p6822
$$ 369968 646689 323538 183210 417745 587336 750918 380586 311947 373278 296456
17132B96456K24239k52697K92142K26525B64314M09144q8542A46036P31615D04682
$$ 296456 520695 267998 560140 786665 264314 673458 584916 146036 877651 404682
17121C90035l6156a72210D75357q9050j48691L7777Q6672j0281J72810r3415M76436
$$ 390035 353879 -172210 475357 386307 237616 275393 362065 351784 524594 431179 907615
17110I07615j30570l14840j3974L8315J09844k32612j6260L86037j05548n1808
$$ 907615 777045 462205 448231 486546 596390 363778 347518 733555 628007 576199
17100E76199J18639l6806q0237j00751J81380m1122B55918L8563O80194k66305
$$ 576199 694838 658032 577795 477044 658424 617302 255918 294481 974675 708370
17090G08370H5240O37693C41513O05684D53346L29854j12076p0791J63983l05824
$$ 708370 85240 722933 341513 947197 453346 783200 671124 600333 764316 458492
17080D58492j16760M75137k42173J23396N105C39621K64688B15258N99097K7945
$$ 458492 341732 816869 574696 698092 703197 339621 604309 215258 814355 842300
17070H42300m7995r3801q2442k1384J6866P1070j0348j88786J37342M2797L73680
$$ 842300 794305 700504 618062 596678 613544 684614 674266 485480 622822 665619 1039299
17059A039299l02782K73000k42668l82777M43611C88581M87215j29018J99987
$$ 1039299 736517 1009517 766849 384072 827683 388581 875796 746778 946765
17050I46765k28721q4273K39805K23898m80981K80152P1238k54148k065L70741
$$ 946765 718044 633771 873576 1097474 616493 896645 967883 713735 711670 1082411
17040A082411l12820N9184R5875K334J09602l8030r1631l15458M16321r0328k3545
$$ 1082411 769591 828775 924650 926984 1036586 998556 906925 591467 1007788 917460 893915
17029H93915O5740K5583n1235j42095M37057l08114K00191m68132L18462N9961
$$ 893915 959655 985238 934003 791908 1228965 920851 1121042 652910 971372 1031333
17019A031333k81039K26082k52224J43551N39715k35788l0277k43452J99361J25161
$$ 1031333 750294 976376 724152 867703 1407418 1171630 1141353 897901 1097262 1222423
17009A222423r4339j36925K44388J00726k45646K96848l51461k1687r3802L61949
$$ 1222423 1128084 991159 1235547 1336273 1090627 1387475 1036014 1014327 920525 1282474
16999A282474l60677K07832J27930J82777j91127k41163Q4095q8706M10242m51665
$$ 1282474 921797 1129629 1257559 1440336 1249209 1008046 1092141 1003435 1413677 962012
16989I62012M56778l35683N85296m24830q9542J53819K50024j80312q8313l3217
$$ 962012 1418790 1083107 1668403 1243573 1154031 1307850 1557874 1377562 1289249 1256032
16979A256032K30169k49695O3426Q7550K75890k95858J29019j20166j81748J16816
$$ 1256032 1486201 1236506 1299932 1387482 1663372 1367514 1496533 1376367 1194619 1311435
16969A311435j41131j59019L38631K33835j29073M0366O575J51728J86871k95559
$$ 1311435 1170304 1011285 1349916 1583751 1454678 1495044 1501619 1653347 1840218 1544659
16959A544659q7710J8657M25896n09860J59915J45763Q7196j6444J08065m50927
$$ 1544659 1456949 1475606 1901502 1391642 1551557 1697320 1784516 1768072 1876137 1425210
16949A425210L07441J60374R4265m84235J33631M50808j65667n8373K55218k78881
$$ 1425210 1732651 1893025 1987290 1503055 1636686 2087494 1921827 1863454 2118672 1839791
16939A839791j56427k162L95540Q7296k18249J78116K99743m41893Q2500j11074
$$ 1839791 1683364 1681202 2076742 2164038 1945789 2123905 2423648 1981755 2064255 1953181
16929A953181N63204j12034L2748n93672K32996l3645L88164R512k19828R0740
$$ 1953181 2516385 2404351 2437099 1843427 2076423 2042778 2430942 2440454 2220626 2311366
16919B311366L61720j41002O8048k94491J30918M27045l10857p3326L50907r9283
$$ 2311366 2673086 2532084 2600132 2305641 2436559 2863604 2552747 2479421 2830328 2731045
16909B731045k08393k3126M58820k48905L62875m4888k49310J49636J46217j13872
$$ 2731045 2522652 2499526 2958346 2709441 3072316 3027428 2778118 2927754 3073971 2960099
16899B960099K53923k06712J03056q8435J88840O3229k14179J10049K74062L7615
$$ 2960099 3214022 3007310 3110366 3021931 3210771 3274000 3059821 3169870 3443932 3481547
16889C481547J09152k14779L08561j75133M7235l57999O05740K7205j9024J81287
$$ 3481547 3590699 3375920 3684481 3509348 3556583 3198584 3804324 3831529 3812505 3993792
16879C993792j38898J19515J60532r536j42920K31660J1752Q1996K09572K2982
$$ 3993792 3854894 3974409 4134941 4125405 3982485 4214145 4225897 4307893 4517465 4540447
16869D540447K31579j52311n5393L94601O9815k04649J08105l0448K83098k68431
$$ 4540447 4772026 4619715 4564322 4958923 5028738 4824089 4932194 4901746 5184844 4916413
16859D916413J70763K43983K24232n4161J4356K4354K30917J36986j20024L11799
$$ 4916413 5087176 5331159 5555391 5501230 5515586 5539940 5770857 5907843 5787819 6099618
16849F099618j16374j82483N66394j40468K45776P1239J33520J68020K47383K43214
$$ 6099618 5983244 5800761 6367155 6226687 6472463 6543702 6677222 6845242 7092625 7335839
16839G335839m27769J12284L84089q9537L23518O34536j66753J53303K80879r2587
$$ 7335839 6908070 7020354 7404443 7314906 7638424 8272960 8106207 8259510 8540389 8447802
16829H447802l1865N41735O9011J61918J46390L27345P9592N1046K75477M65719
$$ 8447802 8415937 8957672 9026683 9188601 9334991 9662336 9741928 9792974 10068451 10534170
16819A0534170r5390J60249K29104M66256k74985N68240K98445n6850K60754K97049
$$ 10534170 10438780 10599029 10828133 11294389 11019404 11587644 11886089 11829239 12089993 12387042
16809A2387042N44998L25466K70069J83323K44596M99936K20375L99309M56412
$$ 12387042 12932040 13257506 13527575 13710898 13955494 14455430 14675805 15075114 15531526
16800A5531526J34022N82465K55022M83346M65986K63158L43900Q60022N51399
$$ 15531526 15665548 16248013 16503035 16986381 17452367 17715525 18059425 18919447 19470846
16791A9470846K84008P19757J54662N27198M81521N80150N85081Q77644L31876
$$ 19470846 19754854 20474611 20629273 21156471 21637992 22218142 22803223 23680867 24012743
16782B4012743Q07614L93773J181119N96637Q14037N94353P62812R42025Q25618
$$ 24012743 24820357 25214130 26395249 26991886 27805923 28400276 29163088 30105113 30930731
16773C0930731J065197P54292J079740Q20089J199732J011050J181737J133932
$$ 30930731 31995928 32750220 33829960 34650049 35849781 36860831 38042568 39176500
16765C9176500P05070J545104J125159J318359J275573J068049J679896J359870
$$ 39176500 39881570 41426674 42551833 43870192 45145765 46213814 47893710 49253580
16757D9253580J478613J431091J377768J372254J966479J319233J588593J493879
$$ 49253580 50732193 52163284 53541052 54913306 56879785 58199018 59787611 61281490
16749F1281490J579063J604809J817284J373193J937485J280956J438149J722620
$$ 61281490 62860553 64465362 66282646 67655839 69593324 70874280 72312429 74035049
16741G4035049J524263J326679J175721J623102J075531J375461Q73839R42697
$$ 74035049 75559312 76885991 78061712 79684814 80760345 82135806 83009645 83952342
16733H3952342R56867R40578L35595L33882O61662Q3141J39298N5861m89152J12126
$$ 83952342 84909209 85849787 86185382 86519264 87180926 87264067 87403365 87459226 86970074 87082200
16723H7082200l14580o35555p07312j154392n39885j195476j016654r88352j668280
$$ 87082200 86767620 86132065 85424753 84270361 83730476 82535000 81518346 80529994 78861714
16714G8861714j173287j314079j426712j504351j407208j415052k013402j029763
$$ 78861714 77688427 76374348 74947636 73443285 72036077 70621025 68607623 67577860
16706F7577860j661266j360612j519263j555051j699879j787028j132331j398512
$$ 67577860 65916594 64555982 63036719 61481668 59781789 57994761 56862430 55463918
16698E5463918j619157j275559j452054j244335j349695j126401j213700j045753
$$ 55463918 53844761 52569202 51117148 49872813 48523118 47396717 46183017 45137264
16690D5137264j605233j120984j293818r61978j142005o90201r50610j108662
$$ 45137264 43532031 42411047 41117229 40155251 39013246 38323045 37372435 36263773
16682C6263773r31643r61295p72730r88833r36799n91418p70789n09591j421289
$$ 36263773 35332130 34370835 33598105 32609272 31672473 31081055 30310266 29800675 28379386
16673B8379386k97070p40804l58536q93351k43299r53672p37499j50226p46123
$$ 28379386 28082316 27341512 26982976 26089625 25846326 24892654 24155155 24004929 23258806
16664B3258806m68848n34399m59959n32085l30130o92029j61878l51186r24151
$$ 23258806 22789958 22255559 21795600 21263515 20933385 20241356 20079478 19728292 18804141
16655A8804141j78198n32965j48726l08187l27948p38522k67401j37261k90075
$$ 18804141 18625943 18092978 17944252 17636065 17308117 16569595 16302194 16164933 15874858
16646A5874858l92083j86887l45335k42797m33254N2780n79708l63743n7132J4498
$$ 15874858 15482775 15295888 14950553 14707756 14274502 14327282 13747574 13383831 13326699 13341197
16636A3341197m55967k78214K67806p53461k8765l82816J18426m69575j47436
$$ 13341197 12885230 12607016 12874822 12121361 12092596 11709780 11828206 11358631 11211195
16627A1211195k68546q3729j16776k26065l16462J28222o3883p53619J27994N982
$$ 11211195 10942649 10858920 10742144 10516079 10199617 10327839 10263956 9510337 9638331 9644313
16617I644313j43728K99563o39369r4219n32735J72336j64474J50307k12498n64031
$$ 9644313 9500585 9800148 9160779 9066560 8533825 8706161 8541687 8691994 8479496 7915465
16607G915465J15463j02024N69364p31706n3740M9277l82185L55883n25725m370
$$ 7915465 8030928 7928904 8498268 7766562 7712822 7762099 7379914 7735797 7210072 7205702
16597G205702j58754r428j88388J5110r8764J0309r9534l42560O9582j07226q5369
$$ 7205702 7046948 7037520 6849132 6864242 6765478 6775787 6676253 6333693 6403275 6296049 6210680
16586F210680J06045p7058k64632k47372R8974O4024j60253J08119j19763j96735
$$ 6210680 6316725 6239667 5975035 5727663 5826637 5890661 5730408 5838527 5718764 5522029
16576E522029j81760k53549P25163o28737R8124n0949J25140l43324m8306j54672
$$ 5522029 5340269 5086720 5811883 5183146 5281270 5230321 5355461 5012137 4963831 4809159
16566D809159J75174k77064K15275J8636j36444p9605L7217l27511J94029j87798
$$ 4809159 4984333 4707269 4922544 4941180 4804736 4725131 4762348 4434837 4628866 4441068
16556D441068L59686n38316Q353M01623m44387o7854L43603l74071j94781K89931
$$ 4441068 4800754 4262438 4270791 4672414 4228027 4160173 4503776 4129705 3934924 4224855
16546D224855n25084L37913j13602K206k12797L23853j40520m1323j03671o565
$$ 4224855 3699771 4037684 3924082 3926288 3713491 4037344 3896824 3855501 3751830 3745265
16536C745265Q2481k03433k08916J06005k7344K89376n55352K75899J86649l86889
$$ 3745265 3827746 3624313 3415397 3521402 3494058 3783434 3228082 3503981 3690630 3303741
16526C303741K98573l61111J88735k76422M03804Q9667o39541N92221m59247K76952
$$ 3303741 3602314 3241203 3429938 3153516 3557320 3646987 3007446 3599667 3140420 3417372
16516C417372k84850l9322j99754R1173j12933K11984j59070k0978k4653n7741
$$ 3417372 3132522 3093200 2893446 2984619 2871686 3083670 2924600 2903622 2878969 2821228
16506B821228M04332k08164k72944j05194K43834p6659p1502L69978o30079J24511
$$ 2821228 3225560 3017396 2744452 2639258 2883092 2806433 2734931 3104909 2474830 2599341
16496B599341L03502j96448J0662l22610J92045m6220n966R9105p5133j62711
$$ 2599341 2902843 2706395 2717057 2394447 2586492 2540272 2534306 2633411 2558278 2395567
16486B395567J21963K92686k59071M4216k26820M12747o5608o25889L10349L7429
$$ 2395567 2517530 2810216 2551145 2595361 2368541 2781288 2715680 2089791 2400140 2437569
16476B437569r8467O1869k0296r9237k05386l8121Q9962M36524j1722k50766m46572
$$ 2437569 2339102 2400971 2380675 2281438 2076052 2037931 2127893 2564417 2552695 2301929 1855357
16465A855357M79548k93333J72341k07126L74855j75047k22349L71519k59120
$$ 1855357 2334905 2041572 2213913 2006787 2381642 2206595 1984246 2355765 2096645
16456B096645m24233K76685J53596Q1425r234n3134J539r7132k1929L9452J4905
$$ 2096645 1672412 1949097 2102693 2184118 2174884 2121750 2123289 2026157 2004228 2043680 2058585
16445B058585j35976L09840k00510J46156l30630k57564J68694j91209L06376
$$ 2058585 1922609 2232449 2031939 2178095 1847465 1589901 1758595 1567386 1873762
16436A873762j40477p3691K92718m20525L12487k2315j79711R580J88893q1218
$$ 1873762 1733285 1659594 1952312 1531787 1844274 1821959 1642248 1651828 1840721 1759503
16426A759503m7984k2889P9628j44206O633j08573J92847J08346J15404j00748
$$ 1759503 1711519 1688630 1768258 1624052 1630685 1522112 1714959 1823305 1938709 1837961
16416A837961M7283j52417o0860k56510J64972K22087l24389j00018L53462k40181
$$ 1837961 1885244 1732827 1671967 1415457 1580429 1802516 1478127 1378109 1731571 1491390
16406A491390R2726k62429L71599j6422J84672m07312K25289m39396K29782K14154
$$ 1491390 1584116 1321687 1693286 1676864 1861536 1454224 1679513 1240117 1469899 1684053
16396A684053o4188n049j57264K18626J32249k66342j31989n3895M20796m84732
$$ 1684053 1619865 1614816 1457552 1676178 1808427 1542085 1410096 1356201 1776997 1292265
16386A292265J35959K43856m33133J80772K22227J08035k66314j8960k61612M86515
$$ 1292265 1428224 1672080 1238947 1419719 1641946 1749981 1483667 1464707 1203095 1689610
16376A689610k47765M0324k33032P7374L4009m0469K29554j08510l31142L16526
$$ 1689610 1441845 1482169 1249137 1326511 1360520 1320051 1549605 1441095 1109953 1426479
16366A426479M0051l7065n6777K6851m6051l01351K26148O2387j97055N41004
$$ 1426479 1466530 1429465 1372688 1399539 1353488 1052137 1278285 1340672 1143617 1684621
16356A684621l95671p8423K12195j30153K75580l92534Q7195j92399J91510j70241
$$ 1684621 1288950 1210527 1422722 1292569 1568149 1175615 1262810 1070411 1261921 1091680
16346A091680J29660O2102N760j00944m20451N49651j89940j1973k27411J94088
$$ 1091680 1221340 1283442 1289202 1188258 767807 1317458 1127518 1115545 888134 1082222
16336A082222n1108K35104k28608K27488r491l9181j04375k63875L9956j97908
$$ 1082222 1031114 1266218 1037610 1265098 1255607 1216426 1112051 848176 888132 690224
16326F90224L39470J99322n2619l47958P7563J57209j99690K13573k00q6486K31886
$$ 690224 1029694 1229016 1176397 828439 906002 1063211 863521 1077094 1076894 990408 1222294
16315A222294k87316K35247l50568K04064k02822L88180j3301j38541m05079M91004
$$ 1222294 934978 1170225 819657 1023721 820899 1209079 1195778 1057237 652158 1143162
16305A143162j65956J75331k99627J23749J90322q7809O4090j03095j18521j83903
$$ 1143162 977206 1152537 852910 976659 1166981 1079172 1143262 1040167 921646 737743
16295G37743R699K31366R3656j37305j06532K16003k35359J58064j60860j1246
$$ 737743 747442 978808 1072464 935159 828627 1044630 809271 967335 806475 795229
16285G95229K66096p3214k81976o626K38050J31862q4580l1845j2215K8661p7737
$$ 795229 1061325 988111 706135 699509 937559 1069421 984841 952996 940781 969442 891705
16274H91705J56609j68612l47625K09507L03474J30548l08332o001k68400K78696
$$ 891705 1048314 879702 532077 741584 1045058 1175606 867274 861273 592873 871569
16264H71569P431k3863J9398N2639o9169L5170k84323M24897R35j05303k60581
$$ 871569 879000 855137 874535 927174 858005 893175 608852 1033749 1034684 929381 668800
16253F68800R0325k65532L11095O6867k77741K61609j48803N9754O8229l3058
$$ 668800 759125 493593 804688 871555 593814 855423 706620 766374 834603 801545
16243H01545r3986k5930j04351N7543O2369J46974k93211M7088j92277M39537
$$ 801545 707559 681629 577278 634821 697190 844164 550953 598041 405764 845301
16233H45301j66933k15495k9498M21025j50765R3823k75455L88332l52740K84093
$$ 845301 678368 462873 433375 854400 703635 797458 522003 910335 557595 841688
16223H41688k9657K26204m59006k8874N3131J17378j74084J92772J6067j94193
$$ 841688 812031 1038235 579229 550355 603486 720864 546780 739552 755619 561426
16213E61426j48775k5923K42704R8968j27323m5482K35395B64287j7884N78126
$$ 561426 412651 386728 629432 728400 601077 555595 790990 264287 246403 824529
16203H24529k48496q8036j02115j44814L41760K29200k31944k53090M80130l60978
$$ 824529 576033 487997 385882 241068 582828 812028 580084 326994 807124 446146
16193D46146J12116j88126K23647l9548J6175j3422O3086m5103K47755B38371
$$ 446146 558262 370136 593783 554235 570410 556988 620074 574971 822726 238371
16182E83977k83904Q0771l3803K2142L56949j03835B05952M83043r0494B08205
$$ 583977 300073 380844 347041 369183 726132 622297 205952 688995 598501 208205
16171D29033N03703D53219K52939j42156q2597l9039q3702A49867K83118J43226
$$ 429033 932736 453219 706158 564002 481405 442366 358664 149867 432985 576211
16161E76211j78180N5215N2835j02761r9625j0156P4082M97889l31528O9969m7743
$$ 576211 398031 453246 506081 403320 303695 293539 367621 865510 533982 603951 556208
16150E56208j16598q2672o6954J68942p800Q4630A90326O4236J59895O6168I7079
$$ 556208 439610 356938 289984 458926 451126 535756 190326 254562 414457 480625 97079
16138C88299J83666B61166K01894k23161J45198J4059K5739j70140N13737A98900
$$ 388299 571965 261166 463060 239899 385097 399156 424895 254755 768492 198900
16127D60972K11547k10140J77207K30388l41658B09872M35456l10191K1294m4523
$$ 460972 672519 462379 639586 869974 528316 209872 645328 335137 356431 311908
16117C11908K63259E1931L63866J39156A33020K23047K84889o4983k75798K30910
$$ 311908 575167 51931 415797 554953 133020 356067 640956 575973 300175 531085
16107E31085j46499k8771e3127D15320o9482I3173J41403l1253I8497a0332C05069
$$ 531085 384586 355815 -53127 415320 345838 93173 234576 203323 98497 -10332 305069
16095A70513R0366K92002f4677C45658P3849B07362L0084J14902j45157n7747
$$ 170513 260879 552881 -64677 345658 419507 207362 237446 352348 207191 149444
16085A49444N81429l37942j91462J47870O566j28660J8595q3534C0593A1630L34966
$$ 149444 730873 392931 201469 349339 355905 227245 245840 162306 30593 11630 346596
16074C46596H7644J70894O4649b4905o605B53099J24648K9362A10233L96219E6466
$$ 346596 87644 258538 323187 -24905 -31510 253099 377747 407109 110233 506452 56466
16062A93806o0633N3061J09711e3397E55299A37933L4217l4746c7661A49156M62901
$$ 193806 133173 186234 295945 -53397 555299 137933 172150 137404 -37661 149156 612057
16051F12057k05121A17089M0613G5646L25959A99309l9647b4961A1119O6144B812
$$ 612057 406936 117089 157702 75646 401605 199309 159662 -24961 11119 77263 2812
16039H0689K44226g1582B18067n0929L27153A30421F1310M08728a961C10829a41492
$$ 80689 324915 -71582 218067 167138 494291 130421 61310 470038 -1961 310829 -141492
16027D02851g1804C35170p6385A2611f5381G0239Q2030a80796A87968J71955A47958
$$ 402851 -71804 335170 258785 12611 -65381 70239 152269 -180796 187968 359923 147958
16015A24605K66429H1033J35032g464B94535D8718J02190q308M0157d5410C60493
$$ 124605 391034 81033 216065 -7464 294535 48718 150908 142600 182757 -45410 360493
16003D3309K99726F9690J90684o6988e5306A55758K6791J68114J48550I9131J50435
$$ 43309 343035 69690 260374 193386 -55306 155758 182549 350663 499213 99131 249566
15992B49566R3608K2384o1264j1961L02761M88622l60596K1073l00324j6080j11332
$$ 249566 343174 365558 304294 292333 595094 1083716 723120 744193 443869 427789 316457
15981C16457j18389K22939e2178A55902b4134B06892Q82A01273h5762o8814G9783
$$ 316457 198068 421007 -52178 155902 -24134 206892 207774 101273 -85762 -154576 79783
15969B42968l2330K679a22706B10358g4252B23713a13350a1949D88198L1706B07489
$$ 242968 210638 213317 -122706 210358 -74252 223713 -113350 -11949 488198 519904 207489
15957b04867B33746I42a71752B14934r0832j1522A6198P1580L07834a72751a6354
$$ -204867 233746 942 -171752 214934 124102 112580 16198 87778 395612 -172751 -16354
15945a19180B52842b58063L390A39087K4276l4073a94291I248O5175c3703E4674
$$ -119180 252842 -258063 -254673 139087 163363 129290 -194291 9248 74423 -33703 54674
15933B76464c1402A42235b06144I2452K4812e5704A53151a9146A81440b9962l66538
$$ 276464 -31402 142235 -206144 92452 117264 -55704 153151 -19146 181440 -29962 -396500
15922c96500B23579a2428A03967J07896D4145a62521A40376a31512B06889l3512
$$ -396500 223579 -12428 103967 211863 44145 -162521 140376 -131512 206889 173377
15912A73377q2583A1458a02187A55613E6055L1836Q5018h6342j3856B06857L4366
$$ 173377 90794 11458 -102187 155613 56055 87891 172909 -86342 -100198 206857 241223
15901B41223J2673h4046A86965K72235F3990L11638c17427a2157F0878K0484J27203
$$ 241223 253896 -84046 186965 459200 63990 375628 -317427 -12157 60878 81362 208565
15890B08565A2434h289p9312D9260K12956c4855j38820I2727l5927J47484b30922
$$ 208565 12434 -8289 -87601 49260 262216 -34855 -173675 92727 56800 204284 -230922
15878B5076L27587g8150B23958a126A19469a6230A45785a14811M1885k6184I2912
$$ 25076 352663 -78150 223958 -1126 119469 -16230 145785 -114811 -72926 -99110 92912
15866A2349J2169N461J69954a64899A70208O2989a24850b560I5053L9782E1699
$$ 12349 24518 29979 199933 -164899 170208 233197 -124850 -2560 95053 134835 51699
15854H5108L7528j7775L1580g6628A36423d3818L939A7704R9424f474A18731b22266
$$ 85108 122636 104861 136441 -76628 136423 -43818 -39879 17704 117128 -6474 118731 -222266
15841A01528a26747B10169D6452e3036I1360l8364J06756p970E129d26727B79177
$$ 101528 -126747 210169 46452 -53036 91360 52996 159752 151782 5129 -426727 279177
15829A18886n3603c8487n9737D61272b8140k3059D6958N0562a7305j4349B17311
$$ 118886 65283 -38487 -98224 461272 -28140 -51199 46958 97520 -17305 -31654 217311
15817d9255F3975B4361c11952D8332l914J09862O741a95930c6055A26181A5775
$$ -49255 63975 24361 -311952 48332 44418 154280 161021 -195930 -36055 126181 15775
15805A59264D0046J50752D3571K44702a10158l8476A47493H579J3354K2833G171
$$ 159264 40046 190798 43571 288273 -110158 -148634 147493 8579 21933 44766 7171
15793a7927j84336q0545e4243m0072A210b74781A5660K13157b42600l2632d3951
$$ -17927 -202263 -282808 -54243 -94315 1210 -274781 15660 228817 -242600 -275232 -43951
15781C7827d2919C30016A5449J15813d91306E828a80458B57196Q364B6726O8481
$$ 37827 -42919 330016 15449 131262 -491306 5828 -180458 257196 265560 26726 95207
15770I5207d3152B23901E0332j6276a41056B7318h4548b750B75498d76314I6658
$$ 95207 -43152 223901 50332 34056 -141056 27318 -84548 -2750 275498 -476314 96658
15758a73732B88519j26785P4721O6723A35113b72044i3416I2244M4157a07014
$$ -173732 288519 161734 236455 303178 135113 -272044 -93416 92244 136401 -107014
15747G6067b13549B10857a49519A24042N6740b27221d6185J3916J3662o0976A39462
$$ 76067 -213549 210857 -149519 124042 180782 -227221 -46185 -32269 -18607 -79583 139462
15735B1351d9782C8484L80483b65098B55312G4881N835b46435A15503p358k7479
$$ 21351 -49782 38484 418967 -265098 255312 74881 80716 -246435 115503 108145 80666
15724H0666a4286j98682b6480B934a19667A38812F217b47374B4008a65250A7924
$$ 80666 -14286 -212968 -26480 2934 -119667 138812 6217 -247374 24008 -165250 17924
15712a70772N6688a0786B20181i6890l5427j10742C59399a42674D2126a54521
$$ -170772 -114084 -10786 220181 -96890 -132317 -243059 359399 -142674 42126 -154521
15701B91483a91910d722k34687A12589b8039B2919J69744a5607A32588J61938
$$ 291483 -191910 -4722 -239409 112589 -28039 22919 192663 -15607 132588 294526
15691B94526a52315b2043F4371l1345L5943b18581D770a45712d2866j66391E4767
$$ 294526 -152315 -22043 64371 33026 68969 -218581 4770 -145712 -42866 -209257 54767
15679B3377a54732J6620q4548g8242j4111A70332j4374a43623K9274k36457J39575
$$ 23377 -154732 -138112 -222660 -78242 -92353 170332 155958 -143623 -114349 -350806 -211231
15668b11231A11911L0842C370M7758c02341a7124j08116f0257G4332b89619a9490
$$ -211231 111911 142753 3370 51128 -302341 -17124 -125240 -60257 74332 -289619 -19490
15656B43003Q7427a9602k11771a05266A42712b93140g4683k78981B85663l9523
$$ 243003 330430 -19602 -231373 -105266 142712 -293140 -74683 -353664 285663 246140
15646B46140b06948k03692a8295K956k36849j04418b5678l3225b758A29028b0090
$$ 246140 -206948 -410640 -18295 -15339 -252188 -356606 -25678 -58903 -2758 129028 -20090
15634a58548f1890A01963A2220c7306B0495c07307g7625B04330b76172e8427C7977
$$ -158548 -61890 101963 12220 -37306 20495 -307307 -77625 204330 -276172 -58427 37977
15622d5853r9302c4483A1061c90566a39811j73068A52185D3141a9442k22886a04264
$$ -45853 -145155 -34483 11061 -390566 -139811 -312879 152185 43141 -19442 -242328 -104264
15610G1582L8314n4877b08352F9013e9251l5503C26580r8683A03857a36198R388
$$ 71582 109896 55019 -208352 69013 -59251 -94754 326580 227897 103857 -136198 -126810
15599a26810B74415j27792a16113k98283f780E118a54949H9992a94333B91580
$$ -126810 274415 146623 -116113 -414396 -6780 5118 -154949 89992 -194333 291580
15588g5640G5067e2236m3728d6490B03416a76203O9590B58862m4268b32019A78485
$$ -75640 75067 -52236 -95964 -46490 203416 -176203 -106613 258862 214594 -232019 178485
15576A57730n3749J32696J6612c5724A42706h8505m1373c2750A62263K1579a32816
$$ 157730 103981 236677 253289 -35724 142706 -88505 -129878 -32750 162263 183842 -132816
15564A10815a62381B9052b25493O6304C7552J21201J20405e0921B05458a45575
$$ 110815 -162381 29052 -225493 -159189 37552 158753 279158 -50921 205458 -145575
15553B24183h0023k49936B18865f6442c689m9574j89100C20399f3209A23120B7518
$$ 224183 -80023 -329959 218865 -66442 -3689 -53263 -242363 320399 -63209 123120 27518
15541A39624A3400J86522a24408m4595d7699B27043N3025d0541j5099j07140A94336
$$ 139624 13400 199922 -124408 -169003 -47699 227043 280068 -40541 -55640 -162780 194336
15529a63050B977a47357H2159a58286m1904B63413n6478k0523j0971b8875D27953
$$ -163050 2977 -147357 82159 -158286 -200190 263413 206935 186412 175441 -28875 427953
15517A40826f2973D3787a05060L5471j57048Q9153A96397b52144m0478f5719j43680
$$ 140826 -62973 43787 -105060 -69589 -226637 -137484 196397 -252144 -292622 -65719 -209399
15506b09399B14255b22390k2930c2101q4851C3694K57376A31109a64499A1280
$$ -209399 214255 -222390 -245320 -32101 -116952 33694 291070 131109 -164499 11280
15495d337j35282A22127a43877l1831A06406e5891j00896a0089k35943A68520
$$ -4337 -139619 122127 -143877 -175708 106406 -55891 -156787 -10089 -246032 168520
15484e6245r6729b2540N762n1127J2568E7161b1827A09470R4450G1448L5214J49048
$$ -56245 -152974 -22540 -16778 -67905 -55337 57161 -21827 109470 203920 71448 106662 255710
15472B55710g5452o4592D873a16508a5734A13406a00868B19342b40784C335J76118
$$ 255710 -75452 -140044 4873 -116508 -15734 113406 -100868 219342 -240784 3335 179453
15461A79453a50861A82127b51932a02925A692O4109c77159G4396b1914I3971J45783
$$ 179453 -150861 182127 -251932 -102925 1692 65801 -377159 74396 -21914 93971 239754
15450B39754D9321g660A3900f6891H606J23566M27132p1490K10569B50770C5956
$$ 239754 49321 -7660 13900 -66891 8606 132172 559304 487814 698383 250770 35956
15438A66648J30670o5247C6687c04128A93892J09554I5752l7403a7377A10554
$$ 166648 297318 232071 36687 -304128 193892 303446 95752 58349 -17377 110554
15427E1065d27708K12386L6119c4420B04761g7630K8498j4088D7912c21154e0107
$$ 51065 -427708 -215322 -179203 -34420 204761 -77630 -49132 -63220 47912 -321154 -50107
15415a42594A03911c86876C4445a42903c5267o6982k30449f9340k47578J38706
$$ -142594 103911 -386876 34445 -142903 -35267 -102249 -332698 -69340 -316918 -178212
15405a78212j01443h9311c3442a2212C23601G2295I582Q980c8306A33200g5958
$$ -178212 -279655 -89311 -33442 -12212 323601 72295 9582 18562 -38306 133200 -75958
15393A79408a41966A85680O8466E6458F97b47466d8031C41872b3927G3667K15561
$$ 179408 -141966 185680 254146 56458 697 -247466 -48031 341872 -23927 73667 289228
15382B89228C3057b32918c6290A66497i1669F9016J7083J03464p5955j0877Q7095
$$ 289228 33057 -232918 -36290 166497 -91669 69016 86099 189563 113608 102731 189826
15371A89826i2318C08353A24179J33466o1586a18234D6276f7036H7824B2656i1514
$$ 189826 -92318 308353 124179 257645 196059 -118234 46276 -67036 87824 22656 -91514
15359a06043K9355J3647B55557K36028a54415B16923J19723A29347a27866r829
$$ -106043 -76688 -63041 255557 491585 -154415 216923 336646 129347 -127866 -137695
15349a37695B97329i1132b638A81928j5215B0367e160D0488K25360o512K04803
$$ -137695 297329 -91132 -2638 181928 166713 20367 -5160 40488 265848 259336 464139
15338D64139A27313K26957C9428M4283b32719D4449j4436J00804a20033K8825
$$ 464139 127313 354270 39428 83711 -232719 44449 30013 130817 -120033 -91208
15328i1208A16046a329A96225D5980B2467K54405r1905A3601e5539L793B5306
$$ -91208 116046 -1329 196225 45980 22467 276872 184967 13601 -55539 -51746 25306
15316B49424I6990a45079O5142A06425c0394A03677J25950a73593O4243N1386
$$ 249424 96990 -145079 -79937 106425 -30394 103677 229627 -173593 -109350 -57964
15306e7964B91287I1339a22422B17416m0020A6460J77637G6776J02963h5147A39847
$$ -57964 291287 91339 -122422 217416 177396 16460 194097 76776 179739 -85147 139847
15294B25137J2315b15437k1234a00191D2492g3233b5870o0028j43662A15421m6431
$$ 225137 237452 -215437 -236671 -100191 42492 -73233 -25870 -85898 -229560 115421 68990
15283F8990N7066g9582B23436a22450N5717D6032a97151H1999a06341K0967F4242
$$ 68990 126056 -79582 223436 -122450 -66733 46032 -197151 81999 -106341 -85374 64242
15271A79652A1716J50131J45136a21462A31554b28122A88587c556j26128O2204
$$ 179652 11716 161847 306983 -121462 131554 -228122 188587 -3556 -129684 -67480
15261f7480B38196b5934j15429L5319j80242h6336B3348R493M5720Q8058J44835
$$ -67480 238196 -25934 -141363 -106044 -286286 -86336 23348 32841 78561 166619 311454
15250C11454p7586R49553P57278I34375R50115p44673E57718k561c5007A84384
$$ 311454 233868 1183421 1940699 934375 1884490 1139817 557718 555157 -35007 184384
15239b8657j09604A54953J55332g5897k4516B24735I3745C3615e7706L551A71174
$$ -28657 -138261 154953 310285 -75897 -100413 224735 93745 33615 -57706 -54155 171174
15227H9578P6528m801J02116j08273c05858c1701E8516b45878A9217p317a42681
$$ 89578 166106 161305 263421 155148 -305858 -31701 58516 -245878 19217 11900 -142681
15215A97799i572A0398P3886J24216b12522F3119a05893A10992R6140a1741H650
$$ 197799 -9572 10398 84284 208500 -212522 63119 -105893 110992 207132 -11741 8650
15203B57098j12695i2640j8014A07719j7029L9559i5772k3158A37217e4980A60019
$$ 257098 144403 -92640 -110654 107719 90690 130249 -95772 -118930 137217 -54980 160019
15191B10782b00525C2722J25866M3111b8527f814j27075e2221A29974B8512R0280
$$ 210782 -200525 32722 158588 201699 -28527 -6814 -133889 -52221 129974 28512 118792
15180A18792I935a31373A27345a12565A15206A0608Q8122N0260a82094k1294A8317
$$ 118792 9935 -131373 127345 -112565 115206 10608 98730 148990 -182094 -203388 18317
15168B89518d551A98222M5930k3084A1720O5733J5033J6657J45193J65880L4829
$$ 289518 -4551 198222 244152 221068 11720 77453 92486 109143 254336 420216 455045
15157D55045A98365m2425M9839M1255A04570J25403q5035a01281c2432A2376J8210
$$ 455045 198365 155940 205779 247034 104570 229973 144938 -101281 -32432 12376 30586
15146C0586K77733h1588n7343O5559A19980R4458B2001J19141k6325J25093a7631
$$ 30586 308319 -81588 -138931 -73372 119980 214438 22001 141142 114817 239910 -17631
15134A11814A0283b12166D8771a1467A03952R805A573f1518A58508D6413K32892
$$ 111814 10283 -212166 48771 -11467 103952 113757 1573 -61518 158508 46413 279305
15123B79305A24517j2706a30418B63698N7057A0938K31175K60780a45980P2392
$$ 279305 124517 111811 -130418 263698 320755 10938 242113 502893 -145980 -73588
15113g3588A71803g5774E2250c39808a35500M0820a7484A4088P5407b4920B42348
$$ -73588 171803 -75774 52250 -339808 -135500 -94680 -17484 14088 89495 -24920 242348
15101A3627J07458c83929B48801P1610H997N00795B8993e6496B41798N6383l7901
$$ 13627 121085 -383929 248801 320411 8997 509792 28993 -56496 241798 298181 260280
15090B60280A24863N2705l0644J98741j64934i9288J4836b6482I4247B870J9911
$$ 260280 124863 177568 146924 345665 180731 -99288 -84452 -26482 94247 2870 22781
15079B2781J57870J99088r8717k9399o8724O9647B1612c804B51480c105C86522
$$ 22781 180651 379739 281022 251623 182899 252546 21612 -3804 251480 -3105 386522
15067c1291B79803b09889A50938J58532A13704J72632j42941M2324k2983a38918
$$ -31291 279803 -209889 150938 309470 113704 286336 143395 185719 162736 -138918
15056B47977P644b14989C01046a765E045J94889J37195A08477J80581k7867O598
$$ 247977 255621 -214989 301046 -1765 5045 199934 337129 108477 289058 261191 267789
15045B67789H3959p856J91027J01731a90458i3597G0203e3126H4916J27503J60331
$$ 267789 83959 76103 267130 368861 -190458 -93597 70203 -53126 84916 212419 372750
15034C72750A34191O4936p7686m5658a9480C05023D6669K09592P194M4535Q944
$$ 372750 134191 199127 121441 75783 -19480 305023 46669 256261 263455 307990 316934
15023C16934R9646j37712F0607O4170J71292A6623M3008M31775B05148P3113J22198
$$ 316934 416580 278868 60607 124777 296069 16623 59631 491406 205148 278261 400459
15012D00459A32197J20014b57992A45710K12849e755F11213j55974p8965E0099
$$ 400459 132197 252211 -257992 145710 358559 -5755 611213 455239 376274 50099
15001D82886A01118N8913a09947D82908p2869q7133J99859j68084J979K74645
$$ 482886 101118 160031 -109947 482908 410039 322906 522765 354681 356660 631305
14991F31305k63820H9576K82770a64B37849J2198O0239J9899I3216L82001A47688
$$ 631305 367485 89576 372346 -164 237849 250047 310286 330185 93216 475217 147688
14979B12380K11906L38988B94060R2333l3098k9642J37089B17921l9298J5343
$$ 212380 424286 763274 294060 386393 353295 323653 460742 217921 178623 193966
14969A93966J43116J63715j67190J69675j51743O4713J08156B50963o3470l1912
$$ 193966 337082 500797 333607 503282 351539 416252 524408 250963 187493 155581
14959A55581n7474K17959J75295k2750A99978J02708J55912j41686j04005N5562
$$ 155581 98107 316066 491361 468611 199978 302686 458598 316912 212907 268469
14949B68469o88a38889D1516K66843K33915q7332n8743A93514J3332J57628m9965
$$ 268469 267781 -138889 41516 308359 542274 454942 396199 193514 206846 364474 314509
14938C14509J26024a1101B28932L15604j56820j27860K20538a6775C91630j85500
$$ 314509 440533 -11101 228932 544536 387716 259856 480394 -16775 391630 206130
14928B06130K68677P568K21370C18208J78293B46203M79436J47667q4576Q1643
$$ 206130 474807 482375 703745 318208 496501 246203 725639 873306 788730 870373
14918H70373J45885k0427K02972l99488j11360J4527K49699D35611J25923k04731
$$ 870373 1016258 995831 1198803 799315 687955 702482 952181 435611 561534 356803
14908C56803J40172j12868j81676J86786j52291J73482J96553k10277A9891K71471
$$ 356803 496975 384107 202431 389217 236926 410408 606961 396684 19891 291362
14898B91362O3946K08988A31598L26861F5545J89J35418q7669P5981J68169l1908
$$ 291362 355308 564296 131598 458459 65545 65734 201152 113483 189464 357633 325725
14887C25725J91731K59050l54579A63925J87085K4390n2230J51270B09562L44850
$$ 325725 517456 776506 421927 163925 351010 375400 323170 474440 209562 554412
14877E54412k59844m5680j10889K73129m4393O00370A88722r471L01478j35229
$$ 554412 294568 248888 137999 411128 366735 967105 188722 179251 480729 345500
14867C45500J14999K4285j84430L50095k78181C3208K51881p6241L3241k6655
$$ 345500 460499 484784 300354 650449 372268 33208 285089 208848 242089 215434
14857B15434p6846J16519J10495K7681m7851G4819L00400j3425J35067j93942
$$ 215434 138588 255107 365602 393283 345432 74819 375219 361794 496861 302919
14847C02919l3677J56264J83854K1069k37694K21331O0962j38361N75787E21955
$$ 302919 269242 425506 609360 630429 392735 614066 675028 536667 1112454 521955
14836E70358o9043m5745R2002j15309l6889K01945j81163J39146B13824r9367
$$ 570358 501315 455570 547572 432263 395374 597319 416156 555302 213824 114457
14826A14457J03912I7577L85095k5619J11203J8900o166k75124J55658J7981N7658
$$ 114457 218369 97577 482672 457053 568256 587156 580990 305866 461524 479505 537163
14815E37163j36795j25931K74551k929k4278N7613j14170R075J15678k25377r593
$$ 537163 400368 274437 548988 546059 521781 579394 465224 474299 589977 364600 355007
14804C55007J44251J80467o0909J83321M2044k55486j41083L84874A64072M27605
$$ 355007 499258 679725 618816 802137 844181 588695 447612 832486 164072 591677
14794E91677j00657k25301J22801K10502B43723K88650B58197J70231j77866n9676
$$ 591677 491020 265719 388520 599022 243723 532373 258197 428428 250562 190886
14784A90886Q2898K6648K84091j32889m4399K13161O2405B73557j20585J18143
$$ 190886 273784 300432 584523 451634 407235 620396 682801 273557 152972 271115
14774B71115K70033K13595j43564B59622K7747K65610o242j46316K89421j06489
$$ 271115 541148 754743 611179 259622 287369 552979 546737 400421 689842 583353
14764E83353j17452P6949R0210j31579J03935J76838l22798A57195K68968j5732
$$ 583353 465901 542850 633060 501481 605416 782254 459456 157195 426163 410431
14754D10431L31106C29975K08176J3795J76704p9388B21564K30939n5614k6632
$$ 410431 741537 329975 538151 551946 728650 649262 221564 452503 396889 370257
14744C70257M14253C61338J21272j48227A39039M39082j69729J74864K78887L7334
$$ 370257 784510 361338 482610 334383 139039 578121 408392 583256 862143 899477
14734H99477l92472J51477O8990l17942K46794K09272m04165M21776J71542k10917
$$ 899477 507005 658482 727472 409530 656324 865596 461431 883207 1054749 843832
14724H43832Q1212j62115N5517K57430k78374R6444J8980K72025n72295K82186
$$ 843832 925044 762929 818446 1075876 797502 893946 912926 1184951 612656 894842
14714H94842j98826C34747J24883J68086L72959k44342B78731N55109O7605p2047
$$ 894842 696016 334747 459630 627716 1000675 756333 278731 833840 901445 829398
14704H29398j59660J66970k79243o5015N93550l09018N1953L38159j3372l0362
$$ 829398 669738 836708 557465 492450 1086000 776982 828935 1167094 1153722 1123360
14694A123360j00522j01433J95443j73641j71916J12255l96416M28757j68376
$$ 1123360 1022838 921405 1116848 943207 771291 883546 487130 915887 747511
14685G47511l14394N58084m13427J94056j88724J33163L9768j37975J96628J36564
$$ 747511 433117 991201 577774 771830 583106 716269 756037 618062 814690 951254
14675I51254l84601M17763m04686K88944j44180K14909j56919L41002k01371j62401
$$ 951254 566653 984416 579730 868674 724494 939403 782484 1123486 922115 759714
14665G59714J31214q7041k26432J02293K22194j72717K28186j13391L3405j73961
$$ 759714 890928 803887 577455 679748 901942 729225 957411 844020 877425 703464
14655G03464M41533l63289J10993J89925k98257l1855R1670J91565K5000k7710
$$ 703464 1144997 781708 892701 1082626 784369 752514 844184 1035749 1060749 1033039
14645A033039j41829K59150k04906j22636R7777O6170J5671k58633L62828m0890
$$ 1033039 891210 1150360 945454 822818 920595 986765 1002436 743803 1106631 1065741
14635A065741n2052Q7697P5644j86575P2387p916j41591k8319K34256k22744L42991
$$ 1065741 1013689 1101386 1177030 990455 1062842 1054926 913335 885016 1119272 896528 1239519
14624A239519k04650K29872j43989j52213K4901j56453N09482k73449J0704M38866
$$ 1239519 1034869 1264741 1120752 968539 993440 836987 1346469 1073020 1083724 1522590
14614A522590m37837K97502p4421j56938j78067K89486j23796M26441k63078J29293
$$ 1522590 1084753 1382255 1307834 1150896 972829 1262315 1138519 1564960 1301882 1431175
14604A431175m90926P1360J89489j91213L46462j37692m4187J49353K08134m45646
$$ 1431175 940249 1011609 1201098 1009885 1356347 1218655 1174468 1323821 1531955 1086309
14594A086309O8133P4302K16991K0819m334l21148N4463L06969k47171J05368
$$ 1086309 1154442 1228744 1445735 1466554 1462220 1141072 1195535 1502504 1255333 1360701
14584A360701K99735l00427m4124K52584k60377M74016k69139K8756J90414k10170
$$ 1360701 1660436 1360009 1315885 1568469 1308092 1782108 1512969 1541725 1732139 1521969
14574A521969K03953k3000O7476k50250J92212k28780L45511J12072o2740m4190
$$ 1521969 1725922 1702922 1770398 1520148 1712360 1483580 1829091 1941163 1878423 1834233
14564A834233P419L61733J44132k24437L31931m05858Q3345K28873M2818K71044
$$ 1834233 1841652 2203385 2347517 2123080 2455011 2049153 2132498 2361371 2404189 2675233
14554B675233K29850L41807M69715J91696R69010K056035L702443Q124489J7007553
$$ 2675233 2905083 3246890 3716605 3908301 4877311 6933346 10635789 18760278 35767831
14545C5767831J811744j8429834H520335m192099j471724o03617m14432J61598
$$ 35767831 37579575 19149741 8520335 4328236 2856512 2252895 1838463 2000061
14537B000061l33716p5730M7425j09918O3329l1989j44824N73664j42576l7802
$$ 2000061 1666345 1590615 1638040 1528122 1591451 1559462 1414638 1988302 1845726 1807924
14527A807924O4282j2887j38138K82070J19552l78730j2502M84322J39310k94356
$$ 1807924 1872206 1859319 1721181 2003251 2122803 1744073 1731571 2215893 2355203 2060847
14517B060847j43605n5210K62063P2768j59323J49150k09425L62342k46127Q8564
$$ 2060847 1917242 1862032 2124095 2196863 2037540 2186690 1977265 2339607 2093480 2182044
14507B182044M5043j57282K99428j02352L26576l28376K37096R6975k68150O15098
$$ 2182044 2227087 2069805 2369233 2266881 2593457 2265081 2502177 2599152 2331002 2946100
14497B946100j91765j74013K90288k44415K9830L79888m2316k81162m9955J74235
$$ 2946100 2754335 2580322 2870610 2626195 2656025 3035913 2993597 2712435 2662480 2836715
14487B836715J26903j2674J54379k53847K75845J65257l33376QJ58890Q0253L6590
$$ 2836715 2963618 2950944 3105323 2851476 3127321 3292578 2959202 2959210 3118100 3198353 3234943
14476C234943M04248j30955j04453j39571J70049j45304O0297J25298J16444O9999
$$ 3234943 3639191 3508236 3403783 3264212 3434261 3288957 3349254 3474552 3590996 3660995
14466C660995j06160L27638l21248L15272o823k55266L97060k06778J0770p1088
$$ 3660995 3554835 3882473 3561225 3876497 3869674 3614408 4011468 3804690 3815460 3744372
14456C744372L17249k43021K66233J26854L8426Q4807O5927J69239m1577p2768
$$ 3744372 4061621 3818600 4084833 4211687 4250113 4334920 4400847 4570086 4528509 4455741
14446D455741O23K59282k58316N82760m2852l17188K78114J24090r9740L27900
$$ 4455741 4456364 4715646 4457330 5040090 4997238 4680050 4958164 5082254 4982514 5310414
14436E310414m0332m6873N3618J9844J89825J42287Q61j49386M44991J34284k7069
$$ 5310414 5270082 5223209 5276827 5296671 5486496 5628783 5629644 5480258 5925249 6059533 6032464
14425F032464R4717J05385N1205O1113K13091l75709L23602K19226j14515L84564
$$ 6032464 6127181 6232566 6283771 6344884 6557975 6182266 6505868 6725094 6610579 6995143
14415F995143P7362K27717m20743L60630l5662K90515l05417Q34777k76910N51765
$$ 6995143 7072505 7300222 6879479 7240109 7204447 7494962 7189545 8024322 7747412 8299177
14405H299177L0007k39016K51468j52071N69214K44472l31114L23665R0264L23104
$$ 8299177 8329184 8090168 8341636 8189565 8758779 9003251 8672137 8995802 9086066 9409170
14395I409170M7151M9768p9588O36742k65710M88248j39604L46958K28209L88550
$$ 9409170 9456321 9506089 9426501 10063243 9797533 10285781 10146177 10493135 10721344 11109894
14385A1109894O0930r0640M83087R4875M65502M6872K9422N80022K20151r5858
$$ 11109894 11170824 11080184 11563271 11658146 12123648 12170520 12199942 12779964 13000115 12904257
14375A2904257M51343J41108M12799J72817K29705L56267L65448K74665K74142
$$ 12904257 13355600 13496708 13909507 14082324 14312029 14668296 15033744 15308409 15582551
14366A5582551J90969M66029K61467L76914Q28229L8598K4647O80755M03058K38778
$$ 15582551 15773520 16239549 16501016 16877930 17706159 17744757 17769404 18450159 18853217 19091995
14356A9091995P24837K86477J77039O60989Q09272J63147N72902Q39512P52783
$$ 19091995 19816832 20103309 20280348 20941337 21750609 21913756 22486658 23326170 24078953
14347B4078953K48452O72591P22165N16091P12861Q90505J208799M70603P68770
$$ 24078953 24327405 24999996 25722161 26238252 26951113 27841618 29050417 29521020 30289790
14338C0289790Q70029Q70720J129299Q94293P25612J425971O94185J381240P10573
$$ 30289790 31159819 32030539 33159838 34054131 34779743 36205714 36899899 38281139 38991712
14329C8991712J493365J549655J522985J284973J482029J522272J866290J782461
$$ 38991712 40485077 42034732 43557717 44842690 46324719 47846991 49713281 51495742
14321E1495742J864834J603198K259812K036590K352067K452912K249353L071582
$$ 51495742 53360576 54963774 57223586 59260176 61612243 64065155 66314508 69386090
14313F9386090K712977L027697L346406L506541L675370L899434L785574M559278
$$ 69386090 72099067 75126764 78473170 81979711 85655081 89554515 93340089 97899367
14305I7899367M303741N190420N031430N805016O113472O007331O789903P196506
$$ 97899367 102203108 107393528 112424958 118229974 124343446 130350777 137140680 144337186
14297A44337186P336528Q032890Q470490R140498R525262J0082182J0591680J1569641
$$ 144337186 151673714 159706604 168177094 177317592 186842854 196925036 207516716 219086357
14289B19086357J1712630J2629674J3291003J3807616J4349498J5094686J4946157
$$ 219086357 230798987 243428661 256719664 270527280 284876778 299971464 314917621
14282C14917621J5669552J5400820J5347462J5191915J4419859J3232623J2862244
$$ 314917621 330587173 345987993 361335455 376527370 390947229 404179852 417042096
14275D17042096J1191689Q729183N404028P01954j10705r38552l417431o161083
$$ 417042096 428233785 436962968 442366996 443068950 442958245 442019693 438602262 432441179
14267D32441179o803566p579538r796396j2339596j3687910j4227153j5696450
$$ 432441179 425637613 418058075 408261679 395922083 382234173 368007020 352310570
14260C52310570j5878998j6010423j6053697j5372552j5123432j4128273j2757428
$$ 352310570 336431572 320421149 304367452 288994900 273871468 259743195 246985767
14253B46985767j3212414j2229801j1872980j1256730j0479435r585510r370864
$$ 246985767 233773353 221543552 209670572 198413842 187934407 178348897 168978033
14246A68978033q292436p929845p517856p101164o474602o536703o168671n087170
$$ 168978033 160685597 152755752 145237896 138136732 131662130 125125427 118956756 113869586
14238A13869586n101575m636357m755721m641632l765385m074052l056321l625761
$$ 113869586 108768011 104131654 99375933 94734301 90968916 86894864 83838543 80212782
14230H0212782l123941k764917k952446l281667k345780k352998k848383j660922
$$ 80212782 77088841 74323924 71371478 68089811 65744031 63391033 60542650 58881728
14222E8881728k216843k244210j629135j413010k019165j479369j580194j658561
$$ 58881728 56664885 54420675 52791540 51378530 49359365 47879996 46299802 44641241
14214D4641241j215460j285960j515925j144880j317404j033925r90175o45658
$$ 44641241 43425781 42139821 40623896 39479016 38161612 37127687 36137512 35491854
14206C5491854j227023j342676q48798q78963o01557q00119n61839q80542p35030
$$ 35491854 34264831 32922155 32073357 31194394 30592837 29792718 29230879 28350337 27615307
14197B7615307p02785j160677m28068n7148j120134l33811n47433p35290o25103
$$ 27615307 26912522 25751845 25323777 25266629 24146495 23812684 23265251 22529961 21904858
14188B1904858n90137n69106k42970o67706k79618l48335q89688M1346l93073
$$ 21904858 21314721 20745615 20502645 19834939 19555321 19206986 18317298 18358644 17965571
14179A7965571l04259m81665m63463n10534J44793q87412K33947k77768n59430
$$ 17965571 17661312 17179647 16716184 16205650 16350443 15463031 15696978 15419210 14859780
14170A4859780m56229J42715p56570K02549m12144o04204j46290m31210j39330
$$ 14859780 14403551 14546266 13789696 13992245 13580101 12975897 12829607 12398397 12259067
14161A2259067K85959m09477k09158l64934j3455k64476k41889O7435k92393l26302
$$ 12259067 12545026 12135549 11926391 11561457 11548002 11283526 11041637 11109072 10816679 10490377
14151A0490377L11074o90134J0438n00562n6841j97r6192m4577m01012r0907o7855
$$ 10490377 10801451 10111317 10121755 9621193 9564352 9564155 9467963 9423386 9022374 8931467 8863612
14140H863612m31528J40678l66845L9362j36830o044M8899l45459k8082j3184
$$ 8863612 8432084 8572762 8205917 8245279 8108449 8102405 8151304 7805845 7777763 7764579
14130G764579l31512K76246l55363J42652n51693K63041l43441p1862m53028J1297
$$ 7764579 7433067 7709313 7353950 7496602 6944909 7207950 6864509 6792647 6339619 6350916
14120F350916J45256j71930K20685j9153j71958l96308j6842Q1131j5462j44307
$$ 6350916 6496172 6324242 6544927 6525774 6353816 5957508 5940666 6021797 6006335 5862028
14110E862028k71318m8356O1038J36679k95804l4898j78558q6047K11894m81976
$$ 5862028 5590710 5542354 5603392 5740071 5444267 5409369 5230811 5144764 5356658 4874682
14100D874682O04847m51574M6710N0950l08248j02606J41667j44012Q0561k13193
$$ 4874682 5479529 5027955 5074665 5125615 4817367 4714761 4856428 4712416 4792977 4579784
14090D579784J57091k16859k32507J74499j47111j38197L10510n65768L26553
$$ 4579784 4736875 4520016 4287509 4462008 4314897 4176700 4487210 3921442 4247995
14081D247995j10523j43560q5657m6760J92268j38677j49126L2495l99792J62212
$$ 4247995 4137472 3993912 3908255 3861495 4053763 3915086 3765960 3798455 3398663 3560875
14071C560875J1784l5553K56189l88416J99752k35820K19283K7412j59039K39697
$$ 3560875 3572659 3537106 3793295 3404879 3604631 3368811 3588094 3615506 3456467 3696164
14061C696164n4355J05128l76341R0558j74277K73618j77246m45596N03597m38984
$$ 3696164 3641809 3746937 3370596 3461154 3286877 3560495 3383249 2937653 3441250 3002266
14051C002266K57306j00157j93944j37663J43798q6180p4798k21071K53164K28794
$$ 3002266 3259572 3159415 2965471 2827808 2971606 2885426 2810628 2589557 2842721 3071515
14041C071515l41560L22323k89699J39680J39665n37722K71169q889l7569k40321
$$ 3071515 2729955 3052278 2762579 2902259 3041924 2504202 2775371 2766482 2728913 2488592
14031B488592M805O06642p02784J9870j7051Q583J32491j35642m3441P0563j7562
$$ 2488592 2493397 3100039 2397255 2417125 2400074 2408657 2541148 2405506 2362065 2432628 2415066
14020B415066J06126l74668K63581k17972J33055J42951m07014j46131K44612
$$ 2415066 2521192 2146524 2410105 2192133 2325188 2468139 2061125 1914994 2159606
14011B159606j84711k10398N56667j86171o1538K7159r0196r1117L3923J06634
$$ 2159606 1974895 1764497 2321164 2134993 2073455 2100614 2010418 1919301 1953224 2059858
14001B059858k04272j6615j39582L27931l57478M80985l47513k58186L90326j35692
$$ 2059858 1855586 1838971 1699389 2027320 1669842 2150827 1803314 1545128 1935454 1799762
13991A799762M48089M46618M37313K569602N479386J4153392J4581243j6392389
$$ 1799762 2247851 2694469 3131782 5701384 11180770 25334162 39915405 23523016
13983B3523016j0450926m939934k217083j714279n24803m60721j62566l5029n45504
$$ 23523016 13072090 8132156 5915073 4200794 3675991 3215270 3052704 3017675 2472171
13974B472171P9470k03014l66372L92205j28413q2719l73008K22314N8579O5426
$$ 2472171 2551641 2348627 1982255 2374460 2246047 2163328 1790320 2012634 2071213 2136639
13964B136639k91074N07269m42564K39356m56215P1141j67681K69613J16625J3576
$$ 2136639 1845565 2352834 1910270 2149626 1693411 1764552 1596871 1866484 1983109 1996685
13954A996685k13281k5804k8984j09363L99712k27169n46540L78863p4579j40173
$$ 1996685 1783404 1757600 1728616 1619253 2018965 1791796 1245256 1624119 1549540 1409367
13944A409367K41694j98867J41771j99665L73729k72254K6226J05952j66677j27018
$$ 1409367 1651061 1452194 1593965 1394300 1768029 1495775 1522001 1627953 1461276 1334258
13934A334258j54826J62738J11844l81519L10923J74686p7372k57701K27831K73873
$$ 1334258 1179432 1342170 1454014 1072495 1383418 1558104 1480732 1223031 1450862 1724735
13924A724735m15846n0073M31992k67970j00621p8057L8557j37252K38132k11366
$$ 1724735 1308889 1258816 1690808 1422838 1322217 1244160 1282717 1145465 1383597 1172231
13914A172231K00589k90004J50032j7139L56341n19111j73832K22903q9451L44846
$$ 1172231 1372820 1082816 1232848 1215709 1572050 1052939 879107 1102010 1012559 1357405
13904A357405o73504N39166N3o621j81530K48065K1676l5483R6453p3384k13856
$$ 1357405 683901 1223067 1223120 1216499 1034969 1283034 1304710 1269227 1365680 1292296 1078440
13893A078440k535R9993j28017j06704J02139n1464L08651l0933l75018N13246
$$ 1078440 1075905 1175898 1047881 941177 1043316 991852 1300503 1269570 894552 1407798
13883A407798l1005o66178L49086m5060j43184K52795k84659J56896J3108K05822
$$ 1407798 1376793 710615 1059701 1014641 871457 1124252 839593 996489 1009597 1215419
13873A215419o3355o2117J45396n45632J82785j16370L85551r8994k3069k17212
$$ 1215419 1152064 1089947 1235343 689711 872496 756126 1141677 1042683 1019614 802402
13863H02402K14837K81520n14777L4140j05545K19269J09293l07965J33483N9911
$$ 802402 1017239 1298759 783982 818122 712577 931846 1041139 733174 866657 926568
13853I26568J3479j73979O0360J92575J00053E17628K56050K96479D74983L83501
$$ 926568 940047 766068 826428 1019003 1119056 517628 773678 1070157 474983 858484
13843H58484q7235l6874J33342j3279J64330k26587j10408l13209P28394l04155
$$ 858484 771249 734375 867717 854438 1018768 792181 681773 368564 1096958 792803
13833G92803j88043J61316O4941k96635L52516N3823l16649K3575L52507j01169
$$ 792803 604760 766076 831017 534382 886898 940721 624072 647647 1000154 898985
13823H98985j68991j30746J43268k21154J89032k4730K1455J59488j36657k17476
$$ 898985 729994 599248 742516 521362 710394 685664 707119 866607 729950 512474
13813E12474M76342k72331K63134k19738j62856J33032Q3108j43920M2163K61372
$$ 512474 988816 716485 979619 759881 597025 730057 813165 669245 711408 972780
13803I72780n9164m9643k55490L37191L17849E90019J44566l000L68615k04996
$$ 972780 913616 863973 608483 945674 1263523 590019 734585 731585 1100200 895204
13793H95204j00514k19721J24520L5016M475l3972j18344K78891r198k16983J41039
$$ 895204 794690 574969 699489 734505 738980 705008 586664 865555 856357 639374 780413
13782G80413j15348j35587m7529K78254n0015j99805L78793j98935j67288L8122
$$ 780413 665065 529478 481949 760203 710188 510383 889176 690241 522953 561075
13772E61075K3980J77786C76819M12206l24055L52373J64039l61648K27120j95057
$$ 561075 585055 762841 376819 789025 464970 817343 981382 619734 846854 651797
13762F51797n4944k43872k7937K33707j96520m3617L77451l27672p1021K90535
$$ 651797 596853 352981 325044 558751 362231 318614 696065 368393 297372 587907
13752E87907k28024K16700j27575j6698j33482N20981r2330k75606j69065L39761
$$ 587907 359883 576583 449008 432310 298828 819809 727479 451873 282808 622569
13742F22569m6771P7542C05372R9982L26334k93349K34738j47613M855j33529
$$ 622569 575798 653340 305372 405354 731688 438339 673077 525464 530319 396790
13732C96790K69449B76820J60044K15906o0598j62417L46002l24347J73461l3082
$$ 396790 666239 276820 436864 652770 592172 429755 775757 451410 624871 591789
13722E91789K49799D04212K95836B42049K74690k8545j16277J59281J9144F5613
$$ 591789 841588 404212 700048 242049 516739 488194 371917 531198 550342 65613
13711C08790K41978j36250R3923k40234L43129m8993G2391J46214K14943K2493
$$ 308790 550768 414518 508441 268207 611336 562343 72391 218605 433548 456041
13701D56041J23287A74177L46477J19558J9931k99379P6865k12162K13122R8689
$$ 456041 579328 174177 520654 640212 660143 360764 437629 225467 438589 537278
13691E37278m5857n1358B03974J24272M45904l13850B05040J15339K39963o1682
$$ 537278 491421 440063 203974 328246 774150 460300 205040 320379 560342 498660
13681D98660J12862m5796k08862L53965k53719o786l8908P2852j89537b6536H21387
$$ 498660 611522 565726 356864 710829 457110 450324 411416 484268 294731 -26536 821387
13669C94910K89716r6232B08944K94185J45274E1984L68340C005M06954J12749
$$ 394910 684626 588394 208944 503129 648403 51984 420324 3005 409959 522708
13659E22708j27026j27083K03532j21546A18234M59385j91665C1482K15700K84987
$$ 522708 395682 268599 472131 350585 118234 577619 385954 31482 247182 532169
13649E32169A35657L40539K3800p4187J38030F4590L55524O2116j30844J38968
$$ 532169 135657 476196 499996 425809 563839 64590 420114 482230 351386 490354
13639D90354A47791L11245J57080k33198J53573j58401l0201j52114l0298H0571
$$ 490354 147791 459036 616116 382918 536491 378090 347889 195775 165477 80571
13628D04784k8095J18813j43540K92528B76510K74061k59964K5065q9956J16491
$$ 404784 376689 495502 351962 644490 276510 550571 290607 315672 225716 342207
13618C42207O6457K05653o2261q2952A52036K94183q6160R5676J6520L45681A57616
$$ 342207 408664 614317 552056 469104 152036 446219 360059 455735 472255 817936 157616
13606D69556j69473k768E0837J28667P1552K22376k09988q0388K73317q4453j84946
$$ 469556 300083 297315 50837 179504 251056 473432 263444 183056 456373 371920 186974
13595A86974J72914L86001C14901m6829L4380j36504K22818r4784J8821M8721
$$ 186974 359888 745889 314901 268072 302452 165948 388766 293982 312803 361524
13585C61524j46958m6566J41139j11275l6855R8064J96090A74806J29091M9862
$$ 361524 214566 168000 309139 197864 161009 259073 455163 174806 303897 353759
13575C53759N3762j66510J53507m0789b0829B58695J51296B9687L37511K62776
$$ 353759 407521 241011 394518 353729 -20829 258695 409991 29687 367198 629974
13565F29974l14861k3243m3076J11549l6784j02905K25222o6031A77651J73963
$$ 629974 315113 291870 248794 360343 323559 220654 445876 379845 177651 351614
13555C51614r5562Q7914Q6077q1479M4606B6617L68146l7464P6204J53988k76575
$$ 351614 256052 343966 430043 348564 393170 26617 394763 357299 433503 587491 310916
13544C10916D1467J85436H2177J19925o9541Q7422M6717G5974N07210A29059J00461
$$ 310916 41467 226903 82177 202102 132561 219983 266700 75974 583184 129059 229520
13533B29520p7394L2737J9094l278j3042l5624K5834O1422D1626M43066B32634
$$ 229520 152126 184863 203957 200679 187637 152013 177847 239269 41626 484692 232634
13521D15310j45881j09352K0034M8985o1910n2636J97412a33124D25170F2987
$$ 415310 269429 160077 180111 229096 167186 114550 311962 -133124 425170 62987
13510B57840B1200L86899j38357o7005Q2575A06164D4604K3302h4951E15378k3245
$$ 257840 21200 408099 269742 202737 285312 106164 44604 67906 -84951 515378 492133
13499D92133B7673K45306j33245N8844F9184j9044M3853J186J03441L864o4542
$$ 492133 27673 272979 139734 198578 69184 50140 93993 95179 198620 202484 137942
13488A37942R7920F1469J64820H8451M630o074Q4679L04795A18671R1286L05242
$$ 137942 235862 61469 226289 88451 93081 87007 171686 476481 118671 209957 515199
13477E15199B27686J22830J879J0063j75950k6998L3352K22436e5762B73167G8310
$$ 515199 227686 350516 352395 362458 186508 159510 192862 415298 -55762 273167 78310
13465A55195N7981Q8171A41054R6871a02714B67091a16511C84094j45066A04463
$$ 155195 213176 301347 141054 237925 -102714 267091 -116511 384094 239028 104463
13454A13988N927O2500B7514J63859a02762n187M6758K5824j28896C84637m1028
$$ 113988 119915 182415 27514 191373 -102762 -107949 -61191 -35367 -164263 384637 343609
13443C43609j21262A10466K1770M2601J26224A16571J9292J25910o7670p345C1374
$$ 343609 222347 110466 132236 174837 301061 116571 135863 261773 194103 186758 31374
13431a85256B10622f4998D1423a6898C97353A00083M21095b7379B12030m0651
$$ -185256 210622 -64998 41423 -16898 397353 100083 521178 -27379 212030 171379
13421A71379M0477q438P8335l3101g0086c2729r4842A05787L15745E7535L60540
$$ 171379 211856 203418 281753 248652 -70086 -32729 -127571 105787 421532 57535 418075
13410D18075B2143M21088A10790J52738J08136j49103P6274J18312A97251Q3640
$$ 418075 22143 443231 110790 263528 371664 222561 298835 417147 197251 280891
13400B80891j05070d3247j58935N5212A29286b1652F7050N3339n3116N1411D5642
$$ 280891 175821 -43247 -202182 -146970 129286 -21652 67050 120389 67273 118684 45642
13388b4516C17744p0150J72339C878M3459f6033A87391J08719J33699g4789C73194
$$ -24516 317744 247594 419933 3878 47337 -66033 187391 296110 429809 -74789 373194
13376C1070c3327A28294L30572j46494b1251q2455E6817L5050J86445K9848a08112
$$ 31070 -33327 128294 458866 312372 -21251 -103706 56817 91867 278312 308160 -108112
13364C32049j45673K29514c5862r7804A16865K56027A51064J32892j06309K97695
$$ 332049 186376 415890 -35862 -133666 116865 372892 151064 283956 177647 475342
13354D75342A79247K19580A67386o8669a20978A87013k8281r373k6984J72438
$$ 475342 179247 398827 167386 98717 -120978 187013 158732 149359 122375 294813
13344B94813j7818j32630H075K50175O220P813P5975K5877j37164j17642a27624
$$ 294813 276995 144365 8075 258250 264470 272283 348258 374135 236971 119329 -127624
13332D11788A19792E7940L7802R0450R9772d0315B40561m6958r3076J6777L15149
$$ 411788 119792 57940 95742 186192 285964 -40315 240561 193603 100527 117304 432453
13321D32453H7776J39250K16858j90898f514n0972C31197A7290L67247B8449L93457
$$ 432453 87776 227026 443884 252986 -6514 -57486 331197 17290 384537 28449 421906
13310D21906c5082j56660e9809B16362B7345M9916a35911F1944O17907B96333
$$ 421906 -35082 -191742 -59809 216362 27345 77261 -135911 61944 679851 296333
13299B68990N13605c2511A31665A923L47415I4659K71189K8341a79995h733C04718
$$ 268990 782595 -32511 131665 1923 349338 94659 365848 394189 -179995 -8733 304718
13287A01644b05050A20692m3922J68111A13972Q8847a03049n3533A79681P5884
$$ 101644 -205050 120692 76770 244881 113972 202819 -103049 -156582 179681 255565
13277B55565B4730b29692C22720A09925b405C56889A30034n7632N4037J47268
$$ 255565 24730 -229692 322720 109925 -2405 356889 130034 72402 126439 273707
13267B73707C6095d9098A04482J90648D6825d39233A27656J80242A6632a95763
$$ 273707 36095 -49098 104482 295130 46825 -439233 127656 307898 16632 -195763
13256a8794k35189I5315L78945A58018F1041l104J40425H0708R2815d1153A99064
$$ -18794 -253983 95315 474260 158018 61041 57937 198362 80708 173523 -41153 199064
13244B32293d0024B63384a2809D73590B10997g509A41361J09625c67632E3479
$$ 232293 -40024 263384 -12809 473590 210997 -7509 141361 250986 -367632 53479
13233D6942J73963B8244R7006J24651l5102I7358K51694e3068C9387K42637k6197
$$ 46942 220905 28244 125250 249901 214799 97358 349052 -53068 39387 282024 255827
13222B55827J56024j12381A14361L56406a21953e6873m3458A32382J27440a51533
$$ 255827 411851 299470 114361 470767 -121953 -56873 -100331 132382 259822 -151533
13211C4880L17950j43538K8015r1888p1261i7279b3545C37712I0869a21888C60546
$$ 34880 352830 209292 237307 145419 74158 -97279 -23545 337712 90869 -121888 360546
13199a02896C62344b59235A42824a35866B19379Q5255H8406d315H329J31769j5532
$$ -102896 362344 -259235 142824 -135866 219379 304634 88406 -4315 8329 140098 124566
13188A24566E1353K27090a52416g3659j7177A11898c22518i2287C72354A01468
$$ 124566 51353 278443 -152416 -73659 -90836 111898 -322518 -92287 372354 101468
13177G1387B7503B683J88464p5556d10507A37853A7846J06772c030I7573B0223
$$ 71387 27503 2683 191147 115591 -410507 137853 17846 124618 -3030 97573 20223
13165B61777o088a30596B04939O3184a43369H6218d7887B46129l930b70529B89844
$$ 261777 255689 -130596 204939 268123 -143369 86218 -47887 246129 242199 -270529 289844
13153C72878A79054a603C9050Q178n857K0679R7853D1256d9789p5663B58320A21320
$$ 372878 179054 -1603 39050 47228 41371 62050 159903 41256 -49789 -125452 258320 121320
13140C38500G8778B1339a12176B87730G9362c05638F8693k4888c3283E0070K55523
$$ 338500 78778 21339 -112176 287730 79362 -305638 68693 43805 -33283 50070 305593
13129C05593e7254B66458b6523A57809j2301b7651C9786J05220f6062a0920A17184
$$ 305593 -57254 266458 -26523 157809 145508 -27651 39786 145006 -66062 -10920 117184
13117a76033A38495n0617J57957A07525J4631b40325d2060I1462a5027k50783
$$ -176033 138495 87878 245835 107525 122156 -240325 -42060 91462 -15027 -265810
13107b65810A92773O1247r0293B8884K0806J69477a7736B7927J7159h2589b2433
$$ -265810 192773 254020 163727 28884 49690 219167 -17736 27927 45086 -82589 -22433
13095B7501L2172b90130Q7229j43908f2288A73454J00162B9845a9244j33944A65418
$$ 27501 59673 -290130 -202901 -346809 -62288 173454 273616 29845 -19244 -153188 165418
13083A14428b4417D33185a30525k75278a19113A3245J75149L7289e4135A44455
$$ 114428 -24417 433185 -130525 -405803 -119113 13245 188394 225683 -54135 144455
13072C197e619B11741J45475g6819J3581m3664j80167i9639A40832E871i1982
$$ 3197 -5619 211741 357216 -76819 -63238 -106902 -287069 -99639 140832 5871 -91982
13060A70228H0901K20698G8991Q2432a5246B05986J15257H0567h7361A00599d1792
$$ 170228 80901 301599 78991 161423 -15246 205986 321243 80567 -87361 100599 -41792
13048a8197A4248J56184a23564k2453B45046A5749K00110F4269i2769L9299j52466
$$ -18197 14248 170432 -123564 -146017 245046 15749 215859 64269 -92769 -53470 -205936
13037b05936B1377K90949r7210N1688a25794H2487K942J6242C1084K16848p2631
$$ -205936 21377 312326 215116 266804 -125794 82487 85429 101671 31084 247932 175301
13026A75301a92493B1738K265J63866a99993A68245a26989J0973G2138J68222
$$ 175301 -192493 21738 24003 187869 -199993 168245 -126989 -116016 72138 240360
13016B40360B0679J56365k629J64340j4648d4216B61114i593B21343J8929m5312
$$ 240360 20679 177044 174415 338755 324107 -44216 261114 -9593 221343 240272 194960
13005A94960M0017j13830J70605I7378J71782c06208a9062B7512J11203g4614
$$ 194960 234977 121147 291752 97378 269160 -306208 -19062 27512 138715 -74614
12994a84383B53479b20479Q5287j56104e9565A83240A3153m005a79903f4577j2041
$$ -184383 253479 -220479 -135192 -291296 -59565 183240 13153 9148 -179903 -64577 -76618
12983g6618q2515A64633l1460b8223A89207b72098D56504b25336B7325a92250
$$ -76618 -159133 164633 133173 -28223 189207 -272098 456504 -225336 27325 -192250
12972I4793J30627I7175m5809g1482B74792G215K69684e5292A81078H806O6714
$$ 94793 225420 97175 51366 -71482 274792 7215 276899 -55292 181078 8806 75520
12961G5520O7742K29955j21376a007E51053A21446R4115a35301b6521B54641A08831
$$ 75520 143262 373217 251841 -1007 551053 121446 215561 -135301 -26521 254641 108831
12949A08877d2993a4806C2024a9656Q783I5315b627l2169Q675G4871K49903a15019
$$ 108877 -42993 -14806 32024 -19656 -10873 95315 -2627 -34796 -26121 74871 324774 -115019
12936a61077B85219b7734D4545a3605B0059i0318p9983b7931k0322B357J30978
$$ -161077 285219 -27734 44545 -13605 20059 -90318 -170301 -27931 -48253 2357 133335
12925A33335a64571B72904A07922M6619F7324e767A62576e2674C84155c34403
$$ 133335 -164571 272904 107922 154541 67324 -5767 162576 -52674 384155 -334403
12914G498P8641J68898e5537A383M23309a4348A82769P6287b85408c0122D1919
$$ 7498 86139 255037 -55537 1383 424692 -14348 182769 259056 -285408 -30122 41919
12902D8346a69740A02192J13534m6787i1174A78299a31946p4043G3922h6467H0805
$$ 48346 -169740 102192 215726 168939 -91174 178299 -131946 -205989 73922 -86467 80805
12890b05268A7207b07217G1864J2621a08870A74292f2815K9056A911J42557f8952
$$ -205268 17207 -207217 71864 84485 -108870 174292 -62815 -33759 1911 144468 -68952
12878a47258j61304J30026P0793F4809c26605C06869i4717k9297B886K24870b8527
$$ -147258 -308562 -178536 -107743 64809 -326605 306869 -94717 -124014 2886 227756 -28527
12866i7537B00950R2975a03625c6197J0529j45594J0056B52081b4146H982M5871
$$ -97537 200950 293925 -103625 -36197 -25668 -171262 -161206 252081 -24146 8982 54853
12855E4853h7633r8539E3017B2568O4312a01664r5732h7444M1442C51453N04e3870
$$ 54853 -87633 -186172 53017 22568 86880 -101664 -197396 -87444 -46002 351453 351957 -53870
12842B47804a45505d1249j31726d0576B47170a73789a3852F0a20466B28749a45572
$$ 247804 -145505 -41249 -172975 -40576 247170 -173789 -13852 60 -120466 228749 -145572
12830C9312q439i735r279d890C11305r3002r9279K00847N349a13212A34794m1643
$$ 39312 30873 -9735 -19014 -4890 311305 218303 119024 319871 325220 -113212 134794 93151
12818I3151b5399A64288F0968J29746J53301g18C18086p2429a2749A68257B3805
$$ 93151 -25399 164288 60968 190714 344015 -718 318086 245657 -12749 168257 23805
12806H0733L3049b14652A05105i326B5444L2805p710b04352O1879f6952q8685
$$ 80733 113782 -214652 105105 -9326 25444 58249 50539 -204352 -142473 -66952 -155637
12795a55637H8997a65463A43176m3209b52407J16735o8228b4941j02218E6090
$$ -155637 88997 -165463 143176 99967 -252407 -135672 -203900 -24941 -127159 56090
12784a03587j63300B13912h9867F6115O501P8526Q8353r8908a1192E6172i5244
$$ -103587 -266887 213912 -89867 66115 72616 151142 239495 140587 -11192 56172 -95244
12772b16424I766L9070a02907j6447B29366a69471j8999B72112j11855P8145o8233
$$ -216424 9766 48836 -102907 -119354 229366 -169471 -188470 272112 160257 238402 170169
12761A70169L9506j03179P4361J02205j11963C4989J93641a19987q0551A60856
$$ 170169 209675 106496 180857 283062 171099 34989 228630 -119987 -200538 160856
12750A36751k6795a97164q8122M5890J10266c0496l6512K1565E8172J57593j04390
$$ 136751 109956 -197164 -285286 -239396 -129130 -30496 -67008 -45443 58172 215765 111375
12739A11375f5607a4489k46324D2412a6637l5370B09720A00176d1369k3002D9209
$$ 111375 -65607 -14489 -260813 42412 -16637 -52007 209720 100176 -41369 -64371 49209
12727b4905A44704c3086j46124A1974a17548d4386n297f707m4522C33583r2748
$$ -24905 144704 -33086 -179210 11974 -117548 -44386 -49683 -6707 -51229 333583 240835
12716B40835A11083J78792N667L9784A05190c7946B6989a03064c9732j03022A75698
$$ 240835 111083 289875 295542 335326 105190 -37946 26989 -103064 -39732 -142754 175698
12704H7809L1267n5783j3124J18633a464A00598o692b60659A12386M035a09330
$$ 87809 119076 63293 50169 168802 -1464 100598 93906 -260659 112386 116421 -109330
12692C66278e1251A03193a08688A06777J47249L4435j1937d3552A96876b89654
$$ 366278 -51251 103193 -108688 106777 254026 288461 276524 -43552 196876 -289654
12681i1483J4549I5190e3595b1214k53136A3210b16122a8193j60177P2950B17143
$$ -91483 -76934 95190 -53595 -21214 -274350 13210 -216122 -18193 -178370 -105420 217143
12669C611b21878C84093j60334j05158J82901I0651e9266B40133f8831A35540
$$ 3611 -221878 384093 223759 118601 301502 90651 -59266 240133 -68831 135540
12658a95434o8799I5757J47489b8700a0988D11114A52109a43114e972j40167a2003
$$ -195434 -264233 95757 243246 -28700 -10988 411114 152109 -143114 -5972 -146139 -12003
12646A20990a34434I6591J6647a74825h3370j70851B73527F9597l1129h852B20877
$$ 120990 -134434 96591 113238 -174825 -83370 -254221 273527 69597 38468 -8852 220877
12634E39022A17574J15590p863I1784d1906K0865k8650B38671h5215A99075H7310
$$ 539022 117574 233164 225301 91784 -41906 -21041 -49691 238671 -85215 199075 87310
12622D12196a46563q9940R2162A61530a02677n5731R943B98185b03272A81430
$$ 412196 -146563 -236503 -144341 161530 -102677 -158408 -148465 298185 -203272 181430
12611b6748A80844F8626a69743A9941J36128H538d5436J4934H9114i1358c6452
$$ -26748 180844 68626 -169743 19941 156069 8538 -45436 -30502 89114 -91358 -36452
12599a7727C3530J24939m439F1402d4413B60106E0969b1301A84827D9649O2023
$$ -17727 33530 158469 154030 61402 -44413 260106 50969 -21301 184827 49649 111672
12588A11672m5116b49831a20987n4785A00222N8415c02863g8665b5707A5939K27750
$$ 111672 66556 -249831 -120987 -175772 100222 158637 -302863 -78665 -25707 15939 243689
12577B43689A20106E0713J15676F1400e5379E6745b28014B45404a18704N3785
$$ 243689 120106 50713 166389 61400 -55379 56745 -228014 245404 -118704 -64919
12567f4919C14967h1550A3886l262c14697a03404B51607g9602A9089R3960d1287
$$ -64919 314967 -81550 13886 10624 -314697 -103404 251607 -79602 19089 113049 -41287
12555B0849f7283g629A9524J2997J20949F7748K66060A43751h1428l2533A35186
$$ 20849 -67283 -7629 19524 32521 153470 67748 333808 143751 -81428 -113961 135186
12543b5296o8774j41248A74362g2199A8539J99624e9084A57070i0413E4697J84057
$$ -25296 -94070 -235318 174362 -72199 18539 218163 -59084 157070 -90413 54697 238754
12532B38754r1873J62177G395J88620G4640a38588A14435J87950j39834b22792
$$ 238754 146881 309058 7395 196015 74640 -138588 114435 302385 162551 -222792
12521e7589j32506O6636H3091J37565F5525K3394a22230B14300d15033b7740j59875
$$ -57589 -190095 -123459 83091 220656 65525 88919 -122230 214300 -415033 -27740 -187615
12510a87615k2416l700g4415M172n1530j34655n4003e9287k09012E9013a07899
$$ -187615 -210031 -213731 -74415 -70243 -121773 -256428 -310431 -59287 -268299 59013 -107899
12498A44097a34634k9311k6590B0412L1108J87524j04305o3824l2559e8372H7921
$$ 144097 -134634 -163945 -190535 20412 51520 239044 134739 70915 38356 -58372 87921
12486B58687p4825c49858b3076A40542b01674B09047p6116a60645i669D3091k699
$$ 258687 183862 -349858 -23076 140542 -201674 209047 132931 -160645 -9669 43091 40392
12475D0392a32650j1672G5714c59499J36264D693K3453N0636g7195j71966A13018
$$ 40392 -132650 -144322 75714 -359499 -223235 4693 28146 78782 -77195 -249161 113018
12463b07301B12197N7390b80388A08195A3709b05250B94689D3816a85020E8118
$$ -207301 212197 269587 -280388 108195 13709 -205250 294689 43816 -185020 58118
12452I191b32570G678e6894A1010K28054J42358j37875a90529e5700A69335b49883
$$ 9191 -232570 7678 -56894 11010 239064 381422 243547 -190529 -55700 169335 -249883
12440c9457j15272B19230D2301d9451K543B64183j11741a45226N1209M6337d409
$$ -39457 -154729 219230 42301 -49451 -46908 264183 152442 -145226 -94017 -47680 -4409
12428b75853h8071J3849B89003b43297B24741A03972A992J65978a56110A12295
$$ -275853 -88071 -74222 289003 -243297 224741 103972 1992 167970 -156110 112295
12417b15760P4498h55l25130F4004b64003A29167a89766K3436A95828J14943D3048
$$ -215760 -141262 -855 -325985 64004 -264003 129167 -189766 -166330 195828 310771 43048
12405a18088p0931B64146j26926f2632A43467a70116d5565C69402j06035a07694
$$ -118088 -189019 264146 137220 -62632 143467 -170116 -45565 369402 263367 -107694
12394B00201C0831a92697B65892b1523b790r7123k2663A16008f7921E4404c8539
$$ 200201 30831 -192697 265892 -21523 -2790 -99913 -122576 116008 -67921 54404 -38539
12382A117a30238A58552D3120c5506E479d2070B36053C8347J09890c65437H3424
$$ 1117 -130238 158552 43120 -35506 5479 -42070 236053 38347 148237 -365437 83424
12370G1273B0018i3732A24418j7197e4456n1801K6996j11825m1953H103J07363
$$ 71273 20018 -93732 124418 107221 -54456 -106257 -79261 -191086 -233039 8103 115466
12359A15466a17414B01519a04398B29222q7474c28633a50308j78360h8467j9619
$$ 115466 -117414 201519 -104398 229222 141748 -328633 -150308 -328668 -88467 -108086
12349a08086E5226a46359B5363h7653j80980D468c00817A00805f5626K9247n9636
$$ -108086 55226 -146359 25363 -87653 -268633 4468 -300817 100805 -65626 -36379 -96015
12338i6015A02501O3904d7064A54407A7043h8026F8006Q7653F345d4298C47200
$$ -96015 102501 166405 -47064 154407 17043 -88026 68006 155659 6345 -44298 347200
12326E7846J9083R0820p6358a75632A17415B8753J91452A08606J55030C8907a49475
$$ 57846 76929 167749 91391 -175632 117415 28753 220205 108606 263636 38907 -149475
12314A83638f812B41927a86201N4208A85387a68142g2452K4285e261m26731D88985
$$ 183638 -6812 241927 -186201 -131993 185387 -168142 -72452 -48167 -5261 -431992 488985
12302b1536B79760e2615A8653K53755f9162j12512A25941b71202D51538c33202
$$ -21536 279760 -52615 18653 272408 -69162 -181674 125941 -271202 451538 -333202
12291c8550A81558E0973M7432c08591C22380A2724M2669L47795a36049F2415b59701
$$ -38550 181558 50973 98405 -308591 322380 12724 55393 403188 -136049 62415 -259701
12279I7093a53554O8013B92261E0360i3052m0919q6050J05156B57889c3842A44592
$$ 97093 -153554 -85541 292261 50360 -93052 -133971 -220021 -114865 257889 -33842 144592
12267a41051B30644G6295Q9942M0752A00632e3537I6805a43089B31153i7490o2613
$$ -141051 230644 76295 166237 206989 100632 -53537 96805 -143089 231153 -97490 -160103
12256a60103B60365p5149a35919E3492a54351C17477b65605G4034a01717a9529
$$ -160103 260365 185216 -135919 53492 -154351 317477 -265605 74034 -101717 -19529
12245I5280M916h3696j52849p060A62560j7721Q4753o9285D3012P9522m2636J60959
$$ 95280 100196 -83696 -236545 -243605 162560 144839 229592 160307 43012 122534 79898 240857
12233B40857B7002b4160R86n8938E3854a35706C80250f0080a4907j59427A67406
$$ 240857 27002 -24160 -23174 -82112 53854 -135706 380250 -60080 -14907 -174334 167406
12221a74587a1933A94302D7297f2610I1500J19038J78131j42329J22052F9174
$$ -174587 -11933 194302 47297 -62610 91500 210538 388669 246340 368392 69174
12210E3711i1989H4475B7873f3235A25577K25432A1589O9748m0617L45391p1617
$$ 53711 -91989 84475 27873 -63235 125577 351009 11589 81337 40720 386111 314494
12199C14494j42450K1496C4537L04652p2784G8551L21712A77527q3809e7915C04628
$$ 314494 172044 193540 34537 339189 266405 78551 400263 177527 93718 -57915 304628
12187A85652i1826C22014e7337C26883J54789A93008J14506C5657J70806F0114
$$ 185652 -91826 322014 -57337 326883 481672 193008 307514 35657 206463 60114
12176C30617A55712M20575F1997b85013B61875j10263L8630q5208d11377E2676
$$ 330617 155712 576287 61997 -285013 261875 151612 190242 105034 -411377 52676
12165A56114f9439H9105e8635A69082j355C7014k459b30620e1691A89830M9909
$$ 156114 -69439 89105 -58635 169082 167727 37014 34555 -230620 -51691 189830 239739
12154B39739o3709o5409a23111A29477A417O318N035j289b49975A38206c287B66332
$$ 239739 176030 110621 -123111 129477 1417 7735 12770 11481 -249975 138206 -3287 266332
12141H9297K74218m6943a15442k09949E717L47200b5868E2137a60698B38202e9
$$ 89297 363515 316572 -115442 -325391 5717 352917 -25868 52137 -160698 238202 -59
12129A90628a65414A8762J06511h0094B23332l0117a37010G0721A0301J02297
$$ 190628 -165414 18762 125273 -80094 223332 193215 -137010 70721 10301 112598
12119A12598B8095a27870C33298E9119a08540A6426g676B65855j1160A17983a69662
$$ 112598 28095 -127870 333298 59119 -108540 16426 -7676 265855 254695 117983 -169662
12107d31506E2919R0586c03938B47446c04667a13557A88100J52780A56646e5169
$$ -431506 52919 143505 -303938 247446 -304667 -113557 188100 340880 156646 -55169
12096d4945p9520J9232l2838C99965A68915a96822o7867B6481K87032a91666N3035
$$ -44945 -124465 -105233 -138071 399965 168915 -196822 -264689 26481 313513 -191666 -138631
12085a38631M7344m2732o7042E7656L4578b57965A45580C7099a54245A71522o4610
$$ -138631 -91287 -134019 -201061 57656 92234 -257965 145580 37099 -154245 171522 106912
12074A06912b4358A6462b8857m23989n0790C7230A4451M9162a58537N9114C21524
$$ 106912 -24358 16462 -28857 -452846 -503636 37230 14451 63613 -158537 -99423 321524
12062A97138P26033B25311j01199m0979l9993e6273j70B12433A05385b43761C55366
$$ 197138 923171 225311 124112 83133 43140 -56273 -56443 212433 105385 -243761 355366
12050F783L399K51170M5518e9168k979b2726A30089b68686A56629D8455J9994
$$ 6783 10182 261352 306870 -59168 -62147 -22726 130089 -268686 156629 48455 68449
12039F8449b17806O1833f8078K3618I7692b39542J3469H2589J62423b51979k9400
$$ 68449 -217806 -155973 -68078 -44460 97692 -239542 -226073 82589 245012 -251979 -281379
12028b81379R0919j733C04122d658A84222R0216j10234J22962j07606B8229a85399
$$ -281379 -190460 -192193 304122 -4658 184222 274438 164204 287166 179560 28229 -185399
12016A17342j5630J8271a30394L2516q6462j894B36184f7220j04898e0942k33883
$$ 117342 101712 119983 -130394 -97878 -184340 -186234 236184 -67220 -172118 -50942 -284825
12005b84825A68726m6516Q3288J03881c3452A30363J10001b16996J07903A72368
$$ -284825 168726 122210 205498 309379 -33452 130363 240364 -216996 -109093 172368
11994A20443a54502A54953a90410J4662j0477A79612B7793d8238j43315i215B79537
$$ 120443 -154502 154953 -190410 -175748 -186225 179612 27793 -48238 -191553 -9215 279537
11982A24789h8100b8608l08854E6305c11341B69636c1077j64721j28522a07073
$$ 124789 -88100 -28608 -337462 56305 -311341 269636 -31077 -195798 -324320 -107073
11971F1950K66160b53619Q7421b7746k32064k4703B97079a57351B80113b07814
$$ 61950 328110 -253619 -166198 -27746 -259810 -284513 297079 -157351 280113 -207814
11960G0301e6665A94440L5528a13257j32593J8507E1952P4999C0227N6523J44015
$$ 70301 -56665 194440 229968 -113257 -245850 -227343 51952 126951 30227 86750 230765
11949B30765c9712a8195k21341c5932j94178P3228D0124a62285g237o1011b464
$$ 230765 -39712 -18195 -239536 -35932 -230110 -156882 40124 -162285 -7237 -68248 -2464
11937f238r3573a3509C64886H5170a90865j42495i5519K6338A84762a11604A81599
$$ -6238 -99811 -13509 364886 85170 -190865 -333360 -95519 -69181 184762 -111604 181599
11925B08123a69922C72280j81060c67543I2912J51475G4547p389b62062E2420
$$ 208123 -169922 372280 191220 -367543 92912 244387 74547 67158 -262062 52420
11914E3109a14070A9355K50035A11006C098f4579A60637o1420b81989A43491b2047
$$ 53109 -114070 19355 269390 111006 3098 -64579 160637 99217 -281989 143491 -22047
11902a31958c8991A3884b15943M1750A75250a35688l625B08136k1880b27893j0754
$$ -131958 -38991 13884 -215943 -174193 175250 -135688 -139313 208136 186256 -227893 -238647
11891b38647K5217J3655A27929J45887G4810A0794J00904a18681D5674i0775A3044
$$ -238647 -213430 -199775 127929 273816 74810 10794 111698 -118681 45674 -90775 13044
11879b47923a9509B13160B7349e6905k33893B5716a32133e4203j39259A61501
$$ -247923 -19509 213160 27349 -56905 -290798 25716 -132133 -54203 -193462 161501
11868c56158i6142D9201R6274L6351G9047b42736A10780l4686e6253q8954B0290
$$ -356158 -96142 49201 145475 181826 79047 -242736 110780 76094 -56253 -145207 20290
11856b63217I6803k1084c9428m0079j38692C31814i2068d3581C44337a15513j80189
$$ -263217 96803 75719 -39428 -79507 -218199 331814 -92068 -43581 344337 -115513 -295702
11845b95702D03798a55004B3779a2202j52978A76789i5737j1070B66172a75043
$$ -295702 403798 -155004 23779 -12202 -165180 176789 -95737 -106807 266172 -175043
11834C58014J88214A16721b52427o4653H8446h9557k0275C6592b28082G6639d5285
$$ 358014 546228 116721 -252427 -317080 88446 -89557 -109832 36592 -228082 76639 -45285
11822e87k9452k64734a2314o2015A5313a42977E5606O1304b27193i4018j50309
$$ -587 -30039 -294773 -12314 -74329 15313 -142977 55606 116910 -227193 -94018 -244327
11811b44327a12114a3999j64045B14344J36190c584k39059E265a11458A02049
$$ -244327 -112114 -13999 -178044 214344 350534 -3584 -242643 5265 -111458 102049
11800B42785h3976A51498a65927k4643g0477p1237f6179C0104c7564l7779j38034
$$ 242785 -83976 151498 -165927 -190570 -70477 -141714 -66179 30104 -37564 -75343 -213377
11789b13377P7622A22566J58709e7826j58139A60722R630n79a31195A21854a07481
$$ -213377 -135755 122566 281275 -57826 -215965 160722 170352 169773 -131195 121854 -107481
11777a4132A78613b59113e009j92244f0804R516I797J67897F424P47a32143I0719
$$ -14132 178613 -259113 -5009 -197253 -60804 -51288 9797 177694 6424 7171 -132143 90719
11764b91734R4858A6256a880n5596G0597O5981g2699G6669a23107N4882A95038
$$ -291734 -196876 16256 -1880 -57476 70597 136578 -72699 76669 -123107 -68225 195038
11752b1557B95072F9170a14909j17829C4433a35230A04014B1408R5441k1684c43797
$$ -21557 295072 69170 -114909 -232738 34433 -135230 104014 21408 116849 95165 -343797
11740A81628A490M423N42838A54053a86288e8243A71505A9802J4602e9986M059
$$ 181628 1490 5913 548751 154053 -186288 -58243 171505 19802 34404 -59986 -55927
11729e5927j90558I390O4817b0181H8465f5058B3856J79228d2728l2125A90254
$$ -55927 -246485 9390 74207 -20181 88465 -65058 23856 203084 -42728 -74853 190254
11717c28778D6858E718M9790R6249a0771B79429A15405a30115G0506a60151B26810
$$ -328778 46858 5718 55508 151757 -10771 279429 115405 -130115 70506 -160151 226810
11705B11228K5679C1315K48803a8153D5303J71466a46641m3517C30291C0964M2252
$$ 211228 236907 31315 280118 -18153 45303 216769 -146641 -190158 330291 30964 73216
11694G3216J81343f7165B53872n2256a33396E9507d7946A50555B5445d5574j7065
$$ 73216 254559 -67165 253872 201616 -133396 59507 -47946 150555 25445 -45574 -62639
11683f2639k0290j25961A34968g8035A08586K00062A01380J53192E6670H89a02365
$$ -62639 -82929 -208890 134968 -78035 108586 308648 101380 254572 56670 889 -102365
11671a94237H5787g135A25388J44662B2746J3899L29165G0257a20534B64057b8056
$$ -194237 85787 -7135 125388 270050 22746 36645 365810 70257 -120534 264057 -28056
11659a47147j8507O0717A87686a53054e7481E8129J13335f2927b6009B54703a03296
$$ -147147 -165654 -104937 187686 -153054 -57481 58129 171464 -62927 -26009 254703 -103296
11647A68514d4871C9583E056g4275A03818b39433b0104A92832o845g507j2847
$$ 168514 -44871 39583 5056 -74275 103818 -239433 -20104 192832 185987 -7507 -20354
11636b0354A99724a29607A38165h4661m22521b22742D6056b88218g640j75887
$$ -20354 199724 -129607 138165 -84661 -507182 -222742 46056 -288218 -7640 -183527
11626a83527C79743f0621j0580B13774J73277g7917A74189a08735A3863K4043
$$ -183527 379743 -60621 -71201 213774 387051 -77917 174189 -108735 13863 37906
11616C7906c3560a4762B26119A06356a45802J2461J6595N7588a2424A11939O2499
$$ 37906 -33560 -14762 226119 106356 -145802 -133341 -116746 -59158 -12424 111939 174438
11605A74438A6374a97802B11739f356D3801b32819B1523a12450N0674F2344b6665
$$ 174438 16374 -197802 211739 -6356 43801 -232819 21523 -112450 -61776 62344 -26665
11593c64306A4391Q7716b53768A27679J14953I5102K2943L12882A18956R7695
$$ -364306 14391 102107 -253768 127679 242632 95102 118045 430927 118956 216651
11583B16651c45420A24939b05236b9463B1423b14805f7298D94042F5385b82172
$$ 216651 -345420 124939 -205236 -29463 21423 -214805 -67298 494042 65385 -282172
11572D2917j2358L60989d5105B0926M8163K19089c62663C00170a10829b3697j5285
$$ 42917 30559 391548 -45105 20926 69089 288178 -362663 300170 -110829 -23697 -38982
11561c8982A32082A8497c51122I5506J24960q0749c0633B34682a52050N2017A0027
$$ -38982 132082 18497 -351122 95506 220466 139717 -30633 234682 -152050 -100033 10027
11549B41653j12042a24658A09358d06745B3834J02322n0104a20259A64437J57926
$$ 241653 129611 -124658 109358 -406745 23834 126156 76052 -120259 164437 322363
11539C22363f1434J4218j79949B91130i4090E6672b5318B14574a283A97145a536
$$ 322363 -61434 -47216 -227165 291130 -94090 56672 -25318 214574 -1283 197145 -1536
11527C91630A19492g3309a5300A42098J13198P375m4572Q2546b32566B6939P7448
$$ 391630 119492 -73309 -15300 142098 255296 262671 218099 300645 -232566 26939 104387
11516A04387Q499a62933N7864B94852D878b20496A35864A4531M17923c21676e9988
$$ 104387 112886 -162933 -105069 294852 4878 -220496 135864 14531 432454 -321676 -59988
11504e3473A18588L19469b2895k04209R5446A95492I3676J17667g8167a1530E6806
$$ -53473 118588 438057 -22895 -227104 -131658 195492 93676 211343 -78167 -11530 56806
11492C29699d4889I4411e5056A9423a75171c1534B38070q4073b5435j82501i5695
$$ 329699 -44889 94411 -55056 19423 -175171 -31534 238070 153997 -25435 -207936 -95695
11480e1820B53338b46550C49307D0460K87380f3796J422n3270M938A82035e5879
$$ -51820 253338 -246550 349307 40460 327840 -63796 -62374 -115644 -110706 182035 -55879
11468a23319A53085m9132N6235O3390g4380A29507g2497A09782A4269N4710e2161
$$ -123319 153085 103953 160188 223578 -74380 129507 -72497 109782 14269 68979 -52161
11456D4260a93327p5180A0173K79587a08697A65719b6073o2426j71719e2154r8410
$$ 44260 -193327 -268507 10173 289760 -108697 165719 -26073 -88499 -260218 -52154 -150564
11445a50564E0569J43994a65617g5940o0483l3408b7611o360B82312b70317A21262
$$ -150564 50569 194563 -165617 -75940 -136423 -169831 -27611 -33971 282312 -270317 121262
11433I7568K79340d8383R587l0785D7360b2182l3445G7550b36066R8235c0015
$$ 97568 376908 -48383 -38796 -69581 47360 -22182 -55627 77550 -236066 -137831 -30015
11421B70210b59857k46796g516l84205g9260B1834a5493l21499A46235K7134a08266
$$ 270210 -259857 -506653 -7516 -391721 -79260 21834 -15493 -336992 146235 173369 -108266
11409a00356k5263C87212A6352b58317J19579q7499g1977B4753J0534a13835k08938
$$ -100356 -125619 387212 16352 -258317 -138738 -226237 -71977 24753 35287 -113835 -322773
11398c22773P5917C544f4975A19891a01761F104d5444B06924J78291f1718r8252
$$ -322773 -246856 3544 -64975 119891 -101761 6104 -45444 206924 385215 -61718 -159970
11387a59970D4544b1032H6057f4116C0160d83n6318C45632A31436A021P0044J27528
$$ -159970 44544 -21032 86057 -64116 30160 -483 -56801 345632 131436 1021 71065 198593
11375A98593B5989J47631c9319A09126b35993L076b1008A88029I1133a73324A10585
$$ 198593 25989 173620 -39319 109126 -235993 -232917 -21008 188029 91133 -173324 110585
11363A10566i7673k5043M5335B482N6872b3714k16021J1299B88733O7659e7709
$$ 110566 -97673 -122716 -77381 2482 59354 -23714 -239735 -228436 288733 356392 -57709
11351D81625b71086q3789A27526k2424D0005b54191M3946k7819k3266A01199i5783
$$ 481625 -271086 -354875 127526 105102 40005 -254191 -210245 -238064 -261330 101199 -95783
11339d4369e63j69411b3381j61111B60752I5959c5253k71480A46450C9826j421
$$ -44369 -563 -169974 -23381 -184492 260752 95959 -35253 -306733 146450 39826 38405
11328C8405J19924c3881j0739F1668J3041b68097L1538i7386a50q2740l14580
$$ 38405 158329 -33881 -44620 61668 74709 -268097 -236559 -97386 -150 -82890 -397470
11317c97470b2175H0890A9618h1391j57096A05285i4454n5685j0177A99395D2602
$$ -397470 -22175 80890 19618 -81391 -238487 105285 -94454 -150139 -160316 199395 42602
11305C8332p426a10874A4231K41212a69760G4858a4471C8955b04801C13216b43298
$$ 38332 30906 -110874 14231 255443 -169760 74858 -14471 38955 -204801 313216 -243298
11293a98318F9768a01647C01139a64073j88342F7692b0850e529j97220o3030a01027
$$ -198318 69768 -101647 301139 -164073 -352415 67692 -20850 -5529 -202749 -265779 -101027
11281D06861a01034h201o4036k18117D2194M1072a39318G155a68748C7613J44969
$$ 406861 -101034 -8201 -72237 -290354 42194 83266 -139318 7155 -168748 37613 182582
11270A82582j9026b0474C4661K23157i0033D1142b1859F2202a69082A07727g2724
$$ 182582 163556 -20474 34661 257818 -90033 41142 -21859 62202 -169082 107727 -72724
11258A1526L919a45893k5393b972A03614b58358C8620A3049P6757c6707j08569
$$ 11526 15445 -145893 -171286 -2972 103614 -258358 38620 13049 89806 -36707 -145276
11247a45276j96161J47822A81551k2966E3087c76721A35534a42374g0434r4492
$$ -145276 -341437 -193615 181551 158585 53087 -376721 135534 -142374 -70434 -164926
11237a64926G5001J2587K52501E67J58197e28078b05955b453E4453b4937D4112
$$ -164926 75001 87588 340089 567 158764 -528078 -205955 -2453 54453 -24937 44112
11225H403J23293n1513n772a25298L2397k36014a3822j89660A79370b25967l4587
$$ 8403 131696 80183 74411 -125298 -92901 -328915 -13822 -203482 179370 -225967 -260554
11214b60554A06639n0039j3999K08947C7024Q4003J35241A05372b6321j41464
$$ -260554 106639 56600 42601 251548 37024 121027 256268 105372 -26321 -167785
11204a67785c1103j2112l5094B9887d1860n3274j99767B52694f0441D5238a18699
$$ -167785 -31103 -43215 -78309 29887 -41860 -95134 -294901 252694 -60441 45238 -118699
11192b46135H687N428b46546D15165F8530A2871a8063I8412b12241J7111a790
$$ -246135 8687 14115 -246546 415165 68530 12871 -18063 98412 -212241 -195130 -1790
11180A29195Q1471I1858d88123A07606c07457F6385a53462j65843k20493J16347
$$ 129195 210666 91858 -488123 107606 -307457 66385 -153462 -319305 -539798 -423451
11170d23451K07620i2428b4213k30056M711Q7244e2149l2595L9090j03802B49185
$$ -423451 -215831 -92428 -24213 -254269 -249558 -162314 -52149 -84744 -45654 -149456 249185
11158A97323G0457f9440k28822b0078p8197r5352G3720r350c8048R941j26835
$$ 197323 70457 -69440 -298262 -20078 -98275 -193627 73720 64370 -38048 -28107 -154942
11147a54942B05792a00537o9469a3639A10070a92361Q0014M3838A42685b61908
$$ -154942 205792 -100537 -170006 -13639 110070 -192361 -112347 -68509 142685 -261908
11136b12408B05942a62783k18549B55150c8226G3443l4674a76351j17698H5777
$$ -212408 205942 -162783 -381332 255150 -38226 73443 38769 -176351 -294049 85777
11125c78911d3746K0794j32720A18949a33982A07924a49384m2455A03839j7112
$$ -378911 -43746 -22952 -155672 118949 -133982 107924 -149384 -191839 103839 86727
11115H6727R7791d7964l22344G2520A7468J83564J40943A22b41820M8695j20542
$$ 86727 184518 -47964 -370308 72520 17468 201032 341975 122 -241820 -193125 -313667
11104c13667C3174K76955q840f7882I954Q2957j5871J8529I952m953K85803b6347
$$ -313667 33174 310129 301289 -67882 9954 92911 77040 95569 9952 4999 290802 -26347
11091a64752C07560n9885H2644J56715r7371J02712a34924F1000K76083a85144
$$ -164752 307560 247675 82644 239359 141988 244700 -134924 61000 337083 -185144
11080D05638c1091A67011J04495A02334J00680a51207A29171K2200K41880C606
$$ 405638 -31091 167011 271506 102334 203014 -151207 129171 151371 393251 3606
11069E59821i9628A55851D4757K7570J29116b81396A12463L70471j27096H4662
$$ 559821 -99628 155851 44757 72327 201443 -281396 112463 482934 355838 84662
11058H7528J60606L05163k56396m8986L35164B30132K58411J588B08917J25303
$$ 87528 248134 553297 296901 247915 583079 230132 488543 490131 208917 334220
11048C34220J28491r9604J15617k11284N0144K90454k98963k822K53563B6949
$$ 334220 462711 363107 478724 267440 317584 608038 309075 306253 559816 26949
11037F41602C18768N2132K24240B81392g4316D65654k24383N81665G1825L44339
$$ 641602 318768 370900 595140 281392 -74316 465654 241271 822936 71825 416164
11027D16164j09524K20184q8528J08272k16473L218r1608K78869j78817M2345
$$ 416164 306640 526824 438296 546568 330095 333313 241705 520574 341757 384102
11017C84102j57459H9824K06804A16363L14139k2358J04221p6864j98661J24875
$$ 384102 226643 89824 296628 116363 430502 408144 512365 435501 236840 361715
11007C61715A51909J72044q1590K16906J26356A22212M69876k72743K30675k27922
$$ 361715 151909 323953 242363 459269 585625 122212 592088 319345 550020 322098
10997C22098A48198N14341L8062B23167K10077j2443K22503l02360J22889J81316
$$ 322098 148198 662539 700601 223167 433244 420801 643304 340944 463833 645149
10987F45149r7937R0239k60973j17347K44041L7350A02764O16170k72150M15795
$$ 645149 547212 637451 376478 259131 503172 540522 102764 718934 446784 862579
10977H62579C95058q7847O32820k83364L3049K47037j94965O0789N53649K2112
$$ 862579 395058 307211 940031 656667 689716 936753 741788 802577 1356226 1378338
10967A378338M14747k72158p0864J42180j56453l43829J50356j89667J40698j06991
$$ 1378338 1793085 1520927 1450063 1592243 1435790 1091961 1242317 1052650 1193348 1086357
10957A086357m57058K08997O2554K37945k729K57464n22826L29140k50723J44230
$$ 1086357 629299 838296 900850 1138795 1136066 1393530 870704 1199844 949121 1093351
10947A093351j63171j86103J79859m20525N1407P1085P788B00607J03951I1322
$$ 1093351 930180 744077 923936 503411 554818 625903 633691 200607 304558 91322
10936b82429E3926d323D15535B05824g2822k29111D63212A84320q2616A3096B04
$$ -282429 53926 -4323 415535 205824 -72822 -301933 463212 184320 101704 13096 204
10924d126p8751G3465a35105M8788F2793E803c03090h5358K908L0462A50380a66098
$$ -4126 -82877 73465 -135105 -86317 62793 5803 -303090 -85358 -82450 -51988 150380 -166098
10911b11236M6657A77834d8979k80840a50033B37134A17664H456K01174B9951
$$ -211236 -164579 177834 -48979 -329819 -150033 237134 117664 8456 209630 29951
10900h1756k5735r5272A98788C8606r929R2452a65668b4622A18039i1848B09748
$$ -81756 -107491 -202763 198788 38606 28677 121129 -165668 -24622 118039 -91848 209748
10888A11736b56170O5480j45264A96938Q4539c53396k8436h2051A70427i4894
$$ 111736 -256170 -190690 -335954 196938 281477 -353396 -381832 -82051 170427 -94894
10877b08142H4150i8155c1587A35036i294j81089m3924P490a3195A10181L9847
$$ -208142 84150 -98155 -31587 135036 -9294 -190383 -234307 -226817 -13195 110181 150028
10866A50028a72325b1872q5767l03108B20349b21561C79139h8220E4783b9736
$$ 150028 -172325 -21872 -107639 -410747 220349 -221561 379139 -88220 54783 -29736
10855a38344k45828a24582g792k10226j8986e83l03552J42297A49862B3976a7381
$$ -138344 -384172 -124582 -7792 -218018 -237004 -583 -304135 -161838 149862 23976 -17381
10843C8499a47117A22985b85616E9270J65900p6254J3292k9990a54950A67802
$$ 38499 -147117 122985 -285616 59270 225170 148916 162208 132218 -154950 167802
10832a38558j22571f4786A15987a08976J3816B7688R2899b44149P4998E0196M8339
$$ -138558 -261129 -64786 115987 -108976 -95160 27688 120587 -244149 -169151 50196 98535
10821I8535b01313A61240m1721N2141a058j23893j79530J23414h8818k9557C7633
$$ 98535 -201313 161240 119519 171660 -1058 -124951 -304481 -181067 -88818 -118375 37633
10809i6283n08456b12990B27096o3432F1833J66106a67377j55621H6830a32532
$$ -96283 -604739 -212990 227096 163664 61833 227939 -167377 -322998 86830 -132532
10798A94862P5683m5678B7300d3371j95872a02015b9213F8236O4015d08224i2204
$$ 194862 270545 224867 27300 -43371 -239243 -102015 -29213 68236 132251 -408224 -92204
10786b75008P7048M9380j81351E7526h7707L0148D2538g6931E2434K54685a89671
$$ -275008 -197960 -148580 -329931 57526 -87707 -57559 42538 -76931 52434 307119 -189671
10774e6861B30788b41413k0778A13602J52580n5831c42901D5698e0510C20102
$$ -56861 230788 -241413 -262191 113602 266182 210351 -342901 45698 -50510 320102
10763b60412i177E2511c27175E80397g3164b0645k31368A76887k8709K08989A20672
$$ -260412 -9177 52511 -327175 580397 -73164 -20645 -252013 176887 148178 357167 120672
10751a69993L3543I0920a57439B03070c5706A31391E688b67063J26087j16429
$$ -169993 -136450 90920 -157439 203070 -35706 131391 5688 -267063 -140976 -257405
10741b57405E6001c86197C38847e7888B5883L4045f1878j13970A61976a9866A46490
$$ -257405 56001 -386197 338847 -57888 25883 59928 -61878 -175848 161976 -19866 146490
10729I3694b53443J07367e326j08102N0662j1613k19640a21805A51403a30669
$$ 93694 -253443 -146076 -5326 -113428 -62766 -74379 -294019 -121805 151403 -130669
10718a44677C5768J1858a56102K7804N773A06243l3832d9638C45146a04373l8993
$$ -144677 35768 47626 -156102 -128298 -122525 106243 72411 -49638 345146 -104373 -143366
10707a43366b3997l20895i3567B67781d02421A60607j372b2957k06096f8962k27943
$$ -143366 -23997 -344892 -93567 267781 -402421 160607 159235 -22957 -229053 -68962 -296905
10696b96905n5392A6754b97545a09993A88502k584b09741i757k10089J7140G9300
$$ -296905 -352297 16754 -297545 -109993 188502 185918 -209741 -9757 -219846 -202706 79300
10684g8128C8660b22295p8267G4013b59780A42768L01037f5483k11856G4381K07124
$$ -78128 38660 -222295 -300562 74013 -259780 142768 443805 -65483 -277339 74381 281505
10673B81505B5400N613Q111e5133A411b73607J31949N2026m6916k72636R3758
$$ 281505 25400 31013 39124 -55133 1411 -273607 -141658 -89632 -136548 -409184 -315426
10662c15426A41633L3865c41237O6154B23197a41324C2845g1540A52648A7554
$$ -315426 141633 175498 -341237 -275083 223197 -141324 32845 -71540 152648 17554
10651e97079a88800A45436n9793a14707j87096A73520D510K26776b50081d5008
$$ -597079 -188800 145436 85643 -114707 -301803 173520 4510 231286 -250081 -45008
10640E0084b75598j02506B532J57368m3124b42684H3914b528n4877J5333q5473
$$ 50084 -275598 -378104 2532 159900 116776 -242684 83914 -2528 -57405 -42072 -127545
10629a27545j43984a17242H8349b98564i3929b4540D9163K58276G7673b91746
$$ -127545 -271529 -117242 88349 -298564 -93929 -24540 49163 307439 77673 -291746
10618c14903K96A27823d9213B30881b20355J3110A6698p223i254k4511A25547
$$ -314903 -314607 127823 -49213 230881 -220355 -207245 16698 9475 -9254 -33765 125547
10606a60281B07269d83774E0726a08080j08477a8217j31767n9026a6908E1178
$$ -160281 207269 -483774 50726 -108080 -216557 -18217 -149984 -209010 -16908 51178
10595a07478j21069K7672a7006A41796g4870A30176a80559C8608a41992K681B29600
$$ -107478 -228547 -200875 -17006 141796 -74870 130176 -180559 38608 -141992 -139311 229600
10583a09104B0161a35584f4982b7467j01277o1200j03043i9265l148I9820g5710
$$ -109104 20161 -135584 -64982 -27467 -128744 -189944 -292987 -99265 -102413 99820 -75710
10571i6592E4464i018G7453a75135D3461b41708g6266A10519b6462B8348J45830
$$ -96592 54464 -9018 77453 -175135 43461 -241708 -76266 110519 -26462 28348 174178
10560A74178d9369B66323D058K83356a31616E9227i7108A92757a2513j6161B51574
$$ 174178 -49369 266323 4058 287414 -131616 59227 -97108 192757 -12513 -28674 251574
10548a12246A30422h7653E6911J16797a33727O766o8032B04357c74018i9129h022
$$ -112246 130422 -87653 56911 173708 -133727 -126961 -194993 204357 -374018 -99129 -8022
10536B91234B2085a03434o5051D8783j5481D47b22147j30905C7843b58063l03396
$$ 291234 22085 -103434 -168485 48783 33302 447 -222147 -353052 37843 -258063 -561459
10525e61459K72422B7960a39271A82735B773b01275L263A25718C7676a84402j1718
$$ -561459 -289037 27960 -139271 182735 2773 -201275 -198012 125718 37676 -184402 -196120
10514a96120G3689a55628J4914C7598b78702L785C56033B7197b03797j41263a64445
$$ -196120 73689 -155628 -140714 37598 -278702 -274917 356033 27197 -203797 -345060 -164445
10502A0576a99520k12714A54117c75766A62173B557a41551A72648e9728j24675
$$ 10576 -199520 -412234 154117 -375766 162173 2557 -141551 172648 -59728 -184403
10492a84403h8155A98070j5464B2958K88343F834J44060L8328p1377a59500N8248
$$ -184403 -88155 198070 182606 22958 311301 6834 150894 189222 117845 -159500 -101252
10481a01252D8358K92769A41791g8574B92922j37553J02493L12733G9170J84536
$$ -101252 48358 341127 141791 -78574 292922 155369 257862 570595 79170 263706
10471B63706j04559O5997j1443a94453B10874H0337C5299b78041A74710a880j46536
$$ 263706 159147 225144 213701 -194453 210874 80337 35299 -278041 174710 -1880 -148416
10460a48416O8929j038G4422b7744B23274r5441A7257d59717a29648J7135k17403
$$ -148416 -79487 -80525 74422 -27744 223274 127833 17257 -459717 -129648 -112513 -329916
10449c29916i0390k28103R9804B54778a71200c743l03924I4174a53300H5511b7368
$$ -329916 -90390 -318493 -218689 254778 -171200 -3743 -307667 94174 -153300 85511 -27368
10437B12230a97569r3184C56401F069a1866j20468m1383f0652p1017c9759k21577
$$ 212230 -197569 -290753 356401 6069 -11866 -132334 -173717 -60652 -131669 -39759 -261336
10426b61336m21i0226b7003j66679C62742e5699c983p6265C2510a35095K9415
$$ -261336 -261757 -90226 -27003 -193682 362742 -55699 -3983 -80248 32510 -135095 -105680
10415a05680q3865b9221I7388R6344b62741P8793d8221E1813A1780d68212a71773
$$ -105680 -189545 -29221 97388 193732 -262741 -183948 -48221 51813 11780 -468212 -171773
10403F3745b50512F4339J12259b4919j16238M3173j10914A28176P2967E97R6509
$$ 63745 -250512 64339 176598 -24919 -141157 -97984 -208898 128176 201143 597 97106
10392I7106b99625A18434b01008A30334J3405F5229J61045I1093A0987a03512
$$ 97106 -299625 118434 -201008 130334 143739 65229 226274 91093 10987 -103512
10381B35426G0257b47796C42694A06028E1061J23334a20692A15608J06006A01022
$$ 235426 70257 -247796 342694 106028 51061 174395 -120692 115608 221614 101022
10370A56561L58186A38666a16777E1639M57524A64447J88005E4101K72491r7293
$$ 156561 514747 138666 -116777 51639 509163 164447 352452 54101 326592 229299
10360B29299J91249j18945B8986L14101j63194J18215b2365o5310j71967B89326
$$ 229299 420548 301603 28986 343087 179893 298108 -22365 -87675 -259642 289326
10349A19546K73040B2094O4694K90568j50327b09075A85433P4390D8180L5013
$$ 119546 392586 22094 86788 377356 227029 -209075 185433 259823 48180 83193
10339H3193J01359K32328j8232h1033A10020L04007D4713i3904a472A7747M5096
$$ 83193 184552 416880 398648 -81033 110020 414027 44713 -93904 -1472 17747 62843
10328F2843a16920B34603c40213i7095A42768j8397b7532A43960n7682a80632
$$ 62843 -116920 234603 -340213 -97095 142768 124371 -27532 143960 86278 -180632
10317B77625a24730I8805J66499Q2977A67221a85540A47156b5704H0939b19946
$$ 277625 -124730 98805 265304 348281 167221 -185540 147156 -25704 80939 -219946
10306D3383b40355a20114B2216i3689a6946B0275R5200B5872a20227A3043b25598
$$ 43383 -240355 -120114 22216 -93689 -16946 20275 115475 25872 -120227 13043 -225598
10294b9031k93331F919b13440j03425j6354a29107j11947E8505O7191n4190b87640
$$ -29031 -322362 6919 -213440 -316865 -333219 -129107 -241054 58505 125696 71506 -287640
10282a4317j63027D1623b21162C4693i9040I0718g5843l23955J78216c1459j50993
$$ -14317 -177344 41623 -221162 34693 -99040 90718 -75843 -399798 -221582 -31459 -182452
10271a82452e9879p5198H4671K19476A09000Q6911c61861b9693r8353H8601b19885
$$ -182452 -59879 -135077 84671 304147 109000 195911 -361861 -29693 -128046 88601 -219885
10259g2556A25161a90908D1564a06079A14335K58814b8663C1436b55987B52328
$$ -72556 125161 -190908 41564 -106079 114335 373149 -28663 31436 -255987 252328
10248B7202a87519J1416A9974c2565A7382N8452b3485B25933J1435b16077e1691
$$ 27202 -187519 -176103 19974 -32565 17382 75834 -23485 225933 237368 -216077 -51691
10236C0418N3975L4704j1542a87016j172B36668c44008c0034A8279a61895l7722
$$ 30418 84393 119097 107555 -187016 -188188 236668 -344008 -30034 18279 -161895 -199617
10225a99617O5416C36851I8039c20501A7933M3948g6567L6820n1254j11042b9710
$$ -199617 -134201 336851 98039 -320501 17933 61881 -76567 -39747 -91001 -202043 -29710
10213a62701B10521C025g2447C2397b2596k15976B51896a39527j43682a36104
$$ -162701 210521 3025 -72447 32397 -22596 -238572 251896 -139527 -283209 -136104
10202c0508r8306K8674j50859o5358a13694j24745E1954j4185b56187b871l31458
$$ -30508 -128814 -100140 -250999 -316357 -113694 -238439 51954 37769 -256187 -2871 -334329
10191c34329B31527f5624B13203E5414a12918k1905j4257b8089j86281k82753
$$ -334329 231527 -65624 213203 55414 -112918 -134823 -149080 -28089 -214370 -497123
10181d97123I86c413H8803a27413o6691j8944M921C3979g1422j88123g1404B50915
$$ -497123 986 -3413 88803 -127413 -194104 -213048 -208127 33979 -71422 -259545 -71404 250915
10168a58402A07605J452l166L630Q6583a41502B42562b84595G8181c44139H4987
$$ -158402 107605 109057 105891 109521 196104 -141502 242562 -284595 78181 -344139 84987
10156b80412b4128I660L3784a85861A66690a14887j20462J5400f9956b9844C0011
$$ -280412 -24128 9660 43444 -185861 166690 -114887 -235349 -219949 -69956 -29844 30011
10144f4372A28508D5469j700h648k62478D9450R9497n7050J12968j4748i8546
$$ -64372 128508 45469 43769 -8648 -271126 49450 148947 91897 204865 190117 -98546
10132a00411j23014j61451h6166b6934k06899F8318a64746I7696K87632E9119
$$ -100411 -223425 -384876 -86166 -26934 -233833 68318 -164746 97696 385328 59119
10121A89223d6011j97417C1985g5162l16966N7187D9370a17228k000I3826K6806
$$ 189223 -46011 -243428 31985 -75162 -392128 -334941 49370 -117228 -119228 93826 120632
10110A20632K8577c78117c9872j03187j31793Q0955p7220B04526a45081H0260
$$ 120632 149209 -378117 -39872 -143059 -274852 -193897 -271117 204526 -145081 80260
10099A6928N833K18593c0070A11753a4302j58864p5294F9590h5741j88575R2597
$$ 16928 22761 241354 -30070 111753 -14302 -173166 -248460 69590 -85741 -274316 -181719
10088a81719a9393l1818j68347Q5208B49162f3802l79239d8466J8519F480J28253
$$ -181719 -19393 -51211 -219558 -134350 249162 -63802 -443041 -48466 -29947 6480 134733
10077A34733d3493j9720j37250M9174A25523b61816i6570k41207H447J8300J01835
$$ 134733 -43493 -63213 -200463 -151289 125523 -261816 -96570 -337777 8447 26747 128582
10066A28582c12377C892K09458j932a5182B54155c44070J51403K3340l85029b38983
$$ 128582 -312377 3892 213350 211418 -15182 254155 -344070 -192667 -169327 -554356 -238983
10054b45567J10116j35425F5492G806l284c4392E9783J9822N6557G142a32880
$$ -245567 -135451 -270876 65492 7806 4522 -34392 59783 79605 136162 7142 -132880
10042F1322C873J25678c7148J4133j23812N6316d3092j36275I4309m3347P0515
$$ 61322 3873 129551 -37148 -23015 -146827 -90511 -43092 -179367 94309 50962 121477
10031A21477c18549A90302a10339n8187I9234c13087a08668O355g934l89762F1030
$$ 121477 -318549 190302 -110339 -168526 99234 -313087 -108668 -102313 -7934 -397696 61030
10019G2732O483i2617A73176F829M1310a97348h5670o8316A33640o1761b43366
$$ 72732 79215 -92617 173176 6829 48139 -197348 -85670 -153986 133640 71879 -243366
10007E9030J24977a90949K1538j40784G9057g6423B30678k7424d04202a99256
$$ 59030 184007 -190949 -169411 -310195 79057 -76423 230678 203254 -404202 -199256
9996a97690c350B8803c74055a49098C51095b07679k9216a12858a1383B21773J1936
$$ -197690 -3350 28803 -374055 -149098 351095 -207679 -236895 -112858 -11383 221773 233709
9985B33709a11920A21820f4120a0542j73754l3559j63478a81135F2900a49855
$$ 233709 -111920 121820 -64120 -10542 -184296 -217855 -381333 -181135 62900 -149855
9974E3176M6385i0553k71912a8861j77442C88068h4095A83201b24582K0467I327
$$ 53176 99561 -90553 -362465 -18861 -196303 388068 -84095 183201 -224582 -204115 9327
9962G2217c30489F4529i3529C31599a5199j22955D609c44949J10081i5566C5747
$$ 72217 -330489 64529 -93529 331599 -15199 -138154 4609 -344949 -234868 -95566 35747
9950A97504b85680A89105F2889e0233B42460c07205A4267l628a84288d6488m56664
$$ 197504 -285680 189105 62889 -50233 242460 -307205 14267 10639 -184288 -46488 -503152
9939e03152I5136Q2500g6554a2711j11403L3310l50434f4481n9750K1492j02627
$$ -503152 95136 177636 -76554 -12711 -124114 -90804 -441238 -64481 -124231 -102739 -205366
9928b05366A35232g0663p1710P0845C01332C1805b39530a04014A61512b37203
$$ -205366 135232 -70663 -142373 -71528 301332 31805 -239530 -104014 161512 -237203
9917a15945l1090B81329c42045a12080b4103k68271C3759b57121D0242b7037j06611
$$ -115945 -147035 281329 -342045 -112080 -24103 -292374 33759 -257121 40242 -27037 -133648
9906a33648b5737N551j32478B55133A08171l7799h4736e778j54984B42547a13868
$$ -133648 -25737 -20186 -152664 255133 108171 70372 -84736 -5778 -160762 242547 -113868
9894b83742h8814L0753j78798M1680B37401b6891D6656d89451b7145B5977J29211
$$ -283742 -88814 -58061 -236859 -195179 237401 -26891 46656 -489451 -27145 25977 155188
9883A55188c85685a01791d7411B12020m8165b06707I4229f6360A92050B7695a01400
$$ 155188 -385685 -101791 -47411 212020 163855 -206707 94229 -66360 192050 27695 -101400
9871a07856j47482K4130A10295O9706a34598j83006j33759B0075a05905C4643
$$ -107856 -255338 -231208 110295 180001 -134598 -317604 -451363 20075 -105905 34643
9860G6213a60810D9156a67687k23129Q2799A78383b11743Q6553b6296F9177a99657
$$ 76213 -160810 49156 -167687 -390816 -308017 178383 -211743 -125190 -26296 69177 -199657
9848a45295j04734A62256C4432J68795n4437J1765E6823c8073a0630B18333b3648
$$ -145295 -250029 162256 34432 203227 148790 160555 56823 -38073 -10630 218333 -23648
9836d9278A45230J41849i7698A03696a08267M8703D2753A5448b82874L8964A48739
$$ -49278 145230 287079 -97698 103696 -108267 -59564 42753 15448 -282874 -243910 148739
9824A41676D2078P9358a89941I0656R7589g156I3902f0264p8218j24537E2122
$$ 141676 42078 121436 -189941 90656 188245 -7156 93902 -60264 -138482 -263019 52122
9812a49914L1567j63950B26063c6104k00277B28167a06639G3215B405d2298j41276
$$ -149914 -118347 -282297 226063 -36104 -236381 228167 -106639 73215 2405 -42298 -183574
9801a83574I8601b36482J15866k59376a3906G4640L8093K47008b8007l1410A55518
$$ -183574 98601 -236482 -120616 -379992 -13906 74640 112733 359741 -28007 -59417 155518
9789A92833a48984j33280a14024j57705a33390k5578r2364A27459f41271b47003
$$ 192833 -148984 -282264 -114024 -271729 -133390 -158968 -251332 127459 -641271 -247003
9778B4392J29806p1728l7851N2361i8066n2553q2613N8216f5353j3483l48085
$$ 24392 154198 82470 44619 96980 -98066 -150619 -233232 -175016 -65353 -78836 -426921
9767d26921c8469C73692a51208k1007A3352a44326H5015h0075q5631d8153j01444
$$ -426921 -38469 373692 -151208 -172215 13352 -144326 85015 -80075 -165706 -48153 -149597
9756a49597M2665C6918J20475c01468a05258B41463C868a52837P3380A07861l5822
$$ -149597 -106932 36918 157393 -301468 -105258 241463 3868 -152837 -79457 107861 72039
9745G2039a93330A3921R1725M5408a36960N5850j57636J3928L6790m494d5082
$$ 72039 -193330 13921 105646 151054 -136960 -81110 -238746 -224818 -188028 -192522 -45082
9733c27999E9263a19978k31314i5351a796l34917A11477f3480D3370a134j56402
$$ -327999 59263 -119978 -351292 -95351 -1796 -336713 111477 -63480 43370 -1134 -157536
9722a57536l31023a14430L8786j46397b0910l1470A41945b68570J10100r6161
$$ -157536 -488559 -114430 -75644 -222041 -20910 -52380 141945 -268570 -158470 -254631
9712b54631J2378B530c2463j46103K8228B5150b68653n861E2946c4961j36718
$$ -254631 -242253 2530 -32463 -178566 -150338 25150 -268653 -274514 52946 -34961 -171679
9701a71679K1422p3931j58784B93789b78880B28847I143O8445c35818F753J90172
$$ -171679 -150257 -224188 -382972 293789 -278880 228847 9143 77588 -335818 6753 196925
9690A96925a71244J1212j1407B82353c7998A12380b01912k5722c097r6936G8579
$$ 196925 -171244 -160032 -171439 282353 -37998 112380 -201912 -227634 -3097 -100033 78579
9678A5460K6509J90003K7066g1575j43201q060b3105j94673N0679A35343A6560
$$ 15460 41969 231972 259038 -71575 -214776 -222836 -23105 -217778 -167099 135343 16560
9666e7558j09831A59071R4712H9630K23132b13107P0500D0175J23841Q3766e7433
$$ -57558 -167389 159071 253783 89630 312762 -213107 -142607 40175 164016 247782 -57433
9654A13791L4352b58145m3033a43602A35303N7460c09528a34909j5008F3242b08301
$$ 113791 148143 -258145 -301178 -143602 135303 192763 -309528 -134909 -149917 63242 -208301
9642a29565F5434i6393l73673D7980k3746J43820f2566B719K06450c08438C6760
$$ -129565 65434 -96393 -470066 47980 24234 168054 -62566 2719 209169 -308438 36760
9630b45193f6715A13801b21071f8068B0396N9280g9644j19157C80783b43661A21169
$$ -245193 -66715 113801 -221071 -68068 20396 79676 -79644 -198801 380783 -243661 121169
9618G3985d6191E9924c3518N751k20114A6795R8009j1999m7832a0825B33205a3829
$$ 73985 -46191 59924 -33518 -27767 -247881 16795 114804 102805 54973 -10825 233205 -13829
9605B33705J0851q3724K9077a4340j24824A7329a53959B06582a18122L9404l2674
$$ 233705 244556 160832 189909 -14340 -139164 17329 -153959 206582 -118122 -78718 -111392
9594a11392m4645A58968a95126P2098a1001k6790l52124J28605h5141r7345c2051
$$ -111392 -156037 158968 -195126 -123028 -11001 -37791 -389915 -261310 -85141 -182486 -32051
9582b34542d5944m0012C1183b88767j1814a20170k3900j45627d9701b4660j69005
$$ -234542 -45944 -85956 31183 -288767 -300581 -120170 -144070 -289697 -49701 -24660 -193665
9571a93665r0842k45483K25120J43251r191l3552f4203j46291A61937a71074d9232
$$ -193665 -284507 -529990 -304870 -161619 -170810 -204362 -64203 -210494 161937 -171074 -49232
9559h2495A905a08147C42477L1510c9865O450j02494j29630N1251i9419A978g8694
$$ -82495 1905 -108147 342477 373987 -39865 -33415 -135909 -265539 -214288 -99419 1978 -78694
9546C02857b96946F8008c316r6619D06727g0453m3864A21352M029C6654a91775
$$ 302857 -296946 68008 -3316 -99935 406727 -70453 -114317 121352 125381 36654 -191775
9534B7531a96588l018d7535B10676E3949m455K0052L5640b06319N8502p1710O9556
$$ 27531 -196588 -199606 -47535 210676 53949 49494 69546 105186 -206319 -147817 -219527 -149971
9522a49971q519J3458N8047J1540k2074l7431B29071I5861K1938a86014A10614
$$ -149971 -158490 -145032 -86985 -75445 -97519 -134950 229071 95861 117799 -186014 110614
9510A20975N3440a12659p629k15946a10256j61396K4858C0334c48602E8449g239
$$ 120975 174415 -112659 -120288 -336234 -110256 -271652 -246794 30334 -348602 58449 -7239
9498B12222l2736B8494P1920a59856b5407j14811A19672e67j89841b3115m7750
$$ 212222 179486 28494 100414 -159856 -25407 -140218 119672 -567 -190408 -23115 -70865
9487g0865r399A20200c9730j31638r5770c2553E5726K3597c60804a52003a2455
$$ -70865 -80264 120200 -39730 -171368 -267138 -32553 55726 79323 -360804 -152003 -12455
9475C70797G2980a53020D0542a17697C5194a20440D21530a53345C06724b48053
$$ 370797 72980 -153020 40542 -117697 35194 -120440 421530 -153345 306724 -248053
9464i3595A19728b00168F9155L13540e53955f3606I1685c0050A49936g7461C9570
$$ -93595 119728 -200168 69155 382695 -553955 -63606 91685 -30050 149936 -77461 39570
9452c4128G8023b66269b1811m7642K2862k41202A34494c39464I390a09848j14954
$$ -34128 78023 -266269 -21811 -69453 -46591 -287793 134494 -339464 9390 -109848 -224802
9441b24802A09907c67169E53201a81801f0462K7334j44669I3601a94235A3172
$$ -224802 109907 -367169 553201 -181801 -60462 -33128 -177797 93601 -194235 13172
9430b31531Q5931e4225r3087N250j44815J25895B11385M743c22783J37344L8219
$$ -231531 -145600 -54225 -147312 -142062 -286877 -160982 211385 216128 -322783 -185439 -147220
9419a47220j30814N8529A77983F6763P8954k4552b92460J14441j38507D5038j070
$$ -147220 -278034 -219505 177983 66763 145717 121165 -292460 -178019 -316526 45038 43968
9408D3968L4105l5677b47231F4953b32941j03936O1213B1854a41382j35479f3195
$$ 43968 78073 42396 -247231 64953 -232941 -336877 -275664 21854 -141382 -276861 -63195
9396b26400f0121j95994C8079A3104d1789r6374A23707h9312j98579b4206E7962
$$ -226400 -60121 -256115 38079 13104 -41789 -138163 123707 -89312 -287891 -24206 57962
9384b87903b0452D6153h3348j50837d5709A11944H133b31913f424D05872E0191
$$ -287903 -20452 46153 -83348 -234185 -45709 111944 8133 -231913 -6424 405872 50191
9372G3877B2878b2578A58570b70208J20813B62003q9653a10352C6223i1160q7841
$$ 73877 22878 -22578 158570 -270208 -149395 262003 172350 -110352 36223 -91160 -179001
9361a79001L4354A35512J3833b02031B06217I732a95987O9021j1444c1558k27656
$$ -179001 -144647 135512 149345 -202031 206217 9732 -195987 -126966 -138410 -31558 -259214
9350b59214C9278N2424J17937i5321k59077r0884c4826I5187b07038O4183O1965
$$ -259214 39278 91702 209639 -95321 -354398 -445282 -34826 95187 -207038 -142855 -80890
9339h0890m1940A29034b96052e1511a6973F2055h4256j07996C0158A0153a46113
$$ -80890 -122830 129034 -296052 -51511 -16973 62055 -84256 -192252 30158 10153 -146113
9327b29092h7765o046A1275b55920j77770a31578O031M6804k77798E5825g9162
$$ -229092 -87765 -93811 11275 -255920 -433690 -131578 -125547 -78743 -356541 55825 -79162
9315A53821E0488a35092J1485b7818C27728A15701a85666j3421b4104E8402b99001
$$ 153821 50488 -135092 -123607 -27818 327728 115701 -185666 -199087 -24104 58402 -299001
9303g4352L3065m48702a82668L7998B28041m7977b25998A88645a50052A01871
$$ -74352 -41287 -489989 -182668 -144670 228041 180064 -225998 188645 -150052 101871
9292b92916P2147j17610C02162m7014C2529K07702b76981f0115p5913B58298p6907
$$ -292916 -220769 -338379 302162 255148 32529 240231 -276981 -60115 -136028 258298 181391
9281A81391E2178c85132J67103k2552J08614E9915b39359A29944H043R5614k6173
$$ 181391 52178 -385132 -218029 -240581 -131967 59915 -239359 129944 8043 103657 77484
9270G7484O4892a15058M6883l63416b10933j3364j35494E1131h5189D2552A4472
$$ 77484 142376 -115058 -68175 -431591 -210933 -224297 -359791 51131 -85189 42552 14472
9258h9383I0201Q3732q2978a17453C47801r3221A01975e9881k02094A50116e0026
$$ -89383 90201 173933 90955 -117453 347801 254580 101975 -59881 -261975 150116 -50026
9246A47290a58616f4463F9867b2340A18582n0415j5811b62k99742A24598K1295
$$ 147290 -158616 -64463 69867 -22340 118582 68167 52356 -262 -300004 124598 145893
9235A45893b82873C7844e5454p3340j30730n6653J16730n5571A26589J81976a13111
$$ 145893 -282873 37844 -55454 -128794 -259524 -316177 -199447 -255018 126589 308565 -113111
9223A15191a42901O1956a638B06414b66421a3308P36k51380a1709k19140F7116
$$ 115191 -142901 -80945 -1638 206414 -266421 -13308 -12572 -263952 -11709 -230849 67116
9211c69377H7808a32171q30K1620N102o1679f4439j14879B27230q6142c01311
$$ -369377 87808 -132171 -133001 -111381 -106279 -167958 -64439 -179318 227230 141088 -301311
9199b08795p11o0006a03468r9020j06856R2897g8201l4537k84268a66526B45136
$$ -208795 -209506 -269512 -103468 -202488 -309344 -216447 -78201 -112738 -397006 -166526 245136
9187h4180o8488J7145F0018O182h2467A04456c74240a58965n9809c2094A73683
$$ -84180 -152668 -135523 60018 66200 -82467 104456 -374240 -158965 -218774 -32094 173683
9175C86178j65745p962N111f0739k62617a3654C35677j58963e17160i0228L0025
$$ 386178 220433 212471 217582 -60739 -323356 -13654 335677 176714 -517160 -90228 -60203
9164f0203j62956C6747b35536D7335b8516q4851F5691g6387l03928f5634K9184
$$ -60203 -223159 36747 -235536 47335 -28516 -113367 65691 -76387 -380315 -65634 -36450
9153c6450m3967l0432A60408b32553c6708B06460g6224H975a39885j0491q1152
$$ -36450 -80417 -110849 160408 -232553 -36708 206460 -76224 8975 -139885 -150376 -231528
9142b31528H9967b65090e117E6344c22360M8550A98017a45500q5728i8936d6320
$$ -231528 89967 -265090 -5117 56344 -322360 -273810 198017 -145500 -231228 -98936 -46320
9130E6207b4954J0071D1132A7697a88655R1890A40662j0458J5411b26909J01242
$$ 56207 -24954 -14883 41132 17697 -188655 -96765 140662 130204 145615 -226909 -125667
9119a25667J3613B66322A05410b90027h9642B24228a29740j22274M3494A60823
$$ -125667 -112054 266322 105410 -290027 -89642 224228 -129740 -252014 -208520 160823
9108C0778J87402C2462a68774o1090C7110J73918k1177j9389a47882D7747I967
$$ 30778 218180 32462 -168774 -229864 37110 211028 189851 170462 -147882 47747 9967
9096i2269I0440D0459a02176p9792P1479A18938a80441C6240b65604J5143a18223
$$ -92269 90440 40459 -102176 -181968 -110489 118938 -180441 36240 -265604 -250461 -118223
9084f0432q6486k8081A31469i3600B17759K13746j60510a38542K0002e1316A27512
$$ -60432 -146918 -174999 131469 -93600 217759 431505 270995 -138542 -118540 -51316 127512
9072E8600k5137a21995E5927i9656K8251A18363b76004e8876f531C77146b58031
$$ 58600 33463 -121995 55927 -99656 -71405 118363 -276004 -58876 -6531 377146 -258031
9060c62875H271K01454c35049a44198A2551a71513o4370O4345B50603a63400b8450
$$ -362875 8271 209725 -335049 -144198 12551 -171513 -235883 -171538 250603 -163400 -28450
9048d0042A22868l6358a24862K9565j83051J30191D7076b17429I3023d6619B68103
$$ -40042 122868 86510 -124862 -95297 -278348 -148157 47076 -217429 93023 -46619 268103
9036c78237C24845d4601K1842A53597a41154M908J4704B8705a20251K5662k33253
$$ -378237 324845 -44601 -22759 153597 -141154 -136246 -121542 28705 -120251 -94589 -327842
9025c27842j81821N4639b12206a01622C4720c44746A810J51986D0584a09888k1121
$$ -327842 -509663 -455024 -212206 -101622 34720 -344746 1810 153796 40584 -109888 -131009
9014a31009A65563a48092j06782j10824J29539h9675I7671a9387j83039a7994
$$ -131009 165563 -148092 -254874 -365698 -236159 -89675 97671 -19387 -202426 -17994
9003A59132a41197F3625A1875b21198N7838C23748C3030a48456B20657B317J08230
$$ 159132 -141197 63625 11875 -221198 -163360 323748 33030 -148456 220657 2317 110547
8992A10547b85596a25690B5350b0989A537J57169a91291A19329n058a06184j6439
$$ 110547 -285596 -125690 25350 -20989 1537 158706 -191291 119329 114271 -106184 -122623
8981a22623k85170J73080a08175d6173C5741Q6950a03077k51102A45904c18336
$$ -122623 -407793 -234713 -108175 -46173 35741 122691 -103077 -354179 145904 -318336
8970h6565B0650L06172b5794m2698j47524R0437f367B37463A2691i6536A05032
$$ -86565 20650 326822 -25794 -68492 -216016 -125579 -6367 237463 12691 -96536 105032
8958c37508C970J8322L6257a9873m9585m70944b48485A71398C8955b09217L3838
$$ -337508 3970 22292 58549 -19873 -69458 -540402 -248485 171398 38955 -209217 -175379
8947a75379B4574J56491F5174b05955O909a9523A15200b92971B05938D5640b5493
$$ -175379 24574 181065 65174 -205955 -199046 -19523 115200 -292971 205938 45640 -25493
8935d28407a37842K2059k5803j71153A05654h0155G334K16973a00109K0679j17817
$$ -428407 -137842 -115783 -141586 -312739 105654 -80155 7334 224307 -100109 -79430 -197247
8924a97247R3438B92493b02485p4096A78638L29803N49677C34073j02056e3368
$$ -197247 -103809 292493 -202485 -276581 178638 508441 1058118 334073 232017 -53368
8913a21688j6798A57824N5758c51255O5758Q268A9910h4300A49634C5557b24048
$$ -121688 -138486 157824 213582 -351255 -285497 -277229 19910 -84300 149634 35557 -224048
8901a1712p163A28787o1508b4646F5736a17632E7824a88736G1317J01420B0826
$$ -11712 -18875 128787 67279 -24646 65736 -117632 57824 -188736 71317 172737 20826
8889b40277H9025Q6513m9652A6470R3886J51136n3577A2757o074a24524m36013
$$ -240277 89025 175538 125886 16470 110356 261492 207915 12757 6683 -124524 -560537
8878e60537e9562j47992h5624D8377a9107q6787L8444l4388a4179j9365j23906
$$ -560537 -59562 -207554 -85624 48377 -19107 -105894 -67450 -101838 -14179 -33544 -157450
8867a57450J4737i186j78184b2473C8513d43684b9765l35170a31300o455L1840
$$ -157450 -142713 -9186 -187370 -22473 38513 -443684 -29765 -364935 -131300 -137755 -105915
$$ [...]
##END NTUPLES=NMR SPECTRUM
##END=
