##TITLE=NES1016_872015062_9265836_VDkpNgDeP0
##JCAMPDX= 6.0         $$ Bruker NMR JCAMP-DX V2.0
##DATA TYPE= NMR SPECTRUM
##DATA CLASS= NTUPLES
##ORIGIN= BRUKER
##OWNER= Administrator
$$ 1.72 TOPSPIN		Version 2.1
$$ 2015-07-09 15:14:10.488 -0700  Administrator@X
$$ Compression mode = diff/dup
##.OBSERVE FREQUENCY= 400.02188249412
##.OBSERVE NUCLEUS= ^1H
##.ACQUISITION MODE= SIMULTANEOUS (DQD)
##.ACQUISITION SCHEME= undefined
##.AVERAGES= 64
##.DIGITISER RES= 22
##SPECTROMETER/DATA SYSTEM= spect
##.PULSE SEQUENCE= noesygpps1d.comp
##.SOLVENT NAME= COFFEE_meoh
##.SHIFT REFERENCE= INTERNAL, COFFEE_meoh, 1, 14.96296
##AUDIT TRAIL= $$ (NUMBER, WHEN, WHO, WHERE, PROCESS, VERSION, WHAT)
$$ ##TITLE= Audit trail, TOPSPIN		Version 2.1
$$ ##JCAMPDX= 5.01
$$ ##ORIGIN= Bruker BioSpin GmbH
$$ ##OWNER= Administrator
$$ $$ E:\/data/COFFEE/nmr/NES1016_872015062_9265836_VDkpNgDeP0/12/pdata/1/auditp.txt
$$ ##AUDIT TRAIL=  $$ (NUMBER, WHEN, WHO, WHERE, PROCESS, VERSION, WHAT)
(   1,<2015-07-09 15:14:05.144 -0700>,<Administrator>,<X>,<go>,<TOPSPIN 2.1>,
      <created by zg
	started at 2015-07-09 15:02:35.160 -0700,
	POWCHK enabled, PULCHK disabled,
       configuration hash MD5:
       21 0F 79 D6 B3 7B B4 F6 88 20 88 DB 03 48 BD 9F
       data hash MD5: 64K
       D7 5B 8F 08 9D E1 17 34 6B A0 AB 1C 72 99 85 E5>)
(   2,<2015-07-09 15:14:08.316 -0700>,<Administrator>,<X>,<proc1d>,<TOPSPIN 2.1>,
      <Start of raw data processing
       efp LB = 0.3 FT_mod = 6 PKNL = 1 PHC0 = 0 PHC1 = 0 SI = 128K 
       data hash MD5: 128K
       8A 50 91 A2 C1 33 42 A1 4C 24 4A BB 72 06 48 A8>)
(   3,<2015-07-09 15:14:09.206 -0700>,<Administrator>,<X>,<proc1d>,<TOPSPIN 2.1>,
      <pk PHC0 = -89.53308 PHC1 = 0 
       data hash MD5: 128K
       39 8C 63 01 73 DC 00 94 97 0B BC 2D 79 FE 35 99>)
(   4,<2015-07-09 15:14:09.597 -0700>,<Administrator>,<X>,<proc1d>,<TOPSPIN 2.1>,
      <abs ABSG = 1 
       data hash MD5: 128K
       01 80 69 82 8B E2 E3 50 A7 81 A6 08 10 8E 81 5E>)
(   5,<2015-07-09 15:14:09.706 -0700>,<Administrator>,<X>,<proc1d>,<TOPSPIN 2.1>,
      <abs ABSG = 2 
       data hash MD5: 128K
       34 4E FA D9 C3 6F 23 47 D3 AD C7 6B 7B 4C B2 62>)
(   6,<2015-07-09 15:14:09.800 -0700>,<Administrator>,<X>,<proc1d>,<TOPSPIN 2.1>,
      <abs ABSG = 3 
       data hash MD5: 128K
       AF B7 83 DE 2C 73 5C A9 72 E1 D4 E2 89 65 5B AE>)
(   7,<2015-07-09 15:14:09.894 -0700>,<Administrator>,<X>,<proc1d>,<TOPSPIN 2.1>,
      <abs ABSG = 4 
       data hash MD5: 128K
       B5 84 1D 32 82 FA 67 3E CC 80 38 AC EC 12 09 0B>)
(   8,<2015-07-09 15:14:10.003 -0700>,<Administrator>,<X>,<proc1d>,<TOPSPIN 2.1>,
      <abs ABSG = 5 
       data hash MD5: 128K
       4C 8E C8 30 77 96 FC 40 56 AD 9F 5C D7 8E C2 DC>)
$$ ##END=
$$ 
$$ $$ hash MD5
$$ $$ 7E 85 0B 06 DD 56 57 20 27 F4 89 75 EF 76 5D 50
##$RELAX= 
##$RELAX= 
##$RELAX= 
##$RELAX= 
##$RELAX= 
##$RELAX= 
##$RELAX= 
##$RELAX= 
$$ Bruker specific parameters
$$ --------------------------
##$DU= <E:\>
##$EXPNO= 12
$$ [...]
##$TP07= 0
##$TPNAME0= <>
##$TPNAME1= <>
##$TPNAME2= <>
##$TPNAME3= <>
##$TPNAME4= <>
##$TPNAME5= <>
##$TPNAME6= <>
##$TPNAME7= <>
##$TPOAL= (0..7)
0.5 0.5 0.5 0.5 0.5 0.5 0.5 0.5
##$TPOFFS= (0..7)
0 0 0 0 0 0 0 0
##$TUNHIN= 0
##$TUNHOUT= 0
##$TUNXOUT= 0
##$USERA1= <user>
##$USERA2= <user>
##$USERA3= <user>
##$USERA4= <user>
##$USERA5= <user>
##$V9= 5
##$VALIST= <valist>
##$VCLIST= <CCCCCCCCCCCCCCC>
##$VD= 0
##$VDLIST= <DDDDDDDDDDDDDDD>
##$VPLIST= <PPPPPPPPPPPPPPP>
##$VTLIST= <TTTTTTTTTTTTTTT>
##$WBST= 2048
##$WBSW= 25
##$XGAIN= (0..3)
0 0 0 0
##$XL= 0
##$YL= 0
##$YMAX_a= 5891662
##$YMIN_a= -11207307
##$ZGOPTNS= <>
##$ZL1= 120
##$ZL2= 120
##$ZL3= 120
##$ZL4= 120
##$ABSF1= 14.96296
##$ABSF2= -5.595222
##$ABSG= 5
##$ABSL= 3
##$ALPHA= 0
##$AQORDER= 0
##$ASSFAC= 0
##$ASSFACI= 0
##$ASSFACX= 0
##$ASSWID= 0
##$AUNMP= <proc_prof1d_extract.lims>
##$AXLEFT= 0
##$AXNAME= <>
##$AXNUC= <1H>
##$AXRIGHT= 0
##$AXTYPE= 0
##$AXUNIT= <>
##$AZFE= 0.1
##$AZFW= 0.1
##$BCFW= 0
##$BC_mod= 0
##$BYTORDP= 0
##$COROFFS= 0
##$CY= 15
##$DATMOD= 1
##$DC= 0
##$DFILT= <>
##$DTYPP= 0
##$F1P= 0
##$F2P= 0
##$FCOR= 0.5
##$FTSIZE= 131072
##$FT_mod= 6
##$GAMMA= 0
##$GB= 0
##$INTBC= 1
##$INTSCL= 1
##$ISEN= 128
##$LB= 0.3
##$LEV0= 0
##$LPBIN= 0
##$MAXI= 10000
##$MC2= 0
##$MEAN= 0
##$ME_mod= 0
##$MI= 0
##$NCOEF= 0
##$NC_proc= -2
##$NLEV= 6
##$NOISF1= 0
##$NOISF2= 0
##$NSP= 0
##$NTH_PI= 0
##$NZP= 0
##$OFFSET= 14.96296
##$PC= 1
##$PHC0= -89.53308
##$PHC1= 0
##$PH_mod= 1
##$PKNL= yes
##$PPARMOD= 0
##$PPDIAG= 0
##$PPIPTYP= 0
##$PPMPNUM= 2147483647
##$PPRESOL= 1
##$PSCAL= 4
##$PSIGN= 0
##$PYNMP= <proc.py>
##$REVERSE= no
##$SF= 400.020008853443
##$SI= 131072
##$SIGF1= 0
##$SIGF2= 0
##$SINO= 400
##$SIOLD= 131072
##$SPECTYP= <>
##$SREGLST= <1H.CDCl3>
##$SSB= 0
##$STSI= 131072
##$STSR= 0
##$SW_p= 8223.68421052631
##$SYMM= 0
##$S_DEV= 0
##$TDeff= 65536
##$TDoff= 0
##$TI= <>
##$TILT= no
##$TM1= 0
##$TM2= 0
##$TOPLEV= 0
##$USERP1= <user>
##$USERP2= <user>
##$USERP3= <user>
##$USERP4= <user>
##$USERP5= <user>
##$WDW= 1
##$XDIM= 131072
##$YMAX_p= 383895190
##$YMIN_p= -12557
##$CURPLOT= <Network HP LaserJet P1505>
##$CURPRIN= <$Network HP LaserJet P1505>
##$DFORMAT= <normdp>
##$LAYOUT= <+/1D_H.xwp>
##$LFORMAT= <normlp>
##$PFORMAT= <normpl>
##$SURQMSG= 1
$$ End of Bruker specific parameters
$$ ---------------------------------
##NTUPLES= NMR SPECTRUM
##VAR_NAME=  FREQUENCY,     SPECTRUM/REAL,   SPECTRUM/IMAG
##SYMBOL=    X,             R,               I
##VAR_TYPE=  INDEPENDENT,   DEPENDENT,       DEPENDENT
##VAR_FORM=  AFFN,          ASDF,            ASDF
##VAR_DIM=   131072,        131072,          131072
##UNITS=     HZ,            ARBITRARY UNITS, ARBITRARY UNITS
##FACTOR=    0.0627417313425164, 1,          1
##FIRST=     8223.62146879497, -4296,        -40927
##LAST=      0,             -1828,           -41301
##MIN=       0,             -12557,          0
##MAX=       8223.62146879497, 383895190,    0
$$ Real data points
##PAGE= N=1
##DATA TABLE= (X++(R..R)), XYDATA
$$ [...]
61109F55055K71Q15J294J526J054j72j549k517l035l221l189l391m272n323n493
61094F27853m870m843n937o783o168m931m560m873m655l829l335l176k389r29
61080E66575l5l51j004r51k21O02J242J692K048K612L594M669N465O323P712R036
61064F09008R139Q024O984O876P290P621P881Q123Q032P551P074O703O161N621
61050G12088N728O513P250P649Q210R087R721J0008J0774J2506J4645J6690J9027
61037H49896K1945K4793K6892K8605L0751L3675L7491M2472M8363N3805N7263
61026A255951N8275N7614N6770N7482O1014O7374P5756Q5757R7347J09717J21369
61015B104426J31717J41837J53839J70878J97376K37189K91127L57872M36941
$$ plain form
61109 655055 655326 656141 657435 658961 660015 659843 658294 655777 652742 649521 646332 642941 638669 633346 627853
61094 627853 622983 618140 612203 605420 599252 594321 589761 584888 580233 576404 573069 569893 567504 566575
61080 566575 566540 566189 565185 564234 564013 564615 565857 567549 569597 572209 575803 580472 585937 592260 599972 609008
61064 609008 618147 626171 633155 640031 647321 654942 662823 670946 678978 686529 693603 700306 706467 712088
61050 712088 717816 724329 731579 739228 747438 756525 766246 776254 787028 799534 814179 830869 849896
61037 849896 871841 896634 923526 952131 982882 1016557 1054048 1096520 1144883 1198688 1255951
61026 1255951 1314226 1371840 1428610 1486092 1547106 1614480 1690236 1775993 1873340 1983057 2104426
61015 2104426 2236143 2377980 2531819 2702697 2900073 3137262 3428389 3786261 4223202
61006D223202N28661O32890P52767R00238J092653J343397J661542K054367K500710
60997A5690427K895395L036735K728087J944388R05263m0994o26746p77882n63639
60988B5191034j00776M59153Q90821R36967M61043m28252j424658k214916k643014
60979B1127402k729392k581906k309068j989608j675001j392983j151013r46498
60971F351933p76299o37298n23895m30196l53591k93536k48033k13483j86938
60962B688664j66541j50408j36732j24601j13688j03571r4059q5412p7568o9921
60952A566163o2522n6609n3284n2254n2317n2175n0534m6582m1000l5422l0385
60941A033079k5049j9326j4768j2437j1387j0364r609r743j0116r761r019q749
$$ plain form
61006 4223202 4751863 5384753 6137520 7037758 8130411 9473808 11135350 13189717 15690427
60997 15690427 18585822 21622557 24350644 26295032 27200295 27159301 26532555 25754673 25191034
60988 25191034 25090258 25549411 26440232 27377199 27838242 27409990 25985332 23770416 21127402
60979 21127402 18398010 15816104 13507036 11517428 9842427 8449444 7298431 6351933
60971 6351933 5575634 4938336 4414441 3984245 3630654 3337118 3089085 2875602 2688664
60962 2688664 2522123 2371715 2234983 2110382 1996694 1893123 1799064 1713652 1636084 1566163
60952 1566163 1503641 1447032 1393748 1341494 1289177 1237002 1186468 1139886 1098886 1063464 1033079
60941 1033079 1008030 988704 973936 961499 950112 939748 930139 920396 910280 900519 891500 882751
60929H82751q705q240p762q012q467q077p232p328q559r719j0188j0599j1380
60916G68483j2018j2122j2033j1916j1261r782q107p013o599o557o748p155p602
60903F49570p903q021p984p803p511p085o366n298m139l218k604k200j953j710
60889E75775j147j14J092K109K913L577L936L815L324K702K094J621J332R48J19
60874F04096r21j485j391j135r48m86J90K93l96p99J17J966L615M462M288K709
60858F14175o8k597l510l064k392j758p73J45r4j711l892o080q379j0639j2277
60843E57086j3023j2958j1914r852p689o556o228n461l877k331j340n28J75J48
60829D75652o63j345j351j163j088o12M16J140J089J106J994L117L422L049K850
$$ plain form
60929 882751 874046 865806 858044 850032 841565 833488 826256 818928 810369 800650 790462 779863 768483
60916 768483 756465 744343 732310 720394 709133 699351 691244 684231 677632 671075 664327 657172 649570
60903 649570 641667 633646 625662 617859 610348 603263 596897 591599 587460 584242 581638 579438 577485 575775
60889 575775 574628 574514 575606 577715 580628 584205 588141 591956 595280 597982 600076 601697 603029 603977 604096
60874 604096 603175 601690 600299 599164 598216 597730 597920 598213 597817 597018 597135 599101 602716 607178 611466 614175
60858 614175 614107 611510 608000 604936 602544 600786 600013 600158 600064 598353 594461 588381 580002 569363 557086
60843 557086 544063 531105 519191 509339 501650 495094 488866 483405 479528 477197 475857 475329 475504 475652
60829 475652 474989 473644 472293 471130 470042 469430 469846 470986 472075 473181 475175 478292 481714 484763 487613
60814D87613K812K274J372J128J993L169L568K893J624M91Q2N21J375J995K002
60799E14912J431O01n3k71k27l28o40q90j063j591k675l863m581m758m660m477
60783D86867m397m657n083n025m068k680j726j589k039k619k824k268j153l40
60769D46399m52j012j033l08L53K07n41j054p62K64J564K726L548L968M012L892
60753D61771L943M190M073K950R34j056k156k307k127k261k880l494l356k329
60739D55895j278j175j872k311j919j188q05q65j223j919k838l500l652l635l827
60724D23888m074m095m043m239m708n279n753n730m812l329k256j989j832j226
60710C70523o67o44m99N25J681J532J43r38r07n35m71j50R69K130K302J719J488
$$ plain form
60814 487613 490425 492699 494071 495199 497192 500361 503929 506822 508446 508937 509019 509540 510915 512910 514912
60799 514912 516343 516944 516891 516620 516393 516065 515425 514535 513472 511881 509206 505343 500762 496004 491344 486867
60783 486867 482470 477813 472730 467705 463637 460957 459231 457642 455603 452984 450160 447892 446739 446399
60769 446399 445947 444935 443902 443594 443947 444154 443613 442559 441797 442061 443625 446351 449899 453867 457879 461771
60753 461771 465714 469904 473977 476927 477861 476805 474649 472342 470215 467954 465074 461580 458224 455895
60739 455895 454617 453442 451570 449259 447340 446152 445347 444482 443259 441340 438502 435002 431350 427715 423888
60724 423888 419814 415719 411676 407437 402729 397450 391697 385967 381155 377826 375570 373581 371749 370523
60710 370523 369856 369212 368713 369238 370919 372451 372594 371656 370749 370214 369743 369593 370562 372692 374994 376713 378201
60693C78201K035K778L133L040K620J999J508J525J979K472K886L483M270M723
60679D16652M387L581L146L543M327M570L782K342J080M99M61N81P20R71J354
60664D51996J713J962K226K640L126L491L675L708L434K540J042m65j388j911
60650D77789k768m164n369n658n311n206n611n968n735m998m032k917j766j001
60636D17285r61j474k127k755l343l664l495l018k619k332j962j725k127l007
60622C82676l363k621j532j197j550j587r65m55o60j126j105o08j05K62N46N31
60606C67141J12j35L84J212J295O24M14J344K448K413J370N50N55P85N86J19r9
60589C81118K3J84J66k0k77m17j83N09J425K191K549K365J630O53J13N16J629
$$ plain form
60693 378201 380236 383014 386147 389187 391807 393806 395314 396839 398818 401290 404176 407659 411929 416652
60679 416652 421039 424620 427766 431309 435636 440206 443988 446330 447410 447909 448370 448951 449671 450642 451996
60664 451996 453709 455671 457897 460537 463663 467154 470829 474537 477971 480511 481553 481088 479700 477789
60650 477789 475021 470857 465488 459830 454519 449313 443702 437734 431999 427001 422969 420052 418286 417285
60636 417285 416324 414850 412723 409968 406625 402961 399466 396448 393829 391497 389535 387810 385683 382676
60622 382676 379313 376692 375160 373963 372413 370826 369861 369406 368746 367620 366515 365907 365802 366064 366610 367141
60606 367141 367253 367118 367502 368714 370009 370633 371047 372391 374839 377252 378622 379172 379727 380512 381098 381217 381118
60589 381118 381141 381325 381491 381471 381194 380777 380594 381103 382528 384719 387268 389633 391263 391916 392029 392545 394174
60572C94174K665L115L148L092K906K436J896J677J753J745J531J407J472J407
60558D24424J065Q80J287K068K753L431M609O271P693Q372Q739R672J1561J4138
60544E06963J7088K0458K4386K8596L2536L6171M0351M5936N2500N8366O2053
60533I25404O3075O1065N4844M3359K7338R185q797k5313l9289m9312n4498n5385
60521I51676n3351m9428m4089l7853l1483k5615k0465j5923j1714p603l651j32
60509F50369K904N884R355J3476J7933K2302K6498L1020L6667M3644N0952N6858
60497I67862O0016N9809N5895M7994L6385K2062O339r241k2519l1086l3712l1121
60485A128683k5070j6949p510K732J3584K5398L8439N2002O4462P4136P9725Q0087
$$ plain form
60572 394174 396839 399954 403102 406194 409100 411536 413432 415109 416862 418607 420138 421545 423017 424424
60558 424424 425489 426369 427656 429724 432477 435908 440517 446788 454481 462853 471592 481264 492825 506963
60544 506963 524051 544509 568895 597491 630027 666198 706549 752485 804985 863351 925404
60533 925404 988479 1049544 1104388 1147747 1175085 1184270 1175473 1150160 1110871 1061559 1007061 951676
60521 951676 898325 848897 804808 766955 735472 709857 689392 673469 661755 654152 650501 650369
60509 650369 653273 659157 668512 681988 699921 722223 748721 779741 816408 860052 911004 967862
60497 967862 1027878 1087687 1143582 1191576 1227961 1250023 1256362 1247121 1224602 1193516 1159804 1128683
60485 1128683 1103613 1086664 1079154 1081886 1095470 1120868 1159307 1211309 1275771 1349907 1429632 1509719
60473A509719P4076O0869M0566J4719j3609m0805o4145q2303r4575j00401j00065
60462A204046r5220q7904p9278o9864o0559n2447m5770l9902l4486k9872k6300
60451E82444k3356k0516j7668j4870j2068r394p351o235n602m646l005j004P75
60438D57504J902K253J974J462J158J225J380J206O78J69k13r43k329l696m069
60423D59661l542l148l206k823j526l09j38l11N28K268L606M173M910O248P283
60408D73674P324P105P686Q964J0050J0629J1207J2290J3832J5336J6166J5965
60396F10228J5039J4088J3323J2206J0287P925N915M702M156L892L480K721J907
60383G09869J551J741J970J771J133K46o67j191r45k40R3j84m29k53k41r22j713
$$ plain form
60473 1509719 1583795 1644664 1685230 1699949 1686340 1645535 1581390 1499087 1404512 1304111 1204046
60462 1204046 1108826 1020922 941644 871780 811221 758774 713004 673102 638616 608744 582444
60451 582444 559088 538572 520904 506034 493966 484572 477221 470986 465384 460738 457733 456729 457504
60438 457504 459406 461659 463633 465095 466253 467478 468858 470064 470742 470911 470698 469755 467426 463730 459661
60423 459661 456119 452971 449765 446942 445416 445107 444969 444658 445186 447454 451060 455233 460143 466391 473674
60408 473674 480998 488103 495789 504753 514803 525432 536639 548929 562761 578097 594263 610228
60396 610228 625267 639355 652678 664884 675171 683096 689011 693713 697869 701761 705241 707962 709869
60383 709869 711420 713161 715131 716902 718035 718281 717614 716423 715478 715238 715331 715147 714718 714465 714224 713302 711589
60366G11589j666p79K09R42J486J583Q90q1k60N15J190R73L62K94Q59J340J197
60349G20643M98l89j196j943k884m177n505o305o418o162n691m730l242j890j376
60334F69233j613k029k480l219m061m265l512k497k127k519l130l660m285n072
60320F24764n748o171o589p144p480p161o279n253m240l167k225j717j361l49
60306E59880J524L271L814L440L618N361Q214J0853J2255J2099J0447P495L521
60293F45792j083n790r880j2573j3509j3060j1997j0748r155o962m411k103l74
60280E44147Q94J851K309K118J692J821K799M051M790M882M859N215O030P232
60266E94690Q831J0664J2192J2880J2772J2480J2574J3184J4153J5263J6098J6070
$$ plain form
60366 711589 709923 709144 709353 710295 711781 713364 714254 714173 713913 714428 715618 716591 716953 717247 718106 719446 720643
60349 720643 721141 720752 719556 717613 714729 710552 705047 698742 692324 686162 680471 675741 672499 670609 669233
60334 669233 667620 665591 663111 659892 655831 651566 648054 645557 643430 640911 637781 634121 629836 624764
60320 624764 619016 612845 606256 599112 591632 584471 578192 572939 568699 565532 563307 561590 560229 559880
60306 559880 561404 564675 568489 571929 575547 580908 589122 599975 612230 624329 634776 642271 645792
60293 645792 644709 638919 629039 616466 602957 589897 577900 567152 557997 551035 546624 544521 544147
60280 544147 545041 546892 549201 551319 553011 554832 557631 561682 566472 571354 576213 581428 587458 594690
60266 594690 603521 614185 626377 639257 652029 664509 677083 690267 704420 719683 735781 751851
60254G51851J4907J3115J1515J0361R286Q148P514P977R305J0656J1584J2421
60242H78640J3735J5710J8152K0835K3597K6285K8742L1009L3508L6879M1439
60231A168531M6696N1653N5770N9415O3140O6775O9616P1368P2389P3029P3098
60220A871480P2141O9805O5906O0522N4210M7733M1313L4498K6938J9036J1486
60209B375068M516k019p978j2836j6284j8518j9882k0466k0137j8835j6641j3672
60197B212316r891n112P91P622J4953K2516L0369L8574M6858N4702O1608O7188
60185B542494P1130P3215P3297P1124O6404N9221N0202M0058K9085J7294M826
60174C098350q042k1145l4309m7052n8749o9022p7584q3783q6748q6172q2598
$$ plain form
60254 751851 766758 779873 791388 801749 811035 819183 826697 834674 843979 854635 866219 878640
60242 878640 892375 908085 926237 947072 970669 996954 1025696 1056705 1090213 1127092 1168531
60231 1168531 1215227 1266880 1322650 1382065 1445205 1511980 1581596 1652964 1725353 1798382 1871480
60220 1871480 1943621 2013426 2079332 2139854 2194064 2241797 2283110 2317608 2344546 2363582 2375068
60209 2375068 2379584 2377565 2369587 2356751 2340467 2321949 2302067 2281601 2261464 2242629 2225988 2212316
60197 2212316 2202425 2197313 2198104 2205726 2220679 2243195 2273564 2312138 2358996 2413698 2475306 2542494
60185 2542494 2613624 2686839 2760136 2831260 2897664 2956885 3007087 3047145 3076230 3093524 3098350
60174 3098350 3090308 3069163 3034854 2987802 2929053 2860031 2782447 2698664 2611916 2525744 2443146
60163B443146p6876o9617o1239n2068m2127l1264j9788q698J145R790J7814K5275
60151B135493L1442L5474L6977L5986L2804K7946K1907J4918P176q13q410j5401
60139B355499k1860k7473l1494l3570l4067l3323l1059k6951k1409j5184q462
60128B070647q78P738J7132K7107L7691M8814O0290P2118Q4440R7162J10018J22964
60116B755243J36073J48987J60972J71444J79914J85425J86872J84107J78050
60107D287087J69389J57743J42595J24305J03644Q0966N6510L1060N501j9965
60097E138835m5293o9587r1373j09909j25424j38113j47588j53464j55804j54839
60087C947441j50798j44205j35740j25668j13812j00255q5588p0275n4304l7730
$$ plain form
60163 2443146 2366270 2296653 2235414 2183346 2141219 2109955 2090167 2081469 2082614 2092404 2110218 2135493
60151 2135493 2166935 2202409 2239386 2275372 2308176 2336122 2358029 2372947 2380123 2379310 2370900 2355499
60139 2355499 2333639 2306166 2274672 2241102 2207035 2173712 2142653 2115702 2094293 2079109 2070647
60128 2070647 2069769 2077507 2094639 2121746 2159437 2208251 2268541 2340659 2425099 2522261 2632279 2755243
60116 2755243 2891316 3040303 3201275 3372719 3552633 3738058 3924930 4109037 4287087
60107 4287087 4456476 4614219 4756814 4881119 4984763 5065729 5122239 5153299 5158800 5138835
60097 5138835 5093542 5023955 4932582 4822673 4697249 4559136 4411548 4258084 4102280 3947441
60087 3947441 3796643 3652438 3516698 3391030 3277218 3176963 3091375 3021100 2966796 2929066
60077B929066k1165n419R020K1921L3015M2001M8680N2974N4896N4458N1401M5213
60065C316061L5920K4684J3041J565j0129k2060l3381m3423n2476o1115o9247
60054C099440p6302q1841q5607q7356q7124q5288q2075p7313p0978o3507n5179
60043B246870m5765l5243k4457j4327m748N151J5789K6787L7658M8215N8261O7303
60031B381494P4681P9725Q1914Q1184P8004P2827O5619N6188M4847L2346J9287
60020C068116N963p365k0393l2962m4976n6123o5813p3414p8411q0599q0287p8022
60008B455714p4028o8172o0695n2440m3993l5013k5021j4462m343N008J4164K3629
59996B120348L3261M2710N1930O1156P0669Q0581R0537R9670J07051J12090J14245
$$ plain form
60077 2929066 2907901 2902482 2911502 2933423 2966438 3008439 3057119 3110093 3164989 3219447 3270848 3316061
60065 3316061 3351981 3376665 3389706 3391271 3381142 3359082 3325701 3282278 3229802 3168687 3099440
60054 3099440 3023138 2941297 2855690 2768334 2681210 2595922 2513847 2436534 2365556 2302049 2246870
60043 2246870 2201105 2165862 2141405 2127078 2122330 2127481 2143270 2170057 2207715 2255930 2314191 2381494
60031 2381494 2456175 2535900 2617814 2698998 2777002 2849829 2915448 2971636 3016483 3048829 3068116
60020 3068116 3074079 3066714 3046321 3013359 2968383 2912260 2846447 2773033 2694622 2614023 2533736 2455714
60008 2455714 2381686 2313514 2252819 2200379 2156386 2121373 2096352 2081890 2077547 2082555 2096719 2120348
59996 2120348 2153609 2196319 2248249 2309405 2380074 2460655 2551192 2650862 2757913 2870003 2984248
59985B984248J12706J06935R7365Q5172P1416N6765M1656K6246J0329o154k2703
59974C563981l8685n3894o7994p9866q8254r2913r4334r2629q7647q0071p1259
59963B716435o1858n1476l9978k8085j6397m804O776J7925K8440L8618M8285N6413
59951B710294O2362O6736P0252P2436P2228O9416O4710N8833N2239M5325L8225
59940C383056L0635K2526J4651P753J678l984q678j1178j0900q179l393L463J2391
59927C429841K3289L6260N1317O7831Q4848J01974J19337J36720J53371J68619
59917D373407J81938J92253J97869J97422J90444J76916J56830J30398R8295O1547
59907E957319K1650j9160n8274r3533j23369j46404j61695j69512j71064j67277
$$ plain form
59985 2984248 3096954 3203889 3301254 3386426 3457842 3514607 3556263 3582509 3592838 3586684 3563981
59974 3563981 3525296 3471402 3403408 3323542 3235288 3142375 3048041 2955412 2867765 2787694 2716435
59963 2716435 2654577 2603101 2563123 2535038 2518641 2513837 2520613 2538538 2566978 2605596 2653881 2710294
59951 2710294 2772656 2839392 2909644 2982080 3054308 3123724 3188434 3247267 3299506 3344831 3383056
59940 3383056 3413691 3436217 3450868 3458621 3460299 3456315 3447637 3436459 3425559 3417380 3413987 3417450 3429841
59927 3429841 3453130 3489390 3540707 3608538 3693386 3795360 3914697 4051417 4204788 4373407
59917 4373407 4555345 4747598 4945467 5142889 5333333 5510249 5667079 5797477 5895772 5957319
59907 5957319 5978969 5959809 5901535 5808002 5684633 5538229 5376534 5207022 5035958 4868681
59897D868681j58634j46312j32361j18024j02771q5763o7526m9279l1244j2838
59887C963929N850K4014M1574N9444P8061R6554J13731J29015J41872J50929J54306
59876D959279J50488J38511J17957Q9595N5908K0269j4612m7222p6566j01575
59866E292032j21433j36081j46139j52456j55737j56333j54201j49184j41464
59857C979004j31666j20409j07907r4145p9286o3748m7883l1848j5893n93J3235
59846C298861K4754L3262L8602M1848M5329N1192N9619O8704P6079Q0140P9549
59835C897939P2604N8281L7924J4930p488k7680m4812n7855o6109p0060p0935
59824C736739o9698o7119o4469o3179o3670o5111o6485o7263o7052o5341o2086
$$ plain form
59897 4868681 4710047 4563735 4431374 4313350 4210579 4124816 4057290 4008011 3976767 3963929
59887 3963929 3969779 3993793 4035367 4094811 4172872 4269426 4383157 4512172 4654044 4804973 4959279
59876 4959279 5109767 5248278 5366235 5455830 5511738 5532007 5517395 5470173 5393607 5292032
59866 5292032 5170599 5034518 4888379 4735923 4580186 4423853 4269652 4120468 3979004
59857 3979004 3847338 3726929 3619022 3524877 3445591 3381843 3333960 3302112 3286219 3285626 3298861
59846 3298861 3323615 3356877 3395479 3437327 3482656 3533848 3593467 3662171 3738250 3818390 3897939
59835 3897939 3970543 4028824 4066748 4081678 4074190 4046510 4001698 3943843 3877734 3807674 3736739
59824 3736739 3667041 3599922 3535453 3472274 3408604 3343493 3277008 3209745 3142693 3077352 3015266
59813C015266n8003n3836m9708m5543m1793l9115l7568l6664l6156l6227l6821
59802B543832l7232l6617l4635l1408k7134k1958j6059r475j884P176J7764K9433
59790B381803M1831N5272P0460Q7715J06660J26757J47761J69334J90246K07977
59780C585816K18785K17980K00928J65069J11914M7340k0192q2053j31426j64712
59770D149449j82063j86279j80713j68038j50659j31159j11563r2632p4556n8064
59760B813723m4081l2465k2081j2333l874K596P602J2450J7806K3269K8189L2488
59748B823289L6577M0869M5569N0902N7218O4705P3028Q1586R0359J00228J12049
59737C576379J25575J39728J53954J68746J84756K01918K19745K37989K56459
$$ plain form
59813 3015266 2957263 2903427 2853719 2808176 2766383 2727268 2689700 2653036 2616880 2580653 2543832
59802 2543832 2506600 2469983 2435348 2403940 2376806 2354848 2338789 2329314 2327430 2334606 2352370 2381803
59790 2381803 2423634 2478906 2549366 2637081 2743741 2870498 3018259 3187593 3377839 3585816
59780 3585816 3804601 4022581 4223509 4388578 4500492 4547832 4527640 4445587 4314161 4149449
59770 4149449 3967386 3781107 3600394 3432356 3281697 3150538 3038975 2946343 2871787 2813723
59760 2813723 2769642 2737177 2715096 2702763 2698889 2701485 2709087 2721537 2739343 2762612 2790801 2823289
59748 2823289 2859866 2900735 2946304 2997206 3054424 3119129 3192157 3273743 3364102 3464330 3576379
59737 3576379 3701954 3841682 3995636 4164382 4349138 4551056 4770801 5008790 5265249
59728E265249K74428K90623L03605L11775L13289L06748K92254K71536K46870
59719G876377K20208J93496J69346J50662J39312J35275J37161J43384J52627
59710I317848J63382J73564J81010J84255J82658J75943J64060J47508J27378
59701A0817606J04876Q1018N6837L3519J2058o883k2508l3611l9148l8853l2882
59690A0932029k1125l468J9411M6250P6302J09626J46038J84437K23541K62569
59680A1975610L00667L36093L66711L90959M07588M14567M09105L88940L52991
59671A5343231L00804K32412J49478N6124m1961j39115k30243l10645l76312m24649
59661A4559124m54674m66702m62455m45424m20620l93818l71133l58608l60757
$$ plain form
59728 5265249 5539677 5830300 6133905 6445680 6758969 7065717 7357971 7629507 7876377
59719 7876377 8096585 8290081 8459427 8610089 8749401 8884676 9021837 9165221 9317848
59710 9317848 9481230 9654794 9835804 10020059 10202717 10378660 10542720 10690228 10817606
59701 10817606 10922482 11003500 11060337 11093856 11105914 11099031 11076523 11042912 11003764 10964911 10932029
59690 10932029 10910904 10907436 10926847 10973097 11049399 11159025 11305063 11489500 11713041 11975610
59680 11975610 12276277 12612370 12979081 13370040 13777628 14192195 14601300 14990240 15343231
59671 15343231 15644035 15876447 16025925 16082049 16040088 15900973 15670730 15360085 14983773 14559124
59661 14559124 14104450 13637748 13175293 12729869 12309249 11915431 11544298 11185690 10824933
59652A0824933l78362m07437m40526m69419m87706m92373m83990m65405m39850
59643F759865m10092l78652l47769l18639k91147k64919k40310k18016j98043
59634D092278j79656j62173j45398j29381j14201j00034q7043p5256o4699n5540
59624B978897m7812m1215l5532l1133k8508k7378k6713k5780k4754k4152k4096
59613B641824k4354k4864k5908k7785l0406l3219l5509l6970l7827l8328l8157
59602B288497l6756l4158l1080k8177k5573k3364k1971k1604k1634k1084j9669
59591B003427j7910j6222j4354j1903q941n797k532R22M236O859Q720J0353J2131
59578A968989J3829J5242J6784J9018K1826K4644K7322L0191L3404L6868M0844
$$ plain form
59652 10824933 10446571 10039134 9598608 9129189 8641483 8149110 7665120 7199715 6759865
59643 6759865 6349773 5971121 5623352 5304713 5013566 4748647 4508337 4290321 4092278
59634 4092278 3912622 3750449 3605051 3475670 3361469 3261435 3174392 3099136 3034437 2978897
59624 2978897 2931085 2889870 2854338 2823205 2794697 2767319 2740606 2714826 2690072 2665920 2641824
59613 2641824 2617470 2592606 2566698 2538913 2508507 2475288 2439779 2402809 2364982 2326654 2288497
59602 2288497 2251741 2217583 2186503 2158326 2132753 2109389 2087418 2065814 2044180 2023096 2003427
59591 2003427 1985517 1969295 1954941 1943038 1934097 1928300 1925768 1926690 1930926 1937785 1946505 1956858 1968989
59578 1968989 1982818 1998060 2014844 2033862 2055688 2080332 2107654 2137845 2171249 2208117 2248961
59567B248961M5883N1833N7552O2052O5533O8935P2834P7231Q2052Q7373R3239
59556C013478R9530J05882J11631J16179J19615J22532J25133J26955J27498J26062
59546D194495J20668J08484Q8756O4688M1127K0612K726j3390k7669m0346n2572
59535D507579o4929p6435q5749r2516r6848r8527r7537r4568r0031q3238p3472
59524C553729o1307m7891l3380j7182N43J8846L7439N6990P7701R8568J18450
59513C802506J37001J53793J67145J74624J74572J66630J51016J28035R8419O3586
59503E217327K5312j4662n4477r1949j24950j51973j72252j85448j91566j91135
59493D064227j85190j74911j61434j45854j29011j11243r2702p4054n6385m0141
$$ plain form
59567 2248961 2294844 2346677 2404229 2466281 2531814 2600749 2673583 2750814 2832866 2920239 3013478
59556 3013478 3113008 3218890 3330521 3446700 3566315 3688847 3813980 3940935 4068433 4194495
59546 4194495 4315163 4423647 4512403 4577091 4618218 4638830 4641556 4628166 4600497 4560151 4507579
59535 4507579 4442650 4366215 4280466 4187950 4091102 3992575 3895038 3800470 3710439 3627201 3553729
59524 3553729 3492422 3444531 3411151 3393969 3394512 3413358 3450797 3507787 3585488 3684056 3802506
59513 3802506 3939507 4093300 4260445 4435069 4609641 4776271 4927287 5055322 5153741 5217327
59503 5217327 5242639 5227977 5173500 5081551 4956601 4804628 4632376 4446928 4255362 4064227
59493 4064227 3879037 3704126 3542692 3396838 3267827 3156584 3063882 2989828 2933443 2893302
59483B893302k4639r111O208K0528L3724M6345N8508O9469P8361Q4863Q8961R0491
59471C437010Q9025Q3929P4615O1157M4578K6070O108j5124l6651n6866p4853
59460C638998r0745j04557j15536j23062j27481j29498j29287j26723j22153j16362
59450B453594j10050j03612r7128r0319q2892p5202o8206o2458n7524n2712m7842
59439A605649m3021l8143l3187k8540k4490k0684j6629j2417q456m758j042K643
59427A376925N968Q966J2174J5967J9826K2218K1269J6180Q340P18m245n948n006
59414A493352k115K025O616J1324J6334K0991K3087K0760J4977R048N596M929
59402A626924O308R491J4433K0350K6063L1099L5944M1211M6895N2425N7353O1927
$$ plain form
59483 2893302 2868663 2859552 2865760 2886288 2920012 2966357 3024865 3094334 3172695 3257558 3346519 3437010
59471 3437010 3526035 3609964 3684579 3745736 3790314 3816384 3822492 3807368 3770717 3713851 3638998
59460 3638998 3548253 3443696 3328160 3205098 3077617 2948119 2818832 2692109 2569956 2453594
59450 2453594 2343544 2239932 2142804 2052485 1969593 1894391 1826185 1763727 1706203 1653491 1605649
59439 1605649 1562628 1524485 1491298 1462758 1438268 1417584 1400955 1388538 1380082 1375324 1374282 1376925
59427 1376925 1382893 1391859 1404033 1420000 1439826 1462044 1483313 1499493 1507833 1508551 1504306 1498358 1493352
59414 1493352 1491237 1493262 1499878 1511202 1527536 1548527 1571614 1592374 1607351 1616399 1621995 1626924
59402 1626924 1633232 1642723 1657156 1677506 1703569 1734668 1770612 1811823 1858718 1911143 1968496 2030423
59390B030423O6860P2507P8595Q4885R1682R9161J06529J12504J16620J19537
59380B979303J22106J24836J28351J33754J42194J54273J69932J88541K09051
59371D352341K30525K52516K74601K95435L12765L24414L29003L25844L14956
59362G012400K97588K76127K52856K28786K03859J78122J52332J27365J03134
59353H832569P8112N0089J7569j9490o0294j04171j50517j97966k44115k86211
59343G915575l21791l48775l65643l71948l68580l57299l40029l18545k94454
59334D828511k69267k44490k21563k01403j84052j68956j55690j44132j34051
59325C104907j24829j15896j07185r9032r1642q4783p7986p1125o4691n9374n5291
$$ plain form
59390 2030423 2097283 2169790 2248385 2333270 2424952 2524113 2630642 2743146 2859766 2979303
59380 2979303 3101409 3226245 3354596 3488350 3630544 3784817 3954749 4143290 4352341
59371 4352341 4582866 4835382 5109983 5405418 5718183 6042597 6371600 6697444 7012400
59362 7012400 7309988 7586115 7838971 8067757 8271616 8449738 8602070 8729435 8832569
59353 8832569 8910681 8960770 8978339 8958849 8898555 8794384 8643867 8445901 8201786 7915575
59343 7915575 7593784 7245009 6879366 6507418 6138838 5781539 5441510 5122965 4828511
59334 4828511 4559244 4314754 4093191 3891788 3707736 3538780 3383090 3238958 3104907
59325 3104907 2980078 2864182 2756997 2657965 2566323 2481540 2403554 2332429 2267738 2208364 2153073
59314B153073n1801m8186m4247m0154l6031l1982k8137k4368k0171j5257r964
59303A802775m752N44O462J3062J9593K4665K6584K4184J8100J1066O131M643
59291A953057O257J0311J6196K2768K8768L4054L9482M5235N0223N3394N4767
59280B314512N4687N2900M8968M2953L5089K5385J4145K351r100k0196l1160m1429
59268B489105m9960n6335o0914o4007o5525o5526o4496o2892o0753n7970n4700
59257A826027n1371m8297m5356m2122l8296l4031k9750k5698k1754j7617j3068
59246A458667q233l776m97J643L813P086J1043J4322J6411J8138K0362K3112K6300
59233A588391L0326L5294M0389M4773M8740N3243N8727O5051P2256Q0615R0104
$$ plain form
59314 2153073 2101272 2053086 2008839 1968685 1932654 1900672 1872535 1848167 1827996 1812739 1802775
59303 1802775 1798023 1798567 1805029 1818091 1837684 1862349 1888933 1913117 1931217 1942283 1948414 1953057
59291 1953057 1959314 1969625 1985821 2008589 2037357 2071411 2110893 2156128 2206351 2259745 2314512
59280 2314512 2369199 2422099 2471067 2514020 2549109 2574494 2588639 2590990 2581890 2561694 2530534 2489105
59268 2489105 2439145 2382810 2321896 2257889 2192364 2126838 2062342 1999450 1938697 1880727 1826027
59257 1826027 1774656 1726359 1681003 1638881 1600585 1566554 1536804 1511106 1489352 1471735 1458667
59246 1458667 1450434 1446658 1446161 1447804 1451617 1458703 1469746 1484068 1500479 1518617 1538979 1562091 1588391
59233 1588391 1618717 1654011 1694400 1739173 1787913 1841156 1899883 1964934 2037190 2117805 2207909
59222B207909J00498J11959J24857J39002J53643J68284J82957J97463K10727
59213C597299K21085K26930K27013K20409K06389J84342J54023J16162P2736K6246
59203E252634k1263o8255j12907j52790j85529k09621k24624k30953k29703k22358
59193C594631k10420j95328j78617j61702j45294j29279j13473r8265q4264p1531
59183B206458n9659m8525l8497k9658k1388j3039m845K326P935J2095J4865J5754
59171B043822J4131R880L446m522j3395k2612l1678m0098m7259n2642n6117n7791
59159A745165n7614n5593n2446m9288m6439m3146l8917l4419l0478k6894k3147
59148A286784j9627j7074j5139j2751r824p303n413l165q7K826M597N677P013
$$ plain form
59222 2207909 2308407 2420366 2545223 2684225 2837868 3006152 3189109 3386572 3597299
59213 3597299 3818384 4045314 4272327 4492736 4699125 4883467 5037490 5153652 5226388 5252634
59203 5252634 5231371 5163116 5050209 4897419 4711890 4502269 4277645 4046692 3816989 3594631
59193 3594631 3384211 3188883 3010266 2848564 2703270 2573991 2460518 2362253 2277989 2206458
59183 2206458 2146799 2098274 2059777 2030119 2008731 1995692 1990847 1993173 2001108 2013203 2028068 2043822
59171 2043822 2057953 2067833 2071279 2066757 2053362 2030750 1999072 1958974 1911715 1859073 1802956 1745165
59159 1745165 1687551 1631958 1579512 1530224 1483785 1440639 1401722 1367303 1336825 1309931 1286784
59148 1286784 1267157 1250083 1234944 1222193 1212369 1205066 1199653 1196488 1196401 1199227 1203824 1209501 1216514
59135A216514Q484R246R098Q492P567O131M543L658L715L967L697L146L132M029
59121A295419N354O286O518O548P125Q404R792J0691J1125J1531J2125J2762J3290
59108A416970J3846J4697J5854J6815J6928J6165J5340J5285J5984J6962J8242
59097A593088K0306K3140K6097K8869L1873L5376L8892M1898M4527M7006M8861
59086A979933M9298M8085M5507M1622L6111K8771J9788R646r82j1420k1347l0806
59074B194206l9633m7137n2675n6266n8309n8950n8195n6405n4213n1899m9249
59063A611275m6107m2824m0029l8040l6459l4475l1662k8518k5912k4141k2770
59052A240338k1329j9676j7671j5108j2209r633p764o420n498n302n925o924p970
$$ plain form
59135 1216514 1224998 1234244 1243342 1251834 1259401 1265532 1270075 1273733 1277448 1281415 1285112 1288258 1291390 1295419
59121 1295419 1300773 1307059 1313577 1320125 1327250 1335654 1345446 1356137 1367262 1378793 1390918 1403680 1416970
59108 1416970 1430816 1445513 1461367 1478182 1495110 1511275 1526615 1541900 1557884 1574846 1593088
59097 1593088 1613394 1636534 1662631 1691500 1723373 1758749 1797641 1839539 1884066 1931072 1979933
59086 1979933 2029231 2077316 2122823 2164445 2200556 2229327 2249115 2258761 2257779 2246359 2225012 2194206
59074 2194206 2154573 2107436 2054761 1998495 1940186 1881236 1823041 1766636 1712423 1660524 1611275
59063 1611275 1565168 1522344 1482315 1444275 1407816 1373341 1341679 1313161 1287249 1263108 1240338
59052 1240338 1219009 1199333 1181662 1166554 1154345 1144712 1136948 1130528 1125030 1119728 1113803 1106879 1098909
59039A098909r245j0760j1882j2224j2352j2880j3275j2430j0234p686n599l904
59027I76438k309q69K97J323K330L217L823M172M485N152O472Q213R578J0061
59013A032383J0155J0827J2442J4604J6919J9350K1802K3989K5969K8391L1835
59002A248666L6053M0193M3743M6967N0251N3183N4671N4037N1570M7661M1862
58991A768857L3546K3265J2649K819o248j4692k1990k7613l1668l4247l5010l4078
58979A635590l2697l2071l1941l1243k9844k8654k8093k7374k5478k2226j8181
58968A327788j4008j0104o540l172P9L059N591P568Q833R263R194R228R409R144
58954A365332Q302P701P998Q796R602J0927J3390J6237J7997J8405J8598J9393
$$ plain form
59039 1098909 1089664 1078904 1067022 1054798 1042446 1029566 1016291 1003861 993627 985941 980342 976438
59027 976438 974129 973260 973557 974880 977210 980427 984250 988422 992907 998059 1004531 1012744 1022322 1032383
59013 1032383 1042538 1053365 1065807 1080411 1097330 1116680 1138482 1162471 1188440 1216831 1248666
59002 1248666 1284719 1324912 1368655 1415622 1465873 1519056 1573727 1627764 1679334 1726995 1768857
58991 1768857 1802403 1825668 1838317 1841136 1834888 1820196 1798206 1770593 1738925 1704678 1669668 1635590
58979 1635590 1602893 1570822 1538881 1507638 1477794 1449140 1421047 1393673 1368195 1345969 1327788
58968 1327788 1313780 1303676 1297136 1293964 1294043 1297102 1302693 1310261 1319094 1328357 1337551 1346779 1356188 1365332
58954 1365332 1373634 1381335 1389333 1398129 1407731 1418658 1432048 1448285 1466282 1484687 1503285 1522678
58942A522678K0553K1960K4305K8128L2915L7763M2410M7212N2550N8573O5102
58931A954149P1201P5178P5489P1686O4429N4855M4283L4328K6810K3020K3024
58920B518452K5813L0290L6016M2902N0566N8519O6826P5928Q5791R5956J06440
58909C193499J17806J30030J42221J53897J65661J78099J90875K03527K16199
58900D691814K28604K39085K45853K48610K48047K44443K38036K30118K22174
58891F836784K13803K02702J86810J65577J39437J09223P6250M1945P103k7843
58881G951791o2084r4715j25481j54168j79506j99900k15179k26497k34570k39323
58871F220368k41187k41224k39654k35693k29309k21854k14326k06250j96901
$$ plain form
58942 1522678 1543231 1565191 1589496 1617624 1650539 1688302 1730712 1777924 1830474 1889047 1954149
58931 1954149 2025350 2100528 2176017 2247703 2312132 2366987 2411270 2445598 2472408 2495428 2518452
58920 2518452 2544265 2574555 2610571 2653473 2704039 2762558 2829384 2905312 2991103 3087059 3193499
58909 3193499 3311305 3441335 3583556 3737453 3903114 4081213 4272088 4475615 4691814
58900 4691814 4920418 5159503 5405356 5653966 5902013 6146456 6384492 6614610 6836784
58891 6836784 7050587 7253289 7440099 7605676 7745113 7854336 7930586 7972531 7979634 7951791
58881 7951791 7889707 7794992 7669511 7515343 7335837 7135937 6920758 6694261 6459691 6220368
58871 6220368 5979181 5737957 5498303 5262610 5033301 4811447 4597121 4390871 4193970
58862D193970j86597j76059j65461j54809j44453j34549j24717j14826j05354
58853B887145r6554q8091p9977p2868o6849o0873n4229m7586m1732l6205l0286
58842B211895k4570k0223j7099j3867r932o042k936l07K589O047R931J4065J8251
58829B167802K2288K6192L0288L4882L9816M4402M7820M9877N1262N2892N4938
58818B622459N6801N8093N9291O1274O4529O9031P4675Q1598R0121J00361J11881
58807C450114J23987J36535J50063J64713J79448J92993K05211K16822K27952
58798E047838K37894K46032K51949K54539K52210K44331K31575K14417J92244
58789G173029J64469J31780R5826N8341K1141j3827m5117p2159r4800j13304j29326
$$ plain form
58862 4193970 4007373 3831314 3665853 3511044 3366591 3232042 3107325 2992499 2887145
58853 2887145 2790591 2702500 2622523 2549655 2482806 2421933 2367704 2320118 2278386 2242181 2211895
58842 2211895 2187325 2167102 2150003 2136136 2126204 2120162 2117226 2116919 2119508 2125555 2135486 2149551 2167802
58829 2167802 2190090 2216282 2246570 2281452 2321268 2365670 2413490 2463367 2514629 2567521 2622459
58818 2622459 2679260 2737353 2796644 2857918 2922447 2991478 3066153 3147751 3237872 3338233 3450114
58807 3450114 3574101 3710636 3860699 4025412 4204860 4397853 4603064 4819886 5047838
58798 5047838 5285732 5531764 5783713 6038252 6290462 6534793 6766368 6980785 7173029
58789 7173029 7337498 7469278 7565104 7623445 7644586 7630759 7585642 7513483 7418683 7305379 7176053
58778G176053j46217j67266j93533k23281k52842k77717k93953k99723k95928
58769E025593k85053k69568k51431k32288k13449j95687j79354j64516j50950
58760C083297j38377j26809j16278j06351r6545q7213p9172p2258o5247n7493
58750B137554m9819m3271l7781l2678k7742k3126j8714j4284r945n936k243J267
58738A873282M716Q465J2977J8076K2741K5754K6090K2755J5188M310p664j8801
58726B007889k8430l6373m2229m5805m7538m8081m8115m8603n0140n1715n1342
58715A509518m8520m4921m2061l9429l5730l0738k4901j8237j0806l432L152R094
58703A222989J4258J7088J5931J0899L256o277j7289k8248l6987m2451m4913m4715
$$ plain form
58778 7176053 7029836 6862570 6669037 6445756 6192914 5915197 5621244 5321521 5025593
58769 5025593 4740540 4470972 4219541 3987253 3773804 3578117 3398763 3234247 3083297
58760 3083297 2944920 2818111 2701833 2595482 2498937 2411724 2332552 2260294 2195047 2137554
58750 2137554 2087735 2044464 2006683 1974005 1946263 1923137 1904423 1890139 1880194 1874258 1872015 1873282
58738 1873282 1877998 1886463 1899440 1917516 1940257 1966011 1992101 2014856 2030044 2034354 2026690 2007889
58726 2007889 1979459 1943086 1900857 1855052 1807514 1759433 1711318 1662715 1612575 1560860 1509518
58715 1509518 1460998 1416077 1374016 1334587 1298857 1268119 1243218 1224981 1214175 1210743 1213895 1222989
58703 1222989 1237247 1254335 1270266 1281165 1284421 1278144 1260855 1232607 1195620 1153169 1108256 1063541
58691A063541m2039l7780l3247k8822k3915j8243j2313o629j293L573P835J1774
58679H82442J5781J9638K2806K5288K7527K9653L1639L4101L8142M4339N2345
58668A223701O1123O8646P1528O6091N0468K5787m254l4468n9595p6150q3679
58657A309198q4155q0142p3641o5970n7899m9813m2144l5415k9641k4221j8893
58646G47264j4260j0853q321o152m480l373k122k21J548K152J933K069K717L076
58632G10977K976L178L963M701M929N010N455O397P855R803J1903J3742J5343
58619H06232J6938J8401J9570K0830K2667K4850K6783K8413L0158L2176L4455
58608A081473L7284M0922M5106M9606N4677O0156O4813O7744O9790P2221P4427
$$ plain form
58691 1063541 1021502 983722 950475 921653 897738 879495 867182 860553 859260 862833 870668 882442
58679 882442 898223 917861 940667 965955 993482 1023135 1054774 1088875 1127017 1171356 1223701
58668 1223701 1284824 1353470 1424998 1491089 1541557 1567344 1563090 1528622 1469027 1392877 1309198
58657 1309198 1225043 1144901 1071260 1005290 947391 897578 855434 820019 790378 766157 747264
58646 747264 733004 722151 713830 707678 703198 699825 697703 697482 699030 701182 703115 705184 707901 710977
58632 710977 713953 717131 721094 725795 730724 735734 741189 747586 755441 765244 777147 790889 806232
58619 806232 823170 841571 861141 881971 904638 929488 956271 984684 1014842 1047018 1081473
58608 1081473 1118757 1159679 1204785 1254391 1309068 1369224 1434037 1501781 1571571 1643792 1718219
58597A718219P4395P1293O6062N9428N0853L9804K6756J2620j780j5397k7207
58586B075046l7032m5272n1738n5695n7090n6637n4682n1085m6387m1774l7696
58575A539958l3670k9700k6592k4457k2212j9193j6160j3973j2313j0455q526
58564A322707p177o668o977q233j0336j2534j3930j4159j3335j1839j0503j0611
58552A196405j3127j8059k4571l1388l7134m0807m2232m1809l9912l6922l3579
58541H36865l0655k8245k5934k3528k1166j8842j6553j4718j3764j3373j2785
58530F17302j1688j0216q428o554n364n263n373m578l173k313k034j261K65J574
58516E52896K198K931M325N731O441O749P349Q442R911J1591J2971J3415J2989
$$ plain form
58597 1718219 1792614 1863907 1929969 1989397 2040250 2080054 2106810 2119430 2117650 2102253 2075046
58586 2075046 2038014 1992742 1941004 1885309 1828219 1771582 1716900 1665815 1619428 1577654 1539958
58575 1539958 1506288 1476588 1449996 1425539 1403327 1384134 1367974 1354001 1341688 1331233 1322707
58564 1322707 1315530 1308862 1301885 1293652 1283316 1270782 1256852 1242693 1229358 1217519 1207016 1196405
58552 1196405 1183278 1165219 1140648 1109260 1072126 1031319 989087 947278 907366 870444 836865
58541 836865 806210 777965 752031 728503 707337 688495 671942 657224 643460 630087 617302
58530 617302 605614 595398 586970 580416 575052 569789 564416 559838 556665 554352 552318 551057 551322 552896
58516 552896 555094 558025 562350 568081 574522 581271 588620 597062 606973 618564 631535 644950 657939
58503F57939J2378J1791J0737Q996O938M667J921r81l014l730l831m163m815n465
58489F89368n812n604m941m623n302o344o608o252o587q018r463j0056j0120j0079
58475E89559r689q885q211p916p602p146o838o374m938k785j364j297j520j064
58461E13930m79o03j193j590j815k028j803q57L17J197J965K786L266L195L009
58446E19297K839K106O83m42n49k93o06j281j515j152n14L45J344J862J432N21
58430E24077m8n9K53Q70J846K923L786M357M584M332L745L258L060L043L336M116
58414E67479M915M983M445M132M162L803K903K262K251K287K058K080K522K719
58400F13001K411K301K675K627J538K75Q2J043K340L275L529L091K519K505K901
$$ plain form
58503 657939 670317 682108 692845 701841 708779 713446 715367 714386 711372 707642 703811 699648 694833 689368
58489 689368 683556 677952 673011 668388 663086 656742 650134 643882 637295 629277 619814 609758 599638 589559
58475 589559 579870 570985 562774 554858 547256 540110 533272 526898 521960 519175 517811 516514 514994 513930
58461 513930 513451 512848 511655 510065 508250 506222 504419 503562 503879 505076 507041 509827 513093 516288 519297
58446 519297 522136 524242 524925 524483 523934 523641 523035 521754 520239 519087 518573 518918 520262 522124 523556 524077
58430 524077 524029 523970 524223 525093 526939 529862 533648 538005 542589 546921 550666 553924 556984 560027 563363 567479
58414 567479 572394 577377 581822 585954 590116 593919 596822 599084 601335 603622 605680 607760 610282 613001
58400 613001 615412 617713 620388 623015 624553 624828 624910 625953 628293 631568 635097 638188 640707 643212 646113
58385F46113K968K709K967L906M652M700M518M391M018L566L758M467M669M251
58371G01653M373N428O296O247N993O051N768M934M704N697O713O567N886N818
58357G82128O225O365O261O174N757M856M138M009L934L678L956M985N732N604
58343H53802N533O313P257P645Q075R199J0360J0811J1050J1650J2032J1670J1404
58330I76801J2120J3252J3806J3951J4442J5410J6704J8440K0316K1519K2120
58319A158881K3207K4818K5270K3507K0595J7857J5149J2082R350P538O132M810
58307A349196M253M698N333O086Q038J1071J3250J3781J4356J6170J7925J8410
58295A482567J8726K0068K1551K2181K2850K4369K5634K5801K6183K7919K9935
$$ plain form
58385 646113 649081 651790 654757 658663 663315 668015 672533 676924 680942 684508 688266 692733 697402 701653
58371 701653 706026 711454 717750 723997 729990 736041 741809 746743 751447 757144 763857 770424 776310 782128
58357 782128 788353 794718 800979 807153 812910 817766 821904 825913 829847 833525 837481 842466 848198 853802
58343 853802 859335 865648 872905 880550 888625 897824 908184 918995 930045 941695 953727 965397 976801
58330 976801 988921 1002173 1015979 1029930 1044372 1059782 1076486 1094926 1115242 1136761 1158881
58319 1158881 1182088 1206906 1232176 1255683 1276278 1294135 1309284 1321366 1330716 1338254 1344386 1349196
58307 1349196 1353449 1358147 1363480 1369566 1377604 1388675 1401925 1415706 1430062 1446232 1464157 1482567
58295 1482567 1501293 1521361 1542912 1565093 1587943 1612312 1637946 1663747 1689930 1717849 1747784
58284A747784L1258L3077L6276L9229M0558M1763M4583M7904M9903N1057N2355
58273B215747N2604N0482M7241M4572M1776L7876L4451L3427L3958L4373L5203
58262B661710L7502M0322M2771M6214N1463N6279N8887O1301O5749P0543P3333
58251C266074P5760Q0602Q6785R1642R5886J01839J08790J14578J19910J26682
58241D268548J33889J39620J45226J53107J62390J71103J80426J92272K05031
58232E751612K16447K28204K42833K58742K73411K88778L08033L29977L52157
58223H250194L76525M06080M39066M72697N09340N52486O00219O49754P04727
58214A2961088P70461Q45872R28117J021326J132290J261792J409282J581623
$$ plain form
58284 1747784 1779042 1812119 1848395 1887624 1928182 1969945 2014528 2062432 2112335 2163392 2215747
58273 2215747 2268351 2318833 2366074 2410646 2452422 2490298 2524749 2558176 2592134 2626507 2661710
58262 2661710 2699212 2739534 2782305 2828519 2879982 2936261 2995148 3056449 3122198 3192741 3266074
58251 3266074 3341834 3422436 3509221 3600863 3696749 3798588 3907378 4021956 4141866 4268548
58241 4268548 4402437 4542057 4687283 4840390 5002780 5173883 5354309 5546581 5751612
58232 5751612 5968059 6196263 6439096 6697838 6971249 7260027 7568060 7898037 8250194
58223 8250194 8626719 9032799 9471865 9944562 10453902 11006388 11606607 12256361 12961088
58214 12961088 13731549 14577421 15505538 16526864 17659154 18920946 20330228 21911851
58206B1911851J787472K027891K303310K625403L012522L480836M052536M764291
58198D5966112N651096O727245P998763R488708J1237961J3296348J5733206J8636691
58190A34736130K2062459K5963070L0118725L3993556L6531093L6201468L1624389
58183C51230890K2515754J0148546l181604j5249618k4652164l0848043l3865791
58176B76097970l4117601l2313290k9281017k5728619k2129396j8761299j5772171
58169I7994577j3207786j1044771r240621p755798o542819n546328m722672m044387
58161C5889395l485214l017113k622890k296462k028224j802038j607220j441628
58153A7588606j301691j179460j070269r73779q86891q04242p25986o56842n97095
$$ plain form
58206 21911851 23699323 25727214 28030524 30655927 33668449 37149285 41201821 45966112
58198 45966112 51617208 58344453 66343216 75831924 87069885 100366233 116099439 134736130
58190 134736130 156798589 182761659 212880384 246873940 283405033 319606501 351230890
58183 351230890 373746644 383895190 380713586 365463968 340811804 309963761 276097970
58176 276097970 241980369 209667079 180386062 154657443 132528047 113766748 97994577
58169 97994577 84786791 73742020 64501399 56745601 50202782 44656454 39933782 35889395
58161 35889395 32404181 29387068 26764178 24467716 22439492 20637454 19030234 17588606
58153 17588606 16286915 15107455 14037186 13063407 12176516 11372274 10646288 9989446 9392351
58144I392351n42051m90308m44871m05924l69690l35196l05663k82595k64322
58135E951731k50413k41727k35840k28033k17229k06085j95315j83059j69766
58126D024264j58502j49956j41707j32746j24519j17421j10319j03582r8663r4802
58116B792047q9953q4571q0748p8083p4362o9816o6649o4724o1764n7581n4160
58105B009636n1669m8428m4666m2380m1377l9376l6236l4255l4013l3642l2614
58094A570980l2497l3405l3251l1350k9535k8858k8101k6351k4356k2662k0933
58083A259681j9614j9779k0982k1558k1327k1542k2214k2123k1444k1657k2618
58072A024823k2526k1059j9817j9320j8393j6907j6329j6908j6945j5613j4032
$$ plain form
58144 9392351 8850300 8359992 7915121 7509197 7139507 6804311 6498648 6216053 5951731
58135 5951731 5701318 5459591 5223751 4995718 4778489 4572404 4377089 4194030 4024264
58126 4024264 3865762 3715806 3574099 3441353 3316834 3199413 3089094 2985512 2886849 2792047
58116 2792047 2702094 2617523 2536775 2458692 2384330 2314514 2247865 2183141 2121377 2063796 2009636
58105 2009636 1957967 1909539 1864873 1822493 1781116 1741740 1705504 1671249 1637236 1603594 1570980
58094 1570980 1538483 1505078 1471827 1440477 1410942 1382084 1353983 1327632 1303276 1280614 1259681
58083 1259681 1240067 1220288 1199306 1177748 1156421 1134879 1112665 1090542 1069098 1047441 1024823
58072 1024823 1002297 981238 961421 942101 923708 906801 890472 873564 856619 841006 826974
58061H26974j2839j1194q929p419p389p921q340r076j0065j0344r848r612r668
58048G04330q828p083o083o528p120o892o637p117p692p683p443p238o556n286
58034F06144m210l761l555l478l819m121l545k605k667l552l508k005n03O7N48
58019E65430J526K133J895J912L008M288M741M907N776P237Q673J0145J1985J4036
58005F47692J6046J8028J9763K0866K1704K3159K5231K6962K8050K9351L1406
57994I08258L3814L6360L9309M2152M3563M3202M2168M1081L9153L5838L2028
57983A336926K8752K5980K3564K2076K1753K1536J9986J6390J0359J429j0189
57972A518562k3232l6344m8570n8611o4883o6968o6067o3389n9054n3162m6768
$$ plain form
58061 826974 814135 802941 794012 786593 779204 771283 762943 753867 743802 733458 723610 713998 704330
58048 704330 695502 688419 682336 675808 668688 661796 655159 648042 640350 632667 625224 617986 611430 606144
58034 606144 601934 598173 594618 591140 587321 583200 579655 577050 574383 570831 567323 565318 564815 564882 565430
58019 565430 566956 569089 570984 572896 575904 580192 584933 589840 595616 602853 611526 621671 633656 647692
58005 647692 663738 681766 701529 722395 744099 767258 792489 819451 847501 876852 908258
57994 908258 942072 978432 1017741 1059893 1103456 1146658 1188826 1229907 1269060 1304898 1336926
57983 1336926 1365678 1391658 1415222 1437298 1459051 1480587 1500573 1516963 1527322 1528751 1518562
57972 1518562 1495330 1458986 1410416 1351805 1286922 1219954 1153887 1090498 1031444 978282 931514
57961I31514m0970l5837l0899k6008k1177j6375j1945q485n940l664j505Q3J138
57948G29930K175K873K258N91m53p3O68Q34J139K466M292N733P082R103J1815
57933G80433J4913J8565K2647K6085K8042K8900K9086K7662K3303J6103P233k598
57921A020374j3224k3859l2953l9292m2602m3277m2069l9813l7029l3875l0540
57910F41841k7160k3414j9010j4723j1904j0613r435p599o074n884o568p266q145
57897D84046r568j0835j1070j0712j0812j1282j1107r992q684p754o989n988m581
57884C64672k790q61P56J931L044M334N509O402P365Q484R144Q973Q586Q620Q648
57869D42817P904O541N274M232K999J435k36j907l502m757n724o921q367r121
$$ plain form
57961 931514 890544 854707 823808 797800 776623 760248 748303 739818 733878 730214 728709 728792 729930
57948 729930 732105 734978 737236 737827 737374 737301 737969 738803 739942 742408 746700 752433 759515 768618 780433
57933 780433 795346 813911 836558 862643 890685 919585 948671 976333 999636 1015739 1022972 1020374
57921 1020374 1007150 983291 950338 911046 868444 825167 783098 743285 706256 672381 641841
57910 641841 614681 591267 572257 557534 545630 535017 525582 517983 511909 506025 499457 492191 484046
57897 484046 474478 463643 452573 441861 431049 419767 408660 398668 389984 382230 375241 369253 364672
57884 364672 361882 361021 361777 363708 366752 371086 376595 382997 390362 398846 407990 416963 425549 434169 442817
57869 442817 450721 457262 462536 466768 469767 471202 470966 469059 465557 460800 455076 448155 439788 430667
57855D30667q595p692p625q110p826o353m516k988j629k63Q45J480J759J853J930
57840C82937K272K903L231K720J681P69l9j191k516l261l193k801k376j660n80
57825C78896M32J143J936L245M985O815Q575J0299J1989J3477J4312J3964J2431
57812D82499J0625R709J0060J1290J3160J5949J9803K4201K8438L2354L6159L9543
57800G33790M1388M0561L6822L0641K2295J1753l22j2118k1884k9271l4897l8887
57788G79871m0793m0754l9717l8320l6530l4485l2765l1381k9555k6921k4122
57777D04528k1680j9236j6523j4118j2480j1002r025p092o206o312o398n821m698
57764B63937l348k140j551j609j600j001l12k05l31P0Q15J087Q69J060K120L584
$$ plain form
57855 430667 422072 414380 406755 398645 390819 384466 379950 376962 375333 375070 375915 377395 379154 381007 382937
57840 382937 385209 388112 391343 394063 395744 396513 396474 395283 392767 389506 386313 383512 381136 379476 378896
57825 378896 379328 380471 382407 385652 390637 397452 406027 416326 428315 441792 456104 470068 482499
57812 482499 493124 502833 512893 524183 537343 553292 573095 597296 625734 658088 694247 733790
57800 733790 775178 815739 852561 883202 905497 917250 916928 904810 882926 853655 818758 779871
57788 779871 739078 698324 658607 620287 583757 549272 516507 485126 455571 428650 404528
57777 404528 382848 363612 347089 332971 320491 309489 300464 293372 287166 280854 274456 268635 263937
57764 263937 260589 258449 256898 255289 253689 252688 252376 252171 251840 251910 252725 253812 254681 255741 257861 261445
57748B61445M967O231P277P774P802P982Q647R420R668R084P697N806L943K463
57734C60206J151m99k485m158m806m249k974j805j210p99J33J491K360K379K320
57719C47055K871L573L633L135K667K383K317L006M691O416P061P001P576R112
57705D12497J0678J1714J2640J3687J4383J4566J4909J6021J7787J9907K2379
57694E81168K5143K7921L0778L4186L8317M2743M7064N1291N5590O0144O5323
57683A059668P1308P7465Q2756Q6895R0387R3346R4998R4663R2646Q9949Q7561
57672B021642Q6269Q6677Q9097R3217R6935R4747P8437M2063j2151p3248j27497
57661B476188j65305j83807j85416j75310j59090j40875j22708j05459q9736p5837
$$ plain form
57748 261445 266412 272643 279920 287694 295496 303478 312125 321545 331213 340297 347994 353800 357743 360206
57734 360206 361357 360858 358373 354215 349409 345160 342186 340381 339171 338372 338505 339996 342356 344735 347055
57719 347055 349926 353499 357132 360267 362934 365317 367634 370640 375331 381747 388808 395809 403385 412497
57705 412497 423175 434889 447529 461216 475599 490165 505074 521095 538882 558789 581168
57694 581168 606311 634232 665010 699196 737513 780256 827320 878611 934201 994345 1059668
57683 1059668 1130976 1208441 1291197 1378092 1468479 1561825 1656823 1751486 1844132 1934081 2021642
57672 2021642 2107911 2194588 2283685 2376902 2473837 2568584 2647021 2689084 2676933 2603685 2476188
57661 2476188 2310883 2127076 1941660 1766350 1607260 1466385 1343677 1238218 1148482 1072645
57651A072645o3706n3406m5092l8292l2010k5893k0573j6462j3020r731o832m421
57639G43207j686K023N994R013J0994J2874J5241J8003K1165K4950K9165L3182
57627I24125L6671L9793M2727M5511M8288N1200N4073N6521N8276N9017N8117
57616A474319N4988M9593M2097L2404K0542P399n668j7893k9315l9915m9128n6304
57604A483119o1263o4275o5809o6219o5398o2911n8898n4551n1151m8676m6012
57593H37956m2508l8625l5013l1749k8797k6519k5139k4175k2915k1245j9536
57582E21735j7888j6068j4097j2422j1324j0443r123p179n196m029l941m261m033
57569D01731k971j715j008q79q11n85n46r64j409j124R0J525K256K049J510J469
$$ plain form
57651 1072645 1008939 955533 910441 872149 840139 814246 793673 777211 764191 754460 747628 743207
57639 743207 741521 743544 749538 758551 769545 782419 797660 815663 836828 861778 890943 924125
57627 924125 960796 1000589 1043316 1088827 1137115 1188315 1242388 1298909 1357185 1416202 1474319
57616 1474319 1529307 1578900 1620997 1653401 1673943 1681342 1675674 1657781 1628466 1588551 1539423 1483119
57604 1483119 1421856 1357581 1291772 1225553 1160155 1097244 1038346 983795 932644 883968 837956
57593 837956 795448 756823 721810 690061 661264 634745 609606 585431 562516 541271 521735
57582 521735 503847 487779 473682 461260 449936 439493 430370 423191 417995 413966 410025 405764 401731
57569 401731 398760 397045 396037 395158 394347 393762 393216 392252 390843 389719 389809 391334 393590 395639 397149 398618
57553C98618K273L670N209O661Q000R073R471Q970Q082P831Q769J0452J2128J3733
57539E12940J5751J8238K0596K2488K4441K7124L0357L3409L6053L8742M1709
57528H21848M4528M6748M8418M9603M9830M8508M5711M1923L7100L0598K2157
57517A286972J2434K370p548j7047k5667l3068l9384m4712m8508n0147m9924m8819
57505I36952m7284m4999m1845l8385l5148l2116k9205k6573k4139k1482j8633
57494E77143j6210j4345j2269r582p078n463m014j767O48J826J952K771N053P616
57480E26281R323J0620J2346J4285J5846J7362J9531K2113K4322K6218K8710L2227
57468G59184L6134L9532M1998M3507M4175M4220M3660M1976L8390L2675K5342
$$ plain form
57553 398618 400891 404561 409770 416431 424431 433504 442975 451945 460027 467858 476627 487079 499207 512940
57539 512940 528691 546929 567525 590013 614454 641578 671935 705344 741397 780139 821848
57528 821848 866376 913124 961542 1011145 1060975 1109483 1155194 1197117 1234217 1264815 1286972
57517 1286972 1299406 1301776 1294228 1277181 1251514 1218446 1179062 1134350 1085842 1035695 985771 936952
57505 936952 889668 844669 802824 764439 729291 697175 667970 641397 617258 595776 577143
57494 577143 560933 546588 534319 524737 517659 512196 508182 506415 507063 508889 510841 513612 518665 526281
57480 526281 535604 546224 558570 572855 588701 606063 625594 647707 672029 698247 726957 759184
57468 759184 795318 834850 876848 920355 964530 1008750 1052410 1094386 1132776 1165451 1190793
57457A190793J7044Q028j726j2033k2321l1754l9570m5443m9543n2139n3272n2897
57445H55167n1304m9108m6806m4425m1672l8404l4959l1950k9658k7670k5372
57434D33839k2732k0282j8335j6587j4698j2854j1487j0641r969r241q559q138
57422B70316q017p942p489o512n521n276n790o100n373l985l066l151l705l915
57408A94474l544k913k401k144k029j836j486j150j056j200j311j129o53j67k1
57393A71434l30q28j168j296j356j221n53N33J278J146O39P06J462K014J709R83
57377A75152O96Q45N50o93k114k505j741j006j288k176k563k149j574j223p09
57362A57502K19J006J003L74k12m59n41n55l98r2J86L70N31O91Q58J045J152J028
$$ plain form
57457 1190793 1207837 1215865 1214139 1202106 1179785 1148031 1108461 1063018 1013475 961336 908064 855167
57445 855167 803863 754755 707949 663524 621852 583448 548489 516539 486881 459211 433839
57434 433839 411107 390825 372490 355903 341205 328351 316864 306223 296254 287013 278454 270316
57422 270316 262299 254357 246868 240356 234835 229559 223769 217669 212296 208311 205245 202094 198389 194474
57408 194474 190930 188017 185616 183472 181443 179607 178121 176971 175915 174715 173404 172275 171622 171455 171434
57393 171434 171104 170276 169108 167812 166456 165235 164682 165215 166493 167639 168278 168984 170446 172460 174169 175152
57377 175152 175848 176693 177243 176550 174436 171931 170190 169184 167896 165720 163157 161008 159434 158211 157502
57362 157502 157721 158727 159730 160104 159892 159433 158892 158337 157939 157847 158033 158403 158934 159625 160483 161528 162680 163708
57344A63708Q08Q80J249J352Q90M23N70J036J069O45M47P28J052J136J290J781
57328A79064K425L013L619M266M730M934N095N275N233M906M628M641M792M934
57314B41555N180N515N667N623N783O269O604O583O875Q068R539J0107R730R579
57300C42677J0342J1233J1059R658P831O213M807L378J815N0k025m389o794q987
57286C86868j0903j2558j3920j4927j5615j5986j5778j4591j2476j0205q714q206
57274B32989q066p667o939o103n134l881k507j392o16O1O39P20J85l04M9J159
57258A93193K096K275K140K460L325M174M707N156N667N916N653N261N350N992
57244B53365O746P367Q011Q759R353R624R842J0367J1140J1746J1943J1876J1876
$$ plain form
57344 163708 164516 165396 166645 167997 168887 169310 169880 170916 171985 172630 173077 173805 174857 175993 177283 179064
57328 179064 181489 184502 188121 192387 197117 202051 207146 212421 217654 222560 227188 231829 236621 241555
57314 241555 246735 252250 257917 263540 269323 275592 282196 288779 295654 303722 313261 323368 333098 342677
57300 342677 353019 364252 375311 384969 392800 399013 403820 407198 409013 409063 407038 402649 395855 386868
57286 386868 375965 363407 349487 334560 318945 302959 287181 272590 260114 249909 241195 232989
57274 232989 224923 217256 210317 204214 199080 195199 192692 191300 190684 190745 191384 192104 192289 191985 192034 193193
57258 193193 195289 197564 199704 202164 205489 209663 214370 219526 225193 231109 236762 242023 247373 253365
57244 253365 260111 267478 275489 284248 293601 303225 313067 323434 334574 346320 358263 370139 382015
57231C82015J2116J2449J2518J2220J2024J2582J3933J5383J6411J7338J8671
57220E37660K0045K0529K0030J9739K0761K2711K4210K4633K4762K5638K7218
57209G87936K8584K9244K9746L0927L2864L4865L6384L7607L9045M0803M2517
57198A170522M3853M4842M5709M6620M7618M8630M9391M9538M8901M7582M5726
57187A688932M3312M0352L7169L4306L2173L0786K9783K8627K6942K4862K2892
57176B040136K1315J9811J7916J5739J3998J3365J3894J5000J5757J5418J4044
57165B216393J2602J2028J2192J2241J1930J1999J2978J4347J5394J6258J7398
57154B365760J8416J8373J7197J5911J5354J5364J5407J5267J4894J4201J3482
$$ plain form
57231 382015 394131 406580 419098 431318 443342 455924 469857 485240 501651 518989 537660
57220 537660 557705 578234 598264 618003 638764 661475 685685 710318 735080 760718 787936
57209 787936 816520 845764 875510 906437 939301 974166 1010550 1048157 1087202 1128005 1170522
57198 1170522 1214375 1259217 1304926 1351546 1399164 1447794 1497185 1546723 1595624 1643206 1688932
57187 1688932 1732244 1772596 1809765 1844071 1876244 1907030 1936813 1965440 1992382 2017244 2040136
57176 2040136 2061451 2081262 2099178 2114917 2128915 2142280 2156174 2171174 2186931 2202349 2216393
57165 2216393 2228995 2241023 2253215 2265456 2277386 2289385 2302363 2316710 2332104 2348362 2365760
57154 2365760 2384176 2402549 2419746 2435657 2451011 2466375 2481782 2497049 2511943 2526144 2539626
57143B539626J3358J3841J4051J3403J2575J2556J3128J3181J2302J1225J0589
57132B679835J0149R461Q643Q062P774P703Q087R330J1605J4784J8595K2647K6669
57119B843344L0950L6247M2942N0500N8038O5033P1226P6187P9561Q1757Q4035
57108C519820Q8120R5974J09486J29616J55965J87884K26176K73141L31005M01149
57098E518336M85172N85819P06026Q47322J009329J190285J387203J595706J810188
57089A5135386K023807K227724K410503K558978K659980K701343K672030K562637
57081C4952388K366632K081985J713667J276578P95547K99310j88520o53743j087723
57072D1556121j480868j820752k095467k297170k422939k474303k457229k381879
$$ plain form
57143 2539626 2552984 2566825 2580876 2594279 2606854 2619410 2632538 2645719 2658021 2669246 2679835
57132 2679835 2689984 2699445 2708088 2716150 2723924 2731627 2739714 2749044 2760649 2775433 2794028 2816675 2843344
57119 2843344 2874294 2910541 2953483 3003983 3062021 3127054 3198280 3274467 3354028 3435785 3519820
57108 3519820 3607940 3703914 3813400 3943016 4098981 4286865 4513041 4786182 5117187 5518336
57098 5518336 6003508 6589327 7295353 8142675 9152004 10342289 11729492 13325198 15135386
57089 15135386 17159193 19386917 21797420 24356398 27016378 29717721 32389751 34952388
57081 34952388 37319020 39401005 41114672 42391250 43186797 43486107 43297587 42643844 41556121
57072 41556121 40075253 38254501 36159034 33861864 31438925 28964622 26507393 24125514
57064B4125514k261234k109074j938268j759575j581119j408837j247260j099723
57056A0720424r67962q52172p51687o65436n91911n29253m75666m29508l89031
57047E067798l52532l19003k88288k60409k35064k11967j91238j73111j57337
57038B878849j43167j29846j17020j04754r3241q2416p1816o0854m9151l6484
57028A990100k2659p519R321K8820N1205P2635Q3500P2941L7485j4404o7209j07986
57016B126230j31954j40920j38906j29639j16271j01434q7011p4073o3071n4023
57006A088928m6647m0484l5043l0044k5682k2475k0622j9666j9007j8578j8691
56995G91989j9351k0080k0336j9829j8514j6690j4937j3602j2291j0312p469m184
$$ plain form
57064 24125514 21864280 19755206 17816938 16057363 14476244 13067407 11820147 10720424
57056 10720424 9752462 8900290 8148603 7483167 6891256 6362003 5886337 5456829 5067798
57047 5067798 4715266 4396263 4107975 3847566 3612502 3400535 3209297 3036186 2878849
57038 2878849 2735682 2605836 2488816 2384062 2290821 2208405 2136589 2075735 2026584 1990100
57028 1990100 1967441 1959922 1969243 1998063 2049268 2121903 2205403 2278344 2315829 2301425 2234216 2126230
57016 2126230 1994276 1853356 1714450 1584811 1468540 1367106 1280095 1206022 1142951 1088928
57006 1088928 1042281 1001797 966754 936710 911028 888553 867931 848265 829258 810680 791989
56995 791989 772638 752558 732222 712393 693879 677189 662252 648650 636359 626047 618578 614394
56983F14394r65J706L002K060j057n135q811j1439j2902j3150j2361j1115r924
56970E34303q751p382n946m643l240j354Q24K687M106N656P831J0473J3183J5698
56956E63445J7452J7154J3592P015p20p603j2814j6554j9011j9958j9217j7095
56944E05686j4242j1291q634o283l884j140J715M157O173Q503J1789J5799J9643
56931E27991K2568K4108K3661K0443J4099N238m661j3852k0948k5338k7118k6729
56919E19462k4737k1909j9106j6793j4802j2806j0841r145p756o595n796n503
56907C63673n498n377n017m533l913l173k645k574k518j848p87j62n0M85J965
56892C28028L649M683N353O530Q359J0375J2392J4337J5316J3913R787M283q89
$$ plain form
56983 614394 613429 615135 618137 620197 619140 614005 605194 593755 580853 567703 555342 544227 534303
56970 534303 525552 518170 512224 507581 504341 502987 503811 506498 510604 516260 524091 534564 547747 563445
56956 563445 580897 598051 611643 618658 617938 610335 597521 580967 561956 541998 522781 505686
56944 505686 491444 480153 471519 465236 461352 460212 461927 466084 472257 480760 492549 508348 527991
56931 527991 550559 574667 598328 618771 632870 638108 633447 619595 598647 573309 546191 519462
56919 519462 494725 472816 453710 436917 422115 409309 398468 389323 381567 374972 369176 363673
56907 363673 358175 352798 347781 343248 339335 336162 333517 330943 328425 326577 325790 325628 325578 326063 328028
56892 328028 331677 336360 341713 348243 356602 366977 379369 393706 409022 422935 432722 437005 436116
56879D36116n080q505j1076j2089j1118q804o476m909l609j570J378M388O868
56866C75514R406J2920J7301K1638K5586K9661L3974L7341L8053L4989K7844J7002
56854F81229L941q728j8525k4603k7548k7938k5778k1430j6241j1588p615l471
56842D91705J364O549J1730J7273K3777L1178L8811M6221N3268N9135O1619N7946
56830I00576M6507K8033N422j7201l5845m8085n3869n4869n2777m8306m1787l4145
56818E93654k6746k0240j4126p662r35N285J0648J5799K1778K8941L6564M3166
56806F86126M6905M5806L8311K4352O045j2980k9361m1275m8308n0645m8783m3815
56794E72378l7375l0877k4882j9337j4289j0030o550l150R76N884J0881J5404
$$ plain form
56879 436116 431036 422531 411455 399366 388248 379444 372968 368059 364450 362880 364258 368646 375514
56866 375514 384920 397840 415141 436779 462365 492026 526000 563341 601394 636383 664227 681229
56854 681229 685170 676442 657917 633314 605766 577828 552050 530620 514379 502791 495176 491705
56842 491705 493069 499618 511348 528621 552398 583576 622387 668608 721876 781011 842630 900576
56830 900576 947083 975116 980538 963337 927492 879407 825538 770669 717892 669586 627799 593654
56818 593654 566908 546668 532542 524880 523945 529230 539878 555677 577455 606396 642960 686126
56806 686126 733031 778837 817148 841500 847545 834565 805204 763929 715621 664976 616193 572378
56794 572378 535003 504126 479244 459907 445618 435588 429038 425888 426864 432748 443629 459033
56782D59033J9472K3053K5302K4917K1170J4266M928n739j5941k3649k7878k9240
56770D89694k8909k7443k5060k2380k0032j7800j5065j2099j0015r172q545p182
56758B85992n539m731m886n043m419l146j833r49o70q14r34q00p17j039j493j431
56742B47548q12l20m55q72r04l66L10N91L19j45j90M04J169J464J219Q16M19l1
56724B50164k18L94J549K046J114m96j393j085k16M51O12K68l12m61M06J968L189
56707B57980L499L394L677M433N091N204M876M504M322M174L709K810J863J420
56693C10956J578J846J682J018J70m92p39n46j42J21J34J83N97J327K039K495
56677C22227K636K394J737R41M74M28K74n03j658k372k227j717j666k382l534
$$ plain form
56782 459033 478505 501558 526860 551777 572947 587213 592141 586402 570461 546812 518934 489694
56770 489694 460785 433342 408282 385902 365870 348070 333005 320906 310891 301719 293174 285992
56758 285992 280453 275722 270836 265793 261374 258228 256395 255446 254776 253962 253028 252228 251511 250472 248979 247548
56742 247548 246736 246416 245961 245089 244185 243819 244129 244720 245039 244894 244704 245108 246277 247741 248960 249776 250195 250164
56724 250164 249946 250340 251889 253935 255049 254553 253160 252075 251859 252310 252922 253190 252878 252417 252823 254791 257980
56707 257980 261479 264873 268550 272983 278074 283278 288154 292658 296980 301154 304863 307673 309536 310956
56693 310956 312534 314380 316062 317080 317250 316758 316019 315473 315331 315452 315586 315769 316366 317693 319732 322227
56677 322227 324863 327257 328994 329935 330409 330837 331111 330608 328950 326578 324351 322634 320968 318586 315052
56662C15052m613n231n186m583l878l486l340l100k732k541k578k484k106j854
56648B67340k149k745k965k454j429l42M24O52M78M44R97J890K296J690M45n04
56632B64068n93j81j65r43j843j843r05j87o34j765k348j971j363j194j293j186
56616B45654r00p81r52j204j271q64K33J805L082L380K835K194J923J804J474
56601B58412R66N80M86O86J257K218L188L456K701J455O70P88J438J990K175K072
56585B84538J818J506J243J089R28N93J21k22j83K22O99R09Q26Q32J339K327L445
56568C02030M473N444O250O504O031N168M382L755L127K446J749J048M71L08N56
56553C53742O43O2j005k059l067m301n549o160n995n715n954o645p289p520p246
$$ plain form
56662 315052 310439 305208 300022 295439 291561 288075 284735 281635 278903 276362 273784 271300 269194 267340
56648 267340 265191 262446 259481 257027 255598 255256 255680 256332 256810 257254 258251 260141 262437 264127 264572 264068
56632 264068 263475 263294 263129 262186 260343 258500 257595 257408 256774 255009 252661 250690 249327 248133 246840 245654
56616 245654 244754 243973 243021 241817 240546 239682 239915 241720 244802 248182 251017 253211 255134 256938 258412
56601 258412 259378 259958 260444 261130 262387 264605 267793 271249 273950 275405 276075 276863 278301 280291 282466 284538
56585 284538 286356 287862 289105 290194 291122 291715 291836 291614 291431 291653 292352 293261 294087 294919 296258 298585 302030
56568 302030 306503 311947 318197 324701 330732 335900 340282 344037 347164 349610 351359 352407 352878 353186 353742
56553 353742 354385 354447 353442 351383 348316 344015 338466 332306 326311 320596 314642 307997 300708 293188 285942
56538B85942o648o169o125o183n719m705l832l503l321k805k100j508r39k98l4
56523B32053n96j557k021j802j566j754j993j748j079m76l33p59j613k424k598
56508B09734k058j463j430j654j243M2J335J649R95J96k14l47m07k46K04N98O03
56491B06294M98Q02J473J928J824J407J059Q22N54K27p3k16oO64J579K366K931
56474B24133L401L577K950J515J19m41l64m47q83j035m40M55P87K88m44n96L6
56457B32611Q77J199R13O20Q43J369J538J094M95L86R21J694K148J952J051l13
56441B49398j587k098j628q39p68j734k958l519l382l145l063k888k512k130j684
56426B15463q48J97O58K13m00l55J29K65p7l28k03oP9L29R67J721K113J958J546
$$ plain form
56538 285942 279294 273125 267000 260817 255098 250393 246561 243058 239737 236932 234832 233324 232385 232087 232053
56523 232053 231457 229900 227879 226077 224511 222757 220764 219016 217937 217461 217128 216369 214756 212332 209734
56508 209734 207676 206213 204783 203129 201886 201928 203263 204912 205907 206103 205889 205542 205135 204889 205093 205691 206294
56491 206294 206792 207594 209067 210995 212819 214226 215285 216107 216661 216888 216815 216599 216593 217257 218836 221202 224133
56474 224133 227534 231111 234061 235576 235695 235254 234890 234443 233560 232525 232085 232540 233327 233615 233171 232575 232611
56457 232611 233488 234687 235600 236220 237063 238432 239970 241064 241559 241945 242866 244560 246708 248660 249711 249398
56441 249398 247811 245713 244085 243246 242478 240744 237786 234267 230885 227740 224677 221789 219277 217147 215463
56426 215463 214615 214812 215470 215683 215283 214928 215057 215322 215245 214917 214714 214708 214787 215116 216083 217804 219917 221875 223421
56407B23421J473K198L427M095L479K204J542J771J911J226K30j96p0p7n24j126
56391B44984j637k046k230j954j321p53m61k30J65O07Q62Q99Q64Q19O39J39o62
56374B38684j308j125O4J508K184J897J331J032Q42N26M28Q95J448J233K90l18
56358B49611J83J365K252K469K314K091J906J976K536L270L365K420J058K95M43
56343B77554R33J212J436K122L293M260M362L703L040K947L255L312K768J967
56329C16164J595J967K726L298L568L942M750N764O446O525O135N521M867M350
56315C77618M067L837L408K798K276J813J008k59j366j502o15M71R31P19M99R24
56299C96627J982L049L595L740L986M481M869M919M870M993N220N480O126P465
$$ plain form
56407 223421 224894 227092 230519 234614 238093 240297 241839 243610 245521 246747 246977 246781 246711 246634 246110 244984
56391 244984 243347 241301 239071 237117 235796 235043 234582 234352 234517 235124 235986 236885 237749 238568 239207 239346 238684
56374 238684 237376 236251 236315 237823 240007 241904 243235 244267 245109 245635 246063 246958 248406 249639 249929 249611
56358 249611 249794 251159 253411 255880 258194 260285 262191 264167 266703 269973 273338 275758 276816 277111 277554
56343 277554 278487 279699 281135 283257 286550 290810 295172 298875 301915 304862 308117 311429 314197 316164
56329 316164 317759 319726 322452 325750 329318 333260 338010 343774 350220 356745 362880 368401 373268 377618
56315 377618 381685 385522 388930 391728 394004 395817 396825 396566 395200 393698 393083 393554 394485 395204 395703 396627
56299 396627 398609 401658 405253 408993 412979 417460 422329 427248 432118 437111 442331 447811 453937 461402
56285D61402R110J0244J0622J0877J1730J3201J4708J5787J6600J7752J9720K2398
56273F34151K5293K8156L1320L5307M0255M5802N1487N7163O3062O9462P6217
56262A157675Q2767Q8769R4492J00122J04900J07660J08258J07568J05804J01723
56252B159738R4220Q3917P2357O0123M6771L2287J7611L751q821j9871k9331l7652
56240B475100m5581n3353o0584o6905p2210p6417p9554q2062q4336q6026q6403
56229A681669q5379q3430q0612p6571p1583o6701o2479n8424n4065m9791m6109
56218I46525m2792l9308l5608l2015k8726k5825k3391k1250j9008j6678j4773
56207F47151j3458j2146j0366q564p476p069o632n725m567l571k921k467j896
$$ plain form
56285 461402 470512 480756 491378 502255 513985 527186 541894 557681 574281 592033 611753 634151
56273 634151 659444 687600 718920 754227 794482 840284 891771 948934 1011996 1081458 1157675
56262 1157675 1240442 1329211 1423703 1523825 1628725 1736385 1844643 1952211 2058015 2159738
56252 2159738 2253958 2337875 2410232 2470355 2517126 2549413 2567024 2570775 2561954 2542083 2512752 2475100
56240 2475100 2429519 2376166 2315582 2248677 2176467 2100050 2020496 1938434 1854098 1768072 1681669
56229 1681669 1596290 1512860 1432248 1355677 1284094 1217393 1154914 1096490 1042425 992634 946525
56218 946525 903733 864425 828817 796802 768076 742251 718860 697610 678602 661924 647151
56207 647151 633693 621547 611181 602617 595141 588072 581440 575715 571148 567577 564656 562189 560293
56194E60293j123n36n55q97p15K88J458K142K612L562N102O692P880Q651R204
56179F04058R685J0111J0396J0569J0965J1946J3349J4605J5433J6018J6374J6124
56167G59633J5126J3848J2849J2307J2346J3233J4900J6707J8176J9712K2109
56156I30946K5688L0375L6408M4481N5152O8400Q3790J00883J19312J38268J55722
56145A789425J68332J72629J66697J51017J28357J03270Q1063O5826N8595N7187
56135B942398N7424N4499M4494K6587M295j6398l0848l7896l9240l8356m0026
56124B926933m8910o6971r2250j20146j45319j62852j69597j65739j54411j39128
56114A661610j21950j04067q6807p1230n7515m5549l5442k7052j9827j3609q782
$$ plain form
56194 560293 559170 558634 558079 557182 556467 556755 558213 560355 562967 566529 571631 578323 586203 594854 604058
56179 604058 613743 623854 634250 644819 655784 667730 681079 695684 711117 727135 743509 759633
56167 759633 774759 788607 801456 813763 826109 839342 854242 870949 889125 908837 930946
56156 930946 956634 987009 1023417 1067898 1123050 1191450 1275240 1376123 1495435 1633703 1789425
56145 1789425 1957757 2130386 2297083 2448100 2576457 2679727 2760790 2826616 2885211 2942398
56135 2942398 2999822 3054321 3098815 3125402 3129697 3113299 3082451 3044555 3005315 2966959 2926933
56124 2926933 2878023 2811052 2718802 2598656 2453337 2290485 2120888 1955149 1800738 1661610
56114 1661610 1539660 1435593 1348786 1277556 1220041 1174492 1139050 1111998 1092171 1078562 1069780
56103A069780n180j837J611M287N453N500M930L503J176j151k789m159n653o678
56089A068793o781o664o913o663m878k100K92J927L299M478N236N882O806P653
56075A070367Q070Q643R967J1444J2207J2607J3469J4481J4748J4459J4563J5114
56063A220139J5333J5176J5398J6187J6920J7352J7877J8629J9247J9635K0059
56052A411952K0571K1018K1529K2321K3213K3935K4643K5666K7056K8818L1012
56041A681734L3213L4672L5434L6423L7918L9075L9531M0177M1511M2663M3056
56030B105407M3587M4922M6030M5933M5543M6283M8030N0021N2397N5287N7560
56019B641000N8385N8887O0437O2520O4166O6201O9944P4663P8583Q1557Q4682
$$ plain form
56103 1069780 1064600 1062763 1064374 1068661 1074114 1079614 1084544 1088047 1089223 1088072 1085283 1081124 1075471 1068793
56089 1068793 1062012 1055348 1048435 1041772 1036894 1034794 1035086 1037013 1040312 1044790 1050026 1055908 1062714 1070367
56075 1070367 1078437 1087080 1097047 1108491 1120698 1133305 1146774 1161255 1176003 1190462 1205025 1220139
56063 1220139 1235472 1250648 1266046 1282233 1299153 1316505 1334382 1353011 1372258 1391893 1411952
56052 1411952 1432523 1453541 1475070 1497391 1520604 1544539 1569182 1594848 1621904 1650722 1681734
56041 1681734 1714947 1749619 1785053 1821476 1859394 1898469 1938000 1978177 2019688 2062351 2105407
56030 2105407 2148994 2193916 2239946 2285879 2331422 2377705 2425735 2475756 2528153 2583440 2641000
56019 2641000 2699385 2758272 2818709 2881229 2945395 3011596 3081540 3156203 3234786 3316343 3401025
56008C401025Q8200R1812R6199J02048J08399J13979J19297J25520J32325J38917
55998D517721J45976J54399J63349J71791J80760J91828K04560K17736K31679
55989F179799K47006K62757K78273K95110L14538L35153L55885L78978M06693
55980I054192M37465M69085N03297N43172N88327O37238O91909P55616Q28326
55971A4508627R09397J002432J112258J239691J384896J553500J753635J990091
55963B5454527K268084K600393L004782L498695M103757M850140N766159O866585
55955E8413122Q160356R667355J1423505J3482309J5923490J8842930K2302520
55948A58215587K6263282L0498525L4417748L6847285L6096458L0637798K0167517
$$ plain form
56008 3401025 3489225 3581037 3677236 3779284 3887683 4001662 4120959 4246479 4378804 4517721
55998 4517721 4663697 4818096 4981445 5153236 5333996 5525824 5730384 5948120 6179799
55989 6179799 6426805 6689562 6967835 7262945 7577483 7912636 8268521 8647499 9054192
55980 9054192 9491657 9960742 10464039 11007211 11595538 12232776 12924685 13680301 14508627
55971 14508627 15418024 16420456 17532714 18772405 20157301 21710801 23464436 25454527
55963 25454527 27722611 30323004 33327786 36826481 40930238 45780378 51546537 58413122
55955 58413122 66573478 76240833 87664338 101146647 117070137 135913067 158215587
55948 158215587 184478869 214977394 249395142 286242427 322338885 352976683 373144200
55941C73144200O210055q386486k0775195k9265975l3603890l4501895l3015718
55934B19805096l0143632k6661048k3082380j9698735j6654189j4006837j1757091
55927G7801184r869610q299383p003830n939111n061130m334751l734783l237987
55919C0320599k822005k471597k177675j929674j715488j528327j366466j226100
55911A5083267j100800r87825q88646q02740p26375o57716n97796n46015m99446
55902H275908m57063m20167l88386l59276l32069l07908k86396k65649k45807
55893E213187k28776k14437k00574j86543j73652j61969j49999j37606j26207
55884C633424j16133j06580r7911r1145q5694q0687p8091q0956q8471r5846r9402
$$ plain form
55941 373144200 379354255 370967769 350192574 320926599 287322709 252820814 219805096
55934 219805096 189661464 163000416 139918036 120219301 103565112 89558275 77801184
55927 77801184 67931574 59632191 52628361 46689250 41628120 37293369 33558586 30320599
55919 30320599 27498594 25026997 22849322 20919648 19204160 17675833 16309367 15083267
55911 15083267 13982467 12994642 12105996 11303256 10576881 9919165 9321369 8775354 8275908
55902 8275908 7818845 7398678 7010292 6651016 6318947 6011039 5724643 5458994 5213187
55893 5213187 4984411 4769974 4569400 4382857 4209205 4047236 3897237 3759631 3633424
55884 3633424 3517291 3410711 3312800 3221655 3135961 3055274 2977183 2896227 2807756 2711910 2612508
55873B612508r9057r5903r0507q4074p8464p4200p0442o6984o4289o1722n8071
55862A768795n3824n0653m8682m6560m4082m2440m1794m0840l8869l6211l2801
55851A292039k8445k4377k2232k1470k0023j7480j5350j4131j2501r798p046n113
55839A094073l744k810k757l463m268n297p171r481j1200j2479j4269j6286j7281
55826I83567j7144j6925j6881j6454j6086j6911j8624j9712j9826j9915j9965
55815G85124j8902j6874j5390j4777j3643j1323q860p025n419m043l696m135l786
55802F57251k192r58j315k382k740k361j974j740j435j155j326k580n562r896
55788F19635j3554j4571j3217j1149q889n854k492j11J375L332N720O798N993
$$ plain form
55873 2612508 2513451 2417548 2327041 2242967 2164503 2090303 2019861 1952877 1888588 1826866 1768795
55862 1768795 1714971 1664318 1615636 1569076 1524994 1482554 1440760 1399920 1361051 1324840 1292039
55851 1292039 1263594 1239217 1216985 1195515 1175492 1158012 1142662 1128531 1116030 1106232 1099186 1094073
55839 1094073 1090329 1087519 1084762 1081299 1077031 1071734 1064563 1055082 1043882 1031403 1017134 1000848 983567
55826 983567 966423 949498 932617 916163 900077 883166 864542 844830 825004 805089 785124
55815 785124 766222 749348 733958 719181 705538 694215 685355 678330 672911 668868 665172 661037 657251
55802 657251 655059 654101 652786 650404 647664 645303 643329 641589 640154 638999 637673 635093 629531 619635
55788 619635 606081 591510 578293 567144 558255 552401 549909 549798 551173 554505 560225 567023 573016
55775E73016M728L689J512k773p927j2297j5642j8144j9251j8812j7898j7339
55763D52862j6642j5338j4125j3704j3639j3290j2750j2125j1068r744r041r111
55751C02285q981q176p381o832n686l816k548k617k966k647k420l036l502k649
55737B39028j241r01j737k616k997l075k748j816q32m74n18l82k59o98j522k134
55721B15078k477k736k612j786p43k22j87n7L21P64J387K431L700M777N596O299
55705B29533O772O784O363N797N377N274N262M777L735L036L458M326M372L635
55691B98501L231L295K863J867J487J968J956P85l53n25p06k019l777m725m998
55676B98850n428n894n844n610n741n823n205m273l723l201j947k03J252K449
$$ plain form
55775 573016 577744 581433 582945 580172 572245 559948 544306 526162 506911 488099 470201 452862
55763 452862 436220 420882 406757 393053 379414 366124 353374 341249 330181 320437 311396 302285
55751 302285 293304 285128 277747 270915 265229 261413 258865 256248 253282 250635 248215 245179 241677 239028
55737 239028 237787 236886 235149 232533 229536 226461 223713 221897 221065 220591 220073 219691 219432 218734 217212 215078
55721 215078 212601 209865 207253 205467 204724 204502 204315 204258 204579 205343 206730 209161 212861 217638 223234 229533
55705 229533 236305 243089 249452 255249 260626 265900 271162 275939 279674 282710 286168 290494 294866 298501
55691 298501 301732 305027 307890 309757 311244 313212 315168 315953 315600 315075 314369 312350 308573 303848 298850
55676 298850 293422 287528 281684 276074 270333 264510 259305 255032 251309 248108 246161 245958 247210 249659
55662B49659L924N594P061Q635J0898J3597J5816J6951J6819J5406J3226J1157
55650C88743R183O170J774k499n194o831q566r971r805q240o562n163l438j429
55636C38172J01J082K115L079L115J996K70j954n125r054j2754j5460j6992j7271
55622B71320j6477j5423j4717j3829j2100j0218r389r310q569o942n721n536n437
55609A37652m556l374k723k590k443k037j472j103j458k544l314k774j571j331
55595A04362k350l121k469j001L9K91J30k33p69j285j551j460r38j05M86L06l82
55578H9950q11o38p1P67J860K852L379L605L730L367K373J806K657M008M063K929
55562A25826K443L103L188J640k14r19j086j823k451j682p6N70j65j033j318j653
$$ plain form
55662 249659 253583 259177 266238 274873 285771 299368 315184 332135 348954 364360 377586 388743
55650 388743 397926 404096 405870 403371 398177 391346 382780 372809 363004 354764 348202 343039 339601 338172
55636 338172 338273 339355 341470 344549 347664 349660 349930 347976 342851 333797 321043 305583 288591 271320
55622 271320 254843 239420 224703 210874 198774 188556 179167 169857 161288 154346 148625 143089 137652
55609 137652 133096 129722 126999 124409 121966 119929 118457 117354 115896 113352 110038 107264 105693 104362
55595 104362 102012 98891 96422 95421 95460 95751 95881 95648 94879 93594 92043 90583 89645 89540 90026 90332 89950
55578 89950 89139 88501 88430 89197 91057 93909 97288 100893 104623 107990 110363 112169 114826 118834 122897 125826
55562 125826 128269 131372 134560 136200 135986 135067 133981 132158 129707 128025 127949 128519 128354 127321 126003 124350
55546A24350k501l207l080k483k276k726l377l605l119k157j299r04p57n29k97
55531I2033k82k47K80J261K111K435K366K215K246K787M099N942P580Q514Q911
55516A42251R216R596R959J0313J0724J0990J0714R774Q472P004M967J769k473
55503B43276o704r806j1521j2406j3024j3381j3144j2194j0917r853r134q444
55491A12748p659p202p330p383o420m594l154k818k962k757k298j983j533n60
55477E4095M06M62l17r71j043j000j220j400j123m79J39L79L2p60j433j510j144
55460D3113p74m61j19l4m94j044r24k26K46K18J79L13J20n58j038p78j52J78J35
55441C7900j8k61o61r91r25m26K64Q02Q46L34k36k42K77O39M09j70o32o88k04
$$ plain form
55546 124350 121849 118642 115562 113079 110803 108077 104700 101095 97976 95819 94520 93616 92859 92330 92033
55531 92033 91751 91504 91784 93045 95156 97591 99957 102172 104418 107205 111304 117246 124826 133340 142251
55516 142251 151467 161063 171022 181335 192059 203049 213763 223537 232009 239013 243980 245749 243276
55503 243276 236572 226766 215245 202839 189815 176434 163290 151096 140179 130326 121192 112748
55491 112748 105089 97887 90557 83174 76754 72160 69006 66188 63226 60469 58171 56188 54655 54095
55477 54095 54501 54963 54646 53675 52632 51632 50412 49012 47889 47410 47549 47928 47960 47200 45767 44257 43113
55460 43113 42339 41878 41759 41725 41231 40187 39263 39037 39283 39501 39680 39993 40113 39555 38517 37739 37587 37765 37900
55441 37900 37882 37621 36960 35969 35044 34618 34882 35684 36530 36864 36628 36386 36663 37302 37711 37541 36909 36221 36017
55422C6017O29J113O79j80m15J00M00m3m82j77M10M08n5r4N78J260J171K94o84
55403D0929j032o57k22l73q14o41L60J246J061j6r19p67M34J737J875M70j290
55386D1381j833j118n96j082j716j460n86N0K96M10J97m97j064r04n24q12j528
55369B8614j548n81M32O07M7o57j079j026n93j90q3O6O38J245J194O24L44N36
55351B8590N68K09J07O36J193J133P02M31J67m73j172j216n83K4K74N86J205J504
55333C3885P11r14k167k165j185j90J95L3l21n94n97k12M33R84J158R44M55j38
55315C0315m95k70L92P95M93r7j95L43R36J060P19J54m92j005j051n49Q1K58j63
55296C1229p77j043p50j35L57M89M25M60N75M27j55q18r97n65j1J57n0k13j02
$$ plain form
55422 36017 36646 37759 38438 38258 37843 37943 38343 38300 37818 37641 38051 38459 38404 38310 38888 40148 41319 41613 40929
55403 40929 39897 39240 39018 38645 37831 37190 37550 38796 39857 39841 38922 38155 38589 40326 42201 42671 41381
55386 41381 39548 38430 37834 36752 35036 33576 32990 33040 33336 33746 33943 33446 32382 31478 30954 30142 28614
55369 28614 27066 26485 26917 27524 27571 26914 25835 24809 24216 24026 23943 24009 24647 25892 27086 27710 28054 28590
55351 28590 29158 29367 29474 30110 31303 32436 33138 33569 33736 33263 32091 30875 30292 30316 30590 31176 32381 33885
55333 33885 34596 33682 31515 29350 28165 27975 28170 28203 27882 27288 26691 26479 26912 27896 29054 29998 30453 30315
55315 30315 29820 29550 29942 30737 31230 31133 30938 31281 32217 33277 33996 34150 33658 32653 31602 31053 31134 31392 31229
55296 31229 30452 29409 28659 28524 28881 29370 29795 30255 30830 31257 31102 30284 29287 28722 28711 28868 28818 28605 28503
55277B8503Q9J29J08K25M20M35J96j19l39m48m58m10m65p11q25k96Q12J612J275
55258B9733K2j074j308j049j070j480j615r37K69J201J379R51L85J03L38R72J461
55241B8281J290O14Q9K6R8O1K12O72Q10M3j116j561j122p70j202j883j806p35
55223B2001N90J258R83L19J04N32R01N41k39o40n59o20j082j445j299q36l09L34
55205B0534J039J444J451J409J492J414J095R43J081R43J60o93q70m88j83j43
55189C0628j12p3k26m69m85l04k17k33p6K99N33K94l59r86j049l96L97N66J54
55170B7886J5N38R20K86r70j655j300n24o4m7j77p6N32J450J933J436L80l09l81
55151B9873l66o01p16l08L86P83O51L21K95P53J293J336Q52M64N73P17J91q69
$$ plain form
55277 28503 28592 28721 28829 29054 29474 29909 30105 29986 29647 29199 28741 28331 27866 27155 26330 26034 26846 28458 29733
55258 29733 29755 28681 27373 26324 25254 23774 22159 21222 21491 22692 24071 25022 25407 25510 25848 26820 28281
55241 28281 29571 30185 30274 30300 30398 30459 30671 31343 32153 32196 31080 29519 28397 27627 26425 24542 22736 22001
55223 22001 22591 23849 24832 25151 25255 25787 26688 27229 26990 26350 25791 25171 24089 22644 21345 20509 20200 20534
55205 20534 21573 23017 24468 25877 27369 28783 29878 30821 31902 32845 33005 32312 31442 30954 30771 30628
55189 30628 30516 30443 30217 29748 29263 28959 28742 28509 28433 28732 29265 29559 29200 28214 27165 26769 27166 27732 27886
55170 27886 27901 28439 29359 29645 28675 27020 25720 25196 25132 25085 24908 24832 25364 26814 28747 30183 30563 30254 29873
55151 29873 29507 28906 28190 27882 28268 29051 29702 30023 30318 31071 32364 33700 34552 35016 35589 36306 36497 35628
55133C5628j566j294l12P38J445J759J846J922K004J949J821K033K737L422L416
55118E7548K675J646O08m32j404k213k891l265k870j709p99j073j976k054r57
55103D0834J24K05k33j05Q03J727J810P86q05j881j741r15n19p24n52N02J526
55086D0842J435M89k19k66j09p0m6q7m61r95j018l18M04L39l93r35p87l60l31
55067C7114o53n81K73J272J488R23M93O91R07M10m65o62K17J441K090J956J380
55050D8294O95P5l31m69n10o02n76j16P10J449J803J964K124K060J512Q43P20
55033E9645J137J310P63j9m27o63j276k056k174j332j07Q92J625K103K046J339
55017F2806N07J78L18L33j85j075j920k436k572k388j967j400q86o47o50n40p9
$$ plain form
55133 35628 34062 32768 32456 33194 34639 36398 38244 40166 42170 44119 45940 47973 50710 54132 57548
55118 57548 60223 61869 62477 62045 60641 58428 55537 52272 49402 47693 46894 45821 43845 41791 40834
55103 40834 40958 41163 40930 40825 41628 43355 45165 45951 45146 43265 41524 40609 40090 39366 38814 39316 40842
55086 40842 42277 42766 42547 42281 42172 42102 42056 41969 41508 40513 39495 39177 39581 39920 39527 38592 37805 37445 37114
55067 37114 36461 35880 36153 37425 38913 39836 40329 41020 41927 42337 41872 41210 41427 42868 44958 46914 48294
55050 48294 48989 49064 48733 48264 47754 47152 46576 46460 47170 48619 50422 52386 54510 56570 58082 58925 59645
55033 59645 60782 62092 62855 62836 62409 61746 60470 58414 56240 54908 54801 55693 57318 59421 61467 62806
55017 62806 63313 63491 63809 64142 63957 62882 60962 58526 55954 53566 51599 50199 49313 48666 48016 47476 47397
55000D7397M47O63P50J156J627J290k3j211j247n57l26p71j003n25P3K17K49P16
54982D8922J360J588J453J399J302O86p5K05J867L588L843K656J297O81Q31J537
54966G3140K643L697M243M649N793P743R520J0511J1321J2656J4116J4774J4392
54953A89198J3303J1412Q226L737j344o236j0403j3369j4821j4953j4262j3032
54941A37456j1387r637q170p065o228n708n435m916l849k764k388k466k097j095
54927F4251j56L97J037J989K739L016L415M440N629O362O970Q241J0156J1865
54913A30351J2797J3109J3008J2151R925O125J321l354o925r216j0716j1767j2218
54900A44591j1919j1139j0187q990p395n711m576m368m875n417n194l822j739
$$ plain form
55000 47397 47844 48507 49257 50413 52040 53330 53307 52096 50849 50292 49966 49195 48192 47667 47740 47957 48206 48922
54982 48922 50282 51870 53323 54722 56024 56710 56635 56840 58707 62295 66138 68794 70091 70772 71603 73140
54966 73140 75783 79480 83723 88372 94165 101908 111428 121939 133260 145916 160032 174806 189198
54953 189198 202501 213913 222139 225876 224532 218296 207893 194524 179703 164750 150488 137456
54941 137456 126069 116432 108262 101197 94969 89261 83826 78910 75061 72297 69909 67443 65346 64251
54927 64251 64095 64492 65529 67518 70257 73273 76688 81128 86757 93119 100089 108330 118486 130351
54913 130351 143148 156257 169265 181416 191341 197466 198787 195433 188508 179292 168576 156809 144591
54900 144591 132672 121533 111346 102356 94961 89250 84674 80306 75431 70014 64820 60998 59259
54887E9259J60J377K074K367J958P67n30j105r04n40n08q51j361j705j583j128
54871E7747r63j416j951j807j067m87m65p28r18r73q65n07o9J51K16M05N22m4
54853D6781j257k058j593m15J82j44m65n9M61jj389k319j698q8R18M84o46j109
54835C5585l52J002J919J819R21Rj98L89J234J818K114K247J980J021k68r20m16
54818D9904O49J271J252J284J911K836L436L674M044M794N609O203O764P643Q817
54803A10091J0007J1092J2075J2735J2677J1695R739O669K467k230o255q852j0168
54790A71742j0744j0801j0264r166p738o196m719l458k482j763j308j107r10l56
54776A00730N83J540K280K964L751M534N344O509Q108R577J0351J0604J0866J1153
$$ plain form
54887 59259 59419 60796 62870 65237 67195 67962 67432 66327 65423 64883 64375 63524 62163 60458 58875 57747
54871 57747 56784 55368 53417 51610 50543 50056 49591 48863 47945 46972 46107 45600 45531 45682 45898 46303 46825 46781
54853 46781 45524 43466 41873 41458 41640 41496 41031 40972 41433 41432 40043 37724 36026 35938 36856 37340 36694 35585
54835 35585 35233 36235 38154 39973 40894 40903 40705 41094 42328 44146 46260 48507 50487 51508 51240 50320 49904
54818 49904 50553 51824 53076 54360 56271 59107 62543 66217 70261 75055 80664 86867 93631 101274 110091
54803 110091 120098 131190 143265 156000 168677 180372 190111 196780 199247 197017 190762 181910 171742
54790 171742 160998 150197 139933 130767 123029 116833 112114 108656 106174 104411 103103 101996 101086 100730
54776 100730 101313 102853 105133 108097 111848 116382 121726 128235 136343 145920 156271 166875 177741 188894
54762A88894J1085J0651J0217R778Q845P195N187L123P92k065n265q479j1584
54749B28374j4344j6110j6353j5350j3934j2651j1511j0489r675q928p845o353
54737H4831m958m123l694l187k474j768j200p70o33r32j370j429j098q58q33n20
54721E4984L02R70P57q6p12p99o27k92L71J099J215N61k35o52q07q73n77J97Q69
54702E5665Q14J99l38n44o03m64J66J136J693J290K66m33j79Q05J759K145K053
54685F5430J831J532J046O48R41K007L077L366K878K087J191K27l90j04R73K011
54669H8751K423K427K513K735K852K934L436M644O232P582Q445R197J0403J2223
54655A66797J4348J6319J7679J7868J6408J3278Q933L847j642o917j1011j3333
$$ plain form
54762 188894 199979 210630 220847 230625 239470 246665 251852 254975 255767 253702 248437 239958 228374
54749 228374 214030 197920 181567 166217 152283 139632 128121 117632 107957 99029 91184 84831
54737 84831 79873 75750 72056 68869 66395 64627 63427 62657 62024 61092 59722 58293 57195 56337 55504 54984
54721 54984 55286 56256 57013 56927 56215 55416 54789 54497 54868 55967 57182 57743 57508 56856 56049 55176 54599 54796 55665
54702 55665 56479 56678 56340 55796 55193 54729 54895 56031 57724 59014 59280 58847 58668 59473 61232 63377 65430
54685 65430 67261 68793 69839 70487 71428 73435 76512 79878 82756 84843 86034 86261 85871 85767 86740 88751
54669 88751 91174 93601 96114 98849 101701 104635 108071 112715 118947 126529 134974 144171 154574 166797
54655 166797 181145 197464 215143 233011 249419 262697 271630 275477 273835 266918 255907 242574
54643B42574j4269j4721j5115j5171j4495j3082j1310r707q658q066p326n950
54631A04704m192k833k305k307k244j848j273q02o39q09j157j478j655j717j708
54616G7737j607j402j181j093j188j337j440j614j995k343k143j290l45J53L46
54601E9258O31Q87P54M39N11Q82Q25J49m68n74n37o19l31N88J250O82o86j476
54583F2165j135l28K56N86O64J87q14j645j704j143m75J20P60J372J682J613J430
54566F3591J375J326J004N15M11J005J736J667O84k85l84K57R58J412J738K020
54550G9030K251K565L066L662M326N301O639P928Q781R273R391Q560O356L365
54536A60494N90j664l685n407o533p341q359r212q824p111n458n037n403n335
$$ plain form
54643 242574 228305 213584 198469 183298 168803 155721 144411 134704 126046 117980 110654 104704
54631 104704 100512 97679 95374 93067 90823 88975 87702 86900 86261 85452 84295 82817 81162 79445 77737
54616 77737 76130 74728 73547 72454 71266 69929 68489 66875 64880 62537 60394 59104 58759 58912 59258
54601 59258 59889 60776 61530 61969 62480 63362 64187 64336 63868 63294 62757 62138 61807 62395 63645 64327 63641 62165
54583 62165 61030 60702 60958 61544 62208 62395 61581 59936 58232 57089 56614 56734 57494 58866 60548 62161 63591
54566 63591 64966 66292 67296 67811 68222 69227 70963 72630 73314 73029 72645 72902 73860 75272 77010 79030
54550 79030 81281 83846 86912 90574 94900 100201 106840 114768 123549 132822 142213 150773 157129 160494
54536 160494 161084 159420 155735 150328 143795 136454 128095 118883 110059 102948 97490 92453 87050 81715
54522H1715m465l400k679k220j764j272q53n28j83J84K41m22j596k297j790n14
54506E8157M80Q63J105J421J421R82N57M20K87K9J6L58M94J35j24K83Q79Q53L48
54487F8964J92N25O32J52l30k06L02O01O17O92Q64P21P7o43r36q86r70j248j127
54468F7993k02R88J398N99p92j796j910j351p03l74k80n6L74O80O57N43M97J72
54450F6437o26j202o06J006K290K174R26l62q63n25R1K94j16o96r98j158j420
54433F4646j471r06j73j27o98r11l71K15K89K19M56P93R71J166J332R23j11p37
54415F5505j77R15J450J486J815K446K670K400K329K654K644J786O04o7j00m3
54399H8317l57j003j527j528j144r24j053r95k86N67O51p9p25o89l70l94p44r45
$$ plain form
54522 81715 77250 73850 71171 68951 67187 65915 65062 64534 64351 64535 64776 64354 62758 60461 58671 58157
54506 58157 58637 59500 60605 62026 63447 64429 64986 65406 65693 65722 65738 66096 66590 66725 66601 66884 67763 68616 68964
54487 68964 69156 69681 70313 70465 70135 69929 70231 70832 71449 72141 73005 73726 73803 73160 72224 71338 70368 69120 67993
54468 67993 67791 68779 70177 70776 69984 68188 66278 64927 64224 63850 63570 63514 63888 64568 65225 65768 66265 66437
54450 66437 65811 64609 64003 65009 67299 69473 70399 70037 69174 68649 68740 69034 68918 68222 67224 66066 64646
54433 64646 63175 62269 62096 61969 61271 60360 59989 60204 60493 60712 61168 61961 62932 64098 65430 66353 66242 65505
54415 65505 65328 66243 67693 69179 70994 73440 76110 78510 80839 83493 86137 87923 88527 88460 88360 88317
54399 88317 87960 86957 85430 83902 82758 81834 80781 79786 79500 80067 80718 80639 79914 79225 78855 78461 77717 76772
54381G6772p90m82l13m03o50p53m91q9r7p12j419j568j199r52j178j464j243n44
54363F2425J44O39J107J415J103K65j64L95J223J284P19M93P29N97j13m83P6Q70
54345G2724J017O77M19J69m06j029j166q58n19k38J0j59j039k106k468j902q99
54328F2227Q9P78Q12J07p04q92n73l97n77q62j217j701j917j463q03p70j270j427
54310D9440r53m63k97q8L12M37J31n1K37N28M05K05L69P61J105J475J833J682
54292E7068Q30m4k15M3n4n69q30m82J25N42P02P37P22O83O03L98J06n6O7L34N39
54271F1249P01Q70R00O54L66L91O97Q73O52K17r7j32j7ok10m12k22M63J228J497
54251F9662J121M59o1l74p08j191j542j357o43N0K05j03m13m68l15J4N10Q87P45
$$ plain form
54381 76772 75982 75500 75187 74784 74134 73381 72890 72801 72704 71992 70573 69005 67806 66854 65676 64212 62969 62425
54363 62425 62569 63208 64315 65730 66833 67098 66934 67329 68552 69836 70555 71048 71777 72374 72261 71778 71854 72724
54345 72724 73741 74418 74837 75006 74600 73571 72405 71547 71028 70790 70800 70641 69602 67496 65028 63126 62227
54328 62227 62316 63094 63906 64013 63309 62417 61844 61447 60870 60008 58791 57090 55173 53710 52907 52137 50867 49440
54310 49440 48487 48024 47727 47639 47951 48388 48519 48468 48705 49233 49638 49843 50212 50973 52078 53553 55386 57068
54292 57068 57898 57854 57639 57682 57628 57059 56229 55747 55872 56414 57116 57853 58575 59258 59861 60259 60365 60309 60376 60710 61249
54271 61249 61950 62820 63720 64374 64740 65131 65828 66701 67353 67570 67473 67341 67324 67318 67108 66696 66474 66937 68165 69662
54251 69662 70783 71242 71181 70807 70099 68908 67366 66009 65366 65416 65621 65518 65105 64637 64322 64336 64846 65733 66478
54232F6478J21n22r06j172j346j098l19M39N33Mn81q26p09k84L60Q81R04N55M30
54213F2942Q72J481J550R13Q7l76m30l98m11k90N0M10O37Q34J012P99j14j356
54195F8212k169k260j998j738j460j123r42j014j000n62Q6L56J4n40o84k76J38
54178E3040j20j021j682j368m27J26q2m43l58PK18L35O78J154J316J019O18M83
54160E3493N27L59k53j018j310q50j36N8l41o05j92N40Q59O23L28M11P85J037
54142E4315Q26J75m81o77m65l95q00j341j516j351j236j239j027m77Pj9m71q30
54124D2998o88j52K94L02J1j65JL79P34R10P73K53m10p57o07k56k6J76O15J293
54104D5678J945K291K135J461O12J07k0l12r98j337n04J046J845J148k17r38o66
$$ plain form
54232 66478 66599 66077 65171 63999 62653 61555 61236 61675 62208 62212 61631 60805 60096 59812 60172 61053 61957 62512 62942
54213 62942 63814 65295 66845 67758 67845 67469 67039 66641 66230 65940 65990 66400 67037 67871 68883 69682 69568 68212
54195 68212 66043 63783 61785 60047 58587 57464 56522 55508 54508 53946 54032 54388 54402 53862 53178 52902 53040
54178 53040 52920 51899 50217 48849 48422 48548 48466 48023 47665 47672 47890 48225 48903 50057 51373 52392 53010 53493
54160 53493 54020 54379 54126 53108 51798 50948 50812 50870 50529 49924 49732 50272 51131 51754 52082 52493 53278 54315
54142 54315 55141 55316 54835 54158 53693 53298 52498 51157 49641 48290 47054 45815 44788 44311 44318 44299 43828 42998
54124 42998 42310 42158 42452 42754 42765 42600 42601 42980 43714 44624 45397 45650 45240 44483 43876 43620 43594 43770 44385 45678
54104 45678 47623 49914 52049 53510 54122 54229 54209 53897 52899 51562 51058 52104 53949 55097 54880 53942 53276
54087E3276k4L63L47J6m57p49n64j7M30N75P12J159J723J895J501Q62L87K25L33
54068F1993O52J040J284J298J178R77O46K99K53M94M80j89j029j126k47R27J654
54051G0584J768J484J042P49Q65J265J529J504J440J464J369J110J050J433J995
54036I0651K420K828L392L890L964L659L305L034K753K435K195K175K485K959
54022A32145K992K077P32J86P41J115P3j792k868k710k375k620k906k509j735
54007A20546j438j901k721l423l766l635l080k363j763j386j250j420j877k432
53993H8091k796k698j991q55J58N44L65P1j19l68p45j020j010q08n83m10m02o38
53975G4786q43n82R3N39L53o8j15J79K54j84q17j115q13m5P30R95O00n1l91j97
$$ plain form
54087 53276 53252 53615 53962 53978 53521 52772 52208 52191 52621 53196 53908 55067 56790 58685 60186 61048 61435 61660 61993
54068 61993 62645 63685 64969 66267 67445 68422 69068 69367 69620 70114 70594 70405 69376 68250 68003 68930 70584
54051 70584 72352 73836 74878 75627 76492 77757 79286 80790 82230 83694 85063 86173 87223 88656 90651
54036 90651 93071 95899 99291 103181 107145 110804 114109 117143 119896 122331 124526 126701 129186 132145
54022 132145 135137 137214 137946 138132 138873 139988 140061 138269 135401 132691 130316 127696 124790 122281 120546
54007 120546 119108 117207 114486 111063 107297 103662 100582 98219 96456 95070 93820 92400 90523 88091
53993 88091 85295 82597 80606 79751 79909 80453 80818 80889 80770 80402 79657 78637 77627 76819 76236 75826 75424 74786
53975 74786 73943 73361 73454 73993 74346 74278 74163 74342 74596 74412 73595 72480 71667 71622 72352 73347 73947 73896 73505 73308
53955G3308L64J034J609J912J872J658J506J501J638K063K974M209N195N514N419
53940A11776N555O212P014P435P463P419P309O666N218L362J730N05n23j326j581
53925A74234j239p53n71o66p39o22k78L53J259K246L071L663M036M155L972L546
53909A95667K967K280J549Q81L07k03n10k93M60J135R19l63k024l091l159k696
53893A93826k588l245m141m431m000l620l929m658n124n113m801m161l114k169
53879A38732k124k948l594l263k314j579j311j310j609k303k940k844k109j581
53865A06903j698j989j949j829k087k528k509j837r70m82o31j319k100k333j770
53850H0872r33n06m96l91r2j03o59j265j356r97n76k23J11K56jm82p29n30o6L91
$$ plain form
53955 73308 73672 74706 76315 78227 80099 81757 83263 84764 86402 88465 91439 95648 100843 106357 111776
53940 111776 117331 123543 130557 137992 145455 152874 160183 166849 172067 175429 177159 177664 177141 175815 174234
53925 174234 172995 172242 171671 171005 170266 169644 169366 169719 170978 173224 176295 179958 183994 188149 192121 195667
53909 195667 198634 200914 202463 203344 203651 203448 202938 202645 203105 204240 205159 204796 202772 199681 196522 193826
53893 193826 191238 187993 183852 179421 175421 171801 167872 163214 158090 152977 148176 144015 140901 138732
53879 138732 136608 133660 130066 126803 124489 122910 121599 120289 118680 116377 113437 110593 108484 106903
53865 106903 105205 103216 101267 99438 97351 94823 92314 90477 89507 89025 88394 87075 84975 82642 80872
53850 80872 79939 79433 78937 78546 78454 78351 77692 76427 75071 74074 73498 73275 73386 73642 73641 73159 72430 71900 71834 72225
53830G2225O89P55O11M14K76J22r6j79J16O98J214J436J343R58L81m8N9O64J281
53811H2919J499J392J358J651K145K520K605K552K530K413K034J777K309L511
53797A13215M221L584K259J534J567J442Q22M92R58J506J268M94J2n1k44q19j521
53780A30739k143k613k633j950j003o40j113j903k575l142l491l142k056j060
53766A01275r16j412j817j927k065k245k036j299n04j03p1j99n01j025j546j733
53750H1876j513j084o59l63k15j17J8K2m13j198j720j534r35n35m59l93l05n25
53732F9948j023j191o20L19R85J201J149Q27J46o16q90m81K18O91P68N14O0l51
53714G1654m27j57pm28j188j406m83J120K289K434K021J803J854J665J034L28
$$ plain form
53830 72225 72914 73669 74280 74694 74970 75092 74996 74817 74933 75631 76845 78281 79624 80582 80963 80915 80974 81638 82919
53811 82919 84418 85810 87168 88819 90964 93484 96089 98641 101171 103584 105618 107395 109704 113215
53797 113215 117436 121020 123279 124813 126380 127822 128644 129136 130094 131600 132868 133362 133374 133323 133079 132260 130739
53780 130739 128596 125983 123350 121400 120397 119757 118644 116741 114166 111024 107533 104391 102335 101275
53766 101275 100359 98947 97130 95203 93138 90893 88857 87558 87054 86951 86880 86681 86180 85155 83609 81876
53750 81876 80363 79279 78620 78257 78042 77925 77943 77965 77552 76354 74634 73100 72165 71630 71171 70778 70473 69948
53732 69948 68925 67734 67114 67433 68418 69619 70768 71595 71741 71125 70235 69754 69972 70663 71431 71945 72005 71654
53714 71654 71227 71070 71063 70635 69447 68041 67558 68678 70967 73401 75422 77225 79079 80744 81778 82106
53698H2106q6k08l3N84J496K128K172K042K175K260J737P79J60K12N56Q48J149
53681A00077J424J270N17l89q94r27p03k35N21J304J636J346P27K30J08K57L53
53664A06622J76j06j34J63M78N61M97L71L8n32r11o06K53R76J109R12R10J173
53646A11950J243P64nm32k51J02M1m14o96m76r5n2l13l69R2Q35J378J478J235
53627A16015Q86N94M27M02M16K59j24m16k01L84O35J46n00l69O20J634K018J936
53609A24762J783J563J167Q15P35P06M31J66M55J260J942K141K174K383K583K465
53593A47531K241K414K986L361L070K299J622J364J377J323R98N36K90M37O54
53578A72503M96Q2J49J006J835J567L19p36r53q94j133j136j63J270J787R22l53
$$ plain form
53698 82106 82020 81812 81779 82363 83859 85987 88159 90201 92376 94636 96373 97152 97312 97524 98080 98928 100077
53681 100077 101501 102771 103288 102899 102005 101078 100375 100140 100661 101965 103601 104947 105674 105904 106012 106269 106622
53664 106622 106798 106692 106558 106721 107199 107760 108257 108628 108666 108134 107223 106617 106870 107846 108955 109867 110777 111950
53646 111950 113193 113957 113952 113520 113269 113371 113412 112998 112302 111826 111731 111679 111366 110997 111089 111924 113302 114780 116015
53627 116015 116901 117495 117922 118324 118740 118999 118875 118459 118258 118642 119277 119423 118923 118554 119174 120808 122826 124762
53609 124762 126545 128108 129275 130090 130825 131531 131962 132128 132583 133843 135785 137926 140100 142483 145066 147531
53593 147531 149772 152186 155172 158533 161603 163902 165524 166888 168265 169588 170586 171122 171412 171849 172503
53578 172503 172999 173081 173230 174236 176071 177638 177957 177221 176268 175374 174241 173105 172942 174212 175999 176921 176568
53561A76568j024j163j318j476j204n32r8l74j097j540j229l43N47J065J236J127
53545A69145O42p8l60L02J413J903J528J140J399J756J224k04j462j605p69J01
53529A76075K73n5nQ79J937K119J345O63R25J792K364K287J898J623J775K526
53513A98421L705M734N201N364N676O084O247O216O352O630O676O549O906Q130
53499B82891R703J0814J1280J1553J1946J2271J2255J2037J1985J2155J2289J2361
53487D23540J2752J3586J4246J4025J3123J2435J2389J2643J2926J3474J4320
53476E69459J4882J4772J4395J4242J4111J3628J3079J2915J2863J2332J1490
53465G18168J1109J1374J1655J1489J1077J0674J0193R641R300R173Q766P682
$$ plain form
53561 176568 175544 174381 173063 171587 170383 169851 169753 169379 168282 166742 165513 165170 165717 166782 168018 169145
53545 169145 169787 169709 169349 169651 171064 172967 174495 175635 177034 178790 180014 179810 178348 176743 175974 176075
53529 176075 176348 176293 176288 177167 179104 181223 182568 183231 184156 185948 188312 190599 192497 194120 195895 198421
53513 198421 202126 206860 212061 217425 223101 229185 235432 241648 248000 254630 261306 267855 274761 282891
53499 282891 292594 303408 314688 326241 338187 350458 362713 374750 386735 398890 411179 423540
53487 423540 436292 449878 464124 478149 491272 503707 516096 528739 541665 555139 569459
53476 569459 584341 599113 613508 627750 641861 655489 668568 681483 694346 706678 718168
53465 718168 729277 740651 752306 763795 774872 785546 795739 805380 814680 823853 832619 840301
53453H40301O149M675L468K290P13j468l855n588o311o769p916r534j0423r981
53439G95751q847p872p234o890p106q054r316j0357j1065j1548j1768j1707j1481
53426F72506j1034j0222r470r618j0580j0910r491p051n141m011k644o97Q16J073
53412E83526N70K65L72O67J318K568L892M383M028L934M998O790Q136Q532Q625
53397F42604R317J0746J2262J3118J3090J2562J2280J2843J4237J5902J7345J8601
53385H04907J9910K1192K2175K2919K3754K4759K5767K6875K8320K9825L0632
53374A081035L0529L0207L0230L0268K9914K9626K9983L0402K9631K7488K5187
53363A404500K3711K2742K1588K0344J9504J8890J7725J5628J2986J0424Q346
$$ plain form
53453 840301 846450 851125 854593 856883 857596 856128 852273 846685 840374 833605 825689 816155 805732 795751
53439 795751 786904 779032 771798 764908 757802 749748 740432 730075 719010 707462 695694 683987 672506
53426 672506 661472 651250 641780 632162 621582 610672 601181 594130 588989 584978 582334 581637 582453 583526
53412 583526 584096 584361 584733 585400 586718 589286 593178 597561 601589 605523 610521 617311 625447 633979 642604
53397 642604 651921 662667 674929 688047 701137 713699 725979 738822 753059 768961 786306 804907
53385 804907 824817 846009 868184 891103 914857 939616 965383 992258 1020578 1050403 1081035
53374 1081035 1111564 1141771 1172001 1202269 1232183 1261809 1291792 1322194 1351825 1379313 1404500
53363 1404500 1428211 1450953 1472541 1492885 1512389 1531279 1549004 1564632 1577618 1588042 1596388
53352A596388O861N678L995R96l330q139j2664j6876k1010k4731k7290k8455k8845
53339A442578k9137k9273k8746k7538k6266k5418k4825k4110k3301k2644k2071
53328A159249k1296k0494k0332k1164k2457k3347k3436k2822k1570j9675j7568
53317I25088j6048j5455j5184j4410j3034j1573j0278q852p132n572m742m698
53305G98110n122n852o881p951q571q486p949p434p293p539p768p390o210m765
53291F98899l742l074k076m93R99J606J393J202J730K976M338N134N221N257O061
53276G25431P604Q962R549R939J0975J2407J3066J2383J1120J0413J0558J0906
53264H53313J0720R873Q836Q141P791P251O072M414K783J448L39o58j687l035
$$ plain form
53352 1596388 1603249 1608927 1612922 1613918 1610588 1602449 1589785 1572909 1551899 1527168 1499878 1471423 1442578
53339 1442578 1413441 1384168 1355422 1327884 1301618 1276200 1251375 1227265 1203964 1181320 1159249
53328 1159249 1137953 1117459 1097127 1075963 1053506 1030159 1006723 983901 962331 942656 925088
53317 925088 909040 893585 878401 863991 850957 839384 829106 820254 813122 807550 802808 798110
53305 798110 792988 787136 780255 772304 763733 755247 747298 739864 732571 725032 717264 709874 703664 698899
53291 698899 695157 692083 690007 689514 690513 692119 693512 694714 696444 699420 703758 708892 714113 719370 725431
53276 725431 733035 741997 751546 761485 772460 784867 797933 810316 821436 831849 842407 853313
53264 853313 864033 873906 882742 890883 898674 905925 911997 916411 919194 920642 920981 920323 918636 915601
53250I15601m848o767q329r723j1513j3587j4993j5208j4988j5433j6593j7541
53238G66078j7632j7144j6708j6544j6308j5432j3649j1403r676r075r249r496
53226F03762r806j0724j2188j3194j2979j1973j1181j0899j0641j0116r563r121
53214D71377q382p009n354m076l339k779k193j870k073k587l017l334l887m900
53200D16577o200p434q429r278j0075j0634j0557r695q584q102q507q976q478
53187C01628p000n596n156n528n966o120o208o456o768o994p186p423p594p495
53173B10138p116o659o221n612m621l456k690k634k904k881k515k274k307k118
53159A56130j356n24m46j166j893k006j683j417j357j393j501j722j876j684j217
$$ plain form
53250 915601 910753 903986 895657 885934 874421 860834 845841 830633 815645 800212 783619 766078
53238 766078 748446 731302 714594 698050 681742 666310 652661 641258 631582 622507 613258 603762
53226 603762 593956 583232 571044 557850 544871 532898 521717 510818 500177 490061 480498 471377
53214 471377 462995 455986 450632 446556 443217 440438 438245 436375 434302 431715 428698 425364 421477 416577
53200 416577 410377 402943 394514 385236 375161 364527 353970 344275 335691 327589 319082 310106 301628
53187 301628 294628 289032 283876 278348 272382 266262 260054 253598 246830 239836 232650 225227 217633 210138
53173 210138 203022 196363 190142 184530 179909 176453 173763 171129 168225 165344 162829 160555 158248 156130
53159 156130 154774 154250 153804 152638 150745 148739 147056 145639 144282 142889 141388 139666 137790 136106 134889
53144A34889r31j158j697k061k011j745j475j139o39k49l84r78j466j534j509
53129A15913j753j944j498n05K54L35J10J36M27O56O94O36M72P9n15j045j179
53112A11273p57MN74N79K76K71O30P02Pj048j623j430q50l91k72l95m34p6N17
53093A07557P84N26K77N16Q37M98m28j099j011m92n6N4l09j209k246k739k459
53076I9001j766r17J01R66J034L34j61K42R98J189P78M02L17L43N58J266K249
53059A06934K807K579J865J080L69j37j92K50Q43J122P60k90j625k428k162j173
53043A10602l13L5J35J85K0l41m33J8O34Q65O39K12k75p54r59o46L8O74J044J196
53023A12576J109O45j41q48j073p23l1O81J124J117P43M14N87J255J816J661Q29
$$ plain form
53144 134889 133958 132800 131103 129042 127031 125286 123811 122672 122033 121784 121400 120422 118956 117422 115913
53129 115913 114160 112216 110718 110213 110467 110802 110912 111048 111475 112131 112825 113461 113933 114012 113497 112452 111273
53112 111273 110516 110520 111094 111673 111949 112220 112850 113552 113559 112511 110888 109458 108608 108217 107945 107550 107116 107040 107557
53093 107557 108341 108867 109144 109660 110497 110995 110567 109468 108457 107965 107909 107963 107654 106445 104199 101460 99001
53076 99001 97235 96318 96419 97385 98419 98753 98592 98834 99832 101021 101799 102201 102518 102861 103419 104685 106934
53059 106934 109741 112320 114185 115265 115634 115497 115305 115555 116398 117520 118280 117990 116365 113937 111775 110602
53043 110602 110289 110324 110459 110644 110664 110323 109890 109908 110542 111407 112046 112258 111983 111229 110270 109624 109662 110336 111380 112576
53023 112576 113685 114330 114189 113341 112268 111545 111514 112195 113319 114436 115179 115593 116180 117435 119251 120912 121741
53006A21741j4k73N2M90N72J64m26n50J94J342J839J234L40K90J127J810J593
52989A31525Q57M36N08N38J37l33j41R21K175K723K411J853J520J189N52j14l46
52972A46411k35k19k99p5N02J006J241J490J882K064J700R76L42Q9K91P68J036
52955A58970P00N0j87J12K28k63p52m71K75N00l2m54L5J113J745J364L98l28m88
52936A62515m61o95j107j230q22o2P51J351J462J018M59L77P54R48N78K1j77N9
52918A65739M48P82R43Q23N22L38L69M05L83N36Q72R70O00J24r6k69p37j332j628
52899A69792j546j279r37p20j056j990k763k567j550n73j70k72o80j165j302q93
52883A50329m34n29r49r91n99l72m36k56L44P71O75N29R01J704K513L014K757
$$ plain form
53006 121741 121727 121454 121506 121996 122568 122732 122306 121756 121950 123292 125131 126365 126705 126995 128122 129932 131525
52989 131525 132382 132818 133326 133864 134001 133668 133527 134448 136623 139346 141757 143610 145130 146319 146871 146757 146411
52972 146411 146176 145957 145658 145583 146085 147091 148332 149822 151704 153768 155468 156444 156786 156875 157166 157934 158970
52955 158970 159670 159720 159533 159645 159873 159610 158858 158387 158662 159162 159130 158676 158711 159824 161569 162933 163331 163003 162515
52936 162515 162054 161359 160252 159022 158200 158138 158889 160240 161702 162720 163179 163556 164310 165258 165836 165857 165680 165739
52918 165739 166187 166969 167912 168735 169257 169595 169964 170369 170752 171288 172160 173130 173730 173854 173758 173489 172752 171420 169792
52899 169792 168246 166967 166030 165310 164254 162264 159501 156934 155384 154811 154641 154369 153689 152524 151222 150329
52883 150329 149895 149366 148417 147426 146827 146455 146019 145763 146107 146878 147553 148082 148983 150687 153200 156214 158971
52866A58971J258j069k735k743j846j583k238k694k152j141o48r12j498k033k416
52851A34521k496k142j574j338j733k415k699k259j425p86o04o32n01j26K48L48
52835A14387J36k14n61r08j269j520j555j476j483j515j310q45m95n45p61o28
52819I9438M5Q50J124N34m59q31k7J228J659J028M16O25J035O89j43m02J14N51
52801A07474L99J07J33K60K56M68J222K103K388J959J352R98Q20M39k99j018j063
52784A17998k53P01Q10o3j037j204m92M89J033Q08N0o08p62o74p69r06o66k18
52766A14237k11p46j202j229j209j441j619j493j377j538j610j134k19P48J532
52751A01489J855J390M51N1O21J258R32j4m36K1P58J321J677J579P07n04j106
$$ plain form
52866 158971 160229 159160 156425 153682 151836 150253 148015 145321 143169 142028 141380 140468 138970 136937 134521
52851 134521 132025 129883 128309 126971 125238 122823 120124 117865 116440 115654 115050 114418 113917 113791 114039 114387
52835 114387 114523 114309 113748 112840 111571 110051 108496 107020 105537 104022 102712 101867 101372 100827 100066 99438
52819 99438 99483 100333 101457 101991 101532 100701 100674 101902 103561 104589 105005 105630 106665 107354 107211 106809 106923 107474
52801 107474 107873 107980 108113 108373 108629 109097 110319 112422 114810 116769 118121 119119 119939 120378 120079 119061 117998
52784 117998 117745 118446 119256 119193 118156 116952 116460 116949 117982 118790 118840 118232 117470 116796 116027 115121 114455 114237
52766 114237 114026 113280 112078 110849 109640 108199 106580 105087 103710 102172 100562 99428 99209 99957 101489
52751 101489 103344 104734 105185 105236 105857 107115 108047 108033 107597 107618 108376 109697 111374 112953 113660 113156 112050
52734A12050q45l85j74Q2O10J013J002R92J457K137K395K047J464J046Q96Q78
52718A26665P79N62N44J026J727J921J386P44O19P96O22k0o34q74r59j209j485
52701A32210j340o37K28P94J050J323J667J741J428J182J396J715J495Q50N67
52686A45669R21J191O63l49r73r07o67p71j170j463j469j353j306j252j009o80
52670A35075o34r49j219j185j256j835k416k069q89r6l87j010r72m53k36l28o5
52653A19076O77J336J713K255L169M002M401M587M698M274K886R16p63j637j748
52638A49842j373r26q95j334j624j158j97M41M54K99L54L49j65j174k212k749
52622A37932k431j299J1O27K72m97j006j184j267j195p41j18J02k92q57j033o85
$$ plain form
52734 112050 111205 110820 110646 110728 111338 112351 113353 114345 115802 117939 120334 122381 123845 124891 125787 126665
52718 126665 127444 128006 128550 129576 131303 133224 134610 135354 135973 136769 137391 137371 136737 135863 134904 133695 132210
52701 132210 130870 130233 130461 131255 132305 133628 135295 137036 138464 139646 141042 142757 144252 145102 145669
52686 145669 146590 147781 148444 148095 147122 146215 145548 144777 143607 142144 140675 139322 138016 136764 135755 135075
52670 135075 134441 133492 132273 131088 129832 127997 125581 123512 122623 122527 122140 121130 120158 119705 119469 119141 119076
52653 119076 119753 121089 122802 125057 128226 132228 136629 141216 145914 150188 153074 153990 153227 151590 149842
52638 149842 148469 147543 146648 145314 143690 142532 142335 142776 143230 143529 143883 144232 144067 142893 140681 137932
52622 137932 135501 134202 134213 134840 135112 134615 133609 132425 131158 129963 129222 129104 129206 128914 128057 127024 126339
52605A26339p0M72O84N30K47J46K95N72R39J451J939K061J723J177O53K25M2K35
52587A39660M50K8j058j866j624p52k12j54mL18K12m64r30o15l7O5j25J9L74K55
52567A33540l28n67j83M2m51r61n27N35J064P31L61M20K49p72k013k370j721r07
52549A26142m52j40J94K64n0l15j75J43K54J58k8m69j286k054k174j625r56n50
52531A16881l47k65m27q08j012o88JM94L75l14j084j341q27R3P05O15Q9l42m41
52512A11357l35k18j89l69q37j411j676j402p99k18J71K70j19r63j612j325k92
52495A00033L86M6o74p81l00l8k41k25N13J498J882J382M07m14o15k08K04J8n16
52476A02357n12K68R45P37N5j83J64N36O76P84P95M21j52l27p4r7p82j559j753
$$ plain form
52605 126339 126269 126741 127425 127955 128202 128348 128643 129215 130154 131605 133544 135605 137328 138505 139158 139383 139425 139660
52587 139660 140110 140138 139080 137214 135590 134838 134626 134472 134468 134786 134998 134534 133604 132989 132952 133017 132892 132911 133285 133540
52567 133540 133212 132645 132462 132504 132053 131092 130565 131100 132164 132895 133256 133676 133925 133153 131140 128770 127049 126142
52549 126142 125690 125550 125744 126008 125958 125643 125468 125611 125865 126023 125995 125526 124240 122186 120012 118387 117431 116881
52531 116881 116534 116269 115842 115034 114022 113334 113335 113829 114204 113890 112806 111465 110638 110731 111436 112051 112140 111798 111357
52512 111357 111022 110804 110615 110246 109409 107998 106322 104920 104121 103903 104074 104344 104225 103262 101650 100325 100033
52495 100033 100419 100465 99791 99010 98710 98672 98431 98206 98719 100217 102099 103481 103888 103474 102859 102651 102855 102873 102357
52476 102357 101845 102113 103058 103795 103850 103667 103831 104367 105043 105827 106622 107043 106891 106564 106490 106393 105611 104052 102299
52457A02299j519j428j459j092k73K98J06m51n02J84R84J251J105J099J347J400
52441A03349J000M77J66j63q56j628j763j020J0N95O04M57N95R84J149P02j01
52424A04557n51l94k13o14j284j390p12J25N33M92K24o1j3P06J773K249J632M73
52406A07532l75p39r62j101r25n84o40j247j755j493o43k1k8k00K8N65R18J039
52388I9369J345J885K055J479P07O02J215J789J703R97J21m37l29L50R53Q75K46
52371A14925k70l12k1M42J039J523J556J203Q75P19O19O67R92J220R08N76J241
52354A27902K672L234K076M67N3O55R13M80K28N65Q50O35L85N58R09J078J193
52337A44853J411J446J070O16M77M80K49QM53J793L296M025L754L086K691K630
$$ plain form
52457 102299 100780 99352 97893 96801 96528 96826 96932 96481 95979 96163 97147 98398 99503 100602 101949 103349
52441 103349 104349 104826 104992 104829 103973 102345 100582 99562 99572 100167 100771 101228 101823 102807 103956 104658 104557
52424 104557 104006 103612 103399 102785 101501 100111 99399 99524 100057 100549 100773 100712 100699 101405 103178 105427 107059 107532
52406 107532 107157 106418 105456 104355 103430 102846 102206 100959 99204 97711 97068 97047 97019 96819 96847 97412 98330 99369
52388 99369 100714 102599 104654 106133 106840 107442 108657 110446 112149 113146 113267 112830 112501 112851 113804 114679 114925
52371 114925 114655 114343 114322 114764 115803 117326 118882 120085 120960 121679 122298 122965 123957 125177 126085 126661 127902
52354 127902 130574 133808 135884 136351 136404 137059 137972 138452 138680 139245 140095 140730 141115 141673 142582 143660 144853
52337 144853 146264 147710 148780 149396 149873 150353 150602 150610 151063 152856 156152 160177 163931 167017 169708 172338
52321A72338K477K000J527J555K222L321M661O093P229P525O854N825N316N659
52307B34602O360O642O255N739N856O789Q025Q894R159R001Q793Q905R469J0179
52293C44668J0578J0716J1137J2017J2707J2594J2076J2042J2564J2831J2388
52282D76318J1718J1425J1425J1370J1284J1287J1039J0119Q803P880P587P245
52270E97500O123M403K955K358K369K328J839J041L38j5j25k75n66q29r13r59
52254F17572j148j294r61j49M88L89j46k45N99K174L978N592O659P103P384Q122
52238F56117R302J0265J0733J1193J2006J2651J2457J1613J0833J0271R503Q502
52226G85446P853P858Q013P690O822N694M403K938J531N17j05p30j721l067m494
$$ plain form
52321 172338 174815 176815 178342 179897 182119 185440 190101 196194 203423 210948 217802 223627 228943 234602
52307 234602 240962 247604 253859 259598 265454 272243 280268 289162 298321 307322 316115 325020 334489 344668
52293 344668 355246 365962 377099 389116 401823 414417 426493 438535 451099 463930 476318
52282 476318 488036 499461 510886 522256 533540 544827 555866 565985 574788 582668 590255 597500
52270 597500 603623 608026 610981 613339 615708 618036 619875 620916 621254 621239 621114 620839 620273 619444 618531 617572
52254 617572 616424 615130 614169 614020 614508 614897 614751 614506 615105 617279 621257 626849 633508 640611 647995 656117
52238 656117 665419 675684 686417 697610 709616 722267 734724 746337 757170 767441 776944 785446
52226 785446 793299 801157 809170 816860 823682 829376 833779 836717 838248 838765 838660 837930 836209 833142 828648
52211H28648n833p133q392r307r565r414r588j0411j1297j1506j1148j0964j1191
52198G02899j1219j0488r170p771o499n343m457m032l932l821l605l506l633l744
52184F21679l508k936k403k262k530k982l471l953m183l769k741j815j667k120
52170E81339k462k454k519k847k993k647k271k434k886k900k417k203k640l018
52156E44648k418j071k44p58k054l012l289l378l536l374k650j860j561j560j340
52141E12543r88j059j570j910j796j603j570j344p57m08q66j727k097j819j536
52126D91493j652j887j900j763j565j128l90K76N27N61Q04J249J521J576J853
52111D89575K639L550L956L805L720M294N482O714P563Q154Q952J0206J1664J2894
$$ plain form
52211 828648 822815 815682 807290 797983 788418 779004 769416 759005 747708 736202 725054 714090 702899
52198 702899 691680 681192 672022 664251 657752 652409 647952 643920 639988 636167 632562 629056 625423 621679
52184 621679 618171 615235 612832 610570 608040 605058 601587 597634 593451 589682 586941 585126 583459 581339
52170 581339 578877 576423 573904 571057 568064 565417 563146 560712 557826 554926 552509 550306 547666 544648
52156 544648 542230 541159 540915 540157 538103 535091 531802 528424 524888 521514 518864 517004 515443 513883 512543
52141 512543 511555 510496 508926 507016 505220 503617 502047 500703 499946 499538 498672 496945 494848 493029 491493
52126 491493 489841 487954 486054 484291 482726 481598 481208 481484 482011 482572 483376 484625 486146 487722 489575
52111 489575 492214 495764 499720 503525 507245 511539 517021 523735 531298 539452 548404 558610 570274 583168
52097E83168J3791J4673J5735J6742J7380J7773J8233J8636J8487J7724J6965
52086G69307J6714J6715J6444J5818J5015J3920J2346J0609R290Q440P581O502
52074I18701N457M418K906P91j304k793l865m939n881o361o618p201q048q542
52060H76721q506q403q450q214p473o879p060p509p085n641m282l799l544k449
52046G87427o96N05O89P81J678K940L557L468L513M033M396M127L691L796M395
52031H28300M918N152N288N260M665L438K183J567J577J564R42l11j738k811l306
52016H56688l418l627m336n538o880q122r444j1150j3120j4824j6003j6966j8020
52003G25240j8894j9112j8725j8310j8283j8608j9090j9447j9153j7845j6058
$$ plain form
52097 583168 596959 611632 627367 644109 661489 679262 697495 716131 734618 752342 769307
52086 769307 786021 802736 819180 834998 850013 863933 876279 886888 896178 904618 912199 918701
52074 918701 924158 928576 931482 932273 930969 928176 924311 919372 913491 907130 900512 893311 885263 876721
52060 876721 868215 859812 851362 843148 835675 828796 821736 814227 807142 801501 797219 793420 789876 787427
52046 787427 786731 787236 787925 788706 790384 793324 796881 800349 803862 807895 812291 816418 820109 823905 828300
52031 828300 833218 838370 843658 848918 853583 857021 859204 860771 862348 863912 864854 864543 862805 859994 856688
52016 856688 853270 849643 845307 839769 832889 824767 815323 804173 791053 776229 760226 743260 725240
52003 725240 706346 687234 668509 650199 631916 613308 594218 574771 555618 537773 521715
51992E21715j4955j4971j5182j4494j3011j1744j1277j1407j1917j2906j4217
51981C75634j5175j5302j4886j4433j3856j2665j0881r255q419q174p834p102
51969B37652o263n651n238m891m681m710m799m597m005l291k825k845l304l796
51955A76756l713k786j492o91p99j471k066k243k113j990k026k022j729j294j165
51940A49156j371j353r02p70j639k799k798j449j78j91j056j628j505j033n36
51925A29948k01k78p05q45k99L76L49k67n45mQ54J273R78K35m37o26l90j70j72
51906A29074j17R3k3p12j260q65P3M77K50L92J309K007J409k06j613j963j256
51889A27069O7J475K436K685K375J868J470J352J460J565J594J936K967M339N277
$$ plain form
51992 521715 506760 491789 476607 462113 449102 437358 426081 414674 402757 389851 375634
51981 375634 360459 345157 330271 315838 301982 289317 278436 269181 260762 252588 244754 237652
51969 237652 231389 225738 220500 215609 210928 206218 201419 196822 192817 189526 186701 183856 180552 176756
51955 176756 173043 170257 168765 168074 167275 165804 163738 161495 159382 157392 155366 153344 151615 150321 149156
51940 149156 147785 146432 145530 144760 143121 140322 137524 136075 135897 135706 134650 133022 131517 130484 129948
51925 129948 129747 129469 128764 127919 127620 127996 128345 128078 127533 127529 128383 129656 130634 130869 130432 129806 129416 129246 129074
51906 129074 128957 129050 129027 128315 127055 126190 126263 126740 126990 127382 128691 130698 132107 131901 130288 128325 127069
51889 127069 127136 128611 131047 133732 136107 137975 139445 140797 142257 143822 145416 147352 150319 154658 159935
51874A59935N659O264P635R303J0493J1229J2267J4221J7104K0498K3626K5364
51862C23598K4589K0726J3977N245l989j2022j7641k0627k1636k1578k1085k0255
51850B49302j8799j6537j3803j1219r134p545o460n911n586m926l786k604j758
51837A41234j246j090j484k236k658k357j713j155m87N29J449J627J097L97k21
51822A31686p25p84j20P79J045N61K0j12l3L5J32J62j46o21p22l90k12m31m93
51803A29631o0K92j06r29j270q11k5N48O94M01r4l05lL55J85l53n62k30J24O5
51783A27547k35m15l83j99P6K17m4n16n72rN19L52k17l77MK28j07n10l92Q2L57
51762A25406M33Q13J550J937J407M03j07K20P50P79M02L11Q67J652J929J365L64
$$ plain form
51874 159935 165594 171858 179493 188796 199289 210518 222785 237006 254110 274608 298234 323598
51862 323598 348187 368913 382890 388135 384146 372124 354483 333856 312220 290642 269557 249302
51850 249302 230503 213966 200163 188944 179810 172265 165805 159894 154308 149382 145596 142992 141234
51837 141234 139988 138898 137414 135178 132520 130163 128450 127295 126808 127337 128786 130413 131510 131907 131686
51822 131686 130961 130177 130057 130836 131881 132442 132462 132350 132317 132352 132484 132646 132500 131879 131157 130767 130555 130124 129631
51803 129631 129571 129863 129757 128828 127558 126747 126722 127270 127964 128365 128271 127966 127963 128318 128503 128150 127588 127358 127482 127547
51783 127547 127312 126897 126514 126315 126391 126608 126564 126048 125476 125467 125986 126338 126121 125744 125748 125976 125869 125359 124967 125049 125406
51762 125406 125839 126652 128202 130139 131546 131949 131842 132062 132812 133591 133993 134304 135171 136823 138752 140117 140481
51745A40481l47l97j45k54r06j552j607j228j056j316j515j143l42L33N31K61
51729A29798l31r92j301j007m10j35m77j133j568j404o14L74Q35M56j17O9R85
51712A23028J527R44k10r27j047j111j293j222o98M7Q13J511J767J145l2p22l39
51695A23181O27J491K369L664N042N484M390K071p65l522n653o593o105m545k707
51680A18429j401j052j435j796j520p37n6K89P42J688K782L264K831J894J042
51665A24964N40L77M32M81K22l99r98j105o77k1O94J498K186K271J624P73K05
51648A33067k83j038j682j528p52l76q36j333j018j53M09M51M06M47L27J6j63
51631A25961j03q5l24p69j321j870j998j295j2R52J021M44k44p98j038o47L29
$$ plain form
51745 140481 140134 139737 139592 139338 138432 136880 135273 134045 132989 131673 130158 129015 128673 129006 129537 129798
51729 129798 129467 128475 127174 126167 125757 125622 125145 124012 122444 121040 120426 120800 121635 122091 121974 122043 123028
51712 123028 124555 125499 125289 124362 123315 122204 120911 119689 118991 119038 119851 121362 123129 124274 124242 123520 123181
51695 123181 123808 125299 127668 131332 136374 141858 146248 148319 147554 144032 138379 131786 125681 121136 118429
51680 118429 117028 115976 114541 112745 111225 110488 110432 110721 111463 113151 115933 119197 122028 123922 124964
51665 124964 125504 125881 126313 126794 127016 126617 125619 124514 123837 123816 124510 126008 128194 130465 132089 132862 133067
51648 133067 132784 131746 130064 128536 127784 127408 126572 125239 124221 124068 124477 124928 125334 125781 126108 126124 125961
51631 125961 125858 125773 125449 124680 123359 121489 119491 118196 118184 119136 120157 120601 120357 119559 118521 117874 118203
51614A18203J171J220P46N89J027J502J474J083P86O98N65K65KK3K69M93N87O93
51596A31396Q57Q64O01M09O68J181J394J233J183J332J109L08l14o3N23M25k89
51579A42817o13j69L31M12N70J281K069K253K009J983K282K489K458K358K134
51564A64664J561Q29M47N07N42K23k85p47j167j489j420q03M0O41Q09O83M98M34
51546A65967M84L85k1l89j79N34R68N50l60r58r15n77m88r56j804k385k094j123
51528A56639l80m20q27r87j003j336j865k005j643j245j123j145j197j332j414
51513A38717j164o42j92J61O69J148J065M66Q5J60j2q46j575j381p77q20j366
51496A33696j201O5J331J540R66N23M04J29m50q42o76k40o9k22k43J89P42Q46
$$ plain form
51614 118203 119374 120594 121340 121929 122956 124458 125932 127015 127801 128499 129064 129329 129331 129354 129623 130116 130703 131396
51596 131396 132253 133117 133718 134127 134795 135976 137370 138603 139786 141118 142227 142535 142221 142158 142681 143106 142817
51579 142817 142204 142035 142366 142778 143348 144629 146698 148951 150960 152943 155225 157714 160172 162530 164664
51564 164664 166225 167054 167501 168008 168550 168773 168488 167741 166574 165085 163665 162862 162902 163543 164352 165035 165533 165967
51546 165967 166451 166836 166815 166426 166247 166781 167749 168299 167939 166981 166066 165489 165001 164045 162241 159856 157762 156639
51528 156639 156259 155839 155012 154025 153022 151686 149821 147816 146173 144928 143805 142660 141463 140131 138717
51513 138717 137553 136911 136719 136880 137549 138697 139762 140228 140313 140473 140461 139615 138040 136659 135882 135062 133696
51496 133696 132495 132560 133891 135431 136397 136920 137324 137453 137003 136161 135485 135245 135176 134954 134711 134900 135642 136488
51478A36488M41P1J74O44J210J807K303K255J499O51M99J032J601J906K142K250
51462A56973J762N22r63k164k947l349l435l493l813m129l928l449l477l923l613
51447A16574k047m20j1m29m75j33k87q26n32R82K497K809K136J351P24N8n46q31
51429A20594q76r17q86o11k08P7K12K67K30J81K69K94k94j612k861l136k473j700
51411A06550j485j859k465k792k412j463p41q37j343j409r42o33p57p13J5R48
51395H7662J125L02p40j039m16M29P51N62M62O74P38L39%M18J357J884J588R59
51377I7055N61M43M56N81P25P08N99O60Q13O56J67j92k04j38p5K94Q61Q22k20
51358A04572j517k153k146j970j591q78m55j002j987k194j508r97j105r38J87
$$ plain form
51478 136488 136929 137000 137174 137818 139028 140835 143138 145393 146892 147543 148042 149074 150675 152581 154723 156973
51462 156973 158735 159257 158294 156130 153183 149834 146399 142906 139093 134964 131036 127587 124110 120187 116574
51447 116574 114527 114107 114096 113667 113192 113059 112772 111946 111414 112396 114893 117702 119838 121189 121913 121971 121425 120594
51429 120594 119718 118801 117915 117304 117096 117173 117385 117652 117882 118063 118332 118626 118332 116720 113859 110723 108250 106550
51411 106550 105065 103206 100741 97949 95537 94074 93333 92496 91153 89744 88802 88169 87412 86699 86714 87662
51395 87662 88787 89089 88349 87310 86894 87323 88074 88636 89098 89772 90510 90849 90849 91267 92624 94508 96096 97055
51377 97055 97616 98059 98515 99096 99821 100529 101128 101788 102601 103257 103424 103232 103028 102890 102815 103109 103970 104792 104572
51358 104572 103055 100902 98756 96786 95195 94317 93862 92860 90873 88679 87171 86174 85069 84131 84318
51343H4318J480J724Q56j79o54m95J35R39J371J122O07N22R02J116P43P9k79k0
51325I4287P09J416J551R81K36j1L26P14P29M48R9l00p60j126j335j650k232k606
51307I1476k054o42N00L37q47j751j553p56l43m87m38L65J464J880J286M88N85
51290H9510J695K693K411J054L5M14J813L063L569L576L368K808J789O90R7J54
51274A18739L50p7j378k853l327k310o22M22K48p36j839k517k332j224J40Q17
51258A01501N84Q1p2K18Q77J827K583K416J325K45r9m8j99l80j0Q87J687J936
51240A15359J633R61K95J31N07P59L71k66m83l60m22o31m45J76P14R22R68Q05
51222A20994K55k68p5O74J023O83N01J051J722J682J017J91q40k149l076k911
$$ plain form
51343 84318 85798 87522 88378 88199 87545 87050 87185 88124 89495 90617 91224 91746 92648 93764 94507 94586 94307 94287
51325 94287 94996 96412 97963 98944 99180 99169 99495 100209 100938 101386 101485 101185 100425 99299 97964 96314 94082 91476
51307 91476 89422 88780 89280 89617 88770 87019 85466 84710 84367 83880 83442 83807 85271 87151 88437 88925 89510
51290 89510 91205 93898 96309 97363 97398 97812 99625 102688 106257 109833 113201 116009 117798 118488 118585 118739
51274 118739 119089 119012 117634 114781 111454 109144 108522 108944 109192 108456 106617 104100 101768 100544 100684 101501
51258 101501 102085 102166 102094 102312 103189 105016 107599 110015 111340 111585 111486 111438 111239 110859 110849 111736 113423 115359
51240 115359 116992 117953 118248 118379 118886 119645 120016 119750 119267 118907 118485 117854 117409 117585 118299 119221 120189 120994
51222 120994 121249 120981 120906 121580 122603 123286 123787 124838 126560 128242 129259 129450 128610 126461 123385 120474
51206A20474k052j606j879k115j662o94L08J118J564J402O48k60q79j092r39m66
51190A11870J01M02L55L13N91J018J142P72J22m67p82p92o58o41q58j105j057
51173A10326o73l01l17o99j020q50j19Q58J555J486N53o94j277o79N30J199Q40
51156A10718J77J98R89J740J836J549J548J952K229J940J361J130J454J873J814
51141A32508J165K36o21j207j479j484j258p40P9Q76J213J114J076J292J331R46
51125A35047P31J326K267K497J891J374J406J248K43j061j651j438j147j163j186
51110A40384r77p59p82q58n33L85J512K098J727Q76M21N82P30L78k01n91r31j397
51092A42064j511p46M12Q54L14k59K6R59J695J803J556J446J691K064K063J408
$$ plain form
51206 120474 118422 116816 114937 112822 111160 110466 110774 111892 113456 114858 115506 115246 114367 113275 112336 111870
51190 111870 111971 112373 112728 113041 113632 114650 115792 116564 116686 116219 115437 114645 113987 113346 112488 111383 110326
51173 110326 109653 109352 109035 108336 107316 106466 106347 107205 108760 110246 110799 110105 108828 108149 108679 109878 110718
51156 110718 110895 111093 112082 113822 115658 117207 118755 120707 122936 124876 126237 127367 128821 130694 132508
51141 132508 133673 133909 133288 132081 130602 129118 127860 127120 127199 128075 129288 130402 131478 132770 134101 135047
51125 135047 135778 137104 139371 141868 143759 145133 146539 147787 148030 146969 145318 143880 142733 141570 140384
51110 140384 139407 138648 137866 137008 136475 136860 138372 140470 142197 143073 143494 144076 144806 145184 144983 144392 143461 142064
51092 142064 140553 139807 140219 141073 141387 141128 141154 142113 143808 145611 147167 148613 150304 152368 154431 155839
51076A55839L88m04o84o60o90r55j439j915k024j597q86k92J07M63P82R17Q59
51059A47809P02M11j1k64p3K77K12k66n15q7P27J360J527J271Q64P67J287K036
51041A58034K207J535O41K00K18L90P20J341K025K330K157J873J902K327K832
51026A80732K867K151J110N98R70J657J900J615J305J339J607J810J795J663J655
51011B04774J890K196K343K528L244M598O031O910P180P219P357P743Q425R319
50997B81757J0256J1251J2480J3851J4944J5582J6163J7078J8100J8764J9118
50986D49344J9734K1102K3291K6033K8911L1597L4175L6974L9988M2783M5226
50975G99158M7777N0625N3026N4067N3668N2205M9611M5694M0986L6280L1361
$$ plain form
51076 155839 156227 155823 155139 154479 153789 152834 151395 149480 147456 145859 144973 144681 144788 145251 146033 146950 147809
51059 147809 148511 148922 148911 148647 148574 148851 149063 148797 148282 148195 148922 150282 151809 153080 153944 154711 155998 158034
51041 158034 160241 161776 162417 162617 162835 163225 163945 165286 167311 169641 171798 173671 175573 177900 180732
51026 180732 183599 185750 186860 187458 188428 190085 191985 193600 194905 196244 197851 199661 201456 203119 204774
51011 204774 206664 208860 211203 213731 216975 221573 227604 234514 241694 248913 256270 264013 272438 281757
50997 281757 292013 303264 315744 329595 344539 360121 376284 393362 411462 430226 449344
50986 449344 469078 490180 513471 539504 568415 600012 634187 671161 711149 753932 799158
50975 799158 846935 897560 950586 1004653 1058321 1110526 1160137 1205831 1246817 1283097 1314458
50964A314458K5259J7954J0854N143M63m256r213j3630j6791j8596j9169j8481
50952A273995j6520j3681j0899r165q749r035r467j0419j2645j5990j9357k2047
50940A116021k4452k7174l0145l2932l5416l7638l9432m0579m1037m0727l9457
50929G27032l7400l5214l3319l1399k9004k6229k3466k0877j8457j6269j4235
50918D41163j2104j0005q559p926p325o044m430l223k389j506p80o82q89o70j89
50903C74442k31o44k94J128K423K611K215K264K825L426M132N249O416O958O955
50888D19875P176Q047R291J0441J1238J1582J1666J2073J3233J4895J6583J8473
50876E64573K1127K4497K7806L0614L3407L6909M1275M6176N1340N6734O2411
$$ plain form
50964 1314458 1339717 1357671 1368525 1373668 1374131 1369875 1360662 1347032 1330241 1311645 1292476 1273995
50952 1273995 1257475 1243794 1232895 1223730 1214981 1205946 1196479 1186060 1173415 1157425 1138068 1116021
50940 1116021 1091569 1064395 1034250 1001318 965902 928264 888832 848253 807216 766489 727032
50929 727032 689632 654418 621099 589700 560696 534467 511001 490124 471667 455398 441163
50918 441163 429059 419054 410495 402569 395244 389200 384770 381547 379158 377652 376872 376190 375301 374631 374442
50903 374442 374211 373567 373273 374401 376824 379435 381650 383914 386739 390165 394297 399546 405962 412920 419875
50888 419875 427051 435098 444389 454830 466068 477650 489316 501389 514622 529517 546100 564573
50876 564573 585700 610197 638003 668617 702024 738933 780208 826384 877724 934458 996869
50865I96869O8394P4624Q0942Q7305R3932J00944J07844J13807J18541J22441
50855A965643J25654J27320J26055J20956J11885R9063Q2881O4143M4187K4487
50845B892274O107j0569k5525l8559m8990n6012n9268n8922n5245m8544l9604
50834B457143k9829k0716j3327q391o513p840j1766j7410k4437l3033m3135n4023
50822B186723o4827p5008q4168r1673r6798r9252r9353r7679r4611r0230q4610
50811A208514p8090p1205o4283n7315n0393m4065l8897l4664l0416k5608k0767
50800F92811j6772j3730j1037q353n981m184k695j227p0L23J12j04j70o16j764
50785F26543l106l877m020m057m228m220l810l338l222l407l535l485l304k795
$$ plain form
50865 996869 1065263 1139887 1220829 1308134 1402066 1503010 1610854 1724661 1843202 1965643
50855 1965643 2091297 2218617 2344672 2465628 2577513 2676576 2759457 2823600 2867787 2892274
50845 2892274 2898381 2887812 2862287 2823728 2774738 2718726 2659458 2600536 2545291 2496747 2457143
50834 2457143 2427314 2406598 2393271 2384880 2378367 2370527 2358761 2341351 2316914 2283881 2240746 2186723
50822 2186723 2121896 2046888 1962720 1871047 1774249 1674997 1575644 1477965 1383354 1293124 1208514
50811 1208514 1130424 1059219 994936 937621 887228 843163 804266 769602 739186 713578 692811
50800 692811 676039 662309 651272 642919 636938 632754 630059 628832 628762 629085 629197 629093 628923 628307 626543
50785 626543 623437 619560 615540 611483 607255 603035 599225 595887 592665 589258 585723 582238 578934 576139
50771E76139j617J38J879L249M609O512Q898J1145J2850J4267J5776J7156J7672
50758F88673J6951J5697J5223J6179J7935J9493K0807K2735K5702K9037L2025
50747I20457L5102L9295M4771N0586N5933O0870O5662P0013P3353P5373P5807
50736A567222P4032O9555O2559N3593M2770K9893J5347L72j3696k6076l6360m4155
50724A795056m9131n1186n0328m6656m0671l3421k6041j9191j3049p712l531j128
50712A453011j165l891q818j4969k1625k8672l6105m3413m9660n4103n6547n7171
50700A076872n6273n4179n1179m7485m3324l9024l4910l1008k7031k2766j8470
50689F51223j4756j2004r899p749n215k559m7K574N685R094J2148J4462J6059
$$ plain form
50771 576139 574522 574660 576539 579788 584397 590909 599807 610952 623802 638069 653845 671001 688673
50758 688673 705624 721321 736544 752723 770658 790151 810958 833693 859395 888432 920457
50747 920457 955559 994854 1039625 1090211 1146144 1207014 1272676 1342689 1416042 1491415 1567222
50736 1567222 1641254 1710809 1773368 1826961 1869731 1899624 1914971 1915343 1901647 1875571 1839211 1795056
50724 1795056 1745925 1694739 1644411 1597755 1557084 1523663 1497622 1478431 1465382 1457670 1454139 1453011
50712 1453011 1451846 1447955 1439137 1424168 1402543 1373871 1337766 1294353 1244693 1190590 1134043 1076872
50700 1076872 1020599 966420 915241 867756 824432 785408 750498 719490 692459 669693 651223
50689 651223 636467 624463 614564 606815 601600 599041 598994 601568 607253 616347 628495 642957 659016
50676F59016J6783J6213J4450J2445J1069J0216R232Q031P155O925P005O901O555
50663G91996O278O395O918P486P758P953Q840J0849J3455J5745J7440J8908K0361
50650I40382K1600K2527K3287K3874K3995K3500K2485K0980J9022J7022J5473
50639A174147J4076J1852Q470M858J998l63l074o112q524r792j0538j1675j3323
50626A152000j4888j5784j5886j5379j4456j3197j1736j0453r787r700r517q464
50614A002753o401l833j343Q06K481L383L071J334j505m780q096j1691j5972k0745
50600I39462k5119k8287l0096l0878l1014l0744l0052k8582k6047k2899k0120
50589F35624j7994j5643j2211q148m712k539j307o19l93m20k60J86M85K47l71
$$ plain form
50676 659016 675799 692012 706462 718907 729976 740192 749424 757455 764610 771535 778540 785441 791996
50663 791996 798274 804669 811587 819073 826831 834784 843624 854473 867928 883673 901113 920021 940382
50650 940382 961982 984509 1007796 1031670 1055665 1079165 1101650 1122630 1141652 1158674 1174147
50639 1174147 1188223 1200075 1208545 1213403 1215401 1215038 1211964 1205852 1197328 1187536 1176998 1165323 1152000
50626 1152000 1137112 1121328 1105442 1090063 1075607 1062410 1050674 1040221 1030434 1020734 1011217 1002753
50614 1002753 996352 992519 991176 991982 994463 997846 1000917 1002251 1000746 995966 987870 976179 960207 939462
50600 939462 914343 886056 855960 825082 794068 763324 733272 704690 678643 655744 635624
50589 635624 617630 601987 589776 581628 576916 574377 573070 572451 572058 571638 571378 571564 572049 572296 571925
50574E71925q49o52M96K292L913M862N710P410R868J1952J3040J3866J5371J7390
50560F76594J8922J9303J8608J7296J5934J5040J4653J4295J3675J3222J3556
50549H51098J4749J6467J8537K0838K2910K4343K5470K7132K9720L2897L6269
50538A120430L9793M3486M7212N0981N4996N9145O2748O5040O5729O4971O3036
50527A737567O0110N6121N0628M3158L3819K3376J2593J744r093j9580k9304l8140
50515A922999m6091n2864n7991o1385o3357o4055o3128o0197n5480m9748m3716
50504A304987l7621l1438k5239j9292j3734q378k852L061R272J5435K1051K5562
50492A240814K8487K9488K8284K4542J8051R054j659j3038k4044l3787m1666m7543
$$ plain form
50574 571925 571076 570424 570920 573212 577125 581987 587697 595107 604975 616927 629967 643833 659204 676594
50560 676594 695516 714819 733427 750723 766657 781697 796350 810645 824320 837542 851098
50549 851098 865847 882314 900851 921689 944599 968942 994412 1021544 1051264 1084161 1120430
50538 1120430 1160223 1203709 1250921 1301902 1356898 1416043 1478791 1543831 1609560 1674531 1737567
50527 1737567 1797677 1853798 1904426 1947584 1981403 2004779 2017372 2019116 2010023 1990443 1961139 1922999
50515 1922999 1876908 1824044 1766053 1704668 1641311 1577256 1514128 1453931 1398451 1348703 1304987
50504 1304987 1267366 1235928 1210689 1191397 1177663 1169285 1166433 1169494 1178766 1194201 1215252 1240814
50492 1240814 1269301 1298789 1327073 1351615 1369666 1378720 1377061 1364023 1339979 1306192 1264526 1216983
50480A216983n1649n4185n5106n4413n2491m9893m6917m3606m0072l6533l2998
50469F99120k9209k5068k0934j7312j4390j1975r809p747n692l544j262J033L067
50456E56278M544N449O187P334R034J0850J2280J3260J3963J4279J3844J2584
50444F79886J0872R129P606O553O262O658P154P227O951O772O953P499Q436R820
50430G87778J1460J3016J4375J5729J7303J9148K1125K2941K4297K5308K6581
50419I99061K8489L0479L1558L1510L1144L1166L1256L0547K8603K5597K1802
50408A321212J7386J2491P140J122n705j3057k0431k7542l4248m0181m4847m8055
50396A125285m9932n0509m9740m7941m5730m3328m0261l6048l0871k5391k0172
$$ plain form
50480 1216983 1165334 1111149 1056043 1001630 949139 899246 852329 808723 768651 732118 699120
50469 699120 669911 644843 623909 606597 592207 580232 570423 562676 556984 553440 552178 553211 556278
50456 556278 560822 566271 572458 579792 588826 599676 611956 625216 639179 653458 667302 679886
50444 679886 690758 699887 707493 714046 720308 726966 734120 741347 748298 755070 762023 769522 777958 787778
50430 787778 799238 812254 826629 842358 859661 878809 899934 922875 947172 972480 999061
50419 999061 1027550 1058029 1089587 1121097 1152241 1183407 1214663 1245210 1273813 1299410 1321212
50408 1321212 1338598 1351089 1358229 1359351 1353646 1340589 1320158 1292616 1258368 1218187 1173340 1125285
50396 1125285 1075353 1024844 975104 927163 881433 838105 797844 761796 730925 705534 685362
50385F85362j5554j1752q553n108n94M770R755J3348J5617J7261J8600J9308J8912
50372G61372J7187J4128R884M769q36o619j2218j7069k0632k2852k4139k4851
50360F78124k5032k4737k4264k3830k3258k2254k0837j9223j7384j5109j2482
50349D49714r994q096o862o015n100l705j835j04Q33J174J840L293M864N540N196
50334D30743M635M603N134N753N973N603M884M374M486N070N605N782N667N387
50320E03699M873M092L195K419J882J612J633J937K484L252M243N429O776Q324
50306E55850J0149J2376J5207J8715K2199K3829K1519J4576M449o184j4960k0612
50294F57113k2916k2454k0349j7704j5098j2711j0771r547q899q250p196o016
$$ plain form
50385 685362 669808 658056 649503 644395 643801 648571 658326 671674 687291 704552 723152 742460 761372
50372 761372 778559 792687 802571 807340 806504 799885 787667 770598 749966 727114 702975 678124
50360 678124 653092 628355 604091 580261 557003 534749 513912 494689 477305 462196 449714
50349 449714 439720 431624 424762 418747 413647 409942 408107 408003 408836 410010 411850 415143 420007 425547 430743
50334 430743 435378 439981 445115 450868 456841 462444 467328 471702 476188 481258 486863 492645 498312 503699
50320 503699 508572 512664 515859 518278 520160 521772 523405 525342 527826 531078 535321 540750 547526 555850
50306 555850 565999 578375 593582 612297 634496 658325 679844 694420 698869 692685 677725 657113
50294 657113 634197 611743 591394 573690 558592 545881 535110 525563 516664 508414 501218 495202
50282D95202n288n177n285n135m635m001l379k641j578k44R42J590J793K035K646
50267D66845L501M327N056N690O019N871N489N337N569N946O297O625O742O271
50253E45585N230M191L488K691J275m65j747k409l039m049n142n859o139o063
50239E27548n554m704m073m200m838n089m350k952j745j205j036n99L92J672K890
50224D92157M006N083N996O647P352Q548J0109J1429J2265J3096J4498J6527J8789
50211F26502K0777K1972K2123K1794K2092K3402K4712K4734K3382K1587J9807
50200H72884J7516J4204J0283O712M110K500J617J128O08m64k625o243j1293j7326
50186H93611k3672k9600l4298l7024l7675l6996l5852l4294l1733k8084k4269
$$ plain form
50282 495202 489914 484737 479452 474317 469682 465681 462302 459661 458083 457839 458781 460371 462164 464199 466845
50267 466845 470346 474673 479729 485419 491438 497309 502798 508135 513704 519650 525947 532572 539314 545585
50253 545585 550815 555006 558494 561185 562460 561995 560248 557839 554800 550751 545609 539750 533611 527548
50239 527548 521994 517290 513217 509017 504179 499090 494740 491788 490043 488838 487802 487203 487595 489267 492157
50224 492157 496163 501246 507242 513889 521241 529789 539898 551327 563592 576688 591186 607713 626502
50211 626502 647279 669251 691374 713168 735260 758662 783374 808108 831490 853077 872884
50200 872884 890400 904604 914887 921599 925709 928209 929826 930954 931562 931098 928473 922230 910937 893611
50186 893611 869939 840339 806041 769017 731342 694346 658494 624200 592467 564383 540114
50175E40114k1348j9407j7587j5204j2575j0589r583q863p611o064n295n708o331
50162C93949n971m676l483l051l123l249l345l460l501l382l165k946k868l205
50148C44524l982m665m639m045l642l824m241m404m070l049j388O4J27j237k622
50133B98907k787k017j282p06K36J499K402K716K926L326L601L543L554M078M893
50118C24889N380N287M923M756M988N539O300P256Q360R380J0095J0668J1528
50105D19349J2748J3823J4346J4587J5117J6078J7255J8664K0494K2562K4414
50094F09437K6036K7948L0491L3572L7191M1492M5879M8775M9011M7197M4917
50083A041946M2730L9848L5888L2006K9665K8878K8404K7320K5483K2533J7445
$$ plain form
50175 540114 518766 499359 481772 466568 453993 443404 433821 424958 417347 411283 405988 400280 393949
50162 393949 387978 383302 379819 376768 373645 370396 367051 363591 360090 356708 353543 350597 347729 344524
50148 344524 340542 335877 331238 327193 323551 319727 315486 311082 307012 303963 302575 302639 302766 301529 298907
50133 298907 296120 294103 292821 292115 292351 293850 296252 298968 301894 305220 308821 312364 315918 319996 324889
50118 324889 330269 335556 340479 345235 350223 355762 362062 369318 377678 387058 397153 407821 419349
50105 419349 432097 445920 460266 474853 489970 506048 523303 541967 562461 585023 609437
50094 609437 635473 663421 693912 727484 764675 806167 852046 900821 949832 997029 1041946
50083 1041946 1084676 1124524 1160412 1192418 1222083 1250961 1279365 1306685 1332168 1354701 1372146
50072A372146R620j92j0586k0615k9834l7604m3234m6656m8424m8984m8439m6898
50060A000300m4544m1404l7619l3845l0671k7684k3984j9712j6128j3800j1848
50049F99061r522p598p115p566p533o748o253o598p113p149o974p091p384p492
50035E96925p398p332p460p894q510q709p862o276n050m739m729m168k950j385
50021E12463L50J904K542J996J099Q79J227J294R09Q79J719K850L355L036K452
50006E38954K122J989J587O78l99j091j402j978l257m914o382p525q323q366p378
49991D94315o059n516n831o016n538n004m904m538l002p03R84J523J874L243N694
49976D60522Q171R684J0273J1004J3024J6487K0424K3737K6139K7986K9463L0299
$$ plain form
50072 1372146 1381766 1381574 1370988 1350373 1320539 1282935 1239701 1193045 1144621 1095637 1047198 1000300
50060 1000300 955756 914352 876733 842888 812217 784533 760549 740837 724709 710909 699061
50049 699061 689539 681941 674826 667260 659727 652979 646726 640128 633015 625866 618892 611801 604417 596925
50035 596925 589527 582195 574735 566841 558331 549622 541760 535484 530434 525695 520966 516798 513848 512463
50021 512463 512813 514717 517259 519255 520354 521233 522460 523754 524663 525542 527261 530111 533466 536502 538954
50006 538954 541076 543065 544652 545330 544931 543840 542438 540460 537203 532289 525907 518382 510059 501693 494315
49991 494315 488256 482740 476909 470893 465355 460351 455447 450909 447907 447204 448188 449711 451585 454828 460522
49976 460522 468693 478377 488650 499654 512678 529165 549589 573326 599465 627451 656914 687213
49964F87213L0081K8439K5185K0706J6136J2606J0358Q934Q109P869P550N775
49952H68961J768l976j0600j7823k5397l2286l7193l9680m0178l9143l6899l4048
49940E53506l1228k8446k5313k1934j8979j6802j5168j3809j2575j0967q507n823
49928C43955m480n033o065n881m606l717l941m560m725m441m088l728l240k658
49914B82792k044j374q08o77r85j184q82m52n98j395k137k177j636j105q90q25
49898B63623p19o62p05n84j21L00J27n19q58m52K02L41j57q18j219j236r07m37
49880B55199j86k88m47l81k85m42o24l65K73P32P87Q08J116J509J659J588J562
49863B62215J713J996K262K338K119J788J673J930K480L192L872M062L313J857
$$ plain form
49964 687213 717294 745733 770918 791624 807760 820366 830724 839658 847767 855636 863186 868961
49952 868961 870729 866753 856153 838330 812933 780647 743454 703774 663596 624453 587554 553506
49940 553506 522278 493832 468519 446585 427606 410804 395636 381827 369252 358285 349778 343955
49928 343955 339475 334442 328377 322496 317890 314173 310232 305672 300947 296506 292418 288690 285450 282792
49914 282792 280748 279374 278566 277889 276904 275720 274838 274386 273788 272393 270256 268079 266443 265338 264448 263623
49898 263623 262904 262242 261537 260953 260832 261132 261259 260740 259882 259430 259632 259973 259816 258998 257779 256543 255636 255199
49880 255199 255013 254725 254278 253897 253612 253170 252546 252181 252454 253186 253973 254781 255897 257406 259065 260653 262215
49863 262215 263928 265924 268186 270524 272643 274431 276104 278034 280514 283706 287578 291640 294953 296810
49849B96810O15L00O40P40R8r52j751j992j877j691j446j010n18l38n95r41r79
49832B85113p03l92k26k27l47l16K55J323K169K118J328M76r9m85o60n23l36n27
49814B87941j021j384j519j648j643j105k37J98q6n52p73r71j309j422j105q04
49798B72560r14j104j002r68j535k437k843k412j557q36m74m02m33m71o75j127
49782B53370j344o68O64J510J248N12O1k30o37o44K25J241J294N56K20P59J521
49765B59658K006K404K744K600J933J339J083P25K4n33n47l13k44k81k96m87q58
49748B70957q85k62M76N68k7p90j381j742j727j184k88O00J282J675J645J271
49732B70188J027J278J688J584Q26nl58k66r8l3J21N81J199J443R25k1n57k54
$$ plain form
49849 296810 297425 297725 298365 299105 299203 298251 296500 294508 292631 290940 289494 288484 287966 287628 287033 286092 285113
49832 285113 284410 284018 283792 283565 283218 282902 283157 284480 286649 288767 290095 290571 290472 289987 289327 288804 288468 287941
49814 287941 286920 285536 284017 282369 280726 279621 279384 279582 279496 278944 278171 277200 275891 274469 273364 272560
49798 272560 271646 270542 269540 268572 267037 264600 261757 259345 257788 256952 256478 256076 255643 255172 254497 253370
49782 253370 252026 251358 252022 253532 254780 255292 255353 255123 254486 253842 254067 255308 256602 257158 257378 258137 259658
49765 259658 261664 264068 266812 269412 271345 272684 273767 274492 274516 273983 273436 273123 272879 272598 272302 271815 270957
49748 270957 270072 269810 270286 270854 270827 270037 268656 266914 265187 264003 263715 264315 265597 267272 268917 270188
49732 270188 271215 272493 274181 275765 276591 276586 276228 275962 275864 275831 275952 276533 277732 279175 280100 280079 279522 279268
49714B79268L99O37M15L71Q57J324R32l43j447j274J28J625K278K229K098J926
49698B91423J259J82m62m8J032J913K224K271K462K867L219L182K665J936J286
49683C17411O80om97l81J61M76M73Q64J986L006K902J742L56q70k024k792k545
49666C20942j419m05j7L78J438K648K983K453K238L226N029O662P805Q897J0164
49651C73022J0990J0409Q012M194k11m248o981p895p404o587o118n644m541l038
49637C53960k095k130k421k040j016j41J70L20P16J022O08m45j276j169j99J125
49621C44989K442L471L878L620L195L106L219L072K673K395K245J968J816K454
49607C84543L815M835M746M015L501L350L304L452L923M232L903L448L772M756
$$ plain form
49714 279268 279667 280304 280719 281090 281947 283271 284203 283860 282413 281139 281267 282892 285170 287399 289497 291423
49698 291423 292682 292864 292402 292354 293386 295299 297523 299794 302256 305123 308342 311524 314189 316125 317411
49683 317411 318091 318085 317588 317207 317368 317844 318317 319181 321167 324173 327075 328817 329173 328303 326279 323487 320942
49666 320942 319523 319118 319101 319479 320917 323565 326548 329001 331239 334465 339494 346156 353961 362858 373022
49651 373022 384012 394421 402433 406627 406416 402168 395187 387292 379888 373301 367183 361539 356998 353960
49637 353960 351865 349735 347314 345274 344258 344117 344287 344607 345323 346345 346953 346508 345232 344063 343864 344989
49621 344989 347431 350902 354780 358400 361595 364701 367920 370992 373665 376060 378305 380273 382089 384543
49607 384543 388358 393193 397939 401954 405455 408805 412109 415561 419484 423716 427619 431067 434839 439595
49593D39595N422N472N661O329O665N991M995M795N369N708N348M881M946N394
49579E16571N695N721N801O180O676O899O703O353O171O049N572M690L971L931
49565E96983M380M742M813M763M525L811K823K361K844L642L808L242K657K538
49551F47932K682K771K832K908K729K094J329R92J205J570J725J669J573J468
49537F75479J278J010R04J332K417L705M465M505M444M896N676O207O448O782
49523G29548P082O611N107L354K365K404L064L742L768K642P36o84q39n01j021
49508G67378k524l856m310m500n240o338p019p079o972o982o919o592o147n800
49494F87100n594n604o031o798p254o727n438m367m103m231m163m098m510n073
$$ plain form
49593 439595 445017 450489 456150 462479 469144 475135 480130 484925 490294 496002 501350 506231 511177 516571
49579 516571 522266 527987 533788 539968 546644 553543 560246 566599 572770 578819 584391 589081 593052 596983
49565 596983 601363 606105 610918 615681 620206 624017 626840 629201 632045 635687 639495 642737 645394 647932
49551 647932 650614 653385 656217 659125 661854 663948 665277 666269 667474 669044 670769 672438 674011 675479
49537 675479 676757 677767 678671 680003 682420 686125 690590 695095 699539 704435 710111 716318 722766 729548
49523 729548 736630 743241 748348 751702 754067 756471 759535 763277 767045 769687 770423 769739 768900 768399 767378
49508 767378 764854 760998 756688 752188 746948 740610 733591 726512 719540 712558 705639 699047 692900 687100
49494 687100 681506 675902 669871 663073 655819 649092 643654 639287 635184 630953 626790 622692 618182 613109
49480F13109m917l979l173l052l169l176l582m699n666n428m311l526l435l319
49466E57677k761k281k419l036l688m020l650k433j031m26o32o60l2N29M04J77
$$ plain form
49480 613109 608192 604213 601040 597988 594819 591643 588061 583362 577696 572268 567957 564431 560996 557677
49466 557677 554916 552635 550216 547180 543492 539472 535822 533389 532358 531932 531300 530640 530608 531137 531541 531718
$$ [...]
##END NTUPLES=NMR SPECTRUM
##END=
