##TITLE=NES1016_872015062_9265836_VDkpNgDeP0
##JCAMPDX= 6.0         $$ Bruker NMR JCAMP-DX V2.0
##DATA TYPE= NMR SPECTRUM
##DATA CLASS= NTUPLES
##ORIGIN= BRUKER
##OWNER= Administrator
$$ 1.72 TOPSPIN		Version 2.1
$$ 2015-08-24 15:02:35.873 -0700  Administrator@X
$$ Compression mode = diff/dup
##.OBSERVE FREQUENCY= 400.02188249412
##.OBSERVE NUCLEUS= ^1H
##.ACQUISITION MODE= SIMULTANEOUS (DQD)
##.ACQUISITION SCHEME= undefined
##.AVERAGES= 8
##.DIGITISER RES= 22
##SPECTROMETER/DATA SYSTEM= spect
##.PULSE SEQUENCE= zg30
##.SOLVENT NAME= COFFEE_meoh
##.SHIFT REFERENCE= INTERNAL, COFFEE_meoh, 1, 14.98509
##AUDIT TRAIL= $$ (NUMBER, WHEN, WHO, WHERE, PROCESS, VERSION, WHAT)
$$ ##TITLE= Audit trail, TOPSPIN		Version 2.1
$$ ##JCAMPDX= 5.01
$$ ##ORIGIN= Bruker BioSpin GmbH
$$ ##OWNER= Administrator
$$ $$ E:\/data/COFFEE/nmr/NES1016_872015062_9265836_VDkpNgDeP0/20/pdata/1/auditp.txt
$$ ##AUDIT TRAIL=  $$ (NUMBER, WHEN, WHO, WHERE, PROCESS, VERSION, WHAT)
(   1,<2015-08-24 15:02:27.920 -0700>,<Administrator>,<X>,<go>,<TOPSPIN 2.1>,
      <created by zg
	started at 2015-08-24 15:01:21.842 -0700,
	POWCHK enabled, PULCHK disabled,
       configuration hash MD5:
       21 0F 79 D6 B3 7B B4 F6 88 20 88 DB 03 48 BD 9F
       data hash MD5: 64K
       FC 73 79 7D E7 4C 72 7B 49 46 EC CE 30 E1 33 61>)
(   2,<2015-08-24 15:02:31.326 -0700>,<Administrator>,<X>,<proc1d>,<TOPSPIN 2.1>,
      <Start of raw data processing
       efp LB = 0 FT_mod = 6 PKNL = 1 PHC0 = 0 PHC1 = 0 SI = 32K 
       data hash MD5: 32K
       9A 72 46 18 06 BA 9D AD 27 32 36 DB 87 B3 C0 C8>)
(   3,<2015-08-24 15:02:31.639 -0700>,<Administrator>,<X>,<proc1d>,<TOPSPIN 2.1>,
      <pk PHC0 = 91.82922 PHC1 = 0 
       data hash MD5: 32K
       18 E5 EC DA 65 1D 95 C4 5D 1E 3B C2 C8 7F 0D 5D>)
(   4,<2015-08-24 15:02:31.748 -0700>,<Administrator>,<X>,<proc1d>,<TOPSPIN 2.1>,
      <abs ABSG = 1 
       data hash MD5: 32K
       3F FB 10 26 F7 68 43 A4 97 95 DC 5D BE 21 14 EE>)
(   5,<2015-08-24 15:02:31.811 -0700>,<Administrator>,<X>,<proc1d>,<TOPSPIN 2.1>,
      <abs ABSG = 2 
       data hash MD5: 32K
       FF 6C 16 98 EC 78 9A 8B BD 7F 96 DB 21 C7 90 9D>)
(   6,<2015-08-24 15:02:31.873 -0700>,<Administrator>,<X>,<proc1d>,<TOPSPIN 2.1>,
      <abs ABSG = 3 
       data hash MD5: 32K
       88 79 F4 8B 43 CB 73 59 D6 34 8A 3D B5 F2 ED E9>)
(   7,<2015-08-24 15:02:31.936 -0700>,<Administrator>,<X>,<proc1d>,<TOPSPIN 2.1>,
      <abs ABSG = 4 
       data hash MD5: 32K
       53 C4 95 3C D8 9D A3 62 23 2E BD DD EA 59 D1 81>)
(   8,<2015-08-24 15:02:31.998 -0700>,<Administrator>,<X>,<proc1d>,<TOPSPIN 2.1>,
      <abs ABSG = 5 
       data hash MD5: 32K
       01 7C 67 82 BB B2 42 0C D1 75 0E CB 23 49 4A 60>)
$$ ##END=
$$ 
$$ $$ hash MD5
$$ $$ 68 01 6D 6A 3A 00 B6 D7 35 01 83 43 EC 0E F5 7C
##$RELAX= 
##$RELAX= 
##$RELAX= 
##$RELAX= 
##$RELAX= 
##$RELAX= 
##$RELAX= 
$$ Bruker specific parameters
$$ --------------------------
##$DU= <E:\>
##$EXPNO= 20
##$NAME= <NES1016_872015062_9265836_VDkpNgDeP0>
$$ [...]
##$TP= (0..7)
150 150 150 150 150 150 150 150
##$TP07= 0
##$TPNAME0= <>
##$TPNAME1= <>
##$TPNAME2= <>
##$TPNAME3= <>
##$TPNAME4= <>
##$TPNAME5= <>
##$TPNAME6= <>
##$TPNAME7= <>
##$TPOAL= (0..7)
0.5 0.5 0.5 0.5 0.5 0.5 0.5 0.5
##$TPOFFS= (0..7)
0 0 0 0 0 0 0 0
##$TUNHIN= 0
##$TUNHOUT= 0
##$TUNXOUT= 0
##$USERA1= <user>
##$USERA2= <user>
##$USERA3= <user>
##$USERA4= <user>
##$USERA5= <user>
##$V9= 5
##$VALIST= <valist>
##$VCLIST= <CCCCCCCCCCCCCCC>
##$VD= 0
##$VDLIST= <DDDDDDDDDDDDDDD>
##$VPLIST= <PPPPPPPPPPPPPPP>
##$VTLIST= <TTTTTTTTTTTTTTT>
##$WBST= 2048
##$WBSW= 25
##$XGAIN= (0..3)
0 0 0 0
##$XL= 0
##$YL= 0
##$YMAX_a= 595669
##$YMIN_a= -496871
##$ZGOPTNS= <>
##$ZL1= 120
##$ZL2= 120
##$ZL3= 120
##$ZL4= 120
##$ABSF1= 14.98509
##$ABSF2= -5.573092
##$ABSG= 5
##$ABSL= 3
##$ALPHA= 0
##$AQORDER= 0
##$ASSFAC= 0
##$ASSFACI= 0
##$ASSFACX= 0
##$ASSWID= 0
##$AUNMP= <proc_prof1d_extract_pilot.lims>
##$AXLEFT= 0
##$AXNAME= <>
##$AXNUC= <1H>
##$AXRIGHT= 0
##$AXTYPE= 0
##$AXUNIT= <>
##$AZFE= 0.1
##$AZFW= 0.1
##$BCFW= 0
##$BC_mod= 0
##$BYTORDP= 0
##$COROFFS= 0
##$CY= 15
##$DATMOD= 1
##$DC= 0
##$DFILT= <>
##$DTYPP= 0
##$F1P= 0
##$F2P= 0
##$FCOR= 0.5
##$FTSIZE= 32768
##$FT_mod= 6
##$GAMMA= 0
##$GB= 0
##$INTBC= 1
##$INTSCL= 1
##$ISEN= 128
##$LB= 0
##$LEV0= 0
##$LPBIN= 0
##$MAXI= 10000
##$MC2= 0
##$MEAN= 0
##$ME_mod= 0
##$MI= 0
##$NCOEF= 0
##$NC_proc= -8
##$NLEV= 6
##$NOISF1= 0
##$NOISF2= 0
##$NSP= 0
##$NTH_PI= 0
##$NZP= 0
##$OFFSET= 14.98509
##$PC= 1
##$PHC0= 91.82922
##$PHC1= 0
##$PH_mod= 1
##$PKNL= yes
##$PPARMOD= 0
##$PPDIAG= 0
##$PPIPTYP= 0
##$PPMPNUM= 2147483647
##$PPRESOL= 1
##$PSCAL= 4
##$PSIGN= 0
##$PYNMP= <proc.py>
##$REVERSE= no
##$SF= 400.02
##$SI= 32768
##$SIGF1= 0
##$SIGF2= 0
##$SINO= 400
##$SIOLD= 32768
##$SPECTYP= <>
##$SREGLST= <1H.CDCl3>
##$SSB= 0
##$STSI= 32768
##$STSR= 0
##$SW_p= 8223.68421052631
##$SYMM= 0
##$S_DEV= 0
##$TDeff= 65536
##$TDoff= 0
##$TI= <>
##$TILT= no
##$TM1= 0
##$TM2= 0
##$TOPLEV= 0
##$USERP1= <user>
##$USERP2= <user>
##$USERP3= <user>
##$USERP4= <user>
##$USERP5= <user>
##$WDW= 1
##$XDIM= 32768
##$YMAX_p= 427465015
##$YMIN_p= -679928
##$CURPLOT= <Network HP LaserJet P1505>
##$CURPRIN= <$Network HP LaserJet P1505>
##$DFORMAT= <normdp>
##$LAYOUT= <+/1D_H.xwp>
##$LFORMAT= <normlp>
##$PFORMAT= <normpl>
##$SURQMSG= 1
$$ End of Bruker specific parameters
$$ ---------------------------------
##NTUPLES= NMR SPECTRUM
##VAR_NAME=  FREQUENCY,     SPECTRUM/REAL,   SPECTRUM/IMAG
##SYMBOL=    X,             R,               I
##VAR_TYPE=  INDEPENDENT,   DEPENDENT,       DEPENDENT
##VAR_FORM=  AFFN,          ASDF,            ASDF
##VAR_DIM=   32768,         32768,           32768
##UNITS=     HZ,            ARBITRARY UNITS, ARBITRARY UNITS
##FACTOR=    0.250966925370066, 1,           1
##FIRST=     8223.43324360094, -61158,       -21644
##LAST=      0,             -169924,         -2565
##MIN=       0,             -679928,         0
##MAX=       8223.43324360094, 427465015,    0
$$ Real data points
##PAGE= N=1
##DATA TABLE= (X++(R..R)), XYDATA
$$ [...]
19476b43806G9867b45509C92356C7098L02524a06347B986a58619A08387a23843
$$ -243806 79867 -245509 392356 37098 339622 -106347 2986 -158619 108387 -123843
19465a68649m1124B54580h8282A21326b26742f6511G3348b94190c477j50791e221
$$ -168649 -209773 254580 -88282 121326 -226742 -66511 73348 -294190 -3477 -154268 -5221
19453a74189a6600B60079d5001k15286J15123A5724a02604c0210o055k46106A56101
$$ -174189 -16600 260079 -45001 -260287 -145164 15724 -102604 -30210 -36265 -282371 156101
19441A16254J12491C6039b11192h1532k93321J74105q402Q4954K5957j69160K9203
$$ 116254 228745 36039 -211192 -81532 -374853 -200748 -209150 -124196 -98239 -267399 -238196
19430b38196J4089D4055a47329D65927A7143J11480J04966a26043c1043A27579
$$ -238196 -224107 44055 -147329 465927 17143 128623 233589 -126043 -31043 127579
19419h2128k06315j48514a32419j17011C15608b18483j58043a41807g394A49877
$$ -82128 -288443 -436957 -132419 -249430 315608 -218483 -376526 -141807 -7394 149877
19408C20896D8530b51505J4169A6985b45019e883F6663f4374k06981J00896D9450
$$ 320896 48530 -251505 -237336 16985 -245019 -5883 66663 -64374 -271355 -170459 49450
19396c60236A54177a38993M1412A24847h2225j37231N4122A31201a74535H491
$$ -360236 154177 -138993 -97581 124847 -82225 -219456 -165334 131201 -174535 8491
19385A16993a30645C18733a7225n0274G3906K47692h2410A63888e6378l5792m956
$$ 116993 -130645 318733 -17225 -67499 73906 321598 -82410 163888 -56378 -92170 -97126
19374i7126j47191G8582d51436B64160b19424B05169a34610e1346A6763c46863
$$ -97126 -244317 78582 -451436 264160 -219424 205169 -134610 -51346 16763 -346863
19363H7815c5587n028l23655f1943j30437F2421a69857q2580j67478H4262L9155
$$ 87815 -35587 -40615 -364270 -61943 -192380 62421 -169857 -252437 -419915 84262 123417
19352A23417b30721K7718A10212B9759a63111H8781b17189e4822B1234e7420E0876
$$ 123417 -230721 -203003 110212 29759 -163111 88781 -217189 -54822 21234 -57420 50876
19340h4927A45642b04693B07188J24631j42050C6644a187j39137o7141A15498
$$ -84927 145642 -204693 207188 331819 189769 36644 -1187 -140324 -207465 115498
19329G648b18869A26350e9082j80793l3839a00159F4961a08281p7673B54728c07060
$$ 7648 -218869 126350 -59082 -239875 -273714 -100159 64961 -108281 -185954 254728 -307060
19317B3181J4966e99806a28561N8535o943L5172j00227j64099d9738D5216J5482
$$ 23181 38147 -599806 -128561 -70026 -76969 -41797 -142024 -306123 -49738 45216 60698
19306F0698O0173c1429k71235A7717c13921f6513q0938b1893B45348o1427b9253
$$ 60698 120871 -31429 -302664 17717 -313921 -66513 -147451 -21893 245348 183921 -29253
19294A51583d0807A61732m0665b21840Q1817l4856r4581N2323Q6654c9513k7356
$$ 151583 -40807 161732 121067 -221840 -140023 -174879 -269460 -217137 -130483 -39513 -66869
19283f6869I2945a40795n40B94852G6852a37613b4259a347o7817a2163B3093b03420
$$ -66869 92945 -140795 -141335 294852 76852 -137613 -24259 -1347 -69164 -12163 23093 -203420
19270a25719o8162H1501E029d9054C29929A38346b93635b6874o1458G0037j3096
$$ -125719 -193881 81501 5029 -49054 329929 138346 -293635 -26874 -88332 70037 56941
19259E6941a01435j12915h3816A79687a66260j89566e8346E3479a20626j94392
$$ 56941 -101435 -214350 -83816 179687 -166260 -355826 -58346 53479 -120626 -315018
19249c15018D1868b2613A21933f2376m3839K3123A39851A1568b89779a44075O0982
$$ -315018 41868 -22613 121933 -62376 -106215 -83092 139851 11568 -289779 -144075 -83093
19238h3093A5973g9989n0928l32819h3339j26616O1053N0568j47518e070A4060
$$ -83093 15973 -79989 -130917 -463736 -83339 -209955 -148902 -98334 -245852 -5070 14060
19226E2682a68997h137j29037m0204B31864g1326l8555L2871D7147d05099C02355
$$ 52682 -168997 -8137 -137174 -177378 231864 -71326 -109881 -77010 47147 -405099 302355
19214a28117J1357B09399a47475e6532j14423f510k66732H2143C2979K25586a06418
$$ -128117 -116760 209399 -147475 -56532 -170955 -6510 -273242 82143 32979 258565 -106418
19202b49947A03286b68438L0685R5482A87252a91170A08554d03809B34132b15899
$$ -249947 103286 -268438 -237753 -142271 187252 -191170 108554 -403809 234132 -215899
19191c63512A14351b97143A0872c32067A93017a00107F7791a32952A68719c1525
$$ -363512 114351 -297143 10872 -332067 193017 -100107 67791 -132952 168719 -31525
19180G1154J79998a02074A12835g1030j2290k16233i952o6845r646c3318o5939
$$ 71154 251152 -102074 112835 -71030 -83320 -299553 -9952 -76797 -86443 -33318 -99257
19169i9257A08445K23702a05552m4171r7674C61550b01370A80514G6680l0683
$$ -99257 108445 332147 -105552 -149723 -247397 361550 -201370 180514 76680 45997
19159D5997j501d9257a3772a284m7039A71399f9378j10342k8262n3335d9523G4158
$$ 45997 44496 -49257 -13772 -1284 -48323 171399 -69378 -179720 -207982 -261317 -49523 74158
19146g4114l13253C27070D0070d508A82581a66845B3359a83817j24957E7573b78729
$$ -74114 -387367 327070 40070 -4508 182581 -166845 23359 -183817 -308774 57573 -278729
19134a21442O733D8736K7508a63168A34487J5222A6404d0275A01818a49597K1676
$$ -121442 -114709 48736 76244 -163168 134487 149709 16404 -40275 101818 -149597 -127921
19123a27921j52127F5088j2056R1208d59042H0756a80419f6208j76162k02520
$$ -127921 -280048 65088 53032 144240 -459042 80756 -180419 -66208 -242370 -444890
19113d44890G2069J18408H3415b17355M7016L9322k03977J14997L7275G7485a72726
$$ -444890 72069 190477 83415 -217355 -170339 -131017 -334994 -219997 -182722 77485 -172726
19101a07879A54581a82300d7869j25102L2300a117l7159A92646J61809A2035e4240
$$ -107879 154581 -182300 -47869 -172971 -140671 -1117 -38276 192646 354455 12035 -54240
19089a07892k90135e6446C2246f2328k67910A38718b4455j59815B2219a00381
$$ -107892 -398027 -56446 32246 -62328 -330238 138718 -24455 -184270 22219 -100381
19078E7707E97J28746k0328d9205A65009c64328I6828g2451l09242A12664b21199
$$ 57707 597 129343 109015 -49205 165009 -364328 96828 -72451 -381693 112664 -221199
19066D1857f1157K8205G8065C4925b1127k7496j5014k25839A87170R0843c40419
$$ 41857 -61157 -32952 78065 34925 -21127 -48623 -63637 -289476 187170 278013 -340419
19054a34546N7946k40274e4687G3688k2490a2874A27966J27310a89789N9427A13241
$$ -134546 -76600 -316874 -54687 73688 51198 -12874 127966 255276 -189789 -130362 113241
19042a78118j51231d8292A87349b27611A29022a09648O006H5201J17492H0624
$$ -178118 -329349 -48292 187349 -227611 129022 -109648 -103642 85201 202693 80624
19031g8528B29385a01781L9201j8632j45361a8228D4367c4753C36021b9916j49402
$$ -78528 229385 -101781 -62580 -81212 -226573 -18228 44367 -34753 336021 -29916 -179318
19020a79318F4177a11739I4342a30004A1729b42911A43843g7085g864o7788c6601
$$ -179318 64177 -111739 94342 -130004 11729 -242911 143843 -77085 -7864 -75652 -36601
19008H4551f3325G0678O1052b00981D5935K27383c53795a49302F9024c21686P9515
$$ 84551 -63325 70678 131730 -200981 45935 273318 -353795 -149302 69024 -321686 -242171
18997b42171j44752A17573g6164l7583j3679O1346l02162D4745b09019P1107D3434
$$ -242171 -386923 117573 -76164 -113747 -127426 -66080 -368242 44745 -209019 -137912 43434
18985E3463k4406d00580A84484d2014m3524A69513f0234p348r4264D9998A237
$$ 53463 29057 -400580 184484 -42014 -85538 169513 -60234 -67582 -161846 49998 1237
18973C8919b6219j11871K0405K0126g354I5576l1095M2601f1157a1487F0012E988
$$ 38919 -26219 -138090 -117685 -97559 -7354 95576 64481 107082 -61157 -11487 60012 5988
18960b97468a15770N2491j2110l05127Q5074A6047P8541b38363a08395c6086j55197
$$ -297468 -115770 -63279 -75389 -380516 -295442 16047 94588 -238363 -108395 -36086 -191283
18949a91283e9943l6692J7345j3623k0126K3227j56188A58083i1052J3902k41488
$$ -191283 -59943 -96635 -79290 -92913 -113039 -89812 -246000 158083 -91052 -77150 -318638
18938c18638A29360f2738n8263M8624k4560C6466J12876h7710n4876A5948b19279
$$ -318638 129360 -62738 -121001 -72377 -96937 36466 149342 -87710 -142586 15948 -219279
18926a51565q6733a3238k24488f6141A12730K22196j65295a15715l20409d6412
$$ -151565 -238298 -13238 -237726 -66141 112730 334926 169631 -115715 -436124 -46412
18915a68842P6489m0754p5446j66493a02813c9437D8357a75998p3914A44289K34393
$$ -168842 -92353 -133107 -208553 -375046 -102813 -39437 48357 -175998 -249912 144289 378682
18904C78682A24342K86876A03491K77417a04388A1131K42739b9001l3689C6737
$$ 378682 124342 411218 103491 380908 -104388 11131 253870 -29001 -62690 36737
18893b01644n2160c2563F2821R6327b06625Q4449D0542a10728j18789B4595J58122
$$ -201644 -253804 -32563 62821 159148 -206625 -122176 40542 -110728 -229517 24595 182717
18882A82717h7166G4529f6181K5161j163l5597o2056K5405j8282F3950G130h6971
$$ 182717 -87166 74529 -66181 -41020 -42183 -77780 -139836 -114431 -132713 63950 7130 -86971
18869F200P2487a31542B44805A8856J28849d2683A65747b86976i4970B09776a27651
$$ 6200 78687 -131542 244805 18856 147705 -42683 165747 -286976 -94970 209776 -127651
18857A64777a75634b8574o6605A34970i4679j47296j46580A34875N1730m7876
$$ 164777 -175634 -28574 -95179 134970 -94679 -241975 -388555 134875 186605 138729
18847A38729a99528r6322F8541b18743N309a3365A66224a00261B1249c27193J17857
$$ 138729 -199528 -295850 68541 -218743 -213434 -13365 166224 -100261 21249 -327193 -209336
18836b09336a171A21624A8210c756k9116m2060H5589d2000l2576L0157C22531
$$ -209336 -1171 121624 18210 -3756 -32872 -74932 85589 -42000 -74576 -44419 322531
18824c88307a69139B72790h721j59547I550K12531c0222k2037L644j77972M4094
$$ -388307 -169139 272790 -8721 -168268 9550 222081 -30222 -52259 -48615 -226587 -182493
18813a82493j2105B5536E603K1508L2885a56200q3348D674g4155B5747C918g0051
$$ -182493 -194598 25536 5603 27111 59996 -156200 -239548 4674 -74155 25747 3918 -70051
18800B44174F2577L0207a4175A31712K8286B3799J91005E3936K38572b50502C8488
$$ 244174 62577 92784 -14175 131712 159998 23799 214804 53936 292508 -250502 38488
18788b77701A16459a36683f791C6134J73182c13648H2663a06196A93718a97922
$$ -277701 116459 -136683 -6791 36134 209316 -313648 82663 -106196 193718 -197922
18777E4356R126h3298k03661A12730b69323A0229M0954i8593k06367a50911L7882
$$ 54356 63482 -83298 -286959 112730 -269323 10229 51183 -98593 -304960 -150911 -113029
18766a13029j17765A3767a21781f733C25682d504q4744B13103d5865n785j48772
$$ -113029 -230794 13767 -121781 -6733 325682 -4504 -89248 213103 -45865 -51650 -200422
18755b00422d1587j29710e5867A10760a4152F1828L9601P8912m8185J3326a47550
$$ -200422 -41587 -171297 -55867 110760 -14152 61828 101429 180341 132156 145482 -147550
18743a88568b1835B3993a04698R776j87953J08301J7771I4436J16000D3044R0569
$$ -188568 -21835 23993 -104698 -94922 -282875 -174574 -156803 94436 210436 43044 133613
18732A33613a83903A79777A0850d10552M2759M9411I6958e6430K3087A21567B5173
$$ 133613 -183903 179777 10850 -410552 -367793 -318382 96958 -56430 -33343 121567 25173
18720b59916a23835J0704B08177a32384b7687k49633J34711j35198a30228L0034
$$ -259916 -123835 -113131 208177 -132384 -27687 -277320 -142609 -277807 -130228 -100194
18710a00194f12D5332P7274j1554b70545M6941c0825E8306b72806J33877j65924
$$ -100194 -612 45332 122606 111052 -270545 -223604 -30825 58306 -272806 -138929 -304853
18699c04853B61770a33495J2120B48663i3772k09052Q6290a5615k6785r2155C8600
$$ -304853 261770 -133495 -121375 248663 -93772 -302824 -216534 -15615 -42400 -134555 38600
18687b62328A99798h226m5588A94040f3536j52231k4157d4126A43475c2515B70199
$$ -262328 199798 -8226 -53814 194040 -63536 -215767 -239924 -44126 143475 -32515 270199
18675G0096R0915G5270a79471h9433j8570o1478q1084p7440a33452A06620l3037
$$ 70096 161011 75270 -179471 -89433 -108003 -169481 -250565 -328005 -133452 106620 73583
18664G3583a34494I8963i9911j34790J10751c4903J680j10052a9990j16327A39599
$$ 73583 -134494 98963 -99911 -234701 -123950 -34903 -33223 -143275 -19990 -136317 139599
18652B55615a55221L1917B58202j24870d64220A21852L4040f5369l30444f7578
$$ 255615 -155221 -123304 258202 133332 -464220 121852 155892 -65369 -395813 -67578
18641e2052l24641A9378c68245e112k23904C07231r476d37983i5794B1919J9548
$$ -52052 -376693 19378 -368245 -5112 -229016 307231 297755 -437983 -95794 21919 41467
18630D1467a8625k25968L8113A37039d0715j7444a3538A52460d1590b876o8569
$$ 41467 -18625 -244593 -206480 137039 -40715 -58159 -13538 152460 -41590 -2876 -71445
18619g1445A66678J4824B6371a6608j21331K5353a6111J947A6960L1457b27510
$$ -71445 166678 181502 26371 -16608 -137939 -112586 -16111 -14164 16960 48417 -227510
18607c4733A1695b38224J17731j49132B0013N167a30379B6751c43169G0146h4767
$$ -34733 11695 -238224 -120493 -269625 20013 25180 -130379 26751 -343169 70146 -84767
18595a25032g08k10341l3202A8205J4941d5654C2723a11784r307b615j58501F5291
$$ -125032 -708 -211049 -244251 18205 33146 -45654 32723 -111784 -121091 -2615 -161116 65291
18582H5056O9085R4488a2551H3140O8788C8442K53437J2460D0653N2465l8536
$$ 85056 154141 248629 -12551 83140 151928 38442 291879 304339 40653 93118 54582
18571E4582f77B7666J9468K0765a09490j3045B5318R2008a16379d5761j5087I1564
$$ 54582 -677 27666 47134 67899 -109490 -122535 25318 117326 -116379 -45761 -60848 91564
18558A40999c96510B078K44298a03112F496a01459o1487J038K2982b1562B95679
$$ 140999 -396510 2078 246376 -103112 6496 -101459 -162946 -161908 -138926 -21562 295679
18546b78731B48162p5135n9337r42h7761j39943A13398E1587c62292C2032i9551
$$ -278731 248162 173027 113690 112748 -87761 -227704 113398 51587 -362292 32032 -99551
18534d7364k7039B1530b22402a00463B94547a45524j36236m5464B57745d619C909
$$ -47364 -74403 21530 -222402 -100463 294547 -145524 -281760 -327224 257745 -4619 3909
18522A1054a73046O5084A0708M3355P9617n5651f7909b4736K366m7715A31861
$$ 11054 -173046 -107962 10708 54063 133680 78029 -67909 -24736 -22370 -70085 131861
18510g2238A06497f7757j07883k09140B97877c530B98840h1209A88996a98466
$$ -72238 106497 -67757 -175640 -384780 297877 -3530 298840 -81209 188996 -198466
18499a0665k06092a00582m5491H9717j3118b79852R021r4874i549A85542b27939
$$ -10665 -216757 -100582 -146073 89717 76599 -279852 -270831 -365705 -9549 185542 -227939
18487c69822O2199b6729o926G5514k8318d7126f180G4558k2100K37567a10899
$$ -369822 -307623 -26729 -33655 75514 47196 -47126 -6180 74558 52458 290025 -110899
18475e0927j00876o4947G6079a46110i007l407H0989b30123C08708F1391f466
$$ -50927 -151803 -216750 76079 -146110 -9007 -12414 80989 -230123 308708 61391 -6466
18463a0077r0983A33269h6837H0203k1446f6904H1565a91590j94572A11112D8388
$$ -10077 -101060 133269 -86837 80203 58757 -66904 81565 -191590 -386162 111112 48388
18451i1975r8607B31888g6479j11043K5495j0505o6387e0428B61494j10075K0690
$$ -91975 -190582 231888 -76479 -187522 -162027 -172532 -238919 -50428 261494 151419 172109
18440A72109b54990A03318g0358k0976K1978A33563a1747l06139J18500e9381
$$ 172109 -254990 103318 -70358 -91334 -69356 133563 -11747 -317886 -199386 -59381
18429b3949D526a62488E4283a35667j5545A92006e8836o3661J6304B70068A30700
$$ -23949 4526 -162488 54283 -135667 -151212 192006 -58836 -122497 -106193 270068 130700
18417D88309I5166a08484G2759A3363M0669a90862j13966A04771c32070I9472
$$ 488309 95166 -108484 72759 13363 54032 -190862 -304828 104771 -332070 99472
18406I2166J081C4118b00897c0790a5080j59766b6989B3807a42325j58546G258
$$ 92166 93247 34118 -200897 -30790 -15080 -174846 -26989 23807 -142325 -300871 7258
18394A6848K55208D7884c27400J26811a00151q9701g06A26804B9816a99418c6708
$$ 16848 272056 47884 -327400 -200589 -100151 -189852 -706 126804 29816 -199418 -36708
18382A06611J80215A31857g8498A40092O2919a39451d6943l36435e3932m92339
$$ 106611 286826 131857 -78498 140092 203011 -139451 -46943 -383378 -53932 -546271
18372e46271E5130c55170B56670g2472b8463A75854f6266l6062m8095m4018A71064
$$ -546271 55130 -355170 256670 -72472 -28463 175854 -66266 -102328 -150423 -194441 171064
18360d1091k535E1788b42375g1368j29892h629A621K04351r1350a5726B4495P8977
$$ -41091 -43626 51788 -242375 -71368 -201260 -8629 1621 205972 114622 -15726 24495 103472
18348A03472P2152a07406p499j87536E835a8320o6887D2114L39899j76268P718
$$ 103472 175624 -107406 -114905 -302441 5835 -18320 -85207 42114 382013 205745 213463
18337B13463I0292k6402A8062O561c5982j43535l9689h2410A44392A9019O1849
$$ 213463 90292 63890 18062 24623 -35982 -179517 -219206 -82410 144392 19019 80868
18326H0868b05115B02377C5411a93203E5328J01935a36364k20842d343j01494
$$ 80868 -205115 202377 35411 -193203 55328 157263 -136364 -357206 -4343 -105837
18316a05837d7342j98509E1741c777C8626a27092l1805P1738b1442n1549A633
$$ -105837 -47342 -245851 51741 -3777 38626 -127092 -158897 -87159 -21442 -72991 1633
18304a57982j96730A33789b98975c3939r3372j70354g999l76824B11275c50733
$$ -157982 -354712 133789 -298975 -33939 -127311 -297665 -7999 -384823 211275 -350733
18293h3532D9868K5208J63582e5473k10282J11229B82965c99965g3434l8521A13503
$$ -83532 49868 75076 238658 -55473 -265755 -154526 282965 -399965 -73434 -111955 113503
18281D50474f2589A05468B1106N4315a68755B07491a07581j40664R2813A14360
$$ 450474 -62589 105468 21106 75421 -168755 207491 -107581 -248245 -155432 114360
18270C0564J37414k1870n7778O8783b09860j67300i397G7989b44255h4000a5011
$$ 30564 167978 146108 88330 157113 -209860 -377160 -9397 77989 -244255 -84000 -15011
18258b37146O8144D8418O7922D4694a04693C28905b4785n0554A05294c82727b255
$$ -237146 -169002 48418 116340 44694 -104693 328905 -24785 -75339 105294 -382727 -2255
18246a69830f0447j28740e374j35470D1865c2483j37082A72718a01009C809J26282
$$ -169830 -60447 -189187 -5374 -140844 41865 -32483 -169565 172718 -101009 3809 130091
18235A30091b6733o2136j28817Q7748c834A11016c2957A64638a92758p8616A51429
$$ 130091 -26733 -88869 -217686 -129938 -3834 111016 -32957 164638 -192758 -271374 151429
18223g9558k42724R8691r0265B07962O9102b5959D2197a89280E1553a14584B75973
$$ -79558 -322282 -223591 -313856 207962 277064 -25959 42197 -189280 51553 -114584 275973
18211a31144C22025j46861a52488I4835B0409L33572c39843J39552D5342a75942
$$ -131144 322025 175164 -152488 94835 20409 353981 -339843 -200291 45342 -175942
18200a24043e6022B766b95561d0583J8469j27700J2267p6474J00288e4055F0306
$$ -124043 -56022 2766 -295561 -40583 -22114 -149814 -137547 -214021 -113733 -54055 60306
18188D8818J015c43022A33657A2272J35471o7635b90535A11655a87975j19342
$$ 48818 49833 -343022 133657 12272 147743 80108 -290535 111655 -187975 -307317
18178c07317b9442j98440E6007J77744a66331N6910E5269N893K01066b21003j28348
$$ -307317 -29442 -227882 56007 233751 -166331 -109421 55269 61162 262228 -221003 -349351
18167c49351B71827c79324a43983M7044M7914A6815c93305C66076a53291F959
$$ -349351 271827 -379324 -143983 -96939 -49025 16815 -393305 366076 -153291 6959
18156a04589l8451o7208N9796B7890a08558B1981R1599J69995C465f5179m7401
$$ -104589 -143040 -210248 -150452 27890 -108558 21981 113580 283575 3465 -65179 -112580
18145a12580A17250d0405C51089p3800A37659a21129B57254b00783h1010D4193
$$ -112580 117250 -40405 351089 277289 137659 -121129 257254 -200783 -81010 44193
18134d8268A29044h4755d354I9190b35426P0911Q0848j45826A53279p4383J11704
$$ -48268 129044 -84755 -4354 99190 -235426 -164515 -83667 -229493 153279 78896 190600
18123A90600f8057B55664g8231B0716c14298a44655A28940a12262C6802b31563
$$ 190600 -68057 255664 -78231 20716 -314298 -144655 128940 -112262 36802 -231563
18112c8275F5981J27796a51869A1708c32720J16779f9108j26985B7313d9146I0319
$$ -38275 65981 193777 -151869 11708 -332720 -215941 -69108 -196093 27313 -49146 90319
18100A4101b1279A52522p2949N1948A8991g4158q1463A79226a18585b2084d499
$$ 14101 -21279 152522 79573 131521 18991 -74158 -155621 179226 -118585 -22084 -4499
18088i8056N427E6528M1675d4786k38254D4981a99720A29741A8762Q1982D0684
$$ -98056 -92629 56528 98203 -44786 -283040 44981 -199720 129741 18762 100744 40684
18076H7244c07989A07891N3022m5167b53555G6863G455K2946a72522B91549A6146
$$ 87244 -307989 107891 160913 115746 -253555 76863 7455 30401 -172522 291549 16146
18064A08408C5506b9597j5606k78634e647o9665G2100c5712C5590B179f0488F323
$$ 108408 35506 -29597 -45203 -323837 -5647 -75312 72100 -35712 35590 2179 -60488 6323
18051f6167A29631J22058d3925j87483A93681a25933C02531K5496b58843a6823
$$ -66167 129631 251689 -43925 -231408 193681 -125933 302531 328027 -258843 -16823
18040d1855q2683q019A23819C8368b19864i8323A47228b29864A71412b71486B44283
$$ -41855 -124538 -132557 123819 38368 -219864 -98323 147228 -229864 171412 -271486 244283
18028a33400B47402I7183h5007j15917A85912p1751K02902a75939A24556h0014
$$ -133400 247402 97183 -85007 -200924 185912 114161 317063 -175939 124556 -80014
18017C29848A09023b82606L9218i3962I5074a04365B3682R2126J5911E3995O4147
$$ 329848 109023 -282606 -243388 -93962 95074 -104365 23682 115808 131719 53995 118142
18006A18142k0756c01725j6674D04987A05192a44687D25973a76078c7552B31052
$$ 118142 97386 -301725 -318399 404987 105192 -144687 425973 -176078 -37552 231052
17995a38213p0900L3683o0204J14478F8629J67089g0632j99036A74927c0436l27631
$$ -138213 -209113 -175430 -235634 -121156 68629 235718 -70632 -269668 174927 -30436 -358067
17984c58067A36013b60163b1815j8050A47465e8431e064H7538c1908m6862C169
$$ -358067 136013 -260163 -21815 -39865 147465 -58431 -5064 87538 -31908 -78770 3169
17972G0200L4360b55489B78994a98484H6461O0208P9060j5156a4119k57726a4499
$$ 70200 104560 -255489 278994 -198484 86461 146669 225729 210573 -14119 -271845 -14499
17960f3980J2428j68548E02269g782o0512q6562E03785b16578H8881a77413d1149
$$ -63980 -51552 -220100 502269 -7782 -68294 -154856 503785 -216578 88881 -177413 -41149
17948A19466a51967j72463R1466I298J38899D9120A8893N4515O8091C6520a83903
$$ 119466 -151967 -324430 -232964 9298 148197 49120 18893 73408 141499 36520 -183903
17936C1583a20090A50327M9778c0373j36328C27670G7885J9602J89563a15948
$$ 31583 -120090 150327 200105 -30373 -166701 327670 77885 97487 287050 -115948
17925a7686o2094j15448D9989a2461G5012a44864a6477A43606j8622b17310A04163
$$ -17686 -79780 -195228 49989 -12461 75012 -144864 -16477 143606 124984 -217310 104163
17913A25635a60258l5055C2621a72183B03225a19374B11938k2157C7025K99987
$$ 125635 -160258 -195313 32621 -172183 203225 -119374 211938 189781 37025 337012
17903C37012a61237C28665b18303N60O8446a0205k25288G4037j2156J05218J03578
$$ 337012 -161237 328665 -218303 -217743 -149297 -10205 -235493 74037 61881 167099 270677
17892B70677a29172B65973a07409l7079f9459A66431a35622B43117b769j19080
$$ 270677 -129172 265973 -107409 -144488 -69459 166431 -135622 243117 -2769 -121849
17882a21849A76573a25586b8891A46856a0872A52712D5960N4971p009f9779l2807
$$ -121849 176573 -125586 -28891 146856 -10872 152712 45960 100931 93922 -69779 -102586
17871a02586A91615M0454o1495F8857a50229e3899A38606N0685k3830a30169N0593
$$ -102586 191615 232069 170574 68857 -150229 -53899 138606 189291 165461 -130169 -79576
17860g9576B53481J83091H0669d3031A27585g6992j08392C46454A29609k7225
$$ -79576 253481 436572 80669 -43031 127585 -76992 -185384 346454 129609 102384
17850A02384f0479k16764a17369B13910b45884G7624g8095A01665K4342g4671
$$ 102384 -60479 -277243 -117369 213910 -245884 77624 -78095 101665 126007 -74671
17839A98941B1881a00515K8991G8165J3305f6774D4875Q7164k139a91787B64415
$$ 198941 21881 -100515 -71524 78165 91470 -66774 44875 132039 129900 -191787 264415
17827g053j19557A97282b23595a07442M5033K090A16170J13531A07030B9251a64971
$$ -7053 -126610 197282 -223595 -107442 -62409 -60319 116170 229701 107030 29251 -164971
17815a59180C32549B0780P7906a03707f173B2242J10601m2827J07330L0057D7644
$$ -159180 332549 20780 98686 -103707 -6173 22242 132843 90016 197346 227403 47644
17803i7184j9898A22327a09968B13971r1363b49727c7793A01264L2334O3362a72037
$$ -97184 -117082 122327 -109968 213971 122608 -249727 -37793 101264 133598 196960 -172037
17791I7420a83069b2555m4792A43438D0638g1359I8396J63667Q4564d6945B26937
$$ 97420 -183069 -22555 -67347 143438 40638 -71359 98396 262063 346627 -46945 226937
17779G3753a06345j09470G4791a88943A49179k8980a1343C08986d02503a48223
$$ 73753 -106345 -215815 74791 -188943 149179 120199 -11343 308986 -402503 -148223
17768f8094k37490A34126R6194a390r9572F2571a25049B85661J88922a17899C1782
$$ -68094 -305584 134126 230320 -1390 -100962 62571 -125049 285661 474583 -117899 31782
17756A17694a98080C7539b28724g1359B80149E2015c07443e0717A53065o8274
$$ 117694 -198080 37539 -228724 -71359 280149 52015 -307443 -50717 153065 84791
17746H4791K44194j49381g9179j14174A76564K4188a2877p3015A82317H4995f6873
$$ 84791 328985 179604 -79179 -193353 176564 200752 -12877 -85892 182317 84995 -66873
17734a50588A40950A5352e5642j23322a1406j12412B6427J94053G6731A5000R6113
$$ -150588 140950 15352 -55642 -178964 -11406 -123818 26427 220480 76731 15000 111113
17723A11113I858N15772B33520A8880M9474b03161f512j2375A87414D026g9982
$$ 111113 9858 525630 233520 18880 68354 -203161 -6512 -18887 187414 4026 -79982
17711b00427A18274g6161C0939a28248B54657m0802j06772r387D3016n536b33446
$$ -200427 118274 -76161 30939 -128248 254657 213855 107083 97696 43016 37480 -233446
17699b690k58776c0637J0586A46829n4564K78750I0608a99523D41852j13440a4211
$$ -2690 -261466 -30637 -20051 146829 92265 371015 90608 -199523 441852 328412 -14211
17687a95883A54834n4478f5730A11152g357C0686a11582c8659C25280a01063B31242
$$ -195883 154834 100356 -65730 111152 -7357 30686 -111582 -38659 325280 -101063 231242
17675h8957A34772O4413a2659C32751A59383B6888K9654O41680k79415b36444
$$ -88957 134772 199185 -12659 332751 159383 26888 56542 698222 418807 -236444
17664B92006a93073m0147J9035I9643b11803F2199a87580b6760I4968j6809a22960
$$ 292006 -193073 -233220 -214185 99643 -211803 62199 -187580 -26760 94968 78159 -122960
17652C06617l8709a38930B7168J66826r3247J9847K02490a08826B24123F709a5722
$$ 306617 267908 -138930 27168 193994 100747 120594 323084 -108826 224123 6709 -15722
17640A20125B0308L42625j934j31044B7462K61535g9977b8294j28745N2581d5406
$$ 120125 20308 362933 360999 229955 27462 288997 -79977 -28294 -157039 -104458 -45406
17628a56992C69215b1143r4050E49839g9345K0886B3665b8691i676m7488I2554
$$ -156992 369215 -21143 -115193 549839 -79345 -58459 23665 -28691 -9676 -57164 92554
17616H9966j4715a63987A71549k9847N0756a71339F1789A7078P3525G174J39664
$$ 89966 75251 -163987 171549 141702 192458 -171339 61789 17078 90603 7174 146838
17605A46838B1984K63542j39559L1282p3416Q7146H1267g0758j78305A25126N25060
$$ 146838 21984 285526 145967 177249 103833 190979 81267 -70758 -249063 125126 650186
17594F50186A30374f2766D1516K63182D599K29688j1808L1794o704I5363O0000
$$ 650186 130374 -62766 41516 304698 4599 234287 222479 254273 247569 95363 155363
17583A55363E5645L20932c3339D2542h9212b20m0551e408A65773J12940a61711
$$ 155363 55645 376577 -33339 42542 -89212 -220 -40771 -5408 165773 278713 -161711
17571A59703l9013L13004A39823d9116B30853R5202j25215I3511Q5415M4982B7619
$$ 159703 120690 433694 139823 -49116 230853 326055 200840 93511 178926 223908 27619
17559d3155B55185q3460E2697P9693L60824A28275h9828C75528f0408a84B69009
$$ -43155 255185 171725 52697 132390 493214 128275 -89828 375528 -60408 -184 269009
17547a46395A03362n1032K1094a03977B07817P1115A1484c9740r2123A25719j6352
$$ -146395 103362 52330 73424 -103977 207817 278932 11484 -39740 -131863 125719 109367
17536A09367e9799A16997J35320d7433A91430K30427j36121F5519J8806k7571
$$ 109367 -59799 116997 252317 -47433 191430 421857 285736 65519 84325 56754
17526E6754K3026N06331b290D23229K08221j29121j6277j63876J84710k47420
$$ 56754 79780 586111 -2290 423229 631450 502329 486052 322176 506886 259466
17516B59466J08851j35413I9842L01750A10840h4455C61627J5779O1840J47973
$$ 259466 368317 232904 99842 401592 110840 -84455 361627 377406 439246 587219
17506E87219P7335j09833J89441C46846A31085J21279A09801K49859G4082M5746
$$ 587219 664554 554721 744162 346846 131085 252364 109801 359660 74082 119828
17496A19828J96885J85888j66114p6543j09263J62600J48831q4753j54779j5604
$$ 119828 316713 502601 336487 259944 150681 313281 462112 377359 222580 206976
17486B06976J32995O9820j7808A6274f6679R591B7668M58384k34303N907J54388
$$ 206976 339971 409791 391983 16274 -66679 -57088 27668 486052 251749 257656 412044
17475D12044A21812J48464A23198K87158b77952H0235K73935p4635B8650b4008
$$ 412044 121812 270276 123198 410356 -277952 80235 354170 279535 28650 -24008
17464B73979R2829r7680a46420C73606j71815A4579a9285C289L49610A6711K43710
$$ 273979 366808 269128 -146420 373606 201791 14579 -19285 3289 352899 16711 260421
17453B60421E8997P2873K09061q0910P2584B6153L67730A32543J38739J86510
$$ 260421 58997 131870 340931 260021 332605 26153 393883 132543 271282 457792
17443D57792A14921J83185o3335I068K91337K65093A69573M3305n430q1138L10301
$$ 457792 114921 298106 234771 9068 300405 565498 169573 212878 207448 126310 436611
17432D36611A04832R1778M4020k8113J53621A68222K33576j75882o8039e8740
$$ 436611 104832 196610 240630 212517 366138 168222 401798 225916 157877 -58740
17421B71099P3973K41829R752k36647j07704K20365k1674Q4928F5615K44743K2056
$$ 271099 345072 586901 596653 360006 252302 472667 450993 535921 65615 310358 332414
17410C32414J06580A15385c3978D69405k02520a13997e0240A29706R8711a19083
$$ 332414 438994 115385 -33978 469405 266885 -113997 -50240 129706 228417 -119083
17399i4778A98242L0772O2141c6415A07987D31N63911k07046h610B75670A6107
$$ -94778 198242 229014 291155 -36415 107987 431 564342 357296 -8610 275670 16107
17387B86553N1830d5911G1923J11189J93399H4745m1442J50483p5153J29642F6388
$$ 286553 338383 -45911 71923 183112 376511 84745 43303 193786 118633 248275 66388
17375A98148P848C5643M8479J75899F7631a0523B64165A09745R3920j01765D9217
$$ 198148 205996 35643 84122 260021 67631 -10523 264165 109745 203665 101900 49217
17363B52419l5836R318G6786K66075E4459a66729A48657J20148E694J68050i5028
$$ 252419 216583 225901 76786 342861 54459 -166729 148657 268805 5694 173744 -95028
17351D69244F896K69132A03170A0700K96199L044A45615L85997H6203M814J09422
$$ 469244 6896 276028 103170 10700 306899 309943 145615 531612 86203 91017 200439
17340B00439L3126J30496j13862M8736K3670a35659B01802N5313A3322L54100
$$ 200439 233565 364061 250199 298935 322605 -135659 201802 257115 13322 367422
17330C67422M6949R7757A95095o6923J85419Q7753C3300K43343J4982N5259k0842
$$ 367422 414371 512128 195095 128172 313591 401344 33300 276643 291625 346884 326042
17319C26042b09817B15387D2204J88978q2913a91397G9065J66138J58159A40578
$$ 326042 -209817 215387 42204 231182 148269 -191397 79065 245203 403362 140578
17308I3144J23897L2839b6968D53226A92320J66153j74559J51843j32569G6132
$$ 93144 217041 249880 -26968 453226 192320 358473 183914 335757 203188 76132
17297B24022p8844b6458C86053K2557r0051j56975E5890K67695a8351B13193J81474
$$ 224022 145178 -26458 386053 408610 318559 161584 55890 323585 -18351 213193 394667
17286C94667j6612j15951J35688A09519L81579j91224o4117J32272A61282o2816
$$ 394667 378055 262104 397792 109519 491098 299874 235757 368029 161282 98466
17276I8466J30812m252H0675e6624E04788l6845k10517o1423m5743L70203k52008
$$ 98466 229278 225026 80675 -56624 504788 467943 257426 196003 150260 520463 268455
17265B68455j00231M20045k73276A36076R1857L08186k9452k05928j32481J13802
$$ 268455 168224 588269 314993 136076 227933 536119 506667 300739 168258 282060
17255B82060o7029l4642K1202o0050J23374N5195j43656M59586A30951J12514
$$ 282060 215031 180389 201591 141541 264915 320110 176454 636040 130951 243465
17245B43465J53618J7632j4411q5012J23605A98505L06998o1152B17279l7623
$$ 243465 397083 414715 400304 315292 438897 198505 505503 444351 217279 179656
17235A79656J66109r378n0557j17899J52340p3081A12885L27459j80976K60578
$$ 179656 345765 336387 285830 167931 320271 247190 112885 440344 259368 519946
17225E19946r7455j35199O8185I5263N0372K33262Q1314p4338k8752J44738k01464
$$ 519946 422491 287292 355477 95263 145635 378897 460211 385873 357121 501859 300395
17214C00395J13885l3054J28776j67756q9813m947M58228C03593J92532j42592
$$ 300395 414280 381226 510002 342246 252433 247486 705714 303593 496125 353533
17204C53533O2077j40420K43031A38106K59245A19782K01768D1386K66632L32267
$$ 353533 415610 275190 518221 138106 397351 119782 321550 41386 308018 640285
17194F40285j24439k39184c0805C54460m6526J04204l7190f4358A53484L67602
$$ 640285 515846 276662 -30805 354460 307934 412138 374948 -64358 153484 521086
17184E21086K81732C21014L32410j51931m3223j26154J19757J94994B23318K04658
$$ 521086 802818 321014 653424 501493 458270 332116 451873 646867 223318 427976
17174D27976J47917j40747O8398j78431r1599K52864k5766j64214R6879M2647
$$ 427976 575893 435146 503544 325113 233514 486378 460612 296398 393277 435924
17164D35924B03045M02901j28777O6791k28780J59655K0169p660l7548A99525
$$ 435924 203045 605946 477169 543960 315180 474835 495004 487344 449796 199525
17153C08624J51317M9062j19535O3515k2440p5061l7821J34061J96594J16304
$$ 308624 459941 509003 389468 452983 430543 355482 317661 451722 648316 764620
17143G64620j81053j22683p7886K56143P9403J54775j13666j27773R9997l34438
$$ 764620 583567 460884 382998 639141 718544 873319 759653 631880 731877 397439
17133C97439L84570l51172q4550j09973M01577J44716l82355K04507j76602A98150
$$ 397439 782009 430837 346287 236314 637891 782607 400252 604759 428157 198150
17122C76017J12588J52601q0825m3178J73832J52732l10054J33891P9403j32761
$$ 376017 488605 641206 560381 517203 691035 843767 533713 667604 747007 614246
17112F14246J03152j11731q7670P4705k57526J64494o7329J58194m2741J3093
$$ 614246 717398 605667 517997 592702 335176 499670 432341 590535 547794 560887
17102E60887o8166K1620r2545j6139L63255k85540R7516K32672n1780L5636j79859
$$ 560887 492721 514341 421796 405657 768912 483372 580888 813560 761780 797416 617557
17091F17557j10403K62593o3441K2474j639k5144k62362K41283q5432J62905K28110
$$ 617557 507154 769747 706306 728780 727141 701997 439635 680918 595486 758391 986501
17080I86501j15072l04089P0845K41654j89463r5194K60499j50997j47320J27249
$$ 986501 871429 567340 638185 879839 690376 595182 855681 704684 557364 684613
17070F84613J1720M6392J193q5639J77822j2566K0404q9823j453P387j349Q8746
$$ 684613 696333 742725 743918 658279 836101 823535 843939 754116 752663 760050 758701 847447
17058H47447m7378l48698M00317l80963M30667o0096q4709M23480k53596j87538
$$ 847447 800069 451371 851688 470725 901392 841296 756587 1180067 926471 738933
17048G38933P5666J37825l08393j35953M72843k18977K97016l35258L13671Q5614
$$ 738933 814599 952424 644031 508078 980921 761944 1058960 723702 1037373 1122987
17038A122987o1695j31093j25555K26998J4776j9539J82608l52524L1777K29094
$$ 1122987 1061292 930199 804644 1031642 1046418 1026879 1209487 856963 888740 1117834
17028A117834q7729k57726L28254J38503l22859n5636O9813J57040J5212l0047
$$ 1117834 1030105 772379 1100633 1239136 916277 860641 930454 1087494 1102706 1072659
17018A072659m5662K87836l54316J99531j91155K41068p0485K77979j55714k79388
$$ 1072659 1026997 1314833 960517 1160048 968893 1209961 1139476 1417455 1261741 982353
17008I82353J73844J058p0388O1576p7931K25909l91092K77745L5028K5111J4180
$$ 982353 1156197 1157255 1086867 1148443 1070512 1296421 905329 1183074 1218102 1243213 1257393
16997A257393j05934J80452m36486M38833J45219j83510j5556M27704k12547k0672
$$ 1257393 1151459 1331911 895425 1334258 1479477 1295967 1280411 1708115 1495568 1474896
16987A474896l9177J04529k32506O1290J2431K36104r1598k25568k3977J04285
$$ 1474896 1435719 1540248 1307742 1369032 1381463 1617567 1525969 1300401 1276424 1380709
16977A380709j04498R8745o0655K18881N7437l42264K33162M9701n2306K2911
$$ 1380709 1276211 1374956 1314301 1533182 1590619 1248355 1481517 1531218 1478912 1501823
16967A501823L43979n4815k63330J40435l12786J97189J2877K54345l5428o9863
$$ 1501823 1845802 1790987 1527657 1668092 1355306 1552495 1565372 1819717 1784289 1714426
16957A714426J23353J37778l05302J14280K17493K0839k35914j06272K11914J14265
$$ 1714426 1837779 1975557 1670255 1784535 2002028 2022867 1786953 1680681 1892595 2006860
16947B006860j00022j79163K06416J87292j63660k21734J89334J01399L13085
$$ 2006860 1906838 1727675 1934091 2121383 1957723 1735989 1925323 2026722 2339807
16938B339807l39661M63510l65411L42432n3496j22226M05369m16632j49571K98041
$$ 2339807 2000146 2463656 2098245 2440677 2387181 2264955 2670324 2253692 2104121 2402162
16928B402162k17709L73237o4273o11j37914L05753l7100n5053K26632p8410J37520
$$ 2402162 2184453 2557690 2493417 2492806 2354892 2660645 2623545 2568492 2795124 2716714 2854234
16917B854234j70166K06000l14671j07492L23754K00852L819Q4234J14037j67852
$$ 2854234 2684068 2890068 2575397 2467905 2791659 2992511 2996330 3080564 3194601 3026749
16907C026749k21267m5856M87531l67852J02663l8340J27763N31231n6296l78417
$$ 3026749 2805482 2759626 3247157 2879305 2981968 2943628 3071391 3602622 3546326 3167909
16897C167909K31886M10676m68960J6025M19055k31678J97955Q9559L3817J38666
$$ 3167909 3399795 3810471 3341511 3357536 3776591 3544913 3742868 3832427 3866244 4004910
16887D004910N6524J13394K04658m11626J49042r2582P07567l91073j73226P627
$$ 4004910 4061434 4174828 4379486 3967860 4116902 4024320 4731887 4340814 4167588 4175215
16877D175215J87029K98310m4980j68062L61984M089o5423O2131J95515p1418
$$ 4175215 4362244 4660554 4615574 4447512 4809496 4813585 4748162 4810293 5005808 4934390
16867D934390m4101Q6947O79100l29145p5740l6349L62850j88202L82167J38367
$$ 4934390 4890289 4977236 5656336 5327191 5251451 5215102 5577952 5389750 5771917 5910284
16857E910284o3686N9844j9718M25663r1671k84707L91250K71158J4428p9871
$$ 5910284 5846598 5906442 5886724 6312387 6220716 5936009 6327259 6598417 6612845 6532974
16847F532974K55735M47864R0745k02633L73030l86730O25057p7791K76237R0424
$$ 6532974 6788709 7236573 7327318 7124685 7497715 7110985 7736042 7658251 7934488 8024912
16837H024912K42557N4187K44069J8375L68499L09191p9322J34584J46844J83092
$$ 8024912 8267469 8321656 8565725 8584100 8952599 9261790 9182468 9317052 9463896 9646988
16827I646988L38528M8840O6486J50449M28081K02893n1241M84914L80431Q3626
$$ 9646988 9985516 10034356 10100842 10251291 10679372 10882265 10831024 11315938 11696369 11779995
16817A1779995k4737N90626l48628O63703N53102J2341J68257N45100n2577N11482
$$ 11779995 11755258 12345884 11997256 12660959 13214061 13226402 13394659 13939759 13887182 14398664
16807A4398664K46770M33253L34601L0029O02487O29573J39751J49934Q31360
$$ 14398664 14645434 15078687 15413288 15443317 16045804 16675377 16815128 16965062 17796422
16798A7796422L30675N07352M50805L52281K06286N64364M54295M37762O64537
$$ 17796422 18127097 18634449 19085254 19437535 19643821 20208185 20662480 21100242 21764779
16789B1764779P22006P42991L36403M41902J059346K91284O76338J023769O18069
$$ 21764779 22486785 23229776 23566179 24008081 25067427 25358711 26035049 27058818 27676887
16780B7676887O41819J055758P51976P91133Q96104P09536Q61083Q89377J286389
$$ 27676887 28318706 29374464 30126440 30917573 31813677 32523213 33384296 34273673 35560062
16771C5560062N44225J069721J004656J443878Q68272J371824J316160R54961
$$ 35560062 36104287 37174008 38178664 39622542 40490814 41862638 43178798 44133759
16763D4133759J690307J191087J116140J609749J572323J142627J363094J681232
$$ 44133759 45824066 47015153 48131293 49741042 51313365 52455992 53819086 55500318
16755E5500318J483957J374794J586889J576404J720718J549039J277941J837601
$$ 55500318 56984275 58359069 59945958 61522362 63243080 64792119 66070060 67907661
16747F7907661J533845J847231J364213J341632J747956J456736J453492J352787
$$ 67907661 69441506 71288737 72652950 73994582 75742538 77199274 78652766 80005553
16739H0005553Q20953J494780R56958J024071J011803Q25742L57242Q08742O04089
$$ 80005553 80826506 82321286 83278244 84302315 85314118 86139860 86497102 87305844 87909933
16730H7909933M26124M95548l33670k33006q8927m0630p12892o44402p44042o88411
$$ 87909933 88336057 88831605 88497935 88264929 88176002 88135372 87422480 86778078 86034036 85345625
16720H5345625l23378j435394j215037j255416j398642j214817j253044j525237
$$ 85345625 85022247 83586853 82371816 81116400 79717758 78502941 77249897 75724660
16712G5724660j121490j540463j458263j517111j774494j572610j393186j627903
$$ 75724660 74603170 73062707 71604444 70087333 68312839 66740229 65347043 63719140
16704F3719140j208664j766655j572668j191094j358659j711030j562150j277968
$$ 63719140 62510476 60743821 59171153 57980059 56621400 54910370 53348220 52070252
16696E2070252j611854r76499j330562r41281j484288j226203j310107j174888
$$ 52070252 50458398 49481899 48151337 47210056 45725768 44499565 43189458 42014570
16688D2014570q45263j168728j013670j121267q33346j228641o21897q93766j079705
$$ 42014570 41169307 40000579 38986909 37865642 37032296 35803655 35181758 34287992 33208287
16679C3208287o58857o62929p17686r01895n69414j159599l44789q16682o95630
$$ 33208287 32549430 31886501 31168815 30266920 29697506 28537907 28193118 27376436 26680806
16670B6680806q33318l75996l21692p05201o97600n59931p10704l38276k77969
$$ 26680806 25847488 25471492 25149800 24444599 23746999 23187068 22476364 22138088 21860119
16661B1860119m60188l62575j128535Q3078n98815k16933p31839J4212o05156
$$ 21860119 21399931 21037356 19908821 19991899 19393084 19176151 18444312 18458524 17853368
16652A7853368j1877n01888l95824k78211m97566k82727o150l14419n94901j04110
$$ 17853368 17841491 17339603 16943779 16665568 16168002 15885275 15879125 15564706 14969805 14865695
16642A4865695m07459J41861o05643n03369M7999p8350n18970l35426J90132l75679
$$ 14865695 14458236 14600097 13994454 13491085 13539084 13460734 12941764 12606338 12796470 12420791
16632A2420791m30337p4919j21352k28526j59526l47356r7352j84825k8326k35362
$$ 12420791 11990454 11915535 11794183 11565657 11406131 11058775 10961423 10776598 10748272 10512910
16622A0512910l55816l07642l8892k29002J71940l9525l41140k24276j75549J00213
$$ 10512910 10157094 9849452 9810560 9581558 9753498 9713973 9372833 9148557 8973008 9073221
16612I073221k85621r043l66441J75273l39629J8219m9946k56281k27116K23484
$$ 9073221 8787600 8778557 8412116 8587389 8247760 8265979 8216033 7959752 7732636 7956120
16602G956120J3977P7564o36555Q6185k14689k06215L275M5800Q3132l75260O9921
$$ 7956120 7970097 8047661 7411106 7497291 7282602 7076387 7079662 7125462 7208594 6833334 6903255
16591F903255l76292J61673k68327j26614J79542k84993k90202K19162m0596j28212
$$ 6903255 6526963 6688636 6420309 6293695 6473237 6188244 5898042 6117204 6076608 5948396
16581E948396k09974r0938J12099l27577j22939L76489p0222k07635M8781j96272
$$ 5948396 5738422 5647484 5759583 5432006 5309067 5685556 5615334 5407699 5456480 5260208
16571E260208J10093m10884L94584o59167N05901n6421j38210o1142k09028N7027
$$ 5260208 5370301 4959417 5354001 4694834 5200735 5144314 5006104 4944962 4735934 4792961
16561D792961r300k69698J77647J11701j79265O5962m07557P2102K18859m56604
$$ 4792961 4783661 4513963 4691610 4803311 4624046 4690008 4282451 4354553 4573412 4116808
16551D116808K04127K03589n53190M31653j40289k29857J80379J86706p11037
$$ 4116808 4320935 4524524 3971334 4402987 4262698 4032841 4213220 4399926 3688889
16542C688889M16473J18441m34259J47870l34060Q9955K73785m87278M39209p2388
$$ 3688889 4105362 4223803 3789544 3937414 3603354 3693309 3967094 3479816 3919025 3846637
16532C846637m14721K52228j99924J1136q5680M79371n64459Q5319q4330k91361
$$ 3846637 3431916 3684144 3484220 3495356 3409676 3889047 3324588 3409907 3325577 3034216
16522C034216J53737L59521l27261j6844Q5648J2380J22586n11222j26412q2081
$$ 3034216 3187953 3547474 3220213 3203369 3289017 3301397 3423983 2912761 2786349 2704268
16512B704268N91420l18920Q8262j7387k12297j02863J42319J69797l22915m7015
$$ 2704268 3295688 2976768 3065030 3047643 2835346 2732483 2874802 3044599 2721684 2674669
16502B674669K8112J79827N6683k53354L09088k23483k21792M21593k66883k67858
$$ 2674669 2702781 2882608 2939291 2685937 2995025 2771542 2549750 2971343 2704460 2436602
16492B436602M87090k76039j83118J84627k0805q1413Q3680J40077n3954l41739
$$ 2436602 2923692 2647653 2464535 2649162 2628357 2546944 2630624 2770701 2716747 2375008
16482B375008o726K3355N6584r0248k59983R9747J19948J70002n6962j30764L03370
$$ 2375008 2368282 2391637 2448221 2357973 2097990 2197737 2317685 2487687 2430725 2299961 2603331
16471B603331l54870j8767j13331j26187J78913J1792J42082o4121j5122J48145
$$ 2603331 2248461 2229694 2116363 1990176 2169089 2180881 2322963 2258842 2243720 2391865
16461B391865l29239p29L0352J84651j52842K7752l37927J37717j33845K48867
$$ 2391865 2062626 2061897 2092249 2276900 2124058 2151810 1813883 1951600 1817755 2066622
16451B066622j08206J2897j63569j0961L64065l06022j9707J69505j90622J31254
$$ 2066622 1958416 1971313 1807744 1796783 2160848 1854826 1835119 2004624 1814002 1945256
16441A945256j54525J16094J28580k36471J15039K8027j15495Q2093k5796j89383
$$ 1945256 1790731 1906825 2035405 1798934 1913973 1942000 1826505 1908598 1882802 1693419
16431A693419J35038o6724N2977J09737R1808k74282r2857K27682k21332j10866
$$ 1693419 1828457 1761733 1814710 1924447 2016255 1741973 1649116 1876798 1655466 1544600
16421A544600P4811J86443j2830j31430k41050K3590K24356j77555J03512k7608
$$ 1544600 1619411 1805854 1793024 1661594 1420544 1444134 1668490 1490935 1594447 1566839
16411A566839l0585O7401j76929K74639j33737R1549j99520K28428j49597j90493
$$ 1566839 1536254 1603655 1426726 1701365 1567628 1659177 1459657 1688085 1538488 1347995
16401A347995M31480k79507o9548N0961L99271m84927L08743l58587K99058m24464
$$ 1347995 1779475 1499968 1430420 1481381 1880652 1395725 1704468 1345881 1644939 1220475
16391A220475M42869l33408K04279j85014P4431L9725l5817l525K47958l18101
$$ 1220475 1663344 1329936 1534215 1349201 1423632 1463357 1427540 1424015 1671973 1353872
16381A353872Q9059J23181m34266j2483k3413L41116j84071J99893m02316J69316
$$ 1353872 1442931 1566112 1131846 1119363 1095950 1437066 1252995 1452888 1050572 1219888
16371A219888K62379k83856j82476O18400n53424K27034K78296n52343L3749o6851
$$ 1219888 1482267 1198411 1015935 1634335 1080911 1307945 1586241 1033898 1067647 1000796
16361A000796L2050j37362N00568K98858n04572j47740Q5823M5468j78797K06512
$$ 1000796 1032846 895484 1396052 1694910 1190338 1042598 1128421 1173889 995092 1201604
16351A201604k298J21830k1160j51072L31896m88968l8432J01778j55846J75389
$$ 1201604 1199306 1321136 1299976 1148904 1480800 991832 953400 1055178 899332 1074721
16341A074721j13519K12153L7977k57445L05263j56809J26539J19908j67000j10360
$$ 1074721 961202 1173355 1211332 953887 1259150 1102341 1228880 1348788 1181788 1071428
16331A071428r2015N24043n77666M77421l01151N9341k92176J82773k39025n6292
$$ 1071428 979413 1503456 925790 1403211 1102060 1161401 869225 1051998 812973 756681
16321G56681M27886l7915o0435m6531k148l99411O56965j66522k32168K15879
$$ 756681 1184567 1146652 1086217 1039686 1037538 638127 1295092 1128570 896402 1112281
16311A112281K50115l14055p5381k06710J29165r2622l7224Q1026j081L664J44729
$$ 1112281 1362396 1048341 972960 766250 895415 802793 765569 846595 845514 849178 993907
16300I93907j42378K24909k25941n0315L26724l15670K64458k77413M5406N3726
$$ 993907 851529 1076438 850497 800182 1126906 811236 1075694 798281 843687 897413
16290H97413j20487q461J87469j7702j35813K9672J09481K6829l64705K04138
$$ 897413 776926 768465 955934 938232 802419 832091 941572 968401 603696 807834
16280H07834j35879M36718J77670D76893O14713l27058r2629P7243K38847l9060
$$ 807834 671955 1108673 1286343 476893 1091606 764548 671919 749162 988009 948949
16270I48949k86392J78203J14868k77845J2785Q1644j82571L54661k51315K18315
$$ 948949 662557 840760 955628 677783 690568 772212 589641 944302 692987 911302
16260I11302k57916K28980l04942K47678l17385K14559J59585J83857j50340p5892
$$ 911302 653386 882366 577424 825102 507717 722276 881861 1065718 915378 839486
16250H39486j76571k14432K61736J41161N2394k87640J08110L7962k27845M67950
$$ 839486 662915 448483 710219 851380 903774 616134 724244 762206 534361 1002311
16240A002311m00963L14405j35271k1794k81699K01883L93325k73465k72555J08248
$$ 1002311 601348 915753 780482 758688 476989 678872 1072197 798732 526177 634425
16230F34425r3773K5720M32255k78384N3619j17004O2618q0824j76996J87430
$$ 634425 540652 566372 998627 720243 773862 656858 719476 638652 461656 649086
16220F49086j33013K38929l03686Q801O9473J186K34997k63722j3202m7173k565
$$ 649086 516073 755002 451316 460117 529590 530776 765773 502051 488849 441676 439111
16209D39111J55369J31720q6518R1666j35295L08863l64105j50705M74419l38285
$$ 439111 594480 726200 639682 731348 596053 904916 540811 390106 864525 526240
16199E26240j10279L09755J0599j37954p1166j12677J06568J24210k18094j06153
$$ 526240 415961 725716 736315 598361 527195 414518 521086 645296 427202 321049
16189C21049N12312B33605M72799j79154o7477j0740Q8458k496J81305l12465
$$ 321049 833361 233605 706404 527250 459773 449033 537491 534995 716300 403835
16179D03835J14936B09615M43893j3625l01718J92573K61127l15166m3691O2790
$$ 403835 518771 209615 653508 639883 338165 530738 791865 476699 433008 495798
16169D95798j46719J3943N1903K63765j56932j75350K00815j03861o3235K2977
$$ 495798 349079 363022 414925 678690 521758 346408 547223 443362 380127 403104
16159D03104j87113K28864J05287A42612O06908C06449L30440k1302n5018A99916
$$ 403104 215991 444855 550142 142612 749520 306449 636889 615587 560569 199916
16148C95208K5003K44021l11340K77485j99489A10346L25666j08520M5830K16489
$$ 395208 420211 664232 352892 630377 430888 110346 436012 327492 373322 589811
16138E89811B54334p8748R1537P8125P9082C4021c510C59036N189j53843R7525
$$ 589811 254334 175586 267123 345248 424330 34021 -3510 359036 364225 210382 307907
16127C07907l262J17937j58983J63668q0682J37322A13608M9806J59552j7086
$$ 307907 304645 422582 263599 427267 346585 483907 113608 163414 322966 305880
16117C05880H1619J71037r6628J46918p031F8188K11204q239G8199N36986k06579
$$ 305880 81619 252656 156028 302946 295915 68188 279392 271153 78199 615185 408606
16106D08606A44489K43459J17821H4507Q6700L94004j19821m9811j02068j44517
$$ 408606 144489 387948 505769 84507 171207 565211 445390 395579 293511 148994
16096A48994J5224K02946j28370M6336R1660j69064K48271A99120n2909K55392
$$ 148994 164218 367164 238794 285130 376790 207726 455997 199120 146211 401603
16086D01603J9229B08659j2287K77471j97050j37356J87596K9593A14476J25388
$$ 401603 420832 208659 196372 473843 276793 139437 327033 356626 114476 239864
16076B39864J74154N4642j81774H2319L89405j74565K58880j46195K07214j01574
$$ 239864 414018 468660 286886 82319 471724 297159 556039 409844 617058 515484
16066E15484a0940B43819Q1357j51840K02895F7938J01622J52773A20878C5132
$$ 515484 -10940 243819 325176 173336 376231 67938 169560 322333 120878 35132
16055D5779M03012j6688j33721J2161r9162J49890M7734j52531A16513J9975O3511
$$ 45779 448791 432103 298382 310543 211381 361271 409005 256474 116513 136488 199999
16044A99999N10534B68668C3171J95501k3703j8582N861J55974j08354N986j0860
$$ 199999 710533 268668 33171 228672 204969 186387 192248 348222 239868 245854 234994
16033B34994K53939B37159G9383k0244P9304J27265L5032j706q6520J9374F4731
$$ 234994 488933 237159 79383 59139 138443 265708 300740 299034 212514 231888 64731
16021F2649J55925G4217O2091k190a1282I4304M64J6026J5610a77073A53716O585
$$ 62649 218574 74217 136308 134118 -11282 94304 94768 110794 126404 -177073 153716 160301
16009A60301k6511J35397J4154j18881J20481p9271o185E7538K30188A8900a4952
$$ 160301 133790 269187 283341 164460 284941 205670 199485 57538 287726 18900 -14952
15997A57106L725J55738A6293K36420J29750a74724a7548G65946j48571M2505
$$ 157106 160831 316569 16293 252713 382463 -174724 -17548 765946 617375 659880
15987F59880K49300o1520l27057J36543l27244j03381a63083C8058H250d1568
$$ 659880 909180 847660 520603 657146 329902 226521 -163083 38058 8250 -41568
15976a69245A78206G1897A4913L74991A76041i0253G9406M5405a3599A58882b282
$$ -169245 178206 71897 14913 389904 176041 -90253 79406 124811 -13599 158882 -2282
15964a4572A51406b56916A38791g3210A98803a09047I6944N0356J68611A14882
$$ -14572 151406 -256916 138791 -73210 198803 -109047 96944 147300 315911 114882
15953D27670p2348I1584c2229C31020c59398D3172R7023j5388m1669c4426A44794
$$ 427670 355322 91584 -32229 331020 -359398 43172 140195 124807 83138 -34426 144794
15941b02769c2306C8986h8811B9785J90274a25110B8612K22681b08190C69162
$$ -202769 -32306 38986 -88811 29785 220059 -125110 28612 251293 -208190 369162
15930B20774m3978a7982C31174I8156b54936e684n414F2527k160J60801l4892
$$ 220774 176796 -17982 331174 98156 -254936 -5684 -11098 62527 60367 221168 186276
15919A86276b04765G6995f9239D49155E2913I39J34611b9853G9770a17563B3874
$$ 186276 -204765 76995 -69239 449155 52913 939 135550 -29853 79770 -117563 23874
15907A55977E5700M8609a45049A60793A0426i4643C21269a93685P4495a2284A01638
$$ 155977 55700 104309 -145049 160793 10426 -94643 321269 -193685 -119190 -12284 101638
15895A42744M0561E2660K7372Q9407J11655c9546A40327a79306C14385b85894
$$ 142744 183305 52660 80032 169439 281094 -39546 140327 -179306 314385 -285894
15884E6995h0877c255o4063B96560E9537J63458K9401q4478M7230O2066A15987
$$ 56995 -80877 -3255 -67318 296560 59537 222995 252396 167918 215148 277214 115987
15872H1558k428a9280A2696K17071G1217c99787A05665b5797A7291L94205d5510
$$ 81558 79130 -19280 12696 229767 71217 -399787 105665 -25797 17291 411496 -45510
15860I1814L5673E9089d3553q2161B83059a27881M9190B29227F6831a10889B41898
$$ 91814 127487 59089 -43553 -125714 283059 -127881 -78691 229227 66831 -110889 241898
15848h5155o97C66381I3506N1216a18619j61975F4691a57609B4874a41452f1008
$$ -85155 -85852 366381 93506 144722 -118619 -280594 64691 -157609 24874 -141452 -61008
15836A63254D708b80926C16748E5696b62212O2822E8473l113b25888a02315A74479
$$ 163254 4708 -280926 316748 55696 -262212 -199390 58473 55360 -225888 -102315 174479
15824A72218a7073K676k832A26484n9956R5374b09188R6494A1942J25722h4891
$$ 172218 -17073 -14397 -17229 126484 66528 161902 -209188 -112694 11942 137664 -84891
15812D626a01746r114D9407J9881f4939B15395a4789D2101b34088a10157B43061
$$ 4626 -101746 -110860 49407 69288 -64939 215395 -14789 42101 -234088 -110157 243061
15800A86484h4381A07351d5635A2267K23330g2466c1840B7L11130b2208B08848
$$ 186484 -84381 107351 -45635 12267 235597 -72466 -31840 27 311157 -22208 208848
15788B78958A04340d5918E5252a00732d0885A02631b1765E958P5198C9677N6524
$$ 278958 104340 -45918 55252 -100732 -40885 102631 -21765 5958 81156 39677 96201
15777I6201a2553A59971M0626a34597a1872G8149l7078a72418C9253a4882A85919
$$ 96201 -12553 159971 200597 -134597 -11872 78149 41071 -172418 39253 -14882 185919
15765b1758j10224k075L1671G5078B3001N321J99079J4403m3025k0520B0148M2288
$$ -21758 -131982 -134057 -102386 75078 23001 28322 227401 241804 198779 178259 20148 62436
15753F2436K37988i798E604J44548e6997A84949a30597j66475B76004A35883J88385
$$ 62436 300424 -9798 5604 150152 -56997 184949 -130597 -297072 276004 135883 324268
15742C24268m655a02347j07455i5838B05347b22883A56491b007q7551c8445k95892
$$ 324268 319613 -102347 -209802 -95838 205347 -222883 156491 -2007 -89558 -38445 -334337
15731c34337H6194K0000A4989i3413r1873Q2001r4838A11609F569b01557A88821
$$ -334337 86194 106194 14989 -93413 -185286 -103285 -198123 111609 6569 -201557 188821
15719D2865J34278f948A30488j3345l6608P2611A7519K58036c7386j51486e6165
$$ 42865 177143 -6948 130488 117143 80535 153146 17519 275555 -37386 -188872 -56165
15707a37640l9086I5398h6957A5012J94118a25914c050B01279E5622B5229a00471
$$ -137640 -176726 95398 -86957 15012 209130 -125914 -3050 201279 55622 25229 -100471
15695e288F1744k9614a00497B44674m8538o0367J09805b32462A69186l504K6915
$$ -5288 61744 32130 -100497 244674 196136 135769 245574 -232462 169186 165682 192597
15684A92597b69120J15019J4270J9879A64570b17575j18155J50887g7221I5947
$$ 192597 -269120 -154101 -139831 -119952 164570 -217575 -335730 -184843 -77221 95947
15673B02992d3423B95342d3545B08744H6636J6728d7312F3944J05449C452R1221
$$ 202992 -43423 295342 -43545 208744 86636 103364 -47312 63944 169393 3452 94673
15662I4673f237l1306j87350J11089b8069m80650B5955c86414b86E0132i0207
$$ 94673 -6237 -37543 -224893 -113804 -28069 -508719 25955 -386414 -286 50132 -90207
15650a7379m5160I039a8514A2834a81064M5091G7254a277F6528h4911A30235P815
$$ -17379 -62539 9039 -18514 12834 -181064 -135973 77254 -1277 66528 -84911 130235 138050
15638A38050b78641G9830B7769d2158p8456A03140a56488A8427o24f6637k0303
$$ 138050 -278641 79830 27769 -42158 -120614 103140 -156488 18427 17803 -66637 -86940
15627h6940A53509F503J11245E7905i5653j73297g7916n9081n3351R2216D7308
$$ -86940 153509 6503 117748 57905 -95653 -268950 -77916 -136997 -190348 -98132 47308
15615c6662j33622C22059b383A46113h4583j0452F7027d22986B52711q0997G2247
$$ -36662 -170284 322059 -2383 146113 -84583 -95035 67027 -422986 252711 171714 72247
15603g5264A95800e5474l7547r2669q8817I3650g3021A05814C3453c5252j13611
$$ -75264 195800 -55474 -93021 -185690 -274507 93650 -73021 105814 33453 -35252 -148863
15592a48863B64905A1930D646K28755j11911n1147J97924f5291j28944b6830E5415
$$ -148863 264905 11930 4646 233401 121490 70343 268267 -65291 -194235 -26830 55415
15580A75875b34022i5378A32052b92537D3137a1048B08291b17869A64400i7665
$$ 175875 -234022 -95378 132052 -292537 43137 -11048 208291 -217869 164400 -97665
15569B71740g3799d209C4042K67980a7634n6288E3683M8139J83820b43871O8714
$$ 271740 -73799 -4209 34042 302022 -17634 -73922 53683 101822 285642 -243871 -175157
15558a75157A23370J0135B6278K36877E3481C604a63673m0656A42847B6223a32520
$$ -175157 123370 133505 26278 263155 53481 3604 -163673 -204329 142847 26223 -132520
15546A14968a3273D38852f3970D10873A0049K36917J8130c5385l8967j20879B04926
$$ 114968 -13273 438852 -63970 410873 10049 246966 265096 -35385 -74352 -195231 204926
15534D03908a44852A84983a36409k85954A10644b35822o9851H3601K86923a01459
$$ 403908 -144852 184983 -136409 -422363 110644 -235822 -305673 83601 370524 -101459
15523a41228c2590k07999A73341i3449j31816i2781C0546f1609A58740b0839I6501
$$ -141228 -32590 -240589 173341 -93449 -225265 -92781 30546 -61609 158740 -20839 96501
15511a12807L43d7581H8385c30420C0556a52457M4047A6375p975N8985c2579B35706
$$ -112807 -112464 -47581 88385 -330420 30556 -152457 -108410 16375 8400 67385 -32579 235706
15498b09883a5381A57737i6575E2451b17057J8692M8153I2784d0185A67327a54261
$$ -209883 -15381 157737 -96575 52451 -217057 -198365 -150212 92784 -40185 167327 -154261
15486a07482j05278c4457A74288a86516r7286A37717j2711P8981J34089h7342
$$ -107482 -212760 -34457 174288 -186516 -283802 137717 125006 203987 338076 -87342
15475D83409B02833K4025b48110D1736J39349a62076C0605a50348r4946N6422
$$ 483409 202833 226858 -248110 41736 181085 -162076 30605 -150348 -245294 -188872
15465a88872N4130A96930l9109A2502c3080B41216b81639h7552A24318c1663A89528
$$ -188872 -134742 196930 157821 12502 -33080 241216 -281639 -87552 124318 -31663 189528
15453b96833a13993A24255R0588e0497A87541c7803B49395k5256J87650O6118
$$ -296833 -113993 124255 214843 -50497 187541 -37803 249395 224139 411789 477907
15443D77907r1443K54640B55102H9781M13716a35421a0271B19080k263G3416L604
$$ 477907 386464 641104 255102 89781 503497 -135421 -10271 219080 216817 73416 77020
15432G7020b7767j88155B42689a03502J757B71884a27682N4878j520D7756K9848
$$ 77020 -27767 -215922 242689 -103502 -101745 271884 -127682 -72804 -74324 47756 77604
15421G7604C3099b45645G3103d60418A44777a21035H5190o50a03664d6521r9253
$$ 77604 33099 -245645 73103 -460418 144777 -121035 85190 84540 -103664 -46521 -145774
15410a45774A65304i7127n0226P3198m3392D4027R8423M5131j1648a29950E1673
$$ -145774 165304 -97127 -147353 -74155 -117547 44027 142450 187581 175933 -129950 51673
15398A07911J01047C8571J5725a19710A74375k9678b07428B17994a61669f0850
$$ 107911 208958 38571 54296 -119710 174375 144697 -207428 217994 -161669 -60850
15387C83591b04376F2016L26853j87334j3241c0613k32517H2650B0809P2566m1383
$$ 383591 -204376 62016 388869 201535 188294 -30613 -263130 82650 20809 93375 51992
15376E1992O6803J54477c2875C23713j41923d999A04489J01141c08440d0585B32106
$$ 51992 118795 273272 -32875 323713 181790 -4999 104489 205630 -308440 -40585 232106
15364B16879p9333e2196a0821B00066m1134l5784M0391N9050k9025O4655a2025
$$ 216879 137546 -52196 -10821 200066 158932 123148 163539 222589 193564 258219 -12025
15352D01265G2718J72024I9614f3919a1584A02460L7988h2191B04241K3621E5334
$$ 401265 72718 244742 99614 -63919 -11584 102460 140448 -82191 204241 227862 55334
15340A65556o2149b53979a17821B11K03209a3723B48287j22933J05340H4949J33857
$$ 165556 103407 -253979 -117821 211 203420 -13723 248287 125354 230694 84949 218806
15329B18806p5578p1367M2376c25679D2817g1884B17372I1346J19091r188d24
$$ 218806 143228 71861 114237 -325679 42817 -71884 217372 91346 210437 201249 -424
15317A17688J76546j43663a90115A36303l2627J07630J42508I3869J82363a08656
$$ 117688 294234 150571 -190115 136303 103676 211306 353814 93869 276232 -108656
15306A59775D3399c37724f6664A61914M7691J36393j65839J09322B2148K68717
$$ 159775 43399 -337724 -66664 161914 209605 345998 180159 289481 22148 290865
15296B90865a92867A96910b58518E5849M5371M8323g1437j8396E4039J67212J12029
$$ 290865 -192867 196910 -258518 55849 101220 149543 -71437 -89833 54039 221251 333280
15285C33280j49971k1689L2644b65663G966a42430O2672K2478p3306C37772j43411
$$ 333280 183309 161620 194264 -265663 7966 -142430 -79758 -57280 -130586 337772 194361
15274A94361K37162e3444F8138d0363B1688a9137j60106A16457b04486N6380B4222
$$ 194361 431523 -53444 68138 -40363 21688 -19137 -179243 116457 -204486 -148106 24222
15262b19764c3763B38807A4924J0772a13282H7508L82920A93866e6397I5483D2372
$$ -219764 -33763 238807 14924 25696 -113282 87508 470428 193866 -56397 95483 42372
15250A01589K74493O01686Q15009l77729m9724Q52500G51954A25104l3702C8434
$$ 101589 376082 977768 1792777 1415048 1365324 2217824 751954 125104 91402 38434
15239b22406A63816i4805B03381C1806a35494q0551F4560J47400a29091k46476
$$ -222406 163816 -94805 203381 31806 -135494 -216045 64560 211960 -129091 -375567
15229c75567C04098a83408A30928P2924e5962R256A64510Q3857I9968N8957a61862
$$ -375567 304098 -183408 130928 203852 -55962 -46706 164510 248367 99968 158925 -161862
15217A63696d6403j61272F9102R4933j0116j3264O500M2865b1146j20043A28500
$$ 163696 -46403 -207675 69102 164035 153919 140655 147155 190020 -21146 -141189 128500
15205g8378j968b9107D110N7649K2863a26160k7165g5881N539G1868J52211m7381
$$ -78378 -80346 -29107 4110 61759 84622 -126160 -153325 -75881 -70342 71868 224079 176698
15193A76698K72672j84862E2675e0432A26434d94439e7280I3855d0195n0221j39192
$$ 176698 449370 264508 52675 -50432 126434 -494439 -57280 93855 -40195 -90416 -229608
15182b29608A61806d7772m2935L3962E7082c4455j78912g8527A91179D4069j0842
$$ -229608 161806 -47772 -90707 -56745 57082 -34455 -213367 -78527 191179 44069 33227
15171C3227L01556A51255C1711c3592C70806c8141H3118b33848A09095L06267
$$ 33227 334783 151255 31711 -33592 370806 -38141 83118 -233848 109095 415362
15161D15362F5506L32520b04266B13583q5725a71102A27582f2618d811j25481
$$ 415362 65506 398026 -204266 213583 127858 -171102 127582 -62618 -4811 -130292
15151a30292E9648L2128B2225O1768Q3736H0264a26051A57895A5760h6352N699
$$ -130292 59648 91776 22225 83993 167729 80264 -126051 157895 15760 -86352 -80653
15140h0653C10480j16648a6802O530C16138q7875o0925m5533a28209C39463A56516
$$ -80653 310480 193832 -16802 -10272 316138 228263 167338 121805 -128209 339463 156516
15128B29737C8924J41623C9319J05335a91366B39470p6264a12827m3444N2112
$$ 229737 38924 180547 39319 144654 -191366 239470 163206 -112827 -156271 -104159
15118a04159C768M21702F2162j8795J62978K0469a24518A49515N8523p5851b1361
$$ -104159 3768 425470 62162 43367 206345 226814 -124518 149515 208038 132187 -21361
15106D91139A50622g0928A15709m938L3607a32158E3822J14778B4629L08658j45917
$$ 491139 150622 -70928 115709 110771 144378 -132158 53822 168600 24629 333287 187370
15095A87370a55441A10233P408J15203j7787b29p5252D33577A19704a40715A08105
$$ 187370 -155441 110233 117641 232844 215057 -229 -75481 433577 119704 -140715 108105
15083D18338A64458c02054e0078C51453I2137J4764m9663j8754e1696B13919o3565
$$ 418338 164458 -302054 -50078 351453 92137 106901 57238 38484 -51696 213919 150354
15072A50354B9179h2153A50377F3589N6785o928i0737C37410A42222k3367j701
$$ 150354 29179 -82153 150377 63589 120374 113446 -90737 337410 142222 118855 117154
15061A17154b171H1717J04435m5937K32146K45208A81294D3660K05114J43016
$$ 117154 -2171 81717 186152 140215 372361 617569 181294 43660 248774 391790
15051C91790J31835j84214p6565j4964d3689D64672b6755B70182J50207F9347
$$ 391790 523625 339411 262846 247882 -43689 464672 -26755 270182 420389 69347
15040B49098K7417M3716A054M58916a06210A2845J41976J24530F623R1283K55971
$$ 249098 276515 320231 1054 459970 -106210 12845 154821 279351 6623 97906 353877
15029C53877j73053K10299J39146B54662k4854K66168J51212B53738O4679D2264
$$ 353877 180824 391123 530269 254662 229808 495976 647188 253738 318417 42264
15018D24952K05902A16217L28910P9893k26157p5639K08633F1903B1955M25323
$$ 424952 630854 116217 445127 525020 298863 223224 431857 61903 21955 447278
15008D47278A07492J90776C6394L39303J10820r8679n9098O7488A88180R8837
$$ 447278 107492 298268 36394 375697 486517 387838 328740 396228 188180 287017
14998B87017H4704J65394J55792o0941a2579B47175G680O85405B75223I3609J02866
$$ 287017 84704 250098 405890 344949 -12579 247175 7680 693085 275223 93609 196475
14987A96475J15104K27033j81635j28634J16980K53474A28955K05435K6941K43786
$$ 196475 311579 538612 356977 228343 345323 598797 128955 334390 361331 605117
14977F05117B77917M81772B88211a6732F46701k09367j8764A85766L67468j89880
$$ 605117 277917 759689 288211 -16732 646701 437334 418570 185766 553234 363354
14967C63354J21313j00622K6844k8963j39695L49798l7760k39991J70691q3041
$$ 363354 484667 384045 410889 381926 242231 592029 554269 314278 484969 401928
14957D01928j60438L50201A21891J64146N3141O4122D4919K73804r2284M32104
$$ 401928 241490 591691 121891 286037 339178 403300 44919 318723 226439 658543
14947F58543B17334d226B24119J95049J98482A17344J47075A26865K112j4328
$$ 658543 217334 -4226 224119 419168 617650 117344 264419 126865 128977 114649
14937A14649K73284m9164F4467N13161k85506K80932J33085j89621J54691r1839
$$ 114649 387933 338769 64467 577628 292122 573054 706139 516518 671209 579370
14927E79370J00504O5935N95750o08370J76844J6413L54806m55216r0380L40480
$$ 579370 679874 745809 1341559 733189 910033 926446 1281252 826036 735656 1076136
14917A076136k14197L70063r0890k83379L9886j60383j54427j32891B19762J66349
$$ 1076136 861939 1232002 1141112 857733 897619 737236 582809 449918 219762 386111
14907C86111j13068K08936N3065H9075c296D36253j37583L81548B53924m0226
$$ 386111 273043 481979 535044 89075 -3296 436253 298670 680218 253924 213698
14897B13698K0145J93431d8044C19128n8597K15806C1490J93856K80422A21813
$$ 213698 233843 427274 -48044 319128 260531 476337 31490 225346 505768 121813
14886F62754k85931m123J48735j06616R43J13947K7607J84568k0414q6313j39193
$$ 662754 376823 372700 521435 414819 415762 529709 557316 741884 721470 635157 495964
14875D95964B21509O0661K43749j19513A18862L96097j75539J34531K774J10983
$$ 495964 221509 282170 525919 406406 118862 514959 339420 473951 476725 587708
14865E87708K26237B99776J9326J91378j984j80816K67258B94478P1960J37546
$$ 587708 813945 299776 319102 510480 508496 327680 594938 294478 366438 503984
14855E03984B03803M37993k69102j4348A64981L38522k15103j27300n029O22506
$$ 503984 203803 641796 372694 358346 164981 503503 288400 161100 156071 778577
14845G78577k49619k5466K5265J51585Q0125j76738L2783O6282L49290m51322
$$ 778577 528958 503492 528757 680342 760467 583729 616512 682794 1032084 580762
14835E80762p8647j44287Q4293A83023L8869R0254l4470L67595n5033l2474k28160
$$ 580762 502115 357828 442121 183023 221892 312146 277676 645271 590238 557764 329604
14824C29604K63631B00736Q4811O3696L4088J60434k12398J90499j40972J51876
$$ 329604 593235 200736 285547 349243 383331 543765 331367 521866 380894 532770
14814E32770J12741B27682J98749Q3687K2500P6270B87056K48950J5765k7701
$$ 532770 645511 227682 426431 510118 532618 608888 287056 536006 551771 524070
14804E24070j53367L12906P1679R1899j31333k33356K29754C46549J85673j20255
$$ 524070 370703 683609 755288 847187 715854 482498 712252 346549 532222 411967
14794D11967L03396C52603J73182j58682P4952B01358J53538L28693k48088Q2402
$$ 411967 715363 352603 525785 367103 442055 201358 354896 683589 435501 517903
14784E17903K31185c802F62514k24590j07348K8951K16782j41001L91383B59429
$$ 517903 749088 -3802 662514 437924 330576 359527 576309 435308 826691 259429
14773D77376J33005k11203j7780M38707k29893P6994J5727k88174j1666j00074
$$ 477376 610381 399178 381398 820105 590212 667206 682933 394759 383093 283019
14763B83019R3348P3516q4906K47174k80871K99806J35301k72152J4301J51626
$$ 283019 376367 449883 364977 612151 331280 631086 766387 494235 508536 660162
14753F60162j73505A61484N21998k3208o0085R2830r7651J32434B96839K74668
$$ 660162 486657 161484 683482 660274 600189 693019 595368 727802 296839 571507
14743E71507k3684K69317J75046B29549P32769k86570r4937K65210k01808k3286
$$ 571507 547823 817140 992186 229549 962318 675748 580811 846021 644213 620927
14733F20927Q9688J73995k901Q83k41667L96242D53347M05532o9366j17094J60326
$$ 620927 710615 884610 881709 882592 640925 1037167 453347 858879 789513 672419 832745
14722H32745N00206k94611K21753k8075k75098k7431j81068J08107K40600l22231
$$ 832745 1332951 1038340 1260093 1232018 956920 929489 748421 856528 1097128 774897
14712G74897J4963K13552m20480n3845M3758J06061L41228P5405k03251j65640
$$ 774897 789860 1003412 582932 529087 572845 678906 1020134 1095539 892288 726648
14702G26648q343K99949j39400J87632p6804J81402J22932M1107l05055P9291
$$ 726648 718305 1018254 878854 1066486 989682 1171084 1294016 1335123 1030068 1109359
14692A109359k22378K29220m62312M22200q8432j96700K57487J0413k4014k00512
$$ 1109359 886981 1116201 653889 1076089 987657 790957 1048444 1058857 1034843 834331
14682H34331m7893l25363J95765N18015k88065j50212K4419j70687M06434j5243
$$ 834331 786438 461075 656840 1174855 886790 736578 760997 590310 996744 981501
14672I81501j41953Q727n3796j2500L36550l34503K23641L0395E04092M31783
$$ 981501 839548 848275 794479 781979 1118529 784026 1007667 1038062 504092 935875
14662I35875M7705k04666K18678J38449J28130j75170n9830j1855J788q2843K92609
$$ 935875 983580 778914 997592 1136041 1264171 1089001 1029171 1017316 1019104 936261 1228870
14651A228870j72856J45902j81237j04826L55936m47451O4964K28728j69903m7240
$$ 1228870 1056014 1201916 1020679 915853 1271789 824338 889302 1118030 948127 900887
14641I00887L08666n7042J28492k55708m6825P13679o15446p5785J01775K9116
$$ 900887 1209553 1152511 1281003 1025295 978470 1692149 1076703 1000918 1102693 1131809
14631A131809J55461j35422j4954J1422m0241J87078j58074P1133M1330j49589
$$ 1131809 1287270 1151848 1136894 1148316 1108075 1295153 1137079 1208212 1249542 1099953
14621A099953K55691j08129J35857j01625k24668M3509M52447k50886R9312l87480
$$ 1099953 1355644 1247515 1383372 1281747 1057079 1100588 1553035 1302149 1401461 1013981
14611A013981J46720j5378K5810L8416Q9079J2903L0863l20119M31505k37900
$$ 1013981 1160701 1145323 1171133 1209549 1298628 1311531 1342394 1022275 1453780 1215880
14601A215880K20875M9265j00970R8550k59552K60742j25102K59578o56n85901
$$ 1215880 1436755 1486020 1385050 1483600 1224048 1484790 1359688 1619266 1618610 1032709
14591A032709O36796j97178J85433j71167m6475K18232K85706j67823J07590l63043
$$ 1032709 1669505 1472327 1657760 1486593 1440118 1658350 1944056 1776233 1883823 1520780
14581A520780K7550K61395L5833j53816M7387R4634j45190N8424K48313r6854
$$ 1520780 1548330 1809725 1845558 1691742 1739129 1833763 1688573 1746997 1995310 1898456
14571A898456l75267K01891O37339k26502j48928j57813M2746K53421J34779m509
$$ 1898456 1523189 1725080 2362419 2135917 1986989 1829176 1871922 2125343 2260122 2255613
14561B255613j80920N14599j64791N2068R6299J82396J74196K18727L76250L49095
$$ 2255613 2074693 2589292 2424501 2476569 2572868 2755264 2929460 3148187 3524437 3873532
14551C873532O57479J025739J885715M023828Q695448J7407851q23095j7213558
$$ 3873532 4531011 5556750 7442465 11466293 20161741 37569592 36746497 19532939
14543A9532939I347273D562128j797702m66595l11174p8663k65461r8238P8996
$$ 19532939 9347273 4562128 2764426 2297831 1986657 1907994 1642533 1544295 1623291
14534A623291J28526j04506J31108K01908J8534K39325k90855l21797L35396L6615
$$ 1623291 1751817 1647311 1778419 1980327 1998861 2238186 1947331 1625534 1960930 1997545
14524A997545L01128l25127J99623j7902j68259K56365r4544N08715l90222p4870
$$ 1997545 2298673 1973546 2173169 2155267 1987008 2243373 2148829 2657544 2267322 2192452
14514B192452K44527q8088J86853k50458K83732K34465o87349M87291k79000L88688
$$ 2192452 2436979 2348891 2535744 2285286 2569018 2803483 2116134 2603425 2324425 2713113
14504B713113K53959l04216J83445o9047M0859K51481j30330J72964k6561j63103
$$ 2713113 2967072 2662856 2846301 2777254 2818113 3069594 2939264 3112228 3085667 2922564
14494B922564p2613M56951k00962j59233j00131M29454J74395k35527L6749J40910
$$ 2922564 2849951 3306902 3105940 2946707 2846576 3276030 3450425 3214898 3251647 3392557
14484C392557l07940M60558q8892K03220k72319J66340p7498M29574j60836k41761
$$ 3392557 3084617 3545175 3456283 3659503 3387184 3553524 3476026 3905600 3744764 3503003
14474C503003K42640j56759Q4592q6677N12290o0826k39342N5338m050K77141
$$ 3503003 3745643 3588884 3673476 3586799 4099089 4038263 3798921 3854259 3850209 4127350
14464D127350k15391L63659l7345j68708M83199l52748K26257k84004M35870j91298
$$ 4127350 3911959 4275618 4238273 4069565 4552764 4200016 4426273 4142269 4578139 4386841
14454D386841J20686J42375j95949L05518N1831Q7622N6391m8315M41782q4080
$$ 4386841 4507527 4649902 4453953 4759471 4811302 4898924 4955315 4907000 5348782 5264702
14444E264702j26028K69107j87270J42972q280M42739l11131K99578K2j3910K61380
$$ 5264702 5138674 5407781 5220511 5363483 5355203 5797942 5486811 5786389 5786411 5772501 6033881
14433F033881m5002j13570M64722j91193M29415n90692O48459j67391J2414M90684
$$ 6033881 5988879 5875309 6340031 6148838 6578253 5987561 6636020 6468629 6481043 6971727
14423F971727N481K39407l02579R2067K76448J66788n6179L81561K30802k91687
$$ 6971727 6977208 7216615 6914036 7006103 7282551 7449339 7393160 7774721 8005523 7713836
14413G713836q0119L8979K70470m6581N61766j79042N85528p0249L82358l62952
$$ 7713836 7633717 7672696 7943166 7896585 8458351 8279309 8864837 8794588 9176946 8813994
14403H813994M07188K365L31881r3040K34756N5094j3734M90716J15387J9383
$$ 8813994 9221182 9223547 9555428 9462388 9697144 9752238 9738504 10229220 10344607 10363990
14393A0363990K56326R8018J69416K46426L85117p8954J95475L75653M8109K80531
$$ 10363990 10620316 10718334 10887750 11134176 11519293 11440339 11635814 12011467 12059576 12340107
14383A2340107K99195L9811M95555j00127N54505K57259K24876N07705k64506
$$ 12340107 12639302 12679113 13174668 13074541 13629046 13886305 14111181 14618886 14354380
14374A4354380M27583L01419K57958N17978l0760M99682N09041J61333K37520
$$ 14354380 14781963 15083382 15341340 15859318 15828558 16328240 16837281 16998614 17236134
14365A7236134O26978M29482J28420M46751M83302M66632N84983P2232M06639
$$ 17236134 17863112 18292594 18421014 18867765 19351067 19817699 20402682 20474914 20881553
14356B0881553O73900M04980O04715N00667L91263O36294O71070N77024R25951
$$ 20881553 21555453 21960433 22565148 23065815 23457078 24093372 24764442 25341466 26267417
14347B6267417L42216J110956L19636P01242R24735O97857Q44199P64825O95216
$$ 26267417 26609633 27720589 28040225 28741467 29666202 30364059 31208258 31973083 32668299
14338C2668299J535842M63900J207274J089518J205226Q36353J442422Q76179
$$ 32668299 34204141 34668041 35875315 36964833 38170059 39006412 40448834 41325013
14330D1325013J229200J761184J383643J191062J701975J836632J475868J714370
$$ 41325013 42554213 44315397 45699040 46890102 48592077 50428709 51904577 53618947
14322E3618947K217053J765952K250772J772556K362535K476273K509340K296912
$$ 53618947 55836000 57601952 59852724 61625280 63987815 66464088 68973428 71270340
14314G1270340K734295L373650K777113L518212L176146L823029M154531M221793
$$ 71270340 74004635 77378285 80155398 83673610 86849756 90672785 94827316 99049109
14306I9049109L882009M609431M974953N188776N362808N974854O021135O673965
$$ 99049109 102931118 107540549 112515502 117704278 123067086 129041940 135063075 141737040
14298A41737040P019192P299753P626390Q122352R173764Q934094R904153R831203
$$ 141737040 148756232 156055985 163682375 171804727 180978491 189912585 199816738 209647941
14290B09647941J0937960J1311254J1660073J2164667J3036370J2690690J3621398
$$ 209647941 220585901 231897155 243557228 255721895 268758265 281448955 295070353
14283B95070353J3803212J3813062J3577740J4019224J3371412J2804921J2340011
$$ 295070353 308873565 322686627 336264367 350283591 363655003 376459924 388799935
14276C88799935J1362937R729020Q193332O067282K660182O52327k43650j658254
$$ 388799935 400162872 409891892 418085224 424152506 426812688 427465015 427221365 425563111
14268D25563111m119667l968805n880269q199975j0001996j1458647j2349339
$$ 425563111 421443444 417474639 411594370 403394395 393392399 381933752 369584413
14261C69584413j3911430j4520957j4358831j4503899j4413953j4571294j3614015
$$ 369584413 355672983 341152026 326793195 312289296 297875343 283304049 269690034
14254B69690034j2477210j2184349j2051062j2027987j0544967j0892506r976011
$$ 269690034 257212824 245028475 232977413 220949426 210404459 199511953 189535942
14247A89535942r269010q797240q108071p623921p512277o964199o441341o273569
$$ 189535942 180266932 171469692 163361621 155737700 148225423 141261224 134819883 128546314
14239A28546314n716397n310425m853467n117685m758917m265733m004484l922721
$$ 128546314 122829917 117519492 112666025 107548340 102789423 98523690 94519206 90596485
14231I0596485l237311l536123l362427l184137k890844k874130k537755k738790
$$ 90596485 87359174 83823051 80460624 77276487 74385643 71511513 68973758 66234968
14223F6234968k694008j933802k103967j912292j917893k095043j563270j563905
$$ 66234968 63540960 61607158 59503191 57590899 55673006 53577963 52014693 50450788
14215E0450788j894765r81939j379804j720090j523276j182259j335612j107334
$$ 50450788 48556023 47574084 46194280 44474190 42950914 41768655 40433043 39325709
14207C9325709m46314j177375j564412q75707j541877m52371r88438l95505q70705
$$ 39325709 38879395 37702020 36137608 35261901 33720024 33267653 32279215 31883710 31013005
14198C1013005j384653m42661q25569p51456o34488m61048j050401j49528r22569
$$ 31013005 29628352 29185691 28360122 27608666 26974178 26513130 25462729 25313201 24390632
14189B4390632l80643p52247j33954q08953l35518l68130m35324n16804r58733
$$ 24390632 24009989 23257742 23123788 22314835 21979317 21611187 21175863 20659059 19700326
14180A9700326k3856o08411j65244q09838q6912l77769n07878l0567j80954l79736
$$ 19700326 19676470 19068059 18902815 18092977 18006065 17628296 17120418 17089851 16908897 16529161
14170A6529161n01884J3761m83455k69611m80392l87893l33419q616o9828l36200
$$ 16529161 16027277 16041038 15557583 15287972 14807580 14419687 14086268 14077652 14007824 13671624
14160A3671624l61803m34259p6465p2330k55531m28507n28990L60347j62347l38445
$$ 13671624 13309821 12875562 12799097 12726767 12471236 12042729 11513739 11874086 11711739 11373294
14150A1373294k66567j54315j63381k55301L5282n2309l69711l42464K05830l91885
$$ 11373294 11106727 10952412 10789031 10533730 10569012 10516703 10146992 9804528 10010358 9618473
14140I618473o0072M24o11270r5894K91012m33566J23181o8667k79606P7340l1380
$$ 9618473 9558401 9558825 8947555 8851661 9142673 8709107 8832288 8763621 8484015 8561355 8529975
14129H529975k02337k11804j11445m88933K97331m17727p1049L22963l05308J80010
$$ 8529975 8327638 8115834 8004389 7515456 7812787 7395060 7324011 7646974 7341666 7521676
14119G521676j41000q4758n23305J14967k11653k7667l51926L14625q5246m39098
$$ 7521676 7380676 7295918 6772613 6887580 6675927 6648260 6296334 6610959 6525713 6086615
14109F086615J91503k09314l97113J21646M8041J35213j78569k82840L27066n13362
$$ 6086615 6278118 6068804 5671691 5793337 5841378 5976591 5798022 5515182 5842248 5328886
14099E328886L14719J08393m18461o0593q4678n6469k08113L17867k34038l1556
$$ 5328886 5643605 5751998 5333537 5272944 5188266 5131797 4923684 5241551 5007513 4975957
14089D975957j84851K80471k41459J52250o63455K9050M25193M1115n45261K95279
$$ 4975957 4791106 5071577 4830118 4982368 4318913 4347963 4773156 4814271 4269010 4564289
14079D564289j78101M4502j82179N86443m71127k49872K13598n6601l02239n6101
$$ 4564289 4386188 4430690 4248511 4834954 4363827 4113955 4327553 4270952 3968713 3912612
14069C912612Q4717q3471k8504M9970l38542M1454L8822K3253J24600N9619j17653
$$ 3912612 3997329 3913858 3885354 3935324 3596782 3638236 3677058 3700311 3824911 3884530 3766877
14058C766877j18403J81925j46430k70848K7338k27145K71094k70186L94430k80395
$$ 3766877 3648474 3830399 3683969 3413121 3440459 3213314 3484408 3214222 3608652 3328257
14048C328257J44521m65954k24248L82817r0671j07705L40489j94304j8353K65275
$$ 3328257 3472778 3006824 2782576 3165393 3074722 2967017 3307506 3113202 3094849 3360124
14038C360124k90984O8083j38565O8406N6422n7785k3602L8088l72948n1013r2840
$$ 3360124 3069140 3137223 2998658 3067064 3123486 3065701 3042099 3080187 2707239 2656226 2563386
14027B563386P8469l3119J19387o2688j04017K43085j94284n2917j71019L0597
$$ 2563386 2641855 2608736 2728123 2665435 2561418 2804503 2610219 2557302 2386283 2416880
14017B416880K32261m39774l4786P5377Q4606M6649n0212m32113N1504M18599
$$ 2416880 2649141 2209367 2174581 2249958 2334564 2381213 2331001 1898888 1950392 2368991
14007B368991k8772J75920k38778j63399K7501k5732O4082j43724k06130J60219
$$ 2368991 2340219 2516139 2277361 2113962 2141463 2115731 2179813 2036089 1829959 1990178
13997A990178k7603k27969K29954k1866K48531J01165K8740K79353J112469K145598
$$ 1990178 1962575 1734606 1964560 1942694 2191225 2292390 2321130 2600483 3712952 5858550
13987E858550O261501J5138041J3845970j6790571j1172817n133254k250808j364908
$$ 5858550 12120051 27258092 41104062 24313491 13140674 8007420 5756612 4391704
13979D391704o08384j44989m95901j66663k74123L4704l97026K86748k21015k35041
$$ 4391704 3783320 3638331 3142430 2975767 2701644 2736348 2339322 2626070 2405055 2170014
13969B170014L17846r196j93199j07132M27619o62789K84968l71945M76144j14697
$$ 2170014 2487860 2478664 2285465 2178333 2605952 1943163 2228131 1856186 2332330 2217633
13959B217633M9307k15139J73359n24323J37078L09718j39312L2589l10624K08009
$$ 2217633 2266940 2051801 2225160 1700837 1837915 2147633 2008321 2040910 1730286 1938295
13949A938295l51701R2901J2793j01381N62255k02772k52738j10996q9720J46433
$$ 1938295 1586594 1679495 1692288 1590907 2153162 1950390 1697652 1586656 1496936 1643369
13939A643369Q4401k22048O6679J84669q7733J41688k01982J0746K4283J10431
$$ 1643369 1727770 1505722 1572401 1757070 1669337 1811025 1609043 1619789 1644072 1754503
13929A754503j20420J09224l71522J16816r8653K39748l95409K37629L18482k56103
$$ 1754503 1634083 1743307 1371785 1488601 1389948 1629696 1234287 1471916 1790398 1534295
13919A534295J33775l43064J88759m42467N07012l03774P8568j9621P7764k05640
$$ 1534295 1668070 1325006 1513765 1071298 1578310 1274536 1353104 1333483 1411247 1205607
13909A205607J02840N3476l8641l7744K9104j60665O18229m84734j1654O2834
$$ 1205607 1308447 1361923 1323282 1285538 1314642 1153977 1772206 1287472 1275818 1338652
13899A338652m97269L05616K6348J91272j7101l9520j76657K3536J21195j05617
$$ 1338652 841383 1146999 1173347 1364619 1347518 1307998 1131341 1154877 1276072 1170455
13889A170455m02530N89902l52213j71285N34341j06350o8482m901l842l04531
$$ 1170455 767925 1357827 1005614 834329 1368670 1262320 1193838 1188937 1185095 880564
13879H80564N58752l92855K01347j52946J69117k51353k27551K57587J46386J6959
$$ 880564 1439316 1046461 1247808 1094862 1263979 1012626 785075 1042662 1189048 1206007
13869A206007j59662j00817K04422r117n4807k86453M03314j04186j70467J91799
$$ 1206007 1046345 945528 1149950 1140833 1086026 799573 1202887 1098701 928234 1120033
13859A120033k86168L47521j77412L2860k99922K99469N1193j50404p6194R3484
$$ 1120033 833865 1181386 1003974 1036834 736912 1036381 1087574 937170 860976 954460
13849I54460M9369J02282k32339k80427K75066J97694k62909J38910R760j34595
$$ 954460 1003829 1106111 873772 593345 868411 1066105 803196 942106 951866 817271
13839H17271P1621r1227K42563l00840J89701j3933k42810K62789k13642L9275
$$ 817271 888892 797665 1040228 739388 929089 915156 672346 935135 721493 760768
13829G60768N27048j44845k93062L9727k1152P599J1158O8331m11525O12378l51324
$$ 760768 1287816 1142971 849909 889636 868484 876083 887241 955572 544047 1156425 805101
13818H05101k8461j53894L48953q4665j2568q8899k307k01784J40027O1152l67900
$$ 805101 776640 622746 971699 887034 874466 785567 783260 581476 721503 782655 414755
13807D14755L14240J53112j62865J59672l90227M98148m75722J23022o4024L81844
$$ 414755 728995 882107 719242 878914 488687 986835 511113 634135 570111 951955
13797I51955l74536L12862B62483N09492J92789j65520k57247L70355j75320j14292
$$ 951955 577419 890281 262483 771975 964764 799244 541997 912352 737032 622740
13787F22740J19808k2594m1211O7638J42377j08229L7055k45212J98613M49j23692
$$ 622740 742548 719954 678743 746381 888758 780529 817584 572372 770985 771434 647742
13776F47742o4134J81637l24614L50070n2198j46639L67512k99274p2367k7927
$$ 647742 583608 765245 440631 790701 738503 591864 959376 660102 587735 559808
13766E59808R0904j47995M32479l43424J99656l77478P8304o9790L10213k80004
$$ 559808 650712 502717 935196 591772 791428 413950 492254 422464 732677 452673
13756D52673K777J26139N6798j2259k30674L77704J68647j99085j77859k36577
$$ 452673 455450 581589 638387 626128 395454 773158 941805 742720 564861 328284
13746C28284K68181J86713l12254K31217C28971J10833p0322K53816K6562j30057
$$ 328284 596465 783178 470924 702141 328971 439804 369482 623298 649860 519803
13736E19803k25654M59299j7317j24385k83811L27929o1394q1132N9650J54711
$$ 519803 294149 753448 736131 611746 327935 655864 594470 513338 572988 727699
13726G27699j47749k68952K12042M5829q4921K3156j7244n2701j06460L09157
$$ 727699 579950 310998 523040 568869 483948 507104 489860 437159 330699 639856
13716F39856r7138J09191j86141J59119k29578P5826k11086Q9821A68521K09051
$$ 639856 542718 651909 465768 624887 395309 471135 260049 349870 168521 377572
13706C77572L08680B71824L03311P6827l10467K7812R3921M0909n2958L5684M0635
$$ 377572 686252 271824 575135 651962 341495 369307 463228 504137 451179 486863 527498
13695E27498j26979J25021P753J6509B18870J9692K35443L22966l43426p668p1257
$$ 527498 400519 525540 533293 549802 218870 238562 474005 796971 453545 445877 374620
13684C74620K81453R6916C44045j57777K80270A79314L26873J35237k17355L97729
$$ 374620 656073 752989 344045 186268 466538 179314 506187 641424 424069 821798
13674H21798m9065k14789m2123J92124j56789O9143l2704j63177L0585p1909O2914
$$ 821798 772733 557944 515821 707945 551156 620299 587595 424418 455003 383094 446008
13663D46008M8041j46416Q7234A99377O2867j3867J92645o731L0380l3782B04562
$$ 446008 494049 347633 434867 199377 262244 248377 441022 434291 464671 430889 204562
13651E72822j80906K21140k15369J56505j37912p8043L33317A86882K81583j37292
$$ 572822 391916 613056 397687 554192 416280 338237 671554 186882 468465 331173
13641C31173K0313j03731J3115L7506j23222C4522J04851K32740j61417L47574
$$ 331173 351486 247755 260870 298376 175154 34522 139373 372113 210696 558270
13631E58270A20453K12963N7747A10047O00715B73698N86J19230Q9483B10756
$$ 558270 120453 333416 391163 110047 710762 273698 274284 393514 482997 210756
13620D93458Q1845B81971J20806q431j02023o6972J54684B8297J54817K30571
$$ 493458 575303 281971 402777 394346 292323 225351 380035 28297 183114 413685
13610D13685A51837K89828i5399D39630m2400R4257l1716R6159k20688A35000
$$ 413685 151837 441665 -95399 439630 397230 491487 459771 555930 335242 135000
13599B33341l6797K80794j56271N7471A83285K48819N3296N4096j14117J52611
$$ 233341 196544 477338 321067 378538 183285 432104 485400 539496 425379 577990
13589E77990p8124j50966J08296l0740K43852j18095B2214J78320M51793k75662
$$ 577990 499866 348900 457196 426456 670308 552213 22214 200534 652327 376665
13579C76665j19201A03118K61302r4507K21475j91222q8469J92216j93699J31213
$$ 376665 257464 103118 364420 269913 491388 300166 211697 403913 210214 341427
13569C41427L0848K30552j83205j56837J87192D378e9770A17560a52807A85449
$$ 341427 372275 602827 419622 262785 449977 4378 -59770 117560 -152807 185449
13558D41888k03613j04407K99219A62195B3596K70318j14651n4214l6861N80465
$$ 441888 238275 133868 433087 162195 23596 293914 179263 125049 88188 668653
13548F68653A73189D5903L98069B05453n3022b3700A71528J70357P3360l1042
$$ 668653 173189 45903 443972 205453 152431 -23700 171528 341885 415245 384203
13538C84203b17027B74814l8646J48580r5576K69922B21278M8273F5468J75730
$$ 384203 -217027 274814 236168 384748 289172 559094 221278 269551 65468 241198
13528B41198j06629L41295B26810P1805l4070R1041J17583B14593k8929P0200
$$ 241198 134569 475864 226810 298615 264545 355586 473169 214593 185664 255864
13518B55864O9353j22387K00262m9708p4565a5141A59670J8704O9895I8367N20556
$$ 255864 325217 202830 403092 353384 278819 -15141 159670 178374 248269 98367 618923
13507F18923B63827K687a71718B39567P6318o3860r1781M27965B16294q4773J19602
$$ 618923 263827 266514 -171718 239567 315885 252025 160244 588209 216294 131521 251123
13496B51123n0100E4093b0863D9300K76800A9849h4482E08813A32704J45733A14826
$$ 251123 201023 54093 -20863 49300 326100 19849 -84482 508813 132704 278437 114826
13484A59462J56131j16824L34671j08334j54114j12478K08360G0398K87122D8594
$$ 159462 315593 198769 533440 425106 270992 158514 366874 70398 357520 48594
13473B77560h9490I9546J98171L4969A24619N2797N72727k58122A16160J09383
$$ 277560 -89490 99546 297717 332686 124619 177416 750143 492021 116160 225543
13463B25543a7086B49283P4601A22232M9560A6492L41045d6218D32621j57746
$$ 225543 -17086 249283 323884 122232 171792 16492 357537 -46218 432621 274875
13453B74875O3972A16537K18496A07930N8657K6209F8175Q4153F9519h9516A10099
$$ 274875 338847 116537 335033 107930 166587 192796 68175 152328 69519 -89516 110099
13441A37426M96927k39958l9429A21937J06295Q6743P4838a38800A79265C1920
$$ 137426 634353 394395 354966 121937 228232 314975 389813 -138800 179265 31920
13430A89036F5973J66804h6571G5779J90782p4072J51169C7359b4291B17808r9610
$$ 189036 65973 232777 -86571 75779 266561 192489 343658 37359 -24291 217808 118198
13419A18198K37744N047j01029g9869C19014j58924C0750J32381N2380r0252a03003
$$ 118198 355942 360989 259960 -79869 319014 160090 30750 163131 215511 125259 -103003
13407D6268J51241j6609J48541j24186a8487H3455K31130a91341A67451J04127
$$ 46268 197509 180900 329441 205255 -18487 83455 314585 -191341 167451 271578
13397B71578j34735J02879A19724K80290A78626J35154p6971j13615E2121L57644
$$ 271578 136843 239722 119724 400014 178626 313780 236809 123194 52121 409765
13387D09765F6851L07393F0217a7523H0325f7437B32433A03651l666J73995A9813
$$ 409765 66851 374244 60217 -17523 80325 -67437 232433 103651 99985 273980 19813
13375b7776B87775d8919J5149B5305L88259J4598q5696m4088n5457A03246J77131
$$ -27776 287775 -48919 -33770 25305 413564 428162 342466 298378 242921 103246 280377
13364B80377j16777L4908I3941J0739J50400r441o0193k0397d49706A00552g9939
$$ 280377 163600 198508 93941 104680 255080 245639 185446 165049 -449706 100552 -79939
13352B22363L9043M1978r1061Q4414J12062m4847A21882L89288j34713I7830J4616
$$ 222363 261406 303384 212323 296737 408799 363952 121882 511170 376457 97830 112446
13341A12446l983K81531g1171c1276C16049O9492L5220B07720B8727M50383j64863
$$ 112446 108463 389994 -71171 -31276 316049 385541 420761 207720 28727 479110 314247
13330C14247b4964A33400N8949a59535A53167B7241R7854n0531K87978A25681
$$ 314247 -24964 133400 192349 -159535 153167 27241 125095 74564 362542 125681
13319A91650M1507L6980p4182i6131B5221J63627f872D85139j12972A35153J49371
$$ 191650 233157 270137 195955 -96131 25221 188848 -6872 485139 372167 135153 284524
13308B84524n2867e5162H3910P9375K2568h0374B23150C5004M0656L63521B03344
$$ 284524 231657 -55162 83910 163285 185853 -80374 223150 35004 75660 439181 203344
13296B53729P2524A37035D9121J7656J11988a08202B29892O0750A01550M4182
$$ 253729 326253 137035 49121 66777 178765 -108202 229892 290642 101550 145732
13286A45732l2071Q6983G8702j7728O678J0600B0404L39550G9406J63993a35131
$$ 145732 113661 200644 78702 60974 67652 78252 20404 359954 79406 243399 -135131
13274H5966L21231A05871b6954B4696R1873n5773K28956D566e7965B86644M6055
$$ 85966 407197 105871 -26954 24696 116569 60796 289752 4566 -57965 286644 332699
13263C32699a31813B11975q8116a2948j33934E156J87620h4293H1786b3126B08216
$$ 332699 -131813 211975 123859 -12948 -146882 5156 192776 -84293 81786 -23126 208216
13251B88587j43927b12038A46292O1436l6242g3241A33586l7068J48658l5152
$$ 288587 144660 -212038 146292 207728 171486 -73241 133586 96518 245176 210024
13241B10024a4501A89092M158d37801C64884q888E3310K13902o4189n8037n9763
$$ 210024 -14501 189092 193250 -437801 364884 355996 53310 267212 203023 144986 85223
13230H5223e7492E6028b8663j40326H6690J38963p9505k7973D2240K36416a04860
$$ 85223 -57492 56028 -28663 -168989 86690 225653 146148 118175 42240 278656 -104860
13218I0205k7388J86192G7944K28281p226j31267K7737b8995C46952H0422J50126
$$ 90205 62817 249009 77944 306225 298999 167732 195469 -28995 346952 80422 230548
13207B30548q5757K1161G2391K74356A41731R1711n9540a7994B12816r7616C7798
$$ 230548 144791 165952 72391 346747 141731 233442 173902 -17994 212816 115200 37798
13195B62700A26083a9669O660C6516J91657C6889A5534K56541j30095K05806F8563
$$ 262700 126083 -19669 -13009 36516 228173 36889 15534 272075 141980 347786 68563
13183d8593I1485R1374J07244a2129I146J09149d3321G5972J2538m3652L6149
$$ -48593 91485 182859 290103 -12129 9146 118295 -43321 75972 88510 44858 81007
13172H1007Q200c5331A40548K7941o5189K3305C4362a7656C68887j83668C0199
$$ 81007 89207 -35331 140548 168489 103300 126605 34362 -17656 368887 185219 30199
13160f8989j25296I1510h5865A03040a01727d4987o6592J0462B7922L70103j54983
$$ -68989 -194285 91510 -85865 103040 -101727 -44987 -111579 -101117 27922 398025 243042
13149B43042E6589L612J80421b45525C4515K80497c5594B30710a24507k6841I6166
$$ 243042 56589 60201 240622 -245525 34515 315012 -35594 230710 -124507 -151348 96166
13137A30318a93640e0369A38773j9855h1561l6973a2409j37726A81189b60913
$$ 130318 -193640 -50369 138773 118918 -81561 -118534 -12409 -150135 181189 -260913
13126C63423c8086F9061b2197k03300A26028h1166r3372B69290A29303d6340C53774
$$ 363423 -38086 69061 -22197 -225497 126028 -81166 -174538 269290 129303 -46340 353774
13114A38631b2748B29953d133B82082E8700J61060K24921f6314j5205j07232p7101
$$ 138631 -22748 229953 -4133 282082 58700 219760 444681 -66314 -81519 -188751 -265852
13103b65852e0351A39182a4051r133A54645D1436c64031B67460j2767L1903l224
$$ -265852 -50351 139182 -14051 -23184 154645 41436 -364031 267460 254693 286596 283372
13092B83372D6159J67306b0038o9901q9086b1490j41742H1511b74919e4955G7654
$$ 283372 46159 213465 -20038 -89939 -179025 -21490 -163232 81511 -274919 -54955 77654
13080c31508h727C46256j23641l1007J38269G1437c33337g5039k2539B01326a56717
$$ -331508 -8727 346256 222615 191608 329877 71437 -333337 -75039 -97578 201326 -156717
13068A79032P2029C0890a4325H4948R3298G2121L1218n710E75a6379D3470c4325
$$ 179032 251061 30890 -14325 84948 178246 72121 103339 97629 575 -16379 43470 -34325
13055D35331A26633b5061I7811e9424G018K6147P0489n0355a2681C58718A63758
$$ 435331 126633 -25061 97811 -59424 7018 33165 103654 53299 -12681 358718 163758
13043B5866M6195N7026O2858a80207D61634k01404E391K4149e6451B22958B0528
$$ 25866 72061 129087 191945 -180207 461634 260230 5391 29540 -56451 222958 20528
13031a29598B7155J05241K4386a9750G3335K2256B3258K66377p6763B4197L4274
$$ -129598 27155 132396 156782 -19750 73335 95591 23258 289635 212872 24197 58471
13020E8471a93090A68655g616j13282B1537Q7130b397B57962m4957i2921C07591
$$ 58471 -193090 168655 -7616 -120898 21537 108667 -2397 257962 213005 -92921 307591
13008A86213B9894a90388B99848n2947c4852C01790e7497C32870C9996f0666A73015
$$ 186213 29894 -190388 299848 246901 -34852 301790 -57497 332870 39996 -60666 173015
12996b2326p3115A39829g1223m7059A08544a52190F1615L63280E8294e55568A21515
$$ -22326 -95441 139829 -71223 -118282 108544 -152190 61615 424895 58294 -555568 121515
12984C09354d2993A42308m9061b3398I1571e8300A63938g8201A29861B5739a08310
$$ 309354 -42993 142308 93247 -23398 91571 -58300 163938 -78201 129861 25739 -108310
12972E1252a17712l20322A92598l0328K52816r0973F5078N3199r18c4721D7555
$$ 51252 -117712 -438034 192598 162270 415086 324113 65078 118277 117359 -34721 47555
12960G0103L75922E9593J69329C495L0488c21674A80599D6745h4072A6917c1949
$$ 70103 446025 59593 228922 3495 33983 -321674 180599 46745 -84072 16917 -31949
12948B40383a20116B79291a82461D7673O2183a26783q364A60322d7504A23619
$$ 240383 -120116 279291 -182461 47673 109856 -126783 -135147 160322 -47504 123619
12937G8925e0289k1833A90602e0580F3815a57207B43049A15618a28466A06075
$$ 78925 -50289 -72122 190602 -50580 63815 -157207 243049 115618 -128466 106075
12926a09341B0025c0030J4346q6108b4885j73331B80378J05661a44067c8826j40796
$$ -109341 20025 -30030 -15684 -101792 -24885 -198216 280378 386039 -144067 -38826 -179622
12915a79622h0662A65568a17873B35828A08783K2243J83141G0578a71097C38814
$$ -179622 -80662 165568 -117873 235828 108783 131026 314167 70578 -171097 338814
12904c17051b0486F1671Q383J2711f0403A17239L4566a814q0536A3285a2805r2020
$$ -317051 -20486 61671 70054 82765 -60403 117239 151805 -1814 -82350 13285 -12805 -104825
12892a04825G9755c04471B26614q0974b20442R5375A58865b64134c5259o912I2642
$$ -104825 79755 -304471 226614 145640 -220442 -125067 158865 -264134 -35259 -42171 92642
12880B42976E5822J9704J46741R754A11245D783b51971A03092B9290K3058K2196
$$ 242976 55822 75526 222267 232021 111245 4783 -251971 103092 29290 52348 74544
12869G4544b006l18907A31307K5102D2677a40614C2657Q7586n8526G627J17538
$$ 74544 -2006 -320913 131307 156409 42677 -140614 32657 120243 61717 7627 125165
12858A25165a45396d5483F2853R2199J4612Q0681E7327j7531b61710F11026A89316
$$ 125165 -145396 -45483 62853 155052 169664 250345 57327 39796 -261710 611026 189316
12846b20712A16603a74055k973f5655I707J43045a77942c8183m411q3270A18297
$$ -220712 116603 -174055 -177028 -65655 9707 152752 -177942 -38183 -42594 -125864 118297
12834A35480K903R5997A02486B1038L1815a05825d3912m9014a7329r5711A11510
$$ 135480 138383 234380 102486 21038 52853 -105825 -43912 -92926 -17329 -113040 111510
12822B17260D9050K6318b7327F3286a20065r8089K7266I141J28870G1a08649B01080
$$ 217260 49050 75368 -27327 63286 -120065 -218154 -190888 9141 138011 71 -108649 201080
12809B27277A3713a2272E9307a55422B31129l5919J6696J81214h4066I8186J46250
$$ 227277 13713 -12272 59307 -155422 231129 195210 211906 393120 -84066 98186 244436
12798B44436R781a6175r45B49859C6043a31908m2413A72814q2935L7648a73278
$$ 244436 254217 -16175 -17120 249859 36043 -131908 -174321 172814 89879 127527 -173278
12786A01124b98646B53248d37428F7917R1002o1418c5103A92082Q0917d0385j15531
$$ 101124 -298646 253248 -437428 67917 158919 97501 -35103 192082 272999 -40385 -155916
12775a55916A29913a05005J6008A08528P9176a10874d4193D9873a35207q5423
$$ -155916 129913 -105005 -88997 108528 187704 -110874 -44193 49873 -135207 -220630
12765b20630m833j04880d8482A32730L36483k32942A2218e2984k70269A68307
$$ -220630 -225463 -330343 -48482 132730 469213 236271 12218 -52984 -323253 168307
12754A08709a78484A6423P8190E369c336j8807g237n5029A26459G913g2618E15869
$$ 108709 -178484 16423 94613 5369 -3336 -22143 -7237 -62266 126459 7913 -72618 515869
12741A99000a88146O3272q6192L2543q4583B36420a33884H8719c1456E1754o773
$$ 199000 -188146 -124874 -211066 -178523 -263106 236420 -133884 88719 -31456 51754 44981
12730D4981b5446k9279k2063A37527a7319k96395D2851a9849D0899J93512a59503
$$ 44981 -25446 -54725 -76788 137527 -17319 -313714 42851 -19849 40899 234411 -159503
12718a2266j47914O4076n844G9292l5239J64297E7518c1760q0003a4420C65424
$$ -12266 -160180 -96104 -101948 79292 44053 208350 57518 -31760 -111763 -14420 365424
12706A38140o2077K75497b33515B1806J51076h0888I209J2499K4799L7653a47980
$$ 138140 76063 351560 -233515 21806 172882 -80888 9209 21708 46507 84160 -147980
12694g3235B05337b17758D8337J20287L18667A91950a90699A4959J79348n7882
$$ -73235 205337 -217758 48337 168624 487291 191950 -190699 14959 194307 136425
12684A36425F3712l849J90401n7055i2608O458K182A11108c47893J43832D14295
$$ 136425 63712 59863 250264 193209 -92608 -86150 -83968 111108 -347893 -204061 414295
12672A02229M7771F0877a47183j38583A76270h6594I3332a84553G3874b01146
$$ 102229 150000 60877 -147183 -285766 176270 -86594 93332 -184553 73874 -201146
12661A50884N1329d745l4190B0377J72846b65844i8162j76061A30832L40216A46427
$$ 150884 202213 -4745 -38935 20377 193223 -265844 -98162 -274223 130832 471048 146427
12649E9908a59825j62685A72104i947q033A32721P4005a93592B03812b82466C8698
$$ 59908 -159825 -322510 172104 -9947 -17980 132721 206726 -193592 203812 -282466 38698
12637e4912n7820M535b1999p5119A99088j5553P0190c092H3147J49098G1703K39947
$$ -54912 -112732 -108197 -21999 -97118 199088 183535 253725 -3092 83147 232245 71703 311650
12625C11650D58K87937A07605d6638D1286L2454L55923A14554h331A84838I2213
$$ 311650 458 288395 107605 -46638 41286 73740 429663 114554 -8331 184838 92213
12613b62609N5097F608b24128B54297b63972a06937j47881h5340A73540b56676
$$ -262609 -207512 6608 -224128 254297 -263972 -106937 -254818 -85340 173540 -256676
12602E3726e8541A02080i9876B9778P9032a59209a58j02276B80189r1923K6746
$$ 53726 -58541 102080 -99876 29778 108810 -159209 -158 -102434 280189 188266 215012
12591B15012m9213K40909D4678a37203B34646h191B18140c6752B11504n0634n2188
$$ 215012 165799 406708 44678 -137203 234646 -8191 218140 -36752 211504 160870 108682
12580A08682b18094A9993K20825e0349j38604C1393M71712a71011Q1997j14283
$$ 108682 -218094 19993 240818 -50349 -188953 31393 503105 -171011 -89014 -203297
12570b03297B67434I471Q0687g2934F9241b36876h5746m9944F3027a46650J2924
$$ -203297 267434 9471 90158 -72934 69241 -236876 -85746 -135690 63027 -146650 -133726
12559a33726c773o4194E6479E159J5555i5924B11504a95293Q8969B1690Q3989
$$ -133726 -3773 -67967 56479 5159 20714 -95924 211504 -195293 -106324 21690 105679
12548A05679b54865C8467b69012F3695K06307N0855j18731b00277b3613j50767
$$ 105679 -254865 38467 -269012 63695 270002 320857 202126 -200277 -23613 -174380
12538a74380C0675c4750D245b94348P270a05347a3651H6163c1221j6111C7146
$$ -174380 30675 -34750 4245 -294348 -287078 -105347 -13651 86163 -31221 -47332 37146
12526a23152C9138J74077c49162d007m5257H446K7931a5171A62729d4170H7997
$$ -123152 39138 213215 -349162 -4007 -49264 8446 36377 -15171 162729 -44170 87997
12514c7338I5880E782K32376a06087A94068q0393L9907O8701A04321P9571J10040
$$ -37338 95880 5782 238158 -106087 194068 113675 153582 222283 104321 183892 293932
12503B93932g6649j6876o7736j75816b452o7020A70236c9910A79637j4845L9573
$$ 293932 -76649 -93525 -161261 -337077 -2452 -69472 170236 -39910 179637 164792 204365
12492B04365b81282A3942a3802B56075N9332c901A38832e9960k66032C51652A34458
$$ 204365 -281282 13942 -13802 256075 315407 -3901 138832 -59960 -325992 351652 134458
12480a5123k90222A40621E2957A9833e0655l5789c4527A20771e6973b7713k41934
$$ -15123 -305345 140621 52957 19833 -50655 -86444 -34527 120771 -56973 -27713 -269647
12469b69647B3126R9272b15987a9757C5458K97455I8538h3355D11260A67810a30964
$$ -269647 23126 122398 -215987 -19757 35458 332913 98538 -83355 411260 167810 -130964
12457c60746J50931j3492L2936c9513I0438A8675c17950A75179b72503q4818e1984
$$ -360746 -209815 -223307 -190371 -39513 90438 18675 -317950 175179 -272503 -357321 -51984
12445C21182f6079K4781K862p8465Q175A17117L5073l8389L5229a45052C38389
$$ 321182 -66079 -41298 -38436 -116901 -108726 117117 152190 113801 149030 -145052 338389
12433C26857C1338J84623r0390J39323q2854F82b37771A41757B9147a78094A22955
$$ 326857 31338 215961 125571 264894 182040 682 -237771 141757 29147 -178094 122955
12421B03790d01106b6114j47072Q3659b847E3704b22510R298K6886R2859l2422
$$ 203790 -401106 -26114 -173186 -89527 -2847 53704 -222510 -213212 -186326 -93467 -125889
12410a25889n5267j14352A45117a52086O646D7167N5169c17765d0753B56449n2701
$$ -125889 -181156 -295508 145117 -152086 -145440 47167 102336 -317765 -40753 256449 203748
12399B03748M1004J1732a0344C7384b15673h0340F3213f2819j29477N7275j33584
$$ 203748 244752 256484 -10344 37384 -215673 -80340 63213 -62819 -192296 -135021 -268605
12388b68605A55553E5501N131a60667A70770K2846c63115G1131d9151G6774a16989
$$ -268605 155553 55501 60632 -160667 170770 193616 -363115 71131 -49151 76774 -116989
12376B84985G5326j9620c12297A6696f2176A60870c62237A54774G4188q78B9074
$$ 284985 75326 55706 -312297 16696 -62176 160870 -362237 154774 74188 73310 29074
12364a11024f812B32421f5557o2379j71246J29125b0777A31872e9070J0367q2426
$$ -111024 -6812 232421 -65557 -127936 -299182 -170057 -20777 131872 -59070 -48703 -131129
12353a31129c1441B19608e6687G2092a80389o0466P6881A14911l7913d1299H7073
$$ -131129 -31441 219608 -56687 72092 -180389 -240855 -163974 114911 76998 -41299 87073
12341A2117a45287B54599c92156B03166k5531D1164c0354j46373C26069A56405
$$ 12117 -145287 254599 -392156 203166 177635 41164 -30354 -176727 326069 156405
12330A54850E5597N8043a63434M2939F2455J7143N9227h0223A92640q2636c1307
$$ 154850 55597 113640 -163434 -120495 62455 79598 138825 -80223 192640 110004 -31307
12318e5266G2252J68238a69150A14247g8103b566A2307J7218a5384B10016f9880
$$ -55266 72252 240490 -169150 114247 -78103 -2566 12307 29525 -15384 210016 -69880
12306A49405M3775i7206A26830N8595N7955H9906L8713m9083a9798A83976g3986
$$ 149405 193180 -97206 126830 185425 243380 89906 128619 79536 -19798 183976 -73986
12294b91345a18901p6135A19255R6160c8718E5421c2809A57877f1563m3133C11869
$$ -291345 -118901 -195036 119255 215415 -38718 55421 -32809 157877 -61563 -104696 311869
12282A27701b67216R0831K4933N0261M4200k1440A41027Q0705E6324J71161F693
$$ 127701 -267216 -176385 -151452 -101191 -56991 -78431 141027 221732 56324 227485 6693
12270A1109J27761k634L4223a26844B17563d0874A38954m3206l4821J20876K14600
$$ 11109 138870 136236 170459 -126844 217563 -40874 138954 95748 60927 181803 396403
12259C96403A4669L13125e6819J5616E273a76338A14443B3995R2416c5589H1476
$$ 396403 14669 327794 -56819 -41203 5273 -176338 114443 23995 116411 -35589 81476
12247A32514b2974p363A1861J19192j4822r620A6018J50656D5171J44781h0440
$$ 132514 -22974 -30337 11861 131053 116231 106611 16018 166674 45171 189952 -80440
12235A42478h5813C20071j23246b05003J01523d4964D0765b66492g1359q9089
$$ 142478 -85813 320071 196825 -205003 -103480 -44964 40765 -266492 -71359 -160448
12225a60448b9388C14811J57456A07286a00466H2988J38606G4439R4796J70009
$$ -160448 -29388 314811 472267 107286 -100466 82988 221594 74439 169235 339244
12215C39244K12567G3985J9693R7102a234q2659k90745B70288o9454J2763c63839
$$ 339244 551811 73985 93678 190780 -1234 -83893 -374638 270288 200834 213597 -363839
12203A86860J1885k6548K0665J15109k1030o661O3340I1563J32586R6186j49364
$$ 186860 198745 172197 192862 307971 286941 280280 343620 91563 224149 320335 170971
12192A70971K21762I0249J15370g4216r9435C42517C4973R4401b26422A98708
$$ 170971 392733 90249 205619 -74216 -173651 342517 34973 129374 -226422 198708
12181A31095M7942F2231e8206k07156J29495A89433K24016j47830b4649C0802
$$ 131095 179037 62231 -58206 -265362 -135867 189433 413449 265619 -24649 30802
12170B47313J85215k02597M9325i7207H8322K41907J46187A63984D6752J97278
$$ 247313 432528 229931 279256 -97207 88322 330229 476416 163984 46752 244030
12160B44030j06710a50081D4460a62184m422B35344J11615a27097j8781l6929
$$ 244030 137320 -150081 44460 -162184 -166606 235344 346959 -127097 -145878 -182807
12150a82807f902j67661A49020G2732a13194o016B18702l437a9033B24759d2139
$$ -182807 -6902 -174563 149020 72732 -113194 -119210 218702 215265 -19033 224759 -42139
12138A63321Q1553F5003P2788a07701C55938j66466c48055a00420B09443q2058
$$ 163321 244874 65003 137791 -107701 355938 189472 -348055 -100420 209443 127385
12128A27385a0707E9292K76664f5573j50620B9286K8128g8866A33029e1044B57230
$$ 127385 -10707 59292 335956 -65573 -216193 29286 57414 -78866 133029 -51044 257230
12116I9188a85541J9469D2050a52773G0166C3219M2211b95697B71098b04634h0769
$$ 99188 -185541 -166072 42050 -152773 70166 33219 75430 -295697 271098 -204634 -80769
12104a22376B2993f6879O280E6323k0870g9071D5198j4976O6317a76223A91908
$$ -122376 22993 -66879 -60599 56323 35453 -79071 45198 30222 96539 -176223 191908
12092a20686A80659o1780b49872D8451O3701B5100L3585i3969G0581L0579J35889
$$ -120686 180659 118879 -249872 48451 112152 25100 58685 -93969 70581 101160 237049
12081B37049f7495E2618g4259B7825b19722F4859J39983b73453i6390j2999p9516
$$ 237049 -67495 52618 -74259 27825 -219722 64859 204842 -273453 -96390 -109389 -188905
12070a88905i111j67841B0465J52208b9037C32890j10433K0274N77497l22092
$$ -188905 -9111 -176952 20465 172673 -29037 332890 222457 242731 820228 498136
12060D98136A42332n1035O0313A7116Q2349d2688D81941k35369P7109f7725C46649
$$ 498136 142332 91297 151610 17116 99465 -42688 481941 246572 323681 -67725 346649
12048B89113b60565E109K89275A42949l9700M4151l5804J2780g4139A08053b2719
$$ 289113 -260565 5109 294384 142949 103249 147400 111596 124376 -74139 108053 -22719
12036a0615r7906D6538a29473B5634a76859O7139A53933c8637o036A29263D1655
$$ -10615 -108521 46538 -129473 25634 -176859 -109720 153933 -38637 -44673 129263 41655
12024d865l20219A17640b46106A06722a01496p7587N7090c7382F1685c38274a13414
$$ -4865 -325084 117640 -246106 106722 -101496 -179083 -121993 -37382 61685 -338274 -113414
12012B18487a75576j76401B37088a52556B64628a79440B40334a94554r7758J3201
$$ 218487 -175576 -351977 237088 -152556 264628 -179440 240334 -194554 -292312 -279111
12002b79111Q1694D06849J02527a77084f414A94067D2839J47039a22997c5431
$$ -279111 -197417 406849 509376 -177084 -6414 194067 42839 189878 -122997 -35431
11991h7164p2078A0781e16141a24780c7581j98187g2362q1201P2687F2982b65422
$$ -87164 -159242 10781 -516141 -124780 -37581 -235768 -72362 -153563 -80876 62982 -265422
11979f2502k0917K1194A18449g935C07944b79743a19187A40537a17295p6226b1132
$$ -62502 -83419 -62225 118449 -7935 307944 -279743 -119187 140537 -117295 -193521 -21132
11967a59199N9042D0254a23879A20465J49251i9517B07194a99794F3266f0893
$$ -159199 -100157 40254 -123879 120465 269716 -99517 207194 -199794 63266 -60893
11956D7252L59511a81620l030B55054a60622B46577C4736P3351l0175f2873O076
$$ 47252 406763 -181620 -184650 255054 -160622 246577 34736 108087 77912 -62873 -56797
11945e6797C4451E899h297j41822O8195M370A58734a9841m9325j11202h1620D3074
$$ -56797 34451 5899 -8297 -150119 -81924 -77554 158734 -19841 -69166 -180368 -81620 43074
11932B68654g5511p2756A00778f5974A2497L2568a1443F0478b00857c0189l14380
$$ 268654 -75511 -148267 100778 -65974 12497 45065 -11443 60478 -200857 -30189 -344569
11921c44569E877N1823j4760J39481e0560B1818b52512Q5621A43843A6862a53273
$$ -344569 5877 57700 42940 182421 -50560 21818 -252512 -166891 143843 16862 -153273
11909h2888F886b4425A96120q2041E6622J8386P1852a54543G4457b78007A09498
$$ -82888 6886 -24425 196120 114079 56622 75008 146860 -154543 74457 -278007 109498
11897a16913C2002c42700B44639a9593F7862j9759g6347A21722c2447k82573A95327
$$ -116913 32002 -342700 244639 -19593 67862 48103 -76347 121722 -32447 -315020 195327
11885a2072k57480o4348R534h8535j93642A35577a74999B61683c011n9869A23301
$$ -12072 -269552 -333900 -324366 -88535 -282177 135577 -174999 261683 -3011 -62880 123301
11873d7483j93130a08839a3970q1049I171e1427A31515a19418M5491F9367J8344
$$ -47483 -240613 -108839 -13970 -95019 9171 -51427 131515 -119418 -73927 69367 87711
11862H7711l4756J07293D8937d10550a32004J4181b3795F6440b5197j47096B0544
$$ 87711 52955 160248 48937 -410550 -132004 -117823 -23795 66440 -25197 -172293 20544
11850c9563B14698j2661k4677a92148A14089c28691a10639A19674d04084a6000
$$ -39563 214698 202037 177360 -192148 114089 -328691 -110639 119674 -404084 -16000
11839b5719k73119J14064e3249F4004a28786d7746l8043m3622N2271B2758e2755
$$ -25719 -298838 -184774 -53249 64004 -128786 -47746 -85789 -129411 -77140 22758 -52755
11827A14270n6017d6575B76044l1346a22762M6121A4668g9343n1077M5672J9378
$$ 114270 58253 -46575 276044 244698 -122762 -76641 14668 -79343 -130420 -84748 -65370
11816f5370A11093g8627K6259A02478b444l35122H6739O7341a6302D3860Q5312
$$ -65370 111093 -78627 -52368 102478 -2444 -337566 86739 154080 -16302 43860 129172
11805A29172K9095b5019l13833H8916c9552B0926i8613Q685k8234k8340l3280
$$ 129172 158267 -25019 -338852 88916 -39552 20926 -98613 -89928 -118162 -146502 -179782
11794a79782L7171A45255C9262a3016C8030a3883j82369C5286J68881F4393a45677
$$ -179782 -142611 145255 39262 -13016 38030 -13883 -196252 35286 204167 64393 -145677
11782b6101j9905m9114B2870J3112a83818e0470K3355J919A76501N3279b1091
$$ -26101 -46006 -95120 22870 35982 -183818 -50470 -27115 -25196 176501 229780 -21091
11770c628j29943K5711d9029F9571c73975a44562A61631o2100K552l3945b9046
$$ -3628 -133571 -107860 -49029 69571 -373975 -144562 161631 99531 102083 68138 -29046
11758a9774G8797e1394j19371j34854a16991I0979b32983C8259a26492A61268
$$ -19774 78797 -51394 -170765 -305619 -116991 90979 -232983 38259 -126492 161268
11747B13512a53649j7399H0657K6617k9153k4520a59490B34679C3853g9370B04853
$$ 213512 -153649 -171048 80657 107274 78121 53601 -159490 234679 33853 -79370 204853
11735A17605l6848a46026k7551A15998a16374M1974p9450B08077b08525A5201
$$ 117605 80757 -146026 -173577 115998 -116374 -74400 -153850 208077 -208525 15201
11724d7451C59387b46437A66076a55743A79174H2682b45858F4184b7831E2259
$$ -47451 359387 -246437 166076 -155743 179174 82682 -245858 64184 -27831 52259
11713A42554b0083A24322h2138D39236j31506g156k38976B6505e8327q4073j91737
$$ 142554 -20083 124322 -82138 439236 307730 -7156 -246132 26505 -58327 -142400 -334137
11702c34137A60874a1679n6869j87520B3487K11302j06398f725j01903b9966j86196
$$ -334137 160874 -11679 -68548 -256068 23487 234789 128391 -6725 -108628 -29966 -216162
11691b16162B01471c10475A0864Q8977f0514B44327H7610l6395c25761A12838
$$ -216162 201471 -310475 10864 99841 -60514 244327 87610 51215 -325761 112838
11680i9051A704K59680b28186c5056A35134k1195k796k5371j8685R4624J83104
$$ -99051 1704 261384 -228186 -35056 135134 113939 111143 85772 67087 161711 344815
11669C44815a03453c8993r4357J0547q615N048B83428A19856Q670M2885p5099
$$ 344815 -103453 -38993 -133350 -122803 -131418 -126370 283428 119856 128526 171411 96312
11658I6312M9296i624D0555K85483F2333N3839J46968c73541j02850A98309e8329
$$ 96312 145608 -9624 40555 326038 62333 116172 263140 -373541 -476391 198309 -58329
11646E268c95865J49119F7566c498I6011M1767g9965A57496N5517a917I8818c05882
$$ 5268 -395865 -246746 67566 -3498 96011 137778 -79965 157496 213013 -1917 98818 -305882
11633c23693a2661n5695o8160B06299o0459B9669f61j54309d2527A9001d74096
$$ -323693 -12661 -68356 -136516 206299 145840 29669 -661 -154970 -42527 19001 -474096
11621B17199a52831d6311B34133c09606A26174C68c10567g2770B3458a64419G304
$$ 217199 -152831 -46311 234133 -309606 126174 368 -310567 -72770 23458 -164419 7304
11609a36170A10730k8175a48418c1178A11080j9404K41093A42372a49159B44260
$$ -136170 110730 82555 -148418 -31178 111080 91676 332769 142372 -149159 244260
11598c0899B41271D8752L8577L3824N8491A6543O7107k424b54827C20362b7966
$$ -30899 241271 48752 87329 121153 179644 16543 83650 81226 -254827 320362 -27966
11586a73302A03359N2828b33148D56982j00765d9784C38260a02821B10745c3925
$$ -173302 103359 156187 -233148 456982 356217 -49784 338260 -102821 210745 -33925
11575a04794B63647r7394a52325b1194A91232L8418b23771A1001a4305o9650l4596
$$ -104794 263647 166253 -152325 -21194 191232 229650 -223771 11001 -14305 -83955 -118551
11564a18551A38689b6919A81578a92232a782j58296m1697A77636a1165C61358
$$ -118551 138689 -26919 181578 -192232 -1782 -160078 -201775 177636 -11165 361358
11553G7043J019K20664M36905A26370e2769A68541a6824p0840A77843a31558f031
$$ 77043 78062 298726 735631 126370 -52769 168541 -16824 -87664 177843 -131558 -6031
11541d6645C0466K6690a10135D9701a05082M6354K3459A35403n8950O3414a6643
$$ -46645 30466 57156 -110135 49701 -105082 -58728 -35269 135403 76453 139867 -16643
11529C32277q6894a15707d7951H5901l4709d2938e141j1021p4394A23548a07910
$$ 332277 245383 -115707 -47951 85901 51192 -42938 -5141 -16162 -90556 123548 -107910
11517a56553n716A57262N5191B0190P2440a97196C8442K02041B0907f2148C12913
$$ -156553 -162269 157262 212453 20190 92630 -197196 38442 240483 20907 -62148 312913
11505I9591e6299l3014G1875c39601g2362K7405j64689b0074E452J55171m313
$$ 99591 -56299 -89313 71875 -339601 -72362 -44957 -209646 -20074 5452 160623 156310
11494A56310k948f1543C66420A66409b9402j30837A01082K89314a78345O6625
$$ 156310 153362 -61543 366420 166409 -29402 -160239 101082 390396 -178345 -111720
11484a11720A24592j3382C610J76423c27777E0426i3689m5906B09465j01417b0777
$$ -111720 124592 111210 3610 180033 -327777 50426 -93689 -139595 209465 108048 -20777
11472B16555d7106A69213D8529a00A76544n8886c09752B15290b9662B93142A05745
$$ 216555 -47106 169213 48529 -100 176544 117658 -309752 215290 -29662 293142 105745
11460A81104a42888a5739l50462D6732A9849L0179O2066h3735p2940b8687j78059
$$ 181104 -142888 -15739 -366201 46732 19849 50028 112094 -83735 -156675 -28687 -206746
11449b06746d5219F0790k1099N8070Q0490g1594B0486b72413j44279B29340k1663
$$ -206746 -45219 60790 39691 97761 178251 -71594 20486 -272413 -416692 229340 207677
11438B07677i9285D0657a6022j31400A3901K81984a81299A54337a2706d301m2947
$$ 207677 -99285 40657 -16022 -147422 13901 295885 -181299 154337 -12706 -4301 -47248
11427d7248A75697a29180j23422J23387C93107c5603o9584D8434g2481A90737
$$ -47248 175697 -129180 -252602 -129215 393107 -35603 -105187 48434 -72481 190737
11416c1476a553B66886A29452L6628m5568c1336H3068f3521F3408R702j6380Q2201
$$ -31476 -1553 266886 129452 166080 120512 -31336 83068 -63521 63408 73110 56730 138931
11404A38931a3020A8179a71907E3485N4969J18352j03933m9828L33074I9074e7722
$$ 138931 -13020 18179 -171907 53485 108454 226806 122873 73045 406119 99074 -57722
11392E2532M6313a19866J1197F3423b10094k22746b4827k00045J3640l0212h9911
$$ 52532 98845 -119866 -108669 63423 -210094 -432840 -24827 -224872 -211232 -241444 -89911
11380E935a80675A79399a13990N3632A33660a67245a4978A10861e7899A08116
$$ 5935 -180675 179399 -113990 -60358 133660 -167245 -14978 110861 -57899 108116
11369c0361I7666b5000n4994F867J31648b7514j04805N1276E3284c45640D67803
$$ -30361 97666 -25000 -79994 6867 138515 -27514 -132319 -81043 53284 -345640 467803
11357b71715B01509H091c31834e969j89834R1499m3232f9447L1067j64977E0567
$$ -271715 201509 8091 -331834 -5969 -195803 -104304 -147536 -69447 -38380 -203357 50567
11345C43156a19487B98873g6732B9812c3886F5509a76301O1383e0405b2933O15
$$ 343156 -119487 298873 -76732 29812 -33886 65509 -176301 -114918 -50405 -22933 -22318
11334b2318P389k85848B20440A5053J28302h9624K6672B30224b17346A5157d07010
$$ -22318 -14929 -300777 220440 15053 143355 -89624 -62952 230224 -217346 15157 -407010
11322D6479O6312a57755k91145B60873E8051b00311L5316N1418j53324O7042M3452
$$ 46479 112791 -157755 -448900 260873 58051 -200311 -164995 -113577 -266901 -199859 -156407
11311a56407G3096a64425C962b14751M4495j2239h127I635d3423o113j28769P1703
$$ -156407 73096 -164425 3962 -214751 -170256 -182495 -8127 9635 -43423 -49536 -178305 -106602
11299a06602I2039b1531n9162E3306d98341g0393j72066f031B2086a59922M3571
$$ -106602 92039 -21531 -80693 53306 -498341 -70393 -242459 -6031 22086 -159922 -116351
11288a16351e4995o112I6342a50205e5858n6685B09353i1711j30291i6697j2580
$$ -116351 -54995 -61107 96342 -150205 -55858 -112543 209353 -91711 -222002 -96697 -109277
11277a09277c9092I0983a12903n4401j81056A08719B8507J13894K9461a3846n3191
$$ -109277 -39092 90983 -112903 -167304 -348360 108719 28507 142401 171862 -13846 -67037
11266f7037M97A09506b10031F4041g2083J8002q7614A36956n8159a67992o8246
$$ -67037 -66540 109506 -210031 64041 -72083 -54081 -141695 136956 78797 -167992 -236238
11255b36238I11h4701F794K5781c60376J33915i116p4094J960l1181k32592B3525
$$ -236238 911 -84701 6794 32575 -360376 -226461 -9116 -83210 -81250 -112431 -345023 23525
11242a55681j48952d2957q5853P734j94867J28466B0757b45295o7760A50337a9465
$$ -155681 -304633 -42957 -128810 -121076 -315943 -187477 20757 -245295 -313055 150337 -19465
11230E1182J64864H7279b17185A2954c4965A9609P8821b3053F3349g3353J4233
$$ 51182 216046 87279 -217185 12954 -34965 19609 98430 -23053 63349 -73353 -59120
11219e9120j1223k26044F8441c2562F8621j3163K08220a84809B59391b20699d7963
$$ -59120 -70343 -296387 68441 -32562 68621 55458 263678 -184809 259391 -220699 -47963
11207f8713k3277H4238i4295A87936a63229k4554c7750F2503a18526A24598b17120
$$ -68713 -91990 84238 -94295 187936 -163229 -187783 -37750 62503 -118526 124598 -217120
11195a92298C4723j3633a22566j80967e5851a4059A65581R3098j08820o8873a77645
$$ -192298 34723 21090 -122566 -303533 -55851 -14059 165581 258679 149859 80986 -177645
11183D0856Q6231o0061j7515b15457j44892a48716L2269B1607J09147J03283a42890
$$ 40856 127087 67026 49511 -215457 -360349 -148716 -116447 21607 130754 234037 -142890
11171a38521j03414A78678a23128e7166m8044H6009f2548E2607k2455a07194A8412
$$ -138521 -241935 178678 -123128 -57166 -105210 86009 -62548 52607 30152 -107194 18412
11159d5270o2114D7012e9001I5415F636a12230A05681a94394A35875d6325q6020
$$ -45270 -107384 47012 -59001 95415 6636 -112230 105681 -194394 135875 -46325 -132345
11148a32345n4860F8688b06736A55304a15391B17033J58272f869B0910Q0081f7602
$$ -132345 -187205 68688 -206736 155304 -115391 217033 375305 -6869 20910 100991 -67602
11136b32779F0568c93737a80984j8405R3124m3404l4229j57397J33683A14251
$$ -232779 60568 -393737 -180984 -199389 -106265 -149669 -183898 -341295 -207612 114251
11125c04087B00352a11339n8828B69352B6675J09284a39364f0378p4874M5014
$$ -304087 200352 -111339 -170167 269352 26675 135959 -139364 -60378 -135252 -90238
11115i0238k31028E2467K3493Q449d1260A00063e3254B27590D8300i6782k91001
$$ -90238 -321266 52467 75960 84409 -41260 100063 -53254 227590 48300 -96782 -387783
11104c87783C07295k6800A30109l3587b49659F5299K14264b7157F19b5024A77750
$$ -387783 307295 280495 130109 96522 -249659 65299 279563 -27157 619 -25024 177750
11092C48816H0100J24625M9960f9582A5594L1273Q0546a8868j70909A32736b86413
$$ 348816 80100 204725 254685 -69582 15594 46867 127413 -18868 -189777 132736 -286413
11080A44301m2282D2189N9926J36411p667P4714F1321K03086g1317F0450J48039
$$ 144301 102019 42189 102115 238526 230859 305573 61321 264407 -71317 60450 208489
11069B08489h5382D00937i3315B18854C3370K14474G9526L56033A04541P7947
$$ 208489 -85382 400937 -93315 218854 33370 247844 79526 435559 104541 182488
11059A82488J9102M57J8404L73338k28533m7424J84621J29315B33513L9123K76958
$$ 182488 201590 202047 220451 593789 365256 317832 502453 631768 233513 272636 549594
11048E49594B55645o9649K12647K10004j09973j86393P5904K02286n174j15441
$$ 549594 255645 185996 398643 608647 498674 312281 388185 590471 585297 469856
11038D69856J23501j49757O9389O7300B61134K2296L56573j68969J33664A68194
$$ 469856 593357 443600 512989 580289 261134 283430 640003 471034 604698 168194
11027A77734J95499j04405K64890N4355j59552J2847L1285k1154j44703q6998
$$ 177734 373233 268828 533718 588073 428521 441368 472653 451499 306796 219798
11017B19798L19130K52025l64917c9985C14348L055K10603B44263O601Q1671O7638
$$ 219798 538928 790953 426036 -39985 314348 317403 528006 244263 250864 332535 400173
11006D00173j22112J87594l7436J15199B40929K33354j8896j79361J03410j63601
$$ 400173 278061 465655 428219 543418 240929 474283 455387 276026 379436 215835
10996B15835M66168N6467k49548j1339j55965Q7533p3156J05548A94190J03190
$$ 215835 682003 738470 488922 477583 321618 409151 335995 441543 194190 297380
10986B97380L90509k31270J90648k6956J31732k15378J192r2709K75774l7953
$$ 297380 687889 456619 647267 620311 752043 536665 537857 445148 720922 682969
10976F82969J07313m9367j25143Q4005J20207M27803k28771L9989K57556K46827
$$ 682969 790282 740915 615772 699777 819984 1247787 1019016 1059005 1316561 1563388
10966A563388N0511o8773l7277J86743r0396n17698p507k27847K20589r8587N8041
$$ 1563388 1613899 1545126 1507849 1694592 1604196 1086498 1078991 851144 1071733 973146 1031187
10955A031187O4478J95223k30986K72767j96136k83281J68444m9218D36998N14111
$$ 1031187 1095665 1290888 1059902 1332669 1136533 853252 1021696 972478 436998 951109
10945I51109k24261j32224B26536M58352B76692M3754j05099K21372e2593E0677
$$ 951109 726848 594624 226536 684888 276692 320446 215347 436719 -52593 50677
10934B01792b8969B00683n9891F780e7133A4968f8571D4130b00072A81621C9056
$$ 201792 -28969 200683 140792 6780 -57133 14968 -68571 44130 -200072 181621 39056
10922C1108a77671e9040A55177K6109B6328e9826A6116d3567B68801b24108A50194
$$ 31108 -177671 -59040 155177 181286 26328 -59826 16116 -43567 268801 -224108 150194
10910f0227C1875c99472J4898d6466A12315A6976a6190r845C3195b29283h8409
$$ -60227 31875 -399472 -384574 -46466 112315 16976 -16190 -26035 33195 -229283 -88409
10898f2865C138h5720I8249j6323J4129a42080j3208p7854g0133H6062a6487k85713
$$ -62865 3138 -85720 98249 81926 96055 -142080 -155288 -233142 -70133 86062 -16487 -302200
10886c02200b6707J1486P35j9728B41706d0293n1058l2201j8502A52104O7588
$$ -302200 -26707 -15221 -14486 -34214 241706 -40293 -91351 -123552 -142054 152104 219692
10875B19692K0377B2435K70628A7200d1348j75096a07549o196o0582n3106a12938
$$ 219692 240069 22435 293063 17200 -41348 -216444 -107549 -113745 -174327 -227433 -112938
10863b66945D1975i2117A72844a70259m8475J05948H5188b69412I9209f6267F8035
$$ -266945 41975 -92117 172844 -170259 -218734 -112786 85188 -269412 99209 -66267 68035
10851B70584G6550Q92J34163a35495d1966a3100k5861A00837R7576o7633N0225
$$ 270584 76550 77442 211605 -135495 -41966 -13100 -38961 100837 198413 130780 181005
10840A81005B2321c1220k28814d6067G8756b07010G1795J09107M5837a38918o3513
$$ 181005 22321 -31220 -260034 -46067 78756 -207010 71795 180902 226739 -138918 -202431
10829b02431e7027B04849a41978N0199A28928R5829n1563K31098d9529E4528L9392
$$ -202431 -57027 204849 -141978 -91779 128928 224757 173194 404292 -49529 54528 93920
10818I3920A2585g8255A75319o8685a03724l098L3295p5712A41481c22219A58261
$$ 93920 12585 -78255 175319 106634 -103724 -106822 -73527 -149239 141481 -322219 158261
10806B32562a14282N5488A09045a41575B51148a94767R3886B92192J8270j16270
$$ 232562 -114282 -58794 109045 -141575 251148 -194767 -100881 292192 310462 194192
10796A94192R8976M9519A7414a89367H0711O3333N8711b61995I7837d8565I7962
$$ 194192 293168 342687 17414 -189367 80711 144044 202755 -261995 97837 -48565 97962
10784h5400j90348i4007C6898c19035I67i4783b1898j71568P2606A6528b66219
$$ -85400 -275748 -94007 36898 -319035 967 -94783 -21898 -193466 -120860 16528 -266219
10772a2481B64126G841i9973l7032d6249l8164A1762b49433j63526B12138d18428
$$ -12481 264126 7841 -99973 -137005 -46249 -84413 11762 -249433 -412959 212138 -418428
10760A14982J9956d7962q2756k4907B01358f3245j96450c8376L533j10904B00681
$$ 114982 134938 -47962 -130718 -155625 201358 -63245 -259695 -38376 -34843 -145747 200681
10748B48729f7311j72036h1284A55714a23408M9376D8583b60309f2572C49857
$$ 248729 -67311 -239347 -81284 155714 -123408 -74032 48583 -260309 -62572 349857
10737a50179e7490r3561G2205c2808m7117D6134L2205a48751B56876f8202F1089
$$ -150179 -57490 -151051 72205 -32808 -79925 46134 78339 -148751 256876 -68202 61089
10725a38361K2944B26611q382c38105A13512g634l0422j88054l4938E5375J4467
$$ -138361 -115417 226611 218229 -338105 113512 -7634 -38056 -226110 -261048 55375 69842
10714F9842J52565C1847J41620c050B8430J68490e6326b6117l73154J60645q6143
$$ 69842 222407 31847 173467 -3050 28430 196920 -56326 -26117 -399271 -238626 -324769
10703c24769g5458A71220a60339j41218a21883A24911c6139m3351k6672j8833
$$ -324769 -75458 171220 -160339 -301557 -121883 124911 -36139 -79490 -106162 -124995
10693a24995M7510k29264a03708m9433n5532M5381g811l28192a24765B8489h5194
$$ -124995 -77485 -306749 -103708 -153141 -208673 -163292 -7811 -336003 -124765 28489 -85194
10681c89517B69892b96661d8783l2179l63124g3397K8838k35590h7986A28344
$$ -389517 269892 -296661 -48783 -80962 -444086 -73397 -44559 -280149 -87986 128344
10670b60232C5425c10303F3420a63659C01624N6794A594c01465R5604j83058a49995
$$ -260232 35425 -310303 63420 -163659 301624 358418 1594 -301465 -205861 -388919 -149995
10658i443k9564B9350a15724B38975g8163j50034a3775j15447d9115j2168l44763
$$ -9443 -39007 29350 -115724 238975 -78163 -228197 -13775 -129222 -49115 -61283 -406046
10647d06046a52717A2945a26436j73759a0386j17981q4645P0356q090F8613g9187
$$ -406046 -152717 12945 -126436 -300195 -10386 -128367 -213012 -142656 -150746 68613 -79187
10635a29732A46485d8668k60326G2407N0672a85710J2213D5828h3901E7413J46919
$$ -129732 146485 -48668 -308994 72407 123079 -185710 -173497 45828 -83901 57413 204332
10624B04332a90182p8419b2761A96614d5304A99108b5525D6999a04801A10769
$$ 204332 -190182 -268601 -22761 196614 -45304 199108 -25525 46999 -104801 110769
10613i6293j68429O6497R8419A46536j2776J56528D1446q352c10001a28426o8513
$$ -96293 -264722 -198225 -99806 146536 133760 290288 41446 33094 -310001 -128426 -196939
10602a96939h3550a9845A48438B9289i107E5093h2561A91443a58106B48533b02236
$$ -196939 -83550 -19845 148438 29289 -9107 55093 -82561 191443 -158106 248533 -202236
10590a33272J1211M0940F8633h7942j00101e2659j6295a6804A77816a38630f3116
$$ -133272 -122061 -81121 68633 -87942 -188043 -52659 -68954 -16804 177816 -138630 -63116
10578f05106b06007j965O5760e9761B42205b11784n086r650i8867B27724b83673
$$ -605106 -206007 -207972 -142212 -59761 242205 -211784 -216870 -226520 -98867 227724 -283673
10566C6126a26570K2874d7704A4434J06350a00582q3443i119k01079h5370A90640
$$ 36126 -126570 -103696 -47704 14434 120784 -100582 -184025 -9119 -210198 -85370 190640
10554e2749B89149I0742a25219B08301g5975r3111g7719F615K67827a24307m572
$$ -52749 289149 90742 -125219 208301 -75975 -169086 -77719 6615 274442 -124307 -128879
10543a28879b8784k10792G709b28711I7101D0142b90866B09979a82031A40382
$$ -128879 -28784 -239576 7709 -228711 97101 40142 -290866 209979 -182031 140382
10532G211d0941B41416M8884a77201O8218e0567j29995m030B50506E995a17227
$$ 7211 -40941 241416 290300 -177201 -108983 -50567 -180562 -184592 250506 5995 -117227
10520a2825q9775r9068p083A43359c40181a53187b7756i769j26200n2724O2721
$$ -12825 -102600 -201668 -208751 143359 -340181 -153187 -27756 -9769 -135969 -188693 -125972
10509a25972A34696K0587a23384j9783A01224J301L45773A67399h9261A43582
$$ -125972 134696 155283 -123384 -143167 101224 102525 448298 167399 -89261 143582
10498A98213h5460b2977k14743a2050D9013g0048k1239o3570L3202H0391b19260
$$ 198213 -85460 -22977 -237720 -12050 49013 -70048 -91287 -154857 -121655 80391 -219260
10486a33238A7509D075N5927A8243d7774j9185n2306G7885c1103F07328j55657
$$ -133238 17509 4075 60002 18243 -47774 -66959 -119265 77885 -31103 607328 451671
10475D51671A44380L00008A75269L11659q4255q7897E5925M4844L59064A29290
$$ 451671 144380 444388 175269 486928 402673 314776 55925 100769 459833 129290
10464g223j07662c5467q7530A61498b69760A40228n6940c07501a36672j30098
$$ -7223 -114885 -35467 -122997 161498 -269760 140228 83288 -307501 -136672 -266770
10454b66770d1324m2936l09274M5444h5494P866A28238i7858e713C5596J8321
$$ -266770 -41324 -84260 -393534 -348090 -85494 -77628 128238 -97858 -5713 35596 53917
10443E3917a54640b5565o3179p1339K651G4979k8645a28492C04375A30939c7383
$$ 53917 -154640 -25565 -88744 -160083 -157432 74979 46334 -128492 304375 130939 -37383
10431g2451B31317c29491J24613g2911L0363a6371A21794b31193P1864p6575P5737
$$ -72451 231317 -329491 -204878 -72911 -42548 -16371 121794 -231193 -159329 -235904 -160167
10420a60167c3124m6957g688j66676g4594F0945b11994a01755p6321B35079r5724
$$ -160167 -33124 -80081 -7688 -174364 -74594 60945 -211994 -101755 -178076 235079 139355
10409A39355a2655j16869q6144f9309l01557I1239b51621a08581A65161b865p2618
$$ 139355 -12655 -129524 -215668 -69309 -370866 91239 -251621 -108581 165161 -2865 -75483
10398g5483D2702R368d59025e9217B11752a01314A15044j9460c08390A32513D7920
$$ -75483 42702 52070 -459025 -59217 211752 -101314 115044 95584 -308390 132513 47920
10386A85526e9314D5438R4765K0747a25633j88567i7574B54058a38616A7202Q8042
$$ 185526 -59314 45438 140203 160950 -125633 -314200 -97574 254058 -138616 17202 105244
10375A05244j5799J26795p3711K923c8075H2768N8968b12221i9104D427J5660
$$ 105244 89445 216240 142529 145452 -38075 82768 141736 -212221 -99104 4427 20087
10364B0087L96J80903J66661j28501A15001b3491B07201h2982E4527a255H053
$$ 20087 20483 201386 368047 239546 115001 -23491 207201 -82982 54527 -1255 8053
10352a1907A56607k1842R3975q9344B9649J06749J25717J29144A39815a24451
$$ -11907 156607 134765 228740 139396 29649 136398 262115 391259 139815 -124451
10341A41618k8504K96158I2260B2928J90263A2663L9213K85969d7361B77937G3236
$$ 141618 113114 409272 92260 22928 213191 12663 51876 337845 -47361 277937 73236
10329G0095c128A64458b1396A14058b8314A22102a3191D6196J08736G2273J37604
$$ 70095 -3128 164458 -21396 114058 -28314 122102 -13191 46196 154932 72273 209877
10318B09877l753a1281B00591b65197o1385D29636j75031j17576a77527f7194
$$ 209877 206124 -11281 200591 -265197 -326582 429636 254605 137029 -177527 -67194
10307b68949K9387J00051r5973f9738C00654r6257o480Q5071H5993M7076e36631
$$ -268949 -239562 -139511 -235484 -69738 300654 204397 197917 282988 85993 133069 -536631
10295a70951P4496F1809a1499o176H2690h5326A64426a59585l053C2591L771O3542
$$ -170951 -96455 61809 -11499 -17675 82690 -85326 164426 -159585 -162638 32591 36362 99904
10283I9904i3813m4897A5352Q7059k9386a30470O2202B4609a78856h8895A04610
$$ 99904 -93813 -138710 15352 102411 73025 -130470 -68268 24609 -178856 -88895 104610
10271F4257e6392j25029b901j4326k62734H334O6249a14852B19888i598j04026
$$ 64257 -56392 -181421 -2901 -17227 -279961 8334 74583 -114852 219888 -9598 -113624
10260a13624A01786D711A10e38H075P9272b1935k9278A91612o0215K82658p7003
$$ -113624 101786 4711 110 -538 8075 87347 -21935 -51213 191612 131397 414055 337052
10248C37052b63441A66721E3018a13721H2732c74213H9754a25471n9343b4377
$$ 337052 -263441 166721 53018 -113721 82732 -374213 89754 -125471 -184814 -24377
10237c76773B56283a59537M5039d4315A92830E0844j354c2849l0919n3596A68824
$$ -376773 256283 -159537 -114498 -44315 192830 50844 49490 -32849 -63768 -117364 168824
10225b6019A80618b63591J02728O3276D371a03835k59296B2087c50571A3677a87687
$$ -26019 180618 -263591 -160863 -97587 4371 -103835 -363131 22087 -350571 13677 -187687
10213a50798p098j75059l3392I5991b9437A53741b40265a5203N349A04171c01653
$$ -150798 -157896 -332955 -366347 95991 -29437 153741 -240265 -15203 -9854 104171 -301653
10201A49026E3143a35476r4076d2451o6240A34472B1752h1687K4049j11261j12824
$$ 149026 53143 -135476 -229552 -42451 -108691 134472 21752 -81687 -57638 -168899 -281723
10190b81723E4571d4865l75419B1698N3886R7574b62869A40011A8357A366i5275
$$ -281723 54571 -44865 -420284 21698 75584 173158 -262869 140011 18357 1366 -95275
10178D0451a05582j4625e1602F0761R709f4989k97644A31997a25001M8517j24845
$$ 40451 -105582 -120207 -51602 60761 70470 -64989 -362633 131997 -125001 -76484 -201329
10167b01329b6601A4328a28440A44183M4221b90941J27625F684a06940b7680j3854
$$ -201329 -26601 14328 -128440 144183 188404 -290941 -163316 6684 -106940 -27680 -41534
10156d1534l67292c4414o1962G1007i257l6965n5635B69133b02664B85766b47387
$$ -41534 -408826 -34414 -96376 71007 -9257 -46222 -101857 269133 -202664 285766 -247387
10144A13682b40913A24930F1775b8685k24049e0210j9311K3831o2024L5924E0761
$$ 113682 -240913 124930 61775 -28685 -252734 -50210 -69521 -45690 -107714 -71790 50761
10132a42313e5861j05083k80618A13228f1201j09262B46485A08931L12214b73255
$$ -142313 -55861 -160944 -441562 113228 -61201 -170463 246485 108931 421145 -273255
10121c355H913a7885o8409k64458p0721A25330j9841r844C2143g6222a4971p8919
$$ -3355 8913 -17885 -86294 -350752 -421473 125330 105489 95645 32143 -76222 -14971 -93890
10109i3890c4246q6031B7181a30807e9607l3855o3667k5569A00823i9280A29049
$$ -93890 -34246 -120277 27181 -130807 -59607 -93462 -157129 -182698 100823 -99280 129049
10097d65511B1555c26218O3191K7089m3378b4843P36A27371N0209N7704b85874
$$ -465511 21555 -326218 -263027 -235938 -279316 -24843 -24107 127371 177580 235284 -285874
10085b77500B00172A3081J69294a80303A02097M3968h7914k04412A12185K9496
$$ -277500 200172 13081 182375 -180303 102097 146065 -87914 -292326 112185 141681
10075A41681i7125a3855m8552A33316E0499a82693B36791o1037F2072b32656H9803
$$ 141681 -97125 -13855 -62407 133316 50499 -182693 236791 175754 62072 -232656 89803
10063f0001B40470b37201f8920A19698n1570a54368e5194A44465e3023A30784
$$ -60001 240470 -237201 -68920 119698 68128 -154368 -55194 144465 -53023 130784
10052A64873f3257r3082g7868H2062J4957B3278e7763B05115h7035l70628g6362
$$ 164873 -63257 -156339 -77868 82062 97019 23278 -57763 205115 -87035 -457663 -76362
10040a1702l7270B63733a69296A42409a78927A28739d76354a32712N575K4289
$$ -11702 -48972 263733 -169296 142409 -178927 128739 -476354 -132712 -127137 -102848
10030a02848d5425E3160a92314a0504c164A09574a67139H6407a77182q8393j13214
$$ -102848 -45425 53160 -192314 -10504 -3164 109574 -167139 86407 -177182 -265575 -378789
10019c78789J41082A43183C4280a43506f7397k0949H8987l5187c10638m3918B8613
$$ -378789 -237707 143183 34280 -143506 -67397 -88346 88987 53800 -310638 -354556 28613
10007D3364O9587o081b16299K3109j41060A73307a2982l15427d0580a7160k8688
$$ 43364 112951 106870 -216299 -193190 -334250 173307 -12982 -328409 -40580 -17160 -45848
9996d5848k08614h6254C19214b8229o5805k88520e0428j30647A40254a92584K4325
$$ -45848 -254462 -86254 319214 -28229 -94034 -382554 -50428 -181075 140254 -192584 -168259
9985a68259m1855E6487e1870G6776N1891b25105g3870a7528B65779D8474j0716
$$ -168259 -210114 56487 -51870 76776 128667 -225105 -73870 -17528 265779 48474 37758
9974C7758R3775B708a60238N2798j43422P3939E8392h9631k54765Q4310P4056
$$ 37758 131533 2708 -160238 -107440 -250862 -176923 58392 -89631 -344396 -260086 -186030
9963a86030e6198A49233l6107a46856A44394e5291b2645p3667H6812C5669b12955
$$ -186030 -56198 149233 113126 -146856 144394 -55291 -22645 -96312 86812 35669 -212955
9951f1920E3831g5508k79453a03913K3978J41b3853I8456r291a42151F5567b46654
$$ -61920 53831 -75508 -354961 -103913 -79935 -79794 -23853 98456 89165 -142151 65567 -246654
9938b60699a28554E8157a96840L6171j42665N7954g086l25035D6111h7258b6156
$$ -260699 -128554 58157 -196840 -160669 -303334 -245380 -7086 -332121 46111 -87258 -26156
9926B5106d9874A30436C8599M545P4786J76690i48j61619A00317a23136c267p057
$$ 25106 -49874 130436 38599 43144 117930 294620 -948 -162567 100317 -123136 -3267 -10324
9914a0324A32047a52252A11576b13606f2675G4329L0458D7828O1395a54076I6846
$$ -10324 132047 -152252 111576 -213606 -62675 74329 104787 47828 109223 -154076 96846
9902B32306a4327N210j83427A09152b39090i7997A00079a95453f6118F2051L26555
$$ 232306 -14327 -9117 -192544 109152 -239090 -97997 100079 -195453 -66118 62051 388606
9891C88606d01630a04981A83354a98269B73075d1731j90056C1317P9813l7042
$$ 388606 -401630 -104981 183354 -198269 273075 -41731 -231787 31317 111130 74088
9881G4088K8293Q881P849a6700l26577A67820D6168b13570c3938n0063j30701
$$ 74088 102381 111262 119111 -16700 -343277 167820 46168 -213570 -33938 -84001 -214702
9870b14702K8629C961a91760c2908B87055H21J37415d2704A64434a75280B14340
$$ -214702 -186073 3961 -191760 -32908 287055 821 138236 -42704 164434 -175280 214340
9858b06249j7421i2049K6335A18520c41367o3376b2627H2766B8576g4740n9386
$$ -206249 -223670 -92049 -65714 118520 -341367 -404743 -22627 82766 28576 -74740 -134126
9847a34126F175a2119A49575d270I1307k741b39892F0548a88512P8881p5771k7024
$$ -134126 6175 -12119 149575 -4270 91307 88566 -239892 60548 -188512 -109631 -185402 -212426
9835b12426E5641b34531B20830J82997b24626l5916k01992b30827j31100J26549
$$ -212426 55641 -234531 220830 403827 -224626 -260542 -462534 -230827 -361927 -235378
9825b35378a08770D7498a93385D528h9976j75205M8997I3579c79202J06851H8577
$$ -235378 -108770 47498 -193385 4528 -89976 -265181 -216184 93579 -379202 -272351 88577
9813b27646K0978h8107H8047a32907l33287a12470I7272O7682c32256o843A74566
$$ -227646 -206668 -88107 88047 -132907 -466194 -112470 97272 164954 -332256 -339099 174566
9801b16693F0184a81121a7002p768j75128f533D8795f3461B86930A41820j3608
$$ -216693 60184 -181121 -17002 -24770 -199898 -6533 48795 -63461 286930 141820 128212
9790A28212b64916B23824e2709C8160a13048K9058o101C6110f7948n8694c1278
$$ 128212 -264916 223824 -52709 38160 -113048 -83990 -90091 36110 -67948 -126642 -31278
9778A52389d4023j8381H0662i0209a0k9694J1256c751q2917o4201o4300O3784
$$ 152389 -44023 -62404 80662 -90209 -10 -29704 -18448 -3751 -86668 -150869 -215169 -151385
9766a51385A98231h8904B79981L179d0313k12423k0345P6292A34660a4395j23479
$$ -151385 198231 -88904 279981 283160 -40313 -252736 -273081 -196789 134660 -14395 -137874
9755a37874d7086B05524B0051b00030i2321A60651a13826l0744M1326F066c66785
$$ -137874 -47086 205524 20051 -200030 -92321 160651 -113826 -144570 -103244 6066 -366785
9743A00405c8884A19202c43872a43821r1753h0518j04256F7913e4265k02735B0512
$$ 100405 -38884 119202 -343872 -143821 -235574 -80518 -184774 67913 -54265 -257000 20512
9731D934b5541A8059c16679A38501D8398c41918J14165j12120J05975i0555r4523
$$ 4934 -25541 18059 -316679 138501 48398 -341918 -227753 -339873 -233898 -90555 -185078
9720a85078c8513B63346b73827A31297a12467A7707O5044l7298b50666L5566A08441
$$ -185078 -38513 263346 -273827 131297 -112467 17707 82751 45453 -250666 -215100 108441
9708a03098l0467l07083A5795a86294O7249k85685B43959A3448c18309d2705l83681
$$ -103098 -133565 -440648 15795 -186294 -119045 -404730 243959 13448 -318309 -42705 -426386
9697d26386I5927J09348a23427A40000C4902d00402a44066e0677p0326B5257I727
$$ -426386 95927 205275 -123427 140000 34902 -400402 -144066 -50677 -121003 25257 9727
9685A13555m5032a64580A30430a7455B05393F6779b20171A58132L8291I015a47592
$$ 113555 68523 -164580 130430 -17455 205393 66779 -220171 158132 196423 9015 -147592
9673a17110B93657A45901b42381a994B9346e7593b5149A99289d1439J6904o8050
$$ -117110 293657 145901 -242381 -1994 29346 -57593 -25149 199289 -41439 -24535 -92585
9662i2585l4324c9770A05554l6390Q242g9485C48993j69728a26328C95151b07445
$$ -92585 -126909 -39770 105554 69164 77406 -79485 348993 179265 -126328 395151 -207445
9650F0875b72799I6718j2273P4969a18658J3480k22636E1867l393a607B80913
$$ 60875 -272799 96718 84445 159414 -118658 -105178 -327814 51867 48474 -1607 280913
9638G603a35995A03463b32620B67117c5017p2957q5754e0491j74127A85727i9951
$$ 7603 -135995 103463 -232620 267117 -35017 -107974 -193728 -50491 -224618 185727 -99951
9626b28789R4667B41996g6114j05995I7628h7260q2310I432a17881j92184J37055
$$ -228789 -134122 241996 -76114 -182109 97628 -87260 -169570 9432 -117881 -310065 -173010
9615a73010O0232D3631c5795k21876I9744M2414a43210P0115l7987o2077l18423
$$ -173010 -112778 43631 -35795 -257671 99744 142158 -143210 -73095 -111082 -173159 -491582
9604d91582R0585A00760e3361G8474a85376J144M9603q489D9425c79546P1682
$$ -491582 -400997 100760 -53361 78474 -185376 -184232 -134629 -143118 49425 -379546 -307864
9593c07864M9661A1280c25586B27943a06302C2591J87627h0610I5712d9297j02003
$$ -307864 -258203 11280 -325586 227943 -106302 32591 220218 -80610 95712 -49297 -151300
9582a51300A05834n012a14836j12263B37917b58263l15946K73630G1269C4457
$$ -151300 105834 100822 -114836 -227099 237917 -258263 -574209 -300579 71269 34457
9571B26082a3343A61883a65309b7140A06041h2736r1540e7290H9839J845C4732
$$ 226082 -13343 161883 -165309 -27140 106041 -82736 -174276 -57290 89839 91684 34732
9559a65477K3504j17336b3161j26025M4967J3426A99980A0L3073a14031L8941
$$ -165477 -141973 -259309 -23161 -149186 -104219 -90793 199980 10 33083 -114031 -75090
9548g5090A81023a54287A05441f1871j01553C421O6065a202q7560j0609I1617
$$ -75090 181023 -154287 105441 -61871 -163424 3421 69486 -1202 -88762 -99371 91617
9536D280R8531b54178Q9739m4184A81181E869b58487k5498B46191e8086l7138
$$ 4280 102811 -254178 -164439 -208623 181181 5869 -258487 -283985 246191 -58086 -95224
9525i5224E0611k1645g9686F7468a11349o051m56E4921a83816h8398M2325j70166
$$ -95224 50611 28966 -79686 67468 -111349 -117400 -117856 54921 -183816 -88398 -46073 -216239
9513b16239A26693H621M326b11496A41098a26140D4346a47438D9856b18346A2018
$$ -216239 126693 8621 12947 -211496 141098 -126140 44346 -147438 49856 -218346 12018
9501a79416e8409F0438c02539e8382r1137A65281i722B46228b48970P3778q7455
$$ -179416 -58409 60438 -302539 -58382 -149519 165281 -9722 246228 -248970 -175192 -262647
9490b62647a25532A82020a7553q8504b3620A49249E8092c8881E0290c9372m5878
$$ -262647 -125532 182020 -17553 -106057 -23620 149249 58092 -38881 50290 -39372 -85250
9479h5250D778b40336F499b51848E1513a16680k69981J63993R1842F4171c55203
$$ -85250 4778 -240336 6499 -251848 51513 -116680 -386661 -222668 -130826 64171 -355203
9467A81031a92428j2278H1207a15765q1534A82075f0743A20256b18256q6554d2343
$$ 181031 -192428 -204706 81207 -115765 -197299 182075 -60743 120256 -218256 -304810 -42343
9455C9427J53609c68417J41359f9179m1180C16000i8720j17640E3973e6688C6289
$$ 39427 193036 -368417 -227058 -69179 -110359 316000 -98720 -216360 53973 -56688 36289
9443c11354J37037B03353h8171K9405E6139K6420L9683a22193E277i0189i906
$$ -311354 -174317 203353 -88171 -58766 56139 82559 122242 -122193 5277 -90189 -9906
9431f4390o0531e7894j70522N0219A01330O61J21264n8853j081d6726E7971a22660
$$ -64390 -124921 -57894 -228416 -178197 101330 101991 223255 164402 163321 -46726 57971 -122660
9418f147A37043d1448B9660J97389b1199A04006b14622J7435B9400O5901a64137
$$ -6147 137043 -41448 29660 227049 -21199 104006 -214622 -197187 29400 95301 -164137
9406C98137e3141j78551g9992q7830A87122f7073q1537e5989K3674l4311k56649
$$ 398137 -53141 -231692 -79992 -167822 187122 -67073 -148610 -55989 -32315 -66626 -323275
9395c23275b0099A37353B3414M9503n007A1307M8699b48716A71935f0394B14965
$$ -323275 -20099 137353 23414 72917 67910 11307 60006 -248716 171935 -60394 214965
9383A83309M0282g0992n5252B53420b41481A34285a30906M2347H3193C6246K5397
$$ 183309 223591 -70992 -126244 253420 -241481 134285 -130906 -88559 83193 36246 61643
9372F1643c7095A6876J19799J8111c9570m342n434j68165o8197f2059A01713a84055
$$ 61643 -37095 16876 136675 154786 -39570 -43912 -49346 -217511 -285708 -62059 101713 -184055
9359g9109n8028I8911k3078B7395c1664m44620b32635N5071J8860K4918j50871
$$ -79109 -137137 98911 75833 27395 -31664 -476284 -232635 -177564 -158704 -133786 -284657
9348b84657h9063d4201n0467k25089A83483G11d05487B51465f7970c3732B1182
$$ -284657 -89063 -44201 -94668 -319757 183483 711 -405487 251465 -67970 -33732 21182
9336c11774A8438g3579n8137K7351I9843c80488A65048g0816A3813J26726L031
$$ -311774 18438 -73579 -131716 -104365 99843 -380488 165048 -70816 13813 140539 143570
9325A43570c70625a13534A15890a33362c8358m902r9303R484J4883J5843F7997
$$ 143570 -370625 -113534 115890 -133362 -38358 -43260 -142563 -133079 -118196 -102353 67997
9313a63071n39r5214b550j37756A29578b18601d1763j63713A9748a03329j37660
$$ -163071 -163610 -258824 -2550 -140306 129578 -218601 -41763 -205476 19748 -103329 -240989
9302b40989a2729A4267K41244G0567a68992O6976D3541c24509J30388o771R533
$$ -240989 -12729 14267 255511 70567 -168992 -102016 43541 -324509 -194121 -200892 -191359
9291a91359j22027O2205b1215A19628b15920G0806a61820f1299j23091j53247
$$ -191359 -313386 -251181 -21215 119628 -215920 70806 -161820 -61299 -184390 -337637
9281c37637I8358a29813a1565j14309K5064j08477k1490O0837P1598H5856J3667
$$ -337637 98358 -129813 -11565 -125874 -100810 -209287 -230777 -169940 -98342 85856 99523
9270I9523a54468O4078Q757j14103P8810j38698D2002c34866h2925l3769K6338
$$ 99523 -154468 -90390 -81633 -195736 -116926 -255624 42002 -334866 -82925 -116694 -90356
9259i0356A26O9285K0931K15179A08319B2066Q6303b31040N0060a919k53841a6662
$$ -90356 126 69411 90342 305521 108319 22066 108369 -231040 -180980 -1919 -255760 -16662
9246a25700k89405A47529o2359a07926m0801r6180A99016f6583B9232h9745j49589
$$ -125700 -415105 147529 85170 -107926 -148727 -244907 199016 -66583 29232 -89745 -239334
9235b39334c6702o2155L8732q1068o0693g3315j68905E3213J55812a30520C7324
$$ -239334 -36702 -98857 -60125 -141193 -201886 -73315 -242220 53213 209025 -130520 37324
9223D0779J39894a37459C65558D779d09082J67316A08978c00379J39914A96591
$$ 40779 180673 -137459 365558 4779 -409082 -241766 108978 -300379 -160465 196591
9212B8920Q5475a65384B95240A84J69929c72237e3338j04881k6591R1622G5290
$$ 28920 114395 -165384 295240 184 170113 -372237 -53338 -158219 -184810 -93188 75290
9200A65469H0875o856a01107A11659J31798O1012b53845B40836a21288F6646a50036
$$ 165469 80875 74019 -101107 111659 243457 304469 -253845 240836 -121288 66646 -150036
9188B8504b25383A52404a44166O5725j61674H3745m1121g224q0910B47490b636
$$ 28504 -225383 152404 -144166 -78441 -240115 83745 42624 -7224 -88134 247490 -2636
9176A09811e4116B3822O263J43936a90623P9114G3543b17040a05583B11959b60219
$$ 109811 -54116 23822 30085 174021 -190623 -111509 73543 -217040 -105583 211959 -260219
9164c67787A88711g4853J0641A34227m9966g6013H9800a62614k53668A01716c78064
$$ -367787 188711 -74853 -64212 134227 84261 -76013 89800 -162614 -416282 101716 -378064
9152d4345j90263J10396e3595q4251A12450k6477b98484i1839E7741a24822B64247
$$ -44345 -234608 -124212 -53595 -137846 112450 85973 -298484 -91839 57741 -124822 264247
9140a26978B8156d09885a62342q6246R3442e7564B2250b09218G6279b7362A13954
$$ -126978 28156 -409885 -162342 -248588 -155146 -57564 22250 -209218 76279 -27362 113954
9128d8526q0708j0080e0430G4472C999J59228c11450a16122k3856k49488C97224
$$ -48526 -129234 -139314 -50430 74472 3999 163227 -311450 -116122 -139978 -389466 397224
9116b16410A89387b18801R5031l5178D04932a58436b7555j44397A03098B9171
$$ -216410 189387 -218801 -123770 -158948 404932 -158436 -27555 -171952 103098 29171
9105b41172b0146k81460R9135B88809b27734d6264b0775j56357K8491d1483A35162
$$ -241172 -20146 -301606 -202471 288809 -227734 -46264 -20775 -177132 -148641 -41483 135162
9093f0644k3257A05782b08812Q6621C2569O2419e5727K870o9924k5992J7608b6835
$$ -60644 -83901 105782 -208812 -122191 32569 94988 -55727 -52857 -122781 -148773 -131165 -26835
9080a7635G9068O1550a60524M7150A0728a18828I4438b56163j75243A73577c72306
$$ -17635 79068 140618 -160524 -113374 10728 -118828 94438 -256163 -431406 173577 -372306
9068a29726n9799m2012R7904A1124J40007A931c5926q9761a3737j46960c040l16730
$$ -129726 -189525 -231537 -133633 11124 151131 1931 -35926 -125687 -13737 -160697 -3040 -319770
9056c19770c5124B97673i4322p3532C7585f4753B57126A0228R5384Q8628d1316
$$ -319770 -35124 297673 -94322 -167854 37585 -64753 257126 10228 105612 194240 -41316
9044A07617f1971I7820a00424k2378k64078h5197j80003E7953h8425J4256E0706
$$ 107617 -61971 97820 -100424 -122802 -386880 -85197 -265200 57953 -88425 -74169 50706
9032c49781A42J7264O0538e6142C3706N969a3779k12812d3921j3613j33611L5006
$$ -349781 142 17406 77944 -56142 33706 39675 -13779 -226591 -43921 -57534 -191145 -156139
9020a56139A33486j3799k1233g171j18821a4030B28091P8943a38972A83135h9801
$$ -156139 133486 119687 98454 -7171 -125992 -14030 228091 307034 -138972 183135 -89801
9008i833A30449e5677p5064M5717b4836i078F4740f91r0770D3352b22363J3853
$$ -9833 130449 -55677 -130741 -85024 -24836 -9078 64740 -691 -91461 43352 -222363 -208510
8996b08510k7882F1450l595N3192b13694k1035h1462j80538C5480c887p8796n5019
$$ -208510 -236392 61450 57855 111047 -213694 -234729 -81462 -262000 35480 -3887 -82683 -137702
8984a37702C418J59141a05204D7119J23155b8701j14728b3752A31374n0958d1608
$$ -137702 3418 162559 -105204 47119 170274 -28701 -143429 -23752 131374 80416 -41608
8972a78212c3191H0175a35295F385h8551j90029a9126l68082a7529j05895J6938
$$ -178212 -33191 80175 -135295 6385 -88551 -278580 -19126 -387208 -17529 -123424 -106486
8961a06486A27337C140a20728C4639Q4812b38841c9860j55287l1130A23897k4391
$$ -106486 127337 3140 -120728 34639 119451 -238841 -39860 -195147 -226277 123897 99506
8950I9506h2836A80820K2208a57564A57120b80485K6799d39j51133p5210i89A40839
$$ 99506 -82836 180820 203028 -157564 157120 -280485 -253686 -439 -151572 -226782 -989 140839
8937c8836k82310a7326l8654j39421m86R2492A43337f8842G7757n253P0675B1862
$$ -38836 -321146 -17326 -55980 -195401 -195887 -103395 143337 -68842 77757 72504 143179 21862
8924A87436b7418I5904i3060c7440C50004J023959L192697A301500A95006i9299
$$ 187436 -27418 95904 -93060 -37440 350004 1373963 4566660 1301500 195006 -99299
8913g3039A05793a3761j13267f1422o2728n2819O3677j21291A31079J87368D285
$$ -73039 105793 -13761 -127028 -61422 -124150 -176969 -113292 -234583 131079 318447 4285
8901E2167k4394b3836B24365a45995A15369b25966a0906A7560a18146M2439B27118
$$ 52167 27773 -23836 224365 -145995 115369 -225966 -10906 17560 -118146 -75707 227118
8889A099e1819j35955p361R1295M3866o3468d3209k5054A74637a24255k2896C5064
$$ 1099 -51819 -187774 -195135 -103840 -59974 -123442 -43209 -68263 174637 -124255 -147151 35064
8876a10610a0417A6756J14640c5034H1065h3055j30527B5953b34262f2345n0994
$$ -110610 -10417 16756 131396 -35034 81065 -83055 -213582 25953 -234262 -62345 -113339
8865a13339n5627N9136o3513n0644A85916a46808k24740B8705c5931B91269H8925
$$ -113339 -168966 -109830 -173343 -223987 185916 -146808 -371548 28705 -35931 291269 88925
8853A98324c16906H5270M7136C3011a44291B69234a40769o2135N8766j23718A02207
$$ 198324 -316906 85270 132406 33011 -144291 269234 -140769 -202904 -144138 -267856 102207
8841b35839a14685o6528G7473J44246A1475c31917a65676b3106j14337j51146
$$ -235839 -114685 -181213 77473 221719 11475 -331917 -165676 -23106 -137443 -288589
8831b88589a9377k40284B68902D9133C594N1589k7278b53583b2063A4169g6606
$$ -288589 -19377 -259661 268902 49133 3594 55183 27905 -253583 -22063 14169 -76606
$$ [...]
##END NTUPLES=NMR SPECTRUM
##END=
