##TITLE=NES1016_872015062_9265836_VDkpNgDeP0
##JCAMPDX= 6.0         $$ Bruker NMR JCAMP-DX V2.0
##DATA TYPE= NMR SPECTRUM
##DATA CLASS= NTUPLES
##ORIGIN= BRUKER
##OWNER= Administrator
$$ 1.72 TOPSPIN		Version 2.1
$$ 2015-08-24 15:15:40.311 -0700  Administrator@X
$$ Compression mode = diff/dup
##.OBSERVE FREQUENCY= 400.02188249412
##.OBSERVE NUCLEUS= ^1H
##.ACQUISITION MODE= SIMULTANEOUS (DQD)
##.ACQUISITION SCHEME= undefined
##.AVERAGES= 64
##.DIGITISER RES= 22
##SPECTROMETER/DATA SYSTEM= spect
##.PULSE SEQUENCE= noesygpps1d.comp
##.SOLVENT NAME= COFFEE_meoh
##.SHIFT REFERENCE= INTERNAL, COFFEE_meoh, 1, 14.9631
##AUDIT TRAIL= $$ (NUMBER, WHEN, WHO, WHERE, PROCESS, VERSION, WHAT)
$$ ##TITLE= Audit trail, TOPSPIN		Version 2.1
$$ ##JCAMPDX= 5.01
$$ ##ORIGIN= Bruker BioSpin GmbH
$$ ##OWNER= Administrator
$$ $$ E:\/data/COFFEE/nmr/NES1016_872015062_9265836_VDkpNgDeP0/22/pdata/1/auditp.txt
$$ ##AUDIT TRAIL=  $$ (NUMBER, WHEN, WHO, WHERE, PROCESS, VERSION, WHAT)
(   1,<2015-08-24 15:15:34.811 -0700>,<Administrator>,<X>,<go>,<TOPSPIN 2.1>,
      <created by zg
	started at 2015-08-24 15:04:05.420 -0700,
	POWCHK enabled, PULCHK disabled,
       configuration hash MD5:
       21 0F 79 D6 B3 7B B4 F6 88 20 88 DB 03 48 BD 9F
       data hash MD5: 64K
       0A 8E 14 01 58 7F AB 7A AA EC EC B0 4F 1C 23 A7>)
(   2,<2015-08-24 15:15:38.217 -0700>,<Administrator>,<X>,<proc1d>,<TOPSPIN 2.1>,
      <Start of raw data processing
       efp LB = 0.3 FT_mod = 6 PKNL = 1 PHC0 = 0 PHC1 = 0 SI = 128K 
       data hash MD5: 128K
       8B FF ED 4A B9 94 D0 AB 93 34 23 8C F1 09 31 FC>)
(   3,<2015-08-24 15:15:39.092 -0700>,<Administrator>,<X>,<proc1d>,<TOPSPIN 2.1>,
      <pk PHC0 = -85.45715 PHC1 = 0 
       data hash MD5: 128K
       D4 06 36 4E B0 FB 64 40 03 F1 8B 13 C3 DD 98 CA>)
(   4,<2015-08-24 15:15:39.483 -0700>,<Administrator>,<X>,<proc1d>,<TOPSPIN 2.1>,
      <abs ABSG = 1 
       data hash MD5: 128K
       79 C8 4A A2 C3 06 7D 11 29 B8 D6 BF 9D 78 B1 16>)
(   5,<2015-08-24 15:15:39.592 -0700>,<Administrator>,<X>,<proc1d>,<TOPSPIN 2.1>,
      <abs ABSG = 2 
       data hash MD5: 128K
       3E 74 86 71 FE 36 8E 6F CE 52 1C 39 20 13 11 21>)
(   6,<2015-08-24 15:15:39.670 -0700>,<Administrator>,<X>,<proc1d>,<TOPSPIN 2.1>,
      <abs ABSG = 3 
       data hash MD5: 128K
       19 14 6D 34 45 74 C4 52 50 FE 00 8F BF 0B A3 94>)
(   7,<2015-08-24 15:15:39.764 -0700>,<Administrator>,<X>,<proc1d>,<TOPSPIN 2.1>,
      <abs ABSG = 4 
       data hash MD5: 128K
       60 3D 88 F6 E6 0D E0 6C BB A7 0C 6C 89 AB 85 72>)
(   8,<2015-08-24 15:15:39.889 -0700>,<Administrator>,<X>,<proc1d>,<TOPSPIN 2.1>,
      <abs ABSG = 5 
       data hash MD5: 128K
       F8 23 6A 11 F6 37 4D B0 13 20 C1 69 4A 46 6A AD>)
$$ ##END=
$$ 
$$ $$ hash MD5
$$ $$ 52 7C 82 E0 14 5B 4E 21 CC DC B8 F5 E3 3F 9C E4
##$RELAX= 
##$RELAX= 
##$RELAX= 
##$RELAX= 
##$RELAX= 
##$RELAX= 
##$RELAX= 
##$RELAX= 
$$ Bruker specific parameters
$$ --------------------------
##$DU= <E:\>
##$EXPNO= 22
$$ [...]
150 150 150 150 150 150 150 150
##$TP07= 0
##$TPNAME0= <>
##$TPNAME1= <>
##$TPNAME2= <>
##$TPNAME3= <>
##$TPNAME4= <>
##$TPNAME5= <>
##$TPNAME6= <>
##$TPNAME7= <>
##$TPOAL= (0..7)
0.5 0.5 0.5 0.5 0.5 0.5 0.5 0.5
##$TPOFFS= (0..7)
0 0 0 0 0 0 0 0
##$TUNHIN= 0
##$TUNHOUT= 0
##$TUNXOUT= 0
##$USERA1= <user>
##$USERA2= <user>
##$USERA3= <user>
##$USERA4= <user>
##$USERA5= <user>
##$V9= 5
##$VALIST= <valist>
##$VCLIST= <CCCCCCCCCCCCCCC>
##$VD= 0
##$VDLIST= <DDDDDDDDDDDDDDD>
##$VPLIST= <PPPPPPPPPPPPPPP>
##$VTLIST= <TTTTTTTTTTTTTTT>
##$WBST= 2048
##$WBSW= 25
##$XGAIN= (0..3)
0 0 0 0
##$XL= 0
##$YL= 0
##$YMAX_a= 6091815
##$YMIN_a= -12280725
##$ZGOPTNS= <>
##$ZL1= 120
##$ZL2= 120
##$ZL3= 120
##$ZL4= 120
##$ABSF1= 14.9631
##$ABSF2= -5.595081
##$ABSG= 5
##$ABSL= 3
##$ALPHA= 0
##$AQORDER= 0
##$ASSFAC= 0
##$ASSFACI= 0
##$ASSFACX= 0
##$ASSWID= 0
##$AUNMP= <proc_prof1d_extract.lims>
##$AXLEFT= 0
##$AXNAME= <>
##$AXNUC= <1H>
##$AXRIGHT= 0
##$AXTYPE= 0
##$AXUNIT= <>
##$AZFE= 0.1
##$AZFW= 0.1
##$BCFW= 0
##$BC_mod= 0
##$BYTORDP= 0
##$COROFFS= 0
##$CY= 15
##$DATMOD= 1
##$DC= 0
##$DFILT= <>
##$DTYPP= 0
##$F1P= 0
##$F2P= 0
##$FCOR= 0.5
##$FTSIZE= 131072
##$FT_mod= 6
##$GAMMA= 0
##$GB= 0
##$INTBC= 1
##$INTSCL= 1
##$ISEN= 128
##$LB= 0.3
##$LEV0= 0
##$LPBIN= 0
##$MAXI= 10000
##$MC2= 0
##$MEAN= 0
##$ME_mod= 0
##$MI= 0
##$NCOEF= 0
##$NC_proc= -2
##$NLEV= 6
##$NOISF1= 0
##$NOISF2= 0
##$NSP= 0
##$NTH_PI= 0
##$NZP= 0
##$OFFSET= 14.9631
##$PC= 1
##$PHC0= -85.45715
##$PHC1= 0
##$PH_mod= 1
##$PKNL= yes
##$PPARMOD= 0
##$PPDIAG= 0
##$PPIPTYP= 0
##$PPMPNUM= 2147483647
##$PPRESOL= 1
##$PSCAL= 4
##$PSIGN= 0
##$PYNMP= <proc.py>
##$REVERSE= no
##$SF= 400.020008798053
##$SI= 131072
##$SIGF1= 0
##$SIGF2= 0
##$SINO= 400
##$SIOLD= 131072
##$SPECTYP= <>
##$SREGLST= <1H.CDCl3>
##$SSB= 0
##$STSI= 131072
##$STSR= 0
##$SW_p= 8223.68421052631
##$SYMM= 0
##$S_DEV= 0
##$TDeff= 65536
##$TDoff= 0
##$TI= <>
##$TILT= no
##$TM1= 0
##$TM2= 0
##$TOPLEV= 0
##$USERP1= <user>
##$USERP2= <user>
##$USERP3= <user>
##$USERP4= <user>
##$USERP5= <user>
##$WDW= 1
##$XDIM= 131072
##$YMAX_p= 414889036
##$YMIN_p= -11062
##$CURPLOT= <Network HP LaserJet P1505>
##$CURPRIN= <$Network HP LaserJet P1505>
##$DFORMAT= <normdp>
##$LAYOUT= <+/1D_H.xwp>
##$LFORMAT= <normlp>
##$PFORMAT= <normpl>
##$SURQMSG= 1
$$ End of Bruker specific parameters
$$ ---------------------------------
##NTUPLES= NMR SPECTRUM
##VAR_NAME=  FREQUENCY,     SPECTRUM/REAL,   SPECTRUM/IMAG
##SYMBOL=    X,             R,               I
##VAR_TYPE=  INDEPENDENT,   DEPENDENT,       DEPENDENT
##VAR_FORM=  AFFN,          ASDF,            ASDF
##VAR_DIM=   131072,        131072,          131072
##UNITS=     HZ,            ARBITRARY UNITS, ARBITRARY UNITS
##FACTOR=    0.0627417313425164, 1,          1
##FIRST=     8223.62146879497, -302,         -42268
##LAST=      0,             222,             -42492
##MIN=       0,             -11062,          0
##MAX=       8223.62146879497, 414889036,    0
$$ Real data points
##PAGE= N=1
##DATA TABLE= (X++(R..R)), XYDATA
$$ [...]
67496 93356 93797 94815 95568 95497 94912 94526 94670 95059 95179 94783 94077 93466 93216 93435 94316 96044 98355 100466
67478 100466 101776 102435 102958 103478 103797 104061 104831 106307 107943 109144 110036 111125 112379 113142 113073 112757 113098
67461 113098 114265 115569 116309 116445 116364 116283 116096 115701 115183 114719 114425 114315 114316 114358 114496 114842 115269 115337 114753 113814
67441 113814 113140 113043 113375 113899 114439 114700 114387 113670 113170 113287 113775 114172 114322 114247 113829 112961 111874 111019 110711
67422 110711 111067 112109 113651 115204 116328 117014 117526 117950 118123 117963 117665 117570 117954 118840 119888 120620 120951
67405 120951 121283 121911 122604 123088 123615 124565 125611 125910 125188 124137 123575 123626 123986 124596 125651 127081 128355
67388 128355 128886 128506 127600 126807 126596 127026 127862 128796 129528 129833 129712 129413 129176 129042 129003 129116 129338 129460 129497
67369 129497 129871 130858 132050 132835 133244 133801 134634 135322 135636 135820 136016 136014 135807 135830 136323 136944 137358 137813 138725
67350 138725 140057 141484 142813 143867 144314 144154 144077 144793 146129 147295 147936 148367 148798 148937 148540 147925 147673
67333 147673 148060 148926 149900 150593 150755 150452 150082 150119 150786 151899 152983 153677 154084 154662 155663 156852 157877
67316 157877 158685 159453 160357 161638 163614 166236 168878 170941 172505 173939 175058 175327 174904 174763 175465 176362
67300 176362 176493 175875 175372 175479 175875 176225 176886 178407 180586 182485 183492 184032 184938 186337 187598 188298 188701
67283 188701 189039 188986 188332 187796 188370 189952 191382 191939 192122 192737 193873 195190 196663 198455 200333 201779
67267 201779 202560 202821 202738 202508 202550 203258 204498 205660 206266 206321 206171 206326 207341 209444 212106 214304 215350
67250 215350 215416 215181 215215 215711 216595 217701 218940 220402 222213 224316 226516 228738 231017 233220 235017 236231
67234 236231 237058 237762 238297 238387 237962 237440 237571 238922 241305 243703 245036 245185 245144 245996 247887 250159 252285
67217 252285 254352 256633 259009 261033 262429 263407 264484 266037 267970 269781 270980 271539 271924 272677 273943
67202 273943 275380 276552 277454 278629 280703 283782 287326 290554 292881 294074 294327 294340 295050 296944 299612
67187 299612 302147 303974 305222 306424 308109 310531 313461 316223 318246 319655 321115 322980 324901 326341
67173 326341 327246 328075 329447 331901 335571 339773 343192 344994 345679 346511 348167 350336 352498 354533 356465
67158 356465 358151 359590 361205 363455 366315 369366 372283 374990 377492 379844 382237 384856 387675 390610
67144 390610 393774 397322 400991 404101 406179 407482 408831 410939 413940 417406 420763 423731 426452 429209
67130 429209 432074 434892 437543 440098 442722 445552 448675 452091 455660 459179 462527 465690 468666 471518
67116 471518 474495 477910 481842 486141 490743 495703 500753 505151 508352 510711 513181 516354 520122 524227
67102 524227 528656 533336 537860 541903 545701 549743 554077 558253 561942 565351 568951 572974 577284 581603
67088 581603 585852 590293 595276 600719 606016 610680 614977 619609 624832 630214 635351 640414 645836 651739
67074 651739 657818 663625 668775 673180 677285 681872 687347 693361 699287 704902 710383 715872 721343 726748
67060 726748 732058 737261 742532 748186 754227 760254 766124 772377 779439 786728 793295 799272 805859 813639
67046 813639 821646 828543 834160 839380 844945 851016 857660 865078 873270 881848 890342 898480 906141 913303
67032 913303 920127 927009 934409 942533 951154 959811 968323 977029 986292 995808 1004804 1013023 1021105 1029770
67018 1029770 1038940 1048020 1056797 1065621 1074810 1084282 1093808 1103335 1112902 1122425 1131714 1140701 1149569 1158561
67004 1158561 1167656 1176560 1185193 1193965 1203280 1212827 1221890 1230443 1239461 1249836 1261364 1273085 1284291
66991 1284291 1294884 1305084 1315193 1325457 1335787 1345836 1355643 1365868 1376940 1388239 1398725
66980 1398725 1408227 1417566 1427434 1437748 1448099 1458340 1468563 1478906 1489545 1500548 1511706 1522718
66968 1522718 1533507 1544089 1554250 1563848 1573362 1583574 1594609 1605759 1616395 1626600 1636672 1646502
66956 1646502 1655754 1664431 1672946 1681756 1691059 1700672 1710143 1719141 1727762 1736273 1744654 1752717 1760592 1768659
66942 1768659 1776987 1785218 1793057 1800464 1807450 1814159 1821116 1828683 1836168 1842255 1846660 1850738 1856010 1862632
66928 1862632 1869680 1876386 1882522 1888074 1893156 1898040 1902807 1907202 1911142 1914888 1918329 1920671 1921506 1921713
66914 1921713 1922543 1924125 1925662 1926785 1927773 1928618 1928872 1928579 1928435 1928796 1929231 1929301 1929075 1928588 1927503 1925688 1923504
66897 1923504 1921128 1918165 1914432 1910572 1907322 1904542 1901646 1898624 1895947 1893513 1890409 1885847 1879907 1873275
66883 1873275 1866608 1860228 1854038 1847612 1840664 1833561 1827030 1821188 1815222 1808400 1801156 1794646 1789158 1783450
66869 1783450 1776027 1766823 1757177 1748231 1739877 1731426 1722771 1714325 1706031 1697106 1686953 1675887 1664720
66856 1664720 1653950 1643566 1633387 1623246 1612981 1602561 1592202 1582118 1572224 1562299 1552339 1542502
66844 1542502 1532708 1522646 1512304 1502165 1492651 1483569 1474354 1464742 1454930 1445123 1435259 1425247 1415183
66831 1415183 1405099 1394760 1384005 1373164 1362856 1353333 1344267 1335148 1325679 1315791 1305593 1295433
66819 1295433 1285719 1276520 1267516 1258465 1249418 1240290 1230597 1220040 1209157 1198900 1189602 1180771 1171912
66806 1171912 1163092 1154571 1146268 1137919 1129466 1120989 1112391 1103490 1094374 1085433 1076986 1069018 1061326 1053762
66792 1053762 1046256 1038684 1030879 1022848 1014922 1007564 1000888 994411 987370 979342 970550 961633 953208 945606
66778 945606 938825 932596 926534 920278 913615 906567 899365 892176 884786 876780 868211 859909 852758 846693
66764 846693 840758 834236 827402 820949 815027 809202 803268 797599 792510 787563 781879 775177 768226 762143
66750 762143 757389 753623 750359 747319 744119 740093 734878 728956 723215 718036 713114 708106 702985 697685
66736 697685 691908 685619 679459 674261 670163 666435 662222 657288 652031 646960 642265 637887 633800 630035
66722 630035 626390 622328 617433 611920 606507 601765 597740 594155 590731 587217 583382 579204 574994 571195
66708 571195 567984 565071 561879 558032 553766 549774 546482 543552 540271 536358 532197 528388 525280 522818
66694 522818 520454 517369 513243 508840 505302 502766 500219 496896 493215 489985 487252 484512 481596 478661
66680 478661 475505 471682 467337 463294 460092 457394 454567 451514 448660 446339 444446 442642 440720 438695
66666 438695 436558 434074 431052 427853 425247 423510 421942 419675 416745 413905 411497 409112 406420 403739
66652 403739 401495 399573 397601 395591 393900 392634 391388 389568 386863 383507 380208 377700 376205 375337
66638 375337 374515 373363 371721 369556 367048 364514 362061 359508 356863 354642 353326 352567 351400 349378 347188
66623 347188 345819 345272 344468 342468 339470 336390 333739 331312 328966 327116 326121 325524 324453 322696 320942
66608 320942 319915 319684 319911 320299 320483 319877 318074 315340 312422 309904 307955 306545 305582 304842 304004 302821
66592 302821 301111 298718 295745 292831 290904 290415 290930 291547 291656 291239 290557 289720 288605 287105 285333 283550
66576 283550 281960 280698 280002 280178 281245 282716 283854 284218 283896 283266 282564 281679 280329 278452 276369 274455
66560 274455 272698 270802 268727 266865 265515 264419 263063 261297 259422 257786 256541 255717 255226 254772 253989
66545 253989 252807 251559 250696 250404 250426 250182 249228 247747 246397 245462 244390 242475 239795 237064 234745 232814
66529 232814 231277 230224 229335 228076 226621 225924 226418 227196 227067 225947 224597 223320 221699 219565 217416
66514 217416 215725 214334 212798 210968 209109 207694 207121 207308 207536 207105 206182 205578 205559 205402 204388 202784
66498 202784 201424 200622 199985 199121 198092 197169 196476 195973 195541 194999 194183 193087 191922 191014 190605 190637 190716 190460
66480 190460 189943 189616 189746 190138 190507 190759 190765 190192 188961 187633 186873 186670 186469 186011 185556 185260 184860 184167 183498
66461 183498 183312 183627 183994 183945 183357 182511 181892 181738 181720 181272 180297 179261 178482 177653 176315 174524 172772 171437
66443 171437 170589 170162 169991 169778 169353 168942 168872 169053 169072 168825 168723 169127 169810 170155 169815 169098 168752 169330 170635
66424 170635 171832 172256 172023 171648 171209 170293 168807 167367 166665 166754 167171 167507 167521 166978 165766 164115 162404
66407 162404 160768 159138 157601 156402 155529 154632 153476 152314 151677 151856 152690 153769 154798 155731 156529 156856
66391 156856 156244 154667 152726 151100 149978 149258 149011 149289 149626 149340 148451 147771 147861 148323 148416 147968 147282 146481
66373 146481 145459 144357 143602 143398 143502 143562 143435 143135 142674 142037 141225 140291 139399 138750 138334 137787 136674 134919
66355 134919 132942 131448 131044 131797 132985 133541 132956 131644 130348 129464 129115 129452 130413 131435 131929 131917 131819
66338 131819 131744 131546 131412 131746 132423 132727 132211 131112 129853 128639 127728 127497 127966 128656 129169 129460 129410 128689
66320 128689 127374 126171 125583 125285 124729 123910 123101 122348 121779 121971 123271 125057 126369 127132 128014 129149 129762
66303 129762 129113 127207 124459 121298 118349 116440 116006 116704 117804 118831 119695 120442 121027 121288 121105 120637
66287 120637 120245 120032 119729 119206 118779 118641 118367 117548 116594 116202 116180 115638 114382 113264 112950 113141 113386 113908
66269 113908 115041 116380 117133 117080 116680 116372 116156 115785 115091 114227 113717 114026 114937 115588 115338 114349 113234 112457
66251 112457 112232 112600 113299 113848 114014 113945 113719 113183 112440 111997 112025 111925 111082 109684 108406 107636 107478 108054 109129
66232 109129 109786 109260 108030 107380 107800 108462 108414 107708 107102 107056 107359 107543 107441 107338 107566 107955 107920 107258 106558
66213 106558 106428 106532 105905 104148 101904 100151 99437 99743 100589 101276 101469 101640 102463 103758 104551 104344 103769
66196 103769 103644 103883 103757 102970 101943 101131 100524 99939 99499 99590 100339 101295 101763 101455 100703 99995 99539 99369 99568
66177 99568 100083 100543 100636 100577 100812 101326 101700 101791 101913 102289 102759 103133 103402 103507 103319 103052 103257 104133 105151 105646
66157 105646 105546 105279 105229 105499 105908 105972 105058 102898 99932 97057 95146 94685 95486 96594 96894 96107 94994
66140 94994 94421 94502 94828 95148 95503 96036 96942 98342 99832 100539 100066 99089 98548 98537 98500 98274 98205 98330 98258 97950
66120 97950 97963 98560 99148 98961 97912 96439 94916 93657 93178 93892 95573 97502 99097 100164 100623 100398 99629
66103 99629 98697 97868 97111 96340 95672 95377 95637 96347 97054 97127 96294 95075 94406 94648 95176 95152 94483 93686 93039
66084 93039 92334 91494 90927 91012 91541 91970 92022 91792 91430 91047 90828 90917 91158 91205 90915 90458 90054 89772 89548 89285
66064 89285 88940 88676 88787 89288 89714 89641 89304 89338 89984 90941 91958 93041 93972 94193 93478 92334 91389 90709 90066
66045 90066 89526 89305 89245 88970 88519 88376 88802 89478 89933 90051 90068 90248 90663 91137 91327 90972 90123 89046 87946
66026 87946 86900 86022 85524 85523 85957 86756 87998 89774 91874 93725 94788 95127 95472 96491 98047 99399 100214
66009 100214 101024 102477 104425 106119 107144 107762 108302 108612 108301 107328 106172 105467 105583 106450 107689 108856
65993 108856 109656 110010 110042 109974 109902 109652 108987 107985 107040 106399 105864 105067 103832 102151 100095 97978 96360 95497
65975 95497 94933 93991 92580 91178 90118 89323 88709 88397 88386 88393 88213 87921 87582 87078 86454 86078 86197 86510 86545
65956 86545 86304 86246 86697 87523 88316 88715 88568 88051 87581 87403 87279 86827 86185 86000 86650 87703 88340 88194 87570
65937 87570 87004 86823 87035 87345 87252 86446 85229 84338 84186 84470 84665 84714 84956 85524 86142 86473 86373 85828 84968
65918 84968 84192 83911 84072 84245 84307 84644 85443 86212 86347 85888 85251 84460 83218 81697 80724 80914 81934 82820
65900 82820 82871 82225 81704 82116 83468 84878 85478 85344 85235 85456 85478 84797 83707 82893 82591 82573 82694 82972 83209
65881 83209 83020 82387 81780 81531 81340 80739 79888 79521 79991 80651 80441 78976 76848 74969 73930 73930 74856 76104
65863 76104 76691 76008 74444 73004 72361 72521 73158 73853 74084 73545 72630 72167 72507 73232 73912 74676 75739 76814
65845 76814 77487 77878 78402 78984 79067 78436 77599 77258 77733 78975 80786 82767 84361 85254 85664 86041 86556 87044
65827 87044 87375 87709 88328 89327 90505 91525 92141 92286 92021 91471 90895 90684 91098 91922 92570 92663 92425 92344 92546
65808 92546 92725 92659 92455 92195 91633 90539 89167 88060 87419 86991 86521 85963 85216 84085 82744 81837 81823 82431
65790 82431 83099 83670 84282 84800 84871 84479 83916 83238 82259 81134 80392 80194 80056 79638 79363 79864 81111 82480
65772 82480 83438 83794 83452 82409 80960 79590 78649 78275 78428 78751 78568 77471 75837 74452 73726 73635 74263
65755 74263 75834 78066 80017 80846 80473 79365 77990 76634 75421 74267 73069 72068 71720 71983 72135 71634
65739 71634 70836 70470 70669 71045 71477 72196 73099 73650 73626 73418 73332 73087 72415 71725 71697 72464 73684 75168 76872
65720 76872 78330 78770 78003 76711 75650 74916 74244 73567 72882 71929 70551 69260 68890 69567 70478 70827 70672
65703 70672 70573 70685 70593 70000 69222 68866 69195 69975 70865 71723 72495 73060 73397 73740 74255 74613 74268 73327 72671 72935
65683 72935 73668 73986 73820 73930 74708 75608 75986 75978 76166 76685 77161 77341 77347 77291 77000 76325 75486 74970 75098 75783 76689
65662 76689 77509 78047 78124 77668 76991 76685 76927 77050 76227 74563 73068 72460 72469 72490 72400 72311 71977 71119 70187 70153 71423
65641 71423 73338 74836 75297 74719 73506 72237 71384 71072 71241 71980 73361 74849 75354 74256 72181 70446
65625 70446 69763 69757 69697 69379 69176 69439 70010 70351 70032 69111 68102 67611 67876 68527 68837 68399 67616 67306 67680 67949
65605 67949 67211 65562 63979 63202 63146 63437 64025 64943 65859 66334 66418 66577 67023 67501 67812 68217 69035 70074 70739
65586 70739 70663 69924 68648 66762 64395 62298 61394 61831 62840 63664 64338 65270 66292 66694 66180 65354 65013
65569 65013 65259 65551 65516 65377 65671 66697 68226 69633 70345 70309 69981 69775 69599 69109 68333 67771 67792 68146 68271
65550 68271 67962 67561 67472 67673 67789 67578 67232 67228 67906 69129 70271 70559 69633 67883 66207 65363 65522 66382 67557
65531 67557 68789 69931 70907 71655 72058 72009 71691 71579 71933 72334 72030 70871 69617 69176 69683 70514 71070 71327
65513 71327 71609 72040 72370 72329 72032 71872 71995 72075 71749 71119 70576 70216 69794 69291 69092 69381 69721 69589 69127 68977
65493 68977 69425 70063 70376 70415 70690 71527 72626 73332 73370 73280 73908 75364 76724 76973 76096 74989 74408 74298 74076
65474 74076 73194 71451 69152 67105 66154 66494 67571 68697 69570 70156 70392 70205 69641 68798 67798 66912 66452
65457 66452 66369 66239 65873 65715 66271 67331 68106 68087 67490 66907 66795 67285 68149 68941 69398 69720 70224 70809 71115
65438 71115 71175 71483 72236 72892 72760 71808 70639 69854 69677 70066 70869 71848 72740 73364 73665 73728 73792 74116 74716 75341
65418 75341 75767 76011 76154 76090 75637 74848 74056 73601 73522 73514 73211 72628 72304 72738 73670 74253 74099 73851 74465 76202
65398 76202 78587 81070 83259 84761 85369 85462 85700 86192 86379 85946 85463 85879 87608 90310 93367 96399 99466
65381 99466 102914 106898 111012 114646 117795 121205 125545 130709 136201 141888 147914 154002 159313 163105
65367 163105 165266 166145 166186 165864 165671 165839 166022 165448 163528 160340 156518 152633 148731 144464 139646 134551
65351 134551 129663 125241 121206 117403 113945 111274 109860 109696 110132 110340 109954 109193 108452 108015 108060 108604 109306
65334 109306 109667 109590 109462 109484 109254 108340 107027 106090 105859 105880 105560 104936 104762 105921 108621 112085 115155 117427
65316 117427 119564 122291 125343 127834 129427 130608 131755 132528 132299 130817 128279 125121 121911 119106 116673
65301 116673 114201 111546 109012 106716 104207 101111 97878 95333 93650 92198 90446 88563 87019 85927
65287 85927 85012 84021 82985 82129 81630 81411 81131 80529 79856 79791 80762 82358 83612 83885 83391 82785 82413 82087
65269 82087 81518 80752 80136 79974 80263 80579 80185 78517 75819 73170 71617 71290 71548 71846 72156 72614 73202 73909
65251 73909 74789 75641 75931 75365 74338 73488 72967 72478 71963 71782 72144 72686 72867 72651 72535 72884 73420 73509 72996
65232 72996 72564 73027 74302 75365 75414 74794 74542 75171 76235 76988 77074 76540 75601 74644 74205 74625 75727 76971
65214 76971 77913 78494 78992 79758 80879 82039 82885 83557 84564 85953 86919 86659 85482 84588 84658 85144 85173 84770
65196 84770 84740 85571 86969 88520 90352 92889 96155 99577 102464 104603 106449 108766 111921 115390 118044
65181 118044 119103 118761 117812 116747 115347 113096 109764 105611 101238 97377 94644 93230 92714 92216 90883
65166 90883 88412 85213 82064 79547 77812 76767 76278 76054 75621 74735 73825 73701 74719 76412 78039 79263
65150 79263 80135 80609 80393 79353 77878 76640 76003 75752 75499 75301 75657 76776 78068 78651 78286 77526 76921
65133 76921 76446 75843 75131 74445 73600 72270 70560 69062 68273 68168 68384 68548 68396 67875 67311 67276 68050 69344
65115 69344 70691 71973 73364 74833 76066 76934 77756 78959 80645 82698 85132 88058 91320 94474 97251
65100 97251 99853 102679 105911 109495 113376 117477 121529 125148 128158 130610 132496 133705 134341 134795 135262
65085 135262 135342 134397 132288 129530 126744 124183 121805 119512 117137 114409 111213 107789 104492 101401 98412
65070 98412 95701 93737 92659 91920 90833 89329 87837 86509 84962 82944 80888 79512 78962 78629 77838
65055 77838 76566 75380 74733 74390 73664 72275 70799 70081 70261 70674 70711 70414 70099 69773 69241 68518 67811 67233
65037 67233 66840 66798 67162 67633 67881 68016 68355 68777 68743 68021 67019 66317 66185 66573 67245 67771 67783 67379 67019 66903
65017 66903 66702 66030 64912 63693 62781 62542 63087 64043 64892 65670 66921 68707 70204 70664 70417 70398 70943 71553
64999 71553 71754 71644 71622 71976 72837 74201 75838 77354 78445 79088 79530 80141 81073 81976 82279 81964 81769 82338
64981 82338 83344 83830 83223 81715 79811 77928 76392 75382 74796 74375 73963 73455 72682 71660 70779 70364 70151
64964 70151 69659 69008 68917 69812 71316 72648 73160 72529 70932 69158 68119 68063 68594 69443 70751 72455 73947
64947 73947 74707 74869 74864 74792 74495 73955 73307 72628 72005 71641 71625 71724 71596 71117 70405 69735 69537 70177 71459 72605
64927 72605 72930 72406 71454 70537 70122 70609 71880 73198 73957 74274 74474 74338 73427 71958 70711 70074 69751 69442
64909 69442 69243 69179 68904 68195 67373 66891 66712 66447 66006 65779 66086 66587 66422 65029 62828 60921 60087 60257
64891 60257 61058 62425 64279 65898 66338 65496 64239 63348 62871 62642 62801 63398 63948 63992 63812 64031 64630 64861
64873 64861 64201 63004 62119 62127 62971 64077 64777 64823 64577 64533 64741 64888 64903 65115 65757 66581 67124 67187 66994 67008 67628
64852 67628 68810 69889 70020 68954 67260 65684 64525 63786 63644 64388 65943 67706 68891 68928 67690 65605
64836 65605 63536 62243 61894 62181 62810 63640 64440 64927 65223 65868 67130 68495 69196 69095 68748 68677 68906 69225
64818 69225 69488 69522 69060 68022 66704 65480 64480 63809 63876 65042 66916 68422 68819 68395 67936 67774 67659
64801 67659 67382 67065 66794 66348 65506 64432 63597 63385 63815 64505 64916 64858 64804 65408 66619 67618 67815 67508 67276
64782 67276 67122 66732 66324 66548 67532 68618 69186 69248 69034 68508 67593 66492 65457 64542 63928 64141 65484 67395
64764 67395 68837 69310 69178 69044 69106 69182 69048 68637 68051 67471 67049 66891 67146 67912 68931 69587 69488 68914 68447
64745 68447 68303 68288 68262 68242 68051 67341 66172 65227 65192 65985 66837 67106 66907 66907 67553 68547 69146 68976 68422 68149 68400
64724 68400 68930 69441 69826 69999 69811 69231 68516 68140 68544 69826 71550 72987 73719 73900 73791 73319 72426 71591
64706 71591 71438 71813 71753 70596 68731 67069 66097 65701 65635 65847 66405 67324 68393 69161 69237 68744 68321 68530 69348
64687 69348 70237 70603 70157 69085 67958 67276 66976 66549 65742 65031 65207 66588 68696 70635 71777 72170 72240
64670 72240 72079 71227 69430 67352 66103 66136 67073 68539 70495 72597 73959 73954 72883 71527 70426 69894 70153
64653 70153 70946 71428 71035 70165 69510 69063 68408 67671 67403 67669 68068 68647 69967 72019 73832 74568 74543 74721
64635 74721 75596 76985 78596 80316 82004 83416 84438 85288 86449 88366 90996 93662 95553 96426 96674
64620 96674 96680 96448 95910 95212 94529 93878 93374 93325 93785 94274 94335 94189 94450 95231 95959 96126 95864 95635 95617 95610 95424
64599 95424 95127 94913 94833 94744 94546 94440 94774 95514 96014 95552 94097 92329 90875 89773 88823 88165 88178 88919 90015
64580 90015 91172 92478 94035 95532 96459 96688 96601 96627 96828 96998 97014 97031 97348 98085 98961 99502 99542 99426 99563
64561 99563 99946 100337 100714 101099 101013 99753 97532 95771 95727 97114 98626 99610 100543 101851 103038 103345 102746
64544 102746 101823 100926 99964 98884 97877 97045 96281 95574 95083 94693 93771 91762 88932 86184 84056 82191
64528 82191 79960 77374 75123 73822 73501 73846 74629 75734 76950 77948 78475 78474 78026 77229 76177 75074 74305
64511 74305 74165 74426 74388 73672 72823 72753 73625 74666 75156 75118 74930 74733 74617 74920 75792 76680 76773 75956 74884 74171
64491 74171 73895 73913 74202 74776 75545 76410 77283 77975 78309 78417 78635 79018 79202 78836 77998 77111 76654 77007 78261
64472 78261 79995 81441 82142 82384 82831 83784 84931 85747 85999 85872 85753 86006 86883 88480 90583 92626 94028
64455 94028 94704 95070 95479 95844 95951 95874 95878 96136 96828 98265 100548 103202 105519 107161 108084 108144 107344 106379 106226
64436 106226 106974 107669 107595 107255 107697 109249 111343 113310 114987 116642 118621 120995 123417 125469 127259 129374
64420 129374 132087 134918 137276 139236 141275 143449 145260 146300 146643 146617 146495 146405 146262 145736 144484 142479
64404 142479 139965 137137 134104 131140 128689 126923 125400 123346 120346 116778 113545 111325 110062 109232
64390 109232 108516 108061 108056 108353 108625 108741 108804 108928 109157 109516 109996 110538 111125 111774 112368 112663 112585 112357 112221 112205
64370 112205 112315 112716 113443 114129 114365 114309 114610 115710 117446 119374 121239 122999 124590 125907 127034 128358
64354 128358 130268 132684 135033 136828 138184 139561 141139 142817 144812 147726 151744 156150 160007 163123
64340 163123 166037 169299 173159 177820 183558 190489 198486 207360 217060 227783 239996 254155 270278
64327 270278 288077 307661 329716 354620 381750 410215 439887 470909 502182 531078 554821
64316 554821 571669 580744 581496 573881 558688 537254 510987 481355 450016 418597 388394 360305
64304 360305 334812 311939 291517 273607 258342 245324 233608 222572 212441 203700 196373 190221
64292 190221 185318 181919 179881 178567 177261 175492 173209 170938 169457 168901 168345 166764 164236 161671 159501
64277 159501 157231 154401 151299 148390 145551 142388 139033 136151 134207 133093 132455 132021 131611 131128 130684
64262 130684 130513 130579 130464 129840 128954 128405 128550 129368 130823 132917 135221 136788 136990 136296 135853 136352 137664
64245 137664 139453 141570 143742 145439 146489 147451 148996 151110 153209 154847 155949 156638 157279 158493 160594
64230 160594 162996 164643 165074 164721 164212 163894 164027 164816 165983 166859 167295 168061 169925 172698 175698 178901
64214 178901 183020 188534 195192 202610 210874 220370 231326 243756 257700 273349 291040 311177 334053
64201 334053 359703 387988 418687 451309 484859 518059 549695 578388 602060 618156 624792 621570
64189 621570 609289 589283 563321 533645 502457 471185 440466 410721 382487 356308 332581
64178 332581 311502 292906 276207 260789 246478 233463 221900 211859 203504 196835 191255 185938
64166 185938 180771 176477 173553 171467 169274 166654 163958 161567 159672 158555 158450 159050 159552 159422 158847
64151 158847 158327 158058 157856 157488 156876 156103 155374 154927 154874 155156 155644 156184 156558 156577 156342 156254 156578 157018 156909 155921
64131 155921 154448 153245 152698 152529 152160 151232 149775 148070 146480 145324 144748 144731 145310 146655 148733 151002
64115 151002 152806 154099 155428 157136 159016 160959 163446 166967 171300 175880 180608 185714 190985 195928
64101 195928 200831 206897 214910 224215 233435 241861 249726 257374 264697 271295 276836 281262 284928 288521
64087 288521 292574 297067 301668 306324 311406 317391 324575 332976 342225 351624 360569 368943 376801 383719
64073 383719 388750 391069 390369 386655 380094 371324 361547 351900 342714 333637 324407 315320 306938 299585
64059 299585 293257 287908 283645 280570 278543 277288 276825 277584 279853 283157 286523 289485 292621 296948 302848
64044 302848 309642 316042 320890 323663 324541 324069 322706 320657 318057 315048 311687 308053 304539 301764 299904
64029 299904 298423 296797 295288 294601 294955 295973 297436 299568 302441 305635 308794 312158 316243 321268 327148
64014 327148 333806 341159 349016 357291 366180 375835 386045 396560 407559 419387 431885 444441 456810
64001 456810 469528 483349 498553 515009 532696 551876 572781 595350 619403 644977 672318
63990 672318 701456 731971 763443 796095 830792 868384 909359 954114 1003019 1056057 1112946
63979 1112946 1174113 1241102 1315552 1398273 1490182 1593865 1713300 1852056 2012805 2198861
63969 2198861 2415273 2667858 2961763 3301370 3690628 4132268 4626503 5170826 5760920
63960 5760920 6391583 7057280 7752422 8470743 9203392 9936983 10653355 11331328 11949512
63951 11949512 12489285 12937092 13284813 13528058 13664097 13690981 13607431 13412708 13107332 12695548
63941 12695548 12187716 11600033 10951803 10262732 9551281 8833141 8120102 7420821 6743187
63932 6743187 6095664 5486341 4921517 4405455 3940573 3527049 3162576 2843189 2564424
63923 2564424 2321775 2110849 1927816 1769510 1632737 1513901 1409702 1317841 1236562 1163937
63913 1163937 1098308 1039049 986048 938470 894792 854069 816371 781645 748889 716886 685323
63902 685323 654689 625407 597519 571003 545872 521998 499235 477775 457993 439871 422875
63891 422875 406626 391377 377549 364972 352966 341169 329955 319922 311236 303595 296533 289540
63879 289540 282175 274501 267287 261359 256748 252782 249019 245658 242953 240770 238968 237773 237303 236968 235838
63864 235838 233615 230894 228507 226885 226062 225900 226134 226424 226603 226818 227291 227906 228143 227470 225820 223576 221035
63847 221035 217996 214083 209470 205020 201546 199018 196642 193652 189925 185990 182527 179809 177486 174934
63833 174934 171826 168304 164636 160968 157492 154628 152782 151938 151562 150850 149102 146151 142565 139247 136680
63818 136680 134728 133232 132396 132288 132284 131524 129856 127981 126687 126257 126505 127004 127206 126749 125784 124748 123787
63801 123787 122700 121542 120868 121118 121986 122725 122960 122935 122976 122973 122532 121501 120188 118998 117999 116950 115754 114654
63783 114654 113909 113419 112867 112122 111351 110804 110656 110992 111704 112402 112648 112357 111855 111519 111471 111618 111811 111940 111946 111830
63763 111830 111609 111320 111046 110831 110492 109799 108973 108708 109325 110131 110122 109263 108560 108812 109804 110880 111731 112338 112636
63744 112636 112748 113194 114372 116002 117562 119093 121056 123453 125735 127664 129715 132300 135053 137334 139144
63729 139144 141077 143449 145998 148462 150994 153699 156137 157689 158376 158975 160218 162072 163829 164788 164761
63714 164761 164126 163498 163267 163290 163026 162005 160123 157557 154615 151819 149829 148926 148545 147620 145508 142483
63698 142483 139328 136638 134549 132954 131735 130813 130131 129684 129622 130288 131984 134572 137330 139386 140354 140557
63682 140557 140699 141417 143018 145375 148009 150410 152365 153933 155202 156260 157306 158470 159414 159471 158362
63667 158362 156566 154750 153002 150985 148709 146769 145703 145395 145315 145185 145183 145569 146337 147357 148671 150490
63651 150490 152908 155760 158823 162063 165580 169383 173329 177274 181199 185203 189427 194043 199286 205560
63637 205560 213430 223298 234891 247208 259301 271150 283587 297254 311766 325893 338337 348270
63625 348270 355361 359618 361256 360619 358156 354469 350284 346269 342867 340302 338688 338062 338339 339240 340255
63610 340255 340670 339710 336693 331194 323275 313736 304018 295516 288784 283380 278507 273767 269414 266057 264135
63595 264135 263569 263903 264833 266486 269015 272072 274952 277195 278754 279708 280207 280754 282009 284204 287093 290641
63579 290641 295215 300801 306630 312115 317770 324607 332879 342114 352155 363361 375606 387759 398417
63566 398417 406685 412103 414432 413832 410835 405751 398596 389972 381525 374865 370280 367033 364711 363580
63552 363580 363686 364365 364815 364573 363158 359857 354333 347120 339108 330854 322820 315840 310622 306746 302827
63537 302827 297859 291996 285841 279493 272709 265580 258445 251251 243595 235577 228121 222152 217708 214144
63523 214144 210978 208137 205470 202552 199192 195839 193139 191228 189730 188329 187030 185846 184644 183430
63509 183430 182443 181783 181201 180541 180103 180222 180699 181124 181649 182871 184925 187236 189392 191787 195066 199272
63493 199272 203875 208410 212780 217144 221742 226549 230846 233550 234417 234580 235405 237006 238473 239308 239928
63478 239928 240831 242042 243537 245488 247833 250156 252335 254780 257795 261261 265267 270359 276563 282655
63464 282655 287116 289612 290964 291948 292799 293737 295159 297200 299619 302326 305572 309488 313837 318385 323171
63449 323171 328301 333834 340032 347415 356404 367110 379584 394045 410702 429538 450219 471902
63437 471902 493142 512379 528675 541693 551014 556042 556835 554482 550250 544716 538168 531335 525022
63424 525022 519249 513517 507873 502992 498980 494740 488908 480977 471160 459671 446763 433248 420268
63411 420268 408395 397375 386831 376829 367591 359110 351407 344900 339998 336440 333428 330453 327677
63398 327677 325523 324320 324455 326397 330232 335522 341994 350029 359997 371314 382787 393848 404844
63385 404844 416045 427021 437364 447506 458305 470112 482607 495324 507852 519643 530026
63374 530026 538394 544197 546921 546488 543562 539102 533663 527504 521263 515950 512166 509742 508194 507093
63360 507093 505877 503855 500730 496741 491995 486077 478720 470487 462298 454478 446767 439130 432017 425836
63346 425836 420643 416409 413097 410368 407555 404115 399858 394657 388352 381148 373742 366740 360140 353667
63332 353667 347390 341662 336582 331885 327367 323125 319330 316006 313151 310856 309214 308263 308072 308802 310483
63317 310483 312873 315668 318799 322363 326200 329705 332208 333480 333725 333097 331431 328508 324424 319538 314191
63302 314191 308684 303484 299128 295786 293065 290380 287426 284295 281246 278491 276097 273943 271768 269314
63288 269314 266484 263408 260460 258145 256795 256288 256165 256057 255874 255606 255161 254518 253873 253537 253783 254779 256415
63271 256415 258074 258881 258488 257508 256931 257202 258100 259392 261255 264004 267671 271949 276409 280689 284572 287946
63255 287946 290739 293010 295196 298047 302055 306940 311964 316768 321780 327744 335004 343252 351860 360465
63241 360465 369343 379172 390298 402347 414727 427444 441173 456614 474046 493414 514413 536321
63229 536321 558155 579286 599792 620061 640229 660148 679700 698882 717706 736282 754945
63218 754945 774188 794451 816080 839292 863927 889204 913903 936845 957124 973952 986455
63207 986455 993710 994941 989689 977985 960490 938434 913282 886320 858436 830195 802049 774585
63195 774585 748666 725334 705378 688887 675342 664215 655366 648789 644253 641618 641389 644424 650914
63182 650914 660006 670602 682157 694474 707249 720328 734137 749249 765565 782343 798961 815232
63170 815232 831069 846379 861346 876329 891335 905937 919787 932748 944432 953998 960688 964218
63158 964218 964495 961280 954370 943889 930237 913995 895948 876904 857374 837698 818562 800947
63146 800947 785339 771404 758744 747666 738898 732717 728634 725722 723050 720029 716582 712801 708403
63133 708403 702825 695982 688523 681139 674050 667431 661773 657307 653493 649648 645846 642691 640433 638845
63119 638845 637794 637373 637536 638116 639136 640672 642524 644432 646527 649106 652070 655030 657805 660278 662004
63104 662004 662666 662858 663641 665208 666677 667375 667608 667906 668297 668773 669799 671734 674146 676306 678068 679742
63088 679742 681390 682872 684411 686472 689070 691680 693916 695853 697620 699137 700456 701998 704166 706958
63074 706958 710194 713987 718677 724357 730735 737483 744565 752115 760181 768759 778041 788463 800396 813881
63060 813881 828729 844841 862395 881726 903046 926290 951298 978217 1007604 1039966 1075230
63049 1075230 1112885 1152640 1194579 1238575 1283827 1329211 1373823 1416992 1458123 1497001 1534159
63038 1534159 1570502 1606522 1642109 1677076 1711537 1745784 1780065 1814459 1848612 1881520 1911790
63027 1911790 1938079 1959033 1972928 1977923 1972822 1957275 1931281 1895060 1849683 1797230 1739781 1678461
63015 1678461 1613953 1547804 1482699 1421265 1364824 1313366 1266451 1223998 1186408 1154228 1127793
63004 1127793 1107070 1091696 1081139 1074960 1073054 1075593 1082587 1093529 1107609 1124198 1142945 1163355
62992 1163355 1184632 1206148 1227923 1250356 1273472 1296650 1319228 1341243 1363277 1385479 1406932
62981 1406932 1426129 1441914 1453677 1460779 1462301 1457510 1446127 1427912 1402430 1369731 1330939 1287700
62969 1287700 1241104 1191578 1139695 1086572 1033541 981906 932967 887604 845633 806129 768674
62958 768674 733936 702731 674940 649720 626497 605307 586279 569159 553433 538700 524870
62947 524870 512086 500480 489986 480421 471668 463675 456332 449493 443104 437208 431877 427295 423671
62934 423671 420780 417700 413463 408092 402664 398201 394694 391343 387481 383184 379091 375711 372866 369873
62920 369873 366337 362495 358665 354790 350994 348062 346611 346015 345007 343334 341887 341162 340607 339820 339332
62905 339332 339533 339703 338940 337497 336321 335678 335048 334147 333227 332479 331808 331209 330764 330219 329076 327165 324821
62888 324821 322458 320312 318533 317226 316361 315823 315504 315273 315132 315496 316931 319304 321610 322998 323578 323866
62872 323866 323981 323968 324431 325964 328165 329987 330964 331452 331753 331799 331633 331469 331212 330580 329786 329399 329440 329299 328631
62853 328631 327657 326440 324617 322118 319432 316856 314189 311508 309505 308474 307683 306450 305314 305323 306452
62838 306452 307556 307831 307554 307347 307379 307572 308084 309182 310780 312346 313335 313668 313820 314390 315488 316687 317596
62821 317596 318327 319238 320491 322168 324627 328241 332696 337002 340488 343529 346967 350964 354861 358245 361725
62806 361725 366308 372278 379101 386350 394110 402439 411035 419883 429757 441455 454804 469062 484177
62793 484177 500994 520229 541930 566182 593605 624722 659342 697094 738287 783741 833936
62782 833936 888794 948210 1012283 1080912 1153427 1228732 1305614 1382852 1459052 1532364 1600340
62771 1600340 1660283 1709979 1748110 1773937 1786867 1786602 1773555 1748699 1712993 1667231 1612572 1550908
62759 1550908 1484450 1414995 1343731 1271669 1200026 1130092 1062845 998854 938540 882315 830355
62748 830355 782434 738206 697603 660729 627400 597044 569156 543633 520550 499774 480927
62737 480927 463638 447757 433358 420603 409492 399761 391162 383769 377793 373076 369105 365585 362650
62724 362650 360376 358545 357193 357048 358914 362729 367698 373251 379440 386440 394225 402929 413037 424922
62710 424922 438473 453504 470299 489457 511272 535598 562326 591824 624876 662201 703868
62699 703868 749064 796643 846102 897794 951850 1007051 1061192 1112431 1159738 1201984 1237325
62688 1237325 1263998 1281316 1289368 1288031 1276926 1256273 1227199 1191097 1149143 1102580 1053019 1002120
62676 1002120 951164 901044 852414 805666 760995 718728 679444 643632 611366 582427 556522
62665 556522 533257 512085 492488 474127 456809 440542 425683 412699 401576 391701 382476 373749
62653 373749 365502 357495 349484 341493 333594 325765 318249 311697 306536 302476 299017 296090 293763 291716
62639 291716 289580 287510 285791 284145 282116 279967 278365 277276 276016 274486 273442 273287 273408 273113 272476
62624 272476 271825 271088 270253 269909 270652 272282 274178 276190 278574 281350 284342 287789 292260 297889 304173
62609 304173 310670 317541 325312 334381 344910 356986 370699 386100 403172 421941 442782 466569
62597 466569 494226 525913 560793 597747 636149 675766 716140 756349 795267 831680 864179
62586 864179 891237 911606 924644 930270 928675 920092 904858 883768 858233 829841 799628 767907
62574 767907 734815 700873 667045 634535 604504 577458 552719 528965 505710 483922 464816
62563 464816 448352 433438 419350 406298 394653 384299 374977 366657 359200 352047 344710 337351 330520
62550 330520 324382 318631 313091 307986 303485 299336 295256 291446 288403 286317 284958 284102 283750 283953 284774
62535 284774 286507 289545 293842 298875 304319 310373 317184 324469 332193 341175 352328 365581 380273
62522 380273 396420 414797 435751 458753 483347 509818 538666 569995 603666 639365 676218
62511 676218 712919 748543 782660 814358 841900 863860 879943 890191 894022 890804 880792 864752
62499 864752 843138 816520 786485 755124 723666 692360 661481 631571 602712 574549 547262
62488 547262 521798 498899 478535 460509 444953 431896 420901 411472 403398 396409 389949 383670
62476 383670 377785 372633 368172 364249 361075 359015 358001 357430 356675 355635 354902 355439 357847 361835 366488
62461 366488 371057 375316 379314 383252 387722 393555 401056 409573 418044 425764 432441 437806 441554 443623
62447 443623 444250 443652 441668 437708 431181 422259 412193 402545 393937 385842 377704 369806 362771 356640
62433 356640 351006 345885 341804 338973 336863 334891 333198 332486 333266 335472 338650 342280 345984 349770 354062
62418 354062 359252 365158 371174 377034 383100 389684 396427 402766 408868 415529 423095 430969 438407 445343
62404 445343 452122 458733 464758 469930 474333 478107 481220 483539 484986 485700 486165 486918 487912 488474 488289 488182
62388 488182 489431 492405 496408 500855 506069 512773 521302 531512 543092 555723 569286 584244 601538
62375 601538 621832 644950 670272 697514 726871 758539 792312 827557 863336 898555 932192
62364 932192 963383 991233 1014610 1032453 1044435 1051228 1053897 1053046 1048649 1040697 1029679 1016108 999765
62351 999765 979846 956032 929134 900580 871573 842912 815214 788849 763845 740221 718355
62340 718355 698691 681213 665560 651570 639324 628668 619095 610197 601946 594432 587553 581076 574884
62327 574884 569136 564348 561159 559809 559914 560932 562633 564850 567045 568709 570076 571855 574210 576548
62313 576548 578420 580068 581842 583605 585057 586218 587238 588021 588511 589136 590577 593087 596285 599586 602706
62298 602706 605796 609152 612708 615872 618082 619561 621243 623822 627150 630654 634038 637381 640852 644614
62284 644614 648908 654018 660264 668091 677875 689464 702129 715255 729020 744202 761453 780981
62272 780981 802831 827244 854579 884899 917606 951636 986115 1020730 1055230 1088654 1119444
62261 1119444 1146368 1168987 1187116 1200276 1208007 1210513 1208628 1203165 1194428 1182271 1166492 1147287
62249 1147287 1125469 1102195 1078398 1054504 1030645 1007019 984093 962603 943304 926519 912005
62238 912005 899455 888933 880464 873403 866849 860738 855905 852873 851177 850136 849670 849876 850264 850112 849356
62223 849356 848592 848199 847931 847421 846713 846172 846040 846185 846249 846065 845922 846328 847531 849466 852097 855542 859808
62206 859808 864702 870039 875719 881592 887613 894132 901628 910185 919665 930337 942659 956396 970656
62193 970656 985005 999730 1014738 1029231 1043066 1057506 1073626 1090618 1106747 1121672 1136803
62182 1136803 1153571 1172310 1192836 1215101 1239030 1264369 1290846 1317920 1344366 1368743 1390388
62171 1390388 1409360 1425426 1437822 1446194 1451114 1453449 1453768 1452526 1450139 1446415 1440405 1431342 1419519
62158 1419519 1406020 1391812 1377298 1362433 1347092 1331519 1316524 1303008 1291286 1281137 1272421
62147 1272421 1265084 1258526 1251695 1244127 1236375 1229079 1222147 1215266 1208621 1202476 1196405 1189687 1182352 1175148
62133 1175148 1168506 1162173 1155979 1150333 1145687 1141918 1138647 1135816 1133556 1131695 1129971 1128786 1129220 1132014
62119 1132014 1136868 1143072 1150548 1159616 1169664 1178542 1183730 1184027 1180071 1173569 1166332 1159766 1154758 1151720
62105 1151720 1150580 1150439 1149288 1144677 1135300 1121879 1106276 1089992 1073830 1058492 1044686 1032660
62093 1032660 1022268 1013566 1006767 1001589 997285 993585 991085 990475 991849 994973 999704 1005803 1012839 1020710
62079 1020710 1029868 1040537 1052032 1063327 1074062 1084489 1094575 1103665 1110953 1115769 1117406 1115293
62067 1115293 1109642 1101592 1092364 1082347 1071208 1058742 1045326 1031442 1016909 1000820 982378 961781
62055 961781 940194 918863 898312 878370 858776 839599 821154 803728 787412 772149 757832
62044 757832 744351 731642 719767 708877 698899 689268 679298 669016 659383 651367 644884 638994 632947
62031 632947 626641 620123 613231 605902 598392 590909 583381 575839 568711 562351 556482 550482 544177 537990
62017 537990 532399 527581 523676 521048 519935 519883 519816 518880 517217 515703 514891 514465 513877 513160 512665 512188 511006
62000 511006 508897 506493 504285 501797 498285 493905 489545 485579 481439 476594 471506 467254 464421 462696
61986 462696 461486 460693 460704 461765 463563 465560 467652 470261 473731 477867 482260 486937 492405 498985 506360
61971 506360 513874 521197 528502 536025 543629 550921 557735 564437 571696 580037 589545 599897 610656 621561
61957 621561 632553 643536 654377 665399 677674 692285 709200 727405 746367 766814 789579
61946 789579 814198 839376 864599 890558 918053 947241 978065 1010643 1044929 1080497 1116965
61935 1116965 1154272 1192422 1231512 1272280 1316051 1363785 1415616 1471634 1532638 1599707 1673604
61924 1673604 1755229 1846269 1948712 2063860 2192356 2335022 2493032 2667255 2857971 3065266
61914 3065266 3289263 3529776 3785722 4054543 4331578 4609902 4880924 5135047 5361684
61905 5361684 5549476 5687790 5768739 5788097 5745160 5642942 5488559 5292235 5064836 4816051
61895 4816051 4554433 4287983 4023830 3767484 3522683 3291688 3075525 2874415 2688528
61886 2688528 2518248 2363518 2223265 2095876 1980034 1874837 1779494 1693418 1616350 1547843
61876 1547843 1486727 1431561 1381585 1336742 1296876 1261433 1229934 1202119 1177530 1155617 1136502
61865 1136502 1121010 1109465 1100991 1094564 1090349 1089322 1091786 1096989 1104127 1112965 1123274 1134333 1145352
61852 1145352 1155993 1166154 1175618 1184271 1192345 1200044 1207109 1213151 1218339 1223457 1229268 1236035 1243552
61839 1243552 1251422 1259327 1267161 1274827 1281910 1287834 1292414 1295815 1297794 1297591 1295111 1291710 1289037 1287358
61825 1287358 1285799 1284067 1283003 1283432 1285459 1289162 1294998 1303066 1312818 1324193 1338309 1356306 1378059
61812 1378059 1402813 1430585 1462025 1497240 1535840 1578013 1624509 1675404 1729927 1787926 1850750
61801 1850750 1920102 1996597 2080019 2170653 2269804 2379177 2500162 2633656 2780330 2941256
61791 2941256 3118500 3314894 3532947 3774245 4040225 4333142 4655539 5008691 5392060
61782 5392060 5804196 6243195 6705403 7183650 7666958 8141534 8591359 8998044 9341547
61773 9341547 9602758 9766682 9824396 9773525 9618226 9368787 9040222 8649979 8215909 7755104
61763 7755104 7282993 6812409 6353232 5912862 5496603 5107388 4745802 4411259 4103381
61754 4103381 3821974 3566016 3333423 3122023 2930273 2756839 2600030 2458033 2329330
61745 2329330 2212475 2105742 2007558 1917167 1834410 1758806 1689292 1624961 1565548 1510913 1460421
61734 1460421 1413296 1369422 1329305 1293122 1260144 1229258 1199800 1171744 1145356 1120921 1098631
61723 1098631 1078316 1059277 1040689 1022358 1004985 989486 976029 963696 951087 937375 922936
61712 922936 908932 896185 884499 873091 861428 849432 837140 824705 812709 801941 792557 783827
61700 783827 774958 765967 757526 750245 744322 739646 735919 732845 730499 729348 729552 730399 730796 730226 728816
61685 728816 726506 722658 716626 708375 698309 686797 674124 660735 647238 634179 621925 610632
61673 610632 600234 590572 581734 574159 568184 563596 559937 557236 556069 556617 557974 558726 558094 556139 552976
61658 552976 548361 542264 535338 528418 521838 515617 510015 505409 501694 498312 494866 491345 487827 484431
61644 484431 481535 479496 478022 476276 473783 470871 468148 465943 464332 463216 462252 461177 460300 460110 460253
61629 460253 459638 457938 456252 455770 456375 457201 457960 458909 459926 460541 460734 460891 460980 460416 458788 456226 453118
61612 453118 449970 447425 445847 444974 444472 444632 445865 447681 449004 449502 449806 450314 450624 450493 450645 452083
61596 452083 454975 458598 462092 465083 467845 471045 475150 480050 485497 491635 498615 505955 513051 520263
61582 520263 528622 538390 548833 559640 571571 585255 600311 616353 634020 654200 676859 701503
61570 701503 728297 757765 789629 822780 856196 889025 919884 946926 968856 985419 996898
61559 996898 1003687 1006396 1005863 1002936 998513 993688 989436 986192 984054 983184 983577 984741 986304 988710 992527
61544 992527 997097 1000755 1002620 1003362 1003860 1003859 1002519 999703 995981 991606 986175 979338 971413 963270 955856
61529 955856 949852 945577 943120 942533 943767 946482 950308 955497 962992 973613 987391 1004030 1023780
61516 1023780 1047415 1075422 1107616 1143625 1183458 1227454 1275940 1329114 1387278 1451074 1521440
61505 1521440 1599166 1684501 1777386 1878197 1987934 2107203 2235048 2369040 2506385 2644481
61495 2644481 2780474 2911006 3032803 3143126 3239346 3318624 3378736 3419214 3441268 3446884 3438558
61484 3438558 3419654 3393894 3363997 3331364 3297487 3264934 3236079 3211035 3187447 3162246 3133089
61473 3133089 3098350 3056675 3007064 2949057 2882666 2808601 2728895 2646959 2566485 2490223 2419835
61462 2419835 2356503 2301132 2253961 2214435 2181734 2155364 2135194 2121050 2112475 2108886 2109859 2115149
61450 2115149 2124419 2137180 2153126 2172422 2195481 2222583 2254049 2290773 2334172 2385281 2443959
61439 2443959 2508936 2578190 2648867 2716943 2777507 2825917 2859152 2876590 2879891 2872168 2856924 2837242
61427 2837242 2815410 2792930 2770800 2749975 2731660 2717099 2707156 2702305 2703080 2710232 2724140 2743910
61415 2743910 2766816 2788381 2803167 2806205 2794530 2767881 2728294 2679262 2625018 2569765 2516711
61404 2516711 2467559 2422915 2383046 2348082 2317693 2290993 2266923 2244703 2224061 2205298 2189166
61393 2189166 2176463 2167666 2163009 2162893 2168008 2178963 2195964 2219011 2248387 2284788 2329054 2381939
61381 2381939 2444178 2516494 2599229 2692013 2794049 2904706 3023428 3148931 3278804 3410153
61371 3410153 3540265 3666246 3784214 3889400 3977140 4043659 4086408 4104539 4099293 4073304 4029040
61360 4029040 3968066 3891797 3802392 3702540 3594634 3480431 3361254 3238289 3113011 2987618
61350 2987618 2864757 2746440 2633400 2525756 2424066 2329307 2242038 2162056 2088964 2022689
61340 2022689 1963359 1911004 1865556 1827002 1795320 1770244 1751208 1737630 1729238 1726027 1727875 1734522
61328 1734522 1746102 1763325 1786556 1814702 1845415 1876406 1906137 1933441 1957307 1977388 1994152
61317 1994152 2008165 2019672 2029194 2037936 2047102 2057122 2067931 2079497 2091622 2103686 2115289 2126863
61305 2126863 2139106 2152072 2165380 2178970 2192925 2206776 2219626 2230850 2240039 2246493 2249564 2249436
61293 2249436 2246794 2241760 2233870 2223135 2210212 2195406 2178426 2159604 2140555 2123115 2108112 2095669
61281 2095669 2086125 2079945 2076914 2075956 2075596 2074243 2070286 2062487 2050496 2034924 2017050 1998404 1980199
61268 1980199 1962717 1945361 1927483 1909052 1890506 1872507 1856147 1842940 1833945 1828985 1827204 1828342
61256 1828342 1832979 1841658 1854386 1871257 1892989 1920573 1954787 1996479 2046960 2107478 2178290 2258677
61244 2258677 2347849 2445244 2549618 2658077 2765989 2867231 2954273 3019089 3055612 3062051 3040745
61233 3040745 2995932 2932065 2853841 2766359 2674372 2581739 2491956 2408635 2334909 2272755 2223382
61222 2223382 2187782 2166265 2157800 2160364 2171441 2187392 2202724 2211246 2208426 2192480 2163589 2123081
61210 2123081 2073491 2018393 1961450 1905697 1853558 1806829 1766245 1731419 1701394 1675047 1651103
61199 1651103 1628413 1606350 1584529 1562146 1538314 1513229 1488351 1465032 1443353 1422521 1401936
61188 1401936 1381513 1361459 1342101 1323679 1306015 1288626 1271341 1254479 1238330 1222949 1208653
61177 1208653 1196143 1185738 1176925 1169081 1162274 1156953 1153156 1150445 1148320 1146127 1142654 1136253 1125490
61164 1125490 1109693 1089098 1064748 1038057 1010241 982142 954536 928251 903771 880981 859448
61153 859448 838789 818750 799333 780990 764291 749141 734715 720384 706348 693075 680569
61142 680569 668605 657381 647461 639199 632586 627543 624004 621775 620665 620772 622475 626085 631607 638856
61128 638856 647732 658303 670482 683630 696752 709255 721105 731879 740175 744701 745728 744729 742791
61115 742791 740276 737860 736661 736942 737786 738552 739710 741632 743506 744314 744116 743444 741969 738882 734371 729777
61099 729777 726157 723265 719961 715171 708514 700434 691824 683361 675284 667765 661057 655131 649645 644503
61085 644503 639985 636120 632447 628653 624922 621483 618482 616475 616223 617587 619487 621417 624158 628402
61071 628402 633592 638784 643892 649344 655363 662296 670813 680908 691456 701611 711753 722244 732219
61058 732219 740752 748292 755769 763085 769723 775973 782214 787851 792476 797328 803982 812211 820815 829880
61044 829880 840481 852663 865677 879818 896070 914236 933394 954051 977835 1005161 1035228
61033 1035228 1068213 1105274 1146308 1190009 1236460 1287484 1344029 1405145 1469733 1537028 1605261
61022 1605261 1672583 1740098 1811674 1890216 1976559 2072280 2180343 2301808 2434885 2578439
61012 2578439 2733749 2902445 3087181 3296398 3544504 3845239 4209347 4651336 5193251
61003 5193251 5858668 6670756 7664037 8892659 10419073 12300559 14591934 17330524 20454208
60994 20454208 23693636 26576233 28619274 29593823 29638836 29141001 28520802 28110485 28140177
60985 28140177 28706721 29674926 30633445 31038232 30486404 28908499 26541062 23747815 20856252
60976 20856252 18094672 15596653 13418510 11558977 9987238 8667312 7565298 6647312
60968 6647312 5881851 5244417 4715828 4277178 3909645 3597771 3329821 3095976 2888695
60959 2888695 2703628 2537725 2387202 2249089 2123108 2009628 1907088 1813716 1730332 1658357
60949 1658357 1595687 1537341 1480111 1424339 1371345 1321661 1275960 1235449 1200577 1170780 1145669
60938 1145669 1125016 1107457 1090801 1073912 1057074 1040546 1024195 1008580 994747 982589 970817
60927 970817 958910 947702 937675 928062 918136 908058 897798 886428 873344 859285 845333 831659
60915 831659 817968 804527 792004 780684 770461 761256 752984 745400 738255 731308 724096 716189 707843
60902 707843 699910 692910 686689 681125 676472 672684 669033 664942 660769 657317 654875 653127 651777 650908
60888 650908 650816 651728 653568 655946 658506 661261 664282 667138 669008 669461 668805 667669 666453 665184 663559
60873 663559 661166 657984 654621 651694 649117 646401 643524 640958 638962 637442 636511 636537 637576 639258 641228
60858 641228 643099 644022 643143 640742 638240 636819 636551 637019 637940 638713 638058 634738 628330 619000 607129 593698
60842 593698 580453 568842 558905 549682 540630 532215 525312 520516 517937 517145 517221 517279 517137 517343 518408
60827 518408 520081 521508 522135 522419 523434 525698 528618 531250 533353 535333 537409 539415 541366 543652 546520
60812 546520 549773 553045 556003 558349 560137 562056 564719 567596 569316 569344 568648 568426 568741 568857 568355 567326
60796 567326 565854 563885 561450 558700 555841 553195 550867 548208 544144 538458 532224 526536 521312 515909
60782 515909 510421 505592 501739 498558 495864 493773 492100 490307 488279 486680 486271 487144 488759 490398 491448
60767 491448 491527 490712 489608 489074 489651 491126 492648 493495 493816 494453 496065 498672 502068 506186 510774 515111
60751 515111 518435 520490 521396 521224 520029 518118 515928 513688 511417 509117 506784 504387 501986 499712 497513
60736 497513 495167 492688 490335 488072 485445 482239 478763 475123 470764 465312 459437 454245 450024 446226
60722 446226 442440 438737 435152 431449 427453 423162 418583 413925 409875 407146 405766 405177 404961 404990 405065 405035
60706 405035 405222 406098 407428 408359 408503 408393 408744 409754 411287 413201 415229 416997 418423 419797 421322 422967
60690 422967 424932 427746 431574 435772 439465 442346 444698 446957 449555 452888 457027 461561 465971 470052
60676 470052 473816 477191 480156 482971 485914 488778 490991 492404 493740 496039 499627 503778 507401 509926
60662 509926 511490 512548 513604 515165 517420 519857 521647 522645 523556 524746 525309 523848 519922 514231 507653
60647 507653 500765 494183 488570 484084 480273 476674 473133 469501 465585 461597 458151 455584 453574 451595
60633 451595 449322 446439 442660 438320 434551 432318 431389 430598 429022 426647 424025 421604 419375 416956 413997
60618 413997 410653 407596 405443 404165 403146 401799 400116 398630 397834 397666 397667 397678 398181 399731 402230 405035
60602 405035 407694 410253 412874 415445 417583 418859 419053 418486 417992 418218 418984 419601 419787 419936 420509 421540
60586 421540 422739 423728 424153 423951 423559 423561 424102 425015 426411 428684 431874 435477 438992 442237 445104 447522
60570 447522 449801 452542 455932 459488 462579 464883 466294 466928 467368 468363 470015 471661 472768 473562 474630
60555 474630 476423 479284 483423 488490 493660 498553 503732 510052 517940 527578 539266 553215 569432
60542 569432 588183 610188 636030 665917 700417 740863 788412 843057 904006 970401 1040816
60531 1040816 1112277 1180503 1241052 1289785 1322715 1336638 1330480 1305847 1266213 1215826 1159108
60520 1159108 1100268 1042865 989458 941439 899095 862166 830603 804598 783892 767679 755566
60509 755566 748062 745559 747415 752753 761759 775396 794211 818396 848817 886864 933052 986563
60497 986563 1046225 1110876 1178192 1243846 1302484 1349386 1381230 1396177 1394112 1376871 1347855 1311372
60485 1311372 1272186 1235106 1204327 1182832 1172172 1172688 1184234 1207271 1243352 1294082 1359457 1437366
60473 1437366 1524315 1615752 1705409 1785321 1847487 1885833 1896750 1878653 1831995 1759850 1667967
60462 1667967 1563739 1454672 1346990 1244827 1150304 1064316 987224 918963 858943 806351
60452 806351 760553 721031 687028 657585 632035 610261 592293 577786 566024 556412 548701 542656
60440 542656 537723 533330 529460 526597 525051 524625 525023 526177 527889 529485 530220 529871 528655 526716 524094
60425 524094 521023 517860 514733 511577 508488 505652 503030 500509 498414 497504 498323 500769 504326 508519 513197
60410 513197 518591 525056 532508 540287 547982 556227 566211 578405 592222 606892 622159 638049 654516
60397 654516 671515 688928 706149 722118 736046 747870 757838 766022 772480 777529 781603 785023 788070
60384 788070 790945 793515 795444 796803 798145 799626 800423 799520 796912 793603 790537 787895 785439 783148 781301
60369 781301 780087 779360 778861 778671 779228 780625 782050 782431 781704 780971 781135 781816 782059 781712 781524 781980 782661 782884
60351 782884 782583 782345 782739 783712 784532 784286 782557 779545 775412 769677 761675 751671 741123 731600 723626
60336 723626 716739 710451 704782 699997 696207 693346 691227 689363 686949 683344 678610 673413 668360 663556
60322 663556 658756 653770 648657 643679 639028 634517 629635 624223 619015 615140 612987 611935 611311 611062 611296
60307 611296 611760 612331 613624 616409 620635 625680 631514 638970 648742 660559 673355 685756 696318 703881
60293 703881 707971 708569 705421 698078 686844 673308 659628 647493 637849 631112 627179 625361 624682 624402
60279 624402 624314 624694 625975 628250 631103 634061 637111 640509 644278 648413 653479 660338 669152 679215 689956
60264 689956 701522 714057 727084 740111 753397 767554 782673 798341 814281 830414 846436
60253 846436 861780 875978 888734 899850 909555 918820 928881 940387 953360 967878 984323 1002879
60241 1002879 1023261 1045252 1069250 1095999 1125921 1158920 1194793 1233622 1275754 1321598 1371577
60230 1371577 1426146 1485591 1549722 1617974 1690002 1765966 1845938 1929080 2013646 2097718 2179653
60219 2179653 2257960 2331283 2398731 2459920 2514541 2562108 2602149 2634296 2658113 2673277 2680104
60208 2680104 2679521 2672350 2659099 2640677 2618770 2595017 2570228 2544988 2520723 2499496 2482828 2471273
60196 2471273 2465154 2465233 2472576 2488160 2512671 2546367 2588970 2639972 2699019 2765724 2839047 2917145
60184 2917145 2997810 3078731 3157283 3230539 3295911 3351629 3396471 3429232 3448777 3454475 3446234 3424031
60172 3424031 3387730 3337533 3274486 3200403 3117522 3028497 2936565 2845112 2756769 2673189 2595857
60161 2595857 2526762 2467843 2420055 2383483 2358199 2344404 2341766 2349257 2365821 2390603 2422217 2458262
60149 2458262 2495964 2532954 2567170 2596488 2619079 2634041 2641247 2640630 2631973 2615359 2591545 2561924
60137 2561924 2528352 2492974 2457937 2425120 2396072 2372010 2353727 2341702 2336484 2338938 2350014 2370441
60125 2370441 2400815 2441870 2494520 2559738 2638462 2731517 2839471 2962607 3100984 3254343
60115 3254343 3421950 3602715 3795401 3998327 4208724 4422616 4635406 4842434 5039152
60106 5039152 5221437 5386027 5530369 5651864 5747609 5815077 5852747 5859996 5836907 5784440 5704426
60095 5704426 5599159 5471380 5324768 5163796 4992685 4814948 4634308 4455332 4282475
60086 4282475 4118809 3966200 3826325 3700828 3590833 3497060 3420375 3361572 3320705 3297191
60076 3297191 3290498 3300114 3324785 3362234 3409638 3463965 3521878 3579928 3635162 3685366 3728623 3762904
60064 3762904 3786211 3797108 3795093 3780407 3753361 3713989 3662612 3600558 3529678 3451199 3365840
60053 3365840 3275223 3182119 3088750 2995798 2903858 2814974 2731628 2654889 2584809 2522261 2469101
60042 2469101 2426640 2395155 2374877 2366325 2369661 2384868 2412668 2454001 2508186 2572722 2645287 2724890
60030 2724890 2810465 2899341 2987950 3073378 3153548 3226495 3290235 3343072 3383487 3410091 3422127
60019 3422127 3419629 3402750 3371452 3326299 3269015 3201637 3125587 3042285 2954324 2865221 2778045
60008 2778045 2694839 2617229 2546906 2485357 2433587 2392267 2361876 2342594 2334278 2336673 2349581 2372888
59996 2372888 2406592 2450818 2505721 2571458 2648267 2736331 2835346 2944253 3061448 3184970 3312202
59985 3312202 3439437 3562055 3675458 3776109 3861945 3931894 3985038 4020277 4036729 4034165 4012805
59974 4012805 3973004 3915570 3842282 3755737 3658801 3554738 3447692 3342268 3242207 3149717
59964 3149717 3066212 2993221 2932315 2884609 2850697 2830795 2824591 2831170 2849511 2879096 2919918 2971872
59952 2971872 3034082 3104657 3181053 3260870 3342279 3423558 3502435 3576418 3643856 3704328 3757847
59941 3757847 3804042 3842226 3871889 3892914 3905574 3910608 3909218 3902984 3893926 3884551 3877543 3875425 3880687
59928 3880687 3896078 3924329 3967643 4027801 4106533 4205207 4324249 4463453 4622698 4801504
59918 4801504 4997747 5207515 5426288 5649347 5870739 6082772 6277175 6446282 6582923
59909 6582923 6680344 6733448 6740095 6701038 6619341 6500510 6352330 6183308 6000960 5811786
59899 5811786 5622180 5438293 5264955 5105313 4961447 4834822 4726284 4636291 4565323 4513890
59889 4513890 4482383 4471369 4481795 4514434 4569269 4645848 4743910 4862998 5001466 5156253 5323233
59878 5323233 5496878 5669457 5831377 5972908 6085823 6164119 6204418 6206303 6171907 6104758
59868 6104758 6008934 5889034 5750083 5596890 5433548 5263695 5090935 4918695 4749832 4586691
59858 4586691 4431547 4286787 4154556 4036355 3933150 3845947 3776062 3724546 3691407 3675715
59848 3675715 3676522 3693321 3725413 3771229 3828554 3895136 3968811 4047479 4129567 4214364 4301305 4388566
59836 4388566 4472227 4546513 4604731 4640751 4650784 4634439 4594258 4534505 4460444 4377953 4292457
59825 4292457 4207501 4124394 4043146 3963363 3884332 3804971 3724388 3642588 3560653 3480402 3403847
59814 3403847 3332556 3267196 3207656 3153535 3104332 3059145 3016574 2975246 2934488 2894423 2855419
59803 2855419 2817493 2780262 2743575 2708231 2675978 2648697 2627643 2613514 2607047 2609251 2621135 2643511
59791 2643511 2677243 2723752 2785287 2864759 2965122 3088713 3236975 3410502 3608837 3829673
59781 3829673 4067724 4313628 4553173 4767795 4937372 5044988 5081329 5046493 4948949 4802783
59771 4802783 4624410 4429596 4231589 4040531 3863381 3703963 3563556 3442202 3339718
59762 3339718 3255642 3188824 3137628 3100371 3075246 3060156 3053271 3053725 3061370 3075861 3096390 3122209
59750 3122209 3152953 3188458 3228725 3274257 3326030 3384934 3451440 3525876 3608850 3701368 3804750
59739 3804750 3920446 4049690 4193226 4351550 4525455 4716280 4925689 5155402 5406929
59730 5406929 5681086 5977458 6294186 6627961 6973909 7325553 7675340 8015476 8338558
59721 8338558 8638149 8909809 9152201 9367324 9559760 9735747 9902479 10067218 10236136
59712 10236136 10413528 10601705 10801069 11009916 11224381 11439030 11647935 11845571 12027142
59703 12027142 12188416 12325542 12435356 12516105 12567972 12592878 12593869 12574778 12540200 12495440 12446355
59692 12446355 12399273 12360938 12338133 12337107 12363237 12421093 12514580 12646944 12820706 13037677 13298946
59681 13298946 13604681 13953676 14342787 14766600 15217453 15685495 16158421 16621088 17055654
59672 17055654 17442518 17761883 17995734 18129954 18155881 18070859 17878132 17586718 17210894 16768681
59662 16768681 16279841 15764454 15241882 14729043 14238235 13775861 13342127 12930606 12528167
59653 12528167 12117520 11682707 11214363 10711772 10181946 9637296 9092298 8559749 8048644
59644 8048644 7564765 7112047 6692635 6306424 5951908 5627564 5331899 5062676 4817314
59635 4817314 4594158 4392535 4211479 4049227 3904153 3775469 3662636 3564629 3480054 3407527
59625 3407527 3345637 3292817 3247458 3207888 3172293 3139078 3107489 3077524 3049145 3021886 2995293
59614 2995293 2969149 2942938 2915371 2884960 2851069 2814219 2775287 2734573 2691832 2647225 2602038
59603 2602038 2558191 2517110 2479337 2445027 2414266 2386738 2361597 2337960 2315279 2293213 2271692
59592 2271692 2251323 2233084 2217341 2203726 2192274 2183893 2179224 2177844 2179259 2183912 2192351 2204043
59580 2204043 2218006 2234028 2252266 2272124 2292844 2314974 2340004 2368572 2400174 2434738 2473373
59569 2473373 2517307 2566964 2622287 2683143 2749155 2819917 2895602 2976805 3063723 3156215 3254586
59558 3254586 3359489 3470983 3588437 3711360 3839492 3972112 4108160 4246948 4387647
59549 4387647 4528139 4665576 4798067 4924143 5039925 5138385 5212621 5259441 5279443 5275029
59539 5275029 5249378 5206171 5148549 5078109 4995519 4901906 4799296 4690269 4577864 4465365
59529 4465365 4355633 4250992 4154112 4068266 3996085 3938705 3896825 3872121 3866922 3883065 3921851
59518 3921851 3984607 4072257 4184437 4319684 4476122 4651059 4839860 5035822 5231045 5416976
59508 5416976 5584504 5724730 5830260 5895821 5918064 5895512 5828871 5721081 5577069 5403616
59498 5403616 5208940 5001476 4788588 4576397 4370460 4175922 3996777 3835220 3691886
59489 3691886 3566708 3459751 3371490 3302446 3252693 3221776 3208890 3212815 3232002 3265419 3313280
59478 3313280 3376145 3453068 3541282 3637767 3740121 3845396 3949152 4046637 4134321 4209338 4267998
59467 4267998 4306097 4320734 4311053 4277301 4220046 4140547 4041208 3925304 3796463 3658421 3514776
59456 3514776 3368720 3223037 3080225 2942339 2810752 2686231 2569117 2459321 2356461
59447 2356461 2260262 2170746 2087964 2011873 1942586 1880245 1824438 1774227 1729102 1689365 1655198
59436 1655198 1625950 1600905 1580225 1564470 1553596 1547111 1544802 1546552 1551708 1559459 1569792 1583495
59424 1583495 1601297 1623410 1649291 1676862 1702109 1720691 1730568 1732926 1730858 1727755 1726539 1729134
59412 1729134 1736188 1747922 1765330 1789467 1818998 1849303 1875082 1893949 1907349 1918566 1930565
59401 1930565 1945379 1964447 1988825 2019188 2055965 2099455 2149678 2206264 2268812 2337550 2413372
59390 2413372 2497005 2588264 2686450 2791291 2902984 3021292 3145139 3273303 3405080 3540110
59380 3540110 3678205 3819960 3967460 4124108 4293992 4481398 4690244 4923242 5181645
59371 5181645 5465811 5775287 6107679 6457796 6818560 7182602 7542693 7891481 8222283
59362 8222283 8530688 8814895 9074356 9308467 9516538 9698218 9853250 9980699 10078366 10142758
59352 10142758 10169491 10153826 10091025 9976781 9808226 9585121 9310097 8987916 8625194 8231129
59342 8231129 7817559 7397120 6980937 6577880 6194932 5837047 5506561 5203478 4926527
59333 4926527 4673788 4442743 4230550 4034505 3852095 3680980 3519633 3367880 3226297
59324 3226297 3095025 2973562 2861380 2758146 2663417 2576659 2497467 2425250 2358866 2297209
59314 2297209 2240084 2187927 2140778 2098168 2059916 2026276 1997269 1972587 1952314 1937088 1927342
59303 1927342 1922981 1924001 1930873 1944081 1963803 1990288 2023951 2064410 2109351 2154568 2195399 2228815
59291 2228815 2254954 2276990 2299253 2325152 2356550 2394361 2438981 2490135 2546796 2607295 2669319
59280 2669319 2730071 2786985 2838150 2881676 2915017 2935684 2942573 2935955 2916302 2883850 2839400 2784799
59268 2784799 2722467 2654918 2584607 2513422 2442102 2370817 2300504 2232931 2169218 2109020 2051606
59257 2051606 1997123 1946329 1899571 1856648 1817475 1782490 1752458 1728008 1709149 1695155 1685116
59246 1685116 1678643 1675827 1676681 1681072 1689160 1701238 1717080 1736036 1757994 1783647 1813488 1847072
59234 1847072 1883629 1923042 1965910 2013022 2065149 2123007 2187062 2257572 2335169 2421245 2517537
59223 2517537 2625455 2746034 2880409 3030137 3197068 3382787 3587826 3811099 4049957
59214 4049957 4300513 4557564 4814301 5062587 5293702 5498786 5668990 5796181 5874206 5899636
59204 5899636 5871557 5791215 5662103 5490083 5283048 5050274 4801673 4546889 4294401 4050955
59194 4050955 3821238 3607769 3411425 3232675 3072260 2930446 2806064 2697034 2601839 2519961
59184 2519961 2451106 2394751 2350458 2317737 2295339 2281386 2274534 2274390 2280402 2290810 2303060 2314796
59172 2314796 2323963 2328254 2325019 2311889 2287501 2251828 2205962 2151555 2090477 2024920 1957351 1889906
59160 1889906 1823943 1760496 1700767 1645616 1594935 1548286 1506005 1468859 1436686 1408247 1382572
59149 1382572 1359699 1340014 1323597 1310467 1300669 1293857 1289510 1287826 1289622 1294926 1302405 1310706 1319766
59136 1319766 1330224 1342034 1354239 1365861 1376551 1386527 1396175 1405553 1414129 1421268 1427011 1431991 1436520
59123 1436520 1440343 1443472 1446774 1451417 1458063 1466673 1476674 1487233 1497898 1509176 1522079 1536982
59111 1536982 1553399 1570766 1588809 1607171 1625537 1644290 1664178 1685089 1705962 1726202 1746328
59100 1746328 1766974 1788216 1810476 1835125 1863440 1895614 1931448 1971294 2015533 2063695 2114915
59089 2114915 2168809 2225097 2282627 2339476 2393782 2443949 2488318 2525209 2553038 2570075 2574536
59078 2574536 2565525 2543637 2510265 2466732 2414459 2355382 2291564 2224726 2156623 2089306 2024314
59067 2024314 1961953 1901969 1844573 1790291 1739222 1691158 1646083 1603989 1564592 1527784 1493899
59056 1493899 1462878 1433753 1405867 1380195 1358436 1340930 1326373 1313477 1302021 1292293 1284376 1278070
59044 1278070 1272725 1266967 1259313 1249286 1237455 1224312 1209767 1193867 1177385 1161355 1146433 1132911
59032 1132911 1121026 1111055 1103377 1098475 1096537 1096968 1098596 1100514 1102568 1105107 1108594 1113374 1119469 1126503
59018 1126503 1134096 1142391 1151996 1163388 1176567 1191209 1206951 1223671 1241763 1262136 1285681 1312771
59006 1312771 1343370 1377490 1415295 1456980 1502882 1553521 1609103 1668841 1730960 1793365 1854108
58995 1854108 1911269 1962658 2005838 2038573 2059434 2068131 2065286 2052026 2029978 2001393 1968624 1933262
58983 1933262 1896106 1858027 1820338 1784009 1748930 1714362 1679875 1645720 1612657 1581744 1553900
58972 1553900 1529331 1507558 1488234 1471708 1458667 1449638 1445032 1445132 1449574 1457184 1466659 1477249 1488591
58959 1488591 1500298 1511956 1523181 1533502 1542681 1551351 1560733 1571440 1583087 1595369 1608733 1623509
58947 1623509 1639151 1655145 1672145 1691357 1713166 1737149 1763198 1791971 1824375 1861313 1903807
58936 1903807 1952807 2008862 2072297 2143352 2221531 2304876 2390222 2473947 2552303 2621746 2680041
58925 2680041 2727351 2765978 2799165 2830186 2861992 2896964 2936978 2983755 3038693 3102146 3173560
58914 3173560 3252928 3341606 3441176 3552210 3674874 3810158 3959489 4123396 4301484 4493564
58904 4493564 4700043 4921244 5156993 5406673 5668822 5940584 6218052 6497181 6774214
58895 6774214 7045831 7309770 7565199 7811689 8047572 8269334 8472093 8650167 8797794
58886 8797794 8910375 8985200 9020765 9015887 8970174 8884888 8762535 8605859 8417965 8203143
58876 8203143 7966639 7713573 7448526 7175726 6898851 6620821 6344358 6072346 5806954
58867 5806954 5548895 5298522 5057246 4826897 4608061 4400226 4203413 4018558 3846439
58858 3846439 3687283 3541310 3408315 3286697 3174145 3069632 2973684 2886553 2807355 2735382
58848 2735382 2671020 2614648 2565536 2522567 2485350 2453868 2427596 2405685 2387774 2374061 2364691
58837 2364691 2359353 2357395 2358282 2362156 2369925 2382487 2399927 2421849 2448322 2479927 2516954 2559127
58825 2559127 2606072 2657468 2712679 2770844 2831393 2893941 2957768 3022051 3086859 3153448 3223551
58814 3223551 3298766 3380545 3470200 3568909 3678069 3799492 3934736 4084438 4248821 4428521
58804 4428521 4624223 4835749 5062403 5303980 5560422 5830379 6110874 6398316 6688932
58795 6688932 6978140 7260338 7529486 7779297 8003100 8194544 8348675 8461747 8530401 8552333
58785 8552333 8528054 8461008 8355772 8217012 8050145 7861321 7655542 7434979 7199303 6947114
58775 6947114 6677348 6390952 6092370 5789039 5488778 5197642 4919723 4657614 4412379
58766 4412379 4183896 3971943 3776616 3597518 3433302 3282471 3144097 3017422 2901433
58757 2901433 2795188 2698003 2609061 2527515 2453336 2387333 2329880 2280140 2236953 2199880 2168923
58746 2168923 2143755 2123632 2107668 2094907 2084682 2077294 2073949 2075733 2082960 2095609 2113742 2137097
58734 2137097 2164617 2194409 2223603 2248144 2263534 2266446 2255665 2231756 2196573 2153073 2104531
58723 2104531 2053177 1999748 1944416 1887589 1829822 1771630 1713678 1656683 1601068 1547366 1496984
58712 1496984 1451850 1413154 1381095 1355850 1337962 1327650 1324668 1328927 1340236 1356947 1375614 1392291
58700 1392291 1403476 1405843 1396476 1374316 1340880 1299177 1252461 1204013 1156837 1112704 1072119 1035654
58688 1035654 1004560 979696 960737 947050 938481 934701 934607 937134 942030 949087 957241 965253 972865
58675 972865 980627 989090 998890 1011320 1028149 1050875 1080305 1116245 1156869 1198329 1235220 1261578
58663 1261578 1272203 1264460 1239578 1201805 1155879 1105498 1053832 1004163 959128 919740 885585
58652 885585 855679 829106 805539 785552 769970 758808 751250 746579 744328 743653 743668 744565 747328 752081
58638 752081 757732 763510 769634 776044 781763 786262 790340 794889 799738 804579 810090 817216 826034 836183
58624 836183 847792 861121 875827 891448 908205 926751 947490 970509 995628 1022181 1049521
58613 1049521 1078266 1110252 1146662 1186919 1230086 1276579 1327777 1384545 1446865 1514399 1586708
58602 1586708 1663285 1743856 1828211 1915360 2003223 2089323 2171092 2245417 2308900 2359087 2394737
58591 2394737 2414692 2417634 2403539 2374406 2332984 2281633 2222865 2159813 2095312 2031301 1969546
58580 1969546 1911826 1858709 1809324 1763263 1721737 1685914 1655121 1627662 1602602 1579767 1558795
58569 1558795 1539286 1521323 1504931 1489406 1473749 1457138 1438499 1416536 1390927 1362734 1333108
58558 1333108 1302497 1271673 1242333 1215774 1191790 1169438 1147684 1124685 1097986 1066843 1033308
58547 1033308 999899 967189 934773 903382 874468 848494 825011 803816 784809 767293 750576
58536 750576 734814 720419 707259 695148 684218 674064 663678 653121 644030 637341 631861 626315
58524 626315 621401 618297 616413 614480 612777 612372 613048 613938 615554 619176 624663 630763 637339 645573 656043
58509 656043 668166 681419 695740 710796 726081 741480 756716 770590 781868 790426 796561 799889
58497 799889 800178 798493 796107 792845 787868 781412 774447 767322 760187 753893 748881 743840 737136 729021
58483 729021 720902 713119 705133 697111 689450 681273 671397 660468 650308 641505 633459 626345 620937 616666
58469 616666 611830 605813 599418 593067 586476 580046 574819 570957 567771 565203 563717 562959 562216 562128 564183
58454 564183 568442 573351 577741 581494 584327 585614 585462 584494 582626 579585 576384 574614 574337 574277 573949 573946
58438 573946 574284 574285 574071 574450 575326 575926 576506 577988 579906 580642 579911 579241 579761 581182 583236 586446 591057
58421 591057 596575 602585 608796 614374 618631 622283 626578 631408 635758 639632 643833 648187 651883 655312
58407 655312 659549 664150 667475 669182 670426 671731 672795 674346 677798 682784 687199 690089 692511 695214
58393 695214 697606 699451 701549 704227 706936 709758 713424 717573 720918 723535 727022 731965 737121 741566
58379 741566 745755 750032 753968 757680 761990 766825 771232 775306 780300 786407 792315 797391 802485 808203
58365 808203 814155 820308 827315 835074 842599 849586 856528 863274 869262 875062 881695 888598 894417 899711
58351 899711 906374 914264 920995 925519 929459 934379 940098 946272 953331 961135 968777 976330 984808 994085
58337 994085 1002920 1011363 1020966 1032339 1044617 1057484 1071450 1086067 1100337 1115003 1131965 1151311
58325 1151311 1171477 1192283 1214985 1239359 1263755 1288110 1313680 1339588 1363056 1383505 1402971
58314 1402971 1421784 1437343 1448047 1455164 1459927 1462199 1462901 1464398 1467349 1470426 1474021 1480758 1491314
58301 1491314 1503270 1515293 1528937 1545074 1562159 1579492 1598726 1620607 1643524 1666712 1691545
58290 1691545 1718375 1745523 1772716 1801960 1833618 1865230 1895558 1926167 1957774 1989010 2020224
58279 2020224 2054453 2092933 2133516 2174946 2218505 2263927 2308194 2350268 2392652 2436529 2479881
58268 2479881 2522145 2565818 2611380 2655829 2698704 2744359 2795525 2849811 2905478 2965363 3031666
58257 3031666 3101973 3174085 3250035 3331715 3417225 3505138 3597690 3696187 3797982 3901592 4010077
58246 4010077 4125869 4247110 4372505 4504636 4644980 4791096 4942345 5102697 5274144
58237 5274144 5453343 5638850 5835371 6046551 6270043 6504324 6753674 7021454 7305353
58228 7305353 7604564 7924615 8269648 8637195 9026418 9443940 9895520 10379990 10897966
58219 10897966 11458169 12068159 12727506 13437679 14209806 15055038 15977103 16983056 18091303
58210 18091303 19320152 20679877 22186620 23872880 25773958 27917962 30342883 33110971
58202 33110971 36293952 39961769 44206248 49165407 55012732 61946643 70217270 80149688
58194 80149688 92124388 106567739 123995536 145024887 170264352 200144915 234752823
58187 234752823 273501431 314503794 354041171 386939839 408174458 414889036 407471227
58180 407471227 388987342 363508384 334499287 304119536 273480131 243296118 214315421
58173 214315421 187306845 162837221 141157843 122269136 106021598 92164559 80387291
58166 80387291 70383842 61891971 54680218 48533113 43267692 38745323 34852457 31483633
58158 31483633 28551865 25996930 23768451 21811540 20078100 18538421 17169577 15942358
58150 15942358 14829619 13817654 12899065 12062286 11296632 10599254 9967858 9393119 8865919
58141 8865919 8385208 7951079 7556478 7193225 6860338 6558987 6284188 6027907 5785546
58132 5785546 5553586 5326251 5100763 4881505 4673450 4475769 4286579 4108553 3944159
58123 3944159 3790273 3643313 3505338 3379301 3262516 3150662 3044634 2947644 2858688 2774304
58113 2774304 2694018 2619000 2547927 2478916 2413166 2352313 2294495 2237038 2180555 2126662 2074387
58102 2074387 2022721 1974020 1930974 1892625 1856802 1823698 1793391 1762900 1729871 1696671 1666759
58091 1666759 1639293 1611183 1582092 1553400 1524390 1493584 1462074 1431685 1401451 1369578 1337215
58080 1337215 1306678 1277484 1247729 1217984 1190338 1164766 1139669 1114858 1090943 1067070 1042329
58069 1042329 1018274 997150 978641 960977 943998 928518 914003 899605 886262 875139 865129
58058 865129 854351 842827 831351 819285 806040 793252 782733 773501 763425 752550 742327 732883
58046 732883 723632 715243 708428 702017 694746 687663 682248 677556 671919 666125 662103 659620 657131 654805
58032 654805 653815 653538 652289 650091 648037 645685 641821 637124 633356 630519 627429 624574 623729 625118 627445
58017 627445 630415 634796 640328 645932 651805 659133 668053 677940 689286 703117 718978 735641 753510
58004 753510 774180 797911 823578 850804 880118 911340 943794 977808 1014195 1052648 1092581
57993 1092581 1134925 1180954 1229649 1278306 1325349 1370503 1412680 1450088 1482473 1511175 1536985
57982 1536985 1559960 1581307 1603370 1627342 1652440 1677123 1699326 1715570 1721739 1715122 1694600 1659401
57970 1659401 1609599 1547807 1478631 1406166 1333176 1262183 1195552 1134434 1079073 1030091 988221
57959 988221 953110 923810 900114 882034 868547 858285 850883 846098 842423 838499 835165 834010 834372
57946 834372 834016 832408 831031 830629 830486 830540 831954 835270 840072 846815 857036 871397 889337 910954
57932 910954 937305 968388 1002556 1038297 1074773 1110022 1140247 1161655 1171816 1169218 1153262 1125258
57920 1125258 1088078 1044338 995989 945548 896000 849064 804997 764308 728161 696936 670068
57909 670068 647508 629628 615443 602880 591285 581733 574169 566174 555673 543221 530496 517955
57897 517955 505175 492245 479532 466937 454487 442975 433159 424917 417829 411886 407091 403200 400399
57884 400399 399488 400833 403913 408367 414576 422634 431590 440416 449070 458021 467331 476712 485914 494558
57870 494558 502093 508355 513684 518207 521459 522869 522160 519159 513908 507060 499554 491765 483534 475025
57856 475025 466860 459427 452778 447173 442899 439602 436618 433971 432182 431190 430423 429940 430473 432234 434609
57841 434609 437152 439916 442702 444899 446172 446552 445933 444351 442521 441003 439044 435548 431055 427302 424839
57826 424839 422693 420571 419704 420924 423493 426611 430827 437158 445912 457088 470911 487231 505202
57813 505202 524148 543875 563747 582570 600050 617500 636651 658745 685146 717480 756210
57802 756210 799894 846464 894318 941519 984982 1021352 1048015 1062809 1063958 1051333 1027055 993997
57790 993997 954277 909641 862231 813934 765724 718490 673708 632305 593580 556343 520722
57779 520722 487929 458689 432867 410284 390896 374311 359910 347414 336819 327938 320460 314218
57767 314218 308940 304060 299263 294891 291373 288590 286245 284456 283432 282868 282262 281686 281801 283109 285495
57752 285495 288447 291611 295206 299873 305990 313316 321641 331352 342667 354670 366093 376908 387964
57739 387964 398874 407530 412170 412920 410885 406873 401646 396330 391589 387093 382616 378985 377122 376748
57725 376748 376929 377431 378705 380843 383376 385964 388689 391748 395256 399227 403518 408022 412984 418741 425143
57710 425143 431884 439410 448651 459656 471440 483531 496730 511817 528490 546209 565216 586018
57698 586018 608635 633095 659920 689484 721608 756460 795044 838128 885574 937518 995222
57687 995222 1059688 1130361 1206318 1287918 1375890 1469439 1566694 1666553 1768583 1871293 1972025
57676 1972025 2068647 2160159 2245779 2325083 2399611 2473249 2550484 2634642 2726835 2823573 2913139
57665 2913139 2975343 2988165 2937985 2825866 2665761 2477256 2278658 2083848 1902118 1738614
57655 1738614 1594698 1469154 1360091 1265899 1184922 1115404 1056387 1007829 969133 938177 912616
57644 912616 891612 875422 863793 855808 851073 849999 852845 859341 869263 882594 899075 918425 941193
57631 941193 968648 1001547 1039534 1081968 1128793 1180311 1236493 1296859 1360807 1427858 1497600
57620 1497600 1569338 1641625 1712234 1778670 1838506 1889166 1927933 1952698 1962480 1956907 1935711 1899313
57608 1899313 1849555 1789177 1720742 1646619 1569555 1492249 1416288 1342185 1270431 1201816 1136768
57597 1136768 1075236 1017430 963951 914923 869654 827504 788574 753154 721003 691521 664364
57586 664364 639484 616789 596072 577145 559874 544196 530205 518052 507647 498539 490207 482351
57574 482351 474930 468028 461758 456244 451676 448337 446383 445526 445142 444797 444427 444005 443386 442734 442648 443485 444920
57557 444920 446535 448561 451532 455482 460023 465075 471008 478073 486169 495114 504806 515196 526425 538900
57543 538900 552856 567986 583935 601017 620084 641789 666413 694250 725628 760538 798679
57532 798679 839897 884266 931853 982707 1036925 1094225 1153529 1213402 1272747 1330536 1384893
57521 1384893 1432996 1472032 1499973 1515655 1518747 1509829 1490034 1460423 1421967 1376102 1324909 1270613
57509 1270613 1215067 1159607 1105034 1051855 1000882 953402 910244 870878 834033 799190 766908
57498 766908 737750 711635 688325 667879 650306 635324 622733 612617 604977 599566 596282 595246
57486 595246 596325 599074 603379 609655 618100 628249 639633 652469 667307 684394 703902 726431
57474 726431 752687 782686 815802 851687 890791 933758 980548 1030365 1082339 1135978 1190727
57463 1190727 1245162 1296987 1343948 1384477 1417199 1440225 1451526 1450027 1435876 1409746 1372527
57452 1372527 1325864 1272404 1214894 1155151 1094067 1032470 971692 913355 858718 808126 761113
57441 761113 717147 676272 638827 604714 573315 544153 517187 492368 469374 448010 428494
57430 428494 411011 395264 380749 367286 354983 343804 333479 323795 314759 306535 299333 293283
57418 293283 288265 283851 279481 274680 269203 263167 257096 251656 247238 243804 241088 238782 236633 234595
57404 234595 232851 231427 229870 227676 225081 222971 221863 221361 220794 220081 219682 219917 220589 221146 221161 220850 221154
57387 221154 222907 225753 228331 229799 230701 231925 233269 233737 233022 231952 231348 231098 230580 229496 227968 226125
57371 226125 224073 222094 220499 219242 217960 216455 214987 213975 213504 213228 212729 211918 211050 210435 210160 210079
57355 210079 209990 209815 209683 209850 210452 211313 212041 212334 212169 211695 211122 210751 210979 212003 213557 215062 216191 217198
57337 217198 218722 221334 225298 230550 236702 243137 249344 255250 261035 266639 271744 276462 281709 288394
57323 288394 296281 304144 311195 317910 325139 332843 340241 347086 354223 362706 372747 383728 395045
57310 395045 406662 418917 431970 445494 458897 471906 484950 498858 514088 530323 546860
57299 546860 563290 579619 595739 610958 624178 634577 642029 646866 649291 649143 646232 640794 633470
57286 633470 624824 614983 603876 591804 579648 568406 558573 550060 542645 536327 531282 527729 525853
57273 525853 525567 526214 526852 527086 527441 528677 530974 534114 538090 543018 548640 554592 561136 568940 577991
57258 577991 587338 596198 604843 614064 624241 635243 646764 658386 669723 680955 692892 706045
57246 706045 719918 733650 747111 760862 775313 790468 806338 822959 839986 856813 873285
57235 873285 890031 907969 927631 948864 970974 993244 1015590 1038585 1062652 1087422 1112109
57224 1112109 1136282 1159932 1183125 1206114 1229623 1254416 1280564 1307568 1335128 1363350 1392334
57213 1392334 1422113 1453020 1485522 1519648 1555017 1591445 1628956 1667135 1705153 1742605 1779853
57202 1779853 1817299 1854794 1891880 1928053 1962615 1994954 2025402 2055223 2085312 2115329 2144592
57191 2144592 2173328 2202411 2232213 2262414 2292789 2323507 2354677 2386252 2418499 2452081 2487361
57180 2487361 2523926 2560957 2597863 2634487 2670911 2707198 2743247 2778830 2813837 2848391 2882439
57169 2882439 2915232 2945544 2972614 2996722 3018604 3038387 3055347 3068756 3078788 3086391 3092406 3097133
57157 3097133 3100803 3104063 3107541 3111056 3113792 3115402 3116586 3118424 3121463 3125757 3131523 3139357 3149892 3163484
57143 3163484 3180088 3199103 3219364 3239631 3259170 3277721 3294971 3310330 3323186 3333127 3339928 3343722
57131 3343722 3345375 3346475 3348725 3353309 3360715 3370895 3383416 3397582 3412516 3427128 3440211 3451002
57119 3451002 3459742 3467479 3475390 3484664 3497018 3514569 3538709 3569488 3606564 3650461 3702521 3764086
57107 3764086 3836576 3922287 4024462 4146621 4292702 4468268 4681161 4940780 5257295 5642038
57097 5642038 6108464 6672466 7351824 8165148 9130534 10264160 11579133 13084201 14782073
57088 14782073 16668152 18730174 20947270 23287647 25707744 28155041 30568802 32870543
57080 32870543 34949572 36664965 37877926 38498768 38514129 37976290 36969222 35579290 33884350
57071 33884350 31955797 29862869 27673811 25453491 23258984 21135746 19116520 17222875
57063 17222875 15467655 13857244 12393357 11074172 9894883 8848238 7925018 7113691
57055 7113691 6399774 5766938 5200490 4690582 4232345 3823408 3461388 3142844 2863429
57046 2863429 2618644 2404601 2217987 2055326 1912710 1786576 1674389 1574271 1484360 1402952
57036 1402952 1329019 1262214 1202461 1149690 1103698 1064144 1030872 1004211 984761 973163 970691
57025 970691 979634 1002205 1039676 1093858 1168064 1262253 1364767 1451474 1497446 1491384 1439228 1356144
57013 1356144 1257411 1154993 1057293 968550 889062 817479 752849 694512 641344 592144 546190
57002 546190 502866 461364 421194 382505 345557 310332 276871 245382 215766 187682 161313
56991 161313 137559 117321 101231 90173 85228 86699 93849 105890 122565 143242 165969 187886
56979 187886 206416 220071 228793 233867 236996 239136 240477 241449 242954 245427 248358 251129 253739 256435
56965 256435 259309 262677 267265 273620 281760 291777 304305 319967 338575 358935 378860 395304
56953 395304 405373 407905 403842 394877 382263 367116 351017 335645 322061 310705 301745 295154
56941 295154 290853 288987 289691 292554 297022 303520 313343 327116 344183 363885 386370 411265 436175
56928 436175 457406 471795 477387 473252 459962 440126 417424 394767 373567 354285 336874 320874
56916 320874 305880 292107 280121 270111 261769 254717 248599 242918 237247 231543 226015 220819 216094
56903 216094 211943 208158 204360 200747 198250 197495 198078 199320 201206 204023 207595 211692 216780 223513 231700
56888 231700 240592 250076 260739 272635 284627 295018 302306 305413 303955 298585 290693 281608 272255
56875 272255 263339 255370 248558 243128 239685 238821 240461 244051 249368 256753 266768 280124 297837 320799
56861 320799 349053 381690 417136 452894 485172 509737 523634 526143 518459 503106 483410 462549
56849 462549 442535 424312 408620 396143 386891 380353 376578 376517 381072 390462 404871 425053 451801
56836 451801 485265 525330 572069 624788 680279 732318 773311 797013 800696 785707 756300 717706
56824 717706 674760 631454 590729 554139 522022 494370 471501 453743 440862 432297 427980 428556
56812 428556 434707 446546 463843 486646 515273 549362 586678 622761 651859 668695 670114 655964
56800 655964 628883 593177 553340 513039 474810 440129 409542 382995 360325 341536 326662
56789 326662 315722 308938 306693 309025 315416 325438 339349 357550 379468 403294 426645 446958
56777 446958 461374 467182 463143 450357 431538 409453 386087 362840 340844 320791 302681 286080
56765 286080 270736 256856 244775 234473 225583 217763 210885 204883 199629 195014 190956 187279 183838
56752 183838 180790 178474 176897 175649 174490 173710 173620 174043 174614 175340 176452 177900 179407 180862 182232 183175
56736 183175 183202 182259 180839 179504 178605 178296 178410 178379 177841 177367 178002 179915 182008 183138 183252 182970 182554 181910
56718 181910 181301 181372 182322 183611 184663 185517 186540 187828 189258 190915 193055 195665 198468 201517 205378
56703 205378 210452 216349 222271 227895 233487 239166 244468 248790 251983 254314 256070 257413 258455 259312
56689 259312 260140 261228 262891 265162 267623 269670 270954 271618 272208 273293 274953 276685 277959 278765 279364
56674 279364 279652 279259 278245 277127 276075 274612 272385 269741 267200 264797 262288 259559 256380 252250 247127
56659 247127 242012 238097 235444 233084 230341 227465 224922 222703 220529 218321 216182 214242 212665 211583
56645 211583 210904 210382 209960 209801 209988 210470 211317 212679 214352 215753 216568 217177 218122 219293 219953 219618 218682
56628 218682 218001 217963 218084 217569 216158 214293 212498 210826 209015 207014 205121 203568 202151 200425 198328
56613 198328 196516 195973 197205 199927 203479 207302 210871 213587 215256 216556 218538 221536 224895 227774
56599 227774 229839 231185 232080 232983 234350 236148 237800 238819 239195 239074 238529 237883 237856 238961 240944 243030
56583 243030 244530 245078 244644 243641 242714 242166 241801 241558 241965 243672 246715 250506 254363 257933 261343 265115
56567 265115 269652 274728 279824 284967 290683 296921 302731 307363 311126 314641 317814 320114 321429 321965
56553 321965 321617 320063 317398 314125 310645 307097 303494 299658 295241 290130 284533 278395 271289 263292
56539 263292 255459 248746 242909 237132 231301 225903 221019 216399 212325 209431 207610 205974 204052 202278
56525 202278 201095 200265 199361 198393 197563 196797 195833 194564 193090 191607 190314 189263 188318 187356 186421 185486 184220
56508 184220 182215 179293 175478 171011 166629 163443 162053 162100 162970 164537 166690 168599 169243 168534 167360
56493 167360 166653 166859 168063 170011 172111 173957 175680 177408 178781 179548 180234 181481 183100 184632 186472
56478 186472 189391 193076 196202 198052 199127 200044 200816 201444 202223 203079 203363 202778 201915 201458 201429 201585 202017
56461 202017 202930 204213 205590 206909 208017 208704 209030 209432 210290 211565 212924 214023 214650 214907 215249 216043
56445 216043 217122 218031 218561 218693 218204 216862 214842 212487 209776 206590 203356 200844 199368 198729 198713 198984
56429 198984 198687 197101 194758 193044 192461 192069 190885 189087 187508 186605 186346 186663 187614 189369 192138 195711
56413 195711 199142 201502 203083 205178 208432 212007 214651 215999 216515 216675 216656 216515 216274 215992 215845 215872 215685
56396 215685 214878 213765 213198 213450 213726 213058 211395 209623 208724 208962 209637 209693 208803 207719 207294 207507 207880 208400
56378 208400 209285 210178 210514 210623 211519 213446 215511 216985 218136 219525 221184 222814 224181 225010 225076 224666
56362 224666 224481 224872 225600 226474 227664 229241 230927 232455 233742 234725 235553 236872 239276 242389 245185 247226
56346 247226 248938 250708 252486 254340 256526 258860 260836 262601 265039 268644 272998 277567 282265 287066
56332 287066 291810 296584 301571 306333 310098 312915 315719 319038 322532 326011 329911 334397 338975 343415
56318 343415 348151 353276 358013 361752 364749 367239 368738 368907 368449 368397 368983 369697 369974 369420 368000 366470
56302 366470 365997 366953 368674 370737 373631 377729 382451 387144 392046 397662 403789 409902 416056 422718 430126
56287 430126 438371 447659 457938 468661 479457 490718 503127 517027 532581 549993 569099 589306
56275 589306 610495 633642 660062 690414 724768 763220 806119 854065 908007 968831 1036629
56264 1036629 1110825 1191222 1278211 1371727 1470727 1574062 1681112 1791125 1902548 2013405
56254 2013405 2121617 2224522 2318868 2402010 2472598 2529824 2572777 2601205 2616207 2619378 2611645
56243 2611645 2593419 2565385 2528448 2483182 2429849 2368830 2300800 2226767 2148078 2066045 1981543
56232 1981543 1895383 1808877 1723269 1638794 1555257 1473528 1395245 1320898 1249557 1180898 1116176
56221 1116176 1056601 1002016 952012 907078 867547 832373 800095 770365 743521 719261 696859
56210 696859 676274 658089 642449 628731 616087 603891 591961 580719 570834 562472 555329 549438
56198 549438 545199 542422 540155 537837 535890 534881 534820 535517 536804 538224 539435 541138 544602 550036 556454
56183 556454 563334 571130 579936 589059 598360 608569 619717 630781 641555 653354 666992 681561
56171 681561 696181 711392 727628 743690 758200 771450 784537 797615 810330 823130 836966
56160 836966 852405 870075 891193 916767 947194 983578 1028473 1084466 1153218 1236813 1338624
56149 1338624 1461227 1604190 1764768 1939106 2120845 2299632 2463592 2604238 2719026
56140 2719026 2810623 2885242 2950700 3013424 3075592 3134434 3183648 3215931 3226450 3215857 3189936
56129 3189936 3155790 3118527 3080421 3040241 2991841 2925527 2833334 2713274 2568709 2405898 2233383
56118 2233383 2061328 1898465 1749619 1616944 1502107 1405841 1326763 1262545 1211506 1171918
56108 1171918 1141074 1116720 1098418 1086047 1078057 1072613 1069276 1067997 1067649 1067104 1066592 1066345 1065099 1061568
56094 1061568 1056331 1050683 1044779 1038428 1032422 1027332 1022275 1016629 1011740 1009136 1008349 1008294 1009450 1012661 1016987
56079 1016987 1020902 1024656 1029508 1035621 1042485 1050350 1059407 1068725 1077763 1087696 1099477 1111982 1123898
56066 1123898 1135928 1149204 1163192 1177291 1192766 1210672 1229446 1247010 1263814 1281390 1299494
56055 1299494 1317335 1336059 1357202 1379945 1402573 1425356 1449375 1473891 1497653 1521428 1546516
56044 1546516 1572146 1597105 1622393 1649450 1677312 1704564 1732468 1762924 1794928 1826417 1858155
56033 1858155 1892356 1928780 1965788 2004044 2045669 2090692 2137639 2186472 2237818 2290584 2343534
56022 2343534 2397854 2455027 2513936 2573281 2634801 2700504 2768914 2837953 2909298 2985687 3066115
56011 3066115 3148181 3232943 3322741 3416409 3511681 3610264 3715377 3826253 3940444 4059510
56001 4059510 4186809 4321545 4460820 4605878 4760498 4924917 5097232 5278972 5473282
55992 5473282 5679530 5895955 6125496 6372541 6636133 6913205 7206123 7519910 7854711
55983 7854711 8208763 8586167 8993476 9431287 9897877 10398512 10942076 11531384 12166603
55974 12166603 12855440 13609837 14435796 15337633 16329178 17429364 18650651 20004908 21517318
55965 21517318 23221422 25145756 27321918 29802874 32658698 35962524 39803494 44312363
55957 44312363 49657641 56027434 63643964 72794032 83824829 97128625 113170512 132508405
55949 132508405 155705763 183163390 214944431 250474891 287966144 323886159 353275131
55942 353275131 371269798 375047399 364835559 343400134 314649604 282377688 249604178
55935 249604178 218384172 189869754 164527174 142404814 123326334 106990076 93044139
55928 93044139 81155332 71032111 62408707 55043598 48737878 43333459 38690351 34681140
55920 34681140 31204353 28182868 25546445 23229536 21184507 19380369 17786440 16369283
55912 16369283 15104750 13978903 12975528 12074163 11260923 10529816 9872032 9273881 8726209
55903 8726209 8226387 7770041 7349337 6959967 6601583 6270956 5962320 5674342 5409044
55894 5409044 5163973 4933053 4714907 4512733 4326060 4150270 3984321 3831369 3691260
55885 3691260 3559762 3435900 3322970 3221195 3126012 3034947 2950182 2873154 2801991 2734961
55875 2734961 2670964 2605923 2534390 2455970 2375524 2296522 2218925 2143609 2073304 2008232 1945729
55864 1945729 1885047 1828056 1774796 1723153 1673528 1629015 1590098 1553595 1517513 1482621 1448811
55853 1448811 1414670 1381607 1353749 1332292 1313725 1294677 1274863 1254638 1233594 1212624 1193768
55842 1193768 1177138 1161225 1146575 1135509 1127779 1120331 1111860 1103765 1096055 1086346 1073782 1060020
55830 1060020 1045380 1027874 1007315 986690 968032 950141 931605 912896 894252 874695 854423
55819 854423 835224 817354 798848 779020 759750 742300 725806 710023 696611 686353 677786 669847
55807 669847 663375 658853 655129 651526 648846 647262 645518 643138 641088 639426 636695 632511 628388 625187
55793 625187 622194 619380 617795 616675 612826 604379 593055 581662 571538 563420 558399 556596 556808 558612
55779 558612 562939 569653 576456 581204 583450 582925 578609 570317 559300 546265 530578 512224 492719
55766 492719 473262 453876 435133 418730 405386 393874 382935 372466 362247 351476 340400
55755 340400 330567 322638 315586 308641 302254 296601 291068 285717 281328 277456 272553 266604 261472 257989
55741 257989 254858 251170 247744 245142 242576 239758 237664 236556 235368 233963 233701 234690 234776 232589 229508
55726 229508 227235 225427 223081 220320 217468 214216 211024 209532 210152 211020 210682 210054 210397 211209 211737 212873
55710 212873 215836 220357 225632 231760 238824 245912 252425 259086 266337 273114 278507 283258 288221 292723
55696 292723 295918 298566 302014 306441 311350 316724 322441 327574 331454 334460 336786 337534 335986 332659
55682 332659 328188 322390 315312 307820 300225 291795 282604 274276 267708 261669 254923 248229 242859 238712
55668 238712 235467 234157 235846 239828 244754 250560 257834 266378 275894 287080 300534 315479 330964
55655 330964 347279 364692 381679 395966 406551 413354 415858 413693 407903 400181 391341 381682 372086
55642 372086 363525 356173 350157 346412 345635 347175 350045 354067 358846 362663 363794 362110 358049 350923
55628 350923 339756 325071 308447 290949 273265 256562 241682 228063 214797 202120 190628
55617 190628 179852 169136 159303 151862 146880 143005 139192 135189 130815 126170 122222 119870 118601 117090
55603 117090 114806 112081 109191 106417 104456 103657 103240 102292 100965 99743 98303 96280 94356 93282 92450
55588 92450 90804 88614 86976 86110 85510 85295 85924 86957 87546 87907 88927 90592 92155 93649 95859 98880
55572 98880 101965 104766 107534 110169 112242 113972 116065 118560 120833 122660 124389 126107 127541 128705
55558 128705 129765 130379 130021 128868 127631 126666 125958 125643 125745 125629 124480 122116 118815 114814 110621 107177
55542 107177 104897 103103 101184 99626 98980 98606 97614 96386 95925 96196 96400 96503 97231 98787 100730 102919
55526 102919 105517 108305 110979 113913 117660 122044 126668 131883 138319 145903 154373 164185 175702 187973
55512 187973 199551 210192 220464 230049 237671 242455 244128 242225 236409 227435 216603 204450 191023
55499 191023 177059 163614 150824 138337 126700 116925 108899 101662 95110 90000 86286 82917 79354
55486 79354 75953 72738 69157 65253 61914 59691 58343 57582 57174 56381 54496 51993 50025 48796 47531
55471 47531 45956 44575 43499 42333 41275 41008 41356 41319 40599 39911 39649 39467 39279 39376 39406 38602 37191 36245
55453 36245 35914 35261 34094 33433 33622 33540 32430 31187 30977 31684 32600 33644 34993 36248 36787 36472 35530
55436 35530 34303 33454 33651 34629 35338 35325 35191 35455 35902 36410 37390 38823 39802 39641 38721 37709 36748 35924
55418 35924 35659 35968 36079 35509 34919 35195 36247 37351 38193 38869 39250 39001 38157 37171 36467 36106 35783 35129
55400 35129 34294 34106 35148 36792 37760 37619 37052 36676 36428 36195 36133 36053 35317 33758 32107 31169 31100 31645 32460
55381 32460 32997 32782 32030 31418 31086 30517 29558 28825 28840 29439 30279 31318 32508 33588 34347 34588 33921 32279
55363 32279 30530 29706 29639 29292 28434 27856 27790 27444 26555 26153 27050 28560 29490 29616 29437 29187 28828 28471 28161
55344 28161 27697 27116 26844 27015 27220 27294 27621 28234 28427 27824 27109 27028 27282 27139 26641 26557 27373 28817 30107
55325 30107 30423 29623 28694 28917 30302 31504 31528 30778 30048 29436 28805 28491 28769 29289 29767 30644 32244 33796
55307 33796 34152 33154 31585 30035 28531 27130 26188 26041 26731 27969 29167 29787 29866 29843 29798 29388 28666 28258
55289 28258 28389 28492 28207 28000 28231 28314 27565 26303 25408 25204 25428 25845 26216 26061 25242 24494 24662 25588 26373
55270 26373 26521 26290 26095 26121 26310 26299 25632 24492 23849 24343 25349 25743 25309 24727 24444 24316 24285 24608 25326
55251 25326 26049 26439 26520 26447 26362 26545 27333 28718 30212 31232 31553 31438 31332 31349 31067 30052 28552 27309
55233 27309 26604 25955 24962 23987 23618 23815 24063 24130 24244 24620 25194 25858 26655 27623 28523 28823 28087 26530 25082
55214 25082 24681 25564 27330 29381 31007 31478 30756 29892 29984 30796 31160 30692 30236 30500 31169 31645 31813 31700
55196 31700 31104 30038 28945 28085 27211 26171 25247 24640 24237 24179 24946 26496 28013 28894 29370 29810 30084 30065
55178 30065 30076 30390 30944 31866 33533 35603 36870 36740 36093 35995 36214 35816 34602 33226 32288 31995 32242 32439
55160 32439 31795 30302 28849 27892 26807 25223 24063 24245 25132 25439 25093 25052 25684 26564 27595 29071 30640
55143 30640 31279 30407 28280 25378 22241 19804 18978 19752 21343 23159 25020 26729 28227 30009 32529
55128 32529 35295 37406 38893 40615 42874 45030 46610 47923 49389 50999 52603 54009 54692 54135 52647
55113 52647 51203 50334 49799 49384 49238 49195 48572 47036 45109 43513 42546 42289 42831 43877 44712 44933 44829 44690
55095 44690 44257 43266 42126 41524 41580 41870 42189 42810 43942 45243 46039 45986 45409 44957 44915 44952 44607 43838 43006
55076 43006 42463 42369 42766 43536 44325 44720 44545 43855 42796 41634 40797 40593 40925 41460 42034 42724 43604 44594 45512
55057 45512 46171 46539 46833 47306 47886 48249 48271 48073 47628 46805 45916 45647 46145 46698 46764 46838 47732 49420 51210
55038 51210 52796 54466 56370 58188 59542 60309 60503 60263 59921 59779 59838 59931 60050 60296 60682 61165 61676 61918
55020 61918 61491 60456 59440 58873 58450 57736 56898 56377 56131 55732 54965 53826 52189 50055 48037 47061 47510
55003 47510 48902 50343 51087 50866 49992 49046 48320 47829 47822 48706 50236 51482 52049 52683 54130 55958 57200
54986 57200 57627 57685 57613 57446 57591 58529 60055 61476 62442 63120 63748 64625 66233 68802 71948 75179 78400
54969 78400 81466 83926 85922 88692 93275 99266 105877 113645 123775 136175 149545 163354 178254
54956 178254 194305 210061 223808 234614 241770 244337 241925 235229 225296 212861 198684 183814
54944 183814 169072 154839 141613 130132 120594 112386 104982 98543 93289 88832 84625 80674 77395
54931 77395 74991 73266 71892 70780 70320 71112 73177 75700 78073 80878 85096 90580 96246 101805 108351
54916 108351 116948 127481 139210 151599 164176 176185 186813 195280 200501 201396 197912 191146 182131
54903 182131 171144 158550 145490 133098 121574 110718 100911 92837 86522 81319 76798 73054 70156
54890 70156 67808 65712 63990 63011 62858 63142 63387 63521 63752 63988 63760 62935 62023 61379 60599 59284 57945
54873 57945 57308 56946 55672 53321 51200 50451 50747 50986 50585 49751 48965 48557 48396 47846 46482 44875 44020
54856 44020 43895 43352 41719 39708 38341 37695 37326 37323 38134 39577 40739 40859 39952 38584 37327 36454 36028
54839 36028 36178 37111 38667 40087 40619 40257 39567 39006 38864 39570 41298 43325 44584 44946 45262 46141 47399
54822 47399 48834 50617 52657 54411 55735 57231 59297 61490 63316 65082 67509 70904 75161 80157
54808 80157 85821 92219 99882 109579 121464 134808 148741 162744 176218 188164 197686 204333 207711
54795 207711 207337 203226 196131 186967 176514 165814 156084 147759 140232 133016 126523 121273 116996 113131
54781 113131 109665 106936 105030 104017 104285 106067 108927 112266 116055 120649 126278 133179 141828 152446
54767 152446 164518 177189 189817 201822 212499 221609 229805 237916 245932 253086 258719 262598 264631
54754 264631 264617 262080 256228 246461 233232 217994 202076 186073 170535 156391 144057 132791 121753
54741 121753 111290 102401 95255 89088 83351 78156 73599 69430 65510 62077 59378 57429 56235 55910
54727 55910 56421 57391 58225 58447 58026 57439 57179 57202 57073 56649 56210 55933 55721 55659 56072 56954 57895 58765 59856
54708 59856 61073 61701 61386 60759 60627 61103 61936 63046 64249 65012 65055 64715 64257 63466 62464 62184 63257 64977
54690 64977 66212 66878 67710 69011 70518 72166 74041 75721 76557 76623 76726 77521 79147 81497 84288 87003
54674 87003 89370 91750 94527 97388 99830 102096 104889 108317 111899 115543 119828 125304 132101 140205
54660 140205 149603 160195 172062 185730 201613 219180 237082 253976 268785 280385 287679 290060
54648 290060 287470 280147 268708 254274 238065 221008 204009 188202 174381 162421 151772 142226
54636 142226 133807 126320 119611 113912 109318 105317 101440 97927 95051 92308 89183 86281 84670 84368
54622 84368 84460 84463 84492 84266 83193 81514 80244 79694 79078 77823 76346 75190 74256 73259 72162 70818 68905
54605 68905 66641 64914 64319 64560 65066 65648 66268 66791 67266 68020 69151 70334 71289 72000 72397 72352 72055 71824
54587 71824 71437 70344 68668 67278 66608 66076 65030 63572 62140 60892 59947 59621 59938 60409 60709 61085 61673
54570 61673 61996 61727 61474 62104 63579 65144 66463 67881 69535 70864 71287 71009 70839 71347 72399 73514
54554 73514 74529 75773 77685 80428 83950 88185 93069 98559 104782 111905 119645 127241 134210 140771
54540 140771 147071 152301 155168 155094 152449 147854 141887 135284 128615 121735 114279 106761 100408 95753 92081
54525 92081 88557 85218 82535 80504 78679 76741 74720 72865 71432 70358 69145 67434 65601 64312
54511 64312 63526 62632 61602 61170 61641 62305 62471 62384 62565 62876 62875 62702 62979 63996 65473 66931 67928 68143 67670
54492 67670 67085 66891 66989 66966 66723 66551 66687 67097 67556 67798 67703 67511 67667 68317 69079 69515 69641 69843 70384 71165
54472 71165 71866 72272 72496 72826 73225 73146 72177 70786 70020 70405 71466 72369 72692 72506 72121 71879 71938 72091 72030
54453 72030 71786 71623 71519 71140 70410 69731 69531 69810 70203 70243 69643 68637 67927 67939 68270 68298 68097 68103 68084 67289 65711
54432 65711 64336 63880 64032 64286 64768 65732 66830 67464 67544 67467 67624 68219 69193 70111 70528 70687 71391 72914 74630
54413 74630 76070 77709 80150 83029 85374 86820 87851 89042 90570 92288 93802 94547 94230 93160 91951
54398 91951 90982 90349 89993 89579 88544 86769 85046 84403 84922 85588 85396 84334 83213 82731 82795 82725 82015 80823
54380 80823 79722 79111 78978 78997 78616 77254 74807 71923 69426 67565 66110 64984 64325 64114 64302 65141 66714
54363 66714 68250 68756 68401 68444 69588 71246 72669 73852 74891 75413 75302 75322 76205 77642 78846 79628 80185
54346 80185 80252 79332 77621 75956 74884 74314 74009 73921 73954 73805 73108 71663 69634 67643 66432 66210 66524 66770
54328 66770 66561 65641 64033 62379 61488 61287 60824 59549 57929 56500 55172 53958 53521 54212 55220 55567
54312 55567 55416 55576 56143 56567 56683 56716 56477 55544 54201 53334 53352 53859 54375 54713 54697 54243 53725 53664 54015 54357
54292 54357 54675 55325 56229 56849 57027 57205 57663 58161 58493 58839 59370 59969 60539 61170 61877 62537 63176 63950 64776
54273 64776 65370 65622 65597 65277 64813 64954 66467 68976 71039 71724 71596 71751 72380 72756 72335 71325 70276 69578
54255 69578 69402 69768 70445 70923 70757 70029 69372 69373 69990 70670 70961 70777 70137 69121 68152 67835 68188 68500 68301
54236 68301 68044 68386 69182 69797 70101 70456 70838 70713 69843 68682 67825 67483 67560 67803 67861 67592 67388 67821 68919
54217 68919 70159 71138 71854 72290 72266 71825 71352 71100 70940 70759 70793 71302 72126 72777 72923 72702 72629 73146 74086 74703
54197 74703 74378 73246 71872 70529 69121 67682 66400 65138 63434 61198 59092 57954 57982 58598 58962 58582
54181 58582 57559 56343 55222 54172 53255 52827 53066 53513 53574 53359 53534 54254 54781 54376 53232 52250 52114 52849
54163 52849 54087 55411 56379 56484 55441 53607 51911 51095 51093 51334 51528 51762 51919 51618 50944 50644 51207 52133
54145 52133 52533 52079 51049 49834 48890 48726 49341 49967 49973 49735 50016 50788 51403 51691 52065 52568 52686 52175 51374
54126 51374 50514 49488 48467 48034 48416 49142 49814 50650 51899 53223 54115 54528 54706 54668 54266 53558 52682 51505
54108 51505 49786 47755 46241 46048 47199 48854 50017 50352 50241 50172 50397 51184 52878 55315 57578 58883
54092 58883 59480 60140 61000 61514 61416 60969 60272 59112 57706 56859 56954 57314 56997 55924 54838 54396 54647 55249
54074 55249 55899 56560 57391 58442 59478 60242 60861 61735 63038 64526 65819 66710 67259 67810 68775 70162 71474
54057 71474 72350 73051 73950 74849 75362 75717 76464 77520 78244 78465 78638 78862 78594 77692 77007 77455 78994 80959
54039 80959 82972 85085 87382 89929 92884 96255 99706 102860 105701 108517 111637 115273 119327 123258
54025 123258 126504 129132 131696 134347 136607 138233 139749 141700 143832 145498 146538 147188 147337 146483 144455
54010 144455 141731 138937 136312 133720 130927 127732 124047 119969 115759 111673 107822 104246 101063 98435
53996 98435 96263 94091 91583 89132 87552 87026 86791 86162 85498 85593 86449 87251 87406 86996 86246 85182 83917
53979 83917 82678 81432 79924 78192 76646 75592 75108 75381 76588 78309 79585 79775 79008 77786 76592
53964 76592 75894 75907 76265 76421 76453 76879 77642 78054 77966 78126 79034 80210 81157 82325 84425 87257 90007 92459
53946 92459 95255 99013 103704 108847 114016 119216 124964 131894 140080 148889 157545 165599 172761 178708
53932 178708 183258 186366 187822 187357 185262 182432 179522 176457 173026 169554 166626 164576 163548 163671 164789
53917 164789 166352 167961 169764 172047 174777 177840 181398 185655 190508 195671 200845 205643 209707 213126
53903 213126 216276 219026 220608 220536 219128 216896 214068 211039 208484 206371 203571 199223 193963 189006 184436
53888 184436 179378 173571 167805 162817 158560 154666 150958 147356 143791 140352 137201 134365 131922 130189
53874 130189 129274 128588 127424 125950 125033 124978 124985 123979 121631 118381 114830 111334 107988 104812 101884 99270
53858 99270 96868 94559 92494 90929 89687 88268 86707 85780 85916 86371 86072 84958 83863 83263 82813 82074
53842 82074 81106 80208 79539 79121 78900 78740 78557 78450 78523 78677 78795 78926 79106 79182 79102 79148 79545 80087 80391 80372 80216
53821 80216 80159 80550 81738 83499 84969 85640 86075 87160 88886 90470 91397 91778 91885 91960 92437 93779 96015
53804 96015 98792 101783 104763 107520 110140 113178 117084 121639 126242 130422 133655 135245 135162 134667 135244
53789 135244 137023 138925 140132 140586 140319 139294 137993 137168 136813 136149 134809 133252 131810 130125 127895
53774 127895 125471 123307 121401 119556 117694 115620 113028 110066 107378 105286 103430 101469 99584 97943
53760 97943 96215 94068 91716 89522 87437 85281 83292 81921 81229 80871 80518 80051 79445 78727 77947 77037
53744 77037 75889 74632 73636 73095 72866 72831 73147 73917 74865 75533 75665 75319 74779 74428 74462 74658 74650 74462 74478 74847
53724 74847 75301 75644 76042 76692 77519 78324 78940 79140 78796 78278 78272 78927 79557 79445 78666 77822 77321 77238 77678 78787
53704 78787 80412 82011 83020 83282 83238 83686 85134 87217 88954 89669 89550 89265 89325 89966 91363 93625 96566
53687 96566 99613 101977 103044 102820 102002 101412 101312 101420 101520 101793 102550 104008 106330 109528 113119 116223
53671 116223 118226 119273 119972 120793 121766 122566 122815 122476 122008 121936 122242 122438 122225 121852 121703 121801 121778 121189 119836
53652 119836 117990 116241 114935 113873 112902 112601 113768 116136 118171 118495 117157 115306 113930 113258 113068
53637 113068 113175 113579 114314 115186 115772 115863 115834 116251 117070 117634 117537 117160 117192 117917 119151 120610 122116 123626 125185
53618 125185 126712 127852 128288 128220 128226 128632 129309 130103 131039 131972 132528 132632 132740 133265 134076 134861 135738 137138 139200
53599 139200 141575 143816 145771 147553 149216 150594 151575 152577 154365 157183 160322 162937 165014 167084
53585 167084 169225 171015 172402 173917 175896 178093 180216 182258 184131 185527 186404 187082 187645 187727 187177 186447
53569 186447 186012 185828 185597 185163 184479 183603 182869 182554 182254 181210 179417 177739 176718 176130 176007 177084 179481
53552 179481 181830 182676 182168 181459 181007 180453 179849 179785 180380 181125 181784 182593 183515 184113 184384 184951 186177 187682
53534 187682 188929 189719 189903 189242 187934 186761 186337 186519 186825 187104 187531 188289 189567 191554 194066 196452
53518 196452 198348 200359 203532 208024 212713 216331 218812 221278 224841 229698 235362 241432 247835 254553
53504 254553 261404 268182 274852 281607 288878 297155 306545 316562 326631 336789 347592 359332 371700
53491 371700 384283 397035 410154 423757 437790 451929 465614 478541 491182 504343 518156
53480 518156 532051 545876 560358 576088 592597 608896 624472 639291 653330 666682 679821
53469 679821 693201 706743 720128 733255 746030 758074 769191 779799 790360 800745 810710 820677
53457 820677 831257 842154 852310 861055 868484 874734 879590 882894 884740 885170 884152 881828 878309 873277
53443 873277 866453 858438 850387 842758 835011 826698 818118 809638 801056 792003 782475 772538 762004 750860
53429 750860 739572 728510 717437 706016 694572 683738 673527 663292 652690 642294 633105 625710
53417 625710 620006 615614 612352 610276 609338 609135 609187 609396 610050 611344 613140 615275 617914 621403 625889 631160
53401 631160 636808 642504 648326 654866 662855 672534 683441 694918 706714 718980 731823 745125 758833
53388 758833 773286 789030 806344 825037 844834 865850 888512 913018 939040 965956 993231
53377 993231 1020577 1048016 1075901 1104647 1134307 1164613 1195499 1227219 1259778 1292575 1324920
53366 1324920 1356571 1387452 1417211 1445520 1472514 1498363 1522573 1544423 1564052 1582467 1600287
53355 1600287 1617124 1632350 1645899 1657881 1667865 1675061 1679002 1679592 1676604 1669527 1657950 1641883 1621704
53342 1621704 1598005 1571595 1543510 1514849 1486448 1458558 1430874 1403050 1375216 1347957 1321706
53331 1321706 1296316 1271255 1246172 1221215 1196861 1173463 1150881 1128555 1105915 1082739 1059124
53320 1059124 1035376 1012048 989842 969121 949513 930342 911614 894374 879937 868856 860713
53309 860713 854735 850346 847078 844183 840623 835548 828686 820251 810670 800608 791010 782624 775315 768229
53295 768229 760758 753122 745829 738971 732467 726736 722671 720807 720698 721149 721054 720165 719209 719226 720750 723728
53279 723728 728036 733673 740474 748105 756512 765869 775979 786322 796983 808768 821833 834932 846832
53266 846832 857936 869515 881642 893035 902913 911905 920805 929337 936619 942263 946539 949914 952774
53253 952774 955253 957006 957397 956047 952941 947948 940666 930891 918870 905044 889915 874160 858297
53240 858297 842043 824614 805903 786937 768836 751828 735595 720071 705395 691486 678236
53229 678236 665914 654813 644566 634246 623215 611600 599889 588246 576301 563595 550290
53218 550290 537361 525823 515715 506128 496356 486749 478315 471706 466735 462630 458600 454421 450596
53205 450596 447699 445449 442786 439030 434544 430007 425338 419704 412351 403171 392698 381850 371459
53192 371459 361669 351962 342021 332324 323583 315846 308587 301490 294648 288040 281343 274379 267355 260492
53178 260492 253683 246728 239693 232855 226347 220049 213807 207665 201792 196215 190732 185240 180103 175986
53164 175986 173215 171410 169818 167918 165631 163110 160518 158001 155690 153646 151804 149978 148011 145980
53150 145980 144177 142801 141708 140648 139616 138735 137871 136677 135096 133542 132469 131974 131814 131626 131070 130055
53134 130055 128896 128025 127464 126858 126053 125278 124641 123894 122919 122089 121807 121956 122155 122378 122966 124095 125478 126501
53116 126501 126504 125197 123029 120992 119718 118906 117934 116800 116043 115830 115671 115146 114498 114203 114230 114062 113406 112593
53098 112593 112184 112357 112831 113307 113776 114327 114879 115285 115567 115815 115874 115429 114454 113383 112710 112618 113027 113764 114551
53079 114551 115014 114918 114370 113735 113433 113757 114639 115559 115934 115748 115569 115791 116102 115950 115351 114945 115314 116450 117867
53060 117867 119046 119769 120182 120666 121535 122715 123700 123863 123021 121724 120828 120616 120472 119594 117888 115943 114320
53043 114320 113219 112690 112732 113099 113435 113745 114362 115318 116053 115982 115181 114289 113910 114190 114847 115573 116451 117901 120008
53024 120008 122117 123442 123892 123888 123531 122638 121565 121208 121924 123131 124259 125445 126907 128274 129048 129315 129461
53007 129461 129645 129997 130897 132447 134059 135149 135930 136877 137749 137882 137297 136793 136924 137522 138207 138773 139019 138802
52989 138802 138413 138413 138956 139621 140064 140426 141062 142229 144067 146452 148726 150040 150253 150227 150998 152783 154864
52972 154864 156283 156587 156155 155832 156129 156752 157161 157417 158045 159091 159923 160250 160803 162491 165066 167205 167953
52955 167953 167672 167388 167543 167758 167731 167864 168704 170046 171017 171096 170642 170247 169929 169290 168293 167525 167638 168701 170093
52936 170093 170991 171038 170621 170417 170686 171206 171834 172718 173799 174587 174783 174778 175138 175873 176653 177440 178372 179204 179545
52917 179545 179625 180221 181658 183383 184732 185659 186485 187302 187948 188274 188131 187238 185403 182836 180096 177734 176095
52900 176095 175298 175205 175372 175196 174264 172620 170654 168717 166897 165218 163892 163148 162818 162409 161652 160719 159796
52883 159796 158800 157737 157039 157202 158200 159511 160551 160990 160923 160998 162012 164033 166176 167614 168515 169526 170700
52866 170700 171548 171902 171954 171503 169921 167059 163510 159753 155674 151280 147304 144551 142980 141891 140873
52851 140873 140063 139557 139052 138161 136855 135361 133766 131928 129865 128053 127120 127214 127882 128589 129071 129083 128204
52834 128204 126245 123591 120824 118217 115913 114231 113235 112309 110840 109242 108550 108946 109399 108984 107880 106807
52818 106807 106114 105818 106006 106656 107401 107960 108565 109567 110812 111793 112223 112164 111775 111326 111263 111888 113037 114373
52800 114373 115909 117909 120356 122806 124759 125887 125993 125125 123832 123005 123275 124552 126162 127332 127614
52785 127614 127062 126104 125220 124742 124966 126148 128112 129967 130664 130025 128992 128668 129273 130178 130733 130711 130088 128853
52767 128853 127225 125695 124590 123768 122985 122341 121990 121595 120526 118669 116599 114916 113811 113393 113828 114830
52751 114830 115553 115448 114948 114809 115090 115325 115429 115758 116334 116708 116717 116808 117394 118339 119333 120322 121292 121959 122064 121767
52731 121767 121444 121188 120810 120319 120165 120910 122724 125244 127851 130030 131492 132190 132452 133027 134555 136829
52715 136829 138931 140322 141467 143068 145034 146624 147292 146920 145537 143531 141929 141651 142365 142813 142435 141989
52699 141989 142301 143147 143844 144349 145110 146130 146879 147091 147188 147773 148986 150421 151532 152053 152167 152281 152726 153625
52681 153625 154897 156189 156989 157087 156816 156551 156077 154911 153166 151556 150480 149632 148691 147821 147187 146468 145238
52664 145238 143454 141240 138573 135579 132829 130853 129527 128405 127527 127457 128547 130557 133060 135933 139306
52649 139306 143240 147527 151759 155540 158685 161200 163105 164352 164842 164418 162880 160288 157229 154532 152670
52634 152670 151602 151187 151382 152005 152658 153011 152926 152257 150928 149278 147933 147090 146303 145118 143567 141860 140073
52617 140073 138425 137386 137066 136912 136483 136210 136823 138208 139406 139693 139161 138299 137557 137370 138077 139546 141179
52600 141179 142514 143594 144607 145425 145800 145870 146142 146871 147706 148139 148198 148417 149142 150212 151442 152997 154899
52583 154899 156472 156867 156091 154948 153935 152745 151041 149142 147579 146389 145254 144037 142883 141977 141415
52568 141415 141055 140363 138812 136745 135436 135830 137444 138896 139268 138615 137422 136142 135194 134880 135101 135435
52552 135435 135560 135463 135279 135106 134931 134592 133829 132540 130917 129253 127700 126314 125140 124204 123541 123306 123621
52535 123621 124264 124763 124929 125022 125213 125219 124628 123353 121572 119529 117584 116151 115384 115165 115475 116383 117525 118168
52517 118168 118110 118064 118711 119813 120659 120948 120718 119852 118365 116945 116510 117244 118501 119562 120073 119954 119411 118955
52499 118955 118936 119136 119176 119075 118999 118705 117875 116793 116045 115608 114911 113794 112797 112352 112314 112458 112893 113646 114201
52480 114201 113845 112400 110497 109159 109064 110031 111250 112090 112553 112866 113046 113152 113582 114614 115868 116680 116796
52463 116796 116322 115307 113961 112935 112686 112760 112429 111833 111668 111868 111593 110609 109684 109295 108892 107921 106804 106280
52445 106280 106329 106369 106169 105988 106100 106632 107598 108651 109047 108367 107192 106664 107354 108732 109739 109745 109064 108635 109109
52426 109109 110208 111126 111439 111320 110927 110166 109162 108372 107860 106977 105281 103458 102756 103544 104931 105844 106037
52409 106037 105914 105716 105281 104543 103917 103931 104576 105298 105688 105889 106164 106393 106312 106016 105794 105648 105424 105326 105800 106841
52389 106841 107870 108418 108600 108769 109068 109423 109743 110021 110427 111269 112586 113881 114610 114857 115137 115617 116029 116303
52371 116303 116731 117416 118098 118632 119140 119598 119787 119834 120258 121329 122864 124737 126999 129357 131182 132311 133216
52354 133216 134130 134775 135315 136706 139403 142368 144155 144581 144589 144847 145352 146181 147694 149911 152294 154276 155567
52337 155567 155987 155491 154416 153305 152460 152002 152235 153474 155491 157554 159153 160427 161830 163636 165755
52322 165755 167821 169532 171108 173279 176552 180631 184908 189376 194609 200822 207348 213189 217867 221720
52308 221720 225592 230230 235717 241440 246785 251820 257157 263302 270311 277930 285754 293357 300637 308017
52294 308017 316067 324973 334634 345120 356629 369005 381702 394276 406610 418630 430199 441380
52282 441380 452556 464156 476456 489649 503794 518548 533185 546986 559510 570507 579894 587971
52270 587971 595395 602709 609962 616839 623039 628457 633152 637267 640909 644010 646374 647839 648372 648085 647337
52255 647337 646687 646521 646642 646477 645743 644728 643849 643131 642299 641205 640036 639200 639242 640749 644087 649087 655157
52238 655157 661883 669493 678506 688893 699748 710078 719837 729890 740927 752681 764365 775568
52226 775568 786436 797146 807568 817468 826781 835595 844014 852050 859543 866131 871443 875342 877930
52213 877930 879337 879491 878053 874543 868737 861047 852346 843164 833173 821759 809065 796138 783996
52200 783996 772799 762066 751434 740984 730929 721311 712085 703319 695162 687619 680466 673505 666868
52187 666868 660968 656145 652362 649234 646272 643120 639704 636208 632817 629427 625698 621420 616714 611906
52173 611906 607335 603331 600121 597567 595171 592525 589675 586888 584187 581357 578334 575360 572661 570190
52159 570190 567805 565573 563745 562394 561206 559799 558197 556794 555745 554604 552846 550553 548219 545945
52145 545945 543274 539957 536430 533302 530731 528600 526988 526033 525520 524985 524183 523086 521527 519265 516479
52130 516479 513875 512044 510816 509411 507184 504207 501148 498582 496507 494615 492925 491854 491614 491897 492425
52115 492425 493470 495443 498123 500761 502930 504893 507054 509451 511963 514745 518179 522498 527634 533437
52101 533437 539876 547020 554923 563632 573292 584140 596309 609683 624006 639161 655222 672252
52089 672252 690126 708517 726937 744892 762186 779091 796011 812914 829351 844987 859859
52078 859859 874053 887475 900045 911780 922482 931619 938743 943819 947031 948596 948993 948940 948711 947641
52064 947641 944776 939914 933738 927024 920072 912828 905227 897356 889448 881727 874165 866560 858952 851762
52050 851762 845355 839695 834586 829923 825551 821248 817179 813922 811655 809796 807926 806624 806674 807807 809055
52035 809055 810166 811815 814473 818028 822551 828440 835400 842140 847699 852464 857350 862485 867305 871560
52021 871560 875507 879232 882319 884252 884822 884185 882767 880987 878835 875804 871370 865378 857793 848410 837128
52006 837128 824320 810560 796075 780792 764815 748447 731730 714309 695945 676943 657929
51995 657929 639292 620981 602789 584828 567686 552062 538104 525074 511671 496750 479828
51984 479828 461099 441155 420729 400518 381106 362923 346255 331235 317743 305303 293235
51973 293235 281203 269676 259622 251562 245060 239238 233608 228163 222864 217488 212033 206958 202780
51960 202780 199504 196575 193386 189870 186567 184062 182289 180577 178376 175752 173042 170369 167814 165754
51946 165754 164583 164149 163903 163541 163093 162441 161237 159394 157256 155158 153152 151265 149688 148530 147686 147025
51930 147025 146434 145601 144183 142345 140783 139967 139627 139162 138296 137191 136209 135738 135953 136541 136933 136996 137139 137580
51912 137580 137867 137460 136430 135236 134117 133143 132564 132591 132969 133274 133518 133972 134422 134253 133456 133016 133874 135798
51894 135798 137684 138838 139541 140353 141288 141947 142229 142550 143348 144719 146637 149183 152250 155292 157803 160003
51878 160003 162659 166239 170682 175969 182397 190039 198511 207698 218400 231805 248525 268560 291900
51865 291900 318615 348221 379268 409440 435712 454651 463417 461086 448938 429354 404655 376944
51853 376944 348479 321448 297232 276065 257524 241193 226884 214466 203720 194370 186114 178617
51841 178617 171658 165347 160051 155931 152656 149786 147349 145732 144979 144517 143788 142851 142108 141612 141014 140146
51825 140146 139300 138824 138680 138557 138279 137880 137369 136623 135648 134808 134582 135054 135836 136606 137517 138848 140366 141434
51807 141434 141757 141671 141580 141491 141304 141194 141311 141299 140571 139009 137072 135238 133739 132831 132845 133714 134788 135391 135399
51788 135399 135088 134675 134307 134279 134847 135840 136834 137711 138656 139547 139843 139348 138706 138722 139416 140229 140933 141738 142478
51769 142478 142394 141090 139280 138159 138231 139066 139998 140676 141088 141522 142486 144323 146737 148889 150014 149902 148884
51752 148884 147587 146675 146564 147228 148299 149353 150094 150453 150598 150745 150841 150571 149804 148805 147871 146983 146022 145075
51734 145075 144233 143308 142065 140547 138942 137386 136204 135991 136966 138420 139316 139253 138492 137358 136217 135714
51718 135714 136198 137016 137124 136464 135969 136190 136740 137174 137514 137676 137259 136344 135674 135521 135094 133673 131720 130293
51700 130293 129862 130290 131420 132984 134393 135382 136627 139035 142640 146710 150635 154008 156078 155943 153413
51685 153413 149269 144641 140428 137090 134510 132184 129935 128298 127806 128197 128836 129594 130680 131803 132296
51670 132296 132057 131701 131750 132240 133167 134608 136236 137326 137525 137175 136715 136238 135889 136153 137311 138887 140067
51653 140067 140590 140958 141797 143171 144524 145192 144962 144083 142796 141095 139062 137113 135646 134613 133770 133171
51637 133171 133047 133336 133695 133902 133863 133409 132510 131624 131302 131448 131465 131077 130531 129981 129303 128671 128760 129965 131704
51618 131704 132766 132242 130115 127307 125201 124715 125607 126920 128117 129499 131448 133751 135841 137351 138237
51603 138237 138646 138858 139084 139174 138775 137924 137216 137313 138513 140729 143453 145749 146873 147166 147788 149318 151105
51586 151105 152250 152705 152926 153011 152848 152791 153474 155004 156876 158695 160476 162219 163720 164914 166050 167348
51570 167348 168786 170297 171904 173481 174707 175527 176442 178011 180083 181785 182403 182066 181349 180405 178841 176515
51554 176515 174018 172116 170945 170105 169347 168731 168242 167755 167433 167670 168475 169348 169933 170424 171116 171952 172779 173653
51536 173653 174537 175044 174903 174455 174228 174128 173470 171769 169213 166407 163956 162172 160820 159219 156942 154434
51520 154434 152652 152039 152214 152626 153099 153564 153675 153052 151810 150563 149897 149939 150352 150587 150214 149289 148451 148423
51502 148423 149221 149978 149810 148812 147927 147754 147862 147490 146629 145917 145631 145329 144620 143781 143313 143233 143129 142748 142292
51483 142292 142237 142980 144472 146037 146853 146855 146962 148112 150302 152815 155150 157303 159344 161243 163113 165167
51467 165167 167350 169382 171293 173561 176471 179537 181665 181780 179394 174928 169594 164646 160526 156837
51453 156837 153137 149426 145807 142135 138350 134832 132016 129794 127668 125433 123350 121730 120674 120213
51439 120213 120322 120703 120867 120587 120097 119765 119842 120588 122274 124727 127093 128412 128455 127765 126935 126071 124979 123628
51421 123628 122286 121296 120792 120574 120209 119274 117586 115262 112674 110268 108244 106343 104206 101998 100360
51406 100360 99480 98611 96984 94985 93801 93940 94736 95401 95899 96495 97043 97237 97158 97044 96806 96290 95827 95935
51388 95935 96583 97210 97530 97826 98381 98997 99272 99126 98876 98902 99328 99995 100788 101939 103756 105980 107783 108691
51370 108691 109195 110035 111203 112157 112742 113301 113987 114660 115432 116563 117648 117568 115718 112839 110259 108631 107634
51353 107634 106614 105158 103293 101390 99809 98552 97428 96511 96079 96055 95984 95712 95576 95683 95499 94607 93472
51336 93472 93016 93640 95019 96601 97872 98381 98027 97333 97108 97781 99157 100675 101710 101933 101655 101654 102340 103251
51318 103251 103641 103336 102689 101939 101072 100212 99654 99498 99575 99712 99771 99519 98818 97916 97175 96506 95482 94025 92626
51299 92626 91796 91645 92095 93092 94407 95535 96119 96334 96663 97399 98510 99883 101436 103107 104913 107094
51283 107094 109993 113659 117638 121349 124660 127875 131013 133331 133916 132680 130384 127687 124604 121091
51269 121091 117629 114847 112830 111205 109708 108346 107180 106318 105931 105908 105681 104902 104133 104327 105615 107124
51253 107124 108037 108287 108169 107867 107715 108352 110150 112684 115129 117057 118591 120005 121493 123204 125203 127338
51237 127338 129294 130726 131351 131095 130287 129491 128970 128510 127929 127523 127655 128132 128415 128400 128591 129420 130796 132438
51219 132438 134297 136345 138202 139330 139541 139047 138028 136455 134391 132205 130330 128942 127974 127297 126666
51204 126666 125668 124028 121972 120054 118480 116884 114910 112812 111248 110559 110508 110707 111082 111778 112828 114118
51188 114118 115641 117554 119848 122066 123589 124267 124631 125370 126620 127865 128459 128154 127232 126285 125784 125618
51172 125618 125068 123470 120967 118431 116634 115719 115503 115894 116776 117743 118300 118306 118051 117948 118251 118874 119370 119231
51154 119231 118468 117720 117622 118213 119201 120561 122463 124698 126686 128169 129522 131168 132987 134569 135831 137038
51138 137038 138270 139197 139475 139164 138603 138012 137427 136955 136841 137122 137459 137562 137680 138368 139773 141461 143028
51121 143028 144583 146400 148390 150129 151328 152016 152372 152528 152452 151895 150583 148633 146663 145279 144560 144220
51105 144220 144100 144260 144685 145195 145665 146083 146339 146185 145533 144748 144543 145500 147519 149680 150866 150709 149824 149025
51087 149025 148519 148113 147988 148795 150924 153924 156799 158746 159583 159633 159274 158633 157725 156762 156099 155822 155693 155636
51069 155636 155915 156540 156872 156241 154802 153316 152176 151137 149933 148656 147468 146485 146120 147007 149235 151949
51053 151949 154086 155347 156194 157079 158029 158902 159696 160461 161123 161631 162209 163256 164875 166623 167907 168590 169000
51036 169000 169448 170009 170862 172423 174910 177993 181181 184308 187389 190166 192213 193409 194163 195227 197357
51021 197357 200792 204748 207814 209321 210078 211337 213362 215580 217801 220418 223519 226671 229774 233284
51007 233284 237339 241336 244791 248080 251996 257116 263843 272423 282372 292449 301821 311012 321187 332844
50993 332844 345741 359820 375470 392839 411441 430602 450022 469837 490425 512186 535439
50982 535439 560531 588073 618861 653363 691493 733035 778045 826545 877979 931260 985232
50971 985232 1038934 1091659 1142965 1192410 1238942 1280833 1316636 1346037 1369429 1386900 1398155
50960 1398155 1403254 1402845 1397641 1388226 1375461 1360561 1344581 1328219 1312279 1297777 1285216 1274071
50948 1274071 1263380 1252629 1241723 1230304 1217558 1202727 1185501 1165842 1143692 1118893 1091230
50937 1091230 1060487 1026642 990089 951464 911215 869552 827006 784833 744496 706679 671036
50926 671036 637008 604746 575125 548994 526511 507122 490057 474863 461488 449857 439482
50915 439482 429777 420776 413146 407304 402837 399085 395984 393918 392928 392541 392342 392226 392122 391968 392012 392695
50899 392695 394129 396082 398556 401862 405957 410206 414133 417997 422358 427522 433730 441395 450597 460710
50885 460710 471114 482085 494362 507983 522232 536793 552340 569802 589513 611380 635499
50874 635499 662192 691640 723862 759047 797611 839792 885388 934198 986778 1044571 1109089
50863 1109089 1181034 1260385 1347145 1441616 1543914 1653661 1770289 1893162 2021047 2151743
50853 2151743 2282516 2410568 2532706 2644938 2743133 2824220 2886559 2929439 2952775 2957325 2944701
50842 2944701 2917026 2876921 2827748 2773342 2717191 2662074 2610466 2564769 2526790 2497147 2475374
50831 2475374 2460339 2450308 2442767 2434537 2422249 2402943 2374606 2336400 2288343 2230696 2163684 2087745
50819 2087745 2003778 1913058 1817165 1718132 1618414 1520350 1425612 1335312 1250541 1172505 1101954
50808 1101954 1038614 981429 929555 883080 842674 808532 779799 755136 733668 715302 700255
50797 700255 688569 680052 674392 671164 669790 669555 669658 669378 668350 666694 664768 662760 660580 658039 655006
50782 655006 651463 647613 643888 640644 637779 634856 631673 628622 626391 625385 625443 626155 627493 630115 634926
50767 634926 642271 651683 662419 673933 685662 696798 706809 716060 725465 735546 746199 757319
50755 757319 769217 782334 797032 813740 832877 854491 878411 904999 935386 970812 1012049
50744 1012049 1059626 1113978 1174895 1241212 1311501 1384905 1460857 1538269 1615454 1690588 1761631
50733 1761631 1825911 1880444 1922862 1951732 1966122 1965527 1950485 1922847 1885227 1840520 1791921 1742770
50721 1742770 1695831 1652905 1615270 1584034 1559667 1541553 1528579 1519926 1514777 1511379 1507146 1499842
50709 1499842 1488253 1471534 1448509 1418134 1380407 1336369 1287215 1233812 1177180 1119157 1062207
50698 1062207 1008408 958599 912531 869866 830917 796327 766185 739786 716351 695791 678588
50687 678588 665096 655136 648199 643845 641959 642827 646972 654709 665721 679104 693856 709334 725288
50674 725288 741518 757524 772517 785867 797582 808204 818152 827348 835665 843547 851863 861087 870840
50661 870840 880338 889166 897543 905982 914887 924534 935359 948026 962938 979680 997247 1014972 1032977
50648 1032977 1051510 1070246 1088742 1107335 1126930 1147776 1168987 1189393 1208376 1225607 1240495
50637 1240495 1252371 1261018 1266632 1269425 1269594 1267532 1263688 1258196 1250883 1241612 1230395 1217272 1202348
50624 1202348 1186046 1169135 1152443 1136579 1121846 1108276 1095742 1084219 1073973 1065497 1059201 1055089
50612 1055089 1052646 1051167 1050406 1050809 1052753 1055466 1057046 1055717 1050799 1042312 1030088 1013710 993115 968756
50598 968756 941256 911269 879785 848197 817827 789317 762440 736611 711823 689139 669954
50587 669954 654677 642530 632828 625881 622117 620830 620466 619935 618921 617160 614384 611116 608638 607751
50573 607751 608155 609341 611431 614712 618974 624004 630309 638626 648926 660529 673151 687234 703182
50560 703182 720789 739455 758521 777276 795176 812357 829586 847354 865235 882384 898542
50549 898542 914278 930433 947714 966797 988298 1012248 1037835 1064099 1091082 1120100 1152709
50538 1152709 1189561 1230435 1275221 1324369 1378190 1436062 1496783 1559636 1624632 1691570 1759177
50527 1759177 1825476 1888695 1947426 2000103 2044906 2080356 2105634 2120180 2123452 2115398 2096783 2068573
50515 2068573 2031213 1985044 1931297 1872024 1808955 1743094 1675751 1609380 1546815 1489779 1438525
50504 1438525 1392716 1352287 1317575 1289075 1267164 1251779 1242410 1238700 1240958 1249691 1264590 1284414
50492 1284414 1308022 1334963 1364539 1394458 1421007 1440684 1451363 1451840 1440940 1417881 1383508 1340488
50480 1340488 1291826 1239353 1183907 1126541 1068973 1012919 959550 909666 863842 822163 784274
50469 784274 749997 719598 693177 670187 649940 632345 617711 606064 597094 590709 587135 586367
50457 586367 587911 591169 595882 602086 609826 619034 629602 641506 654791 669292 684316 698794 711938
50444 711938 723649 734198 743675 752002 759369 766383 773755 781903 790743 799792 808597 817223 826239 836227
50430 836227 847502 860307 874849 890950 908094 926044 945075 965381 986743 1009209 1033573
50419 1033573 1060526 1089683 1120076 1151354 1183709 1216774 1249404 1280639 1310255 1338213 1364101
50408 1364101 1387218 1406650 1421104 1429216 1430225 1424058 1410707 1390040 1362316 1328344 1288943 1244710
50396 1244710 1196520 1145804 1094058 1042405 991817 943365 897996 856360 818995 786410 758860
50385 758860 736353 718918 706426 698158 693195 691555 694388 702581 715463 731238 748333 765967
50373 765967 783680 800848 816618 830007 839976 845545 845878 840367 828909 812147 791193 767145
50361 767145 741107 714445 688347 662970 637631 612134 587452 564820 544589 526333 509685
50350 509685 494666 481478 470267 460921 452918 445736 439587 435304 433250 432748 432922 433637 435225 437709
50336 437709 440767 444188 447937 452053 456755 462329 468551 474639 480145 485405 490685 495488 499431 503323
50322 503323 508355 514458 520346 525216 529525 533947 538376 542266 545344 547627 549243 550589 552344 555021
50308 555021 558715 563408 569266 576463 584955 594451 604196 612569 617341 616970 611842 604149 596318 589373
50294 589373 582631 574951 566255 557644 550086 543391 536757 529971 523554 517884 512774 507988 503652 499937
50280 499937 496675 493547 490484 487735 485641 484349 483612 482946 482166 481734 482278 483817 485820 487982 490566
50265 490566 493844 497635 501564 505497 509480 513571 517967 523065 529082 535704 542307 548499 554240 559599
50251 559599 564553 568913 572271 574150 574498 573941 573263 572612 571465 569450 566891 564337 561800 558721 554626
50236 554626 549529 543849 538233 533442 529918 527313 524750 521856 519289 517986 518142 519276 521065 523687
50222 523687 527467 532608 539254 547405 556776 567136 578739 592012 606849 622780 639889 658932
50210 658932 680329 703592 728033 753540 780241 807823 835592 862879 889004 913082 934264
50199 934264 951999 965906 975856 982523 987432 991871 995890 998669 999525 998021 993320 984040 968822 946891
50185 946891 918295 884049 845924 805744 764932 724794 686758 651851 620268 591941 567190
50174 567190 546225 528351 512428 498022 485465 474835 465583 457168 449369 441855 434222 426680 420111
50161 420111 415020 410860 406785 402681 399061 396138 393416 390174 386146 381689 377292 372967 368231 362799
50147 362799 357108 351949 347703 344209 341229 338696 336514 334464 332365 330142 327763 325300 322936 320733
50133 320733 318582 316621 315410 315334 316047 316942 317995 319659 322095 325050 328429 332399 336884 341466 345896
50118 345896 350278 354764 359484 364743 370818 377501 384305 391148 398389 406213 414534 423579 433985 446124
50104 446124 459752 474401 489710 505325 521079 537440 555263 574897 596060 618733 643654
50093 643654 671623 702883 737524 775952 818455 864572 913247 963309 1013492 1062345 1108619
50082 1108619 1151713 1191573 1228346 1262388 1294397 1325147 1355003 1383565 1409457 1430349 1443548
50071 1443548 1446993 1439831 1422211 1394859 1358973 1316250 1268786 1218801 1168187 1118033 1068768 1020989
50059 1020989 975904 934534 896871 862488 831785 805721 784378 766645 751514 738784 728216
50048 728216 718919 710130 701903 694517 687810 681604 676121 671288 666194 660016 653177 646829 641333 635858
50034 635858 629372 621538 612753 603775 595316 587595 580308 573159 566237 559718 553560 547813 542870 539061
50020 539061 536225 534063 532664 532365 533297 535329 538138 541140 543786 546274 549511 553913 558707 562902 566519
50005 566519 570226 574134 577666 580346 582009 582382 581212 578777 575574 571512 566043 559196 551819 544651
49991 544651 537662 530573 523526 516944 510969 505420 500150 495379 491654 489448 488660 488610 488767 489427 491498
49976 491498 495696 502136 510586 520898 533331 548667 567856 591215 618026 647139 677798 709618
49964 709618 741883 773222 801964 826735 846954 863148 876659 888750 899934 910135 919033 925866
49952 925866 929183 927250 918681 902603 878685 847530 810845 770817 729399 688303 649059 612493
49940 612493 578533 547148 519072 494901 473917 454822 437482 422860 411139 400936 390757
49929 390757 380416 370643 362012 354720 348764 343757 339036 334414 330452 327548 325148 322340 318962 315579
49915 315579 312622 310057 307815 306032 304771 303816 302801 301405 299440 296963 294331 292015 290352 289482 289381
49900 289381 289798 290254 290300 289828 289084 288397 287959 287821 287922 288040 287782 286841 285384 284125 283746 284182 284628 284290
49882 284290 283007 281187 279403 278127 277479 277077 276370 275297 274337 273779 273410 273134 273340 274210 275176 275744 276397
49865 276397 277916 280058 281856 283135 284754 287175 289743 291775 293613 296013 299057 302304 305608 309189
49851 309189 313005 316544 319294 321168 322423 323302 323732 323409 322270 320744 319273 317727 315744 313579 312036
49836 312036 311401 310961 309878 308056 305915 303801 302032 301105 301298 302226 303225 304057 304888 305738 306351 306586 306632
49819 306632 306801 307271 307939 308423 308369 307909 307600 307695 307689 306925 305409 303691 302045 300229 298045 295795 294020 292980
49801 292980 292432 291794 290540 288655 286669 285108 283980 282988 282123 281625 281353 280662 279163 277286 275749 274733
49785 274733 273938 273288 273050 273249 273475 273531 273850 274877 276276 277211 277326 276981 276617 276362 276345 276860 277941 279153
49767 279153 280112 280920 281801 282630 283202 283795 284951 286753 288603 289731 289756 288834 287512 286355 285498 284688 283896
49750 283896 283623 284275 285448 286275 286408 286240 286171 286065 285546 284528 283369 282621 282642 283313 284197 285024 285784 286280
49732 286280 286131 285562 285697 287354 289822 291492 291591 290655 289479 288413 287708 287723 288530 289894 291762 294182 296641
49715 296641 298264 298944 299635 301113 303059 304723 305900 306829 307655 308487 309542 310765 311700 312185 312767 313978
49699 313978 315572 316933 317841 318358 318377 317941 317686 318310 319754 321487 323415 325899 328980 332225 335308 338111
49683 338111 340203 340935 340305 339287 338966 339632 340849 342130 343338 344677 346468 348748 350940 352152 351998
49668 351998 350969 349899 349249 349037 349246 349927 350954 351948 352668 353363 354613 356859 360196 364666 370554 378316
49652 378316 388226 400081 412947 424953 433614 436991 434939 429105 421596 413684 405769 398231 391893
49639 391893 387604 385508 384908 384834 384719 384493 384208 383894 383769 384235 385425 387036 388782 390645 392408 393376 393139
49622 393139 392335 392056 392730 394141 396249 399104 402095 404320 405944 408181 411571 415159 417903 420115 422826
49607 422826 426358 430263 434210 438214 442234 446257 450556 455349 460342 465123 469816 474811 480003 484846
49593 484846 489070 492994 497145 501861 507098 512384 517230 521842 527076 533326 539885 545856 551292 556853
49579 556853 562770 568853 575230 582249 589706 596987 603945 610955 618057 624733 630681 636168 641458 646443
49565 646443 651144 656005 661358 666898 672033 676562 680814 685308 690315 695554 700279 703883 706424 708368
49551 708368 709937 711108 712195 713899 716638 720144 723859 727425 730685 733563 736127 738524 740722 742476
49537 742476 743637 744303 744669 744989 745761 747642 750976 755517 760737 766345 772487 779475 787237 795006 801755
49522 801755 807063 811372 815252 818741 821694 824350 826992 829273 830529 830734 830584 830540 830305 829324 827345 824345
49506 824345 820326 815402 809788 803598 796895 789905 782897 775895 768839 761929 755351 748812 741946 735155
49492 735155 729295 724403 719478 713846 707997 702605 697376 691548 685135 678922 673424 668469 663751 659189
49478 659189 654660 649777 644127 637607 630595 623959 618702 615160 612539 609609 605935 602156 598970 596213
49464 596213 593173 589595 585988 582947 580549 578610 577203 576517 576245 575570 573968 571772 569710 568145 567008
49449 567008 566230 565899 566075 566770 568113 570316 573633 578457 585043 592595 598925 601815 600912 597797 594140
49434 594140 590373 586282 582158 578743 576389 574836 573708 572835 572138 571606 571470 572227 574283 577561 581500
49419 581500 585499 589370 593255 597146 600807 604307 608272 613264 619177 625658 632862 641206 650555 660276
49405 660276 670050 679992 689931 699288 707806 715843 723742 731533 739358 747467 755493 762390 767578 771585
49391 771585 775262 778905 782544 786347 790194 793468 795986 798614 802195 806311 809926 812912 816024 819638
49377 819638 823501 827653 832627 838507 844667 850779 857377 864981 873164 880951 887831 893998 899873 905723
49363 905723 911673 917845 924442 931652 939377 947212 954984 963196 972539 983041 994125 1005540 1017654
49350 1017654 1030651 1043952 1056806 1069148 1081456 1094054 1106826 1119473 1131689 1143195 1153940
49339 1153940 1164280 1174732 1185528 1196446 1207008 1216780 1225630 1233861 1241976 1250139 1257959 1264903 1270825
49326 1270825 1275948 1280528 1284749 1288797 1292707 1296210 1299051 1301459 1304008 1306926 1309815 1312200 1314066 1315672
49312 1315672 1317078 1318162 1319009 1319939 1321095 1322251 1323079 1323434 1323275 1322527 1321234 1319716 1318398 1317465 1316797 1316207
49296 1316207 1315588 1314837 1313826 1312620 1311693 1311723 1312961 1314825 1316275 1316698 1316344 1315835 1315508 1315466 1315983 1317329 1319153
49279 1319153 1320612 1321366 1321958 1322874 1323640 1323397 1322135 1320739 1319864 1319312 1318492 1316976 1314487 1310919 1306678 1302599
49263 1302599 1299126 1295669 1290959 1283888 1273925 1261018 1245435 1227695 1208556 1188992 1170018 1152185
49251 1152185 1135286 1118879 1103108 1088604 1075502 1063092 1050648 1038173 1025998 1014151 1002646
49240 1002646 992094 983357 976556 970820 965047 958620 951486 943967 936567 929681 923353 917454 912033 907288
49226 907288 903260 899899 897453 896335 896450 896959 897017 896633 896527 897209 898404 899463 900186 901059 902704 905244
49210 905244 908335 911683 915303 919208 923123 926719 930065 933615 937701 942187 946655 950850 954939 959332
49196 959332 964298 969738 975327 980773 985861 990382 994318 998124 1002504 1007697 1013155 1018174 1022645 1027031
49182 1027031 1031750 1036909 1042508 1048493 1054543 1060183 1065383 1070917 1077859 1086715 1097149 1108490 1120394
49169 1120394 1133018 1146732 1161772 1178122 1195606 1214077 1233555 1254157 1275822 1298157 1320701
49158 1320701 1343403 1366725 1391193 1416910 1443488 1470342 1496942 1523011 1548572 1573611 1597540
49147 1597540 1619273 1638140 1654578 1669568 1683498 1695949 1706551 1715650 1724064 1732531 1741493 1751060
49135 1751060 1760998 1770941 1780780 1790670 1800713 1810965 1821836 1834114 1848317 1864327 1881912 1901444
49123 1901444 1923647 1948383 1973720 1996604 2015114 2030512 2046627 2066293 2088005 2106333 2115881
49112 2115881 2114950 2105916 2092896 2079102 2065465 2050929 2034121 2014955 1994712 1974871 1956455 1940397
49100 1940397 1927580 1918079 1911009 1905625 1901989 1900133 1899273 1898614 1898424 1899444 1901599 1904091 1906597 1909484
49086 1909484 1912887 1916408 1919894 1923708 1927973 1932138 1935669 1938762 1942011 1945680 1949586 1953449 1957048 1960105
49072 1960105 1962270 1963330 1963373 1962683 1961400 1959287 1955990 1951532 1946321 1940597 1934130 1926561 1917690 1907196
49058 1907196 1894492 1879247 1861903 1843368 1824364 1805242 1786087 1766685 1746680 1726129 1705655
49047 1705655 1685838 1666874 1649137 1633411 1619876 1607401 1594714 1582022 1570586 1560938 1552514 1544966
49035 1544966 1538776 1534327 1531287 1529334 1528703 1529575 1531539 1534180 1537745 1542772 1549326 1556918 1564863 1572577
49021 1572577 1579926 1587443 1595775 1604747 1613418 1621282 1628835 1636672 1644648 1652378 1660026 1667971 1676019 1683641
49007 1683641 1690807 1697987 1705418 1712883 1720266 1727765 1735416 1742813 1749592 1755961 1762421 1769051 1775375 1781042
48993 1781042 1786409 1792189 1798586 1805128 1811330 1817121 1822474 1827162 1831279 1835563 1840615 1846039 1850939 1855027
48979 1855027 1858554 1861456 1863463 1865016 1867023 1869429 1870883 1870335 1868281 1866031 1864443 1863912 1864853 1867422 1871137
48964 1871137 1875406 1880130 1885324 1890628 1895904 1901952 1909843 1919675 1930707 1942632 1956015 1971422 1988729
48951 1988729 2007344 2026563 2045578 2063703 2080819 2097241 2113065 2128043 2142266 2156495 2171528
48940 2171528 2187470 2203869 2220360 2236919 2253590 2270157 2285996 2300149 2311632 2319907 2325212 2328499
48928 2328499 2331030 2333842 2337459 2342075 2348048 2356070 2366683 2379746 2394593 2410708 2428024 2446601
48916 2446601 2466294 2486931 2508615 2531603 2555895 2581126 2606904 2633155 2660035 2687570 2715490
48905 2715490 2743429 2771134 2798443 2825241 2851607 2877902 2904533 2931638 2959079 2986645 3014104
48894 3014104 3041141 3067445 3092851 3117279 3140655 3163044 3184749 3206048 3226951 3247410 3267556
48883 3267556 3287413 3306565 3324561 3341563 3358099 3374177 3389157 3402572 3414556 3425371 3435030
48872 3435030 3443516 3450823 3456515 3459798 3460375 3458848 3455948 3451762 3446003 3438578 3429484 3418519 3405507 3390424
48858 3390424 3373011 3352797 3330122 3306667 3284171 3262666 3240573 3216419 3190015 3162184 3134078
48847 3134078 3106714 3080462 3054761 3028882 3003124 2978834 2957076 2937770 2920364 2904838 2891636
48836 2891636 2880851 2871992 2864574 2858632 2854552 2852625 2852958 2855734 2861251 2869494 2879897 2891828 2905188
48823 2905188 2920111 2936212 2952780 2969873 2988508 3009310 3031563 3054141 3076794 3099729 3122278
48812 3122278 3142992 3161094 3176969 3191102 3203266 3213066 3220653 3226526 3231173 3235234 3239527 3244457 3249684
48799 3249684 3254749 3259748 3265118 3271102 3277835 3285717 3295190 3306229 3318435 3331622 3345957 3361530 3378157
48786 3378157 3395675 3414098 3433401 3453467 3474444 3496868 3521077 3546630 3572652 3598847 3625822
48775 3625822 3654240 3683836 3713557 3742468 3770240 3796768 3821767 3844919 3866191 3885680 3903198
48764 3903198 3918174 3930032 3938623 3944267 3947329 3947725 3944934 3938596 3928997 3916709 3901878 3884203 3863599
48751 3863599 3840420 3814839 3786409 3754590 3719499 3681876 3642406 3601383 3558962 3515591 3472146
48740 3472146 3429648 3388641 3348809 3309444 3270323 3231971 3195075 3160027 3127096 3096598 3068632
48729 3068632 3043039 3019839 2999338 2981603 2966272 2953162 2942576 2934606 2928620 2923991 2920880 2919639
48717 2919639 2919662 2919549 2918379 2916259 2913725 2911113 2908612 2906520 2905344 2905689 2907824 2911177 2914706 2918061 2921955
48702 2921955 2926942 2932394 2937336 2941742 2946166 2950468 2953918 2956349 2958224 2959598 2960023 2959544 2958861 2958384 2958054
48687 2958054 2958302 2960285 2964896 2972450 2983601 2999610 3021204 3048001 3079447 3115294 3154242 3192726
48675 3192726 3225936 3249740 3261224 3258137 3239120 3204640 3157230 3100736 3039509 2977776 2918866
48664 2918866 2864621 2815539 2771372 2731649 2696150 2665130 2638727 2615937 2594739 2573611 2552511
48653 2552511 2532041 2512180 2492387 2472451 2452586 2432911 2413450 2394433 2376071 2358183 2340465
48642 2340465 2322915 2305613 2288320 2270805 2253306 2236179 2219294 2202245 2184995 2167870 2151156
48631 2151156 2135153 2120286 2106567 2093182 2079302 2065224 2052099 2040572 2030227 2020216 2009882
48620 2009882 1998897 1987516 1976766 1967749 1960549 1954314 1948404 1942938 1938241 1934427 1931617 1929905 1928908
48607 1928908 1927926 1926739 1925731 1925065 1924384 1923580 1923208 1923712 1924843 1926272 1928274 1931250 1935030 1939176 1943669
48592 1943669 1948687 1953935 1958852 1963363 1967850 1972390 1976575 1980183 1983580 1987312 1991595 1996298 2001070 2005395
48578 2005395 2008864 2011582 2013922 2015691 2015909 2013862 2010260 2006852 2004779 2003659 2002432 2000789 1999398 1998855
48564 1998855 1998869 1998684 1998032 1997421 1997539 1998607 2000269 2001908 2003027 2003477 2003457 2003313 2003322 2003574 2003941 2004091 2003708 2002792
48546 2002792 2001626 2000336 1998712 1996696 1994798 1993593 1992840 1991581 1989224 1986133 1982992 1980021 1977093 1974201
48532 1974201 1971234 1967554 1962401 1955840 1948840 1942269 1936137 1929942 1923319 1916112 1908194 1899651 1890999 1882778
48518 1882778 1874968 1867154 1859218 1851484 1844128 1836850 1829316 1821604 1814025 1806756 1799827 1793229 1786810 1780313
48504 1780313 1773785 1767730 1762510 1757759 1752783 1747461 1742334 1737799 1733569 1729060 1724032 1718756 1713796 1709672
48490 1709672 1706488 1703722 1700594 1696784 1692750 1689321 1687021 1685705 1684668 1683164 1681041 1678795 1676880 1675188
48476 1675188 1673515 1672186 1671646 1671549 1670956 1669586 1668187 1667406 1666880 1665827 1664006 1661661 1658913 1655783 1652559
$$ [...]
##END NTUPLES=NMR SPECTRUM
##END=
