##TITLE=NES1017_872015068_9265900_OTYrnOHzXa
##JCAMPDX= 6.0         $$ Bruker NMR JCAMP-DX V2.0
##DATA TYPE= NMR SPECTRUM
##DATA CLASS= NTUPLES
##ORIGIN= BRUKER
##OWNER= Administrator
$$ 1.72 TOPSPIN		Version 2.1
$$ 2015-07-09 16:43:50.910 -0700  Administrator@X
$$ Compression mode = diff/dup
##.OBSERVE FREQUENCY= 400.02188249412
##.OBSERVE NUCLEUS= ^1H
##.ACQUISITION MODE= SIMULTANEOUS (DQD)
##.ACQUISITION SCHEME= undefined
##.AVERAGES= 8
##.DIGITISER RES= 22
##SPECTROMETER/DATA SYSTEM= spect
##.PULSE SEQUENCE= zg30
##.SOLVENT NAME= COFFEE_meoh
##.SHIFT REFERENCE= INTERNAL, COFFEE_meoh, 1, 14.98509
##AUDIT TRAIL= $$ (NUMBER, WHEN, WHO, WHERE, PROCESS, VERSION, WHAT)
$$ ##TITLE= Audit trail, TOPSPIN		Version 2.1
$$ ##JCAMPDX= 5.01
$$ ##ORIGIN= Bruker BioSpin GmbH
$$ ##OWNER= Administrator
$$ $$ E:\/data/COFFEE/nmr/NES1017_872015068_9265900_OTYrnOHzXa/10/pdata/1/auditp.txt
$$ ##AUDIT TRAIL=  $$ (NUMBER, WHEN, WHO, WHERE, PROCESS, VERSION, WHAT)
(   1,<2015-07-09 16:43:43.613 -0700>,<Administrator>,<X>,<go>,<TOPSPIN 2.1>,
      <created by zg
	started at 2015-07-09 16:42:37.300 -0700,
	POWCHK enabled, PULCHK disabled,
       configuration hash MD5:
       21 0F 79 D6 B3 7B B4 F6 88 20 88 DB 03 48 BD 9F
       data hash MD5: 64K
       30 0B 36 28 17 4B 49 14 D3 48 84 C6 DC 03 E6 3F>)
(   2,<2015-07-09 16:43:46.738 -0700>,<Administrator>,<X>,<proc1d>,<TOPSPIN 2.1>,
      <Start of raw data processing
       efp LB = 0 FT_mod = 6 PKNL = 1 PHC0 = 0 PHC1 = 0 SI = 32K 
       data hash MD5: 32K
       76 BD E0 AB 26 85 0F A3 DF F7 C2 9B 38 23 70 04>)
(   3,<2015-07-09 16:43:47.050 -0700>,<Administrator>,<X>,<proc1d>,<TOPSPIN 2.1>,
      <pk PHC0 = 93.00476 PHC1 = 0 
       data hash MD5: 32K
       30 B6 A3 0F AE 2A 96 22 0A 64 61 8A 72 95 F1 AB>)
(   4,<2015-07-09 16:43:47.175 -0700>,<Administrator>,<X>,<proc1d>,<TOPSPIN 2.1>,
      <abs ABSG = 1 
       data hash MD5: 32K
       40 46 F4 0A AF 36 B3 8B 92 D4 2E 93 98 C2 60 FE>)
(   5,<2015-07-09 16:43:47.253 -0700>,<Administrator>,<X>,<proc1d>,<TOPSPIN 2.1>,
      <abs ABSG = 2 
       data hash MD5: 32K
       26 93 CF 80 76 41 C6 D5 2C E3 F7 E3 CD 34 8A 32>)
(   6,<2015-07-09 16:43:47.316 -0700>,<Administrator>,<X>,<proc1d>,<TOPSPIN 2.1>,
      <abs ABSG = 3 
       data hash MD5: 32K
       F5 BD 32 9F 44 C1 68 20 FB 39 85 18 AE 39 9D 88>)
(   7,<2015-07-09 16:43:47.378 -0700>,<Administrator>,<X>,<proc1d>,<TOPSPIN 2.1>,
      <abs ABSG = 4 
       data hash MD5: 32K
       A8 ED AC DD A8 84 6A F3 A5 EC 0A 7E AE DA 95 F4>)
(   8,<2015-07-09 16:43:47.425 -0700>,<Administrator>,<X>,<proc1d>,<TOPSPIN 2.1>,
      <abs ABSG = 5 
       data hash MD5: 32K
       46 90 3E 83 40 33 F1 D8 E2 14 DA E7 5A 4C 44 30>)
$$ ##END=
$$ 
$$ $$ hash MD5
$$ $$ BB 2C 25 F9 64 D0 85 BF 19 CA 16 AF 50 FD F6 02
##$RELAX= 
##$RELAX= 
##$RELAX= 
##$RELAX= 
##$RELAX= 
##$RELAX= 
##$RELAX= 
$$ Bruker specific parameters
$$ --------------------------
##$DU= <E:\>
##$EXPNO= 10
##$NAME= <NES1017_872015068_9265900_OTYrnOHzXa>
$$ [...]
##$TP= (0..7)
150 150 150 150 150 150 150 150
##$TP07= 0
##$TPNAME0= <>
##$TPNAME1= <>
##$TPNAME2= <>
##$TPNAME3= <>
##$TPNAME4= <>
##$TPNAME5= <>
##$TPNAME6= <>
##$TPNAME7= <>
##$TPOAL= (0..7)
0.5 0.5 0.5 0.5 0.5 0.5 0.5 0.5
##$TPOFFS= (0..7)
0 0 0 0 0 0 0 0
##$TUNHIN= 0
##$TUNHOUT= 0
##$TUNXOUT= 0
##$USERA1= <user>
##$USERA2= <user>
##$USERA3= <user>
##$USERA4= <user>
##$USERA5= <user>
##$V9= 5
##$VALIST= <valist>
##$VCLIST= <CCCCCCCCCCCCCCC>
##$VD= 0
##$VDLIST= <DDDDDDDDDDDDDDD>
##$VPLIST= <PPPPPPPPPPPPPPP>
##$VTLIST= <TTTTTTTTTTTTTTT>
##$WBST= 2048
##$WBSW= 25
##$XGAIN= (0..3)
0 0 0 0
##$XL= 0
##$YL= 0
##$YMAX_a= 553085
##$YMIN_a= -462598
##$ZGOPTNS= <>
##$ZL1= 120
##$ZL2= 120
##$ZL3= 120
##$ZL4= 120
##$ABSF1= 14.98509
##$ABSF2= -5.573092
##$ABSG= 5
##$ABSL= 3
##$ALPHA= 0
##$AQORDER= 0
##$ASSFAC= 0
##$ASSFACI= 0
##$ASSFACX= 0
##$ASSWID= 0
##$AUNMP= <proc_prof1d_extract_pilot.lims>
##$AXLEFT= 0
##$AXNAME= <>
##$AXNUC= <1H>
##$AXRIGHT= 0
##$AXTYPE= 0
##$AXUNIT= <>
##$AZFE= 0.1
##$AZFW= 0.1
##$BCFW= 0
##$BC_mod= 0
##$BYTORDP= 0
##$COROFFS= 0
##$CY= 15
##$DATMOD= 1
##$DC= 0
##$DFILT= <>
##$DTYPP= 0
##$F1P= 0
##$F2P= 0
##$FCOR= 0.5
##$FTSIZE= 32768
##$FT_mod= 6
##$GAMMA= 0
##$GB= 0
##$INTBC= 1
##$INTSCL= 1
##$ISEN= 128
##$LB= 0
##$LEV0= 0
##$LPBIN= 0
##$MAXI= 10000
##$MC2= 0
##$MEAN= 0
##$ME_mod= 0
##$MI= 0
##$NCOEF= 0
##$NC_proc= -8
##$NLEV= 6
##$NOISF1= 0
##$NOISF2= 0
##$NSP= 0
##$NTH_PI= 0
##$NZP= 0
##$OFFSET= 14.98509
##$PC= 1
##$PHC0= 93.00476
##$PHC1= 0
##$PH_mod= 1
##$PKNL= yes
##$PPARMOD= 0
##$PPDIAG= 0
##$PPIPTYP= 0
##$PPMPNUM= 2147483647
##$PPRESOL= 1
##$PSCAL= 4
##$PSIGN= 0
##$PYNMP= <proc.py>
##$REVERSE= no
##$SF= 400.02
##$SI= 32768
##$SIGF1= 0
##$SIGF2= 0
##$SINO= 400
##$SIOLD= 32768
##$SPECTYP= <>
##$SREGLST= <1H.CDCl3>
##$SSB= 0
##$STSI= 32768
##$STSR= 0
##$SW_p= 8223.68421052631
##$SYMM= 0
##$S_DEV= 0
##$TDeff= 65536
##$TDoff= 0
##$TI= <>
##$TILT= no
##$TM1= 0
##$TM2= 0
##$TOPLEV= 0
##$USERP1= <user>
##$USERP2= <user>
##$USERP3= <user>
##$USERP4= <user>
##$USERP5= <user>
##$WDW= 1
##$XDIM= 32768
##$YMAX_p= 418332201
##$YMIN_p= -707405
##$CURPLOT= <Network HP LaserJet P1505>
##$CURPRIN= <$Network HP LaserJet P1505>
##$DFORMAT= <normdp>
##$LAYOUT= <+/1D_H.xwp>
##$LFORMAT= <normlp>
##$PFORMAT= <normpl>
##$SURQMSG= 1
$$ End of Bruker specific parameters
$$ ---------------------------------
##NTUPLES= NMR SPECTRUM
##VAR_NAME=  FREQUENCY,     SPECTRUM/REAL,   SPECTRUM/IMAG
##SYMBOL=    X,             R,               I
##VAR_TYPE=  INDEPENDENT,   DEPENDENT,       DEPENDENT
##VAR_FORM=  AFFN,          ASDF,            ASDF
##VAR_DIM=   32768,         32768,           32768
##UNITS=     HZ,            ARBITRARY UNITS, ARBITRARY UNITS
##FACTOR=    0.250966925370066, 1,           1
##FIRST=     8223.43324360094, -174963,      187558
##LAST=      0,             -12122,          18544
##MIN=       0,             -707405,         0
##MAX=       8223.43324360094, 418332201,    0
$$ Real data points
##PAGE= N=1
##DATA TABLE= (X++(R..R)), XYDATA
$$ [...]
23793 149127 157998 77288 14608 -222531 -65846 131536 25509 183939 151242 -323584 -3010
23781 -243379 -111252 -196177 -29942 -18558 -136486 -432902 78385 117378 -120109 197369
23770 4314 222107 -53802 408112 -154448 -246614 -223282 -138425 266131 171786 99000 84939
23759 84939 -304521 -280155 245248 -242951 108935 20484 17492 292034 -139174 -137582 -259633
23748 -259633 11048 -79274 -182320 413234 -3854 17446 -282235 248929 -4163 137861 285548
23737 285548 104256 -94085 -141770 -214254 -11522 90463 -28780 -155346 -84578 18587 104141
23726 104141 75859 11824 -22694 -42336 11007 -109999 120274 -81019 -341209 -67160 205765
23714 -111121 219882 -269465 72412 -200154 105691 -165553 29537 94451 21324 -2081 -312818
23703 -312818 -155726 -68965 154974 -93137 -110124 -139765 12581 -351182 135255 -174075
23692 57550 -64830 161433 -222627 136132 194520 93546 -212567 -58351 -181042 234589
23681 133648 -121451 -189281 64773 9223 285606 -117638 -152657 -127393 -187921 42720 -193291
23669 -484661 -30990 196141 365134 -51281 -201330 -474411 14159 -176423 -105517 33052
23658 243758 -196229 -427309 139161 304780 56206 63340 37263 -53873 -125843 -213654 -6659
23646 -52448 -168615 26513 3733 110100 -59667 -67861 -10844 -126132 -18991 -339 70225 -65090
23633 -118907 58017 -99927 -296874 -120610 168747 -136825 -114317 100800 -317617 20002
23622 -45924 148298 -77976 122228 -134526 -25045 337787 -99910 -64621 15110 -6278 -384903
23611 -384903 -171132 -206271 415977 -69791 -9880 -195872 -68102 369319 54757 21790 -194951
23599 45846 159873 12162 133588 9051 -16104 59337 92502 45019 180497 223367 -215349
23587 324649 -105071 -37921 104643 227841 156353 -93735 -307369 78385 510830 -99672
23576 219419 -10823 -14350 125349 -64493 -71163 114902 -51409 159859 25721 -25374 -399519
23565 -399519 64161 135105 -127103 21367 235218 -111849 101567 20823 62664 -201406
23554 99091 147106 -63297 210961 81870 -227808 -55660 66249 -51230 -32090 161311 -74364
23542 78017 -93354 86247 -8086 -250578 324169 -68163 111094 153896 -31682 -162738 -80340
23530 352153 177084 -133414 138312 327986 -115334 68647 58016 215558 -44140 134307
23519 123830 57244 270917 -294867 422499 -208771 9618 -93427 -62424 -3564 25749 -37669
23507 1230 -112190 207012 129451 13327 -57906 -112708 -19496 84484 15599 169938 -244638
23495 41226 -33969 194459 -283424 192116 248424 -29236 159655 -180159 143573 -106500
23484 290198 -116039 110956 -182662 -129681 1483 179700 -103987 -163945 -111258 -351936
23474 -351936 -92212 83215 -108329 -168588 407307 157770 280647 -224742 106 129126 65331
23463 65331 -39500 -184624 289701 -177547 -56135 -128745 177131 33908 -93893 -45927 81589
23451 -32769 61700 -75779 -96150 -100822 164776 -80157 -71765 55477 -177467 181439 -73777
23439 43681 119715 90882 -61311 80655 -117943 -385756 -255305 259990 147340 288031
23429 288031 83514 -396603 21541 434429 -110236 -60641 126214 42175 -445273 -282840
23419 -282840 -45209 191897 174946 -138404 -56658 92326 -143977 138733 103837 -90842 246102
23407 47654 259633 -279674 18087 -152283 -260353 -50722 -80086 -5670 3229 -138624 59716
23395 -232093 -148481 -131550 -94361 -24392 -73683 151891 199705 -244482 216424 354988 1156
23383 343475 -534272 132186 121676 170473 -206283 -186832 -49176 -49924 31508 -195059 19958
23371 94196 -3401 -7229 -152391 -210401 -440967 -98310 -166262 -16887 127335 30881 -6258 -217654
23359 -217654 151235 -388728 -275162 -313210 -54666 146897 -15906 -75674 88837 103680 131853
23348 131853 -191794 -6857 102301 -38952 -44979 -189854 167962 64306 8681 155555 150111
23337 150111 407706 142067 143719 -42618 -81790 -96387 152506 112831 -291872 66711 178268
23326 178268 72678 -113115 52594 25661 207376 114855 11335 -258025 -358020 -1458 -15062
23315 -15062 -110055 -46454 -261500 226512 136246 -643 -146038 -46410 -246622 -260214 -98390
23303 307790 -133663 150386 -191785 207640 62053 -92345 128330 -48833 41172 -84150
23292 103787 -336921 -216304 -480997 47100 51183 229697 -11367 22412 -3973 -83703 -68101
23281 -68101 180766 2931 23712 -466672 -173700 -177165 -66169 -185859 109468 21109 5501
23269 -1463 -24651 -44428 13172 -113489 -6830 -46516 -152307 -34767 -16142 25198 35322 102434
23257 102434 -167835 134398 -123574 -9320 -261156 -99938 -144193 -159104 180467 164733 -29018
23245 -155774 -281209 -253185 -75619 -193468 14436 -109567 -273282 132066 168296 -157854
23234 52250 158117 -13095 8092 3116 -237070 -29592 115454 78094 -264387 19363 78879
23223 78879 -220345 -183948 232697 -96609 214507 49947 -132479 181746 61549 87187 70667
23212 70667 66744 -133194 88668 -163455 205739 37392 154912 -150134 -69191 -411400 -160768
23200 -98937 -299232 -65501 155001 -221659 -20282 6053 74790 55024 -65494 52305 -193936
23188 -183944 -72844 124766 71104 145977 12162 -51458 -87236 -106447 103200 -263300 -474
23176 -5172 -73288 -143661 -259924 -37698 -221057 28279 154104 52587 7709 154361 -129525
23164 6287 209945 -298778 -73875 -245580 47662 -182813 -159035 4092 -130823 208211 182674
23153 182674 29815 142093 -22035 24847 -266931 -237970 -395246 7287 91139 -72881 -80885
23142 -80885 -52567 7930 75782 114771 21581 -22168 338293 10478 -62993 8567 -114193 -90689
23130 -90689 122715 58810 -62475 3402 -25871 57926 138293 68256 -145280 -87697 -320341
23119 -320341 119007 70247 346558 -132718 -124257 107441 294236 -87244 -95967 -146861 -22387
23107 -114483 -231689 83788 -8396 67413 -85318 -131591 -73931 332981 -29377 280541 92615
23095 196099 177603 137605 321513 25501 60524 -208831 16938 198325 -48950 66275 104777
23084 104777 -86923 -109630 -154133 -104993 -36877 82973 14506 -7643 43089 -23708 57914 422303
23072 422303 -77711 -273623 296649 279020 74408 -76691 -58521 66705 -98296 164515 -183951
23060 -95465 -218442 317682 185223 236680 304386 -431737 -81487 38661 -89686 -31636 -69532
23049 -69532 155264 -107481 30207 -97651 14265 54623 -274376 73821 -297235 80945 -360148
23037 153121 72395 -48029 -351014 163212 126017 182681 -82359 -63151 106015 235651 228252
23026 228252 -36362 35456 -271848 -230726 -148309 159655 -218967 -29838 136205 -338789
23015 65997 131809 204384 161472 -210869 -103893 59442 -119201 114928 15600 -42659 58202
23003 -304870 -223916 174850 -31715 437082 1253 -137013 -138686 -156624 -95262 -218730 265571
22991 -483734 -59327 -103777 305207 -56260 -136060 -154501 -68186 -7347 -293697 -116375 91725
22979 -37391 -267596 17573 -348192 -228183 211893 245219 93994 304013 -100098 87915
22968 -97481 -218520 191306 -46028 -240194 -312570 70142 -334867 -50323 7942 20857 -254464
22956 -193494 61009 -22528 -94901 81981 -349204 -304818 156871 -17374 31961 74281 222612
22945 222612 301011 -240604 76169 -6718 -24680 211788 100945 -118468 -256114 48940 216500
22934 216500 171398 -185989 74380 -84214 -286912 389907 29467 -309072 262337 323751
22924 323751 -171064 442202 -74284 -132672 -122662 314378 -129348 -131249 48176 -47316 -129317
22913 -129317 -89789 -270274 -44318 -217720 -106062 -46275 229480 -104631 -34712 -119188
22903 -119188 35867 -21836 -662065 -203166 73645 155785 153986 71669 201483 93145 -473618
22891 71309 -28410 -108845 -11385 -12923 -97132 53846 238325 74048 8042 134708 -363887
22879 -99389 -111625 220080 -8699 168389 47454 -15180 -71264 58896 -163080 -40106 -90686
22868 -90686 16396 97315 -25019 26361 52660 -200935 -146699 326300 -132287 -135528 152995
22856 -32363 58977 -189001 113202 69644 -160386 -198669 -99435 35559 -245718 -256037 -182506
22845 -182506 -46334 -163721 8402 -146871 438097 -157141 -103029 -136870 134175 45830 350389
22834 350389 -78262 38662 82465 -139112 -90921 4196 -10092 -74763 100556 -351967 -113038
22822 -55807 -112962 -62253 -237144 -24997 -146365 12965 75130 118405 -134313 -191952 41573
22810 -270895 -78705 -196438 -98242 -196153 125944 268427 -33823 -188219 -46649 -206699
22800 -206699 225232 136200 499824 -130385 -200355 -30594 16180 62312 -149216 -187474 79161
22788 -319478 75473 241061 89591 84079 121083 20635 -89755 62231 -56042 152902 -94184
22776 76513 -57840 -105697 -343720 -63069 17575 140753 -208136 18287 -244372 83041 -57364
22764 -347975 -69089 -84844 -210627 -67881 199642 -387320 -311853 -16326 168174 -378376
22753 -8757 102915 -11879 -141850 -213935 95393 121348 -35004 68435 -182570 -14595 73616
22741 -121565 -162084 -356168 27734 -100104 66497 -30758 -43685 -161978 -94617 120196 305
22729 -195232 -224499 -23820 118541 -72534 37806 -55993 61225 -124526 -94467 -375848 -235631
22718 -235631 -269100 -17091 -182303 73416 -63552 -222541 -179107 114443 303982 -281833
22707 -88387 -227500 -9858 153465 -118635 70131 -199567 467510 -247702 196265 -20805
22696 -104997 90915 -102759 -59573 61889 -153541 146160 186599 -150455 -5881 258143 38941
22684 85672 61788 -126167 18294 101159 38216 -113503 81466 -40780 479419 -340309 -21049
22672 27308 35804 -128744 5924 140197 -245578 -97805 30287 -13802 -141368 -210703 -147798
22661 -147798 -138705 134961 -105466 -61676 130697 -147351 -180447 -133717 -90181 -48978 124722
22649 166032 23750 93565 -69426 -90576 -339588 220598 -146755 -77443 -102913 -310705 206288
22637 -233917 -180178 83986 -133473 32022 -38048 177881 258340 220260 -262929 -220166 -29780
22625 137219 413679 193804 73909 -122445 -200772 -158784 408805 94387 -34668 65438 -125081
22613 18800 -347040 -161018 -60805 -237739 -458836 216186 88664 -52226 124849 -266413
22602 -99101 85727 -70852 -54628 -41135 27115 94213 -231921 -91450 -444810 69584 61139
22591 61139 153891 44522 94548 -37694 55376 -111289 46275 -328780 187559 -174674 -49875
22579 -10127 -184614 99027 -242655 -165181 191200 96357 -186793 -97564 -417001 -248314
22569 -248314 384043 -122664 -324035 167599 -224969 57754 -307007 -163115 -67419 62503
22558 1022 -17187 31367 -1507 -22519 -253390 -209992 58779 85879 -355201 -362745 64906 -88731
22545 -178696 50951 -160149 141110 -113101 203272 -432784 32844 52656 532 42436 -154060
22533 -1795 186070 119724 -103818 38778 -71059 -195372 175087 -328178 -25854 -81280 -259833
22522 -259833 1680 -238382 224726 274647 61884 164993 -563801 -167696 31038 309227
22512 309227 -237136 -36234 -47660 325626 -239706 182198 -193196 -30499 380366 -211704
22501 -291355 35902 821 114400 147910 -318474 -106438 -49155 228689 211591 -48992 231746
22489 201601 284727 176214 -196149 -85508 74375 -15672 8814 -15498 -5247 -314059 -66260
22477 10762 -136024 370579 13546 99974 208289 98180 65513 -117994 41438 -125417 -146169
22466 -146169 -241388 -89167 -52205 201737 -212658 350358 -58093 -134957 -74891 -230937 -121550
22455 -121550 -210810 -227340 141836 252007 176472 322074 718 -264311 78186 33413 44880
22444 44880 -133006 -105484 -271063 61852 98938 78415 61482 50170 44084 -70343 -16241
22432 -274294 -53624 -116185 -239401 -51942 14855 142143 -293034 22403 215294 87770 -68019
22420 253181 -148322 71916 -244869 -140189 -92517 18399 -41856 -169264 -234870 256530
22409 -111600 -185484 -11630 -188890 -362793 190372 -68292 37299 -146502 257624 66743
22398 181770 -321274 -314842 26404 -27904 -202751 491860 224547 -59741 -145313 -20192 -321526
22387 -321526 30881 182327 244031 21729 52140 -205724 -102636 173382 -67185 -14391 47696
22375 -204986 -83395 -229750 167942 -311882 -218037 -197634 46167 -217258 25120 -8134 -92865
22364 -92865 290403 -25030 4716 146132 -43037 38043 -294144 -106842 -326002 209158 -15789
22352 4670 -159645 -142306 63483 -172677 73971 -172877 27938 287173 -315896 -137191 151708
22340 -30865 62068 214467 -23283 -280590 5061 86089 -35696 -107311 325965 -2975 -85114
22329 -85114 4870 343895 -313268 -198779 187028 -40911 -244270 24087 -436572 -220555
22319 -220555 241737 201634 -110423 -357240 -191833 155432 -300527 179715 -193293 81049
22308 -260256 -261030 -179467 -45981 -52718 -5974 183537 233488 -306311 100595 -98438 -20047 3862
22295 -228709 154591 185046 -133816 -185259 173519 -97435 56326 23991 18602 -37890 -61345
22284 -61345 240124 -111135 -19819 66107 198211 113055 -125162 -277932 160956 -268092
22273 37547 -108871 -101602 213718 -285185 -387550 -266596 34403 -51874 127597 11080 -155280
22261 231575 101515 -47868 -92099 -160444 -127018 79524 -2520 -183363 248061 -8913 -57838
22250 -57838 131263 -333723 -197797 -71019 -204773 -58195 27265 -243552 8313 -11652 -180580
22239 -180580 -105197 -195310 -223028 -337398 17893 -83491 -88739 -195980 -18893 -103827 101259
22227 405448 137408 390944 121557 -123591 261182 40640 -347524 -108850 -76072 -40725
22217 -40725 67068 96544 102585 -39924 -130683 -399310 -10206 -14213 -150422 -71225 -112147 -28393
22204 -127038 -321987 -137481 65689 93149 298501 -17319 -101295 -46110 138345 -95652 -37207
22192 -222894 -144348 -38807 47092 -130665 -107984 -68632 -275111 188987 -12063 238624 -63469
22180 -109184 -64066 -332127 -29663 -13352 -289657 7403 -19712 -47463 -25969 -28937 -293849
22169 -293849 -108665 116077 29334 327541 3509 128081 201162 -136657 -149048 122475
22158 97754 -347500 123358 -18125 113794 -172795 103442 -6213 199274 119366 39682 144934
22147 144934 20447 -138239 -116091 -28532 -282779 108299 -26697 -107936 -89976 387806 -205109
22135 253435 -386341 -258121 62430 64065 -217925 -118033 69439 91154 -286152 67782 -5866
22123 -128475 -77447 -308701 133833 -142913 323226 36741 -300690 -58303 104375 7517
22112 -35741 266245 -69776 51036 120977 -71538 -116645 22183 -211287 171249 170629 -81439
22100 9040 21103 -98456 -226574 60948 382718 -225455 -52694 -253909 -145828 30275 -317721
22088 -167229 137834 -50610 280768 195974 -80779 -354097 100353 -374240 235947 39743
22077 306664 -163925 50309 -122803 -180938 30598 -184386 65051 141230 -305779 -5176 174156
22065 -76653 398613 -34140 14170 -99357 -257124 -59843 -76494 -150166 130524 189296 -45020
22053 -129429 -99723 185486 -353507 -6711 -186492 5726 -28662 -262516 -8847 -148646 -153533
22042 -153533 -103154 -157737 -73865 -277761 36190 117136 114909 -54465 -56561 -217282 -154825
22031 -154825 -188369 297053 79844 -17236 -109026 88663 -392080 -20133 -160474 -147970 -137681
22020 -137681 -405494 178456 -116953 -102705 -75102 -105435 -145950 139696 -178767 -62795
22009 88639 -7703 -193757 -113342 -73704 47063 -33549 73330 -133802 111915 -206173 221153
21997 -310101 -112968 -7962 110272 138453 -139538 -54863 -101105 -3866 -391949 226126 -38356
21985 -156607 66188 -62594 -409950 -57395 68013 -218768 -168610 -210391 -431575 11432 -188201
21973 148130 -423073 -110516 99475 -78124 -239691 -98916 -319586 -224109 -294287 -166672
21963 -166672 41698 -59842 -39538 7176 -56519 17420 478890 20187 -343555 111725 21503
21951 -1575 -156294 -69322 -5493 -49487 30756 -75378 -32948 107100 -188867 -118615 6180 81740
21939 81740 -349347 18722 -29264 -172661 -3036 17006 -71693 217936 59606 152237 88143
21928 88143 47419 -33354 4777 -438174 8229 -163090 -17580 -105261 -363978 -112879 -191914
21917 -191914 -69689 78733 -393759 -189541 4791 -6787 53453 -29481 137923 -108088 81215
21905 -69335 142394 171864 -32139 32994 69261 -215710 -257721 54374 22838 -131512 181025
21893 -55123 -211189 -207950 95850 -50969 53930 -164941 60255 151272 -122302 197304 195114
21882 195114 159738 -174585 300047 -68575 31309 88537 31908 199386 -321639 254802
21871 -19031 70961 -123899 -162022 52334 -25238 150841 77854 -101936 255973 190459 -304193
21859 263401 43105 -71483 37164 -76501 152365 72261 -131535 -208984 101508 78999 -360085
21847 24464 -373585 -17318 -134993 -166504 101984 -181714 -144071 172356 -350450 -53827
21836 -121171 185846 -209441 23340 71516 83141 -400836 -15807 -127805 -176293 -409439
21826 -409439 -154558 -3847 -116610 -133752 71532 -116566 -70528 -25153 -311199 -72323 -145315
21815 -145315 -163946 -172577 89152 -331195 96815 272293 28467 -272771 -190323 30936 -265407
21803 -123427 -101856 -319826 -209734 99587 -10796 4235 -205919 110827 -69285 19564 180
21791 148347 -386767 199429 197594 -50246 -13118 -85077 -36844 -73456 -312930 -149181 -213760
21780 -213760 210633 -97072 67928 -39097 -273881 -358997 -112673 -260537 -129973 151143
21769 161331 28572 -156446 -80697 228475 476654 156079 -71144 -1152 205147 50612 -90206
21757 -60180 -261328 15226 127558 -100913 27012 -47609 -29656 153340 -59419 86902 -129912
21745 274749 -160554 -13268 97019 -1412 259473 -54284 -53836 286154 -71800 107868 146173
21734 146173 -45444 103910 141384 -14374 -162095 349524 49682 -174878 41825 -23373 215385
21722 17316 -219091 -346014 35586 -48256 -318054 -1329 75233 -286381 -76604 -234540 106894
21710 -19269 -150260 85245 226341 -165202 104355 -274722 -415866 58949 43746 -75279
21699 97329 62797 -82802 63628 -82696 -204894 -179422 -93658 -136209 -34920 15543 71731
21688 71731 -355188 130245 -216139 210264 -173318 4826 168334 174120 -168671 182223
21677 -17663 100230 -2676 -38359 382505 -86027 -94208 -193540 45927 134624 -20238 145218
21665 -230037 -171264 279927 -151605 -228620 -8792 -27052 128615 -150244 369782 57356 -137107
21653 84439 122503 313548 -163914 -155718 1921 189781 59657 64997 -84975 -178654 -308804
21642 -308804 -73706 -155566 -187391 -87620 362826 42172 -56375 -329639 -97192 -102387 -30165
21630 -94634 -241854 -148895 163319 -33515 309201 437358 231959 7747 -168245 -157141 -177634
21619 -177634 7522 94816 88270 -67617 42391 -49471 -185944 87247 136893 -119171 -418143
21608 -418143 -300131 -7023 134835 69961 41318 -56897 -359805 85502 64391 -108797 92338
21596 381106 -96157 -57309 37431 79384 -149497 -80296 54930 62209 114538 -17137 -200409
21585 -200409 -448244 2342 144366 39915 -247212 108634 -60084 -420018 9729 93002 -17269
21573 -119044 442239 -182832 -4266 181022 111483 -384697 -43368 -170581 148328 16233
21562 143816 -512818 -247103 -139138 95147 335255 24167 64065 7148 11910 90744 -34702
21550 -25861 -89719 -222019 -22391 25978 -226292 -43266 -143931 165611 140784 -177123 -199382
21539 -199382 234293 95715 -381019 -98842 -111905 -114351 -259744 66771 -210104 -39370 -153758
21528 -153758 -148120 69986 -322 174758 22031 -201266 -84423 -65022 156030 144804 -127970
21516 -134052 -35332 -73017 16551 -155437 93676 116356 -96618 221861 -118616 100812 -148852
21504 -262714 -68570 -92523 -279365 75717 26787 32663 -227449 -80278 -300442 -352219 -175458
21492 -90559 87471 58907 -62187 277014 -140728 -246063 -55997 -148327 405207 -87716 -35563
21480 -256331 38101 -364266 -9349 143963 57887 -36167 -182123 -200455 -140369 386005 -351752
21468 -88792 -93412 -87497 35015 -222319 -138245 82341 -13859 85105 88494 -256221 -170221 24112
21455 -176067 -125910 59486 -273860 -181797 -318919 18483 142516 -53454 62819 246572 241288
21444 241288 230973 228975 622336 368867 416818 185438 232487 -120242 -34482 -180594 -214609
21433 -214609 -138179 105034 256675 156042 -23657 -14752 -250633 -142509 408225 248044
21423 248044 91068 -198859 72059 -138573 -186459 157556 -236638 90502 -49776 -27936 -15048
21412 -15048 -415928 -134211 -270473 -89669 -86256 -266048 -122582 -314591 15295 -174221
21401 -157024 -155722 -373867 -234492 63311 -221286 73123 -43788 -36639 52012 300774 55909
21389 -58903 21399 -28106 -51564 95700 78527 186042 117459 293492 234811 -638675 -221440
21377 -50948 115652 -192879 212442 -3293 -24169 7206 -146293 86921 -142387 -230024 -130750
21366 -130750 -164809 -209832 9788 -89536 -245727 -44897 -289781 144072 28499 -14354 -57517
21355 -57517 -289235 -72024 391922 -156345 -54839 3232 191065 -69988 -68922 -84572 -218992
21344 -218992 -217332 -208945 285892 40427 -274467 11369 -415803 137041 36487 92964 31315
21332 -163505 48639 229070 21463 -255519 -322332 -33875 171467 -347265 -268999 -111537
21321 -320166 -117124 248901 53227 59511 -124646 230721 -77792 -16252 -311605 -86981 199525
21309 -137049 28272 -92664 -74435 -21768 -236982 -97725 74083 -291388 -96618 67862 -149315
21297 12084 211512 -67595 226997 -45999 362229 -196896 -287830 63712 -76157 238488 3960
21285 -229673 -97566 -251518 30813 198253 -318899 210065 -132430 103907 250933 309210
21275 309210 -79791 199916 -119013 -15844 -58178 -109181 240011 204289 -56084 -104661 68532
21263 99094 -199947 -114431 -28213 -117811 -84327 -195914 69897 -44339 -248674 -100675 -151466
21252 -151466 -146695 150845 29392 -284134 62240 62065 -15058 -40549 -243367 -360874 35458
21240 -46234 195017 101391 322156 -193830 -72390 -42015 -165422 -399883 88374 50791 301298
21229 301298 -120865 -63202 102546 179553 157131 -335001 -203326 -251629 25274 162847
21219 162847 -216751 93816 -270953 -39849 -271112 -146098 332614 114628 -480289 7331
21208 -114343 120795 -217979 -97718 -105212 -67116 -19828 -110228 -33331 -2987 -213674 30199
21196 174516 90322 -339752 -49495 -228061 -74748 196458 -282038 -56915 119641 107176
21186 107176 58692 -113764 119252 67640 172043 18145 -9726 -106405 219804 47434 -128630
21174 -244987 -288591 -269436 -94148 -98771 -146657 -123563 -90223 -32359 -124540 -22252 -42314 26468
21161 91935 -83353 -64394 -95612 212051 -9764 113608 -188541 -103068 34245 49898 -214023
21149 106549 -119957 -277591 173410 148387 527636 27925 131176 153682 148757 165614 160982
21138 160982 24968 153394 7069 11991 -148983 57380 -65726 -27852 -14928 -217453 -199608
21127 -199608 17381 -1211 76940 134659 2389 23856 -138285 -326588 -80185 -61203 106809
21115 -55454 -7493 -140792 -306557 165580 -113465 -131259 160962 67512 55917 -56143 -120168
21104 -120168 165580 -360312 -163569 -40515 40497 -92874 40849 37630 28396 -126225 -45853
21092 -204210 -312020 -52645 -69735 140843 -14663 126339 114659 -167358 281222 -200585
21081 -290214 -9449 -114247 -90313 135872 -92878 175654 -238127 -294013 -96550 116471 -94440
21069 -1706 -345008 -299086 -14012 66344 98480 -286572 -279542 -206450 -70872 -11150 -125 1274
21056 -126896 -327702 62728 -99728 -94080 84416 -81955 -189986 348323 53837 -56525 -94098
21045 -94098 -230611 40744 303910 -8019 -221207 -18584 14644 -201745 -3849 -345834 181864
21033 12300 -60029 -70331 341169 -16230 -60469 -248765 -9802 29469 -94815 117634 -68931
21021 136182 78458 -233572 111395 -146964 72955 -261041 -55782 137237 -222 -228460 -80353
21009 14975 -371906 139873 -213409 -106480 -108854 46504 68399 -38883 7132 -52547 66421
20997 -26319 -59913 -279406 202172 -48543 -91947 263074 295171 -48257 -73895 -182364 -4676
20985 -369337 -146586 26371 206341 57202 -208592 -98949 135635 -66973 -111950 -40873 -317416
20974 -317416 -161054 -57221 -171591 -237622 317972 122149 -455599 60183 228272 -178382
20963 -20122 38592 -137961 -78372 -104842 -32799 286041 311142 299520 -63363 -116233 28709
20951 -92537 -71832 -127963 -152668 -235034 333772 -100610 325640 -27259 133611 45773 89265
20940 89265 -105842 -177749 250211 36630 -175901 -60780 26900 -126164 47606 38133 182998
20929 182998 -31567 26458 59179 324801 -451369 -7517 -34291 -38200 -141922 -151570 -176407
20918 -176407 168504 -300949 -442085 42431 -231325 -9692 -561993 -185862 222081 57067
20907 78297 6898 -26896 -215998 64350 308000 -287851 178052 -485020 183018 48162 -26602
20895 23436 -206003 5082 56689 155163 -129854 190218 -37554 -321094 77940 181791 -201653
20883 -302297 -168754 -6552 251319 -141562 -103311 -333720 -382787 -283130 265879 30696 -234150
20871 -208438 22036 35167 108372 -62858 -73188 -44088 58904 79317 -257622 -20708 213039
20859 -261275 349429 102466 220032 -101003 -13730 84082 -289985 55199 57149 137200 46686
20847 -127267 -109339 32628 1856 -252628 -200286 45565 226625 50247 -12644 84510 47049
20836 47049 -18075 -9550 -195109 -916 -126301 75618 -144032 -212057 -135861 280306 -175800
20824 -196046 -167149 342197 141334 39995 -57143 -197177 -107964 -375383 -31476 151023
20813 224143 77243 -172611 -104526 -252891 9384 -236922 -69353 -203773 -222131 47272 76395
20802 76395 -194486 -269253 -225039 -145304 181689 -22205 211748 180559 -238516 -260311 -100560
20790 -9986 -33256 -206860 120759 -97376 -2850 66284 -288992 -110911 -334290 -126085 -118190
20779 -118190 -355091 10929 -467630 220744 327483 -46320 -113236 149550 -105879 -179325
20769 -179325 -170225 -82510 -53405 112927 -77154 108113 -67645 -420685 -280102 109151 -180794
20757 -121792 -76387 -150472 -261303 -198869 -121548 -334322 -131851 98459 -82759 28554 -31769
20745 272939 -146161 -306901 52610 20048 -87797 -99654 75792 -333572 -129950 -66792 -143222
20734 -143222 225647 -328424 -342859 -61367 -33998 -19600 237574 -61910 81050 -328966 -73044
20722 -206113 -201445 488 -131264 -179176 -30488 -134495 -22344 -185193 136464 132597 -394728
20710 306495 -149091 -111994 -60874 193171 -216193 86655 47961 -122867 300639 -40206
20699 -32823 -261186 266777 89646 -7845 -296612 169468 -80754 43198 4952 276493 -44113
20687 111010 13258 107531 251429 198498 -122602 -121201 -35779 -203101 -203785 -240908 36807
20675 -524287 -347943 58476 191462 -5425 -138831 202644 -515415 -99960 23910 -74366 -225371
20664 -225371 -184936 321689 -284344 -116279 -274995 351484 -281449 -55271 -2505 -127311
20654 -127311 -378811 217173 51456 37491 213772 -59940 214226 -50314 -127315 -142506 -239644
20643 -239644 -170229 -76500 200288 -149875 -69919 -111311 40093 -31572 -121644 132527 -15528
20631 53635 -6001 -351178 -227474 201000 309309 43868 -184560 -259093 180149 -142512
20620 -286018 -163126 -14210 -185796 -5043 -143785 -71381 125739 39950 -149161 -119366 -60112
20609 -60112 -203692 42768 -4948 51873 -125688 -210032 236781 -235805 -227619 48037 4406
20597 97890 -4120 101674 60712 -60404 -474231 -134032 41068 173455 -46239 -10293 330615
20585 139502 -9612 -131115 -350812 101146 -83584 -148635 -110274 390177 -62977 -78936 101857
20573 -472929 172811 -250984 -9142 -126245 -431472 86923 79411 -349410 -304618 45605 -116634
20561 137866 144355 -132261 -456426 -213600 198937 229069 32659 -23661 38572 -70513 49760
20549 -91463 -13090 108440 -270349 17257 -90652 241118 -90800 -99460 123455 42343 140163
20538 140163 -178578 87279 -120847 -92235 -25202 -68999 -301024 40392 127237 -50999 -207158
20527 -207158 63682 84061 -60769 233351 274911 91348 104565 -482209 -43964 104364 -104664
20515 121667 74698 -183067 22178 2637 -199170 32354 31162 -342506 -28990 -118243 86993
20503 -91149 -10815 230430 82406 -6771 -110511 -165271 78 150058 -192973 -96560 -312857
20492 -312857 209088 -264835 -269518 -82525 -34858 -106735 121435 -291107 -403577 -91268 -209292
20481 -209292 -523 19338 40313 74511 -200346 -34644 -313095 -169369 107488 -214944 -253763
20470 -253763 50211 -136343 -147862 -133942 14300 -47351 -108988 -230199 -85383 -5242 -244334
20459 -244334 279202 -234813 -299223 -61389 311594 38378 299099 -155088 -99003 209626
20448 140812 -260799 200123 -66391 -156248 -277316 65740 -36388 -91059 224068 27108 -164580
20436 306420 80589 -256175 -36666 230014 -135343 -181306 64498 -452638 60207 -7110 -217621
20425 -217621 89777 184134 160278 -85856 -298034 -314509 325970 -34205 -240858 -78266 121345
20413 -114043 63094 -188154 63037 37747 -200699 -302719 -397899 -53379 -377321 -253261
20403 -253261 -30808 97552 -123660 165624 -270580 142986 -193705 309 -60114 274135 -98160
20391 -16266 -116394 249097 24506 -53686 -203618 54870 89186 204267 16541 85296 -6523
20379 -189717 -87237 105936 -106301 -240842 59011 106498 -96985 -461836 13625 -122879
20368 160921 101056 13308 -40891 -315272 -186224 -94902 358645 -253432 -50103 -296659
20358 -296659 -2264 198186 -171752 19096 -240023 -392123 -366652 -84067 -177723 260461 322672
20347 322672 -147387 -96659 110036 226694 -283642 -508478 -118942 -245916 -18154 -182321
20337 -182321 -249864 -217691 62925 107163 -201210 217745 -9315 176935 -385766 177031 169924
20326 169924 723 -75414 675 -35642 -290341 -112530 -8420 169194 285837 -357726 -73019
20314 -316805 -218281 -38289 -260096 116366 -45906 -141675 -255579 -81030 -199313 -114720 -289906
20303 -289906 131002 -107421 -144481 96265 -71326 -18224 29805 33183 -42751 -234461 174081
20291 -224462 -217180 -212735 261512 150415 -4523 -117224 -43446 -96357 -160212 -177960 145453
20279 -39121 -43848 14418 135900 -172316 -90319 115543 -41171 62136 -226868 -6665 137397
20267 51611 75845 -151327 5324 -184117 -71357 -129568 -9910 -144870 191786 -112973 49925
20255 43409 -214466 -182406 -62991 -25365 -57081 -97044 -139780 -37464 68375 119 -77418 -347133
20243 -347133 -81725 -269534 -50272 -76872 144053 -194770 -94603 70795 -108853 110476
20232 106257 40919 -9442 -145062 -83786 -37548 -106560 -203037 222209 -213706 -9038 -323185
20221 -323185 -82754 123601 -182760 132568 -59257 8799 199326 42542 -34638 154318 -377552
20209 27380 46160 -77636 -20631 100197 -65424 -348701 -73635 -432160 -92118 -5637 71767
20197 7590 -196544 -151521 -105101 -165897 82617 299826 13285 -428284 -199996 -240354 46187
20185 -15067 272498 -103880 -247690 -116224 92133 -53726 65645 -111063 9019 48984 -289721
20173 190701 154173 -328877 90882 -102656 -28796 100570 33050 -166323 340707 76645
20162 -91480 43598 81196 -42021 -221756 87836 -97150 86871 90697 208648 88491 -8051 2886
20149 -54140 48928 311343 273341 -53782 302535 201594 -66704 89516 -47185 147808 195888
20138 195888 320287 173085 -213633 -500358 -291161 152099 -280046 -181576 57589 75048
20128 75048 -290193 -65294 -61767 25816 -92560 122741 42836 -191671 -244640 -103753 -103232
20117 -103232 16960 -192112 230929 -73015 130109 289054 4116 -91668 41158 -136396 -72702
20106 -72702 -257114 -39698 139135 220812 -166575 40284 -123618 -103481 -194675 -111488 -28859
20094 -96266 241701 121214 -316955 -423778 -124847 102868 -556942 -70291 -168625 46965
20083 -105023 116937 280128 6653 -246804 263623 -274940 -127503 19298 216476 -201171
20072 -207200 -44797 -31144 -42514 279908 -90864 -173740 121487 111849 -122089 255454 -231435
20060 229039 -260546 -206969 137222 -49211 81414 9722 147393 -205646 141596 -189328
20049 33065 -52008 -324495 58152 -74052 88961 250011 -379382 -71754 -138793 7870 307006
20038 307006 -47712 138121 -167039 217562 -62070 -69937 -325736 -12339 115788 293199
20028 293199 -323229 30578 -158992 -240507 42309 -38982 -181288 -32983 85592 -62756 -171774
20017 -171774 -159811 75052 37900 -216211 -105664 161086 601701 -138055 -148425 -69690
20006 -285751 -40213 -99176 -4841 -215931 -487696 -104313 109895 -69173 177264 357576
19996 357576 180196 -10537 -631 16934 73688 -181438 -25881 -40060 -193360 312439 -145371
19984 -316828 18120 -110793 199807 -5281 115542 -88776 186563 -85629 -206880 -71656 -162918
19973 -162918 171631 88320 378817 -5382 -36748 -279134 45783 239443 -212362 89248 -137686
19961 197901 -76770 -258185 -193785 -80554 144149 113336 46408 -270583 -126741 117508
19950 96490 163612 -204748 -140325 -145520 -273550 117348 47432 -229290 -22047 21003 71287
19939 71287 -190838 -158052 161586 -167646 -288672 131533 -355577 -47964 -219646 152217
19928 -33524 -25122 -12002 -85639 -270205 253333 258440 -138221 -72378 -87927 -28069 -63361
19917 -63361 -91567 -183138 -148600 84104 -199996 -99133 -272089 -187414 -221583 -151873 119481
19905 37158 146725 -97128 68582 294403 -22697 102777 -300022 78172 -42939 -257766 39796
19893 -22370 -102585 -5624 -132529 19303 -343807 90548 64990 157706 -444374 -120893 -136685
19882 -136685 -46189 35353 -119574 -219179 -64068 -32678 -104092 -107152 121712 140126 -215059
19870 -539968 -25389 161377 122860 -55959 89201 -636984 72825 -63263 80296 141616 -88847
19858 -77438 -83806 -215789 -477113 -609795 216534 91983 -59977 162381 189065 12597 28550
19847 28550 -113311 -327143 -63354 -182827 144809 -12477 -209186 -339483 49942 -48569
19836 165234 47693 -46878 39034 -362099 -204050 -47236 94618 -22466 -278442 57191 -114904
19824 13612 -422869 -24478 9780 -178285 -15293 -226478 195001 72794 -210933 152508 91689
19813 91689 -85067 -38168 171453 -25504 5434 -256159 -28182 148272 319924 -97393 -124875
19802 -124875 -174564 -233587 272357 -6390 -38109 16774 1251 117915 83827 -175652 326247
19790 -143454 286095 -99048 213360 -228030 -253879 43088 -247727 -177462 -290085 -230784
19780 -230784 69251 122667 -174537 -127785 -532549 77018 -236060 -138046 -333964 235609
19769 -38389 57231 280878 -315030 147382 -106704 -118707 48676 -285694 37949 -25867 141179
19757 -70337 78560 200531 -296758 236726 -18085 24232 -60092 -71447 -213452 204887 -64467
19745 -78220 51348 118453 -10654 -242226 -226131 52424 67207 -27377 -20743 -123608 86229
19733 126663 -147567 -66848 9896 8720 174603 -743 -123796 82039 -55023 -242732 263010
19721 -256558 -129762 -164058 -486574 -102191 -450699 -320605 -201994 70395 -1305 -45528
19711 -45528 195401 2867 29623 106349 -72488 -41463 61436 241604 -121612 40055 160596
19700 160596 -45622 -46804 121846 183191 -5135 137065 23140 48403 -213858 -323267 -101508
19688 3682 -277358 -117632 -187371 -255960 65166 -200049 -101991 -82818 -174958 -20092 -9808
19676 166683 77638 -13663 -169908 94957 -138349 -17721 193669 225546 -49474 89776 -244228
19664 -247794 121495 110674 -267241 -167722 -127330 142828 283067 83583 -43560 -75519 -71950
19653 -71950 241690 -265686 62113 124916 -60911 -78375 115126 -20407 -1193 -116362 -105835
19642 -105835 -123022 -73528 -156531 296309 -139238 -183318 111652 101997 -193131 50770 -86183
19630 -125116 46803 -84337 46995 26391 -54283 59081 -507719 -109526 25379 -48193 2086
19618 156405 -282136 -260333 -341508 -140469 -15930 -163419 -281716 -227173 -81847 -147627 -3317
19606 -113554 -206459 57593 -74603 -284655 -63498 169805 -326668 16594 25834 124100 -28736
19594 -82451 186003 172175 5219 180062 -64498 -172205 107391 -41539 -127857 -58124 -54060
19583 -54060 164924 -243803 -67079 54176 -64454 -158881 -64048 -25427 167449 60272 -171407
19571 210839 -250821 -23496 -78660 -44679 -316471 -245249 -15183 -60943 -91165 -7857 80374
19559 -11801 -90816 -141095 -292496 44972 -135032 145301 -283491 -6180 178103 11586 -186874
19547 -211933 57721 54845 -25734 21170 247347 -77617 -6884 -326829 175929 226491 -61334
19535 -206898 -321868 -344270 -68063 -164902 178322 -247960 -61903 335838 -169451 91120
19524 -66212 -307892 -90158 95854 -128389 -128209 81752 -99945 -142851 -111240 -455321 -20094
19512 -65025 -175927 158784 94492 105714 -69014 -269747 -293058 113507 318380 -56969 -151246
19501 -151246 65400 -128361 262172 -278891 -143413 -131818 -157531 -257855 -5759 -31001 -47000
19490 -47000 -153641 -70964 -206634 47487 -282105 -203201 38894 -92980 -167340 -44204 -281775
19479 -281775 -128437 -135401 -188981 45960 92786 44458 -11797 -285640 -57522 270228 174831
19468 174831 -260056 272348 13381 -281238 -130326 26663 -173227 227001 -54615 -67870
19458 -67870 154894 62468 -379733 -97308 -46159 -247476 -281703 -185798 -224498 66201 122108
19447 122108 -40923 122065 -243295 -41836 -232923 -106189 -377613 -107610 -97240 -109054
19437 -109054 -175301 -259327 -15010 55945 122373 75619 -364168 -137508 -70783 -49493 -295429
19426 -295429 -80636 -280299 121815 90690 -35289 -48835 -11272 -87409 79077 -94861 -52331
19415 -52331 213282 -304187 -282069 130016 -218949 -250188 13428 410409 -306635 49631
19404 -127972 -165361 13279 -39005 -28063 -250021 219501 88985 -391568 217652 -59431 76512
19392 55610 156377 -221911 -138925 -148223 -112359 -187923 58458 -11422 -17416 -80157 -112417 -110640
19380 -110640 295428 -161072 19520 -144125 -80748 264853 151324 190941 -241465 104263
19369 111033 -173816 31941 -422467 77695 -51367 135214 -4590 -92557 -38647 20450 -243601
19357 -192993 -266947 -51114 135226 132209 -127884 -34376 273572 -63884 229582 -4566 -100994
19346 -100994 27117 -194014 -214213 -140499 15184 -91213 201971 -206705 -441220 207475
19335 -84369 -177827 216064 82557 254839 -90147 316525 -241544 -345304 -124049 -233697
19325 -233697 -275426 274771 -342590 -66565 -63133 253408 80746 -55286 -173408 214006 -38614
19313 -111115 -279160 -5421 -16172 -88057 414 -126541 -22906 -201277 -192559 -228736 -319330 53771
19300 126196 -134989 -129464 -287021 -157172 -51500 -223596 257992 -207577 -325490 154092
19289 95733 -82748 29714 -19383 -164492 92080 -163811 -348722 212137 -41809 205396 -305743
19277 -119722 -32617 189502 -20788 2515 74160 17035 -261004 -177557 -358821 -89049 -69351
19266 -69351 31805 -186106 -75962 66015 -364440 -197558 -33882 -62819 -294734 48963 112727
19255 112727 -230343 -102793 -205021 -121470 -270705 283681 -273178 209650 95338 483873
19245 483873 -135842 -58900 -380819 269270 12943 -38744 -259493 -60039 132037 -102906
19234 -366297 -199349 -28988 -263377 -267944 34909 -1038 -283586 39856 -272128 179133 -113340
19222 157549 138668 -51420 -161356 -253079 225527 -75238 -378647 -240448 -130850 131136
19211 -41242 324934 146591 244652 -71441 119710 -299662 -78645 92019 35537 -67690 118294
19199 -110426 -371422 200023 -62705 -48162 -42591 -109688 201346 102243 -66700 115502 80661
19188 80661 -81472 -190173 -136835 -31056 -131029 -34626 -48370 -93500 -78666 -119922 -166248
19177 -166248 135058 -189387 -346798 104231 62618 -184648 2147 -166780 6206 -58372 -335795
19166 -335795 -95573 -26996 174912 124712 101886 1341 -121160 -337424 -327601 -145724 209524
19154 -67189 -29648 -17199 -348016 147646 -146145 -117438 120478 -245919 -291524 -200846 -189896
19143 -189896 -101923 -159856 149983 76270 120846 -73618 -398001 -207014 -428599 -374403 -331804
19132 -331804 -151183 86325 54494 173458 -3344 80594 -226763 53632 35829 195812 -65210
19120 -63282 -242472 10046 162523 -16832 52779 -180788 -229819 -209542 -84220 -163350 53996
19108 -378849 -15093 102144 -20707 -59143 -228319 -202922 137503 -324784 127747 158779
19098 158779 -41163 66686 226790 -48577 -71651 -134712 11015 -299370 -14075 3963 -34315
19086 -270101 189260 -295043 -192272 -98129 40723 -13384 -86206 92448 180204 -102392 -194967
19075 -194967 -63084 -31593 -72427 -154386 -86520 -313156 130553 -544809 244059 -25680 -158304
19064 -158304 -28555 -73865 741 -108380 117218 -71313 -71560 -125602 -146284 -221846 -75136 48223
19051 46079 63996 81432 -32439 -73575 4398 127958 76022 220806 -147724 83081 -218353
19039 -332059 39555 134940 -111185 266124 197539 221864 48105 -293793 157328 84452 36911
19027 -179353 151679 -83672 250138 -81261 -150539 9528 -81181 95136 92540 -194739 -23497
19015 244411 -29326 60918 122307 242146 127715 -92632 252112 -191205 33510 244324
19005 244324 -25318 -79664 -9874 61081 -448468 -402386 -157407 -301284 -180342 201766 -116128
18993 -97661 3508 166552 115618 -34453 -95852 194489 158970 87072 -114823 -324957 -132211
18981 326931 -176014 -8945 -204154 -191255 -78076 -263228 57546 -182715 -273801 38385 121142
18970 121142 -94074 -275795 217095 -15280 131600 -13312 -84901 120523 65770 -22644 -132734
18959 -132734 -82184 -202241 -164080 -137071 -172251 -426501 -78398 64974 114090 168915 37000
18947 -224454 -90732 -146290 -168166 276190 -57175 418621 -63704 168187 -113767 -79756 179756
18935 -46731 -259680 -9060 -64019 -267292 38259 64005 -195328 -104332 -295845 -79013 184752
18923 184884 -83079 -72060 -146364 140927 -266244 18047 -180037 11021 -365482 135519
18912 -137812 -358459 292518 119235 -41387 180850 62727 134186 -93479 -13537 -154332
18902 -154332 -556764 -323492 128969 -232586 21061 -116032 44561 -293898 250197 -145653
18891 5734 -25254 40081 -51454 -332907 18300 291855 40363 -36220 -124380 -15142 174397
18879 -326068 -124483 -118925 49336 -44618 -230455 -281085 -220573 -42666 -53773 -191383 32289
18867 -197907 87904 -101386 -132827 -212525 -33523 -30607 188906 -137784 -177264 -143288 16401
18855 -148618 -149683 -204928 -10596 -137761 -182752 94835 -174196 -16850 -148032 4332 200279
18844 200279 46226 70855 -81496 25834 -53800 -36621 -174507 -44059 62658 -133562 -224583
18833 -224583 209890 -224198 80488 -41960 260963 -242399 -218170 -20387 -121365 -19317
18822 -133991 -312562 250146 19697 -72583 120825 161959 -76454 -219141 -220383 94352 20404
18810 165571 138007 140644 123882 334891 95906 197248 363471 92454 -413297 -205803 -124424
18799 -124424 331286 88116 -103309 -217785 -68084 -337148 51889 -180050 -69693 142141
18788 141418 -289405 -159396 -330978 -20624 -224503 -6094 -224183 -124973 -64608 46997 -56173
18776 -74889 -101787 -120398 -104153 -149765 32318 -60461 -17136 18310 -349799 51512 -31070
18764 -200358 8880 -124671 -110819 -113436 331658 -338026 -205234 -436040 148472 101868 -130512
18752 123558 -247341 -346736 225133 -48698 376330 -31180 112415 -61443 -225396 56242
18741 -63566 -151611 172930 -203499 -226091 -35675 -32775 -209609 -164558 114591 -122653 189750
18729 175986 -61354 -67032 -169591 56626 172370 74997 -121626 -89288 -136343 -302350 -141629
18717 -334952 -158626 -107964 -406188 -31278 204664 -10485 -84297 145630 -62710 -28124 -8715
18705 -231178 301648 257709 -238617 24337 -255690 -26800 118632 -90019 68752 1128 -13598
18693 -200684 -258973 -15861 367950 -247690 -229360 -106562 -35922 -6878 -150672 236599 -34621
18681 43137 -109241 50449 -201052 -41298 -14373 -356992 -111089 -138742 -45407 -280470 -137843
18669 13876 -296545 -112296 -123798 -400117 -235878 -82554 35389 -311404 -396013 68503 111582
18658 111582 -132516 -47642 -200784 147713 -107636 -74439 -179624 29165 74131 95738
18648 95738 -396276 237825 248164 -246846 62719 31337 12708 -276448 9426 353184 -100023
18636 -27380 169374 -119882 -19531 -257821 -304434 -191289 28549 -114996 -118177 -343268 -43929
18624 -273084 -56232 127116 -87439 -150091 -335319 -22432 -42918 48956 143839 84956 -16621
18612 46208 -444487 -190236 71772 -341169 -4534 -151554 -237163 65396 113673 225054 152050
18601 152050 -106634 -323459 -357483 -106133 -234646 92108 143810 -54531 -121904 26082 -16194
18589 95508 83320 -272426 327856 -26354 9943 37536 -160772 -150846 -76073 144357 -176986
18577 -248193 -186988 -71648 206764 -107037 149899 -105054 104456 5677 73478 -115239
18566 306525 -149107 -91609 -189932 -177695 -275364 276385 109259 -209195 24706 -11098 -79634
18555 -79634 97265 164046 183592 -166714 274712 -68010 17075 390300 -54142 -99294 -227693
18544 -227693 -4055 35262 -178748 198626 -27834 -116362 155791 109140 213488 -456522 -124214
18532 -36875 -158501 -72825 -38164 -222614 -14961 -266287 -177700 -263884 78935 -19899 -42530
18521 -42530 118906 -114709 130221 -70085 -146312 -81912 -24517 -8394 93362 -55032 86186
18509 165402 -232207 42573 -120579 -303378 -370899 257252 -60294 -269990 -147348 195956
18498 -141840 -37471 133146 -106603 124884 -105360 -376705 525395 -1149 174575 129163
18488 129163 208673 -78310 -176834 -94114 -102206 -196112 265442 57376 -166535 -213403 47931
18476 -134165 -162465 156174 -148787 25292 113983 -71193 -251628 -11258 220125 58097 127148
18465 127148 -144878 -167436 298377 186221 2992 143256 80011 -249535 44642 43421 2921
18453 5161 39272 -516802 -155452 335435 -75507 115156 218173 -26806 172320 44068 54962
18442 54962 -8328 90941 -25425 -11188 -34928 -304611 -49692 -71749 -25552 -22239 -56589 42675
18429 -392419 -84494 159657 -325179 -1247 68135 -195377 -123066 -184699 36895 -73950 -111493
18418 -111493 -276782 -169694 229254 -240784 -50341 -250097 -146174 60793 221763 -177426
18407 191882 -95928 160741 202578 54511 -99990 -1486 194370 -119334 -312831 -224065 23852
18395 -51700 264706 -155218 106868 43992 53908 -324685 8312 257979 -267768 -138308 -43995
18383 -174979 -359600 -164340 81767 -146491 -198657 64676 -313696 25841 -81022 -98627 220238
18371 5937 -280496 15032 -69165 195932 112833 146259 -61797 33551 -370566 -130126 -505160
18360 -505160 172007 17413 260143 -294471 5308 -80965 -59561 -240425 -134285 -121007 -31534
18348 -60677 199582 58023 101155 208635 -143996 71849 -125302 6987 -197191 -111877 210330
18336 49147 -8341 32421 -219233 92322 81678 -208800 308284 37321 146153 -41651 101117
18324 -48249 3872 59429 77120 -31000 -91401 -67277 -63095 -60897 -133478 -299902 -133467 -107437
18312 -107437 -246977 24106 -189262 -348026 -64722 162744 -186167 -145299 1384 216471
18302 216471 171919 133005 -192072 47786 -141935 150495 -217895 168630 -355800 -276837
18292 -276837 273585 -319503 -196546 52567 -266076 -163855 -128294 34385 -331040 -71187
18281 96637 138809 -7017 150764 -167214 -95911 -222273 -78131 227401 334168 128296 -57090
18269 235350 87823 -145145 -40503 22691 180747 171232 31673 -98231 2627 -81021 193003
18257 -85017 -103541 -603197 -104768 -412259 58679 -132178 -175293 115961 315135 164736
18247 164736 -66816 88206 41472 -405476 -29348 264756 -123131 -48935 70893 146500 -385424
18235 36727 -329266 -98744 -125739 121671 -203456 -150441 -176213 -14635 -307050 119384 70680
18224 70680 -52608 -251754 -88002 -434832 208355 -68581 -73691 28551 -96892 -165680 191980
18212 68179 223824 -91008 14728 101622 -66454 -107595 -43595 309936 -69099 -113425 141098
18200 -32172 163239 32170 -16485 425281 250861 242134 -143941 51097 110526 -80498 -186461
18189 -186461 -260020 -70749 -122960 61682 149909 -308749 -61197 -142980 42626 310120 -122845
18177 -271836 52969 -193152 -236216 -58843 -158275 101450 -88401 180958 229786 -297646 123858
18165 28372 -201874 -36961 -52563 161421 -156519 -146923 -156875 428897 -200397 -94582 56431
18153 -82969 261908 1370 182418 31255 -136344 177950 -101025 -70304 455 -11727 269563
18141 163881 -101635 -95130 -38135 120121 -169456 195159 -333736 -375309 -211221 152255
18130 88861 -218762 -1649 -150318 -164856 -68209 -21788 29487 126000 -6939 88055 -217927
18118 -152644 159284 -250585 34065 -278811 42856 -126226 62715 347726 117487 -189464
18107 -16084 104745 -31603 -220326 1420 -13481 -83058 6844 -54855 -172974 -150945 205719
18095 -25310 -20996 -386098 -184486 -141016 -38238 -15470 -115799 -20712 75332 -104444 -239093
18084 -239093 195823 -74206 -56678 -108497 -104178 281305 -75408 -143022 166939 -62322 240940
18072 88900 164644 -21292 -33922 52817 -169367 272147 -99685 -154958 -48288 -76018 -274614
18061 -274614 -213804 219163 134269 -63754 -77373 176000 473236 81888 171255 433550 160960
18049 268714 150034 154516 -206712 33913 -16089 -314260 -128092 186104 -60034 9196 231486
18038 231486 -291647 -72221 -315722 -16268 -649 82517 316823 -118883 -110448 -192379 2629
18026 -194598 -144428 225711 -118047 30978 184543 75367 -15772 -267181 367027 -115 -61385
18015 -61385 -399229 -5110 -324727 169883 60992 29374 -8180 -138537 -78837 40422 -175942
18003 70251 167632 -127544 147114 -233648 -314104 -195750 129196 -430886 206968 -143090
17992 302666 127091 195741 -129573 -295254 -41692 -325312 386120 -174370 1533 -88954
17981 -379761 11654 -5069 -428132 -322410 130758 -31232 -196575 -216354 112933 184037 30609
17969 -389189 -96959 -34824 -148843 66711 133056 62691 -38432 169366 64466 244961 -176694
17957 -194025 198176 311290 74778 -95719 100120 -58861 -68563 249950 248196 110041 -80602
17945 64317 24291 -237798 70150 -168660 150605 281356 -138196 -9637 102197 168625 -28133
17933 -61984 40865 -322571 31575 149696 -65566 -158292 -22535 61905 -90375 29285 189893
17922 189893 107585 -144344 -194462 -404562 -8625 141939 13929 240021 178750 -47523 -305438
17911 -305438 -186816 233380 -105429 -173028 84986 -29043 23454 208591 74637 -48453 30362
17899 138736 -226607 163167 -78295 368456 -210658 54500 -136847 -37759 -16035 -53533
17889 -53533 -181201 127176 360315 -2768 202636 -27029 46044 159687 294607 111703
17878 247394 -4689 138157 -27877 274270 111530 -257041 17116 -105227 73005 -19623 156370
17866 274782 -62917 106490 -268533 -166586 168248 124243 -107168 84842 254336 98134
17855 115481 32194 118666 101757 93815 -108201 -246564 86722 -41749 -43655 -183327 -294632
17844 -294632 229481 -166294 106079 61978 116036 108973 -186465 -494 378312 108799 -254504
17832 -254347 38176 123979 -55358 -113952 395476 -87969 -12461 44672 -165793 162900 33782
17820 27655 -291062 67880 136747 380681 -14332 -253519 201770 186204 220115 10678 -149803
17808 71009 82833 154956 235059 -60287 -14392 132026 11681 19493 169310 -59305 133676
17796 7768 -74197 184584 -77433 -55752 -90347 -43637 124803 -62793 73368 -16787 -97407
17785 -97407 -465342 -79316 234636 -21313 -273497 176676 246784 -92183 -98380 264095 -7884
17773 133594 82273 204153 -50847 193570 -3189 2472 -70542 134220 260477 260699 -4601 571
17760 -51015 -120111 159466 3067 -176002 -250485 -127907 -125412 1959 -88143 101879 -112821
17748 -57388 554595 -116669 -314393 81624 53857 -128576 -68989 -342771 61468 448219
17738 448219 -121290 326575 -151111 178113 -47390 6277 192260 484583 -17824 285154
17727 -19196 -35665 -227351 158181 -108345 218721 137457 55485 -146240 -195603 -21539 82339
17715 -329215 -213978 138372 246394 69016 5772 234584 -129120 -173267 -129009 87723 -283071
17703 -2895 264092 19388 -108240 -51392 -212019 11089 92701 394070 324361 -126635 41745
17691 127616 -83415 166083 -57003 -111202 -56014 27956 128245 -282443 377327 128630
17680 -133595 87729 217080 367775 93656 -6162 12741 72384 -1277 69074 -21644 -45539
17669 -45539 83149 194161 -66681 24585 26625 151411 68130 -339191 26355 -171452 -106231
17658 -106231 241030 199125 185530 -50168 285320 -134168 -307704 109324 325146 -180370
17647 -839 -123175 306783 -95336 133081 151108 323932 147923 -160616 82200 -199611 280443
17635 106781 247377 74348 -66161 253967 37446 -10985 -193323 -128443 243782 5925 53371
17624 53371 -42554 146919 10711 126709 159210 157813 -157574 30296 -13814 29502 173347
17613 173347 -214861 169206 -208558 -154365 -22118 338300 -129292 200481 117246 -356736
17602 107171 77927 5297 142402 145439 118418 121419 -49321 -13180 136859 79843 -20274 218206
17589 252743 -288901 253539 -192530 109625 -84553 86311 66519 104666 73175 172388 453689
17578 453689 -63886 371732 256073 118228 219078 -91181 -134705 351388 45525 198356
17568 198356 110518 -19191 -5014 -241795 245330 211021 176190 3153 -18978 -102056 57950
17556 170125 84777 115797 -54703 347672 37104 182684 -176176 217966 222191 267886 411929
17545 411929 -201510 -45401 -186056 308191 235411 125196 121681 254657 -221270 271269
17534 99483 7330 254031 211349 33966 179244 -43811 426507 47507 20371 184575 535242
17523 535242 494385 418149 718933 653407 267355 616425 225464 39186 449494 337105
17513 337105 -13886 389305 30517 597581 120585 290777 488143 378162 378488 698261
17503 698261 411867 172259 -176879 350437 186479 9187 252811 246079 429589 32769
17492 375111 404332 -136721 67376 111115 143252 -25190 402526 113747 111901 126806 -24252
17480 198077 -25410 7939 263375 102865 111535 172995 146882 224417 117884 166704 348290
17469 348290 502962 395850 -82442 57333 171001 129858 101620 177871 120383 165385 34283
17457 335892 178521 273749 327955 -26069 -30313 445690 -4130 473814 72757 163851 161613
17446 161613 45554 239084 413595 391870 97087 400434 100174 274032 318300 353934
17436 353934 311028 61994 221075 133227 395333 212492 -62963 -15938 133407 249087
17426 249087 131887 263144 293862 432116 573545 486219 82412 -34982 240736 67759
17415 -64680 111280 149121 211710 244420 54266 254474 38637 464651 185826 500393 143538
17403 274159 300325 225809 138934 76685 131305 196894 431152 368321 27552 232251 115136
17391 117016 -59030 497744 146754 5127 23558 141329 124297 397062 396586 3696 428740
17380 428740 416622 270589 116671 123521 264363 526804 180093 29646 404656 123653
17369 -102747 164650 441177 -63248 147321 85139 -242582 184772 -130042 173687 122118
17359 122118 42353 -53902 180375 99180 20297 153001 304944 291360 -62728 -124411 374278
17347 161251 -55250 43646 338728 188049 33840 -22027 329837 -41321 166463 -223250
17336 -235779 275238 411652 19740 200402 -22416 286214 128410 363454 499756 141521
17325 123816 256960 320509 151226 305777 -250632 128998 130827 -7365 366822 133478
17314 -32373 323782 402600 265234 250328 -54906 60230 538365 321566 236565 297010 -1363
17302 314151 122288 154730 14755 -52928 134650 283768 201928 152949 192984 372712 -143523
17290 190311 68462 470315 125340 379324 310364 410755 185067 161522 -61617 360234
17279 197223 114936 262784 228213 323273 220006 138841 197800 -36582 20965 358606 259999
17268 259999 447452 298827 277492 331102 243229 181834 177185 179226 257721 409834 481219
17257 481219 66840 35375 197083 121249 344465 -52269 474494 82379 99915 159328 56739
17245 496353 579167 109132 431273 158192 377916 325175 346273 359912 392537 179912
17234 -50409 332778 122039 293285 493213 275076 590755 618802 326374 246253 -34153
17223 379207 383242 85871 257730 269414 254525 227150 92124 466105 389576 72825 113423
17212 113423 201873 519793 386326 250158 266257 457125 235495 143603 86740 235186
17202 235186 144283 765423 282362 429640 196436 243516 119792 178599 281093 19718
17191 420702 222448 417948 467484 467514 446541 285252 286993 345947 184765 -104870 355212
17179 370069 136022 509342 480483 627460 300973 160452 400516 458674 445169 708526
17169 708526 147458 701404 301986 317665 196788 661474 197511 502051 133386 186346
17159 186346 356759 368087 353922 100286 379272 540230 483387 344573 579659 332377
17149 332377 480691 405659 535354 623063 510068 544669 401762 473140 620362 725162
17139 725162 594574 334010 656051 427973 320503 415653 140296 470233 280009 632378
17129 632378 479254 370820 584534 454181 363099 259550 328874 536533 537056 452320 640922
17118 640922 727414 308747 773099 368526 684018 86295 391184 684574 727078 380111
17108 380111 455679 605294 720590 469170 827962 696041 380653 375387 408048 600461
17098 600461 632684 752239 478669 552183 624538 521015 573250 486868 520785 638894 698364
17087 698364 418050 598710 740264 501333 520938 773737 824983 553707 256770 684435
17077 684435 807499 576261 687106 592770 812619 727730 991700 651849 782659 579897
17067 579897 708623 804139 803129 740621 514389 488122 775644 629467 571160 971027 794317
17056 794317 716835 800415 925714 797331 773927 952263 897318 671618 532539 830205
17046 830205 577359 682164 497520 1050001 870744 942012 782418 675121 1053261 964747
17036 964747 485400 905589 723740 689670 1074609 910199 822407 822210 1043563 856217
17026 856217 1092642 1049408 898753 949091 944596 939093 872273 947390 815670 865890 952466
17015 952466 1123754 780450 1095998 1138062 994744 889406 1043810 1235092 857243 1176601
17005 1176601 1120309 850868 1023484 1052027 1072520 1214871 1323021 921456 1020973 649783
16995 649783 1047922 1115243 1191777 1321160 970550 1353931 776940 1464722 1185007 1144433
16985 1144433 1186461 1197386 1410148 1425338 1316098 1228809 1353078 1712180 1307988 1457001
16975 1457001 1503562 1435002 1717646 1490737 1438440 1258533 1205823 1609291 1331200 1237323
16965 1237323 1368421 1302712 1584867 1381188 1678713 1572733 1599733 1559219 1637580 1639207
16955 1639207 1656481 1630209 1690628 1473476 1707900 1630351 1586479 1609603 1861680 1486626
16945 1486626 1918537 1928540 1922002 2137503 1602427 2281138 1984135 2038686 2195204 2257652
16935 2257652 1708411 2041101 1949860 2057910 2115917 2379109 1933848 2390208 2353188 1941935
16925 1941935 2260784 2384207 2369451 2024251 2171945 2410461 2239381 2233123 2345148 2353525
16915 2353525 2209590 2387261 2447264 2382344 2534559 2344000 2809824 2435447 2672320 2671232
16905 2671232 2723177 3077585 2935458 2696200 2862443 2830008 3017209 2692271 3018659 2855230
16895 2855230 3225556 3187519 3468283 3018339 3223947 3254266 3355050 3564605 3317479 3234996
16885 3234996 3475887 3554602 3817298 3362271 3687557 3873880 4059827 4164368 4027365 3917752
16875 3917752 3870043 4123954 3984527 3865256 4261534 4127986 4474240 4567547 4718470 4366044
16865 4366044 4436918 4512642 4787758 4625672 5070361 4864573 5303114 5085971 5530871 5386542
16855 5386542 5497561 5531496 5216223 5764997 5569659 5330560 5895066 6164069 6400072 6149192
16845 6149192 6283551 6137062 6515214 6615038 6840014 6998563 7227432 7232120 7299576 7354268
16835 7354268 7055739 7649793 8013724 7779967 7765737 7808483 8306935 8244046 8790651 8609493
16825 8609493 8974557 9018857 9523825 9227603 9765403 9612510 10048310 10408085 10472210 10599676
16815 10599676 10900294 11265949 11564764 11877561 11608646 11960381 12297782 12532920 12810288
16806 12810288 13192263 13310532 13754769 14194762 14028313 14737010 14925893 15849515 15593653
16797 15593653 16210447 16694872 17191372 17547665 17830226 18046800 18641755 18963728 19444639
16788 19444639 20198477 20586468 20898148 21505453 22190596 22967086 23126118 23775763 24562083
16779 24562083 25138691 26028335 27099966 27466302 28272263 28766769 29722577 30854980 31631487
16770 31631487 32170591 33368611 34419733 35195245 36268384 37294652 38453821 39558343
16762 39558343 40433219 41708831 42941542 44185763 45502355 46719515 47691300 49421047
16754 49421047 50667614 52244728 53819391 55141510 56546858 58118231 59373594 60800266
16746 60800266 62642680 63966489 65274217 66781449 68300761 69820145 70882006 72160518
16738 72160518 73278591 74814838 75927874 76975045 77853068 78414786 79429630 80162205
16730 80162205 80446806 80935948 81313393 81758725 81669692 81713392 81606249 81324964 81067820 80552975
16720 80552975 79619261 79267882 78435348 77485085 76567279 75448630 74346812 73395746 71847394
16711 71847394 71104820 69216966 68104431 66599010 65418023 63768542 62337863 61084875
16703 61084875 59823045 58362216 56571101 55515147 53881362 52749630 51711119 50216494
16695 50216494 48812353 47509482 46413449 45049729 43762046 43082550 41952747 40458575
16687 40458575 39801315 38788174 37705288 36541173 35492648 34783013 33632951 33172773
16679 33172773 32394300 31262786 30492313 30046481 29217575 28266320 27498989 27157748 26386693
16670 26386693 25946500 25071217 24733331 23983048 23221414 22912468 22412085 21901774 21459412
16661 21459412 21159678 20388648 20127510 19560423 19214016 18836131 18615701 18150300 17575265
16652 17575265 16854540 16706017 16849624 16195924 15788196 15318654 15263776 14967663 14609757
16643 14609757 14535930 14262098 13879083 13630710 13707564 13231360 12755319 12853106 12429272 12006199
16633 12006199 12072987 11822166 11651707 11255279 11463546 11026212 10724368 11019158 10364366
16624 10364366 9934705 9950408 9825960 9527091 9310035 9710222 9511297 8901714 9184935
16615 9184935 9003598 8863405 8580773 8418105 8449776 8336449 8200581 8161607 8076617 7780478
16605 7780478 7668720 7821718 7363391 7322974 7647818 6678052 7514414 6959630 7204634 6834862
16595 6834862 6918728 7050958 6442452 6477355 6626058 6266797 6023319 6339045 5968705 5858765
16585 5858765 5752824 5862010 5957058 6103822 5502128 5580903 5519656 5506128 5581376 5108507
16575 5108507 5498610 4908308 4981814 5178144 5145512 5372584 4704365 4641327 4725149 4887284
16565 4887284 4890057 4509417 4594801 4706899 4536317 4247008 4514477 4703653 4178409 4193393
16555 4193393 4053237 4262945 4210762 4409376 4128545 4171701 4424441 3715933 4360476 3862563
16545 3862563 3932693 4133725 3947460 3813973 3657517 3419875 3750414 3731906 3661061 3591043
16535 3591043 3376363 3416037 3360965 3355993 3348601 3620878 3319406 3425822 3413285 3315150 3300339
16524 3300339 3168159 3112153 3235372 3035062 3018327 2958119 2861889 2911722 2799083 3045796
16514 3045796 2903013 2762090 2783559 3000122 3217964 2793583 2726436 2787742 2747903 2697961
16504 2697961 2409654 2845699 2648006 2582194 2429593 2774929 2448466 2729611 2630889 2364315
16494 2364315 2394356 2910363 2120099 2664240 2598602 2257435 2535700 2378729 2306243 2274601
16484 2274601 2321598 2066022 2282138 2472625 2271411 2385247 2099923 2432795 2177175 2386380
16474 2386380 2620297 2235494 2195859 2210658 2156914 2032379 2094068 1981886 2019002 2017855 2095086
16463 2095086 2126428 2354617 2088076 2183120 1936521 1976284 2149341 1956150 1720242 2247734
16453 2247734 2094489 1849873 1815720 2164390 1710818 1605182 1551877 1832231 2018519 1843628
16443 1843628 1770304 1762240 1796431 1854867 1847477 2028104 1819366 1802546 1537090 1920186 1649765
16432 1649765 1657147 1682110 1939610 1746977 1907502 1615493 1904332 1471483 1661560 1798997
16422 1798997 1361384 1744725 1692657 1295790 1634248 1435038 1630284 1754486 1547931 1546994
16412 1546994 1427012 1360511 1392130 1416669 1421443 1584309 1730315 1434550 969157 1376052
16402 1376052 1324535 1264957 1541912 1366204 1559688 1302003 1484593 1321892 1280135 1530928
16392 1530928 1205951 1702109 1182926 1058546 1228377 1011689 1104916 1355880 1105543 1486303
16382 1486303 1286279 982417 1120799 1201739 1412162 1456839 1145735 1334895 1406237 1310962
16372 1310962 1005418 1139565 1238899 1338086 1351594 939235 1372307 1414817 1359684 1183034
16362 1183034 1169021 1494128 1093924 1153362 1004680 1032525 1354177 1257821 1296000 1024313
16352 1024313 1095915 1177861 966455 981390 1409847 1103919 1450461 1129979 1527320 1423318
16342 1423318 1114263 1420033 1510985 1154242 667908 1181363 1087536 759070 1037979 1037582
16332 1037582 1436426 1255206 959824 1219068 931573 750603 743619 1077386 1173185 709181
16322 709181 766073 768823 943530 1562009 1124711 1063099 864393 985312 731074 818610
16312 818610 1032377 842481 1137308 676580 1227275 916482 973345 1261727 791019 964829
16302 964829 721740 814946 735374 784041 1006932 952281 813152 623352 872110 842518
16292 842518 709239 791166 1099225 486290 700581 1273809 1047286 760878 452807 1037829
16282 1037829 547248 717844 629653 1133067 613803 738055 613544 470973 582689 661855
16272 661855 923040 319768 586311 491104 370344 787438 809235 423509 792755 547715
16262 547715 799908 682767 830228 620533 859714 657120 472411 854436 712915 636723
16252 636723 934032 871648 425314 720569 816314 934992 342642 957442 628673 723030
16242 723030 860993 881166 895496 539655 752199 552133 745301 746870 717366 564704
16232 564704 1042255 684188 701354 711071 718609 365589 669644 314754 830023 474630
16222 474630 448379 556742 511577 497076 912264 857252 655860 344136 496480 580669
16212 580669 528654 661181 800271 744252 261261 609588 802003 318303 486020 666015
16202 666015 375637 460431 657825 589396 605929 264390 453991 363683 383285 489266
16192 489266 624228 278795 324792 370478 116597 676298 336936 340894 608860 243258
16181 526454 418254 426391 446810 494031 241346 522947 636143 465686 404198 377275 360029
16170 360029 582886 426802 350647 523849 260936 641766 233133 630706 91864 483582
16160 483582 319422 250796 326867 377499 347030 154885 207872 420745 428703 441728 271511
16149 271511 502494 621491 542967 427918 446138 418206 297180 462601 212048 490316
16139 490316 330962 266570 377828 239124 641282 634559 441693 206022 507622 699749
16129 699749 311110 438946 441008 54689 335822 76694 485756 198789 206465 435037 889195
16118 889195 26489 217911 383227 305941 277844 377650 300807 127233 206873 484760 260211
16107 260211 21375 318922 266252 -13867 275359 299238 241272 354890 340613 247848 365113
16096 365113 278389 363684 367924 173313 284625 312415 248015 -87341 311197 -160761 429825
16084 275520 506658 534412 122619 414299 420197 -10213 72426 258364 -82713 -30690 131761
16072 163656 220856 -155854 241948 472280 156280 222137 207988 434665 271776 36279
16061 208412 373759 122116 590292 309555 150489 185251 260563 -89255 240264 -15361
16050 113356 40414 203175 371846 269439 326422 404517 51108 355981 378187 -242486
16039 -104160 293014 222944 165193 69094 182165 401293 288129 301899 123185 -538 -17854
16028 -17854 -24495 97773 205596 -7019 -58386 -66385 124621 412611 63682 48348 302596
16017 302596 85415 68529 160 48119 -208509 248341 75856 68131 195522 4906 53453 465857
16005 465857 240045 -58817 175144 168067 474936 87937 -187856 243321 60620 -42921 1212
15993 325728 90460 197964 177410 375164 631187 575073 502168 446479 612108 602736 227554
15981 625460 324277 -135545 -6721 345624 302087 -108696 137849 -76315 71840 209125
15971 209125 -247243 264568 266543 409222 -386 39871 226366 354125 216133 -92442 246113
15959 35780 -74390 49821 90107 -164322 -85273 156344 -167657 164238 -48742 349621 -132910
15947 -30227 481654 80827 110999 -16387 132267 -38073 91551 220781 -83952 -94890 304671
15935 140627 164823 -27970 144330 -73936 6411 462030 -101411 -282432 -59901 205042 -3461
15923 -130267 -118296 6387 290239 -65653 7597 238077 33311 15570 -118345 187677 -92419
15911 216589 -34511 372962 30482 196543 -38297 65293 301651 187096 360728 290954
15901 290954 436524 108113 128170 207338 -207233 -281080 142302 6137 35448 30071 13085
15889 -111422 -9177 91112 2720 252369 10785 41442 -108473 -62457 259164 -269286 203130
15877 -69574 201160 244037 140229 100460 31432 38787 33703 127085 -231543 -50552 11513
15865 140716 151057 -72742 18916 344066 239629 89419 -51910 -35244 194448 -172769 157354
15853 -192481 -113083 61688 -120696 -28212 -116751 -255235 130225 -221008 140324 178390
15843 178390 91360 -41829 -198262 -345328 92549 39311 -51710 -157622 124741 -7777 12953
15831 -252250 -9076 -168481 24602 -314577 332533 -11098 -126364 -224860 -226149 -85792 -221416
15820 -221416 -46659 38952 307363 9423 -94114 -182781 79216 149939 -240351 114365 224002
15809 224002 -32531 265915 93168 215005 143032 33979 -94527 229268 -131498 -108958 120571
15797 -85371 55206 83532 125019 -81800 -242296 -44459 39734 -284626 -237015 172865 -432520
15785 189183 43595 112209 81088 342657 252844 39308 95441 50413 98812 -41879 -326899
15774 -326899 111345 -94653 116685 -80939 -3180 -105565 -205899 31980 161807 53460 55508
15763 55508 -141395 128987 -295028 -19789 26483 -119429 281057 211017 149828 -70470 -109793
15752 -109793 137716 79309 484094 66014 223432 176145 -169322 80597 -47372 112861
15741 -63763 -216045 -209395 -74651 154384 -51867 202405 -191270 170330 -75632 153579 -151296
15729 57985 -312237 -157333 322237 19880 34799 -221108 282300 -155372 -67211 -163837
15719 -163837 -356968 181894 -166909 -342810 121194 233097 70344 -282957 -175247 95580
15708 -190136 191867 123528 -196182 -223051 194937 201947 132371 46492 201936 -320265 28514
15696 305395 -365239 -12166 96443 364 206802 -113442 220415 -58249 69031 -207694 118644
15684 896 -110937 -57911 185438 -223529 147601 -121832 230988 -24112 360914 -174102
15673 -99536 161870 33085 -164671 -206900 -131959 310397 120688 -138019 -103017 -113501 -147976
15662 -147976 -112570 279701 94916 -22609 67388 147462 -25210 127197 22932 71173 -156622
15650 82263 -416877 -68068 238141 -4202 114462 -5822 -109146 162131 -247001 -218884 -178144
15639 -178144 -68617 -282221 142063 121354 -81721 -136912 -94014 15160 173442 -219046 -4576
15627 -283341 -37266 125884 19108 215670 -279034 103556 28960 161992 -437377 85367
15616 -195118 -131678 24830 95196 83366 -61707 77221 -165386 124825 60709 24268 -83332
15604 58244 -223281 -17677 -7924 -34358 -176719 -256840 28743 175647 48781 -312548 74442
15592 240883 254618 -33612 -41707 23790 -56089 23403 104461 -9665 62442 -161021 -123847 -198571
15580 -198571 -91446 308000 99300 137449 -245059 -219944 -379601 185711 -143975 -97499
15570 -97499 104391 25700 -94054 -137594 -229567 -22838 -200797 -48877 -22438 -103968 215012
15558 -115194 -359349 33306 -146423 261815 -42342 93614 306803 102281 38635 -22137
15547 -80828 -168628 -5300 308518 267950 -176669 -287464 117664 192359 -4022 299324 -183859
15535 321072 201035 88008 -132698 88190 -166710 123987 373965 470491 -153064 171788
15524 101300 74476 -27705 289180 143054 -99926 -27545 6429 -4017 246119 -68379 108969
15512 -333505 -345925 350100 41705 134391 95419 20789 -64221 321514 308270 -378905 -165224
15500 61974 -178584 21816 368285 -8264 -186605 -270999 81030 -373914 -155643 -93995 -138726
15489 -138726 195566 267079 79284 -303381 269801 20917 3668 131830 171553 -11855 -76876
15478 -76876 41576 88826 183189 148040 179033 385262 311678 65219 -45416 -210275 26048
15466 -313956 -40532 9766 -17800 -29987 -195331 -117905 -133269 162361 -302342 150898 128864
15455 128864 14497 38713 181607 23078 293359 150133 -18354 180025 -58209 225002
15444 176387 629465 404221 402075 166806 177055 187169 321861 85375 136665 -123368 -221839
15433 -221839 73030 -131118 138115 -161389 -486240 -66283 278006 8979 253842 -285711
15422 26414 140498 253293 -205800 4549 180299 -77261 -125784 1089 184526 72193 118867
15411 118867 98309 103540 22766 176660 -279176 -208313 132100 -277334 16730 -184045 -47407
15399 112977 107684 -62579 -34038 139873 238604 130722 132392 -158023 270372 -230120 -5005
15387 -108794 -11845 -191021 -9443 -130399 -147204 244420 -246510 26135 351460 -63452 195614
15375 291698 -82340 266394 -48994 97998 83883 116018 -203957 136793 -145905 -2656 313009
15363 31839 173264 -149615 224939 276563 40374 308073 56667 360 777 224924 51978
15351 151019 -172668 426512 -64355 -116078 22401 -21795 174221 87846 -95425 -17629 -74871
15340 -74871 -37919 135789 310802 107468 42227 5217 -281365 -110741 356837 101155
15329 114329 153098 -310832 -198826 205843 209601 74149 96836 209464 53729 252305 299075
15318 299075 118475 224471 -161671 -1597 -68683 167916 100585 112345 -97976 310030 244282
15307 244282 286174 90406 -76296 154681 200349 203294 460046 -52832 182218 -916 -268506
15296 -268506 24407 7199 -73713 -144365 -127171 -102870 110713 -160393 91027 246322 246893
15285 246893 -215973 -116722 -173726 10771 60936 -350251 -254796 83185 21251 97008 88422
15274 88422 -126571 61078 69410 21113 -152205 -19984 129313 201121 40237 275053 207876
15263 207876 248247 -131223 61251 216304 -121401 -163064 141376 -146179 384427 -12438
15252 -48874 291894 78678 -11799 497058 1112138 1928882 1321651 1883632 1317213 728501
15242 728501 50119 60768 151554 136456 -145465 -82352 -118261 68287 -204278 -240440 -88071
15230 -33116 -209972 83418 -18615 79098 -16202 -4327 72382 297992 108230 -192611 -276428
15219 -276428 -291982 205196 176265 -8705 38884 161289 168780 -23197 28123 109101 122066
15208 122066 206056 198977 -151244 51569 -36502 -163377 -224110 -40223 -14748 137165 93613
15197 93613 16249 190701 31338 164346 -269324 -2362 -65287 190580 177251 120774 -146584
15185 -80382 -127309 -85743 -113457 191970 -12927 -23789 235572 -28718 -203704 -261650 308894
15173 134161 153111 -82161 -80853 396481 323277 -24249 192595 149098 -151051 6464 7662
15162 7662 135430 -133513 321186 225497 -111514 145035 34853 -256539 185286 -25527
15151 16637 317430 148697 37620 -181587 -167897 -109228 239956 219359 60990 -158467 -26771
15139 -5193 80690 -20537 -61046 -172456 312002 229827 267201 -109258 390834 -124452 145268
15127 55803 192158 170672 -295177 246387 463399 177683 -25777 35390 137782 57888
15116 156526 464987 45391 -20010 -92024 87880 369042 55444 86865 88905 195550 359095
15105 359095 -205920 -64390 110383 397517 -127352 118558 403656 -98706 -83438 73477
15094 77540 293800 313022 -135940 231918 -57402 -85448 263294 -60059 -145802 399122 123509
15082 283652 168841 27261 248513 190790 337687 -93966 135760 -21412 188622 261288
15072 261288 -10820 218569 255995 -109611 -556148 118623 147287 329452 6271 63291 -276967
15060 -54491 221252 239140 188753 452702 -93555 77573 -334317 19181 134294 197476 138137
15049 138137 -165455 -33948 -3799 219884 287013 250974 491364 196615 164466 33084 151481
15038 151481 275158 84088 125666 192468 174104 -83949 367077 460277 301073 -30157 454627
15026 203443 227190 295065 367748 404412 224288 441134 357836 371724 135898 248889 701066
15015 701066 400911 287511 253677 104390 276199 289582 150537 111082 488930 -75763
15004 138772 210807 803418 111954 500399 245529 56337 -252772 -105398 189918 339677
14994 339677 164374 277042 132612 229572 74856 343591 64075 300536 105133 287721
14984 287721 151234 403438 325689 7100 232654 496676 626136 428254 505401 323757
14974 323757 478369 326863 428052 -2761 433603 479516 534954 325196 230525 237549 313253
14963 313253 550841 -22658 472723 140060 48118 458929 881064 400330 311664 221545
14953 221545 50721 46721 -2403 376369 337708 393736 541089 478785 155172 295880 531646
14942 531646 292035 412113 187232 341287 279748 342204 512564 616369 257609 210464
14932 210464 499454 429022 666642 350271 743210 636413 555099 802765 489549 497060
14922 497060 1003073 569036 822301 553204 795168 1013912 1103045 1038878 665886 1206782
14912 1206782 701220 495276 303853 296093 7719 240273 118664 93448 405212 524547
14902 524547 204149 165898 440244 279872 130079 313278 248119 338743 -48488 54840
14891 224765 445310 221885 126071 413534 258484 469864 437379 533075 439025 506565
14881 506565 90260 460203 373862 396291 890007 528904 168525 75584 387872 74675
14870 554567 353526 365688 117916 76181 469687 172221 380524 428399 312147 449538
14860 449538 381911 229735 180976 401694 227843 272013 487091 172600 400983 270892
14850 270892 684079 468026 514893 513584 304669 105805 622315 411013 614342 550336
14840 550336 841678 855519 570185 549794 578128 548428 635640 431952 157881 64085 529415
14829 529415 546652 183054 163846 160615 529544 115013 292414 340745 422971 506175 161753
14817 686759 463939 831923 194549 113466 515127 321153 359767 664662 395268 642034
14807 642034 370621 590219 623276 540637 461324 746909 430293 637037 453153 579105
14797 579105 422759 315347 716667 355306 304360 507901 443760 565991 522667 442815
14787 442815 302007 427259 551345 160028 690046 382079 205539 607256 347875 739225
14777 739225 591850 720722 613581 740362 561917 605739 474484 439624 159309 514443
14767 514443 614774 386517 269933 303578 688035 129195 633826 605135 474133 711761
14757 711761 566467 552335 364143 466061 517983 320516 517921 546169 474057 776261
14747 776261 665986 661931 551724 617671 607209 417408 628197 826996 594353 358999
14737 358999 568655 435720 527001 453925 639113 823610 693499 670725 768700 505776
14727 505776 911251 475237 725547 1100085 781481 987717 595744 904496 1011319 1040045
14717 1040045 726802 793112 747668 556955 553146 754900 739923 602753 861533 482739
14707 482739 832937 611049 924009 531267 278201 734461 748460 1024220 625118 940978
14697 940978 1239599 825876 954765 786487 814017 744288 807855 701116 791822 576607
14687 576607 854031 490125 480716 689519 544747 750457 431303 549751 1090753 708003
14677 708003 1137690 636395 634333 432274 859014 761869 677300 1070994 937607 840932
14667 840932 835996 874689 581859 537679 689698 795067 798161 914132 698497 1367288 915032
14656 915032 661932 1001009 1160883 864770 914601 863050 857077 1011834 808773 951788
14646 951788 646881 835399 844242 969227 833407 1001537 1041410 722489 1149294 1154304
14636 1154304 734581 787543 696693 1221017 917568 1039134 920700 699279 743737 1235225
14626 1235225 1111132 769837 937457 893042 822252 968175 965581 615405 1437325 1037717
14616 1037717 1134884 1045823 1310824 1270843 1176916 975633 1375458 1336849 1085545 962484
14606 962484 1132915 1453575 1493858 1511024 1151318 1132940 1231300 1320843 1338131 878365 974221
14595 974221 1463778 1336802 1454002 1619896 1556578 1026473 1456300 1461384 1316518 1171588
14585 1171588 1457467 1297542 1512798 1443193 1718839 1100962 1764038 1678133 1235620 1448840
14575 1448840 1353001 1502065 1458997 1628117 1752032 1697063 1792301 1639499 1798037 1642970
14565 1642970 1983241 1440200 2111627 1787057 1935014 2165667 2120316 2002309 2558238 2425804
14555 2425804 2216646 2703661 3042305 3113246 3784927 4369459 5943075 8860448 15068495
14546 15068495 28486692 35342247 22614142 12562434 5954502 2955891 2130526 1727772
14538 1727772 1844486 1728303 1879085 1477361 1444261 1609218 1564481 1419592 1510928 1463983
14528 1463983 1921315 1837090 1676514 1378300 1926359 1747942 1884732 1953833 1593676 1855197
14518 1855197 1636143 1935966 2085701 1834910 1835675 2063042 1920313 2283954 2391999 2280516
14508 2280516 2148817 2311360 2350645 2164169 2249970 2287059 2455625 2421331 2531914 2574446
14498 2574446 2771371 2860594 2615207 2766143 2630236 2782442 2394012 2833949 2744078 2881738
14488 2881738 2725374 2835111 2799375 2739761 2523285 2703821 2926532 2921102 2919348 3110650
14478 3110650 2997874 3196728 3546849 3045118 3446171 3137315 3243079 3336479 2819995 3161360
14468 3161360 3423030 3564939 3482787 3346894 3435747 3627138 3478882 3193344 3544422 3962344
14458 3962344 3562207 3313113 4210867 3882997 3976239 4124327 3879899 3988430 4124476 3963333
14448 3963333 4239010 4254924 4174295 4545202 4515852 4336768 4836180 4473838 4662983 4777274
14438 4777274 4815634 4779773 4926403 4843786 4999237 5149494 5185662 4930488 5252401 5278011
14428 5278011 5552330 5502860 5272677 5384532 5735924 5767101 5994041 6087830 6186223 6350148
14418 6350148 6451307 6487806 6654390 6450050 6899056 6592174 6851850 6840553 7075335 6925427
14408 6925427 7129039 7136375 7088381 7381162 7986661 7989296 8153422 7891605 8272856 8133378
14398 8133378 8296694 8381556 8670919 8694313 8760410 9001260 9036521 9120454 9357856 9763830
14388 9763830 9893914 9944952 10411157 10605763 10500295 10605418 10813098 11145735 11626327 11322351
14378 11322351 11793297 11912333 11886562 12339891 12491002 12941720 12952621 13510281 13296696 14015765
14368 14015765 14027574 14344397 14480835 15212240 15529261 15776318 16277854 16908690 16507201
14359 16507201 17346166 17799444 18004704 18175943 18877308 19312468 19697413 20270988 20709255
14350 20709255 21186504 21959207 22343130 22936141 23489108 24172169 25006008 25610750 25943551
14341 25943551 26590959 27258658 28194133 29319011 29756516 30710219 31665803 32642081 33194401
14332 33194401 34652185 35843488 36478667 38116972 38881947 40534577 41636710 43433363
14324 43433363 44703780 46381321 48098084 49116282 51270437 53204689 55041440 57205614
14316 57205614 59472774 61836944 64223932 67517998 69932417 72823409 76189822 79537332
14308 79537332 82888088 86118561 90541576 94218088 99061511 103225350 108363091 113563113
14300 113563113 119072527 124817081 130879317 137988743 144923318 152431379 160519232 169409932
14292 169409932 178261803 188367754 198495178 209327174 220665867 232936973 245245039
14285 245245039 258122835 271519396 285922150 300231035 314998802 329842084 344687016
14278 344687016 359005987 372764475 385662263 397463225 407520870 414646633 417156695
14271 417156695 418202978 418332201 417404840 414495807 410266382 405575128 398404331 387213141
14263 387213141 374303537 361171006 346948410 332158664 317189391 302067203 287249511
14256 287249511 272927693 258789272 245310627 233548928 221556470 209651051 198713605
14249 198713605 188193484 178457817 169375513 160211462 152258364 145188262 138023845 130788059
14241 130788059 124845247 118915082 113115409 108055824 103395947 98556947 94388239 89907457
14233 89907457 86288108 82784083 79754051 76520952 73123471 70182646 67409641 64711655
14225 64711655 62421669 60126281 58141947 55635075 53978293 52361153 50399544 48355465
14217 48355465 46734835 45573462 44143317 42589258 41480584 40112347 38661219 37392106
14209 37392106 36257356 35468584 34472344 33793411 32419697 31131311 30259512 29837978 28682706
14200 28682706 28538639 27609735 26551175 25983650 25384787 24582566 24271953 23605325 22992297
14191 22992297 22557047 22101181 21179226 20782862 20252548 19597857 19501746 18960562 18691767
14182 18691767 18090622 17814180 17368007 16780355 16437604 16068323 15670529 16072277 15308543
14173 15308543 14853209 15015687 14283453 14163454 13840513 13579643 13303962 13122729 12550613
14164 12550613 12864164 12270814 12179573 12035967 11821940 11473594 11622425 11255333 11088767
14155 11088767 10474326 10704182 10306658 10279007 9998440 9631597 9715012 9624059 9499734 9428152
14145 9428152 8940397 9222680 8963998 8807937 8824718 8516006 8495636 8119069 8164673 7957272
14135 7957272 7810669 7641527 7911891 7320710 7490432 7582935 7264444 7245278 7174444 6843879
14125 6843879 6869851 6435498 6706754 6530393 6686698 6606369 6191281 5949462 6465022 6074683
14115 6074683 6049830 6000003 5840750 5969087 5700317 5328339 5673436 5646057 5479053 5224176
14105 5224176 5474525 5170631 4771788 5051151 5178601 4872122 4879886 5152026 4689245 4684821
14095 4684821 4756203 4315620 4490937 4560593 4349864 4264597 4287580 4463445 4227944 4051428
14085 4051428 4341976 3942782 4229105 4070349 3846337 4072869 4050714 4014144 3748764 3752808
14075 3752808 3608015 3424937 3367398 3417991 3527075 3808934 3517859 3669579 3196432 3261645
14065 3261645 3192693 3296307 3189840 3227726 3531564 3525484 3376506 2992703 3258280 3060052
14055 3060052 3146362 2606112 2802809 3169265 2749663 3002274 3108436 2882990 2796522 2396396
14045 2396396 2528743 2729338 2716469 2920841 2628447 2350922 2736396 2666548 2854140 2818738
14035 2818738 3008728 2693063 2679106 2934275 2779730 2579996 2672140 2623722 2436679 2383822
14025 2383822 2325231 2372649 2187424 2044379 2383440 1976559 2050663 2551180 1917603 2381453
14015 2381453 2100582 2162331 1934027 2206820 1998463 1745585 2302085 2214019 1719300 1905324
14005 1905324 2073767 1921780 1665833 1506600 1883349 2075967 2075142 1675992 1901578 1849520
13995 1849520 1900422 1865471 1825258 1760662 1993259 2414438 2747942 4983636 8882618 19847487
13985 19847487 33924107 28332449 15242161 8995403 6012893 4394330 3458552 3291776
13977 3291776 2924435 2819089 2837040 2358881 2040377 2373432 2144919 2056637 2166179 1952343
13967 1952343 1968299 1870880 2024043 2024722 1808601 1808319 1883640 1749649 1918922 1636895 1934203
13956 1934203 1592770 1584014 1565187 1700816 1471275 1714957 1641923 1134116 1463642 1465033
13946 1465033 1366130 1499848 1502297 1740046 1230619 1783033 2061529 1442470 1489874 1254887
13936 1254887 1306294 1626864 1659858 1248260 1320436 1306588 1171024 738765 1320564 1291181
13926 1291181 1340228 1241303 1459308 1358492 1378525 1367350 1051593 1489560 957076 1488782
13916 1488782 1620155 1564750 1080871 1127182 1200851 1494170 1039620 1049838 1287469 1177686
13906 1177686 1032144 1126823 1369431 744042 1057407 1134159 780681 1198072 1332260 919462
13896 919462 868036 1311996 1411681 896957 1079008 1072987 959892 1145389 1098846 1080268 1195784
13885 1195784 581450 1131792 939534 897095 865739 957603 1124311 1067236 1119697 1073457
13875 1073457 773978 832773 984591 616832 1018490 873194 715508 818154 1111743 860483
13865 860483 866484 913747 849690 807624 836572 897510 804245 907070 722462 900748 869942
13854 869942 784005 782620 840368 757476 1052633 759641 681956 889976 746978 1211099 741037
13843 741037 514258 730244 685607 575101 1094856 910895 777776 609441 575029 816380
13833 816380 791399 769168 877141 600148 881787 712809 726712 810646 487132 863475
13823 863475 796931 916266 730353 657182 581192 410963 700007 663504 567269 774406
13813 774406 617600 579154 770935 430960 256239 766484 734846 937788 558220 518216
13803 518216 706296 762087 919765 541869 1024389 632742 903945 638828 263953 588291
13793 588291 842970 473701 536559 752001 898487 613610 573082 524349 833309 965025
13783 965025 636724 1002148 84140 549028 727096 877410 473328 536998 509932 749810
13773 749810 484310 690855 570221 637678 675353 485692 777209 738681 581094 728366
13763 728366 282859 487112 588379 395120 302195 509938 562878 350459 750097 376014
13753 376014 491013 240643 561525 98151 190279 435115 523187 497123 355755 306474
13743 306474 738259 407337 673323 604521 536173 491362 289661 552985 562562 597000 425418
13732 425418 450091 728708 355860 495670 298219 737396 712474 690158 544260 686071
13722 686071 387608 473113 543310 466307 455788 526893 555571 209427 400445 275933 464959
13711 464959 479478 325947 648134 448599 406526 327577 529171 322965 186632 182172
13701 182172 598425 66710 409867 799519 788554 342993 482737 421352 414981 499881 319884
13690 319884 411122 583068 356801 319780 396027 700780 583826 425496 385151 370118
13680 370118 365118 356879 122429 297578 292847 742549 288887 405105 278792 464119 393058
13669 393058 627179 680376 419648 401024 404235 446981 361804 493379 231168 634238 292172
13657 109840 -64821 255295 473253 184374 336394 114569 347214 437871 237334 78867
13646 259776 282056 421969 337873 175451 146769 296173 198818 324806 245744 227396 187653
13635 187653 352865 421841 489930 450589 516555 386243 302482 512490 449782 -65761 509887
13623 347300 85420 461452 621454 648769 317789 129154 232355 209775 631504 787045
13613 787045 372597 549374 295977 108608 276132 625579 189063 176098 468898 122966
13602 355735 76423 256291 311668 272679 309523 297348 225592 464807 345790 479833 304336
13591 304336 104136 535826 473575 252896 -22396 29103 626215 185474 197968 306967
13581 306967 296751 311651 123106 291207 306523 22564 109195 102587 391840 416781 300794
13570 300794 147658 319411 395749 417151 187918 66678 305020 327000 68649 189566
13560 189566 53059 524451 88856 126898 194248 451084 604457 428053 -127049 89104
13549 193103 412814 255378 77008 239512 62937 83930 181288 -158000 381083 289214
13539 289214 225142 531144 510834 200862 79953 10585 -20574 391862 136968 294757
13529 294757 210926 114763 178266 176259 259588 189323 360064 141343 341858 501161 74906
13517 -1822 102445 187133 261056 6369 418273 481243 261125 402802 258760 255660 145661
13506 145661 -45752 219484 4426 110544 205330 256729 114610 115816 56174 451935 45370
13494 311489 147221 291766 130988 243149 345945 241217 349568 376056 205012 213540
13484 213540 186138 280563 250552 1102 84110 348961 371687 268523 -22180 157883 305397
13473 305397 201081 -135871 85807 472682 190307 348808 147249 241628 -87630 116024
13462 79914 78351 -140611 130784 49147 586337 242396 204243 75523 93765 -35345 156677
13450 -116198 -205821 283717 356907 242820 614695 135306 280846 324427 458038 275475
13440 275475 178545 253625 107834 204780 222823 287080 355748 156266 141283 305595 -134097
13428 535976 -190879 -174354 161192 -100363 204490 470177 251164 163135 186865 124673
13418 124673 -37336 252395 206968 121479 -51535 252313 20036 -221944 281981 32767 73356
13407 73356 117831 133761 212458 135384 123752 208998 295590 39538 212497 244213 478188
13396 478188 131213 407772 170493 206458 356992 55466 117529 76227 417918 4245 424504
13385 424504 149220 39743 -88473 166674 -100948 40852 343028 132845 416960 211070
13375 211070 43039 340261 140335 -71818 86574 144740 212094 93079 69317 95950 18704
13363 63448 398965 278859 83907 121355 186484 407646 184359 -177341 129863 -12701
13352 135859 -16668 365415 280769 182209 131367 -17131 134547 -12707 211156 27853 254767
13341 254767 99821 321648 252628 349868 266534 126873 79631 130177 595225 278768 250282
13330 250282 318134 145837 -52138 274058 -144746 403109 187250 275051 61614 -7562 91635
13318 421808 228372 311344 114022 274740 416970 193862 43316 201757 -644 237723
13307 595900 135676 -155141 285132 -21742 88031 94762 80888 360318 -296707 -31066 319553
13295 281161 311158 13883 416775 252002 -294127 48980 233114 303700 103299 114664
13285 114664 10496 94898 163619 -168458 -268371 -28282 240989 228647 16009 145392 176134
13274 176134 242684 -124655 76259 92880 -213468 -15967 504589 37789 -135202 -62740 186859
13262 151392 234551 9970 391284 196681 10579 141383 105851 -378924 174173 -132187
13251 152831 194468 -46564 -99709 17520 -93281 74530 72999 341740 245400 206625 102481
13239 254023 99528 15007 12102 -39347 34392 82047 187587 162506 1225 -196566 150565
13227 143155 323326 -16805 165802 172943 226167 5511 -82958 -42875 -388132 7156 352127
13216 352127 176649 104902 -123610 307064 -107622 2480 244346 -92917 34613 -176089
13205 65520 129282 84303 -268598 104929 43591 334075 -6876 136053 99022 -81718 -234631
13194 -234631 -54815 31049 139603 -86403 374990 179446 44573 174226 184452 229445 93278
13182 178808 191658 112422 500041 109268 -37355 187870 -4931 191780 48189 236066 31590
13170 102247 -10954 -228508 -43877 267850 70796 161050 216573 -41005 55552 10939 -274981
13158 167202 399251 187314 193477 388506 50730 221164 73388 -74947 212076 406450
13148 406450 191417 -149964 258673 -99911 207535 206942 -23604 -15186 -96448 164598 52405
13136 312359 -111478 -84672 -106683 188383 97147 -51567 159195 -16607 -45962 -135701 -7727
13124 -291619 156826 212591 51094 346617 -128205 -437653 -305720 272810 167810 -36336
13113 31887 126454 56529 120973 310980 139240 -7397 -154510 171417 -142521 138584 -97734
13101 141896 96023 85946 248228 49149 -141946 299066 52693 -25526 -274779 -156036
13091 -156036 268862 -210894 161472 236940 209840 2779 81599 -152029 305387 11672 -5841
13079 -69728 -123174 -150880 25962 -342717 7912 230889 355068 66763 122080 221045 -30612
13067 84839 -110 -107819 -81162 292967 -45293 88559 -55653 125869 -185453 314930 132689
13055 -14831 -6799 34473 306334 136521 -57913 213296 -15743 30053 -6120 263885 81455
13043 -21908 -26814 100095 -109858 100952 187475 376994 153438 -16542 159160 -178120
13032 261048 72410 102373 117963 -46300 139712 130345 40673 361327 102386 -316379 34842
13020 -41959 37628 358875 -107423 153672 -82893 32855 200516 -137351 135790 127016 2889
13008 -255822 -162955 -32486 155410 205668 175879 -42415 199185 20242 285642 -96893 120996
12996 -148413 -207982 18324 220037 17811 -42380 248517 261548 126204 160660 -3187 173098
12984 206512 -19826 400214 167172 1047 138585 42366 70181 44760 138061 101784 63269
12973 63269 136246 145160 -244220 -313707 114062 229287 306913 82948 147452 -233411 -144835
12962 -144835 -25422 281488 -655 -158001 -114671 6672 456523 225696 333977 101597 182983
12951 182983 -157463 125827 129601 250248 -28362 147243 -77649 382713 -100084 -112918
12941 -112918 38079 -3829 -121355 29028 -258603 -122281 -63251 309066 -274725 45305 -155973
12929 11177 -66544 -177410 9293 -84847 -99238 -9309 -147849 295693 -206755 -293376 97124
12917 212632 380790 -146672 -1161 -1317 -378031 -36973 -199267 105359 -4122 -67238 187177
12905 99153 -71727 -156777 -175657 -165565 235382 329216 -192985 -317124 434539 -233352 -147812
12894 -147812 173629 180904 -5502 -331906 14486 225356 -55712 2076 122 321128 -223954
12882 -70831 46664 62498 -21297 37676 -120275 21606 146804 57543 -212302 -28500 210545
12870 -84919 -110901 82810 -325644 172278 91696 56014 -86970 196602 -105231 -18009 194653
12858 -61458 -150290 -140815 -28556 299013 289135 -17791 255090 -96812 -114259 237937 27824
12846 -244160 26425 -45514 -296442 56858 114189 281484 -113806 118453 -79589 190976
12835 -21961 108040 162222 56451 -98770 83407 -16225 181292 172566 -372821 -280951 308251
12823 257003 247519 -77515 60643 81881 222573 194731 -147739 -179409 -48524 47734 -136451
12811 60979 131336 -215215 -83537 19092 -75347 103790 -21831 -95634 398800 126842 110522
12800 110522 141692 118956 -19011 -18172 159566 -136020 263846 -221775 100000 -122085 235627
12788 -133898 148892 117436 195231 261274 89998 -94778 -136281 -269164 -216443 156435 -84363
12776 -448013 78683 43609 155184 204988 -204339 -27594 8331 55324 50755 45081 349824
12765 349824 103867 -376192 -198127 -91334 325713 67118 -45752 -279892 -14084 -238502
12755 -238502 93821 4752 138902 -218182 -181523 -83828 40559 123568 -166273 -226945 -28501
12743 157563 114069 31029 -198667 428587 91752 -23858 -317498 -25838 -31701 18650 98306
12732 98306 343442 10961 -144136 149418 278160 -163720 335572 -1221 37598 -259981
12721 -237983 -34765 157176 -148421 156204 109341 -284645 209494 259124 -188748 -107133
12711 -107133 -103478 131106 -8020 415919 -5989 121621 -28789 306809 75089 -39221 -458145
12700 -458145 -219475 7719 -2997 52826 188689 -60069 40861 -124277 -34872 -12829 -140646
12689 -140646 150893 182082 275164 88607 -181869 102281 213241 496599 197273 5401
12678 167869 323959 -358900 10098 -113751 90414 -259376 -157440 -54192 74707 171555
12668 171555 -331693 38124 -152145 204867 73817 -47673 -192620 -13078 -37348 -63042 44682
12656 113615 210941 236861 44426 -122458 75763 4583 311360 113360 -40710 -112385 120811
12644 22949 101783 196173 -62200 -49902 112829 43860 25781 -210645 -144594 366086 70910
12632 73743 -79672 -37010 1570 129872 -108857 228841 -293515 -90267 21687 47012 79971
12621 79971 -144072 -59867 201420 63826 -117493 -72688 -80574 -327264 16700 266473 -2148
12609 18079 156172 285363 85780 174473 -127600 225920 -140503 196130 111522 -225268
12598 122815 -245755 196474 -98620 -26393 180086 61363 180688 223381 196872 -19328 -352702
12587 -352702 5147 94580 -152166 -348262 122087 -845 7180 299383 415828 -82191 151331
12575 195350 -76561 -31337 256000 -53835 -407443 -276331 41116 267961 37307 92539 -160190
12563 -151860 20529 -129314 57698 -53569 -155617 145571 45101 -205976 -17252 -1336 173046
12551 204104 354045 297244 -24154 -77500 114625 486448 -29444 328858 -35145 220871
12540 -103871 369679 -105228 -99225 -25531 -249712 59102 -246052 36407 -125743 113499
12529 162682 -118008 -154385 -127261 -21152 32809 -200360 35502 25258 -218264 50199 -112442
12517 -275737 50607 53724 99072 -534672 -283702 -50895 -60442 -246199 141514 341868 205215
12506 205215 178248 130168 39066 136623 -65417 256546 -22581 140662 -65595 -159776 -120014
12495 -120014 -78183 108061 167779 -36119 14203 245672 168253 -274020 -214664 -64568 29712
12483 -169858 72135 -186932 -142155 -15197 101877 106376 47174 -20750 61365 -61104 142137
12471 258135 -76667 -19902 -8941 96695 -206079 -170149 -341938 22563 -282669 79983 -219302
12459 17002 -49529 -126784 -289803 -32062 78502 -214632 57313 -352005 -32419 166277 21879
12447 -333498 -150750 -209839 127303 34877 -129097 -113216 -56194 44137 -111276 258309
12436 -169760 -188328 -194310 -94719 -37635 80618 -298411 -303564 -180041 -66582 4238 10065 -29914
12423 -118494 -4142 99536 -141071 12704 90822 308673 -173677 92157 100226 293623 339144
12412 339144 -96511 -137208 64602 -158103 194754 -73051 37226 -111801 243211 393935
12402 393935 -262355 87230 249346 -23191 -36125 -207294 -459594 -313897 -181885 -98513
12392 -98513 -67611 164151 113799 139424 33405 -187791 -137361 -345317 21806 -194820 174873
12380 152014 -37568 18171 -157898 264917 75849 411306 135795 -211271 -40335 12875
12369 157075 116834 -39869 -112400 155296 -29692 -25490 103991 -77072 -58565 -72547 291790
12357 75104 176434 -163062 -131701 41864 129877 43158 -25271 159070 4541 -37566 96857
12345 -170196 -116435 -87678 46036 -142927 -10431 -48086 -108796 -213386 176557 86482 -132512
12333 -85570 -43230 -69751 27988 -474031 -130793 176269 316727 -25586 -47584 332830 -171909
12321 -5801 67129 159859 266774 -8121 99410 208507 82012 -27038 142768 -20251 -59816
12310 -59816 -53289 -69347 -22842 -29575 -220351 -46913 302851 319538 -82420 -277756 214147
12298 67769 -1428 236530 139944 140226 -205629 156138 55605 37058 116052 185185 56424 254865
12286 254865 -160741 -59516 -380480 2727 137565 157408 373231 83571 160923 -65462 -215010
12275 -215010 -157921 -35610 51745 303651 193687 329770 -6980 162449 -219054 -221098 81646
12263 -98366 238728 -51508 63328 -338449 31002 140346 104689 -239336 20962 170163 -231641
12251 -135003 -191687 182255 60584 207667 -13872 -216130 58306 -135424 -203534 52270 152801
12240 152801 272917 192506 134809 -9201 178983 -153003 360872 245623 219851 192058 149661
12229 149661 62597 217948 127757 195541 36388 62329 -234556 -131166 235459 50597 149049
12218 149049 290357 112032 430412 42263 254294 351792 281217 434974 -129221 -140948
12208 -140948 -24729 -148499 290977 354380 -15840 202850 -22150 250706 152964 81019 222026
12197 222026 36530 58161 215025 -96541 -123853 277930 257465 162927 -153700 141662 166448
12186 166448 202564 -224727 112510 -5266 -182185 81058 -261238 169773 112679 -78895 177187
12174 -2992 -78632 -18776 133245 -39784 -75287 445081 150616 -37940 -215780 137775 207146
12163 207146 80598 305502 630 140031 19411 168144 168056 176306 46919 -263630 5792 10809
12151 10809 -232674 233253 -20536 -348158 -288390 179286 -99638 217977 4742 49919 -8658
12139 -2110 -14760 71493 6219 -119480 304352 339081 -292679 359174 131097 168654 250810
12128 250810 -58336 -235534 -86068 -38954 -67327 -47108 158455 282161 -161048 -213382 -124662
12117 -124662 127495 137802 -84786 -361792 112282 -226666 208833 159915 196862 246583
12107 246583 -118304 4982 -81232 382439 367776 -128518 119910 263918 -69573 -193116
12097 -193116 -159509 209116 -179363 -127234 169730 -286632 -217436 142304 -18673 -181601
12087 -181601 135302 219734 -126398 -42312 -139149 157587 -201814 93908 -221992 780 313560
12076 313560 -363507 303721 -203024 -28102 -20344 -125558 -372231 28985 -172957 -150714
12066 -150714 194579 309261 56234 184722 624169 286062 71730 1730 -145552 77364
12055 -175961 54114 266161 227686 -78511 -235472 196903 -197174 -98320 260774 91257
12044 -46015 -229444 -177770 28223 143151 -3585 -5550 306460 136492 -143451 -394409 59443
12032 -39648 100558 175136 -27985 108058 -38010 -195019 39315 66002 152666 -170077 30833
12020 -12468 -184443 50732 357273 -3872 -14527 244705 -406772 -263795 64355 -114531 -382964
12009 -382964 -17860 -79858 255584 -107457 -155425 -57999 -131816 327238 107050 -322628
11998 178904 -70924 -57128 -29005 180977 -51310 -143956 154545 309763 146080 -4888 83189
11986 178326 -76697 -254690 -220238 -72032 -253115 -40208 172926 149093 289311 -176666
11975 335586 -70129 109378 -287199 42413 -164722 -163937 4939 19923 -86484 47175 120789
11964 120789 -41696 144142 41780 -220262 -29301 48503 77349 535 -292512 -211747 12668
11952 -223673 18172 -87279 -269809 314178 -194168 -142587 -140967 219329 73358 118390 -103114
11940 82959 142730 246005 -134876 -155699 -213578 113918 58684 -135555 132634 109898 -330474
11928 169692 110678 230855 -300712 -161440 -225267 -82096 80874 130702 74975 -34626 938
11916 -198809 -29509 -215096 -128336 12468 142891 -292 178401 47961 371190 174224 -172707
11904 -173296 -93684 61275 -259956 -219440 -120492 -40155 -182179 -210167 271213 228171 -250547
11892 114157 -98132 39208 37725 -177528 112138 94463 -446418 -30267 -120057 -159796 55699
11880 45615 -79345 -434959 -37795 -153374 -40515 -154891 19395 -169473 -216421 -42331 166541
11868 22647 30604 150296 -27711 -206457 62251 244132 440062 -83159 -10473 104162 53375
11857 53375 835 -87547 -53870 44723 387284 -78919 -141863 36197 100989 231874 11297 121621
11845 121621 166852 -48003 10729 -208515 -77236 -45863 254898 -25349 96307 -58517 67437
11833 -289758 -46638 -111795 -185678 -36800 56896 142008 213346 -50033 303406 -3123 -113311
11822 -113311 -444971 30110 189385 115386 -58408 111075 -405083 -137678 -323903 382730
11811 -112554 -243649 58540 -215484 -2734 59621 233020 -51525 -212692 -245675 -141140 -9103
11799 -68141 -102501 -260703 56711 -118382 -74988 -130648 -6913 -257555 -304370 64939 15742
11787 -155530 75106 -136545 58475 81115 -14812 -174465 -205813 172468 93400 -226552 -157106
11776 -157106 -159095 45273 -187355 133989 152566 140386 -7312 -28464 195940 -130832 414926
11764 105603 280762 -99123 -353102 117774 -49755 -132520 12198 57159 -133065 -159346 -232735
11753 -232735 182664 255769 241326 36210 -27517 -104413 179971 -311028 161627 -186015
11742 -39352 -104786 -174011 -5749 -17621 -140025 -291153 -146388 81465 -76335 138322 -354361
11730 -224609 110507 -314777 -327854 -269372 266773 -77226 21809 -109956 83528 -71927 -231962
11719 -231962 -190844 -190616 64965 38668 1987 -2414 158127 139558 15529 245563 -129794 -255954
11707 -255954 366059 187281 252371 -237286 67832 -92739 115280 395756 53793 154105
11697 154105 -66810 -129644 -42470 14650 -120470 -102803 250721 96060 -16367 -198908 -42303
11685 407643 -792 12509 313739 52187 -14720 126934 -47888 185050 87800 110373 150273
11674 150273 -21006 270910 -91938 33130 282203 -65893 131022 -34332 -160102 -53539 -347597
11663 -347597 24486 -50619 -22831 -198141 -25841 163029 187178 -232692 -28753 -75016 2491
11651 -11835 -167869 112629 74182 -62278 -183390 105444 266943 -357227 297088 -27939
11640 276964 -73590 410979 -130407 36752 54277 155595 35019 -225263 406931 -16680
11629 -203157 15711 -367957 200394 -181977 -41351 -94943 56424 81222 -87587 -72813 43211
11617 -211275 -12296 -131183 -319498 -10861 88282 -233990 72733 -136078 -54044 229011
11606 -172471 -150290 167728 75378 -388093 14437 32824 74631 -170782 308321 165810
11596 165810 -12232 224510 28142 281195 190982 194489 -255340 -9914 -235533 -31776 -164830
11585 -164830 147730 114465 -11724 219571 -321780 160122 -145955 18876 -40350 -94545
11575 -94545 249511 -173091 -71009 205966 -359271 153938 38921 52739 -86736 -26452 -15250
11564 -15250 -195931 -91931 284288 1846 190542 290338 142981 76252 154375 45445 -124422
11552 82111 55486 -8312 182559 -111209 -10830 99163 -5218 -28616 -146568 56704 89128
11541 89128 -362262 5879 -71047 227175 185945 -20733 -31490 85599 239186 120158 -97118
11529 -80918 -64046 -211333 -53863 353372 104179 -135374 128737 -139786 -143605 70049 -170367
11517 -93790 114283 -87810 488910 -46884 27110 -180111 -143663 190561 188351 -6396 -129666
11506 -129666 -117141 379227 208207 -209706 221888 376799 55042 167608 226343 78646
11495 -107858 160082 55262 8170 88342 201532 93107 38193 246011 67959 163542 -15133
11483 246640 130827 76032 -7311 30084 52213 172551 -245686 -40145 158897 352352 69129
11471 -141033 156776 -107925 -49814 58300 227624 136263 239790 852 -1466 108676 143070
11460 143070 -222623 15841 331411 259939 19687 142914 238851 -57584 220066 350342
11450 350342 8034 -363071 -88158 -486190 103315 221679 173169 12266 42185 -178993 231500
11438 -159774 -213289 -32977 -300570 40086 214866 159223 -36108 160711 -140238 -88366 -88621
11427 -88621 -48128 248825 347107 -112860 -6045 481800 -372418 -119471 -132058 113565 181535
11416 181535 -141756 -83293 126327 -22450 -34073 285131 281733 186785 -176186 175884 229413
11405 229413 2093 -103903 201131 23445 -208327 7396 -51844 -15944 130058 -342991 -135294
11393 233453 96468 90874 -82712 40703 -16026 -240491 25880 120492 115444 -265876 -32740
11381 -292745 -160520 -134727 -121593 -95106 -14468 -285488 143532 -84175 328110 216495
11371 216495 12221 90286 -54261 -69799 -46205 -185509 165585 18885 31669 255354 -887
11359 95696 172678 171527 -127681 225310 39111 69848 -143298 -19561 -189728 -47378 91093
11347 -251948 -183931 -142120 -114517 -53142 -86585 -194171 -83152 -155219 129200 -15225 -114310
11336 -114310 138853 -140188 154206 140539 5584 -6084 110476 -156940 175914 -192269
11325 367290 52644 -211325 -119686 -286960 1564 -179182 -241409 8891 200988 250462 -113069
11313 -52405 402445 -103523 -111172 -530177 -187365 39963 -103022 86777 -306595 -97222 -162540
11302 -162540 229818 23939 -103847 29391 256123 -165224 -305634 -26736 3682 242020
11292 242020 -209586 -134298 -260212 118476 159560 -94629 295625 -159882 -331731 -178563
11282 -178563 -16897 -70253 111808 29148 196757 -138598 -135614 -311191 -73219 140481 98803
11271 98803 123844 170939 165813 -49797 133401 -46753 -144133 -229404 -126038 -107529 -79278
11260 -79278 978 310173 -19507 -41493 -112789 187751 -19506 -257959 15465 142747 -209770
11248 -48850 -30286 73854 -139340 -332813 90 -114762 182251 -79432 -6092 -15169 -112726 -103767
11236 -103767 50913 31037 -135299 97476 29735 -219790 -31427 44271 166731 -205501 -480135
11225 -480135 -246314 -35582 -88516 -134528 -88923 159280 -164871 145534 -36215 115846
11214 -252246 62724 -382067 -179594 -120734 85764 223617 -37176 -377568 -283325 -285225 -337172
11203 -337172 108283 57629 152365 267308 179018 59522 7837 -252504 183460 -358376 -133170
11191 97606 -89755 -157840 -432059 50641 102963 114913 -197250 24490 71025 291078 -264742
11179 -147592 58279 17409 -95837 -25739 204939 7169 -98576 -76768 -236944 230149 -309871
11167 341889 54494 143135 15125 -126520 -304431 -289821 425699 -233047 -180170 12150 -79890
11155 185445 -83068 -92683 101033 -98639 -2045 -198845 -110884 225783 -181308 69013 -242550
11143 -297596 -316092 177224 -37490 -78794 -230623 84461 31292 1295 -256608 108642 -9532
11131 -262136 164197 -195412 -98383 324805 64620 -108786 329067 -124041 142282 1414
11120 -36430 257680 -213900 -14762 -34895 123816 86640 103131 -158607 -120046 328312 81637
11108 -157366 113796 -46335 -102598 83067 69380 184205 69107 166605 57478 23116 -86046
11096 167508 -120396 38311 -36563 250794 -6216 -23634 42616 45648 412149 -65093 85465
11084 316752 -16366 -66134 446800 18261 -59094 37224 265601 216515 217888 104523 -177314
11072 88158 39381 161721 46307 325215 129448 508188 17167 210478 308566 -98743 175006
11060 186223 165530 359093 259579 338499 345823 315057 292249 115552 387778 516853 581839
11049 581839 363541 178100 559915 161595 378676 251288 273069 302347 411021 474928
11039 474928 288536 755538 269346 506952 520618 472777 329792 277738 414796 322164
11029 322164 307654 159001 483441 350894 44231 399171 214773 284079 271024 434415
11019 434415 187121 193385 211667 509477 342890 273393 298332 615910 355601 170683
11008 457148 425020 412707 460859 627355 188261 591859 325966 303910 136854 -81683
10997 468233 248974 329450 429401 90792 327848 478395 533428 486263 466985 290726 324452
10986 324452 296725 563972 488896 147474 379834 30141 300464 472138 510162 424571
10976 424571 514629 435411 653083 739634 658682 1021534 667038 1267847 1049545 1077291
10966 1077291 1355475 1384013 1628140 1682879 1324277 1140369 1111913 1029861 1016475 970088
10956 970088 957276 1102080 575111 773497 918904 1324590 1150984 732292 750536 1059486
10946 1059486 773069 855713 301195 397595 -4080 329109 -70986 234579 100715 142170
10936 142170 109410 192494 54465 397389 104456 -36076 -7974 123072 -52238 -172628 20617
10924 81736 -65854 -76381 181911 80356 42907 -71634 -142202 353466 -101434 -237831 -298188
10913 -298188 -182806 162484 100018 201530 -216229 -300050 -47666 -55465 42878 -232190 -122497
10902 -122497 -170839 -152470 -259529 -251641 -14041 38364 -131689 130050 85835 148097 -204241
10890 76651 280496 -217467 -8268 -206874 112975 -63605 254966 -251072 333212 153811
10879 366111 88912 -69810 364628 -71014 -58133 43352 91426 -125876 -145810 -123922 150926
10867 -369545 -225342 -74380 -260946 270283 -188134 -33774 120152 -224783 189052 160414
10857 160414 424944 65115 269426 70088 -172036 170743 3649 265085 -52044 73521 -208910
10845 223011 -78346 -461492 220167 -322534 -122874 -66012 45694 102952 1908 -181827 74878
10833 -42920 175292 -58196 -308608 354456 -314988 -167872 145719 147277 102838 -92819 115344
10821 -95392 -114202 -187996 -1331 -412908 54001 118977 -30021 -78364 -177987 109037 -138592
10809 -131291 225994 247965 -128002 -147285 -161844 -330300 -209975 250433 -333441 232966
10798 -42689 -204768 141601 56172 55597 -11980 76057 -131385 -367524 -155161 -69275 149542
10786 -133106 -169815 -34039 -4793 -252065 -69446 -176806 177542 -131459 -106608 249398 326749
10775 326749 -156337 -200364 -78709 206177 -51389 2602 394676 171329 -102757 -53115 -139709
10764 -139709 -176806 -62646 39476 13036 -101885 -107688 -427029 90941 4651 -354033 -71464
10752 -178686 60301 6605 76809 191712 -148827 82637 -120312 -42065 96082 42473 194296
10741 194296 102983 -394623 -179753 140287 -13509 -30371 -104190 -100409 -180760 4784 -176727
10729 34423 64818 -183274 145041 56374 -177528 208172 -138621 -268016 -417611 -15439
10718 -197815 142704 -58292 222331 272668 -94072 110981 -112279 -40842 12485 -12992 -121020
10707 -121020 -64107 138470 22032 -108701 82353 -33306 -127626 -191059 -89236 -185602 -39324
10695 -242838 -281827 -285513 -61360 -292369 -22849 -114032 -61450 -262074 147325 -129425 306503
10683 54296 -67348 -54012 -180772 115392 95461 201414 16853 -72875 124943 -124476 -281660
10672 -281660 -90186 -549 31790 -328041 124993 112631 4800 -331658 173458 -335656 153946
10660 -124852 213150 -160620 -92692 -130712 19671 186704 -153669 113908 -22615 -13935 -376915
10649 -376915 -252641 -112980 234504 -224319 -225666 107373 -47361 -22084 -179352 -186410 -119923
10638 -119923 36768 -108385 -47511 200970 -160330 -2389 -59883 -275266 -44729 -70066 -42215
10627 -42215 -525874 92291 -36648 -12039 203021 152641 -252572 164465 -141637 -215606 44437
10615 -101041 -172407 102276 -77483 -3734 -379074 250069 227659 -40229 -72555 17146 -85176
10603 -274875 -210329 -101086 53283 -54440 -162883 -56897 95365 -215962 199848 -472788
10592 57458 66433 122470 -93898 -166552 11958 -297181 131265 6855 -113131 -185982 -152703
10581 -152703 317320 -189985 159791 36757 -20550 -40527 -88438 17281 120293 212632 -362122
10569 46253 119658 102846 -188707 -294584 -174953 -283879 -435409 -15785 190427 -16465
10558 -28816 15570 -60241 203391 -117964 -18052 269192 129065 -209002 169305 -339521
10547 106906 5732 170985 -216420 -51448 20837 115926 97319 -240542 -114011 -27214 81782
10535 364 -115028 -35335 104341 77976 6396 -131457 -15146 158770 74443 -30525 83852
10523 -106162 -41397 -64724 221136 -88018 -121310 102294 -240045 -45772 31684 -81908 116974
10511 -163780 -133190 -239378 -165467 181594 -128860 -148257 226535 255357 -27153 -38702 22673
10499 -46160 -68838 115259 -310371 -234261 -211465 -217001 -191602 -45515 198784 -74041 -250095
10488 -250095 50903 -124501 106328 -176746 -32974 335665 105456 -219365 -267120 311587
10477 -211227 -180342 140449 156880 487118 272860 237544 81140 144193 -67858 170793 -106339
10465 -123155 101501 -180935 89684 224937 50184 -168030 -25749 19939 159079 -82275
10454 -163692 -434556 -572613 28180 46367 -89193 54815 -19416 -104242 -64009 130623 29450
10442 -108606 -374836 -71630 77813 -35866 332854 180310 156509 -373303 264424 11558
10431 -24970 78926 -126360 144416 -152297 -54198 288964 -64710 -98730 127387 -73451 -232670
10420 -232670 -133257 69956 -259343 -25108 468624 -94617 -238106 89374 114412 -223590 134696
10408 -121662 -69269 -66020 -177331 153804 -37447 -94527 -18301 150979 289409 -237395 75048
10396 -123563 -12663 19165 -120011 -201968 133052 131767 -174422 -96013 -137509 -1635 191767
10384 -28491 47457 -376590 149719 32571 89687 150242 -63450 -90938 26588 -117501 214895
10372 30175 118525 250738 -143864 -64506 -89235 -50891 -42179 257767 216452 392680 -141971
10360 503048 214747 24968 287580 196661 108712 131498 -111499 16669 -40024 463709 -136454
10348 -67056 627934 -161798 227644 479490 98759 -126563 -301101 356832 160523 28499
10337 182795 306737 -83761 -299 -166989 167455 -12051 427933 55583 212826 84618 169158
10326 169158 89689 200697 -156810 109501 -69050 199539 -94897 149385 -38516 1877 -7335
10314 24524 -153292 333018 -55711 16006 -55254 -235636 -173844 -319569 -47752 -134965 958
10302 -161244 432698 180423 -204479 229973 77120 3103 2199 210044 205109 -182008 134763
10290 131339 95555 203417 -44785 -41263 -184820 -109790 76741 -424961 169806 -220371 27616
10278 -201850 -152911 255256 -196785 -66331 -108234 -105577 -82575 30025 50177 23609 281703
10267 281703 -109216 -124059 109127 -184630 129141 -28104 -187957 30437 12945 -39277
10256 -188088 56061 -45589 -280108 228209 135045 174378 39226 -109765 56129 153813 207046
10245 207046 206378 -80242 136850 -114259 60622 190332 -124514 200398 -136833 -102483 -73893
10234 -73893 21680 -80774 -9863 -25866 -375927 -50513 20181 -92180 184370 -104146 193017
10222 -182286 -276200 -168329 88158 -103415 -12219 -25040 -94565 27768 67191 -206365 -346690
10211 -346690 20116 -182744 47975 -19893 -2682 126192 -118501 122937 -238645 69470 8460
10199 -12653 151559 56161 126921 -125540 99811 27926 -170862 123364 134963 61495 302053
10188 302053 -443607 -158331 35165 61194 836 136476 -290213 71266 261937 7243 -185366
10176 100867 -186445 -37859 -6108 3695 -95337 -74003 448231 38857 148120 -5554 -33824
10165 -33824 137933 -160619 -76752 94200 168341 111822 165591 -119543 22749 121000 266449
10154 266449 -73365 -208512 -408970 -11526 -382904 -119809 -232954 -132865 -21611 -68962
10144 -68962 -185670 114956 -159652 -280729 -571887 -337359 110126 -241947 -160665 85401
10133 -350047 -7662 -44046 -372468 29733 -446057 146039 -30532 -68295 -152653 116922 9763
10121 256963 17496 152084 -181857 107486 -206365 91838 289545 -15506 179622 91695
10111 91695 -663 -461142 -87342 -91594 13141 -19267 -153548 -82236 -99335 -34259 178161 -23555
10098 200475 182491 -243593 93564 247712 153933 -213470 180062 50003 47605 -329074 44108
10086 -76944 -191198 -83720 -58065 53865 32989 94912 -268210 -62608 68230 134662 -14185
10074 -54816 136325 -121454 -199388 39467 -285081 25065 82347 -201190 41893 318707 -93366
10062 200682 44807 143670 -34956 203423 -15828 -22303 130761 -52728 -200381 -147438 262810
10050 322786 -73013 -290674 -212901 -43789 60615 -50766 95364 -297742 231558 -345893 18377
10038 -558981 -281782 -3988 2416 -31471 -275265 23776 146676 -31007 45911 278569 -204164
10026 30881 -137665 -172136 -79262 -102285 40556 323020 -240426 -135086 65644 -7073 -233794
10015 -233794 -127911 44632 -35340 74405 -254711 -166357 -176498 -300683 -100879 -7656 -55187
10004 -55187 -259616 201583 89864 -59405 24985 -128380 146798 -212376 88308 -102044
9993 -175101 -29791 -215242 -132987 -152345 -171312 -68660 -153406 72583 517377 -158569 -116606
9982 -116606 -32878 -26688 -26005 -234300 -116290 279430 -92220 -326112 -48582 -191669 -12080
9970 -100666 -102569 112595 -305511 92502 -490252 -166815 -96411 -242121 48480 -321573 -88744
9958 -59461 -97368 259038 -76144 154106 -28577 -200538 -5773 -23522 -404532 -328691 -147955
9946 111489 -65434 -35894 -263338 -166290 -26643 -176436 -315310 65530 -87602 -241244 -339080
9935 -339080 -152471 -75502 -90604 124637 -157121 93065 -188541 -305336 70567 -270783
9924 37082 186415 -34055 7429 40495 71458 -415723 -115077 -208110 -286120 87693 199036
9913 199036 170768 -36981 -148500 -184542 -65290 -59350 -138540 -538974 -17205 -37429 253222
9901 -54247 -232850 -51572 -126372 -139682 -382477 38625 -70999 -73747 -241099 -482954 -154949
9889 10536 -114438 -34495 -249749 117101 -268800 -234738 -440528 -182511 -67635 -438884
9879 -438884 271226 -112495 -232737 45198 -421555 -282074 -82931 -367345 -255448 -306206
9869 -306206 -49724 147763 -33544 62873 -30094 -16894 -16219 107868 59027 242999 -180616
9857 17772 384142 -16322 -9161 -199173 -232848 -306842 146518 40085 -141323 -55347 129569
9845 -120313 -68620 -20990 63473 -224849 -40761 68157 113384 252533 20771 199850 139172
9834 139172 51760 -3973 -61370 232996 -96214 31327 103478 -86973 -2023 -264938 -98787 299713
9821 395801 -155164 18228 -105594 -235875 -218224 -65016 208877 237894 -57778 -70299 113703
9809 -17467 271209 25220 -413031 -59884 -223924 342795 234086 234307 -187979 -77095 12207
9797 -28999 -165969 -325600 150104 -40510 268535 -109891 -53844 -32811 291160 -1262 -77278
9786 -77278 -61752 261623 297408 -38731 -176073 77465 -90240 -14592 -141302 -112360 -362704
9775 -362704 -96509 -26530 -321354 -364873 -287861 128789 -21496 78115 15714 -128133 -8511
9763 169344 25236 -185058 -146975 -84300 168969 95284 -35566 68210 -329042 123604 -3779
9751 110318 50745 -144003 -77315 108340 39578 -21311 -115559 -106905 -276738 -71844 12096
9739 -79570 -160254 -49493 32071 -176129 -222733 -100179 -111278 -238293 -117921 6637 32528
9728 32528 -125140 -236158 83568 -158508 -33868 -355934 53507 -127628 -27263 86745 -105642
9716 -164193 -83953 -238234 -193273 -230875 96489 22012 6358 126732 -181452 -383289 -273730
9705 -273730 -132890 248682 -28340 195840 -161559 -159190 -111821 28451 167180 -401875 18982
9693 -115580 -121090 -176342 267379 -243188 -1706 -46824 -283283 92304 -42501 42597 -61372
9681 -51314 -14230 -275255 -102924 223888 -251914 250878 -220918 -118233 -98641 164600
9670 250419 139316 -3189 199789 -268554 -52574 160250 -292807 -297947 120083 -71861 -402161
9659 -402161 81150 -81739 -129876 -69287 -49456 -25724 -141207 -141985 -61112 -246731 91341 -71359
9646 -254833 -30848 -45630 170584 -289674 187272 65952 -119092 -156376 188337 -47228 107443
9634 23930 -44549 -53938 -380926 -30341 -36007 -115217 -26266 43646 -2104 -733 -158623 85795
9621 -203452 22650 -188947 179831 67589 54174 -182757 -251777 176806 286218 30615 -25554
9609 -213406 -167359 92027 -128005 -12659 100983 -195007 -15263 -271006 153139 -119628
9598 -233785 307387 -218565 -94963 -121881 -262935 -232789 -104717 -124088 188602 -383413
9587 13746 41014 -168589 -94916 237554 -207240 -154693 -180452 -136400 12366 263578 -59136
9575 71211 45273 26458 -96086 -122259 -116501 38141 164191 100968 247465 85746 -193802
9563 -102299 137916 91820 29304 -351477 -281309 -252409 -13683 -141927 -64003 37340 -100604
9551 60952 -11204 -91142 -196111 -180883 -131254 -65008 108506 -70685 -416952 -135435 13337
9539 22448 -174721 281366 -97026 -44141 76079 -263626 35139 -275392 -423310 -168961 -82703
9527 49500 -182919 341193 -57047 -134334 -106543 -276244 -394763 153866 -174950 -55157 -21891
9515 23959 -40248 -47021 -59554 -201604 -113903 68741 -223765 94577 -174596 240394 -30046
9503 -535866 -147588 -217819 -123298 -275899 -259492 -321670 -257725 -147778 -73295 -143935 22219
9491 -247545 74148 -325060 137487 228420 -375350 -127601 -196817 6115 -209445 161930 107089
9480 107089 -260651 135972 40470 -275189 120747 -1618 -517019 89878 -103205 -227529
9470 -227529 12514 128588 -67811 -126045 176959 91210 232782 -14003 164422 -146561 -36223
9458 117269 -302260 -57252 -104487 -17972 -108568 -213981 34857 -44496 100910 -101841 281468
9446 75569 -385356 -185124 157152 -124849 55459 -51217 -290202 -70084 -238610 -258018 167459
9434 171163 110764 19966 -268959 92511 56168 -56186 -122746 88352 -209925 -95174 -101153
9423 -101153 -38065 24596 -183512 -177652 -97488 -43039 -365982 10983 90627 253266 -150239
9411 30685 -83459 -169148 -146334 167198 176999 -46414 -125261 -95029 -29957 -9482 -198439 100508
9398 -219250 -288019 19285 -82809 -44169 179705 -138775 -224638 151293 -248364 216645 -31647
9386 26443 -173284 -108107 -238440 -120447 -112325 -96123 -171979 113685 -68562 -327333 215792
9374 -2346 -60654 -470508 101697 13715 338410 -38196 532834 -132083 23827 -17898 245028
9362 -177474 -34708 157337 274077 -19217 -268115 46745 -150332 -104515 -253007 -179659 -36717
9350 187726 9692 -16894 -144983 163017 86502 -178016 -140223 -4513 55551 59829 -182267
9338 -85197 -176827 -404386 119694 -118801 -2530 -64172 -359247 110458 -82349 -4324 -76434
9327 -76434 107933 -278256 -126902 185615 -80838 -134637 -124340 190865 -93303 -187002 -21065
9315 -176874 137506 149859 122855 398253 -225192 -77135 -122324 -276279 -254497 -246125 -249382
9304 -249382 55422 -153675 240607 -245145 -178438 -73766 88848 -140886 -264373 -64155 68466
9292 277549 126150 -60664 -71957 -150415 134154 20353 -54376 -86995 -228825 -216497 67672
9280 15035 125513 123535 -222382 -385745 -49538 -77235 115106 -151264 114401 -51485 -152469
9269 -152469 -3450 503201 -114903 -158280 -61819 171251 -341158 77982 -28821 -258508 -94532
9257 165307 -92099 -202297 -455 -233809 79830 -10989 2324 -300524 79363 -197494 -114758
9246 -114758 -292451 64150 -424306 -127109 126510 -39591 191112 -332654 260247 13347
9235 95802 -80690 -45215 124730 51929 -103208 11223 -235293 -444572 -123058 -144120 -86460
9224 -86460 308549 -326046 -96583 -59412 -124570 -31097 7138 -224858 -95323 -45839 257963
9212 -155071 -104813 -203672 368342 -230418 -134253 -397531 187942 -182267 -178777 -82924 282357
9200 -195259 103275 -341126 -115084 -35599 -7718 -49445 -54993 -242163 -210962 -281717 -91722
9188 -262602 -109671 56906 82091 -134309 -205816 -152767 -41612 13036 -115982 -177417 -374862
9177 -374862 -488133 -147854 -12221 -74760 33813 -175739 14543 179181 -183145 -191616 44442
9165 264299 -33720 255370 10701 112507 47725 -76240 -15021 167765 -154787 -485558 72319
9153 25774 308986 -75198 -144603 -97253 92600 -59000 93945 -26244 -7689 73703 41007 -81903
9140 52414 103960 -195957 101564 149581 233589 -43576 -230569 -16477 28717 166010 93833
9129 93833 -182682 79469 -94399 -77297 215830 330689 50323 279063 -241911 -103755 -39318
9117 -19686 -179743 -3791 192826 -147176 86330 -2157 -134415 -76876 149695 -163374 10169
9105 113217 54883 -198557 -186715 -24478 122072 -373526 -238612 -85923 -81828 63842 -57779
9093 -112941 -89417 -106921 -169864 144722 -10670 -1189 -98428 -344222 -175456 8026 -48331
9081 192348 63651 -175435 100788 -334380 -158916 -6027 -172885 89600 307449 -133223
9070 -114364 -64271 -320195 -257351 121679 200705 -44965 -40854 16043 28522 357819 45529
9058 -220878 301687 -129497 -87219 102232 -72865 87644 -168620 -97356 107997 -163769
9047 62049 -218956 84869 -3361 -81826 26189 -224873 -152610 -43318 -182162 -28109 -32290 -233620
9035 -233620 42639 -39776 -188391 -114305 6815 -126301 149466 32958 -69554 410450 16995
9023 157081 82573 -267144 177109 300373 345619 -61003 -189510 137876 103905 -18698 -73071
9012 -73071 -59835 28377 -150902 35635 -18781 -79298 -220017 -312188 -325180 186496 -166383
9000 -174016 -415187 -72271 110969 -203472 -73076 -25659 437247 -176908 -159945 197359
8989 -91856 14285 135126 64581 6562 -183039 -224081 -264589 119720 -73333 -56869 22115
8977 -94094 -155422 -94967 -218348 64582 -370666 108589 -195788 -211721 161193 -65335 -282379
8966 -282379 245906 -124999 26672 -2533 190665 -82990 -225315 -226644 60013 -21232 -18016
8955 -18016 -29558 -181383 -75778 -48245 3853 35498 -137009 -27433 -27500 -162047 39065 258413
8943 258413 217018 26274 38941 135140 77994 -227982 168155 -36331 -11752 130778 -228965
8931 -182944 -115248 -249535 141038 -153345 -220397 -79670 13658 -14650 -124449 71462 77017
8920 77017 373392 40718 533767 435952 146712 -121667 -207219 -64111 235784 -52108 95850
8908 70468 97979 -85201 -7584 -47935 137317 51711 282536 120388 200214 -120939 146766
8896 90914 -192508 -123537 66523 309925 -61165 -145071 -194802 -22637 -258648 -125771 -166067
8885 -166067 -180553 5792 -132105 -360910 52255 -23316 -31065 -476532 -30703 184162 -120648
8873 -171071 18522 -423621 -125490 82029 33894 -6727 -85928 17795 160540 -88815 3490
8861 -127926 262049 -351773 -9960 54473 -132514 -36590 74288 105889 -231891 132612 -256833
8849 106804 62857 -129057 -420716 83942 -230094 314005 -463524 -75401 97515 208917
8839 208917 70838 -94573 -178950 -29716 145370 -98883 -11632 32468 118200 -119487 -314371
8828 -314371 -17753 257350 -154208 137274 -8336 -309154 38104 -47447 76174 237749 55442
8816 -263139 -107360 -228014 -121866 148977 -32545 263428 -76119 -287987 164262 -78621
8805 175487 83114 258790 82642 171072 48557 24766 -282571 -362831 -162225 -105182 -321246
8794 -321246 -206589 -194546 -12284 152262 65879 104177 238228 -84406 -118713 -85528 39670
8782 -97149 273296 -270970 79427 100137 -154605 78052 385670 -105304 -316259 -277412 -70759
8770 -152767 117621 98705 66267 -51054 166464 -282544 51039 -220869 36658 -149724 79054
8758 -235172 -23072 -242545 62304 -510141 -217555 260090 129066 -181570 -52341 -38503
8748 -38503 -156977 -191326 231972 24063 -203064 318467 43471 10674 196510 -149936 -257416
8737 -257416 49720 -47443 325676 -89584 -62227 239464 -252745 -63032 -4561 -175501 -75570
8725 262952 151059 130954 -12764 -100818 -52409 -198247 27172 -112708 25800 -339342 -184640
8714 -184640 -212286 -303513 -127569 57842 14973 -28681 -183080 239217 125870 -170127 -233968
8703 -233968 215449 41846 148770 -70968 47550 -135073 -196159 -261840 -58036 50853 79151
8692 79151 71581 -356688 -48134 -294515 -180741 -116439 -218572 -54207 -166417 153444 -287011
8680 -53708 44850 -1667 -21578 12396 -327007 61902 -9089 27350 -154587 -183985 -417204 -89175
8667 -59995 -291289 49473 139587 -69053 -3620 197756 -43230 -230810 -13234 204991 64281
8655 -26530 325049 26710 -161199 -28563 29237 -187558 -92538 107218 -15671 18759 10458
8644 10458 125769 -234170 290999 13678 -77436 -98088 198 117636 -146493 53272 96466
8633 96466 229670 215165 -213529 -20284 252649 25494 -212476 -222523 -353939 -241656 -94884
8621 -82395 -4068 -196036 -526397 -296050 -100296 -183212 22807 -199710 -156071 -106292 -42147
8609 29058 -300743 -255348 -256687 41829 -63333 -81433 80342 -8334 -64834 -74633 -31362 159256
8596 271697 227740 -75706 -279579 20042 -27465 -283714 -250710 -113468 186118 46319 -58919
8584 -220451 131127 -12606 -61642 -300877 -67711 -402406 -173607 -260186 -242911 -286917 -102365
8572 -148007 190843 90247 82388 -140692 282222 -80559 -65265 90476 7138 103900 162031
8561 162031 -133241 117079 21115 -256289 -74688 -95249 -195798 -151247 33051 107277 -40687
8549 -57405 -85676 -165208 138884 61211 -115044 -372650 -77627 -124035 -131029 -318101 57704
8537 -2127 -82755 -13608 59731 -39507 49995 96025 28972 -382938 -174611 68532 -56763 100790
8524 -230174 231224 -29136 -221037 146683 56652 -378 -103250 62049 -152085 -175202 -104802
8513 -104802 98847 165613 -60540 76812 57599 47612 -361086 162802 -25883 -92111 100456
8501 248955 38038 -41062 149438 -35890 191797 -156939 -179591 306437 137836 335556
8491 335556 84389 -454766 383541 -262763 -272609 -7262 103690 -343026 -104366 213767 -219587
8479 -82041 -96738 101511 -100494 -241809 -209431 -25237 -485805 -101376 -4482 -123884 435763
8467 155460 148204 -21866 110914 -408055 303665 325600 -257865 -143876 -240067 -158752 -12614
8455 -17814 -192366 119651 43853 -37708 -33625 -75455 229238 299096 -293809 -411251 -346133
8444 -346133 -313871 18310 143982 -296254 150917 159448 -115459 -150264 -93650 141633 -154590
8432 -211403 -96575 -381958 70704 -247462 119637 111912 -241294 217987 -26485 292146 116968
8420 -106658 145939 -170144 -99698 -49753 -79041 -159784 -66209 -236877 -126145 47640 59565
8409 59565 350756 47863 270351 356822 -90996 81454 -18275 -374249 -210733 -101250 -181434
8398 -181434 6031 -127898 -78005 -286412 20609 -39263 -326171 -65985 53044 -8554 -208627
8387 -208627 266045 -201514 -85273 110826 -193807 5423 -435140 -24234 126172 -211396
8376 200388 -279457 -103296 -111014 43714 105925 9688 -111743 -250220 355047 76262 24001
8364 -74967 -212660 -266452 -43916 219854 63220 -50789 -6867 -410566 -96676 -132455 -9765 -186457
8352 -186457 -94337 -471252 -98224 -206138 16008 132651 -148873 -143893 -92604 -53418 -59574
8341 -59574 -324736 -28464 -157064 256738 -212407 -66136 -237194 146962 40449 -142231
8330 104119 -62677 36848 245748 -400518 -93908 79956 -136169 1915 -295243 -144979 4443
8318 -282785 -265763 184908 33841 -253490 -431490 -79868 452586 102623 260051 -184608
8307 -183807 170866 43430 218665 80026 -207302 -150417 6733 -130711 -62763 54449 -239641
8295 -106326 -224364 -6628 -262751 -110599 -413398 262558 -332435 242974 168930 72310
8284 59180 -219960 -32458 21750 88978 -56117 -42768 -159485 193592 17331 124446 -465855
8272 -25061 13055 -57582 180275 15096 -148876 -70590 148364 -370145 -195268 170858 181529
8261 181529 -7830 -7231 -118909 56118 159970 -168516 32334 -252116 131355 13740 26424
8250 26424 -220652 -101787 -275176 -361793 -229960 115934 -116240 -267630 -309715 79660
8239 172075 98975 198629 -173860 55873 -95674 67104 262954 -69725 -166651 73358 -4196
8227 69685 -182775 -216628 -130615 24214 37498 -76409 68975 -25412 20190 43783 -168453
8215 -501746 -3089 90251 -75691 -133738 267067 93393 -164672 48817 -233643 -160884 29991
8203 46248 -244085 147406 -78235 -55065 -125648 183877 207949 100944 -141050 -166954 -262999
8192 -262999 -43893 -191340 59858 -141663 75567 518 -120063 106796 134592 216645 -169729
8180 40818 78689 -100760 -156618 -55086 -5312 -103 62577 172510 -248535 444241 -158744
8168 -41534 -323505 113592 -24865 -44814 114972 262555 117468 59241 -15809 -128173 -187547
8157 -187547 169497 -95735 6061 -112640 5321 -278034 -18812 -169825 -409534 182636 -96068
8145 -44561 -24549 263039 17467 -449374 -123990 -102486 -174102 51149 -183333 -249370 -14011
8133 -54989 213694 -149744 -8020 -95717 -111543 46692 13126 109436 -64741 61832 -220312
8121 153883 -275864 32331 -267381 66377 -89193 25737 -152047 -148477 -389738 103659 -155348
8109 1594 -182936 6469 -79052 -87378 -75778 116427 88129 221081 -121533 -87155 156408
8097 154289 276860 123962 -135351 -128585 201679 -155233 -186692 28275 -150958 -96659 144992
8085 577917 -82497 -51743 -340259 -109540 -13742 -164866 -127832 -5329 204046 122129 36505
8073 -202060 40448 -193278 177428 -24016 -32496 -165181 -163816 -17208 -105034 73209 27934
8061 307594 190207 105591 -127200 -202149 174395 75915 225124 -158136 -68858 -86150 70645
8049 153554 409976 45694 -233343 38441 -264974 -78106 -46083 -111928 -167160 198881 -152553
8037 -180698 -158492 -145481 -94195 197287 -41362 107444 170127 130107 55581 -133782 -93346
8026 -93346 -155370 215632 -122610 -78166 -221434 -113894 184652 32626 -19750 -215676 -222360
8015 -222360 -135304 -70029 -278305 -88615 -235854 227941 -333806 103127 -39508 -13389 195074
8003 -200307 -15864 -144383 19585 -146081 181551 -120288 79432 -122910 -362785 -33173
7992 -226155 96231 -24388 271557 -189620 91521 -152326 113896 -92723 70534 262270 137696
7981 137696 -392235 11541 -114763 367853 -55057 -208930 3563 -53757 -44864 -290784 -316802
7970 -316802 45819 -60364 -207037 239412 29366 41637 -245685 -116266 -78096 -163736 82604
7958 611783 66287 146474 273297 -107396 -272278 -155047 131774 -25180 -48392 113223
7947 -10219 -127993 -73487 -322624 -52339 -175598 35978 4384 -50243 12707 194506 -13711
7935 71752 -24292 14976 88476 -288418 239702 261 -208426 27014 247562 16584 16014 -183887
7922 23649 -117128 -52980 -368484 -80267 100255 -158460 39728 159263 -162637 -393641
7912 -393641 -88994 -101077 93273 105818 261763 -358417 144980 124955 -278643 -93979 -208919
7901 -208919 148026 32772 -317984 -242077 -55789 206210 203471 -72294 -320744 58155 -32859
7889 -291416 60611 152883 -17367 140392 177148 -361301 -61654 -55636 19483 84757 -212369
7877 -125005 128057 -8389 -184239 -117454 69613 14096 97016 -16056 247431 91278 -46163
7865 -77818 -124358 98628 114655 -47019 42605 -19856 -98259 -340672 -282494 140965 91528
7854 91528 523406 320268 -144138 87534 223722 -420576 198687 -13814 -93571 -173978 -146048
7843 -146048 -36608 317401 14635 382512 309806 -197914 37638 234674 -170026 123702
7832 -13160 2217 -368093 -98682 119445 94239 112270 -43739 117620 197514 61844 148328
7821 148328 4747 54244 137041 -157986 -552042 -127541 69484 -245227 69126 -246014 -58833
7809 88135 264036 -236052 44037 -97871 -117292 -68087 37437 -286673 284375 40588 -9469
7797 -261852 -202111 -165208 -64455 -303925 -437494 -24223 -75805 -67739 -164587 299667 -34885
7785 136772 24939 43428 -30656 48880 -33937 -107001 -270437 -4765 -94386 -46560 -162930
7774 -162930 -126501 132602 58616 228870 250372 214955 -123851 80095 101321 -266941 99402
7762 38140 -34018 -209046 -158669 -133937 90814 -293530 -303630 -25330 -204653 -131039 -274835
7751 -274835 -272672 -18063 313654 -196491 73934 -118643 -87566 345201 18316 -31149 -48717
7740 -48717 308274 94786 -481452 -221465 319336 -23246 230952 212078 -41039 8794 -84 -10666
7728 -10666 -79942 -115728 -117571 26736 161090 16061 50242 123003 -36676 -383629 -37124 -173455
7716 -173455 -146013 11658 26321 -240509 -294355 117138 -25556 -12212 -65853 69796 317462
7705 317462 -149842 396973 95 -189234 18819 -174395 31463 223532 -146051 37934 94659
7694 94659 163274 268145 -173001 18496 -199315 168946 92330 -189353 -252504 279541 40348
7682 -235679 124025 69511 -123192 -104367 29030 -247547 -250304 -12674 -165288 -32544 201200
7670 127158 46178 300215 -95347 -15510 138494 104873 -227279 211042 18603 4070 -119101
7658 -116533 -110012 -86640 313519 46843 151899 -71230 -311626 -74247 50706 7977 -207772
7646 -71665 42823 -182898 -291324 -52692 -37457 -250674 146404 1011 61033 -375351 -123732
7634 124170 -12623 51897 -171675 39132 -217970 65387 -172784 -409891 -184569 124801
7623 -79326 173281 278441 -130517 41378 -253133 158706 201595 -137124 -81373 -59979 -486465
7612 -486465 -68980 44374 -48400 -74618 -159377 348108 -166812 -144737 -163412 -171438 188402
7600 -5875 -147431 -63365 26414 -306411 -82098 63634 -118594 -171174 -38666 226817 -53073
7588 19252 -71056 -61740 -224569 15011 -261361 90376 -253100 147611 147854 156623 129253 -93754
7575 -36483 143271 -191933 -305675 -118210 -167319 -54053 129965 -74148 -10310 90881 74863
7564 74863 -174308 114901 -175898 -318703 -23798 -111728 -74638 250476 -80770 -55108 128530
7552 -717 79611 258953 -84662 407764 -52003 21573 -130441 67554 -25953 -137353 169592
7540 -153089 -228515 73414 -53486 -40284 -83897 371132 -67886 163342 303170 -254486 -19312
7528 96810 -401337 -95284 -152330 -34942 -144075 161749 -148772 30052 -113352 -78527 -41287
7517 -41287 37836 152571 45236 -33289 347709 -33241 259839 108743 -33104 -153018 61757
7505 -65756 79175 -19603 -162959 67651 -214852 83636 10563 193650 -228756 311980 -134234
7493 112427 -179520 205255 -303484 -1819 147536 -62891 1090 107834 7375 273153 150457
7482 150457 -9660 4695 -248085 -8278 155113 51829 395548 -204236 -297384 48237 -44045
7470 -218520 -116146 374183 -77829 -74210 -101721 182846 -221570 -83938 231535 -112554 108904
7458 -69174 -18977 -190679 19283 131376 46059 -57148 -333915 138053 -277293 -186131 -45686
7446 346804 -208752 -7439 -60794 -142017 94761 110677 -287819 -113361 147806 -40324 -92931
7435 -92931 88035 -296591 194298 158136 -49840 109236 -73785 -44449 -158661 -123238 -157001
7424 -157001 -328743 194060 -48003 -50952 201674 108562 -325636 207112 264745 68298 -126887
7412 -202843 -8150 -78316 -100388 -83989 158157 8266 -36070 109952 -6273 30236 -160339 -91676
7400 -91676 -14002 163126 -39427 -315268 22657 230882 -214090 -81935 120995 -116240 137571
7388 216462 187493 -23843 -191570 -331938 13405 119921 -747 154639 -68592 -23921 -148476
7377 -148476 -7251 354369 36836 -167908 -18229 -107029 314388 -129538 -101970 -96522 243801
7365 -161598 -28861 -66037 52486 -69708 -275055 287784 -301988 -181430 -205349 -46643 153582
7353 -137028 -146807 -169843 -33466 -239640 251617 -31828 -21803 -159181 67335 -126370 -6874
7341 60340 84903 111442 -75081 68835 326616 -83950 237447 -178365 -147258 94248 114635
7330 114635 198344 -235224 40527 -98189 -147934 45152 -267096 -6698 110214 160018 28190
7318 -297388 -158297 -35968 -399650 -45367 164590 -84832 -209654 217661 -6178 -48441 -38342
7307 -38342 184423 226912 -201758 -195227 -96056 83782 62991 -182707 -175286 103596 106121 89271
7295 89271 -17454 149506 -81904 297967 51548 -199664 -162048 -167370 107045 -302434 -174921
7284 -174921 -233120 36396 -252287 -110438 24837 206641 -152723 97103 -247357 -76198 -69652
7273 -69652 270004 -145603 256011 -349929 77717 -101688 30195 -145615 104749 -22934
7262 265830 -283538 73094 67523 101862 -117077 -25878 20809 8991 36256 197305 -62261
7250 -149763 -209029 -80487 -268884 -162292 -19371 -149357 -56643 -205495 -134934 -105380 292429
7238 18016 -10731 -188438 45671 10393 18948 86279 156800 -552772 -130389 -129590 119124 -18886
7225 180374 -227298 365242 16004 16087 40003 38378 -166802 3567 2763 -122535 -96227 -203447
7213 -203447 5029 -255232 219810 274036 -182249 -205172 6321 -131381 90813 -130417 280337
7201 24979 47739 -270971 51686 -43302 56457 -144673 -198495 -258051 -193493 333683 -515183
7189 -337875 173539 -221004 -13853 90500 345694 -67565 271112 -26002 424145 -173617
7178 -244955 22454 -118862 96411 70436 -81833 -130938 -433321 192359 -171206 116983 157781
7167 157781 9734 176115 284626 -153789 -105584 116471 -51971 185978 329755 -210754
7156 144325 -272609 -196054 -249663 96623 131371 -19553 22120 114770 -41524 66780 -182833
7144 -88252 -67723 -184792 -99137 -238755 449062 79407 8032 -122730 -53636 -194165 144471
7132 23961 123914 221143 -169460 -13499 302114 177944 -361208 223825 40503 -75765 -57854
7121 -57854 -111632 252817 -62639 38255 -277390 -155825 -257074 -230160 -134491 65304 -20601
7109 91165 -180965 329587 -169854 -182089 -59793 -192363 128180 -140398 110474 135280
7099 135280 -140401 -110294 45655 171678 -140556 -141789 20412 -155203 -55536 -126114 135705
7087 -108822 302099 17264 -65737 -204742 -315364 189545 -30945 -137431 -174337 -154605 261992
7075 93160 -97821 -136998 170514 219684 197118 10448 -182543 -316169 184810 42827 -19409
7063 157627 125861 -340123 -168432 126719 30402 -108120 -101289 -56858 160416 -287456 -17517
7051 209177 -13381 -43990 16958 -5110 205486 28202 147752 -147416 228377 -136033 58890
7039 58557 178763 -120192 -129983 -298117 48335 266525 -49775 66705 -322121 -105174 -375444
7028 -375444 -124851 174045 23649 -217481 69598 -298442 -179231 -154480 36171 47730 13534
7016 228130 104235 -248997 69386 101631 137315 -254090 439803 -149966 -89506 342372
7005 192671 86752 -319504 -92938 -240222 102272 -434786 66865 -83881 28583 145070 -116320
6993 -20628 102137 -30723 -176140 4508 -95747 8054 -56509 598 -122694 -238070 -206310 -94243
6980 -78594 -186084 90176 -192101 120708 -28447 95957 -49497 -98479 -46542 -7080 142773
6968 -322905 247048 -10805 -273944 -606333 -96027 10038 117150 139898 132846 131540 -144572
6956 50625 5569 -216510 23256 54778 78521 19469 -22790 272417 73632 47487 -68152 108432
6943 -56048 178968 20230 -31500 -107865 -45994 99969 -49021 -84042 131991 143904 51862
6931 173244 -20379 220963 155531 36791 201966 138189 2948 -151114 85425 -158423 -184112
6920 -184112 136609 111022 -8800 112140 83378 -201652 243917 -257633 16181 200347 -223424
6908 100417 35235 221375 -58696 172324 -91250 -249904 211329 -78869 -91732 -80224 -2037
6896 -40962 28280 -69070 112738 97726 -12575 127765 161223 -11951 262519 -18476 -446284
6885 -446284 -119106 -71746 -65684 63211 -18888 37716 179145 -159374 -274401 -53225 -278305
6874 -278305 -15368 -38703 -63452 -141885 7923 -249460 -180634 -75266 -313155 -199564 -196143
6863 -196143 110621 -34673 203536 -6863 221194 -131487 -153488 218646 -317714 54916 -24177
6851 119142 -57956 -277934 38966 -169720 231939 157527 -233499 -262516 133513 -132558
6840 -161861 20444 -9472 -495751 -188596 -43164 -18123 -107901 -26918 -67952 -212980 264995
6828 -63567 -148821 -16659 60711 62689 143002 -204303 201006 -106763 -44256 -358261 133503
6816 345746 148073 -23277 129975 -117701 -36044 -55945 -20261 39068 -111276 -174068 204304
6804 -143894 123152 -229520 -222707 -83942 -85580 43937 335696 -247392 79705 85236 -193027
6792 24582 23902 -201289 -320048 253610 -167394 -108860 -29042 257204 72864 113729 -316595
6780 86929 -303976 -29340 131654 -171909 -194996 -82824 71273 -128830 60677 1405 -140277
6768 -435599 106528 -108067 -166407 202446 146400 450635 -337481 446733 -215241 -17788
6757 -82651 -193293 -9088 123680 1247 43278 63693 96343 50379 75815 62378 160729 -18552
6744 -110584 28242 245099 -310938 -193863 237475 -89610 108399 -300869 -33117 -42037 -119391
6733 -119391 -103230 -219759 -160608 -290711 -146695 -111414 70418 -140177 135970 -163391
6722 -92126 -88876 106643 -19677 14796 -261032 207740 -158296 201660 205395 -75318 -253688
6711 -253688 149186 10484 109262 -36831 218265 -319863 35394 123785 32685 -12285 -243969
6700 -243969 -89732 234142 253078 35563 40472 360884 255444 195970 38763 -197628 259793
6688 -152201 -541901 100210 77474 61799 200130 -190458 -16938 159066 -29139 -246570
6678 -246570 246299 -48962 9852 96651 151871 39094 -202350 -101848 -47521 -71940 -122462
6667 -122462 -373481 -174211 -177636 96653 170572 64114 -105686 -40033 -47944 -21376 -233656
6656 -233656 -2725 -10457 2564 -320788 76492 76510 17494 4030 -42710 225321 251073 251720 88636
6642 46574 19052 147232 -17976 -173109 -222639 -174637 266540 -192275 231048 -266900 9495
6630 -289553 105823 82016 -187320 212499 118349 7606 -273164 18747 -127343 144 -14020
6618 -107646 225795 136010 -187455 161312 24401 71126 106784 4981 -85078 119282 64615
6607 64615 -152243 -237631 26968 339641 474689 281753 295710 10008 67654 -19533 -78514
6596 -78514 72285 -35600 187923 -166621 -179903 -243481 80717 246912 30286 197362 41936
6584 -194900 93317 -450016 -167406 -49449 -41054 -206488 7472 -187678 95077 -133709 -219660
6573 -219660 82374 -3560 140699 74239 -252661 -364657 -131782 -67150 -270472 192592 45460
6561 151673 19625 5447 -70028 389904 243727 200368 -206661 142334 -100817 381108 -119136
6549 -97473 -177161 -148723 -182819 109452 -45407 67826 198568 147782 -249481 -213688 -42317
6537 -97359 -61677 42448 -77865 161935 251182 19404 -150131 205459 100354 -223965 226980
6525 -245903 -66877 141939 -251505 -43091 133506 67841 135540 -150826 -6351 -291527 116079
6513 -38812 -55048 69186 -2434 -97007 -247000 -204535 -232154 -97413 -118154 136043 -66365 -226957
6501 -226957 -156594 -160798 346938 300343 56847 101589 154308 61238 -407943 -40755 61171
6489 24232 -40510 -17556 71643 156298 14830 -295309 -97299 -138743 -290745 124120 -90138
6477 -152450 -428046 94622 -213537 41580 41949 -88659 40637 -249093 -33299 88919 40275
6465 50403 46494 -29536 178555 -181629 -65374 48822 36422 23423 -131857 88578 401460
6454 401460 -77475 -28273 -281564 -274965 -15121 163085 -194075 156930 139680 -134464 1933
6442 -136420 -70893 -208157 373561 219332 -105528 -331644 207770 26355 -46020 -11314
6431 -24500 204069 -179773 72005 -102784 92198 326259 -99571 34976 -133897 156471 -321
6419 -57205 104933 -25738 121345 36707 -14100 -315510 19278 -409104 86127 293392 324506
6408 324506 -227380 -146677 -189969 -64944 -145359 -161831 -48522 113 113157 64732 -182842
6396 4315 -406102 119635 2415 579935 1159 -29178 -41122 226493 -121344 -260704 -179795
6385 -179795 118043 161844 3248 179077 -115857 226546 162535 -106791 -206960 74263 155706
6374 155706 107741 361684 -411606 -6921 -139976 -249144 -346536 184414 479096 -83184 -183933
6363 -183933 -282693 -239006 -66037 -25062 -202682 -171209 149161 106104 121756 287011 -198582
6351 370104 -176767 -13656 -99522 -348928 208866 -246979 -100805 38153 96342 29814 119325
6340 119325 92626 249967 62284 42048 173802 -185111 -64597 19476 64561 18716 119929
6329 119929 -38868 41530 83305 219944 -65704 -236960 -145967 59383 -128053 302894 -248704
6317 310541 192149 132527 -213043 235484 520201 -349386 -418708 -198830 -138304 102671
6306 -74324 203730 50647 -64743 -312166 -137724 -100839 117321 4003 -127258 -97671 179996
6294 -223718 -220946 343004 -396958 -388725 -7979 -60190 -138730 312264 141919 -93131 -91708 -144420
6282 -144420 208715 136412 -74796 -129933 38945 204096 370011 -25982 136134 35573 -274065
6270 -110099 117170 -2066 225845 241172 -205619 77834 95189 -38032 -14599 -487639 -169624
6258 -144631 144042 -126331 -223921 -159016 166668 -109790 -251011 115908 57149 -42650
6247 66297 67013 -308472 53015 92439 178622 -308663 212775 306643 -147014 -62533 -112921
6236 -112921 41746 -77278 -102902 -163088 77819 -176931 -326766 -172305 -44019 76711 11238
6224 411713 959 -61466 -133081 184296 -135704 280753 -107207 176569 -9262 -137995 -339526
6213 -339526 -66973 178981 -49939 117828 8281 -246061 -400781 29008 165778 -213711 170775
6201 -42559 228152 -24426 37185 219845 -202935 194133 158698 325021 65701 135450 -128542
6189 39867 -146019 21572 89192 -338540 232850 -165053 -184999 18570 -20675 -214488 -56737
6177 -5484 1696 -134407 42844 83471 7979 -323773 -124545 123150 50005 -97830 -84903 101638
6164 -62868 -46324 -51046 122579 -104872 -174766 403044 -40844 -122419 -89509 40152 -239375
6152 -70284 -103338 -115811 208928 -387501 108173 -182897 -181639 -267677 -184555 -76227 -9281
6140 -63000 -119979 -113075 303429 239267 -255572 51356 182157 147684 -151909 65194 -289504
6128 -252709 391848 52622 197220 -299258 163722 13399 276906 -76438 127375 -59360
6117 -76904 303082 10647 -152253 131313 174083 3171 -46333 97641 -127467 4173 143756
6106 143756 285616 210264 104055 42063 70780 -48521 -328289 118178 -221428 311379
6095 -108279 21929 -88032 -108687 -117435 172511 -12977 180215 -40209 39447 -15264 144034
6083 60945 409638 92115 -145558 -54842 -192431 -146703 -170176 46860 118637 25840 169105
6072 169105 -359335 -9434 66481 -182235 87917 50961 93940 138913 207646 -37314 -261907
6061 -261907 288486 -26300 23021 -20523 185097 -66647 -308481 81550 -65331 204102 -274193
6049 -149088 -222749 -41974 -35819 26073 84631 -60557 -185818 -27094 -90765 -158268 -168090 -46374
6036 -21559 -87977 124960 -105102 -56552 -9398 66419 99713 -107707 -72361 41149 67823
6025 67823 -16828 260879 381856 -116499 -186348 -57526 -35079 54404 -133226 -25157 -458917
6014 -458917 -97313 -303243 62605 121793 51976 61014 149 96757 -50777 -251074 252289 -57032
6001 136305 136451 118250 -54183 -22223 212842 251635 264944 28310 -165965 -93779 -91728 -217439
5989 -217439 -41198 -101993 171519 -106677 -98221 227078 157231 4443 212653 153017 93868
5978 93868 -69505 -76204 321540 -195321 38677 -321788 184059 166448 70304 40701 -522085
5966 61722 -8119 436066 202517 120009 218771 178254 -381686 -185662 -248946 -85394 -108038
5955 -108038 191181 -48750 47683 45732 47431 -185065 35503 -236475 69410 -180636 -33997
5943 52512 71755 65871 152832 215273 334206 -33627 189158 43068 -95659 -18270 -8912 395067
5930 47181 -168664 -229544 -11219 -133289 205043 77698 317860 -198007 244780 218682 -39367
5918 -143116 103265 51422 -136973 -192823 -195303 114415 128009 185510 101167 -257192 82777
5906 -91891 368022 -128331 -253383 -147529 -192601 -311571 165350 -194213 118912 30998
5895 -81600 31993 -21659 123395 -46926 -105682 -207954 -98778 -132831 63656 47413 136459
5884 136459 109390 -48366 365202 -373150 -118007 -226342 101237 -67187 129056 -67414
5873 -245141 -75115 206796 -20083 124477 -180951 187799 54468 -146915 111138 -22823
5862 40212 -23470 202998 213145 -140109 227927 44613 -111760 283181 46714 428285 -235625
5850 66566 126487 15316 -39913 -194882 -146185 78149 -180704 108942 -111741 -30779 -239197
5839 -239197 29502 -88957 78642 139673 121095 310270 -172627 -24283 -231337 -147343 -41188
5827 108923 -27716 53505 -259713 -73080 100973 139367 -56069 -33137 138780 -155821 -115382
5816 -115382 280770 148609 -42740 -303674 -68691 -58753 203834 222229 182324 -160506 -266140
5805 -266140 -196914 83337 -58854 41157 182242 -56604 15059 335908 -88624 70317 -141316
5793 24616 -318691 45451 166961 327784 -140867 -168457 25609 101876 256235 -267036 -191365
5782 -191365 65441 -152776 -43185 -325144 -12665 424924 -152615 139473 -428988 60086
5771 198846 257516 175206 11637 -53972 -805 -161443 80932 108996 -2663 -26827 26104 -211378
5758 -263783 -121564 -73078 1533 74393 -265475 -322709 190386 -352306 -112850 -221106 138692
5746 -36020 235078 -182470 -254930 -74896 100780 195618 -125100 -58482 93566 163067 129836
5735 129836 76072 -9859 -176145 145565 -41516 216519 -22828 -153116 108592 94798 -144165
5723 304201 50344 -15204 -51947 -146521 -215601 176080 145640 192572 105018 -26234 -6600 -68028
5711 -68028 -35187 -18313 -8999 -113109 -100773 -173400 -410019 11241 66979 139421 -16717 -90837
5699 -90837 -151226 14272 -27319 -39779 180481 -35272 -23384 -136937 4779 532477 -128238
5687 383679 42909 -105601 -98378 216745 -169084 98322 37468 11060 -99841 -45949 48092
5675 -42019 -254094 41562 84565 -122711 194985 -109616 66016 -13395 -206768 83862 -157739
5663 -17239 93347 170584 12638 -130822 1679 147307 -220834 -148772 -141633 -19006 175742
5651 147563 -109063 259773 397094 88483 -269125 -106865 329720 -160078 -10100 -340917
5641 -340917 270194 100593 -304255 150781 -84693 -34810 305525 493058 102432 -128136
5630 -30106 25823 49048 -134829 209604 261178 -32790 34332 256498 -22722 213235 -12680
5618 35118 54111 -195739 7050 376991 11594 386332 151219 3874 178988 -86246 134531
5606 -54612 -111805 -260629 -6924 6396 -122604 57774 137641 -220941 -53921 94696 97150 -69875
5593 -300886 280468 -138760 190937 803 -500712 87161 33032 -52009 225717 -160485 74359
5581 -100421 147499 -19290 -76776 90439 -185223 -43551 86783 199461 133883 -151716 -209448
5570 -209448 11390 95258 3858 5107 39336 -178310 -287845 134821 -151808 -139462 -276251
5559 -276251 -157956 134368 99153 222590 15656 243841 63733 -82292 -4015 -162239 -119649
5548 -119649 17507 104598 -56487 -64248 -374562 66605 -187836 188787 -156282 80031 82925
5537 82925 -67058 -171555 -9289 16205 282916 -79897 226886 -134354 152631 104332 -226470
5525 190944 -119713 -162987 27030 -267154 -224991 -327727 366358 -15652 -310618 157025
5514 192919 -92312 -35506 15974 -34864 -288721 212906 146856 -79630 187406 -61712 -116009
5503 -116009 58195 63199 300778 43946 -144100 -80791 -134882 21421 148822 131339 -288545
5491 196263 -111437 450529 -18053 -24821 -242904 -199661 -195586 32478 -15054 -196072 50683
5479 24888 -191147 224178 -83717 -79396 187031 -1249 -19173 116446 58303 -130681 -27605
5467 -76664 -99821 115282 -45474 -84727 -309007 -42411 -63728 186026 92311 107252 -50452
5455 203625 4410 -373064 -108711 155136 -41722 236939 217204 7868 -179112 -122806 -60473
5443 -4947 -102888 -152936 -49607 -329605 17349 38316 50467 -2154 -222554 -168155 -18481 209719
5430 -71038 -66881 256005 -153625 -307138 -4774 -75274 -77596 23060 -184330 223870 8070 83128
5418 83128 133969 114522 285512 45152 160865 -40156 -89667 -157964 239162 -93061 -141231
5407 -141231 9524 -35366 50961 114452 -43142 -70944 65193 -49243 -108109 -279982 -36053 82861
5394 -177133 247266 -328601 89756 81888 -119207 396258 -156531 24922 -180871 -48206 29458
5382 -63492 73409 -13709 -177763 -263909 -34440 115703 35683 144101 159930 -189891 -421950
5371 -421950 94000 -60245 196813 -153686 61303 63999 78761 -32217 -96733 61602 81262
5360 81262 35324 127313 94096 99443 -118171 -90942 12873 103715 18804 -51135 34238 319606
5348 319606 -72471 227077 80354 -215141 -94937 -57413 -172713 88560 269701 58992 -44929
5336 318217 185911 297308 -135164 97014 -82375 -85783 246115 252134 38299 134330 238580
5325 238580 22381 -245386 50437 91621 148331 -112879 92896 -11876 -140689 83880 86986
5314 86986 111026 272922 -138184 83438 -203621 92193 -193297 -176272 -66370 -57107 102517
5302 25893 -49658 43138 281808 -37715 71794 164433 121814 -93402 197923 121250 24696
5290 275115 148669 -64977 -54745 43721 74166 18282 -15479 180858 -313722 -86108 -24052
5278 140831 212177 -35881 128627 38757 84840 -185202 41075 125283 -308216 -141456 -36304
5266 108569 -104132 -7198 86312 -46685 -323505 -77602 368329 52969 -142962 71335 -9487
5254 7438 22905 32368 -158467 387992 22571 -194782 -15805 36942 304783 60444 -39118
5242 -237903 -51005 223213 -250981 64192 -216450 9498 187339 249074 -37099 -140826 147807
5230 52118 186321 12696 100860 166069 45224 -30988 276456 17924 -291172 66378 364109
5219 364109 -45762 -228490 -45413 260561 167777 -51400 -99993 63085 80452 106648 -308702
5207 201748 124435 -152700 221060 -173566 10764 -92805 -379082 145666 -416323 -256965
5197 -256965 -17009 55770 -27314 -206 35861 316049 -43718 74229 226922 -382201 -210562
5186 -210562 41915 -91063 68158 -245396 -35632 -106637 -6926 78523 98785 -138149 -219489
5175 -219489 -97966 -200926 39826 223585 -89701 180872 -86632 -51376 -279436 -168334 -70623
5163 -41953 -46673 -276940 -115271 -348548 -422455 30077 -132589 134971 -122121 23028 -95943
5151 114603 268059 -176019 123379 127092 -35290 51055 151925 -259728 458826 72715 -230638
5139 17146 56196 138814 72959 127838 -6900 308552 28934 -100378 -28624 117142 180468
5128 180468 -18314 72856 157580 46465 74273 61071 -325557 -117719 172864 -62685 4057
5116 -224527 288540 58026 -241767 -49862 -181480 320569 -203828 406871 -71907 38357
5105 -201002 66735 -120537 107753 9100 221908 -13926 102420 110681 -58088 -314622 -2614
5093 -218092 -47639 95321 -107845 -250215 56702 88774 -63508 120062 170626 181927 377067
5082 377067 9931 -109813 431883 186631 -6034 133352 103372 184049 -166045 18630 42097
5071 42097 -16867 -128086 -151403 149690 228787 1994 -170126 -57920 -50740 139519 299599
5060 299599 -31036 -226703 -22988 -186981 252098 -82321 235657 -167251 -210546 64340 -201941
5048 93625 81042 -414435 119835 -293518 -14358 -153949 -29901 -179955 -62690 -5887 67691
5036 118050 30283 -114748 303653 10819 276829 269747 53046 141581 -95720 241663 16089
5024 197299 -138339 -106823 -49491 -203920 -603482 -160 -69587 -92201 32425 -73756 150396
5012 -88644 51195 113981 163334 -73233 -149692 -59135 -98 -153262 302 -149690 6723 32554 274965
4999 274965 1462 149488 -123476 -72291 74429 -165779 -46552 -3181 -276042 163546 243914
4988 243914 135258 252115 99892 -67240 -5324 -144423 82409 287931 172686 -246724 16588
4976 509648 -77446 113220 315754 -137472 -29405 -226832 -85386 32701 -76801 23095 143859
4965 143859 -57956 399225 62231 -72172 -278228 33692 -18950 -119007 -10795 160110 -135052
4953 57067 -175339 -47558 34047 11402 -57858 -224710 -16381 51553 -95607 106461 -225543
4941 -89548 -53328 -104402 233482 -108196 241844 318561 262029 101562 -158745 67631 -143037
4929 79279 -149023 138818 234300 290536 235788 84827 -189973 58751 -33622 -624319 55881
4917 -51829 27196 -131507 -217852 -11896 32383 46982 -69010 -84653 25156 182968 38845
4905 -20744 -175264 -107673 226513 -255526 -36170 -198954 113127 36198 -130884 -80926 100817
4893 158674 -29243 112769 70800 -73407 -22988 -97660 181831 -118190 -370713 231354 469118
4882 469118 103116 -83679 19952 -25126 -15716 108217 224076 -98772 57022 -43679 -250048
4871 -250048 -190477 400854 -95350 -50755 -12113 132679 -110189 430096 -76706 198922 -144988
4859 180972 173064 12358 -74421 -156269 82091 98154 325746 334929 -129341 106152 270365
4848 270365 113830 -331758 -63880 -432343 280162 100386 8309 197439 -158945 -236611
4838 -236611 158364 278964 -43834 -21701 -55398 75689 -197041 306198 75313 183458 -111131
4826 -230409 -109805 31157 -52818 111273 -326250 -167456 13647 -23851 -107214 43163 165967
4815 165967 -140979 61809 67587 101481 -184603 -96022 -54892 -217560 -215270 -232111 104581
4803 -64665 9213 257351 2840 -108311 -97941 155912 125260 127594 117622 100851 -42249 -321033
4791 -321033 -72712 -153797 135892 -280153 -97707 58082 -60215 -18921 -83928 80658 50742
4780 50742 192603 241801 -113655 205894 -220434 311316 184478 -76748 112614 245138
4770 245138 -64853 229070 65182 239899 -71193 89976 -296050 135399 -84574 136633 -139177
4758 138596 69353 -176352 -121411 -107636 18757 -35586 -191807 113256 -247864 -271449 185872
4746 -203109 214230 -29948 47114 209293 -253408 157552 -37208 -75908 -113871 45976 17051
4734 -116027 167177 -189235 116501 -429949 141611 72788 -1645 184655 217546 -55893 -20135
4722 -124895 176699 49525 -22550 -79745 -68949 69799 -179469 -145287 92854 298507 -85397
4710 86476 219315 -133240 -65690 99797 337983 -66574 147840 76868 369326 35543 48736
4699 48736 -165081 79602 -265820 3564 -83385 130206 -7511 -5465 147754 -187675 354840
4687 -130468 -36592 -150082 272274 -158132 -13428 160326 93085 -69740 -216204 267260
4676 63963 -156051 -148264 -81633 57755 -240305 -20861 133826 -241029 -188885 -272189 -39338
4664 192676 172798 -224671 -361440 -156865 90085 -58565 172822 236817 -2763 19192 -149289
4652 -163302 54436 35237 -221889 114982 -43464 157366 62406 80558 47020 223590 -21177
4640 225235 -190704 -42792 69170 -74630 -183639 127688 -93885 73158 -23925 -391270 -59833
4628 -113013 94637 99100 -122919 325856 -16721 187741 93245 221242 171917 459703 -343896
4616 -15499 79462 134987 25167 121864 59524 -128884 55697 -115753 315723 -124612 -212704
4605 -212704 -101580 -145781 -38253 74939 -181126 -58972 42059 -111558 15389 151662 224049
4594 224049 272993 388785 15220 -161015 -43896 91065 268163 -114332 89031 -149611 268177
4582 70992 123104 -51911 148913 -183651 54931 4506 -243642 -282894 -2643 159080 81047
4571 81047 95473 -69931 -73661 -7295 200960 50513 -73332 -37770 -336701 99861 96993 107091
4559 107091 25774 207018 -32230 163049 -113934 -90968 67227 64596 42436 174842 -148612
4547 150490 144244 -128033 -194511 -216483 -168233 -178614 168116 -117493 208213 37469 57244
4536 57244 -74065 359050 128573 -10904 470109 74349 -192554 -45205 -182413 -83349 264782
4524 -272188 -398356 -6425 98862 193062 -186366 96677 -37133 -258435 14253 -116060 -50140
4512 -59902 -110171 215713 -41741 -218469 -162174 120528 -245944 -180956 69582 124323 -149684
4500 -70843 -282757 63303 382191 455785 82117 149581 -529398 -115187 101644 -25330 -83612
4489 -83612 144965 270831 -7675 33464 68130 109517 -106007 28416 157533 25837 190956
4478 190956 85918 85690 -170082 21200 -31284 88908 353679 -32774 -163856 143661 -128032
$$ [...]
##END NTUPLES=NMR SPECTRUM
##END=
