##TITLE=NES1017_872015068_9265900_OTYrnOHzXa
##JCAMPDX= 6.0         $$ Bruker NMR JCAMP-DX V2.0
##DATA TYPE= NMR SPECTRUM
##DATA CLASS= NTUPLES
##ORIGIN= BRUKER
##OWNER= Administrator
$$ 1.72 TOPSPIN		Version 2.1
$$ 2015-07-09 16:56:56.238 -0700  Administrator@X
$$ Compression mode = diff/dup
##.OBSERVE FREQUENCY= 400.02188249412
##.OBSERVE NUCLEUS= ^1H
##.ACQUISITION MODE= SIMULTANEOUS (DQD)
##.ACQUISITION SCHEME= undefined
##.AVERAGES= 64
##.DIGITISER RES= 22
##SPECTROMETER/DATA SYSTEM= spect
##.PULSE SEQUENCE= noesygpps1d.comp
##.SOLVENT NAME= COFFEE_meoh
##.SHIFT REFERENCE= INTERNAL, COFFEE_meoh, 1, 14.96334
##AUDIT TRAIL= $$ (NUMBER, WHEN, WHO, WHERE, PROCESS, VERSION, WHAT)
$$ ##TITLE= Audit trail, TOPSPIN		Version 2.1
$$ ##JCAMPDX= 5.01
$$ ##ORIGIN= Bruker BioSpin GmbH
$$ ##OWNER= Administrator
$$ $$ E:\/data/COFFEE/nmr/NES1017_872015068_9265900_OTYrnOHzXa/12/pdata/1/auditp.txt
$$ ##AUDIT TRAIL=  $$ (NUMBER, WHEN, WHO, WHERE, PROCESS, VERSION, WHAT)
(   1,<2015-07-09 16:56:49.706 -0700>,<Administrator>,<X>,<go>,<TOPSPIN 2.1>,
      <created by zg
	started at 2015-07-09 16:45:19.550 -0700,
	POWCHK enabled, PULCHK disabled,
       configuration hash MD5:
       21 0F 79 D6 B3 7B B4 F6 88 20 88 DB 03 48 BD 9F
       data hash MD5: 64K
       92 0E 8E CE 30 44 1D F8 CB F4 7B 0D 7F E1 0D AF>)
(   2,<2015-07-09 16:56:52.941 -0700>,<Administrator>,<X>,<proc1d>,<TOPSPIN 2.1>,
      <Start of raw data processing
       efp LB = 0.3 FT_mod = 6 PKNL = 1 PHC0 = 0 PHC1 = 0 SI = 128K 
       data hash MD5: 128K
       98 E5 43 9E E4 19 6F FD 2C 1F 59 B7 51 E4 30 6C>)
(   3,<2015-07-09 16:56:53.878 -0700>,<Administrator>,<X>,<proc1d>,<TOPSPIN 2.1>,
      <pk PHC0 = -86.06689 PHC1 = 0 
       data hash MD5: 128K
       78 84 D5 B6 F3 9A 4D 65 EB BF 0D 83 58 0D B6 C9>)
(   4,<2015-07-09 16:56:54.816 -0700>,<Administrator>,<X>,<proc1d>,<TOPSPIN 2.1>,
      <abs ABSG = 1 
       data hash MD5: 128K
       86 89 91 84 29 B6 A5 19 66 E2 D6 A5 26 B9 0F 50>)
(   5,<2015-07-09 16:56:54.972 -0700>,<Administrator>,<X>,<proc1d>,<TOPSPIN 2.1>,
      <abs ABSG = 2 
       data hash MD5: 128K
       EE DA 5F C2 18 0F BE EF 54 F1 4C B4 AA 87 FC EC>)
(   6,<2015-07-09 16:56:55.081 -0700>,<Administrator>,<X>,<proc1d>,<TOPSPIN 2.1>,
      <abs ABSG = 3 
       data hash MD5: 128K
       BE F7 3B 11 07 FA 5D 1D 3D 6A 5B D5 99 CB A5 B0>)
(   7,<2015-07-09 16:56:55.472 -0700>,<Administrator>,<X>,<proc1d>,<TOPSPIN 2.1>,
      <abs ABSG = 4 
       data hash MD5: 128K
       8E 0E 28 13 26 1B 5B F6 DD 4B 98 E6 6B EE 1E 5F>)
(   8,<2015-07-09 16:56:55.675 -0700>,<Administrator>,<X>,<proc1d>,<TOPSPIN 2.1>,
      <abs ABSG = 5 
       data hash MD5: 128K
       4C 85 26 DC 99 D3 6A 16 A2 61 43 E1 9F A1 2F B2>)
$$ ##END=
$$ 
$$ $$ hash MD5
$$ $$ 1C 4B 7E 37 30 0F FD 7D 59 96 AE 3E ED B6 A0 9B
##$RELAX= 
##$RELAX= 
##$RELAX= 
##$RELAX= 
##$RELAX= 
##$RELAX= 
##$RELAX= 
##$RELAX= 
$$ Bruker specific parameters
$$ --------------------------
##$DU= <E:\>
##$EXPNO= 12
$$ [...]
##$TP07= 0
##$TPNAME0= <>
##$TPNAME1= <>
##$TPNAME2= <>
##$TPNAME3= <>
##$TPNAME4= <>
##$TPNAME5= <>
##$TPNAME6= <>
##$TPNAME7= <>
##$TPOAL= (0..7)
0.5 0.5 0.5 0.5 0.5 0.5 0.5 0.5
##$TPOFFS= (0..7)
0 0 0 0 0 0 0 0
##$TUNHIN= 0
##$TUNHOUT= 0
##$TUNXOUT= 0
##$USERA1= <user>
##$USERA2= <user>
##$USERA3= <user>
##$USERA4= <user>
##$USERA5= <user>
##$V9= 5
##$VALIST= <valist>
##$VCLIST= <CCCCCCCCCCCCCCC>
##$VD= 0
##$VDLIST= <DDDDDDDDDDDDDDD>
##$VPLIST= <PPPPPPPPPPPPPPP>
##$VTLIST= <TTTTTTTTTTTTTTT>
##$WBST= 2048
##$WBSW= 25
##$XGAIN= (0..3)
0 0 0 0
##$XL= 0
##$YL= 0
##$YMAX_a= 6255851
##$YMIN_a= -12114081
##$ZGOPTNS= <>
##$ZL1= 120
##$ZL2= 120
##$ZL3= 120
##$ZL4= 120
##$ABSF1= 14.96334
##$ABSF2= -5.594842
##$ABSG= 5
##$ABSL= 3
##$ALPHA= 0
##$AQORDER= 0
##$ASSFAC= 0
##$ASSFACI= 0
##$ASSFACX= 0
##$ASSWID= 0
##$AUNMP= <proc_prof1d_extract.lims>
##$AXLEFT= 0
##$AXNAME= <>
##$AXNUC= <1H>
##$AXRIGHT= 0
##$AXTYPE= 0
##$AXUNIT= <>
##$AZFE= 0.1
##$AZFW= 0.1
##$BCFW= 0
##$BC_mod= 0
##$BYTORDP= 0
##$COROFFS= 0
##$CY= 15
##$DATMOD= 1
##$DC= 0
##$DFILT= <>
##$DTYPP= 0
##$F1P= 0
##$F2P= 0
##$FCOR= 0.5
##$FTSIZE= 131072
##$FT_mod= 6
##$GAMMA= 0
##$GB= 0
##$INTBC= 1
##$INTSCL= 1
##$ISEN= 128
##$LB= 0.3
##$LEV0= 0
##$LPBIN= 0
##$MAXI= 10000
##$MC2= 0
##$MEAN= 0
##$ME_mod= 0
##$MI= 0
##$NCOEF= 0
##$NC_proc= -2
##$NLEV= 6
##$NOISF1= 0
##$NOISF2= 0
##$NSP= 0
##$NTH_PI= 0
##$NZP= 0
##$OFFSET= 14.96334
##$PC= 1
##$PHC0= -86.06689
##$PHC1= 0
##$PH_mod= 1
##$PKNL= yes
##$PPARMOD= 0
##$PPDIAG= 0
##$PPIPTYP= 0
##$PPMPNUM= 2147483647
##$PPRESOL= 1
##$PSCAL= 4
##$PSIGN= 0
##$PYNMP= <proc.py>
##$REVERSE= no
##$SF= 400.02000870002
##$SI= 131072
##$SIGF1= 0
##$SIGF2= 0
##$SINO= 400
##$SIOLD= 131072
##$SPECTYP= <>
##$SREGLST= <1H.CDCl3>
##$SSB= 0
##$STSI= 131072
##$STSR= 0
##$SW_p= 8223.68421052631
##$SYMM= 0
##$S_DEV= 0
##$TDeff= 65536
##$TDoff= 0
##$TI= <>
##$TILT= no
##$TM1= 0
##$TM2= 0
##$TOPLEV= 0
##$USERP1= <user>
##$USERP2= <user>
##$USERP3= <user>
##$USERP4= <user>
##$USERP5= <user>
##$WDW= 1
##$XDIM= 131072
##$YMAX_p= 369564051
##$YMIN_p= -13034
##$CURPLOT= <Network HP LaserJet P1505>
##$CURPRIN= <$Network HP LaserJet P1505>
##$DFORMAT= <normdp>
##$LAYOUT= <+/1D_H.xwp>
##$LFORMAT= <normlp>
##$PFORMAT= <normpl>
##$SURQMSG= 1
$$ End of Bruker specific parameters
$$ ---------------------------------
##NTUPLES= NMR SPECTRUM
##VAR_NAME=  FREQUENCY,     SPECTRUM/REAL,   SPECTRUM/IMAG
##SYMBOL=    X,             R,               I
##VAR_TYPE=  INDEPENDENT,   DEPENDENT,       DEPENDENT
##VAR_FORM=  AFFN,          ASDF,            ASDF
##VAR_DIM=   131072,        131072,          131072
##UNITS=     HZ,            ARBITRARY UNITS, ARBITRARY UNITS
##FACTOR=    0.0627417313425164, 1,          1
##FIRST=     8223.62146879497, -2246,        -43398
##LAST=      0,             -486,            -44492
##MIN=       0,             -13034,          0
##MAX=       8223.62146879497, 369564051,    0
$$ Real data points
##PAGE= N=1
##DATA TABLE= (X++(R..R)), XYDATA
$$ [...]
67541 91520 92205 92841 93068 92739 92204 92005 92230 92378 92024 91432 91196 91338 91175 90234 88925 88033 87768 87722 87573
67522 87573 87395 87236 86844 86022 84941 83962 83374 83419 84194 85322 86024 85905 85471 85506 86075 86564 86647 86734 87320 88264
67502 88264 88947 88971 88509 88080 88120 88648 89234 89401 89110 88749 88618 88670 88901 89641 91148 93013 94441 95132 95477
67483 95477 95770 95690 94990 94344 94867 96721 98745 99779 99966 100298 101184 102016 102184 101889 101731 101866 102023 102136
67465 102136 102543 103460 104543 105123 104885 104241 103986 104499 105253 105360 104652 103962 104194 105323 106671 107885 109143
67448 109143 110407 111087 110763 109863 109206 109072 109115 109113 109357 110117 111084 111607 111422 110880 110447 110163 109717 108958 108172
67429 108172 107801 107995 108472 108734 108403 107489 106502 106222 107138 108983 110865 111876 111642 110458 109086 108339 108559
67412 108559 109356 110013 110268 110594 111568 113059 114216 114291 113390 112404 112195 112830 113661 114172 114648 115790 117685 119438
67394 119438 119988 119110 117455 115779 114418 113438 112932 113032 113761 114942 116202 117129 117605 117957 118609 119561 120486
67377 120486 121319 122362 123606 124343 123915 122702 121907 122305 123599 125088 126502 127903 129100 129694 129671 129552
67361 129552 129855 130628 131643 132754 133863 134641 134581 133501 131919 130790 130754 131622 132646 133329 133854 134657 135687
67344 135687 136332 136102 135240 134496 134395 134826 135358 135799 136338 137095 137774 137981 137891 138240 139457 141046 142130 142433
67326 142433 142373 142278 142050 141702 141753 142816 144992 147852 150779 153217 154897 156079 157263 158483 159232 159358 159605
67309 159605 160741 162431 163603 163778 163467 163282 163296 163403 163668 164015 164058 163668 163391 163892 165161 166572 167624
67292 167624 168334 168919 169372 169455 169057 168547 168633 169700 171328 172676 173362 173699 174101 174655 175348 176269 177318 178084
67274 178084 178350 178427 178713 179201 179779 180720 182321 184205 185567 186238 186980 188517 190594 192250 192843 192602 192328
67257 192328 192729 193948 195561 197001 198070 199079 200507 202509 204667 206227 206672 206210 205638 205710 206658 208310
67241 208310 210414 212702 214873 216778 218539 220286 221880 223073 223865 224480 225118 225930 227108 228696 230398
67226 230398 231841 232969 233907 234544 234727 234800 235457 236908 238600 239943 240960 242033 243387 245129 247420 250196
67210 250196 252940 255080 256539 257614 258451 259031 259572 260530 262055 263763 265194 266349 267589 269091 270559
67195 270559 271546 272053 272673 274024 276064 278197 280050 281843 283861 285917 287713 289474 291772 294701 297694
67180 297694 300227 302372 304451 306493 308316 309940 311604 313382 315016 316227 317126 318258 320159 322805
67166 322805 325505 327494 328672 329682 331182 333235 335436 337459 339325 341301 343714 346731 350077 353031
67152 353031 355016 356229 357482 359356 361804 364621 367918 371766 375604 378538 380337 381763 383684 386117
67138 386117 388414 390234 391924 393936 396152 398053 399452 400894 403210 406715 410881 414863 418343 421681
67124 421681 425213 428653 431526 434002 436786 440098 443299 445938 448711 452760 458109 463436 467569 470704
67110 470704 473851 477426 480853 483447 485302 487218 489944 493530 497305 500514 503063 505584 508733 512545
67096 512545 516580 520541 524506 528637 532994 537698 542962 548770 554628 559827 563919 566897 569042 570792
67082 570792 572708 575318 578837 583028 587399 591592 595650 599960 604912 610576 616611 622475 627769 632493
67068 632493 637032 641815 646912 652028 656929 661743 666742 671987 677448 683385 690216 697862 705510 712343
67054 712343 718371 724317 730736 737426 743733 749281 754335 759518 765181 771093 776786 782144 787496 793156
67040 793156 799155 805552 812617 820347 828022 834740 840467 846195 852944 860826 869156 877137 884341 890816
67026 890816 897076 903809 911350 919431 927589 935715 944029 952577 961038 969058 976624 983956 991193 998366
67012 998366 1005704 1013732 1022781 1032415 1041677 1050112 1058289 1066977 1075977 1084322 1091673 1098984 1107501 1117461
66998 1117461 1128108 1138657 1148805 1158535 1167988 1177499 1187262 1196880 1205666 1213565 1221433 1230226 1240171
66985 1240171 1250886 1261936 1272969 1283591 1293561 1303104 1312705 1322564 1332467 1342227 1351967 1361838 1371714
66972 1371714 1381371 1390903 1400740 1411191 1422037 1432660 1442604 1452009 1461450 1471302 1481318 1490900 1499755
66959 1499755 1508150 1516615 1525624 1535574 1546708 1558756 1570809 1581906 1591769 1600770 1609339 1617737 1626314
66946 1626314 1635452 1645051 1654472 1663291 1671763 1680280 1688742 1696898 1704977 1713370 1721877 1729897 1737360 1744831
66932 1744831 1752613 1760354 1767747 1775003 1782300 1789342 1795896 1802265 1808746 1815030 1820732 1826167 1831904 1837714
66918 1837714 1842737 1846695 1850283 1854256 1858753 1863664 1869018 1874605 1879665 1883402 1885598 1886533 1886690 1886768 1887490
66903 1887490 1888878 1889996 1889985 1889246 1889080 1890210 1892165 1894082 1895538 1896379 1896307 1895133 1893212 1891184 1889351 1887612
66887 1887612 1885904 1884265 1882457 1879943 1876480 1872462 1868391 1864256 1859765 1855065 1850754 1847047 1843312 1838709
66873 1838709 1833113 1827199 1821667 1816610 1811564 1805933 1799355 1791835 1783696 1775415 1767473 1760216 1753652 1747307
66859 1747307 1740455 1732677 1724073 1714853 1705002 1694605 1684305 1674955 1666735 1658968 1650947 1642634 1634408
66846 1634408 1626354 1618123 1609401 1600272 1591064 1581943 1572716 1563070 1553077 1543369 1534610 1526718 1518838 1510217
66832 1510217 1500907 1491467 1482180 1472862 1463308 1453485 1443221 1432181 1420497 1409201 1399465 1391294 1383313
66819 1383313 1374164 1363909 1353777 1344699 1336435 1328128 1319244 1309813 1300179 1290817 1282107 1273889 1265397
66806 1265397 1255996 1245900 1235815 1226005 1216161 1206123 1196183 1186566 1177147 1167937 1159341 1151580 1144187
66793 1144187 1136592 1128907 1121615 1114554 1106833 1097883 1088183 1078688 1069830 1061355 1052898 1044420 1036110 1028127
66779 1028127 1020456 1012865 1005015 996781 988533 980873 974000 967393 960290 952384 943975 935576 927557 920105
66765 920105 913223 906668 900103 893420 886806 880410 874121 867752 861280 854777 848259 841699 835045 828184
66751 828184 821107 814227 808229 803353 799085 794770 790281 785787 781199 776249 770908 765302 759435 753425
66737 753425 747761 742748 737909 732600 727071 722093 717627 712786 707371 702399 698601 695189 690805 685111
66723 685111 678803 672572 666837 662074 658489 655415 651783 647295 642598 638291 634247 630005 625427 620792
66709 620792 616471 612535 608615 604314 599903 596197 593413 590579 586622 581726 576946 572734 568646 564438
66695 564438 560565 557364 554468 551376 548090 544893 541923 539208 536680 533939 530510 526579 522926 519792
66681 519792 516344 511758 506387 501279 496884 492914 489253 486254 483953 481672 478733 475308 472257 470224
66667 470224 469052 467992 466352 463953 461051 457973 454889 451873 448974 446190 443566 441372 439915 439042
66653 439042 438098 436629 434862 433192 431439 429072 426103 423195 420778 418445 415475 411686 407558 403748
66639 403748 400736 398708 397466 396469 395232 393619 391645 389168 386124 382985 380557 379178 378394 377510 376167
66624 376167 374228 371564 368295 364952 361990 359299 356609 354179 352506 351463 350346 348860 347364 345955
66610 345955 344086 341519 338976 337116 335407 332928 329994 327933 327153 326431 324544 321871 319769 318826 318386
66595 318386 317523 315891 313711 311462 309689 308688 308123 307174 305260 302578 299885 297824 296481 295464 294328
66580 294328 292956 291588 290463 289444 288145 286492 285047 284484 284802 285295 285383 285148 284836 284205 282854 281025
66564 281025 279448 278346 277171 275529 273735 272169 270682 269105 267804 267092 266501 265342 263685 262063 260477
66549 260477 258575 256668 255627 255617 255767 255334 254418 253283 251804 250037 248581 247833 247454 247079 246932 247132 246926
66532 246926 245464 242989 240533 238653 237159 235888 234924 234053 232742 230866 228970 227665 227128 227226 227666 227909
66516 227909 227424 226214 224791 223554 222519 221691 221261 221216 221152 220730 220073 219445 218732 217517 215611 213294 211060
66499 211060 209215 207685 206189 204685 203633 203658 204849 206476 207485 207272 206074 204724 203973 203875 203805 203183
66483 203183 202135 201262 200856 200606 200093 199239 198181 197000 195833 195046 194968 195449 195898 195839 195329 194774 194419 194102
66465 194102 193502 192504 191235 189844 188401 187049 186036 185461 185116 184782 184567 184718 185101 185122 184318 182903 181611
66448 181611 180989 180882 180571 179427 177431 175163 173316 172238 171804 171578 171123 170388 169846 170065 171026 172022 172340
66431 172340 171894 171085 170308 169787 169627 169674 169400 168385 166940 165907 165705 165829 165519 164723 164142 164324 164955 165217
66413 165217 164728 163894 163220 162558 161401 159781 158420 157823 157642 157203 156347 155413 154660 154119 153825 153796 153814 153626
66395 153626 153296 153052 152825 152364 151732 151278 151037 150635 149908 149221 148951 148980 148948 148781 148675 148665 148511 148040 147430 146992
66375 146992 146693 146060 144804 143449 142936 143471 144209 144385 144291 144569 144971 144653 143601 142852 143084 143769 144025 143696
66357 143696 143097 142221 140782 138818 136835 135469 135210 136106 137520 138503 138718 138708 139006 139381 139313 138794 138171 137545
66339 137545 136853 136258 135903 135465 134514 133194 132048 131260 130627 130157 130095 130370 130598 130680 130856 131080 130976 130559 130400
66320 130400 130790 131288 131453 131533 131990 132684 132982 132445 131023 128855 126311 124052 122589 121804 121246 120788 120656
66303 120656 120966 121606 122494 123498 124201 124245 123916 123844 124028 123745 122618 121199 120154 119453 118848 118591 118922 119227
66285 119227 118658 117534 117188 118188 119617 120443 120776 121123 121191 120380 119022 118117 117878 117547 116741 116108 116315 117139
66267 117139 118010 118781 119379 119276 118083 116469 115686 116114 116834 116769 115787 114484 113301 112238 111262 110630 110668 111352
66249 111352 112255 112915 113157 112960 112188 110748 109049 107990 108198 109400 110670 111187 110686 109466 108221 107666
66233 107666 107946 108430 108363 107709 107138 107182 107682 108118 108216 108073 107811 107346 106553 105576 104796 104403 104145 103748 103450 103767
66213 103767 104689 105538 105795 105632 105366 104875 104042 103350 103372 103833 103900 103372 102870 102732 102414 101331 99776 98508
66195 98508 97765 97132 96278 95490 95434 96521 98475 100468 101786 102334 102422 102220 101778 101420 101573 102116 102416 102243
66177 102243 102128 102507 102994 102989 102596 102403 102600 102934 103407 104407 106058 107883 109269 109923 109873 109348 108770 108540
66159 108540 108687 108948 109180 109404 109405 108758 107434 106065 105297 105082 104892 104415 103701 102775 101564 100305 99653 100112
66141 100112 101487 103057 104166 104523 104112 103179 102276 101934 102042 101782 100469 98323 96178 94563 93442 92740
66125 92740 92587 92883 93095 92916 92822 93542 95027 96340 96609 95809 94594 93667 93419 93894 94823 95732 96222 96229 95990
66106 95990 95746 95512 95166 94702 94258 93849 93270 92510 92140 92815 94310 95463 95363 94316 93347 93014 93074 93105 92970
66087 92970 92705 92403 92247 92352 92566 92716 92961 93517 94085 94060 93417 92837 92755 92750 92235 91340 90662 90398 90189 89754
66067 89754 89273 89144 89581 90477 91423 91946 91920 91743 91917 92513 93224 93854 94467 95051 95354 95201 94833 94691 94930
66048 94930 95268 95333 95060 94635 94130 93396 92376 91377 90781 90593 90508 90369 90313 90442 90713 91168 91932 92800 93211 92908
66028 92908 92341 92110 92233 92332 92376 92774 93753 94998 96027 96685 97211 97944 99002 100114 100853 101126 101347 101938
66010 101938 102830 103653 104253 104703 104975 104995 104997 105385 106162 106861 107116 106972 106499 105588 104412 103801 104612 106734 109027
65991 109027 110378 110617 110262 109569 108284 106434 104884 104472 104706 104046 101821 99208 97760 97493 97223 96393
65975 96393 95541 94947 93967 92184 90365 89617 90081 91052 91928 92412 92078 90576 88294 86257 85237 85242 85880 86852
65957 86852 87993 89103 89898 90041 89354 88149 87202 87146 87911 88953 89829 90282 89976 88752 87201 86427 86881
65940 86881 87683 87526 86116 84431 83529 83486 83721 84041 84845 86186 87168 86776 85090 83130 81549 80103 78606
65923 78606 77720 78258 80036 82013 83342 83877 83829 83522 83456 84020 84970 85591 85541 85216 85123 85238 85244 85088 84986 84914
65903 84914 84441 83239 81669 80682 80957 82148 83186 83415 83173 83139 83391 83495 83302 83181 83388 83598 83231 82072
65885 82072 80443 78951 78035 77607 77122 76218 75240 74892 75393 76262 76941 77306 77439 77288 76783 76072 75440 75095
65867 75095 75188 75842 76943 77994 78413 78049 77317 76813 76797 76978 76801 76014 74980 74362 74434 74790 74786 74280 73830 74087
65847 74087 74947 75497 74967 73642 72526 72176 72263 72304 72305 72400 72448 72433 72823 73926 75192 75877 76201 77105 78826 80439
65827 80439 80946 80267 79019 77885 77352 77493 77750 77425 76603 76203 76901 78442 80161 81653 82764 83498 84228
65810 84228 85460 87011 88025 88127 87997 88298 88672 88480 87958 87795 87888 87468 86454 85819 86354 87640 88474 87989
65792 87989 86254 84064 82268 81125 80361 79918 80259 81528 82805 82927 81970 81166 81276 81740 81718 81300 81232 81864
65774 81864 82829 83499 83333 82002 79712 77419 76266 76599 77633 78241 77995 77406 77220 77632 78176 78260 77681 76664
65756 76664 75616 74925 74799 75113 75417 75207 74272 72850 71533 70914 71068 71358 71062 70244 69678 69790 70038 69634
65738 69634 68563 67462 66788 66510 66490 66608 66538 65875 64716 63767 63734 64772 66577 68769 70977 72717 73399
65721 73399 72631 70596 68157 66345 65570 65405 65257 65006 64837 64780 64838 65297 66376 67620 68169 67793 67171 66975
65703 66975 67058 66879 66469 66524 67563 69277 70874 71872 72369 72587 72503 72130 71914 72327 73035 73049 71973 70681 70314
65684 70314 70947 71723 72031 71964 71748 71334 70703 70030 69422 68845 68430 68427 68697 68653 67932 66878 66126 65919 66043 66255
65664 66255 66518 66880 67282 67562 67629 67608 67740 68065 68336 68272 67784 66903 65802 64970 64973 65709 66259 65943 65237 65126
65644 65126 65743 66254 66020 65261 64551 64268 64633 65710 67117 68120 68243 67551 66386 65192 64540 64742 65338
65627 65338 65421 64638 63417 62238 61249 60691 60980 62047 63170 63791 64050 64188 63988 63281 62469 62038 61881 61636
65609 61636 61392 61519 62009 62467 62663 62708 62733 62730 62662 62510 62276 62098 62158 62356 62372 62268 62683 64046 65793 66781 66394
65588 66394 65037 63653 62987 63148 63639 63862 63700 63457 63236 62787 62080 61559 61522 61677 61672 61656 61838 61874 61246 60071
65568 60071 58978 58320 58001 57991 58441 59240 59887 59951 59398 58433 57305 56319 55821 56055 57064 58620 60223 61413
65550 61413 62273 63363 64910 66294 66649 65808 64418 63305 63000 63567 64527 65099 64954 64627 64861 65725 66710
65533 66710 67524 68331 69277 70219 70933 71251 70995 70073 68651 66985 65208 63515 62376 62201 62850 63779 64572
65516 64572 65071 65182 64974 64823 65070 65547 65801 65700 65483 65334 65311 65608 66395 67409 68091 68207 67983 67678 67379
65497 67379 67234 67461 67997 68414 68292 67506 66228 64867 63934 63736 64220 65240 66734 68413 69587 69725 68955
65480 68955 67670 65975 64033 62588 62413 63385 64708 65969 67226 68183 68188 67214 66116 65561 65295 64695 63572
65463 63572 62209 61059 60613 61097 62105 62881 63085 62921 62597 62228 62214 63002 64348 65481 66163 66813 67437 67313
65445 67313 66112 64555 63448 62766 62212 61984 62384 63227 64210 65319 66323 66508 65649 64692 64645 65227 65452 65108
65427 65108 64793 64783 64876 65181 65989 66840 66716 65433 64011 63374 63434 63711 64127 64689 65023 64832 64494 64691 65633
65408 65633 67027 68588 70209 71758 73097 74246 75236 75814 75624 74769 73971 73967 74804 75875 76629 77026 77236
65391 77236 77187 76772 76402 76853 78385 80401 82212 83774 85376 86987 88410 89858 91788 94192 96527 98424
65375 98424 100072 101894 104246 107478 111829 117021 122247 126794 130474 133374 135487 136754 137252 137120 136397
65360 136397 135029 132855 129644 125403 120735 116522 113128 110174 107289 104695 102757 101292 99760 97971
65346 97971 96174 94528 92953 91521 90483 89762 88833 87368 85688 84274 83090 81795 80433 79480 79168
65331 79168 79244 79425 79701 79953 79721 78747 77510 76803 76883 77391 78008 78712 79377 79605 79266 78859 79053 79995 81341
65312 81341 82808 84354 85885 87076 87656 87721 87593 87332 86508 84626 81791 78778 76338 74550 73040 71623
65296 71623 70405 69393 68449 67687 67479 67909 68570 69073 69405 69590 69405 68763 68008 67433 66825 65969 65359 65772
65278 65772 67196 68760 69814 70527 71262 71884 72059 71871 71688 71571 71196 70352 69209 68062 67031 66103 65250
65261 65250 64409 63476 62478 61650 61207 61084 61047 61056 61288 61732 62012 61789 61175 60488 59800 59041 58472 58565 59336 60198
65241 60198 60703 61093 61832 62847 63572 63581 62889 61756 60536 59744 59871 60957 62424 63472 63638 62975 61805
65224 61805 60414 59053 58103 57970 58614 59398 59718 59714 60000 60719 61313 61350 61089 61038 61358 62032 63161 64667 66020
65205 66020 66800 67334 68220 69305 69726 69043 67868 67174 67273 67693 67865 67741 67699 67956 68162 67817 67057 66688 67241
65186 67241 68360 69394 70245 71170 72067 72570 72752 73092 73702 74095 73842 73033 71957 70790 69758 69159 69001
65169 69001 68874 68363 67321 65705 63542 61221 59418 58477 58161 58145 58387 58771 58817 58210 57393 57209 57973 59217
65151 59217 60342 61258 62347 63883 65631 67013 67727 68004 68059 67547 66059 64131 63079 63543 64729 65493
65135 65493 65664 65796 65969 65641 64580 63305 62477 62283 62517 62828 62785 62108 61076 60399 60513 61191 61936 62504
65117 62504 62955 63476 64304 65539 66827 67524 67478 67443 68402 70511 72971 74893 76055 76880 77919 79424 81242
65100 81242 83098 85043 87601 91304 96141 101549 106811 111290 114457 116146 116843 117388 118209 119070 119588 119716
65084 119716 119557 119106 118381 117469 116174 113952 110601 106744 103164 99918 96605 93356 90850 89335 88285
65069 88285 87222 86249 85457 84372 82477 79891 77069 74177 71288 68917 67692 67437 67147 66159 64984 64700
65053 64700 65637 66943 67471 66949 66130 65826 66045 66207 65960 65390 64549 63350 62056 61367 61699 62730 63892
65036 63892 64933 65688 65773 65084 64316 64365 65300 66400 67108 67449 67558 67314 66555 65282 63601 61820 60605 60587
65018 60587 61661 62985 63804 64047 64060 64092 64138 64034 63633 63063 62833 63387 64487 65335 65416 65030 64901 65421 66372
64999 66372 67266 67912 68665 69989 71756 73229 73934 74257 74877 75895 76960 77943 78916 79665 79883 79787 79818 79746
64981 79746 78767 76689 74317 72364 70639 68703 66796 65595 65394 65938 66774 67442 67585 67314 67244 67820 68714
64964 68714 69196 68945 68285 67717 67447 67268 66777 65795 64644 63831 63473 63307 63258 63560 64255 64975 65427 65683 65829
64945 65829 65718 65317 64893 64608 64324 64093 64393 65499 66949 67940 67984 66990 65205 63446 62789 63464 64456 64795
64927 64795 64788 65292 66179 66427 65659 64645 64120 63849 63186 61958 60483 59105 58082 57586 57508 57440 57114 56727 56621
64908 56621 56768 56847 56848 57342 58924 61364 63537 64383 63846 62689 61552 60615 60066 60183 60680 60625 59514 58037
64890 58037 57233 57191 57247 57218 57697 59073 60861 62226 62770 62654 62275 61980 61863 61693 61193 60385 59561 59020 58985
64871 58985 59587 60608 61380 61337 60623 59832 59219 58540 57675 56979 56896 57468 58374 59258 59984 60673 61499 62394 63072
64852 63072 63474 63870 64309 64320 63598 62721 62595 63249 63787 63587 63029 62868 63277 63727 63640 63048 62771 63782 66144
64833 66144 68666 69925 69501 67948 65953 64086 63036 63168 63775 63603 62346 60982 60426 60582 61028 61787
64817 61787 62839 63543 63311 62508 61976 61931 61969 61992 62374 63154 63689 63375 62291 60863 59243 57388 55577 54465
64799 54465 54440 55173 56014 56745 57675 59023 60539 61847 62822 63427 63534 63216 62875 62654 62105 60992 60075 60301
64781 60301 61360 61954 61561 61058 61394 62461 63599 64398 64570 63824 62515 61795 62436 63901 65122 65719 65911
64764 65911 65772 65345 65084 65378 65839 65825 65468 65432 65851 66281 66609 67137 67734 67758 67040 66191 65621 64949 63815 62692
64744 62692 62370 62961 63919 64812 65663 66591 67455 67921 67752 67026 66089 65208 64344 63399 62612 62439 63003 63933 64747
64725 64747 65151 65005 64333 63506 63084 63287 63785 64139 64302 64583 65244 66176 66913 67083 66925 67075 67579 67493 66054
64706 66054 63964 62697 62574 62453 61578 60734 60959 61932 62508 62335 61999 61869 61744 61558 61536 61577 61313 60996 61495
64687 61495 63032 64591 65100 64668 64081 63533 62618 61381 60619 60920 61894 62650 62775 62617 62714 63178 63655 63816
64669 63816 63748 63749 63781 63395 62401 61393 61300 62374 63928 65100 65624 65730 65580 65114 64343 63510 62835 62336 62024
64650 62024 62109 62792 63819 64532 64470 63824 63097 62506 62014 61892 62757 64819 67398 69501 70733 71330 71536 71394
64632 71394 71140 71305 72244 73854 75877 78160 80414 82082 82815 82978 83368 84424 85877 87133 87795 87820 87374
64615 87374 86665 85840 84964 84053 83105 82171 81437 81202 81615 82465 83363 84130 84800 85304 85429 85195 84959 84977 85070 84939
64595 84939 84619 84409 84558 85158 86176 87307 88005 87932 87266 86374 85338 84159 83210 83058 83785 84861 85813 86727
64577 86727 87943 89406 90538 90791 90307 89899 90230 91079 91677 91713 91589 91622 91594 91407 91585 92534 93741 94412 94577
64558 94577 94835 95233 95292 95105 95444 96576 97818 98578 99082 99650 99955 99595 98850 98323 98159 98173 98386 98875 99304
64539 99304 99168 98400 97306 95968 94098 91502 88451 85608 83677 82952 83018 83012 82352 81031 79255 77171 75119
64522 75119 73664 72975 72531 71754 70673 69643 68790 68147 67923 68082 68008 67184 66056 65556 65879 66349 66509 66623
64504 66623 66975 67284 67169 66776 66569 66715 66955 67028 67019 67252 67838 68405 68456 68077 67983 68657 69722 70439 70542 70205
64484 70205 69487 68427 67484 67258 67703 68206 68497 68912 69625 70166 70029 69371 68785 68677 69077 69843 70799 71773 72651
64465 72651 73310 73577 73523 73757 75010 77335 80066 82572 84637 86046 86442 86006 85772 86737 88795 90932 92288
64448 92288 92728 92567 92243 92202 92756 93884 95350 96955 98526 99745 100251 99984 99280 98607 98320 98630 99644
64431 99644 101309 103337 105272 106800 108053 109531 111598 114136 116829 119603 122451 124956 126419 126644 126230
64416 126230 125983 126343 127444 129248 131307 132798 133235 132928 132426 131762 130652 129184 127762 126414 124698 122393
64400 122393 119883 117716 116063 114727 113429 111981 110395 108957 108048 107800 107982 108191 108003 107061 105396 103686
64384 103686 102773 102715 102586 101510 99675 98083 97432 97611 98196 99000 99963 100773 101001 100643 100290 100587 101533 102477
64366 102477 102874 102979 103641 105418 108028 110740 113147 115396 117722 120042 122139 124047 126008 128044 129840
64351 129840 131202 132447 134172 136665 139721 143015 146385 149683 152563 154699 156223 157789 160153 163721
64337 163721 168444 173997 180019 186345 193194 201148 210838 222571 236291 251954 269878 290538 313965
64324 313965 339525 366449 394477 423645 453401 482164 507951 529239 544986 554068 555253 548068
64312 548068 533496 513562 490166 464437 437042 408792 380722 353683 328107 304222 282370
64301 282370 262953 246102 231577 219066 208465 199717 192442 186018 180126 175015 171019 167943 165212
64288 165212 162592 160413 158950 157915 156835 155656 154608 153574 152043 149756 147020 144224 141382 138451
64274 138451 135807 134015 133102 132350 130932 128647 125998 123679 122017 120876 119958 119094 118237 117307 116277 115380
64258 115380 115019 115386 116304 117500 118847 120293 121797 123461 125418 127364 128548 128591 128158 128376 129625 131348
64242 131348 133057 135016 137649 140658 143210 144914 146274 147996 150045 151589 151955 151478 151183 151600 152178
64227 152178 152057 151209 150430 150298 150612 150998 151683 153281 155988 159328 162726 166050 169535 173396 177741 182757
64211 182757 188813 196288 205389 216174 228617 242577 257891 274716 293687 315393 339633 365487
64199 365487 392335 420576 450981 483255 515343 544166 567068 582731 590957 591716 584670 569789
64187 569789 548272 522380 494198 464891 435239 406335 379297 354569 331992 311379 292619
64176 292619 275391 259286 244255 230624 218668 208379 199490 191479 183817 176571 170494 166044 162561
64163 162561 159057 155592 153068 151702 150600 149042 147402 146419 146213 146484 147078 147796 148108 147602 146520 145412
64147 145412 144526 143911 143784 144305 145144 145715 145788 145557 145221 144797 144237 143469 142421 141171 139950 138850 137741
64130 137741 136674 136054 136133 136592 136967 137271 137839 138728 139637 140299 140624 140562 140160 139757 139889 140960 143012 145615
64112 145615 147961 149477 150565 152361 155431 159186 162963 167160 172601 179119 185659 191743 198015 205139
64098 205139 212834 220308 227161 233562 239939 246797 254520 262970 271435 279258 286422 293366 300378 307367
64084 307367 314209 321212 329174 338870 350341 362717 374888 386281 396869 406515 414617 420340 422955
64071 422955 422006 417469 409887 400077 388626 375808 362028 348109 334993 323293 313190 304634 297508
64058 297508 291622 286649 282211 278176 274865 272753 271918 272003 272831 274692 277774 281662 285724 289765 293839
64043 293839 297633 300521 302206 302876 302800 302187 301399 300775 300142 298887 296664 293756 290744 288120 286201 285008
64027 285008 284194 283400 282687 282303 282126 281861 281747 282475 284313 286830 289618 292698 296117 299796 304051 309580
64011 309580 316504 324004 331458 339390 348669 359141 369728 379745 389511 399825 411379 424558 439254
63998 439254 454807 470626 486912 504457 523721 544453 566158 588554 611609 635612 661330
63987 661330 689664 720907 754619 790376 828375 869132 912917 959858 1010538 1066132 1127872
63976 1127872 1196575 1272902 1358056 1454090 1563550 1689107 1833797 2001462 2196596 2423711
63966 2423711 2687091 2991037 3339584 3735328 4178505 4667356 5199154 5770653 6377863
63957 6377863 7015791 7678031 8355800 9036985 9706367 10347035 10941873 11474608 11930953
63948 11930953 12299915 12574346 12750074 12824429 12795481 12662518 12427177 12094382 11672584 11173393
63938 11173393 10610967 10001180 9360246 8703007 8041970 7387704 6749673 6136216 5553926
63929 5553926 5007755 4501924 4040179 3624692 3254946 2928159 2640790 2389482 2170779
63920 2170779 1980655 1814884 1669954 1543442 1433366 1337315 1252467 1176489 1108192 1047116
63910 1047116 992600 943435 898252 856008 816188 778860 744484 713211 684254 656230 628310
63899 628310 600808 574554 549979 526964 505224 484491 464535 445362 427305 410638 395194
63888 395194 380660 367115 354867 343787 333232 322761 312568 303082 294439 286598 279599 273326
63876 273326 267234 260813 254346 248788 244729 241762 239027 236097 233080 230110 227151 224321 222033 220651
63862 220651 220184 220448 221392 223048 225211 227331 228827 229459 229391 228902 228071 226758 224861 222469 219683 216439
63846 216439 212725 208898 205458 202339 198786 194185 188859 183696 179161 175075 171327 168312 166402 165310
63832 165310 164263 162645 160280 157317 154146 151309 149169 147636 146405 145352 144479 143547 142163 140274 138258
63817 138258 136371 134450 132363 130491 129381 129018 128764 128031 126849 125727 125137 125135 125307 125060 124062 122485 120759
63800 120759 119158 117702 116361 115196 114291 113708 113470 113445 113283 112669 111678 110723 110132 109878 109709 109339 108551 107361
63782 107361 106104 105091 104187 102995 101533 100415 100194 100808 101817 102931 104039 105053 105958 106862 107736 108306
63766 108306 108407 108214 107870 107159 105910 104421 103131 102092 101228 100833 101164 101728 101711 101115 100741 100945 101209 101213
63748 101213 101562 102832 104545 105768 106386 107072 108217 109578 110911 112334 113968 115753 117723 120024 122575
63733 122575 125107 127644 130509 133640 136353 138214 139810 142153 145337 148305 150149 151307 153080 156000
63719 156000 159088 160909 161118 160667 160518 160576 160053 158571 156540 154531 152622 150460 147761 144624 141477 138797
63703 138797 136865 135698 135143 134938 134687 133953 132546 130711 128897 127363 126134 125192 124519 123942 123205 122342
63687 122342 121821 122183 123583 125730 128155 130454 132427 134141 135811 137527 139159 140652 142220 144038 145825
63672 145825 147110 147908 148752 149852 150574 150092 148325 145839 143054 140079 137290 135378 134555 134233 133842 133607
63656 133607 134068 135153 136258 137070 137756 138433 139035 139800 141354 144045 147505 151062 154400 157743 161610 166445
63640 166445 172222 178387 184517 191031 198820 208090 218061 228037 238255 249327 261297 273698 286168
63627 286168 298426 309777 319258 326335 331138 333967 334928 334041 331426 327390 322564 317966 314605 312939
63613 312939 312786 313673 315017 316000 315667 313319 308819 302561 295240 287556 279988 272856 266551 261387 257089
63598 257089 252835 248229 243926 240898 239343 238817 239141 240376 241973 242918 243053 243544 245476 248490 251300
63583 251300 253159 254301 255319 256782 259290 263186 268045 272922 277301 281568 286496 292632 300237 309404
63569 309404 319917 331151 342330 352812 361980 369021 373136 374066 372313 368767 364135 358781 353037
63556 353037 347528 343030 339969 338172 337181 336673 336443 336087 334990 332778 329592 325789 321464 316446 310681
63541 310681 304425 298027 291717 285648 279905 274333 268503 262107 255344 248736 242509 236333 229730 222666
63527 222666 215659 209366 204065 199479 195051 190440 185808 181617 178255 175890 174526 173937 173600 172972 171915
63512 171915 170697 169580 168604 167772 167095 166380 165343 164105 163220 162927 162730 162126 161469 161640 162969 164989 167237
63495 167237 169757 172677 175771 178776 181896 185625 190091 194700 198500 200904 202158 203067 204148 205164
63481 205164 205641 205635 205640 205782 205641 204933 203994 203337 203153 203530 204779 207045 209767 211979 213176 213553 213506 213322 213383
63462 213383 214136 215595 217211 218582 220104 222564 226208 230523 234945 239483 244582 250602 257527 265008
63448 265008 272621 280250 288273 297178 306970 317313 328358 341055 356237 373638 392170 410897
63436 410897 429249 446464 461494 473632 482707 488620 491210 490709 487796 482987 476592 469515 463341
63423 463341 459050 456159 453738 451711 450325 448828 445723 440335 433184 424758 414846 403392 391190 379235
63409 379235 367865 356941 346442 336498 327174 318589 310994 304521 299143 295062 292759 292391 293480 295457
63395 295457 298201 301786 306141 311308 317674 325466 334260 343436 352940 363170 374261 385867 397521
63382 397521 408801 419267 428749 437735 447071 457136 467490 477278 485702 492161 496312 498164 497939
63369 497939 495825 492079 487309 482337 477704 473542 469983 467375 465882 465052 464007 462043 458951 454771
63355 454771 449398 442502 433834 423605 412529 401439 390816 380663 370790 361258 352604 345533 340283
63342 340283 336281 332519 328227 323101 317122 310553 304095 298552 294114 290276 286581 283068 279815 276565
63328 276565 273270 270624 269449 269694 270515 271243 271846 272593 273857 276196 279971 284703 289282 293008 296054
63313 296054 298789 301214 303279 305164 306775 307366 306229 303544 300083 296220 291733 286505 280917 275467
63299 275467 270390 265793 261798 258395 255383 252630 250229 248244 246552 245130 244308 244426 245203 245648 244821
63284 244821 242690 240225 238579 238110 238227 238158 237751 237381 237213 236902 236140 235236 234878 235439 236673 238059 239259
63267 239259 240286 241379 242694 244058 245133 245928 246967 248704 250947 253228 255637 258744 262658 266654
63253 266654 270025 272883 275760 278797 281795 284870 288539 293124 298445 304139 310044 316316 323406 331879
63239 331879 341858 352634 363088 372651 381728 391306 402407 415761 431477 448803 466500 483654
63227 483654 500094 516060 531802 547539 563547 580053 597155 614839 632913 651033 669106
63216 669106 687650 707401 728558 750699 773313 795884 817377 836248 851306 862222 869011 871432
63204 871432 869150 862055 850153 833629 813403 791204 768546 745913 723353 701528 681616 664386
63192 664386 649934 638191 629157 622627 618244 615893 615712 617711 621736 627795 636099 646734 659566
63179 659566 674375 690745 707908 725131 742298 759830 778065 797023 816658 836859 857180
63168 857180 877054 896408 915603 934659 952919 969706 984862 998309 1009409 1017138 1020843 1020511
63156 1020511 1016345 1008326 996359 980791 962641 943111 922811 901630 879515 857144 835643 815888
63144 815888 798421 783762 772154 762986 755081 747813 741528 736642 732710 728699 723859 718000 711177
63131 711177 703543 695442 687294 679304 671445 663772 656618 650434 645492 641755 639021 637134 635957 635192
63117 635192 634483 633851 633792 634651 636057 637290 638084 638712 639429 640277 641342 642615 643515 643237 641818 640377 639964
63100 639964 640571 641603 642869 644605 646867 649422 652079 654693 656923 658411 659188 659659 660218 661061 662244
63085 662244 663647 665074 666637 668858 672051 675822 679611 683492 687948 692930 697715 701744 705106 708083
63071 708083 710742 713219 715964 719374 723450 728082 733403 739609 746728 754830 764209 774988 786740 798904
63057 798904 811539 825362 841111 859129 879475 902074 926743 953349 981925 1012397 1044274
63046 1044274 1077027 1110689 1145539 1181089 1216062 1249738 1282746 1315934 1348916 1380501 1410318
63035 1410318 1439181 1467900 1496659 1525757 1555922 1587168 1617922 1646084 1670702 1691917 1709492
63024 1709492 1722154 1728474 1727719 1719605 1703814 1680251 1649545 1612919 1571616 1526595 1478679 1428831
63012 1428831 1378338 1328819 1281999 1239304 1201551 1168914 1141114 1117772 1098831 1084714 1075977
63001 1075977 1072703 1074339 1080175 1089974 1104040 1122566 1144921 1169732 1195871 1223228 1252221 1282685
62989 1282685 1313735 1344764 1375918 1407240 1437981 1467375 1495615 1523273 1549971 1574418 1595642
62978 1595642 1613257 1626393 1633221 1632006 1622071 1603478 1576468 1541677 1500336 1453607 1402078 1346399
62966 1346399 1288113 1229186 1170851 1113432 1057212 1002883 951138 902348 856882 815352 778178
62955 778178 744991 714745 686557 660394 636846 616147 597598 580098 563143 547036 532222
62944 532222 518780 506616 495646 485660 476360 467760 460191 453618 447341 440688 433758 427095 420931
62931 420931 415189 410012 405751 402372 399276 395810 391775 387386 382900 378325 373480 368445 363896 360680
62917 360680 358903 357741 356310 354396 352143 349559 346797 344500 343241 342739 342156 341039 339516 337815 336224
62902 336224 335369 335694 336568 336591 335098 332774 330547 328417 325799 322562 319233 316394 314307 313019 312496 312627
62886 312627 313216 313866 313970 313163 311938 311320 311688 312281 312258 311865 312043 313148 314711 316340 318108 319853 320788
62869 320788 320345 319028 317930 317525 317396 317050 316546 316198 316008 315585 314484 312511 309902 307284 305222 303653
62853 303653 302001 300003 298205 297313 297318 297653 297996 298414 298710 298288 296930 295247 294030 293472 293309 293414 293788
62836 293788 294153 294049 293381 292625 292406 293031 294347 295873 297076 297744 298124 298643 299519 300631 301674 302394 302876
62819 302876 303631 305120 307100 308791 309922 311223 313543 316820 320329 323614 326650 329316 331464 333504
62805 333504 336271 340089 344464 348897 353553 358924 365274 372746 381628 392040 403541 415511 427946
62792 427946 441565 457057 474501 493649 514638 538130 564769 594745 628042 664872 705526
62781 705526 749882 797562 848647 903596 962126 1022648 1083335 1143410 1202726 1260342 1314242
62770 1314242 1362447 1403701 1436933 1460765 1473973 1476106 1467481 1448870 1421303 1385709 1342649 1292843
62758 1292843 1238100 1181092 1123827 1066775 1009875 953911 900287 849758 802060 756775 714043
62747 714043 674366 638140 605476 576164 549612 525014 501794 479921 459808 441959 426640
62736 426640 413705 402620 392651 383150 373865 365078 357333 350881 345535 341226 338422 337575 338304 339606
62722 339606 340928 342548 344868 347920 351755 356727 362996 370236 378253 387568 398878 412243 427252
62709 427252 443786 462134 482553 505237 530627 559307 591548 627296 666579 709587 756444
62698 756444 807240 862200 921323 983767 1047901 1112003 1174627 1234355 1289630 1338944 1380845
62687 1380845 1413719 1436034 1447068 1447135 1436937 1416925 1387447 1349209 1303332 1251162 1194288 1134616
62675 1134616 1074057 1014083 955666 899501 846107 795722 748397 704280 663743 627093 594221
62664 594221 564624 537813 513586 491846 472191 453952 436701 420601 406086 393256 381732
62653 381732 370990 360689 350702 341082 332043 323853 316605 310147 304256 298824 293817 289128 284534 279875
62639 279875 275260 271050 267508 264553 261990 259936 258641 257830 256613 254494 252192 250950 251027 251366 250923
62624 250923 249850 249087 249128 249658 250264 250988 252009 253148 254004 254536 255208 256524 258545 261054 264112 268239
62608 268239 273941 281145 289237 297662 306401 315903 326659 338963 353038 369207 387797 408829 431974
62595 431974 456937 483769 512664 543483 575611 608200 640321 670914 698941 723689 744673
62584 744673 761180 772246 777366 776940 771727 762050 747878 729460 707462 682605 655637 627739
62572 627739 600405 574601 550266 526853 504230 482888 463444 446143 430756 416754 403571
62561 403571 390869 378671 367304 357223 348733 341678 335360 328975 322251 315648 309873 305237 301447
62548 301447 297839 293822 289318 284894 281346 278992 277423 276025 274684 273852 273987 275089 276825 278994 281748
62533 281748 285335 289669 294284 298811 303504 309203 316756 326509 338303 351790 366693 382962 400989
62520 400989 421629 445679 473082 502794 533753 566034 600765 638779 679492 721250 762548
62509 762548 802587 840786 876210 907585 933613 953116 965246 969850 967463 958700 943723 922543
62497 922543 895751 864724 831055 795892 759819 723286 687097 652399 620009 589813 561171
62486 561171 534024 509299 487984 470084 454749 441135 428775 417390 406868 397387 389177 382161
62474 382161 376139 371164 367291 364099 361013 358088 355899 354597 353707 353052 353187 354571 356915 359833 363596
62459 363596 368597 374472 380494 386670 393634 401339 408601 414322 418744 423011 427641 431810 434146 434009
62445 434009 431881 428589 424332 418579 410942 401959 392862 384586 377108 369722 361833 353469 345148 337368
62431 337368 330388 324479 320136 317679 316693 316255 315921 316137 317436 319553 321769 323959 326806 330938 336296
62416 336296 342437 349085 356149 363497 370969 378482 385921 393080 399900 406660 413714 421027 428154 434708
62402 434708 440675 446156 451005 454937 458021 460754 463423 465540 466293 465622 464518 464032 464240 464470 464381 464441
62386 464441 465402 467686 471413 476727 483862 492910 503559 515078 526837 539138 553346 570718 591111
62373 591111 613354 636939 662664 691281 722207 754189 786759 820139 853855 886320 915961
62362 915961 942079 964330 981992 994334 1001433 1004205 1003665 1000266 993764 983566 969443 952026 932331
62349 932331 910671 886539 859910 832175 805147 779399 754238 729244 705216 683521 665059
62338 665059 649944 637527 626452 615313 603764 592672 582862 574072 565540 557212 549767 543657 538758
62325 538758 534948 532429 531305 531291 532068 533572 535730 538225 540768 543361 546036 548484 550251 551272 551937
62310 551937 552680 553637 554693 555600 556051 555931 555675 556154 557927 560606 563261 565485 567791 570791 574277 577484
62294 577484 580048 582303 584601 586830 588725 590291 591670 592998 594649 597261 601058 605398 609472 613370
62280 613370 618012 624114 631704 640612 650966 663023 676926 692781 710684 730605 752538 776821
62268 776821 803900 833629 865116 897293 929264 960021 988400 1013704 1035982 1055330 1071312
62257 1071312 1083420 1091762 1096813 1098736 1097342 1092439 1083762 1070920 1054106 1034749 1014754 994989
62245 994989 975049 954585 934263 915227 898093 882744 868718 855555 843133 831967 822905 816282
62233 816282 811561 807957 805071 802791 800948 799404 798206 797364 796719 796240 796102 796164 795780 794578 793086 792013
62217 792013 791114 789444 786663 783425 780494 778147 776576 776147 776832 778014 779377 781590 785533 791063 797124
62202 797124 802957 808712 814899 821752 829277 837570 846837 857253 868818 881245 893982 906605 919207
62189 919207 932177 945583 959014 972109 984995 998140 1012008 1026964 1043276 1061035 1080183
62178 1080183 1100695 1122529 1145324 1168455 1191608 1215009 1238739 1261897 1282791 1300001 1313122
62167 1313122 1322595 1329162 1333568 1336478 1338341 1339165 1338355 1334977 1328550 1319784 1310237 1300930 1291460 1280792
62153 1280792 1268769 1256437 1245005 1235020 1226540 1219441 1213254 1207224 1201000 1194992 1189615 1184447 1178605
62140 1178605 1171808 1164580 1157451 1150448 1143463 1136688 1130462 1124919 1119937 1115220 1110391 1105293 1100358 1096436
62126 1096436 1094026 1092829 1092200 1091843 1091888 1092510 1093804 1095918 1099099 1103642 1109986 1118585 1129247 1140599 1150602
62111 1150602 1157716 1161363 1161506 1158450 1153306 1147977 1143991 1141457 1139482 1137266 1134258 1129582 1122250 1112192
62097 1112192 1100439 1088015 1075195 1062207 1049980 1039498 1030741 1023005 1016159 1010911 1007822 1006720
62085 1006720 1007203 1009027 1011792 1014876 1018222 1022685 1029025 1036814 1044865 1052552 1060128 1067856 1075479 1082561
62071 1082561 1088729 1093317 1095347 1094347 1090898 1085975 1079937 1072490 1063492 1053333 1042524 1031235 1019327
62058 1019327 1006589 992839 977949 961856 944529 925983 906479 886609 867031 848156 830239
62047 830239 813616 798485 784523 771136 758155 745910 734484 723428 712520 702403 693874 686771
62035 686771 680074 673079 665937 659029 652340 645678 639065 632600 626157 619498 612569 605514 598506 591713
62021 591713 585269 579150 573156 567183 561424 556229 551857 548368 545589 543169 540887 539007 538057 538129 538670
62006 538670 539035 538934 538222 536698 534513 532358 530733 529201 526882 523509 519498 515114 510225 504989 500115
61991 500115 496103 492692 489356 486061 483223 481144 479825 479142 478976 479226 479887 481091 482984 485644 489101
61976 489101 493246 497741 502309 507123 512565 518492 524204 529349 534450 540182 546485 552842 559172 565923
61962 565923 573426 581702 590873 601147 612270 623504 634446 645519 657426 670359 684037 698277
61950 698277 713246 729278 746746 766023 787250 810156 834304 859576 886177 914158 943194
61939 943194 973001 1003757 1035898 1069561 1104492 1140517 1177879 1217000 1258072 1301162 1346761
61928 1346761 1396068 1450577 1511345 1578748 1653015 1735042 1826648 1929962 2046509 2176862 2321120
61917 2321120 2479645 2653355 2843430 3050753 3275417 3516496 3772102 4039418 4314261
61908 4314261 4590294 4858743 5109236 5331186 5514672 5650741 5732056 5754246 5717011 5623895
61898 5623895 5480995 5295867 5077191 4834537 4577531 4314661 4052664 3796667 3550467
61889 3550467 3316583 3096486 2891278 2702065 2529366 2372358 2229307 2098842 1980324
61880 1980324 1872984 1775516 1687010 1607619 1537493 1475398 1419244 1367910 1321768 1281318 1246131
61869 1246131 1215358 1188518 1165300 1145126 1127475 1112342 1099934 1090150 1082768 1077908 1075880 1076656
61857 1076656 1079780 1084739 1091154 1098760 1107482 1117363 1128122 1138909 1148904 1158047 1166785 1175115 1182420
61844 1182420 1188488 1194286 1201192 1209495 1218059 1225635 1232204 1238653 1245279 1251150 1255140 1257095 1257569 1256825
61830 1256825 1254850 1252205 1249989 1248636 1247409 1245504 1243168 1241285 1240295 1240205 1241414 1244790 1250817 1259083 1268900
61815 1268900 1280199 1293730 1310471 1330915 1354829 1381697 1411372 1444226 1480724 1521124 1565603
61804 1565603 1614362 1667512 1725184 1787944 1856807 1932648 2015913 2107116 2207277 2317635 2439284
61793 2439284 2573465 2721853 2886165 3067742 3267977 3488950 3733198 4002995 4300104
61784 4300104 4625892 4981112 5365575 5778209 6216875 6677292 7151956 7630267 8099241
61775 8099241 8543460 8944841 9283991 9543134 9708671 9772335 9731664 9590273 9357305 9045993
61765 9045993 8672134 8252738 7804387 7341662 6876642 6419317 5977638 5557037 5160638
61756 5160638 4790432 4447982 4133845 3846933 3585057 3346143 3128827 2932061 2754384
61747 2754384 2593654 2447578 2314598 2194042 2085217 1986725 1897062 1815467 1741503 1674022
61737 1674022 1611346 1552490 1497459 1446364 1399016 1355463 1315902 1279757 1245703 1213108 1182703
61726 1182703 1155304 1130505 1107245 1085021 1063948 1044109 1025581 1008641 993295 978904 964901
61715 964901 951496 938975 926652 913382 899042 884745 871508 859293 847478 835756 824344
61704 824344 813671 803995 795134 786540 777857 769344 761534 754570 748209 742469 737926 735256 734600 735395
61690 735395 736767 738151 739559 741077 742138 741626 738768 733578 726375 717392 707050 696023 684621 672579
61676 672579 659922 647471 635956 625142 614567 604759 596824 591038 586656 583058 580254 578228 576633
61663 576633 575309 574342 573290 570974 566502 560161 553028 545970 539213 532552 525754 518920 512557 507084
61649 507084 502294 497612 492869 488465 484774 481771 479248 476940 474396 471219 467657 464570 462598 461679
61635 461679 461395 461387 461308 460829 459990 459236 458896 458846 458802 458571 457914 456581 454752 453124 452274 452146 452266 452175 451504 450018
61615 450018 447873 445501 443052 440277 437207 434576 433212 433248 434199 435522 436786 437597 437822 437777 437886 438302
61599 438302 439079 440433 442415 444526 446180 447557 449537 452715 456823 461226 465659 470297 475347 480859
61585 480859 486886 493633 501318 509871 518848 527849 537063 547312 559416 573586 589508 606904 625851
61572 625851 646643 669480 694350 721121 749649 779688 810632 841505 871372 899625 925620
61561 925620 948206 966118 978965 987399 992171 993499 991698 987937 983706 979710 975848 972232 969610
61548 969610 968635 969229 970996 973847 977782 982226 986100 988634 989825 989988 989122 986984 983581 979205 973969
61533 973969 967752 960754 953770 947516 941936 936615 931761 928241 926637 926789 928452 931915 937677 945952
61519 945952 956829 970621 987647 1007936 1031561 1059047 1090938 1127053 1166622 1209213 1255205
61508 1255205 1305434 1360795 1422221 1490594 1566446 1649969 1741423 1841235 1949573 2065987 2189601
61497 2189601 2319291 2453417 2589469 2724222 2854249 2976339 3087684 3185998 3269459 3336498
61487 3336498 3385811 3416857 3430458 3428903 3415417 3393419 3365951 3335373 3303414 3271459 3240694
61476 3240694 3211728 3183963 3155530 3124138 3088115 3046564 2998677 2943360 2879962 2809309 2733773
61465 2733773 2656246 2579228 2504807 2434910 2371094 2314143 2264230 2221524 2186335 2158584 2137487
61454 2137487 2122068 2111864 2106888 2106902 2111092 2118611 2129271 2143417 2161284 2182870 2208493 2239078
61442 2239078 2275616 2318531 2367807 2423392 2484852 2550503 2617170 2680947 2738114 2785582 2821180
61431 2821180 2844023 2854530 2854004 2844341 2828135 2808432 2787777 2767521 2748288 2730898 2716493 2705939
61419 2705939 2699668 2698185 2702276 2712257 2727003 2743767 2758864 2768590 2769840 2760396 2739104 2706172 2663456
61406 2663456 2614311 2562742 2512219 2464917 2421699 2382586 2347272 2315413 2286742 2261092 2238389
61395 2238389 2218551 2201367 2186578 2174208 2164779 2159003 2157355 2160105 2167740 2181100 2201069 2228338
61383 2228338 2263508 2307127 2359542 2420908 2491421 2571292 2660408 2758285 2864382 2978109 3098385
61372 3098385 3223504 3351475 3479917 3605366 3723297 3829414 3920573 3994020 4046473 4075130
61362 4075130 4079595 4061992 4025025 3970566 3900143 3815819 3719986 3614825 3502498 3385447 3265816
61351 3265816 3144716 3022578 2900334 2779982 2663920 2553857 2450314 2353010 2261746 2176990
61341 2176990 2099587 2029980 1967970 1913242 1865815 1825686 1792284 1764645 1742153 1724871 1713166
61330 1713166 1707224 1707025 1712592 1723985 1740983 1762817 1788294 1816160 1845267 1874433 1902382 1927987
61318 1927987 1950631 1970280 1987285 2002115 2015096 2026314 2035914 2044573 2053378 2062977 2073039 2082863
61306 2082863 2092402 2102394 2113566 2125994 2139158 2152276 2164677 2176194 2187112 2197434 2206330 2212790
61294 2212790 2216674 2218463 2217977 2214128 2206227 2194882 2181197 2165689 2148574 2130623 2113031 2096592
61282 2096592 2081596 2068414 2057625 2049488 2043728 2039852 2037275 2035065 2031964 2026877 2019241 2008942 1996160
61269 1996160 1981353 1965173 1948181 1930750 1913224 1896050 1879682 1864510 1850923 1839395 1830446
61258 1830446 1824543 1822004 1822903 1827117 1834618 1845838 1861778 1883652 1912353 1948203 1991282 2042007
61246 2042007 2101177 2169343 2246331 2331597 2424670 2524546 2628380 2731177 2826936 2909843 2974513
61235 2974513 3016047 3031020 3018845 2982148 2925818 2855451 2776014 2691292 2604354 2518388 2436706
61224 2436706 2361957 2295940 2240528 2198077 2170125 2155803 2152042 2155174 2161731 2167968 2169676 2163206
61212 2163206 2146581 2119614 2083326 2039489 1990407 1938684 1886924 1837318 1791216 1749079 1711084
61201 1711084 1677628 1648906 1624084 1601380 1579176 1556845 1534510 1512375 1490485 1468844 1447479
61190 1447479 1426479 1405997 1386134 1366751 1347526 1328279 1309115 1290329 1272241 1255087 1238840
61179 1238840 1223209 1208024 1193584 1180443 1168906 1158892 1150182 1142601 1136110 1130988 1127721 1126291
61167 1126291 1125611 1124012 1120179 1113312 1102606 1087257 1067194 1043335 1017018 989501 961973 935395
61155 935395 910051 885647 862016 839377 817798 797046 777202 758908 742536 727532 713006
61144 713006 698724 685119 672620 661478 651934 643983 637030 630324 623909 618750 615734 614800 615211 616474
61130 616474 618741 622298 627023 632684 639737 649266 661685 675748 689364 701329 711720 720604 727186
61117 727186 730607 731091 729798 727860 725954 724472 723580 723108 722747 722368 721994 721577 720975 719999 718365 715866
61101 715866 712683 709267 705671 701354 695935 689844 683871 678308 672910 667479 662057 656672 651271 645871
61087 645871 640522 635233 630197 625894 622616 620041 617620 615291 613409 612076 611008 610187 610270 612101 615852
61072 615852 620782 625786 630232 634333 638767 644052 650379 657810 666263 675260 684075 692216 699499 705723
61058 705723 710807 715289 720074 725432 730737 735412 739575 743507 747188 750773 754891 759914 765526 771591
61044 771591 778910 788407 800005 812940 826745 841267 856273 871927 889351 909790 933390 959447
61032 959447 987628 1018178 1051313 1087309 1126951 1171003 1219351 1271381 1326900 1385800 1447133
61021 1447133 1509562 1572738 1637493 1705032 1777011 1856059 1944950 2045112 2156804 2280497 2417124
61010 2417124 2567671 2734458 2923300 3143510 3406111 3723086 4107331 4571295 5126499
61001 5126499 5787430 6576960 7528722 8690744 10134523 11952850 14218755 16911766 19867790
60992 19867790 22805509 25415389 27446328 28751916 29317129 29286798 28960670 28702199 28779761
60983 28779761 29241738 29912569 30494638 30687119 30260300 29094755 27211743 24780334 22068253
60974 22068253 19346980 16810275 14552305 12594710 10921400 9499088 8289254 7258511
60966 7258511 6383180 5645599 5028889 4516043 4091059 3738547 3443248 3191501 2972865
60957 2972865 2779761 2606402 2448657 2304131 2171572 2050388 1940653 1842611 1755678 1678431
60947 1678431 1609508 1547676 1491051 1437502 1386264 1338240 1294272 1253994 1216754 1182670 1152135
60936 1152135 1124951 1100479 1078086 1057089 1036918 1017705 1000133 984367 969778 955953 943177
60925 943177 931578 920584 909673 898892 888168 876903 864764 852188 839589 826738 813460
60914 813460 800227 787496 775199 763537 753521 745859 739867 734260 728532 722783 716659 709503 701364
60901 701364 693045 685195 677990 671544 665980 661055 656252 651254 646072 640873 636033 632097 629341 627600
60887 627600 626752 627002 628341 630199 632040 633831 635499 636489 636561 636529 637372 638874 639893 639761 638702 637019
60871 637019 634724 631991 629344 627247 625935 625604 626313 627751 629545 631730 634570 638055 641980 646219 650394
60856 650394 653510 654602 653691 651637 649228 646952 645392 644940 645040 644366 641838 637049 629816 620128 608647
60841 608647 596525 584444 572400 560590 549918 541252 534618 529416 525105 521429 518317 515850 514115
60828 514115 512956 512106 511590 511685 512364 513071 513159 512348 510798 509104 508167 508584 509964 511228 511763 511987 512679 514145
60810 514145 516166 518434 520707 522804 524643 526216 527465 528369 529199 530397 532065 533777 534972 535384 535098
60795 535098 534416 533719 533177 532539 531391 529607 527383 524930 522371 519814 517138 513833 509537 504746 500453
60780 500453 497058 494098 491175 488543 486499 484705 482562 479974 477348 475065 473277 472062 471409 471102 470889
60765 470889 470758 470903 471413 472110 472704 473070 473389 473955 474859 476002 477452 479538 482361 485450 488258 490772
60749 490772 493195 495208 496103 495637 494229 492274 489775 486717 483310 479761 476307 473543 472064 471523 470666
60734 470666 468671 465975 463425 461212 459121 457321 456161 455315 453841 451194 447764 444306 441073 437659
60720 437659 433612 429107 424871 421329 418019 414241 410118 406464 403594 400935 398033 395200 392794 390608
60706 390608 388575 387409 387643 388488 388598 387788 387048 386887 386755 386312 386287 387485 389604 391691 393374 395025 396964
60689 396964 399172 401698 404744 408177 411443 414247 417030 420384 424126 427360 429585 431407 433862 437191
60675 437191 440675 443713 446581 449844 453318 456134 457802 458763 459689 460597 461035 461044 461431 462858 465015 467129
60659 467129 469185 472048 476164 480670 484249 486500 487882 488513 487853 485648 482392 478552 473947 468398 462465
60644 462465 456959 452013 447251 442601 438339 434447 430540 426507 422697 419376 416459 413894 411827 410106
60630 410106 408035 405015 401298 397846 395506 394466 394320 394403 394095 393078 391472 389722 388256 387240 386578
60615 386578 386111 385720 385254 384459 383162 381532 380036 379063 378718 379004 379955 381483 383339 385431 387956 390956
60599 390956 393937 396307 398064 399660 401236 402469 403202 403697 404056 403862 402788 401238 399995 399408 399252 399254
60583 399254 399358 399576 399999 400886 402394 404253 406098 408094 410707 413756 416368 418167 419980 422772 426301
60568 426301 429472 431816 433839 435925 437641 438398 438194 437372 436180 434933 434267 434711 436152 438031 439938
60553 439938 441849 444034 446966 451052 456155 461717 467643 474707 483767 494941 508036 523354 541498
60540 541498 562745 587363 616274 650510 690120 734541 784070 839827 901721 967138 1032035
60529 1032035 1092544 1145014 1185491 1210511 1218507 1209982 1186531 1150410 1104905 1054158 1002015 951098
60517 951098 902936 858570 818798 784104 754711 730653 711668 697079 686123 678656 675419 677305
60505 677305 684316 695587 710525 729485 753138 781744 815628 855833 903243 957104 1015124 1074874
60493 1074874 1133984 1188886 1234762 1267731 1286614 1292168 1285555 1268462 1244095 1216843 1190886 1169581
60481 1169581 1155712 1151373 1157562 1174629 1203221 1244308 1298174 1363586 1437539 1515191 1590162 1655697
60469 1655697 1705981 1736522 1744032 1726936 1686102 1624627 1546853 1457844 1363193 1268074 1175996
60458 1175996 1088797 1007777 934173 868503 810337 759188 715055 677662 645705 617482 592152
60447 592152 570000 551560 536792 525068 515603 507831 501459 496270 491982 488395 485632 484061 483903
60434 483903 484937 486525 487913 488686 489034 489364 489605 489203 488006 486689 485842 484958 482938 479509 475614 472472
60418 472472 470726 470409 471148 472382 473884 476174 479935 484995 490444 495827 501658 508557 516437 524841 533620
60403 533620 542949 553019 564019 576099 589154 602945 617581 633418 650203 666735 681823 695273
60391 695273 707552 718785 728631 736960 744103 750346 755553 759512 762394 764688 766741 768514 769827 770780
60377 770780 771757 772958 774012 774202 773083 770804 767919 765003 762336 759801 757141 754420 752071 750351 749026
60362 749026 747857 747053 746761 746377 745015 742616 739968 737619 735387 733065 730933 729270 727934 726776 726040
60347 726040 725950 726251 726444 726139 724875 722036 717377 711405 704925 698395 692034 686234 681377 677374 673816
60332 673816 670553 667833 665766 663872 661218 657033 651336 645003 639087 634016 629600 625630 622032 618423
60318 618423 614044 608440 601872 594933 588098 581782 576358 571777 567625 563917 561433 560841 561798 563396 565146
60303 565146 567088 569293 571964 575902 582184 591158 602107 613925 625761 636930 646563 653560 656905
60290 656905 656173 651900 645309 637440 628634 619055 609406 600809 594089 589479 586819 585674 585411 585632 586581
60275 586581 588789 592358 596842 601732 606745 611804 617182 623571 631518 640772 650586 660695 671503 683298
60261 683298 695865 709095 723460 739431 756741 774612 792512 810246 827395 843109 856672
60250 856672 868109 878094 887413 896702 906646 918017 931188 945724 960947 977062 995311 1016697
60238 1016697 1040997 1067581 1096921 1130449 1168797 1210977 1255810 1303655 1356097 1414095 1477142
60227 1477142 1544269 1615225 1690262 1769076 1850509 1933261 2016427 2099087 2179690 2256309 2327492
60216 2327492 2392600 2451262 2502882 2546868 2583032 2611350 2631432 2642663 2645097 2640081 2629777 2616027
60204 2616027 2599622 2580573 2559045 2535977 2512920 2491479 2473112 2459277 2451320 2450022 2455551 2468104
60192 2468104 2488399 2517287 2555046 2601364 2655847 2718140 2787493 2862443 2940900 3020364 3098148
60181 3098148 3171806 3239466 3299533 3350068 3388881 3414496 3426706 3425891 3411970 3384385 3343070 3289034
60169 3289034 3223920 3149422 3067466 2980715 2892398 2805500 2722254 2644402 2573497 2510753 2456908
60158 2456908 2412602 2378727 2356016 2344320 2342640 2349858 2365093 2387273 2414744 2445458 2477238 2507767
60146 2507767 2534695 2556148 2571103 2579160 2580150 2574045 2560969 2541135 2515047 2483998 2450124 2415687
60134 2415687 2382398 2351553 2324469 2302468 2286633 2277853 2276949 2284495 2300671 2325711 2360345 2405558
60122 2405558 2462081 2530478 2611659 2706855 2816974 2942167 3082059 3236148 3403905 3584438
60112 3584438 3775892 3975075 4178027 4381313 4582537 4779253 4967537 5142123 5297957
60103 5297957 5431383 5540141 5622875 5678778 5707250 5707673 5679777 5624361 5543411 5439516 5315454
60092 5315454 5174334 5019732 4855484 4685516 4513830 4344283 4180160 4024172 3878854
60083 3878854 3746584 3629062 3527062 3440871 3370745 3316892 3279348 3258136 3253237 3264153 3289603
60072 3289603 3327808 3376775 3433994 3496081 3559149 3619695 3675030 3722952 3761291 3787941 3801329
60061 3801329 3800850 3786846 3760128 3721483 3671641 3611560 3542465 3465573 3381954 3292817 3199778 3104702
60049 3104702 3009390 2915576 2825222 2740557 2663601 2595563 2536725 2487042 2446929 2417438 2399666
60038 2399666 2394105 2400713 2419463 2450544 2493958 2549000 2614175 2687513 2766956 2850467 2935800 3020222
60026 3020222 3100723 3174694 3240344 3296298 3340996 3372813 3390754 3394733 3385068 3361944 3325460 3276018
60014 3276018 3214546 3142562 3062244 2976383 2888051 2800169 2715206 2635108 2561343 2495087 2437374
60003 2437374 2389107 2350900 2323018 2305557 2298724 2303013 2319030 2347073 2386886 2437956 2500052 2573331
59991 2573331 2657836 2753052 2857871 2970662 3089173 3210607 3332018 3450410 3562373 3664073
59981 3664073 3752229 3825072 3882015 3922463 3945310 3949526 3934820 3901698 3851266 3785164 3705475
59970 3705475 3614617 3515545 3412046 3308462 3208830 3116191 3032535 2959074 2896557 2845624 2807045
59959 2807045 2781538 2769340 2770117 2783231 2807904 2843219 2888315 2942657 3005828 3076830 3153668 3233641
59947 3233641 3313975 3392332 3466959 3536531 3599899 3656110 3704671 3745448 3778050 3801634 3815747
59936 3815747 3821194 3819704 3812999 3802682 3790848 3780049 3772562 3770254 3775288 3790343 3817927 3860017
59924 3860017 3918560 3995589 4092359 4208801 4344349 4498957 4672652 4864230 5070734 5287972
59914 5287972 5510864 5733145 5947274 6145163 6319183 6462666 6569820 6635745 6657139 6633398
59904 6633398 6567110 6463371 6328659 6170251 5995984 5813492 5629138 5447805 5273637 5110527
59894 5110527 4961782 4829826 4716434 4622844 4549481 4496138 4462891 4450531 4459752 4490394 4541938
59883 4541938 4614479 4708519 4823702 4957918 5107289 5266493 5429053 5587764 5735150 5863832
59873 5863832 5967191 6040487 6081492 6089854 6066058 6011415 5928780 5822465 5697003 5556130 5403061
59862 5403061 5241280 5074745 4907305 4742105 4581542 4427806 4283516 4151669 4034765
59853 4034765 3934003 3849536 3781492 3730418 3696735 3680236 3680388 3696792 3728860 3775114 3833311
59842 3833311 3901416 3978057 4061724 4149777 4238616 4324690 4404856 4475768 4533506 4574288 4595437
59831 4595437 4595640 4574806 4534255 4476891 4406693 4327836 4244288 4159627 4076307 3994856 3914247 3833364
59819 3833364 3751944 3670265 3588655 3507756 3428947 3354028 3284425 3220760 3162985 3110701 3063372
59808 3063372 3020227 2979978 2940899 2901578 2861588 2821197 2780707 2740602 2702247 2667680 2638463
59797 2638463 2615216 2598363 2588725 2587177 2594450 2611801 2641344 2685203 2744678 2820670 2914547 3028171
59785 3028171 3163440 3322105 3505188 3711282 3934897 4166303 4392443 4597824 4766028
59776 4766028 4882725 4938887 4932032 4865658 4748627 4594364 4418269 4233839 4050453 3874227
59766 3874227 3709813 3560851 3429374 3315738 3219245 3138720 3072844 3020504 2980956 2953461
59756 2953461 2936861 2929643 2930402 2938185 2952494 2973158 3000138 3033333 3072502 3117435 3168241 3225525
59744 3225525 3290243 3363230 3444910 3535668 3636517 3749090 3874733 4013964 4167122 4335246
59734 4335246 4519889 4722284 4943194 5183460 5443999 5724983 6025241 6342375 6672875
59725 6672875 7011801 7352647 7687895 8009916 8311936 8589160 8839678 9064442 9266500
59716 9266500 9450506 9622682 9790109 9959093 10133985 10317420 10510940 10714685 10926681
59707 10926681 11143065 11359083 11569665 11769416 11952950 12115740 12254510 12366872 12451180
59698 12451180 12507143 12536346 12541920 12527908 12499160 12461497 12421299 12384772 12357810 12346398 12356603
59687 12356603 12393964 12463224 12568687 12714255 12902625 13134699 13410098 13727928 14086475 14482176
59677 14482176 14909215 15359732 15823569 16287522 16735333 17148922 17509904 17800784 18006193
59668 18006193 18114296 18117801 18014620 17808722 17510569 17135655 16701610 16226300 15727838 15224040
59658 15224040 14729569 14252750 13794975 13352303 12916757 12477256 12022097 11542938 11037508
59649 11037508 10509472 9966824 9420300 8881527 8360625 7864598 7397532 6961587 6557359
59640 6557359 6183911 5839560 5522989 5233412 4969686 4729838 4511786 4314298 4136900
59631 4136900 3978875 3838607 3714023 3603573 3506593 3422763 3351278 3290545 3238484 3193049
59621 3193049 3152601 3115980 3082303 3050805 3020930 2992512 2965531 2939551 2913522 2886238 2856850
59610 2856850 2824884 2790049 2752290 2711931 2669542 2625760 2581407 2537644 2495708 2456439 2420100
59599 2420100 2386522 2355241 2325643 2297243 2269906 2243767 2219035 2196009 2175106 2156688 2140918
59588 2140918 2127897 2117849 2111009 2107370 2106650 2108437 2112409 2118625 2127624 2139924 2155257 2172549 2190936
59575 2190936 2210600 2232472 2257365 2285625 2317360 2352669 2391823 2435483 2484544 2539493 2600045
59564 2600045 2665608 2735932 2811157 2891602 2977820 3070517 3169970 3275727 3387255 3504640 3628140
59553 3628140 3757257 3890741 4027381 4166311 4306586 4446828 4585139 4718821 4844092
59544 4844092 4956406 5051188 5124464 5173655 5198586 5201489 5185244 5151555 5101251 5035880 4958084
59533 4958084 4870442 4774856 4673224 4567885 4461230 4355712 4254557 4161674 4080320 4012326
59523 4012326 3958964 3921919 3903040 3903851 3925921 3971132 4040788 4134649 4251373 4389436 4546751
59512 4546751 4719317 4900932 5084370 5262415 5427762 5572670 5689443 5771469 5814059 5814803
59502 5814803 5773557 5692078 5573581 5422666 5245632 5050377 4845255 4637506 4432600 4234852
59492 4234852 4048200 3876027 3720500 3582649 3463123 3362454 3280544 3216620 3170168 3141492
59482 3141492 3130855 3137384 3159398 3195658 3245761 3309369 3385506 3472504 3567945 3668516 3770380
59471 3770380 3870001 3964461 4050985 4126488 4187673 4231289 4254345 4254519 4230679 4183075 4113109 4023088
59459 4023088 3916011 3795267 3664405 3527037 3386465 3245067 3104326 2965754 2831412
59450 2831412 2703134 2581672 2467145 2359897 2260264 2167912 2082289 2003610 1932548 1868977
59440 1868977 1811802 1760037 1713349 1671588 1634607 1602573 1575701 1553585 1535482 1521191 1510889
59429 1510889 1504191 1500428 1499911 1503808 1512500 1525049 1540528 1558603 1578278 1597255 1613288 1625304
59417 1625304 1632658 1634595 1631633 1626662 1623411 1624195 1629845 1640983 1657872 1679223 1702337 1724643 1744570
59404 1744570 1761380 1775334 1788126 1802180 1819212 1839920 1865055 1895957 1933751 1978438 2029119
59393 2029119 2084977 2146043 2213256 2287783 2370144 2460112 2557529 2662759 2776020 2896626 3023383
59382 3023383 3155504 3292799 3435265 3583146 3737413 3899925 4073265 4260630 4465608
59373 4465608 4691457 4940396 5213384 5509944 5827772 6162738 6509583 6862474 7214978
59364 7214978 7560357 7892546 8206746 8499172 8767123 9009816 9228283 9423517 9594958
59355 9594958 9741016 9859948 9949164 10004255 10019890 9991454 9915144 9787355 9605723 9371070
59345 9371070 9087499 8760874 8398406 8009519 7605466 7197184 6793882 6403350 6032081
59336 6032081 5684338 5361865 5065001 4793400 4545549 4318727 4110263 3918361 3741347
59327 3741347 3576964 3423118 3278822 3143838 3017898 2900801 2792753 2693872 2603551 2520771
59317 2520771 2444769 2374978 2310694 2251323 2196811 2147362 2102849 2062739 2026404 1993357 1963624
59306 1963624 1938230 1918772 1905863 1898261 1894127 1893011 1896094 1904789 1919826 1941658 1970789 2007091
59294 2007091 2049073 2094189 2139764 2183584 2224105 2260733 2294167 2326265 2359366 2395520 2436099
59283 2436099 2481777 2532533 2587466 2644640 2701346 2754747 2802367 2842114 2872156 2891020 2897783
59272 2897783 2891952 2873247 2841777 2798541 2745485 2684842 2618490 2548094 2475554 2402813 2331075
59261 2331075 2260593 2191447 2124312 2060252 2000025 1943926 1892159 1845003 1802650 1765133 1732316
59250 1732316 1703689 1678365 1655800 1636564 1621923 1612552 1607937 1607070 1609305 1614547 1623134 1635722 1652792
59237 1652792 1674043 1698720 1726690 1758695 1795245 1835924 1880364 1929451 1984925 2048003 2118948
59226 2118948 2197913 2285669 2383457 2492485 2613780 2748446 2897952 3063936 3247430 3448269
59216 3448269 3665391 3897310 4141465 4393032 4645147 4890535 5122174 5332264 5511841
59207 5511841 5652507 5748257 5795287 5791200 5735697 5631732 5484896 5301767 5089488 4856378
59197 4856378 4611578 4363627 4119647 3885347 3664733 3459773 3271137 3099409 2945127
59188 2945127 2808032 2687230 2582090 2492182 2416448 2353425 2302387 2263370 2235920 2218624 2210024
59177 2210024 2209179 2215068 2226137 2240639 2256649 2271511 2282016 2285522 2280421 2265512 2239868 2203726
59165 2203726 2158748 2106922 2049785 1989029 1927018 1865880 1806442 1748595 1692438 1638644 1588083
59154 1588083 1541513 1499426 1461734 1427802 1397137 1369897 1346455 1326666 1309822 1295273 1282908
59143 1282908 1273121 1266379 1262794 1262104 1264087 1268644 1275293 1283056 1291409 1300946 1312310 1324642 1336033
59130 1336033 1345566 1353996 1362170 1369750 1375953 1380861 1385362 1390224 1395720 1401850 1408564 1415977 1424547 1434717
59116 1434717 1446329 1458801 1471918 1485956 1501036 1517108 1534616 1554214 1575448 1596579 1616378
59105 1616378 1635466 1655256 1676140 1697399 1718464 1739540 1761224 1784141 1808864 1835794 1865295
59094 1865295 1898132 1935326 1977182 2022882 2071480 2122796 2176744 2232204 2287294 2340569 2391178
59083 2391178 2437841 2478338 2510214 2531666 2541645 2539488 2524760 2497464 2458422 2409372 2352550 2290030
59071 2290030 2223478 2154363 2084079 2013888 1945032 1878848 1816351 1757726 1702637 1650998 1602890
59060 1602890 1557820 1514932 1474136 1436219 1401404 1368688 1337190 1307431 1280521 1256567 1234733
59049 1234733 1214579 1196496 1180892 1167611 1156140 1145836 1135855 1125258 1113389 1100113 1085852
59038 1085852 1071527 1058170 1046393 1036400 1028541 1023313 1020537 1019059 1017817 1016901 1017158 1019020 1022185 1026156
59024 1026156 1030695 1035870 1041964 1049166 1057146 1065266 1073457 1082484 1093024 1104994 1118113 1132640 1149009
59011 1149009 1167183 1186988 1208757 1233022 1259852 1289103 1321151 1356788 1396532 1440593 1489306
59000 1489306 1542917 1600802 1661319 1722427 1782162 1838608 1889844 1934029 1969425 1994561 2008647
58989 2008647 2011721 2004289 1987213 1962158 1931598 1897773 1861859 1824471 1786545 1749185 1712926 1677715
58977 1677715 1643434 1610019 1577337 1545535 1515315 1487476 1462430 1440537 1422450 1408478 1398024
58966 1398024 1390419 1386048 1385770 1389377 1395510 1403142 1412298 1423133 1435022 1446925 1458123 1468361 1477682
58953 1477682 1486403 1494930 1503509 1512427 1522407 1534351 1548545 1564560 1582074 1601421 1623155 1647416
58941 1647416 1673999 1702928 1734851 1770954 1812481 1860200 1914327 1974945 2042194 2115658 2193616
58930 2193616 2273161 2351108 2424715 2491815 2550765 2600606 2641509 2675261 2705271 2735537 2769174
58919 2769174 2807892 2852732 2904715 2964555 3032348 3108097 3192362 3286165 3390613 3506879 3636043
58908 3636043 3778561 3934367 4103950 4288816 4490213 4707813 4940177 5185954 5443734
58899 5443734 5710990 5984100 6259476 6534159 6805609 7071782 7331443 7583613 7826419
58890 7826419 8056708 8270608 8463851 8631608 8768615 8869813 8930996 8949448 8924615 8858044
58880 8858044 8752314 8610146 8434730 8230180 8000999 7751557 7486689 7212130 6933248
58871 6933248 6653521 6375010 6099830 5830222 5567696 5313373 5069024 4836529 4616426
58862 4616426 4408233 4212137 4028966 3858475 3699237 3550629 3413438 3287818 3172091
58853 3172091 3064476 2964875 2873890 2791154 2715839 2648149 2588884 2537696 2492828 2452577 2416342
58842 2416342 2384372 2357254 2335642 2319770 2309056 2302486 2299426 2299824 2303856 2311691 2323477 2339154
58830 2339154 2358377 2380917 2407132 2437800 2473595 2514768 2561105 2611950 2666502 2724292 2785198
58819 2785198 2848864 2914442 2981309 3049865 3121371 3197172 3278350 3366020 3461554 3566435 3682099
58808 3682099 3809909 3951095 4106533 4276620 4461569 4661942 4878754 5112643 5362766
58799 5362766 5626688 5901430 6184217 6471993 6760651 7045172 7320199 7579978 7818088
58790 7818088 8027983 8203848 8340738 8434400 8481929 8482757 8438485 8352016 8227498 8070735 7888255
58779 7888255 7685256 7464838 7229115 6980112 6719322 6447571 6166303 5878708 5589223
58770 5589223 5302475 5023109 4755799 4504215 4269841 4052217 3850321 3663438 3490985
58761 3490985 3332143 3185860 3051096 2927084 2813450 2709959 2616071 2530915 2453771 2384289
58751 2384289 2322202 2267092 2218559 2176294 2139798 2108320 2081321 2058863 2041323 2028866 2021231
58740 2021231 2017878 2018296 2022384 2030565 2043341 2060589 2081243 2103370 2124298 2140899 2150263 2150345 2140077
58727 2140077 2119408 2089646 2053249 2012433 1968044 1920306 1870273 1819592 1768907 1717639 1665643
58716 1665643 1614133 1564582 1517564 1473317 1432776 1397336 1367866 1344514 1327272 1316357 1312194
58705 1312194 1315130 1324764 1339205 1355203 1369182 1378036 1379225 1370952 1352702 1325269 1290049 1248768
58693 1248768 1203954 1158897 1116486 1078174 1044197 1014362 988490 966648 949335 937028 929270
58682 929270 924614 921778 920406 920421 921248 922240 923556 926012 930156 935884 942928 951522 962741 978288 999566
58667 999566 1026555 1057463 1089311 1118542 1141321 1154145 1154825 1142869 1119018 1084962 1043670 999222
58655 999222 955598 915450 879969 849427 823555 801787 783541 768325 755678 745360 737586 732608
58643 732608 729994 728826 728694 729972 732887 736879 741147 745463 750128 755449 761381 767431 772884 777523
58629 777523 782104 787656 794370 801744 809786 819286 830781 843999 858567 874628 892422 911926 933134
58616 933134 956127 980695 1006609 1034508 1065741 1100970 1139672 1181383 1226690 1276515 1331197
58605 1331197 1390808 1455666 1525854 1600709 1679363 1761281 1845718 1931108 2015499 2097086 2173767
58594 2173767 2242658 2300746 2345795 2376244 2390736 2388502 2370068 2337170 2292079 2237217 2175105
58583 2175105 2108327 2039555 1971465 1906051 1843924 1784927 1729591 1679333 1634958 1595743 1560366
58572 1560366 1528106 1498809 1472371 1448681 1427514 1408089 1389253 1370254 1350633 1329379 1305337
58561 1305337 1278833 1251741 1225306 1199052 1172548 1147045 1124217 1104140 1085681 1068062 1050738
58550 1050738 1032293 1010954 986272 959399 931796 904432 877969 852785 828822 806021 784813
58539 784813 765628 748146 731604 715656 700413 685981 672524 660468 650020 640710 631869 623342
58527 623342 615378 608214 602182 597723 594742 592402 590086 588186 587472 588134 589878 592453 595632 599213 603549
58512 603549 609522 617538 627107 637810 649865 663219 677013 690688 704711 719266 733067 744536
58500 744536 753473 760425 765019 766202 763902 759285 753467 746843 739556 731793 723666 715443 707679 700598
58486 700598 693670 686354 678808 671296 663493 655144 646865 639405 632496 625260 617418 609406 601641 594321
58472 594321 587589 581291 574969 568578 562626 557179 551574 545652 540346 536322 533095 530348 528979 529593
58458 529593 530943 531341 530877 530865 531706 532736 533682 534796 535833 536234 536109 535906 535472 534555 533774 533893 534549 534965
58440 534965 535454 536888 539004 540644 541452 542058 542738 543178 543434 543949 544699 545339 546002 546975 547957 548702 549960
58423 549960 552622 556343 560139 563943 568280 572877 576964 580698 584926 589737 594440 598709 602588 605704
58409 605704 607725 609226 610997 612844 614209 615333 616616 617626 618171 619562 623042 627569 631001 633035
58395 633035 635146 637988 640782 643119 645455 647849 649880 651782 654149 656793 659400 662856 668145 674371
58381 674371 679741 684096 688461 692574 695247 696972 699821 704630 710506 717112 725082 733983 742223 749433
58367 749433 756689 764092 770354 775231 780089 785490 790503 795010 800407 807172 813918 819776 825667 832271
58353 832271 838682 844140 849284 854675 859720 864086 868687 874329 880775 887848 895998 905092 914094 922650
58339 922650 931594 941342 951200 960742 970443 980567 990909 1001891 1014254 1027545 1040639 1053896
58327 1053896 1068823 1085485 1102427 1119470 1138215 1159242 1181152 1203040 1225666 1249325 1272701
58316 1272701 1294633 1314971 1333023 1347371 1357989 1366356 1372803 1376091 1376440 1376464 1378087 1380805 1384044
58303 1384044 1388816 1395844 1404339 1413893 1425460 1439358 1454401 1470027 1487077 1505532 1523915 1542034
58291 1542034 1561792 1584103 1607529 1631243 1656693 1684794 1714068 1743251 1773410 1805782 1839797
58280 1839797 1874906 1912186 1952472 1994939 2038909 2084833 2132115 2178293 2221919 2264035 2305544
58269 2305544 2345548 2383647 2421302 2459423 2497182 2534662 2574030 2616568 2661211 2707452 2756865
58258 2756865 2810194 2865997 2923790 2985489 3052014 3121665 3193686 3270105 3352035 3437511 3525186
58247 3525186 3616853 3714041 3815401 3919829 4028914 4144009 4264166 4389283 4521878 4663404
58237 4663404 4812261 4967659 5131802 5306057 5488946 5680281 5883147 6099488 6328203
58228 6328203 6570104 6829780 7109660 7407413 7722481 8059981 8424618 8816205 9235116
58219 9235116 9686673 10176008 10704141 11273540 11892110 12567535 13303662 14106901 14989990
58210 14989990 15965202 17041168 18231697 19560799 21054498 22736828 24640840 26816078
58202 26816078 29320610 32217673 35590069 39549867 44226927 49758291 56296883 64021390
58194 64021390 73136683 83891115 96620035 111778786 129942773 151774911 177882804
58187 177882804 208432959 242590358 278176404 311923668 340251181 360108922 369564051
58180 369564051 368127897 356850338 338036308 314537845 288935065 263036606 237827079
58173 237827079 213677225 190631854 168703575 148076768 129099441 112096185 97204521
58166 97204521 84368558 73423232 64151916 56309476 49656599 43994877 39167174 35038691
58158 35038691 31494211 28444074 25814954 23536737 21547125 19801368 18265665 16905292
58150 16905292 15687674 14591056 13600477 12699267 11872279 11112866 10418641 9783732 9201416
58141 9201416 8669813 8187873 7749157 7345882 6975794 6639246 6332759 6051003 5791790
58132 5791790 5553401 5329799 5113939 4903643 4699750 4501326 4307402 4120770 3945138
58123 3945138 3780362 3624440 3477906 3342201 3215884 3096426 2983799 2878800 2779990 2685760
58113 2685760 2597247 2515767 2439577 2366473 2297260 2233293 2172973 2114259 2058364 2007270 1959683
58102 1959683 1913176 1868452 1827748 1790654 1755115 1721087 1689673 1660008 1630422 1601511 1574835
58091 1574835 1549727 1524510 1499656 1476561 1454298 1430752 1406032 1381767 1357913 1333241 1308132
58080 1308132 1283958 1260263 1235345 1209074 1182632 1156091 1128763 1101370 1075460 1051189 1027816
58069 1027816 1005596 984974 964802 943783 922955 904406 888194 872854 858251 845444 834189
58058 834189 822990 811396 800102 789104 777750 766322 755632 745356 734589 723649 713600
58047 713600 704432 695484 687115 680172 674308 668513 662748 657399 651904 645754 640018 635889 632426 627837
58033 627837 622386 617870 614708 611708 608363 605189 602021 598116 593922 590761 588816 587248 586124 586287
58019 586287 587430 588371 589309 591867 596615 602323 607940 613724 620158 627306 635641 646106 659004 673841
58005 673841 690299 708422 728043 749220 772895 799878 829547 860896 894346 930926 970152
57994 970152 1010528 1051910 1095451 1141205 1187656 1233689 1279087 1322756 1362386 1396548 1425752
57983 1425752 1451035 1473028 1492942 1512911 1534443 1557395 1580822 1603626 1623876 1638555 1644692
57972 1644692 1640148 1623203 1592587 1548558 1493345 1430197 1362446 1293334 1225683 1161360 1101553
57961 1101553 1047422 999755 958293 922402 892275 868481 850508 836861 826566 819494 815305 813218
57949 813218 812809 813915 815768 817389 818838 820900 823546 825963 828133 831078 835340 840596 847043 855841
57935 855841 867738 882488 900104 921476 947101 976114 1007100 1038931 1070160 1098394 1120920
57924 1120920 1135511 1140389 1134191 1116580 1088584 1052198 1009987 964868 919400 875003 832277 791866
57912 791866 754414 720089 689090 662322 640443 622476 606669 592654 581373 572814 565314 557384
57900 557384 548787 539395 528460 515788 502452 489564 477271 465514 454682 444830 435201 425366
57888 425366 416070 408254 401968 396869 393011 390480 389039 388829 390745 395360 402046 409753 418101 427096
57874 427096 436444 445850 455439 465172 474302 482101 488719 494677 499850 503592 505565 505890 504682 501871
57860 501871 497299 490734 482145 472219 462219 452989 444530 436706 429767 423731 417966 411984 406293 401894
57846 401894 399277 398347 398947 400853 403562 406674 410330 414820 419839 424502 427991 429896 430128 428909 426792
57831 426792 424447 422359 420695 419282 417685 415623 413440 412006 412148 414293 418485 424292 430899 437838
57817 437838 445690 455548 467851 482283 498621 516792 536025 554956 572992 590841 609412 629042
57805 629042 650309 674728 703828 737967 776544 818777 863442 908154 949574 984286 1009277
57794 1009277 1022261 1022347 1010388 988221 957712 920759 879619 836443 792524 748462 704916 662758
57782 662758 622620 584784 549443 516744 486672 459240 434708 413272 394673 378397 364085
57771 364085 351400 339785 328871 319102 311341 305708 301217 296803 292442 288938 286809 285753 285197 284960
57757 284960 285059 285204 285053 284983 286012 288633 292195 295826 299553 304020 309478 315773 323048 331655 341381 351497
57741 351497 361658 372023 382300 391371 398158 402400 404363 404316 402556 399484 395419 390742 386318 383157
57727 383157 381421 380269 378985 377760 377065 376881 377007 377673 379320 382007 385499 389737 394821 400624 406690
57712 406690 412570 418210 424136 431204 439922 450058 461193 473473 487376 502876 519425 536674
57700 536674 554602 573006 591756 611688 634421 660943 691076 724533 761708 803080 848691
57689 848691 898793 954210 1015468 1082198 1154081 1231768 1316038 1406429 1501377 1599317 1698964
57678 1698964 1798739 1896606 1990456 2078417 2159228 2232940 2301275 2367255 2434898 2508874 2592421
57667 2592421 2683379 2771828 2842372 2879390 2871198 2811952 2702840 2552582 2375528 2187475 2001868
57656 2001868 1828119 1671469 1533542 1413625 1310261 1222020 1147257 1083964 1030295 985025
57646 985025 947374 916586 891807 872216 857191 846350 839379 835868 835554 838736 846042 857597 872849
57633 872849 891403 913589 939901 970434 1005331 1045209 1090454 1140477 1194368 1252017 1313832
57622 1313832 1379523 1447938 1517861 1588092 1656717 1721171 1779228 1829211 1869044 1896000 1907983
57611 1907983 1904706 1887281 1857045 1815164 1763025 1702497 1635786 1565126 1492453 1419196 1346525
57600 1346525 1275771 1208294 1144815 1085145 1028844 975956 926959 882154 841358 804162 770233
57589 770233 739261 710735 683969 658499 634403 612058 591628 573002 556166 541230 528024
57578 528024 516093 505319 496096 488517 481833 475199 468692 463036 458562 455093 452646 451475 451291 451169
57564 451169 450536 449746 449400 449580 450076 450960 452481 454608 457130 460042 463513 467500 471790 476481 482117 489141
57548 489141 497384 506333 515819 526228 537949 550906 564844 579944 596853 616128 637992 662632
57536 662632 690379 721393 755504 792592 832901 876649 923584 973232 1025446 1080315 1137479
57525 1137479 1195801 1253679 1309463 1361510 1408062 1447238 1477202 1496391 1503753 1498914 1482245 1454859
57513 1454859 1418370 1374422 1324521 1270434 1214515 1159054 1105233 1053169 1003082 955855 912201
57502 912201 871871 834162 798887 766378 736872 710418 687200 667396 650734 636609 624705
57491 624705 615191 608267 603710 600891 599161 598306 598678 600761 604680 610355 618045 628170 640572 654589
57477 654589 670187 688397 710206 735587 764094 795830 831202 870158 912364 957772 1006274
57466 1006274 1057099 1109214 1161978 1214611 1265217 1311143 1350265 1381223 1402639 1413014 1411492
57455 1411492 1398051 1373106 1337777 1294448 1245962 1193915 1138470 1080025 1020193 960870 903237
57444 903237 848058 796160 747968 703195 661559 623368 588924 557823 529419 503540 480241
57433 480241 459140 439563 421126 403800 387638 372828 359722 348329 337991 327985 318292 309450
57421 309450 301804 295335 289992 285662 281823 277640 272604 266873 261000 255503 250657 246455 242696 239217
57407 239217 236049 233267 230804 228529 226420 224556 223034 222003 221676 222084 222803 223083 222371 220782 219086
57392 219086 218152 218292 219075 219803 220170 220444 221136 222554 224543 226519 227865 228418 228440 228091 227279 226242 225773
57375 225773 226295 227019 226698 225198 223573 222567 221730 220327 218552 217422 217756 219527 221952 224052 225391
57360 225391 226493 228335 231346 235125 239059 242774 246011 248630 250935 253430 256047 258106 259338 260388
57346 260388 261942 263893 265747 267336 268606 269239 269181 269275 270657 273578 277303 281077 284669 288102 291451
57331 291451 295006 299194 304158 309638 315191 320346 324650 328035 331125 334886 339876 345984 352752 359715
57317 359715 366591 373548 381196 389910 399188 408060 416135 423899 432012 440774 450328 460911 472620 485197
57303 485197 498310 511888 526066 540968 556589 572644 588398 602917 615706 626914 636714 644666
57291 644666 649958 652248 652033 650206 647358 643542 638539 632269 625023 617398 610120 603882 599231 596482
57277 596482 595695 596797 599642 603978 609452 615901 623696 633624 646269 661483 678550 696807 716005
57264 716005 736076 756800 777925 799578 822283 846493 872313 899822 929350 961112 994716
57253 994716 1029562 1065750 1104170 1145508 1189586 1235943 1284555 1335425 1387659 1439613 1490125
57242 1490125 1539236 1587579 1635477 1682849 1729589 1775566 1820356 1863403 1904346 1942698 1976994
57231 1976994 2004833 2024512 2036791 2044673 2051212 2057687 2063936 2069909 2076390 2084347 2094213 2105993 2119683
57218 2119683 2135229 2152281 2170263 2188694 2207270 2225739 2243816 2261212 2277688 2293166 2307865
57207 2307865 2322233 2336644 2351244 2366133 2381531 2397559 2413983 2430418 2446789 2463476 2480984
57196 2480984 2499557 2519023 2538852 2558408 2577427 2596384 2616148 2637041 2658335 2678886 2698351
57185 2698351 2717527 2737413 2758157 2779137 2799846 2820326 2840782 2861210 2881650 2902438 2923892
57174 2923892 2945971 2968562 2992005 3016942 3043595 3071463 3099760 3127985 3156019 3183980 3212054
57163 3212054 3240312 3268538 3296316 3323389 3349949 3376630 3404179 3432999 3462789 3492721 3521959
57152 3521959 3549893 3575793 3598624 3617456 3631801 3641224 3644990 3642763 3635606 3625700 3614891 3603901
57140 3603901 3592946 3582513 3573256 3565637 3560042 3556995 3557027 3560628 3568523 3581584 3600010 3622815 3648515
57127 3648515 3676170 3705445 3735836 3766387 3796361 3825915 3855995 3887783 3922575 3962106 4008625
57116 4008625 4064195 4129836 4205569 4291358 4387769 4495671 4615864 4749538 4898939 5067155
57106 5067155 5257420 5473140 5718638 5999599 6323150 6698364 7136975 7653421 8264629
57097 8264629 8990812 9856916 10892833 12131987 13609921 15363473 17429019 19838940
57089 19838940 22617766 25779397 29324931 33240165 37492595 42027567 46763956 51592905
57081 51592905 56384418 61000387 65304691 69162499 72432694 74966356 76620481 77284222
57073 77284222 76905929 75508375 73185452 70082849 66372381 62229611 57818497 53281941
57065 53281941 48737227 44276688 39972477 35882295 32053292 28523128 25318392 22451760
57057 22451760 19920687 17709583 15794054 14144407 12727862 11511040 10462776 9555535
57049 9555535 8765153 8070814 7456082 6909264 6422015 5987530 5599895 5254099 4945583
57040 4945583 4669680 4421774 4197885 3994821 3810035 3641685 3488713 3350391 3225725
57031 3225725 3113520 3013033 2924270 2847476 2782489 2728827 2686332 2655653 2638549 2638600 2661706
57020 2661706 2714058 2797017 2902609 3014295 3112310 3178250 3196572 3156611 3057492 2911360 2739156
57009 2739156 2561218 2390785 2234060 2093093 1967452 1855150 1754070 1662874 1580512 1505828
56999 1505828 1438265 1378141 1325481 1279129 1237690 1200796 1168751 1141409 1118096 1098365 1082145
56988 1082145 1069377 1060092 1054573 1052891 1054412 1058258 1064112 1072045 1081510 1090784 1097325 1098603 1093143 1081370
56974 1081370 1065393 1047540 1029050 1010175 991035 971924 953167 935222 918790 904374 891844
56963 891844 880885 871656 864521 859399 856031 854840 856758 861809 868252 873435 875294 872856 865623 853012
56949 853012 834698 811438 785295 758764 733605 710556 689904 671843 656215 642452 630157
56938 630157 619567 611225 605567 603097 604652 611018 622373 638277 657845 679454 700492 717865
56926 717865 728821 731224 723660 706110 680547 650233 618149 586221 555799 528059 503600 482079
56914 482079 462713 445086 429276 415344 402917 391340 380158 369411 359452 350546 342765 336141
56902 336141 330629 325841 321159 316384 311962 308359 305542 303405 302383 303039 305222 308258 312118 317851
56888 317851 326540 338072 351208 364661 377804 390311 401328 409235 412422 410338 403736 393955 382235
56875 382235 369712 357605 346946 338213 331505 327052 325317 326640 330905 337586 346194 356992 371365
56862 371365 391127 417109 448449 483263 519481 554837 586569 611795 628152 633988 628603 612988
56850 612988 590078 563561 536299 510051 486191 465996 450343 439779 434716 435061 439972 448848
56838 448848 462517 482763 510841 547185 592217 645951 706180 767789 824276 869506 898264
56827 898264 906884 894748 864915 822593 773127 721363 671622 626862 587928 554366 525984 503282
56815 503282 486791 476673 472843 475031 482974 497081 518561 548210 585032 626333 668720 708345
56803 708345 740626 760998 766579 756966 733737 699908 659695 617605 576913 539138 505071 475634
56791 475634 451413 431976 416418 404460 396529 392867 393095 396797 404205 415956 432214 452044 473513
56778 473513 494177 511457 522882 526505 521475 508274 488360 463626 436126 407913 380651 355218
56766 355218 331766 310188 290501 272915 257686 244922 234457 225937 219051 213520 208821 204240
56754 204240 199433 194816 191099 188506 186674 185248 184306 184155 184854 185945 186639 186406 185538 184921 185075 185581
56738 185581 185665 185128 184405 183904 183690 183708 183867 183897 183526 182833 182107 181356 180320 179020 177928 177497 177839 178897
56720 178897 180534 182338 183796 184850 185954 187317 188475 188936 189003 189601 191387 194291 197776 201312 204728
56705 204728 208338 212617 217640 222990 228395 234152 240532 246967 252288 255840 258015 259561 260716 261263
56691 261263 261200 260971 260971 261098 261032 260859 261128 262189 263730 265258 266816 268838 271335 273703 275480 276812 277940
56674 277940 278652 278720 278546 278732 279102 278713 277009 274473 271921 269511 266798 263529 260004 256672 253608 250480
56658 250480 246933 243030 239360 236629 234976 233692 231743 228670 224995 221737 219545 218287 217411 216616 216065
56643 216065 216009 216370 216842 217353 218239 219857 222130 224490 226291 227218 227433 227347 227180 226687 225436 223499 221709
56626 221709 220949 221152 221279 220428 218771 217168 216002 214763 212801 210177 207575 205604 204383 203775 203763 204499
56610 204499 206049 208189 210538 212939 215551 218411 221058 222984 224465 226452 229354 232353 234331 235176
56596 235176 235640 236175 236678 237314 238715 240919 242861 243612 243764 244908 247822 251708 255219 257660 258995 259189
56580 259189 258038 255642 252765 250560 249849 250559 251902 253113 253950 254488 254710 254644 254755 255732 257724 260058
56564 260058 261910 263063 263865 264604 265174 265286 264811 263913 262941 262130 261317 260024 257947 255247 252193 248696
56548 248696 244565 240191 236445 233634 230925 227261 222607 217867 213729 210185 207179 204958 203437 201847
56534 201847 199617 197204 195373 193964 192175 190015 188518 188234 188317 187700 186649 186368 187337 188698 189294 188727
56518 188727 187296 185409 183357 181392 179717 178428 177499 176771 176003 175076 174173 173566 173212 172776 172068 171257 170548
56501 170548 169839 168907 167842 167101 167089 167760 168605 169004 168662 167832 167126 167062 167729 168875 170265 171846 173607 175443
56483 175443 177321 179427 181943 184642 187000 188859 190715 193118 195897 198306 199866 200711 201186 201484 201772
56468 201772 202243 202806 203056 202854 202627 202782 203118 203235 203302 203869 204924 205728 205757 205287 204754 203934 202282 199915
56450 199915 197727 196467 196126 196395 197304 198983 201006 202477 202864 202410 201613 200668 199611 198658 197938 197101 195632
56433 195632 193544 191425 189852 189071 189144 189921 190792 190990 190375 189559 189111 189018 189109 189539 190471 191685 192848 193929
56415 193929 194977 195814 196360 197054 198468 200588 202897 205068 207184 209326 211340 213039 214286 214898 214732
56400 214732 213954 213006 212336 212280 213073 214647 216442 217662 217786 216790 215061 213281 212160 211958 212348 212914 213534
56383 213534 214110 214292 213941 213585 213895 214862 215968 216998 218094 219154 219853 220312 221081 222282 223326 223760 223897
56366 223897 224351 225268 226363 227403 228387 229386 230432 231555 232921 234927 237910 241469 244374 245700 245962
56351 245962 246592 248280 250468 252533 254743 257610 260885 263737 265724 267179 268713 270607 272657 274497
56337 274497 276126 278053 280721 283910 287066 290124 293486 297132 300388 302909 305371 308745 313149 317858
56323 317858 322222 326188 329954 333559 336969 340387 344231 348633 353092 356910 360033 363096 366408 369311
56309 369311 370951 371330 371089 370639 370161 370086 370729 371586 371947 372160 373277 375393 377442 378968 381007 384638 389616
56292 389616 395123 400981 407318 413728 419735 425726 432566 440536 449354 458948 469534 481059 493268
56279 493268 506276 520629 536864 555299 576046 598994 624106 652026 683887 720110 759938
56268 759938 802705 849100 900510 957667 1020715 1090160 1166690 1250129 1339543 1434400 1534712
56257 1534712 1639793 1747613 1855806 1962755 2067291 2167689 2261395 2345667 2418379 2478337
56247 2478337 2525098 2558600 2579057 2587050 2583337 2568464 2542883 2507626 2464351 2414318 2357643 2294045
56235 2294045 2224118 2149392 2071267 1990377 1906954 1821458 1734816 1648243 1562847 1479339 1398308
56224 1398308 1320711 1247624 1179343 1115241 1054767 998148 945874 898124 855047 816910 783303
56213 783303 752777 724064 697344 673652 653402 636174 621554 609363 599185 590383 582522 575295
56201 575295 568302 561471 555345 550304 545891 541637 538176 536560 536658 537184 537311 537370 537943 539154 541039 543803
56185 543803 547407 551501 555986 561219 567562 575113 583775 593133 602441 611411 620870 631937 644593 657782
56171 657782 670868 684181 697985 711764 724807 736913 748217 758840 769059 779431 790564
56160 790564 802962 817198 833971 854030 878293 907944 944053 987379 1038983 1100877 1175676
56149 1175676 1265813 1373412 1500320 1647190 1812179 1990554 2175104 2356747 2525945 2675406
56139 2675406 2802266 2907927 2996384 3072863 3142355 3207271 3266029 3314549 3348927 3366528 3366254
56128 3366254 3349918 3322878 3290867 3255312 3212482 3156766 3083178 2987342 2866296 2721219 2558321
56117 2558321 2386039 2212079 2043203 1885685 1744121 1620341 1514363 1425726 1353202 1294322
56107 1294322 1246492 1208223 1178647 1156469 1140249 1129138 1122476 1119026 1117241 1115949 1114236 1111173
56095 1111173 1106264 1099868 1092667 1084973 1076877 1068658 1060619 1052925 1045896 1040103 1035829 1032800 1030672 1029448
56081 1029448 1029299 1030390 1032962 1037115 1042455 1048410 1054892 1062186 1070383 1079543 1090088 1102168 1114880
56068 1114880 1127106 1138971 1151350 1164132 1176355 1188141 1201004 1215848 1231974 1248473 1265369
56057 1265369 1282858 1300643 1318587 1336929 1355343 1372919 1389693 1407122 1426387 1447196 1468835
56046 1468835 1491422 1515481 1541090 1567999 1595856 1623979 1651782 1679708 1708938 1740085 1773162
56035 1773162 1808668 1847119 1887358 1927006 1965158 2003215 2042625 2083365 2125141 2168416 2213454
56024 2213454 2259917 2308135 2359319 2413751 2470226 2528052 2588033 2650725 2715334 2781265 2849190
56013 2849190 2919625 2991953 3065868 3142401 3222459 3305673 3391569 3480580 3573166 3669306 3769489
56002 3769489 3874805 3985558 4101391 4223075 4352298 4489385 4633441 4785109 4946609
55993 4946609 5118496 5299191 5488604 5689311 5903130 6129585 6369079 6624353 6897183
55984 6897183 7186727 7493054 7819373 8169074 8543609 8945198 9378434 9847221 10353322
55975 10353322 10900007 11493986 12141857 12848286 13619867 14467313 15402113 16435395 17582534
55966 17582534 18864899 20305555 21929048 23768753 25870402 28288227 31087003 34353811
55958 34353811 38202931 42766562 48187638 54624016 62251888 71267602 81908578 94493786
55950 94493786 109454292 127341244 148803181 174443138 204428905 237932330 272778856
55943 272778856 305677516 332973818 351490161 359113434 355132029 340401468 317213714
55936 317213714 288720596 258083939 227788625 199402874 173703852 150923391 130970036
55929 130970036 113603968 98555181 85572291 74425826 64904446 56812315 49960256
55922 49960256 44160987 39240002 35048786 31463593 28377709 25701873 23367247 21319795
55914 21319795 19512601 17906927 16475663 15198803 14056689 13031046 12108964 11280522
55906 11280522 10534114 9857895 9243600 8685175 8175516 7707914 7278657 6884945 6521971
55897 6521971 6184957 5872086 5582464 5313058 5060435 4823711 4602981 4396563 4202472
55888 4202472 4020919 3852677 3696484 3550548 3415050 3290588 3175513 3067293 2965346
55879 2965346 2870354 2782120 2700229 2625368 2557539 2494073 2431471 2368138 2303434 2235635 2163346
55868 2163346 2087940 2012426 1938718 1867767 1801078 1739697 1682473 1627443 1574344 1524052 1476565
55857 1476565 1431456 1389439 1351430 1316801 1284483 1255042 1229740 1208188 1188882 1171410 1156130
55846 1156130 1142187 1128007 1113516 1100028 1088140 1077425 1067907 1059957 1052792 1044864 1035854 1026739
55834 1026739 1017756 1007757 995717 981569 965450 947459 928515 910315 893900 878839 863972 848472
55822 848472 832337 816350 801305 786793 771199 753561 734850 716777 699972 684200 669653
55811 669653 656871 645796 635981 627498 620794 615903 612522 610377 608758 606287 602123 596956 591952 587239
55797 587239 582336 577498 573533 570687 568701 567508 566829 565450 561995 556231 548901 540671 532133 524317
55783 524317 518203 514071 512181 513484 518510 525993 533714 540309 545161 547078 544578 537456 526866 513878
55769 513878 498954 482647 465558 447648 428705 409546 391671 375639 360837 346891 334233
55758 334233 323057 312795 303058 294312 287189 281643 276984 272253 266536 259517 251902 244845 238916 233947
55744 233947 229633 225737 221890 217863 214031 210983 208726 206766 204817 202990 201437 200323 199909 200193 200631
55729 200631 200718 200621 200816 201417 202200 202856 202788 201258 198364 195315 193110 191565 190314 190005 191432 194093 196762
55712 196762 199129 201807 205030 208501 212310 216966 222577 228900 235988 243833 251679 258695 265134 271818
55698 271818 278753 285330 291524 297609 302885 306188 307744 309154 311260 313255 314194 314226 313891 313316 312589 311999
55682 311999 311327 309648 306267 301349 295427 288966 282490 276379 270357 263886 257127 250779 245010 239573
55668 239573 234945 232168 231283 231136 231222 232653 236725 243500 252434 263459 276634 291394 306927 322855
55654 322855 338916 354379 368286 379932 388685 393815 394986 392636 387580 380616 372679 364816 357580
55641 357580 350886 344802 340082 337492 336955 337705 339074 340863 343067 345262 346069 343490 336357 325384 312205
55626 312205 297520 280968 262707 244076 226454 210391 196127 183945 173512 163740 153953 144572
55614 144572 136160 128552 121552 115727 111629 108673 105610 101931 98196 95149 93046 91643 90442 89056
55600 89056 87581 86433 85636 84696 83379 82088 81083 79846 77763 75094 72742 71307 70774 70914 71490 72216
55584 72216 72817 73102 72860 71982 70844 70219 70590 71865 73918 76947 81027 85802 90923 96365 101957 107086
55568 107086 111400 115411 119872 124827 129695 134036 137716 140621 142720 144305 145649 146468 146147 144560 142337
55553 142337 140248 138459 136408 133371 129221 124622 120290 116150 111627 106768 102468 99365 97009 94491
55539 94491 91450 88072 84572 81208 78536 77044 76612 76719 77091 77797 78868 80187 81755 83730 86233
55524 86233 89291 92890 96915 101225 106031 112062 119996 129739 140411 151061 161284 171360 181890
55511 181890 193174 204687 215227 223648 229351 232024 231274 226810 218871 208242 195822 182307 168171
55498 168171 153795 139600 126092 113789 103080 94187 87079 81345 76311 71491 66786 62140 57391
55485 57391 52838 49517 48216 48301 48168 46867 44737 42519 40593 39146 38300 37713 36687 35013 33253 31958
55469 31958 31105 30534 30300 30270 29931 29026 27986 27403 27453 28002 28720 28888 27825 25960 24714 24747 24929 23803
55451 23803 21588 19828 19407 19757 19933 19624 18994 18235 17548 17168 17108 17084 16890 16731 17083 18152 19459 20121
55433 20121 19749 18945 18542 18455 17843 16481 15273 15103 15735 16244 16144 15656 15218 15127 15432 15899 16305 16910 18230
55414 18230 20143 21789 22636 23104 23710 24176 23923 23033 22123 21517 21044 20432 19572 18611 18041 18293 19013 19252
55396 19252 18674 17919 17439 16760 15583 14731 15100 16248 17109 17633 18606 20028 20874 20533 19510 18531 17796 17303
55378 17303 17168 17290 17341 17317 17655 18577 19782 20879 21676 21940 21386 20150 18915 18319 18420 18794 18985 18834
55360 18834 18569 18512 18622 18525 18095 17609 17118 16206 14806 13744 13734 14233 14051 12854 11309 9927 8645 7504
55342 7504 6846 6668 6471 5959 5318 4722 4135 3774 4141 5372 6965 8289 9015 9060 8615 8174 8016 7689 6639
55323 6639 5312 4877 5728 6982 7693 7857 7901 7926 7920 8190 8920 9660 9783 9381 9278 10192 12008 13837 14756
55304 14756 14628 14196 14226 14662 14878 14633 14309 14303 14583 14877 14860 14208 12949 11757 11365 11639 11800 11609 11696 12520
55284 12520 13597 14138 13962 13476 13130 13165 13604 14191 14601 14856 15272 15940 16609 17100 17414 17378 16704 15567 14617
55265 14617 14203 14080 14041 14273 14792 15085 14741 14058 13667 13849 14468 15131 15125 13711 10994 8201 6647 6580 7312
55246 7312 8138 8740 9018 9024 8951 8881 8669 8342 8349 9051 10145 10948 11181 11184 11442 12133 13013 13566 13382 12576 11725 11279
55224 11279 11205 11257 11304 11228 10866 10321 10040 10331 10954 11420 11492 11213 10706 10197 9978 10106 10347 10623 11197 12142 12952
55203 12952 13091 12742 12600 13021 13723 14238 14381 14272 14135 14081 14008 13779 13548 13652 14073 14267 13818 13031 12593 12736
55183 12736 13006 12812 12088 11460 11783 13313 15302 16651 17008 16928 16955 17045 17104 17504 18572 19937 20893 21250 21399
55164 21399 21687 22126 22584 22851 22595 21633 20235 18865 17685 16559 15436 14444 13702 13280 13218 13320 13094 12293
55146 12293 11446 11477 12692 14426 15693 15983 15455 14590 13760 13017 12310 11850 12016 12778 13517 13734 13726 14224 15549
55127 15549 17480 19759 22218 24421 25817 26557 27752 30447 34330 37765 39218 38578 36970 35418 33965
55112 33965 32169 30054 28146 26688 25395 24120 23246 23154 23648 24192 24437 24239 23486 22264 21012 20218 20095
55095 20095 20726 22147 24002 25472 26002 25915 25900 26134 26307 26290 26325 26665 27442 28675 30063 30934 30893 30341 29934
55076 29934 29757 29569 29531 29960 30512 30471 29867 29516 29811 30264 30469 30641 30845 30518 29394 28208 27760 27777 27525
55057 27525 27148 27445 28429 29035 28537 27520 27063 27453 28158 28722 29163 29590 29934 30195 30621 31455 32636 33984
55039 33984 35554 37560 39856 41772 42673 42595 42149 41852 41733 41577 41298 40981 40702 40464 40283 40257 40530 41152
55021 41152 41966 42695 43172 43394 43294 42694 41668 40772 40532 40746 40690 40088 39467 39362 39529 39340 38727 38240 38181
55002 38181 38114 37481 36404 35540 35206 34958 34203 33008 32112 32159 33093 34301 35214 35717 36109 36774 37782 38783
54984 38783 39361 39547 39852 40693 41929 43097 43991 44853 46033 47640 49515 51432 53350 55550 58405 61999
54968 61999 66074 70450 75285 80772 86825 93431 101112 110611 122058 134806 148121 161706 175429
54955 175429 188890 201409 212141 219995 223793 222944 217941 209911 199704 187609 173911 159390 145081
54942 145081 131662 119203 107536 96807 87590 80436 75334 71717 68997 66951 65523 64420 63158
54929 63158 61519 59808 58621 58419 59342 61278 63965 67161 70882 75563 81797 89797 99228 109730 121524
54914 121524 135179 150567 166199 179851 189945 196235 199248 199273 196038 189247 179207 166874 153430
54901 153430 139890 126958 115036 104313 94958 87242 81236 76343 71466 66005 60625 56692 54859
54888 54859 54482 54391 53899 52923 51605 50255 49462 49699 50670 51374 51074 50033 49057 48429 47631 46214 44576 43521
54870 43521 43179 42859 42083 41256 40965 41050 40900 40434 40096 39918 39343 38198 37151 36812 36871 36663 36139 35743 35556
54851 35556 35174 34378 33381 32440 31667 31207 31155 31187 30731 29694 28703 28389 28659 28903 28792 28683 29220 30654 32574
54832 32574 34284 35442 36290 37237 38349 39320 39838 39875 39678 39636 40056 40967 42115 43245 44346 45638 47418
54815 47418 49890 52938 56065 58862 61614 65182 70170 76552 84250 93546 104566 116779 129529 142795
54801 142795 156834 171213 184675 195835 203568 206986 205798 200827 193527 184788 174689 163522 152358
54788 152358 142183 132958 124023 115232 107209 100560 95212 90665 86702 83666 82008 81626 81887 82412 83598
54773 83598 86070 89807 94231 99167 105236 113130 122794 133455 144194 154426 164045 173334 182683 192319
54759 192319 202313 212566 222482 230833 236395 238693 237786 233541 225717 214725 201613 187107 171388
54746 171388 155062 139632 126409 115404 105827 97275 89826 83324 77321 71715 66834 62810 59343
54733 59343 56189 53512 51571 50303 49357 48375 47138 45597 43900 42362 41372 41229 41914 42972 43757 43909
54717 43909 43510 42791 41967 41428 41709 42985 44773 46426 47742 48818 49527 49579 49016 48297 47785 47446 47107 46738
54699 46738 46418 46252 46427 47173 48499 50059 51389 52266 52787 53153 53433 53605 53830 54549 56151 58525 61152
54682 61152 63622 65854 67778 69142 69879 70389 71133 72079 72839 73257 73566 74019 74695 75686 77145 79062 81181
54665 81181 83295 85532 88294 91959 96641 102123 108057 114373 121462 129803 139398 149672 159832 169080
54651 169080 176572 181548 183757 183606 181651 178056 172703 165698 157509 148588 139161 129523 120326 112257
54637 112257 105504 99765 94776 90486 86618 82572 78102 73873 70820 69062 67932 67039 66686 67046 67552
54622 67552 67597 67472 67978 69240 70383 70437 69193 67089 64654 62230 60047 58343 57350 57155 57546 58107 58533
54605 58533 58729 58531 57633 56046 54418 53444 53077 52699 52049 51453 51087 50571 49640 48794 48778 49616 50616 51238
54587 51238 51475 51372 50742 49664 48908 49355 51023 53010 54431 55111 55250 54824 53726 52345 51531 51779 52663
54570 52663 53278 53171 52682 52443 52682 53024 52925 52258 51393 50632 49743 48384 46941 46492 47630 49658 51365 52429
54552 52429 53580 55447 57844 60351 63063 66279 69822 73228 76520 80227 84527 88854 92621 95872
54538 95872 98785 100831 101048 99173 96025 92551 88941 84933 80619 76493 72896 69825 67207 64984 62953
54523 62953 60936 59197 58297 58340 58674 58518 57737 56779 56068 55656 55350 54953 54418 53883 53531 53369 53214 52945 52656
54504 52656 52474 52367 52211 51949 51585 51177 50911 51012 51406 51632 51352 50923 51195 52593 54522 55802 55788 55026
54486 55026 54710 55493 56942 58151 58651 58501 57810 56632 55318 54443 54198 54150 53849 53359 53051 53121 53523 54073
54468 54073 54425 54234 53641 53320 53666 54163 53965 52978 51908 51275 50818 50048 49020 48307 48341 49028 50052 51375
54450 51375 53226 55490 57321 57747 56662 54947 53470 52375 51501 51038 51294 52066 52746 53012 53063 53238 53771
54433 53771 54815 56274 57566 57946 57207 55849 54533 53602 53172 53324 54083 55377 57088 58982 60607 61536
54417 61536 61795 61842 62078 62585 63291 64193 65310 66727 68663 71212 73936 76043 77139 77575 77913 78342 78779
54400 78779 79215 79640 79818 79440 78395 76649 74100 70947 68057 66386 65906 65543 64431 62857 61676 61172
54384 61172 61009 61061 61599 62520 63049 62578 61363 60053 58894 57899 57374 57615 58217 58415 58094 57816 57759 57418 56600
54365 56600 55966 56147 56919 57821 59066 61135 63797 66177 67688 68375 68564 68688 69287 70633 72371 73923
54349 73923 75067 75676 75281 73611 71408 69901 69452 69357 69022 68566 68147 67506 66470 65266 63994 62358 60290
54332 60290 58326 56981 56177 55623 55238 54849 54006 52600 51277 50714 50747 50737 50514 50443 50735 51200 51576 51699 51404
54313 51404 50653 49696 48829 48083 47346 46599 45743 44554 43217 42540 43031 43965 44132 43454 43096 43804 44868 45190
54295 45190 44795 44691 45468 46563 46958 46272 45125 44551 45061 46216 47141 47418 47281 47007 46524 45853 45515 46070
54277 46070 47357 48635 49475 50080 50652 50931 50703 50417 50803 51927 53041 53462 53235 52826 52502 52289 52287 52662
54259 52662 53378 54247 55253 56510 57879 58916 59336 59355 59426 59790 60370 60923 61145 60726 59569 57975 56505
54242 56505 55638 55490 55782 56042 55944 55538 55052 54499 53654 52466 51299 50602 50483 50775 51310 51880 52073 51535 50464
54223 50464 49562 49372 49835 50594 51419 52100 52203 51437 50275 49812 50754 52701 54597 55676 55881 55642 55599 56322
54205 56322 57868 59585 60729 61257 61664 62043 61878 60865 59405 58016 56830 56067 56352 57812 59208 58860
54189 58860 56457 53284 50702 49099 48340 48329 48711 48715 47903 46730 45914 45543 45231 44859 44648 44658 44650 44471 44296
54170 44296 44422 44987 45820 46459 46447 45719 44552 43098 41343 39623 38728 39027 39798 39927 39186 38367 38268 38985
54152 38985 40155 41342 42113 42207 41888 41793 42173 42585 42534 42122 41761 41487 40978 40170 39401 38917 38626 38468 38708
54133 38708 39622 41103 42769 44257 45193 45197 44317 43280 42784 42568 41786 40379 39397 39617 40502 41033 41100 41341
54115 41341 41921 42330 42349 42423 42871 43357 43480 43474 43964 45219 46775 47732 47473 46334 45388 45300 45576 45442 45151 45678
54095 45678 47190 48704 49337 49048 47969 46055 43859 42666 43061 44024 44226 43660 43249 43348 43539 43569 43594 43674
54077 43674 43773 44097 44705 44994 44419 43614 43925 45697 47772 48870 48867 48591 48951 50407 52697 54833 55862 55818
54059 55818 55586 55804 56390 57164 58287 59822 61428 62784 63931 64950 65717 66221 66736 67433 68121 68598 68954
54042 68954 69380 69993 70969 72478 74321 76045 77560 79263 81406 83853 86683 90453 95440 101013 106205
54027 106205 110636 114474 117800 120503 122639 124444 126077 127621 129196 130776 132081 132932 133521 134035 134199
54012 134199 133594 132292 130781 129341 127862 126158 124138 121739 119101 116721 114948 113294 110757 106981
53998 106981 102719 98966 95992 93491 91271 89379 87716 86087 84662 83965 84133 84421 83773 81823 79149
53983 79149 76632 74826 73919 73827 74045 73740 72504 70962 70227 70672 71605 72249 72628 73185 73861 74100 73724 73354
53965 73354 73673 74502 74881 74126 72537 70993 70039 69648 69761 70647 72522 75096 77771 80139 82045 83420
53949 83420 84434 85662 87681 90486 93632 96885 100369 104166 108281 112966 118541 124704 130676 136260
53935 136260 142169 148886 155616 160897 163965 165150 165272 165090 165048 165023 164471 163234 162060 161847 162541 163278 163530
53918 163530 163605 164038 165042 166544 168335 170155 172161 175278 180381 186957 193229 198002 201769 205537 209125
53903 209125 211432 212099 212016 212122 212443 212605 212645 212711 212345 210790 207998 204764 201638 198194 193778 188645 183806
53886 183806 179738 175804 171121 165688 160338 155804 152091 148615 144716 140140 135311 131105 128121 126199
53872 126199 124742 123351 121918 120350 118601 116892 115399 113684 110925 106977 102793 99463 97052 94740
53858 94740 91935 88912 86380 84732 83757 82873 81604 79991 78577 77841 77664 77489 77013 76511 76389 76631 76864
53841 76864 76834 76607 76311 75929 75437 74955 74594 74251 73771 73286 73185 73603 74160 74343 74075 73725 73647 73906 74415 75126
53821 75126 76012 77013 78081 79183 80217 81030 81536 81692 81434 80866 80485 80890 82038 83098 83367 83183 83599
53804 83599 85239 87794 90644 93573 96744 100235 103843 107256 110289 113090 116040 119324 122578 125306
53790 125306 127684 130532 134164 137619 139558 139751 139196 138779 138369 137418 135958 134579 133639 132876 131780 130116
53774 130116 128071 126041 124270 122619 120768 118673 116653 114832 112675 109436 105106 100669 97210 94972
53760 94972 93363 91736 89948 88194 86691 85632 85193 85237 85117 84133 82302 80345 78795 77509 76310 75662
53744 75662 76126 77395 78540 79171 79627 79936 79395 77616 75338 73649 72847 72614 72796 73311 73632 73187 72204
53727 72204 71395 70884 70210 69395 69136 69687 70322 70352 70048 70047 70337 70407 70078 69657 69375 69141 68812 68449 68318 68809
53707 68809 70136 71983 73649 74763 75575 76333 76728 76322 75294 74302 73785 73760 74194 75076 76201 77303 78507
53690 78507 80294 82939 86187 89486 92318 94282 95159 95031 94233 93219 92511 92586 93504 94791 95990 97212
53674 97212 98812 100678 102289 103516 104826 106544 108306 109454 109595 108634 106716 104539 103333 103920 105825
53659 105825 107701 108652 108872 109026 109406 109830 110091 110198 110313 110617 111234 112075 112732 112715 111997 111236 111197 111875 112401
53640 112401 111988 110805 109666 109034 108677 108275 107847 107462 106981 106452 106394 107221 108515 109385 109574 109709 110412 111575
53622 111575 112780 113964 115283 116565 117355 117476 117232 117042 117100 117383 117724 117896 117868 118045 118977 120779 123050
53605 123050 125440 127965 130660 133221 135262 136687 137634 138282 138999 140398 142847 145939 148805 150961 152608
53590 152608 154220 156113 158373 160827 163098 164954 166585 168234 169654 170397 170653 171263 172735 174691 176537
53575 176537 178183 179788 181194 182088 182491 182651 182586 182137 181352 180472 179605 178735 177982 177453 176896 175873 174409
53558 174409 173172 172868 173565 174651 175365 175396 175091 175039 175337 175364 174471 172785 171128 170198 170083 170448 170897 171135
53540 171135 171110 171127 171579 172462 173366 174033 174663 175476 176166 176081 174975 173392 172155 171569 171268 170890 170662 171075 172127
53521 172127 173266 174228 175539 177908 181332 185117 188650 191856 194968 198181 201506 204761 207741 210617
53507 210617 214112 219028 225580 233316 241564 249739 257430 264656 272036 280267 289301 298356 306907 315396
53493 315396 324804 335691 347764 360242 372552 384768 397359 410464 423603 436351 449117 462741
53481 462741 477379 492266 506682 520723 534858 549211 563635 578139 592831 607550 621937
53470 621937 635822 649356 662805 676312 689727 702607 714578 725820 736901 748055 758986
53459 758986 769590 780428 791953 803603 814230 823393 831658 839601 847003 853227 857976 861410 863770
53446 863770 865132 865387 864252 861417 856811 850667 843326 835138 826582 818185 810098 801909 793078 783461
53432 783461 773278 762727 751905 740971 730061 719029 707636 696063 684889 674380 664094
53421 664094 653480 642650 632245 622655 613807 605611 598224 591816 586491 582561 580455 580061 580431 580449
53407 580449 579706 578664 578301 579758 583772 589846 596240 601456 605782 610908 618010 626704 635879 644975 654184
53392 654184 663954 674752 687060 701188 717021 734061 751651 769230 786697 804696 824272 846023
53380 846023 869683 894617 920509 947457 975646 1005076 1035404 1065938 1096045 1125760 1155783
53369 1155783 1186671 1218289 1250164 1281987 1313465 1344032 1373213 1401131 1428261 1454749 1480272
53358 1480272 1504530 1527505 1549276 1569866 1589266 1607400 1624019 1638827 1651599 1661995 1669348
53347 1669348 1672959 1672548 1668226 1660165 1648603 1633928 1616352 1595589 1571396 1544433 1516078 1487255
53335 1487255 1457992 1428276 1398718 1369951 1341864 1314041 1286711 1260698 1236494 1213843 1192147
53324 1192147 1170788 1149016 1126087 1101829 1076831 1051892 1027469 1003717 980719 958461 936876
53313 936876 916218 897217 880502 865962 852945 841016 830176 820416 811514 803410 796305 789998
53301 789998 783362 774993 764481 752821 741508 731373 722340 714041 706415 699700 694020 689157 684805
53288 684805 680927 677752 675512 674423 674858 677114 680816 684834 688238 691240 694964 700368 707604 716240
53274 716240 725635 735194 744747 754832 766217 778960 792277 805454 818487 831574 844371 856216
53262 856216 866935 877003 886899 896621 905913 914699 923075 930898 937530 942206 944766 945884 946342 946120
53248 946120 944453 940784 935296 928448 920294 910521 898848 885217 869837 853257 836162 818891 801389
53235 801389 783798 766698 750444 734661 718898 703523 689377 676604 664410 652062 639603
53224 639603 627450 615679 603949 591800 578849 564928 550292 535578 521457 508345 496297
53213 496297 484984 473825 462553 451730 442343 434801 428609 423092 418030 413333 408553 403169 397228
53200 397228 391251 385541 379880 373888 367404 360446 353047 345208 336857 327849 318193 308323 298879 290119
53186 290119 281797 273848 266875 261495 257252 252712 246934 240400 234187 228576 223042 217372 211980 206992
53172 206992 201782 195862 189700 184126 179265 174643 170127 166107 162813 160032 157538 155261 152956 150259
53158 150259 147243 144446 142101 139845 137507 135753 135369 136105 136728 136241 134702 132863 131391 130538 130238 130185
53142 130185 129916 129062 127667 126181 125088 124562 124514 124830 125393 125905 126011 125683 125247 124815 123991 122454 120613
53125 120613 119223 118449 117766 116847 116047 115820 116076 116362 116432 116343 116166 115865 115341 114508 113441 112481 111962 111763 111444
53106 111444 110908 110551 110635 110879 110955 110977 111192 111523 111775 111961 112006 111433 109966 108229 107214 107060 106946 106255 105294
53087 105294 104691 104607 104779 105047 105478 106142 106923 107452 107281 106384 105483 105470 106418 107542 108274 108932 110078 111673
53069 111673 113275 114780 116496 118600 120899 123059 124732 125527 125245 124221 123177 122656 122700 123042 123407 123602
53053 123602 123537 123167 122342 120809 118542 116008 113852 112343 111340 110716 110539 110762 111096 111315 111462 111576 111393
53036 111393 110534 108904 106831 104941 103947 104307 105817 107627 108965 109864 110970 112637 114434 115689 116323
53021 116323 116922 118006 119487 120903 121968 122611 122657 121893 120607 119683 119797 120671 121421 121592 121540 121858 122733 123906
53003 123906 124999 125845 126700 128117 130297 132605 134095 134530 134433 134147 133508 132628 132255 132804 133602 133795 133651
52986 133651 134171 135633 137311 138634 139839 141346 143123 144894 146416 147330 147305 146596 146011 146070 146611 147406 148672
52969 148672 150593 152829 154949 156976 159030 160723 161453 161205 160656 160521 161014 161840 162525 162908 163503 165064
52953 165064 167532 169795 170837 170783 170400 169966 169258 168326 167576 167182 167041 167229 167765 167995 167055 165112 163386
52936 163386 162638 162380 161965 161655 161955 162558 162818 162961 163934 166047 168518 170463 171762 172781 173787 174885
52920 174885 176091 177149 177642 177576 177594 178272 179440 180500 181173 181480 181227 180079 178242 176463 175127 173787
52904 173787 171954 169905 168212 166818 165250 163634 162718 162697 162710 161903 160472 159145 157995 156442 154240 151869
52888 151869 149868 148351 147345 147096 147673 148494 148647 147722 146127 144602 143581 143111 143228 144060 145418 146572
52872 146572 146864 146542 146561 147441 148715 149720 150452 151215 151799 151615 150554 149147 147834 146525 144943 143007
52856 143007 140800 138479 136330 134608 133226 131840 130277 128637 127025 125510 124318 123618 123079 122099 120615
52841 120615 119279 118627 118450 118153 117348 115881 113684 110960 108258 105998 104123 102402 100903 99970 99887 100711
52825 100711 102160 103485 103806 102910 101512 100475 99990 99721 99413 98989 98352 97564 97070 97308 98172 99209 100219
52808 100219 101278 102322 103201 104120 105518 107405 109234 110568 111550 112579 113878 115549 117708 120309 123001
52793 123001 125396 127333 128751 129473 129413 128876 128389 128180 127963 127349 126353 125488 125308 125895 126717 127009 126360 125008
52775 125008 123623 122801 122685 122976 123260 123313 123162 122904 122531 121909 120931 119710 118675 118366 118992 120181 121255
52758 121255 121777 121779 121503 121039 120217 118813 116856 114804 113282 112573 112469 112765 113670 115413 117604 119444 120565
52741 120565 121227 121551 121096 119519 117313 115465 114524 114318 114418 114593 114827 115187 115689 116193 116504 116696 117250 118689
52723 118689 121098 124086 127114 129830 132232 134633 137343 140318 143252 145980 148500 150590 151822 152195
52709 152195 152369 152959 153880 154691 155256 155654 155720 155212 154357 153769 153803 154283 154810 155063 154919 154678 155022 156317 157975
52690 157975 158976 159017 158709 158645 158805 159034 159542 160523 161642 162315 162411 162353 162588 163170 163812 164116 163704 162361 160207
52671 160207 157725 155492 153728 152111 150112 147534 144593 141521 138365 135287 132740 131054 130050 129326
52657 129326 128754 128437 128361 128431 128690 129128 129475 129695 130511 132775 136150 139048 140190 139806 139069 138760 138850 139042
52639 139042 139156 139085 138821 138596 138694 139098 139491 139643 139650 139722 139906 140104 140222 140141 139592 138295 136392 134591 133555
52620 133555 133101 132266 130358 127685 125103 123122 121813 121286 121714 122875 124165 125228 126225 127337 128335 128824
52604 128824 128695 128112 127255 126248 125267 124543 124308 124723 125793 127315 129001 130654 132099 133060 133360 133206 133015
52587 133015 132958 132933 132923 133042 133128 132699 131440 129486 127124 124540 122010 119993 118749 118094 117748 117690 117945 118343
52569 118343 118786 119526 120730 121909 122161 121073 119113 117145 115798 115278 115371 115498 115098 114279 113895 114636 116046
52552 116046 116827 116263 115058 114486 114858 115258 114745 113365 111796 110445 109279 108321 107825 107936 108487 109160 109639
52535 109639 109669 109267 108792 108535 108269 107573 106577 105943 106016 106353 106276 105654 104970 104794 105270 105960 106175 105694 105070 104894
52515 104894 104814 103835 101706 99458 98204 97927 97894 97857 98154 98823 99347 99453 99609 100331 101384 102052 102083 101916 101965
52496 101965 102045 101709 100870 99827 98879 98271 98334 99148 100059 100081 98998 97554 96421 95611 95244 96050 98332 101007
52478 101007 102630 103077 103246 103408 103006 102041 101425 101561 101626 100786 99339 98104 97439 97348 97851 98689 99234 99258 99225
52459 99225 99371 99127 98088 96876 96332 96314 96069 95380 94640 94142 94025 94571 95784 96915 97201 96915 96993 97814
52441 97814 98893 99570 99342 97908 95738 94337 94986 97245 99482 100802 101562 102150 102423 102495 102982 103902 104277
52424 104277 103425 102029 101303 101561 102143 102411 102341 102324 102745 103597 104369 104521 104148 103879 104119 104707 105317 105706 105555
52405 105555 104700 103658 103291 103724 104224 104355 104512 104938 105035 104319 103459 103468 104272 104904 104945 104873 104982 104835 104190 103796
52385 103796 104658 106685 108577 109170 108607 108008 108134 108734 109222 109519 109816 109887 109305 108315 107793 108151 108916 109701
52367 109701 110877 112799 114895 116267 116927 117761 119298 121130 122621 123673 124639 125817 127172 128370 129024
52352 129024 129079 129039 129623 131126 133165 134970 135961 136207 136483 137646 139769 142070 143870 145336 146987 148715
52336 148715 149785 149794 149205 148880 149370 150679 152378 153843 154674 155036 155513 156550 158154 160086 162157 164283
52320 164283 166402 168391 170070 171395 172773 174981 178559 183349 188840 194820 201422 208590 215857 222615
52306 222615 228416 233088 236941 240772 245297 250526 256079 262040 268931 276746 284632 291871 298714 305831
52292 305831 313374 321115 329167 337944 347484 357371 367325 377329 387214 396683 405890 415485 425834 436626
52278 436626 447470 458369 469289 479701 489127 497914 506944 516564 526264 535327 543480 550866 557756
52265 557756 564335 570518 575986 580653 584985 589490 593949 597669 600520 603150 605995 608663 610667 612267
52251 612267 614070 616076 617644 618319 618281 618086 618266 619066 620307 621592 622914 624853 627921 631977 636627 641909
52235 641909 648114 655158 662714 670818 679759 689410 699297 709305 719686 730325 740690 750708 760965
52222 760965 771740 782436 792334 801355 809625 816877 822899 828214 833606 839132 844176 848363 851854 854764
52208 854764 856814 857708 857528 856649 855420 853851 851353 846933 840042 831316 822136 813363 804761 795729 786354
52193 786354 777539 770203 764468 759630 754828 749720 744520 739539 734893 730645 726909 723666 720725 718018
52179 718018 715649 713446 710807 707391 703756 700802 698633 696438 693494 689879 686105 682513 679221 676262
52165 676262 673468 670477 667168 663898 661011 658203 654748 650384 645715 641630 638496 636040 633875 631911
52151 631911 630254 628871 627543 626132 624747 623501 622119 619925 616372 611624 606539 602027 598436 595569
52137 595569 593140 591012 589021 586851 584253 581303 578319 575640 573493 571880 570377 568237 565009 561022
52123 561022 557080 553709 550857 548185 545341 542091 538532 535236 532880 531666 531353 531776 533058 535330 538582
52108 538582 542719 547390 551794 555213 557830 560622 564333 568961 574289 580321 587022 594214 602005 610834
52094 610834 620773 631400 642642 655054 668755 682801 696352 709899 724415 739717 754636 768703
52082 768703 782686 797325 812377 827142 841260 854686 867367 879271 890413 900622 909596 917348
52070 917348 924310 930888 937113 942767 947595 951353 953895 955224 955307 953962 951171 947368 943131 938734 934230
52055 934230 929661 924820 919182 912655 906069 900256 894926 889291 883535 878627 874682 870624 865764 860714
52041 860714 856251 852290 848588 845652 844077 843510 843013 842140 841065 840073 839544 840062 841866 844332 846587 848443
52025 848443 850259 852137 853867 855497 857383 859723 862471 865555 868692 871115 872096 871728 870747 869595 868077
52010 868077 865834 862639 858197 852182 844647 836047 826716 816574 805356 792816 778759 763270 747000
51997 747000 730858 715206 699589 683371 666449 649297 632450 616089 600029 584052 568154
51986 568154 552218 535503 516968 496543 475670 455983 437631 419541 401219 383490 367332
51975 367332 352684 338832 325384 312399 299924 287948 276671 266393 257215 249067 241873 235415
51963 235415 229225 222980 216961 211731 207404 203538 199827 196529 193997 192037 190039 187688 185255 183100
51949 183100 181168 179151 176997 174947 173141 171441 169720 168028 166365 164557 162474 160179 157729 155168
51935 155168 152863 151421 150911 150534 149533 148161 147199 146759 146211 145203 144019 142840 141438 139823 138554
51920 138554 138037 138046 138282 138899 139977 140980 141325 141187 141204 141591 142093 142655 143464 144341 144633 143858 142142 139953
51902 139953 137762 136006 135056 134969 135476 136262 137154 138025 138743 139281 139733 140229 140928 142003 143433 144866 145870
51885 145870 146323 146422 146527 147138 148750 151375 154421 157471 161017 165826 171704 177593 183062 189068 196946
51870 196946 207156 219412 233513 249556 267701 288224 311574 337735 365535 392976 418225
51859 418225 439926 456646 466569 468038 460343 444128 421365 394947 367788 341805 317591 294978
51847 294978 273862 254559 237601 223193 210881 199862 189767 180956 173878 168334 163689 159645
51835 159645 156291 153456 150585 147512 144913 143514 142991 142083 139946 137181 135304 135185 136162 136853 136685 136265
51819 136265 136241 136384 136185 135857 136088 136948 137782 138160 138242 138153 137776 137401 137714 138642 138920 137520 135075 133119 132317
51800 132317 132229 132551 133555 135154 136404 136436 135408 134224 133636 133835 134550 135271 135596 135585 135579 135627 135417 134933 134763
51781 134763 135374 136358 136806 136380 135669 135487 136102 137179 138228 138956 139342 139584 140001 140804 141853 142701 142964 142635
51763 142635 141949 141023 139878 138838 138527 139207 140326 141064 141245 141439 142242 143701 145412 146864 147703 147939 147942
51746 147942 148025 148076 147847 147480 147412 147718 147920 147473 146177 144155 141815 139852 138824 138534 138201 137387 136463 136040
51728 136040 136317 137071 137864 138089 137333 135988 135059 135037 135365 135320 134966 134784 134855 135020 135500 136643 138143 139162
51710 139162 139271 138761 138022 137141 136172 135340 134754 134265 133729 133123 132367 131384 130415 129926 130030 130241 129998 129306 128829
51691 128829 129460 131694 135114 138459 140474 140751 139614 137397 134286 130792 127761 125662 124183 122774 121260
51676 121260 119824 118699 118179 118582 119966 122034 124489 127176 129736 131598 132620 133332 134063 134262 133321 131839
51660 131839 131262 132201 133803 134990 135614 136089 136473 136559 136452 136470 136630 136844 137467 138940 140756 141456 140052 137078
51642 137078 133936 131608 130366 130263 131223 132704 133928 134600 134990 135227 134912 133645 131616 129485 127900 127205
51626 127205 127275 127452 127011 125939 125005 124799 125078 125349 125719 126642 128021 129151 129526 129273 128742 128153 127733 127786
51608 127786 128383 129273 130313 131731 133720 135874 137333 137511 136601 135351 134434 134088 134281 135052 136485 138448
51592 138448 140640 142926 145343 147664 149286 149850 149719 149547 149589 149715 149888 150221 150724 151425 152608 154470 156583
51575 156583 158173 158960 159369 159889 160635 161573 162778 164376 166528 169446 173030 176528 178980 180109 180368 180149
51559 180149 179494 178617 178013 177835 177642 177109 176468 176022 175708 175445 175402 175578 175577 175272 175225 175964 177207 178287 178956
51540 178956 179295 179207 178680 178254 178499 179090 179046 177923 176238 174694 173541 172724 172087 171258 169741 167477 165030
51523 165030 163046 161646 160445 158981 157074 154884 152665 150415 147976 145590 144065 143974 144830 145454 145207
51508 145207 144481 143943 143658 143109 141899 140292 139106 139017 139909 141077 142084 143121 144310 145125 144964 143967 142710
51491 142710 141377 139849 138430 137647 137375 136962 136335 136212 136896 137678 137892 137911 138478 139516 140239 140231 139871 139806 140454
51472 140454 141937 144106 146587 149008 151168 152921 154136 154969 155932 157411 159290 161175 162765 163779 163849
51457 163849 162841 161050 158726 155686 151791 147612 144046 141278 138592 135278 131339 127242 123361 119927
51443 119927 117224 115516 114776 114618 114591 114567 114786 115491 116536 117540 118385 119299 120363 121265 121674 121576 121069 120202
51425 120202 119276 118861 119047 119094 118460 117875 118561 120430 121903 121716 120191 118391 116703 114746 112229 109277
51409 109277 106129 102998 100167 97881 96157 94881 93943 93123 92102 90816 89610 88782 88251 87899 87917 88383
51393 88383 88793 88551 87803 87268 87300 87634 88034 88598 89314 89898 90315 90937 91900 92717 92936 92840 93058 93714 94337 94525
51373 94525 94324 94066 94150 94889 96273 97901 99338 100462 101283 101680 101640 101580 102000 102814 103446 103503 102989 101863 99965
51354 99965 97565 95474 94263 93620 92755 91225 89197 87149 85623 84983 85128 85500 85617 85501 85459 85640 86008
51337 86008 86584 87404 88369 89327 90231 91071 91766 92258 92575 92715 92727 93021 94172 96124 97978 98976 99349 99719
51319 99719 100033 99800 99106 98558 98225 97462 96002 94412 93148 91823 89962 87954 86642 86265 86305 86182 85646
51302 85646 84646 83281 81872 80774 80173 80221 81126 82754 84349 85097 85004 84843 85234 86080 86915 87517 88105 89159
51284 89159 91148 94212 97989 101845 105364 108590 111784 115001 117858 119703 120116 119296 117835 116105 114044
51269 114044 111656 109391 107738 106617 105546 104332 103249 102455 101567 100052 97934 95943 94868 94806 95143
51254 95143 95326 95478 95975 96581 96495 95423 94097 93431 93606 94397 95990 98764 102351 105612 107677 108632 109146
51237 109146 109792 110791 112000 112990 113444 113595 113968 114665 115218 115221 114788 114277 113909 113749 113740 113695 113586 113878 115160 117265
51217 117265 119256 120533 121458 122513 123337 123135 121838 120243 119051 118250 117479 116562 115560 114591 113798 113309
51201 113309 113088 112858 112291 111249 109911 108674 107882 107554 107394 107092 106534 105801 105139 104892 105222 105823 106184 106231
51183 106231 106459 107260 108502 109925 111540 113246 114430 114487 113620 112588 111717 110690 109289 107825 106650 105711
51167 105711 104836 104123 103755 103654 103572 103350 102949 102395 101833 101469 101261 100945 100539 100512 101111 101727 101450 100308 99499
51148 99499 100184 102332 104942 107133 108741 109992 111059 111995 112771 113224 113169 112771 112608 113078 113880 114362 114387 114507
51130 114507 115203 116291 117225 117757 118064 118487 119423 121316 124323 127906 131038 132963 133655 133526 132892 131826
51114 131826 130378 128767 127359 126462 126150 126282 126721 127368 127918 127816 126780 125306 124296 124094 124209 124096 123898
51097 123898 124114 124797 125475 125801 125889 125867 125508 124552 123256 122287 122019 122219 122570 123286 124927 127607 130706 133484
51079 133484 135751 137778 139701 141319 142359 142688 142258 141166 139823 138734 137915 136776 134815 132328 130092
51064 130092 128442 126974 125239 123430 122193 121923 122473 123461 124628 125873 127128 128309 129344 130208 130943
51049 130943 131624 132225 132564 132577 132673 133546 135448 137766 139554 140431 140804 141335 142377 143810 145177 146101 146858
51032 146858 148418 151437 155213 158243 159957 161295 163164 165000 165566 164854 164321 165239 167464 170019 172241
51017 172241 174051 175562 176856 178010 179113 180353 182126 184762 188059 191395 194444 197508 200992 204957
51003 204957 209438 214846 221577 229383 237583 245805 254244 263249 273107 284155 296689 310501 324860
50990 324860 339202 353705 368995 385374 402580 420270 438522 457756 478274 500131 523541
50979 523541 549220 578047 610338 645609 683143 722650 764238 807852 852940 898616 944011
50968 944011 988418 1031187 1071540 1108549 1141437 1169982 1194503 1215310 1232273 1245042 1253651 1258776
50956 1258776 1261434 1262598 1263000 1263132 1263367 1264188 1266158 1269474 1273506 1277072 1279279 1279868 1278629 1274748 1267150
50941 1267150 1255408 1239948 1221208 1198903 1172321 1141109 1105493 1065888 1022778 976992 929699
50930 929699 881869 834001 786630 740852 697941 658536 622507 589600 559877 533494 510333
50919 510333 489968 471803 455221 439924 426140 414252 404148 395245 387206 380207 374324 369121
50907 369121 364232 360012 357117 355563 354634 353711 352808 352281 352314 352758 353254 353553 353945 355297 358323 362786 367709
50890 367709 372418 377142 382501 388764 395719 403045 410578 418398 426835 436333 447156 459174 472004
50877 472004 485408 499671 515630 534162 555496 579214 605107 633763 665938 701638 740419
50866 740419 782588 829389 881803 939775 1003003 1071841 1146863 1227958 1314636 1406982 1505489
50855 1505489 1609839 1718443 1829292 1940580 2050200 2155196 2252316 2338974 2413534 2475014
50845 2475014 2522946 2557397 2578838 2588146 2586970 2577843 2563519 2546350 2528626 2513171 2502771 2498813
50833 2498813 2500938 2508209 2520052 2535783 2553704 2571127 2584969 2591917 2588554 2572224 2541944 2498114
50821 2498114 2441365 2372126 2291202 2200085 2100452 1993885 1882401 1768828 1656225 1547069
50811 1547069 1443125 1345702 1255550 1172731 1097040 1028597 967732 914359 867747 826909 791076
50800 791076 759892 733426 711867 694971 681829 671406 663234 657279 653264 650460 648219 646339 644768
50787 644768 643251 641497 639504 637437 635224 632445 628681 623925 618570 613039 607498 601995 596790 592270
50773 592270 588455 584812 580795 576474 572473 569416 567662 567428 568825 571699 575678 580498 586158 592750
50759 592750 600236 608422 617113 626344 636550 648402 662358 678489 696783 717376 740357 765688
50747 765688 793720 825536 862237 903875 949502 998264 1050080 1105271 1163969 1225958 1290590
50736 1290590 1356584 1422247 1486039 1546607 1602190 1650471 1689347 1717632 1734877 1741044 1736844 1724100
50724 1724100 1705192 1682089 1656222 1629254 1603521 1581507 1564950 1554479 1549903 1550655 1555859 1564110
50712 1564110 1573482 1582013 1588099 1590171 1586160 1573804 1551718 1519933 1479329 1430903 1375870 1316084
50700 1316084 1253852 1191218 1129492 1069359 1011270 955837 903978 856638 814345 777149 744929
50689 744929 717498 694423 675125 659350 647237 638764 633474 630932 631117 634088 639592 647353 657415
50676 657415 669790 683900 698771 713663 728228 742136 754972 766458 776546 785324 793036 800076
50664 800076 806722 812917 818495 823478 828000 832189 836377 841196 847134 854128 861950 870797 881121 893043
50650 893043 906365 921065 937351 955224 974362 994444 1015250 1036475 1057801 1079081 1100078
50639 1100078 1119988 1137685 1152561 1164832 1174923 1182877 1188464 1191553 1192169 1190392 1186363 1180267 1172274
50626 1172274 1162606 1151621 1139632 1126671 1112754 1098418 1084748 1072636 1062088 1052323 1042572 1032830
50614 1032830 1023856 1016327 1010104 1004599 999857 996714 995584 995605 995381 994129 991519 986843 979133 967943
50600 967943 953218 934632 911950 886082 858838 831383 803699 775769 748389 722416 698072
50589 698072 675543 655567 638696 624519 612362 602421 595418 591362 589328 588443 588469 589316 590468 591155
50575 591155 590929 590049 589320 589484 590634 592374 594582 597699 602206 608214 615788 625226 636589 649352 662937
50560 662937 677433 693326 710662 728872 747320 765666 783762 801512 818760 835164 850339
50549 850339 864364 877917 891742 906267 921992 939767 960120 982601 1006392 1031472 1058679
50538 1058679 1088805 1122179 1159063 1199824 1244640 1293449 1346224 1402758 1462194 1523180 1584553
50527 1584553 1645461 1704856 1761464 1814266 1862383 1904290 1937798 1961274 1974484 1977927 1971788 1955935
50515 1955935 1930563 1896287 1853853 1804242 1749051 1690356 1630118 1569899 1511022 1454666 1401738
50504 1401738 1352865 1308532 1269137 1234946 1206248 1183515 1167219 1157400 1153607 1155349 1162433 1174659
50492 1174659 1191359 1211504 1234284 1259138 1284850 1308750 1327264 1337492 1338100 1328868 1309969 1282069
50480 1282069 1246675 1205631 1160190 1110959 1058792 1005311 952382 901379 853151 808418 767850
50469 767850 731741 699776 671250 645618 622881 603363 587169 573988 563497 555595 550027 546170
50457 546170 543694 543165 545385 550161 556429 563683 572596 583817 596809 610328 623635 636640 649220
50444 649220 661133 672529 683838 694993 705260 714121 722000 729825 738146 746863 755656 764415 773324
50431 773324 782709 792831 803765 815498 828199 842267 858033 875476 894414 914874 937070 961001
50419 961001 986267 1012423 1039363 1067208 1095941 1125270 1154795 1184092 1212647 1239940 1265595
50408 1265595 1289242 1310134 1327116 1339078 1345310 1345382 1338960 1325882 1306181 1279880 1247074 1208460
50396 1208460 1165501 1119769 1072282 1023844 975654 929039 884688 842775 803858 769035 739008
50385 739008 713541 692130 674739 661556 652441 647140 645756 648445 654744 663753 675107 689276 706525
50372 706525 725718 744439 760339 772257 780036 783599 782548 776577 765827 750559 730884 707301
50360 707301 681337 655067 629817 605676 582292 559699 538182 517819 498610 480841 464925
50349 464925 451002 438951 428716 420348 413786 408853 405440 403520 402941 403352 404377 405862 407939 410810
50335 410810 414437 418580 423192 428530 434588 440702 446216 451410 457082 463195 468712 473090 477214 482309
50321 482309 488492 495004 501329 507293 512423 516141 518644 520864 523437 526284 529259 532598 536587 541288
50307 541288 546844 553620 561861 571556 582650 594855 607009 617041 622956 623794 619708 611610 600975
50294 600975 589502 578463 568345 559081 550340 541626 532655 523936 516498 510721 505829 500877 495820
50281 495820 491185 487081 483157 479326 475886 472981 470486 468468 467221 466717 466492 466306 466581 467913 470332
50266 470332 473225 475822 477678 478889 480011 481662 484085 487199 491015 495669 500947 506123 510578 514405
50252 514405 518109 521847 525365 528635 532134 536321 541065 545737 549680 552452 553905 554277 554111 553750 552998
50237 552998 551497 549425 547440 545873 544344 542336 539833 537120 534259 531170 528054 525321 523132 521413
50223 521413 520327 520330 521632 523941 526957 530874 536219 543367 552357 562960 574781 587521 601322 616769
50209 616769 634391 654356 676590 700862 726598 753037 779891 807402 835329 862242 886424
50198 886424 907310 925427 941045 953678 963024 969684 974567 978042 979986 980148 977971 972398 962373
50185 962373 947437 927512 902447 872325 838120 801543 764178 727072 691133 657373 626599
50174 626599 599149 575031 554103 536029 520378 506833 495046 484290 473730 463224 453457 444992
50162 444992 437536 430506 423969 418545 414571 411805 409793 407968 405522 401877 397473 393458 390285 387130
50148 387130 383051 378203 373330 368522 363273 357623 352362 347901 343632 338797 333490 328361 323699 319369
50134 319369 315430 312256 310004 308400 307178 306418 306308 306828 307810 309073 310382 311453 312232 313123 314734 317330
50118 317330 320617 324110 327689 331740 336706 342507 348575 354457 360220 366119 372151 378292 385055 393296
50104 393296 403295 414435 426066 438342 451781 466165 480482 494147 507985 523705 542489 564287
50092 564287 588453 614805 643890 676384 712601 752665 796713 844402 894326 944465 993416
50081 993416 1040773 1086181 1128622 1167226 1202477 1235904 1268458 1299612 1327963 1352208 1371342
50070 1371342 1384353 1390125 1387557 1375786 1354612 1324978 1288814 1248191 1204622 1159156 1112838 1066891
50058 1066891 1022593 981052 942911 908211 876717 848480 823834 802835 785063 770064 757628
50047 757628 747397 738660 730927 724371 719285 715391 712092 709107 706281 702984 698463 692824 687016 681611
50033 681611 676100 669622 661877 653045 643286 632877 622571 613282 605318 598224 591365 584549 578101 572551
50019 572551 568230 564991 562311 559813 557714 556628 556849 557919 559060 560112 561914 565546 571105 577441
50005 577441 583210 587955 591941 595268 597658 599039 599778 600126 599802 598281 595226 590527 584324 577260 570306
49990 570306 563916 557507 550059 541157 531381 521930 514043 508323 504221 500417 496168 492148 489623 489100
49976 489100 490291 493113 497932 504723 512856 522112 533410 548013 566265 587489 610922 636302 663614
49963 663614 692542 722212 751266 778225 801986 822084 838593 852011 863299 873604 883448 892120
49951 892120 898095 900054 897389 889853 877084 858613 834168 804002 769165 731528 693271 656075
49939 656075 620785 587799 557510 530276 506214 485243 467099 451089 436074 421224 406861
49928 406861 394158 383878 375634 368492 361883 355714 349919 344353 339005 333948 329036 323942 318553 313148
49914 313148 308181 304005 300749 298256 296180 294315 292736 291392 289803 287544 284983 283038 282105 281671 281089
49899 281089 280259 279390 278609 278125 278266 278894 279181 278523 277429 276863 276907 276699 275701 274312 273079 271906 270419
49882 270419 268682 267092 265789 264594 263485 262811 262889 263530 264057 263834 262831 261679 261208 261910 263775 266414
49866 266414 269149 271216 272236 272611 273227 274664 276752 278900 280721 282271 283803 285338 286578 287328 287970
49851 287970 289207 291236 293436 295126 296297 297305 298205 298908 299665 300699 301466 301122 299794 298549 297861 296917
49835 296917 294985 292641 290895 289708 288303 286665 285754 286154 287364 288673 290056 291868 294123 296429 298294
49820 298294 299279 299202 298537 298279 299026 300328 301275 301496 301186 300290 298296 295073 291474 288736 287382 286982 286869
49803 286869 286714 286397 285720 284558 283085 281593 280151 278656 277148 275809 274612 273271 271629 269891 268348
49788 268348 267101 266199 265850 266172 266831 267177 266832 266025 265307 265030 265154 265450 265784 266117 266333 266190 265586 264742
49770 264742 264001 263512 263284 263396 263863 264349 264424 264216 264417 265510 267282 269281 271319 273193 274282 274021 272682
49753 272682 271239 270413 270189 270234 270437 270904 271699 272694 273562 273951 273788 273352 272895 272336 271543 270721 270206 269980 269808
49734 269808 269747 270125 271031 272248 273679 275342 276897 277746 277741 277324 276800 276020 275090 274756 275582 277128 278507 279487
49716 279487 280518 281967 283873 286286 289170 291946 293724 294130 293517 292331 290795 289351 288850 289866 292032
49701 292032 294358 296070 296972 297260 297261 297360 297909 299098 300865 302988 305345 308218 312090 316898 321642 325157
49685 325157 327264 328744 330153 331210 331554 331536 331850 332764 334204 336207 338725 341189 342947 344063 345069
49670 345069 345889 345755 344433 342856 341992 341601 340781 339535 339020 340114 342285 344239 345383 346381 348432 352366
49654 352366 358378 366318 376004 387270 399698 412240 423137 430507 433268 431633 426736 419945 412483
49641 412483 405377 399290 394311 390148 386640 383890 381877 380245 378685 377298 376329 375747 375373 375286 375697 376456
49625 376456 377112 377527 378086 379114 380393 381516 382514 383844 385814 388242 390738 393151 395676 398564 401803
49610 401803 405083 408037 410485 412483 414345 416621 419843 424052 428750 433502 438416 443734 449188 454153
49596 454153 458398 462269 466137 470076 474045 477949 481558 484892 488655 493597 499337 504624 509050 513637
49582 513637 519251 525286 530704 535623 540812 546110 550579 554161 558003 562909 568420 573698 578511 582947
49568 582947 586915 590472 594137 598407 603189 608003 612454 616286 619360 621903 624479 627469 630763 634081
49554 634081 637240 640042 642360 644522 647175 650470 653758 656391 658495 660678 663339 666541 670205 674076
49540 674076 677712 680787 683212 684922 685939 686798 688350 690850 693724 696506 699437 702833 706555 710699
49526 710699 716065 723092 730771 737577 743201 748490 753850 758679 762406 765164 767229 768613 769468 770223 770947
49511 770947 771089 770172 768357 766091 763639 761128 758559 755501 751211 745368 738479 731331 724378 717753 711460
49496 711460 705257 698692 691552 684121 676842 669998 663836 658653 654454 650749 646890 642473 637419 632089
49482 632089 627353 624069 622173 620638 618621 616259 614026 611768 608897 605296 601493 597997 594897 592058
49468 592058 589308 586460 583468 580611 578197 576177 574259 572394 570775 569368 567845 566090 564465 563348
49454 563348 562619 561836 560790 559667 558703 557953 557463 557543 558641 560991 564492 568976 574357 580342 586199 591109
49438 591109 594761 597309 598698 598369 595905 591801 587351 583763 581498 580345 579896 579839 579976 580182 580529 581370
49422 581370 583081 585652 588631 591619 594637 597868 601263 604729 608515 613025 618230 623718 629347 635472
49408 635472 642414 650092 658347 667253 676845 686817 696707 706161 714950 723126 731295 740197 749625 758187
49394 758187 764723 769705 774684 780456 786286 790944 793987 795970 797860 800418 803816 807607 811207 814472
49380 814472 817690 821050 824408 827680 831126 835061 839433 843920 848419 853269 858937 865507 872515 879321
49366 879321 885632 891630 897616 903657 909582 915189 920380 925265 930237 935865 942504 950053 958165 966606
49352 966606 975394 984691 994624 1005048 1015418 1025129 1034117 1042939 1052118 1061615 1071112 1080484 1089668 1098303
49338 1098303 1105926 1112563 1118827 1125380 1132427 1139600 1146176 1151593 1156015 1160270 1164915 1169566 1173479 1176649
49324 1176649 1179783 1183231 1186510 1189033 1190873 1192538 1194370 1196510 1199144 1202364 1205801 1208751 1210779 1212109
49310 1212109 1213394 1215095 1217072 1218747 1219680 1220006 1220260 1220854 1221783 1222757 1223480 1223804 1223762 1223515 1223225 1222970 1222736
49293 1222736 1222385 1221604 1220136 1218193 1216426 1215270 1214550 1213975 1213759 1214318 1215505 1216649 1217338 1217737 1218094 1218433
49277 1218433 1218857 1219673 1220901 1222005 1222415 1222101 1221392 1220424 1219025 1217014 1214382 1211285 1208005 1204834 1201858
49262 1201858 1198978 1196186 1193537 1190637 1186386 1179569 1169715 1157255 1143003 1127728 1112106 1096658 1081571
49249 1081571 1066752 1052190 1038167 1025033 1012827 1001229 989893 978784 968201 958524 949939 942334
49237 942334 935392 928793 922400 916238 910288 904402 898594 893337 889308 886721 885104 883782 882433 881138
49223 881138 880238 880206 881231 882638 883203 882529 881747 882331 884488 887360 890530 894426 899122 903693 907164 909595
49207 909595 911831 914626 918332 922982 928201 933315 937890 942025 945973 949862 953971 958818 964564 970656
49193 970656 976414 981765 987048 992440 997903 1003426 1008940 1014193 1019011 1023499 1027777 1031861 1036047 1040964
49179 1040964 1046793 1052905 1058750 1064692 1071360 1078645 1086109 1094048 1103192 1113535 1124425 1135892 1148843
49166 1148843 1163677 1179571 1195582 1211802 1228956 1247499 1267570 1289263 1312355 1336175 1360297
49155 1360297 1385024 1410707 1436968 1463134 1489128 1515241 1541208 1566156 1589431 1610876 1630316
49144 1630316 1647445 1662422 1675960 1688455 1699490 1708638 1716409 1723930 1731811 1739868 1747927 1756397 1765761
49131 1765761 1775852 1785997 1795812 1805610 1816125 1828204 1842759 1860564 1881705 1905248 1929612 1953337
49119 1953337 1975567 1996180 2015650 2034508 2052510 2068342 2080351 2087471 2089267 2085481 2076210 2062574
49107 2062574 2046532 2029638 2012307 1994497 1976686 1959817 1944589 1931239 1919827 1910294 1902314 1895592
49095 1895592 1890322 1886990 1885618 1885511 1885924 1886756 1888448 1891309 1895078 1899124 1902989 1906761 1910829 1915238 1919415
49080 1919415 1922706 1925164 1927516 1930361 1933673 1937176 1940855 1944730 1948322 1950727 1951408 1950652 1949088 1946920
49066 1946920 1943845 1939636 1934494 1928691 1922109 1914408 1905505 1895531 1884243 1870933 1855261 1837972 1820305
49053 1820305 1802682 1784414 1764839 1744358 1724004 1704337 1685273 1666850 1649500 1633395 1618075
49042 1618075 1603134 1588935 1576155 1564864 1554564 1545056 1536647 1529441 1523018 1517122 1512248 1509130 1507982
49029 1507982 1508535 1510500 1513486 1516786 1519853 1522996 1527096 1532579 1539126 1546393 1554391 1562948 1571375 1579161
49015 1579161 1586704 1594860 1603885 1613116 1621646 1629082 1635770 1642538 1650112 1658523 1667139 1675439 1683615 1692140
49001 1692140 1700892 1709101 1716155 1722129 1727429 1732282 1736735 1740938 1745145 1749492 1753948 1758437 1762939 1767490
48987 1767490 1772119 1776734 1781120 1785189 1789228 1793699 1798680 1803715 1808367 1812740 1817193 1821626 1825382 1827918
48973 1827918 1829354 1830249 1831037 1831836 1832631 1833407 1834208 1835303 1837277 1840616 1845159 1850136 1854909 1859549 1864613
48958 1864613 1870629 1877908 1886628 1896860 1908636 1922178 1937816 1955376 1973871 1992206 2010107 2027898
48946 2027898 2045456 2061981 2077007 2091074 2105086 2119376 2133826 2148583 2164171 2180910 2198534
48935 2198534 2216300 2233259 2248498 2261458 2272020 2280230 2286138 2290144 2293235 2296451 2300203 2304464 2309563
48922 2309563 2316346 2325455 2336748 2349541 2363289 2378024 2394389 2413279 2435142 2459563 2485627 2512654
48910 2512654 2540387 2568686 2597460 2626879 2657140 2687926 2718554 2748861 2779531 2811274 2844007
48899 2844007 2877145 2910309 2943352 2975919 3007513 3037972 3067497 3096170 3123771 3150114 3175304
48888 3175304 3199586 3223101 3245917 3268162 3289972 3311235 3331469 3350080 3366917 3382502 3397538
48877 3397538 3412146 3425886 3438508 3450259 3461272 3471104 3479293 3486040 3491730 3495984 3497858 3497060 3494336
48864 3494336 3490406 3485084 3477852 3468869 3458775 3447657 3434787 3419476 3401785 3382235 3361216 3338931
48852 3338931 3315643 3291553 3266517 3240269 3212987 3185284 3157472 3129257 3100491 3071957 3044888
48841 3044888 3019693 2995650 2972008 2948932 2927165 2907192 2889135 2873165 2859531 2848324 2839609
48830 2839609 2833684 2830758 2830420 2831938 2835143 2840581 2848666 2859074 2871142 2884477 2898946 2914464 2931087
48817 2931087 2949065 2968475 2988972 3010099 3031487 3052440 3071718 3088363 3102640 3115598 3127679
48806 3127679 3138323 3147085 3154544 3161722 3168977 3175949 3182409 3188707 3195356 3202540 3210105 3217824 3225575 3233456
48792 3233456 3241849 3251250 3261956 3273928 3287022 3301227 3316670 3333451 3351500 3370492 3389907 3409383
48780 3409383 3429166 3450057 3472722 3497009 3522112 3547307 3572358 3597278 3622092 3647009 3672436
48769 3672436 3698381 3723863 3747374 3768111 3786529 3803482 3819000 3832285 3842799 3850867 3856927 3860515
48757 3860515 3860604 3856904 3850272 3841530 3830306 3815597 3797224 3776096 3753081 3728286 3701619 3673303
48745 3673303 3643379 3611232 3576316 3539144 3500910 3462253 3423032 3383310 3343838 3305357 3267972
48734 3267972 3231561 3196381 3162897 3131320 3101656 3074013 3048469 3024817 3002827 2982753 2965293
48723 2965293 2950972 2939698 2930908 2924057 2918977 2915779 2914312 2913777 2913067 2911615 2909663 2907700 2905912 2904376
48709 2904376 2903410 2903383 2904354 2906239 2909185 2913423 2918766 2924557 2930174 2935433 2940533 2945731 2950980 2955821 2959797
48694 2959797 2963035 2966177 2969570 2972936 2976154 2979943 2985246 2992296 3000962 3011866 3026384 3045503 3069422
48681 3069422 3098499 3133833 3176369 3225749 3280220 3337079 3392550 3441592 3478659 3499182 3500607
48670 3500607 3482518 3446293 3394635 3331060 3259550 3184414 3109939 3039657 2975723 2918917 2869042
48659 2869042 2825304 2786624 2751988 2720620 2691844 2665005 2639588 2615248 2591686 2568742 2546663
48648 2546663 2525923 2506522 2487726 2468651 2448946 2428769 2408473 2388499 2369192 2350356 2331346
48637 2331346 2311948 2292825 2274642 2257061 2239228 2221054 2203344 2186690 2170882 2155478 2140346
48626 2140346 2125405 2110372 2095097 2079856 2065072 2051012 2037901 2025954 2014997 2004364 1993512
48615 1993512 1982608 1972238 1962703 1953892 1945741 1938475 1932324 1927188 1922668 1918369 1914146 1910137 1906608
48602 1906608 1903761 1901602 1899854 1898041 1895840 1893513 1891821 1891368 1892180 1893978 1896534 1899458 1901977 1903566
48588 1903566 1904756 1906740 1910099 1914344 1918777 1923214 1927733 1932267 1936775 1941253 1945180 1947489 1947661 1946537
48574 1946537 1945447 1944770 1943866 1942247 1940194 1938283 1936907 1936317 1936558 1937207 1937579 1937381 1936830 1936087 1935003 1933584
48558 1933584 1932273 1931444 1930934 1930349 1929573 1928729 1927889 1927104 1926509 1926053 1925225 1923488 1920969 1918386 1916197 1914074
48542 1914074 1911373 1907882 1903979 1900199 1896822 1893804 1890928 1887959 1884779 1881418 1877907 1874107 1869822 1865110
48528 1865110 1860360 1855913 1851624 1846980 1841697 1836070 1830637 1825550 1820419 1814731 1808330 1801477 1794555 1787823
48514 1787823 1781441 1775536 1770039 1764439 1757951 1750225 1741815 1733789 1726875 1721169 1716492 1712633 1709175 1705562
48500 1705562 1701612 1697669 1694034 1690546 1687002 1683625 1680662 1677806 1674543 1670913 1667402 1664177 1661043 1658133
48486 1658133 1655965 1654666 1653713 1652700 1651791 1651133 1650400 1649374 1648454 1648034 1647740 1646938 1645705 1644678 1644093 1643639
48470 1643639 1643189 1642949 1642790 1642109 1640677 1639055 1637778 1636526 1634583 1631815 1628716 1625567 1622017 1617535 1611997
48455 1611997 1605673 1598909 1591973 1585074 1578268 1571299 1563659 1555003 1545525 1535809 1526261 1516745 1506870 1496495
48441 1496495 1485864 1475308 1464987 1454853 1444733 1434503 1424268 1414304 1404686 1395098 1385194 1375013
$$ [...]
##END NTUPLES=NMR SPECTRUM
##END=
