##TITLE=NES1017_872015068_9265900_OTYrnOHzXa
##JCAMPDX= 6.0         $$ Bruker NMR JCAMP-DX V2.0
##DATA TYPE= NMR SPECTRUM
##DATA CLASS= NTUPLES
##ORIGIN= BRUKER
##OWNER= Administrator
$$ 1.72 TOPSPIN		Version 2.1
$$ 2015-07-10 00:02:05.753 -0700  Administrator@X
$$ Compression mode = diff/dup
##.OBSERVE FREQUENCY= 400.02188249412
##.OBSERVE NUCLEUS= ^1H
##.ACQUISITION MODE= SIMULTANEOUS (DQD)
##.ACQUISITION SCHEME= undefined
##.AVERAGES= 8
##.DIGITISER RES= 22
##SPECTROMETER/DATA SYSTEM= spect
##.PULSE SEQUENCE= zg30
##.SOLVENT NAME= COFFEE_meoh
##.SHIFT REFERENCE= INTERNAL, COFFEE_meoh, 1, 14.98509
##AUDIT TRAIL= $$ (NUMBER, WHEN, WHO, WHERE, PROCESS, VERSION, WHAT)
$$ ##TITLE= Audit trail, TOPSPIN		Version 2.1
$$ ##JCAMPDX= 5.01
$$ ##ORIGIN= Bruker BioSpin GmbH
$$ ##OWNER= Administrator
$$ $$ E:\/data/COFFEE/nmr/NES1017_872015068_9265900_OTYrnOHzXa/10/pdata/1/auditp.txt
$$ ##AUDIT TRAIL=  $$ (NUMBER, WHEN, WHO, WHERE, PROCESS, VERSION, WHAT)
(   1,<2015-07-10 00:01:58.660 -0700>,<Administrator>,<X>,<go>,<TOPSPIN 2.1>,
      <created by zg
	started at 2015-07-10 00:00:52.769 -0700,
	POWCHK enabled, PULCHK disabled,
       configuration hash MD5:
       21 0F 79 D6 B3 7B B4 F6 88 20 88 DB 03 48 BD 9F
       data hash MD5: 64K
       8F F5 EA 69 9B BF B2 20 BF 31 19 59 1C 60 74 18>)
(   2,<2015-07-10 00:02:01.800 -0700>,<Administrator>,<X>,<proc1d>,<TOPSPIN 2.1>,
      <Start of raw data processing
       efp LB = 0 FT_mod = 6 PKNL = 1 PHC0 = 0 PHC1 = 0 SI = 32K 
       data hash MD5: 32K
       9F 7D B6 D3 E2 49 79 1D 41 09 70 5C 20 95 AA E3>)
(   3,<2015-07-10 00:02:02.097 -0700>,<Administrator>,<X>,<proc1d>,<TOPSPIN 2.1>,
      <pk PHC0 = 88.14331 PHC1 = 0 
       data hash MD5: 32K
       FD D2 9A 7C A6 05 B4 58 6B 2E 6F 42 11 01 34 7E>)
(   4,<2015-07-10 00:02:02.222 -0700>,<Administrator>,<X>,<proc1d>,<TOPSPIN 2.1>,
      <abs ABSG = 1 
       data hash MD5: 32K
       D6 25 77 48 DB 36 67 7C 17 50 1E D3 21 02 1E AE>)
(   5,<2015-07-10 00:02:02.300 -0700>,<Administrator>,<X>,<proc1d>,<TOPSPIN 2.1>,
      <abs ABSG = 2 
       data hash MD5: 32K
       E8 D1 1F 29 53 F9 78 8E 2B EC 76 8A 22 D1 5A C7>)
(   6,<2015-07-10 00:02:02.363 -0700>,<Administrator>,<X>,<proc1d>,<TOPSPIN 2.1>,
      <abs ABSG = 3 
       data hash MD5: 32K
       70 BD 88 41 A9 AD 88 B6 A0 B4 5E 91 E7 B0 11 50>)
(   7,<2015-07-10 00:02:02.425 -0700>,<Administrator>,<X>,<proc1d>,<TOPSPIN 2.1>,
      <abs ABSG = 4 
       data hash MD5: 32K
       0F 4A BC 5E 1F A1 A2 15 29 2D 8D FD B4 D4 D2 C4>)
(   8,<2015-07-10 00:02:02.488 -0700>,<Administrator>,<X>,<proc1d>,<TOPSPIN 2.1>,
      <abs ABSG = 5 
       data hash MD5: 32K
       91 3E D3 87 0B 8F 97 5E FE 9D 79 5B 54 8F E9 04>)
$$ ##END=
$$ 
$$ $$ hash MD5
$$ $$ 9D 0F 36 0A 0E 6F 45 EC B8 41 C2 70 97 0B 68 A7
##$RELAX= 
##$RELAX= 
##$RELAX= 
##$RELAX= 
##$RELAX= 
##$RELAX= 
##$RELAX= 
$$ Bruker specific parameters
$$ --------------------------
##$DU= <E:\>
##$EXPNO= 10
##$NAME= <NES1017_872015068_9265900_OTYrnOHzXa>
$$ [...]
##$TP= (0..7)
150 150 150 150 150 150 150 150
##$TP07= 0
##$TPNAME0= <>
##$TPNAME1= <>
##$TPNAME2= <>
##$TPNAME3= <>
##$TPNAME4= <>
##$TPNAME5= <>
##$TPNAME6= <>
##$TPNAME7= <>
##$TPOAL= (0..7)
0.5 0.5 0.5 0.5 0.5 0.5 0.5 0.5
##$TPOFFS= (0..7)
0 0 0 0 0 0 0 0
##$TUNHIN= 0
##$TUNHOUT= 0
##$TUNXOUT= 0
##$USERA1= <user>
##$USERA2= <user>
##$USERA3= <user>
##$USERA4= <user>
##$USERA5= <user>
##$V9= 5
##$VALIST= <valist>
##$VCLIST= <CCCCCCCCCCCCCCC>
##$VD= 0
##$VDLIST= <DDDDDDDDDDDDDDD>
##$VPLIST= <PPPPPPPPPPPPPPP>
##$VTLIST= <TTTTTTTTTTTTTTT>
##$WBST= 2048
##$WBSW= 25
##$XGAIN= (0..3)
0 0 0 0
##$XL= 0
##$YL= 0
##$YMAX_a= 576200
##$YMIN_a= -491283
##$ZGOPTNS= <>
##$ZL1= 120
##$ZL2= 120
##$ZL3= 120
##$ZL4= 120
##$ABSF1= 14.98509
##$ABSF2= -5.573092
##$ABSG= 5
##$ABSL= 3
##$ALPHA= 0
##$AQORDER= 0
##$ASSFAC= 0
##$ASSFACI= 0
##$ASSFACX= 0
##$ASSWID= 0
##$AUNMP= <proc_prof1d_extract_pilot.lims>
##$AXLEFT= 0
##$AXNAME= <>
##$AXNUC= <1H>
##$AXRIGHT= 0
##$AXTYPE= 0
##$AXUNIT= <>
##$AZFE= 0.1
##$AZFW= 0.1
##$BCFW= 0
##$BC_mod= 0
##$BYTORDP= 0
##$COROFFS= 0
##$CY= 15
##$DATMOD= 1
##$DC= 0
##$DFILT= <>
##$DTYPP= 0
##$F1P= 0
##$F2P= 0
##$FCOR= 0.5
##$FTSIZE= 32768
##$FT_mod= 6
##$GAMMA= 0
##$GB= 0
##$INTBC= 1
##$INTSCL= 1
##$ISEN= 128
##$LB= 0
##$LEV0= 0
##$LPBIN= 0
##$MAXI= 10000
##$MC2= 0
##$MEAN= 0
##$ME_mod= 0
##$MI= 0
##$NCOEF= 0
##$NC_proc= -8
##$NLEV= 6
##$NOISF1= 0
##$NOISF2= 0
##$NSP= 0
##$NTH_PI= 0
##$NZP= 0
##$OFFSET= 14.98509
##$PC= 1
##$PHC0= 88.14331
##$PHC1= 0
##$PH_mod= 1
##$PKNL= yes
##$PPARMOD= 0
##$PPDIAG= 0
##$PPIPTYP= 0
##$PPMPNUM= 2147483647
##$PPRESOL= 1
##$PSCAL= 4
##$PSIGN= 0
##$PYNMP= <proc.py>
##$REVERSE= no
##$SF= 400.02
##$SI= 32768
##$SIGF1= 0
##$SIGF2= 0
##$SINO= 400
##$SIOLD= 32768
##$SPECTYP= <>
##$SREGLST= <1H.CDCl3>
##$SSB= 0
##$STSI= 32768
##$STSR= 0
##$SW_p= 8223.68421052631
##$SYMM= 0
##$S_DEV= 0
##$TDeff= 65536
##$TDoff= 0
##$TI= <>
##$TILT= no
##$TM1= 0
##$TM2= 0
##$TOPLEV= 0
##$USERP1= <user>
##$USERP2= <user>
##$USERP3= <user>
##$USERP4= <user>
##$USERP5= <user>
##$WDW= 1
##$XDIM= 32768
##$YMAX_p= 445541066
##$YMIN_p= -777761
##$CURPLOT= <Network HP LaserJet P1505>
##$CURPRIN= <$Network HP LaserJet P1505>
##$DFORMAT= <normdp>
##$LAYOUT= <+/1D_H.xwp>
##$LFORMAT= <normlp>
##$PFORMAT= <normpl>
##$SURQMSG= 1
$$ End of Bruker specific parameters
$$ ---------------------------------
##NTUPLES= NMR SPECTRUM
##VAR_NAME=  FREQUENCY,     SPECTRUM/REAL,   SPECTRUM/IMAG
##SYMBOL=    X,             R,               I
##VAR_TYPE=  INDEPENDENT,   DEPENDENT,       DEPENDENT
##VAR_FORM=  AFFN,          ASDF,            ASDF
##VAR_DIM=   32768,         32768,           32768
##UNITS=     HZ,            ARBITRARY UNITS, ARBITRARY UNITS
##FACTOR=    0.250966925370066, 1,           1
##FIRST=     8223.43324360094, 21679,        91684
##LAST=      0,             -40193,          -92025
##MIN=       0,             -777761,         0
##MAX=       8223.43324360094, 445541066,    0
$$ Real data points
##PAGE= N=1
##DATA TABLE= (X++(R..R)), XYDATA
$$ [...]
19500D2602J95902I440e38767a65157b0747B88140b19027O8807n9246O0406A15215
$$ 42602 238504 9440 -538767 -165157 -20747 288140 -219027 -150220 -209466 -149060 115215
19488b31457a1772j11000k79031I0971B9977i9594D0448a54510j72640A00592
$$ -231457 -11772 -122772 -401803 90971 29977 -99594 40448 -154510 -327150 100592
19477b17181C12598a13523B60875b8580A80396g5489E4258b06157n7945A5112
$$ -217181 312598 -113523 260875 -28580 180396 -75489 54258 -206157 -264102 15112
19466a77941H6058c391A41331b68043j26855J58177h9501o9387g0757I3113a28810
$$ -177941 86058 -3391 141331 -268043 -394898 -236721 -89501 -158888 -70757 93113 -128810
19454a67201m2700I8713a58369h248A34566h7105p315D2093c61629L2679B3607
$$ -167201 -209901 98713 -158369 -8248 134566 -87105 -94420 42093 -361629 -328950 23607
19442A20159A2676a53437B24930a94531e5238q4214j64463q4985c0179r0232j17067
$$ 120159 12676 -153437 224930 -194531 -55238 -139452 -303915 -388900 -30179 -120411 -237478
19431b37478b5729A28743a47995A3056J05075h9409k00060e7847I5991K8267K52182
$$ -237478 -25729 128743 -147995 13056 118131 -89409 -289469 -57847 95991 124258 376440
19420C76440a85840I89L2766c10819P1073c0605k73799j74403A27572a0704A24502
$$ 376440 -185840 989 33755 -310819 -239746 -30605 -304404 -478807 127572 -10704 124502
19408b37585j3149n5157A85063h6775A19569g2797A3491b99316g6602J4881A56238
$$ -237585 -250734 -305891 185063 -86775 119569 -72797 13491 -299316 -76602 -61721 156238
19396A01737d1890k00210q9891A4877c0599B6636c02615A65092g6954J743l1559
$$ 101737 -41890 -242100 -331991 14877 -30599 26636 -302615 165092 -76954 -75211 -106770
19385a06770C4880a19864p7914K837P9687k755E1942j4613d4353j26239D9662
$$ -106770 34880 -119864 -197778 -194941 -115254 -118009 51942 37329 -44353 -170592 49662
19373A62537b90472N1750i0907l87111D248d1840A15865c10255J21657N4183E6621
$$ 162537 -290472 -238722 -90907 -478018 4248 -41840 115865 -310255 -188598 -134415 56621
19361c61364J32363A1174e9193a9405j29558A06290k6650i2739L1305j22809c1435
$$ -361364 -229001 11174 -59193 -19405 -148963 106290 79640 -92739 -61434 -184243 -31435
19349a03827H0709L4569c55533a00788b0892M532B2161i0715B137a43952j98971
$$ -103827 80709 115278 -355533 -100788 -20892 -16360 22161 -90715 2137 -143952 -342923
19338c42923A17163f4329B09099a45687k31612a31124k34660E7721d9096k82551
$$ -342923 117163 -64329 209099 -145687 -377299 -131124 -365784 57721 -49096 -331647
19328c31647h8809r6626K6992E9642K4335B3001a38978B1708a19201m3067C7557
$$ -331647 -88809 -185435 -158443 59642 83977 23001 -138978 21708 -119201 -162268 37557
19316G947f6684P375A15798b15885B34273b81374B84886p3770i2165H2483G339
$$ 7947 -66684 -59309 115798 -215885 234273 -281374 284886 211116 -92165 82483 7339
19304a29461m9574n0918c0425H7511a88056O0078j67364F092a80630I5824b52264
$$ -129461 -179035 -229953 -30425 87511 -188056 -127978 -295342 6092 -180630 95824 -252264
19292A96024a76267r1576i1713j5066q4068C15130A12855b09617k3189j0207q5960
$$ 196024 -176267 -267843 -91713 -106779 -190847 315130 112855 -209617 -232806 -243013 -328973
19281c28973A50358b71704f9282j98338b3058j76436f9931A30956a82355k9109
$$ -328973 150358 -271704 -69282 -267620 -23058 -199494 -69931 130956 -182355 -211464
19271b11464a05207D192b08009Q5228q6752h9942l18300D4858M1612b5172j9933
$$ -211464 -105207 4192 -208009 -122781 -209533 -89942 -408242 44858 86470 -25172 -45105
19260d5105j70711A10039a40197p377L6672F7032H793L7188J5286a44174K7615
$$ -45105 -215816 110039 -140197 -147574 -110902 67032 8793 45981 61267 -144174 -116559
19249a16559A22537O6314M4923c0137a0005j28726f6780J7076A75893J50104a43121
$$ -116559 122537 188851 233774 -30137 -10005 -138731 -66780 -49704 175893 325997 -143121
19237h2144K7181j62228A30276b25910N3490A70537e3277C0659i9413n7986C5987
$$ -82144 -54963 -217191 130276 -225910 -172420 170537 -53277 30659 -99413 -157399 35987
19225e0460r0759M6018j15143l5701F9891M8013J12631a8547j2418J4882A86912
$$ -50460 -141219 -95201 -210344 -246045 69891 117904 230535 -18547 -30965 -16083 186912
19213f9803A48174a38945A81662C9037r018a28511p7940k1383c6078a4806l2515
$$ -69803 148174 -138945 181662 39037 30019 -128511 -206451 -227834 -36078 -14806 -47321
19202d7321A99901n0231d51283a59476A23801a13327N3978o3786B6058a51720
$$ -47321 199901 149670 -451283 -159476 123801 -113327 -59349 -123135 26058 -151720
19191d6157B58537b59708a16145B13759a0852p0071A43363a46976A36676g786
$$ -46157 258537 -259708 -116145 213759 -10852 -80923 143363 -146976 136676 -7786
19180B60071b22821A04656b9616k7783n1921m7188j65633J13927A09781a16186
$$ 260071 -222821 104656 -29616 -57399 -109320 -156508 -322141 -208214 109781 -116186
19169B8766Q0413D6679i1492A19203J16893a40824B9370a45590A36153J2585f8350
$$ 28766 109179 46679 -91492 119203 236096 -140824 29370 -145590 136153 148738 -68350
19157B42019b32613a0102o3753k1488n2297L6127j8993A89956B5724a16444F2430
$$ 242019 -232613 -10102 -73855 -95343 -147640 -111513 -130506 189956 25724 -116444 62430
19145b83394a41665B460b50311J4046J7893O8009A0884d9482D624K51850c91220
$$ -283394 -141665 2460 -250311 -236265 -218372 -150363 10884 -49482 4624 256474 -391220
19133c4181A1662O6525c02310a19712C2335f0890k76390B4990J14341a90160A91335
$$ -34181 11662 78187 -302310 -119712 32335 -60890 -337280 24990 139331 -190160 191335
19121C7194N076c7291I7876d6037G1869J13983d0265p7297a3955B64579h3187
$$ 37194 42270 -37291 97876 -46037 71869 185852 -40265 -117562 -13955 264579 -83187
19109a09757B04763q8232E5583g5910A56654A6988K13244L6953r9520a27384r2656
$$ -109757 204763 116531 55583 -75910 156654 16988 230232 267185 167665 -127384 -220040
19098b20040A51804f3404j2539m5582j11443A61987a86507E2440f6225o8774A1851
$$ -220040 151804 -63404 -75943 -121525 -232968 161987 -186507 52440 -66225 -134999 11851
19086b17731k15601I6857b19997a06315k06951Q5927D3484D697P4324N0291R8502
$$ -217731 -433332 96857 -219997 -106315 -313266 -227339 43484 4697 79021 129312 227814
19075B27814d25912a12968h171k27833f809p2926b0571A70712m1915d54417I2724
$$ 227814 -425912 -112968 -8171 -236004 -6809 -79735 -20571 170712 128797 -454417 92724
19063E0380K91426h7660B9962J52835b59101A46820a30239A20582a98255I6364
$$ 50380 341806 -87660 29962 182797 -259101 146820 -130239 120582 -198255 96364
19052A13102h9372j04947b6283B62264j29787i3610A83435a29931A79150e0576
$$ 113102 -89372 -194319 -26283 262264 132477 -93610 183435 -129931 179150 -50576
19041b99412B52590b02252a9516k7825B50968a53463m970H6106a29007j5475j1282
$$ -299412 252590 -202252 -19516 -47341 250968 -153463 -158433 86106 -129007 -144482 -155764
19030a55764E7552b78526D4211J44306o6045O9985l7784k5189b75319A03168c08288
$$ -155764 57552 -278526 44211 188517 122472 192457 154673 129484 -275319 103168 -308288
19018A04656g1152L0571C0979a77847n0815A33763J8304a11070n1633D5951a20503
$$ 104656 -71152 -40581 30979 -177847 -228662 133763 152067 -111070 -162703 45951 -120503
19006B07388b3255l3361n8780j2569A51896a25745e4823k89181N6100A34641o811
$$ 207388 -23255 -56616 -115396 -127965 151896 -125745 -54823 -344004 -287904 134641 127830
18995A27830D8610f4414o5547a3703A02274J20484a73603J0880a1892F8032a82686
$$ 127830 48610 -64414 -129961 -13703 102274 222758 -173603 -162723 -11892 68032 -182686
18983H6857b3463G3461a96038M1569e3370o5242D3031K4018J4751N6215b44807
$$ 86857 -23463 73461 -196038 -154469 -53370 -118612 43031 67049 81800 138015 -244807
18971i1446A58855l2598J21843E7235L09634A17239D900c61810J09604f289l9382
$$ -91446 158855 126257 248100 57235 366869 117239 4900 -361810 -252206 -6289 -45671
18960d5671m3222A47384b94889A10143a18175p0972h4182r027j44891l5571R2935
$$ -45671 -88893 147384 -294889 110143 -118175 -189147 -84182 -93209 -238100 -273671 -180736
18949a80736B4275b51143D1400b97424J21745q5066h1895o921j9567j15410c7518
$$ -180736 24275 -251143 41400 -297424 -175679 -260745 -81895 -88816 -108383 -223793 -37518
18937a64802j42032e6706H7820g6093k01861f0289o4355b6167a2593l50159I1635
$$ -164802 -306834 -56706 87820 -76093 -277954 -60289 -124644 -26167 -12593 -362752 91635
18925c08026Q4302a00398M2093j68268A05594a75208I8375g2480l1164l0117B72486
$$ -308026 -223724 -100398 -58305 -226573 105594 -175208 98375 -72480 -103644 -133761 272486
18913A9536K12730E8187J80901d3737l8440E8754B8952a55463h934D8215M638
$$ 19536 232266 58187 239088 -43737 -82177 58754 28952 -155463 -8934 48215 52853
18902E2853a410j23952J0437p2756Q3627q380A04451b33007C47168E7033a54706
$$ 52853 -1410 -125362 -114925 -187681 -104054 -112434 104451 -233007 347168 57033 -154706
18890e8742j74549g9189G2736k1389a32940A9271a41198A2554b72814P3764P9727
$$ -58742 -233291 -79189 72736 51347 -132940 19271 -141198 12554 -272814 -199050 -119323
18879a19323j07589C66525A8448L740f1464p0247A02346b44150D6640a20105B04440
$$ -119323 -226912 366525 18448 22188 -61464 -131711 102346 -244150 46640 -120105 204440
18867a48929B6071d40304J56310a6923k681j19494r5395j3133n0946J42606B90480
$$ -148929 26071 -440304 -283994 -16923 -19604 -139098 -234493 -247626 -298572 -155966 290480
18855C35150a65935C422L2419c73744i9450c5027C8470j3379d5652j0446H8780
$$ 335150 -165935 3422 35841 -373744 -99450 -35027 38470 25091 -45652 -56098 88780
18843a20550A74083b86051J08838j02257g23n1217b3858A45663b78055h488o5023
$$ -120550 174083 -286051 -177213 -279470 -723 -51940 -23858 145663 -278055 -8488 -73511
18832g3511k17001G0657a35205k9013G0506c33535a3875A89840f8314B66614F6841
$$ -73511 -290512 70657 -135205 -164218 70506 -333535 -13875 189840 -68314 266614 66841
18820B14010I7042N255a78283C33632j08719a23102d6882J6909p0607A04759K273
$$ 214010 97042 102297 -178283 333632 224913 -123102 -46882 -29973 -100580 104759 107032
18809A07032a05580A73977a10411B15310J21173A67282c1818k08969k5162M6867
$$ 107032 -105580 173977 -110411 215310 336483 167282 -31818 -240787 -265949 -219082
18799b19082R2892r6231C3635L465i9669p0713E0316b83021D6319H703a12675
$$ -219082 -126190 -222421 33635 37100 -99669 -170382 50316 -283021 46319 8703 -112675
18787A36204f7919K4484F764b63720d1591l58948F1374k1323Q7971B6091M3383
$$ 136204 -67919 -43435 6764 -263720 -41591 -400539 61374 40051 128022 26091 69474
18776F9474a11589k4777A27074a88303C22596o2043b14690f3509A22961c65850
$$ 69474 -111589 -136366 127074 -188303 322596 260553 -214690 -63509 122961 -365850
18765d0436j83028A00178F859J21118F0215c5412L035p8897M8489p4186r4566
$$ -40436 -223464 100178 6859 127977 60215 -35412 -32377 -111274 -62785 -136971 -231537
18754b31537D3193e3083m0432j4720G9262d0022j95462P7218E60L8467Q087c71964
$$ -231537 43193 -53083 -93515 -108235 79262 -40022 -235484 -158266 560 39027 47114 -371964
18741A70970b34063n8920F3964e4424B85019a57183f1948e665m58166J00553a54589
$$ 170970 -234063 -292983 63964 -54424 285019 -157183 -61948 -5665 -463831 -363278 -154589
18729f0320k78915A55167M930d2141B4126R900a42751A52928a12274a6373j67779
$$ -60320 -339235 155167 160097 -42141 24126 34026 -142751 152928 -112274 -16373 -184152
18718a84152k1258j90294i4562j33151M212m1819B84092e6560k09533H6538R6485
$$ -184152 -205410 -395704 -94562 -227713 -223501 -265320 284092 -56560 -266093 86538 183023
18707A83023J1316a10972K6729B34223I4684a41383N4130c0329E385a6393j45190
$$ 183023 194339 -110972 -84243 234223 94684 -141383 -87253 -30329 5385 -16393 -161583
18696a61583q9225E2674a88924G7258d72214K25792O1550o1604L6684b4394q6819
$$ -161583 -250808 52674 -188924 77258 -472214 -246422 -184872 -246476 -209792 -24394 -111213
18685a11213e0283A14081c26356P9857A21330m395d4409g405r8795k0472k79324
$$ -111213 -50283 114081 -326356 -246499 121330 116935 -44409 -7405 -106200 -126672 -405996
18674d05996I7639K4459b28495a5667q1081j82734r1304A08142b40899d5632A58686
$$ -405996 97639 122098 -228495 -15667 -96748 -279482 -370786 108142 -240899 -45632 158686
18662b51079c550k68086G8325a56043e0394A11119i3492j88426B74811a94599
$$ -251079 -3550 -271636 78325 -156043 -50394 111119 -93492 -281918 274811 -194599
18651b78941J12582G0862a7168k66324e3571j55578h8512A59018G6334k5933a49417
$$ -278941 -166359 70862 -17168 -283492 -53571 -209149 -88512 159018 76334 50401 -149417
18639E0692i4009A13283P0014c34783A81196b47014f5791R809j75859D6672J0749
$$ 50692 -94009 113283 183297 -334783 181196 -247014 -65791 -55982 -231841 46672 57421
18628E7421a35863d1246j19175I82J2143F177P9345a8614A19945E4615J91717
$$ 57421 -135863 -41246 -160421 982 13125 6177 85522 -18614 119945 54615 246332
18617B46332J34719q2163D504J22627a06204B78973d00408g2161j64850B55775
$$ 246332 381051 298888 4504 127131 -106204 278973 -400408 -72161 -237011 255775
18606e9796A6721c49193J12511M931p4270J24789K171A16366c19406g9713D6116
$$ -59796 16721 -349193 -236682 -231751 -306021 -181232 -179061 116366 -319406 -79713 46116
18594f031A53776i2117l22634D584a92246F9081a23308j98550Q7203j29892b331
$$ -6031 153776 -92117 -414751 4584 -192246 69081 -123308 -321858 -234655 -364547 -2331
18582D1742f910k8215l93565J78497r295E4648J13334c0061D5481e9863j87110
$$ 41742 -6910 -35125 -428690 -250193 -259488 54648 167982 -30061 45481 -59863 -246973
18571b46973F5278N4476K8652b66231A39836b56260a27447c4722D9019P0187b57777
$$ -246973 65278 119754 148406 -266231 139836 -256260 -127447 -34722 49019 119206 -257777
18559g0198A99012p4456K4468b55850A18049c63510P4893B45103f5180n9951A69688
$$ -70198 199012 124556 149024 -255850 118049 -363510 -288617 245103 -65180 -125131 169688
18547A0589a07022B7216a6237j719j72324F9440g6869A02858a83683d0260q5816
$$ 10589 -107022 27216 -16237 -17956 -190280 69440 -76869 102858 -183683 -40260 -126076
18536a26076e85j64141j56492o4207I7605c91410J89967A02726a25228j28404
$$ -126076 -585 -164726 -321218 -385425 97605 -391410 -201443 102726 -125228 -253632
18526b53632H0329J24042a85793j93474D9162r747J67771a54866I6053e2732k5155
$$ -253632 80329 204371 -185793 -379267 49162 39415 207186 -154866 96053 -52732 -77887
18515g7887E586g7437j14532f8403k10213C2016b08558R9096o5978j41071E45
$$ -77887 5586 -77437 -191969 -68403 -278616 32016 -208558 -109462 -175440 -316511 545
18503A45393L36898A76845b67597A10441E4796K3903d628r8705H6078P8897c11440
$$ 145393 482291 176845 -267597 110441 54796 78699 -4628 -103333 86078 164975 -311440
18491B25700i8247a7177B01539c6647l90831a22499b5155C7423J625J4639J17948
$$ 225700 -98247 -17177 201539 -36647 -427478 -122499 -25155 37423 39048 53687 171635
18480A71635q0755a48900L6659Q828K4806K7741j17082c2125A07663b00043b7132
$$ 171635 90880 -148900 -112241 -103413 -78607 -50866 -167948 -32125 107663 -200043 -27132
18468e5300A10034c1878J3002B68905I7801c6895F2611c52447A00407d83623a16290
$$ -55300 110034 -31878 -18876 268905 97801 -36895 62611 -352447 100407 -483623 -116290
18456E9455J35839a79330p5425f666k11351Q8978B6560a3477A44105G0001b02039
$$ 59455 195294 -179330 -254755 -6666 -218017 -129039 26560 -13477 144105 70001 -202039
18444D04595a2040A66618j1435c7921j05731b501r512k2636A07074c13944A04246
$$ 404595 -12040 166618 155183 -37921 -143652 -2501 -12013 -34649 107074 -313944 104246
18432a88714l7476i7626F4540a46949a3911j18347B37033A9192b0331g569F1808
$$ -188714 -226190 -97626 64540 -146949 -13911 -132258 237033 19192 -20331 -7569 61808
18420i7593M38A5819a50880d2917B69843A2144K08006J9810A7168L6788K2312
$$ -97593 -97155 15819 -150880 -42917 269843 12144 220150 239960 17168 53956 76268
18409G6268K96652c2629r2693N3524A55295a4903A10399d27213g7893A61194g8958
$$ 76268 372920 -32629 -125322 -71798 155295 -14903 110399 -427213 -77893 161194 -78958
18397a70637L5008e0356n1424L112p359A14285b51221o1042J53317f9451b0336
$$ -170637 -135629 -50356 -101780 -98668 -106027 114285 -251221 -312263 -158946 -69451 -20336
18385C02640b8450A16813a26124A434O120J01480a19240A07006J93346g0988C0757
$$ 302640 -28450 116813 -126124 1434 7554 109034 -119240 107006 300352 -70988 30757
18373A47653k9898b34536R4550p4672N6138A12343l8662N8284k7769h6605d2049
$$ 147653 117755 -234536 -139986 -214658 -158520 112343 73681 131965 104196 -86605 -42049
18361B52752g9748q0955C33596B1049P4690c56683E3159o232b07457J9741A24063
$$ 252752 -79748 -160703 333596 21049 95739 -356683 53159 46927 -207457 -187716 124063
18349a3485e829l38917B09310D8307b47589A39393R7399a72939A42263a87387
$$ -13485 -5829 -344746 209310 48307 -247589 139393 236792 -172939 142263 -187387
18338b68789Q2477M7462o843O5220k4290m4879B77215a05585j96766G7994I79
$$ -268789 -186312 -138850 -145693 -80473 -104763 -149642 277215 -105585 -302351 77994 979
18326B61959q7667a15257o4194m5692A93629Q8568c01396e2556j06958P5886c8652
$$ 261959 174292 -115257 -179451 -225143 193629 282197 -301396 -52556 -159514 -83628 -38652
18314d07548A08950h6481G1220b81864A70093f8395k784B15982H7074d3586a3256
$$ -407548 108950 -86481 71220 -281864 170093 -68395 -71179 215982 87074 -43586 -13256
18302b07168Q6940A65234b3296F9072c8551m3968b4544j41048e1039D010a43670
$$ -207168 -120228 165234 -23296 69072 -38551 -82519 -24544 -165592 -51039 4010 -143670
18290a18840b7789p4938d0985p4955r9310K2388H1344L6122a36253l8928M5151
$$ -118840 -27789 -102727 -40985 -115940 -215250 -192862 81344 117466 -136253 -175181 -130030
18279a30030a3812C9243J63115b33865f6228A09281b16647B8108P308L52167d9916
$$ -130030 -13812 39243 202358 -233865 -66228 109281 -216647 28108 35416 387583 -49916
18267b05406D4013L0894P325a8332E9598j4899i380A65268a41151B78769c88139
$$ -205406 44013 74907 82232 -18332 59598 44699 -9380 165268 -141151 278769 -388139
18255F228a73934F7548b17960N7642N9732r6205Q1103B58719C2739K74752K135
$$ 6228 -173934 67548 -217960 -160318 -100586 -196791 -115688 258719 32739 307491 309626
18244C09626h0158B87793B8727L8776c16314C6002g6242D8679g8722j45394m5216
$$ 309626 -80158 287793 28727 67503 -316314 36002 -76242 48679 -78722 -224116 -269332
18233b69332A67104h9991b8556B67725l4292h7034j37506M1555G0059a29779A49907
$$ -269332 167104 -89991 -28556 267725 233433 -87034 -224540 -182985 70059 -129779 149907
18221D8175K15095a51047A73596R5658D5607b8224j49768A3477P7421a55793B55030
$$ 48175 263270 -151047 173596 269254 45607 -28224 -177992 13477 90898 -155793 255030
18209b2130O439B40301a7328j10050K3643j529d5483k99006A88153i7645l82808
$$ -22130 -15691 240301 -17328 -127378 -103735 -105264 -45483 -344489 188153 -97645 -480453
18198d80453B8738O2932e3279G4862h6577c4037E7312O0513c41839h2398B27545
$$ -480453 28738 91670 -53279 74862 -86577 -34037 57312 117825 -341839 -82398 227545
18186A32337b87151A08006O8874H7547a05024b1767B5994e0354R763j28798A20099
$$ 132337 -287151 108006 176880 87547 -105024 -21767 25994 -50354 -40591 -169389 120099
18174B8698e7225j02351e7081j5284H0783c08168B03375i2953d2012j35597O0175
$$ 28698 -57225 -159576 -57081 -72365 80783 -308168 203375 -92953 -42012 -177609 -117434
18163a17434C4224a88194Q7799A43262h6438G6185c1474j25103B71483d8405k38507
$$ -117434 34224 -188194 -100395 143262 -86438 76185 -31474 -156577 271483 -48405 -286912
18152b86912H6831L9220a90287e5850G9145a83726e358G2238A8181J92815C5113
$$ -286912 86831 126051 -190287 -55850 79145 -183726 -5358 72238 18181 210996 35113
18140D4276J83160b00129B36395a58307C8392J74579a40181A25341D3982a39454
$$ 44276 227436 -200129 236395 -158307 38392 212971 -140181 125341 43982 -139454
18129a3742A76445b46339i4722C6598a27834k23712a12814o7644B48792p713i0710
$$ -13742 176445 -246339 -94722 36598 -127834 -351546 -112814 -180458 248792 241079 -90710
18117A1523R0264C1496K70983c74145h2405a4001j45619F5296b32343p3766d5987
$$ 11523 101787 31496 302479 -374145 -82405 -14001 -159620 65296 -232343 -306109 -45987
18105B07902c18374a10791c5625A12308a81125A54518d639B40605j14645g082
$$ 207902 -318374 -110791 -35625 112308 -181125 154518 -4639 240605 125960 -7082
18094c94221a70198J2250l30631a3573k30006j44736J60344a7867k3072C11734
$$ -394221 -170198 -157948 -488579 -13573 -243579 -388315 -227971 -17867 -40939 311734
18083A23340N68h3199k01851M7760g8058B64752a4785A06301D8728J19093a49597
$$ 123340 123908 -83199 -285050 -237290 -78058 264752 -14785 106301 48728 167821 -149597
18071d04379i5950B37739b57958F0242L4255a2135o5653K0145d925B78244b17011
$$ -404379 -95950 237739 -257958 60242 94497 -12135 -77788 -57643 -4925 278244 -217011
18059c02036A04225l7293b32231B44864B6486K336P1129D0730A402R0893b84780
$$ -302036 104225 66932 -232231 244864 26486 28822 99951 40730 1402 92295 -284780
18047a3006j945j06242A55464b9512k0850j77584D36250d9950a6519l9332A707
$$ -13006 -14951 -121193 155464 -29512 -50362 -227946 436250 -49950 -16519 -55851 1707
18035A04219a81052A86212d0888A25907C2771L39302c70068d3575A36962A8814
$$ 104219 -181052 186212 -40888 125907 32771 372073 -370068 -43575 136962 18814
18024A12595e3246A02245l1581a46376A20991K85118e6599e043j77509C40286
$$ 112595 -53246 102245 70664 -146376 120991 406109 -56599 -5043 -182552 340286
18013I3767b58195C5730J11995E8173b81164e1467k04872j49917E2436b39875
$$ 93767 -258195 35730 147725 58173 -281164 -51467 -256339 -406256 52436 -239875
18002B5654d9974I9016e9934I6855a57405C32513A36029A6440i5498c1936H3208
$$ 25654 -49974 99016 -59934 96855 -157405 332513 136029 16440 -95498 -31936 83208
17990B16782k1987I4653b72029c4514l1309C1909L9610b2012A04584b74001d2931
$$ 216782 194795 94653 -272029 -34514 -65823 31909 71519 -22012 104584 -274001 -42931
17978G1165e7789n7574A47631b43160G6214b25937C4204e3691A16256B4087J8276
$$ 71165 -57789 -115363 147631 -243160 76214 -225937 34204 -53691 116256 24087 42363
17967D2363J52327e4364k26777G5617K07610a94483h3869A8191K70591e9378A70615
$$ 42363 194690 -54364 -281141 75617 283227 -194483 -83869 18191 288782 -59378 170615
17955a56341A0052J10623n4555K9698a22266D59792B6319R4279L2380h7590B22700
$$ -156341 10052 120675 66120 95818 -122266 459792 26319 120598 152978 -87590 222700
17943F4081b03368a01236C07663a72281A20449b5979q6617b9810n9370K2439r5693
$$ 64081 -203368 -101236 307663 -172281 120449 -25979 -112596 -29810 -89180 -66741 -162434
17932a62434P1751L2763b1322B40532A3394c28531J25850O7017K9542H7136a07873
$$ -162434 -90683 -57920 -21322 240532 13394 -328531 -202681 -135664 -106122 87136 -107873
17920B92931a25867A27917A508K71481D2114K59433A46704h2646J0981k946K3667
$$ 292931 -125867 127917 1508 272989 42114 301547 146704 -82646 -71665 -74611 -50944
17909e0944C1129M391e8405I1853a80609h641A41219L4997k629c41663A47301
$$ -50944 31129 35520 -58405 91853 -180609 -8641 141219 176216 173587 -341663 147301
17897G129b10324B27379a88672A21030q33d1698D6932N6267a27600p4170A59698
$$ 7129 -210324 227379 -188672 121030 120197 -41698 46932 103199 -127600 -201770 159698
17885G457O6147l3554a37322A20943J25624A01861j0892a1766l265A12030M1280
$$ 7457 73604 40050 -137322 120943 246567 101861 90969 -11766 -15031 112030 153310
17874A53310J41509A43970J21504a49495L7798D874J34297C7814M44859H774J6924
$$ 153310 294819 143970 265474 -149495 -111697 4874 139171 37814 482673 8774 25698
17863B5698b80473j34224A2385b7127k30172d4781j63423I877b7851A43494k3324
$$ 25698 -280473 -414697 12385 -27127 -257299 -44781 -208204 9877 -27851 143494 120170
17852A20170E0635J80211b14763A53278b89065B67487A32011b67493A27904i4403
$$ 120170 50635 230846 -214763 153278 -289065 267487 132011 -267493 127904 -94403
17841a68946B29592G3571a21941A21120H147M4957K0043e0745b4835h411j68543
$$ -168946 229592 73571 -121941 121120 8147 53104 73147 -50745 -24835 -8411 -176954
17830a76954j76553c148p8648a4495E4087K42964K09820B0872K29313D2212a44
$$ -176954 -353507 -3148 -81796 -14495 54087 297051 506871 20872 250185 42212 -144
17818g2723B63028A02295A7317K65913f8944k9714C04838c8082m4647j53564A37043
$$ -72723 263028 102295 17317 283230 -68944 -98658 304838 -38082 -82729 -236293 137043
17806i3384A42697B4812J14231n3016J17347p9731a26454J9884A97973G9015b6689
$$ -93384 142697 24812 139043 86027 203374 123643 -126454 -106570 197973 79015 -26689
17794B57451H3560C1507b82215d0959B44974b47343J2738P5526A06584j8641a62339
$$ 257451 83560 31507 -282215 -40959 244974 -247343 -234605 -159079 106584 87943 -162339
17782F6250a01675l0554j11071C75539d4430C45361E9662b23382G9399O4553E8737
$$ 66250 -101675 -132229 -243300 375539 -44430 345361 59662 -223382 79399 143952 58737
17770e4390K2655A41182J69148l2719n1102q2089P2957C8411J12966c4409j1087
$$ -54390 -31735 141182 310330 277611 226509 144420 217377 38411 151377 -34409 -45496
17759d5496B25691J70476d8391A41642G0557k39J0799a24135A96692G5606L87923
$$ -45496 225691 396167 -48391 141642 70557 70318 81117 -124135 196692 75606 463529
17748D63529H5448K1246K23366a35743A30362c63197J67635A34733p281a96951
$$ 463529 85448 106694 330060 -135743 130362 -363197 -195562 134733 127452 -196951
17737a3922o275k9648C03254e3594C9097K52856m6159L4508K38354a27622B5273
$$ -13922 -20197 -49845 303254 -53594 39097 291953 245794 280302 518656 -127622 25273
17725A59054i6428J6578G3141d665k20110B9427Q1822l4138K1965m7749b74156
$$ 159054 -96428 -79850 73141 -4665 -224775 29427 111249 77111 99076 51327 -274156
17713A75165a47257B95087a00161A12117b5141B72149a46326D7864J437f5042
$$ 175165 -147257 295087 -100161 112117 -25141 272149 -146326 47864 49301 -65042
17702B24660n4114b9661A80763F7496a79891D4456d427C77630a5642A99310Q6503
$$ 224660 170546 -29661 180763 67496 -179891 44456 -4427 377630 -15642 199310 285813
17691B85813a91458C16868a65233A54798e013A18763l296A8522L8262J36873b76005
$$ 285813 -191458 316868 -165233 154798 -5013 118763 115467 18522 56784 193657 -276005
17679A85677M51395C06902a46636C4869K53908a49351A8033J8465j6586P9759
$$ 185677 637072 306902 -146636 34869 288777 -149351 18033 36498 19912 99671
17669I9671b80599A4518K39044J18059G5874N341d58734A9292J38615H571K27671
$$ 99671 -280599 14518 253562 371621 75874 81215 -458734 19292 157907 8571 236242
17658B36242C4526A5162Q8824K31228M7592A05846c0605n0070j07l814A93637
$$ 236242 34526 15162 103986 335214 382806 105846 -30605 -80675 -80782 -84596 193637
17646H2172J42667b1917j37038L1707K5896B49013K90206C9503J26963a61016
$$ 82172 224839 -21917 -158955 -127248 -101352 249013 539219 39503 166466 -161016
17635F2798J59182a45988A51026b24971B04624D0175a61315H6498K68635A76542
$$ 62798 221980 -145988 151026 -224971 204624 40175 -161315 86498 355133 176542
17624F5242j7664f6385D24949I6106J374L9658a28499H4431J24470b329A43514
$$ 65242 47578 -66385 424949 96106 97480 137138 -128499 84431 208901 -2329 143514
17612G4998J12270k2026l1825a63986b1528H6436D2102a48479H2518K44718n2536
$$ 74998 187268 165242 133417 -163986 -21528 86436 42102 -148479 82518 327236 274700
17601B74700h4077A00201e0117o0136B87554A36630P0084J32878a66626E1776
$$ 274700 -84077 100201 -50117 -110253 287554 136630 206714 339592 -166626 51776
17590d2660F1158k2462j9315L75513A04547g3704j2034B28530i8704A17044a13975
$$ -42660 61158 38696 19381 394894 104547 -73704 -85738 228530 -98704 117044 -113975
17578i0241D9043h0178A63574e1280j41907A71624c2200j21059a5705I030L01446
$$ -90241 49043 -80178 163574 -51280 -193187 171624 -32200 -153259 -15705 9030 310476
17567C10476b97405E4749c41860A13504O5436J25131j20265F8826f4553A83599
$$ 310476 -297405 54749 -341860 113504 178940 304071 183806 68826 -64553 183599
17556A64267K43448j98394q2024J3740i2215I9122P9151J58857K10954k33433
$$ 164267 407715 209321 127297 141037 -92215 99122 178273 337130 548084 314651
17546C14651A40592b84A10729j2856J12211l5796G7861a43002D4426K39032K82744
$$ 314651 140592 -284 110729 97873 210084 174288 77861 -143002 44426 283458 566202
17535E66202p3645k39900M7390o4299P0368q6n7098H7938J24336o9615E5624L28644
$$ 566202 492557 252657 300047 235748 306116 306030 248932 87938 212274 142659 55624 384268
17523C84268K91499Q4025C62062J03423B30457K36913p1652E4771J05915b72046
$$ 384268 675767 759792 362062 465485 230457 467370 395718 54771 160686 -272046
17512B54805l8469o3184Q1522J67168P049o1597O7169P3335k26269K43095A69827
$$ 254805 216336 153152 234674 401842 408891 347294 414463 487798 261529 504624 169827
17500D16383M8422e7637D33988b70223C04077B877J41876K29265k0152o1660j17499
$$ 416383 464805 -57637 433988 -270223 304077 2877 144753 374018 353866 292206 174707
17489A74707O7551a138K10A81660Q3006G4599G600K78292a3197C16015j03875
$$ 174707 242258 -1138 -928 181660 264666 74599 7600 285892 -13197 316015 212140
17478B12140n8977d7648A47696o0419L56576C2575L51265j49276E1531L1605L8994
$$ 212140 153163 -47648 147696 87277 443853 32575 383840 234564 51531 83136 122130
17467A22130K7751n6992a1006n1026H7401J04423K73585b58210A60937m4196J58418
$$ 122130 149881 92889 -11006 -62032 87401 191824 465409 -258210 160937 116741 275159
17456B75159L9466n7920N3843N7370j2678A43430J54831J43113J665j49338m892
$$ 275159 314625 256705 310548 367918 355240 143430 298261 441374 443039 293701 288809
17445B88809K61521A06496L09640j32940j03399l348m2568m3630R9645f0930D68728
$$ 288809 550330 106496 416136 283196 179797 176449 133881 90251 189896 -60930 468728
17433C64061L4456A1068K84071b1496A92106L2413L31921B45755P813J17616H8345
$$ 364061 398517 11068 295139 -21496 192106 224519 556440 245755 253568 371184 88345
17421A78827K5055J70005H8860Q4328L5944a98559B87210m2596R615L7817N8761
$$ 178827 203882 373887 88860 173188 209132 -198559 287210 244614 254229 292046 350807
17410C50807P785j62930j7187p8932L50485j82010K1955m0576p0395K96382A18971
$$ 350807 358592 195662 178475 99543 450028 268018 289973 249397 179002 475384 118971
17398B53686e4364B06961h4028A25690d6780H2866a4683A86254M0345K25732K9551
$$ 253686 -54364 206961 -84028 125690 -46780 82866 -14683 186254 226599 452331 481882
17387D81882j01687j70531O565r204O2510H9988C4581R8997F2287M22072j26574
$$ 481882 380195 209664 216229 207025 269535 89988 34581 133578 62287 484359 357785
17376C57785M3184G3921N76202C00451A07942j5882D3633K40642C4463M43025
$$ 357785 400969 73921 650123 300451 107942 92060 43633 284275 34463 477488
17366D77488A99432L58740B42341h5120c1382A20998N8607J61259A29866a22669
$$ 477488 199432 558172 242341 -85120 -31382 120998 179605 340864 129866 -122669
17355B79538a35025F4330P7878a34441c8018C67905k102a0366B94374D7067K80581
$$ 279538 -135025 64330 142208 -134441 -38018 367905 365803 -10366 294374 47067 327648
17344C27648j58878J29137Q1479A3532N4531q233L7309h7424K2941C32258J85953
$$ 327648 168770 297907 379386 13532 68063 59830 97139 -87424 -64483 332258 518211
17333E18211A45684b8978A47789L65732B1260K44041M0442A40688J93360C2493
$$ 518211 145684 -28978 147789 513521 21260 265301 305743 140688 334048 32493
17322B41052J30262A41973K21225j23106j17326D5949J5139R1024M087m9148P0749
$$ 241052 371314 141973 363198 240092 122766 45949 61088 152112 156199 107051 177800
17311A77800b10663A94211O5037H7821K63839j44327c5695B57275K21546k06962
$$ 177800 -210663 194211 259248 87821 351660 207333 -35695 257275 478821 271859
17301B71859j02878j4551K4466E9344J44371Q9978J08845E6411K6746J56633r1374
$$ 271859 168981 154430 178896 59344 203715 293693 402538 56411 83157 239790 148416
17290A48416K07109R0o2322K3905K3374J23217p3561A09694C6273L88265j93046
$$ 148416 355525 355615 293293 317198 340572 463789 390228 109694 36273 424538 231492
17279B31492q6111K65380J01910B31418k1607J38730n9234J76048A50963l2546
$$ 231492 145381 410761 512671 231418 209811 348541 289307 465355 150963 118417
17269A18417J86534k0903L1952R2764J44409j11908I4667J75070K17981j21078
$$ 118417 304951 284048 316000 408764 553173 441265 94667 269737 487718 366640
17259C66640j03687O0430j23408a04579C99504k3953L7020j5425j74878Q8667
$$ 366640 262953 323383 199975 -104579 399504 375551 412571 397146 222268 310935
17249C10935C641J69474G2496L40744j57134K1396a3256C10919k5092l7553p5335
$$ 310935 3641 173115 72496 413240 256106 277502 -13256 310919 285827 248274 172939
17238A72939J17373Q2266j4462q5923n9762K91092A46635F9184L58131J31810
$$ 172939 290312 372578 358116 272193 212431 503523 146635 69184 427315 559125
17228E59125B29274J73359O6458j9280l2660n4140G8646J33941j9344Q3491m4205
$$ 559125 229274 402633 469091 449811 417151 363011 78646 212587 193243 276734 232529
17217B32529J71922j20377c2208B33279M46214B39477P3391J36183A43537R1379
$$ 232529 404451 284074 -32208 233279 679493 239477 312868 449051 143537 234916
17207B34916J78623p0884N7601L2381k03325m3898D2991M45055k14925A35471
$$ 234916 413539 342655 400256 432637 229312 185414 42991 488046 273121 135471
17196D17170j31780I5776J16673J74240A00937K4276N89956k00476M1488j01657
$$ 417170 285390 95776 212449 386689 100937 125213 715169 514693 556181 454524
17186D54524q5215j03729A28133K45675j58333O6935Q0894L7371l1285K27834
$$ 454524 369309 265580 128133 373808 215475 282410 363304 400675 369390 597224
17176E97224k62177L0143J57394r7654L8139M9989A77991K04381q0922J73319
$$ 597224 335047 365190 522584 424930 463069 513058 177991 382372 301450 474769
17166D74769o4852M6128p7794m1708M5276K7456q3096M2046M22634B84033K29518
$$ 474769 409917 456045 378251 336543 381819 409275 326179 368225 790859 284033 513551
17155E13551j10526L3540J89789k13553Q1889K10621B44218Q966J00303Q4398
$$ 513551 403025 436565 626354 412801 494690 705311 244218 253184 353487 437885
17145D37885Q1553O4508k19145K22061j39317J5737J89304l11871J5084N0723
$$ 437885 519438 583946 364801 586862 447545 463282 652586 340715 355799 406522
17135D06522P1504k1564L70733P1649l13252r9379k31212L31139L6901J22094
$$ 406522 478026 456462 827195 898844 585592 486213 255001 586140 623041 745135
17125G45135n2637J18119j57508r7615k05898J24757F5470L85967P9353p0921
$$ 745135 692498 810617 653109 555494 349596 474353 65470 451437 530790 459869
17115D59869l4090K66726k79914J27328M5004L49608j93396j01808m9336Q2465
$$ 459869 425779 692505 412591 539919 584923 934531 741135 639327 589991 672456
17105F72456P8491r037o5902j74712j53848K94835k63154M52727C84097L27872
$$ 672456 750947 741910 676008 501296 347448 642283 379129 831856 384097 711969
17095G11969K34998C05416K44580K68258j33705L1014L9227j24773k15325K65663
$$ 711969 946967 305416 549996 818254 684549 715563 754790 630017 414692 680355
17085F80355j33289L43475k76852J27363k13710M57904m72547K11288o6443q4203
$$ 680355 547066 890541 613689 741052 527342 985246 512699 723987 657544 573341
17075E73341K60074j71676J28781k05910J61098j91309L6537k07000L12437J95075
$$ 573341 833415 661739 790520 584610 745708 554399 590936 383936 696373 891448
17065H91448j25697J94951j97822j46030N45196j35531l19635M8202M2482J77130
$$ 891448 765751 960702 762880 616850 1162046 1026515 706880 755082 797564 974694
17055I74694j5872k13470p06K10014j91218C62785N28413n0281J00615l55670
$$ 974694 958822 745352 744646 954660 763442 362785 891198 840917 941532 585862
17045E85862L38457J2823k09143K48702J7886Q7738m38908J24331K0741K77955
$$ 585862 924319 937142 727999 976701 994587 1082325 643417 767748 788489 1066444
17035A066444m0087j60408L60934j95441J5480N9506k22802N4529l04564L03082
$$ 1066444 1026357 865949 1226883 1031442 1046922 1106428 883626 938155 633591 936673
17025I36673K30585l3542j86990o3744L10108k11405Q0561K28970l50147J2666
$$ 936673 1167258 1133716 946726 882982 1193090 981685 1062246 1291216 941069 953735
17015I53735J29497k77433M36944k74438M25745m74442k2909K02309L06487j54141
$$ 953735 1083232 805799 1242743 968305 1394050 919608 896699 1099008 1405495 1251354
17005A251354l2637J25835K7704n6187r4518j04764N4189P5603K16230n47555
$$ 1251354 1218717 1344552 1372256 1316069 1221551 1116787 1170976 1246579 1462809 915254
16995I15254K44343k3709M60471j99632o8590n2705o476K81000k60085j80065
$$ 915254 1159597 1135888 1596359 1396727 1328137 1275432 1268956 1549956 1289871 1109806
16985A109806L70939l67831K2394J66397o5930p6196M13175p6344j50073J1087
$$ 1109806 1480745 1112914 1135308 1301705 1235775 1159579 1572754 1496410 1346337 1357424
16975A357424r8869m2549J18246k50735L90727L7198o6915N8449K7721O4315j24499
$$ 1357424 1258555 1216006 1334252 1083517 1474244 1511442 1444527 1502976 1530697 1595012 1470513
16964A470513L84622m88934L94140j86593K00315m71799K86054q930K79915k5276
$$ 1470513 1855135 1366201 1760341 1573748 1774063 1302264 1588318 1579388 1859303 1834027
16954A834027m5974K43340m55538M93451k55456k05131M63713o8123J943k3809
$$ 1834027 1788053 2031393 1575855 2069306 1813850 1608719 2072432 2004309 2006252 1982443
16944A982443o5591j67572L00087N66l36361L08820j47947K41272l10328L34329
$$ 1982443 1916852 1749280 2049367 2049933 1713572 2022392 1874445 2115717 1805389 2139718
16934B139718l7485N0863p4724J40828l7896J21098j13508K37007J20566K4972
$$ 2139718 2102233 2153096 2078372 2219200 2181304 2302402 2188894 2425901 2546467 2571439
16924B571439j50768J09792j59879j43994k3538J25552P8108M9007L55413j47535
$$ 2571439 2420671 2530463 2370584 2226590 2203052 2328604 2406712 2455719 2811132 2663597
16914B663597n6662J74336R7523k01991J18829p6952J59982M2375j35664K01477
$$ 2663597 2606935 2781271 2878794 2676803 2795632 2718680 2878662 2921037 2785373 2986850
16904B986850K22507K84810l56194l83505K10309M64270m80588N16014n6587j45702
$$ 2986850 3209357 3494167 3137973 2754468 2964777 3429047 2948459 3464473 3407886 3262184
16894C262184L89741l6109l06190K26419R3998Q3906K7465j88308K80816J12271
$$ 3262184 3651925 3615816 3309626 3536045 3630043 3713949 3741414 3553106 3833922 3946193
16884C946193q4433j15780K15117j16654j13952L75273K32296J7818J03598j59516
$$ 3946193 3861760 3745980 3961097 3844443 3730491 4105764 4338060 4355878 4459476 4299960
16874D299960K89698J12176k25832j19409J82012K95138J05751k41175J65749
$$ 4299960 4589658 4701834 4476002 4356593 4538605 4833743 4939494 4698319 4864068
16865D864068J84369J90303l3499j35534M52769k73833O5322q1060K96592K1848
$$ 4864068 5048437 5238740 5205241 5069707 5522476 5248643 5313965 5232905 5529497 5551345
16855E551345m0706K55309J60619Q3687L24488q3145K63226r4785k2451J69081
$$ 5551345 5510639 5765948 5926567 6010254 6334742 6251597 6514823 6420038 6397587 6566668
16845F566668K36669r9109m4276J67919M40263L092L34186L2235k6262R7806K00261
$$ 6566668 6803337 6704228 6659952 6827871 7268134 7271226 7605412 7637647 7611385 7709191 7909452
16834G909452J74053k7649J84227J53662M35373N8740K09014K87247l2525K75563
$$ 7909452 8083505 8055856 8240083 8393745 8829118 8887858 9096872 9384119 9351594 9627157
16824I627157j35345L07841J31353M08633n6882M69485J65002M75503m19126O99270
$$ 9627157 9491812 9799653 9931006 10339639 10282757 10752242 10917244 11392747 10973621 11672891
16814A1672891q5906M56210L35000j67330O91883K5411M86348N96258O8500M22740
$$ 11672891 11586985 12043195 12378195 12210865 12902748 12928159 13414507 14010765 14079265 14502005
16804A4502005P0394M71846M45564n8529N43097K48514L44503P03168L70035K89422
$$ 14502005 14572399 15044245 15489809 15431280 15974377 16222891 16567394 17270562 17640597 17930019
16794A7930019N44697L94646M70049N60728L31531P15636K75947N46233Q50297
$$ 17930019 18474716 18869362 19339411 19900139 20231670 20947306 21223253 21769486 22619783
16785B2619783L11991K99698R73773Q31344O27428Q48352M30417R13370K48251
$$ 22619783 22931774 23231472 24205245 25036589 25664017 26512369 26942786 27856156 28104407
16776B8104407R04900J115483J123371M98773J014312N97723Q90332J182927J230292
$$ 28104407 29009307 30124790 31248161 31746934 32761246 33358969 34249301 35432228 36662520
16767C6662520J082884R75763J021861J068662J281135R29933J708530J237272
$$ 36662520 37745404 38721167 39743028 40811690 42092825 43022758 44731288 45968560
16759D5968560R07129J475041J368434J472238J308219J590260J340856J559343
$$ 45968560 46875689 48350730 49719164 51191402 52499621 54089881 55430737 56990080
16751E6990080J681777J485698J573067J710863J305902J513383J785473J738414
$$ 56990080 58671857 60157555 61730622 63441485 64747387 66260770 68046243 69784657
16743F9784657J220386J721514J307546J670653J143552J352947J288532J420299
$$ 69784657 71005043 72726557 74034103 75704756 76848308 78201255 79489787 80910086
16735H0910086R29868Q64992J143212P58929O99835Q86529N63182J10139J60482
$$ 80910086 81839954 82704946 83848158 84607087 85306922 86193451 86756633 86866772 87027254
16726H7027254K70161l02942J17389l8924j005230k64075o43041r02496r03017
$$ 87027254 87297415 86994473 87111862 87072938 86067708 85803633 85160592 84258096 83355079
16717H3355079o67063j260178r15609j661004p49203j477574j056861j605009
$$ 83355079 82688016 81427838 80512229 78851225 78102022 76624448 75567587 73962578
16709G3962578j517325j431044j749232j537502j485436j378981j615812j291993
$$ 73962578 72445253 71014209 69264977 67727475 66242039 64863058 63247246 61955253
16701F1955253j206792j732376j400299k015606j134196j106171j573597j156774
$$ 61955253 60748461 59016085 57615786 55600180 54465984 53359813 51786216 50629442
16693E0629442j391371j237619j247908j074315j389070r69918j327219j167125
$$ 50629442 49238071 48000452 46752544 45678229 44289159 43319241 41992022 40824897
16685D0824897r79993r51864j258432o23577j055372r97263q84838q55608p74981
$$ 40824897 39844904 38893040 37634608 37011031 35955659 34958396 34073558 33217950 32442969
16676C2442969j157628m67689j003831o01207n16280o89238r92120k50387p60152
$$ 32442969 31285341 30817652 29813821 29212614 28696334 28007096 27014976 26764589 26004437
16667B6004437q10347l76242m29208p35737k96338n42105p90139j35377l99351
$$ 26004437 25194090 24817848 24388640 23652903 23356565 22814460 22024321 21888944 21489593
16658B1489593n88478n70057m81725k54499n07713n81750m27301k22292n95177
$$ 21489593 20901115 20331058 19849333 19594834 19087121 18505371 18078070 17855778 17260601
16649A7260601l10867M8423m59128k42942o36590J34274p40688j09389k32917
$$ 17260601 16949734 16998157 16539029 16296087 15659497 15793771 15053083 14943694 14710777
16640A4710777n53097k7007k77259n0758n67798M072m12452l32563j17722N9861
$$ 14710777 14157680 14130673 13853414 13802656 13234858 13238930 12826478 12493915 12376193 12436054
16630A2436054k18485m71382m5688l59589k9626K9091p11310r2181N4534J3380
$$ 12436054 12217569 11746187 11700499 11340910 11311284 11340375 10629065 10536884 10591418 10604798
16620A0604798m17725m54706m916k1526j14908J06104l22398j99661l14327R696
$$ 10604798 10187073 9732367 9727451 9705925 9591017 9697121 9374723 9175062 8860735 8870431
16610H870431j27978m9603l1133l08995k59074K3554k05319L40743n06241k17181
$$ 8870431 8742453 8692850 8661717 8352722 8093648 8117202 7911883 8252626 7746385 7529204
16600G529204P1412M1459k69595j04419p9243m8306O7341m03657N3701j11705
$$ 7529204 7600616 7642075 7372480 7268061 7188818 7140512 7207853 6804196 6857897 6746192
16590F746192k84132j40092L31952j84955j25116Q0857j65035l68105L79267j55475
$$ 6746192 6462060 6321968 6653920 6468965 6343849 6424706 6259671 5891566 6270833 6115358
16580F115358k7674j21550r7366j5638k8344j36923j30665l82097L17272p4118
$$ 6115358 6087684 5966134 5868768 5853130 5824786 5687863 5557198 5175101 5492373 5418255
16570E418255L0261l25417L863j76694n3373J33085l788k60608K56755n8699j5053
$$ 5418255 5448516 5123099 5126962 4950268 4896895 5029980 5026192 4765584 5022339 4963640 4948587
16559D948587j82902k75911N45471n23307l2025J30821K30633l67141K9624k51363
$$ 4948587 4765685 4489774 5035245 4511938 4479913 4610734 4841367 4474226 4503850 4252487
16549D252487P8967j75590J26778j72753J42253q7045k50173m7147o2945J58843
$$ 4252487 4331454 4155864 4282642 4109889 4252142 4165097 3914924 3867777 3804832 3963675
16539C963675j56378K11221j24672R9978l48523N1441j37681p9267k14302O69704
$$ 3963675 3807297 4018518 3893846 3993824 3645301 3696742 3559061 3479794 3265492 3935196
16529C935196l53082R3349j90571m50565N16612j17009l5147O9400k49804R0784
$$ 3935196 3582114 3675463 3484892 3034327 3550939 3433930 3398783 3468183 3218379 3309163
16519C309163Q5539j0011k5367J02876l14699l16868K59748k53576L27983j5262
$$ 3309163 3394702 3384691 3359324 3462200 3147501 2830633 3090381 2836805 3164788 3149526
16509C149526J2878j88365Q2138q4245r3320Q8250k20059K16919q4892L0417j27033
$$ 3149526 3162404 2974039 3056177 2971932 2878612 2966862 2746803 2963722 2878830 2909247 2782214
16498B782214k15106M21769j65652n25857M62321j32843L5039n0153L3230J36710
$$ 2782214 2567108 2988877 2823225 2297368 2759689 2626846 2661885 2611732 2644962 2781672
16488B781672j20889R2296k84582k98371K53463K19437k44117p0770J03764j41593
$$ 2781672 2660783 2753079 2468497 2170126 2423589 2643026 2398909 2328139 2431903 2290310
16478B290310M7456J9387O1686j56504k43805L36172m11251K82218j38488o6076
$$ 2290310 2337766 2357153 2418839 2262335 2018530 2354702 1943451 2225669 2087181 2021105
16468B021105j06716J62441K32915k83948J05966m2294L77130n17996J68199l7431
$$ 2021105 1914389 2076830 2309745 2025797 2131763 2089469 2466599 1948603 2116802 2079371
16458B079371Q0885q4263P1386k38785N9481P361j6777L27182o9042j05599l3500
$$ 2079371 2160256 2075993 2147379 1908594 1968075 1975436 1958659 2285841 2216799 2111200 2077700
16447B077700k29579j60275L20464l53780K86459R9082m23130J98027M568j40817
$$ 2077700 1848121 1687846 2008310 1654530 1940989 2040071 1616941 1814968 1819536 1678719
16437A678719J33706j0124K60279p29751K16049l2269K51217l7945O8j94657N09503
$$ 1678719 1812425 1802301 2062580 1332829 1548878 1516609 1767826 1729881 1729949 1535292 2044795
16426B044795l89421M71714n4129n66395K79915j20635n9101l11492M72949l6310
$$ 2044795 1655374 2127088 2072959 1506564 1786479 1665844 1606743 1295251 1768200 1731890
16416A731890r9677k03712J98998j92172K27440L07500k12466k46135J84219k31831
$$ 1731890 1632213 1428501 1627499 1435327 1662767 1970267 1757801 1511666 1695885 1464054
16406A464054N0755R2102Q4044j94255J07446P6929j3726l64618p7600L10691
$$ 1464054 1514809 1606911 1690955 1496700 1604146 1681075 1667349 1302731 1225131 1535822
16396A535822j36279j89217M69313m26959j51835J17886K44056k08490K8632q0073
$$ 1535822 1399543 1210326 1679639 1252680 1100845 1218731 1462787 1254297 1282929 1202856
16386A202856M64652m63645p7131K94416j61681J14031j38351M9089L07320l70993
$$ 1202856 1667508 1203863 1126732 1421148 1259467 1373498 1235147 1284236 1591556 1220563
16376A220563l8729L56032k08748m2745K55670j97297j72835O19957n90062K12919
$$ 1220563 1181834 1537866 1329118 1286373 1542043 1344746 1171911 1791868 1201806 1414725
16366A414725n4529K097k10471L5337J99224L6790k47787k01395L37459k31742
$$ 1414725 1360196 1362293 1151822 1187159 1386383 1423173 1175386 973991 1311450 1079708
16356A079708N7530j48045K99632l62704L36276K10969k01246l8216l23026L36780
$$ 1079708 1137238 989193 1288825 926121 1262397 1473366 1272120 1233904 910878 1247658
16346A247658j8345n1615N5446k47059K84369j35272J20984N0983P3362j4563
$$ 1247658 1229313 1177698 1233144 986085 1270454 1135182 1256166 1307149 1380511 1365948
16336A365948n57271O47392k03822j29806J21441m60540J27910K03684O1558J8024
$$ 1365948 808677 1456069 1252247 1122441 1243882 783342 911252 1114936 1176494 1194518
16326A194518L3094j57144j85940J30661J11359j79094K30043k90033M00536n29463
$$ 1194518 1227612 1070468 884528 1015189 1126548 947454 1177497 887464 1288000 758537
16316G58537J26998J0541R7456j15340K58487q9566K45036k96975m8383j31968
$$ 758537 885535 896076 993532 878192 1136679 1047113 1292149 995174 946791 814823
16306H14823J21729m2987K5259j04207L58472j61356k28192j80387N00887l42202
$$ 814823 936552 893565 918824 814617 1173089 1011733 783541 603154 1104041 761839
16296G61839J08887Q6J2451J30348j91510q1189J75255j29357K43919k53722l3811
$$ 761839 870726 870812 883263 1013611 822101 740912 916167 786810 1030729 777007 743196
16285G43196P9631j31315K65178J08937k77888q8503J6610R9875k24111J12527
$$ 743196 822827 691512 956690 1065627 787739 699236 715846 815721 591610 704137
16275G04137J33405j09522q7373M02037k17681q2976J9283O3780J78622l46182
$$ 704137 837542 728020 640647 1042684 825003 742027 761310 825090 1003712 657530
16265F57530L74822l31779k4288J92843M2839B76802P23085D56368L49096B78634
$$ 657530 1032352 700573 676285 869128 911967 276802 999887 456368 805464 278634
16254H08442r2975k51319K31720O2545J41953j19984p8043k50583J39857q949
$$ 808442 715467 464148 695868 758413 900366 780382 702339 451756 591613 582664
16244E82664L65865l33869J36163P8554J56547D47687K89231Q3607J03542C64949
$$ 582664 948529 614660 750823 829377 985924 447687 736918 820525 924067 364949
16233E24392J25784J00373L14222l05219k96916O36291r7509l05191Q5093l01976
$$ 524392 650176 750549 1064771 759552 462636 1098927 1001418 696227 781320 479344
16223D79344N49157D73156J57598K14324B96299P1509K50852J11213l1764k25069
$$ 479344 1028501 473156 630754 845078 296299 367808 618660 729873 698109 473040
16213D73040M27481j99096j27778L3168j49902J09414j33648O1568o8875n0801
$$ 473040 900521 701425 573647 606815 456913 566327 432679 494247 425372 374571
16203C74571L08053k8577k62011J60789j5638j82642O57983n02667j10967N1996
$$ 374571 682624 654047 392036 552825 537187 354545 1012528 509861 398894 450890
16193D50890J26179j2311o5643J41834J09527k65449L7388L43987k09757B94672
$$ 450890 577069 564758 499115 640949 750476 485027 522415 866402 656645 294672
16182D70250J00393j81078M47042j53596q0936k93893K42885M63252m37480B84847
$$ 470250 570643 389565 836607 683011 602075 308182 551067 1014319 576839 284847
16171D14806A91208K23282P1385j05364O00248l45930j81575M4173j53816K47126
$$ 414806 191208 414490 485875 380511 980759 634829 453254 497427 343611 590737
16161E90737o1528J02382j79913o6978q4331M1819p2889J11044L15120k11146
$$ 590737 529209 631591 451678 384700 300369 342188 269299 380343 695463 484317
16151D84317A08223J87556J13497j92529J58916m0743k6553J06605P9749m1832
$$ 484317 108223 295779 409276 216747 375663 334920 308367 414972 494721 452889
16141D52889j59998K27817B7991M31894K03694j59692q0088J70922n5801f5319
$$ 452889 292891 520708 27991 459885 663579 503887 423799 594721 538920 -65319
16130D81772j77643K24988j29164j8020j58674K24904O7725k1539c3223A67769
$$ 481772 304129 529117 399953 381933 223259 448163 515888 494349 -33223 167769
16119D97568j95011M81930k57757k6739B08742J2789r5149h7523C34192q4189
$$ 497568 302557 784487 526730 499991 208742 221531 126382 -87523 334192 250003
16109B50003J11701A65125J60791j07766L22006A02468L42942B00944J88655e7704
$$ 250003 361704 165125 325916 218150 540156 102468 445410 200944 389599 -57704
16098i8189A91310J26515I4373K48218J166K46841a44014I138K44585J21760H4600
$$ -98189 191310 317825 94373 342591 343757 590598 -144014 9138 253723 375483 84600
16086B34075P9398n8J77917j74890L4389J81111G7633K65464A43666n4183J28865
$$ 234075 313473 313415 491332 316442 350831 531942 77633 343097 143666 89483 218348
16075B18348n9576L59390k57896J9689j16918J21610j2201K85116k11532j43241
$$ 218348 158772 518162 260266 279955 163037 284647 272446 557562 346030 202789
16065B02789c4060D33743a44267C36415N0095n3339R7746A00713K50453M3800
$$ 202789 -34060 433743 -144267 336415 386510 333171 430917 100713 351166 394966
16055C94966j25091p0217k4130a78B29414Q4249F7476R704a2192F24315A60347
$$ 394966 269875 199658 175528 -178 229414 313663 67476 77180 -12192 624315 160347
16043A24493b3109C63448a454B22105N2879o0105q6929L7377J16135A7849J26390
$$ 124493 -23109 363448 -1454 222105 274984 214879 127950 165327 281462 17849 144239
16032A44239O4735J2334q6907E5691J79513J31919H401L08303K14422f890B53902
$$ 144239 208974 221308 134401 55691 235204 367123 8401 316704 531126 -6890 253902
16020A5111K72680n475r7479K92920b10111B17516M9322A23858O1827J97291A61898
$$ 15111 287791 282316 184837 477757 -210111 217516 266838 123858 185685 382976 161898
16008i613I5497C7854L99249A02365O0526n2582J16573q2054l7875K61402m8758
$$ -9613 95497 37854 437103 102365 162891 110309 226882 144828 106953 368355 319597
15997C19597D8122J19815a4107C3567M14574j04490G3297a8976G41422R3127n5853
$$ 319597 48122 167937 -14107 33567 448141 343651 73297 -18976 741422 834549 778696
15986G78696q6937m2760n7424k90201j09077g0842G9540K40016J68466d0451B86529
$$ 778696 691759 648999 591575 301374 192297 -70842 79540 319556 488022 -40451 286529
15974D48189B23923b5044C04208b23012J10928e1623D12544B106J11540d1705
$$ 448189 223923 -25044 304208 -223012 -112084 -51623 412544 2106 113646 -41705
15963c0534B00626a62157C48222m6917k8787e4504A24280k4816J83374F1028j1807
$$ -30534 200626 -162157 348222 301305 272518 -54504 124280 99464 282838 61028 49221
15952D9221b21970B22141b15894f6829G6085f9771a2429I283a2633B0156J64497
$$ 49221 -221970 222141 -215894 -66829 76085 -69771 -12429 9283 -12633 20156 184653
15941A84653A5862J24205a77592B22333l8255J3588O1194d5340C204L6852a35537
$$ 184653 15862 140067 -177592 222333 184078 197666 258860 -45340 3204 40056 -135537
15929B84071A13921K06955f3876K3256B29557G6898C0404K4184j696b97822B95951
$$ 284071 113921 320876 -63876 -40620 229557 76898 30404 54588 52892 -297822 295951
15917C8995a0277p0646j10781k9236d6883G0b61340A86835F8301a60770H1948
$$ 38995 -10277 -80923 -191704 -220940 -46883 70 -261340 186835 68301 -160770 81948
15905d683j15432B54555i7332H6756J37040A7263g223j12028r3600A01849e2922
$$ -4683 -120115 254555 -97332 86756 223796 17263 -7223 -119251 -212851 101849 -52922
15893A90978o1964A6870Q3191a17665A91196b0413k0283A72995g7279A18726J89595
$$ 190978 129014 16870 100061 -117665 191196 -20413 -40696 172995 -77279 118726 308321
15882C08321a33040G4174b4693O282k46766O859B66490F3338P5595D0343N7871
$$ 308321 -133040 74174 -24693 -18411 -265177 -258318 266490 63338 138933 40343 98214
15871I8214G175J20884n3722d3477m0521k5011G1494K16185G4306a67787A52263
$$ 98214 7175 128059 74337 -43477 -83998 -109009 71494 287679 74306 -167787 152263
15859A82771a32382N4728B84223g2971C76988p0735g5867D2105M9437R5277H8912
$$ 182771 -132382 -77654 284223 -72971 376988 306253 -75867 42105 91542 186819 88912
15847e1703J4702k9402j74885f7748G1192q508g3792A34239a14084I4600a7981
$$ -51703 -37001 -66403 -241288 -67748 71192 62684 -73792 134239 -114084 94600 -17981
15835C03725C4813b0757k38119A97558a98786g6893A87897b39110A58908L00639
$$ 303725 34813 -20757 -258876 197558 -198786 -76893 187897 -239110 158908 459547
15825D59547a79973g2602K1358B36000e1822B68660C5458G848c7642A36516b35205
$$ 459547 -179973 -72602 -51244 236000 -51822 268660 35458 7848 -37642 136516 -235205
15813C3001a87044C9585K10365H0336J03546q6085M4047B6212d7086H0163m891
$$ 33001 -187044 39585 249950 80336 183882 97797 141844 26212 -47086 80163 75272
15802G5272Q4737a61922B50979b74840A15789c01836G6377Q5894O052o3187A9585
$$ 75272 160009 -161922 250979 -274840 115789 -301836 76377 162271 168323 105136 19585
15790b95067H9253J85175G2072J42927d3174A10183C8077J45777e0951A29593
$$ -295067 89253 274428 72072 214999 -43174 110183 38077 183854 -50951 129593
15779B31750A1585L9277J33760e1890j00365L242j14262f9692b2782k40827F4172
$$ 231750 11585 50862 184622 -51890 -152255 -149013 -263275 -69692 -22782 -263609 64172
15767b39942B14036A06534J37299b77747a03572L7012A58752l7916J70381A19565
$$ -239942 214036 106534 243833 -277747 -103572 -66560 158752 120836 291217 119565
15756H826K15031K08468k02848q5624C4714L906a98172a1863B04208E4388P1551
$$ 8826 223857 432325 229477 143853 34714 38620 -198172 -11863 204208 54388 125939
15745A25939a969j49068A44640R8981a70498f63F3119a13429G5156d8546F5525
$$ 125939 -1969 -151037 144640 243621 -170498 -663 63119 -113429 75156 -48546 65525
15733a62174P6630A78125a2888B85776C8555b29787B52691j4488i9508B19879
$$ -162174 -85544 178125 -12888 285776 38555 -229787 252691 238203 -99508 219879
15722B314h1936r9781B27629i6833R341k79726F5122N4950g5578j04714g4669
$$ 2314 -81936 -181717 227629 -96833 -87492 -367218 65122 120072 -75578 -180292 -74669
15710A40837k1962O333K21453A47877e019j66813H7427K4705L5445e7428k67585
$$ 140837 118875 125208 346661 147877 -5019 -171832 87427 112132 147577 -57428 -325013
15699c25013d0755B2300P7240A3203O5151a61149k0576A71661J80980b3094j20750
$$ -325013 -40755 22300 99540 13203 78354 -161149 -181725 171661 352641 -23094 -143844
15688a43844k1114d0362j08859d9960B24171G6162d3049q7396a541m8593A1167
$$ -143844 -164958 -40362 -149221 -49960 224171 76162 -43049 -130445 -1541 -50134 11167
15676a68827P3474F323K52013r9410j4476o0184G415a32402m9739P7063r3425
$$ -168827 -95353 6323 258336 158926 144450 84266 7415 -132402 -182141 -105078 -198503
15665a98503b5413I728K78412a11699G5289K32052l5058c7433p3074A09607m903
$$ -198503 -25413 9728 288140 -111699 75289 307341 272283 -37433 -110507 109607 104704
15654A04704B7353a30322a058C05124C2633J4975a7819m64143A95306J43795c29949
$$ 104704 27353 -130322 -1058 305124 32633 47608 -17819 -481962 195306 339101 -329949
15642B07431i5568A65317o1985c9528F5922a3993j32651A697N2758f2654i822
$$ 207431 -95568 165317 103332 -39528 65922 -13993 -146644 1697 54455 -62654 -9822
15630B0814a49358j09126g7900L1472o3827J3779a1076A45439g8350A42749g272
$$ 20814 -149358 -258484 -77900 -46428 -110255 -96476 -11076 145439 -78350 142749 -7272
15618b94944I2760b56336M8371H2813J8529l0872J63706A8383K34901a64197k56758
$$ -294944 92760 -256336 -207965 82813 101342 70470 234176 18383 253284 -164197 -420955
15607d20955i0865b2287C67531A362a46955n116C3850b53469N4441R5792B278
$$ -420955 -90865 -22287 367531 1362 -146955 -152071 33850 -253469 -199028 -103236 2278
15595A23454l2127g7574E5122d58175A80942b02506M6237f1315B93743A06894
$$ 123454 91327 -77574 55122 -458175 180942 -202506 -156269 -61315 293743 106894
15584b83953B6800L923c92982G4659b44568J05625A19450d8630j26748A97740
$$ -283953 26800 30723 -392982 74659 -244568 -138943 119450 -48630 -175378 197740
15573B60753a49818B57513e4865A71222g2170j62555A548e0524C04978a2096A18405
$$ 260753 -149818 257513 -54865 171222 -72170 -234725 1548 -50524 304978 -12096 118405
15561F4149c03487A62914n5533b71636h3957k35797f8756j15430j17294a38011
$$ 64149 -303487 162914 107381 -271636 -83957 -319754 -68756 -184186 -301480 -138011
15550A20816F546J26820c5448A70063A532a65587O6311I4505m2696k2229a24246
$$ 120816 6546 133366 -35448 170063 1532 -165587 -99276 94505 51809 29580 -124246
15538A84594A2898p42b09041B48760L7027g8205m8119C9125J52893a08056k7424
$$ 184594 12898 12156 -209041 248760 285787 -78205 -126324 39125 192018 -108056 -135480
15527a35480A80650O9082g7151A29850A8151N3336K16102a81338h2711F3212J26250
$$ -135480 180650 249732 -77151 129850 18151 71487 287589 -181338 -82711 63212 189462
15516A89462o7251L0732a40839A37133a30270d935A93636F4099h3059A32424E4925
$$ 189462 122211 152943 -140839 137133 -130270 -4935 193636 64099 -83059 132424 54925
15504A5153K81344E9608J72192g2986O07b8357a3815j19950k78212a40670H8441
$$ 15153 296497 59608 231800 -72986 -72379 -28357 -13815 -133765 -411977 -140670 88441
15492A34944d7734C7610J06007D9737b28113j044B39083l5569P7009H1735O433
$$ 134944 -47734 37610 143617 49737 -228113 -229157 239083 203514 280523 81735 88168
15481H8168B693M4134O0098N0231n0820N2673L01937a4296A39763J40765j21313
$$ 88168 2693 46827 106925 157156 106336 159009 460946 -14296 139763 280528 159215
15470A59215n37h2108J2648j12273q0723B03356e0988H6596J3387C1701J13211
$$ 159215 158678 -82108 -69460 -181733 -262456 203356 -50988 86596 99983 31701 144912
15459A44912o9979g2519R213H9802c9374E9257K0225b97623B09404k6523P1514
$$ 144912 74933 -72519 -63306 89802 -39374 59257 79482 -297623 209404 182881 254395
15448B54395r7763J33190l7358N16704B52932J86589A31264a09488J6994B84593
$$ 254395 156632 289822 252464 769168 252932 439521 131264 -109488 -92494 284593
15437C7138p831K76655I5258M29513A1498c4944m02304B03800C033J62355a34745
$$ 37138 29307 305962 95258 524771 11498 -34944 -437248 203800 3033 165388 -134745
15425D0071C727L1896b36195E9041a87312I0149i0971k6016K8086o7217j4413
$$ 40071 3727 35623 -236195 59041 -187312 90149 -90971 -116987 -88901 -156118 -170531
15414a70531D22503a12180L1485H835J64385d1932l4161B11285D1556O465A8154
$$ -170531 422503 -112180 -80695 8835 173220 -41932 -76093 211285 41556 48021 18154
15402C7969h2568B55983c94938a02286j74254A83067b23574C58221a29754B05867
$$ 37969 -82568 255983 -394938 -102286 -276540 183067 -223574 358221 -129754 205867
15391b8312D4883P1189g6241A4494M2303Q5474J44557h9343B48742p3492M5587
$$ -28312 44883 116072 -76241 14494 56797 142271 286828 -89343 248742 175250 220837
15380B20837o5211J18778b5435A02938B944a84658B59815k6116f9816B15099a6238
$$ 220837 155626 274404 -25435 102938 2944 -184658 259815 233699 -69816 215099 -16238
15368B44666i821A46196c58457a49172H7057A6715d959B33032L3684a12401A07397
$$ 244666 -9821 146196 -358457 -149172 87057 16715 -4959 233032 266716 -112401 107397
15356C27719a0800j53488a850H5042k4829b521C50746p1078K01119B39177h094
$$ 327719 -10800 -164288 -1850 85042 60213 -2521 350746 279668 480787 239177 -8094
15344B98009a41192D0781d6001A03872M5159n6740g0924B81763J58295b282F3286
$$ 298009 -141192 40781 -46001 103872 149031 92291 -70924 281763 440058 -2282 63286
15332A50100o4884J2653J56788j9909J8632J83036G6564e4513B24970j04399a59022
$$ 150100 85216 97869 254657 234748 253380 436416 76564 -54513 224970 120571 -159022
15320B82460f7773C9302J58953p0791n0250K08585b50758C04254a16675D29163
$$ 282460 -67773 39302 198255 127464 77214 285799 -250758 304254 -116675 429163
15309a27750a0989B79326j2629j1040P6783m5824j40689c5847C68379f5594j48364
$$ -127750 -10989 279326 266697 255657 332440 286616 145927 -35847 368379 -65594 -213958
15298b13958O1431A65736g7025a2029B29456B220K68898h4247B7899b75412j20301
$$ -213958 -152527 165736 -77025 -12029 229456 2220 271118 -84247 27899 -275412 -395713
15287c95713A9802K25868j02450m3995K747a08297A38127a52568c4933k2189r7537
$$ -395713 19802 245670 143220 99225 101972 -108297 138127 -152568 -34933 -57122 -154659
15276a54659A36573a19569k0198O7754B633N9456K3645g8229g267B22468b55960
$$ -154659 136573 -119569 -139767 -72013 2633 62089 85734 -78229 -7267 222468 -255960
15264A49281J94573j39587H9648k6341a04845A62887J34411i5907A18413J58868
$$ 149281 343854 204267 89648 63307 -104845 162887 297298 -95907 118413 277281
15254B77281J95813a82599C57351R893A79732N93814O58678K68190j70440N17482
$$ 277281 473094 -182599 357351 367244 179732 773546 1432224 1700414 1529974 2047456
15244B047456r99817D97338p7732p1178f8608B92637j46306b34584A83980a11106
$$ 2047456 1047639 497338 419606 348428 -68608 292637 146331 -234584 183980 -111106
15233C12884F6437K15288E4725N2032a08191D1580b0014p2338L4132G7912j4852
$$ 312884 66437 281725 54725 106757 -108191 41580 -20014 -92352 -58220 77912 63060
15222F3060c1661f475A55851a03100A1772O6074B3396J86157a59557j17403K7969
$$ 63060 -31661 -6475 155851 -103100 11772 77846 23396 209553 -159557 -276960 -248991
15211b48991D2067N5134M9788d36819b7139C19418C1770d5609E48504a42596C7213
$$ -248991 42067 97201 146989 -436819 -27139 319418 31770 -45609 548504 -142596 37213
15199A25471f3521A28068J844L251b37920B35313c8809k7158o7391A93202a19802
$$ 125471 -63521 128068 129912 133163 -237920 235313 -38809 -65967 -133358 193202 -119802
15187B21583A10163Q2630a36539A13756a3409G6087d410l14517F796c22186A38995
$$ 221583 110163 192793 -136539 113756 -13409 76087 -4410 -318927 6796 -322186 138995
15175A85480m4503b96258a07172O998i166C9849d1490a4413H1897a4327E4602
$$ 185480 140977 -296258 -107172 -100174 -9166 39849 -41490 -14413 81897 -14327 54602
15163B8766a8079k9160L081j51838H2050P7692b5366k8914A06207D8266J64737
$$ 28766 -18079 -47239 -44158 -195996 82050 159742 -25366 -54280 106207 48266 213003
15152B13003a26839G9342L66811e6179k6884A51465J17724I8061b76885A35196
$$ 213003 -126839 79342 446153 -56179 -83063 151465 269189 98061 -276885 135196
15141A0759K90358a45988A57202f3955B56073D6020K65250a43623A38546l7194
$$ 10759 301117 -145988 157202 -63955 256073 46020 311270 -143623 138546 101352
15131A01352e2654J3569A00414b18336B5590a55217I9414L36290a11816H8224
$$ 101352 -52654 -39085 100414 -218336 25590 -155217 99414 435704 -111816 88224
15120A43758a28618C8431L76671K40979B16470E0470K5594J3406O706C8275a66562
$$ 143758 -128618 38431 415102 656081 216470 50470 76064 89470 96176 38275 -166562
15108b6073j59252E7727J52951h8703A76953a25205I4993D4820b5959A99540Q4704
$$ -26073 -185325 57727 210678 -88703 176953 -125205 94993 44820 -25959 199540 284244
15097B84244A4793J09158h715E6912K51406j41092J69264i7853B77357j08836
$$ 284244 14793 123951 -8715 56912 308318 167226 336490 -97853 277357 168521
15087A68521J99648H8820n083D0707a17185H1567Q0494P0620a38452C39951j15111
$$ 168521 368169 88820 83737 40707 -117185 81567 162061 232681 -138452 339951 224840
15076B24840a16319M3540G0821L02334k3103j00554e7313D3254A4622h2457J9599
$$ 224840 -116319 -72779 70821 373155 350052 249498 -57313 43254 14622 -82457 -62858
15065f2858D2123D147L29112O5102A67376b9547D7703a30104C30324C6885K25974
$$ -62858 42123 4147 333259 398361 167376 -29547 47703 -130104 330324 36885 262859
15054B62859h9664B14008i1765L2356B94469b93127g1967B20412F4132J95244
$$ 262859 -89664 214008 -91765 -59409 294469 -293127 -71967 220412 64132 259376
15044B59376l9252K14110A49363G2069e7724G1747L67381p5806J33739A29194
$$ 259376 220124 434234 149363 72069 -57724 71747 439128 363322 497061 129194
15033B69586I7488L68141d3575D38281q6687m418A64325K87977B15494J51677
$$ 269586 97488 465629 -43575 438281 351594 347176 164325 452302 215494 367171
15023C67171J06905J71378A80228J74685n7795G5536k1720J38202Q5252k0768
$$ 367171 474076 645454 180228 354913 297118 75536 53816 192018 277270 256502
15013B56502L39928B13628r9313L86117A56484J57735A16617N38699B33440k8785
$$ 256502 596430 213628 114315 500432 156484 314219 116617 655316 233440 204655
15003B04655R906K73464l2515b5074I1202K05882P9126R0783A05317K30467J41464
$$ 204655 214561 488025 455510 -25074 91202 297084 376210 466993 105317 335784 477248
14992D77248A70459J26888M2716j60032L23420k33305M3986K24101B10822J66528
$$ 477248 170459 297347 340063 180031 503451 270146 314132 538233 210822 377350
14982C77350b05520A24394K82641o656Q8863k4286J27163J10548k40994k05241
$$ 377350 -205520 124394 407035 400379 489242 464956 592119 702667 461673 256432
14972B56432O5620j39693E0249J22904K33075o9232p543A32896a3622A77071L9997
$$ 256432 322052 182359 50249 173153 406228 336996 329453 132896 -13622 177071 217068
14961B17068J97037k06722K63327J12330H2344K22462I1919K43945K95560l11243
$$ 217068 414105 207383 470710 583040 82344 304806 91919 335864 631424 320181
14951C20181j45510J55720D0736L63334j023j46792J54327A53861K12643Q0294
$$ 320181 174671 330391 40736 404070 403047 256255 410582 153861 366504 446798
14941D46798A6374L73677I3882L10312j09838K3458N9913K15337k5846j26169
$$ 446798 16374 390051 93882 404194 294356 317814 377727 593064 567218 441049
14931D41049L25005j11446J70105l36453o6273Q42268l86410j53002M4844J3271
$$ 441049 766054 654608 824713 488260 421987 1264255 877845 724843 769687 782958
14921G82958k66769L92840L2139Q6211L83710l19308l6633M4770m45492p2592
$$ 782958 516189 909029 941168 1027379 1411089 1091781 1055148 1099918 654426 581834
14911E81834p4207B32531K93565A85720N49687B61793K7861L8253j47918R8800
$$ 581834 507627 232531 526096 185720 735407 261793 289654 327907 179989 278789
14901B78789O7309J74877j54412J86278A64775J01299P0230j45732M85434B98910
$$ 278789 346098 520975 366563 552841 164775 266074 336304 190572 676006 298910
14890B98711j1386J73846J9091J43424m6381r0401J47745j23213p4854J0012J8999
$$ 298711 287325 461171 480262 623686 577305 486904 634649 511436 436582 446594 465593
14879D65593B9093M40231K52352B93686J51986K8030j872A97087M1015L39709
$$ 465593 29093 469324 721676 293686 445672 473702 471830 197087 238102 577811
14869E77811J2883o2512k24416j17383K66675L7037i0433E93747k20436J43151
$$ 577811 590694 528182 303766 186383 453058 490095 -90433 593747 373311 516462
14859E16462j21154O0824J58956l02362K99027B71113K58074k11931O4769A20841
$$ 516462 395308 456132 615088 312726 611753 271113 529187 317256 382025 120841
14848C82678J76515Q4726j11663A99711K60613m8966J02581J62763N3022j95453
$$ 382678 559193 643919 532256 199711 460324 411358 513939 676702 729724 534271
14838E34271M30335k25910j13855q0978k10955J19733A92509K20780m8775j79863
$$ 534271 964606 738696 624841 543863 332908 452641 192509 413289 364514 184651
14828A84651M47081p5238K558p0013K58729j73211j10061j43392J43020m415M468
$$ 184651 631732 556494 559052 489039 747768 574557 464496 321104 464124 459709 464177
14817D64177R2090B24017J59170m6871q2001K06346k9574O9692B20849M26985
$$ 464177 556267 224017 383187 336316 254315 460661 431087 500779 220849 647834
14807F47834j7155B41903M76357j08468K8455J29112n5903l2168l852J02190l25540
$$ 647834 630679 241903 718260 609792 638247 767359 711456 679288 675436 777626 452086
14796D52086j13846K4781j27497K31450r2330j0009l27m353J31098P5593J5935
$$ 452086 338240 363021 235524 466974 374644 364635 364308 359955 491053 566646 582581
14785E82581M6138j35185q6537R3137J11659j33908r9903N7675K979L44295k88002
$$ 582581 628719 493534 406997 500134 611793 477885 377982 435657 438636 782931 494929
14774D94929k37284M25853l3487k16108j97140M17708j98865P7970J99697k93867
$$ 494929 257645 683498 650011 433903 236763 654471 455606 533576 733273 439406
14764D39406j16486J97884j07072J4585M44179m23348n004r066K33265k52524
$$ 439406 322920 520804 413732 428317 872496 449148 444144 435078 668343 415819
14754D15819L20285l43246K01600p5858j80018n754J25801K74761q6431B94570
$$ 415819 736104 392858 594458 518600 338582 332828 458629 733390 646959 294570
14743F44908l09472K25723m6985p3731J85810l4969K91317k04494k79571N0291
$$ 644908 335436 561159 514174 440443 626253 591284 882601 678107 398536 448827
14733D48827L51169l80228K85062K40255m03208L65102q8865K26320k28689J12669
$$ 448827 799996 419768 704830 945085 541877 906979 818114 1044434 815745 928414
14723I28414r969M6162J50992j00835q8082K69652n15523J47948k38748J00018
$$ 928414 918445 964607 1115599 1014764 926682 1196334 680811 828759 590011 690029
14713F90029k33015J62838P7592R8657j56962N7695K5521C10004L29707K16338
$$ 690029 457014 619852 697444 796101 639139 696834 722355 310004 639711 856049
14703H56049K02399q8773m30548J21151M60891J194k03521K17805j06164j31990
$$ 856049 1058448 969675 539127 660278 1121169 1122363 918842 1136647 1030483 898493
14693H98493j57639k7559J2415K18533P7468l21988J39803P2248j27990Q2661
$$ 898493 740854 713295 725710 944243 1021711 699723 839526 911774 783784 866445
14683H66445R9290l95368K13953K15424l75460N06855k67655J3463M8054q6303
$$ 866445 965735 570367 784320 999744 624284 1131139 863484 876947 925001 838698
14673H38698K80531n01011K95442j26613o7738k69948L22313J56982Q5682M0788
$$ 838698 1119229 618218 913660 787047 719309 449361 771674 928656 1014338 1055126
14663A055126l02261q6211J29686J36503l10631L99107o5778K1558j03357l85438
$$ 1055126 752865 666654 796340 932843 622212 1021319 955541 977099 873742 488304
14653D88304L61982k9324R5706j35432n3259M73124n7914j37797j86358O8870
$$ 488304 850286 820962 916668 781236 727977 1201101 1143187 1005390 819032 887902
14643H87902K92907k55224J56591j80384k18972L35025Q1373N9604j3827J8286
$$ 887902 1180809 925585 1082176 901792 682820 1017845 1099218 1158822 1144995 1163281
14633A163281j74624l2796J62999P8500k41101L56552J24750m50858j00060M95036
$$ 1163281 988657 955861 1118860 1197360 956259 1312811 1437561 986703 886643 1381679
14623A381679j09352J18223l79217O3513K11425K9101m24292K07979M178K21931
$$ 1381679 1272327 1390550 1011333 1074846 1286271 1315372 891080 1099059 1103237 1325168
14613A325168l17555M34475m83126J23391K65914J99133l40369j01896N1883R5713
$$ 1325168 1007613 1442088 958962 1082353 1348267 1547400 1207031 1105135 1157018 1252731
14603A252731J12468j94036K09291j86367L49672k90581J86701O373l06202r5054
$$ 1252731 1365199 1171163 1380454 1194087 1543759 1253178 1439879 1446252 1140050 1044996
14593A044996K75764L88701k20185J43371n6029Q8597q1593k37058N9366M27684
$$ 1044996 1320760 1709461 1489276 1632647 1576618 1665215 1583622 1346564 1405930 1833614
14583A833614m55989M31339j54552L38303j29478q9330j07796K8294K3417Q4605
$$ 1833614 1377625 1808964 1654412 1992715 1863237 1773907 1666111 1694405 1717822 1802427
14573A802427K27160m04608L403M38308m26391L27408j53958J67192R0235K06825
$$ 1802427 2029587 1624979 1628382 2066690 1640299 1967707 1813749 1980941 2071176 2278001
14563B278001l88250J16178L22463o6937j88444J64524M72599n35953N31604K06059
$$ 2278001 1889751 2005929 2328392 2261455 2073011 2237535 2710134 2174181 2705785 2911844
14553B911844J25747K02384R78661J296517K025450M142730Q036046J4154619
$$ 2911844 3037591 3239975 4218636 5515153 7540603 11683333 19719379 33873998
14545C3873998K304494j7478652q022335E151092k034523o16252q6459n45855
$$ 33873998 36178492 18699840 10677505 5151092 3116569 2500317 2413858 1868003
14537A868003m32167K98489o9973j67852k50089N47145M6093K22415j74945J26433
$$ 1868003 1435836 1734325 1664352 1496500 1246411 1793556 1839649 2062064 1887119 2013552
14527B013552p1244m19491L72688K73069j83010j80255N7783L17576K7461k16949
$$ 2013552 1942308 1522817 1895505 2168574 1985564 1805309 1863092 2180668 2208129 1991180
14517A991180J40174q2525M04323j07137n1954o4015J2247J36748J5196j7833
$$ 1991180 2131354 2048829 2453152 2346015 2294061 2230046 2242293 2379041 2394237 2376404
14507B376404J72165l32607L06380N8744N3216r5835P033k64176M12395R410j12640
$$ 2376404 2548569 2215962 2522342 2581086 2634302 2538467 2545500 2281324 2693719 2703129 2590489
14496B590489p0633N68573m04326J08283k3493j70854q591N57251j00490k58972
$$ 2590489 2519856 3088429 2684103 2792386 2768893 2598039 2589448 3146699 3046209 2787237
14486B787237M72413K6105k14584j63193J78749j29827K62514j4636K38854j14734
$$ 2787237 3259650 3285755 3071171 2907978 3086727 2956900 3219414 3204778 3443632 3328898
14476C328898Q5994L1469j98619J43601L4522P4115J69171K40625l21016J60652
$$ 3328898 3414892 3446361 3247742 3391343 3425865 3499980 3669151 3909776 3588760 3749412
14466C749412Q7981M5778q5530Q2606K71924n04174J59526J99738p7756M8918
$$ 3749412 3837393 3883171 3797641 3880247 4152171 3647997 3807523 4007261 3929505 3978423
14456C978423R3566J34535K1401J79521M5955L6368m7742K47488l55133L37107
$$ 3978423 4071989 4206524 4227925 4407446 4453401 4489769 4442027 4689515 4334382 4671489
14446D671489j3599j04799M8198J897K91196K05929L30227o81337J69691K57647
$$ 4671489 4657890 4553091 4601289 4603186 4894382 5100311 5430538 4749201 4918892 5176539
14436E176539L14056l10216N55503l59566P0324L30514J22424n1296J09557r0618
$$ 5176539 5490595 5180379 5735882 5376316 5446640 5777154 5899578 5848282 5957839 5867221
14426E867221K06960J43224K36533k09602O54326n08217N33856J7079r4018L16126
$$ 5867221 6074181 6217405 6453938 6244336 6898662 6390445 6924301 6941380 6847362 7163488
14416G163488q5986K34800K36535k40596j5035K89141L70727m33597N03076j1461
$$ 7163488 7077502 7312302 7548837 7308241 7293206 7582347 7953074 7519477 8022553 8011092
14406H011092k7220P12410q9195j35176J04362L3376J66319J05279R6572O62794
$$ 8011092 7983872 8696282 8607087 8471911 8576273 8609649 8775968 8881247 8977819 9640613
14396I640613k00937L14349q3600J48908M34690J05983J89225J5854K76851k3294
$$ 9640613 9439676 9754025 9670425 9819333 10254023 10360006 10549231 10565085 10841936 10818642
14386A0818642L84202l9776O01091p0960J66401N27930n6848M65077J37409J28124
$$ 10818642 11202844 11163068 11764159 11693199 11859600 12387530 12330682 12795759 12933168 13061292
14376A3061292L61132J06010M32075N16854m4378j4216N28385K47870N57643P1191
$$ 13061292 13422424 13528434 13960509 14477363 14432985 14418769 14947154 15195024 15752667 15823858
14366A5823858K33446M63395K33647M12320P27639Q9764N48981J11541O29447
$$ 15823858 16057304 16520699 16754346 17166666 17894305 17984069 18533050 18644591 19274038
14357A9274038L14461M30254N44550L25764O79713N69707L57210N58062N28062
$$ 19274038 19588499 20018753 20563303 20889067 21568780 22138487 22495697 23053759 23581821
14348B3581821P65532M67103P96734P45038L88046R31301N96240R16882M10564
$$ 23581821 24347353 24814456 25611190 26356228 26744274 27675575 28271815 29188697 29599261
14339B9599261Q71311J064053O54399J083962J187620R99050J123243Q43563J248050
$$ 29599261 30470572 31534625 32189024 33272986 34460606 35459656 36582899 37426462 38674512
14330C8674512J308641J427722J375973J151158J652323J454608J789830J697859
$$ 38674512 39983153 41410875 42786848 43938006 45590329 47044937 48834767 50532626
14322E0532626J786894J710041J773209K401467K112426K431359K313939K371911
$$ 50532626 52319520 54029561 55802770 58204237 60316663 62748022 65061961 67433872
14314F7433872K784744L119512L056393L230670L260926L888374L610528M473690
$$ 67433872 70218616 73338128 76394521 79625191 82886117 86774491 90385019 94858709
14306I4858709M177372M866678M811849N214657N839647N782320O631482O665183
$$ 94858709 99036081 103902759 108714608 113929265 119768912 125551232 132182714 138847897
14298A38847897P588938P333268Q165622R258164R274183R961761J0140744J0775745
$$ 138847897 146436835 153770103 161935725 171193889 180468072 190429833 200570577 211346322
14290B11346322J1784591J2442168J2573176J3729255J4449355J4591742J5379400
$$ 211346322 223130913 235573081 248146257 261875512 276324867 290916609 306296009
14283C06296009J5334750J6478345J6222357J5972615J5609619J4737705J3695634
$$ 306296009 321630759 338109104 354331461 370304076 385913695 400651400 414347034
14276D14347034J2595198J0429779P120345J048710n54806q91079o03528n27801
$$ 414347034 426942232 437372011 444492356 445541066 444986260 444095181 443491653 442963852
14268D42963852o011478p646302r211646j1146026j2562949j3787979j4433548
$$ 442963852 436952374 429306072 420094426 408948400 396385451 382597472 368163924
14261C68163924j4879958j5251641j5734630j5566064j5413002j5054500j4534732
$$ 368163924 353283966 338032325 322297695 306731631 291318629 276264129 261729397
14254B61729397j3428913j1931583j2460930j1991312j1514241j0361074r880041
$$ 261729397 248300484 236368901 223907971 211916659 200402418 190041344 180161303
14247A80161303r344379q893626p990599p486981p066396p092114o212161n787667
$$ 180161303 170816924 161923298 153932699 146445718 139379322 132287208 126075047 120287380
14239A20287380n769275n029433m968539m469655m456326m222572l857829l326846
$$ 120287380 114518105 109488672 104520133 100050478 95594152 91371580 87513751 84186905
14231H4186905l035905l800869k911711k883759l186099k336584k992521j822805
$$ 84186905 81151000 77350131 74438420 71554661 68368562 66031978 63039457 61216652
14223F1216652k432640j649702k217814j769083k092223j244742j782582j704886
$$ 61216652 58784012 57134310 54916496 53147413 51055190 49810448 48027866 46322980
14215D6322980j323432j433533j323321j366516j389861j064282r45471j187160
$$ 46322980 44999548 43566015 42242694 40876178 39486317 38422035 37476564 36289404
14207C6289404r57300q80233j032060j092855p12711r66312r65087n37065o86233
$$ 36289404 35332104 34451871 33419811 32326956 31614245 30647933 29682846 29145781 28459548
14198B8459548r39490j013237n81863o40087o56914p71244m94909l94383p16901
$$ 28459548 27520058 26506821 25924958 25284871 24627957 23856713 23361804 22967421 22250520
14189B2250520o41879j50935l56166p50208o59487k1750r85487j32170r6194p44253
$$ 22250520 21608641 21457706 21101540 20351332 19691845 19670095 18684608 18552438 18456244 17711991
14179A7711991k48408m34925n26004j49061l28360m37913L4597m66165n86044
$$ 17711991 17463583 17028658 16502654 16353593 16025233 15587320 15621917 15155752 14569708
14170A4569708k43838j60951p5036k23277m9332m31409o51279J73403m09491J29986
$$ 14569708 14325870 14164919 14089883 13866606 13817274 13385865 12734586 12907989 12498498 12628484
14160A2628484q01215J7782l95989j52816n5063j31836j76867J15786n81823o7263
$$ 12628484 11827269 11845051 11449062 11296246 11241183 11109347 10932480 11048266 10466443 10399180
14150A0399180n5732j6225n65028l36570J39754J14000o31237M982j07424j65886
$$ 10399180 10343448 10327223 9762195 9425625 9565379 9679379 9048142 9053124 8945700 8779814
14140H779814l57646J40188m56561r8322J03082j50287j46452j24892K67335j98819
$$ 8779814 8422168 8562356 8105795 8007473 8110555 7960268 7813816 7688924 7956259 7757440
14130G757440k11273l219j85594k27419K2481q8984k44566K06961k03608n8795
$$ 7757440 7546167 7542948 7357354 7129935 7152416 7063432 6818866 7025827 6822219 6763424
14120F763424k76480Q3754k47630N3484l06804l50199L15364P486l79285J68240
$$ 6763424 6486944 6570698 6323068 6376552 6069748 5719549 6034913 6042399 5663114 5831354
14110E831354J53309m77251J14719j6176l15926J33037k53290L91430o55223K60456
$$ 5831354 5984663 5507412 5622131 5605955 5290029 5423066 5169776 5561206 4905983 5166439
14100E166439k89806K75901l47706p4522K98441l90215q7235L32601k37733j71735
$$ 5166439 4876633 5152534 4804828 4730306 5028747 4638532 4551297 4883898 4646165 4474430
14090D474430J25972Q1851m69449L17638p1930m40273K23217L75197m07771J8839
$$ 4474430 4600402 4682253 4212804 4530442 4458512 4018239 4241456 4616653 4208882 4227721
14080D227721j18518j16355J98817j76171k0833j47105m19234K67440J38124j85879
$$ 4227721 4109203 3992848 4191665 4015494 3994661 3847556 3428322 3695762 3833886 3648007
14070C648007l78383K80439j44370J37738J66088l67281L11242j25211k4808j26316
$$ 3648007 3269624 3550063 3405693 3543431 3709519 3342238 3653480 3528269 3503461 3377145
14060C377145l6927J30164k11543o2622R1629K04020l40235n24139M54534r888
$$ 3377145 3340218 3470382 3258839 3196217 3287846 3491866 3151631 2627492 3082026 3072138
14050C072138o7556J16442j29015k81157p4760N57639n87007K85306r0363r6614
$$ 3072138 3004582 3121024 2992009 2710852 2636092 3193731 2606724 2892030 2801667 2705053
14040B705053J16612l18532r0588N29789n18005K88350K40934j27794j67732k0094
$$ 2705053 2821665 2503133 2412545 2942334 2424329 2712679 2953613 2825819 2658087 2637993
14030B637993k55046k8956L21733l8490k33277o8789K67125l38570j72548L35694
$$ 2637993 2382947 2353991 2675724 2637234 2403957 2335168 2602293 2263723 2091175 2426869
14020B426869q5259j05481R7760N6576n77564M48943k3422k97323J14855l09162
$$ 2426869 2341610 2236129 2333889 2390465 1812901 2261844 2238422 1941099 2055954 1746792
14010A746792L85352j15124k33964J21187j99672K50392J94691k67674j23435
$$ 1746792 2132144 2017020 1783056 1904243 1704571 1954963 2149654 1881980 1758545
14001A758545M01142j60948l89066J98372o2764K7338O674k19549L59109Q9451
$$ 1758545 2159687 1998739 1609673 1808045 1745281 1772619 1779293 1559744 1918853 2008304
13991B008304K08575M43432J456389K709612N778091J2540639J2977469j4360595
$$ 2008304 2216879 2660311 4116700 6826312 12604403 25145042 38122511 23761916
13983B3761916j1035272n022118k136223q44736q94666l34493k44140m84461l3406
$$ 23761916 12726644 7704526 5568303 4723567 3828901 3494408 3250268 2765807 2732401
13974B732401k20638j58740K1903j94556K60174q56824L88443J47019J05078k74773
$$ 2732401 2511763 2353023 2374926 2180370 2440544 1583720 1972163 2119182 2224260 1949487
13964A949487j52011K42551m10657O0839p5727l2808J38824J24010N7610l22137
$$ 1949487 1797476 2040027 1629370 1690209 1614482 1581674 1720498 1844508 1902118 1579981
13954A579981K79295k44951n5103J19724j42685O3587K04599l54212M3168L53523
$$ 1579981 1859276 1614325 1559222 1678946 1536261 1599848 1804447 1450235 1493403 1846926
13944A846926l34794J94417j67706k87621L67284k04941J56190J03820p0191k17928
$$ 1846926 1512132 1706549 1538843 1251222 1618506 1413565 1569755 1673575 1603384 1385456
13934A385456r6113J58680l90216P88904m47498J33202j55949r9359P9865Q4361
$$ 1385456 1289343 1448023 1057807 1846711 1399213 1532415 1376466 1277107 1356972 1441333
13924A441333n6303j08708l6773K92217l42518p1476M63214m40671P0081J78438
$$ 1441333 1385030 1276322 1239549 1531766 1189248 1117772 1580986 1140315 1210396 1388834
13914A388834m21368J10732m181J34989L63936l24597J29480m09025M51828k63149
$$ 1388834 967466 1078198 1074017 1209006 1572942 1248345 1377825 968800 1420628 1157479
13904A157479P0233J03073F52353M88170j56704K38572n960m02354M31006k21137
$$ 1157479 1227712 1330785 652353 1140523 983819 1222391 1216431 814077 1245083 1023946
13894A023946L0772L44752n78155M11771l16962K9717K21980j59309J99730m005
$$ 1023946 1054718 1399470 821315 1233086 916124 945841 1167821 1008512 1208242 1204237
13884A204237p3515l26101K25468j42727n2571K0498L09018k5846k33060n2520
$$ 1204237 1130722 804621 1030089 887362 834791 855289 1164307 1138461 905401 852881
13874H52881K20472k64759K68143j02398j17343L26893l41913o3745K23561K3730
$$ 852881 1073353 808594 1076737 974339 856996 1183889 841976 778231 1001792 1025522
13864A025522p101l9273q8842K43975J9517j79200p5937K14172k13379j9859k2857
$$ 1025522 1018421 979148 890306 1134281 1153798 974598 898661 1112833 899454 879595 856738
13853H56738j11924j96076K51091L09796l38368J30439l235k50530J80193j99053
$$ 856738 744814 548738 799829 1109625 771257 901696 898461 647931 828124 629071
13843F29071J70110n170j8540J91223k77445j0899J18235K8819r4794P7411J71065
$$ 629071 799181 794011 775471 966694 689249 678350 796585 825404 730610 808021 979086
13832I79086j81874K25208C72747L80516K7170q9626O6339L90221l78026k47527
$$ 979086 797212 1022420 372747 753263 780433 690807 757146 1147367 769341 521814
13822E21814J40773j79046k9760M56799l7846j30853Q3427j68683j4934M3419
$$ 521814 662587 483541 453781 910580 872734 741881 825308 656625 641691 685110
13812F85110l1214l8867J39010k3689k11084J96325l0906K71940k73472Q1668
$$ 685110 653896 615029 754039 730350 519266 715591 684685 956625 683153 764821
13802G64821J79426k18481p0428L1487R7384C87360O01649m11024m2609L87394
$$ 764821 944247 725766 655338 686825 784209 387360 989009 577985 535376 922770
13792I22770Q4815P6611m56656j39653j11561N51596k95618J36794j15516k89525
$$ 922770 1007585 1084196 627540 487887 376326 927922 632304 769098 653582 364057
13782C64057Q8330J48857j15573K37978K21005l19961l4507P2023l2366j3254
$$ 364057 452387 601244 485671 723649 944654 624693 590186 662209 629843 616589
13772F16589k72662L272L78429B36370K33626j18942J83598q8097Q4075k51071
$$ 616589 343927 347199 725628 236370 469996 351054 534652 446555 530630 279559
13762B79559L14622N3841k09680L22553j04676o3651B54923L74374j92889j9881
$$ 279559 594181 648022 438342 760895 656219 592568 254923 629297 436408 416527
13752D16527P4826K28373k14667n4694P6155J46905j47967J22392J45940j20039
$$ 416527 491353 719726 505059 450365 526520 673425 525458 647850 793790 673751
13742F73751j30204R4538k7640r3327K84045k24745j29089k01821O0584J92872
$$ 673751 543547 638085 610445 517118 801163 576418 447329 245508 306092 498964
13732D98964q2402N1978J25590j34286J90145n9952j86334j16917K59951j02526
$$ 498964 416562 468540 594130 459844 649989 590037 403703 286786 546737 444211
13722D44211K95389l57236R1799J23147k27327K4728K31104j70968m6929j27966
$$ 444211 739600 382364 474163 597310 369983 394711 625815 454847 407918 279952
13712B79952J94167j36293m6063K48050k26969l3886K25716r5282A64637K68741
$$ 279952 474119 337826 291763 539813 312844 278958 504674 409392 164637 433378
13702D33378m4773J45537k0244q0195K86223r5332q6408r7958j56916Q947M6049
$$ 433378 388605 534142 513898 433703 719926 624594 538186 440228 283312 292259 338308
13691C38308Q0940j04793C1854L36215K72341j52714K8032j91500K09115k05036
$$ 338308 419248 314455 31854 368069 640410 487696 515728 324228 533343 328307
13681C28307j20102K05441A82189N20149l10314j35604K7423K73719L4424B93754
$$ 328307 208205 413646 182189 702338 392024 256420 283843 557562 591986 293754
13670D51708R4889j12819L49254e0994C85479J06551Q0079B27076l7340m154N84350
$$ 451708 546597 433778 783032 -50994 385479 492030 572109 227076 189736 185582 769932
13659G69932l25565J54692q8042j60457A19454J56987K89010p9598k5217A81022
$$ 769932 444367 599059 511017 350560 119454 276441 565451 485853 460636 181022
13648B66149L5038J95323A44161a03750B77751o2024J98978A88052J41624p0539
$$ 266149 301187 496510 144161 -103750 277751 215727 414705 188052 329676 259137
13638B59137J94191k197J96473j74057j64201J66831j87763L57300A44385J66191
$$ 259137 453328 451131 647604 473547 309346 476177 288414 645714 144385 310576
13628C10576J23512M2954J0908J7027C6536J78176n7883L18951A35840L07394
$$ 310576 434088 477042 487950 504977 36536 214712 156829 475780 135840 443234
13618D43234o1520j73779L60856A67074K60607K4410J00208k63608n1126L5356
$$ 443234 381714 207935 568791 167074 427681 452091 552299 288691 237565 272921
13608B72921L55342A22701J74643K25692n5080k9057B2753K98457K17748r7047
$$ 272921 628263 122701 297344 523036 467956 438899 22753 321210 538958 441911
13598D41911J50885B19813p0869k056L25784k08053A20972K13705f8550C73081
$$ 441911 592796 219813 148944 146888 472672 264619 120972 334677 -68550 373081
13587A50388M74020j55639B0935K60401M0752n2364K99883k44650N2058k104q7532
$$ 150388 624408 468769 20935 281336 322088 269724 569607 324957 377015 374911 287379
13576B87379F3786J77024J88514p27E4612K28796Q0937b21395B72071J44789A69717
$$ 287379 63786 240810 429324 428597 54612 283408 364345 -221395 272071 416860 169717
13564G0899J02823L16450J2051j26374M0958n0576j62245j90M6886G8575L18163
$$ 70899 173722 490172 502223 375849 416807 366231 203986 203796 250682 78575 396738
13553C96738j88139j6704R6821D127R6740J92923J27890a6239C21863R6360G3378
$$ 396738 208599 191895 288716 4127 100867 293790 421680 -16239 321863 418223 73378
13541B87674a52756B15126A9489J98802r4253c1804C00358n2029j24130j8258
$$ 287674 -152756 215126 19489 218291 124038 -31804 300358 248329 124199 105941
13531A05941K74860p0718A12432Q0732l6637J32498J59498j86491o5895J68107
$$ 105941 380801 310083 112432 193164 156527 289025 448523 262032 196137 364244
13521C64244j49600p3310c5356B26426o1789D3984K58591J3011h808B91228A7126
$$ 364244 214644 141334 -35356 226426 164637 43984 302575 315586 -8808 291228 17126
13509A41975e3725E04621F3342N39839A11677R984J42716A06388a73692g314B71327
$$ 141975 -53725 504621 63342 603181 111677 121661 264377 106388 -173692 -7314 271327
13497a42021A64526j7869J53083L7451a62680B53115P1489p7871Q9483J03615
$$ -142021 164526 146657 299740 337191 -162680 253115 324604 246733 336216 439831
13487D39831A44785Q3497n2556h9675E04866J20882j62450A88570J91470C561
$$ 439831 144785 228282 175726 -89675 504866 625748 463298 188570 380040 3561
13476a60010D13498b09977A6315i9632C14463P6515l5779J3592l877q6311j7682
$$ -160010 413498 -209977 16315 -99632 314463 390978 355199 368791 364914 278603 260921
13465B60921O5370h7518B23534J1194c0303D8838Q8460J18808J0637M4412p2279
$$ 260921 326291 -87518 223534 234728 -30303 48838 137298 256106 266743 311155 238876
13454B38876J76430B2968b0798B14069K09017m6440j86698e7333m4351I2595K53026
$$ 238876 415306 22968 -20798 214069 423086 376646 189948 -57333 -101684 92595 345621
13443C45621D2204N6841D2732J88280r737p4213R8933n7354O3010l0062J76495
$$ 345621 42204 99045 42732 231012 221275 147062 245995 188641 251651 221589 398084
13432C98084C0327J28767J30611N9860A12768f6980B08059J7078F793L67107j83458
$$ 398084 30327 159094 289705 349565 112768 -66980 208059 225137 6793 373900 190442
13421A90442b7413B9274K51023J17990N3261D5609i1345B27124J8916p2657J80181
$$ 190442 -27413 29274 280297 398287 451548 45609 -91345 227124 246040 173383 353564
13410C53564m5986j48371L9554m7069O3228a49794A61774G1443K03417A24419
$$ 353564 307578 159207 198761 151692 214920 -149794 161774 71443 274860 124419
13399A56169D0633K23410M926A28559h8886D56838d91A34660C6080M31909j59507
$$ 156169 40633 264043 268969 128559 -88886 456838 -491 134660 36080 467989 308482
13388C08482N3976k6886J67668j76124j17368H8982b07229A05651R5361J20798
$$ 308482 362458 335572 503240 327116 209748 88982 -207229 105651 201012 321810
13378C21810j11440o1551L2012k223a176j05195B06727P2219a87268D02799B01235
$$ 321810 210370 148819 180831 178608 -1176 -106371 206727 278946 -187268 402799 201235
13366D78696A37213R7924p6910R2938M8432I1880j9087J64907G2959a8535C30004
$$ 478696 137213 235137 158227 251165 299597 91880 72793 237700 72959 -18535 330004
13354c806k6141D6729Q5876l3305J92128J14231g8110B67200a13023j37790D64317
$$ -3806 -29947 46729 132605 99300 291428 405659 -78110 267200 -113023 -250813 464317
13342B12647l1588a00784B19991G1224A5393L6227K67924m5606J0577E5009i3553
$$ 212647 181059 -100784 219991 71224 15393 51620 319544 273938 284515 55009 -93553
13330G3317K45962l0851M2462A59617r836L757m9716J64956g1188G3044d8611
$$ 73317 319279 288428 330890 159617 149781 153538 103822 268778 -71188 73044 -48611
13318b99325C57969I3165a79916k8328H0477L7134l4079L04912f4657A20091j6995
$$ -299325 357969 93165 -179916 -208244 80477 117611 83532 388444 -64657 120091 103096
13307A03096q657k7963B396J71895g4904k8737B17029a57969B18898B9370a69467
$$ 103096 94439 66476 2396 174291 -74904 -103641 217029 -157969 218898 29370 -169467
13295A69597h8498B71198j9492a6951C30600J17760a60806B04849j1493P6529
$$ 169597 -88498 271198 251706 -16951 330600 448360 -160806 204849 193356 269885
13285B69885H5067K4232J66530g659A5576O6989m667G390Q652J68888N6661Q949
$$ 269885 85067 109299 275829 -7659 15576 82565 77898 7390 16042 184930 241591 250540
13273B50540a04760L4742A32319M4398N1577o6477J42147D3762K974a37079a0245
$$ 250540 -104760 -70018 132319 176717 228294 161817 303964 43762 46736 -137079 -10245
13261B28732P1948Q9702E8793J02813J47510a61572L8499E0754J10297c3347B12079
$$ 228732 300680 390382 58793 161606 309116 -161572 -123073 50754 161051 -33347 212079
13249A7201J29717p2889J40456q1419R9776a65121A87827N8368l0392J89261j93103
$$ 17201 146918 74029 214485 133066 232842 -165121 187827 246195 215803 405064 211961
13238B11961A6590J40487L03305A37751O1876c77352B52856d3471A64929a10078
$$ 211961 16590 157077 460382 137751 199627 -377352 252856 -43471 164929 -110078
13227E6911a2515B13446l7730J86303f1200K9551J5422C1294J52526D069N6096
$$ 56911 -12515 213446 175716 362019 -61200 -31649 -16227 31294 183820 4069 60165
13216F0165a22042A27682a96568E1925a21089k4617d5372m0765A86239l2830J43462
$$ 60165 -122042 127682 -196568 51925 -121089 -145706 -45372 -86137 186239 153409 296871
13205B96871A31854d0588C19232F1661L43858C188a07856C23851B7273O2518R9209
$$ 296871 131854 -40588 319232 61661 405519 3188 -107856 323851 27273 89791 189000
13194A89000M4913e2324C9344K24875j22103L851J67695G4746J00361m3887i0786
$$ 189000 233913 -52324 39344 264219 142116 145967 313662 74746 175107 131220 -90786
13182A39857l0012O0264B6979L1539b30971A8193N5169c7038B8108K15609E2758
$$ 139857 109845 170109 26979 58518 -230971 18193 73362 -37038 28108 243717 52758
13170a86660C40790B328f5772K6081D4296J07486o6708a4819B30426o2135d2899
$$ -186660 340790 2328 -65772 -39691 44296 151782 85074 -14819 230426 168291 -42899
13158B73210b42118H4140K64219j14031J8416g8805I0206a00931I0282c61889
$$ 273210 -242118 84140 348359 234328 252744 -78805 90206 -100931 90282 -361889
13147C0917j3690i4796B46751J68017f1753j77133B71616h6704A94987f1173B17798
$$ 30917 17227 -94796 246751 414768 -61753 -238886 271616 -86704 194987 -61173 217798
13135a17634A23797o0583L04682C2902K27820j14992J02774G1372o969K6675h2239
$$ -117634 123797 63214 367896 32902 260722 145730 248504 71372 64403 91078 -82239
13123d9094B6344Q0085J05361a0937A42845c6366F2221a5167B37099G9264L48958
$$ -49094 26344 106429 211790 -10937 142845 -36366 62221 -15167 237099 79264 428222
13112D28222A68046M5062a24427N5608A17319J34816D9347L6676a05942k50214
$$ 428222 168046 213108 -124427 -68819 117319 252135 49347 86023 -105942 -356156
13102c56156J57061E9325k595c0631B01492a44500K0499M2004k13491h8005K6027
$$ -356156 -199095 59325 56730 -30631 201492 -144500 -124001 -81997 -295488 -88005 -61978
13091f1978B47484d5150l06804J55905A18902a79906A69394G2784g7542o2985
$$ -61978 247484 -45150 -351954 -196049 118902 -179906 169394 72784 -77542 -140527
13081a40527L160B45458r1480f7422B64756B9206L12138d7817B25052D1955a60280
$$ -140527 -137367 245458 153978 -67422 264756 29206 341344 -47817 225052 41955 -160280
13069e2342K4303K315B2041J47364R411c2144B70054H6248g7841B34970G3094
$$ -52342 -28039 -25724 22041 169405 178816 -32144 270054 86248 -77841 234970 73094
13057A60994D6571K27729a45272A37518M0642J18402j18185p3962k7625d1502
$$ 160994 46571 274300 -145272 137518 178160 296562 178377 104415 76790 -41502
13046a45719d6388B53913h7166q4579I7071M50637g4588F1776J42610c1536C02543
$$ -145719 -46388 253913 -87166 -171745 97071 547708 -74588 61776 204386 -31536 302543
13034F9140b43593b7689D91940C6626J04830K3726K11003b34286A75571K18949
$$ 69140 -243593 -27689 491940 36626 141456 165182 376185 -234286 175571 394520
13024C94520I7162g4123F2096A6761N4072J36763b10036B65134I5161h9835D19368
$$ 394520 97162 -74123 62096 16761 70833 207596 -210036 265134 95161 -89835 419368
13012E0724b41453J2472e8074a0542C47953F8955J26258i9787c2961B21462E7411
$$ 50724 -241453 -228981 -58074 -10542 347953 68955 195213 -99787 -32961 221462 57411
13000c33593A36657L81937A12362j7768a99741A77360i9582k3088D2412f993k12374
$$ -333593 136657 518594 112362 94594 -199741 177360 -99582 -122670 42412 -6993 -219367
12989b19367K0660b1980B0279K08493e3990B85950B9966a28480E6167K1542g1650
$$ -219367 -198707 -21980 20279 228772 -53990 285950 29966 -128480 56167 77709 -71650
12977d04311C39707a58492n1906B47124c21975a36426r233b6777H107J92268o1352
$$ -404311 339707 -158492 -210398 247124 -321975 -136426 -145659 -26777 8107 200375 139023
12966A39023A9302J98350c57935B67208B3611K11283D2726L03371A06280J24347
$$ 139023 19302 217652 -357935 267208 23611 234894 42726 346097 106280 230627
12956B30627b0723m1524A15354a54920D7244e9764A50340K0020i3902B19010I5879
$$ 230627 -20723 -62247 115354 -154920 47244 -59764 150340 170360 -93902 219010 95879
12944A41164J45316A03723A0688d7247B49443a14442B76178A04087E1905E465
$$ 141164 286480 103723 10688 -47247 249443 -114442 276178 104087 51905 5465
12933A41650b78086A72979I191J12746K8952h6859o9038f0083j85404a16398C08051
$$ 141650 -278086 172979 9191 121937 150889 -86859 -155897 -60083 -245487 -116398 308051
12921a21779m367I6599e6834A90994a84404l7508E3381a07455d9017B13780a31053
$$ -121779 -126146 96599 -56834 190994 -184404 -221912 53381 -107455 -49017 213780 -131053
12909A0294g0415C8881a2763A12917i589B98377a95184A19876c5691D64751h6014
$$ 10294 -70415 38881 -12763 112917 -9589 298377 -195184 119876 -35691 464751 -86014
12897c25180h8730L8690A06486A1093K7672h870n7878j47631A56771K64738c2429
$$ -325180 -88730 -50040 106486 11093 38765 -8870 -66748 -214379 156771 421509 -32429
12885B4915c2569l10157H7308C7571J41050m9382d9311c212B9465J40345f4555
$$ 24915 -32569 -342726 87308 37571 178621 129239 -49311 -3212 29465 169810 -64555
12873a10052d909A53867a44099A15191A6350b2050j16007a0525A36862Q6776d740
$$ -110052 -4909 153867 -144099 115191 16350 -22050 -138057 -10525 136862 223638 -4740
12861a58187N2626L6129G875L7752g3204A1592J9751e1658o8903K5335B85043
$$ -158187 -105561 -69432 7875 45627 -73204 11592 31343 -51658 -120561 -95226 285043
12849c1047j14470G8278a72134B8061d2461A57598i8280a396I2462J81508A15266
$$ -31047 -145517 78278 -172134 28061 -42461 157598 -98280 -1396 92462 273970 115266
12837c55557c1830B23992D0819c0109c308B94177H251a21071B36863J6117C840
$$ -355557 -31830 223992 40819 -30109 -3308 294177 8251 -121071 236863 252980 3840
12825A68842a9112B76327A4186J31926P5162c6678j25135E312K21497b2590B82342
$$ 168842 -19112 276327 14186 146112 221274 -36678 -161813 5312 226809 -22590 282342
12813A46829h2326C0967K2025J30801P7736c4663G108h3886b0198G47J00867A3779
$$ 146829 -82326 30967 52992 183793 261529 -34663 7108 -83886 -20198 747 101614 13779
12800A05203b64937A63691a51854A18273P1500d67813h5490h43A1019h3966j45554
$$ 105203 -264937 163691 -151854 118273 189773 -467813 -85490 -843 11019 -83966 -229520
12789b29520A79617b0949n1292J2206F2577d7797F7282f1543K9266F039K59108
$$ -229520 179617 -20949 -72241 -60035 62577 -47797 67282 -61543 -32277 6039 265147
12778B65147C4263J67321b17586j42241A19649a0232r7448e2169r7019A60116
$$ 265147 34263 201584 -217586 -359827 119649 -10232 -107680 -52169 -149188 160116
12767A0919e06836a43714j86777a38414E1717f7655j82024A66540L7638b48214
$$ 10919 -506836 -143714 -330491 -138414 51717 -67655 -249679 166540 204178 -248214
12756A12698E2013N5259M3497b00527o8876b2810j82508B50419H5810c61514g879
$$ 112698 52013 107272 150769 -200527 -269403 -22810 -205318 250419 85810 -361514 -7879
12744B71287A7541a854A46526d0943E3329e9254C62585A49641m9444L2714E7698
$$ 271287 17541 -1854 146526 -40943 53329 -59254 362585 149641 100197 132911 57698
12732C27890a39085A82403a36349I7874B856O4345J01518i3566A506K53790a37012
$$ 327890 -139085 182403 -136349 97874 2856 67201 168719 -93566 1506 255296 -137012
12720a89231B0224e3299B44145K2953b8985A30873m1503a14693D26990d5546C2468
$$ -189231 20224 -53299 244145 267098 -28985 130873 89370 -114693 426990 -45546 32468
12708I1522J44728A06410R8788C6721J4443a66735a0875l8854B63171a691A42176
$$ 91522 236250 106410 205198 36721 51164 -166735 -10875 -49729 263171 -1691 142176
12696C7242J66981R1563D2823b07197i2877A21384c95639H3442j3250a6084r680
$$ 37242 204223 295786 42823 -207197 -92877 121384 -395639 83442 70192 -16084 -25764
12685b5764j12218f0695B0883L20094a37415b7841F2945J54430E3414M7217g4235
$$ -25764 -137982 -60695 20883 340977 -137415 -27841 62945 217375 53414 100631 -74235
12673b00994N336B5775N9278J43603a33015A89776C6351h7366H1280c13958A78210
$$ -200994 -195658 25775 85053 228656 -133015 189776 36351 -87366 81280 -313958 178210
12661e4519o2709D69327A22830a11406B82944h7561L6511A49470d3277j66332
$$ -54519 -117228 469327 122830 -111406 282944 -87561 -51050 149470 -43277 -209609
12651b09609A05966e9697F8456b2118B558K61118K8056m5878L7437f7786J8647
$$ -209609 105966 -59697 68456 -22118 2558 263676 291732 245854 283291 -67786 -49139
12640d9139j33442I0519B2206b56967O8943H7599f1482b0822k9273n4773B22987
$$ -49139 -182581 90519 22206 -256967 -188024 87599 -61482 -20822 -50095 -104868 222987
12628C7406O5128J69154r3967c26457B79727c18050G9374b42252F0392O2062c75571
$$ 37406 102534 271688 177721 -326457 279727 -318050 79374 -242252 60392 122454 -375571
12616B0636a63002d1823A52648A2434M6268d6241k56453J02768g3081K9946o1319
$$ 20636 -163002 -41823 152648 12434 58702 -46241 -302694 -199926 -73081 -43135 -104454
12605a04454B7841O3124l5197J74304I5817J32156a997m468o3082A56699F1167
$$ -104454 27841 90965 55768 230072 95817 227973 -1997 -6465 -69547 156699 61167
12593A01176a24823a6118l5092F4389M2992i2970M977N275I8115m6599pL4956
$$ 101176 -124823 -16118 -51210 64389 107381 -92970 -87993 -82718 98115 51516 51509 86465
12581H6465J80911a2124C1749J64778p7022a71060b3941j26384M399A75104q2855
$$ 86465 267376 -12124 31749 196527 119505 -171060 -23941 -150325 -145926 175104 92249
12570I2249c6352G4386Q763b3447B46011a28852A2736k709a01996A20084L5767
$$ 92249 -36352 74386 83149 -23447 246011 -128852 12736 10027 -101996 120084 155851
12559A55851a4403k54864B25052a79333N4176d711C31378G2822a50016E4023B393
$$ 155851 -14403 -269267 225052 -179333 -125157 -4711 331378 72822 -150016 54023 2393
12547a30953j1817B89458a7959q0967D0452a70385C33480j14636a86077m4802
$$ -130953 -142770 289458 -17959 -98926 40452 -170385 333480 218844 -186077 -230879
12537b30879J04617j29011L9195K7733h4064A47070d8686G8480J07653a8651j5420
$$ -230879 -126262 -255273 -216078 -188345 -84064 147070 -48686 78480 186133 -18651 -34071
12526c4071j2191j21753g9503L0468G2150B1522b92008R8063B0143Q7982a1578
$$ -34071 -46262 -168015 -79503 -49035 72150 21522 -292008 -193945 20143 108125 -11578
12514A56325a08036c4442F9502a19090G9012k2955O6017b17105J1833j60408L3220
$$ 156325 -108036 -34442 69502 -119090 79012 56057 122074 -217105 -205272 -365680 -332460
12503c32460J02534B8966a9994B59364c4053k35400d3421o9722B4662R8780J8263
$$ -332460 -229926 28966 -19994 259364 -34053 -269453 -43421 -113143 24662 123442 141705
12492A41705K78434a39586B9834O1006R0117c32841g0075b5220d161l43193R6388
$$ 141705 420139 -139586 29834 90840 180957 -332841 -70075 -25220 -4161 -347354 -250966
12481b50966f6593A55534b23446C6417d5830C4729J56199b7102p4757b7428p5393
$$ -250966 -66593 155534 -223446 36417 -45830 34729 190928 -27102 -101859 -27428 -102821
12470a02821c7203B44771A16130b00669B66101e9444n0508E4765k147a03360n6885
$$ -102821 -37203 244771 116130 -200669 266101 -59444 -109952 54765 52618 -103360 -160245
12459a60245A28814J08763a88819c161j5736C1039A4046b17982g4468C668b2881
$$ -160245 128814 237577 -188819 -3161 -18897 31039 14046 -217982 -74468 3668 -22881
12447A6404a3049D0434c02659d7154B94807d28885I7950K07964a10362k46813
$$ 16404 -13049 40434 -302659 -47154 294807 -428885 97950 305914 -110362 -357175
12437c57175g7476D6257h7224m67226A40274c09364J23731B13628k5491D0791
$$ -357175 -77476 46257 -87224 -554450 140274 -309364 -185633 213628 188137 40791
12426C2099f4386B51010c1288B18690c69058R1934A63800g5983p5043d5794j41211
$$ 32099 -64386 251010 -31288 218690 -369058 -277124 163800 -75983 -151026 -45794 -187005
12415a87005Q9611A8615J8492f1165j43468A70690o1043J16916a44273f5020A45010
$$ -187005 -97394 18615 37107 -61165 -204633 170690 109647 226563 -144273 -65020 145010
12403A10303b25926C37060a20994B13281m0657i5306l0575C3171O6273b4076m1001
$$ 110303 -225926 337060 -120994 213281 172624 -95306 -125881 33171 99444 -24076 -65077
12392f5077A56506D8880e3272I7303d15367A32991i2666G9592a37568J1607B9082
$$ -65077 156506 48880 -53272 97303 -415367 132991 -92666 79592 -137568 -125961 29082
12380C5896N7363L1731a24501e5161j72444F3867a33627C48906b78405m8259A2774
$$ 35896 93259 124990 -124501 -55161 -227605 63867 -133627 348906 -278405 -326664 12774
12368b41792I7191K18513a30632j18368B41058a3644A34567n2067L5257c7161
$$ -241792 97191 315704 -130632 -249000 241058 -13644 134567 82500 117757 -37161
12357c2878o6229B57092g2119k63090B81885I4784K6934A9395a55514H387b2357
$$ -32878 -99107 257092 -72119 -335209 281885 94784 121718 19395 -155514 8387 -22357
12345g8486j47138B37768d943p7801F4460a84328d3367B63744E1337R0037f6193
$$ -78486 -225624 237768 -4943 -82744 64460 -184328 -43367 263744 51337 141374 -66193
12333f8782j75603k50700C92040j77633j05413a7609o7644B55716c0384j11645
$$ -68782 -244385 -495085 392040 214407 108994 -17609 -85253 255716 -30384 -142029
12323a42029A24722d35157d8291q0393k33418J51145B29741A0968b31022g0891
$$ -142029 124722 -435157 -48291 -128684 -362102 -210957 229741 10968 -231022 -70891
12312A58490D3010J45756a05934A25255R797a20751j36174B66908I3955Q6664
$$ 158490 43010 188766 -105934 125255 135052 -120751 -256925 266908 93955 180619
12302A80619N413a6777l1478A61107h3969o7314C00032I4049a28569B70666a1815
$$ 180619 186032 -16777 -48255 161107 -83969 -151283 300032 94049 -128569 270666 -11815
12290b68493g1396j51860I3715J13405O1012F0469j9671M10064A70651G8010K32535
$$ -268493 -71396 -223256 93715 207120 268132 60469 40798 450862 170651 78010 310545
12279C10545E9424K47603a32141A22024b24258C30905b23820A37409d3600j12420
$$ 310545 59424 307027 -132141 122024 -224258 330905 -223820 137409 -43600 -156020
12269a56020A86772D2324J05074d2412A43426D2176a40626K6095A46879a00047
$$ -156020 186772 42324 147398 -42412 143426 42176 -140626 -114531 146879 -100047
12258A50945d9480A60845O6581G1030R91N0428j002a57367b9247D8690M8966N9217
$$ 150945 -49480 160845 227426 71030 72021 122449 121447 -157367 -29247 48690 97656 156873
12246A56873J36527o5142j09074B0803J68821o2448J54490L3855f4548A07982
$$ 156873 293400 228258 119184 20803 189624 127176 281666 315521 -64548 107982
12235A76121o0230k5092K19421q1507a66239A18106f3772r0512B01954e8443H1227
$$ 176121 115891 90799 310220 228713 -166239 118106 -63772 -154284 201954 -58443 81227
12223A59958K7384k679J53625A31676J02235J81167H1692J45145f18C15609A35138
$$ 159958 187342 184663 338288 131676 233911 415078 81692 226837 -618 315609 135138
12211D70543B34690r4456L6862H6088a7000C076O1230L68142G1965f8291C68225
$$ 470543 234690 140234 177096 86088 -17000 3076 64306 432448 71965 -68291 368225
12199d04124a82681A23853L74672A45655L7734K974D3574J7149K46388f560p5747
$$ -404124 -182681 123853 498525 145655 183389 186363 43574 60723 307111 -6560 -82307
12188h2307A0191L14571o9412F4567A4427J63656c04377J14663B01501j4453J24365
$$ -82307 10191 324762 255350 64567 14427 178083 -304377 -189714 201501 187048 311413
12177C11413A11752J20151C1353a07918M2451I6996K70951r0157n7114I8498m5235
$$ 311413 111752 231903 31353 -107918 -65467 96996 367947 277790 220676 98498 53263
12166E3263c38641F5471B855J66306j6433N3817m8874i4188A04475l8332j4187
$$ 53263 -338641 65471 2855 169161 152728 206545 157671 -94188 104475 66143 51956
12155E1956J68190n9972K17847r5522I0319b45337E10039k32825b38001I7827
$$ 51956 220146 160174 378021 282499 90319 -245337 510039 277214 -238001 97827
12144B05865a36643j4483A39352b1345j07434E1168k279O987L0676J72502b87580
$$ 205865 -136643 -151126 139352 -21345 -128779 51168 48889 55876 86552 259054 -287580
12132A67064a27901B22827r2297b13983f4040A60915l9298e3837n0335A68121
$$ 167064 -127901 222827 130530 -213983 -64040 160915 121617 -53837 -104172 168121
12121C9355J4649J71524b47849g6568A03930k384h9878A77680R9577A22914M7166
$$ 39355 54004 225528 -247849 -76568 103930 101546 -89878 177680 277257 122914 170080
12110A70080m2996J38329a93698e7238k21477h1352j63713L9291B1636m623a2769
$$ 170080 127084 265413 -193698 -57238 -278715 -81352 -245065 -205774 21636 17013 -12769
12098a30537A81311o0265a53104b2246l0174k83101h2031j49795f4808q8554c8949
$$ -130537 181311 121046 -153104 -22246 -52420 -335521 -82031 -231826 -64808 -153362 -38949
12086D33J46019c21313B13418I5375c11224b8034A13556M015a42644F1352d09064
$$ 433 146452 -321313 213418 95375 -311224 -28034 113556 117571 -142644 61352 -409064
12074b19295j718A72847F0451h8273n891k59468G000b50064B08055a73237A08448
$$ -219295 -221013 172847 60451 -88273 -94164 -353632 7000 -250064 208055 -173237 108448
12062A24699L97345Q3661A63508b6699B09950F983J08187K41713E2335K51301
$$ 124699 522044 605705 163508 -26699 209950 6983 115170 356883 52335 303636
12052C03636E6335K93001B1985J94674p0735a57311d901l94026A20000k9228f7156
$$ 303636 56335 349336 21985 216659 145924 -157311 -4901 -398927 120000 90772 -67156
12040a78587h5980K9872B1557o166a04113a5403j03504m52626i7492A11088B455
$$ -178587 -85980 -56108 21557 15391 -104113 -15403 -118907 -571533 -97492 111088 2455
12028a54959K5247d3418b848A83895J73850a65982J666A18922a9527F2864Q6211
$$ -154959 -129712 -43418 -2848 183895 357745 -165982 -164316 118922 -19527 62864 149075
12017A49075l0866b79328b6488l5539C91613p4659A28371m5782c02792f544l17206
$$ 149075 118209 -279328 -26488 -62027 391613 316954 128371 82589 -302792 -6544 -323750
12006c23750a7202G0584b09590A0561J7302a47444a0675p5465p8370J019B11860
$$ -323750 -17202 70584 -209590 10561 27863 -147444 -10675 -86140 -164510 -163491 211860
11994A16407L2510F6041a2748A66J70299e9146I5451A557a53877j95517B25869
$$ 116407 148917 66041 -12748 166 170465 -59146 95451 1557 -153877 -349394 225869
11982a32184e3489k15501E5335J65218r0941a22017M7396l0417c2453A94333a94351
$$ -132184 -53489 -268990 55335 220553 129612 -122017 -74621 -105038 -32453 194333 -194351
11970c6108A3912Q3082C2261a36318F1594L11538a6236k96272d7684H6186a4651
$$ -36108 13912 96994 32261 -136318 61594 373132 -16236 -312508 -47684 86186 -14651
11958b31459d9100a0349j44474n7063L4380B1283b24796A50326a52847L4107A43882
$$ -231459 -49100 -10349 -154823 -211886 -177506 21283 -224796 150326 -152847 -118740 143882
11946c5718j86157A19754a00809h116j34449e5066F0221e8711j98446A72304b02977
$$ -35718 -221875 119754 -100809 -8116 -142565 -55066 60221 -58711 -257157 172304 -202977
11934g6889A74504a94227b8925n7441B15731h2639k5536L3068j68474R0328B8949
$$ -76889 174504 -194227 -28925 -86366 215731 -82639 -108175 -75107 -243581 -153253 28949
11922f4324D04781A56544b0294K554B78215E7237b02362j65683F7778a48782J8938
$$ -64324 404781 156544 -20294 -17740 278215 57237 -202362 -368045 67778 -148782 -129844
11911a29844b8458a2853q6071E1654a03857I6647D4060e1453F5074c5704o0091
$$ -129844 -28458 -12853 -98924 51654 -103857 96647 44060 -51453 65074 -35704 -95795
11900i5795C05219n4531H0851b11805d9317G2327J55586I5261b03417A32274i5773
$$ -95795 305219 250688 80851 -211805 -49317 72327 227913 95261 -203417 132274 -95773
11888c78587a9037k32448B61519E3744D748P712e2165R502D3269d4085A76222
$$ -378587 -19037 -251485 261519 53744 4748 12460 -52165 -42663 43269 -44085 176222
11876a59954k7774D5768n993L31420b54151c1515m8532A06635A959g9745A6241
$$ -159954 -187728 45768 39775 371195 -254151 -31515 -80047 106635 1959 -79745 16241
11864C60103a19515a5247j2453l76453J98508J9893N1253j5243I6962n591a19750
$$ 360103 -119515 -15247 -27700 -404153 -205645 -185752 -134499 -149742 96962 91371 -119750
11852A7983J50180I585a94557a2680j0620o3717J5529F8724a90068r5234A71406
$$ 17983 168163 9585 -194557 -12680 -23300 -87017 -71488 68724 -190068 -285302 171406
11840h3460C8938R5997i1186A20487f6773J4711l96896G4857j6314e5863k88052
$$ -83460 38938 134935 -91186 120487 -66773 -52062 -448958 74857 58543 -55863 -343915
11829c43915O358L3525J50762j4021B07548d35058f6653p9525e208o4327l1633
$$ -343915 -337557 -304032 -153270 -167291 207548 -435058 -66653 -146178 -5208 -69535 -101168
11818a01168A3535a80592C84095h2631p1122G7900d05435a41825c9343j23217
$$ -101168 13535 -180592 384095 -82631 -153753 77900 -405435 -141825 -39343 -162560
11808a62560A97233a95952A01852b01240C58869a4916E387a7123k84122F5346
$$ -162560 197233 -195952 101852 -201240 358869 -14916 5387 -17123 -301245 65346
11797b35457q2579d534r2682k12786a19105J1340j8194j79541j5960a35149I2343
$$ -235457 -318036 -4534 -97216 -310002 -119105 -107765 -125959 -305500 -321460 -135149 92343
11785E2050e4259b1068q9497C12125a59509N6712A56684a47419E8088K1454j703
$$ 52050 -54259 -21068 -110565 312125 -159509 -102797 156684 -147419 58088 79542 77839
11774G7839R0005o8034K2514K00970B7464J36178a27178K0918C94451a25453j2540
$$ 77839 167844 99810 122324 323294 27464 163642 -127178 -106260 394451 -125453 -137993
11763a37993m1336b817n8788P07A10909J30737a05295K3154p2047j98509A84767
$$ -137993 -179329 -2817 -61605 -60898 110909 241646 -105295 -82141 -154188 -352697 184767
11751a06387j57510B54128C8668K1788c06787C9329b9797j07480p3193A05961
$$ -106387 -263897 254128 38668 60456 -306787 39329 -29797 -137277 -210470 105961
11740b47014D13085a24225F5372P049b12799n074B65679r9831c1970G4301b69035
$$ -247014 413085 -124225 65372 72421 -212799 -217873 265679 165848 -31970 74301 -269035
11728b76490d5353d886C12350d4344j23735m0817O186A3737K1851a90211B60785
$$ -276490 -45353 -4886 312350 -44344 -168079 -208896 -202710 13737 35588 -190211 260785
11716A73322g5156k3179j5498L9259I896K25087B6729J00033n5871c1390j53674
$$ 173322 -75156 -98335 -113833 -74574 9896 234983 26729 126762 70891 -31390 -185064
11705a85064j30906B6001K04425l5670I075K2961b00208j4675C45020d10893A60872
$$ -185064 -315970 26001 230426 194756 9075 32036 -200208 -214883 345020 -410893 160872
11693B91109b64980n5673J29838g3249B8420L97799g4636p8236j03510I3590c29825
$$ 291109 -264980 -320653 -190815 -73249 28420 426219 -74636 -152872 -256382 93590 -329825
11681A00446f0215A38779J4933i8624D474O4169P9945a45018d9292K4402l5741
$$ 100446 -60215 138779 153712 -98624 4474 68643 148588 -145018 -49292 -24890 -60631
11670f0631A21769n0632e4818l5315d1559A5382K10762a39044p619E9280B1948
$$ -60631 121769 71137 -54818 -90133 -41559 15382 226144 -139044 -146663 59280 21948
11658f3850A4003K54402g5122A5299a08017L0490j92625H3983J76191l5732A0284
$$ -63850 14003 268405 -75122 15299 -108017 -77527 -270152 83983 260174 224442 10284
11646D00012c2356k7162F1829B0990R8502J73399h8316B09985b34263a16648F187
$$ 400012 -32356 -59518 61829 20990 119492 292891 -88316 209985 -234263 -116648 6187
11634A83405g3293n5797A29665m6416J1169c31180E4586a12341R451B15709H929
$$ 183405 -73293 -129090 129665 83249 94418 -331180 54586 -112341 -102890 215709 8929
11622B75726h7691B61288a3289I8418d8469A64390J64355a415A01985b8359I528
$$ 275726 -87691 261288 -13289 98418 -48469 164390 328745 -1415 101985 -28359 9528
11610a33025A12717n5188a28739b9058k91882Q0402f2631A71024D3794a76754
$$ -133025 112717 57529 -128739 -29058 -320940 -240538 -62631 171024 43794 -176754
11599a47954e4717K4094E7363f0670D7087J14016a54929A10473m5591L4067R4571
$$ -147954 -54717 -30623 57363 -60670 47087 161103 -154929 110473 64882 98949 193520
11588A93520c86468B45584E7644L21646r8976c05843A52473F3810g2605L1181
$$ 193520 -386468 245584 57644 379290 280314 -305843 152473 63810 -72605 -41424
11578d1424R619i036F0126k7988c1966j30570e7439A74219a22543a5262A33018
$$ -41424 -31805 -9036 60126 32138 -31966 -162536 -57439 174219 -122543 -15262 133018
11566C42855A57156d6685A27847D7055E561N5924k0705b54241a4851C57781g131
$$ 342855 157156 -46685 127847 47055 5561 61485 40780 -254241 -14851 357781 -7131
11554A95803i4953D9775g4556L0010A58713o3460m0600d3893B41726a11375J0779
$$ 195803 -94953 49775 -74556 -44546 158713 95253 54653 -43893 241726 -111375 -100596
11543a00596F3284a36537d9172l7252c1244D58203a5258E8583O4892M7189O3329
$$ -100596 63284 -136537 -49172 -86424 -31244 458203 -15258 58583 123475 170664 233993
11532B33993A12636b580E175K55055c0303B88481l8606C8896a49157A97645E594
$$ 233993 112636 -2580 5175 260230 -30303 288481 249875 38896 -149157 197645 5594
11520d9790j69356B27696a12848a2664D7309K46532c05010i1314N271a8206B51044
$$ -49790 -219146 227696 -112848 -12664 47309 293841 -305010 -91314 -86043 -18206 251044
11508d2737A97395A2746c0651E01222g4291A45649A9718f1176D7497h6799k09839
$$ -42737 197395 12746 -30651 501222 -74291 145649 19718 -61176 47497 -86799 -296638
11497b96638F1094o790J32409d3379p0595C58107j60319a45872k0998P840H8753
$$ -296638 61094 54304 186713 -43379 -113974 358107 197788 -145872 -166870 -159030 88753
11485A4817c39219A23865K21622a05010A50655a7222o7386n2582B43172c2032
$$ 14817 -339219 123865 345487 -105010 150655 -17222 -84608 -137190 243172 -32032
11474c2049C45461a10099A88854i7145l4939A83516G0574a06000D9238b44707
$$ -32049 345461 -110099 188854 -97145 -132084 183516 70574 -106000 49238 -244707
11463c8858G6694f0143F00370h1666I8225C8820J1293L23973C6130N732a81973
$$ -38858 76694 -60143 600370 -81666 98225 38820 50113 374086 36130 41862 -181973
11451a5961I3498b45101F736a61519P697A78029b21856B7529J04018B9328e4417
$$ -15961 93498 -245101 6736 -161519 -153822 178029 -221856 27529 131547 29328 -54417
11439D3929g1157E4909M9183K6899R1688p25a11472A19261b23462g5985C94223
$$ 43929 -71157 54909 104092 130991 222679 221954 -111472 119261 -223462 -75985 394223
11427a2305A7287b742k47764Q5551k0586b5835C08960a47774D4189K93451A02256
$$ -12305 17287 -2742 -250506 -164955 -185541 -25835 308960 -147774 44189 337640 102256
11415b2752r657A40392o8203a7643l14323A02208A0377N7707j3685J69384f3493
$$ -22752 -32409 140392 72189 -17643 -331966 102208 10377 68084 54399 223783 -63493
11403g4816C02789j8809A32383f5623B6094a24256B8949L656l497a78378H9737
$$ -74816 302789 283980 132383 -65623 26094 -124256 28949 32605 29108 -178378 89737
11391c31479J30050B22403B2973R2690b83250K5870O2971M1077j4728e9564l35665
$$ -331479 -201429 222403 22973 115663 -283250 -257380 -194409 -153332 -168060 -59564 -395229
11380c95229D28715E2443L1464b21074J00721G3199Q4625F7956c36499g9135k58438
$$ -395229 428715 52443 83907 -221074 -120353 73199 157824 67956 -336499 -79135 -337573
11369c37573F0892c13268a14363b5527j30827A08204a58082e6744J3132p0078
$$ -337573 60892 -313268 -114363 -25527 -156354 108204 -158082 -56744 -43612 -113690
11359a13690c3439k90224c9090j10969k9771Q7162A71403a52226A5645b18354
$$ -113690 -33439 -323663 -39090 -150059 -179830 -92668 171403 -152226 15645 -218354
11348G7920A3987a47572m7441A17670a17580m4365m3720c2043A63648g2420L4908
$$ 77920 13987 -147572 -195013 117670 -117580 -161945 -205665 -32043 163648 -72420 -37512
11337c7512k23680g1608B6632K08960a50003D61544i4705o0589j0906K1544b4006
$$ -37512 -261192 -71608 26632 235592 -150003 461544 -94705 -155294 -166200 -144656 -24006
11325E32L84424b2713F3435a20250H5669D2819a50068E6170a34266B25330R2989
$$ 532 384956 -22713 63435 -120250 85669 42819 -150068 56170 -134266 225330 318319
11314C18319i2770M6016A44234b063A67596B166N3597b01004C8221J66889c74599
$$ 318319 -92770 -46754 144234 -2063 167596 2166 55763 -201004 38221 205110 -374599
11302e200B70087D4364b03482N2769L4149A46925N270A8274L741J99152a94403
$$ -5200 270087 44364 -203482 -150713 -116564 146925 152195 18274 22015 221167 -194403
11290A16937b6228k37144a1634A75966C1043g9641j49906B30204i7796m4916B47263
$$ 116937 -26228 -263372 -11634 175966 31043 -79641 -229547 230204 -97796 -142712 247263
11278B09387a74900j71834b5602l22123a04238H7011a55939K0144L220b3936I3725
$$ 209387 -174900 -346734 -25602 -347725 -104238 87011 -155939 -135795 -132575 -23936 93725
11266I4894f6104G6467a23413m6839L0601A8214h7807a1787A08616a21403l6939
$$ 94894 -66104 76467 -123413 -170252 -139651 18214 -87807 -11787 108616 -121403 -158342
11255a58342A41773J5048c40427B0370a32736N8430k77615d9450n3170j29175
$$ -158342 141773 156821 -340427 20370 -132736 -74306 -351921 -49450 -102620 -231795
11245b31795A93341c16k02847A93544f5757m826K3548A6330e1331k91980N8689
$$ -231795 193341 -316 -203163 193544 -65757 -70583 -47035 16330 -51331 -343311 -284622
11234b84622h6092A6537b08706O3367j08596c8727l44545i4202A18380L39831
$$ -284622 -86092 16537 -208706 -145339 -253935 -38727 -383272 -94202 118380 458211
11224D58211f9506l97511A3643b41217D4325K9125c8710E8427b15820A91832l2805
$$ 458211 -69506 -467017 13643 -241217 44325 73450 -38710 58427 -215820 191832 159027
11213A59027a13181k20417a13747p6316P4831B24896d2113B95667f0991k58711
$$ 159027 -113181 -333598 -113747 -190063 -115232 224896 -42113 295667 -60991 -319702
11203c19702J27786j1909G8672L9546O1804A6364a69359O05B23213b97121l3975
$$ -319702 -191916 -203825 78672 118218 180022 16364 -169359 -168754 223213 -297121 -331096
11192c31096G8701e176F2463b24568A23437i5018A90557G8239h1411B03399b32014
$$ -331096 78701 -5176 62463 -224568 123437 -95018 190557 78239 -81411 203399 -232014
11180f2490n5493k23818D15554A43001a73264f3279I5918D322c4440k7514b719
$$ -62490 -117983 -341801 415554 143001 -173264 -63279 95918 4322 -34440 -61954 -2719
11168h6592p5710M9715A35089J16705E3345a45945f7886B9117M8631B7651d7733
$$ -86592 -162302 -112587 135089 251794 53345 -145945 -67886 29117 77748 27651 -47733
11156B06861g9619E7089O4196C0568L10197H5416c18614f9744L017M231J3275
$$ 206861 -79619 57089 121285 30568 340765 85416 -318614 -69744 -66727 -62496 -49221
11145d9221e736A43559b03528O8121J3877D3571a09825J3055o6866l7286O9606
$$ -49221 -5736 143559 -203528 -135407 -121530 43571 -109825 -96770 -163636 -200922 -131316
11134a31316k37533H4999F927a40358C36447b11484B04113e14j42467M0365j07566
$$ -131316 -368849 84999 6927 -140358 336447 -211484 204113 -514 -142981 -102616 -210182
11123b10182I949M8175O1966K300M7035r342K7097j4989a5442J352B44892j10002
$$ -210182 9949 58124 120090 122390 169425 160083 187180 172191 -15442 -14090 244892 134890
11111A34890a16682K763k74872J01232n698B28781r7945j6931L6106F4397K7627
$$ 134890 -116682 -113919 -388791 -287559 -293257 228781 130836 113905 150011 64397 92024
11100I2024a86881B49739E1071g3065B67288C3180b45501G6799l6348J1161J18908
$$ 92024 -186881 249739 51071 -73065 267288 33180 -245501 76799 40451 51612 170520
11089A70520D8941J3546A9708a71378A09944a98865R7584A79207p3991m0373O321
$$ 170520 48941 62487 19708 -171378 109944 -198865 -101281 179207 105216 64843 71164
11078G1164Q3642h3430l4213b6882B43104C2500J81824j46o8189D1633a85589
$$ 71164 154806 -83430 -117643 -26882 243104 32500 214324 214178 145989 41633 -185589
11066A81799H5231R9117a10625r0824C89976j9853J3653H9527K56346j11933A11749
$$ 181799 85231 184348 -110625 -201449 389976 370123 383776 89527 345873 233940 111749
11054B03397L13213j38501j16663K54288k23000j32350L00202k18350N50490l62646
$$ 203397 516610 378109 261446 515734 292734 160384 460586 242236 792726 430080
11044D30080E3929K73346Q6180j8268r0004J06616A84497K90598N6602j80420
$$ 430080 53929 327275 413455 395187 305183 411799 184497 475095 531697 351277
11034C51277r599J56205n4455j83343J23542k3832j54269J22983q1460K94561
$$ 351277 341678 497883 443428 260085 383627 359795 205526 328509 247049 541610
11024E41610M425j84559M24587k43637R058k02085K02176B54775m5115J79835
$$ 541610 546035 361476 786063 542426 551484 349399 551575 254775 209660 389495
11014C89495J2482k7508e216C52561j11982L08654B21398J82823A30278Q2143
$$ 389495 401977 374469 -5216 352561 240579 549233 221398 404221 130278 212421
11004B12421K60487j89787J34618l8732k7090K07671J8863A54160L75968L7251
$$ 212421 472908 283121 417739 379007 351917 559588 578451 154160 530128 567379
10994E67379B22484H7267L24444A52792J05275J91707J09932k8848o8604m3677
$$ 567379 222484 87267 411711 152792 258067 449774 559706 530858 462254 418577
10984D18577j53515L7930l5251M39318k48406k9368J55935K8092j0081m0372Q4306
$$ 418577 265062 302992 267741 707059 458653 429285 585220 613312 603231 562859 647165
10973F47165k74129O55602n3193j05720L81590K67724k8458J55079j24524l80146
$$ 647165 373036 1028638 975445 869725 1251315 1519039 1490581 1645660 1521136 1140990
10963A140990M67966q3794j1197m47879j92412K78816m9991O2374L8520k14646
$$ 1140990 1608956 1525162 1513965 1066086 873674 1152490 1102499 1164873 1203393 988747
10953I88747N473J70338l94120K42977j0912k4037o7629j93117j9451p570j28745
$$ 988747 994220 1164558 770438 1013415 1002503 978466 910837 717720 698269 690699 561954
10942E61954M6795j96358j47266D0816J96435p8524C2614K64103A46176g8492
$$ 561954 608749 412391 265125 40816 237251 158727 32614 296717 146176 -78492
10931H6070c7577k2585b2990j44284A49115M164c12730B81265F2541B5557a45685
$$ 86070 -37577 -60162 -22990 -167274 149115 153279 -312730 281265 62541 25557 -145685
10919b52073B5607J16172b0160D93506C0645K22647I5833D111N9842M6078b31968
$$ -252073 25607 141779 -20160 493506 30645 253292 95833 4111 63953 110031 -231968
10907I171a39522G9580L6536e513k88556a927o0353j30733C5955b96206a04020
$$ 9171 -139522 79580 116116 -5513 -294069 -1927 -62280 -193013 35955 -296206 -104020
10895d7918n73048E5790a87819k6713E5481e4066A44359i0277l5302k15597A64427
$$ -47918 -620966 55790 -187819 -214532 55481 -54066 144359 -90277 -125579 -341176 164427
10883g0919A16870m0962l7764b70314M0203a5698B38963c4113k49269B99762b13205
$$ -70919 116870 75908 38144 -270314 -230111 -15698 238963 -34113 -283382 299762 -213205
10871a56797q142B61782K9178B4212a15916B13816I489a87089N3322A3281J854
$$ -156797 -164939 261782 290960 24212 -115916 213816 9489 -187089 -133767 13281 15135
10860A5135b2566k49115f9260C3327a27386n4930j6172B12472E5935k1521J04481
$$ 15135 -22566 -271681 -69260 33327 -127386 -182316 -198488 212472 55935 34414 138895
10849A38895a29755N5365E3957O7059h6506D9207a94414A02663a9171E6378J70676
$$ 138895 -129755 -74390 53957 121016 -86506 49207 -194414 102663 -19171 56378 227054
10838B27054a57208A31953o3442C837b38747B69406f280j22362q3037R3474M6378
$$ 227054 -157208 131953 68511 3837 -238747 269406 -6280 -128642 -211679 -118205 -71827
10827g1827C17472C8340K31598i226n7210k2590l4759j7364A70571A1941N6371
$$ -71827 317472 38340 269938 -9226 -66436 -89026 -123785 -141149 170571 11941 68312
10816F8312b96903C20407G0061J59050c6351A69114e0244A88823a32977j14171
$$ 68312 -296903 320407 70061 229111 -36351 169114 -50244 188823 -132977 -247148
10806b47148O0319E9579L1460J94580b23066I4039a98238A49512b98224O3165
$$ -247148 -186829 59579 91039 285619 -223066 94039 -198238 149512 -298224 -235059
10796b35059d814B19508a29003K810A07885h2050B2489a5684o9180c5292B07624
$$ -235059 -4814 219508 -129003 -126193 107885 -82050 22489 -15684 -84864 -35292 207624
10784a51260o5171Q3390D2610J26664m0813a96152j38635J53962c7693A8951a67988
$$ -151260 -216431 -133041 42610 169274 128461 -196152 -334787 -180825 -37693 18951 -167988
10772a20630p3459H58J93871D6898a37489B8335h3443D877b64011A41950k2217
$$ -120630 -194089 858 194729 46898 -137489 28335 -83443 4877 -264011 141950 119733
10761A19733b33103e8560A07816L9241i2407A25653A6334d8107m4993j75361a25730
$$ 119733 -233103 -58560 107816 147057 -92407 125653 16334 -48107 -93100 -268461 -125730
10749F5594i1545P187o9468q9053B55024o2778a02090p818C7886f6742K6388F3011
$$ 65594 -91545 -84358 -153826 -242879 255024 192246 -102090 -109908 37886 -66742 -40354 63011
10736B37464r3202D5754J09037b33742a06453L1586j19373A5937h2588B11622
$$ 237464 144262 45754 154791 -233742 -106453 -74867 -194240 15937 -82588 211622
10725b68377J20267C2572M567c0884j87356E0164e0403H7596b93104B688J8161
$$ -268377 -148110 32572 37139 -30884 -218240 50164 -50403 87596 -293104 2688 20849
10714B0849c53717f7452D2696c34373d8801B65489b29107B7911a27267k16561
$$ 20849 -353717 -67452 42696 -334373 -48801 265489 -229107 27911 -127267 -343828
10704c43828c2546k55184C03549c40424J50808O051p1506k6837J29027L575c3703
$$ -343828 -32546 -287730 303549 -340424 -189616 -183565 -255071 -281908 -152881 -149306 -33703
10692b4170o7907d3054H1079H213a81044c6973o6583j92143A17557b96615I9166
$$ -24170 -92077 -43054 81079 8213 -181044 -36973 -103556 -295699 117557 -296615 99166
10680a16805F5660g3432j30822b0007H6084O1036a44701G6765c2929J5549I8067
$$ -116805 65660 -73432 -204254 -20007 86084 147120 -144701 76765 -32929 -17380 98067
10668A76864b57839A24044a18370l03897H3403b01790l6380O4752N1065B54842
$$ 176864 -257839 124044 -118370 -422267 83403 -201790 -238170 -173418 -122353 254842
10657a82315H0486P7183A6931a52126D2080A0299J92207A364a79641l1733b1141
$$ -182315 80486 157669 16931 -152126 42080 10299 202506 1364 -179641 -211374 -21141
10645a30881j06795M9849A63100O8013A9599g7333A42542D3148a10448a8422B60520
$$ -130881 -237676 -187827 163100 231113 19599 -77333 142542 43148 -110448 -18422 260520
10633b2831B67611I6095a26359m0472m5375E9684a03611A0445K69725a50059k452
$$ -22831 267611 96095 -126359 -166831 -212206 59684 -103611 10445 280170 -150059 -152511
10622a52511A28766b98122c2827j60312K7164r5430n324J01224N0381A64109b74584
$$ -152511 128766 -298122 -32827 -193139 -165975 -261405 -266729 -165505 -115124 164109 -274584
10610b56211l2646o9926o5971a23518A79933d31924E2844c43405f5890m2253p4586
$$ -256211 -288857 -358783 -424754 -123518 179933 -431924 52844 -343405 -65890 -108143 -182729
10599a82729G5784a56297A88156f3241H2573K8622j5511J28489f0413F3685i0052
$$ -182729 75784 -156297 188156 -63241 82573 111195 95684 224173 -60413 63685 -90052
10587b57336M3402I5500p669J2390a49418n4533k2108E1341J2174a2490j52803
$$ -257336 -213934 95500 87831 100221 -149418 -203951 -226059 51341 63515 -12490 -165293
10576a65293O6131A48529o8811q994A3292O9093a33648H2290a78036H8792L6909
$$ -165293 -99162 148529 79718 70724 13292 82385 -133648 82290 -178036 88792 125701
10565A25701k078d2237l40410a02710A01922c61866C6744O9148i4449F7173a10832
$$ 125701 123623 -42237 -382647 -102710 101922 -361866 36744 105892 -94449 67173 -110832
10553H3817f7053g58G4394b02598M8399e4319j12945H8101J11375f2410A22217
$$ 83817 -67053 -758 74394 -202598 -154199 -54319 -167264 88101 199476 -62410 122217
10541C7132f5093C31274c21336R2419q780N5602e3397A44924A2847a03421G4858
$$ 37132 -65093 331274 -321336 -228917 -237697 -182095 -53397 144924 12847 -103421 74858
10529b50106C32304A06366c66452B89391a25449F1889c31693A81115a91082l8863
$$ -250106 332304 106366 -366452 289391 -125449 61889 -331693 181115 -191082 -229945
10519b29945A38261n4749e5533B81779h7395I6407a21931K3423k53828B2603a3941
$$ -229945 138261 83512 -55533 281779 -87395 96407 -121931 -98508 -352336 22603 -13941
10507B58319a62255A53716b47052f3489k0760L5224C05893H1101d65869C36134
$$ 258319 -162255 153716 -247052 -63489 -84249 -49025 305893 81101 -465869 336134
10496a80535B58413j07153a06975D219P247a08810j9197A467a09114A70158a25510
$$ -180535 258413 151260 -106975 4219 11466 -108810 -128007 1467 -109114 170158 -125510
10484a74950M0026k84641D42778b79506H1692b8421j4362o099k3305C22515p3029
$$ -174950 -134924 -419565 442778 -279506 81692 -28421 -42783 -48882 -72187 322515 249486
10473B49486K2531i274C30944g4355J2564k9216H9880a63268O2782B05118b06992
$$ 249486 272017 -9274 330944 -74355 -61791 -91007 89880 -163268 -100486 205118 -206992
10461i6158L1422a2326C809a7279C9520f2280k05928D5296b00648j72384J07602
$$ -96158 -64736 -12326 3809 -17279 39520 -62280 -268208 45296 -200648 -373032 -265430
10450b65430A33983D2115a46242M089B06522H8670b51535c7978C3370K91181e1192
$$ -265430 133983 42115 -146242 -142153 206522 88670 -251535 -37978 33370 324551 -51192
10438A52754a19549l16681A30184Q5709c4773A05287a41105a7829j18440Q649
$$ 152754 -119549 -436230 130184 215893 -34773 105287 -141105 -17829 -136269 -127620
10428a27620A25640c6458r2641a3349j62574C352c14412h7197H3638J31599g6501
$$ -127620 125640 -36458 -129099 -13349 -175923 3352 -314412 -87197 83638 215237 -76501
10416a8853E3003b15A70940c58824e5587a91p2271c1505j47046m7956N2172I0255
$$ -18853 53003 -215 170940 -358824 -55587 -191 -72462 -31505 -178551 -226507 -174335 90255
10403a61990E4642b69165E3896K6674a2605A72370q2791L0718D0838J94598a41646
$$ -161990 54642 -269165 53896 80570 -12605 172370 89579 120297 40838 235436 -141646
10391c1503r794k29067J14859D92983k33333a67333Q1386H0919c5174j26208E2896
$$ -31503 -41297 -270364 -155505 492983 259650 -167333 -85947 80919 -35174 -161382 52896
10379a96687B23227a53692E9279e4946B30130a80243L304B33842h152B85091A5121
$$ -196687 223227 -153692 59279 -54946 230130 -180243 -176939 233842 -8152 285091 15121
10367b7614B17586C5999k563K9561J92097r7476K68782B08435Q2375E1035d4959
$$ -27614 217586 35999 33436 62997 255094 157618 426400 208435 290810 51035 -44959
10355B22843a56196A0633K53057a10727A57049J10232d9351C14432j35164p9652
$$ 222843 -156196 10633 263690 -110727 157049 267281 -49351 314432 179268 99616
10345I9616g1289A89952r0342R2840L09938G0430B0810b18844d8583A68822C3648
$$ 99616 -71289 189952 99610 192450 502388 70430 20810 -218844 -48583 168822 33648
10333A16076P5098a78647f6273E8955J67875j06020d13480a27968F8393c2044
$$ 116076 191174 -178647 -66273 58955 226830 120810 -413480 -127968 68393 -32044
10322A56986g2115L813l50866A20215K58539A20059d0700a1156I4681L6507B4870
$$ 156986 -72115 -68302 -419168 120215 378754 120059 -40700 -11156 94681 131188 24870
10310c3748J5816k8490A68579c87535f580j05924L5525A14026J2737a32666B12555
$$ -33748 -17932 -46422 168579 -387535 -6580 -112504 -76979 114026 126763 -132666 212555
10298F3387k6776d8122c241A25737J10380e9062B1621K88134b67194c2940l46332
$$ 63387 36611 -48122 -3241 125737 236117 -59062 21621 309755 -267194 -32940 -379272
10287c79272e986A38507F8246a90933A20143J25819e2621A71208a30215r122O3696
$$ -379272 -5986 138507 68246 -190933 120143 245962 -52621 171208 -130215 -139337 -75641
10276g5641B61549a62804B28608a54592A39717f9058I2507b2013r6845A4693a42421
$$ -75641 261549 -162804 228608 -154592 139717 -69058 92507 -22013 -118858 14693 -142421
10264E3683K1764n849K57557a04760c7006H0521g3292A43820J14364r805A7642
$$ 53683 75447 69598 327155 -104760 -37006 80521 -73292 143820 258184 248379 17642
10252C60091A04800B8353J94743J62763H9354p239A8198a72889m1469Q9774a5085
$$ 360091 104800 28353 223096 385859 89354 82115 18198 -172889 -214358 -124584 -15085
10240c90937A79422a71114A0148a97449M3850A95076C9012P3284J38714a28940
$$ -390937 179422 -171114 10148 -197449 -153599 195076 39012 112296 251010 -128940
10229a41698A3899a99737H391b21802B34590a94791a3543j21228A25186e0595
$$ -141698 13899 -199737 8391 -221802 234590 -194791 -13543 -134771 125186 -50595
10218b93507j4206H5656b10528b7623A5513b65733A95808J7810I2280J53435j15058
$$ -293507 -307713 85656 -210528 -27623 15513 -265733 195808 213618 92280 245715 130657
10207A30657a35196O1673l4867B1595P7826M8520k5522d7744D235K32933h0269
$$ 130657 -135196 -73523 -108390 21595 99421 147941 122419 -47744 4235 237168 -80269
10195I453L4215i5943m0018F1826c5647I1083k6889J01384b45235d5489a8700
$$ 9453 43668 -95943 -135961 61826 -35647 91083 64194 165578 -245235 -45489 -18700
10183b51189d1089N76e647j52475M0500A70391d8677k12794A49M9359f3203j2993
$$ -251189 -41089 -40513 -5647 -158122 -117622 170391 -48677 -261471 149 49508 -63203 -76196
10171g6196F4378P9701a03937A57020a3137j11554h506A32409c44903a1597B81712
$$ -76196 64378 144079 -103937 157020 -13137 -124691 -8506 132409 -344903 -11597 281712
10159f8890n4317j28677A17920d17910A36272c67418a08180d4294C1778L76072
$$ -68890 -123207 -251884 117920 -417910 136272 -367418 -108180 -44294 31778 407850
10149D07850b40914j36620h0622b4374m8089B04553D3207a88422k8463b4431j56021
$$ 407850 -240914 -377534 -80622 -24374 -72463 204553 43207 -188422 -216885 -24431 -180452
10138a80452j39897J33146e5680H3505i1834p5607B28001b54063i0448j57013
$$ -180452 -320349 -187203 -55680 83505 -91834 -167441 228001 -254063 -90448 -247461
10128b47461j29374g1552r3456A15356a23440B48185h7449A43153b31678j28721
$$ -247461 -376835 -71552 -165008 115356 -123440 248185 -87449 143153 -231678 -360399
10118c60399k6545a87126G1807f0907q5517B13270c0701n4182a415k68790B9337
$$ -360399 -386944 -187126 71807 -60907 -146424 213270 -30701 -84883 -1415 -270205 29337
10106b47071l8741A51541b08984m4933A65163q1974M0892c7760p9219o72F3846
$$ -247071 -285812 151541 -208984 -253917 165163 83189 124081 -37760 -116979 -117651 63846
10094a50993j49771J23734L2445C38886K0134g24817a74955K985g5207a8972j1030
$$ -150993 -300764 -177030 -144585 338886 359020 -724817 -174955 -171970 -75207 -18972 -30002
10083c0002B34147g9479j22977Q7691G0726R9779j9682b05897A39491g7783A13304
$$ -30002 234147 -79479 -202456 -114765 70726 170505 150823 -205897 139491 -77783 113304
10071e4791j65836K1851A03248c97031O6716a10656b4553A27668f4694m3512H1089
$$ -54791 -220627 -198776 103248 -397031 -330315 -110656 -24553 127668 -64694 -108206 81089
10059A8620d04970b2930C8019J69403a88874C82035b55011J17463j03904A5945
$$ 18620 -404970 -22930 38019 207422 -188874 382035 -255011 -137548 -241452 15945
10048b3579j21676j82880O5750a09564d3395C7813a78733g1775b5216A96345J43152
$$ -23579 -145255 -328135 -262385 -109564 -43395 37813 -178733 -71775 -25216 196345 339497
10037C39497B2167d6032l42911a58300a4526B79600C1208h6442Q587b6383J0128
$$ 339497 22167 -46032 -388943 -158300 -14526 279600 31208 -86442 -77855 -26383 -16255
10026a6255B28033b11360B21561d54161I4461K5876b10247i197j65683p2634a2293
$$ -16255 228033 -211360 221561 -454161 94461 120337 -210247 -9197 -174880 -247514 -12293
10014b0271l44066o7325J79230J01073B43662b71598i2516b6281k32316F1781
$$ -20271 -364337 -431662 -252432 -151359 243662 -271598 -92516 -26281 -258597 61781
10003B3014a4102j89079l33691J59768A47245i8163M5719j61067K0534N1382F0797
$$ 23014 -14102 -203181 -536872 -377104 147245 -98163 -52444 -213511 -192977 -141595 60797
9991e5064M380k36043a4632k75140d6491A78429M1362H2227C6555b15631a731
$$ -55064 -50684 -286727 -14632 -289772 -46491 178429 219791 82227 36555 -215631 -1731
9979a66082m9761A2091J74147b98554a24340C10J03190a45162L7368A53139a46752
$$ -166082 -215843 12091 186238 -298554 -124340 310 103500 -145162 -107794 153139 -146752
9967B47286a86071b2288j78139f6091C66756G6386a19685j83855h3200L9490l52647
$$ 247286 -186071 -22288 -200427 -66091 366756 76386 -119685 -303540 -83200 -43710 -396357
9956c96357H92f9457A01677O576b80004h3913k29112b6873C19257C7885N9471
$$ -396357 892 -69457 101677 108253 -280004 -83913 -313025 -26873 319257 37885 97356
9945I7356a28215C4677a45815B78726H8969e3459B29531b85105O383C0428K592
$$ 97356 -128215 34677 -145815 278726 88969 -53459 229531 -285105 -278722 30428 33020
9934C3020R8651c44916O5010B01697b89891a11133o0368e488m3664j9871B14511
$$ 33020 131671 -344916 -279906 201697 -289891 -111133 -171501 -5488 -49152 -69023 214511
9922a44805B63644f1399b0148m65462H2425c61672A83892C3344O4628e8872j9580
$$ -144805 263644 -61399 -20148 -485610 82425 -361672 183892 33344 97972 -58872 -78452
9911g8452B51937a86328I7493O3182a04049C49253f5320j1969j43931E7623e6825
$$ -78452 251937 -186328 97493 160675 -104049 349253 -65320 -77289 -221220 57623 -56825
9899A9995N3011a29328B82878i3895j31323p6458J31079o6266F0870b06172e6966
$$ 19995 73006 -129328 282878 -93895 -225218 -301676 -170597 -236863 60870 -206172 -56966
9887C06097d1266A57864a72876C57331a09056J8008l9656d9217k72182a24865
$$ 306097 -41266 157864 -172876 357331 -109056 -91048 -130704 -49217 -321399 -124865
9876f6284I2223b10423P0470e2581A28675C0772O7860e6768k75669h3324J661
$$ -66284 92223 -210423 -139953 -52581 128675 30772 98632 -56768 -332437 -83324 -81663
9865h1663j42941D25759a08723j42141N7080k43134a90382i2089a5913B1493c1810
$$ -81663 -224604 425759 -108723 -250864 -193784 -436918 -190382 -92089 -15913 21493 -31810
9853a50843O7199k30592C29728d5277G9213a00642F7111P5651f5804j49013J05591
$$ -150843 -83644 -314236 329728 -45277 79213 -100642 67111 142762 -65804 -214817 -109226
9842a09226j27569G9478b3823q183D80925A90418a36293H2092b11274F8347b41983
$$ -109226 -236795 79478 -23823 -32006 480925 190418 -136293 82092 -211274 68347 -241983
9830a04481a7628k52370D2013a11893B10110c40981J18749B40739E5723a67711
$$ -104481 -17628 -269998 42013 -111893 210110 -340981 -222232 240739 55723 -167711
9819A46058D4599A8132h6673j99257h7033k9981k790q1464A08620e6598j36111
$$ 146058 44599 18132 -86673 -285930 -87033 -117014 -119804 -201268 108620 -56598 -192709
9808a92709D9923b8175j13152A29244a74764K9046C7512d7628l2403i583j33224
$$ -192709 49923 -28175 -141327 129244 -174764 -145718 37512 -47628 -80031 -9583 -142807
9797a42807A02178c70764I5097a36510d3829j93571j0086F014a06793M9629k88547
$$ -142807 102178 -370764 95097 -136510 -43829 -237400 -247486 6014 -106793 -57164 -345711
9786c45711c0347A3263J3299d10458J03393b2697r8768A11600m5733P333a65907
$$ -345711 -30347 13263 26562 -410458 -307065 -22697 -121465 111600 65867 73200 -165907
9774e93l35595c2447A45773f975F8894c05768A2811B302e6790q6390I4118b03408
$$ -593 -336188 -32447 145773 -6975 68894 -305768 12811 2302 -56790 -143180 94118 -203408
9761B23099h8064B17864b00653A33299m8474a02984k75092a20815a2895q5406
$$ 223099 -88064 217864 -200653 133299 84825 -102984 -378076 -120815 -12895 -98301
9751i8301c9897k91261c0943D998b37438b7101q264A19058e5973j39420f1335
$$ -98301 -39897 -331158 -30943 4998 -237438 -27101 -35365 119058 -55973 -195393 -61335
9739C36265b41243h0712E3854c11270J54702L3350C24321c81343b4156j1711A75465
$$ 336265 -241243 -80712 53854 -311270 -156568 -123218 324321 -381343 -24156 -35867 175465
9727B24712a52242L8734D0282a83195J0350A2285a90776b5291p2558j35177R0397
$$ 224712 -152242 -113508 40282 -183195 -172845 12285 -190776 -25291 -97849 -233026 -142629
9716a42629n2855C65186A31251C8467b6478H4501J07924G4296h701n0040j06075
$$ -142629 -195484 365186 131251 38467 -26478 84501 192425 74296 -8701 -58741 -164816
9705a64816k26670J7415E939b80677h3355D8489M3425a88851c0819A89680e0142
$$ -164816 -391486 -374071 5939 -280677 -83355 48489 91914 -188851 -30819 189680 -50142
9693b18846E9728i3439I5400c1096B75920c63357a75292E6111C093A341M8398
$$ -218846 59728 -93439 95400 -31096 275920 -363357 -175292 56111 3093 1341 49739
9682D9739b26327Q3057A29939c83462J11554i4932c9165A12797b79161g9675B7354
$$ 49739 -226327 -143270 129939 -383462 -271908 -94932 -39165 112797 -279161 -79675 27354
9670b00903M7085J0080j34459J01976a8657k93846c6933A11070K39127A29622
$$ -200903 -153818 -143738 -278197 -176221 -18657 -312503 -36933 111070 350197 129622
9659d75585F8721N7304F2309c11102a37332j0026e9830m490p1387C1274c2077
$$ -475585 68721 126025 62309 -311102 -137332 -147358 -59830 -64320 -135707 31274 -32077
9647A50677l9022a67572j26090g4846a6356k04748e4927j65854A10305J86794
$$ 150677 111655 -167572 -293662 -74846 -16356 -221104 -54927 -220781 110305 297099
9637B97099A5452g4785A04284a2110D2072b45736C79952j67287a82522j04025
$$ 297099 15452 -74785 104284 -12110 42072 -245736 379952 212665 -182522 -286547
9627b86547h7863k02400B0571e13251B5283b72612M8409A2300J18763b08258m566
$$ -286547 -87863 -290263 20571 -513251 25283 -272612 -224203 12300 131063 -208258 -212824
9616b12824i738l63779E5776B5091a04457k61893A91711b7205o5634A77701a13063
$$ -212824 -9738 -373517 55776 25091 -104457 -366350 191711 -27205 -92839 177701 -113063
9604i0515A23738n074a79781P239B40734F5441a76143k3498e3978k28041M5401
$$ -90515 123738 118664 -179781 -172542 240734 65441 -176143 -199641 -53978 -282019 -236618
9593b36618J00057d9330j3675A38682d95665a77563b2595k62028h6921K8397j17339
$$ -236618 -136561 -49330 -63005 138682 -495665 -177563 -22595 -284623 -86921 -58524 -175863
9582a75863O3002B35099A5917g4441A20330L6794a9282A42455A0038J19783b71517
$$ -175863 -112861 235099 15917 -74441 120330 157124 -19282 142455 10038 129821 -271517
9570H4003h2026A60321e8797m6770K5628A73338a66411A12132i9068C2975K27430
$$ 84003 -82026 160321 -58797 -105567 -79939 173338 -166411 112132 -99068 32975 260405
9559B60405a10672j00212A3686K4245N624a70412F4012c05940C5745b6035l21451
$$ 260405 -110672 -210884 13686 37931 43555 -170412 64012 -305940 35745 -26035 -347486
9548c47486J43161b6313A09977g9034B65145c0138A35174a54987k8805e9643j99924
$$ -347486 -204325 -26313 109977 -79034 265145 -30138 135174 -154987 -183792 -59643 -259567
9537b59567A47937M820P0651B7086a59160q5669D9147c05326j6893i7067q5446
$$ -259567 147937 152757 223408 27086 -159160 -244829 49147 -305326 -322219 -97067 -182513
9526a82513A4349Q5835a818A21982b43928J05378n0849N6279j64234a35598a6176
$$ -182513 14349 100184 -1818 121982 -243928 -138550 -189399 -133120 -297354 -135598 -16176
9514A89711R362A3249J92686L2619L5449a80569a552H0732A5769L24837b05323
$$ 189711 199073 13249 205935 238554 274003 -180569 -1552 80732 15769 340606 -205323
9502I3629p740k2921a68802d4814G0815a34792o4541H5298C3849b04315C0367
$$ 93629 85889 62968 -168802 -44814 70815 -134792 -199333 85298 33849 -204315 30367
9490b13979a7631l70992a18724D5992q442a37850k26642C5699a41552l4848A32635
$$ -213979 -17631 -388623 -118724 45992 37550 -137850 -364492 35699 -141552 -176400 132635
9478F2122a89564A13340a39041O1999n8543o6046i5618o2611O6491D7961a8385
$$ 62122 -189564 113340 -139041 -77042 -135585 -201631 -95618 -158229 -91738 47961 -18385
9466i8390c0188q4415k68474N6849h2483G2590b953k6438B25916h6729j08413
$$ -98390 -30188 -114603 -383077 -326228 -82483 72590 -2953 -29391 225916 -86729 -195142
9455a95142g9119j59350B14470E5289g1682k02783f4365B60915b989j98674A0680
$$ -195142 -79119 -238469 214470 55289 -71682 -274465 -64365 260915 -2989 -201663 10680
9443d3627A62117m375F7498b04365L8081c3474G0894d6550b0754n36j2695B3726
$$ -43627 162117 157742 67498 -204365 -166284 -33474 70894 -46550 -20754 -21290 -33985 23726
9430a36458H3477O4348c9004p0502B04727H7515h8058B50655G7957a13890j73990
$$ -136458 83477 147825 -39004 -109506 204727 87515 -88058 250655 77957 -113890 -287880
9419b87880A01793a55658A80438a19622A40390Q1456B819g0984j22605A42395
$$ -287880 101793 -155658 180438 -119622 140390 221846 2819 -70984 -193589 142395
9408b81811d0041D3107b54699c9123B090f9204R018F952J17324J22581C9726i5914
$$ -281811 -40041 43107 -254699 -39123 2090 -69204 -60186 6952 124276 246857 39726 -95914
9395a08046j92408F4157f495A10944i150D8300Q8893N0031e2971k54915A06877
$$ -108046 -300454 64157 -6495 110944 -9150 48300 137193 187224 -52971 -307886 106877
9383b19053O7731r0565A91975m3319a25586l42086a18118m5723b7638E9295f8879
$$ -219053 -151322 -241887 191975 148656 -125586 -467672 -118118 -163841 -27638 59295 -68879
9371C35989I2777J8973P6981h0739b5362j79275g9112A2289a29121a8632R36r839
$$ 335989 92777 111750 188731 -80739 -25362 -204637 -79112 12289 -129121 -18632 -17696 -27535
9359b7535l26885A90710b390A84748g7918j07113m2024J1493f9263r54C42612
$$ -27535 -354420 190710 -2390 184748 -77918 -185031 -227055 -215562 -69263 -70217 342612
9347e7923A0953J46710g8600I4579b77129A89159G4917a8091j55419C11372a06862
$$ -57923 10953 157663 -78600 94579 -277129 189159 74917 -18091 -173510 311372 -106862
9335i1980A19319E3282a15310m8723q5976N2484P5242j13313J03428F4847l443
$$ -91980 119319 53282 -115310 -164033 -250009 -197525 -122283 -235596 -132168 64847 61404
9324F1404c88204D6506b55381a19505j29841A1127K24066a55157A61525c17080
$$ 61404 -388204 46506 -255381 -119505 -249346 11127 235193 -155157 161525 -317080
9313c16330D18207b09577n9090j74560A78223c3446m2536A53016a48835A61116
$$ -316330 418207 -209577 -268667 -443227 178223 -33446 -75982 153016 -148835 161116
9302B1331h9542l15995a79428O2121C58539A39025c54313J47730B03974H9815
$$ 21331 -89542 -405537 -179428 -117307 358539 139025 -354313 -206583 203974 89815
9291F9182a21525o7856B81093G9566a85253D1956h8551k54711G3021a40568D1387
$$ 69182 -121525 -189381 281093 79566 -185253 41956 -88551 -343262 73021 -140568 41387
9279i5855k96799a26523M7680A2785a6163l28133a69537I526i0536o2098N4643
$$ -95855 -392654 -126523 -78843 12785 -16163 -344296 -169537 9526 -90536 -152634 -97991
9268i7991k68879J37257n2290I49a22572c06n1399a9080A0417f7595B04406c05438
$$ -97991 -366870 -229613 -281903 949 -122572 -306 -51705 -19080 10417 -67595 204406 -305438
9255G0132l3352D441e4185j82663F0522I211d3277k5872p8085B01191b4007j76145
$$ 70132 36780 4441 -54185 -236848 60522 9211 -43277 -69149 -147234 201191 -24007 -200152
9243b00152A96247a37702B39964a0788C381J83534k6144a80583j5073c7652r5924
$$ -200152 196247 -137702 239964 -10788 3381 186915 160771 -180583 -195656 -37652 -133576
9232a33576N0072A24820a62759A90016b59086d6812j81447B55991r6840C7340
$$ -133576 -83504 124820 -162759 190016 -259086 -46812 -228259 255991 159151 37340
9221A31928J08977H3140i6604C6304R720a21270j05312e3982b0016l17302f9338
$$ 131928 240905 83140 -96604 36304 46024 -121270 -226582 -53982 -20016 -337318 -69338
9209g5329J2941B68122b55426J25641A25946a58061A4290a63944A48857d60424
$$ -75329 -62388 268122 -255426 -129785 125946 -158061 14290 -163944 148857 -460424
9198i4358l62823b20199h2929j0509C0310a80829M1406A97823h5957d219A22186
$$ -94358 -457181 -220199 -82929 -93438 30310 -180829 -139423 197823 -85957 -4219 122186
9186g8265j0228n7794n2127B83a16431j54027J07851A14709i0219j39243M6689
$$ -78265 -88493 -146287 -198414 283 -116431 -270458 -162607 114709 -90219 -229462 -182773
9175a82773O4860L009o5819j14232c1037A39165b28288J10269j30662o6765B22221
$$ -182773 -117913 -114904 -180723 -294955 -31037 139165 -228288 -118019 -248681 -315446 222221
9163g946k2176B45919a5297F0471K64729A52002b70195a1383j78779A46349c35669
$$ -7946 -30122 245919 -15297 60471 325200 152002 -270195 -11383 -190162 146349 -335669
9151A0178L4733J42912a09572j27355a15648f63p297k22936l7979J15503j68252
$$ 10178 44911 187823 -109572 -236927 -115648 -663 -7960 -230896 -268875 -153372 -321624
9140c21624r4128a45349O3589L4707r4971A59503o2329d4789p5614A85569f1117
$$ -321624 -415752 -145349 -81760 -47053 -142024 159503 97174 -44789 -120403 185569 -61117
9128i0646h577j05455m5327B33555a09776p1019M6699j59772d4272A7140a73562
$$ -90646 -8577 -114032 -159359 233555 -109776 -180795 -134096 -293868 -44272 17140 -173562
9116a05439B85077j09571A47N8715K7325B6633a85982m681E7500e2135A71131
$$ -105439 285077 175506 147 58862 86187 26633 -185982 -190663 57500 -52135 171131
9104e0538F5817b10484B74174a24542I3578b11936c8319j77878A01613b37906
$$ -50538 65817 -210484 274174 -124542 93578 -211936 -38319 -216197 101613 -237906
9093b13237A34104e2298A21040b43797B18017i9305d5304k30771A34783b9397
$$ -213237 134104 -52298 121040 -243797 218017 -99305 -45304 -276075 134783 -29397
9082A97120i0482j05427l0330P4088A0905b27577A35066a28309b1312k46873I0174
$$ 197120 -90482 -195909 -226239 -152151 10905 -227577 135066 -128309 -21312 -268185 90174
9070b26090J07548k57677H0884j8624a74214j45652a3295m0355m276k31694e5727
$$ -226090 -118542 -376219 80884 62260 -174214 -319866 -13295 -53650 -57926 -289620 -55727
9058a60611A35737o7099b25125C22329E5911a30597j62249i2715j9820K6446j09158
$$ -160611 135737 68638 -225125 322329 55911 -130597 -292846 -92715 -112535 -86089 -195247
9047a95247B6487R8023b41941A82652P043b43333A16058b80780j58128a29253
$$ -195247 26487 124510 -241941 182652 189695 -243333 116058 -280780 -438908 -129253
9036a57046O4657B7571L5267b15765F3439b40983c6299n9202A26022i2435j12456
$$ -157046 -92389 27571 62838 -215765 63439 -240983 -36299 -95501 126022 -92435 -204891
9025b04891Q6906j38286A41483E9795a27870A44410a33642c4922J0938l52172
$$ -204891 -117985 -256271 141483 59795 -127870 144410 -133642 -34922 -23984 -376156
9015c76156a73997F0036B1968J65529a53025j23778c8522B52014C0089b78570
$$ -376156 -173997 60036 21968 187497 -153025 -276803 -38522 252014 30089 -278570
9004A43867A8107J16210j0924b2230j51393A33806A7593L254P6065J9696e7852
$$ 143867 18107 134317 123393 -22230 -173623 133806 17593 20847 96912 116608 -57852
8992a115j01324A38785P2101l4252J6870a1856e131C06496g1454K1404E3635f5967
$$ -1115 -102439 138785 210886 176634 193504 -11856 -5131 306496 -71454 -50050 53635 -65967
8979F8304a18396G746i5339r8329g4246I3470b98182L0862a00728k78694Q9677
$$ 68304 -118396 7746 -95339 -193668 -74246 93470 -298182 -267320 -100728 -379422 -289745
8968b89745N1679K4589A08995a61104A5812J01324m8246f636E8934A6738J0599
$$ -289745 -238066 -213477 108995 -161104 15812 117136 68890 -6636 58934 16738 27337
8957B7337P5058a23035d4552J0607k77805d3320J567p1892j21563A35788a67312
$$ 27337 102395 -123035 -44552 -33945 -311750 -43320 -41753 -113645 -235208 135788 -167312
8945B01541c19912A45344a47458D1864h9492p5274N520k11870A07503e3207k48653
$$ 201541 -319912 145344 -147458 41864 -89492 -164766 -159246 -371116 107503 -53207 -301860
8934c01860b0344E7092a06414A20108D9065J75807h8327C42561m2908K28941A08028
$$ -301860 -20344 57092 -106414 120108 49065 224872 -88327 342561 299653 528594 108028
8922d9693l59222F706g5512A50222O60644F4404K88997g4348J6246b1221B4134
$$ -49693 -408915 6706 -75512 150222 810866 64404 353401 -74348 -58102 -21221 24134
8910I4419R3966a2918m8059J3844C4709f1142k0355q7996I9563B0091e0646k11104
$$ 94419 188385 -12918 -60977 -47133 34709 -61142 -81497 -169493 99563 20091 -50646 -261750
8898b61750D3718b11849H1967a13117j3867e4567l5589a5504j43368C5933b04778
$$ -261750 43718 -211849 81967 -113117 -126984 -54567 -90156 -15504 -158872 35933 -204778
8886C00551a3966l77150J76000K5251C6544h4940m8946P448k7742B09977g91I4094
$$ 300551 -13966 -391116 -215116 -189865 36544 -84940 -133886 -126438 -154180 209977 -791 94094
8873F0893K16627a4092j23263G1555M0271d35594a41743A14297c58301J54629
$$ 60893 277520 -14092 -137355 71555 111826 -435594 -141743 114297 -358301 -203672
8863b03672l0783f8510I8632g1742j13746B9477Q3436a26729A51102b01105d7762
$$ -203672 -234455 -68510 98632 -71742 -185488 29477 112913 -126729 151102 -201105 -47762
8851b91050F5632a84120P2712F199g8687B33623e9966J7079E5109b62806A16532
$$ -291050 65632 -184120 -111408 6199 -78687 233623 -59966 -42887 55109 -262806 116532
$$ [...]
##END NTUPLES=NMR SPECTRUM
##END=
