##TITLE=NES1017_872015068_9265900_OTYrnOHzXa
##JCAMPDX= 6.0         $$ Bruker NMR JCAMP-DX V2.0
##DATA TYPE= NMR SPECTRUM
##DATA CLASS= NTUPLES
##ORIGIN= BRUKER
##OWNER= Administrator
$$ 1.72 TOPSPIN		Version 2.1
$$ 2015-07-10 00:15:10.019 -0700  Administrator@X
$$ Compression mode = diff/dup
##.OBSERVE FREQUENCY= 400.02188249412
##.OBSERVE NUCLEUS= ^1H
##.ACQUISITION MODE= SIMULTANEOUS (DQD)
##.ACQUISITION SCHEME= undefined
##.AVERAGES= 64
##.DIGITISER RES= 22
##SPECTROMETER/DATA SYSTEM= spect
##.PULSE SEQUENCE= noesygpps1d.comp
##.SOLVENT NAME= COFFEE_meoh
##.SHIFT REFERENCE= INTERNAL, COFFEE_meoh, 1, 14.96313
##AUDIT TRAIL= $$ (NUMBER, WHEN, WHO, WHERE, PROCESS, VERSION, WHAT)
$$ ##TITLE= Audit trail, TOPSPIN		Version 2.1
$$ ##JCAMPDX= 5.01
$$ ##ORIGIN= Bruker BioSpin GmbH
$$ ##OWNER= Administrator
$$ $$ E:\/data/COFFEE/nmr/NES1017_872015068_9265900_OTYrnOHzXa/12/pdata/1/auditp.txt
$$ ##AUDIT TRAIL=  $$ (NUMBER, WHEN, WHO, WHERE, PROCESS, VERSION, WHAT)
(   1,<2015-07-10 00:15:04.956 -0700>,<Administrator>,<X>,<go>,<TOPSPIN 2.1>,
      <created by zg
	started at 2015-07-10 00:03:35.066 -0700,
	POWCHK enabled, PULCHK disabled,
       configuration hash MD5:
       21 0F 79 D6 B3 7B B4 F6 88 20 88 DB 03 48 BD 9F
       data hash MD5: 64K
       A1 96 8F 04 1E A0 B3 81 F0 80 C9 02 4E 55 EB C9>)
(   2,<2015-07-10 00:15:08.160 -0700>,<Administrator>,<X>,<proc1d>,<TOPSPIN 2.1>,
      <Start of raw data processing
       efp LB = 0.3 FT_mod = 6 PKNL = 1 PHC0 = 0 PHC1 = 0 SI = 128K 
       data hash MD5: 128K
       AB 18 EE 57 CB 15 19 6E 5C F4 18 59 ED 15 4A DE>)
(   3,<2015-07-10 00:15:09.066 -0700>,<Administrator>,<X>,<proc1d>,<TOPSPIN 2.1>,
      <pk PHC0 = 269.9231 PHC1 = 0 
       data hash MD5: 128K
       E6 7C 3D 70 FE 72 CD 95 0C 88 96 82 A2 11 04 6A>)
(   4,<2015-07-10 00:15:09.472 -0700>,<Administrator>,<X>,<proc1d>,<TOPSPIN 2.1>,
      <abs ABSG = 1 
       data hash MD5: 128K
       CE 4B B5 99 55 4B 6D 7E 9C A0 8F B1 A8 18 1C D0>)
(   5,<2015-07-10 00:15:09.581 -0700>,<Administrator>,<X>,<proc1d>,<TOPSPIN 2.1>,
      <abs ABSG = 2 
       data hash MD5: 128K
       E9 C1 FC 57 FF 67 A0 B2 07 0F 02 F4 73 FB 2C FF>)
(   6,<2015-07-10 00:15:09.660 -0700>,<Administrator>,<X>,<proc1d>,<TOPSPIN 2.1>,
      <abs ABSG = 3 
       data hash MD5: 128K
       96 90 D1 BC 6B 29 12 F1 E7 A7 BD 79 FE 07 4E 45>)
(   7,<2015-07-10 00:15:09.753 -0700>,<Administrator>,<X>,<proc1d>,<TOPSPIN 2.1>,
      <abs ABSG = 4 
       data hash MD5: 128K
       38 F9 75 56 5A 95 E3 E6 8D A0 52 58 7D 9C 73 ED>)
(   8,<2015-07-10 00:15:09.847 -0700>,<Administrator>,<X>,<proc1d>,<TOPSPIN 2.1>,
      <abs ABSG = 5 
       data hash MD5: 128K
       B4 69 63 60 89 4C B3 5C F1 DD DA 45 30 5E 91 2C>)
$$ ##END=
$$ 
$$ $$ hash MD5
$$ $$ A8 55 C5 DA 22 0B BA 4B 5F 7E D8 A7 13 BC 2B F5
##$RELAX= 
##$RELAX= 
##$RELAX= 
##$RELAX= 
##$RELAX= 
##$RELAX= 
##$RELAX= 
##$RELAX= 
$$ Bruker specific parameters
$$ --------------------------
##$DU= <E:\>
##$EXPNO= 12
$$ [...]
##$TP07= 0
##$TPNAME0= <>
##$TPNAME1= <>
##$TPNAME2= <>
##$TPNAME3= <>
##$TPNAME4= <>
##$TPNAME5= <>
##$TPNAME6= <>
##$TPNAME7= <>
##$TPOAL= (0..7)
0.5 0.5 0.5 0.5 0.5 0.5 0.5 0.5
##$TPOFFS= (0..7)
0 0 0 0 0 0 0 0
##$TUNHIN= 0
##$TUNHOUT= 0
##$TUNXOUT= 0
##$USERA1= <user>
##$USERA2= <user>
##$USERA3= <user>
##$USERA4= <user>
##$USERA5= <user>
##$V9= 5
##$VALIST= <valist>
##$VCLIST= <CCCCCCCCCCCCCCC>
##$VD= 0
##$VDLIST= <DDDDDDDDDDDDDDD>
##$VPLIST= <PPPPPPPPPPPPPPP>
##$VTLIST= <TTTTTTTTTTTTTTT>
##$WBST= 2048
##$WBSW= 25
##$XGAIN= (0..3)
0 0 0 0
##$XL= 0
##$YL= 0
##$YMAX_a= 6135969
##$YMIN_a= -11584199
##$ZGOPTNS= <>
##$ZL1= 120
##$ZL2= 120
##$ZL3= 120
##$ZL4= 120
##$ABSF1= 14.96313
##$ABSF2= -5.595052
##$ABSG= 5
##$ABSL= 3
##$ALPHA= 0
##$AQORDER= 0
##$ASSFAC= 0
##$ASSFACI= 0
##$ASSFACX= 0
##$ASSWID= 0
##$AUNMP= <proc_prof1d_extract.lims>
##$AXLEFT= 0
##$AXNAME= <>
##$AXNUC= <1H>
##$AXRIGHT= 0
##$AXTYPE= 0
##$AXUNIT= <>
##$AZFE= 0.1
##$AZFW= 0.1
##$BCFW= 0
##$BC_mod= 0
##$BYTORDP= 0
##$COROFFS= 0
##$CY= 15
##$DATMOD= 1
##$DC= 0
##$DFILT= <>
##$DTYPP= 0
##$F1P= 0
##$F2P= 0
##$FCOR= 0.5
##$FTSIZE= 131072
##$FT_mod= 6
##$GAMMA= 0
##$GB= 0
##$INTBC= 1
##$INTSCL= 1
##$ISEN= 128
##$LB= 0.3
##$LEV0= 0
##$LPBIN= 0
##$MAXI= 10000
##$MC2= 0
##$MEAN= 0
##$ME_mod= 0
##$MI= 0
##$NCOEF= 0
##$NC_proc= -2
##$NLEV= 6
##$NOISF1= 0
##$NOISF2= 0
##$NSP= 0
##$NTH_PI= 0
##$NZP= 0
##$OFFSET= 14.96313
##$PC= 1
##$PHC0= 269.9231
##$PHC1= 0
##$PH_mod= 1
##$PKNL= yes
##$PPARMOD= 0
##$PPDIAG= 0
##$PPIPTYP= 0
##$PPMPNUM= 2147483647
##$PPRESOL= 1
##$PSCAL= 4
##$PSIGN= 0
##$PYNMP= <proc.py>
##$REVERSE= no
##$SF= 400.020008783839
##$SI= 131072
##$SIGF1= 0
##$SIGF2= 0
##$SINO= 400
##$SIOLD= 131072
##$SPECTYP= <>
##$SREGLST= <1H.CDCl3>
##$SSB= 0
##$STSI= 131072
##$STSR= 0
##$SW_p= 8223.68421052631
##$SYMM= 0
##$S_DEV= 0
##$TDeff= 65536
##$TDoff= 0
##$TI= <>
##$TILT= no
##$TM1= 0
##$TM2= 0
##$TOPLEV= 0
##$USERP1= <user>
##$USERP2= <user>
##$USERP3= <user>
##$USERP4= <user>
##$USERP5= <user>
##$WDW= 1
##$XDIM= 131072
##$YMAX_p= 370763374
##$YMIN_p= -13042
##$CURPLOT= <Network HP LaserJet P1505>
##$CURPRIN= <$Network HP LaserJet P1505>
##$DFORMAT= <normdp>
##$LAYOUT= <+/1D_H.xwp>
##$LFORMAT= <normlp>
##$PFORMAT= <normpl>
##$SURQMSG= 1
$$ End of Bruker specific parameters
$$ ---------------------------------
##NTUPLES= NMR SPECTRUM
##VAR_NAME=  FREQUENCY,     SPECTRUM/REAL,   SPECTRUM/IMAG
##SYMBOL=    X,             R,               I
##VAR_TYPE=  INDEPENDENT,   DEPENDENT,       DEPENDENT
##VAR_FORM=  AFFN,          ASDF,            ASDF
##VAR_DIM=   131072,        131072,          131072
##UNITS=     HZ,            ARBITRARY UNITS, ARBITRARY UNITS
##FACTOR=    0.0627417313425164, 1,          1
##FIRST=     8223.62146879497, 1890,         -41641
##LAST=      0,             2810,            -41348
##MIN=       0,             -13042,          0
##MAX=       8223.62146879497, 370763374,    0
$$ Real data points
##PAGE= N=1
##DATA TABLE= (X++(R..R)), XYDATA
$$ [...]
61076F00969R23J089J938L269M568N618O384O682O381N754N352N602O527P645
$$ 600969 601892 602981 604919 608188 612756 618374 624758 631440 637821 643575 648927 654529 661056 668701
61062F68701Q248Q057P475O898O159N038L953L388L062K464J966K402L688M891
$$ 668701 676949 685006 692481 699379 705538 710576 714529 717917 720979 723443 725409 727811 731499 736390
61048G36390N567O076O641P212Q237J0346J3165J5549J7108J8359J9484K0266
$$ 736390 741957 748033 754674 761886 770123 780469 793634 809183 826291 844650 864134 884400
61036H84400K1306K3694K7161L0207L2355L4711L7851M1002M3950M7803N2862
$$ 884400 905706 929400 956561 986768 1019123 1053834 1091685 1132687 1176637 1224440 1277302
61025A277302N7528O0435O2065O3265O4100O5359O9220P6832Q6970R8491J12182
$$ 1277302 1334830 1395265 1457330 1520595 1584695 1650054 1719274 1796106 1883076 1981567 2093749
61014B093749J28630J46611J65865J89345K20266K58864L04519L58709M22833
$$ 2093749 2222379 2368990 2534855 2724200 2944466 3203330 3507849 3866558 4289391
61005D289391M95776N77587O73597P90795R32813J103693J313516J572320J878608
$$ 4289391 4785167 5362754 6036351 6827146 7759959 8863652 10177168 11749488 13628096
60996A3628096K217925K561347K841004K924844K657238J980289J035279J20197
$$ 13628096 15846021 18407368 21248372 24173216 26830454 28810743 29846022 29966219
60988B9966219m86080o76940n20672j56600K72647O02435O36348K35048n57059
$$ 29966219 29480139 28803199 28282527 28125927 28398574 29001009 29637357 29872405 29315346
60979B9315346j495841k278435k719657k814237k667344k395062k078994j768912
$$ 29315346 27819505 25541070 22821413 20007176 17339832 14944770 12865776 11096864
60971A1096864j491069j251115j043639q65074p15774n93504m92447m08916l42788
$$ 11096864 9605795 8354680 7311041 6445967 5730193 5136689 4644242 4235326 3892538
60962C892538k92817k54829k25100k01959j83545j67351j52578j40111j29564
$$ 3892538 3599721 3344892 3119792 2917833 2734288 2566937 2414359 2274248 2144684
60953B144684j18920j07401r6146q5687p5490o6337o0323n7573n5426n1964m8001
$$ 2144684 2025764 1918363 1822217 1736530 1661040 1594703 1534380 1476807 1421381 1369417 1321416
60942A321416m4651m1255l7037l2841k9655k7051k4394k2226k1101k0284j8860
$$ 1321416 1276765 1235510 1198473 1165632 1135977 1108926 1084532 1062306 1041205 1020921 1002061
60931A002061j7070j5504j4021j2478j1431j1162j1017j0638j0805j2002j3261
$$ 1002061 984991 969487 955466 942988 931557 920395 909378 898740 887935 875933 862672
60920H62672j3449j2825j2275j1843j1217j0812j1133j1631j1385j0490r741r286
$$ 862672 849223 836398 824123 812280 801063 790251 779118 767487 756102 745612 735871 726585
60908G26585q621p725p201p302p566p504p131o783o703o786o667o163n552n040
$$ 726585 717964 710239 703038 695736 688170 680666 673535 666752 660049 653263 646596 640433 634881 629841
60894F29841m275k980j824j646j997j609l38O79J002J466K375K694J929J250J627
$$ 629841 625566 622586 620762 619116 617119 615510 615172 615851 616853 618319 620694 623388 625317 626567 628194
60879F28194K196J769Q08L78J65q80k502l412l216k617j923p91N79J350J305J159
$$ 628194 630390 632159 632967 633345 633510 632630 630128 626716 623500 620883 618960 618169 618748 620098 621403 622562
60863F22562J480K137K848L483L771L375K334R06p47k209k664j874q23o10j045
$$ 622562 624042 626179 629027 632510 636281 639656 641990 642896 642149 639940 637276 635402 634579 633969 632924
60848F32924j371j910l793p154j0769j3405j4568j4059j2013r453p705o932o185
$$ 632924 631553 629643 625850 618696 607927 594522 579954 565895 553882 544429 536724 529792 523607
60835E23607m971l794l025k300j440q89q74r45q03p80j013r11m3J056J466R69
$$ 523607 518636 514842 511817 509517 508077 507188 506314 505369 504566 503786 502773 501862 501819 502875 504341 505310
60819E05310J09m51l23L99J124J334J276J620K387K864K713K377K103J412P6j089
$$ 505310 505419 504968 504645 505044 506168 507502 508778 510398 512785 515649 518362 520739 522842 524254 524330 523241
60803E23241j120j69P73J030O80R1l54l16J87O37M82k77j262k179k837l053k936
$$ 523241 522121 521952 522725 523755 524435 524526 524172 523856 524043 524680 525162 524885 523623 521444 518607 515554 512618
60786E12618l025l688m542m854m481l975l777l691l227k262j216o74q12j171j103
$$ 512618 509593 505905 501363 496509 492028 488053 484276 480585 477358 475096 473880 473206 472394 471223 470120
60771D70120n34j03m02j204j677j251j32R71J446J213P36O24J098J874K528K836
$$ 470120 469586 469483 469081 467877 466200 464949 464817 465788 467234 468447 469183 469807 470905 472779 475307 478143
60755D78143K725K208J586J392J792K140J593J58j269k021k368k832l222k925
$$ 478143 480868 483076 484662 486054 487846 489986 491579 491737 490468 488447 486079 483247 480025 477100
60741D77100j977j244j300j692j685j326j303j942k826l386l455l215k949k850
$$ 477100 475123 473879 472579 470887 469202 467876 466573 464631 461805 458419 454964 451749 448800 445950
60727D45950k858k718k472k656l547m430m354l504l068l573m233m219l730l331
$$ 445950 443092 440374 437902 435246 431699 427269 422915 419411 416343 412770 408537 404318 400588 397257
60713C97257l020k581k228k180k170k043k257k955l110j659Q24K627K913K334
$$ 397257 394237 391656 389428 387248 385078 383035 380778 377823 374713 373054 373878 376505 379418 381752
60699C81752J730J244Q20N95N58N69Q66J836L152L894L745L318L111K936K702
$$ 381752 383482 384726 385546 386141 386699 387268 388134 389970 393122 397016 400761 404079 407190 410126 412828
60684D12828K853L540M008L552K542J874J759J664J284J009J426K587L805M123
$$ 412828 415681 419221 423229 426781 429323 431197 432956 434620 435904 436913 438339 440926 444731 448854
60670D48854L259K079J706K159K380J767R44O78P53N95M21R10J947K572K263J564
$$ 448854 452113 454192 455898 458057 460437 462204 463148 463826 464579 465174 465595 466505 468452 471024 473287 474851
60654D74851J149Q77J14j315k897m023m480m440m226m210m625n204n222m282l072
$$ 474851 476000 476877 476991 475676 472779 468756 464276 459836 455610 451400 446775 441571 436349 432067 428995
60639D28995k859l939n084m930l562k158j382q93m36m41j167j961j976j265o88
$$ 428995 426136 422197 417113 412183 408621 406463 405081 404188 403752 403311 402144 400183 398207 396942 396254
60624C96254q35j554k320k743k686k259j739j320q89k97K10R3p60j630j588n37
$$ 396254 395419 393865 391545 388802 386116 383857 382118 380798 379909 379612 379822 379915 379155 377525 375937 375400
60608C75400O23J036Q04O15P78J114J656K666L823M130L149J738J001R38Q05L71
$$ 375400 376023 377059 377863 378478 379256 380370 382026 384692 388515 392645 395794 397532 398533 399471 400276 400647
60592D00647K5o0j36k77k71m3L24Q98J606J832J082n1l93L34J273J675J585J273
$$ 400647 400672 400612 400476 400199 399928 399885 400209 401107 402713 404545 405627 405576 405183 405517 406790 408465 410050 411323
60574D11323Q72P35J277K203K683K501K231K081J523M64k27K1N47M94N3r6R5K71
$$ 411323 412195 412930 414207 416410 419093 421594 423825 425906 427429 427893 427666 427687 428234 428728 428781 428685 428780 429051
60556D29051N62J380K614L803M797N677O332O814P763R726J2222J4279J5756J7494
$$ 429051 429613 430993 433607 437410 442207 447884 454216 461030 468793 478519 490741 505020 520776 538270
60542E38270K0120K3479K7273L1593L6513M1663M6521N0851N4619N7631N9302
$$ 538270 558390 581869 609142 640735 677248 718911 765432 816283 870902 928533 987835
60531I87835N8647N4503M6061L3461J7923J233j4961k9464m1314m9522n3338n2975
$$ 987835 1046482 1100985 1147046 1180507 1198430 1199663 1184702 1155238 1113924 1064402 1011064 958089
60519I58089m9759m5250m0245l4927k9639k4946k0938j7008j2506p368k079K576
$$ 958089 908330 863080 822835 787908 758269 733323 712385 695377 682871 675503 673424 676000
60507F76000O023Q562J1432J5620K0798K6067L1367L7206M3251M8435N2476N5822
$$ 676000 682023 690585 702017 717637 738435 764502 795869 833075 876326 924761 977237 1033059
60495A033059N7783N6233M9969M0153K8592J5867K286j0462k0031k5286k6335
$$ 1033059 1090842 1147075 1197044 1237197 1265789 1281656 1283942 1273480 1253449 1228163 1201828
60484A201828k3358j6747p913J488J1095K1623L3207M4909N5615O4373O9954P1057
$$ 1201828 1178470 1161723 1153810 1155298 1166393 1188016 1221223 1266132 1321747 1386120 1456074 1527131
60472A527131O6971N7372M1836K0606m228k9358n2143p1189q5455r4036r7027
$$ 1527131 1594102 1651474 1693310 1713916 1709688 1680330 1628187 1556998 1471543 1377507 1280480
60461A280480r5528r0587q2971p3949o5191n7458n0285m3322l7160l2443k8919
$$ 1280480 1184952 1094365 1011394 937445 872254 814796 764511 721189 684029 651586 622667
60450F22667k5856k2851j9843j6804j3865j1340r309p489n620l718j904l93M52
$$ 622667 596811 573960 554117 537313 523448 512108 502799 495310 489690 485972 484068 483675 484127
60437D84127N35L75M84N72J45l52QR72J078l73k320l396l460l108k588j953j594
$$ 484127 484662 485037 485521 486093 486238 485886 485894 486866 487944 487571 485251 481855 478395 475287 472699 470746 469152
60420D69152j701j690r53J82J031J730L002M844O331O839O729O687O914P298P908
$$ 469152 467451 465761 464808 464990 466021 467751 470753 475597 481928 488767 495496 502183 509097 516395 524303
60405E24303Q847R878J0638J1277J2446J4371J6192J6661J5571J4058J3294J3281
$$ 524303 533150 543028 553666 564943 577389 591760 607952 624613 640184 654242 667536 680817
60393F80817J3201J2586J1553J0172Q269N919L668K091J420J570K176K674K684
$$ 680817 694018 706604 718157 728329 736598 742517 746185 748276 749696 751266 753442 756116 758800
60380G58800K315J793R94k45j588k540l101l532l640l115k371k210k589k632k026
$$ 758800 761115 762908 763902 763657 762069 759529 756428 752896 749256 746141 743770 741560 738971 736339 734313
60365G34313j440j303j082l30L66J47r01j917k295k055j575j274j280j173n09
$$ 734313 732873 731570 730488 730158 730524 730671 729770 727853 725558 723503 721928 720654 719374 718201 717692
60350G17692K95K72o48j378j260j083j839l235m347n101n991o753o524n292m160
$$ 717692 717987 718259 717611 716233 714973 713890 712051 708816 704469 699368 693377 686624 680100 674808 670648
60335F70648l932m218m174l525k661k152k401l344m345m685m279l621l142k951
$$ 670648 666716 662498 658324 654799 652138 649986 647585 644241 639896 635211 630932 627311 624169 621218
60321F21218l161l944n183o417p235p487p134o283n382m854m471l537j858q7J122
$$ 621218 618057 614113 608930 602513 595278 587791 580657 574374 568992 564138 559667 556130 554272 554185 555307
60306E55307J890K714L647M370M865N561O794Q421R990J1018J1041R734P272M383
$$ 555307 557197 559911 563558 567928 572793 578354 585148 593569 603559 614577 625618 635352 642624 647007
60292F47007J724q01l775p269j0337j1810j1433r951q137o140l891j712j62O42
$$ 647007 648731 647930 644155 636886 626549 614739 603306 593355 585218 579078 575187 573475 573313 573955
60278E73955J132J725K379K832L089L537M511N954P476Q733R678J0433J1063J1545
$$ 573955 575087 576812 579191 582023 585112 588649 593160 599114 606590 615323 625001 635434 646497 658042
60264F58042J1907J2321J2978J3975J5212J6448J7365J7711J7381J6486J5358
$$ 658042 669949 682270 695248 709223 724435 740883 758248 775959 793340 809826 825184
60253H25184J4340J3378J2004J0080Q498Q579J0546J3038J4606J5315J6403J8609
$$ 825184 839524 852902 864906 874986 883484 892063 902609 915647 930253 945568 961971 980580
60241I80580K1476K4284K6977L0006L3661L7842M2162M6122M9392N2162N5053
$$ 980580 1002056 1026340 1053317 1083323 1116984 1154826 1196988 1243110 1292502 1344664 1399717
60230A399717N8614O2954O7734P2253P5657P7461P7977P7994P7855P7068P4846
$$ 1399717 1458331 1521285 1589019 1661272 1736929 1814390 1892367 1970361 2048216 2125284 2200130
60219B200130P0868O5502N9453N3232M6781L9669L1736K3358J5032P011l60o414
$$ 2200130 2270998 2336500 2395953 2449185 2495966 2535635 2567371 2590729 2605761 2612772 2612412 2605998
60207B605998j0810j4148j7206j9785k0968k0444j8750j6181j2401p376j821L792
$$ 2605998 2595188 2581040 2563834 2544049 2523081 2502637 2483887 2467706 2455305 2447929 2446108 2449900
60195B449900R987J7458K5991L4695M2907N0397N7054O2904O8128P2570P5417
$$ 2449900 2459887 2477345 2503336 2538031 2580938 2631335 2688389 2751293 2819421 2891991 2967408
60184B967408P5808P3532O8754O1353N1210L9032K6283J4072K396r441k1859l4597
$$ 2967408 3043216 3116748 3185502 3246855 3298065 3337097 3363380 3377452 3379848 3370407 3348548 3313951
60172C313951m6998n8459o8500p6596q2218q5169q5610q3578p8787p1362o2508
$$ 3313951 3266953 3208494 3139994 3063398 2981180 2896011 2810401 2726823 2648036 2576674 2514166
60161B514166n3690m5198l6164k6111j5819o329K176J0077J7325K3283K7307K9083
$$ 2514166 2460476 2415278 2379114 2353003 2337184 2330855 2333031 2343108 2360433 2383716 2411023 2440106
60149B440106K8668K6453K2900J8117J2017M994k061q679j5172k1624k7087l0376
$$ 2440106 2468774 2495227 2518127 2536244 2548261 2553255 2551194 2542515 2527343 2505719 2478632 2448256
60137B448256l1364l0863k9390k6683k2342j6408r270j397O778J5026K3484L2484
$$ 2448256 2416892 2386029 2356639 2329956 2307614 2291206 2281936 2280539 2287317 2302343 2325827 2358311
60125B358311M2291N3120O5140P8209R1739J05212J18675J32453J46448J59993
$$ 2358311 2400602 2453722 2518862 2597071 2688810 2794022 2912697 3045150 3191598 3351591
60115C351591J72317J82856J91086J96350J97997J95773J89996J81234J69624
$$ 3351591 3523908 3706764 3897850 4094200 4292197 4487970 4677966 4859200 5028824
60106E028824J54669J36010J14204R0327O4926L8003J0077j7565m3912o8866r2377
$$ 5028824 5183493 5319503 5433707 5524034 5588960 5626963 5637040 5619475 5575563 5506697 5414320
60095E414320j13627j31604j46024j57002j64231j67221j66090j61481j53897
$$ 5414320 5300693 5169089 5023065 4866063 4701832 4534611 4368521 4207040 4053143
60086D053143j43653j31390j17913j03575q8341p2481n6629m1086k5560r882N376
$$ 4053143 3909490 3778100 3660187 3556612 3468271 3395790 3339161 3298075 3272515 3262633 3268009
60075C268009J9201L0953M0654M8518N4315N7341N7068N3650M7560L9008K8191
$$ 3268009 3287210 3318163 3358817 3407335 3461650 3518991 3576059 3629709 3677269 3716277 3744468
60064C744468J5953L483q827k1493l4598m6975n7280o5441p2465p9140q5325r0233
$$ 3744468 3760421 3763904 3755077 3733584 3698986 3652011 3594731 3529290 3456825 3377685 3292360 3202127
60052C202127r2950r2992r0736q7094q2460p6415o8709n9988n1015m1699l1504
$$ 3202127 3109177 3016185 2925449 2838355 2755895 2679480 2610771 2550783 2499768 2458069 2426565
60041B426565k0421q852L012J5019K6606L7289M7329N7132O6161P3260P7874Q0228
$$ 2426565 2406144 2397292 2400304 2415323 2441929 2479218 2526547 2583679 2649840 2723100 2800974 2881202
60029B881202Q0426P8160P3346O6274N7173M6265L4286K2133R897l057j6856l0607
$$ 2881202 2961628 3039788 3113134 3179408 3236581 3282846 3317132 3339265 3349162 3346105 3329249 3298642
60017C298642m3342n4813o5070p3838q0609q4996q6603q5058q0453p3638o5702
$$ 3298642 3255300 3200487 3135417 3061579 2980970 2895974 2809371 2724313 2643860 2570222 2504520
60006B504520n7277m8424l9015k9076j8826q445K154J3201K4659L6132M7248N7848
$$ 2504520 2447243 2398819 2359804 2330728 2311902 2303457 2305611 2318812 2343471 2379603 2426851 2484699
59994B484699O7769P6861Q5434R4103J02729J10044J14770J16637J15724J11395
$$ 2484699 2552468 2629329 2714763 2808866 2911595 3021639 3136409 3253046 3368770 3480165
59984C480165J02894R0687P6296O0870M4675K7808J0598o751k4083m0798n6103
$$ 3480165 3583059 3673746 3750042 3810912 3855587 3883395 3893993 3887242 3863159 3822361 3766258
59973C766258o9722q1643r1288r7674j00411r9698r5488q7659p7095o5515n3822
$$ 3766258 3696536 3614893 3523605 3425931 3325520 3225822 3130334 3042675 2965580 2900065 2846243
59962B846243m1564k8373j4995k421R170K0100L0537M0618N0515N9751O7160P2067
$$ 2846243 2804679 2776306 2761311 2758890 2768060 2788160 2818697 2859315 2909830 2969581 3036741 3108808
59950C108808P4935P6296P5809P3113O8931O4194N8555N0939M1536L2145K4263
$$ 3108808 3183743 3260039 3335848 3408961 3477892 3542086 3600641 3651580 3693116 3725261 3749524
59939C749524J7677J1379N170j83m069o536p661o847l085M155J4509K7153M1453
$$ 3749524 3767201 3778580 3783750 3783567 3779498 3772962 3765301 3758454 3755369 3759524 3774033 3801186 3842639
59926C842639N7018P3423R0213J07254J24725J42647J60384J76730J90437K00725
$$ 3842639 3899657 3973080 4063293 4170547 4295272 4437919 4598303 4775033 4965470 5166195
59916E166195K07283K09582K06243J95530J76660J50376J18011Q0541L9099m047
$$ 5166195 5373478 5583060 5789303 5984833 6161493 6311869 6429880 6510421 6549520 6545473
59906F545473m5880q3944j16779j43319j62735j74891j80276j79302j72398j60824
$$ 6545473 6499593 6415649 6298870 6155551 5992816 5817925 5637649 5458347 5285949 5125125
59896E125125j46527j30803j13652r4845p4952n4889l4929j4810N477K5470M4726
$$ 5125125 4978598 4847795 4734143 4639298 4564346 4509457 4474528 4459718 4465195 4490665 4535391
59885D535391O3212Q1248R9127J16536J32239J44523J51908J53172J46949J32237
$$ 4535391 4598603 4679851 4778978 4895514 5027753 5172276 5324184 5477356 5624305 5756542
59875E756542J09670Q1677N0903J8827j3711m5229p3646r7532j16829j32281j44498
$$ 5756542 5866212 5947889 5998792 6017619 6003908 5958679 5885033 5787501 5670672 5538391 5393893
59864E393893j53582j59374j61816j61116j57564j51329j42472j31131j17560
$$ 5393893 5240311 5080937 4919121 4758005 4600441 4449112 4306640 4175509 4057949
59855D057949j02207q5856o9438n3293l6933j9923k895J2915K6995L9802N1702
$$ 4057949 3955742 3869886 3800448 3747155 3710222 3690299 3687404 3700319 3727314 3767116 3818818
59844C818818O2258P0756P6809Q0347Q1419Q0180P6531O9754N9077M4736K7904
$$ 3818818 3881076 3951832 4028641 4108988 4190407 4270587 4347118 4416872 4475949 4520685 4548589
59833D548589R468j0311l0700m9816o5581p6941q3781q6412q5728q3445q1348
$$ 4548589 4558057 4547746 4517046 4467230 4401649 4324708 4240927 4154515 4068787 3985342 3903994
59822C903994q0241p9893p9719p9262p8236p6485p3894p0240o5438n9904n4389
$$ 3903994 3823753 3743860 3664141 3584879 3506643 3430158 3356264 3286024 3220586 3160682 3106293
59811C106293m9353m4972m1602l9637l8743l8044l7286l6997l7122l6407l3765
$$ 3106293 3056940 3011968 2970366 2930729 2891986 2853942 2816656 2779659 2742537 2706130 2672365
59800B672365k9534k4518j8499j0663j112R123J9502L0525M2790N6293P0879Q6734
$$ 2672365 2642831 2618313 2599814 2589151 2588039 2597162 2616664 2647189 2689979 2746272 2817151 2903885
59788B903885J04062J22672J42059J61606J80434J97084K09268K13759K06665
$$ 2903885 3007947 3130619 3272678 3434284 3614718 3811802 4021070 4234829 4441494
59779D441494J84466J45622R1896K8663l6200r4549j40306j70724j86240j89515
$$ 4441494 4625960 4771582 4863478 4892141 4855941 4761392 4621086 4450362 4264122 4074607
59769D074607j84057j72808j57469j39187j19600j00578q3036o6771n1716l8515
$$ 4074607 3890550 3717742 3560273 3421086 3301486 3200908 3117872 3051101 2999385 2960870
59759B960870k7540j8140r490j563N433J1993J8857K5892L2343L8076M3810N0058
$$ 2960870 2933330 2915190 2905700 2904137 2909570 2921563 2940420 2966312 2998655 3036731 3080541 3130599
59747C130599N6570O3108P0182P8610Q8586R9533J10834J22527J35192J49217
$$ 3130599 3187169 3250277 3320459 3399069 3487655 3587188 3698022 3820549 3955741 4104958
59737D104958J64299J79849J95707K12236K29785K48314K67398K86153L03168
$$ 4104958 4269257 4449106 4644813 4857049 5086834 5335148 5602546 5888699 6191867
59728F191867L17048L27053L32700L32808L25725L10995K90179K65800K40067
$$ 6191867 6508915 6835968 7168668 7501476 7827201 8138196 8428375 8694175 8934242
59719H934242K14958J92814J75962J65838J62711J65772J73200J82696J92505
$$ 8934242 9149200 9342014 9517976 9683814 9846525 10012297 10185497 10368193 10560698
59710A0560698K01586K08568K11278K08122J99354J86172J69017J47593J22386
$$ 10560698 10762284 10970852 11182130 11390252 11589606 11775778 11944795 12092388 12214774
59701A2214774R5197O8107M2538J9353p17j6834k7838l2419k9896k0794o185J3411
$$ 12214774 12309971 12378078 12420616 12439969 12439252 12422418 12394580 12362161 12332265 12311471 12305286 12318697
59689A2318697L8046O7548J01218J38197J77509K17908K58180K97578L35369L70048
$$ 12318697 12356743 12424291 12525509 12663706 12841215 13059123 13317303 13614881 13950250 14320298
59679A4320298L99501M21909M35812M39304M29875M05340L64494L06928K33062
$$ 14320298 14719799 15141708 15577520 16016824 16446699 16852039 17216533 17523461 17756523
59670A7756523J44959M6687n6471j59051k55592l40632m09614m60196m92439n07724
$$ 17756523 17901482 17948169 17891698 17732647 17477055 17136423 16726809 16266613 15774174 15266450
59660A5266450n07891m95683m75549m53389m35169m25729m28255m43488m68533
$$ 15266450 14758559 14262876 13787327 13333938 12898769 12473040 12044785 11601297 11132764
59651A1132764m96797n20394n33502n33949n22511n01611m74441m44068m12555
$$ 11132764 10635967 10115573 9582071 9048122 8525611 8024000 7549559 7105491 6692936
59642F692936l80942l50044l20655k93047k67020k42682k20538k00661j82417
$$ 6692936 6311994 5961950 5641295 5348248 5081228 4838546 4618008 4417347 4234930
59633D234930j65282j49191j33827j18515j03317q9387p7586o7395n7941m9415
$$ 4234930 4069648 3920457 3786630 3668115 3564798 3475411 3397825 3330430 3272489 3223074
59623C223074m2646l7780l4257l1777l0438l0085l0212l0456l0715l0994l1549
$$ 3223074 3180428 3142648 3108391 3076614 3046176 3016091 2985879 2955423 2924708 2893714 2862165
59612B862165l2875l5030l7352l9273m0998m2820m4185m4208m2790m0648l8448
$$ 2862165 2829290 2794260 2756908 2717635 2676637 2633817 2589632 2545424 2502634 2461986 2423538
59601B423538l6368l4249l1685k8397k4991k2807k2364k2499k1704j9793j7441
$$ 2423538 2387170 2352921 2321236 2292839 2267848 2245041 2222677 2200178 2178474 2158681 2141240
59590B141240j4716j1176p104l504q34J413L869O717R799J2699J4846J6243J7718
$$ 2141240 2126524 2115348 2108244 2104740 2103906 2105319 2109188 2115905 2125704 2138403 2153249 2169492 2187210
59577B187210J9881K2297K4464K7004L0736L5037L8640M1804M6216N2505N9313
$$ 2187210 2207091 2229388 2253852 2280856 2311592 2346629 2385269 2427073 2473289 2525794 2585107
59566B585107O5246P0475P5812Q1287Q6477R1492R6781J02438J08247J14101J19897
$$ 2585107 2650353 2720828 2796640 2877927 2964404 3055896 3152677 3255115 3363362 3477463 3597360
59555C597360J25206J29484J32411J33901J34013J32919J30717J27152J21569
$$ 3597360 3722566 3852050 3984461 4118362 4252375 4385294 4516011 4643163 4764732
59546D764732J12980J00081Q1776N8485L2754P933j3872l2289m7731o0708p1848
$$ 4764732 4877712 4977793 5059569 5118054 5150808 5158741 5144869 5112580 5064849 5004141 4932293
59535D932293q1643q9989r6460j00864j02993j02167r7851r0480q0833o8894n4238
$$ 4932293 4850650 4760661 4664201 4563337 4460344 4358177 4260326 4169846 4089013 4020119 3965881
59524C965881l7375j9545j197J8230L8964O0311Q1600J02635J22888J41181J56364
$$ 3965881 3928506 3908961 3907764 3925994 3964958 4025269 4106869 4209504 4332392 4473573 4629937
59513D629937J67522J73345J72239J63431J47160J23728R3394N7383J7949k2924
$$ 4629937 4797459 4970804 5143043 5306474 5453634 5577362 5670756 5728139 5746088 5723164
59503E723164o3877j02937j37224j64612j84830j98362k05085k04822j98349j87135
$$ 5723164 5659287 5556350 5419126 5254514 5069684 4871322 4666237 4461415 4263066 4075931
59493D075931j72536j55815j38250j20471j02198q3314o4649m7205l0974j5185
$$ 4075931 3903395 3747580 3609330 3488859 3386661 3303347 3238698 3191493 3160519 3145334
59483C145334O31J6283L1283M5146N7627O8906P9153Q7762R3620R6267R6124R3328
$$ 3145334 3145965 3162248 3193531 3238677 3296304 3365210 3444363 3532125 3625745 3722012 3818136 3911464
59471C911464Q7181P7144O3536M6811K7051M843j8172m0553o2159q3121j02232
$$ 3911464 3998645 4075789 4139325 4186136 4213187 4218030 4199858 4159305 4097146 4014025 3911793
59460C911793j17518j28155j34936j38933j40554j39896j37220j32855j27132
$$ 3911793 3794275 3666120 3531184 3392251 3251697 3111801 2974581 2841726 2714594
59451B714594j20583j13805j07044j00143r2960q5636p8440p1593o5186n9182
$$ 2714594 2594011 2480206 2373162 2273019 2180059 2094423 2015983 1944390 1879204 1820022
59441A820022n3496m8067m2753l7303l1745k6659k2645j9493j6367j2778q921
$$ 1820022 1766526 1718459 1675706 1638403 1606658 1579999 1557354 1537861 1521494 1508716 1499795
59430A499795n054j150K670N959Q481J0579J2805J5374J7891J9117J7357J1997
$$ 1499795 1494741 1493591 1496261 1502220 1510701 1521280 1534085 1549459 1567350 1586467 1603824 1615821
59418A615821M845q73l165k363L15M243R098J4240J9050K3182K5891K5873K2635
$$ 1615821 1620666 1619793 1616628 1614265 1614580 1618823 1627921 1642161 1661211 1684393 1710284 1736157 1758792
59405A758792J7630J3416J1906J3601J7876K3489K9297L5057M1228M7803N4011
$$ 1758792 1776422 1789838 1801744 1815345 1833221 1856710 1886007 1921064 1962292 2010095 2064106
59394B064106N9501O5096P1765P9367Q7023R4278J01407J08878J16967J25526
$$ 2064106 2123607 2188703 2260468 2339835 2426858 2521136 2622543 2731421 2848388 2973914
59384B973914J33797J40919J46806J52202J57797J64062J72028J83149J97969
$$ 2973914 3107711 3248630 3395436 3547638 3705435 3869497 4041525 4224674 4422643
59375D422643K15743K35750K57836K81034L02893L21144L35142L44727L48674
$$ 4422643 4638386 4874136 5131972 5413006 5715899 6037043 6372185 6716912 7065586
59366G065586L45493L35127L18702K97316K72237K45618K19357J93508J67051
$$ 7065586 7411079 7746206 8064908 8362224 8634461 8880079 9099436 9292944 9459995
59357I459995J39960J13106Q6081N6698K2941j5656n8765j06035j56396k07480
$$ 9459995 9599955 9713061 9799142 9855840 9878781 9863125 9804360 9698325 9541929 9334449
59347I334449k56520l01393l40373l71432l92569m02810m02640l93507l77083
$$ 9334449 9077929 8776536 8436163 8064731 7672162 7269352 6866712 6473205 6096122
59338F096122l54973l29019l01571k75002k50639k28555k08572j91072j76471
$$ 6096122 5741149 5412130 5110559 4835557 4584918 4356363 4147791 3956719 3780248
59329C780248j64377j53925j44623j36263j28225j19673j10510j01508r3362q5955
$$ 3780248 3615871 3461946 3317323 3181060 3052835 2933162 2822652 2721144 2627782 2541827
59319B541827p8803p1792o5279n9624n4753n0348m6286m2681l9296l5288l0132
$$ 2541827 2463024 2391232 2325953 2266329 2211576 2161228 2114942 2072261 2032965 1997677 1967545
59308A967545k4565j9854j6149j2375p783k694K542Q212J4366K0320K5739L1288
$$ 1967545 1942980 1923126 1906977 1894602 1886819 1884125 1886667 1894879 1909245 1929565 1955304 1986592
59296A986592L7384M3023M6684M7652M5834M1261L5040K9966K8686L1394L6216
$$ 1986592 2023976 2066999 2113683 2161335 2207169 2248430 2283470 2313436 2342122 2373516 2409732
59285B409732M1504M6653N1092N3881N4424N2638M8418M1747L3162K3230J1751
$$ 2409732 2451236 2497889 2548981 2602862 2657286 2709924 2758342 2800089 2833251 2856481 2868232
59274B868232j516j5548k8535l9639m9227n7501o3975o8425p1256p2666p2531
$$ 2868232 2866716 2851168 2822633 2782994 2733767 2676266 2612291 2543866 2472610 2399944 2327413
59263B327413p1221o9611o7882o5224o1186n6426n1792m7355m2858l8461l4422
$$ 2327413 2256192 2186581 2118699 2053475 1992289 1935863 1884071 1836716 1793858 1755397 1720975
59252A720975l0591k6660k2579j8379j3954r359m969j027K590O024R206J2252
$$ 1720975 1690384 1663724 1641145 1622766 1608812 1599453 1594484 1593457 1596047 1602071 1611277 1623529
59240A623529J5665J9791K4276K8406L1900L5236L9152M4022M9664N5806O2552
$$ 1623529 1639194 1658985 1683261 1711667 1743567 1778803 1817955 1861977 1911641 1967447 2029999
59229B029999P0222P8740Q7654R6859J06895J18190J30512J43565J57593J72785
$$ 2029999 2100221 2178961 2266615 2363474 2470369 2588559 2719071 2862636 3020229 3193014
59219C193014J88394K03145K16209K27152K35015K38233K35417K25730K08555
$$ 3193014 3381408 3584553 3800762 4027914 4262929 4501162 4736579 4962309 5170864
59210E170864J83433J50547J10927O6254J8618k9838p7434j22835j64050j98092
$$ 5170864 5354297 5504844 5615771 5682025 5700643 5670805 5593371 5470536 5306486 5108394
59200E108394k22435k36727k42487k41421k34615k23108k08219j91160j72918
$$ 5108394 4885959 4649232 4406745 4165324 3930709 3707601 3499382 3308222 3135304
59191C135304j54513j36885j20436j05166r1122p8252o6035n3921m2132l1449
$$ 3135304 2980791 2843906 2723470 2618304 2527182 2448930 2382895 2328974 2286842 2255393
59181B255393k2220j4080o643J2N524R513J1679J1850R915N588j361j0440k0447
$$ 2255393 2233173 2219093 2212450 2212462 2217986 2227499 2239178 2251028 2260943 2266531 2265170 2254730 2234283
59168B234283l0487m0287m9298n6320o0654o2870o3650o2751o0010n6544n3679
$$ 2234283 2203796 2163509 2114211 2057891 1997237 1934367 1870717 1807966 1747956 1691412 1637733
59157A637733n1237m8068m3835l9081l4075k8950k4600k1910k0248j8126j5229
$$ 1637733 1586496 1538428 1494593 1455512 1421437 1392487 1367887 1345977 1325729 1307603 1292374
59146A292374j2386r740o532k794L73K499M317O251P818Q854R956J1135J1449
$$ 1292374 1279988 1270248 1263716 1260922 1261295 1263794 1268111 1274362 1282180 1291034 1300990 1312125 1323574
59133A323574J0566R444Q763P941O459N029M541M813N239N790O484O766O380O160
$$ 1323574 1334140 1343584 1352347 1360288 1366747 1371776 1376317 1381130 1386369 1392159 1398643 1405409 1411789 1417949
59119A417949P035Q767J0492J1925J3267J4445J5276J6014J7031J8170J9077J9825
$$ 1417949 1424984 1433751 1444243 1456168 1469435 1483880 1499156 1515170 1532201 1550371 1569448 1589273
59107A589273K0637K1321K1550K1522K1761K2441K3308K4186K5203K6648K8784
$$ 1589273 1609910 1631231 1652781 1674303 1696064 1718505 1741813 1765999 1791202 1817850 1846634
59096A846634L1667L5034L8557M2147M5680M8558N0123N0556N0696N0796N0030
$$ 1846634 1878301 1913335 1951892 1994039 2039719 2088277 2138400 2188956 2239652 2290448 2340478
59085B340478M7392M2476L5248K5760J4527K578r205k0530l1259m1127m9977n7700
$$ 2340478 2387870 2430346 2465594 2491354 2505881 2508459 2499254 2478724 2447465 2406338 2356361 2298661
59073B298661o3769o7449o8747o8547o7578o5854o3330o0357n7159n3517m9472
$$ 2298661 2234892 2167443 2098696 2030149 1962571 1896717 1833387 1773030 1715871 1662354 1612882
59062A612882m5711m2852m0728l8755l6592l4181l1607k9164k7114k5164k2673
$$ 1612882 1567171 1524319 1483591 1444836 1408244 1374063 1342456 1313292 1286178 1261014 1238341
59051A238341j9609j6766j4807j3607j2728j1958j1273j0777j0869j1801j3015
$$ 1238341 1218732 1201966 1187159 1173552 1160824 1148866 1137593 1126816 1115947 1104146 1091131
59040A091131j3560j3289j2841j2321j0960q443n670l671k446j354N9J919M073
$$ 1091131 1077571 1064282 1051441 1039120 1028160 1019717 1014047 1010376 1007930 1006576 1006635 1008554 1012627
59027A012627N823O365N937N768O506P438P771P876Q558R830J1233J2751J4655
$$ 1012627 1018450 1024815 1030752 1036520 1043026 1050464 1058235 1066111 1074669 1084499 1095732 1108483 1123138
59014A123138J6734J8429J9634K0808K2522K5085K8375L1795L4817L7761M1469
$$ 1123138 1139872 1158301 1177935 1198743 1221265 1246350 1274725 1306520 1341337 1379098 1420567
59003A420567M6019N0388N3714N6082N7626N7653N5423N1260M5958L9397L0609
$$ 1420567 1466586 1516974 1570688 1626770 1684396 1742049 1797472 1848732 1894690 1934087 1964696
58992A964696J9380P141l989j2876j9919k6012l1263l5056l7185l8223l8457l7408
$$ 1964696 1984076 1991217 1987228 1974352 1954433 1928421 1897158 1862102 1824917 1786694 1748237 1710829
58980A710829l5109l3017l2431l2604l1741k9534k7240k5451k3390k0575j7435
$$ 1710829 1675720 1642703 1610272 1577668 1545927 1516393 1489153 1463702 1440312 1419737 1402302
58969A402302j4059r952n517k099J52K805O643J0123J1510J1173J0592J0169R407
$$ 1402302 1388243 1378291 1372774 1370675 1370827 1373632 1380275 1390398 1401908 1413081 1423673 1433842 1443249
58956A443249Q396P774P760Q232R297J0892J2419J3583J5011J7302K0089K2720
$$ 1443249 1451645 1459419 1467179 1475411 1484708 1495600 1508019 1521602 1536613 1553915 1574004 1596724
58944A596724K5127K7435K9563L1873L5279L9906M4629M8841N3594N9922O6978
$$ 1596724 1621851 1649286 1678849 1710722 1746001 1785907 1830536 1879377 1932971 1992893 2059871
58933B059871P2930P6825P8330P6725P1605O4003N5484M6738L8338L2093K9931
$$ 2059871 2132801 2209626 2287956 2364681 2436286 2500289 2555773 2602511 2640849 2672942 2702873
58922B702873L1782L6014M1691M8991N7693O6834P5909Q5140R4492J03723J13440
$$ 2702873 2734655 2770669 2812360 2861351 2919044 2985878 3061787 3146927 3241419 3345142 3458582
58911C458582J24835J38102J52140J66004J79737J93627K07638K21749K35898
$$ 3458582 3583417 3721519 3873659 4039663 4219400 4413027 4620665 4842414 5078312
58902E078312K49226K60174K67641K71560K72172K69378K63181K54335K44077
$$ 5078312 5327538 5587712 5855353 6126913 6399085 6668463 6931644 7185979 7430056
58893G430056K33296K21787K08249J91046J69167J42369J10701P4576L5442m541
$$ 7430056 7663352 7885139 8093388 8284434 8453601 8595970 8706671 8781247 8816689 8812148
58883H812148m3966q2621j20129j55024j85851k12294k34403k51518k63045k69734
$$ 8812148 8768182 8685561 8565432 8410408 8224557 8012263 7777860 7526342 7263297 6993563
58873F993563k73102k73887k71951k67370k60697k52410k42816k32359k21353
$$ 6993563 6720461 6446574 6174623 5907253 5646556 5394146 5151330 4918971 4697618
58864D697618k09791j97863j86154j74842j63379j51674j40699j31153j22278
$$ 4697618 4487827 4289964 4103810 3928968 3765589 3613915 3473216 3342063 3219785
58855C219785j12972j03353r4158q5421p6887o9053o2462n6492n0208m3953l8693
$$ 3219785 3106813 3003460 2909302 2823881 2746994 2677941 2615479 2558987 2508779 2464826 2426133
58844B426133l4149k9058k3199j7728j3447r957o597l072Q73N415J0103J4235
$$ 2426133 2391984 2362926 2339727 2321999 2308552 2298595 2291998 2288926 2289799 2295214 2305317 2319552
58832B319552J7803K1325K4962K8736L3257L9043M5190M9976N2973N5482N8682
$$ 2319552 2337355 2358680 2383642 2412378 2445635 2484678 2529868 2579844 2632817 2688299 2746981
58821B746981O2269O5246O7288O9010P1448P5456Q1149Q7937R5379J03831J13817
$$ 2746981 2809250 2874496 2941784 3010794 3082242 3157698 3238847 3326784 3422163 3525994 3639811
58810C639811J25223J37553J50650J64551J79107J94224K09936K25552K39538
$$ 3639811 3765034 3902587 4053237 4217788 4396895 4591119 4801055 5026607 5266145
58801E266145K50973K60438K68591K74633K77178K75671K69670K57650K38159
$$ 5266145 5517118 5777556 6046147 6320780 6597958 6873629 7143299 7400949 7639108
58792G639108K11830J80700J45897J07298O5229K1084k3511o6819j06642j41241
$$ 7639108 7850938 8031638 8177535 8284833 8350062 8371146 8347635 8280816 8174174 8032933
58782H032933j70509j95060k14591k28629k38544k47100k56014k65137k73610
$$ 8032933 7862424 7667364 7452773 7224144 6985600 6738500 6482486 6217349 5943739
58773E943739k80054k82036k77445k66867k53077k38048k22032k05442j89587
$$ 5943739 5663685 5381649 5104204 4837337 4584260 4346212 4124180 3918738 3729151
58764C729151j75061j61235j47952j36120j25958j16298j06362r6865q8527q0803
$$ 3729151 3554090 3392855 3244903 3108783 2982825 2866527 2760165 2663300 2574773 2493970
58754B493970p2908o4973n7460n0474m4268l9361l5398l1032k5669k0320j5942
$$ 2493970 2421062 2356089 2298629 2248155 2203887 2164526 2129128 2098096 2072427 2052107 2036165
58743B036165j1936p225k012K541N926Q721J1700J5038J8133J9766J8609J3887
$$ 2036165 2024229 2017004 2014992 2017533 2023459 2032180 2043880 2058918 2077051 2096817 2115426 2129313
58731B129313N638n290j7157k7700l5515m0942m5030m7942m9251m9287m9011m8728
$$ 2129313 2134951 2129661 2112504 2084804 2049289 2008347 1963317 1915375 1866124 1816837 1767826 1719098
58719A719098m8079m7124m6226m4980m2551l9046l5301l1405k6734k1423j6257
$$ 1719098 1671019 1623895 1577669 1532689 1490138 1451092 1415791 1384386 1357652 1336229 1319972
58708A319972j1060m786K399Q701J2705J4371J3561R225R09j0054k1540l1903
$$ 1319972 1308912 1304126 1306525 1315226 1327931 1342302 1355863 1365088 1365997 1355943 1334403 1302500
58696A302500l9852m4383m5541m4372m1633l7450l2389k7580k3300j8741j3683
$$ 1302500 1262648 1218265 1172724 1128352 1086719 1049269 1016880 989300 966000 947259 933576
58685I33576r245o265m219k370r45l20K5R11K485M379O208P632Q731J0449J3706
$$ 933576 924331 918066 913847 911477 910532 910212 910237 911148 913633 918012 924220 931852 940583 951032 964738
58670I64738J7964K1747K4644K7287K9051K7414K0438Q768n370j9725l1964l9798
$$ 964738 982702 1004449 1029093 1056380 1085431 1112845 1133283 1142051 1136681 1116956 1084992 1045194
58658A045194m2575m1968m0049l7399l3740k9426k5209k1233j7232j3300r762
$$ 1045194 1002619 960651 920602 883203 849463 820037 794828 773595 756363 743063 733301
58647G33301o758m367k651j245M29K271L520L902L947M055M144M374N092N909
$$ 733301 726543 722176 719525 718280 718709 720980 724500 728402 732349 736404 740548 744922 750014 755923
58633G55923N975N464N520O420P160P263P636Q970J0654J2017J3420J5289J7204
$$ 755923 761898 767362 772882 779302 786462 793725 801361 810331 820985 833002 846422 861711 878915
58620H78915J8792K0511K2763K5108K7098K9115L1745L5039L8755M2568M5806
$$ 878915 897707 918218 940981 966089 993187 1022302 1054047 1089086 1127841 1170409 1216215
58609A216215M8049N0230N3902N9173O4579O9194P3397P7222P9722Q0550Q0506
$$ 1216215 1264264 1314494 1368396 1427569 1492148 1561342 1634739 1711961 1791683 1872233 1952739
58598A952739P9681P6606P0146O0779M9168L5147J9136L008j1710k5247l8026
$$ 1952739 2032420 2109026 2179172 2239951 2289119 2324266 2343402 2346410 2334700 2309453 2271427
58587B271427m9095n7262o2656o5956o7109o5940o3022n8915n3615m7646m2455
$$ 2271427 2222332 2165070 2102414 2036458 1969349 1903409 1840387 1781472 1727857 1680211 1637756
58576A637756l8716l5409l1655k8146k5689k3694k1460j9676j9198j9433j9427
$$ 1637756 1599040 1563631 1531976 1503830 1478141 1454447 1432987 1413311 1394113 1374680 1355253
58565A355253j9618k0998k3258k5192k6347k7058k7382k7072k6088k4331k1659
$$ 1355253 1335635 1314637 1291379 1266187 1239840 1212782 1185400 1158328 1132240 1107909 1086250
58554A086250j8833j7474j8260k0119k1955k3911k6098k7509k7457k6788k6354
$$ 1086250 1067417 1049943 1031683 1011564 989609 965698 939600 912091 884634 857846 831492
58543H31492k5520k3518k1131j9486j8205j6302j4076j2565j1840j1219j0548
$$ 831492 805972 782454 761323 741837 723632 707330 693254 680689 668849 657630 647082
58532F47082j0006r287q147p102o497n675m143k706k301k537k529k243j900r85
$$ 647082 637076 627789 619642 612540 606043 600368 596225 593519 591218 588681 586152 583909 582009 581024
58518E81024Q83K937M319N371O701P900Q366Q511R058R916J0835J2138J3739J4515
$$ 581024 581907 584844 589163 594534 601235 609135 617501 626012 635070 644986 655821 667959 681698 696213
58504F96213J3850J2650J1678J0119P142L618P70j710m574p133q216q146q113
$$ 696213 710063 722713 734391 744510 751652 755270 756040 754330 749756 742623 734407 726261 718148
58491G18148q317q226p909p669p112n986n117n180n479n283n298o329p552p783
$$ 718148 709831 701605 693696 686027 678915 672929 667812 662632 657153 651870 646572 640243 632691 624908
58477F24908p449p586p845p230o071n499n628n836o150o771p009o204n043m478
$$ 624908 617459 609873 602028 594798 588727 583228 577600 571764 565614 558843 551834 545630 540587 536109
58463E36109m151l303k313j772j041N92K282K801K453K178J698M15q61r35k93
$$ 536109 531958 528655 526342 524570 523529 524121 526403 529204 531657 533835 535533 535948 535087 534152 533859
58448E33859k67q88j281j441j842j979j134J19P47R29J358J712J483J277J718
$$ 533859 533592 532704 531423 529982 528140 526161 525027 525146 525893 526822 528180 529892 531375 532652 534370
58433E34370K005J304N05Q59J855K358K695L617M374L867K808K617L145L508M080
$$ 534370 536375 537679 538184 539043 540898 543256 545951 549568 553942 557809 560617 563234 566379 569887 573967
58418E73967N454O547O073M959M908N497N094L821L107L034K542J676J328J305
$$ 573967 579421 585968 592041 597000 601908 607405 612499 616320 619427 622461 625003 626679 628007 629312
58404F29312R37Q48J896L110L021K241K444L553M298M691N450N928N131M016M138
$$ 629312 630249 631097 632993 636103 639124 641365 643809 647362 651660 656351 661801 667729 672860 676876 681014
58389F81014M811M278K873K281K357J580j6j132j818k943l692k584m98L03k07
$$ 681014 685825 690103 692976 695257 697614 699194 699178 698046 696228 693285 689593 687009 686511 686814 686607
58374F86607m3J312K534L242M239N311N526N432O266P367P136O070N997O848P058
$$ 686607 686564 687876 690410 693652 697891 703202 708728 714160 720426 727793 734929 740999 746996 753844 760902
58359G60902O634O759O980N888M203L950M973N394N160N838P265P651O869O425
$$ 760902 767536 774295 781275 787163 791366 795316 800289 805683 810843 816681 823946 831597 838466 844891
58345H44891O452N805M893N183O282O672O780Q074R775R967R345J0147J1935J2339
$$ 844891 851343 857148 862041 867224 873506 880178 886958 895032 904807 914774 924119 934266 946201 958540
58331I58540J1548J2000J3930J5272J5789J7217J9308K0016J9560K0278K2329
$$ 958540 970088 982088 996018 1011290 1027079 1044296 1063604 1083620 1103180 1123458 1145787
58320A145787K3526K3415K3419K3059K0366J6062J2924J0997P859L702J447J567
$$ 1145787 1169313 1192728 1216147 1239206 1259572 1275634 1288558 1299555 1307414 1311116 1312563 1314130
58308A314130J543Q14J476L662N052N556P600J1125J3204J3387J4528J7408J9377
$$ 1314130 1315673 1316487 1317963 1321625 1326677 1332233 1339833 1350958 1364162 1377549 1392077 1409485 1428862
58295A428862J9306J9108J9549J9296J8922K0854K4489K6383K6095K6764K9180
$$ 1428862 1448168 1467276 1486825 1506121 1525043 1545897 1570386 1596769 1622864 1649628 1678808
58284A678808L0653L0663L1989L5180L7366L7866L9334M2150M3302M2125M1498
$$ 1678808 1709461 1740124 1772113 1807293 1844659 1882525 1921859 1964009 2007311 2049436 2090934
58273B090934M2031M0922L7893L6266L6791L6431L4674L4727L7042L8265L8142
$$ 2090934 2132965 2173887 2211780 2248046 2284837 2321268 2355942 2390669 2427711 2465976 2504118
58262B504118M0620M6178N0131N0760N2038N5978N9406O0887O3618O8636P2309
$$ 2504118 2544738 2590916 2641047 2691807 2743845 2799823 2859229 2920116 2983734 3052370 3124679
58251C124679P3486P6080Q1707Q6878R0269R5359J03029J09196J12718J17878
$$ 3124679 3198165 3274245 3355952 3442830 3533099 3628458 3731487 3840683 3953401 4071279
58241D071279J26022J32941J37550J44612J55457J64910J71134J79509J92720
$$ 4071279 4197301 4330242 4467792 4612404 4767861 4932771 5103905 5283414 5476134
58232E476134K06163K17318K30347K47135K63351K77809K95893L19265L42469
$$ 5476134 5682297 5899615 6129962 6377097 6640448 6918257 7214150 7533415 7875884
58223G875884L64178L90933M24997M60188M94816N36474N88535O44756P03265
$$ 7875884 8240062 8630995 9055992 9516180 10010996 10547470 11136005 11780761 12484026
58214A2484026P72402Q56315R49186J050787J172802J322361J495564J695814
$$ 12484026 13256428 14112743 15061929 16112716 17285518 18607879 20103443 21799257
58206B1799257J942119K251105K629019L089330L655432M333038N101655N947292
$$ 21799257 23741376 25992481 28621500 31710830 35366262 39699300 44800955 50748247
58198E0748247O883155P929322R103831J0452280J2053961J3973981J6235587
$$ 50748247 57631402 65560724 74664555 85116835 97170796 111144777 127380364
58191A27380364J8852214K1830633K5084400K8341712L1108504L2610520L1747254
$$ 127380364 146232578 168063211 193147611 221489323 252597827 285208347 316955601
58184C16955601K7360414J8967973P479386m874951j5535142k2789886k6324635
$$ 316955601 344316015 363283988 370763374 365888423 350353281 327563395 301238760
58177C01238760k6983914k6117988k4897275k3854824k2865542k1550422j9735296
$$ 301238760 274254846 248136858 223239583 199384759 176519217 154968795 135233499
58170A35233499j7567764j5312154j3155759j1197685r497655q068763o870540
$$ 135233499 117665735 102353581 89197822 78000137 68502482 60433719 53563179
58163E3563179n855988n006967m309561l729503l234856k817321k471965k178611
$$ 53563179 47707191 42700224 38390663 34661160 31426304 28608983 26137018 23958407
58155B3958407j920434j700314j522038j372821j239010j122627j028153r47398
$$ 23958407 22037973 20337659 18815621 17442800 16203790 15081163 14053010 13105612
58147A3105612q70471p98863p35799o75653o13915n56445n08571m65245m21223
$$ 13105612 12235141 11436278 10700479 10024826 9410911 8854466 8345895 7880650 7459427
58138G459427l80833l48609l19963k90061k63139k44564k31742k20506k12561
$$ 7459427 7078594 6729985 6410022 6119961 5856822 5612258 5380516 5160010 4947449
58129D947449k09231k05386j96726j86248j77272j67225j54257j42629j35393
$$ 4947449 4738218 4532832 4336106 4149858 3972586 3805361 3651104 3508475 3373082
58120C373082j28679j19205j10453j05588j01100r3594q6277q2581p9592p3951
$$ 3373082 3244403 3125198 3014745 2909157 2808057 2714463 2628186 2545605 2466013 2392062
58110B392062o8379o6216o4971o1241n6925n4830n3056m9219m5516m4189m2612
$$ 2392062 2323683 2257467 2192496 2131255 2074330 2019500 1966444 1917225 1871709 1827520 1784908
58099A784908l8190l3645l2187l1832k9636k7357k7725k8880k7817k5815k5568
$$ 1784908 1746718 1713073 1680886 1649054 1619418 1592061 1564336 1535456 1507639 1481824 1456256
58088A456256k6132k5365k4273k4621k5195k4418k3759k4751k5745k5113k4483
$$ 1456256 1430124 1404759 1380486 1355865 1330670 1306252 1282493 1257742 1231997 1206884 1182401
58077A182401k5329k5736k4033k2207k2257k2620k1615k0802k1419k1204j8498
$$ 1182401 1157072 1131336 1107303 1085096 1062839 1040219 1018604 997802 976383 955179 936681
58066I36681j5885j5860j6478j5164j3357j3214j3203j1209q897q764r733r825
$$ 936681 920796 904936 888458 873294 859937 846723 833520 822311 813414 804650 794917 785092
58054G85092j0191j2282j3985j2959j1060j1036j1485r708p078o716p885p520
$$ 785092 774901 762619 748634 735675 724615 713579 702094 692386 685308 678592 670707 663187
58042F63187n736n177o064o306n552n104m714l248j652j740k857l019k427k645
$$ 663187 657451 652274 646210 639904 634352 629248 624534 621286 619634 617894 615037 612018 609591 606946
58028F06946l385l275k760l120l642k882j582j304j264L06K694L764L641M290
$$ 606946 603561 600286 597526 594406 590764 587882 586300 584996 583732 584038 586732 590496 594137 598427
58014E98427O106P816R121J0717J2319J3178J3910J5459J7213J8282J9619K2424
$$ 598427 604533 612349 621470 632187 644506 657684 671594 687053 704266 722548 742167 764591
58002G64591K5692K7770K9168L1260L3544L4826L5911L8252M1022M2328M2374
$$ 764591 790283 818053 847221 878481 912025 946851 982762 1021014 1062036 1104364 1146738
57991A146738M2567M2396M0186L6284L2597K9450K5663K1369J8189J6848J6860
$$ 1146738 1189305 1231701 1271887 1308171 1340768 1370218 1395881 1417250 1435439 1452287 1469147
57980A469147J8058K0201K1586K0340J6614J1447M285o131j9127l2583m5244n6350
$$ 1469147 1487205 1507406 1528992 1549332 1565946 1577393 1581678 1575547 1556420 1523837 1478593 1422243
57968A422243o4050o6810o5836o3629o0633n5725m9228m2851l7074l1189k5496
$$ 1422243 1358193 1291383 1225547 1161918 1101285 1045560 996332 953481 916407 885218 859722
57957H59722k0973j7118j2607p896m705l133j672R4J170J447J935K739K983K843
$$ 859722 838749 821631 809024 801128 796423 793290 791618 791712 792882 794329 796264 799003 801986 804829
57943H04829L483M846N621N556N939P526R810J2366J5293J8312K1005K3831K7291
$$ 804829 808312 813158 818779 824335 830274 837800 847610 859976 875269 893581 914586 938417 965708
57930I65708L0274L0917K8798K4733J8784J0328j43j1156k1949l2287m0887m5986
$$ 965708 995982 1026899 1055697 1080430 1099214 1109542 1109399 1098243 1076294 1044007 1003120 957134
57918I57134m7492m6919m5239m2413l8767l5079l1392k7292k3221k0001j7365
$$ 957134 909642 862723 817484 775071 736304 701225 669833 642541 619320 599319 581954
57907E81954j4499j1712r942r083q398q156r022j0322j0794j0695j1206j2135
$$ 581954 567455 555743 545801 536718 528320 520164 511142 500820 490026 479331 468125 455990
57895D55990j2281j1747j1748j2150j1454r309p051n474m006k356j152n18L93
$$ 455990 443709 431962 420214 408064 396610 387301 380250 374776 370770 368414 367262 366744 367137
57882C67137K058M050O046Q012R438R704R158Q648Q306Q003Q294R350R640P701
$$ 367137 369195 373245 379291 387303 396741 406445 415603 424251 432557 440560 448854 458204 467844 475545
57868D75545M648K788K246J234o94k196k954m270o455q028q219q023q146p913
$$ 475545 480193 482981 485227 486461 485767 483571 480617 476347 469892 461864 453645 445622 437476 429563
57854D29563p027o474o733o765n668l893k161n44P65J204R63J051J773K419K734
$$ 429563 422536 416062 409329 402564 396896 393003 390842 390298 391063 392267 393230 394281 396054 398473 401207
57839D01207L233L720L150J461j6n15p95j505k092k019j714j576j217l95M17R73
$$ 401207 404440 408160 411310 412771 412755 412240 411445 409940 407848 405829 404115 402539 401322 400927 401344 402317
57823D02317J779L128M566N727O858Q289J0154J2699J5839J8529J9764J9993K0278
$$ 402317 404096 407224 411790 417517 424375 432664 442818 455517 471356 489885 509649 529642 549920
57810E49920K0406J9473J8157J8448K0990K4611K8613L3369L8179M0885M0550
$$ 549920 570326 589799 607956 626404 647394 672005 700618 733987 772166 813051 853601
57799H53601L8547L5831L0985K2368J0710j707j3346k3610l1863l7601m1054m2708
$$ 853601 892148 927979 958964 981332 992042 990335 976989 953379 921516 883915 842861 800153
57787H00153m2820m1898m0745l9441l7244l4106l1274k9679k8625k6825k4000
$$ 800153 757333 715435 674690 635249 598005 563899 532625 502946 474321 447496 423496
57776D23496k0848j8157j6376j5357j4166j2023r549q070p624o888n336l989l579
$$ 423496 402648 384491 368115 352758 338592 326569 317020 308950 301326 294438 289102 285113 281534
57763B81534l390k677j832j406j100n77j70jN71J835L057L604L884M472N261O048
$$ 281534 278144 275467 273635 272229 271129 270552 270382 270381 270952 272787 275844 279448 283332 287804 293065 299113
57747B99113P043Q204R025R479J0124J0788J0313Q223N530L252J321m79j717k313
$$ 299113 306156 314360 323385 332864 342988 353776 364089 372312 377842 381094 382415 381936 380219 377906
57733C77906l069m305n084m626l494k506j574n07J52R9J16R12K026K781L396M241
$$ 377906 374837 370532 365448 360822 357328 354822 353248 352741 352893 352992 353108 354020 356046 358827 362223 366464
57717C66464M928N153N518O496P444P703P776Q369R134R477R867J1094J2899J4438
$$ 366464 371392 376545 382063 388559 396003 403706 411482 419851 428985 438462 448329 459423 472322 486760
57703D86760J5600J6755J7871J8927K0610K3465K6805K9649L2311L5898M0550
$$ 486760 502360 519115 536986 555913 576523 599988 626793 656442 688753 724651 765201
57692G65201M5289M9476N3439N7728O2494O7596P2756P7797Q3013Q8802R4564
$$ 765201 810490 859966 913405 971133 1033627 1101223 1173979 1251776 1334789 1423591 1518155
57681A518155R8647R9964R8957R6416R2267Q6367P9619P3240O7634O2993O0458
$$ 1518155 1616802 1716766 1815723 1912139 2004406 2090773 2170392 2243632 2311266 2374259 2434717
57670B434717O1313O5140O9338O9582O0032L4727q224o2773j16598j57783j80539
$$ 2434717 2496030 2561170 2630508 2700090 2760122 2794849 2786625 2723852 2607254 2449471 2268932
57659B268932j85818j78384j63748j46287j28496j11313r5103q0327o7513n6897
$$ 2268932 2083114 1904730 1740982 1594695 1466199 1354886 1259783 1179456 1111943 1055046
57649A055046m8141m0459l3277k6864k1783j7767j3726r167m778j240J815N135
$$ 1055046 1006905 966446 933169 906305 884522 866755 853029 843862 839084 837844 839659 844794
57637H44794Q863J2855J7219K1842K5996K9262L2386L6353M1073M5691M9801N3598
$$ 844794 853657 866512 883731 905573 931569 960831 993217 1029570 1070643 1116334 1166135 1219733
57625A219733N7141O0232O2808O4764O5615O4889O2567N8587N2349M3336L1932
$$ 1219733 1276874 1337106 1399914 1464678 1530293 1595182 1657749 1716336 1768685 1812021 1843953
57614A843953J9082N466q502k2205l4941m6186n5479o2484o7436p0882p2591p1739
$$ 1843953 1863035 1868501 1859999 1837794 1802853 1756667 1701188 1638704 1571268 1500386 1427795 1356056
57602A356056o8601o5040o2430o0079n6783n2905m9590m6703m3170l8998l5368
$$ 1356056 1287455 1222415 1159985 1099906 1043123 990218 940628 893925 850755 811757 776389
57591G76389l2795l0630k8434k6499k4817k2789k0333j8250j7014j6054j4647
$$ 776389 743594 712964 684530 658031 633214 610425 590092 571842 554828 538774 524127
57580E24127j2876j1269j0105r373q982q609p773o359m854l829l417l278k977
$$ 524127 511251 499982 489877 480504 471522 462913 455140 448781 443927 440098 436681 433403 430426
57567D30426k333j562j024p48l84K77J011J504J716J758J760K008K787L962N079
$$ 430426 428093 426531 425507 424759 424375 424652 425663 427167 428883 430641 432401 434409 437196 441158 446237
57552D46237O013P004Q024Q768R386J0408J1727J2664J3251J4433J6510J8559
$$ 446237 452250 459254 467278 476046 485432 495840 507567 520231 533482 547915 564425 582984
57540E82984K0045K1825K4675K7966L0891L3915L7720M1648M4621M6871M9391
$$ 582984 603029 624854 649529 677495 708386 742301 780021 821669 866290 913161 962552
57529I62552N2137N4137N4966N4776N3414N0645M6857M2148L5360K5537J3899
$$ 962552 1014689 1068826 1123792 1178568 1231982 1282627 1329484 1371632 1406992 1432529 1446428
57518A446428K700p523j7826k8176l6885m2925m7036n0055n1809n2150n1675n0664
$$ 1446428 1449128 1441605 1423779 1395603 1358718 1315793 1268757 1218702 1166893 1114743 1063068 1012404
57506A012404m8573m5265m1608l8279l5036l1696k8772k6503k4266k1649j9134
$$ 1012404 963831 918566 876958 838679 803643 771947 743175 716672 692406 670757 651623
57495F51623j7058j4796j1823q782o651n424m322k887j121R80L396N835Q030J0007
$$ 651623 634565 619769 607946 599164 592513 587089 582767 579880 578759 579739 583135 588970 597000 607007
57481F07007J1843J3500J5228J7640K0959K4557K7589K9905L2061L4666L7882
$$ 607007 618850 632350 647578 665218 686177 710734 738323 768228 800289 834955 872837
57470H72837M1292M4189M6237M7703M8804M9051M7786M5044M1129L5562K7476
$$ 872837 914129 958318 1004555 1052258 1101062 1150113 1197899 1242943 1284072 1319634 1347110
57459A347110J7086N767n428j6421k7034l6400m3911m9831n4416n7253n8065n7436
$$ 1347110 1364196 1369963 1364535 1348114 1321080 1284680 1240769 1190938 1136522 1079269 1021204 963768
57447I63768n6088n4029n1123m7841m4793m1890l8681l5232l2088k9501k7303
$$ 963768 907680 853651 802528 754687 709894 668004 629323 594091 562003 532502 505199
57436E05199k5316k3473k1633j9698j7851j6365j5234j4142j2874j1609j0782
$$ 505199 479883 456410 434777 415079 397228 380863 365629 351487 338613 327004 316222
57425C16222j0570j0480r769q428p315p002o962o507n936n864n915n225m079l656
$$ 316222 305652 295172 285403 276975 269660 262658 255696 249189 243253 237389 231474 226249 222170 218514
57411B18514m124m271l444k518k415k814l031l051k931k104m03J033R70k16j041
$$ 218514 214390 210119 206675 204157 201742 198928 195897 192846 189915 187811 187408 188441 189411 189195 188154
57396A88154q28k67k17p29j290j336o43M60J297J573J647J869J970J522O22k18
$$ 188154 187326 187059 186842 186113 184823 183487 182844 183304 184601 186174 187821 189690 191660 193182 193804 193586
57380A93586o10m77j7K38j62r12j117n15P5r8p57j218j408j674k037k267k342
$$ 193586 192976 192499 192482 192720 192558 191646 190529 190014 190089 189991 189234 188016 186608 184934 182897 180630 178288
57363A78288k323k116j734j353p71M97K076K530J123r16j768j153j73L93N24J78
$$ 178288 175965 173849 172115 170762 169991 170488 172564 175094 176217 175301 173533 172380 172207 172600 173124 173302
57347A73302n88q94K19K188L269K735J707J454J832J987J732J566J827K407L007
$$ 173302 172714 171820 172039 174227 177496 180231 181938 183392 185224 187211 188943 190509 192336 194743 197750
57332A97750L290L086K729K812L384L824L719L479L627L989M067L930M142M870
$$ 197750 201040 204126 206855 209667 213051 216875 220594 224073 227700 231689 235756 239686 243828 248698
57318B48698N635N994O077O221O475O792P471Q813J0331J0918J0238R432R796
$$ 248698 254333 260327 266404 272625 279100 285892 293363 302176 312507 323425 333663 343095 352891
57305C52891J1072J1875J1726J1623J2264J2801J2144J0605R240Q086O274L634
$$ 352891 363963 375838 387564 399187 411451 424252 436396 447001 456241 464327 470601 474235
57293D74235J045j000l038n616q415j0820j2696j4093j4799j4707j4247j3959
$$ 474235 475280 474280 471242 465626 457211 446391 433695 419602 404803 390096 375849 361890
57281C61890j3822j3431j2613j1562j0450r252p886o365m872l746l197l015k746
$$ 361890 348068 334637 322024 310462 300012 290760 282874 276509 271637 267891 264694 261679 258933
57268B58933k239j724j311q09k24J9l05p37o89k61k7j27r3L83J018J435J700K043
$$ 258933 256694 254970 253659 252850 252626 252645 252340 251603 250914 250653 250626 250499 250406 250789 251807 253242 254942 256985
57250B56985K347K350K202K321K697K831K541K359K717L123K777J884J612K608
$$ 256985 259332 261682 263884 266205 268902 271733 274274 276633 279350 282473 285250 287134 288746 291354
57236B91354M149N098N208N013M895M790M648M615M789N174N808O574P038O887
$$ 291354 295503 300601 305809 310822 315717 320507 325155 329770 334559 339733 345541 352115 359153 366040
57222C66040O459O485P274Q518R800J0889J1609J1874J1909J2060J2400J2846
$$ 366040 372499 378984 386258 394776 404576 415465 427074 438948 450857 462917 475317 488163
57210D88163J3529J4526J5379J5544J5391J5901J7243J8397J8607J8401J8640
$$ 488163 501692 516218 531597 547141 562532 578433 595676 614073 632680 651081 669721
57199F69721J9277J9800K0272K1075K1951K2324K2395K2971K4139K5055K5277
$$ 669721 688998 708798 729070 750145 772096 794420 816815 839786 863925 888980 914257
57188I14257K5497K6555K8314K9957L0973L1411L1468L1195L0349K8446K5451
$$ 914257 939754 966309 994623 1024580 1055553 1086964 1118432 1149627 1179976 1208422 1233873
57177A233873K2669K2287K5316L0264L4444L6381L6451L5514L3891L1713K9504
$$ 1233873 1256542 1278829 1304145 1334409 1368853 1405234 1441685 1477199 1511090 1542803 1572307
57166A572307K7867K6964K6539K6119K5166K3465K1543K0244J9586J8628J6786
$$ 1572307 1600174 1627138 1653677 1679796 1704962 1728427 1749970 1770214 1789800 1808428 1825214
57155A825214J4761J3566J3112J2506J1505J0818J0914J1307J1358J1188J1364
$$ 1825214 1839975 1853541 1866653 1879159 1890664 1901482 1912396 1923703 1935061 1946249 1957613
57144A957613J2063J2928J3532J3657J3343J3018J3349J4619J6295J7544J8167
$$ 1957613 1969676 1982604 1996136 2009793 2023136 2036154 2049503 2064122 2080417 2097961 2116128
57133B116128J8716J9660K0791K1584K1919K2219K2964K4293K6143K8561L1667
$$ 2116128 2134844 2154504 2175295 2196879 2218798 2241017 2263981 2288274 2314417 2342978 2374645
57122B374645L5348L9273M3362M7993N3528N9829O6570P3886Q2316R2042J02736
$$ 2374645 2409993 2449266 2492628 2540621 2594149 2653978 2720548 2794434 2876750 2968792 3071528
57111C071528J14331J27538J43277J62037J84171K10605K42774K82204L30703
$$ 3071528 3185859 3313397 3456674 3618711 3802882 4013487 4256261 4538465 4869168
57102D869168L90884M65809N58111O69939Q03581R61056J142408J345028J565431
$$ 4869168 5260052 5725861 6283972 6953911 7757492 8718548 9860956 11205984 12771415
57093A2771415J801755K054354K324357K611820K913922L222893L524281L796435
$$ 12771415 14573170 16627524 18951881 21563701 24477623 27700516 31224797 35021232
57085C5021232M010322M128819M108328L907588L503337K904019K151673J310386
$$ 35021232 39031554 43160373 47268701 51176289 54679626 57583645 59735318 61045704
57077F1045704M48715l75115j121128j768511k311128k750240l088132l325505
$$ 61045704 61494419 61119304 59998176 58229665 55918537 53168297 50080165 46754660
57069D6754660l462829l503457l455816l333364l152589k930582k683418k425466
$$ 46754660 43291831 39788374 36332558 32999194 29846605 26916023 24232605 21807139
57061B1807139k168895j923116j694501j486650j300969j137303r94513q70877
$$ 21807139 19638244 17715128 16020627 14533977 13233008 12095705 11101192 10230315
57053A0230315p64308o72718n94489n28370m72718m25143l83435l46682l14951
$$ 10230315 9466007 8793289 8198800 7670430 7197712 6772569 6389134 6042452 5727501
57044E727501k87910k64310k42820k22781k04001j86422j70190j55604j42643
$$ 5727501 5439591 5175281 4932461 4709680 4505679 4319257 4149067 3993463 3850820
57035C850820j30814j19585j08640r7770q7054p7087o8342o0230n1450m1346k9948
$$ 3850820 3720006 3600421 3491781 3394011 3306957 3229870 3161528 3101298 3049848 3008502 2978554
57024B978554j6867j303J6597L5923N6540P7446R1650Q5715M9432j2509q0763
$$ 2978554 2961687 2960384 2976981 3012904 3069444 3146890 3238540 3324255 3373687 3361178 3280415
57013C280415j34554j64247j72339j66317j52947j37034j21549j07558r4980q3877
$$ 3280415 3145861 2981614 2809275 2642958 2490011 2352977 2231428 2123870 2028890 1945013
57003A945013p4628o7132o0714n4884m9684m5357m2006l9473l7264l4820l2099
$$ 1945013 1870385 1803253 1742539 1687655 1637971 1592614 1550608 1511135 1473871 1439051 1406952
56992A406952k9550k7258k4706k1689j8826j6591j4454j1710q685o258m695l902
$$ 1406952 1377402 1350144 1325438 1303749 1284923 1268332 1253878 1242168 1233483 1227225 1222530 1218628
56980A218628m511p514j2680j8259k2570k5135k6177k5891k4669k3295k2304k1437
$$ 1218628 1214117 1206603 1193923 1175664 1153094 1127959 1101782 1075891 1051222 1027927 1005623 984186
56968I84186k0137j8260j6035j3677j1487r914r059q241o595m095j586J72J097
$$ 984186 964049 945789 929754 916077 904590 894676 885617 877376 870781 866686 865100 865272 866369
56955H66369J262K01k801p793j3752j9222k3208k5429k5933k4877k2651j9943
$$ 866369 867631 867832 865031 857238 843486 824264 801056 775627 749694 724817 702166 682223
56943F82223j7404j5253j3264j1085q565n857l260q40J738M897Q591J2259J5325
$$ 682223 664819 649566 636302 625217 616652 610795 607535 606695 608433 613330 621921 634180 649505
56930F49505J7439J8041J6073J0540J597r092j9117k6533l0573l1600l0600k8659
$$ 649505 666944 684985 701058 711598 713195 704103 684986 658453 627880 596280 565680 537021
56918E37021k6555k4493k2196j9456j6700j4733j3732j2917j1583j0080r218q983
$$ 537021 510466 485973 463777 444321 427621 412888 399156 386239 374656 364576 355358 346375
56906C46375q586p681o738o075n371m413l606l247k940k214j213l13M79J265J924
$$ 346375 337789 330108 323370 317295 311924 307511 303905 300658 297718 295504 294291 293978 294457 295722 297646
56891B97646K545L686N569P543Q954J0054J1214J1694J0200O574J967k567o716
$$ 297646 300191 303877 309446 316989 325943 335997 347211 358905 369105 375679 377646 375079 368363
56878C68363j0132j2078j2245j1225r733p948n810l430q39K138N395Q341J0651
$$ 368363 358231 346153 333908 322683 312950 305002 299192 295762 294923 297061 302456 310797 321448
56865C21448J2842J5835J9982K4798K9306L2563L4027L3539L0802K5065J5853
$$ 321448 334290 350125 370107 394905 424211 456774 490801 524340 555142 580207 596060
56854E96060M194p429j6612k2332k4807k4740k2946k0165j6707j2447p511k579
$$ 596060 600254 592825 576213 553881 529074 504334 481388 461223 444516 432069 424558 421979
56842D21979J805N931J0506J5799K1530K7452L3626M0135M6690N2329N5213N2967
$$ 421979 423784 429715 440221 456020 477550 505002 538628 578763 625453 677782 732995 785962
56830G85962M3879K8179Q301j2077k9383m1251m7094m7994m5814m2103l7501l1960
$$ 785962 829841 858020 866321 854244 824861 783610 736516 688522 642708 600605 563104 531144
56818E31144k5461j8537j2092o599j613L672R451J5203K0495K5510L0559L5312
$$ 531144 505683 487146 475054 468455 466842 470514 479965 495168 515663 541173 571732 607044
56806F07044L8546L8436L3224K2338P250q993k3421l4302m0912m3025m1207l7067
$$ 607044 645590 684026 717250 739588 746838 737845 714424 680122 639210 596185 554978 517911
56794E17911l2397k7970k3508j8703j3818r339n460k048J156M415P892J1616J5478
$$ 517911 485514 457544 434036 415333 401515 392176 386716 384668 385824 390239 398131 409747 425225
56781D25225J9084K1491K1420J8044J1609L196n889j4397k1205k5558k7348k7030
$$ 425225 444309 465800 487220 505264 516873 520069 514180 499783 478578 453020 425672 398642
56769C98642k5440k3597k2181k0904j8874j5898j3010j1203j0243r285q179p274
$$ 398642 373202 349605 327424 306520 287646 271748 258738 247535 237292 228007 219828 212554
56757B12554o369m948l350k545k573k357j419o91r58j543j369o39l88q00j038
$$ 212554 206185 201237 197887 195342 192769 190412 188993 188302 187344 185801 184432 183793 183405 182605 181567
56742A81567n79J88P17R00Q05M81J72J18O1n72j820k974l380l014k160j086j62
$$ 181567 180988 181176 181893 182793 183598 184079 184251 184369 184430 183858 182038 179064 175684 172670 170510 169424 169262
56725A69262K17J72L50R63J293O10p12j540j317n13J54M87P00R88J433K041K705
$$ 169262 169479 169651 170001 170964 172257 172867 172155 170615 169298 168785 168939 169426 170126 171114 172547 174588 177293
56708A77293L291L832M480N156N566N636N725O090O385O005M918L733K922K280
$$ 177293 180584 184416 188896 194052 199618 205254 210979 217069 223454 229459 234377 238110 241032 243312
56694B43312J471P47P38J501K295K392J840J182P22M36L74P11J368J941K136K007
$$ 243312 244783 245530 246268 247769 250064 252456 254296 255478 256200 256636 257010 257721 259089 261030 263166 265173
56678B65173J715J275P42K87j6k97o51j008j335j716k048k075j947k368l632m904
$$ 265173 266888 268163 268905 269192 269176 268879 268228 267220 265885 264169 262121 260046 258099 255731 252099 247195
56662B47195n052m090l176l108l509l572l097k440j995k024k576l164k958j739
$$ 247195 242143 238053 234877 231769 228260 224688 221591 219151 217156 215132 212556 209392 206434 204695
56648B04695m03J2m50q83p43k83J47N69J010J226J110R90J228J677J796J250K10
$$ 204695 204292 204304 203854 202971 202228 201945 202092 202661 203671 204897 206007 206997 208225 209902 211698 212948 213158
56631B13158p97j268j096o25k82k12m04j016k147l316l666k903j688q38n27n15
$$ 213158 212361 211093 209997 209372 209090 208878 208474 207458 205311 201995 198329 195426 193738 192900 192373 191858
56615A91858o90r05o53L88J613K037J630J452K179L143L265K528J878J894K215
$$ 191858 191168 190263 189610 189998 191611 193648 195278 196730 198909 202052 205317 207845 209723 211617 213832
56600B13832K256J967J625J302R26O19O28R02J115J189J426J949K235J692N44
$$ 213832 216088 218055 219680 220982 221908 222527 223155 224057 225172 226361 227787 229736 231971 233663 234207
56585B34207k93l70k24n20j123j414j205q00l36L10R79J255J154J188J541J712
$$ 234207 233914 233544 233320 232800 231677 230263 229058 228258 227922 228232 229211 230466 231620 232808 234349 236061
56569B36061J333Q74J054J878K613K600J720L68q07j304j256j205j281j030l91
$$ 236061 237394 238268 239322 241200 243813 246413 248133 248501 247694 246390 245134 243929 242648 241618 241227
56554B41227k12j089k328k859k864l415m649n419m966l868l039k668k632l016
$$ 241227 241015 239926 237598 234739 231875 228460 223811 218392 213426 209558 206519 203851 201219 198203
56540A98203l606l559k437j069o17j109j544j254n31k4j27q58j760k003j109M10
$$ 198203 194597 191038 188601 187532 186915 185806 184262 183008 182477 182453 182326 181468 179708 177705 176596 177006
56524A77006J500J627J069K57o41j447j806j554j056r48j535k455k929k529j701
$$ 177006 178506 180133 181202 181459 180818 179371 177565 176011 174955 174007 172472 170017 167088 164559 162858
56509A62858j355j772k274k166j643j318j213p56L13J520K209K148J589J011Q26
$$ 162858 161503 159731 157457 155291 153648 152330 151117 150361 150674 152194 154403 156551 158140 159151 159977
56494A59977J105J499J662J631J693J956K223K210J774J071N72N97Q77R05P73
$$ 159977 161082 162581 164243 165874 167567 169523 171746 173956 175730 176801 177373 177970 178847 179752 180525
56479A80525J036J639J779J272J123K015K952K547J103K09M82R27N93l33j281
$$ 180525 181561 183200 184979 186251 187374 189389 192341 194888 195991 196200 196682 197609 198202 197869 196588
56464A96588k073k534k249j205j05M43N34N10M55L75L83L95J51k87m81j99L79
$$ 196588 194515 191981 189732 188527 188422 188865 189399 189909 190364 190739 191122 191517 191668 191381 190900 190701 191080
56447A91080R88J333Q99m51j730j648l84M51j9q59r56o26p58j215j147m15L10
$$ 191080 192068 193401 194300 193849 192119 190471 190087 190538 190519 189660 188704 188078 187320 186105 184958 184543 184853
56430A84853N07J74n66j401j686j008J43R47J214J316J320R54K82j43J39J152
$$ 184853 185360 185534 184968 183567 181881 180873 181016 181963 183177 184493 185813 186767 187049 186906 187045 188197
56414A88197K527L551L443K141O27k1K99R30J420J628J281K83o55n99K83P72J42
$$ 188197 190724 194275 197718 199859 200486 200465 200764 201694 203114 204742 206023 206306 205651 205052 205335 206107 206249
56397B06249r69j559j453j092o78q7N41P39L02l64o53l45K45O50P17O07N19M74
$$ 206249 205280 203721 202268 201176 200498 200411 200952 201691 201993 201629 200976 200631 200876 201526 202243 202850 203369 203843
56379B03843M08K55k1l12l56k5L58L00j71m69j71M72R29R61O62K85J94O23J264
$$ 203843 204251 204506 204485 204173 203817 203792 204150 204450 204279 203810 203639 204111 205040 206001 206663 206948 207142 207765 209029
56360B09029J477J147R31J369K190K841L262L580L505K652J341L92J35J92K05
$$ 209029 210506 211653 212584 213953 216143 218984 222246 225826 229331 231983 233324 233716 233851 234043 234248
56345B34248L22Q29J736K768L569L858L714L581L760L977L804L478L735M719N562
$$ 234248 234570 235399 237135 239903 243472 247330 251044 254625 258385 262362 266166 269644 273379 278098 283660
56330B83660N368M345L539L546L960M136M062M147M381M336L961L793M062M145
$$ 283660 289028 293373 296912 300458 304418 308554 312616 316763 321144 325480 329441 333234 337296 341441
56316C41441L416K212J318Q41L15k69m23q0K37L19M69O40L32l66n02M06J556J999
$$ 341441 344857 347069 348387 349228 349543 349274 348851 348771 349008 349327 349796 350436 350768 350402 349900 350306 351862 353861
56298C53861J947K264L236M433N393N874N830N689O166P283Q079P907P534Q164
$$ 353861 355808 358072 361308 365741 371134 377008 382838 388527 394693 401976 410055 417962 425496 433660
56284D33660R832J1547J2751J3741J4843J5956J7108J8689K0982K3831K6992L0443
$$ 433660 443492 455039 467790 481531 496374 512330 529438 548127 569109 592940 619932 650375
56272F50375L4319L8625M3099M7366N1411N5799O1119O7172P3266P9224Q5440
$$ 650375 684694 723319 766418 813784 865195 920994 982113 1049285 1122551 1201775 1287215
56261A287215R1781R7324J01498J04532J06350J05963J02797R7731R1821Q4717
$$ 1287215 1378996 1476320 1577818 1682350 1788700 1894663 1997460 2095191 2187012 2271729
56251B271729P5381O3912N1524L8954K6044J2815m8j1813k2195l1202l9109m6449
$$ 2271729 2347110 2411022 2462546 2501500 2527544 2540359 2540311 2528498 2506303 2475101 2435992 2389543
56239B389543n3433n9563o4434o8573p2790p6928q0060q1863q2941q3760q3962
$$ 2389543 2336110 2276547 2212113 2143540 2070750 1993822 1913762 1831899 1748958 1665198 1581236
56228A581236q2888q0323p6684p2746o9139o5769o1985n7474n2666m7980m3271
$$ 1581236 1498348 1418025 1341341 1268595 1199456 1133687 1071702 1014228 961562 913582 870311
56217H70311l8550l4539l1800k9755k7341k4314k1273j8686j6637j5105j3903
$$ 870311 831761 797222 765422 735667 708326 684012 662739 644053 627416 612311 598408
56206E98408j2566j0911r364q249p250o036m894m103l367k516j954j745j042N74
$$ 598408 585842 574931 565567 557318 550068 544032 539138 535035 531668 529152 527198 525453 524411 524985
56192E24985K049K258J686J554J919K030J966K550L925N475O841P871Q071P378
$$ 524985 527034 529292 530978 532532 534451 536481 538447 540997 544922 550397 557238 565109 573180 580558
56178E80558O967P957R765J1099J1961J3076J3940J3391J1890J1233J1876J2498
$$ 580558 587525 595482 605247 616346 628307 641383 655323 668714 680604 691837 703713 716211
56166G16211J2397J2465J3325J4339J5110J6428J8980K2402K6298L0994L6710
$$ 716211 728608 741073 754398 768737 783847 800275 819255 841657 867955 898949 935659
56155I35659M3120N0298N9098P0047Q2844R7279J13589J31387J49104J64730J76112
$$ 935659 978779 1029077 1088175 1158222 1241066 1338345 1451934 1583321 1732425 1897155 2073267
56144B073267J80405J74815J58904J35758J10412Q7549P0402O0238N5871N3970
$$ 2073267 2253672 2428487 2587391 2723149 2833561 2921110 2991512 3051750 3107621 3161591
56134C161591N0386M1595K6027N430j5355l1453m1264m6454m9657n3631o1886
$$ 3161591 3211977 3253572 3279599 3285029 3269674 3238221 3196957 3150503 3100846 3047215 2985329
56123B985329p7415r9817j24862j47319j63311j70503j68245j58336j44156j28155
$$ 2985329 2907914 2808097 2683235 2535916 2372605 2202102 2033857 1875521 1731365 1603210
56113A603210j11078r3640p7368o3194n0740l9639l0394k3380j8095j3991j1007
$$ 1603210 1492132 1398492 1321124 1257930 1207190 1167551 1137157 1113777 1095682 1081691 1070684
56102A070684q863o938n219m394m663n521o737q381r772r898r032q522q676q334
$$ 1070684 1061821 1054883 1049664 1045270 1040607 1035086 1028349 1019968 1010196 1000298 991266 982744 974068 965734
56088I65734o884n190m001k872j328K24J296K053K781L513M406N524O246O077
$$ 965734 958850 953660 949659 946787 945459 945683 946979 949032 951813 955326 959732 965256 971502 977579
56074I77579N782O500P981R117R878J1038J2274J2526J2093J2350J3394J4030
$$ 977579 983361 989861 997842 1006959 1016837 1027875 1040149 1052675 1064768 1077118 1090512 1104542
56062A104542J4058J4493J5396J5734J5513J5802J6495J6436J5909J6526J8287
$$ 1104542 1118600 1133093 1148489 1164223 1179736 1195538 1212033 1228469 1244378 1260904 1279191
56051A279191J9435J9608K0447K2478K4093K4481K4859K5957K6834K7101K7821
$$ 1279191 1298626 1318234 1338681 1361159 1385252 1409733 1434592 1460549 1487383 1514484 1542305
56040A542305K9287L0378L0958L2375L4776L6491L6966L7618L8943L9546L8984
$$ 1542305 1571592 1601970 1632928 1665303 1700079 1736570 1773536 1811154 1850097 1889643 1928627
56029A928627L8754L9507M0127M0446M1911M4571M6530M7415M9094N2007N4156
$$ 1928627 1967381 2006888 2047015 2087461 2129372 2173943 2220473 2267888 2316982 2368989 2423145
56018B423145N4948N6383N9120O1131O1837O3678O7700P1433P3269P5215P9070
$$ 2423145 2478093 2534476 2593596 2654727 2716564 2780242 2847942 2919375 2992644 3067859 3146929
56007C146929Q3482Q7100R1176R6724J02459J07720J14017J21664J28527J34080
$$ 3146929 3230411 3317511 3408687 3505411 3607870 3715590 3829607 3951271 4079798 4213878
55997D213878J40820J49726J58424J65934J74793J86289J98194K09534K22836
$$ 4213878 4354698 4504424 4662848 4828782 5003575 5189864 5388058 5597592 5820428
55988E820428K39083K55443K70633K87400L07068L27162L47295L71530M01777
$$ 5820428 6059511 6314954 6585587 6872987 7180055 7507217 7854512 8226042 8627819
55979H627819M34950M69820N10213N58090O10535O67382P34242Q13936R03055
$$ 8627819 9062769 9532589 10042802 10600892 11211427 11878809 12613051 13426987 14330042
55970A4330042J001680J118037J258722J423795J617534J854738K150742K515516
$$ 14330042 15331722 16449759 17708481 19132276 20749810 22604548 24755290 27270806
55962B7270806K962738L510778M165510M914759N749395O678144P716168Q880123
$$ 27270806 30233544 33744322 37909832 42824591 48573986 55252130 62968298 71848421
55954G1848421J0208716J1768456J3621193J5801364J8332386K1222630K4392929
$$ 71848421 82057137 93825593 107446786 123248150 141580536 162803166 187196095
55947A87196095K7587696L0314555L1771719L0818636K6260496J7577724N650129
$$ 187196095 214783791 245098346 276870065 307688701 333949197 351526921 357177050
55940C57177050p280730j8599103k6525319l0642059l1562498l0283498k7744884
$$ 357177050 349896320 331297217 304771898 274129839 242567341 212283843 184538959
55933A84538959k4666277k1512747j8525361j5809116j3414428j1357797r617481
$$ 184538959 159872682 138359935 119834574 104025458 90611030 79253233 69635752
55926F9635752q153869o934402n929057n098180m403133l820707l335173k925869
$$ 69635752 61481883 54547481 48618424 43520244 39117111 35296404 31961231 29035362
55918B9035362k573992k272391k017448j798580j605116j435827j292272j169052
$$ 29035362 26461370 24188979 22171531 20372951 18767835 17332008 16039736 14870684
55910A4870684j058879r60984q76458q00969p29561o63599o06061n54697n06136
$$ 14870684 13811805 12850821 11974363 11173394 10443833 9780234 9174173 8619476 8113340
55901H113340m61975m24677l91821l60093l30806l06146k84136k62436k42946
$$ 8113340 7651365 7226688 6834867 6474774 6143968 5837822 5553686 5291250 5048304
55892E048304k27534k13332j97327j81773j69993j60369j49534j38122j28531
$$ 5048304 4820770 4607438 4410111 4228338 4058345 3897976 3748442 3610320 3481789
55883C481789j20077j11098j03040r7745r3269q6681p8814p2398o7935o5164o5838
$$ 3481789 3361712 3250614 3147574 3049829 2956560 2869879 2791065 2718667 2650732 2585568 2519730
55872B519730p0910p7158q0547q1034q0660p9168p5206o9850o5252o1347n7108
$$ 2519730 2448820 2371662 2291115 2210081 2129421 2050253 1975047 1905197 1839945 1778598 1721490
55861A721490n3309n0973m8827m5205m0899l7410l4291l0826k8294k7658k7045
$$ 1721490 1668181 1617208 1568381 1523176 1482277 1444867 1410576 1379750 1351456 1323798 1296753
55850A296753k4457k1087j9110j8039j6290j4441j3885j3839j2749j1237j0762
$$ 1296753 1272296 1251209 1232099 1214060 1197770 1183329 1169444 1155605 1142856 1131619 1120857
55839A120857j0743r875q939r511j1088j2201j3143j4892j6514j6390j5072j4401
$$ 1120857 1110114 1100239 1091300 1081789 1070701 1058500 1045357 1030465 1013951 997561 982489 968088
55827I68088j4663j4887j5048j5652j6134j5846j5716j6801j8141j8155j7090
$$ 968088 953425 938538 923490 907838 891704 875858 860142 843341 825200 807045 789955
55816G89955j6183j5473j4373j3285j2622j1474r176o979o169n831m566l077k834
$$ 789955 773772 758299 743926 730641 718019 706545 697369 690390 684221 678390 673824 670747 667913
55803F67913l386l351k961l372m348m864n072n595n726m487k599j514j312j507
$$ 667913 664527 661176 658215 654843 650495 645631 640559 634964 629238 624751 622152 620638 619326 617819
55789F17819k764n646q695r889r212p804n659k322J116L041L617L972L839K113
$$ 617819 615055 609409 600714 590825 581613 573809 568150 565828 566944 569985 573602 577574 581413 583526
55775E83526j010m448q064j1971j5024j6129j6270j7000j7758j7011j5268j4410
$$ 583526 582516 578068 570004 558033 543009 526880 510610 493610 475852 458841 443573 429163
55763D29163j4551j4105j2697j1560j1189j0841j0383j0500j0988j0848j0074
$$ 429163 414612 400507 387810 376250 365061 354220 343837 333337 322349 311501 301427
55752C01427r618r625r380q834q500q060o841n403m943n286n109l998k674j499
$$ 301427 291809 282184 272804 263970 255470 247410 240569 235166 230223 224937 219828 215830 213156 211657
55738B11657l51M01L88K99Q42J253N73k49L91J919K200P36q67j537j732j821j511
$$ 211657 211306 211707 212095 212394 213236 214489 215062 214813 215204 217123 219323 220059 219192 217655 215923 214102 212591
55721B12591j045j121j383p85N00J230J188J460K513L660M520N422O260O564O707
$$ 212591 211546 210425 209042 208257 208757 209987 211175 212635 215148 218808 223328 228750 235010 241574 248281
55706B48281P457Q425Q527P903P687P933P572O399N310M553L571K627K683L479
$$ 248281 255738 264163 272690 280593 288280 296213 303785 310184 315494 320047 323618 326245 328928 332407
55692C32407L647K964K549K569J800k9j479j747j945l159m791n837o371o861p178
$$ 332407 336054 339018 341567 344136 345936 345907 344428 342681 340736 337577 332786 326949 320578 313717 306539
55677C06539p115o952o840o551o216o305o517n802l863j605K68J986L770N286
$$ 306539 299424 292472 285632 279081 272865 266560 260043 254241 250378 248773 249041 251027 254797 260083
55663B60083O465P741R108J0014J0450J1075J1927J2153J1332J0017Q613O814
$$ 260083 266548 274289 283397 293411 303861 314936 326863 339016 350348 360365 368978 375792
55651C75792M529K293L92j494l448n019o045o822p260o805n399l626j769K41J989
$$ 375792 380321 382614 383006 381512 378064 373045 367000 360178 352918 346113 340714 337088 335319 335560 337549
55636C37549K725K440J696L74k202n867r476j2266j4237j5232j5066j4566j4961
$$ 337549 340274 342714 344410 344784 342582 336715 327239 314973 300736 285504 270438 255872 240911
55623B40911j5915j5650j3462j0778r268r057r245r007p855n936m357m155m770
$$ 240911 224996 209346 195884 185106 175838 166781 157536 148529 140674 134738 130381 126226 121456
55610A21456m720l776l010k675j891o70l71j408k349k159j717k009k406j894q65
$$ 121456 116736 112960 109950 107275 105384 104714 104343 102935 100586 98427 96710 94701 92295 90401 89536
55595H9536l47m16n08n41p12q74q78r04q55k43P37J017J85p20o39J71R81J757
$$ 89536 89189 88773 88265 87724 87012 86138 85260 84356 83501 83258 83995 85012 85197 84477 83838 84009 84990 86747
55577H6747K683L322L280L035L288L989M645N054N154M752L983L403L257L180
$$ 86747 89430 92752 96032 99067 102355 106344 110989 116043 121197 125949 129932 133335 136592 139772
55563A39772K957K797K609J922Q78K65K19o5q63j363j136r62j461k123k530l297
$$ 139772 142729 145526 148135 150057 150935 151200 151419 151354 150491 149128 147992 147030 145569 143446 140916 137619
55547A37619m704n558m810l416l173m157m770m025k593j542j098r00p52p76j012
$$ 137619 132915 127357 122547 119131 115958 111801 107031 103006 100413 98871 97773 96873 96121 95345 94333
55532I4333j097m97P12J625J630J449K202L602M317M073M069N045O328P295Q316
$$ 94333 93236 92739 93451 95076 96706 98155 100357 103959 108276 112349 116418 121463 127791 135086 143402
55517A43402R600J0445J0548J0726J1410J1573J0279Q110O025L773O94k860o160
$$ 143402 153002 163447 173995 184721 196131 207704 217983 226093 232118 235891 236585 233725 227565
55504B27565r287j2357j4395j4435j3201j2269j1967j1409j0234q951p791o500
$$ 227565 218278 205921 191526 177091 163890 151621 139654 128245 118011 109060 101269 94769
55492I4769n256m650m719m866m711m274l579k781k430k738k925k254j297j205
$$ 94769 89513 84863 80144 75278 70567 66293 62714 59933 57503 54765 51840 49586 48289 47084
55478D7084j897k162j473o61o28j342k203k654k264r44O49J516J259L53n45j068
$$ 47084 45187 43025 41552 40891 40263 38921 36718 34064 31800 30856 31505 33021 34280 34633 34088 33020
55462C3020j115p82l99j84J7L82O94O54L91K36K12J03j57m76p33o55J1Q85J077
$$ 33020 31905 31123 30724 30540 30557 30939 31633 32287 32678 32914 33126 33229 33072 32596 31863 31208 31219 32104 33181
55443C3181L04n85o94j67K88M20L53L3n45r37p56k48K19O89J156J147M64j45L5
$$ 33181 33485 32900 32206 32039 32327 32747 33100 33133 32588 31651 30895 30647 30866 31555 32711 33858 34322 34177 34212
55424C4212N94P24N28N95P40L10m92q15n99p36j600k466k623k185j549q44k14
$$ 34212 34806 35530 36058 36653 37393 37703 37211 36396 35797 35061 33461 30995 28372 26187 24638 23794 23580
55407B3580R9K10N96J298J677J266M52l5K0K44J99j98o73q87q17p90j025j290
$$ 23580 23679 23889 24485 25783 27460 28726 29178 29143 29163 29407 29606 29408 28735 27848 27031 26241 25216 23926
55389B3926j180o35K3M00K78k51p57q36o34o61r55r25l23K06qo79j007p46l44
$$ 23926 22746 22111 22134 22534 22812 22561 21804 20968 20334 19673 18718 17793 17470 17676 17668 16989 15982 15236 14892
55370A4892j98l18n11n59l26L1J69J12L13R62J642J929J870J532P23m56j328j428
$$ 14892 14694 14376 13865 13306 12980 13011 13180 13292 13605 14567 16209 18138 20008 21540 22263 21807 20479 19051
55352A9051j061o70j99M77J052J331J576J814J452K76q55j094p90p27q35n58K1
$$ 19051 17990 17320 17121 17598 18650 19981 21557 23371 24823 25099 24244 23150 22360 21633 20798 20240 20261
55335B0261M21O77R96R67J68p53q32l25l41j011j239l65R40J682J553P78k20q82
$$ 20261 20682 21359 22355 23322 23490 22737 21905 21580 21239 20228 18989 18624 19564 21246 22799 23577 23357 22475
55317B2475q60m61k28j45J22M03K58r4J1N40O76L8p98j131q50k30L86O09L22j4
$$ 22475 21615 21154 20926 20781 20903 21306 21564 21470 21481 22021 22697 22735 21937 20806 19956 19726 20112 20721 21043 21029
55297B1029O4K95J24k96k88K49P77J054J268J318Q42Q5k16P4L32K77L01M81K84
$$ 21029 21093 21388 21512 21216 20928 21177 21954 23008 24276 25594 26436 26521 26305 26379 26711 26988 27289 27770 28054
55278B8054l98p91l84K41K98j03l55l25l59n61o95o51n56m66k33K40P55Q78L57
$$ 28054 27656 26865 26481 26722 27020 26917 26562 26237 25878 25317 24622 23971 23415 22949 22716 22956 23711 24589 24946
55259B4946m37p65l01N38J198J468J200J49j303j969j189Q0M06j82m55J29Q94
$$ 24946 24509 23744 23443 23981 25179 26647 27847 27996 26693 24724 23535 23615 24021 23839 23384 23513 24407
55242B4407J260J390J405J034L65k3m7l34j057j453j015l32j84m64o10n28m54
$$ 24407 25667 27057 28462 29496 29861 29838 29791 29457 28400 26947 25932 25600 25416 24952 24342 23814 23360
55225B3360l55j02P7j09m68n22j34L79O30M23k09r75j430j272o12J54O89J040
$$ 23360 23005 22903 22980 22871 22403 21881 21747 22126 22756 23179 22970 21995 20565 19293 18681 18835 19524 20564
55207B0564J596K478L020K312N05j033j330r55r27j052l88J014J949J642N68m28
$$ 20564 22160 24638 27658 29970 30475 29442 28112 27157 26230 25178 24790 25804 27753 29395 29963 29535
55191B9535r51r05l65K34M36M18O65J089J143P30J89m69j376j963j475l47J37
$$ 29535 28584 27679 27314 27548 27984 28402 29067 30156 31299 32029 32218 31749 30373 28410 26935 26588 26725
55174B6725k53l69M24J287J304P05L8p04j412j382m35M22L13j93m1P52J359J435
$$ 26725 26472 26103 26527 27814 29118 29823 29861 29157 27745 26363 25928 26350 26663 26470 26429 27181 28540 29975
55156B9975J214P75J9q76j602k049k048j313j74L51j90r24r26n48o24r65p07J98
$$ 29975 31189 31964 31983 31107 29505 27456 25408 24095 23921 24272 24082 23158 22232 21684 21060 20095 19388 19586
55138A9586R13R65O30J94k46l49K44J173J655J537J366J463J628J760K027K231
$$ 19586 20499 21464 22094 22288 22042 21693 21937 23110 24765 26302 27668 29131 30759 32519 34546 36777
55122C6777J826P68k27n74m37k84l27n70r68j288j226q90p27p95n86J37P53N41
$$ 36777 38603 39371 39144 38570 38133 37849 37522 36952 35984 34696 33470 32580 31853 31058 30472 30609 31362 31903
55104C1903k84p90n14P9L41K80L67P93J170J019L42l24m31P2O47O63P9m44k54
$$ 31903 31619 30829 30315 30394 30735 31015 31382 32175 33345 34364 34706 34382 33951 34023 34670 35333 35412 34968 34714
55085C4714M76R21N95j47p19r45q86m35L53Q36M11n15q50j70P61J040O12M3k99
$$ 34714 35190 36111 36706 36559 35840 34895 34009 33574 33927 34763 35174 34659 33809 33639 34400 35440 36052 36095 35796
55066C5796m41n41p29j041j295j176n97J49O17N92K21m9J51O18O69O7n03l34K23
$$ 35796 35355 34814 34085 33044 31749 30573 29976 30125 30742 31334 31555 31506 31657 32275 32944 33011 32508 32174 32397
55047C2397K74k04l05M35J409J938K046J984J681J141Q12J020J465J646J472J095
$$ 32397 32671 32467 32162 32597 34006 35944 37990 39974 41655 42796 43608 44628 46093 47739 49211 50306
55031E0306N85L9l43o03j069j757k076j496j75J257K170K066Q18q72j814j526
$$ 50306 50891 50930 50587 49984 48915 47158 45082 43586 43411 44668 46838 48904 49722 48850 47036 45510
55015D5510p42l59l96l83k80m07p44r05o96k80P5J80J6j47N9N92R49Q19M38J92
$$ 45510 44768 44409 44013 43630 43350 42943 42199 41294 40598 40318 40393 40573 40589 40442 40501 41093 42042 42861 43299 43491
54995D3491J62K80M69M32j60j012j237m62N80R62O63L73N68J197J912K249J906
$$ 43491 43653 43933 44402 44834 44674 43662 42425 41963 42543 43505 44168 44541 45109 46306 48218 50467 52373
54978E2373J175P57Q80J064J038J204J862K609L071L622M675N791O310O450O976
$$ 52373 53548 54305 55185 56249 57287 58491 60353 62962 66033 69655 74330 80121 86431 92881 99857
54963I9857Q055R245J0341J1548J2837J3857J4381J4331J3414J1287P992L808
$$ 99857 107912 117157 127498 139046 151883 165740 180121 194452 207866 219153 227145 230953
54951B30953j064o159j0447j3088j4299j4795j4638j3450j1571j0010r115q205
$$ 230953 229889 223730 213283 200195 185896 171101 156463 143013 131442 121432 112317 104112
54939A04112o804n452m819m681m268l266j999r09k15Q9K11M59R65J588K215K983
$$ 104112 97308 91856 87037 82356 78088 74822 72823 71914 71699 71788 71999 72458 73423 75011 77226 80209
54923H0209M077N403O636P534Q114Q623R325J0267J1176J1620J1324J0317Q753
$$ 80209 84286 89689 96325 103859 111973 120596 129921 140188 151364 162984 174308 184625 193378
54910A93378O620L742J43l693p092r742j1688j2808j2733j1604j0380r813r458
$$ 193378 199998 203740 203883 200190 193098 183356 171668 158860 146127 134523 124143 114330 104872
54897A04872q375o585n056m348m052l613k927k020r13k7J31j68j38K37J36o32
$$ 104872 96497 89912 84856 80508 76456 72843 69916 67896 66983 66956 67087 66919 66781 67018 67154 66522
54881F6522j176j028r39j431j727j122m02o80j532j709j158r15j249j274o38k42
$$ 66522 65346 64318 63379 61948 60221 59099 58697 58017 56485 54776 53618 52703 51454 50180 49542 49300
54865D9300r02k095k637k069j023m79p76j267j041j02N89M26j1N1M34N12L17K43
$$ 49300 48398 46303 43666 41597 40574 40095 39319 38052 37011 36909 37498 37924 37913 37964 38398 38910 39227 39470
54847C9470R7n98j564k012j739j194o08P9N67M33qj8M10N77L32L41R10J459J491
$$ 39470 39567 38969 37405 35393 33654 32460 31852 31931 32498 32931 32923 32905 33315 33892 34224 34565 35475 36934 38425
54828C8425J275J224J220J016Q00R49J570K392K915K692J880J385J911K981L544
$$ 38425 39700 40924 42144 43160 43960 44909 46479 48871 51786 54478 56358 57743 59654 62635 66179
54813F6179L445L560M446N722O911Q071R281J0183J0552J0836J1615J2757J3319
$$ 66179 69624 73184 77630 83352 90263 98334 107615 117798 128350 139186 150801 163558 176877
54800A76877J2253R193M887P31k415m886p325r492j0562j0400r784r319q817p886
$$ 176877 189130 198323 203210 203941 201526 196640 189315 179823 169261 158861 149077 139758 130941 123055
54786A23055o510m936l503k559k082j533o12J13Mm68k99N60J346K029L358N220
$$ 123055 116545 111609 108106 105547 103465 101932 101320 101433 101437 100969 100670 101230 102576 104605 107963 113183
54770A13183O382O408O567P954R829J0765J0660J0508J0733J0804J0259R157P643
$$ 113183 119565 125973 132540 140494 150323 161088 171748 182256 192989 203793 214052 223209 230852
54757B30852N731L483R18k155n733r238j1917j3548j4385j4663j4480j3912j2910
$$ 230852 236583 240066 240984 238829 233096 223858 211941 198393 184008 169345 154865 140953 128043
54744A28043j1306r257p466o483o058n609n075m816m752m248l023j696j151j541
$$ 128043 116737 107480 100014 93531 87473 81864 76789 71973 67221 62973 59950 58254 57103 55562
54730E5562k116k048j265m55l35r58j705j839j091P8P76M40n37j143p82J80R74
$$ 55562 53446 51398 50133 49678 49343 48385 46680 44841 43750 43828 44604 45044 44507 43364 42582 42762 43736
54713D3736J172Q24L20L20J200K328K448J329K73L50Q65N21n10r18l00M13N24
$$ 43736 44908 45732 46052 46372 47572 49900 52348 53677 53950 54300 55165 55686 55176 54258 53958 54371 54895
54696E4895L36K43J68J93O34J217J103J10q80j031l85N90J476J856J586J260J597
$$ 54895 55231 55474 55642 55835 56469 57686 58789 58899 58019 56988 56603 57193 58669 60525 62111 63371 64968
54679F4968K304K487K153K113K361J988R38L80Q17J291J156J150J812K289J869
$$ 64968 67272 69759 71912 74025 76386 78374 79312 79692 80509 81800 82956 84106 85918 88207 90076
54664I0076J464K218L766N133O406Q039R362R357Q384P628P308O792O025N314
$$ 90076 91540 93758 97524 102657 109063 117102 126464 135821 144205 151833 159141 165933 171958 177272
54650A77272M046J244k615n781p384q068q457q319p534o668o171n979o112o714
$$ 177272 181318 182562 179947 174166 166782 158714 150257 141938 134404 127736 121565 115586 109474 102760
54636A02760p239o680m994l340k523k140j595j063q66p92o04n42p06o01Q1P60
$$ 102760 95521 88841 83847 80507 77984 75844 74249 73186 72320 71528 70924 70382 69676 69075 69156 69916
54620F9916P21J17l47l96l12k86k96m07p94j392j916k139k014j644j271j102j027
$$ 69916 70637 70754 70407 70011 69699 69413 69117 68710 67916 66524 64608 62469 60455 58811 57540 56438 55411
54603E5411p24j91J71J13p6j4K59M83O45R04J228J362J069K68r21k011k351j723
$$ 55411 54687 54496 54667 54780 54704 54690 54949 55432 56077 56981 58209 59571 60640 60908 59987 57976 55625 53902
54585E3902o99o6r6m91q90j059q37l06N8j18n17m88k3K17or6K95M76k19j137j049
$$ 53902 53203 53137 53041 52550 51660 50601 49764 49458 49516 49398 48881 48393 48370 48587 48581 48485 48780 49256 49037 47900 46851
54564D6851kP29O15O14J406K161J853R81P94J465K176K653L245L666L083J665
$$ 46851 46849 47578 48193 48807 50213 52374 54227 55208 56002 57467 59643 62296 65541 69207 72290 73955
54548G3955P76J123J914K351K881M095N326N389M192K665J388J36j348k876m098
$$ 73955 74731 75854 77768 80119 83000 87095 92421 97810 102002 104667 106055 106191 104843 101967 97869
54533I7869m752m678m063l517l555m008m315m211l854l405k831j988p99N20J364
$$ 97869 93117 88439 84376 80859 77304 73296 68981 64770 60916 57511 54680 52692 51893 52413 53777
54518E3777J249M99rL6R5k01m29k20j2l13p84p19j13M43N97M05k3m37l52L70J147
$$ 53777 55026 55525 55516 55552 55647 55446 55017 54797 54785 54472 53688 52969 52856 53299 53896 54301 54278 53841 53489 53859 55006
54497E5006J417J414J613J821J558R66N45K53l02r31j025o15l97o67r46p92l58
$$ 55006 56423 57837 59450 61271 62829 63795 64340 64593 64291 63360 62335 61720 61323 60656 59710 58918 58560
54480E8560k9J7k43o96j034j054r24q11n02J36O34M95J4j40M4O7j11j26q2m17
$$ 58560 58531 58548 58305 57609 56575 55521 54597 53786 53284 53420 54054 54549 54563 54423 54467 54534 54423 54297 54215 53798
54460E3798q94o71L76J271J193M64o2L0N34R83R15K84l32l30J13L41J52j31m00
$$ 53798 52904 52233 52609 53880 55073 55537 55475 55505 56039 57022 57937 58221 57889 57559 57672 58013 58165 58034 57634
54441E7634p29p54l0Q91Q47k38j019n84L36N65P3l57l67j71O7L74O38P41P81Q47
$$ 57634 56905 56151 56121 57012 57859 57621 56602 56018 56354 56919 56992 56635 56268 56097 56164 56538 57176 57917 58698 59545
54421E9545Q31P32Q12J168J552J812K086K286J950R97J27O2P44J598K182K227
$$ 59545 60376 61108 61920 63088 64640 66452 68538 70824 72774 73771 73898 73960 74704 76302 78484 80711
54405H0711J569N03k06j94l8m55j308j884j839j381p80k41n5l92r64j272j102
$$ 80711 82280 82783 82577 82383 82345 81890 80582 78698 76859 75478 74698 74457 74402 74010 73046 71774 70672
54388G0672n95m7J75j91q73j168p92l65o00j309j610j025L9Q03Q16K76j67p7K26
$$ 70672 70077 70030 70205 70014 69141 67973 67181 66816 66216 64907 63297 62272 62311 63114 63930 64206 64039 63962 64188
54369F4188J05l85m13M30J458J764J280N53nj16N34J734K523K230J407R65Q40
$$ 64188 64293 63908 63495 63925 65383 67147 68427 68980 68975 68859 69393 71127 73650 75880 77287 78252 79092
54352G9092L99j60QQ51J253N94m80j218j687k066j970j178l51j89l63j41L25J59
$$ 79092 79491 79331 79339 80190 81443 82037 81557 80339 78652 76586 74616 73438 73087 72898 72535 72394 72719 72878
54334G2878q11j685j725j302j238j657j965j720j144p38p07q78j092j381j799
$$ 72878 72067 70382 68657 67355 66117 64460 62495 60775 59631 58893 58186 57308 56216 54835 53036
54319E3036k131k047j488p45o1O00J316J841J820J241M64k02p76j360j876k123
$$ 53036 50905 48858 47370 46625 46564 47164 48480 50321 52141 53382 53846 53644 52868 51508 49632 47509
54303D7509j966j357l59P12J351J282P60K71O4J31M70J027J463J377Q29K92L5
$$ 47509 45543 44186 43827 44539 45890 47172 47932 48203 48267 48398 48868 49895 51358 52735 53564 53856 53891
54286E3891r3k25k09qP9j23l44l17k05k13j67J10K86L0k61J10J078J853J938J544
$$ 53891 53798 53573 53364 53356 53435 53312 52968 52651 52446 52233 52066 52176 52462 52492 52231 52341 53419 55272 57210 58754
54266E8754R54K22m02n14k67k97o70o26J33O80J20r30j071o1R37J044O62N07N02
$$ 58754 59708 59930 59528 59014 58747 58450 57780 57154 57287 57967 58087 57157 56086 56025 56962 58006 58668 59175 59677
54247E9677J80l57n58l12r9j92k72j2K85J9q53j647j703j025j27N58R61J114R56
$$ 59677 59857 59500 58942 58630 58531 58339 58067 58055 58340 58359 57506 55859 54156 53131 53004 53562 54523 55637 56593
54228E6593M81l9k16M5L70L60J09J02M73O83K53m36n75r7K14q4l68J30J195J869
$$ 56593 57074 57035 56819 56864 57234 57594 57703 57805 58278 58961 59214 58778 58203 58106 58320 58236 57868 57998 59193 61062
54208F1062J644Q86K65J57M65P48N70K5l38l02l58r00j420j166l43L0n45j502
$$ 61062 62706 63592 63857 64014 64479 65227 65797 65822 65484 65182 64824 63924 62504 61338 60995 61025 60480 58978
54190E8978k069k138k116k286k473k197j217l6M63J10k41O4N13L17k76m84l46
$$ 58978 56909 54771 52655 50369 47896 45699 44482 44446 44909 45019 44778 44842 45355 45672 45396 44912 44566
54173D4566n30r99j079p81p98j084o76O69J830J853J103L86o4j82L28J206J390
$$ 44566 44036 43037 41958 41177 40379 39295 38619 39288 41118 42971 44074 44460 44396 44214 44542 45748 47138
54156D7138L96p90j004m59j46l92p79r74q09n0J081J618R98j4l38n5K0k58m08
$$ 47138 47534 46744 45740 45281 45135 44743 43964 42990 42181 42131 43212 44830 45828 45814 45476 45421 45441 45183 44775
54137D4775m03n55o16p1P53R31L62j12l6J59J58K77O12N74k15j191j475q75R1
$$ 44775 44372 43817 43201 43130 43883 44814 45176 45064 45028 45187 45345 45622 46234 46808 46593 45402 43927 43052 43143
54118D3143Q04R44N69K3m15p24q68n99L0L73l7o26n20J10L33j2j05M12Q83R07
$$ 43143 43947 44891 45460 45483 45068 44344 43476 42877 42907 43280 43243 42617 42097 42207 42540 42528 42423 42835 43718 44625
54098D4625J069J777K274J665L19o25p23l99L4O62J354J610J213M88j90p09r80
$$ 44625 45694 47471 49745 51410 51729 51104 50381 49982 50016 50678 52032 53642 54855 55343 55153 54444 53464
54081E3464p99k16K73J79m28r73j010o38k68n5K20P23J203J315J198J414K168
$$ 53464 52665 52449 52722 52901 52473 51500 50490 49852 49584 49529 49749 50472 51675 52990 54188 55602 57770
54064E7770K902K807J728L98k20J36Q11R28L66j28M5N04M05l59r37o06K89P94
$$ 57770 60672 63479 65207 65605 65385 65521 66332 67260 67626 67498 67543 68047 68452 68093 67156 66550 66839 67633
54046F7633N43J60M53J423K261K353K040K103K639K923K537K055K257L049L713
$$ 67633 68176 68336 68789 70212 72473 74826 76866 78969 81608 84531 87068 89123 91380 94429 98142
54031I8142L929L887L673L220K821K903L219K998K119J411J423J652J463J166
$$ 98142 102071 105958 109631 112851 115672 118575 121794 124792 126911 128322 129745 131397 132860 134026
54017A34026J400J897J707N81o59j270j480j950k873l871m539m703m358l657k937
$$ 134026 135426 137323 139030 139611 138952 137682 136202 134252 131379 127508 122969 118266 113908 110251 107314
54002A07314k494k308k176k036j977j897j533r30o07r63j622j763j109k46J04
$$ 107314 104820 102512 100336 98300 96323 94426 92893 91963 91356 90393 88771 87008 85899 85653 85757
53987H5757j80p34j196j378j227r25q52j160j471j294o55n1J54K6k64o54j056
$$ 85757 85577 84843 83647 82269 81042 80117 79265 78105 76634 75340 74685 74634 74788 74814 74550 73896 72840
53970G2840j128n11O77J685J674O13n57r07m98m8J89N89J173J289O97J88M92J127
$$ 72840 71712 71201 71878 73563 75237 75850 75293 74386 73888 73840 74029 74618 75791 77080 77777 77965 78457 79584
53952G9584J143O38O19J530K745L516L701L428K904K622L131M266N209N589N933
$$ 79584 80727 81365 81984 83514 86259 89775 93476 96904 99808 102430 105561 109827 115036 120625 126558
53937A26558O692P397P183N836L923K195J117O99M64j88j267k035j791o89L98
$$ 126558 133250 140647 147830 153666 157589 159784 160901 161600 162064 161876 160609 158574 156783 156094 156492
53922A56492P47M04J01N97J896L101L318K687K221K559L294L663L537L436L828
$$ 156492 157239 157643 157744 158341 160237 163338 166656 169343 171564 174123 177417 181080 184617 188053 191881
53907A91881M565M984M459L074J685J081J140J110O04j36q90j735k622l253l578
$$ 191881 196446 201430 205889 208963 210648 211729 212869 213979 214583 214447 213557 211822 209200 205947 202369
53892B02369l884m230m384m494n090o035o277n251l915l568m064m100l126k041
$$ 202369 198485 194255 189871 185377 180287 174252 167975 162724 158809 155241 151177 147077 143951 141910
53878A41910j841k360k704k525k368k799l524l632k734j592j262j776k204k058
$$ 141910 140069 137709 135005 132480 130112 127313 123789 120157 117423 115831 114569 112793 110589 108531
53864A08531j918k418l190l390k794j878j148q75j162j728j930j523j056j054
$$ 108531 106613 104195 101005 97615 94821 92943 91795 90920 89758 88030 86100 84577 83521 82467
53850H2467j183r10n27o48j031r03k87k3l83p43p75q94j226j110k24P36J091J111
$$ 82467 81284 80374 79847 79199 78168 77265 76978 76955 76572 75829 75054 74160 72934 71824 71600 72336 73427 74538
53832G4538J288J387J024N61N02N38J08m85m74P3M07M12O94J237J147P6j000r98
$$ 74538 75826 77213 78237 78798 79300 79838 79946 79461 78987 79060 79467 79879 80573 81810 82957 83033 82033 81035
53814H1035JJ208K184K824K848K126J188P79R82J366J791K486L354L873L752L233
$$ 81035 81036 82244 84428 87252 90100 92226 93414 94193 95175 96541 98332 100818 104172 108045 111797 115030
53798A15030K725K460K546K912L185K987K462K091K021J895J446P83M8p42j328
$$ 115030 117755 120215 122761 125673 128858 131845 134307 136398 138419 140314 141760 142543 142591 141849 140521
53783A40521j254n85j23m73j303j878k081k332k780l052k857k412k157k299k671
$$ 140521 139267 138682 138559 138086 136783 134905 132824 130492 127712 124660 121803 119391 117234 114935 112264
53768A12264k902k727k238j776j514j340j227j375j785j985j613r61n75n09m06
$$ 112264 109362 106635 104397 102621 101107 99767 98540 97165 95380 93395 91782 90821 90246 89737 89331
53753H9331k04k10n33r07j137j266j281j093q99j074j581j895j702j261q69l90
$$ 89331 89127 88917 88384 87477 86340 85074 83793 82700 81801 80727 79146 77251 75549 74288 73419 73029
53737G3029L56J032J074L92n74j359j797j855j518q64j46L35L91O8l06k65L21
$$ 73029 73385 74417 75491 75883 75309 73950 72153 70298 68780 67916 67770 68105 68496 68564 68258 67993 68314
53720F8314J001J144O76K25L09O35M47m03j144j030k84K67K85J83L48O73R30J135
$$ 68314 69315 70459 71135 71360 71669 72304 72751 72348 71204 70174 69890 70157 70442 70625 70973 71646 72576 73711
53702G3711J272J155Q60Q71J384J813J479N78QL33J319K328K777K376J367N01
$$ 73711 74983 76138 76998 77869 79253 81066 82545 83123 83131 83464 84783 87111 89888 92264 93631 94132
53686I4132L12M91L84j6o0O01J567K246K406K112J550R87O59N47N25O57R57J029
$$ 94132 94444 94935 95319 95303 95243 95844 97411 99657 102063 104175 105725 106712 107371 107918 108443 109100 110057 111086
53668A11086M53m18o28K31J443J988J564O33k36p52q85p25m16j34r1l42n79l68
$$ 111086 111539 111121 110493 110724 112167 114155 115719 116352 116116 115364 114479 113754 113338 113204 113113 112771 112192 111824
53650A11824K27N99M52K54M50O43K71l32l51K42O92O23L27m1o13j082q03O5N20
$$ 111824 112051 112650 113102 113356 113806 114449 114720 114388 114037 114279 114971 115594 115921 115880 115267 114185 113382 113447 113967
53631A13967J60k15Q8N96N72K31K60O88R59Q38O20N79P28R64J091Q87M24R3J52
$$ 113967 114127 113912 114000 114596 115168 115399 115659 116347 117306 118144 118764 119343 120071 121035 122126 123013 123437 123530 123682
53612A23682M45P55J039J196J030O26L76M78Q10J304J884K096J575Q89R84J685
$$ 123682 124127 124882 125921 127117 128147 128773 129149 129627 130437 131741 133625 135721 137296 138185 139169 140854
53596A40854J846J280J257K398L408K907J547R82J535K174K285K126J846J361
$$ 140854 142700 143980 145237 147635 151043 153950 155497 156479 158014 160188 162473 164599 166445 167806
53582A67806J074J493K131J898P13k81k42M36R61J033P48K44j77k07L4J21n1j80
$$ 167806 168880 170373 172504 174402 175115 174834 174592 175028 175989 177022 177770 178014 177837 177630 177664 177785 177734 177554
53564A77554j18J0J98N46Q31O31o6p66j076j011q11p34r27j098o50M75J407J386
$$ 177554 177436 177446 177644 178190 179021 179652 179586 178820 177744 176733 175922 175188 174261 173163 172513 172988 174395 175781
53546A75781P98N50O97N80K3m79o93q26q40m72J3j1n01p06l51K3kk13l40l89j66
$$ 175781 176579 177129 177826 178406 178429 177950 177257 176431 175591 175119 175132 175121 174620 173914 173563 173586 173584 173371 173031 172642 172476
53525A72476O70J833K514K521K493K710K617J978J573K082L027L573L711L964
$$ 172476 173146 174979 177493 180014 182507 185217 187834 189812 191385 193467 196494 200067 203778 207742
53511B07742M383M638M797N221N919O546O951P244P422P416P394P657Q251Q891
$$ 207742 212125 216763 221560 226781 232700 239246 246197 253441 260863 268279 275673 283330 291581 300472
53497C00472R265R262R112R283J0072J1189J2096J2674J3164J3463J3203J2576
$$ 300472 309737 318999 328111 337394 347466 358655 370751 383425 396589 410052 423255 435831
53485D35831J2351J2722J2966J2705J2680J3571J4729J5013J4452J4068J4293
$$ 435831 448182 460904 473870 486575 499255 512826 527555 542568 557020 571088 585381
53474E85381J4572J4505J4368J4275J3769J2734J1976J2237J3011J3109J2246
$$ 585381 599953 614458 628826 643101 656870 669604 681580 693817 706828 719937 732183
53463G32183J1336J1172J1403J1222J0620J0302J0519J0603R895Q639P545O780
$$ 732183 743519 754691 766094 777316 787936 798238 808757 819360 829255 837894 845439 852219
53451H52219N873M447K619P34r33k264l391m657o147p401p955q074q432r186r758
$$ 852219 858092 862539 865158 865892 864959 862695 859304 854647 848500 841099 833144 825070 816638 807452 797694
53436G97694r682r143q728q958r996j1360j2021j1401j0247r889j0575j1299j1326
$$ 797694 788012 778869 770141 761183 751187 739827 727806 716405 706158 696269 685694 674395 663069
53423F63069j1051j1030j0980j0294r008p644o467n352m107k640j119j13j24p83
$$ 663069 652018 640988 630008 619714 610706 603062 596595 591243 587136 584496 583377 583264 583140 582357
53409E82357j025l18Q70K017L246M623N611N809N712O039O769P458Q077Q847R690
$$ 582357 581332 581014 581884 583901 587147 591770 597381 603190 608902 614941 621710 629168 637245 646092 655782
53394F55782J0462J1426J2796J4101J4748J4917J5289J6135J7231J8413J9580
$$ 655782 666244 677670 690466 704567 719315 734232 749521 765656 782887 801300 820880
53383H20880K0543K1466K3036K5396K7397K7880K7399K7543K8731K9874L0234
$$ 820880 841423 862889 885925 911321 938718 966598 993997 1021540 1050271 1080145 1110379
53372A110379L0335L0761L1271L1607L2051L2524L2129L0406K8293K6981K6365
$$ 1110379 1140714 1171475 1202746 1234353 1266404 1298928 1331057 1361463 1389756 1416737 1443102
53361A443102K5556K4382K3402K2671K1535J9710J7673J5847J4027J1979R909
$$ 1443102 1468658 1493040 1516442 1539113 1560648 1580358 1598031 1613878 1627905 1639884 1649793
53350A649793P925N534K196j861n941r868j4117j8789k2957k5443k6134k6086
$$ 1649793 1657718 1663252 1665448 1663587 1657646 1647778 1633661 1614872 1591915 1566472 1540338 1514252
53338A514252k6408k7360k8511k9338k9419k8542k7006k5616k4922k4602k4025
$$ 1514252 1487844 1460484 1431973 1402635 1373216 1344674 1317668 1292052 1267130 1242528 1218503
53327A218503k3286k3128k3816k4651k4876k4589k4382k4403k4236k3615k2765
$$ 1218503 1195217 1172089 1148273 1123622 1098746 1074157 1049775 1025372 1001136 977521 954756
53316I54756k1924k0904j9324j7125j4669j2415j0607r280q343p623p011o644
$$ 954756 932832 911928 892604 875479 860810 848395 837788 828508 820165 812542 805531 798887
53304G98887o797p484q254q637q721r016r734j0411j0361r341p699o103n145m894
$$ 798887 792090 784606 776352 767715 758994 749978 740244 729833 719472 710131 702432 696329 691184 686290
53290F86290m706l733j908j59O20N67N63J186K337L715N154O434P271P614P818
$$ 686290 681584 677851 675943 675784 676404 676971 677534 678720 681057 684772 689926 696360 703631 711245 719063
53275G19063Q387R601J1348J3066J4004J3806J2909J2103J1727J1582J1474J1433
$$ 719063 727450 737051 748399 761465 775469 789275 802184 814287 826014 837596 849070 860503
53263H60503J1321J0746R590Q331P529P193O881O234N195L895K608J632Q84k42
$$ 860503 871824 882570 892160 900491 908020 915213 922094 928328 933523 937418 940026 941658 942542 942300
53249I42300k285m950p308q844r979j1369j3050j4476j5339j5910j6582j7372
$$ 942300 940015 935065 927757 918913 908934 897565 884515 870039 854700 838790 822208 804836
53237H04836j7969j8110j7746j7003j6083j5147j4172j3017j1770j0867j0709
$$ 804836 786867 768757 751011 734008 717925 702778 688606 675589 663819 652952 642243
53226F42243j1205j1868j2432j3111j4168j5376j6013j5529j4114j2591j1622
$$ 642243 631038 619170 606738 593627 579459 564083 548070 532541 518427 505836 494214
53215D94214j1106j0512r695r072q885q708p939o539n000l795l193l343m101m954
$$ 494214 483108 472596 462901 453829 444944 436236 428297 421758 416758 412963 409770 406427 402326 397372
53201C97372n516n972o619p173p199p053p569q752r606r508r008q827q818q461
$$ 397372 391856 385884 379265 372092 364893 357840 350271 341519 331913 322405 313397 304570 295752 287291
53187B87291p763p047o257n256m483m625n653o813p443p400o756n739m918m912
$$ 287291 279528 272481 266224 260968 256485 251860 246207 239394 231951 224551 217795 212056 207138 202226
53173B02226n650o328o236n407m403l694l366l219l029k716k292j712j022n70
$$ 202226 196576 190248 184012 178605 174202 170508 167142 163923 160894 158178 155886 154174 153152 152582
53159A52582p63j488k111k312k413k694k798k369j802j710j921j706r30k52j40
$$ 152582 151819 150331 148220 145908 143495 140801 138003 135634 133832 132122 130201 128495 127565 127313 127173
53144A27173k92k65r4J3J15L63N56L42k39o51m74K6R2n98j432j582j095q00j089
$$ 127173 126881 126616 126522 126535 126650 127013 127569 127911 127672 127021 126547 126573 126665 126067 124635 123053 121958 121158 120069
53125A20069j454j462j432j632j538o66L72N89P7j88J82O82J016J453J905J756
$$ 120069 118615 117153 115721 114089 112551 111885 112257 112846 112923 112735 112917 113599 114615 116068 117973 119729
53109A19729R31K07j4l90j435k417k297j259m49l76m62j17M13N39J84k19l52l11
$$ 119729 120660 120867 120853 120463 119028 116611 114314 113055 112606 112230 111768 111651 112064 112603 112787 112568 112216 111905
53091A11905k79j55K52O79N00m17j277j274o38k47l33l71j92k89p78r29k54O71
$$ 111905 111626 111471 111723 112402 112902 112485 111208 109934 109296 109049 108716 108345 108153 107864 107086 106157 105903 106574
53073A06574J051J008J136J430J413J131J134J575J948J807J208M43j77k77K04
$$ 106574 107625 108633 109769 111199 112612 113743 114877 116452 118400 120207 121415 121858 121681 121404 121608
53058A21608O49K89o95j278r30l23k69n32l19L81O04l09j780k622k291j243k42
$$ 121608 122257 122546 121851 120573 119643 119320 119051 118519 118200 118581 119185 118876 117096 114474 112183 110940 110698
53041A10698M07Q52J152J072L87o00j162p31N45J902K596K387J509L70o12r79
$$ 110698 111105 111957 113109 114181 114568 113968 112806 112075 112620 114522 117118 119505 121014 121384 120772 119793
53025A19793m37P20J618J539O91l7p6K53L15M8l8L59Q99J020N81p2n20n76k96
$$ 119793 119356 120076 121694 123233 123924 123887 123811 124064 124379 124427 124389 124748 125647 126667 127248 127176 126656 126080 125784
53006A25784Q9K92K25J86N25J101J291P62l1l80j45K56N07O54P80Q38Q79J007
$$ 125784 125873 126165 126390 126576 127101 128202 129493 130255 130224 129844 129699 129955 130462 131116 131896 132734 133613 134620
52988A34620J091R17O75Q17J250J279N84k24m22m1M88J082J783K155J700P40K17
$$ 134620 135711 136628 137303 138120 139370 140649 141233 141009 140587 140546 141034 142116 143899 146054 147754 148494 148711
52971A48711N92J435K130K433K327J799R72J11n88r89q54q5R12J511J510J191
$$ 148711 149303 150738 152868 155301 157628 159427 160399 160510 159922 158933 158079 157994 158906 160417 161927 163118
52955A63118Q23N75P14J313J773J338J88o11m89l4Pk55l21k14l40o68p18k66L66
$$ 163118 163941 164516 165230 166543 168316 169654 169842 169231 168742 168708 168715 168460 168139 167925 167585 166917 166199 165933 166299
52936A66299P32O59K32k91n80m35jL75N32O45R54J438J748J576J070P72J012J517
$$ 166299 167031 167690 167922 167631 167051 166616 166615 166990 167522 168167 169121 170559 172307 173883 174953 175725 176737 178254
52918A78254J754J541J054M38k92r38j143q27l49j55l56p37j027j171j400j907
$$ 178254 180008 181549 182603 183041 182749 181811 180668 179841 179492 179337 178981 178244 177217 176046 174646 172739
52902A72739k449k581k337k285k598k653j998j178r20r61n53K20O04M72L64L22
$$ 172739 170290 167709 165372 163087 160489 157836 155838 154660 153740 152779 152226 152446 153050 153522 153886 154208
52886A54208j98j096j449r29l52l73n76l97m4J03J61K47J54O5O92J996K760K294
$$ 154208 154010 152914 151465 150536 150184 149811 149235 148838 148794 148897 149058 149305 149459 149524 150216 152212 154972 157266
52868A57266J593J658J607m6k800m536m327l309k685k297j756j538k141k948k889
$$ 157266 158859 160517 162124 162078 159278 154742 150415 147106 144421 142124 140368 138830 136689 133741 130852
52853A30852j821o02on3l28n49p90j241j785j915j308l49K15J33k50o34j086j678
$$ 130852 129031 128429 128423 128370 128042 127493 126703 125462 123677 121762 120454 120105 120320 120453 120203 119569 118483 116805
52835A16805k239k621k857k931k716k277j890j664j380q66k38L49R15J441J650
$$ 116805 114566 111945 109088 106157 103441 101164 99274 97610 96230 95364 95126 95475 96390 97831 99481
52820I9481J332P15L13L72O80R12J042J227J372J101L25l59k66M44R06P30N39
$$ 99481 100813 101528 101841 102213 102893 103805 104847 106074 107446 108547 108872 108513 108247 108691 109597 110327 110866
52803A10866J064K110K862K932K650K405K156J642P91j24o25l95L37R34R77O22
$$ 110866 111930 114040 116902 119834 122484 124889 127045 128687 129478 129354 128729 128334 128671 129605 130582 131204
52787A31204K45kk26o12j334k237k586j662J30J372J235L99m2mm1k03r4K06K32
$$ 131204 131449 131447 131221 130609 129275 127038 124452 122790 122920 124292 125527 125926 125884 125880 125839 125636 125542 125748 125980
52768A25980l4j57p6j61m37m87j98Qj94o88j252j754j970j766j347r44l78M88
$$ 125980 125946 125789 125713 125552 125115 124628 124430 124438 124244 123556 122304 120550 118580 116814 115467 114523 114145 114633
52750A14633J136R34J85k12j02j29m30l06M28P81q9j607k466k105r52L40J278
$$ 114633 115769 116703 116888 116676 116574 116445 116015 115709 116137 116918 116829 115222 112756 110651 109699 110039 111317
52733A11317J503J067O20Q51J742K586K706K067J304J212J936K698K581J631P84
$$ 111317 112820 113887 114507 115358 117100 119686 122392 124459 125763 126975 128911 131609 134190 135821 136605
52718A36605P42J390K305L137L407K699J437P30R75J216N19o32j103q42q10j352
$$ 136605 137347 138737 141042 144179 147586 150285 151722 152452 153427 154643 155162 154530 153427 152585 151775 150423
52702A50423j590p85N10J140Q29L74M99R91J188R29O77P37R11J041J395K122K645
$$ 150423 148833 148048 148558 149698 150527 150901 151400 152391 153579 154508 155185 155922 156833 157874 159269 161391 164036
52685A64036K255J129J72j07kJ03J22j42r84k108k603k110j447j574k393l062
$$ 164036 166291 167420 167592 167485 167483 167586 167708 167566 166582 164474 161871 159761 158314 156740 154347 151285
52669A51285l115k744k285j933j777j684j288m60L82O89L73k70r41j364j267p04
$$ 151285 148170 145426 143141 141208 139431 137747 136459 135999 136381 137070 137443 137173 136232 134868 133601 132897
52653A32897j11K39N79J095J501J544J554J871K057J471M23J5O40J367J107n9
$$ 132897 132786 133025 133604 134699 136200 137744 139298 141169 143226 144697 145120 145135 145775 147142 148249 148190
52637A48190j068j161n94j87l98r61j332j291r87o31l66l96p77j140j049p05p74
$$ 148190 147122 145961 145367 145180 144782 143821 142489 141198 140211 139580 139214 138818 138041 136901 135852 135147 134373
52620A34373j373j784j530j052q66o36J71J143J320N76j98l11p4j59o88j145r04
$$ 134373 133000 131216 129686 128634 127768 127132 127303 128446 129766 130342 130144 129833 129759 129600 128912 127767 126863
52603A26863J79J508K140J679O63j45n39o46l58L81J046R94L53k13n12q71j270
$$ 126863 127042 128550 130690 132369 133032 132887 132348 131702 131344 131725 132771 133765 134118 133905 133393 132522 131252
52586A31252j279r26q10j084j128n98o9j45n26n27q9L17M25L01j8n30j018j190
$$ 131252 129973 129047 128237 127153 126025 125427 125358 125213 124687 124160 124071 124388 124813 125114 125096 124566 123548 122358
52568A22358j028p43n30n36q55j301j460j237j102j404j741j407l54P32J210J039
$$ 122358 121330 120587 120057 119521 118666 117365 115905 114668 113566 112162 110421 109014 108660 109392 110602 111641
52552A11641N61J79J71N23Q43O99J45l66n41n60p37j115j474j564j311q53m17
$$ 111641 112202 112381 112552 113075 113918 114617 114762 114396 113855 113295 112558 111443 109969 108405 107094 106241 105824
52535A05824q8K18M68L41l71j252j514q68J38P56Q28O85M89Nq85j793k121j675
$$ 105824 105736 105954 106422 106763 106392 105140 103626 102758 102896 103652 104480 105165 105654 105659 104774 102981 100860 99185
52517I9185q04P1Q13J425J719J427O66j4k04j11k25o00p58l50L58Q33Q99P88O56
$$ 99185 98381 98452 99265 100690 102409 103836 104502 104488 104284 104173 103948 103348 102590 102240 102598 103431 104330 105118 105774
52498A05774L72k06r37j545j816j629r67j20L68K19j63j75J66K45k64r16j073
$$ 105774 106146 105940 105003 103458 101642 100013 99046 98926 99294 99513 99350 99175 99341 99586 99322 98406 97333
52481I7333p03k41N4K82N56Q12R81J140J363J578J562J073J04q77j223q58n40
$$ 97333 96630 96389 96443 96725 97281 98093 99074 100214 101577 103155 104717 105790 105894 105017 103794 102936 102396
52464A02396r59j776j993j258l30j04o18j308j760j890j606p85L81J386J789J545
$$ 102396 101437 99661 97668 96410 96080 95976 95358 94050 92290 90400 88794 88009 88390 89776 91565 93110
52448I3110R32L32J3J8J89L81N58P51R57J190J418J418Q91r8r77j187p79k67n
$$ 93110 94042 94374 94387 94405 94594 94975 95533 96284 97241 98431 99849 101267 102158 102060 101083 99896 99117 98850 98845
52429I8845R1K31M72P80J078J152P68K8n04l65K42O09K66n20j050r33m29j69m69
$$ 98845 98936 99167 99639 100419 101497 102649 103417 103445 102941 102576 102818 103427 103693 103173 102123 101190 100761 100592 100123
52410A00123j014j151n83L17Q93Q95P00P98J224J531J339O98l1n01n59l22j41
$$ 100123 99109 97958 97375 97692 98585 99480 100180 100978 102202 103733 105072 105770 105739 105238 104679 104357 104216
52393A04216l39p93r54n29J8N8k36l4Q71J606J411P66O93J249J472Q52Ml06r8
$$ 104216 103877 103084 102130 101601 101619 101677 101441 101407 102278 103884 105295 106061 106754 108003 109475 110327 110331 110025 109927
52374A09927K37O41J173J559J595J633J970K094J302j0o11j18M63K23m41n80q2
$$ 109927 110164 110805 111978 113537 115132 116765 118735 120829 122131 122121 121510 121392 121855 122078 121637 121057 120975
52357A20975N13J013J648K257K283J598P18P5l34n10k10N73J357J768J981K293
$$ 120975 121488 122501 124149 126406 128689 130287 131005 131080 130746 130236 130026 130599 131956 133724 135705 137998
52341A37998K565K445J900J147L26m09o17M4J212J978J821J085M68L04N17R64
$$ 137998 140563 143008 144908 146055 146381 145972 145355 145399 146611 148589 150410 151495 151963 152267 152784 153748
52325A53748J518J981K183K221K379K728L025L098L175L636M460N171N417N403
$$ 153748 155266 157247 159430 161651 164030 166758 169783 172881 176056 179692 184152 189323 194740 200143
52311B00143N632O229O735O562N617M475L947M366N252N827N902O037O665P368
$$ 200143 205775 212004 218739 225301 230918 235393 239340 243706 248958 254785 260687 266724 273389 280757
52297B80757P375O673O076O194O803P456Q186R200J0246J0797J0816J0811J1055
$$ 280757 288132 294805 300881 307075 313878 321334 329520 338720 348966 359763 370579 381390 392445
52284C92445J1167J0684R825R352R718J0576J1192J1216J0878J0514J0152R704
$$ 392445 403612 414296 424121 433473 443191 453767 464959 476175 487053 497567 507719 517423
52272E17423R280R002Q598P669O398N542N484N604N049L865K957K949L530L959
$$ 517423 526703 535705 544303 551972 558370 563912 569396 575000 580049 583914 586871 589820 593350 597309
52258E97309L851L278K458J604R66P03P16P29N19R1l45m56N9J200K539L480L802
$$ 597309 601160 604438 606896 608500 609466 610169 610885 611614 612133 612224 611879 611423 611482 612682 615221 618701 622503
52241F22503L890M296N103N842O122O189O719P986R463J0370J0533J0502J0778
$$ 622503 626393 630689 635792 641634 647756 653945 660664 668650 678113 688483 699016 709518 720296
52228G20296J1080J0691R454Q192P889Q589R409R500Q782P679O601N784N308M961
$$ 720296 731376 742067 751521 759713 767602 776191 785600 795100 803882 811561 818162 823946 829254 834215
52214H34215M371L566L081L149L080K004R1j577k401k955m082n826p488q418q444
$$ 834215 838586 842152 845233 848382 851462 853466 853557 851980 849579 846624 842542 836716 829228 820810 812366
52199H12366p815p064o659o639o660o525o387o294n940n124m165l552l383l439
$$ 812366 804551 797487 790828 784189 777529 771004 764617 758323 752383 747259 743094 739542 736159 732720
52185G32720l603l912m315m680m903m826m258l349k691k707l091l223l027k997
$$ 732720 729117 725205 720890 716210 711307 706481 702223 698874 696183 693476 690385 687162 684135 681138
52171F81138l357l689l579l273l338l825m096l632k785k402k768l275l314l048
$$ 681138 677781 674092 670513 667240 663902 660077 655981 652349 649564 647162 644394 641119 637805 634757
52157F34757k911k704j922q49m89j150j924j942j501j414j819k300k663k909k802
$$ 634757 631846 629142 627220 626371 625882 624732 622808 620866 619365 617951 616132 613832 611169 608260 605458
52142F05458k257j869k217k809k641j782j456k307l449l709l149k768l091l667
$$ 605458 603201 601332 599115 596306 593665 591883 590427 588120 584671 580962 577813 575045 571954 568287
52128E68287l829l444k928k752l010l379l535l497l449l283k692j759j016p69
$$ 568287 564458 561014 558086 555334 552324 548945 545410 541913 538464 535181 532489 530730 529714 528945
52114E28945o44o3J024K105K721K915L099L590M277M784M909M852M926N236N748
$$ 528945 528301 528238 529262 531367 534088 537003 540102 543692 547969 552753 557662 562514 567440 572676 578424
52099E78424O535P646Q869R897J0692J1441J2213J2922J3586J4324J5058J5521
$$ 578424 584959 592605 601474 611371 622063 633504 645717 658639 672225 686549 701607 717128
52087G17128J5517J5065J4349J3751J3724J4274J4740J4479J3716J3169J2955
$$ 717128 732645 747710 762059 775810 789534 803808 818548 833027 846743 859912 872867
52076H72867J2379J0982R227P906P238O767N873M268K278O88Pj25m13r05j082
$$ 872867 885246 896228 905455 913361 920599 927366 933239 937507 939785 940473 940480 940355 939942 939037 937955
52061I37955r75j402k719m109m655m596m758n266n579n614n898o563o910o327
$$ 937955 936980 935578 932859 928750 924095 919499 914741 909475 903896 898282 892384 885821 878911 872584
52047H72584n151m216l894l851l688l457l504l901m143l567k101n05L77N20O49
$$ 872584 867433 863217 859323 855472 851784 848327 844823 840922 836779 833212 831111 830606 830983 831503 832152
52032H32152J282K118K515K384K288K689L382L757L521K896K236J722J401J315
$$ 832152 833434 835552 838067 840451 842739 845428 848810 852567 856088 858984 861220 862942 864343 865658
52018H65658J451J651J722J468O60q14k641m219n251o001o862p914r129j0607
$$ 865658 867109 868760 870482 871950 872610 871796 869155 864936 859685 853684 846822 838908 829779 819172
52004H19172j2265j3605j4243j4426j4653j4998j5292j5736j6623j7626j8036
$$ 819172 806907 793302 779059 764633 749980 734982 719690 703954 687331 669705 651669
51993F51669j7684j7087j6562j5964j5290j4963j5238j5953j7037j8572k0110
$$ 651669 633985 616898 600336 584372 569082 554119 538881 522928 505891 487319 467209
51982D67209k0679j9909j8637j7833j7414j6702j5587j4576j3890j3196j2158
$$ 467209 446530 426621 407984 390151 372737 356035 340448 325872 311982 298786 286628
51971B86628j0845r572q629q132p856p374o536n649m953m272l458k894l030l586
$$ 286628 275783 266211 257582 249450 241594 234220 227684 222035 217082 212810 209352 206458 203428 199842
51957A99842l736l123k256j844j985k219k180k000k045k356k524k209j679j506
$$ 199842 196106 192983 190727 188883 186898 184679 182499 180499 178454 176098 173574 171365 169686 168180
51943A68180j790k060j956j639j440j444j586j785j806j386p46n62j148k029k595
$$ 168180 166390 164330 162374 160735 159295 157851 156265 154480 152674 151288 150542 149980 148832 146803 144208
51928A44208k804k899k758k089j019p8L30J59m17j028j193o69K87J200J696J545
$$ 144208 141404 138505 135747 133658 132639 132561 132891 133050 132633 131605 130412 129743 130030 131230 132926 134471
51912A34471P51j55l63L12J050R96K48m41o86o56n67m71m84o18n68p3N57P29L52
$$ 134471 135222 135067 134704 135016 136066 137062 137310 136869 136183 135527 134960 134489 134005 133387 132819 132746 133303 134032 134384
51893A34384n3m6K85N58N70M63O38J346K316L039L470M019M648M642L735K898
$$ 134384 134331 134285 134570 135128 135698 136161 136799 138145 140461 143500 146970 150989 155637 160279 164014 166912
51877A66912L279M712O072O918P910R615J1691J3477J4853J6239J8095K0548K3211
$$ 166912 170191 174903 180975 187893 195803 205418 217109 230586 245439 261678 279773 300321 323532
51864C23532K5391K6620K6772K5373K1292J3824L958o111j4675k1109k5140k6579
$$ 323532 348923 375543 402315 427688 448980 462804 466762 460651 445976 424867 399727 373148
51852C73148k5960k4541k3134k1490j9145j6414j4079j2528j1486j0443r056p389
$$ 373148 347188 322647 299513 278023 258878 242464 228385 215857 204371 193928 184872 177483
51840A77483n880m903m336l787l240k996l023k809k069j175o53n87o60n83l28
$$ 177483 171603 166700 162364 158577 155337 152341 149318 146509 144440 143265 142612 142025 141365 140782 140454
51825A40454j59l29o62n94L3N18K58k36j5P64R59K26l71L5Q41R35K71k79k27L5
$$ 140454 140295 139966 139304 138710 138743 139261 139519 139283 139268 140032 140991 141217 140846 140881 141722 142657 142928 142649 142422 142457
51805A42457p4o51j249j282o07J38J62m63q43m68J69M08K38o8n51j174j377o96
$$ 142457 142383 141732 140483 139201 138594 138732 138894 138431 137588 137120 137289 137697 137935 137867 137316 136142 134765 134069
51787A34069M45J189J275J063P52K27m01p10m86J05R26J949K863K996J964K33
$$ 134069 134514 135703 136978 138041 138793 139020 138619 137909 137423 137528 138454 140403 143266 146262 148226 148459
51771A48459j168j590j344j210j382j205k06R38J094K29n19m26m0j13m04k06N32
$$ 148459 147291 145701 144357 143147 141765 140560 140354 141292 142386 142615 142096 141670 141630 141517 141113 140907 141439
51754A41439J266J698J866J730J291Q68O89M55j30o61n23J15N20L96J4n52j481
$$ 141439 142705 144403 146269 147999 149290 150158 150847 151302 151172 150511 149988 150103 150623 151019 151033 150481 149000
51737A49000k507k930k552j879j291o84p0J33j53l32P0P64J233J442J554J363
$$ 149000 146493 143563 141011 139132 137841 137157 137087 137220 137067 136735 136805 137569 138802 140244 141798 143161
51721A43161N97m11r46p65l34k64p10j328j618j307n88J19O21J013J215Q72ro65
$$ 143161 143758 143347 142401 141636 141302 141038 140328 139000 137382 136075 135487 135606 136227 137240 138455 139327 139318 138653
51703A38653l50O36J157N17q56k022k456k179j383k63Q43J516J551J114N57J13
$$ 138653 138303 138939 140096 140613 139757 137735 135279 133100 131717 131454 132297 133813 135364 136478 137035 137148
51687A37148k76q09j543k199k405k126j684j287p36J34R29J023M91J54M88Q98
$$ 137148 136872 136063 134520 132321 129916 127790 126106 124819 124083 124217 125146 126169 126660 126814 127302 128200
51671A28200N40m12r09l95N69J170J251J090P78K98n7J07P33J323J576J605J585
$$ 128200 128740 128328 127419 127024 127593 128763 130014 131104 131882 132180 132123 132230 132963 134286 135862 137467 139052
51654A39052J475J192P75K48m70j317j939j946j326n04N7K38K69L73M74L34r3
$$ 139052 140527 141719 142494 142742 142272 140955 139016 137070 135744 135240 135297 135535 135804 136177 136651 136985 136892
51637A36892n72q46q44n84j20K91K13m47j146j214p30m49p97j275j146m53O6K9
$$ 136892 136320 135474 134630 134046 133926 134217 134430 133983 132837 131623 130893 130444 129647 128372 127226 126773 126839 126868
51619A26868j14J88P72J055R25Q35R32P17j44j049j095k82N09P02O22P64J012
$$ 126868 126754 126942 127714 128769 129694 130529 131461 132178 132034 130985 129890 129608 130117 130819 131441 132205 133217
51602A33217R74O25K51m3k30k1Q58K066K787K572J767J005N99N08O24Q39R63Q14
$$ 133217 134191 134816 135067 135024 134794 134773 135631 137697 140484 143056 144823 145828 146427 146935 147559 148398 149361 150175
51584A50175L74j68n23m16K16J122J911K386K612K631K328J686J056R11J301J734
$$ 150175 150549 150381 149858 149442 149658 150780 152691 155077 157689 160320 162648 164334 165390 166301 167602 169336
51568A69336J738J400J163J197J225J052R44J190J542J430P48mm46p68j286j818
$$ 169336 171074 172474 173637 174834 176059 177111 178055 179245 180787 182217 182965 182961 182515 181747 180461 178643
51552A78643j886j427q79o24n84m10O4O95J176J262R24L78n6j91j12m0r3j68j41
$$ 178643 176757 175330 174451 173827 173243 172833 172897 173592 174768 176030 176954 177332 177276 177085 176973 176933 176840 176672 176531
51533A76531j23l52p99j107j108j147j613k286k523k102j479j156j192j423j768
$$ 176531 176408 176056 175257 174150 173042 171895 170282 167996 165473 163371 161892 160736 159544 158121 156353
51518A56353k099k115j701j133p27m90l38l77o72r65r61p66o68o39l97M9L03P3
$$ 156353 154254 152139 150438 149305 148578 148088 147750 147373 146701 145736 144775 144009 143341 142702 142305 142354 142657 142730
51500A42730m53q10o76j25M23N18J35l24m96m97o63j078j490j630j325n27N40
$$ 142730 142277 141467 140791 140666 141089 141607 141742 141418 140922 140425 139762 138684 137194 135564 134239 133712 134252
51483A34252J305J304P20K40L32Q48J366J647J758J877K116K399K481K172J534
$$ 134252 135557 136861 137581 137821 138153 139001 140367 142014 143772 145649 147765 150164 152645 154817 156351
51468A56351Q34L77L98R98J972K782K886K150R15l81j573k806m197n405n756m995
$$ 156351 157185 157562 157960 158958 160930 163712 166598 168748 169663 169282 167709 164903 160706 155301 149545 144550
51452A44550l847l357l693m009l644k888k321j917j319o02j93j93k85k17P2N99
$$ 144550 140703 137346 133653 129644 126000 123112 120791 118874 117555 116953 116760 116567 116282 116065 116137 116736
51436A16736J249J621J451J036Q25P73N24P5k97o33j154j578j277k69O07P40M09
$$ 116736 117985 119606 121057 122093 122918 123691 124215 124290 123993 123360 122206 120628 119351 119082 119689 120429 120838
51419A20838J28j59q05j758k551k859k757k572k597k785k703k055j254j027j419
$$ 120838 120966 120807 120002 118244 115693 112834 110077 107505 104908 102123 99420 97365 96111 95084 93665
51404I3665j660j263p46q39j408j648j148l26K15L46L85O59J087J176N03p41j762
$$ 93665 92005 90742 89996 89157 87749 86101 84953 84627 84842 85188 85573 86232 87319 88495 88998 88257 86495
51387H6495j847r67L52J499K126K218K060J997K085K026J558P96J60O3O08J427
$$ 86495 84648 83681 84033 85532 87658 89876 91936 93933 96018 98044 99602 100398 100558 100621 101229 102656
51371A02656J809J342M16j94l11n40j221j751j322j07Q03O34k57q76p05j53j9
$$ 102656 104465 105807 106223 106029 105718 105178 103957 102206 100884 100777 101580 102214 101957 101081 100376 100223 100204
51354A00204n53j182j212p26m94r69j725k022j681j082n84k13J69O14J028J214
$$ 100204 99651 98469 97257 96531 96037 95068 93343 91321 89640 88558 87974 87761 87930 88544 89572 90786
51338I0786J023O14L86N30Q14R35R45J013R80N38j60m57k1O04N58k38q76m58Q54
$$ 90786 91809 92423 92809 93339 94153 95088 96033 97046 98026 98564 98404 97947 97926 98530 99088 98850 97974 97516 98370
51319I8370K033K346J935J250L40q94k095k691k633k468k510k508k252j957j761
$$ 98370 100403 102749 104684 105934 106274 105380 103285 100594 97961 95493 92983 90475 88223 86266 84505
51304H4505j317l38P60J239R20K55l14o47o40j86N13R89J032R13R69J165J259
$$ 84505 83188 82850 83610 84849 85769 86024 85710 85063 84423 84237 84750 85739 86771 87684 88653 89818 91077
51287I1077J247J450K171L292M264M538M143L704L693L743L003J261o03j562j606
$$ 91077 92324 93774 95945 99237 103501 108039 112182 115886 119579 123322 126325 127586 126983 125421 123815
51272A23815j629k174k821k934k599k391k430k223j455m53L42Q98J249J080J28
$$ 123815 122186 120012 117191 114257 111658 109267 106837 104614 103159 102706 103048 103946 105195 106275 106403
51257A06403j141j829j521o31J70M50R0o69j254j179n11L51J276K315L130L107
$$ 106403 105262 103433 101912 101281 101451 101901 101991 101322 100068 98889 98378 98729 100005 102320 105450 108557
51241A08557K224J234P65O57M88K28J15K23N30J014J356R81j73j278j482r63n75
$$ 108557 110781 112015 112780 113437 113925 114153 114268 114491 115021 116035 117391 118372 118199 116921 115439 114476 113901
51224A13901o70p90m56L08J202K000K492K487J985J197L61l18o54o46o04q34j212
$$ 113901 113231 112441 111985 112293 113495 115495 117987 120474 122459 123656 124017 123699 123045 122399 121795 120961 119749
51207A19749j337j084p83q05j170j603j778j540j010n22l18l82n72p60p50l17
$$ 119749 118412 117328 116545 115740 114570 112967 111189 109649 108639 108117 107799 107417 106845 106085 105335 105018
51191A05018M33R32P16L3m06k30L34R20J363J582J499J213J027J127J310J182
$$ 105018 105451 106383 107099 107132 106726 106496 106830 107750 109113 110695 112194 113407 114434 115561 116871 118053
51175A18053N16n10j431j812j611j172q54p49q44j140j464j387p47o6l0n21p08
$$ 118053 118569 118059 116628 114816 113205 112033 111179 110430 109586 108446 106982 105595 104848 104782 104752 104231 103523
51158A03523j42O17P68L47O6K99O30N67K94M55J235K083K357K040J589J306J140
$$ 103523 103381 103998 104766 105113 105179 105478 106108 106675 106969 107424 108659 110742 113099 115139 116728 118034 119174
51141A19174R90Q39N96J24m50p79p31n20l06jM07O61O24N57Q25J403J927J989
$$ 119174 120164 121003 121599 121723 121273 120494 119763 119243 118937 118936 119343 120004 120628 121185 122010 123413 125340 127329
51123A27329J355K14o37l90P41J489R29m40j436j632j537j658j990k298k314j750
$$ 127329 128684 128898 128261 127871 128612 130101 131030 130590 129154 127522 125985 124327 122337 120039 117725 115975
51107A15975o28M40P82M55J45L39R71J704K116J775P17l02n41k25j00k37k5O67
$$ 115975 115347 115787 116569 117024 117169 117508 118479 120183 122299 124074 124791 124489 123948 123723 123623 123386 123361 124028
51089A24028J171J085Q29Q29R11R08J177J873K304J722M34n06n39k3M25M59L4
$$ 124028 125199 126284 127113 127942 128853 129761 130938 132811 135115 136837 137271 136765 136226 136203 136628 137087 137121
51072A37121o25j074j081r75j269j899k200j708p09Q2K07j94n90n32L5P46J185
$$ 137121 136496 135422 134341 133366 132097 130198 127998 126290 125581 125663 125870 125676 125086 124554 124589 125335 126520
51055A26520J148O97O8l98m58j99J5m2j41J61R78J907K422K445K420K695K919
$$ 126520 127668 128365 128433 128035 127577 127378 127393 127351 127210 127371 128349 130256 132678 135123 137543 140238 143157
51038A43157K391J097j7j20M93R53J061J304J783J949J612J412J858K463K404
$$ 143157 145548 146645 146628 146508 147001 147954 149015 150319 152102 154051 155663 157075 158933 161396 163800
51023A63800J669R30N99N55O98J189J960K479K291J629J286J825L023M112M591
$$ 163800 165469 166399 166998 167553 168251 169440 171400 173879 176170 177799 179085 180910 183933 188045 192636
51008A92636M615M611M728M948N443O412P577Q325Q427Q252Q234Q510R119J0150
$$ 192636 197251 201862 206590 211538 216981 223393 230970 239295 247722 255974 264208 272718 281837 291987
50994B91987J1578J3262J5130J6944J8013J7867J7192J7335J8597J9956K0756
$$ 291987 303565 316827 331957 348901 366914 384781 401973 419308 437905 457861 478617
50983D78617K1701K3523K5667K7319K8958L1667L5254L8332M0220M1592M3109
$$ 478617 500318 523841 549508 576827 605785 637452 672706 711038 751258 792850 835959
50972H35959M4372M4619M3693M1953L9744L7243L4377L0781K6281K1412J6942
$$ 835959 880331 924950 968643 1010596 1050340 1087583 1121960 1152741 1179022 1200434 1217376
50961A217376J2939Q985N249K524J013M6p23o76N89K281L324L653L800L703K775
$$ 1217376 1230315 1239300 1244549 1247073 1248086 1248132 1247409 1246733 1247322 1249603 1252927 1256580 1260380 1264083 1266858
50946A266858Q67j696m927r127j4001j8625k2575k6479l1045l5981m0279m3344
$$ 1266858 1267725 1266029 1261102 1251975 1237974 1219349 1196774 1170295 1139250 1103269 1062990 1019646
50934A019646m5430m6991m7936m7692m5975m3308m0590l8201l5813l3119l0369
$$ 1019646 974216 927225 879289 831597 785622 742314 701724 663523 627710 594591 564222
50923E64222k7858k5304k2277j9118j6751j5450j4325j2413r923p917o975o623
$$ 564222 536364 511060 488783 469665 452914 437464 423139 410726 400803 392886 385911 379288
50911C79288o122n307m431l567k626j844j722k207k411j573j18P81P02M60R61
$$ 379288 373166 367859 363428 359861 357235 355391 353669 351462 349051 347478 347360 348141 348843 349303 350264
50896C50264K111L199L903M375M697M825N002N595O461P024P105P193P764Q730
$$ 350264 352375 355574 359477 363852 368549 373374 378376 383971 390432 397456 404561 411754 419518 428248
50882D28248R836J1144J2810J4668J6432J8075J9722K1347K2941K4823K7386L0596
$$ 428248 438084 449228 462038 476706 493138 511213 530935 552282 575223 600046 627432 658028
50870F58028L4073L7711M1864M6922N2789N8864O4386O8937P2893P7241Q2639
$$ 658028 692101 729812 771676 818598 871387 930251 994637 1063574 1136467 1213708 1296347
50859A296347Q8677R4344R9131J03166J06290J07666J06619J03310R8076R0497
$$ 1296347 1385024 1479368 1578499 1681665 1787955 1895621 2002240 2105550 2203626 2294123
50849B294123P9945O6893N2938L9339K6230J3603K422n941j1184j4196j5694j5382
$$ 2294123 2374068 2440961 2493899 2533238 2559468 2573071 2575493 2569552 2558368 2544172 2528478 2513096
50837B513096j2747q103k439L447R044J3552J5868J5291J1793N585l162j3956
$$ 2513096 2500349 2492246 2489807 2493254 2502298 2515850 2531718 2547009 2558802 2564387 2561225 2547269
50825B547269k5915l8425n1496o4988p7867q8808r7345j03795j08202j10057j09245
$$ 2547269 2521354 2482929 2431433 2366445 2288578 2199770 2102425 1998630 1890428 1780371 1671126
50814A671126j06537j02795r8082r1955q4375p5936o7489n9709n2918m6927m1233
$$ 1671126 1564589 1461794 1363712 1271757 1187382 1111446 1043957 984248 931330 884403 843170
50803H43170l5609l0344k5769k1721j7818j4057j0872q564o950n602m307l278
$$ 843170 807561 777217 751448 729727 711909 697852 686980 678416 671466 665864 661557 658279
50791F58279k853k949k952k443j929k364l858n355n875n549n141n000n004n191
$$ 658279 655426 652477 649525 647082 645153 642789 638931 633576 627701 622152 617011 612011 607007 601816
50777F01816n746o478o795o287n072l671k687k349k073q89J323L473M609N187
$$ 601816 596070 589592 582797 576510 571438 567767 565080 562731 560658 559769 561092 564565 569174 574361
50763E74361O259P860R110R621R859J0219J0747J1859J4173J7312J9923K1342
$$ 574361 580620 588480 597590 607211 617070 627289 638036 649895 664068 681380 701303 722645
50751G22645K2492K4539K7510L0763L4130L7776M1560M5236M9017N3165N7234
$$ 722645 745137 769676 797186 827949 862079 899855 941415 986651 1035668 1088833 1146067
50740A146067O0384O2293O3271O3497O2636O0126N5627M9216M1399L2697K3215
$$ 1146067 1206451 1268744 1332015 1395512 1458148 1518274 1573901 1623117 1664516 1697213 1720428
50729A720428J2851K045q165j6953k3893k8257k9076k6496k2253j7963j3548q211
$$ 1720428 1733279 1735324 1727159 1710206 1686313 1658056 1628980 1602484 1580231 1562268 1548720 1540509
50717A540509k313K788O334Q430Q884P073K974k674r440j7467k6457l5414m3673
$$ 1540509 1538196 1540984 1547318 1555748 1564632 1571705 1574679 1572005 1562565 1545098 1518641 1483227 1439554
50704A439554n1291n7973o2501o3984o3005o0927n8452n5390n1456m6708m1475
$$ 1439554 1388263 1330290 1267789 1203805 1140800 1079873 1021421 966031 914575 867867 826392
50693H26392l6318l1831k8125k4666k0964j7195j3834j0965q191n087j492K376
$$ 826392 790074 758243 730118 705452 684488 667293 653459 642494 634303 629216 627724 630100
50681F30100N884Q375R902J1251J2962J4643J5568J5586J5057J4138J2670J0684
$$ 630100 635984 644359 654261 665512 678474 693117 708685 724271 739328 753466 766136 776820
50669G76820Q557O724N494N015N069N047M554L992M146N151O354P196P821Q606
$$ 776820 785377 792101 797595 802610 807679 812726 817280 821272 825418 830569 836923 844119 851940 860546
50655H60546R582J0556J1674J3305J5409J7336J8447J8784J8913J9210J9577J9871
$$ 860546 870128 880684 892358 905663 921072 938408 956855 975639 994552 1013762 1033339 1053210
50643A053210K0169K0395J9949J8211J5391J2402R876P633N225K582o7k504m506
$$ 1053210 1073379 1093774 1113723 1131934 1147325 1159727 1169603 1177236 1182461 1185043 1184976 1182472 1177966
50630A177966n882o824p980r756j1756j3222j3856j3861j3454j2765j2117j1787
$$ 1177966 1172084 1165260 1157280 1147524 1135768 1122546 1108690 1094829 1081375 1068610 1056493 1044706
50618A044706j1525j0687r049p133n595m531l592k508j392o25n89j402k870m769
$$ 1044706 1033181 1022494 1013445 1006312 1000717 996186 992594 990086 988694 988069 987480 986078 983208 978439
50604I78439p129j0120j3664j7387k0904k3932k6142k7271k7464k7274k7066k6598
$$ 978439 971310 961190 947526 930139 909235 885303 859161 831890 804426 777152 750086 723488
50592G23488k5362k3185k0381j7442j4747j2409j0174p622m667j800K68J194J146
$$ 723488 698126 674941 654560 637118 622371 609962 599788 592166 587499 585699 585967 587161 588307
50579E88307N52j16n06o09p07q61n64O44K353L578M043M616O173Q489J0672J2344
$$ 588307 588859 588743 588237 587628 586921 586060 585496 586140 588493 592071 596114 600730 606903 615392 626064 638408
50563F38408J3810J5251J6429J7240J7955J8687J8998J8408J7018J5411J4145
$$ 638408 652218 667469 683898 701138 719093 737780 756778 775186 792204 807615 821760
50552H21760J3496J3470J3871J4466J5289J6553J8243K0000K1640K3472K5827
$$ 821760 835256 848726 862597 877063 892352 908905 927148 947148 968788 992260 1018087
50541A018087K8605L1532L4646L8063M1530M4651M7495N0487N3712N6724N9035
$$ 1018087 1046692 1078224 1112870 1150933 1192463 1237114 1284609 1335096 1388808 1445532 1504567
50530A504567O0429O0782N9914N7672N3874M8214M0675L1936K2963J4063M853
$$ 1504567 1564996 1625778 1685692 1743364 1797238 1845452 1886127 1918063 1941026 1955089 1959942
50519A959942m785j4246k2906l0798l8299m5466n1930n7095o0216o0821n9352
$$ 1959942 1955157 1940911 1918005 1887207 1848908 1803442 1751512 1694417 1634201 1573380 1514028
50508A514028n6904n3982m9995m4472l8207l2480k7451k2233j6418j0629n433
$$ 1514028 1457124 1403142 1353147 1308675 1270468 1237988 1210537 1188304 1171886 1161257 1155824
50497A155824o11M228Q955J3285J7251K0736K3009K3314K1646J8388J3388O083
$$ 1155824 1155213 1159441 1168396 1181681 1198932 1219668 1242677 1265991 1287637 1306025 1319413 1325496
50485A325496l315j3459k2979l1508l9265m5960n0722n3107n3619n3043n1564
$$ 1325496 1322181 1308722 1285743 1254235 1214970 1169010 1118288 1065181 1011562 958519 906955
50474I06955m8937m5212m0985l6826l2852k8955k5230k1944j9143j6495j3636
$$ 906955 858018 812806 771821 734995 702143 673188 647958 626014 606871 590376 576740
50463E76740j0613p884n787m082k155K39K644M429N505O294P202Q442J0202J2432
$$ 576740 566127 558243 552456 548374 546219 546458 549102 553531 559036 565330 572532 580974 591176 603608
50449F03608J4434J5181J4421J3048J2041J1332J0190Q509P144O863P440P957
$$ 603608 618042 633223 647644 660692 672733 684065 694255 702764 709908 716771 724211 732168
50437G32168P883P570P720Q571R709J0652J1435J2420J3687J4963J6156J7534
$$ 732168 740051 747621 755341 763912 773621 784273 795708 808128 821815 836778 852934 870468
50425H70468J9212K0797K1901K2710K3699K4963K6234K7387K8448K9226K9365
$$ 870468 889680 910477 932378 955088 978787 1003750 1029984 1057371 1085819 1115045 1144410
50414A144410K8815K7913K6845K5397K3247K0224J6215J1186N463l60n988j1697
$$ 1144410 1173225 1201138 1227983 1253380 1276627 1296851 1313066 1324252 1329715 1329355 1323367 1311670
50402A311670j7815k4123l0062l5334l9944m3669m5916m6382m5643m4663m3701
$$ 1311670 1293855 1269732 1239670 1204336 1164392 1120723 1074807 1028425 982782 938119 894418
50391H94418m2031l8937l4736l0430k6550k2830j8946j4981j1002o816k490J445
$$ 894418 852387 813450 778714 748284 721734 698904 679958 664977 653975 647159 644669 646114
50379F46114M787Q130J1836J5036J6523J6358J5656J4823J3021R581M986K0n204
$$ 646114 650901 659031 670867 685903 702426 718784 734440 749263 762284 771865 776851 776871 771667
50366G71667j0701j5800j9622k2022k3503k4404k4766k4682k4234k3253k1672
$$ 771667 760966 745166 725544 703522 680019 655615 630849 606167 581933 558680 537008
50355E37008j9912j8426j7045j5324j3368j1662j0157q228n789l721k817k687
$$ 537008 517096 498670 481625 466301 452933 441271 431114 422886 417097 413376 410559 407872
50343D07872k250j104O9N36N46J051K441L932M493M143L850M197M759N012N202
$$ 407872 405622 404518 404587 405123 405669 406720 409161 413093 417586 421729 425579 429776 434535 439547 444749
50328D44749N793O559O954P047P275P468O989N852M881M485M111L240K247J802
$$ 444749 450542 457101 464055 471102 478377 485845 492834 498686 503567 508052 512163 515403 517650 519452
50314E19452J956K354K892L715M759N808O731P416P743P983Q706R842J0183Q398
$$ 519452 521408 523762 526654 530369 535128 540936 547667 555083 562826 570809 579515 589357 599540 607938
50300F07938M394p43n802r908j2320j2633j1324r538q176p459p156o853o073m778
$$ 607938 612332 611589 605787 595879 583559 570926 559602 550064 541888 534429 527273 520420 514347 509569
50286E09569l708l606m133m176l235j960j230j324k114l309m245m172l110j919
$$ 509569 505861 502255 498122 493946 490711 488751 487521 486197 484083 480774 476529 472357 469247 467328
50272D67328j151m12P10J841K434K609K769K833K613K505L001L772M066L885L923
$$ 467328 466177 465765 466475 468316 470750 473359 476128 478961 481574 484079 487080 490852 494918 498803 502726
50257E02726M314M298L385K183J693K220L230L933L857L167K535K482K765K759
$$ 502726 507040 511338 514723 516906 518599 520819 524049 527982 531839 535006 537541 540023 542788 545547
50243E45547K309J776J259M53o33j419j598j715k380l390m038m103l959l820l385
$$ 545547 547856 549632 550891 551344 550711 549292 547694 545979 543599 540209 536171 532068 528109 524289 520904
50228E20904k348r50J70O32P28J127K168L603N070O562Q130R403J0003J0359J1417
$$ 520904 518556 517606 517776 518408 519136 520263 522431 526034 531104 537666 545796 555199 565202 575561 586978
50213E86978J3398J5469J6971J8310K0112K2088K3398K3913K4342K5147K5948
$$ 586978 600376 615845 632816 651126 671238 693326 716724 740637 764979 790126 816074
50202H16074K6078K5261K3572K1138J8096J4631J0964P354M173J737K7j352k930
$$ 816074 842152 867413 890985 912123 930219 944850 955814 963168 967341 969078 969105 967753 964823
50189I64823n142q234j2249j7024k2198k7207l1341l4046l5272l5359l4590l3099
$$ 964823 959681 951447 939198 922174 899976 872769 841428 807382 772110 736751 702161 669062
50177F69062l1135k9029k6765k4078k1074j8335j6062j3784j1274r201q238p951
$$ 669062 637927 608898 582133 558055 536981 518646 502584 488800 477526 468325 460087 452136
50165D52136p302o025m793m146m049m341m901n327n186m658m248l922l292k707
$$ 452136 444834 438809 434016 429870 425821 421480 416579 411252 406066 401408 397160 393238 389946 387239
50151C87239l151m700o070o250n821n836o188n986n121m442m419m569m340l794
$$ 387239 384088 379388 373318 367068 361247 355411 349223 343237 338116 333674 329255 324686 320346 316552
50137C16552l241k646j794p56J01M44K58o0qM95R56R55P70R40J377J485J233J439
$$ 316552 313311 310665 308871 308115 308216 308660 308918 308858 308850 309345 310301 311256 312026 312966 314343 315828 317061 318500
50119C18500K638M185N063N231N545O346O871O384N394N144O052P249P822P987
$$ 318500 321138 325323 330386 335617 341162 347508 354379 360763 366157 371301 377353 384602 392424 400411
50105D00411Q649J0082J1582J2420J2687J3047J3981J5495J7344J9229K1000K2866
$$ 400411 409060 419142 430724 443144 455831 468878 482859 498354 515698 534927 555927 578793
50093E78793K5311K8553L2215L5782L9206M2686M5835M7731M7998M7434M6996
$$ 578793 604104 632657 664872 700654 739860 782546 828381 876112 924110 971544 1018540
50082A018540M6451M4609M0923L6357L2390K9622K7601K5615K3063J9339J4014
$$ 1018540 1064991 1109600 1150523 1186880 1219270 1248892 1276493 1302108 1325171 1344510 1358524
50071A358524P253k77q103j6135k4141l1497l7604m2197m5059m5973m5224m3663
$$ 1358524 1365777 1365500 1357397 1341262 1317121 1285624 1248020 1205823 1160764 1114791 1069567 1025904
50059A025904m1798l9231l5510l1123k7018k3447k0002j6610j3742j1634j0101
$$ 1025904 984106 944875 909365 878242 851224 827777 807775 791165 777423 765789 755688
50048G55688r061q516p894o381m209k776k978m064m771m929n278o077o805p096
$$ 755688 746627 738111 730217 723836 719627 716851 713873 709809 705038 700109 694831 688754 681949 674853
50034F74853p229p629q353r134r590r435q794q179p907p639o866n716m767m231
$$ 674853 667624 659995 651642 642508 632918 623483 614689 606510 598603 590964 584098 578382 573615 569384
50020E69384l703k848j849j103o95l85J24R01J760K489L210M266N572O345N901
$$ 569384 565681 562833 560984 559881 559186 558801 558925 559826 561586 564075 567285 571551 577123 583468 589369
50005E89369M555L327K780K510J813M81j160k702l949m943n748o306o550o726
$$ 589369 593924 597251 600031 602541 604354 604835 603675 600973 597024 592081 586333 580027 573477 566751
49991E66751p288q204q706q166p012o293o352o442n692l999j924j32R52J363J702
$$ 566751 559463 551259 542553 534387 527375 521082 514730 508288 502596 498597 496673 496541 497493 498856 500558
49976E00558K663M341O214P959R865J2347J5351J8493K1478K4131K6278K7810
$$ 500558 503221 507562 513776 521735 531600 543947 559298 577791 599269 623400 649678 677488
49964F77488K8675K8641K7253K4382K0627J6965J3986J1677R763Q105O657N210
$$ 677488 706163 734804 762057 786439 807066 824031 838017 849694 859457 867562 874219 879429
49952H79429L231J33m247r512j5199k1217k7403l2793l5912l6196l4728l3192
$$ 879429 882660 882793 878546 869034 853835 832618 805215 772422 736510 700314 665586 632394
49940F32394l2197l1022k8860k5899k2969k0487j8172j5771j3652j2327j1589
$$ 632394 600197 569175 540315 514416 491447 470960 452788 437017 423365 411038 399449
49929C99449j0672r322q125p540p155o408n599n371n508n154m183l419l333l399
$$ 399449 388777 379455 371330 363790 356635 350227 344628 339257 333749 328595 324412 320993 317660 314261
49915C14261l141k925l124l241k636j651j189j488k002k328k493k504k210j674
$$ 314261 311120 308195 305071 301830 299194 297543 296354 294866 292864 290536 288043 285539 283329 281655
49901B81655j138n62K50J135J625J563J180N60m60j728k644k797k408j971j753
$$ 281655 280517 279955 280205 281340 282965 284528 285708 286268 285808 284080 281436 278639 276231 274260 272507
49886B72507j702j552r49J10R19N97p28j785j510l10M43K6r27j270n67N97J334
$$ 272507 270805 269253 268304 268414 269333 269930 269202 267417 265907 265597 266040 266066 265139 263869 263302 263899 265233
49869B65233J293P99L00p2l53m04p8M42Q68J342K270L464M023L419K295J727J904
$$ 265233 266526 267325 267625 267553 267200 266796 266718 267160 268028 269370 271640 275104 279127 282546 284841 286568 288472
49852B88472K081J703J054O69O19O26N45M15K41Kk07k93l73o13q81q29m29j24
$$ 288472 290553 292256 293310 293979 294598 295224 295769 296184 296425 296427 296220 295927 295554 294941 294060 293231 292802 292678
49834B92678l13q30j161j005m57K06O43M79l16j066r00K27J365J693J402J198
$$ 292678 292365 291535 290374 289369 288912 289118 289761 290240 289924 288858 287958 288185 289550 291243 292645 293843
49818B93843J204R68L29k89n33n61o36p06o28n83q54j383j747j665j301j027r78
$$ 293843 295047 296015 296344 296055 295522 294961 294325 293619 292991 292408 291554 290171 288424 286759 285458 284431 283453
49801B83453r46p27n02o73j289j858j883j473j164j241j426j354j033p84q16r69
$$ 283453 282507 281780 281278 280605 279316 277458 275575 274102 272938 271697 270271 268917 267884 267100 266284 265315
49785B65315q67l58J84J35o46j521j697j019M5J008J624J684J148M38J80M11M91
$$ 265315 264448 264090 264274 264409 263763 262242 260545 259526 259571 260579 262203 263887 265035 265473 265653 266064 266555
49768B66555Jo21o06K37J406K257K402J855J056O17P48R90P81J53l41l48m9J15
$$ 266555 266556 265935 265329 265566 266972 269229 271631 273486 274542 275159 275907 276897 277678 277831 277490 277142 277093 277208
49750B77208q2n15p94n83J0M53L16k57p74r94j062j097r86o61k75qJ90M77R06
$$ 277208 277126 276611 275817 275234 275244 275697 276013 275756 274982 273988 272926 271829 270843 270182 269907 269899 270089 270566 271472
49731B71472J431K049K720L162K951J951N17p88j617j841j387l32Q02J353J244
$$ 271472 272903 274952 277672 280834 283785 285736 286253 285465 283848 282007 280620 280288 281090 282443 283687
49716B83687J120J503K091K265J926J453R86L86k05l84j84j14l20k48N34J641
$$ 283687 284807 286310 288401 290666 292592 294045 295031 295417 295212 294828 294644 294530 294210 293962 294496 296137
49700B96137K347K406K030J463R69R38J491K157K390K266K303K711L208L454L308
$$ 296137 298484 300890 302920 304383 305352 306290 307781 309938 312328 314594 316897 319608 322816 326270 329578
49685C29578K660J513K39n42n05R2P26J096J274J497J787J829J356N90J6l14p85
$$ 329578 332238 333751 333990 333448 332943 333035 333761 334857 336131 337628 339415 341244 342600 343190 343206 342892 342107
49668C42107j445j725j209k85L75O45Q74J316K018K951L906M551N035O027P789
$$ 342107 340662 338937 337728 337443 337818 338463 339337 340653 342671 345622 349528 354079 359114 365141 372930
49653C72930R618J0838J1644J2108J0987O891O03n091q173q938q586p512n699
$$ 372930 382548 393386 405030 417138 428125 435016 435619 430528 422355 413417 404831 397319 391620
49640C91620l748k470j898j469r89o90o64p67r86j346j568j261n01J98M46L64
$$ 391620 387872 385402 383504 382035 381046 380356 379692 378925 377939 376593 375025 373764 373263 373461 373907 374271
49624C74271L31N68R70J333J627J984K351K414K126J984K388K977L106K859K919
$$ 374271 374602 375170 376140 377473 379100 381084 383435 385849 387975 389959 392347 395324 398430 401289 404208
49609D04208L534M283M801N039M834M121L591M150N354N540L982K027J379K147
$$ 404208 407742 412025 416826 421865 426699 430820 434411 438561 443915 449455 453437 455464 456843 458990
49595D58990L267M100M668M936M872M846N142N399N193M813M741M803M631M502
$$ 458990 462257 466357 471025 475961 480833 485679 490821 496220 501413 506226 510967 515770 520401 524903
49581E24903M859N411N565N402N343N202M605L987M089M668M840M526M383M423
$$ 524903 529762 535173 540738 546140 551483 556685 561290 565277 569366 574034 578874 583400 587783 592206
49567E92206L946L042K757L428M063L897L501L659M114M077L382K524K072K435
$$ 592206 596152 599194 601951 605379 609442 613339 616840 620499 624613 628690 632072 634596 636668 639103
49553F39103L517M359L867K289J145J282J923K163K278K807L314L169K796K921
$$ 639103 642620 646979 650846 653135 654280 655562 657485 659648 661926 664733 668047 671216 674012 676933
49539F76933L167K633J596J303K075K872K949K909L596M835N786O135O284O665
$$ 676933 680100 682733 684329 685632 687707 690579 693528 696437 700033 704868 710654 716789 723073 729738
49525G29738P151P187O322M673K891J623J008Q10P90P77O01K36p1j20q6l50j105
$$ 729738 736889 744076 750398 755071 757962 759585 760593 761403 762193 762970 763571 763807 763736 763616 763530 763180 762075
49508G62075k268l603m733n333n541n846o404o831o984p334q127q632p974o383
$$ 762075 759807 756204 751471 746138 740597 734751 728347 721516 714532 707198 699071 690439 682465 676082
49494F76082m901m087l763l788m260m899n098m711m165l708l201k791k968l695
$$ 676082 671181 667094 663331 659543 655283 650384 645286 640575 636410 632702 629501 626710 623742 620047
49480F20047m205m016l551l383l439l405l378l590l891l952l774l527l193k697
$$ 620047 615842 611826 608275 604892 601453 598048 594670 591080 587189 583237 579463 575936 572743 570046
49466E70046k169j659r58o4M12o6j103j692j411p54l46k65k39r8J81N43Q66J047
$$ 570046 567877 566218 565260 565196 565608 565542 564439 562747 561336 560582 560236 559971 559732 559634 559815 560358 561224 562271
49448E62271J220J623K194K582K742L242M584O302P014N639K434j189l822m914
$$ 562271 563491 565114 567308 569890 572632 575874 580458 586760 593774 599413 601847 600658 596836 591922
$$ [...]
##END NTUPLES=NMR SPECTRUM
##END=
