##TITLE=NES1018_872015066_9266120_aT6socKug7
##JCAMPDX= 6.0         $$ Bruker NMR JCAMP-DX V2.0
##DATA TYPE= NMR SPECTRUM
##DATA CLASS= NTUPLES
##ORIGIN= BRUKER
##OWNER= Administrator
$$ 1.72 TOPSPIN		Version 2.1
$$ 2015-07-09 15:37:28.660 -0700  Administrator@X
$$ Compression mode = diff/dup
##.OBSERVE FREQUENCY= 400.02188249412
##.OBSERVE NUCLEUS= ^1H
##.ACQUISITION MODE= SIMULTANEOUS (DQD)
##.ACQUISITION SCHEME= undefined
##.AVERAGES= 8
##.DIGITISER RES= 22
##SPECTROMETER/DATA SYSTEM= spect
##.PULSE SEQUENCE= zg30
##.SOLVENT NAME= COFFEE_meoh
##.SHIFT REFERENCE= INTERNAL, COFFEE_meoh, 1, 14.98509
##AUDIT TRAIL= $$ (NUMBER, WHEN, WHO, WHERE, PROCESS, VERSION, WHAT)
$$ ##TITLE= Audit trail, TOPSPIN		Version 2.1
$$ ##JCAMPDX= 5.01
$$ ##ORIGIN= Bruker BioSpin GmbH
$$ ##OWNER= Administrator
$$ $$ E:\/data/COFFEE/nmr/NES1018_872015066_9266120_aT6socKug7/10/pdata/1/auditp.txt
$$ ##AUDIT TRAIL=  $$ (NUMBER, WHEN, WHO, WHERE, PROCESS, VERSION, WHAT)
(   1,<2015-07-09 15:37:21.441 -0700>,<Administrator>,<X>,<go>,<TOPSPIN 2.1>,
      <created by zg
	started at 2015-07-09 15:36:15.425 -0700,
	POWCHK enabled, PULCHK disabled,
       configuration hash MD5:
       21 0F 79 D6 B3 7B B4 F6 88 20 88 DB 03 48 BD 9F
       data hash MD5: 64K
       7A 15 A7 B7 3D E1 97 16 90 E2 2D 2F A2 DF 29 B2>)
(   2,<2015-07-09 15:37:24.581 -0700>,<Administrator>,<X>,<proc1d>,<TOPSPIN 2.1>,
      <Start of raw data processing
       efp LB = 0 FT_mod = 6 PKNL = 1 PHC0 = 0 PHC1 = 0 SI = 32K 
       data hash MD5: 32K
       2F 20 A8 34 C4 40 5D A8 C5 8E 6B 65 00 93 E1 11>)
(   3,<2015-07-09 15:37:24.878 -0700>,<Administrator>,<X>,<proc1d>,<TOPSPIN 2.1>,
      <pk PHC0 = 89.91211 PHC1 = 0 
       data hash MD5: 32K
       F5 81 2A 7A 05 BA 3C 4A F5 11 51 D2 D5 75 E5 C1>)
(   4,<2015-07-09 15:37:25.003 -0700>,<Administrator>,<X>,<proc1d>,<TOPSPIN 2.1>,
      <abs ABSG = 1 
       data hash MD5: 32K
       0C D6 4B FB 13 99 82 E1 14 BC A2 47 61 F9 1B BF>)
(   5,<2015-07-09 15:37:25.066 -0700>,<Administrator>,<X>,<proc1d>,<TOPSPIN 2.1>,
      <abs ABSG = 2 
       data hash MD5: 32K
       58 B4 8D C6 B6 6A 6C 17 3C 9B 18 5B 6F 48 EA DE>)
(   6,<2015-07-09 15:37:25.128 -0700>,<Administrator>,<X>,<proc1d>,<TOPSPIN 2.1>,
      <abs ABSG = 3 
       data hash MD5: 32K
       4D DF D3 6D BF 62 2F 43 36 50 D1 C5 29 54 02 9B>)
(   7,<2015-07-09 15:37:25.175 -0700>,<Administrator>,<X>,<proc1d>,<TOPSPIN 2.1>,
      <abs ABSG = 4 
       data hash MD5: 32K
       6D 53 8C FC DE 9E A6 77 9C DF 52 2D 68 41 4F E3>)
(   8,<2015-07-09 15:37:25.238 -0700>,<Administrator>,<X>,<proc1d>,<TOPSPIN 2.1>,
      <abs ABSG = 5 
       data hash MD5: 32K
       E0 A5 34 76 8A E6 69 D2 A6 1D 76 3A FF 1B AB E6>)
$$ ##END=
$$ 
$$ $$ hash MD5
$$ $$ 38 22 FD DE A3 58 BA 10 4F 02 65 C4 82 9F AC 6D
##$RELAX= 
##$RELAX= 
##$RELAX= 
##$RELAX= 
##$RELAX= 
##$RELAX= 
##$RELAX= 
$$ Bruker specific parameters
$$ --------------------------
##$DU= <E:\>
##$EXPNO= 10
##$NAME= <NES1018_872015066_9266120_aT6socKug7>
$$ [...]
##$TP= (0..7)
150 150 150 150 150 150 150 150
##$TP07= 0
##$TPNAME0= <>
##$TPNAME1= <>
##$TPNAME2= <>
##$TPNAME3= <>
##$TPNAME4= <>
##$TPNAME5= <>
##$TPNAME6= <>
##$TPNAME7= <>
##$TPOAL= (0..7)
0.5 0.5 0.5 0.5 0.5 0.5 0.5 0.5
##$TPOFFS= (0..7)
0 0 0 0 0 0 0 0
##$TUNHIN= 0
##$TUNHOUT= 0
##$TUNXOUT= 0
##$USERA1= <user>
##$USERA2= <user>
##$USERA3= <user>
##$USERA4= <user>
##$USERA5= <user>
##$V9= 5
##$VALIST= <valist>
##$VCLIST= <CCCCCCCCCCCCCCC>
##$VD= 0
##$VDLIST= <DDDDDDDDDDDDDDD>
##$VPLIST= <PPPPPPPPPPPPPPP>
##$VTLIST= <TTTTTTTTTTTTTTT>
##$WBST= 2048
##$WBSW= 25
##$XGAIN= (0..3)
0 0 0 0
##$XL= 0
##$YL= 0
##$YMAX_a= 570462
##$YMIN_a= -481549
##$ZGOPTNS= <>
##$ZL1= 120
##$ZL2= 120
##$ZL3= 120
##$ZL4= 120
##$ABSF1= 14.98509
##$ABSF2= -5.573092
##$ABSG= 5
##$ABSL= 3
##$ALPHA= 0
##$AQORDER= 0
##$ASSFAC= 0
##$ASSFACI= 0
##$ASSFACX= 0
##$ASSWID= 0
##$AUNMP= <proc_prof1d_extract_pilot.lims>
##$AXLEFT= 0
##$AXNAME= <>
##$AXNUC= <1H>
##$AXRIGHT= 0
##$AXTYPE= 0
##$AXUNIT= <>
##$AZFE= 0.1
##$AZFW= 0.1
##$BCFW= 0
##$BC_mod= 0
##$BYTORDP= 0
##$COROFFS= 0
##$CY= 15
##$DATMOD= 1
##$DC= 0
##$DFILT= <>
##$DTYPP= 0
##$F1P= 0
##$F2P= 0
##$FCOR= 0.5
##$FTSIZE= 32768
##$FT_mod= 6
##$GAMMA= 0
##$GB= 0
##$INTBC= 1
##$INTSCL= 1
##$ISEN= 128
##$LB= 0
##$LEV0= 0
##$LPBIN= 0
##$MAXI= 10000
##$MC2= 0
##$MEAN= 0
##$ME_mod= 0
##$MI= 0
##$NCOEF= 0
##$NC_proc= -8
##$NLEV= 6
##$NOISF1= 0
##$NOISF2= 0
##$NSP= 0
##$NTH_PI= 0
##$NZP= 0
##$OFFSET= 14.98509
##$PC= 1
##$PHC0= 89.91211
##$PHC1= 0
##$PH_mod= 1
##$PKNL= yes
##$PPARMOD= 0
##$PPDIAG= 0
##$PPIPTYP= 0
##$PPMPNUM= 2147483647
##$PPRESOL= 1
##$PSCAL= 4
##$PSIGN= 0
##$PYNMP= <proc.py>
##$REVERSE= no
##$SF= 400.02
##$SI= 32768
##$SIGF1= 0
##$SIGF2= 0
##$SINO= 400
##$SIOLD= 32768
##$SPECTYP= <>
##$SREGLST= <1H.CDCl3>
##$SSB= 0
##$STSI= 32768
##$STSR= 0
##$SW_p= 8223.68421052631
##$SYMM= 0
##$S_DEV= 0
##$TDeff= 65536
##$TDoff= 0
##$TI= <>
##$TILT= no
##$TM1= 0
##$TM2= 0
##$TOPLEV= 0
##$USERP1= <user>
##$USERP2= <user>
##$USERP3= <user>
##$USERP4= <user>
##$USERP5= <user>
##$WDW= 1
##$XDIM= 32768
##$YMAX_p= 437822260
##$YMIN_p= -769093
##$CURPLOT= <Network HP LaserJet P1505>
##$CURPRIN= <$Network HP LaserJet P1505>
##$DFORMAT= <normdp>
##$LAYOUT= <+/1D_H.xwp>
##$LFORMAT= <normlp>
##$PFORMAT= <normpl>
##$SURQMSG= 1
$$ End of Bruker specific parameters
$$ ---------------------------------
##NTUPLES= NMR SPECTRUM
##VAR_NAME=  FREQUENCY,     SPECTRUM/REAL,   SPECTRUM/IMAG
##SYMBOL=    X,             R,               I
##VAR_TYPE=  INDEPENDENT,   DEPENDENT,       DEPENDENT
##VAR_FORM=  AFFN,          ASDF,            ASDF
##VAR_DIM=   32768,         32768,           32768
##UNITS=     HZ,            ARBITRARY UNITS, ARBITRARY UNITS
##FACTOR=    0.250966925370066, 1,           1
##FIRST=     8223.43324360094, -54234,       56167
##LAST=      0,             213562,          -98038
##MIN=       0,             -769093,         0
##MAX=       8223.43324360094, 437822260,    0
$$ Real data points
##PAGE= N=1
##DATA TABLE= (X++(R..R)), XYDATA
$$ [...]
19508A3804b08779d1320j78013C9049P1490a09430j59557k55402b42179f3708
$$ 13804 -208779 -41320 -219333 39049 110539 -109430 -268987 -524389 -242179 -63708
19497b17516I683f4066B35885b51413E1642b7632m67349c3790A68505a38166e4572
$$ -217516 9683 -64066 235885 -251413 51642 -27632 -494981 -33790 168505 -138166 -54572
19485A10153J1360d6987j10610L1241D0796a4644k85678a25352f367l75990D636
$$ 110153 121513 -46987 -157597 -126356 40796 -14644 -300322 -125352 -6367 -382357 4636
19473e49251a14302G1513A1859R8985m1955a37078a6867B00742i3745j7931B09885
$$ -549251 -114302 71513 11859 110844 68889 -137078 -16867 200742 -93745 -111676 209885
19461B35225B4735a91503C6794a73604A08332J41498a04230c6361M239G488c500
$$ 235225 24735 -191503 36794 -173604 108332 249830 -104230 -36361 -32122 7488 -3500
19449a26318A8503a35534A11502d0079j69801A25410b90499A69309G5423e9592
$$ -126318 18503 -135534 111502 -40079 -209880 125410 -290499 169309 75423 -59592
19438A27316c52851k2980a17659a0134k14559c4652B36675a49277E4774d5165
$$ 127316 -352851 -375831 -117659 -10134 -224693 -34652 236675 -149277 54774 -45165
19427H4910b91897B17677k7117c34573a07334A56833k8594c48535R17A36232b70635
$$ 84910 -291897 217677 190560 -334573 -107334 156833 128239 -348535 -347618 136232 -270635
19415a7084A18937C6942J96712i6792B9605P6272d5032j03094q0104R2210k54271
$$ -17084 118937 36942 233654 -96792 29605 105877 -45032 -148126 -228230 -136020 -390291
19404c90291A4736J5040a00239F0991c13520J01413D8725c78550k9762I5104a62302
$$ -390291 14736 29776 -100239 60991 -313520 -212107 48725 -378550 -408312 95104 -162302
19392C40444d467m2640j25155Q1957D5602a46745F787b11816d5968l0437L0970
$$ 340444 -4467 -47107 -172262 -90305 45602 -146745 6787 -211816 -45968 -76405 -45435
19381d5435k9564k60346a41966l60469K39684k2597f3059A96238E1630h0883j48275
$$ -45435 -74999 -335345 -141966 -502435 -262751 -285348 -63059 196238 51630 -80883 -229158
19370b29158A75273a04299A35220b08326E4899i7352B1953O3496b61275j72230
$$ -229158 175273 -104299 135220 -208326 54899 -97352 21953 85449 -261275 -433505
19360d33505a95477G4647b65740A53386J5511a20704A49749f7829O700A71418
$$ -433505 -195477 74647 -265740 153386 168897 -120704 149749 -67829 -61129 171418
19349A55d97605H2507b1162A10541K7139A7415N3015c12335f2690H2901a68497
$$ 155 -497605 82507 -21162 110541 137680 17415 70430 -312335 -62690 82901 -168497
19337c12099c0440F6047B1536Q0666L11866c9602j17313G1860j2149d0501H9951
$$ -312099 -30440 66047 21536 102202 414068 -39602 -156915 71860 59711 -40501 89951
19325b46087f7304k45233b9561A23040M0176b51278j0327B15811A5705O75b14466
$$ -246087 -67304 -312537 -29561 123040 163216 -251278 -261605 215811 15705 16380 -214466
19313b19733j9655B9892L30663a46677c2412A33475a32918D1249N9112D5524A094
$$ -219733 -239388 29892 360555 -146677 -32412 133475 -132918 41249 100361 45524 1094
19301b28376H6064a20300e0999K2784c219j75287O46k435I9382j1086J62423c21417
$$ -228376 86064 -120300 -50999 -28215 -3219 -178506 -177860 -180295 99382 88296 250719 -321417
19288g0550r1422G0667c64443i9081A11650a62286B5796a39614f7664j37574g2132
$$ -70550 -161972 70667 -364443 -99081 111650 -162286 25796 -139614 -67664 -205238 -72132
19276e504B60477b77119C6517a90335j82818J71623R9160E9312b02693B99535
$$ -5504 260477 -277119 36517 -190335 -373153 -201530 -102370 59312 -202693 299535
19265a62322B19484a92230C39297a82360A70928a39953H5981D0486b10555E4381
$$ -162322 219484 -192230 339297 -182360 170928 -139953 85981 40486 -210555 54381
19254a52373C8695A1984L77029A0855a75414j60514H167c24147A28020M608E387
$$ -152373 38695 11984 389013 10855 -175414 -335928 8167 -324147 128020 132628 5387
19242c0018B6671L3961b28683J4009K5634b3651A53298N036b30024A3742a89333
$$ -30018 26671 60632 -228683 -214674 -189040 -23651 153298 158334 -230024 13742 -189333
19230a39603A12836a45425A99002A4808K3688A8992d9745J1187k27584a032n3121
$$ -139603 112836 -145425 199002 14808 38496 18992 -49745 -38558 -266142 -1032 -54153
19219e4153n8661A85640k2777i3738j2968I5900a39180A21118P3961c78752E9170
$$ -54153 -112814 185640 162863 -93738 -106706 95900 -139180 121118 195079 -378752 59170
19207c28980e9590j13011N7130N6620m08299a8562k00235a00914k74791a74556
$$ -328980 -59590 -172601 -115471 -58851 -467150 -18562 -218797 -100914 -375705 -174556
19196a15966K2360j06075p8983L5328c5344j94218a6325j49567r967D7742e8640
$$ -115966 -93606 -199681 -278664 -243336 -35344 -229562 -16325 -165892 -175859 47742 -58640
19184b84834F3894a87790p632j1033c8441p1735F2108c15340H1089J36823p2766
$$ -284834 63894 -187790 -195422 -206455 -38441 -110176 62108 -315340 81089 217912 145146
19173A45146f378A55736c4474C8278a38810B6151c21492A10642A4971e05398A01412
$$ 145146 -6378 155736 -34474 38278 -138810 26151 -321492 110642 14971 -505398 101412
19161a87894D0251a08569B3818J2708a26142E2310c35407B9605c74121B59365
$$ -187894 40251 -108569 23818 36526 -126142 52310 -335407 29605 -374121 259365
19150A02863o553J08690a76294K5978j79846f1954G7037b97126A08315a65370
$$ 102863 96310 205000 -176294 -150316 -330162 -61954 77037 -297126 108315 -165370
19139a10115C19362c7823q6213c7036C39208c44993J33628d4376p7286l0539b2249
$$ -110115 319362 -37823 -124036 -37036 339208 -344993 -211365 -44376 -121662 -152201 -22249
19127A9343a13621D9815E253a68344C9703j1808a50753b8383j0624k10290H5459
$$ 19343 -113621 49815 5253 -168344 39703 27895 -150753 -28383 -39007 -249297 85459
19115A80544c978k45340L2347C9075a46849A25687a7939A41996b27451e1393l6714
$$ 180544 -3978 -249318 -216971 39075 -146849 125687 -17939 141996 -227451 -51393 -88107
19104h8107C07876F5415a81099H0235b2391A35830a59828C0694a01348B02989
$$ -88107 307876 65415 -181099 80235 -22391 135830 -159828 30694 -101348 202989
19093b54998J26685l6821D0481c89209B09944o2074d35892e1787A25401a36863
$$ -254998 -128313 -165134 40481 -389209 209944 147870 -435892 -51787 125401 -136863
19082a8849j21478o1611f3729P99J0338k63006D3515I498a33677k5170c3600k84290
$$ -18849 -140327 -201938 -63729 -62930 -52592 -315598 43515 9498 -133677 -158847 -33600 -317890
19070c17890g9017D834a72049d1514k71345e2242m08881a99579D5236J7354a31621
$$ -317890 -79017 4834 -172049 -41514 -312859 -52242 -461123 -199579 45236 62590 -131621
19058C2550f5083A37724a17814F8230k3075d12397a07734F2709K57822b42586
$$ 32550 -65083 137724 -117814 68230 45155 -412397 -107734 62709 320531 -242586
19047b96957L1991g843A3011J12033d19199B093J16816m513e7124j60107c1518
$$ -296957 -264966 -7843 13011 125044 -419199 2093 118909 114396 -57124 -217231 -31518
19035f6577A20184K33490B8586l796J05821b22560J9681i4126j08332I2309i8766
$$ -66577 120184 353674 28586 24790 130611 -222560 -202879 -94126 -202458 92309 -98766
19023E1552J23981a13886F5032b64336f4241A48410b79192N5036P2785g0725c3630
$$ 51552 175533 -113886 65032 -264336 -64241 148410 -279192 -224156 -151371 -70725 -33630
19011d9193D7773g659m5144l4176A32527e063A34211f1972E9882a96077A16113
$$ -49193 47773 -7659 -52803 -86979 132527 -5063 134211 -61972 59882 -196077 116113
18999b38750B09351c40284a59918g2321d933I7637a22222p679L8271A96354a26221
$$ -238750 209351 -340284 -159918 -72321 -4933 97637 -122222 -129901 -91630 196354 -126221
18987b74903b8968D6217F088L50074H3453d282I664e3896j79427Q2467B47652
$$ -274903 -28968 46217 6088 356162 83453 -4282 9664 -53896 -233323 -150856 247652
18975a12836q5750h2708q5402O6518r9760j5301B87356a8392A0705a58264j80966
$$ -112836 -198586 -82708 -168110 -101592 -201352 -216653 287356 -18392 10705 -158264 -339230
18964c39230m674d828n3750m2659j10803l57528a28990D3872b13841P7674B37993
$$ -339230 -343904 -4828 -58578 -101237 -212040 -569568 -128990 43872 -213841 -136167 237993
18952a47313J9867O1625b1497l23475b8786A10141e5260J6588r3365e3601A4487
$$ -147313 -127446 -65821 -21497 -344972 -28786 110141 -55260 -38672 -132037 -53601 14487
18940A05396i738n2359m0814F3251d0879A8169J86290e85A93919j8873a71958
$$ 105396 -9738 -62097 -102911 63251 -40879 18169 204459 -585 193919 175046 -171958
18928b00921G211b37755A57910c2840j53277K6879f3464j14110B02198g2406j862
$$ -200921 7211 -237755 157910 -32840 -186117 -159238 -63464 -177574 202198 -72406 -74268
18917g4268A01579M234b26436J6502F7733L3594f5556r6597J578a4258j28063
$$ -74268 101579 105813 -226436 -209934 67733 101327 -65556 -162153 -160575 -14258 -142321
18906a42321A44561K1317R8722a26827C93036b15829k612H4084d54B60279a35670
$$ -142321 144561 165878 264600 -126827 393036 -215829 -218441 84084 -454 260279 -135670
18894a35048k61563f250A9584i7927j39202q9778A67925J19794D2871a40481D4646
$$ -135048 -396611 -6250 19584 -97927 -237129 -326907 167925 287719 42871 -140481 44646
18882a04044A86133q5877h9345o6948d464j29349j48015K310a32354l7062O7524
$$ -104044 186133 100256 -89345 -156293 -4464 -133813 -281828 -279518 -132354 -169416 -101892
18871a01892F2296a8632A46670b9949n4927k54046a31180b9411A33488J4068c9965
$$ -101892 62296 -18632 146670 -29949 -84876 -338922 -131180 -29411 133488 147556 -39965
18859g1299C5728O5822c3185j21795r5933K3418C0392d3591j13602c4572G6326
$$ -71299 35728 101550 -33185 -154980 -250913 -227495 30392 -43591 -157193 -34572 76326
18847B49368a40077A39225c37781i3423j94052a36374A70065e343B05983a52335
$$ 249368 -140077 139225 -337781 -93423 -287475 -136374 170065 -5343 205983 -152335
18836g6062A92703L5055G823a35094D184b98172A84449f946j16179B5591a28898
$$ -76062 192703 227758 7823 -135094 4184 -298172 184449 -6946 -123125 25591 -128898
18824A2233L5654J65305a3793l4580a1854m0500B05907a18715b7466j20583H1186
$$ 12233 47887 213192 -13793 -48373 -11854 -52354 205907 -118715 -27466 -148049 81186
18812E0411J1394O3320J42696b33967a05053C13602a06170c680j06006B15078
$$ 50411 61805 125125 267821 -233967 -105053 313602 -106170 -3680 -109686 215078
18801A59524l1044a19182p2426n2122k2160A45564b00420B42690a59578B8014
$$ 159524 128480 -119182 -191608 -243730 -265890 145564 -200420 242690 -159578 28014
18790A38648b9788L825H9571b9306j7249j25473d5625k86407A4565h8409A68372
$$ 138648 -29788 -25963 89571 -29306 -46555 -172028 -45625 -332032 14565 -88409 168372
18778A28728a58710A58651a28198M0658A19054m9880b62783A5283R5357e19033
$$ 128728 -158710 158651 -128198 -87540 119054 69174 -262783 15283 110640 -519033
18767A21758a32058J4286A17489a71819A19883l4141g4928A28865b00024r9161
$$ 121758 -132058 -117772 117489 -171819 119883 85742 -74928 128865 -200024 -299185
18757b99185g0981L0850A19935e9286F2361j7081c61210J58014a0208j05891E0643
$$ -299185 -70981 -40131 119935 -59286 62361 45280 -361210 -203196 -10208 -116099 50643
18745a29670k3607j23592h4854j14895D3928a82883j87224G5825a4679j30956
$$ -129670 -153277 -276869 -84854 -199749 43928 -182883 -370107 75825 -14679 -145635
18735a45635K2593A8214J01006J16545C5510g3681P330m15694A4139R7569E0134
$$ -145635 -123042 18214 119220 235765 35510 -73681 -66351 -482045 14139 111708 50134
18723c831G8375a20799A29787B6936J38974L7590r645j8372i0557j64812k7458
$$ -3831 78375 -120799 129787 26936 165910 203500 193855 175483 -90557 -255369 -282827
18712b82827A03602a90286j17985E6280j549a6716E3398g0828m1732F970a80389
$$ -282827 103602 -190286 -308271 56280 54731 -16716 53398 -70828 -112560 6970 -180389
18700h2460A89984a1424l19088a1825E9003a99363B2378B644i9457C6142J28046
$$ -82460 189984 -11424 -330512 -11825 59003 -199363 22378 2644 -99457 36142 164188
18689A64188i352E2743c24924b7892r4335j0576j20441N6581P6256H936N168i3280
$$ 164188 -9352 52743 -324924 -27892 -122227 -132803 -253244 -196663 -120407 8936 14104 -93280
18676e716j85741g493l66539a76423g5717o3786K297A63698h0824A99398a66j65190
$$ -5716 -191457 -7493 -374032 -176423 -75717 -139503 -137206 163698 -80824 199398 -166 -165356
18664a65356j05824b8756k7927b4860F653M7283b17965C70100a53087I4867C0310
$$ -165356 -271180 -28756 -56683 -24860 6653 53936 -217965 370100 -153087 94867 30310
18652G476K02739a67639j23160C29000H1370a12100e2038H506i3313j53435B26571
$$ 7476 210215 -167639 -290799 329000 81370 -112100 -52038 8506 -93313 -246748 226571
18640i4137j65276i477k25079a797C10591b23933O2172P5705C2375K97413i1144
$$ -94137 -259413 -9477 -234556 -1797 310591 -223933 -161761 -86056 32375 329788 -91144
18628e1139o3764B3952a10462K1611G4678d783G2831f8143n4553I1460b08423
$$ -51139 -114903 23952 -110462 -88851 74678 -4783 72831 -68143 -122696 91460 -208423
18616h3239q4621j11871M1892C7240A3132J90868b62192b7251H823i5312A44625
$$ -83239 -167860 -279731 -237839 37240 13132 204000 -262192 -27251 8823 -95312 144625
18604d82954a96115D5607d2582A96361i0612B04978h4993D77209a25364A61546
$$ -482954 -196115 45607 -42582 196361 -90612 204978 -84993 477209 -125364 161546
18593d91078A09218a20926N5438g733j67172P6048q9944A32368d18802C415a94736
$$ -491078 109218 -120926 -65488 -7733 -174905 -98857 -188801 132368 -418802 3415 -194736
18581f1853b43j27266H1265K85429b41701A7951J41324B5456a0847j41150f1530
$$ -61853 -243 -127509 81265 366694 -241701 17951 159275 25456 -10847 -151997 -61530
18569b13736O586a5495D6600K29865C7036q834b55036N5734J2617k32904A24594
$$ -213736 -207150 -15495 46600 276465 37036 28202 -255036 -199302 -186685 -419589 124594
18557A48509b39650a15671H6322i2518B47349g8543j87970e3057B6498a81620
$$ 148509 -239650 -115671 86322 -92518 247349 -78543 -266513 -53057 26498 -181620
18546g9145o6190B31054c51993A42848F0139b4017A91020o2227a75016A22230
$$ -79145 -145335 231054 -351993 142848 60139 -24017 191020 128793 -175016 122230
18535a59600B46643d83300F676J2478a74055f2808k8840p4437k20137h9686p1062
$$ -159600 246643 -483300 6676 19154 -174055 -62808 -91648 -166085 -386222 -89686 -160748
18524a60748J1665J5429A44340J30263b061k4191P617k95555a55681K4204C14527
$$ -160748 -149083 -133654 144340 274603 -2061 -26252 -18635 -314190 -155681 -131477 314527
18512i7106G0569Q5615o4467Q7407b17477A81511a77677F0257k4219a52634o9391
$$ -97106 70569 156184 91717 179124 -217477 181511 -177677 60257 36038 -152634 -222025
18501b22025Q2555B78179a66608f1728B2782f0317J7350A9316f6216A96745a57357
$$ -222025 -139470 278179 -166608 -61728 22782 -60317 -42967 19316 -66216 196745 -157357
18489A26528f5061D8524e4838q4191j52884A4774L07126A5888b0296k78135A69980
$$ 126528 -65061 48524 -54838 -139029 -291913 14774 321900 15888 -20296 -298431 169980
18477B92066j533c6975j31475b8082k15237B11820p5734H997b23149G3056B1599
$$ 292066 290533 -36975 -168450 -28082 -243319 211820 136086 8997 -223149 73056 21599
18465A62415b90222J07794l1069c2911j54101r9492B03603c14270A7203a99295
$$ 162415 -290222 -182428 -213497 -32911 -187012 -286504 203603 -314270 17203 -199295
18454a09178j47807A53887g4329A52261c4167k23496f5058A52583b84623R4205
$$ -109178 -256985 153887 -74329 152261 -34167 -257663 -65058 152583 -284623 -190418
18444a90418f8326m8008n717k0170B42805G8312a23599A15496h866j03365o7776
$$ -190418 -68326 -116334 -122051 -142221 242805 78312 -123599 115496 -8866 -112231 -180007
18433a80007A91603m9048a79920m2535D9117A3695h6226k6768B04068i6426N959
$$ -180007 191603 142555 -179920 -222455 49117 13695 -86226 -112994 204068 -96426 -90467
18422i0467B2365O6392a28454j9314I6278J51937i281E9358a07269k09376b9748
$$ -90467 22365 88757 -128454 -147768 96278 248215 -9281 59358 -107269 -316645 -29748
18410A12762b49937h6073A79885q0225J03283a54111r1263P702J07036N0002a8250
$$ 112762 -249937 -86073 179885 99660 202943 -154111 -245374 -237672 -130636 -80634 -18250
18398B683d3946A26905c05824l6985P2698a31001A37761C9484a20562c9332o0140
$$ 2683 -43946 126905 -305824 -342809 -270111 -131001 137761 39484 -120562 -39332 -99472
18387i9472K6954C320a773B86498b21676F1269b8499a2188j05002j9655O7162
$$ -99472 -72518 3320 -1773 286498 -221676 61269 -28499 -12188 -117190 -136845 -69683
18376f9683j20535f2550K708G975K7296d1452D4256K1317K15949D4315J04438
$$ -69683 -190218 -62550 -59842 7975 35271 -41452 44256 65573 281522 44315 148753
18365A48753l8266l8664D93K79327b90444i5388F2550a28454l54709D1606a0867
$$ 148753 110487 71823 493 279820 -290444 -95388 62550 -128454 -483163 41606 -10867
18353C8764a31347M6471n1087q1832B73658e0108Q085p9095j52428A79407b1674
$$ 38764 -131347 -84876 -135963 -217795 273658 -50108 -42023 -121118 -273546 179407 -21674
18341e6584o1685B3467K4898g0595L1184j90215r8505J25410Q3769L7020k1084
$$ -56584 -118269 23467 48365 -70595 -39411 -229626 -328131 -202721 -118952 -81932 -103016
18330a03016A62204k3497M23057A68139a00649j32586J15724k0511H1539l9705
$$ -103016 162204 138707 561764 168139 -100649 -233235 -117511 -138022 81539 41834
18320D1834b06407M8166A55293b04569A6105K59877a73433g4192C9206b23429
$$ 41834 -206407 -158241 155293 -204569 16105 275982 -173433 -74192 39206 -223429
18309D8252M8871a48066L9948A03488j9635J56278j01548g05j29711j42235A35785
$$ 48252 97123 -148066 -108118 103488 83853 240131 138583 -705 -130416 -272651 135785
18297c41832h0718c6706m8605j73987B58890c00544H3802b27847A06327J50466
$$ -341832 -80718 -36706 -85311 -259298 258890 -300544 83802 -227847 106327 256793
18287B56793B1091a20848a6329A30948a54239B12645J2307N7406B0762J86857
$$ 256793 21091 -120848 -16329 130948 -154239 212645 224952 282358 20762 207619
18277B07619p6296F0772H969J34080m1859g1096h920q4621A01653N3197b89002
$$ 207619 131323 60772 8969 143049 101190 -71096 -8920 -93541 101653 154850 -289002
18265b30512o5230E8353a94060i0157q3310A18124j3507a7957j62517B90337a69693
$$ -230512 -295742 58353 -194060 -90157 -173467 118124 104617 -17957 -180474 290337 -169693
18253a22682d2971k7296A07201J23311I9312B545P3735a19709A9188a06514B26356
$$ -122682 -42971 -70267 107201 230512 99312 2545 76280 -119709 19188 -106514 226356
18241C29324a21231r5666a07564j83900f1960a837B7837K66470b34723A66862
$$ 329324 -121231 -216897 -107564 -291464 -61960 -1837 27837 294307 -234723 166862
18230d4179A99366p6258L526g3240j279p6864P2933H8227a9790l79444h7341C2349
$$ -44179 199366 123108 126634 -73240 -74519 -151383 -78450 88227 -19790 -399234 -87341 32349
18217a06909m2421M1965A09050C6781A5255g4943A89699a62038E1605I095a23959
$$ -106909 -149330 -107365 109050 36781 15255 -74943 189699 -162038 51605 9095 -123959
18205I8297h6400A21747B0754A921a99656J9139G1511J57638a66772F5229E357
$$ 98297 -86400 121747 20754 1921 -199656 -180517 71511 229149 -166772 65229 5357
18193I5830b30456A22977e6763E2855e8685B91358A09860g6113j32182F9096a2075
$$ 95830 -230456 122977 -56763 52855 -58685 291358 109860 -76113 -208295 69096 -12075
18181A0850R4279C5567O6801M9569a26867B9107b98786a7998B13065a16176L4192
$$ 10850 105129 35567 102368 151937 -126867 29107 -298786 -17998 213065 -116176 -81984
18170h1984k55724B14608C2663b0764k47992B4419K363J37486F8715i3321m3857
$$ -81984 -337708 214608 32663 -20764 -268756 24419 26782 164268 68715 -93321 -137178
18159a37178A84289d6791l71417A66436P9318b68525A11578n1319L866a01400
$$ -137178 184289 -46791 -418208 166436 245754 -268525 111578 60259 64125 -101400
18148a0035j3461I8512g5029k66994h8662A74680P0115a80707A35009O028f7866
$$ -10035 -23496 98512 -75029 -342023 -88662 174680 244795 -180707 135009 141037 -67866
18136G3573k0711K51691j43281J49319c9670k68903G9379G808d2619I2795c50109
$$ 73573 52862 304553 161272 310591 -39670 -308573 79379 7808 -42619 92795 -350109
18124B14067G2910h4722j25401P0077B34634H4530g5667I6195A9081J0415a22356
$$ 214067 72910 -84722 -210123 -140046 234634 84530 -75667 96195 19081 29496 -122356
18112a9994q5791A91048C8311b18750A07178b82304a37429c7902k9537b2883j97419
$$ -19994 -105785 191048 38311 -218750 107178 -282304 -137429 -37902 -67439 -22883 -220302
18101b20302K7786O3270C14033a32144P178F4210a52532J3539q0251o9249C8633
$$ -220302 -192516 -129246 314033 -132144 -124966 64210 -152532 -138993 -219244 -288493 38633
18089C1207e3208a4372r0618G0255d4169R624C21091b13890N0591B66084a85285
$$ 31207 -53208 -14372 -104990 70255 -44169 -34545 321091 -213890 -163299 266084 -185285
18077i5132b2884E8203b9923D5169c78226a43532e5693B23561M821b35622A59614
$$ -95132 -22884 58203 -29923 45169 -378226 -143532 -55693 223561 228382 -235622 159614
18065G4962c67019A34529B9257a7677k36973H2264g381j2650l4160j52050I9167
$$ 74962 -367019 134529 29257 -17677 -254650 82264 -7381 -20031 -54191 -206241 99167
18053A74519m0255a67279m9320E2336d02677c2345o5811o1880K5709K9736p716
$$ 174519 134264 -167279 -216599 52336 -402677 -32345 -98156 -160036 -134327 -104591 -112307
18042a12307k17240f3598A45703e4710k24463A02882D0282J80766F5713b62075
$$ -112307 -329547 -63598 145703 -54710 -279173 102882 40282 221048 65713 -262075
18031a1683H3228a76257b0776j11943B9314L58259D8128a35496j41908I1079d3941
$$ -11683 83228 -176257 -20776 -132719 29314 387573 48128 -135496 -277404 91079 -43941
18019f1111A76621C9227g155j7442L38j81184A9752h8254g988D6584J60670q8237
$$ -61111 176621 39227 -7155 -24597 -24259 -205443 19752 -88254 -7988 46584 207254 119017
18007A19017a72351N2760C62353A4080L392a0564H7287j5565K1488c01231C5457
$$ 119017 -172351 -119591 362353 14080 17472 -10564 87287 71722 93210 -301231 35457
17995A8479b35732H4964a98682g8355A56970a22404G2969A421g2217m2047j72950
$$ 18479 -235732 84964 -198682 -78355 156970 -122404 72969 1421 -72217 -114264 -287214
17984b87214L7377E10662a10376a6658k8177A8791J6424b07702q2418b0407D7709
$$ -287214 -249837 510662 -110376 -16658 -44835 18791 35215 -207702 -290120 -20407 47709
17972A54612p3499b5811A82693c74471e9269K3003F1582b6241k14276A4775b4626
$$ 154612 81113 -25811 182693 -374471 -59269 -36266 61582 -26241 -240517 14775 -24626
17960a64127j26183a1193B08781p1525b6009A31032c50355G2099a86106M6787
$$ -164127 -290310 -11193 208781 137256 -26009 131032 -350355 72099 -186106 -139319
17950a39319C85559A44932a40210B31935j13857J720E2833Q8763K28003n4944
$$ -139319 385559 144932 -140210 231935 118078 119798 52833 141596 369599 314655
17940C14655B6018J79978a08908F407h3105a0545B52809E6290r398O5432b85606
$$ 314655 26018 205996 -108908 6407 -83105 -10545 252809 56290 46892 112324 -285606
17928a86498N6822a6299B57026E5830a04177J8743b3483p6263H5516J11010m4129
$$ -186498 -129676 -16299 257026 55830 -104177 -85434 -23483 -99746 85516 196526 152397
17917A52397F8001a73059c4655l1762J1012A25802a74620b7234j9026B02408G1603
$$ 152397 68001 -173059 -34655 -66417 -55405 125802 -174620 -27234 -46260 202408 71603
17905A43609a56881o3710N3394p7157d8485C03962f0479A55905E0685a06532C858
$$ 143609 -156881 -220591 -167197 -244354 -48485 303962 -60479 155905 50685 -106532 3858
17893b5204B51848p0686J10806q8777m3584Q3093c28586A07280b5662o158j26693
$$ -25204 251848 181162 291968 203191 159607 242700 -328586 107280 -25662 -31820 -158513
17882a58513B27489g7596C461Q8557P6159c5501E4377J55556M2748A3885J140
$$ -158513 227489 -77596 3461 92018 168177 -35501 54377 209933 252681 13885 15025
17871A5025J33511N4441r4076D7243J33617C7978K33624a71867l9769q9744f3997
$$ 15025 148536 202977 108901 47243 180860 37978 271602 -171867 -211636 -301380 -63997
17859g510H1417i5231A49908B1519q397M0913g127A20421D6529O5267J47780h1805
$$ -7510 81417 -95231 149908 21519 13122 54035 -7127 120421 46529 111796 259576 -81805
17846c2355B71999c38060A89882a86116B18157a09440c6677o4142k08946C1067
$$ -32355 271999 -338060 189882 -186116 218157 -109440 -36677 -100819 -309765 31067
17835b4355j38961a2627M380j95063j9318A9324a56591A29438j2863a00524j45470
$$ -24355 -163316 -12627 -8247 -203310 -222628 19324 -156591 129438 116575 -100524 -245994
17824b45994K9976A73826o5055K34176q0630b25305F6213e45436b13736D5859
$$ -245994 -216018 173826 108771 342947 262317 -225305 66213 -545436 -213736 45859
17813b43918B19964C7222J52179e3971B50286f6939A44581b58747B04873E7870
$$ -243918 219964 37222 189401 -53971 250286 -66939 144581 -258747 204873 57870
17802d5581F1143A4528b32079D578L9653a8108I1682A276Q4761P05J19149r1382
$$ -45581 61143 14528 -232079 4578 44231 -18108 91682 1276 86037 86742 205891 114509
17790A14509a7713D2855b07308i1945A77826J00477K489A3310R5675a550j32163
$$ 114509 -17713 42855 -207308 -91945 177826 278303 280792 13310 108985 -1550 -133713
17779a33713j55986e2289C30083A63952c5951k8411A48854C0250J16876p064b31264
$$ -133713 -289699 -52289 330083 163952 -35951 -64362 148854 30250 147126 140062 -231264
17767D4039a49142A65055b1297G0223a34007K5092A10701J04333i1071r2300j2474
$$ 44039 -149142 165055 -21297 70223 -134007 -108915 110701 215034 -91071 -183371 -195845
17756a95845H402J05712a34107G5819b70665g075l14062B18112E6986K7949e9557
$$ -195845 8402 114114 -134107 75819 -270665 -7075 -321137 218112 56986 84935 -59557
17744C38477A29750O1528J62114A23128m2176K2137j9870R2787Q8967j21465a06241
$$ 338477 129750 191278 353392 123128 80952 103089 83219 176006 264973 143508 -106241
17732A34286n8480B4743h8112L5016C12831D3232L13785i7566D5575K62973F3552
$$ 134286 75806 24743 -88112 -53096 312831 43232 357017 -97566 45575 308548 63552
17720c5072A15111a8398j95736B8692c5415A38193K19872A1283a4841A83746g6484
$$ -35072 115111 -18398 -214134 28692 -35415 138193 358065 11283 -14841 183746 -76484
17708b4644B55233I3516L1727k6227L5552l2713a88996A98748k3664c2944A72036
$$ -24644 255233 93516 125243 99016 134568 101855 -188996 198748 175084 -32944 172036
17696A21857K94939r5124G2407e8325B06050J73435j41349b24212a03183M0962
$$ 121857 416796 321672 72407 -58325 206050 379485 238136 -224212 -103183 -62221
17686f2221A16848j1026i3395M1035j11551E1781K5316J04465J67093j24497e7182
$$ -62221 116848 105822 -93395 -52360 -163911 51781 77097 181562 348655 224158 -57182
17674E5675L7580P0149a96813A87970h0109A33279m7002a45983H5765h5961k91446
$$ 55675 93255 163404 -196813 187970 -80109 133279 86277 -145983 85765 -85961 -377407
17663c77407c6269r1146B02879M3911F8975a34482C38803k9218K20003B691d7410
$$ -377407 -36269 -127415 202879 246790 68975 -134482 338803 309585 529588 2691 -47410
17651B0498a30689F2843L288R0931a17113q7944Q5903C595M9120J51157C8524
$$ 20498 -130689 62843 66131 157062 -117113 -205057 -119154 3595 52715 203872 38524
17639B57806j00309G8678c7630B509L6951J52335p0727k9654b28454H4919K04209
$$ 257806 157497 78678 -37630 2509 39460 191795 121068 91414 -228454 84919 289128
17628B89128p2727A05672J43268b37981B49528K2007b72967B74011g2715F4006
$$ 289128 216401 105672 248940 -237981 249528 271535 -272967 274011 -72715 64006
17617C18151g6655q5523b8832H1785b42962A38831b08943A23211J23797G7153
$$ 318151 -76655 -162178 -28832 81785 -242962 138831 -208943 123211 247008 77153
17606i9570o9028I5830Q7744a64159D2208E070a12732j50395e6224C49591i1763
$$ -99570 -168598 95830 183574 -164159 42208 5070 -112732 -263127 -56224 349591 -91763
17594d8133I1799B2185c0838D1169a14547M6942A3354J73130C5224b70204C06411
$$ -48133 91799 22185 -30838 41169 -114547 -67605 13354 186484 35224 -270204 306411
17582B16939L06958e148D1962J4681K69284a88312A80387n3751d71375a17358
$$ 216939 523897 -5148 41962 56643 325927 -188312 180387 126636 -471375 -117358
17571A67638a01397m3243B43266g2413B46105H727L46375a07356c9551j466B24087
$$ 167638 -101397 -144640 243266 -72413 246105 8727 355102 -107356 -39551 -41017 224087
17559A23062L96652b37758E9082B1791d765B8207a25253d3941C11379A3992J85866
$$ 123062 519714 -237758 59082 21791 -4765 28207 -125253 -43941 311379 13992 199858
17548A99858m8886c2469B91042G878b9744B82318C1768M8418K96822j43785A00355
$$ 199858 150972 -32469 291042 7878 -29744 282318 31768 80186 377008 233223 100355
17536G1847a07782e084E12456F7539P1761b2446C18666a13570C45339A23807J41276
$$ 71847 -107782 -5084 512456 67539 139300 -22446 318666 -113570 345339 123807 265083
17525B65083q7357K3044N6171K21907j31652K714K0124K13695B79355o1615n7197
$$ 265083 177726 200770 256941 478848 347196 349910 370034 583729 279355 217740 160543
17514A60543J08790a61554B56426F0575M02842F3585L18469L78438l48357K61424
$$ 160543 269333 -161554 256426 60575 463417 63585 382054 760492 412135 673559
17504F73559B48702J53930A60945R9706J09492b1638B30848m813o0138k0520f1966
$$ 673559 248702 402632 160945 260651 370143 -21638 230848 226035 165897 145377 -61966
17492B45865c04489A58907e5924A44244J10976a08078a3237B91430q6967a2402
$$ 245865 -304489 158907 -55924 144244 255220 -108078 -13237 291430 204463 -12402
17481B21546L95355f4554I0054L21663A72600k7032K61521B2112N6410J19601
$$ 221546 616901 -64554 90054 411717 172600 145568 407089 22112 78522 198123
17471A98123F4065B9442J41879K15140D6984J4935i019A14896L70386A39445L00064
$$ 198123 64065 29442 171321 386461 46984 61919 -9019 114896 485282 139445 439509
17460D39509n1262A39080K7266K90287A58420n4626R5895m9838L1945l7211a85160
$$ 439509 388247 139080 166346 456633 158420 103794 199689 149851 181796 144585 -185160
17448B24851J24319N0616p7862J20741o7411l6425j29561r2228K37258A55417
$$ 224851 349170 399786 321924 442665 375254 338829 209268 117040 354298 155417
17437B56234g6641C74649k3936A0450J32934J57641L4105j08539L6406L45816
$$ 256234 -76641 374649 350713 10450 143384 301025 335130 226591 262997 608813
17427F08813k66136L8515A47704K00841m8666L37721a16395A65127K90353k09615
$$ 608813 342677 381192 147704 348545 299879 637600 -116395 165127 455480 245865
17417B45865J36981q4263a55519C63803H8024M3949M5074D5066J48808G6365k207
$$ 245865 382846 298583 -155519 363803 88024 131973 177047 45066 193874 76365 74158
17406G4158C5759J41810K2452j5674J8496q2661J14951a08883B98850b3307A33776
$$ 74158 35759 177569 200021 184347 202843 120182 235133 -108883 298850 -23307 133776
17394C15366l2999j39950J90598j02421H9660R3874H4753J18783A9644L22274
$$ 315366 282367 142417 333015 230594 89660 183534 84753 203536 19644 341918
17384C41918j66313D8241e0006D06222k8149a16661g94B16709a9186k40919A43488
$$ 341918 175605 48241 -50006 406222 378073 -116661 -794 216709 -19186 -260105 143488
17372C24690G7739M0309B0547K46860e3505a1202j44371A82602M3928E5504N86357
$$ 324690 77739 118048 20547 267407 -53505 -11202 -155573 182602 226530 55504 641861
17361F41861k52350A77020d5894C40656N873B4032M12361A0459J66924G7182l0538
$$ 641861 389511 177020 -45894 340656 346529 24032 436393 10459 177383 77182 46644
17350D6644a3826F05029B61350o9762J69069F7862Q5753B8730J19717O7961n8259
$$ 46644 -13826 605029 261350 191588 360657 67862 153615 28730 148447 216408 158149
17339A58149L9483K87216C5215M37416n2450j09829L3583A8995L29921r7888g952
$$ 158149 197632 484848 35215 472631 420181 310352 343935 18995 348916 251028 -7952
17327C37835m9969D0982O9245K28592o4897g8756k118H5876K18593o3575j6248
$$ 337835 287866 40982 110227 338819 273922 -78756 -80874 85876 304469 240894 224646
17316B24646B3052c7450B74650n2719f0302B31870p5370N1435N3689P9209O4778
$$ 224646 23052 -37450 274650 221931 -60302 231870 156500 207935 261624 340833 405611
17305D05611A08400L68323B11112e2304A7413K34541k3313K15803A59028G1725
$$ 405611 108400 476723 211112 -52304 17413 251954 228641 444444 159028 71725
17294C52708C525M31362L9514j78801C0079K96567r922j25450k9889J29482q26
$$ 352708 3525 434887 474401 295600 30079 326646 316724 191274 161385 290867 290041
17283B90041B5421P7594m3448J15673M9253A04963J43257o6755n0264c2340D07233
$$ 290041 25421 103015 59567 175240 224493 104963 248220 181465 131201 -32340 407233
17271H7630M71214B62700A26562M48809k62526o5434N3532P2378p1029m5483K80991
$$ 87630 558844 262700 126562 575371 312845 247411 300943 373321 302292 256809 537800
17260E37800A77612p7980J9955M7396L80326k11167N7977j36911a26947A1933
$$ 537800 177612 99632 119587 166983 547309 336142 394119 257208 -126947 11933
17249C22821L5476O8897F8493M5519K16206o3568J59028j50986p4654K85683B36137
$$ 322821 358297 427194 68493 114012 330218 266650 425678 274692 200038 485721 236137
17237a50728A65255L43629r2575A28129M99615l03157a01807F92137B54446J14470
$$ -150728 165255 508884 416309 128129 627744 324587 -101807 692137 254446 368916
17227C68916A39900N10J95219K58023B59119P5414j39730K39363j68508p0757
$$ 368916 139900 140410 335629 593652 259119 334533 194803 434166 265658 194901
17217A94901J18543O5791A80071L72716J46122k29441J51077l02846j4685L5549
$$ 194901 313444 379235 180071 552787 698909 469468 620545 317699 303014 338563
17207C38563l3208j40041J5137I089b30364B66946J49682Q9732K7589j89768L94724
$$ 338563 305355 165314 180451 9089 -230364 266946 416628 506360 533949 344181 738905
17196G38905C20286N9429k061o364J23630B28803q5589P1649Q0181M3114J98140
$$ 738905 320286 379715 377654 371290 494920 228803 143214 214863 295044 338158 536298
17185E36298B14744L97113j00335j34835j59544K34985A75097J88305A47446R6545
$$ 536298 214744 611857 511522 376687 217143 452128 175097 363402 147446 243991
17175B43991O970L83200B98524F8144K50143Q7067K9470J03305p5282j54029H6280
$$ 243991 250961 634161 298524 68144 318287 405354 434824 538129 462847 308818 86280
17163G07768H538O35166B41889J86935J8955j54980K49528A37451J01853Q3059
$$ 707768 8538 643704 241889 428824 447779 292799 542327 137451 239304 322363
17153C22363N358J98683j36968N9174K2613k4414o5339o7951N05809k89595m4042
$$ 322363 327721 526404 389436 448610 471223 446809 381470 313519 819328 529733 485691
17142D85691j81919J72012n7j54259J74794k37141J62985j7712J80324R2164j55930
$$ 485691 303772 475784 475727 321468 496262 259121 422106 404394 584718 676882 520952
17131E20952k59492j26069K42764J20895M0420M8215k7493J22849B59429p8740
$$ 520952 261460 135391 378155 499050 539470 587685 560192 683041 259429 180689
17121A80689j8245K48114J0101R9748j4277k33278J34728K74655K01585j68721
$$ 180689 162444 410558 420659 520407 506130 272852 407580 682235 883820 715099
17111G15099M0676j45947n6347o3479J47228O0588j82723J91340j394k05077J66807
$$ 715099 755775 609828 553481 490002 637230 697818 515095 706435 705041 499964 666771
17100F66771B83388M76481j60198K811o3843j1494R2180R8974Q1786k82220J75739
$$ 666771 283388 759869 599671 602482 538639 527145 619325 718299 800085 517865 693604
17089F93604k6207m1301k55489L31129J68009j20537N0661j24920N1919j21521
$$ 693604 667397 626096 370607 701736 869745 749208 799869 674949 726868 605347
17079F05347J71259l00207K27192p7081r8527K6674J55433K24883j35347K59114
$$ 605347 776606 476399 703591 626510 527983 554657 710090 934973 799626 1058740
17069A058740k18218j99885P7909j07565J71315J6514r547M0040J1994k1475J12672
$$ 1058740 840522 640637 718546 610981 782296 798810 789263 829303 841297 819822 932494
17058I32494k00023K17349L725j93574j71632J05655R7516p5368j11530L32598
$$ 932494 732471 949820 953545 759971 588339 693994 791510 716142 604612 937210
17048I37210l32998K61332m1298j30103K27752K09526o7897l36108J80420q6317
$$ 937210 604212 865544 824246 694143 921895 1131421 1063524 727416 907836 821519
17038H21519K51206q3907l06613J67780J95146p7641j21542J62592n1105O4915
$$ 821519 1072725 988818 682205 849985 1045131 967490 845948 1008540 957435 1022350
17028A022350j72700j05145J03685j59592n0034L16619J56817j48396P4014j32261
$$ 1022350 849650 744505 848190 688598 638564 955183 1112000 963604 1037618 905357
17018I05357K27057j88227k05574L71274j01001K17453n22223L20733r0203L64953
$$ 905357 1132414 944187 738613 1109887 1008886 1226339 704116 1024849 934646 1299599
17008A299599n46949L89870L45061k55052j81107J76649M3336k35729R9715J46600
$$ 1299599 752650 1142520 1487581 1232529 1051422 1228071 1271407 1035678 1135393 1281993
16998A281993k94681K21444J71611l6586K13858m93921J62047k75650N17039J1911
$$ 1281993 987312 1208756 1380367 1343781 1557639 1063718 1225765 950115 1467154 1479065
16988A479065J67256m22783j57286K54979P5597j30376K69648j75661J7299K41103
$$ 1479065 1646321 1223538 1066252 1321231 1396828 1266452 1536100 1360439 1377738 1618841
16978A618841k92774P7794k07717N18662k95710L31722j1558k34878l62109K75625
$$ 1618841 1326067 1403861 1196144 1714806 1419096 1750818 1739260 1504382 1142273 1417898
16968A417898L32466k72043K16650k2680k07657n6705K33737J66275k95657J35684
$$ 1417898 1750364 1478321 1694971 1672291 1464634 1407929 1641666 1807941 1512284 1647968
16958A647968N1791J13272k83376K34938P5256k58471K83332k79281n9597N80730
$$ 1647968 1699759 1813031 1529655 1764593 1839849 1581378 1864710 1585429 1525832 2106562
16948B106562j71898L8954m2797L0843j52580K5167J57683J27745j83962L2338
$$ 2106562 1934664 1973618 1930821 1961664 1809084 1834251 1991934 2119679 1935717 1968055
16938A968055L81489K5137l08994l36992O68289j43807k24286L99766k91022Q9813
$$ 1968055 2349544 2374681 2065687 1728695 2396984 2253177 2028891 2428657 2137635 2227448
16928B227448K28834k96616L61837m66820M79713R3766j02479j71557N1214N5438
$$ 2227448 2456282 2159666 2521503 2054683 2534396 2628162 2525683 2354126 2405340 2460778
16918B460778l2393J1603p126J04057L85990j35022J69094j72419l69052K34694
$$ 2460778 2428385 2439988 2432862 2536919 2922909 2787887 2956981 2784562 2415510 2650204
16908B650204k4486L8391M30395l02242m553L04302k29917K24112n8518L36557
$$ 2650204 2625718 2664109 3094504 2792262 2787709 3092011 2862094 3086206 3027688 3364245
16898C364245M508j77721j57119M62771J68525l86687j04145M79969k39260L03841
$$ 3364245 3368753 3191032 3033913 3496684 3665209 3278522 3174377 3654346 3415086 3718927
16888C718927l1334n05133L12947L5122Q303J53797j11641N05983l48652K60973
$$ 3718927 3687593 3182460 3495407 3530529 3538832 3692629 3580988 4086971 3738319 3999292
16878C999292j06L83561k06502k13895N85214o2701j50723J80384L2797N379P3308
$$ 3999292 3999186 4382747 4176245 3962350 4547564 4484863 4334140 4514524 4547321 4552700 4626008
16867D626008j64068K94525k03284M25045L1219K82158n0192l0464l0302J96269
$$ 4626008 4461940 4756465 4553181 4978226 5009445 5291603 5241411 5210947 5180645 5376914
16857E376914J65959J7128o8383L45372K96967k12783l893L78235l91695L19715
$$ 5376914 5542873 5560001 5491618 5836990 6133957 5921174 5917281 6295516 5903821 6223536
16847F223536J70442O2903P9803L33495O8776K87983j40550L47647k01970K98808
$$ 6223536 6393978 6456881 6536684 6870179 6938955 7226938 7086388 7434035 7232065 7530873
16837G530873O9609j63810K97768J65487L78872L05657J831j52097L07900q7810
$$ 7530873 7600482 7436672 7734440 7899927 8278799 8584456 8586287 8434190 8742090 8654280
16827H654280M92973L36234K11031M296L48590l2280J16039K85924L27065o332
$$ 8654280 9147253 9483487 9694518 9698814 10047404 10015124 10131163 10417087 10744152 10737820
16817A0737820N01233n718O36522k97662N85976K77042j88193M84954L49191M00440
$$ 10737820 11239053 11233335 11869857 11572195 12158171 12435213 12247020 12731974 13081165 13481605
16807A3481605J63354N18625j16849L57240M22765M90693K98759N37430N05941
$$ 13481605 13644959 14163584 14046735 14403975 14826740 15317433 15616192 16153622 16659563
16798A6659563R1222J82209N16694M96448M12407N83486L14473N62091O22233
$$ 16659563 16750785 16932994 17449688 17946136 18358543 18942029 19256502 19818593 20440826
16789B0440826J76375P12141P35685N35278O08752N31745N32874Q66123N88367
$$ 20440826 20617201 21329342 22065027 22600305 23209057 23740802 24273676 25139799 25728166
16780B5728166O30870M94388N18563J268929M37194J191993R06947N32123Q79365
$$ 25728166 26359036 26853424 27371987 28640916 29078110 30270103 31177050 31709173 32588538
16771C2588538Q53592J411244Q97208J017054R81329P73318J175196J065705J247977
$$ 32588538 33442130 34853374 35750582 36767636 37748965 38522283 39697479 40763184 42011161
16762D2011161J542415R38687J984181J107535J107384J268589J508922J683195
$$ 42011161 43553576 44492263 46476444 47583979 48691363 49959952 51468874 53152069
16754E3152069J145105J715043J195126J513584J571717K010598R36128J627122
$$ 53152069 54297174 56012217 57207343 58720927 60292644 62303242 63239370 64866492
16746F4866492J897927J636946J452558J447958J644091J109793J407065J669496
$$ 64866492 66764419 68401365 69853923 71301881 72945972 74055765 75462830 77132326
16738G7132326P39836J487685J189384R24879R92596R69717O73131P01252K16887
$$ 77132326 77872162 79359847 80549231 81474110 82466706 83436423 84109554 84810806 85027693
16729H5027693O24949l08106M38024J0537J8892q19690j09971m44126m23267r09174
$$ 85027693 85652642 85344536 85782560 85793097 85811989 84992299 84882328 84438202 84014935 83105761
16719H3105761q65903q95226p64437j168497j196841j667557j184208r37294j865056
$$ 83105761 82239858 81344632 80580195 79411698 78214857 76547300 75363092 74425798 72560742
16710G2560742p32143j776481j875323j185106j571741j300779j403492j870187
$$ 72560742 71828599 70052118 68176795 66991689 65419948 64119169 62715677 60845490
16702F0845490j469179j225521j578454j308310j371790j320162j538778j169658
$$ 60845490 59376311 58150790 56572336 55264026 53892236 52572074 51033296 49863638
16694D9863638j404989j275508j230933j118905j469537o97384j289156j419772
$$ 49863638 48458649 47183141 45952208 44833303 43363766 42666382 41377226 39957454
16686C9957454r13406j096670n14516j080374p99116j044731p72234q75392r31022
$$ 39957454 39044048 37947378 37432862 36352488 35553372 34508641 33736407 32861015 31929993
16677C1929993o52379q83362p51210q88149l87577q13624r29072o81339n07956
$$ 31929993 31277614 30394252 29643042 28754893 28367316 27553692 26624620 25943281 25435325
16668B5435325n38527o01213k04702o26259p84582n82737m57139n94911j53277
$$ 25435325 24896798 24295585 24090883 23464624 22680042 22097305 21640166 21045255 20891978
16659B0891978n56004m39291n51347k59815n25723j89082n55341l8675m82884
$$ 20891978 20335974 19896683 19345336 19085521 18559798 18370716 17815375 17776700 17293816
16650A7293816k91960m29810k25889m14079m87653J37194m24352l91918l07993
$$ 17293816 17001856 16572046 16346157 15932078 15444425 15581619 15157267 14765349 14457356
16641A4457356j85274l57485j73104m4279m66080l47654J2915l95546l9106n95657
$$ 14457356 14272082 13914597 13741493 13697214 13231134 12883480 12896395 12500849 12461743 11866086
16631A1866086k5446m60895K5784p0765m81365J5557k88423j68828j35247L8728
$$ 11866086 11840640 11379745 11405529 11334764 10853399 10868956 10580533 10411705 10276458 10315186
16621A0315186j66819n38468r0325J49290M8342k84868l06743J6840o9627n20970
$$ 10315186 10148367 9609899 9519574 9668864 9717206 9432338 9125595 9142435 9072808 8551838
16611H551838K30115k69263k42869j14347l10564J30860o4240j77624k84116K42664
$$ 8551838 8781953 8512690 8269821 8155474 7844910 7975770 7911530 7733906 7449790 7692454
16601G692454O2668m06716k13468n802k18858M7515j73170k04692K38487J20621
$$ 7692454 7755122 7348406 7134938 7129136 6910278 6957793 6784623 6579931 6818418 6939039
16591F939039m12907Q2827n01027L15103l94916J13361L725J31557j25490l30124
$$ 6939039 6526132 6608959 6107932 6423035 6028119 6141480 6145205 6276762 6151272 5821148
16581E821148L4427J5216N5636m50171j52749K31103k33515M33348k07117l85769
$$ 5821148 5855575 5870791 5926427 5476256 5323507 5554610 5321095 5754443 5547326 5161557
16571E161557r2172p3959J52756m2417m67138L72744L6504k73508j33021M4161
$$ 5161557 5069385 4995426 5148182 5105765 4638627 5011371 5047875 4774367 4641346 4685507
16561D685507j49365j97385N2459N11563l88424K7495O8651n27266N14272m03361
$$ 4685507 4536142 4338757 4391216 4902779 4514355 4541850 4610501 4083235 4597507 4194146
16551D194146O8827l8525o9321k54012L4668L2747J069J68290j7424j79180l06933
$$ 4194146 4262973 4224448 4155127 3901115 3935783 3968530 3969599 4137889 4120465 3941285 3634352
16540C634352K04345K09575m30476j79214Q2485K10049J224l13671L60779j38759
$$ 3634352 3838697 4048272 3617796 3438582 3521067 3731116 3732340 3418669 3779448 3640689
16530C640689j73971n2975J64215m9439k57649M1567L69536l55485q6270N8776
$$ 3640689 3466718 3413743 3577958 3528519 3270870 3312437 3681973 3326488 3240218 3298994
16520C298994l08614M49794k59044M3214l31757K09932k3342j34514l789R5435
$$ 3298994 2990380 3440174 3181130 3224344 2892587 3102519 3079177 2944663 2940874 3036309
16510C036309O8335l86425K85182j75425P402l42525O0167L91565j02293o5337
$$ 3036309 3104644 2718219 3003401 2827976 2835378 2492853 2553020 2944585 2842292 2776955
16500B776955Q8275k74009J63132k3037K87216k41390k25500r7051j02194L97282
$$ 2776955 2865230 2591221 2754353 2731316 3018532 2777142 2551642 2454591 2352397 2749679
16490B749679m68018L12926O7123m72421O14283j38941n20915K16913J75812P5252
$$ 2749679 2281661 2594587 2661710 2189289 2803572 2664631 2143716 2360629 2536441 2611693
16480B611693n03271N8688L01505k94281J26596M48263l80899r6814j25403K60171
$$ 2611693 2108422 2167110 2468615 2174334 2300930 2749193 2368294 2271480 2146077 2406248
16470B406248P4904l98438k81096M04000K8815p8164p9010q8060K56067l11816
$$ 2406248 2481152 2082714 1801618 2205618 2234433 2156269 2077259 1989199 2245266 1933450
16460A933450J26932j91212o8004L82433J1507O3517k27780r2609l739L07947
$$ 1933450 2060382 1869170 1801166 2183599 2195106 2258623 2030843 1938234 1934495 2242442
16450B242442j27246j77178J30068j66444K48730o6056k67304l24691M27735N4134
$$ 2242442 2115196 1938018 2068086 1901642 2150372 2084316 1817012 1492321 1920056 1974190
16440A974190j41310l16883L16806K17125k76684L3438j8351K03571j36021k68076
$$ 1974190 1832880 1515997 1832803 2049928 1773244 1806682 1788331 1991902 1855881 1587805
16430A587805J49321j21826J49240k82562L20757k66875K63628j73930K01193
$$ 1587805 1737126 1615300 1764540 1481978 1802735 1535860 1799488 1625558 1826751
16421A826751l09181m333K36611K6012l3046L9701m2934k12468K38999j06477
$$ 1826751 1517570 1513237 1749848 1775860 1742814 1782515 1739581 1527113 1766112 1659635
16411A659635l53953J61504n171N5486P0384k53458J10724M4747J05472k85830
$$ 1659635 1305682 1467186 1462015 1517501 1587885 1334427 1445151 1489898 1595370 1309540
16401A309540j68507N58562j84164j58694J3109j730l0690j81404K76836J63721
$$ 1309540 1141033 1699595 1515431 1356737 1369846 1368116 1337426 1156022 1432858 1596579
16391A596579j95604o4643L81063n37040J67156J28234n0383j42237J56540m1657
$$ 1596579 1400975 1336332 1717395 1180355 1347511 1475745 1425362 1283125 1439665 1398008
16381A398008k9598j04961M0994k51204K74362J97261L1370j47194j03649m3948
$$ 1398008 1368410 1263449 1304443 1053239 1327601 1524862 1556232 1409038 1305389 1261441
16371A261441j32921L34417p9275k510k07811J59928k99063P90928o77779M9174
$$ 1261441 1128520 1462937 1383662 1381152 1173341 1333269 1034206 1825134 1147355 1196529
16361A196529J68236o8404Q9194k89695J60570r6278m104q3637K67946k07383
$$ 1196529 1364765 1296361 1385555 1095860 1256430 1160152 1156048 1072411 1340357 1132974
16351A132974q5870J11987K3556K76983q5642l68391P3872M20425m81322L9185
$$ 1132974 1047104 1159091 1182647 1459630 1373988 1005597 1079469 1499894 1018572 1057757
16341A057757J67773P3073j14181j49844J25968l1767K9578J0277j18601K00301
$$ 1057757 1225530 1298603 1184422 1034578 1160546 1128779 1158357 1168634 1050033 1250334
16331A250334j79630Q8524m2398k05212j43646K29005j26329n5928p1434K45145
$$ 1250334 1070704 1159228 1116830 911618 767972 996977 870648 814720 743286 988431
16321I88431l57597O14867l44841J47926k67209K35285j92945M13840l55964M5615
$$ 988431 630834 1245701 900860 1048786 781577 1016862 823917 1237757 881793 927408
16311I27408L44110l40340J58292j68814L32623n66499J52232M0521P5040N9819
$$ 927408 1271518 931178 1089470 920656 1253279 686780 839012 879533 954573 1014392
16301A014392j09078J55317l84542M58547k75902p9478K17964q7167j00028K83947
$$ 1014392 905314 1060631 676089 1134636 858734 779256 997220 910053 810025 1093972
16291A093972m65574K14973J09863L9440M4427M6828N2136j80811l05717j59057
$$ 1093972 628398 843371 953234 992674 1037101 1083929 1136065 955254 649537 490480
16281D90480K93329P3392j26098j26144K14326j31353R7376J5812L1146K42112
$$ 490480 783809 857201 731103 604959 819285 687932 785308 801120 832266 1074378
16271A074378m53945M60539l43435K46282m51338M00335J58175k26383l4007j10005
$$ 1074378 620433 1080972 737537 983819 532481 932816 1090991 864608 830601 720596
16261G20596K18662j93025Q5612m9928k49987L27446J94671l38125J25513N8919
$$ 720596 939258 746233 831845 781917 531930 859376 1054047 715922 841435 900354
16251I00354O6877m35011N7881J65699J12046j20488J04893m6299N3381k50618
$$ 900354 967231 532220 590101 755800 867846 747358 852251 805952 859333 608715
16241F08715p776L41202l33436Q3676k7699m8108K38477k87736J5602l06M384
$$ 608715 600939 942141 608705 692381 664682 616574 855051 567315 582917 582611 586995
16230E86995m1310K03853K1373m5224C01707L54658m0917n3863j43400K455K87886
$$ 586995 545685 749538 770911 725687 301707 656365 615448 561585 418185 420640 708526
16219G08526B99827L63372l7781o9942r1353P0473j7806L9249L01446C81601J42469
$$ 708526 299827 663199 625418 555476 464123 534596 516790 556039 857485 381601 524070
16208E24070J52948O7460j74953P5858j29781m6687L53333j15003J33555k55860
$$ 524070 677018 744478 569525 645383 515602 468915 822248 707245 840800 584940
16198E84940J86129r4170j29976j04784J58879n0635M1664q2432J63837B92761
$$ 584940 771069 676899 546923 442139 601018 550383 592047 509615 673452 292761
16187F32357O0082l24528J49142K12606o6723j12402j22709A10183K79600p2647
$$ 632357 692439 367911 517053 729659 662936 550534 427825 110183 389783 317136
16177C17136K40086j67963K91984d9352E44317B40374O25727C73494M5898N9135
$$ 317136 557222 389259 681243 -49352 544317 240374 866101 373494 419392 478527
16167D78527K6900o7553o0612j40849M97666k62070q883n467P6942J02135j22865
$$ 478527 505427 437874 377262 236413 734079 472009 463126 457659 534601 636736 513871
16156E13871n7752O6466K9570m6151P9223k56932L2624O2159m2430K27005J13762
$$ 513871 456119 522585 552155 506004 585227 328295 360919 423078 380648 607653 721415
16145G21415C09508J05330J3027j01386J21920B10622K54861A97893n3767K22638
$$ 721415 309508 414838 427865 326479 448399 210622 465483 197893 144126 366764
16135C66764P1721D6930O82862A97504L2112J38044m4991H2948K49810R3699o3180
$$ 366764 438485 46930 729792 197504 229616 367660 322669 82948 332758 426457 363277
16124C63277n905j50186p7387J99789j21218l2718n2988O6074K54434D0483M23059
$$ 363277 357372 207186 129799 329588 208370 175652 122664 188738 443172 40483 463542
16113D63542A53805M06114n8001B42828L46944A91057N7226K53817k1374j71643
$$ 463542 153805 559919 501918 242828 589772 191057 248283 502100 480726 309083
16103C09083J32470j32029j11717K71351I2835J71577M77562k38148k25231o7927
$$ 309083 441553 309524 197807 469158 92835 264412 741974 503826 278595 210668
16093B10668J11739A55869p5751K03516I5060J33975o1823G7383C0262a4670C53770
$$ 210668 322407 155869 80118 283634 95060 229035 167212 77383 30262 -14670 353770
16081G4497K42323q738J14154I8962J55204O0363o9295k1152R2842J78635a02450
$$ 74497 316820 308082 422236 98962 254166 314529 245234 224082 316924 495559 -102450
16069D84294r7676N318N3950H9141N73042B32957K0607L7032J5710j3440m58R6358
$$ 484294 386618 391936 445886 89141 662183 232957 253564 290596 306306 292866 292408 388766
16057C88766r8820F4468J70338R2208K7811A21009K0863K2939K13757r2553m9641
$$ 388766 289946 64468 234806 327014 354825 121009 141872 164811 378568 286015 236374
16046B36374j04448n2732K11334N3218A45903j6709a11891D0699J92691p7625
$$ 236374 131926 79194 290528 343746 145903 129194 -111891 40699 233390 155765
16036A55765b08726C52708o437j63034a22464B08281l1503P0090j05043K73445
$$ 155765 -208726 352708 346271 183237 -122464 208281 176778 246868 141825 415270
16026D15270j66423q7372L02876d2785A23985P1630p5785E5560J22743q3772L29534
$$ 415270 248847 161475 464351 -42785 123985 195615 119830 55560 178303 94531 424065
16015D24065h3207A57974j826J00286L2642n0887A6867L7936L8398E958L5254
$$ 424065 -83207 157974 156148 256434 289076 238189 16867 54803 93201 5958 41212
16004D1212J11357J31988j30668L02881a60510A51191J44905J25988j35443C2446
$$ 41212 152569 284557 153889 456770 -160510 151191 296096 422084 286641 32446
15993A27199R4621r2730L26850j32418Q1971Q7145K77458J77157m48643B22706
$$ 127199 221820 129090 455940 323522 405493 492638 770096 947253 498610 222706
15982B40967P8974G8006J07036J75727j42465G0750k4384P8781L0524h178F0757
$$ 240967 319941 78006 185042 360769 218304 70750 46366 125147 155671 -8178 60757
15970A3081J3912a4478G438L12568a50119B07667b38632h1901b1620B74778j22800
$$ 13081 26993 -14478 7438 320006 -150119 207667 -238632 -81901 -21620 274778 151978
15959A51978J23669E2881A3244R5031M31867d2689A96677J26691q1606J37395
$$ 151978 275647 52881 13244 108275 540142 -42689 196677 323368 241762 379157
15949C79157A29464M1196m2923i2599A15436a02959k18456B03294E8355e2154
$$ 379157 129464 170660 127737 -92599 115436 -102959 -321415 203294 58355 -52154
15938A54114L27702A80933D2709a20061k95922B0874a68623A21745m4008J57620
$$ 154114 481816 180933 42709 -120061 -415983 20874 -168623 121745 77737 235357
15928B35357M8628A41220B4278J99751I5498R7670p0959j002D6776j2351K97725
$$ 235357 283985 141220 24278 224029 95498 193168 122209 121207 46776 34425 332150
15917C32150A30078J32902a08447A2112J4722a20369A55061d7530k3711A6154
$$ 332150 130078 262980 -108447 12112 26834 -120369 155061 -47530 -71241 16154
15906B41107o068I3852D3948a10615H6436A3888J13626a33813A30444F236J6227
$$ 241107 235039 93852 43948 -110615 86436 13888 127514 -133813 130444 6236 22463
15895B2463b19191A22691d1825C81420j50899J16419E0287a7379A3489K67293
$$ 22463 -219191 122691 -41825 381420 230521 346940 50287 -17379 13489 280782
15885B80782A21965b5492j42619I8602o83J95407e1849j9816A26044A9713L89524
$$ 280782 121965 -25492 -168111 98602 97919 293326 -51849 -71665 126044 19713 409237
15874D09237e339A0756M0229M11843b12975A50151K07200j32186o7885a26157
$$ 409237 -5339 10756 50985 462828 -212975 150151 357351 225165 157280 -126157
15863A48689e5453E9586b38336B56210I7716b0113A85831b25374B63089r4518
$$ 148689 -55453 59586 -238336 256210 97716 -20113 185831 -225374 263089 168571
15853A68571J78682j12714R2624p6971B8394P6133b00251C4159a47573k0085C92983
$$ 168571 347253 234539 327163 250192 28394 104527 -200251 34159 -147573 -167658 392983
15841F5198e0724E1599i9010p3713h3499K8271F9815b38769A06503k4360b40322
$$ 65198 -50724 51599 -99010 -172723 -83499 -55228 69815 -238769 106503 82143 -240322
15829e4762E2069e495B03803a71910j1283k72466A31115i055k75871p5027h27
$$ -54762 52069 -5495 203803 -171910 -183193 -455659 131115 -9055 -284926 -359953 -827
15817c60704a0894l29777A73889B0985J95486c1494C77461A44950J17544f5786
$$ -360704 -10894 -340671 173889 20985 216471 -31494 377461 144950 262494 -65786
15806a86514A07981k6542b5886A19247d33216B0352b92141D3663a30318A23125
$$ -186514 107981 81439 -25886 119247 -433216 20352 -292141 43663 -130318 123125
15795C4675L75521b78415B97120b06349A2812c3788B79901a7976E5740c7809A08335
$$ 34675 410196 -278415 297120 -206349 12812 -33788 279901 -17976 55740 -37809 108335
15783h5325E5992d4159E2144e1303a9853j89407h1244l48966G7700L1783b30800
$$ -85325 55992 -44159 52144 -51303 -19853 -209260 -81244 -430210 77700 109483 -230800
15771d9984A02085B5916A1122L44929a05819j02523B56701B4169a92320A12030
$$ -49984 102085 25916 11122 356051 -105819 -208342 256701 24169 -192320 112030
15760C4158c72248e5842B4388K99303p7832a8864j4662F936L71370d0465r6562
$$ 34158 -372248 -55842 24388 323691 245859 -18864 -33526 6936 378306 -40465 -137027
15749a37027B85682H8613i8958I7662J46837c9661A6633M3037K46325L0638a29230
$$ -137027 285682 88613 -98958 97662 244499 -39661 16633 59670 305995 336633 -129230
15737B272c29721A13319b70392a28295e6339j77511R7786A31571R0567a70210
$$ 2272 -329721 113319 -270392 -128295 -56339 -233850 -136064 131571 222138 -170210
15726B21885C2298Q2983n4712d289j73083j64651A34300e067k10855J3540A75532
$$ 221885 32298 115281 60569 -4289 -177372 -342023 134300 -5067 -215922 -202382 175532
15714i918A58894g1485L4422G4241a85843b9226j43359k8183l4769B73940a4372
$$ -9918 158894 -71485 -37063 74241 -185843 -29226 -172585 -200768 -235537 273940 -14372
15702b82791e8820C68643A1385N675N1495b52978J02039B17389n8928E2040A8764
$$ -282791 -58820 368643 11385 17060 68555 -252978 -150939 217389 158461 52040 18764
15690i18l8209A02318h4583k11004j23273a25395f0908B06528H0318g1344A6677
$$ -918 -39127 102318 -84583 -295587 -418860 -125395 -60908 206528 80318 -71344 16677
15678A03205b72516g1497H373b17550g310B62738G0578a29909B12881E5692j3561
$$ 103205 -272516 -71497 8373 -217550 -7310 262738 70578 -129909 212881 55692 42131
15667D2131b19515B76074q7471m9781a86128K6683I2301a47359a6117n6237j15225
$$ 42131 -219515 276074 188603 138822 -186128 -159445 92301 -147359 -16117 -72354 -187579
15656a87579j51583A59684C1427i2521o1886j00452B89075b00794I2458Q6601
$$ -187579 -339162 159684 31427 -92521 -154407 -254859 289075 -200794 92458 179059
15646A79059a96369B93414a93554G2642b10610e8590k501j24046I2534c9667A10397
$$ 179059 -196369 293414 -193554 72642 -210610 -58590 -61091 -185137 92534 -39667 110397
15634h129j71027g7739j85344C2868a91352J5809C8796a53850A01897i4968k1871
$$ -8129 -179156 -77739 -263083 32868 -191352 -175543 38796 -153850 101897 -94968 -116839
15623a16839A3284M16398C596J03556C4522a40707j07469Q3570d788A69084A7264
$$ -116839 13284 429682 3596 107152 34522 -140707 -248176 -164606 -4788 169084 17264
15611e0186H1504b21575A04134b7539I567L8359K20884i1522A66567E7896a27298
$$ -50186 81504 -221575 104134 -27539 9567 47926 268810 -91522 166567 57896 -127298
15599c3583k15672a04094A3427N7373c853A06013L3639g6655A99341F3251b64887
$$ -33583 -249255 -104094 13427 70800 -3853 106013 139652 -76655 199341 63251 -264887
15587A72053e3899k12414J1767A43691m4562o331b63491J06467m7391D09545A39809
$$ 172053 -53899 -266313 -254546 143691 99129 92798 -263491 -157024 -204415 409545 139809
15575b25008h3323B78332E8259J86557E1161d6390k2830F950h9906A37705M1231
$$ -225008 -83323 278332 58259 244816 51161 -46390 -69220 6950 -89906 137705 178936
15564A78936h4397A04669j5376J0075k7529K8117e8549l06332J53369R7715A18140
$$ 178936 -84397 104669 89293 99368 71839 99956 -58549 -364881 -211512 -113797 118140
15552A30933L7064E5652R1539b08601I531e5121A34756M01N5470P2551B4027D328
$$ 130933 167997 55652 147191 -208601 9531 -55121 134756 135157 190627 263178 24027 4328
15539A75153M6554e9956B55036l143J95077a62930F5833d2782j21061b0826C7826
$$ 175153 221707 -59956 255036 251893 446970 -162930 65833 -42782 -163843 -20826 37826
15527A76859q5386d87182C8986R4003d37398g8703G0222J63561a67170D3509N4654
$$ 176859 91473 -487182 38986 132989 -437398 -78703 70222 233783 -167170 43509 98163
15516I8163J63122a21996M8440A2780f8556A43954a72020f4609l41599a43721
$$ 98163 261285 -121996 -73556 12780 -68556 143954 -172020 -64609 -406208 -143721
15505D38676a79770g1581A16081b17445J03462A34755b29328b6092j9674j92495
$$ 438676 -179770 -71581 116081 -217445 -113983 134755 -229328 -26092 -45766 -238261
15495b38261b906A55180m7150a4043A6891J95765c45910A10492J15207b43244
$$ -238261 -2906 155180 108030 -14043 16891 212656 -345910 110492 225699 -243244
15484a51851c8331q099A04554A6529K9035K01363H0676J24880K89751B12891J14300
$$ -151851 -38331 -46430 104554 16529 45564 246927 80676 205556 495307 212891 327191
15473C27191A51178c6385E4173a1305p6817A9874O3724K54919q5074E3063J84297
$$ 327191 151178 -36385 54173 -11305 -88122 19874 83598 338517 253443 53063 237360
15462B37360h9981D8627J4584K83660n3251b09009P9907k94831B53776j09515
$$ 237360 -89981 48627 63211 346871 293620 -209009 -129102 -423933 253776 144261
15452A44261F5034i7514A70140P9447d6895J0465B83605a30982A97247L87549
$$ 144261 65034 -97514 170140 249587 -46895 -36430 283605 -130982 197247 584796
15442E84796j85658j74058E7340J59745C5335J9498a36846E285e9621H8814f2910
$$ 584796 399138 225080 57340 217085 35335 54833 -136846 5285 -59621 88814 -62910
15430D3257J34238a50594f397o0023B73368E1977N1513M3525b4328C8356R4183
$$ 43257 177495 -150594 -6397 -66420 273368 51977 103490 147015 -24328 38356 132539
15419A32539J9395a1055q4341J7407m6037c2907k72714D00038j25114h7286d112
$$ 132539 151934 -11055 -95396 -77989 -124026 -32907 -305621 400038 274924 -87286 -4112
15407d02665A57930a03542C20921b40971f7302B33469K5383C1347a35443f1607
$$ -402665 157930 -103542 320921 -240971 -67302 233469 258852 31347 -135443 -61607
15396B43960a62766L4789J0214e8392o7772F7484b217o9262k068A65659e0385
$$ 243960 -162766 -127977 -117763 -58392 -126164 67484 -2217 -71479 -73547 165659 -50385
15384C13475G281J5803J42461c10237J26863A8661a39642F1774B7369J99980a46585
$$ 313475 7281 23084 165545 -310237 -183374 18661 -139642 61774 27369 227349 -146585
15372c83025E9458N5236b68155F2805J7026O3386k1783Q2333m3986h5419f426
$$ -383025 59458 114694 -268155 62805 79831 143217 121434 203767 159781 -85419 -6426
15360A63420e5048j74381A99363m4996J40523a99561B74219l9870j0864C7539
$$ 163420 -55048 -229429 199363 154367 294890 -199561 274219 234349 223485 37539
15349a36491A31765b802F0608J69318C05J83390J27813K06780c0379c477A37129
$$ -136491 131765 -2802 60608 229926 305 183695 311508 518288 -30379 -3477 137129
15337B04323a85075e6464m0864B18515f5920C22906c3848B21544b08210C0896
$$ 204323 -185075 -56464 -97328 218515 -65920 322906 -33848 221544 -208210 30896
15326B11750e2556A08694Q5612F0701L21362A82958a77004E0535M744L8379J52138
$$ 211750 -52556 108694 194306 60701 382063 182958 -177004 50535 55279 93658 245796
15315B45796l4970E872b8291r6936B74898n2114a735A31984a94935C9160K80969
$$ 245796 210826 5872 -28291 -125227 274898 222784 -1735 131984 -194935 39160 320129
15304C20129r3535f6060B8365J91992J3525b27371F6602g9235a995D5703N3249
$$ 320129 226594 -66060 28365 220357 233882 -227371 66602 -79235 -1995 45703 98952
15293I8952b39035a09520H5194d7860J5446B0566J34736O2584C9231b9067C03251
$$ 98952 -239035 -109520 85194 -47860 -32414 20566 155302 217886 39231 -29067 303251
15281a72879A0476R5395m8741J46665D5959K9646a16819C3109L73352j63968E3898
$$ -172879 10476 105871 57130 203795 45959 75605 -116819 33109 406461 242493 53898
15269a50917A17507c90634I5014b1676A51126r385a53696D2625b76941l1129J13340
$$ -150917 117507 -390634 95014 -21676 151126 141741 -153696 42625 -276941 -308070 -194730
15258a94730A72208o1911g2667B7001O3333K20306m7506m2129L45875L84810R90724
$$ -194730 172208 110297 -72667 27001 90334 310640 263134 221005 566880 951690 1942414
15247A942414r47550J75821M36104D77870o8601j12623N6268A27162K1223a46323
$$ 1942414 994864 1170685 1606789 477870 409269 296646 352914 127162 148385 -146323
15236b32205P5366P6124B542K480J13887J8510h7021b6073j81236e4535D9783
$$ -232205 -156839 -80715 2542 5022 118909 137419 -87021 -26073 -207309 -54535 49783
15224A84725b5274A95362a33628B0964J83674j00965a66526L5671M905C4435K52417
$$ 184725 -25274 195362 -133628 20964 204638 103673 -166526 -130855 -125950 34435 286852
15213B86852f8270E1689b37399B10058B5554Q3220c8564A37647Q7687I8017M4867
$$ 286852 -68270 51689 -237399 210058 25554 108774 -38564 137647 225334 98017 142884
15202A42884a25497F8510Q9298a30137M0700k5030d9506B6564i6841A00400J65407
$$ 142884 -125497 68510 157808 -130137 -89437 -114467 -49506 26564 -96841 100400 265807
15191B65807a3117A85991J36209j05017b01610i8794D23141A15256J37954o3267
$$ 265807 -13117 185991 322200 217183 -201610 -98794 423141 115256 253210 189943
15181A89943b47187A52533b26082B3372e099A55246f9993n8247F6449N3296j4644
$$ 189943 -247187 152533 -226082 23372 -5099 155246 -69993 -128240 66449 119745 105101
15170A05101l1968J42193G8167g3539f625A91698c8308k0701j6611J9723G26a34341
$$ 105101 73133 215326 78167 -73539 -6625 191698 -38308 -59009 -75620 -55897 726 -134341
15157e9917n106j14881h2639r0326c2113m2409G768J34254a39658f0069k49562
$$ -59917 -65023 -179904 -82639 -172965 -32113 -74522 7768 142022 -139658 -60069 -309631
15146c09631A0786J4088K01870J68849d1140B45254A10882a1817D7643f1162A85982
$$ -309631 10786 24874 226744 395593 -41140 245254 110882 -11817 47643 -61162 185982
15134C06077L2433E2358a0339m2970B25115n1926e3476E0228L01642j27311a27992
$$ 306077 338510 52358 -10339 -53309 225115 173189 -53476 50228 351870 224559 -127992
15122C74205c4401A6137R0863J6833a32806b5562H2292b9665A7229J95794b98297
$$ 374205 -34401 16137 107000 123833 -132806 -25562 82292 -29665 17229 213023 -298297
15110c1582B43249r9288J50488f7356J0227D8320J05132e8435B01726a47658R138
$$ -31582 243249 143961 294449 -67356 -57129 48320 153452 -58435 201726 -147658 -138520
15099a38520C67966A06246a30859C50158a15484o1125B62227p4603J0905n4815
$$ -138520 367966 106246 -130859 350158 -115484 -176609 262227 187624 198529 143714
15089A43714o6028a19881I7099a69550B76976q5937J24295B3572J36384O6673
$$ 143714 77686 -119881 97099 -169550 276976 191039 315334 23572 159956 226629
15079B26629a08251B36491o2865Q7964c7510J2412D86001a11043C48762G8963
$$ 226629 -108251 236491 173626 261590 -37510 -25098 486001 -111043 348762 78963
15068b27501c8886J4790A65445b25610A01813Q6171F6246a02960D26245h3349
$$ -227501 -38886 -24096 165445 -225610 101813 187984 66246 -102960 426245 -83349
15057I9559J20440G0753J595N765a9483D45385j87008d1409n4551C63067r5936
$$ 99559 219999 70753 72348 78113 -19483 445385 258377 -41409 -95960 363067 267131
15046B67131A18065j9297k3487J88361J87705b8956B48653n564L6411J69874p0274
$$ 267131 118065 98768 75281 263642 451347 -28956 248653 243089 279500 449374 379100
15035C79100A30282l2014K05589m1987G0995J18926E4693K1587L58204C4725L42546
$$ 379100 130282 98268 303857 261870 70995 189921 54693 76280 434484 34725 377271
15024C77271R6780j04624j20023j4592K52689A29641Q1643f3331C40638r2777
$$ 377271 474051 369427 249404 234812 487501 129641 211284 -63331 340638 247861
15014B47861J41533j59773o8001K42833h5362B2802K68647L4963K0329l3062I9919
$$ 247861 389394 229621 161620 404453 -85362 22802 291449 326412 346741 313679 99919
15002A91578L4597L6642l0422h676C93027a66700C59587K3637A53351K4176A2632
$$ 191578 226175 262817 232395 -8676 393027 -166700 359587 383224 153351 177527 12632
14990B93393G3684L03085D4388L26515j07159f274F64418B46498p770K31383q9427
$$ 293393 73684 376769 44388 370903 263744 -6274 664418 246498 238728 470111 380684
14979C80684J68168B16732K77675R8284o9959l9345N3404j86896r9264L46175
$$ 380684 548852 216732 494407 592691 522732 483387 536791 349895 250631 596806
14969E96806B28168M80209C52720K68456k87197L84348l29322A07132M1899p1842
$$ 596806 228168 708377 352720 621176 333979 718327 389005 107132 149031 77189
14959G7189O00592j50805p7977n4149o4870Q999N2136j71243L627R1500j48875
$$ 77189 677781 526976 448999 394850 329980 338979 391115 219872 223499 314999 166124
14948A66124K50429j24791J81746A47031L20276K21063C09078J71942B26167J19983
$$ 166124 416553 291762 473508 147031 467307 688370 309078 481020 226167 346150
14938C46150L26658D4178O16449E7898M69504p0521B10700D3151P80749J20608
$$ 346150 672808 44178 660627 57898 527402 456881 210700 43151 823900 944508
14928I44508j55588j10945J71693l07501l404K6472N33048l55265K88365J73373
$$ 944508 788920 677975 849668 542167 538763 565235 1098283 743018 1031383 1204756
14918A204756l01305K83189J28254k80076r9600m03153q4208B13590N36522A34097
$$ 1204756 903451 1186640 1314894 1034818 935218 532065 447857 213590 750112 134097
14907D59119j16384n4432K6565Q3006A88652L65400B20998E7291R7946K6967K72403
$$ 459119 342735 288303 314868 397874 188652 554052 220998 57291 155237 182204 454607
14896D54607L388r2313A63180J34181K09730k45956J7326o4768K65214F6305N22111
$$ 454607 457995 365682 163180 297361 507091 261135 278461 213693 478907 66305 588416
14885E88416B07783j01872L53603j12933K31154F5538M59624j22377j04511J2456
$$ 588416 207783 105911 459514 346581 577735 65538 525162 402785 298274 310730
14875C10730M01142l32731p8543M20584o1480B14481J57802j12427J94793p4072
$$ 310730 711872 379141 300598 721182 659702 214481 372283 259856 454649 380577
14865C80577M2701m1988L103L0850A81376M4779J46333A13926K51172L0696N2092
$$ 380577 423278 381290 384393 415243 181376 226155 372488 113926 365098 395794 447886
14854D47886B06858K26097r7143j21028O9470N45874H2765P9356L04262R3313
$$ 447886 206858 432955 335812 214784 284254 830128 82765 162121 466383 559696
14844E59696O4486K74038j30391j10736l192l01046K49553J21013k55471J67612
$$ 559696 624182 898220 767829 657093 653901 352855 602408 723421 467950 635562
14834F35562B21888J24147j10211L55052k35280A68906K77665j62759N8727O7545
$$ 635562 221888 346035 235824 590876 355596 168906 446571 283812 342539 410084
14824D10084j37012R8157q9421K89256k31961J17142j02838j52018J44493H8602
$$ 410084 273072 371229 281808 571064 339103 456245 353407 201389 345882 88602
14813C70927m5416K83251B92495r9798K54261j06854J40916J56460j5122j002
$$ 370927 325511 608762 292495 192697 446958 340104 481020 637480 622358 621356
14803F21356p5719k23948N06925k33436k14767J42394P1410k76270N5932q8696
$$ 621356 545637 321689 828614 595178 380411 522805 594215 317945 373877 285181
14793B85181M80862B40442m5094K27196j50480J29985L503B3307M49589j27243
$$ 285181 766043 240442 195348 422544 272064 402049 405552 23307 472896 345653
14783C45653J74346K26633M0050B89962J98784q4096O2171O2330Q4102B41551
$$ 345653 519999 746632 786682 289962 488746 404650 466821 529151 613253 241551
14772D75798r6297L23909K1591m7430j36306P6678K7506j98456J74170j34052
$$ 475798 379501 703410 725001 677571 541265 617943 645449 446993 621163 487111
14762D87111J60139r8948r0393A33552N70519k17836J20968J23415l34131k7822
$$ 487111 647250 548302 457909 133552 704071 486235 607203 730618 396487 368665
14752C68665Q0678j0668q0394M72880J17301B93864L60891j87102K84827j38714
$$ 368665 449343 438675 358281 831161 948462 293864 654755 467653 752480 613766
14742F13766J54851n6787j80551J4849k02213N00001D09439K39952k52106L35630
$$ 613766 768617 711830 531279 546128 343915 843916 409439 649391 397285 732915
14732G32915O761k0800j51629L54541l5279j01079r1479J89850K66868k28146
$$ 732915 739676 718876 567247 921788 886509 785430 693951 883801 1150669 922523
14722I22523r1130L796j46504m7176L70950k66388J7365Q2463l93791J10570L1758
$$ 922523 831393 835189 688685 641509 1012459 746071 763436 845899 452108 562678 594436
14711E94436J71314J71944j28025j2703M4793j55480P6977J46768n1080L36451
$$ 594436 765750 937694 809669 796966 841759 686279 763256 910024 858944 1195395
14701A195395n87541N35449k49463L71738k02403n732k9151K83811k97986J87357
$$ 1195395 607854 1143303 893840 1265578 1063175 1057443 1028292 1312103 1014117 1201474
14691A201474k90389m28321K42333l0797K16897j79498K39498L1085l02853J40371
$$ 1201474 911085 482764 725097 694300 911197 731699 971197 1002282 699429 839800
14681H39800C40091Q53826m39515L929l3630K76505j84342j18970L46229N0582
$$ 839800 340091 1193917 754402 758331 724701 1001206 816864 697894 1044123 1094705
14671A094705j76499j52987K67666k00353j77054K39002J92701j81188J82753
$$ 1094705 918206 765219 1032885 832532 655478 894480 1087181 905993 1088746
14662A088746m97984Q00926D78970M84685l21767J18902J16315P7122k33700N02828
$$ 1088746 590762 1391688 478970 963655 641888 760790 877105 954227 720527 1223355
14652A223355j04275R1469r9642j29394j57269K72536R0356k57706k16770L59044
$$ 1223355 1119080 1210549 1110907 981513 824244 1096780 1187136 929430 712660 1071704
14642A071704K81839k00229K46879O4440n07669K11224j46479K13807k42527N0742
$$ 1071704 1353543 1153314 1400193 1464633 956964 1168188 1021709 1235516 992989 1043731
14632A043731M09039l17206j23919N9023n1724K08816j77849o0938Q1340q0081
$$ 1043731 1452770 1135564 1011645 1070668 1018944 1227760 1049911 988973 1070313 990232
14622I90232O3269K76325l20728L50136l70751J80624K73988R8807n08381L88133
$$ 990232 1053501 1329826 1009098 1359234 988483 1169107 1443095 1541902 1033521 1421654
14612A421654l47146k02025M94573m51062P26058m01608j18439J48841K65952
$$ 1421654 1074508 872483 1367056 915994 1642052 1240444 1122005 1270846 1536798
14603A536798l29101J37762j29928K01399j90983J55972p5936k61567K01825M7399
$$ 1536798 1207697 1345459 1215531 1416930 1225947 1381919 1305983 1044416 1246241 1293640
14593A293640L50722j59018k31097K30745R630J89620m2737M9869K0330k80741
$$ 1293640 1644362 1485344 1254247 1484992 1494622 1684242 1641505 1691374 1711704 1430963
14583A430963R6931m5039K44051P7081k63417P4698l3948J04455P9963k432k98646
$$ 1430963 1527894 1482855 1726906 1803987 1540570 1615268 1581320 1685775 1765738 1763306 1464660
14572A464660q1608M20316M7361N2350K762l68609M71975l70192P28518k75215
$$ 1464660 1383052 1803368 1850729 1903079 1905841 1537232 2009207 1639015 2367533 2092318
14562B092318K52876l63971N91152j4937N3916j52753L98026J8864L36807L35499
$$ 2092318 2345194 1981223 2572375 2557438 2611354 2458601 2856627 2875491 3212298 3547797
14552C547797L15843M73692Q81916K149305L626086P021973J3229391K237366
$$ 3547797 3863640 4337332 5219248 7368553 10994639 18016612 31246003 33483369
14544C3483369j4863020r112334l867634j780910q83548n08931l62174k4635K2814
$$ 33483369 18620349 9508015 5640381 3859471 2975923 2466992 2104818 2080183 2102997
14535B102997l97165j1079J65869l6577J65019J08185m86332J64454K11568R5096
$$ 2102997 1705832 1694753 1860622 1824045 1989064 2097249 1610917 1775371 1986939 2082035
14525B082035j84477M43145k24701m63012M19428r8861o5727M39371o6190J9730
$$ 2082035 1897558 2340703 2116002 1652990 2072418 1973557 1907830 2347201 2281011 2300741
14515B300741k19119K49034j50232k02567J25756K69863j5229m7153K43532k18928
$$ 2300741 2081622 2330656 2180424 1977857 2103613 2373476 2358247 2311094 2554626 2335698
14505B335698j7716L13122m15006L50703L76394m27652K19175K45372j51642J31916
$$ 2335698 2317982 2631104 2216098 2566801 2943195 2515543 2734718 2980090 2828448 2960364
14495B960364J043l82600O28477k99042p8754J86362K1593l1662l15189L04064
$$ 2960364 2961407 2578807 3207284 2908242 2829488 3015850 3037443 3005781 2690592 2994656
14485B994656K28312R0341m8328j27752J19314j60441p610L39887m29894K48383
$$ 2994656 3222968 3313309 3264981 3137229 3256543 3096102 3088492 3428379 2998485 3246868
14475C246868J04786k84991N38563P2963k40112j45471M07228r807R6134j66363
$$ 3246868 3351654 3066663 3605226 3678189 3438077 3292606 3699834 3690027 3786161 3619798
14465C619798K09684j38914K43272j38146j07228K25503J55273N6623L08302k26737
$$ 3619798 3829482 3690568 3933840 3795694 3688466 3913969 4069242 4125865 4434167 4207430
14455D207430j96396K56488J20342K45964j99387J14287K2854j90839J02694Q9445
$$ 4207430 4011034 4267522 4387864 4633828 4434441 4548728 4571582 4380743 4483437 4572882
14445D572882O3905L42442j29326j11802L3573K8775M65177j11052o872K45585
$$ 4572882 4636787 4979229 4849903 4738101 4771674 4800449 5265626 5154574 5147702 5393287
14435E393287j4814J18609l65724N73324J97749m02748K23825J6563J65025m6793
$$ 5393287 5378473 5497082 5131358 5704682 5902431 5499683 5723508 5740071 5905096 5858303
14425E858303M41438l03509J31972J40626K80983l0703K27783j00114K62085J34969
$$ 5858303 6299741 5996232 6128204 6268830 6549813 6519110 6746893 6646779 6908864 7043833
14415G043833J03604L0022m06925L79504M93499K45046m0716o3792J94983r5586
$$ 7043833 7147437 7177459 6770534 7150038 7643537 7888583 7847867 7784075 7979058 7883472
14405G883472J45310N03256K07808j61570K38566k09075N39158l49358K62664
$$ 7883472 8028782 8532038 8739846 8578276 8816842 8607767 9146925 8797567 9060231
14396I060231J27716M36690k25716K54808J74181K09851K27510L34163k01357
$$ 9060231 9187947 9624637 9398921 9653729 9827910 10037761 10265271 10599434 10398077
14387A0398077N38051K29557J70879L77429O9356r629j26481R16797M7403M70366
$$ 10398077 10936128 11165685 11336564 11713993 11783349 11773720 11647239 12564036 12611439 13081805
14377A3081805M258K19836L6317N02231l7072K89880K40042M58924K44079J95579
$$ 13081805 13086063 13305899 13342216 13844447 13807375 14097255 14337297 14796221 15040300 15235879
14367A5235879Q63003L7918N71050j72553J053456m77927R93444K14363J11585
$$ 15235879 16098882 16136800 16707850 16535297 17588753 17110826 18104270 18318633 18430218
14358A8430218M15018O61833L8772O72504M14951Q17075J41816R49433K45342
$$ 18430218 18845236 19507069 19545841 20218345 20633296 21450371 21592187 22541620 22786962
14349B2786962R02618J18709N36746R21047Q07602O45717O49382P33673M29604
$$ 22786962 23689580 23808289 24345035 25266082 26073684 26719401 27368783 28102456 28532060
14340B8532060J016056Q17983Q38946Q77546R20740P98000J071850J164241J164235
$$ 28532060 29548116 30366099 31205045 32082591 33003331 33801331 34873181 36037422 37201657
14331C7201657J089651J333938J149773J170364J724885J091824J598957J405500
$$ 37201657 38291308 39625246 40775019 41945383 43670268 44762092 46361049 47766549
14323D7766549J846427J774610K117242J670157K049677K128629J936821K555849
$$ 47766549 49612976 51387586 53504828 55174985 57224662 59353291 61290112 63845961
14315F3845961K356711L192042K439523K774190L472398L278033L334741L781625
$$ 63845961 66202672 69394714 71834237 74608427 78080825 81358858 84693599 88475224
14307H8475224L980178M278040M350311N132074M995212N322493N677759O393326
$$ 88475224 92455402 96733442 101083753 106215827 111211039 116533532 122211291 128604617
14299A28604617O333215O985424P202718Q103120P903056Q893739R012760R788769
$$ 128604617 134937832 141923256 149125974 157229094 165132150 174025889 183038649 192827418
14291A92827418R934424J1280794J1282026J2138899J2871211J2820872J3896294
$$ 192827418 202761842 214042636 225324662 237463561 250334772 263155644 277051938
14284B77051938J4096407J4415694J4918360J4906461J4993230J4891283J3878012
$$ 277051938 291148345 305564039 320482399 335388860 350382090 365273373 379151385
14277C79151385J2883179J2669284J1460378R679246O492043L201724J385664
$$ 379151385 392034564 404703848 416164226 425843472 432335515 435537239 436922903
14270D36922903Q99357j097468n202613q340461q109672q948490j1302860j3206936
$$ 436922903 437822260 436724792 431522179 423181718 415072046 406123556 394820696 381613760
14262C81613760j3795387j4461157j4701003j5764580j5538107j5128383j5079138
$$ 381613760 367818373 353357216 338656213 322891633 307353526 292225143 277146005
14255B77146005j4360868j2447644j3509110j2319094j1718167j1263684j0513770
$$ 277146005 262785137 250337493 236828383 224509289 212791122 201527438 191013668
14248A91013668j0010584r064789q742089p962129p414383p334763p007143o378495
$$ 191013668 181003084 171938295 163196206 155234077 147819694 140484931 133477788 127099293
14240A27099293n842801n782209m665041n137092m679641m418697m191520m003906
$$ 127099293 121256492 115474283 110809242 105672150 100992509 96573812 92382292 88378386
14232H8378386l449300l113526l389600l273923k904318l060746k658211k253186
$$ 88378386 84929086 81815560 78425960 75152037 72247719 69186973 66528762 64275576
14224F4275576k272960k389081k358143j894499j932586j505707k189647j555856
$$ 64275576 62002616 59613535 57255392 55360893 53428307 51922600 49732953 48177097
14216D8177097j316032j723739j254635j347489j680603r94640j422662j046171
$$ 48177097 46861065 45137326 43882691 42535202 40854599 39859959 38437297 37391126
14208C7391126r36906q20355r55850n93886j853944p95526q58358p47618m68990
$$ 37391126 36454220 35633865 34678015 34084129 32230185 31434659 30576301 29828683 29359693
14199B9359693r60358p98062m76952j094501p13212k50454n35561p14979o20360
$$ 29359693 28399335 27601273 27124321 26029820 25316608 25066154 24530593 23815614 23195254
14190B3195254q06821m51715k82648o93488o30098j0693r82929o9449n10721o00588
$$ 23195254 22388433 21936718 21654070 20960582 20330484 20319791 19336862 19267413 18756692 18156104
14180A8156104k81050m61197m52727j99179k51399j95913n91392k03925m00988
$$ 18156104 17875054 17413857 16961130 16761951 16510552 16314639 15723247 15519322 15118334
14171A5118334k34663l01499j8723p51087k77904j2732m14144L2415k46833l02263
$$ 15118334 14883671 14582172 14563449 13812362 13534458 13521726 13107582 13139997 12893164 12590901
14161A2590901n3619o12650r8114k22084j80348l64805p7818l49283n1275j39788
$$ 12590901 12537282 11924632 11826518 11604434 11424086 11059281 10981463 10632180 10580905 10441117
14151A0441117K0634m74194L4098m58489M70954m54512l85912K76106k81958k91375
$$ 10441117 10461751 9987557 10021655 9563166 10034120 9579608 9193696 9469802 9187844 8896469
14141H896469m0236k67769J33951m60856J31881j44710l56584J9141j75516j86428
$$ 8896469 8856233 8588464 8722415 8261559 8393440 8248730 7892146 7911287 7735771 7549343
14131G549343K0650o38p070l42847J83425l47909j47523J73066k27570r8591j3188
$$ 7549343 7569993 7569355 7562285 7219438 7402863 7054954 6907431 7080497 6852927 6754336 6741148
14120F741148j22000j82399k96528M844K49730k88246p6268L36037l00825q6996
$$ 6741148 6619148 6436749 6140221 6145065 6394795 6106549 6030281 6366318 6065493 5978497
14110E978497r7152j71304m95545J64526J80381m62946K61861l17303k27149L05600
$$ 5978497 5881345 5710041 5214496 5379022 5559403 5096457 5358318 5041015 4813866 5119466
14100E119466K96838k97022l65654K48609j77444k442l55536K69650j95757j08891
$$ 5119466 5416304 5119282 4753628 5002237 4824793 4822351 4466815 4736465 4540708 4431817
14090D431817J11153n66927K76133K0479L7510o9463L21015m56802O2131n64380
$$ 4431817 4542970 3976043 4252176 4272655 4310165 4240702 4561717 4104915 4167046 3602666
14080C602666N52990r1081r5154O1874k34157J0981O3414J3506j84890j94927
$$ 3602666 4155656 4064575 3969421 4031295 3797138 3808119 3871533 3885039 3700149 3505222
14070C505222Q447J32235K92506r009o26999M05484M7844k64836q2738J78280
$$ 3505222 3513669 3645904 3938410 3929401 3302402 3707886 3755730 3490894 3408156 3586436
14060C586436j46151n960j23139j83277j67731J59436k12925K21397k8983Q4144
$$ 3586436 3440285 3434325 3311186 3127909 2960178 3119614 2906689 3128086 3099103 3183247
14050C183247p1576J81953n12649K08828n0589J03800l11306L75321o5181l30858
$$ 3183247 3111671 3293624 2780975 2989803 2939214 3043014 2731708 3107029 3041848 2710990
14040B710990j3774j26928l31622M75069l15371K15226j8042p0700q9054L31457
$$ 2710990 2697216 2570288 2238666 2713735 2398364 2613590 2595548 2524848 2435794 2767251
14030B767251j83278j01717q9505K85979J10308k62723j90068k48691J85619j25905
$$ 2767251 2583973 2482256 2392751 2678730 2789038 2526315 2336247 2087556 2273175 2147270
14020B147270k46305K13750L03713k22123j35664P5203l37759K80833m85536K49923
$$ 2147270 1900965 2114715 2418428 2196305 2060641 2135844 1798085 2078918 1593382 1843305
14010A843305o2282K24147o5089J57587k26003J97868k49886j00576P3628N16418
$$ 1843305 1781023 2005170 1940081 2097668 1871665 2069533 1819647 1719071 1792699 2309117
14000B309117l89378p7718j04299M59699k61711k02332L46044m37701L95257L18473
$$ 2309117 1919739 1842021 1737722 2197421 1935710 1733378 2079422 1641721 2036978 2355451
13990B355451M72270J059290K659704N006029J1290738J2182341j2703778r645468
$$ 2355451 2827721 3887011 6546715 11552744 22843482 35025823 22322045 12676577
13982A2676577m234213k310430j507780r16714l52334j06476m49940m21883L07886
$$ 12676577 8442364 6131934 4624154 3707440 3355106 3248630 2798690 2376807 2684693
13973B684693l00441m79208M05529J32359n94843L73355r4607j73218k15246J33953
$$ 2684693 2384252 1905044 2310573 2442932 1848089 2221444 2126837 1953619 1738373 1872326
13963A872326k35043J72036n73n5312j86513K88082l58820K75581k18479J24904
$$ 1872326 1637283 1809319 1808746 1753434 1566921 1855003 1496183 1771764 1553285 1678189
13953A678189j42682J24040J16814J15809k00753R5497k1845p6160k3052r0778
$$ 1678189 1535507 1659547 1776361 1892170 1691417 1786914 1765069 1688909 1665857 1575079
13943A575079L11374m10791K04264o9814j15099j6427p7361O2859j65472j258
$$ 1575079 1886453 1475662 1679926 1610112 1495013 1478586 1401225 1464084 1298612 1297354
13933A297354L05630k89018J48081k49370L20318m02275M56846m65049L14431
$$ 1297354 1602984 1313966 1462047 1212677 1532995 1130720 1587566 1122517 1436948
13924A436948n0314k68896N2367J29372K19922k24560K69150n09762o9329l365
$$ 1436948 1386634 1117738 1170105 1299477 1519399 1294839 1563989 1054227 984898 981533
13914I81533L68016o1454k94409L73512m81876L22630J7341n2586m3133L37681
$$ 981533 1349549 1288095 993686 1367198 885322 1207952 1225293 1172707 1129574 1467255
13904A467255l84081K45689k57510J80608m16817K80392j15112m9366P5250J08101
$$ 1467255 1083174 1328863 1071353 1251961 835144 1115536 1000424 951058 1026308 1134409
13894A134409j76288J57727M3747j82607p5478J99615K33429n27482N45157n04440
$$ 1134409 958121 1115848 1159595 976988 901510 1101125 1334554 807072 1352229 847789
13884H47789J43274l14293K62718J03011p5850j5843L26310m06417M6070L89415
$$ 847789 991063 676770 939488 1042499 966649 950806 1277116 870699 916769 1306184
13874A306184j19398q4607k28101K03226K42967l59715J55126j70163p424j78549
$$ 1306184 1186786 1102179 874078 1077304 1320271 960556 1115682 945519 938095 759546
13864G59546K42255j36139q9145J07918K1961J362J48844m54285N96627m24489
$$ 759546 1001801 865662 776517 884435 906396 907758 1056602 602317 1198944 774455
13854G74455K35665J13348k34720j15083J17740O1044j99552R7020k17963J50824
$$ 774455 1010120 1123468 888748 773665 891405 952449 752897 849917 631954 782778
13844G82778k14373m0810J11401K04868O8443J26327l64478J76490j83411K92513
$$ 782778 568405 527595 638996 843864 912307 1038634 674156 850646 667235 959748
13834I59748k66123K40791k53088j47332P12684n89480J10104j36001N47117m51865
$$ 959748 693625 934416 681328 533996 1246680 657200 767304 631303 1178420 726555
13824G26555O2887k45121L51912j42015k33888K06085L02005l30269J57592j4058
$$ 726555 789442 544321 896233 754218 520330 726415 1028420 698151 855743 841685
13814H41685P8555j06384p9611l4360J00149J02630C46959L90418N497m0776n7828
$$ 841685 920240 813856 734245 699885 800034 902664 346959 737377 742874 702098 644270
13803F44270j65726K5534J26677K26108m18503K03111j03606R0186P642B75427
$$ 644270 478544 504078 630755 856863 438360 641471 537865 628051 635693 275427
13792E32099L25455C50282M50345k10749J9745K87400l81057Q5965J73577n3065
$$ 532099 857554 350282 800627 589878 609623 897023 515966 601931 775508 722443
13782G22443k28770j21551L66985K00825l35480o6112j12937p83M08989k86203
$$ 722443 493673 372122 739107 939932 604452 538340 425403 424620 833609 547406
13772E47406j56424K2657L52804k19709j25455K60297O006j03321B74923L79819
$$ 547406 390982 413639 766443 546734 421279 681576 687582 584261 274923 654742
13762F54742l04425L77561j70623J87953j163l71168L36840l6015k97331k5223
$$ 654742 350317 727878 557255 745208 744045 372877 709717 673702 376371 351148
13752C51148k4753N4390L3796j10203M85531k65943j38747N15146l90739k06440
$$ 351148 326395 380785 414581 304378 789909 523966 385219 900365 509626 303186
13742C03186K26833q8629K88043j98250j49621I8737M79566m9575m7496L06142
$$ 303186 530019 441390 729433 531183 381562 98737 578303 528728 481232 787374
13732G87374j23291l15706J51387P6477j22691j6810j21237L35698k68632J32817
$$ 787374 664083 348377 499764 576241 453550 436740 315503 651201 382569 515386
13722E15386p2064K14895C03938P1815L19469j97317j21631L93191B21167A04863
$$ 515386 443322 658217 303938 375753 695222 497905 376274 769465 221167 104863
13711C08510L32129A64956J53728L349j2303j05665L29681B64614m8112J43968
$$ 308510 640639 164956 318684 322033 309730 204065 533746 264614 216502 360470
13701C60470k1611L70636A90323L50824q0979j00136A53788J01535K84215B25092
$$ 360470 338859 709495 190323 541147 460168 360032 153788 255323 539538 225092
13690B30942q171N5874A3468L79532d8722B86831q3565L77316j01054K02615n6161
$$ 230942 222771 278645 13468 393000 -48722 286831 203266 580582 479528 682143 625982
13679F25982k77338j5919j36584M01416J41813k53969F4904K79122O2711j31648
$$ 625982 348644 332725 196141 597557 739370 485401 64904 344026 406737 275089
13669B75089M12394A65650P8596K4363M4392J02520A49560n3486K77488R0134
$$ 275089 687483 165650 244246 268609 313001 415521 149560 96074 373562 463696
13659D63696J80542A78534K08822j5779P1383J52177K2836B29879N2500K17375
$$ 463696 644238 178534 387356 371577 442960 595137 617973 229879 282379 499754
13649D99754l9447K0241K49838C28452j546A48404K03332M7891j14012E8444L78310
$$ 499754 460307 480548 730386 328452 326906 148404 351736 399627 285615 58444 436754
13638D36754M1427j35503Q9998J31462B22253l6269K95809O2289B04890K64838
$$ 436754 478181 342678 432676 564138 222253 185984 481793 544082 204890 469728
13628D69728B33130J77184k01501K10494b8293B04281L36279K8826B69344k0661
$$ 469728 233130 410314 208813 419307 -28293 204281 540560 569386 269344 248683
13618B48683A13111K76993j12057j18391J74280j12913J20677L2740K75976j57709
$$ 248683 113111 390104 278047 159656 333936 221023 341700 374440 650416 492707
13608D92707B40113j14861L05339J72556H5767J5048K06424K31686j05655r6602
$$ 492707 240113 125252 430591 603147 85767 100815 307239 538925 433270 336668
13598C36668K27660k12007K41101k37034r1377F0566L42692p5637j44946J99413
$$ 336668 564328 352321 593422 356388 265011 60566 403258 327621 182675 382088
13588C82088a8484C27104Q4368o3314p7272g341B79135H5217K16303a01385A27857
$$ 382088 -18484 327104 411472 348158 270886 -7341 279135 85217 301520 -101385 127857
13576A56159n5278K19542F6701K23375K6438q3519I5487K36487K1539d8207E66638
$$ 156159 100881 320423 66701 290076 316514 232995 95487 331974 353513 -48207 566638
13564B72158R0142c6049C63821O571K87267l04227O2170k06725O9589D5681K03856
$$ 272158 362300 -36049 363821 370392 657659 353432 415602 208877 278466 45681 249537
13553B49537E8054M4454K49295j63524p5378J25975A17384O7085J06762J87999
$$ 249537 58054 102508 351803 188279 112901 238876 117384 184469 291231 479230
13543D79230A91873B0443G420L95854j31746J95226g6895B98488J09650q0897
$$ 479230 191873 20443 7420 403274 271528 466754 -76895 298488 408138 327241
13533C27241L050A48682K74999G0878N6949M18085k07367G9536K66909A07891
$$ 327241 330291 148682 423681 70878 127827 545912 338545 79536 346445 107891
13522C05912m0635q1612J38975D3628L82220p9801A71398J13387N2712a9958A34196
$$ 305912 265277 183665 322640 43628 425848 346047 171398 284785 337497 -19958 134196
13510F72234l01912A69776a04786C81190M0292B06018p9885N9593J82215j65211
$$ 672234 370322 169776 -104786 381190 421482 206018 126133 185726 367941 202730
13500B02730I5134L392K39934A62488m1021b46698A28882K30985j8105k1654J21152
$$ 202730 95134 98526 338460 162488 121467 -246698 128882 359867 341762 320108 441260
13489D41260a1070l076H7591L13060A69441i22m1505C4679K69601j44699J2769
$$ 441260 -11070 -14146 87591 400651 169441 -922 -42427 34679 304280 159581 172350
13478A72350K0122N0000J6516d708A23387K18967j23719j4326O9198j31238L41982
$$ 172350 192472 242472 258988 -4708 123387 342354 218635 204309 273507 142269 484251
13467D84251C9767J42087m498n1601M1679P3929k4986a46738F6995a9284A08729
$$ 484251 39767 181854 177356 125755 167434 241363 216377 -146738 66995 -19284 108729
13455C63004A66606j5981K9074l5924l1439K7007l3829I904J76304r2641a04179
$$ 363004 166606 150625 179699 143775 112336 139343 105514 9904 186208 93567 -104179
13443D15466D7362K2737J93618D0521K80279j16223m9655J17407H1216J80568
$$ 415466 47362 70099 263717 40521 320800 204577 154922 272329 81216 261784
13433B61784H3664a8463B07428I3381K12913p3320D2437K77871C2542K52400K37029
$$ 261784 83664 -18463 207428 93381 306294 232974 42437 320308 32542 284942 521971
13422E21971E3833K17177a51429f6920I4653K39210a57578B66644g5983B59783
$$ 521971 53833 271010 -151429 -66920 94653 333863 -157578 266644 -75983 259783
13411g4112C51965m0277k2262a79095B03250l7981F7491B7785J88580F731e4624
$$ -74112 351965 311688 289426 -179095 203250 165269 67491 27785 216365 6731 -54624
13399A51893J19473n6139E0982K25008c0763C61342d48D15885l8254A07441c4020
$$ 151893 271366 215227 50982 275990 -30763 361342 -448 415885 377631 107441 -34020
13387B8788L86344a91073A41087m8248P0420a3991F6800b9535B8178J68372m2679
$$ 28788 415132 -191073 141087 92839 163259 -13991 66800 -29535 28178 196550 153871
13376A53871n0068q263J67476p3709m493D1436e3695I9873K13674A54431N52078
$$ 153871 103803 95540 263016 189307 184814 41436 -53695 99873 313547 154431 706509
13365G06509A83029Q4522G5118j552L2740J20669H9151J15229r1590N6514k349
$$ 706509 183029 267551 75118 73566 106306 226975 89151 204380 112790 169304 166955
13354A66955c6047l66A22776M0317h239l0093D5087FJ35262Q1008o0867J27150
$$ 166955 -36047 -36413 122776 163093 -8239 -38332 45087 6 135268 216276 155409 282559
13342B82559K64669c5357F59157a05183A8371P752a81679A39562M00345A0633
$$ 282559 547228 -35357 659157 -105183 18371 26123 -181679 139562 539907 10633
13331A29393J921P956J30968j04830F9411N9652a54231D62857B09449A3606J36977
$$ 129393 131314 139270 270238 165408 69411 129063 -154231 462857 209449 13606 150583
13320A50583N6541J31189c9209A03371J88843j40091l9227J03494a06248C3706
$$ 150583 207124 338313 -39209 103371 292214 152123 112896 216390 -106248 33706
13309A75081J58817R273A0313d8653A57427k915g9765A81771a6616D3763J78672
$$ 175081 333898 343171 10313 -48653 157427 154512 -79765 181771 -16616 43763 222435
13298B22435R5833p6173a95844A91062b36637A81753a49760b6992C34154A58535
$$ 222435 318268 242095 -195844 191062 -236637 181753 -149760 -26992 334154 158535
13287C79279a74361A76040K8349F4424a58341E1979J77370J5596E7171N1580K0487
$$ 379279 -174361 176040 204389 64424 -158341 51979 229349 244945 57171 108751 129238
13276A29238J11007a55944j01178B7540R4052P10Q5897b8409A22596J65405b02148
$$ 129238 240245 -155944 -257122 27540 121592 122302 208199 -28409 122596 288001 -202148
13264b1409l05294a17489A84779f2941B97882j36666b01283c906k36971A92145
$$ -21409 -326703 -117489 184779 -62941 297882 161216 -201283 -3906 -240877 192145
13253b880A83206g6211j34976g4167o368D02778G6287K49503A31094f4785B68942
$$ -2880 183206 -76211 -211187 -74167 -80535 402778 76287 325790 131094 -64785 268942
13241A70277B1544e7697J145C65850g7829n1861B57372m9451H105J84654a86929
$$ 170277 21544 -57697 -56552 365850 -77829 -129690 257372 207921 8105 192759 -186929
13229I7015b26331A13394J12929I3211J66464J67371B09880b93407B13513a7438
$$ 97015 -226331 113394 226323 93211 259675 427046 209880 -293407 213513 -17438
13218F0160k801J93681A18450a52758B74346E0422i4266B47873l1382C2832Q4715
$$ 60160 57359 251040 118450 -152758 274346 50422 -94266 247873 216491 32832 117547
13207A17547J1140a27588c1055B17615d4326A19650J80041g0930b7016E0220K19120
$$ 117547 128687 -127588 -31055 217615 -44326 119650 299691 -70930 -27016 50220 269340
13196B69340L767f8134A72038J80304A4028R72l429a41249d2152A1050O8387J41610
$$ 269340 273107 -68134 172038 352342 14028 15000 11571 -141249 -42152 11050 79437 221047
13184B21047b4890D53239b44856A17381K49266B6501J30409N0634C6131R9071
$$ 221047 -24890 453239 -244856 117381 366647 26501 156910 207544 36131 135202
13174A35202b4183m383k3187G1331J51459f3296n1112r5717H2866C9680A7636
$$ 135202 -24183 -28566 -51753 71331 222790 -63296 -114408 -210125 82866 39680 17636
13162h050B6087a24863b2093H4235N6961e0274G3958a81248e2462a6830m7638
$$ -8050 26087 -124863 -22093 84235 141196 -50274 73958 -181248 -52462 -16830 -64468
13151f4468a1351A4315a7964l8776A10188e5559A62932g7378B98371A9775b44807
$$ -64468 -11351 14315 -17964 -56740 110188 -55559 162932 -77378 298371 19775 -244807
13139E3383d9673J336B83272i870C58841a24035B06938K6561j01632M3449O8277
$$ 53383 -49673 -48337 283272 -9870 358841 -124035 206938 233499 131867 175316 243593
13128B43593a67008C69584A49219a01721F5197a10995A41397N8297i3795D33374
$$ 243593 -167008 369584 149219 -101721 65197 -110995 141397 199694 -93795 433374
13117a29302B95836B493J10838A5013J12477h2203n3887p3081e6318j12683j19051
$$ -129302 295836 2493 113331 15013 127490 -82203 -136090 -209171 -56318 -169001 -288052
13106b88052c1320R761n8248A09730a72239F2533J70376A05952J62051k9289F3070
$$ -288052 -31320 -21559 -79807 109730 -172239 62533 232909 105952 268003 238714 63070
13094E5540a00034b3740B60163d8374k09877A28360a93586A11113N3339i6103
$$ 55540 -100034 -23740 260163 -48374 -258251 128360 -193586 111113 164452 -96103
13083c7786E07447e02690I4720A8751J86848I6923J18531I7603g5893B02107a40066
$$ -37786 507447 -502690 94720 18751 205599 96923 215454 97603 -75893 202107 -140066
13071G8600l6053J4345O3262a08223b7140B75903a6475G0624K45988g4747I3567
$$ 78600 42547 56892 120154 -108223 -27140 275903 -16475 70624 316612 -74747 93567
13059F3989N8066e7049C01748E1152b2180I2229D6050f5949G4690J76410a03130
$$ 63989 122055 -57049 301748 51152 -22180 92229 46050 -65949 74690 251100 -103130
13047a41143I467e501F3463A352c1374b180A30705R3295b25344f6087F3050L0477
$$ -141143 9467 -5501 63463 1352 -31374 -2180 130705 224000 -225344 -66087 63050 93527
13035I3527i4405B02046F9452K92188j26297b115l30797A69819D1738J5489L7720
$$ 93527 -94405 202046 69452 361640 235343 -2115 -332912 169819 41738 57227 94947
13024I4947J42248a03755l7287A3496K51743I768c3396A06289O0233g2480B8928
$$ 94947 237195 -103755 -141042 13496 265239 9768 -33396 106289 166522 -72480 28928
13012c09685C5413m292K8210K60767a58A43706J61161C7117a08123A98299j809
$$ -309685 35413 31121 59331 320098 -158 143706 304867 37117 -108123 198299 196490
13001A96490q9420N407J61838A10880B0583L10970f5258j9073j04628A26791N0659
$$ 196490 107070 112477 274315 110880 20583 331553 -65258 -84331 -188959 126791 177450
12990A77450H6562E518a06286K4403j89542I8465D2394i8450A20462m1121M4108
$$ 177450 86562 5518 -106286 -81883 -271425 98465 42394 -98450 120462 79341 123449
12979A23449d0176C42821f484A90318a53908o2987F6348g5162C29566B5214b0281
$$ 123449 -40176 342821 -6484 190318 -153908 -216895 66348 -75162 329566 25214 -20281
12967c86714d9268J3569F2516b66668H3940K6488a7331j56589B1447K67057i520
$$ -386714 -49268 -35699 62516 -266668 83940 110428 -17331 -173920 21447 288504 -9520
12955d8542B38824B1679k988J27367a65912G1644j1868b14080A13807q966C003
$$ -48542 238824 21679 18691 146058 -165912 71644 59776 -214080 113807 104841 3003
12943f7647l8770A10930f8672B53223D8674c5239A50518d3481J6299j14483e5417
$$ -67647 -106417 110930 -68672 253223 48674 -35239 150518 -43481 -27182 -141665 -55417
12931A20193h2501G2326L9620a52353M1875A73693d2039A22075a85584A09728
$$ 120193 -82501 72326 111946 -152353 -110478 173693 -42039 122075 -185584 109728
12920B91956b96996B61315B8096a98720J7765A99496J07505A39263E5158Q4742
$$ 291956 -296996 261315 28096 -198720 -180955 199496 307001 139263 55158 139900
12910A39900b20834J10020m2151b1998B83338b6113C5630K13986a20952A17328
$$ 139900 -220834 -110814 -152965 -21998 283338 -26113 35630 249616 -120952 117328
12899b79010B68767j10006R4014b02762b9675j50750F284M32171d472p7852B544
$$ -279010 268767 158761 252775 -202762 -29675 -180425 6284 438455 -4472 -82324 2544
12887G8157k8222a55976A518e8988A36743J29586B6494L07075h337j9577A9796
$$ 78157 49935 -155976 1518 -58988 136743 266329 26494 333569 -8337 -27914 19796
12875d6411C86082A06433J11154b78229B597J21429b42785B21010E7852a97824
$$ -46411 386082 106433 217587 -278229 2597 124026 -242785 221010 57852 -197824
12864a01516H580d6735j13751g1580A05493K23121H2481o992i7287L0191A22584
$$ -101516 8580 -46735 -160486 -71580 105493 328614 82481 75489 -97287 -67096 122584
12852f22k2824p0631A51224a70159c6912A77681a52925C2565b14169C62673n1321
$$ -622 -23446 -94077 151224 -170159 -36912 177681 -152925 32565 -214169 362673 311352
12841C11352H6889a49933C34554I8972J38765K553a2937H9359K9790R9368B5132
$$ 311352 86889 -149933 334554 98972 237737 240290 -12937 89359 119149 218517 25132
12829g2890b8627j29165A29644a31121d4742k89483G3484a07439c5055F5314N8070
$$ -72890 -28627 -157792 129644 -131121 -44742 -334225 73484 -107439 -35055 65314 123384
12818A23384K3686r10Q8538H4764a95760k4460b7052r7748A13790Q0485B7847
$$ 123384 147070 146160 234698 84764 -195760 -220220 -27052 -124800 113790 194275 27847
12806A19863J1040a53133A92935N4522h1551F8013c090j53479A57203p4148K81377
$$ 119863 130903 -153133 192935 247457 -81551 68013 -3090 -156569 157203 83055 364432
12795C64432E258c0190k57874a020r7906b5079k12565A4559J61927l6812J18668
$$ 364432 5258 -30190 -288064 -1020 -98926 -25079 -237644 14559 176486 139674 258342
12784B58342r1740q340j7604a65553j17810n37M1423j75537b00306j4541L5891
$$ 258342 166602 158262 140658 -165553 -283363 -283900 -242477 -418014 -200306 -214847 -178956
12773a78956I4213i794G3037a05019P023j98609L260B70029G2893J01024j8180
$$ -178956 94213 -9794 73037 -105019 -97996 -296605 -293345 270029 72893 173917 155737
12762A55737a42109O4892I4112N7472J1322d01109A01611A2292K01059b14558
$$ 155737 -142109 -77217 94112 151584 162906 -401109 101611 12292 213351 -214558
12751c15245A1221a23705D7300Q3057K51046c0306E8254a4477C96802d1882A92969
$$ -315245 11221 -123705 47300 130357 381403 -30306 58254 -14477 396802 -41882 192969
12739B50712a4090A30865j6497a31598O942o7352E8096a13336c6684E5408a83026
$$ 250712 -14090 130865 114368 -131598 -124656 -192008 58096 -113336 -36684 55408 -183026
12727i6644A18823b1440j56600f3279A82211a16866B38181a24326j00247j5176
$$ -96644 118823 -21440 -178040 -63279 182211 -116866 238181 -124326 -224573 -239749
12717b39749E0937j7011i7805j56263A05563m2468J26011M6705A05939P7298b21051
$$ -239749 50937 33926 -97805 -254068 105563 63095 189106 235811 105939 183237 -221051
12705e4226A86350c7558A25012K5963j1674c23580A27799i842b170j35656C4119
$$ -54226 186350 -37558 125012 150975 139301 -323580 127799 -9842 -2170 -137826 34119
12693D8571j1667J92078q1727l4183Q6457G9971f6037H6804g4687C7935a72115
$$ 48571 36904 228982 147255 113072 199529 79971 -66037 86804 -74687 37935 -172115
12681b70615h2010B37031B9701a328A59000a75398A24594E3140B2161J32501a83063
$$ -270615 -82010 237031 29701 -1328 159000 -175398 124594 53140 22161 154662 -183063
12669A34565N1605f1728B42596o8585K093a74037A86673H3938e3080A53894a4975
$$ 134565 186170 -61728 242596 174011 176104 -174037 186673 83938 -53080 153894 -14975
12657c76820E5000a82370f305m2963F4230d139A18211b0947m0360m8659A52148
$$ -376820 55000 -182370 -6305 -49268 64230 -4139 118211 -20947 -61307 -109966 152148
12645B86360b92483A66790b3952C76556b49918c073l9247E2698e7802B78693b99095
$$ 286360 -292483 166790 -23952 376556 -249918 -3073 -42320 52698 -57802 278693 -299095
12633D5994B318c7134A77156a33925j3470D3729b03721G8180N352K08500b37714
$$ 45994 2318 -37134 177156 -133925 -147395 43729 -203721 78180 83532 292032 -237714
12621B917K09073h6482M312B5869c0363n6906P032B73289A05665J483l6991J25393
$$ 2917 211990 -86482 -82170 25869 -30363 -87269 -80237 273289 105665 107148 70157 195550
12609A95550a11610A71074B5720J1207Q3899N5713i1179A08076K8766L6249o3504
$$ 195550 -111610 171074 25720 36927 120826 176539 -91179 108076 136842 173091 109587
12598A09587K06709A26419k0828C8104L7218C4945J07227F9188L325i711k9035
$$ 109587 316296 126419 105591 38104 75322 34945 142172 69188 72513 -9711 -38746
12587c8746G6151i6097p4329F0386a91788C2557e6226j24982L5832j3124F3769
$$ -38746 76151 -96097 -170426 60386 -191788 32557 -56226 -181208 -145376 -158500 63769
12575b05257C5684b39700C5892J13467a5191p4080a5167j37307I0471c1770A56682
$$ -205257 35684 -239700 35892 149359 -15191 -89271 -15167 -152474 90471 -31770 156682
12563b02068B19063b44682B88266f9919m2340A93400b48055N9966B11911P5204
$$ -202068 219063 -244682 288266 -69919 -112259 193400 -248055 -188089 211911 287115
12553B87115a67486k478G8622l2538N579f0994B90620a32401n54A96962r1054
$$ 287115 -167486 -169964 78622 46084 51663 -60994 290620 -132401 -132955 196962 105908
12542A05908a34874f0883B5429J65471d5263B34081b85252N6613A45975D5301
$$ 105908 -134874 -60883 25429 190900 -45263 234081 -285252 -228639 145975 45301
12531A8972J48227h9628C17817e5279b3841C29908A56416m1033a34611b5546p4221
$$ 18972 167199 -89628 317817 -55279 -23841 329908 156416 115383 -134611 -25546 -99767
12520i9767n7329L5516A35114b68132C59057j23287J41036j39057f9753A47784
$$ -99767 -157096 -121580 135114 -268132 359057 235770 376806 237749 -69753 147784
12509h3293F9057M4023c24435J14062A7220a40366A95375a40451e1033K4658A89233
$$ -83293 69057 113080 -324435 -210373 17220 -140366 195375 -140451 -51033 -26375 189233
12497b12351A27546a04032o4474k23827g6394o1637N7248G4764M4692m5097J1054
$$ -212351 127546 -104032 -168506 -392333 -76394 -138031 -80783 74764 119456 74359 85413
12486H5413j4439a71490O5504E24594A50240b7507j34872A93463d21417A18129
$$ 85413 70974 -171490 -105986 524594 150240 -27507 -162379 193463 -421417 118129
12475g4841F1632J18005b04156J366B33009i5450j35562C7339M0597O7409K3943
$$ -74841 61632 179637 -204156 -202790 233009 -95450 -231012 37339 77936 145345 169288
12464A69288h8751D02998h2920K7047H2177O716d2305B198M5609c415j927l84136
$$ 169288 -88751 402998 -82920 -55873 82177 88893 -42305 2198 47807 -3415 -5342 -389478
12452c89478C31573A9735a29305b9645A60464b1323F2465c3252j1554A64158L305
$$ -389478 331573 19735 -129305 -29645 160464 -21323 62465 -33252 -44806 164158 167463
12441A67463a45020L7252I3566i9366B05839b77666j20013a64098B1107a00724
$$ 167463 -145020 -107768 93566 -99366 205839 -277666 -397679 -164098 21107 -100724
12430c0935j3205A38461f0997G801c10770a3256p0464F7133k4078J21361b47055
$$ -30935 -44140 138461 -60997 7801 -310770 -13256 -83720 67133 43055 164416 -247055
12418B32068e5422A01179b47486Q6106k34039B39001I1139a391q5999D7592k2187
$$ 232068 -55422 101179 -247486 -161380 -395419 239001 91139 -1391 -87390 47592 25405
12407B5405a47064j56297E8564A1273b62846f6103j37736G1672b28558A17753
$$ 25405 -147064 -303361 58564 11273 -262846 -66103 -203839 71672 -228558 117753
12396C4010b42488R7924M691e3503F3249h1181q0207f9590C8900P8677a56190
$$ 34010 -242488 -144564 -139873 -53503 63249 -81181 -161388 -69590 38900 117577 -156190
12384A14675N3182d0559C0632J31892f333H9646A2158Q6066b1254q9566G6804
$$ 114675 167857 -40559 30632 162524 -6333 89646 12158 98224 -21254 -110820 76804
12372c23821C37473b5405C4620Q7233j7310a79054d9854C8875a17262E8397a86685
$$ -323821 337473 -25405 34620 121853 104543 -179054 -49854 38875 -117262 58397 -186685
12360i2519r2085B03338a48481j5086A10435m4492H237J20966j9755C2927N28
$$ -92519 -184604 203338 -148481 -163567 110435 65943 8237 129203 109448 32927 33455
12349C3455a68623k0772h9277j02906j15167B15319j141m9820a22340M2870L7523
$$ 33455 -168623 -189395 -89277 -192183 -307350 215319 214178 164358 -122340 -79470 -41947
12338d1947B62766a00473A73067b5005B29643A333J56486a3132j62749m363D6282
$$ -41947 262766 -100473 173067 -25005 229643 1333 157819 -13132 -175881 -180244 46282
12326A4185a39172G000J29438a44179g879j71207e9588I5369a35110A26589J1854
$$ 14185 -139172 7000 136438 -144179 -7879 -179086 -59588 95369 -135110 126589 138443
12315A38443o0040b4795E6086f682A51519j9587m4813K7299A6863L35286j72554
$$ 138443 78403 -24795 56086 -6682 151519 131932 87119 114418 16863 352149 179595
12304A79595g8478o4935d4154k34136b6277j48201b8624I0037c77988E033a85627
$$ 179595 -78478 -143413 -44154 -278290 -26277 -174478 -28624 90037 -377988 5033 -185627
12292C68113E4004b28157a03229j36476A42743i7437A52351b18102D371g0547
$$ 368113 54004 -228157 -103229 -239705 142743 -97437 152351 -218102 4371 -70547
12281b19074A0380a00674E5872c39135c6387G2083i9629k53749B9501A2926J54486
$$ -219074 10380 -100674 55872 -339135 -36387 72083 -99629 -353378 29501 12926 167412
12270A67412h000o3055B88540F9703Q5940P961N6744c49144D1946a7541k03960
$$ 167412 -8000 -71055 288540 69703 155643 163604 220348 -349144 41946 -17541 -221501
12259b21501F7123A8944J4660L8787J81762a75860A42779b59900b5085p977E0218
$$ -221501 67123 18944 33604 72391 254153 -175860 142779 -259900 -25085 -33062 50218
12247c6795J4412I2982h0974A32366d1316a4382B67423a32629N1060j71816A00408
$$ -36795 -22383 92982 -80974 132366 -41316 -14382 267423 -132629 -81569 -253385 100408
12235A45126b01113A65109b22498I0975k7003g697I0331k6290J3559K23065Q2084
$$ 145126 -201113 165109 -222498 90975 63972 -7697 90331 64041 77600 300665 382749
12224C82749o8898h4933L038A30852L9775c79436B03708J09645J0557A01170a66119
$$ 382749 313851 -84933 -81895 130852 170627 -379436 203708 313353 323910 101170 -166119
12212C7005J93745B1716J75602c6547B14296a3033A7193M44785d27C79195A01758
$$ 37005 230750 21716 197318 -36547 214296 -13033 17193 461978 -427 379195 101758
12200B9419a7703l250I7174K18550j14392a25010E8804L83275f6242K3954D7080
$$ 29419 -17703 -20953 97174 315724 201332 -125010 58804 442079 -66242 -42288 47080
12188A05608K78902a42633M7916C9728F428K95865J6986a4157p2601A81622a08177
$$ 105608 384510 -142633 -94717 39728 6428 302293 319279 -14157 -86758 181622 -108177
12176a38875C04522m5487A6433h1145B7572J28986A2939P6266J3498g5911B17299
$$ -138875 304522 259035 16433 -81145 27572 156558 12939 89205 102703 -75911 217299
12164D59868G9214J63692A5315b06770A43064J84061J9841q9473D915a1664O6
$$ 459868 79214 242906 15315 -206770 143064 327125 346966 257493 4915 -11664 -11598
12153a1598F9764e2237H6673Q1792R8022b7684K69A67412O1379K958b02499d4436
$$ -11598 69764 -52237 86673 168465 266487 -27684 -27415 167412 228791 231749 -202499 -44436
12140A32160d0778A620Q374a93214f3119j98558D25299g7829k81304J56824F3358
$$ 132160 -40778 1620 9994 -193214 -63119 -261677 425299 -77829 -359133 -202309 63358
12128A51954a06738A97702f1873A47787N9459a09875F3567K02621D4360a19983
$$ 151954 -106738 197702 -61873 147787 207246 -109875 63567 266188 44360 -119983
12117g0606L3298a7597C6647j3561K20540M8522a35770B93910d38371a60438O8353
$$ -70606 -37308 -17597 36647 23086 243626 292148 -135770 293910 -438371 -160438 -92085
12106i2085E9896h103C4704K53182a6863l70885A65150n1156m4714a11702A52104
$$ -92085 59896 -8103 34704 287886 -16863 -387748 165150 113994 69280 -111702 152104
12094A19099k3002e29800J57240a12245I7262O8435J02070e2894L512a0792D284
$$ 119099 96097 -529800 -372560 -112245 97262 165697 267767 -52894 -49382 -10792 4284
12082b34211a13412A29969c4990G8931e5540F3456A1331K66498k3552J1472d2811
$$ -234211 -113412 129969 -34990 78931 -55540 63456 11331 277829 254277 265749 -42811
12070d2002o7500B60853P5228j4812b5296B22784b3442D9087K05379L61697B13224
$$ -42002 -109502 260853 336081 321269 -25296 222784 -23442 49087 254466 616163 213224
12058A51974M4885a32678k29192a55821A36955E5405e0067j02786A7569b18476
$$ 151974 196859 -132678 -361870 -155821 136955 55405 -50067 -152853 17569 -218476
12047b9274m08l42131a03280B40004D1936J26438d8547A17373e6172j43992h2266
$$ -29274 -29682 -371813 -103280 240004 41936 168374 -48547 117373 -56172 -200164 -82266
12035b24878A70739c9741D13350a33200I3556P1157H0494Q5941c08204B95372
$$ -224878 170739 -39741 413350 -133200 93556 164713 80494 166435 -308204 295372
12024A13631j1593c30985A02514a57765B09526g7353A6722a98440k25003B19404
$$ 113631 102038 -330985 102514 -157765 209526 -77353 16722 -198440 -423443 219404
12013a66333p7433K1957L8577j08949j1713e6304B99074a72816A67711a02699
$$ -166333 -243766 -221809 -183232 -292181 -303894 -56304 299074 -172816 167711 -102699
12002B04628J53412o7787B1319O9187f7835j67508c4515m4774D7802J58495b21049
$$ 204628 358040 290253 21319 90506 -67835 -235343 -34515 -79289 47802 206297 -221049
11990d1219Q520l17248E9638A9734d1510A67990a14276A44310k2943G325a3391
$$ -41219 -32699 -349947 59638 19734 -41510 167990 -114276 144310 121367 7325 -13391
11978d25683i874k49710a21729l6958N3365E0286k0691b67732A45454D8999a28791
$$ -425683 -9874 -259584 -121729 -158687 -105322 50286 29595 -267732 145454 48999 -128791
11966A11038i1338d1687J6513a1785k0418j71085Q5485C9643c4018D6952K76900
$$ 111038 -91338 -41687 -25174 -11785 -32203 -203288 -117803 39643 -34018 46952 323852
11955C23852G9773b76356f4835F5872J22248f9255j00848B01383B7770a09908
$$ 323852 79773 -276356 -64835 65872 188120 -69255 -170103 201383 27770 -109908
11944c32470c6036M343C1352d8234B5093b1059B78939B3905h9679j68437g1425
$$ -332470 -36036 -31693 31352 -48234 25093 -21059 278939 23905 -89679 -258116 -71425
11932c01590e5177k3137F3869P0479e9182q2124B56745h2672c6888J035q5689
$$ -301590 -55177 -78314 63869 134348 -59182 -141306 256745 -82672 -36888 -35853 -121542
11921a21542I4805N564b9499D2277f3063C15735B332J01883a51923a8398l13804
$$ -121542 94805 100369 -29499 42277 -63063 315735 2332 104215 -151923 -18398 -332202
11910c32202a18491B77062j36630b07185a0796j49461e0497j7867D45285i4128
$$ -332202 -118491 277062 140432 -207185 -10796 -160257 -50497 -68364 445285 -94128
11899B20533b26157E6212a66964A83425J07178e3827j27869A65255a32879M4116
$$ 220533 -226157 56212 -166964 183425 290603 -53827 -181696 165255 -132879 -88763
11889h8763B0284a48505M5880A91458r4271h7578C0326h3415l3300m9553P5456
$$ -88763 20284 -148505 -102625 191458 97187 -87578 30326 -83415 -116715 -166268 -90812
11878i0812E101J31297b9673B42427b939I0684a36863p253m6943p8265B8402Q6497
$$ -90812 5101 136398 -29673 242427 -2939 90684 -136863 -144116 -191059 -269324 28402 114899
11866A14899P575b37956D50378c5877o6588B37964c3199n3418J6692K1235k83536
$$ 114899 122474 -237956 450378 -35877 -102465 237964 -33199 -86617 -69925 -48690 -332226
11855c32226B43719b04620R1720D1014l141J30249a82720K5742d7045A48161c77998
$$ -332226 243719 -204620 -112900 41014 37873 168122 -182720 -156978 -47045 148161 -377998
11843g8561L5458o7906k33831J08777a7965k04605B5539K02556A10433b35265
$$ -78561 -43103 -111009 -344840 -236063 -17965 -222570 25539 228095 110433 -235265
11832g830k64194A451P0576J37463i7099B15914d19919F399K3722e2902J2130
$$ -7830 -272024 1451 72027 209490 -97099 215914 -419919 6399 30121 -52902 -40772
11821d0772E8893g7838j7077C6170e580n8142J7225B4891K4094g2512C21582a08371
$$ -40772 58893 -77838 -94915 36170 -5580 -63722 -46497 24891 48985 -72512 321582 -108371
11808A52751i4561F3390J8246a02101M5876j98404J07066B8181N6907h602E4452
$$ 152751 -94561 63390 81636 -102101 -56225 -254629 -147563 28181 85088 -8602 54452
11796B16486a48025A35395J4463b16481n7932J31913O438j14558C3098e9458E6119
$$ 216486 -148025 135395 149858 -216481 -274413 -142500 -136062 -250620 33098 -59458 56119
11784A99832J62601a72567B40609b33099A07289K08441h3330j16723C36544c19760
$$ 199832 362433 -172567 240609 -233099 107289 315730 -83330 -200053 336544 -319760
11773A60505m6797P5324j1569e0170j07308D62326b43670B45923i4475H7237d33277
$$ 160505 113708 189032 177463 -50170 -157478 462326 -243670 245923 -94475 87237 -433277
11761f0756G8119c3125j48360A13824m1100b35153b7479p3703A28332m5695j372
$$ -60756 78119 -33125 -181485 113824 72724 -235153 -27479 -101182 128332 82637 81265
11750H1265e9412j83017a20931A05663a42456A03842E1864K10271i1086B09919
$$ 81265 -59412 -242429 -120931 105663 -142456 103842 51864 262135 -91086 209919
11739B65673A8821d8409q7604A06569d139j67053B73765g1763J4507i29A29519
$$ 265673 18821 -48409 -136013 106569 -4139 -171192 273765 -71763 -57256 -929 129519
11727a38314m3652b1736A32223D1239N202b34917B38387c4840k94487e6392k74780
$$ -138314 -181966 -21736 132223 41239 46441 -234917 238387 -34840 -329327 -56392 -331172
11716c31172B03436m6044b66844a30611j76096E2059k0640a7411B57368F5056
$$ -331172 203436 157392 -266844 -130611 -306707 52059 31419 -17411 257368 65056
11705a29576O4557C08649N6939b11k96375a42263A53302b21643j8142D8152K41218
$$ -129576 -65019 308649 365588 -211 -296586 -142263 153302 -221643 -239785 48152 289370
11694B89370D3099f0625j29889b3077B20328C1924G616J20029n9357C0571a32707
$$ 289370 43099 -60625 -190514 -23077 220328 31924 7616 127645 68288 30571 -132707
11682b3814A25807e14822C2907A6400a78340L3833A04309g8869B31094h4038K2146
$$ -23814 125807 -514822 32907 16400 -178340 -144507 104309 -78869 231094 -84038 -61892
11671f1892B31557G0089b854A36741K2388a3474A91277J68828H5828g8922F7791
$$ -61892 231557 70089 -2854 136741 159129 -13474 191277 360105 85828 -78922 67791
11659B7179c39420P2373C4636J93959f6828l4527A33921a26114E6969a66727I9894
$$ 27179 -339420 -267047 34636 228595 -66828 -101355 133921 -126114 56969 -166727 99894
11647d1676A42548M9653a91626j32713Q3299g8326k59538r089g7352F1637a37909
$$ -41676 142548 192201 -191626 -324339 -241040 -78326 -337864 -346953 -77352 61637 -137909
11635a18084c9455A43138D6405f8217A30368n1647j9053a23905E278b7815A31985
$$ -118084 -39455 143138 46405 -68217 130368 78721 59668 -123905 5278 -27815 131985
11623a64503B64020O445j09095K2614B9013a85089j78156A15946D3165a571A96284
$$ -164503 264020 270465 161370 183984 29013 -185089 -363245 115946 43165 -1571 196284
11611d6051D6644g743j09548m982c9361j94207R8157J9138C7250K36206b35339
$$ -46051 46644 -7743 -117291 -122273 -39361 -233568 -135411 -116273 37250 273456 -235339
11599a48216N8984I6616B6495J05587Q465D5573b2238l1123D0665a55902K0026
$$ -148216 -89232 96616 26495 132082 140547 45573 -22238 -53361 40665 -155902 -135876
11588a35876H0001B8114O4433b54116a07161j02487A1183L24853J37029k07531
$$ -135876 80001 28114 92547 -254116 -107161 -209648 11183 336036 473065 265534
11578B65534A1346d6372A76316a20631H1473B5398f8103B90712l6278g6526c2186
$$ 265534 11346 -46372 176316 -120631 81473 25398 -68103 290712 254434 -76526 -32186
11566I6734J40187K19121b08355d3918p8215j2228C52022a80824h3750j22242
$$ 96734 236921 456042 -208355 -43918 -122133 -134361 352022 -180824 -83750 -205992
11556b05992e2342N334E8630a01855K9133A53057J09403l6785C5369a43151l2929
$$ -205992 -52342 -47008 58630 -101855 -72722 153057 262460 225675 35369 -143151 -176080
11545a76080H5328J50456r4549n1107L2708a06278H8213k9628e2646k9381B42134
$$ -176080 85328 235784 141235 90128 122836 -106278 88213 58585 -52646 -82027 242134
11533A02987J3679E0384a82000B05488a28896I9033a82871F5029G246Q0406a96489
$$ 102987 116666 50384 -182000 205488 -128896 99033 -182871 65029 7246 87652 -196489
11521C01135b03605A09852a8446l4045A62686h5463A32078A5473L4706b32210
$$ 301135 -203605 109852 -18446 -52491 162686 -85463 132078 15473 50179 -232210
11510C4731a00533A5557e5704A22162n9315J97156a21480A16778a3988C9586J77815
$$ 34731 -100533 15557 -55704 122162 62847 260003 -121480 116778 -13988 39586 217401
11499B17401j4410I2483J70187a63554e4015j54904I1220b08689P6802O0450A9709
$$ 217401 202991 92483 262670 -163554 -54015 -208919 91220 -208689 -131887 -71437 19709
11487E6289J68966a55422A09599c201A56802b0147k7264j4676J4192r7262L3826
$$ 56289 225255 -155422 109599 -3201 156802 -20147 -47411 -62087 -47895 -145157 -111331
11476a11331a6526r3870B26948f2631D02043F579a93410c931p3659o5968A15552
$$ -111331 -16526 -110396 226948 -62631 402043 6579 -193410 -3931 -77590 -143558 115552
11464A34959D8494c67999g0343j85930J07885d5523A98171B7325b11939A06484
$$ 134959 48494 -367999 -70343 -256273 -148388 -45523 198171 27325 -211939 106484
11453B23307F8422m512a52259O1379j54014e1576a2043B30692a12408G2676J05615
$$ 223307 68422 63910 -152259 -90880 -244894 -51576 -12043 230692 -112408 72676 178291
11442A78291h1815C9490K13722G1805a12080B33554b00695J7871D3318K60233
$$ 178291 -81815 39490 253212 71805 -112080 233554 -200695 -182824 43318 303551
11432C03551A02600e5731a1697A59061o4277a13629k02740A72920p7716J61090
$$ 303551 102600 -55731 -11697 159061 94784 -113629 -316369 172920 95204 256294
11422B56294h8628j16166H7340b76212A79904l6054d8067A07118e9638C75174
$$ 256294 -88628 -204794 87340 -276212 179904 143850 -48067 107118 -59638 375174
11411D31594g4213j13307I7711g6826i586o8135k49972d4223a4690m05926A12078
$$ 431594 -74213 -187520 97711 -76826 -9586 -77721 -327693 -44223 -14690 -420616 112078
11399a00258c326F1925J60895q8114F5271b92928B62568A9915K25568j18366A5695
$$ -100258 -3326 61925 222820 134706 65271 -292928 262568 19915 245483 127117 15695
11387e1488B25792q3111i0832B00318G8718J2893j2749A0822J24792N1313c983
$$ -51488 225792 142681 -90832 200318 78718 91611 78862 10822 135614 186927 -3983
11375F5550Q7583h5534I3288D4137b56372A86861d41124a21221A56159e9540D01928
$$ 65550 153133 -85534 93288 44137 -256372 186861 -441124 -121221 156159 -59540 401928
11363I4409d9501k55188P6640F7997k7575e5155A08845d9929a1597k30596B26109
$$ 94409 -49501 -304689 -228049 67997 40422 -55155 108845 -49929 -11597 -242193 226109
11351d6344A33337j7907b90593o3336I3286b55021C4982d649D2153Q1928a0666
$$ -46344 133337 115430 -290593 -353929 93286 -255021 34982 -4649 42153 124081 -10666
11339H1725b5633j99376e3502F2785a79428A938e0616B7814b50137G5638J68777
$$ 81725 -25633 -225009 -53502 62785 -179428 1938 -50616 27814 -250137 75638 244415
11328B44415F857L8168M1972a59847N4767N1394C7089a48370M2669J7758A92541
$$ 244415 6857 45025 86997 -159847 -105080 -53686 37089 -148370 -105701 -87943 192541
11316a41601l2568B78049A13921a3333j15285c8211E1475f6999A24497a57091
$$ -141601 -174169 278049 113921 -13333 -128618 -38211 51475 -66999 124497 -157091
11305A41343l0892b6993B20040A6779a59252C07722b1172r9206L4307p6366G490
$$ 141343 110451 -26993 220040 16779 -159252 307722 -21172 -120378 -86071 -162437 7490
11293B6408F666Q2196a34974C3873a84851A4617P5549a90253A80958a6574j28800
$$ 26408 6666 88862 -134974 33873 -184851 14617 90166 -190253 180958 -16574 -145374
11282a45374r5670D5626b65870J26980A08852c02852B9730i2102a1094q9365K8916
$$ -145374 -241044 45626 -265870 -138890 108852 -302852 29730 -92102 -11094 -100459 -71543
11271g1543H8747a91460O0148a5326r535j94013H9420J45307a66191b3487H6128
$$ -71543 88747 -191460 -131312 -15326 -24861 -218874 89420 234727 -166191 -23487 86128
11259b0315I6457a84960E59674B38725D2255f6344A56346q760b52457j08561J55045
$$ -20315 96457 -184960 559674 238725 42255 -66344 156346 147586 -252457 -361018 -205973
11248b05973b2001k1985A23447g3779B38195A7808K7528M5465b77657B7231a25638
$$ -205973 -22001 -43986 123447 -73779 238195 17808 45336 90801 -277657 27231 -125638
11236b1904o6372j13341A72214n9648N9853D7643L2256A0208f8375o5974B04255
$$ -21904 -88276 -201617 172214 112566 172419 47643 79899 10208 -68375 -134349 204255
11224b04791j04713k194a43700N0798A86582e901l29060C6346d59263d3051I4265
$$ -204791 -309504 -311698 -143700 -92902 186582 -5901 -334961 36346 -459263 -43051 94265
11212B7169c78636A55628a67477q1712k8801M4249L1562f6297A13235d22492a73757
$$ 27169 -378636 155628 -167477 -249189 -277990 -233741 -202179 -66297 113235 -422492 -173757
11200a59124b3619r604j21374j73978J12773o5304A91582k3865b22814P6035k3999
$$ -159124 -23619 -33223 -154597 -328575 -215802 -281106 191582 167717 -222814 -146779 -170778
11189a70778A74069J2664a97727L5090N3215a3114l30996A82767d02048H5921
$$ -170778 174069 186733 -197727 -162637 -109422 -13114 -344110 182767 -402048 85921
11178c92142J35659c8430r1632A0870J82469a43700L422A42119d2079A45601A1118
$$ -392142 -256483 -38430 -130062 10870 193339 -143700 -140278 142119 -42079 145601 11118
11166B86a39143d7724l6685r382C91523a19218e7150j80541C36815a7377j23210
$$ 286 -139143 -47724 -84409 -93791 391523 -119218 -57150 -237691 336815 -17377 -140587
11155a40587P0150n7371n0758B67729b9292p5683j34390B92702a66279N4821J1684
$$ -140587 -70437 -127808 -178566 267729 -29292 -104975 -239365 292702 -166279 -111458 -99774
11144i9774P203k5743K413B72847G8908N1944g9849C08103c29327A60355e3455
$$ -99774 -92571 -118314 -115901 272847 78908 130852 -79849 308103 -329327 160355 -53455
11132a79613A75158a25142J009M7871j88161A3795a37554E6739a87348m5196Q9882
$$ -179613 175158 -125142 -124133 -76262 -264423 13795 -137554 56739 -187348 -232544 -142662
11121a42662j42799D0111J7704g6492A51928M079f4358m8815G8097K57607g0652
$$ -142662 -285461 40111 57815 -76492 151928 156007 -64358 -113173 78097 335704 -70652
11109A92713a52350l9345g2398A4843a37251A71124C6558e4441q1489d0637B11105
$$ 192713 -152350 -191695 -72398 14843 -137251 171124 36558 -54441 -135930 -40637 211105
11097C15805A28064a08992C2157m344J11972O1859G4657G638K89165J94958i3243
$$ 315805 128064 -108992 32157 27813 139785 201644 74657 7638 296803 491761 -93243
11085A14043b83948A25119a03063A99093J13462A45780J80766I2148D3166Q6389
$$ 114043 -283948 125119 -103063 199093 312555 145780 326546 92148 43166 129555
11075A29555a06562A49568K6451E0687N35766B43930J0758j16649J448D7665K35775
$$ 129555 -106562 149568 176019 50687 586453 243930 254688 138039 139487 47665 283440
11064B83440L987F9571k9580K21438j28173n8916K84287G2765J69464M4153L8404
$$ 283440 287427 69571 39991 261429 133256 74340 358627 72765 242229 286382 324786
11053C24786R5245Q4604B19407K8386K82009j76624H9318L66312N570K7737B43798
$$ 324786 420031 504635 219407 247793 529802 353178 89318 455630 461200 488937 243798
11041C14834K00767K50904C05296M49109H6997L39256J76408B38445N9459J2874
$$ 314834 515601 766505 305296 754405 86997 426253 602661 238445 297904 310778
11031C10778L21534k27419J49380B69019j20197L15706B15812M37826B81326Q6668
$$ 310778 632312 404893 554273 269019 148822 464528 215812 653638 281326 367994
11021C67994l9838j56149b2075C62581k7941E7757P15393C78260J21300c2983
$$ 367994 328156 172007 -22075 362581 334640 57757 773150 378260 499560 -32983
11010C07966J10851P0763A91967J78301G1129L30378j21667A34111J71283K37356
$$ 307966 418817 489580 191967 370268 71129 401507 279840 134111 305394 542750
11000E42750H8707M2577M7817K73932r054j01503J51073k32963K77611A19064
$$ 542750 88707 131284 179101 453033 443979 342476 493549 260586 538197 119064
10989B55897E3595J74440K06640j8274J18331J60972k58274o5627q7115K38013
$$ 255897 53595 228035 434675 416401 534732 695704 437430 371803 284688 522701
10979E22701j7174j05853L09615l28545J23172K34122J55830n6884N3830j0045
$$ 522701 505527 399674 709289 380744 503916 738038 893868 836984 890814 880769
10969H80769M01161J52230R9890r4092j36430K60566m08129M5621K35332m39126
$$ 880769 1281930 1434160 1534050 1439958 1303528 1564094 1155965 1201586 1436918 997792
10959I97792R5619k57922J25680j57406K16010J59439j58259K7380q9733K01507
$$ 997792 1093411 835489 961169 803763 1019773 1179212 1020953 1048333 958600 1160107
10949A160107j99616k91038K9020B07620P19968B51316J11657r785p6001M694
$$ 1160107 960491 669453 698473 207620 927588 251316 362973 353188 277187 281881
10939B81881O3283N8215A67532k0993O6181I6809L8700f2459B6433a19248A99959
$$ 281881 345164 403379 167532 146539 212720 96809 135509 -62459 26433 -119248 199959
10927d6256J0768A94034K6979C24b70955M6699D34563A41617b24761C47904g1974
$$ -46256 -35488 194034 221013 324 -270955 -224256 434563 141617 -224761 347904 -71974
10915b41036B665c2220j77641B48186e2907m8155L4901j44502D7885e5461M962
$$ -241036 2665 -32220 -209861 248186 -52907 -101062 -66161 -210663 47885 -55461 -50499
10904e0499B03248B3769b30389B05428F2055f7959j89277B17078a40718N8157
$$ -50499 203248 23769 -230389 205428 62055 -67959 -257236 217078 -140718 -82561
10894h2561k32890A73784K32915C5547g5200R03k45295C8207a81607j53432d1452
$$ -82561 -315451 173784 406699 35547 -75200 -74297 -319592 38207 -181607 -335039 -41452
10882A7971J18498N0746M3073b53544F399i8305j29675A27099b4209q9546B03912
$$ 17971 136469 187215 230288 -253544 6399 -98305 -227980 127099 -24209 -113755 203912
10870A82585o6230a05844c5130B919K10968p2284a32906c1384p5508h076o0582
$$ 182585 116355 -105844 -35130 2919 213887 141603 -132906 -31384 -106892 -8076 -68658
10859f8658B2441J03389d21995a26251B45819A21486n1942J99284J61283a93340
$$ -68658 22441 125830 -421995 -126251 245819 121486 69544 268828 430111 -193340
10848F103J09568b9930j29003D9624b158j58877A50126b61210a20004j59945L5671
$$ 6103 115671 -29930 -158933 49624 -2158 -161035 150126 -261210 -120004 -279949 -244278
10837b44278N9195Q6924j17951m3260A4680J3018J58522B4020c73042h8921A41479
$$ -244278 -185083 -98159 -216110 -259370 14680 27698 186220 24020 -373042 -88921 141479
10825I2172b5547B71515d82100b33659C6091c36822M582J29307a9006E4732K5966
$$ 92172 -25547 271515 -482100 -233659 36091 -336822 -332240 -202933 -19006 54732 80698
10814H0698a79655A08276h0945k65978d3924B02043r6439a25238c2208j42267
$$ 80698 -179655 108276 -80945 -346923 -43924 202043 105604 -125238 -32208 -174475
10804a74475j8099H779J85351h3669k39339A66860C7125a56772A44378b2560l4787
$$ -174475 -192574 8779 194130 -83669 -323008 166860 37125 -156772 144378 -22560 -57347
10793e7347j20822c6307A74670a9568a59A09844J10757a73914J0761E1959Q6288
$$ -57347 -178169 -36307 174670 -19568 -159 109844 220601 -173914 -163153 51959 138247
10782A38247n0951b06086B04520D491a93722i4210j8397j08052R3721l8589A65921
$$ 138247 87296 -206086 204520 4491 -193722 -94210 -112607 -220659 -126938 -165527 165921
10770b60864a3868B1577J33002J30634g69093a49807L0379B67619H8903M4578
$$ -260864 -13868 21577 154579 285213 -769093 -149807 -119428 267619 88903 133481
10760A33481i9064d2083H2186a3946j12985N7506G9718i5209A64366a44989B8128
$$ 133481 -99064 -42083 82186 -13946 -126931 -69425 79718 -95209 164366 -144989 28128
10748b13269g0983B89859A39548d2788A30487b14009d6361m2177n2238j0943B6485
$$ -213269 -70983 289859 139548 -42788 130487 -214009 -46361 -88538 -140776 -151719 26485
10736a34605B35734Q2795a978I3199O176c41250g2318J9935a6820l64171F4548
$$ -134605 235734 318529 -1978 93199 99375 -341250 -72318 -52383 -16820 -380991 64548
10724c9830A32022b31487f5967k8283A34209g198j75904O6967L4996A65174e0713
$$ -39830 132022 -231487 -65967 -94250 134209 -7198 -183102 -116135 -81139 165174 -50713
10712b61754A36284Q3384f3400D845a77713A4188e8217j70640A09986d39995L3678
$$ -261754 136284 219668 -63400 4845 -177713 14188 -58217 -228857 109986 -439995 -406317
10701d06317J84715p5442B2521a31996k40833a15423k06192a56412I8962b53252
$$ -406317 -221602 -297044 22521 -131996 -372829 -115423 -321615 -156412 98962 -253252
10690b9058C83129A4531g9449k72374B00907b77448Q9224l449B24116H8037e4611
$$ -29058 383129 14531 -79449 -351823 200907 -277448 -188224 -191673 224116 88037 -54611
10678c98568d012I1662J14903a28639d5288j23571C38973c9610j69645c2741k07827
$$ -398568 -4012 91662 206565 -128639 -45288 -168859 338973 -39610 -209255 -32741 -240568
10667b40568L4425q3948j08438b2547q5052D73883B6300b4934k20787f1634k9960
$$ -240568 -206143 -290091 -398529 -22547 -107599 473883 26300 -24934 -245721 -61634 -91594
10656i1594B1162a77008A07685b82214P0526A87852a85259B06142a99343I7026
$$ -91594 21162 -177008 107685 -282214 -211688 187852 -185259 206142 -199343 97026
10645H2954J01157b24926R6343Q411b6317k55115A77311a36662N7403l47532D6306
$$ 82954 184111 -224926 -128583 -120172 -26317 -281432 177311 -136662 -79259 -426791 46306
10633a21988j84588a02403b7265k7521k1402G6878J14646G900Q3365J40272C2258
$$ -121988 -306576 -102403 -27265 -54786 -76188 76878 191524 7900 91265 231537 32258
10621g2021j0728I6425d7109C3292a92553h1611r9731K6516D2943a91494g5561
$$ -72021 -82749 96425 -47109 33292 -192553 -81611 -181342 -154826 42943 -191494 -75561
10609B04383C9648P4773P669k9065a93447j60230a43701E7606J79434n208A7972
$$ 204383 39648 114421 122090 93025 -193447 -353677 -143701 57606 237040 231832 17972
10597a04144d8285F4093b55801A39468m6402a77471r5463Q6466A4855P1666h0183
$$ -104144 -48285 64093 -255801 139468 93066 -177471 -272934 -186468 14855 86521 -80183
10585a01388B08388I9312k5391a44575j60989J14792p3610f1394H361a43975l1245
$$ -101388 208388 99312 73921 -144575 -305564 -190772 -264382 -61394 8361 -143975 -175220
10574a75220j06180i2100J9840C07544A30926B3569g0087J5533r7673K4642b3508
$$ -175220 -281400 -92100 -72260 307544 130926 23569 -70087 -54554 -152227 -127585 -23508
10562G4582K19074b6078E9392K2419c1672n5757k34297J02757A25747m3842k7345
$$ 74582 293656 -26078 59392 81811 -31672 -87429 -321726 -218969 125747 81905 54560
10551E4560J43199a77129h8556A04865g3136J8449j86170H7330A5590g0510A45460
$$ 54560 197759 -177129 -88556 104865 -73136 -54687 -240857 87330 15590 -70510 145460
10539E0375a25653E4951d6990o9645a6056r436A40956D6764J16364C9113Q6089
$$ 50375 -125653 54951 -46990 -116635 -16056 -25492 140956 46764 163128 39113 125202
10528A25202D1491K25442n9490k1140f0135J6646l4973n1286E4695N6173C0341
$$ 125202 41491 266933 207443 186303 -60135 -43489 -78462 -129748 54695 110868 30341
10516I4013a18944a9107B33718a4037A6900a08200j41071j05483C6838K34547
$$ 94013 -118944 -19107 233718 -14037 16900 -108200 -249271 -354754 36838 271385
10506B71385B7310O2042K26395c63819a00999j21067A3250R1168c40609r7728
$$ 271385 27310 89352 315747 -363819 -100999 -222066 13250 104418 -340609 -438337
10496d38337A54313l6534h8492k07011D9488a88815A5391a73517j27417f8487
$$ -438337 154313 117779 -88492 -295503 49488 -188815 15391 -173517 -300934 -68487
10485a78877A3375c7647A25963E3408K3010c96495I0085J04642a65981B26403
$$ -178877 13375 -37647 125963 53408 76418 -396495 90085 194727 -165981 226403
10474a19537C4346M26421D1775b2035B50414P2618a45320C157L47366k2753F6577
$$ -119537 34346 460767 41775 -22035 250414 323032 -145320 3157 350523 327770 66577
10462B56175a60125j44097i0808l7910k68478A32328d1466k15426m7602a1274
$$ 256175 -160125 -304222 -90808 -128718 -397196 132328 -41466 -256892 -304494 -11274
10451A50267K04384C5373A0646M36288a28105D0694Q9191q881f3101B23056a17231
$$ 150267 354651 35373 10646 446934 -128105 40694 129885 121004 -63101 223056 -117231
10439D0574f7034j24640d4951A35408a24340j86187g7954G0759b40266i7676C6613
$$ 40574 -67034 -191674 -44951 135408 -124340 -310527 -77954 70759 -240266 -97676 36613
10427a28861l1917a3139j69691a4081j29219l9631D4069J63960f2326k17j95147
$$ -128861 -160778 -13139 -182830 -14081 -143300 -182931 44069 208029 -62326 -62543 -257690
10416b57690m1599i4383o3710L5502o1645A02623N0702n781e0413D8864b9557
$$ -257690 -299289 -94383 -158093 -122591 -184236 102623 153325 147544 -50413 48864 -29557
10404E1179h8573A52255D1825o331B657a63318A6091f0661A19608O3358j393B1018
$$ 51179 -88573 152255 41825 35494 2657 -163318 16091 -60661 119608 182966 181573 21018
10391A05192a51239J6502e6750B3051Q2182L5015b26989L3995H091L2377E143
$$ 105192 -151239 -134737 -56750 23051 105233 140248 -226989 -192994 8091 40468 5143
10379f6049b8876j12304l345B36670J6100l9061A06838j8987C1977a52136k04745
$$ -66049 -28876 -141180 -144525 236670 252770 213709 106838 87851 31977 -152136 -356881
10368c56881b2312l5595A16334k2475J30970P7948A33514a03546C48303A53849
$$ -356881 -22312 -57907 116334 93859 224829 302777 133514 -103546 348303 153849
10357A00014J96362a24089d4142l722H3680J69939p2549b05094D95492B21301
$$ 100014 296376 -124089 -44142 -47864 83680 253619 181070 -205094 495492 221301
10346e6444A18917M13608A66772g6160A44141K1622K08476n6953j40866L75701
$$ -56444 118917 532525 166772 -76160 144141 165763 374239 317286 176420 552121
10336E52121F0954B1421J85477e584A05888b09420A40068a62232C88554A41124
$$ 552121 60954 21421 206898 -5584 105888 -209420 140068 -162232 388554 141124
10325c72240P389d5032A28231h8493M2560I9428J17462k4528o5370b22387H7398
$$ -372240 -364851 -45032 128231 -88493 -45933 99428 216890 192362 126992 -222387 87398
10313e3790E3382d506j2054C53223j03247a34428J7880A1211b1501D356i4756
$$ -53790 53382 -4506 -16560 353223 249976 -134428 -116548 11211 -21501 4356 -94756
10301c26525I4457e3627B57616a89956A19095B4547a5161C53361e2881B03304
$$ -326525 94457 -53627 257616 -189956 119095 24547 -15161 353361 -52881 203304
10290b58351A41621Q8527D1556f9343F283J74019b23314h6143K5210D0197J65464
$$ -258351 141621 230148 41556 -69343 6283 180302 -223314 -86143 -60933 40197 205661
10279B05661f9544k07930O7479A08437p259j9687d41186d793j50117l09436A16576
$$ 205661 -69544 -277474 -209995 108437 101178 81491 -441186 -4793 -154910 -464346 116576
10267H1471e6872D5491a62098E3248J28529a41393B7621n898a62193l24717b8923
$$ 81471 -56872 45491 -162098 53248 181777 -141393 27621 21723 -162193 -486910 -28923
10255a55637E6160J72914A04849K7623a71608A28503a2694j28818D9989b1438
$$ -155637 56160 229074 104849 132472 -171608 128503 -12694 -141512 49989 -21438
10244B71965E121a64938A29281m1350h5790J6932A04804d2753G0436J3280a53985
$$ 271965 5121 -164938 129281 87931 -85790 -68858 104804 -42753 70436 83716 -153985
10232A1011Q6561K4965b09202j15864a24355M2322A54459o9410c60185d1781n74098
$$ 11011 97572 122537 -209202 -325066 -124355 -82033 154459 85049 -360185 -41781 -615879
10221f15879A06136b43333a18981I0096a61705d843C5275a20676A10637l3814
$$ -615879 106136 -243333 -118981 90096 -161705 -4843 35275 -120676 110637 76823
10211G6823J96476a80894A31936n2922A6703J55201e5063j9449j68770J07634
$$ 76823 273299 -180894 131936 79014 16703 171904 -55063 -74512 -243282 -135648
10201a35648D978a82379C4147b59768g8529B000a13875M7804C13203j32777H6935
$$ -135648 4978 -182379 34147 -259768 -78529 2000 -113875 -66071 313203 180426 86935
10189A37724I752a29766d3633j83504A18438b6108j24496g1478i692j87540g687
$$ 137724 9752 -129766 -43633 -227137 118438 -26108 -150604 -71478 -9692 -197232 -7687
10177f4787B12272a64663O4563C2696a75589l3478R9277p1315D198a62200d452
$$ -64787 212272 -164663 -100100 32696 -175589 -209067 -109790 -181105 4198 -162200 -4452
10165c42149a06861K7505J7294j1814A14648D9109a60817b3652A89277H7654b41222
$$ -342149 -106861 -79356 -62062 -73876 114648 49109 -160817 -23652 189277 87654 -241222
10153c4144A24312h9178L5417B4210a32886j83519e8696A783P9233A690i3392
$$ -34144 124312 -89178 -53761 24210 -132886 -316405 -58696 1783 81016 1690 -93392
10141c91382A38284e460k38882a13366E1113b36871B6268o12f5003k1831H6312
$$ -391382 138284 -5460 -244342 -113366 51113 -236871 26268 25656 -65003 -86834 86312
10129i2344l7386B09421b27945h8283H8719a1311k10562h7153l25255b8457l0589
$$ -92344 -129730 209421 -227945 -88283 88719 -11311 -221873 -87153 -412408 -28457 -59046
10118e9046j68697R7813A94442d91440A2000a86203A13342A2099a67277Q0769
$$ -59046 -227743 -129930 194442 -491440 12000 -186203 113342 12099 -167277 -86508
10108h6508B35653j01530a33515l1929J6921K1711d348J58j1317k56624Q0204
$$ -86508 235653 134123 -133515 -165444 -148523 -126812 -4348 -4190 -15507 -272131 -191927
10097a91927c2529o6650J0252H4760Q1531o6821c16664a36129j0442k28293B12075
$$ -191927 -32529 -99179 -88927 84760 166291 99470 -316664 -136129 -146571 -374864 212075
10085E9191a3472A85050b13510I0583a48314j37723h9480D865L4425a26656j74246
$$ 59191 -13472 185050 -213510 90583 -148314 -286037 -89480 4865 39290 -126656 -300902
10074c00902a21115C6913J91891a7249k03722l0924a13057K0425k815l13478a02313
$$ -300902 -121115 36913 228804 -17249 -220971 -251895 -113057 -92632 -95447 -408925 -102313
10062D6010b2924A61018j2884a7006E2812d1704j16865R513q0382A31552a18058
$$ 46010 -22924 161018 148134 -17006 52812 -41704 -158569 -149056 -229438 131552 -118058
10050C1892a30719Q43k6452F5039d11289D1630b54683B95150h1928n9577D0141
$$ 31892 -130719 -129876 -156328 65039 -411289 41630 -254683 295150 -81928 -141505 40141
10038f1126k76931f7394K587A25091b94480J35289J6568c4672j94453h5943a9975
$$ -61126 -338057 -67394 -64807 125091 -294480 -159191 -142623 -34672 -229125 -85943 -19975
10026F0977b29050B25034j686I8174f8495B9608a06346B15986c08555Q3791c5118
$$ 60977 -229050 225034 223348 98174 -68495 29608 -106346 215986 -308555 -224764 -35118
10014A59674C4604Q0607d74755a9012o5628k05198a42784K2115E7161i3054m008
$$ 159674 34604 115211 -474755 -19012 -84640 -289838 -142784 -120669 57161 -93054 -97062
10003i7062l47259A58861a26920o4471j22998n0861A00773i0722k7023m36644
$$ -97062 -444321 158861 -126920 -191391 -314389 -365250 100773 -90722 -117745 -554389
9993e54389B66090b40927Q7573m1899P1066b8532m236H2140K40529F2214b12343
$$ -554389 266090 -240927 -153354 -195253 -124187 -28532 -32768 82140 322669 62214 -212343
9981b64080A34247c92146B32934c94518A11050b20958K7055B23513b4643k36391
$$ -264080 134247 -392146 232934 -394518 111050 -220958 -193903 223513 -24643 -261034
9971b61034O2206k5817g4841B44466a4896E2031a26002i223j38345A61828k335
$$ -261034 -198828 -224645 -74841 244466 -14896 52031 -126002 -9223 -147568 161828 159493
9960A59493a59673d7460A01460B7568L155a71557L1341E9397K5400C8715J9687
$$ 159493 -159673 -47460 101460 27568 30723 -171557 -140216 59397 84797 38715 58402
9949E8402a19010j68898f7022B22959b49688J0955A33618K44104j71642F2683
$$ 58402 -119010 -287908 -67022 222959 -249688 -238733 133618 377722 206080 62683
9938I9799b094o1956A13129i6208J4299B44599d8090j14455e2393k2748j52343
$$ 99799 -2094 -64050 113129 -96208 -81909 244599 -48090 -162545 -52393 -75141 -227484
9927b27484E484L52089f0652j85885R5496k1230M8330F7466i3760l29898J64789
$$ -227484 5484 357573 -60652 -246537 -151041 -172271 -123941 67466 -93760 -423658 -258869
9916b58869A41282n942a79647j4125b8560A68907c48741J40038G749J07042c69304
$$ -258869 141282 135340 -179647 -193772 -28560 168907 -348741 -208703 7749 114791 -369304
9904a32153A77991c32602o76c2710B74322e2678K2887p8463r945j95865e9107
$$ -132153 177991 -332602 -333278 -32710 274322 -52678 -29791 -108254 -118199 -314064 -59107
9892b13106o9759J39635k60819A0910J52531a12023B9200J8649M4379J80055b64349
$$ -213106 -282865 -143230 -404049 10910 163441 -112023 29200 47849 92228 272283 -264349
9880a95936d8024l78613A80125A7653J31224i1777D21094a95920A16555e6605
$$ -195936 -48024 -426637 180125 17653 148877 -91777 421094 -195920 116555 -56605
9869b38740j72999a35209c9936A13627e7515o7690p2151A63050O2974n5237a0871
$$ -238740 -411739 -135209 -39936 113627 -57515 -125205 -197356 163050 226024 170787 -10871
9857i6091o4802a734j63556K9205I4238a89146B58381a49520o9148A62107g115
$$ -96091 -160893 -1734 -165290 -136085 94238 -189146 258381 -149520 -218668 162107 -7115
9845H2585d11327D9557f4762A58036b10573A05426K9874c2866B13900a38387A37897
$$ 82585 -411327 49557 -64762 158036 -210573 105426 135300 -32866 213900 -138387 137897
9833A19760b70757G2172g106r1320a2723j38068J7727b1642B1511i5900j18772
$$ 119760 -270757 72172 -7106 -98426 -12723 -150791 -133064 -21642 21511 -95900 -214672
9822b14672A34350g3319F3807b73944H1767P8519c1771l96110h6921d318n6391
$$ -214672 134350 -73319 63807 -273944 81767 160286 -31771 -427881 -86921 -4318 -60709
9811f0709C31354i4525F2258a8019j56105P280C3249d549I7460r709N6181m6885
$$ -60709 331354 -94525 62258 -18019 -174124 -166844 33249 -4549 97460 87751 143932 97047
9799I7047h7856F7849h4585P769I8487d60878a92895C22524F1363b51677K5200
$$ 97047 -87856 67849 -84585 -76816 98487 -460878 -192895 322524 61363 -251677 -226477
9788b26477C4126R76a57203P4301P843l9072Q421j48024i3320j0792b6718p4130
$$ -226477 34126 35102 -157203 -82902 -75059 -114131 -105710 -253734 -93320 -104112 -26718 -100848
9776a00848A2955J24596a12784G1793a40238A63383K3370a28211k23128J08134
$$ -100848 12955 137551 -112784 71793 -140238 163383 186753 -128211 -351339 -243205
9766b43205k1893e3876k03936d6924k01553R3760A36157d41059D6137L84048h3026
$$ -243205 -265098 -53876 -257812 -46924 -248477 -154717 136157 -441059 46137 430185 -83026
9754a10592l4659Q825k30304B77b38156A58844A2792O7615a48734P2064D8354
$$ -110592 -145251 -136426 -366730 277 -238156 158844 12792 80407 -148734 -76670 48354
9742A84799b69351A76043B069i4673A3293a27839o891A64260b6175k71465A93737
$$ 184799 -269351 176043 2069 -94673 13293 -127839 -134730 164260 -26175 -297640 193737
9730f354l59507B32193d2583A54903B1959K02056d9517j40611Q2474a1257A04799
$$ -6354 -365861 232193 -42583 154903 21959 224015 -49517 -190128 -107654 -11257 104799
9718B3826g5013j33582d2803A26871f2956A10632P6852e0417j28307A79857K42427
$$ 23826 -75013 -208595 -42803 126871 -62956 110632 187484 -50417 -178724 179857 422284
9707D22284b1403J0578B94792H7905D789c4467I7520d2253k7356k96054A6996
$$ 422284 -21403 -10825 294792 87905 4789 -34467 97520 -42253 -69609 -365663 16996
9695a56352b3001A8276c68947C98698c69858A00955J15850f8567B80429A21768
$$ -156352 -23001 18276 -368947 398698 -369858 100955 216805 -68567 280429 121768
9684c01220c9591j01278O9689p9991f1155F3458L2783a89471Q2847n777l8249
$$ -301220 -39591 -140869 -71180 -151171 -61155 63458 96241 -189471 -106624 -112401 -150650
9673a50650k56319f7810p9507O0786o6224N8261A2971P5520P1876a0697B52884
$$ -150650 -406969 -67810 -147317 -86531 -152755 -94494 12971 88491 160367 -10697 252884
9661B52507b23164e0467K3978k20931A90710b74863g1642a8610p3613j91565f3146
$$ 252507 -223164 -50467 -26489 -247420 190710 -274863 -71642 -18610 -92223 -283788 -63146
9649b11933B1655d04449J11669L8253c6404m9090A20570A5345i231A45208b24452
$$ -211933 21655 -404449 -292780 -254527 -36404 -85494 120570 15345 -9231 145208 -224452
9637a05132k15605A2857a30598A43143c3208A35360P7373c30249M7676a2247j3188
$$ -105132 -320737 12857 -130598 143143 -33208 135360 212733 -330249 -282573 -12247 -25435
9626b5435j7923j17789e4714p4685k55794k08423d9008J9107A67034K5042d7137
$$ -25435 -43358 -161147 -54714 -129399 -385193 -593616 -49008 -29901 167034 192076 -47137
9614C01556I1897D1645g8389E6319g6415F4331R5820a1998D967a20679b9804K461
$$ 301556 91897 41645 -78389 56319 -76415 64331 160151 -11998 4967 -120679 -29804 -27343
9602b7343k5427H2135f9463J0342m9841A79579E1871a47961j1209B12353r1276
$$ -27343 -52770 82135 -69463 -59121 -108962 179579 51871 -147961 -159170 212353 121077
9591A21077b11348f8282H0642i8607j46735j87530A51822b62369p1979J37304
$$ 121077 -211348 -68282 80642 -98607 -245342 -432872 151822 -262369 -334348 -197044
9581a97044B5592G325h8262J0414m3064A29302a46724C9734c35363A7536a87664
$$ -197044 25592 7325 -88262 -77848 -120912 129302 -146724 39734 -335363 17536 -187664
9569b58850A28568l8187b2493A59547p1967a48095A03749R789L5791a58595A87450
$$ -258850 128568 90381 -22493 159547 87580 -148095 103749 113538 149329 -158595 187450
9557D5369P8089J12680g0437M682l73716a67585b9768j30327a9638r067C2578
$$ 45369 123458 236138 -70437 -65755 -439471 -167585 -29768 -160095 -19638 -28705 32578
9545a31425O836j69514C39346c4427o785A5203J32808M05848a74283p008F5788
$$ -131425 -124589 -294103 339346 -34427 -41212 15203 148011 553859 -174283 -181291 65788
9533b45184F5205L4459K8497a345E0362H256h0316k18444A20113a09450j94063
$$ -245184 65205 99664 128161 -1345 50362 8256 -80316 -298760 120113 -109450 -303513
9522c03513R2269f4849r648q1068d8443G3713K7993C3585b45516g2303p3855k16847
$$ -303513 -211244 -64849 -74497 -155565 -48443 73713 101706 33585 -245516 -72303 -146158 -363005
9510c63005c6771j24749e8751A9218J60386N5136b18468d5657j46726j2227E2977
$$ -363005 -36771 -161520 -58751 19218 179604 234740 -218468 -45657 -192383 -204610 52977
9498b56966C1173c60710J78391A31895L4415A0295a01617B5902b43572a14879
$$ -256966 31173 -360710 -182319 131895 166310 10295 -101617 25902 -243572 -114879
9487A02596K3342b95200K8840I3074e119l46756K2915J14843l4689d6554A16180
$$ 102596 125938 -295200 -266360 93074 -5119 -351875 -328960 -214117 -248806 -46554 116180
9475d3036a7630j71347o4248c5530D2136b8938P87l95929B05934a52795j00515
$$ -43036 -17630 -188977 -253225 -35530 42136 -28938 -28151 -424080 205934 -152795 -253310
9464b53310H0135a787H6985l3167a10788A7018J48182E7775b46220A61009F8904
$$ -253310 80135 -1787 86985 53818 -110788 17018 165200 57775 -246220 161009 68904
9452i3215b2556B19680a15419m25001K11709e221m8340I8484a07433j67370l0189
$$ -93215 -22556 219680 -115419 -540420 -328711 -5221 -53561 98484 -107433 -274803 -304992
9441c04992g5900F408a67161F4683c03337g3242H5343a26505e5874o018o5577
$$ -304992 -75900 6408 -167161 64683 -303337 -73242 85343 -126505 -55874 -61892 -127469
9430a27469A07759b7222G6186a29966B52820a45902A74341a1824j40299A38152
$$ -127469 107759 -27222 76186 -129966 252820 -145902 174341 -11824 -152123 138152
9419a45059A52661k9133k5177c01190p1760A42649B5501O7753c28420J07808A32811
$$ -145059 152661 123528 98351 -301190 -372950 142649 25501 93254 -328420 -220612 132811
9407A46726E7826Q4857b139C57606a61426k04194N9455M2260A26957g1631D0851
$$ 146726 57826 142683 -2139 357606 -161426 -365620 -306165 -263905 126957 -71631 40851
9395B09141a9201B1402b47427A0747J26123a10693b2601A01477a63973M6610N7873
$$ 209141 -19201 21402 -247427 10747 136870 -110693 -22601 101477 -163973 -117363 -59490
9384e9490a2023r8645j14490i9001j12278j21663a02856C2805b9379E242K18038
$$ -59490 -12023 -110668 -225158 -99001 -211279 -332942 -102856 32805 -29379 5242 223280
9373B23280c28579A7382a33689L4127E5981i3695j69501j8337a9679A84674c3643
$$ 223280 -328579 17382 -133689 -99562 55981 -93695 -263196 -281533 -19679 184674 -33643
9361b07741a02113j71599l8715q1508a09798C1630i7816D33986A13434a24192
$$ -207741 -102113 -273712 -312427 -393935 -109798 31630 -97816 433986 113434 -124192
9350G0721b24019M7347k1495K8535L7855B56925A9848Q778J23143a74778O7101
$$ 70721 -224019 -176672 -198167 -169632 -131777 256925 19848 28626 151769 -174778 -107677
9339a07677O641m7905L6437I9251K14613B0909c74619a35951A94630c6211B12763
$$ -107677 -101036 -148941 -112504 99251 313864 20909 -374619 -135951 194630 -36211 212763
9327A27774l8514a36345A38866a92669O6088c7365j65066A58126b42441g7162
$$ 127774 89260 -136345 138866 -192669 -126581 -37365 -202431 158126 -242441 -77162
9316G2031d46A49290C4071i9918A31229b07411k12149a99743b6065A01702a12284
$$ 72031 -446 149290 34071 -99918 131229 -207411 -419560 -199743 -26065 101702 -112284
9304b39582A10506e7970l8231I5210h055j39884A02865j2814B0891a34038G4758
$$ -239582 110506 -57970 -96201 95210 -8055 -147939 102865 90051 20891 -134038 74758
9292a1814A56971e2033J8822k4853j223j91477l6999d7079j27115I9237b13298
$$ -11814 156971 -52033 -33211 -58064 -59287 -250764 -287763 -47079 -174194 99237 -213298
9280a46229F6207O028c7760A35757B2771h3948J9694m73580a92607j58724a1578
$$ -146229 66207 72235 -37760 135757 22771 -83948 -64254 -537834 -192607 -351331 -11578
9268g2264k6071j73254A29996c3936j26847M1439j4660j3923A20275d8884i874
$$ -72264 -98335 -271589 129996 -33936 -160783 -119344 -134004 -147927 120275 -48884 -9874
9256e6265k67264C303d9188C0311c2869A77479a97454C7473a89132f5067k27114
$$ -56265 -323529 3303 -49188 30311 -32869 177479 -197454 37473 -189132 -65067 -292181
9245b92181h404E9514a65000I8610b05106c0960I3028c1187A78316J5094r2363
$$ -292181 -8404 59514 -165000 98610 -205106 -30960 93028 -31187 178316 193410 101047
9234A01047j1453j1298b56469a03699n4241N6331L4991A00079a62957c0361j5094
$$ 101047 89594 78296 -256469 -103699 -157940 -101609 -66618 100079 -162957 -30361 -45455
9223d5455J8099C6112J30630a08504k02230A2908b10980C00214c84839a80245
$$ -45455 -27356 36112 166742 -108504 -310734 12908 -210980 300214 -384839 -180245
9212a55464H2926C2137m098a43871A43595a3083k45725F8161r835L10458j64682
$$ -155464 82926 32137 28039 -143871 143595 -13083 -258808 68161 58326 368784 204102
9201B04102c72746O2494K3618A79716e0904o624K5047o563N043j7372J0959j67781
$$ 204102 -372746 -310252 -286634 179716 -50904 -57528 -32481 -39044 -34001 -51373 -40414 -208195
9189b08195A68715D116b66083J02080l2217Q7602j35115L6034d0772A02022Q7239
$$ -208195 168715 4116 -266083 -164003 -196220 -108618 -243733 -207699 -40772 102022 189261
9178A89261j591a79530N0236E1319g0124k6629b6225A7209a50433C4439c5359
$$ 189261 187670 -179530 -129294 51319 -70124 -96753 -26225 17209 -150433 34439 -35359
9166a05746k65031Q8386E9309K48359c77071B38814B6956a8993j20270B1155f3415
$$ -105746 -370777 -282391 59309 307668 -377071 238814 26956 -18993 -139263 21155 -63415
9154a1683o9543B87845h6985l7810j83889h0992G3820b5334L937o8901A98254
$$ -11683 -81226 287845 -86985 -124795 -308684 -80992 73820 -25334 -21397 -90298 198254
9142B5690a33685A41924R4456H56d6516k15310A29384C9324P7123r396J22189
$$ 25690 -133685 141924 236380 856 -46516 -261826 129384 39324 116447 107051 229240
9131B29240b5326k64870A00712d0717H4388i4322q9135B90511a99583A10703m0742
$$ 229240 -25326 -290196 100712 -40717 84388 -94322 -183457 290511 -199583 110703 69961
9120F9961d1823a6624B68489c5265A74460e11004A10895O6355e5372k42857k6175
$$ 69961 -41823 -16624 268489 -35265 174460 -511004 110895 177250 -55372 -298229 -324404
9109c24404A2771i2297D1710g4369D6024b22981n4799b8603j18306H2285b37965
$$ -324404 12771 -92297 41710 -74369 46024 -222981 -277780 -28603 -146909 82285 -237965
9097h6905j9287L3628A41718h3149A45890c73313a80665A21034a02138A8540i7096
$$ -86905 -106192 -72564 141718 -83149 145890 -373313 -180665 121034 -102138 18540 -97096
9085b79543O3618B68955A5808J3098e303l29366g6282j69603d6323n4328L0672
$$ -279543 -215925 268955 15808 28906 -5303 -334669 -76282 -245885 -46323 -100651 -69979
9074f9979m52291A05416J5186m2464a22470j2832A9334h3309p6075j39258J36997
$$ -69979 -522270 105416 120602 78138 -122470 -135302 19334 -83309 -159384 -298642 -161645
9063a61645f5812A81485a56726c9421r4853j70529e8756p4161n6994k7909e5992
$$ -161645 -65812 181485 -156726 -39421 -134274 -304803 -58756 -132917 -189911 -217820 -55992
9051C8739P6923Q2725I680L07341H4876d22923F5618R5360c34179n4630a64539
$$ 38739 115662 198387 9680 317021 84876 -422923 65618 160978 -334179 -388809 -164539
9039B1063f7162k62991a18517j5707M8780H680Q2287d1219F1229a08156m6077
$$ 21063 -67162 -330153 -118517 -134224 -85444 8680 90967 -41219 61229 -108156 -154233
9028a54233P3086H7126J3350a14557A02147j8245h7388g840A66023a80712j82313
$$ -154233 -81147 87126 100476 -114557 102147 83902 -87388 -7840 166023 -180712 -363025
9017c63025b6285j22119j2513c0733A37908e4596E1771b73744P7662p2725F2405
$$ -363025 -26285 -148404 -160917 -30733 137908 -54596 51771 -273744 -196082 -268807 62405
9005a23074A76559C5696b6609c081j12338l33571F8869Q6189b19618A56316D1582
$$ -123074 176559 35696 -26609 -3081 -115419 -448990 68869 155058 -219618 156316 41582
8993d13452f617B10225c1668j90713B6257b00066H2895J07788H6463a76539O4048
$$ -413452 -6617 210225 -31668 -222381 26257 -200066 82895 190683 86463 -176539 -112491
8982a12491I6568b85755A42880B5692b1264j14566L8951a8698D9291j6689c32811
$$ -112491 96568 -285755 142880 25692 -21264 -135830 -96879 -18698 49291 32602 -332811
8970F9277a92998F5004K2574a82077Q6347D7785b49745B2996K78641a46722B66767
$$ 69277 -192998 65004 87578 -182077 -95730 47785 -249745 22996 301637 -146722 266767
8958c9370j06376H4125D0329e9686B9943h9743D3619J67186n7362a47923k2643
$$ -39370 -145746 84125 40329 -59686 29943 -89743 43619 210805 153443 -147923 -170566
8947a70566C07153a7275E5790a08770k0843A7793J19783d7331j49111e5852J0384
$$ -170566 307153 -17275 55790 -108770 -129613 17793 137576 -47331 -196442 -55852 -45468
8936d5468l46178a7448l41641j2459C44428b0854p9465L1182C11875a26023N6202
$$ -45468 -391646 -17448 -359089 -371548 344428 -20854 -100319 -69137 311875 -126023 -69821
8925f9821A61139c08222C2049D566a86657I5975L34309L56604B50528K76886c08320
$$ -69821 161139 -308222 32049 4566 -186657 95975 430284 786888 250528 527414 -308320
8913a59264D4151e3328m2217L0373A98953C6847D54N1658b27308j50296f1969
$$ -159264 44151 -53328 -95545 -65172 198953 36847 454 52112 -227308 -377604 -61969
8901h1023B7563h4488I191N6625B7059h4596H8844b90145c2471C6972f7172k20171
$$ -81023 27563 -84488 9191 65816 27059 -84596 88844 -290145 -32471 36972 -67172 -287343
8889b87343h1277A3952e097B3430a17174L7812n7495C10942E7033L9996b3114
$$ -287343 -81277 13952 -5097 23430 -117174 -79362 -136857 310942 57033 97029 -23114
8877g1529p3820q7541o0421D4235A4431a70517C09169g3978b1639l22318J16846
$$ -71529 -145349 -232890 -293311 44235 14431 -170517 309169 -73978 -21639 -343957 -227111
8866b27111m89467c12011a30378d0329j25186D7206K66915D4171M3891l6837h1559
$$ -227111 -716578 -312011 -130378 -40329 -165515 47206 314121 44171 88062 51225 -81559
8854b73331a18825r216n3846l6178B17361B7005a3170k29862I8332i9048K0950
$$ -273331 -118825 -128041 -181887 -218065 217361 27005 -13170 -243032 98332 -99048 -78098
8843g8098J6388A5214i2158k16360d6800C56855b80895I8078N7350a88426P391
$$ -78098 -61710 15214 -92158 -308518 -46800 356855 -280895 98078 155428 -188426 -181035
$$ [...]
##END NTUPLES=NMR SPECTRUM
##END=
