##TITLE=NES1018_872015066_9266120_aT6socKug7
##JCAMPDX= 6.0         $$ Bruker NMR JCAMP-DX V2.0
##DATA TYPE= NMR SPECTRUM
##DATA CLASS= NTUPLES
##ORIGIN= BRUKER
##OWNER= Administrator
$$ 1.72 TOPSPIN		Version 2.1
$$ 2015-07-09 15:50:32.722 -0700  Administrator@X
$$ Compression mode = diff/dup
##.OBSERVE FREQUENCY= 400.02188249412
##.OBSERVE NUCLEUS= ^1H
##.ACQUISITION MODE= SIMULTANEOUS (DQD)
##.ACQUISITION SCHEME= undefined
##.AVERAGES= 64
##.DIGITISER RES= 22
##SPECTROMETER/DATA SYSTEM= spect
##.PULSE SEQUENCE= noesygpps1d.comp
##.SOLVENT NAME= COFFEE_meoh
##.SHIFT REFERENCE= INTERNAL, COFFEE_meoh, 1, 14.96304
##AUDIT TRAIL= $$ (NUMBER, WHEN, WHO, WHERE, PROCESS, VERSION, WHAT)
$$ ##TITLE= Audit trail, TOPSPIN		Version 2.1
$$ ##JCAMPDX= 5.01
$$ ##ORIGIN= Bruker BioSpin GmbH
$$ ##OWNER= Administrator
$$ $$ E:\/data/COFFEE/nmr/NES1018_872015066_9266120_aT6socKug7/12/pdata/1/auditp.txt
$$ ##AUDIT TRAIL=  $$ (NUMBER, WHEN, WHO, WHERE, PROCESS, VERSION, WHAT)
(   1,<2015-07-09 15:50:27.394 -0700>,<Administrator>,<X>,<go>,<TOPSPIN 2.1>,
      <created by zg
	started at 2015-07-09 15:38:57.425 -0700,
	POWCHK enabled, PULCHK disabled,
       configuration hash MD5:
       21 0F 79 D6 B3 7B B4 F6 88 20 88 DB 03 48 BD 9F
       data hash MD5: 64K
       FA 5D F3 39 11 B7 8D 28 4F 21 2B 12 DD AE 2E 1E>)
(   2,<2015-07-09 15:50:30.613 -0700>,<Administrator>,<X>,<proc1d>,<TOPSPIN 2.1>,
      <Start of raw data processing
       efp LB = 0.3 FT_mod = 6 PKNL = 1 PHC0 = 0 PHC1 = 0 SI = 128K 
       data hash MD5: 128K
       9D 7C E6 46 B4 00 D8 7B 74 50 F9 DA 8E 6B D8 5E>)
(   3,<2015-07-09 15:50:31.519 -0700>,<Administrator>,<X>,<proc1d>,<TOPSPIN 2.1>,
      <pk PHC0 = -87.23145 PHC1 = 0 
       data hash MD5: 128K
       B3 20 53 23 21 A3 F5 3A 71 F9 FF 52 FB DD 60 44>)
(   4,<2015-07-09 15:50:31.894 -0700>,<Administrator>,<X>,<proc1d>,<TOPSPIN 2.1>,
      <abs ABSG = 1 
       data hash MD5: 128K
       38 09 58 A2 27 55 05 DA A0 3A BB D0 63 B8 D9 A6>)
(   5,<2015-07-09 15:50:32.003 -0700>,<Administrator>,<X>,<proc1d>,<TOPSPIN 2.1>,
      <abs ABSG = 2 
       data hash MD5: 128K
       59 CA F7 3E B2 23 4E 22 42 65 6A D5 23 99 F1 7C>)
(   6,<2015-07-09 15:50:32.081 -0700>,<Administrator>,<X>,<proc1d>,<TOPSPIN 2.1>,
      <abs ABSG = 3 
       data hash MD5: 128K
       2C B1 C6 8B 7B B7 F0 8B D9 5F 6C F2 27 4A 42 E0>)
(   7,<2015-07-09 15:50:32.160 -0700>,<Administrator>,<X>,<proc1d>,<TOPSPIN 2.1>,
      <abs ABSG = 4 
       data hash MD5: 128K
       6D 3D 05 A8 AA 87 8B 21 F1 61 61 EF 71 15 C9 8F>)
(   8,<2015-07-09 15:50:32.253 -0700>,<Administrator>,<X>,<proc1d>,<TOPSPIN 2.1>,
      <abs ABSG = 5 
       data hash MD5: 128K
       DD A8 42 51 CB AC 2B 6B E1 31 51 C8 38 18 6A 33>)
$$ ##END=
$$ 
$$ $$ hash MD5
$$ $$ 97 C3 0D 62 77 1F 5B FC 29 CC C1 C6 2A 42 5A 1A
##$RELAX= 
##$RELAX= 
##$RELAX= 
##$RELAX= 
##$RELAX= 
##$RELAX= 
##$RELAX= 
##$RELAX= 
$$ Bruker specific parameters
$$ --------------------------
##$DU= <E:\>
##$EXPNO= 12
$$ [...]
##$TP07= 0
##$TPNAME0= <>
##$TPNAME1= <>
##$TPNAME2= <>
##$TPNAME3= <>
##$TPNAME4= <>
##$TPNAME5= <>
##$TPNAME6= <>
##$TPNAME7= <>
##$TPOAL= (0..7)
0.5 0.5 0.5 0.5 0.5 0.5 0.5 0.5
##$TPOFFS= (0..7)
0 0 0 0 0 0 0 0
##$TUNHIN= 0
##$TUNHOUT= 0
##$TUNXOUT= 0
##$USERA1= <user>
##$USERA2= <user>
##$USERA3= <user>
##$USERA4= <user>
##$USERA5= <user>
##$V9= 5
##$VALIST= <valist>
##$VCLIST= <CCCCCCCCCCCCCCC>
##$VD= 0
##$VDLIST= <DDDDDDDDDDDDDDD>
##$VPLIST= <PPPPPPPPPPPPPPP>
##$VTLIST= <TTTTTTTTTTTTTTT>
##$WBST= 2048
##$WBSW= 25
##$XGAIN= (0..3)
0 0 0 0
##$XL= 0
##$YL= 0
##$YMAX_a= 5915830
##$YMIN_a= -11404091
##$ZGOPTNS= <>
##$ZL1= 120
##$ZL2= 120
##$ZL3= 120
##$ZL4= 120
##$ABSF1= 14.96304
##$ABSF2= -5.595141
##$ABSG= 5
##$ABSL= 3
##$ALPHA= 0
##$AQORDER= 0
##$ASSFAC= 0
##$ASSFACI= 0
##$ASSFACX= 0
##$ASSWID= 0
##$AUNMP= <proc_prof1d_extract.lims>
##$AXLEFT= 0
##$AXNAME= <>
##$AXNUC= <1H>
##$AXRIGHT= 0
##$AXTYPE= 0
##$AXUNIT= <>
##$AZFE= 0.1
##$AZFW= 0.1
##$BCFW= 0
##$BC_mod= 0
##$BYTORDP= 0
##$COROFFS= 0
##$CY= 15
##$DATMOD= 1
##$DC= 0
##$DFILT= <>
##$DTYPP= 0
##$F1P= 0
##$F2P= 0
##$FCOR= 0.5
##$FTSIZE= 131072
##$FT_mod= 6
##$GAMMA= 0
##$GB= 0
##$INTBC= 1
##$INTSCL= 1
##$ISEN= 128
##$LB= 0.3
##$LEV0= 0
##$LPBIN= 0
##$MAXI= 10000
##$MC2= 0
##$MEAN= 0
##$ME_mod= 0
##$MI= 0
##$NCOEF= 0
##$NC_proc= -2
##$NLEV= 6
##$NOISF1= 0
##$NOISF2= 0
##$NSP= 0
##$NTH_PI= 0
##$NZP= 0
##$OFFSET= 14.96304
##$PC= 1
##$PHC0= -87.23145
##$PHC1= 0
##$PH_mod= 1
##$PKNL= yes
##$PPARMOD= 0
##$PPDIAG= 0
##$PPIPTYP= 0
##$PPMPNUM= 2147483647
##$PPRESOL= 1
##$PSCAL= 4
##$PSIGN= 0
##$PYNMP= <proc.py>
##$REVERSE= no
##$SF= 400.020008819621
##$SI= 131072
##$SIGF1= 0
##$SIGF2= 0
##$SINO= 400
##$SIOLD= 131072
##$SPECTYP= <>
##$SREGLST= <1H.CDCl3>
##$SSB= 0
##$STSI= 131072
##$STSR= 0
##$SW_p= 8223.68421052631
##$SYMM= 0
##$S_DEV= 0
##$TDeff= 65536
##$TDoff= 0
##$TI= <>
##$TILT= no
##$TM1= 0
##$TM2= 0
##$TOPLEV= 0
##$USERP1= <user>
##$USERP2= <user>
##$USERP3= <user>
##$USERP4= <user>
##$USERP5= <user>
##$WDW= 1
##$XDIM= 131072
##$YMAX_p= 342094029
##$YMIN_p= -12056
##$CURPLOT= <Network HP LaserJet P1505>
##$CURPRIN= <$Network HP LaserJet P1505>
##$DFORMAT= <normdp>
##$LAYOUT= <+/1D_H.xwp>
##$LFORMAT= <normlp>
##$PFORMAT= <normpl>
##$SURQMSG= 1
$$ End of Bruker specific parameters
$$ ---------------------------------
##NTUPLES= NMR SPECTRUM
##VAR_NAME=  FREQUENCY,     SPECTRUM/REAL,   SPECTRUM/IMAG
##SYMBOL=    X,             R,               I
##VAR_TYPE=  INDEPENDENT,   DEPENDENT,       DEPENDENT
##VAR_FORM=  AFFN,          ASDF,            ASDF
##VAR_DIM=   131072,        131072,          131072
##UNITS=     HZ,            ARBITRARY UNITS, ARBITRARY UNITS
##FACTOR=    0.0627417313425164, 1,          1
##FIRST=     8223.62146879497, 1099,         -43930
##LAST=      0,             3602,            -43718
##MIN=       0,             -12056,          0
##MAX=       8223.62146879497, 342094029,    0
$$ Real data points
##PAGE= N=1
##DATA TABLE= (X++(R..R)), XYDATA
$$ [...]
63473A96586m99L38Q00P42P00J056J539J826K125K718L272L233K679K287K422
63458B21824K808L095L357L850M630N534O405P123P598P812P820P744P885Q711
63444C06196J0454J2637J4320J4930J4713J4326J4214J4307J4092J2831J0145
63433D53165O581L316R90q75k923m726n200m157k758k089j884j273l83m42k167
63418D35175m763o897q216r335j0619j1604j1774j1291j0660r978q975p659o457
63405C16947n673n162m613l925l140k225j147j3J020J948K900L917M870N604O132
63390C17440O716P683R008J0153J0507J0076R498R324R487R601R515R331R095
63377D37434Q728Q110O995N094K559J21j613k772l711m207l798k804k106j908
$$ y = [196586, 196087, 196425, 197225, 197967, 198667, 199723, 201262, 203088, 205213, 207931, 211203, 214436, 217115, 219402, 221824, 224632, 227727, 231084, 234934, 239564, 245098, 251503, 258626, 266224, 274036, 281856, 289600, 297485, 306196, 316650, 329287, 343607, 358537, 373250, 387576, 401790, 416097, 430189, 443020, 453165, 459746, 463062, 464052, 463177, 460254, 455528, 450328, 446171, 443413, 441324, 439440, 438167, 437784, 437342, 435175, 430412, 423515, 415299, 405964, 395345, 383741, 371967, 360676, 350016, 340038, 331063, 323404, 316947, 311274, 306112, 301499, 297574, 294434, 292209, 291062, 291049, 292069, 294017, 296917, 300834, 305704, 311308, 317440, 324156, 331839, 340847, 351000, 361507, 371583, 381081, 390405, 399892, 409493, 419008, 428339, 437434, 446162, 454272, 461267, 466361, 468920, 469041, 467428, 464656, 460945, 456738, 452940, 450136, 448030, 446122]
63363D46122j523p80n98j612l028l720l986n062p152r010r612r300q946q793q578
63348C64422q233p805p097o000m969m641n012n396n289m950n013n656o223n791
63334B82347m179k376j654k171k773k413j368o77o91p66l81J56L26K71O69J858
63318B66178L405M479M551L770K814K273K081J669P27m22j293j862k423l051l533
63303B79363l739l743l583l256k976l026l276l239k749k220k002j897j623j372
63289B40662j385j367r04k63o1k45j48L50N66J20m49n95n75p53p90k90J67l12
63271B33728j456j926j016N28J615K050K320K731L175L448L386K924K277J900
63257B55684K045K505K910L102L083K913K786K972L507M142M691N132N313N001
$$ y = [446122, 444599, 443819, 443221, 441609, 438581, 434861, 430875, 425813, 418661, 409651, 400039, 390739, 381793, 373000, 364422, 356189, 348384, 341287, 335287, 330318, 325677, 320665, 315269, 309980, 305030, 300017, 294361, 288138, 282347, 278168, 275792, 274138, 271967, 269194, 266781, 265413, 264736, 264045, 263279, 262898, 263054, 263380, 263651, 264320, 266178, 269583, 274062, 278613, 282383, 285197, 287470, 289551, 291220, 291947, 291525, 290232, 288370, 285947, 282896, 279363, 275624, 271881, 268298, 265042, 262066, 259040, 255764, 252525, 249776, 247556, 245554, 243657, 242034, 240662, 239277, 237910, 237006, 236743, 236682, 236437, 236289, 236639, 237205, 237325, 236876, 236281, 235706, 234953, 234163, 233873, 234040, 233728, 232272, 230346, 229330, 229858, 231473, 233523, 235843, 238574, 241749, 245197, 248583, 251507, 253784, 255684, 257729, 260234, 263144, 266246, 269329, 272242, 275028, 278000, 281507, 285649, 290340, 295472, 300785, 305786]
63243C05786M458M512N657P362Q734R584J0383J1385J2314J2848J2989J2925J2960
63230D31897J3518J4735J6008J6435J5835J4937J4398J4105J3709J3347J3415
63219E92339J3908J4519J5256J6396J7815J8795J8716J7580J5697J3210J0127
63208G64358O616K895r95n011q827j2071j4758j7091j8818j9291j8355j6734j5217
63195F26701j3740j1745r141o489m306k670j439l56J078L270N967Q406J0245J1864
63181F17645J3495J4648J4856J4555J4606J5125J5565J5844J6580J7930J8873
63170G89722J8268J6316J4444J3734J3907J3827J2680J0510P911N463L264Q57
63158I20903k349o322j0208j3107j4991j6584j8331j9852k0535k0254j9232j7544
$$ y = [305786, 310244, 314756, 320413, 327775, 336509, 346093, 356476, 367861, 380175, 393023, 406012, 418937, 431897, 445415, 460150, 476158, 492593, 508428, 523365, 537763, 551868, 565577, 578924, 592339, 606247, 620766, 636022, 652418, 670233, 689028, 707744, 725324, 741021, 754231, 764358, 770974, 773869, 772874, 767863, 759036, 746965, 732207, 715116, 696298, 677007, 658652, 641918, 626701, 612961, 601216, 592075, 585586, 581280, 578610, 577171, 576815, 577893, 581163, 587130, 595536, 605781, 617645, 631140, 645788, 660644, 675199, 689805, 704930, 720495, 736339, 752919, 770849, 789722, 807990, 824306, 838750, 852484, 866391, 880218, 892898, 903408, 911319, 916782, 920046, 920903, 918554, 912232, 902024, 888917, 873926, 857342, 839011, 819159, 798624, 778370, 759138, 741594]
63146G41594j5249j2789j0707q984p121n017l278k466k438k703l047l479l872
63133F60444m118m505n427o716p592p431o371n063m037l405l042k816k629k341
63119E94951j777r71l35l32q84j231o25Q00K058K300J667J039R69J016M05q01
63103E98249j581j182o2Q28J356K131L111L246J931J70m28N12J916K764L066L331
63087F19358L693L904L805L489L164L020L130L345L419L262K977K639K345K441
63073F63991L316M749N834N918N418N325O015O946P551P930Q483R295J0172J1016
63059G61959J1841J2590J3300J4289J5784J7447J8828K0178K2191K4762K6744
63048I59913K7410K7472K8065K9200K9966K9977K9699K9476K9121K8594K8207
$$ y = [741594, 726345, 713556, 702849, 693865, 686744, 681727, 678449, 675983, 673545, 670842, 667795, 664316, 660444, 656326, 651821, 646394, 639678, 632086, 624655, 618284, 613221, 609184, 605779, 602737, 599921, 597292, 594951, 593174, 592203, 591868, 591536, 590652, 589421, 588796, 589596, 591654, 593954, 595621, 596660, 597629, 598645, 599050, 598249, 596668, 595486, 595424, 596252, 597608, 599739, 602850, 606096, 608027, 608197, 607769, 608281, 610197, 612961, 616027, 619358, 623051, 626955, 630760, 634249, 637413, 640433, 643563, 646908, 650327, 653589, 656566, 659205, 661550, 663991, 667307, 672056, 677890, 683808, 689226, 694551, 700566, 707512, 715063, 722993, 731476, 740771, 750943, 761959, 773800, 786390, 799690, 813979, 829763, 847210, 866038, 886216, 908407, 933169, 959913, 987323, 1014795, 1042860, 1072060, 1102026, 1132003, 1161702, 1191178, 1220299, 1248893, 1277100]
63037A277100K7919K7215K6033K5099K4925K5058K4795K4017K2801K0677J7081
63026A542720J2186O727J110m762j0970j7363k3714k9658l4639l8303m0747m1993
63014A320594m1631l9527l6538l3731l1079k7746k3557j9334j5600j1875p647
63003A032329l282N94M085P717J1442J4654J7113J9313K1724K4136K5914K6712
62991A202451K6712K6301K5814K5551K5734K6173K6127K4867K2453J9644J6920
62980A468747J3893R827M563j447p743j4208k0851k7460l3617l8909m3223m6818
62968A262754m9921n2246n3121n2284n0296m8020m5921m3962m1873l9294l6031
62957G49785l2398k9023k6180k3631k1322j9656j8762j8005j6779j5220j3710
$$ y = [1277100, 1305019, 1332234, 1358267, 1383366, 1408291, 1433349, 1458144, 1482161, 1504962, 1525639, 1542720, 1554906, 1561633, 1562743, 1557981, 1547011, 1529648, 1505934, 1476276, 1441637, 1403334, 1362587, 1320594, 1278963, 1239436, 1202898, 1169167, 1138088, 1110342, 1086785, 1067451, 1051851, 1039976, 1032329, 1029047, 1029641, 1033726, 1041443, 1052885, 1067539, 1084652, 1103965, 1125689, 1149825, 1175739, 1202451, 1229163, 1255464, 1281278, 1306829, 1332563, 1358736, 1384863, 1409730, 1432183, 1451827, 1468747, 1482640, 1492467, 1497030, 1495583, 1487840, 1473632, 1452781, 1425321, 1391704, 1352795, 1309572, 1262754, 1212833, 1160587, 1107466, 1055182, 1004886, 956866, 910945, 866983, 825110, 785816, 749785, 717387, 688364, 662184, 638553, 617231, 597575, 578813, 560808, 544029, 528809, 515099]
62946E15099j2182j0632r682r759j0096r565q269p325p141o985o317n514n039
62933D06593m711m213l667l347l372l819m643n385n484m992m384l750k865k051
62919C49910k127l217m395m712m052k848j715j364j966k524j877m81Lq19j445
62904C16371q66j39n65j561j788j324j261j676j682j163r83j384j547r90l01j38
62888B99003l55n39o37p12o41l77p4K25N97Q74P43K71p7j05l8oJ78N56Q30Q03
62868C00519O39M80K06k23n09l54J01M06K56k85q93j286j484j685j899j870j538
62851B90581j264j355j608j667j599j656j668j234m93j10l65p11n09J58P01Q27
62835B78028Q25J029J315J273Q49M93N36O38K41n11q33l16O16J408J937K153J862
$$ y = [515099, 502917, 492285, 482603, 472844, 462748, 453183, 444914, 437589, 430448, 423463, 417146, 411632, 406593, 401882, 397669, 394002, 390655, 387283, 383464, 378821, 373436, 367952, 362960, 358576, 354826, 351961, 349910, 347783, 344566, 340171, 335459, 331407, 328559, 326844, 325480, 323514, 320990, 319113, 318632, 318635, 317816, 316371, 315505, 315366, 314801, 313240, 311452, 310128, 308867, 307191, 305509, 304346, 303363, 301979, 300432, 299442, 299141, 299003, 298648, 298109, 297472, 296760, 296119, 295742, 295668, 295893, 296490, 297364, 298107, 298378, 298301, 298196, 298158, 298152, 298330, 298886, 299716, 300519, 301158, 301638, 301844, 301621, 301112, 300758, 300859, 301265, 301521, 301236, 300343, 299057, 297573, 295888, 293989, 292119, 290581, 289317, 287962, 286354, 284687, 283088, 281432, 279764, 278530, 278037, 277927, 277562, 276851, 276342, 276500, 277201, 278028, 278853, 279882, 281197, 282470, 283319, 283812, 284348, 284986, 285227, 284716, 283883, 283567, 284183, 285591, 287528, 289681, 291543]
62818B91543J295J255K141L237L646L463L339L349L120K798K939L528L975M075
62804C33703M256M738N252N681O282P135Q003Q922J0246J1927J3372J4351J5444
62791D49312J7278J9749K2320K4729K7106K9657L2455L5335L7951M0172M2361
62780G78425M4914M7554M9530N0424N0366M9480M7677M4964M1325L6268K9201
62769A270128K0379J0883J511p598j6180k3546k9439l4417l8898m2530m4986m6680
62757A018627m8005m8481m7530m5626m3876m2620m1196l9027l6186l2936k9396
62746E63748k5805k2625k0098j8039j6253j4902j4203j3937j3390j1954r751p687
62734C75104o643o560o468n574m111k954k544k395j729l25J302K602L610M691
$$ y = [291543, 292838, 294093, 296234, 299471, 303117, 306580, 309919, 313268, 316388, 319186, 322125, 325653, 329628, 333703, 337959, 342697, 347949, 353630, 359912, 367047, 375050, 383972, 394218, 406145, 419517, 433868, 449312, 466590, 486339, 508659, 533388, 560494, 590151, 622606, 657941, 695892, 736064, 778425, 823339, 870893, 920423, 970847, 1021213, 1070693, 1118370, 1163334, 1204659, 1240927, 1270128, 1290507, 1301390, 1302901, 1295303, 1279123, 1255577, 1226138, 1191721, 1152823, 1110293, 1065307, 1018627, 970622, 922141, 874611, 828985, 785109, 742489, 701293, 662266, 626080, 593144, 563748, 537943, 515318, 495220, 477181, 460928, 446026, 431823, 417886, 404496, 392542, 382791, 375104, 368461, 361901, 355433, 349859, 345748, 342794, 340250, 337855, 336126, 335801, 337103, 339705, 343315, 348006]
62720C48006N766O253O046O038P139R063J0790J2034J3490J5527J7591J9174K0641
62707D97558K2608K5093K7802L0781L4214L7863M1271M4289M7054M9589N1754
62696I09876N3351N4036N3347N1099M7504M2709L6584K9157K0816J1855K305p465
62684A305174j6590k4624l2029l9133m5138m8956n0662n1291n1366n0542m8638
62673H46205m6192m3810m1661l9660l7568l4847l1080k6848k3521k1777k0759
62662D78482j9101j6522j4023j2652j2464j2690j2655j2300j1835j1124r834q137
62650C25145o853o511o622o314n449m663m445m618m733m500l842k946k270k159
62636B59220k383k430k233k188k454k670k487k031j584j175o63l6N52R31J005
$$ y = [348006, 353772, 360025, 366071, 372109, 379248, 388311, 399101, 411135, 424625, 440152, 457743, 476917, 497558, 520166, 545259, 573061, 603842, 638056, 675919, 717190, 761479, 808533, 858122, 909876, 963227, 1017263, 1070610, 1121709, 1169213, 1211922, 1248506, 1277663, 1298479, 1310334, 1312639, 1305174, 1288584, 1263960, 1231931, 1192798, 1147660, 1098704, 1048042, 996751, 945385, 894843, 846205, 800013, 756203, 714542, 674882, 637314, 602467, 571387, 544539, 521018, 499241, 478482, 459381, 442859, 428836, 416184, 403720, 391030, 378375, 366075, 354240, 343116, 333282, 325145, 318292, 311781, 305159, 298845, 293396, 288733, 284288, 279670, 274937, 270437, 266595, 263649, 261379, 259220, 256837, 254407, 252174, 249986, 247532, 244862, 242375, 240344, 238760, 237585, 236922, 236886, 237438, 238369, 239374]
62621B39374Q19N80N07O98J236K210L354L898L308K197J985L459N928P969Q759
62606B86281Q637Q619R480J1118J2743J3854J4859J6505J8817K1058K2683K3826
62594D68480K4810K5650K6162K6143K5246K3197K0291J7219J4163J0542N954Q71
62582F88728l950q326j2371j5762j7950j8993j9617k0397k1283k1851k1681k0548
62570D85999j8668j6803j5696j5299j4802j3616j1973j0485r391q491p634o965
62558C36176o647o530o244n669n186n220n543n351m275l019k554k868l050k647
62544B71373k244k400k616j968m33J100K051K654L195L483L489L827M982O479
62530B92972P473Q013Q921J0434J1815J2572J3360J5081J7552J9802K1472K3235
$$ y = [239374, 240193, 240773, 241280, 241978, 243214, 245424, 248778, 252676, 255984, 258181, 260166, 263625, 269553, 277522, 286281, 294918, 303537, 313017, 324135, 336878, 350732, 365591, 382096, 400913, 421971, 444654, 468480, 493290, 518940, 545102, 571245, 596491, 619688, 639979, 657198, 671361, 681903, 687857, 688728, 684778, 676452, 664081, 648319, 630369, 611376, 591759, 571362, 550079, 528228, 506547, 485999, 467331, 450528, 434832, 419533, 404731, 391115, 379142, 368657, 359266, 350775, 343141, 336176, 329529, 322999, 316755, 311086, 305900, 300680, 295137, 289786, 285511, 282492, 279938, 277070, 274020, 271373, 269129, 266729, 264113, 262145, 261712, 262812, 264863, 267517, 270712, 274195, 277684, 281511, 286493, 292972, 300445, 308458, 317379, 327813, 339628, 352200, 365560, 380641, 398193, 417995, 439467, 462702]
62518D62702K5727K8609L0987L2438L3312L4173L5129L5713L5270L3434L0259
62507H17753K5961K0684J4587Q020J390n085j1362j7304k2530k6587k9272l0825
62495G45430l1780l2460l2630l1812k9988k7746k5596k3512k1315j9158j7249
62484D52184j5445j3585j1989j1041j0445r503q154p050o477n886m766l448k564
62471C41831k156j807j312q18m26p5K77O93J254J790J881J536J562K695M454N574
62455C56953N543N135N206N578N486M679L561K493J437J98j340l225n284p034
62441C79386q058q444q609q632q184p156n975n108m567m084l484k597j227M13
62427C03674J553J681J322J386J901K091J725J651K586M124N349N926O059N813
$$ y = [462702, 488429, 517038, 548025, 580463, 613775, 647948, 683077, 718790, 754060, 787494, 817753, 843714, 864398, 878985, 887005, 888395, 883310, 871948, 854644, 832114, 805527, 776255, 745430, 713650, 681190, 648560, 616748, 586760, 559014, 533418, 509906, 488591, 469433, 452184, 436739, 423154, 411165, 400124, 389679, 380176, 372022, 364972, 358495, 352609, 347843, 344395, 341831, 339675, 337868, 336556, 335738, 335312, 335237, 335514, 336207, 337461, 339251, 341132, 342668, 344230, 346925, 351379, 356953, 362496, 367631, 372837, 378415, 383901, 388580, 392141, 394634, 396071, 396269, 394929, 391704, 386420, 379386, 371328, 362884, 354275, 345643, 337459, 330303, 324328, 319220, 314653, 310569, 307085, 304488, 303261, 303674, 305227, 306908, 308230, 309616, 311517, 313608, 315333, 316984, 319570, 323694, 329043, 334969, 341028, 346841]
62413C46841N271N009N624O794P489P272O731O530O574O408N953N461N049M643
62399D31649M177L550K593J392N00M75J156J652J205Jr27o46Q25K639M121N432
62383D59794P053Q859J0178J0790J1412J2879J5180J7584J9579K1312K3135K5055
62371F42810K6742K7961K8773K9381K9766K9572K8398K6191K3265J9962J6420
62360I29241J2683Q893N246J839j357m454p631j1058j4672j8052k0685k2452k3742
62347H33799k4977k6033k6303k5424k3774k2006k0283j8280j5959j3920j2755
62336F04085j2363j2178j1835j1281j0495r383p954o356m779l472k655k227j770
62323E07337j099n42l38j48M14J083J347J291J332J376R97M35M74J235J925K031
$$ y = [346841, 352112, 357121, 362745, 369539, 377028, 384300, 391031, 397561, 404135, 410543, 416496, 421957, 427006, 431649, 435826, 439376, 441969, 443361, 443861, 444336, 445492, 447144, 448349, 448350, 447423, 446777, 447602, 450241, 454362, 459794, 466847, 475706, 485884, 496674, 508086, 520965, 536145, 553729, 573308, 594620, 617755, 642810, 669552, 697513, 726286, 755667, 785433, 815005, 843403, 869594, 892859, 912821, 929241, 941924, 950817, 956063, 957902, 956545, 952091, 944460, 933402, 918730, 900678, 879993, 857541, 833799, 808822, 782789, 756486, 731062, 707288, 685282, 664999, 646719, 630760, 616840, 604085, 591722, 579544, 567709, 556428, 545933, 536550, 528596, 522240, 517461, 513989, 511334, 509107, 507337, 506238, 505696, 505358, 505210, 505624, 506707, 508054, 509345, 510677, 512053, 513050, 513485, 513959, 515194, 517119, 519150]
62307E19150J890J745J176J30l82N59K368L528L323K321J381R08R90J563K356
62292E43006L060L552L756L498K869K398K392K442K146K014K869M559O113P161
62278E91835Q306R876J1251J1925J2565J4277J7158K0198K2452K3793K4612K5244
62266G93492K5805K6180K6027K4922K2733J9781J6600J3509J0466P363M297J514
62254I92689r96l579o562r865j3050j5607j7161j7608j7204j6440j5650j4837
62242H44130j3963j3148j2400j1403r915q216o785n682m572l386k496k234k442
62229G47488k643k430j758j036q68j437k210k493k226j889j833k053k547l302
62215G18763l938l911l200k345j651q47J94J038J335J465K072L173M226M873N239
$$ y = [519150, 521040, 522785, 523961, 524091, 523709, 524268, 526636, 530164, 533487, 535808, 537189, 538097, 539087, 540650, 543006, 546066, 549618, 553374, 556872, 559741, 562139, 564531, 566973, 569119, 571133, 574002, 578561, 584674, 591835, 600141, 610017, 621268, 633193, 645758, 660035, 677193, 697391, 719843, 743636, 768248, 793492, 819297, 845477, 871504, 896426, 919159, 938940, 955540, 969049, 979515, 986878, 991175, 992689, 991693, 988114, 981552, 971687, 958637, 943030, 925869, 908261, 891057, 874617, 858967, 844130, 830167, 817019, 804619, 793216, 783301, 775085, 768300, 762618, 758046, 754660, 752164, 749930, 747488, 744845, 742415, 740657, 739621, 738753, 737316, 735106, 732613, 730387, 728498, 726665, 724612, 722065, 718763, 714825, 710914, 707714, 705369, 703718, 702871, 703065, 704103, 705438, 706903, 708975, 712148, 716374, 721247, 726486]
62200G26486N604O164O975P849Q386Q485Q650R437J0625J1440J1569J1514J1762
62187H44946J2123J2149J1895J1873J2409J3461J4946J6903J9170K1221K2530
62176A013626K2971K2740K1986K0722J9042J7178J5285J3289J1075Q742O621M989
62164A198266L770K502P33j480l586n198o584q187r802j0679j0516r823r122q281
62150A122013o979n466m322l773l636l743l989m178m226m383m745m836m253l473
62136A060011l281l504l189k106j172j087j400j320q40m35j85K32J033K294M028
62121A049079N881P122P478P643Q425R594J0008Q716N611J399k573m834m834l426
62107A105289j920r23n46j230l465o730r622j1228j1783j1864j1492j0341q368
$$ y = [726486, 732090, 738254, 745229, 753078, 761464, 769949, 778599, 788036, 798661, 810101, 821670, 833184, 844946, 857069, 869218, 881113, 892986, 905395, 918856, 933802, 950705, 969875, 991096, 1013626, 1036597, 1059337, 1081323, 1102045, 1121087, 1138265, 1153550, 1166839, 1177914, 1186656, 1193277, 1198266, 1202036, 1204538, 1205271, 1203791, 1200205, 1195007, 1188423, 1180236, 1170434, 1159755, 1149239, 1139416, 1130294, 1122013, 1115034, 1109568, 1105246, 1101473, 1097837, 1094094, 1090105, 1085927, 1081701, 1077318, 1072573, 1067737, 1063484, 1060011, 1056730, 1053226, 1050037, 1047931, 1046759, 1045672, 1044272, 1042952, 1042112, 1041677, 1041492, 1041724, 1042757, 1045051, 1049079, 1054960, 1062082, 1069560, 1077203, 1085628, 1095222, 1105230, 1113946, 1119557, 1120956, 1118383, 1113549, 1108715, 1105289, 1103369, 1102446, 1101900, 1100670, 1097205, 1090475, 1080853, 1069625, 1057842, 1045978, 1034486, 1024145, 1015777]
62094A015777o000l933k760k478k338j602l46Q41J760K671L552M050M292M917
62080A018403O113P235P724P815P966Q161Q099P549O195L736O05k032l572m729
62066A079268o410q352r640j0234j0931j2020j2873j3128j3417j4500j6150j7364
62054I34249j7466j6742j6017j5751j5560j4707j3113j1594j0897j0787j0458
62043G81157r638q789q346q239q195q043p633o930o273o166o654p238p465p339
62029F74209p063o815o829p319q094q540q205p213o012m996m432m365m482m345
62015E85499l937l646l642l649l467l263l136k857k363k017k012j965j618j492
62001E46435k154l186l669l574l783m667n484n528n094m806m515l637k257j153
$$ y = [1015777, 1009777, 1005844, 1003084, 1000606, 998268, 996666, 996320, 997161, 998921, 1001592, 1005144, 1009194, 1013486, 1018403, 1024516, 1031751, 1039475, 1047290, 1055256, 1063417, 1071516, 1079065, 1085260, 1088996, 1089601, 1087569, 1083997, 1079268, 1072858, 1064506, 1054866, 1044632, 1033701, 1021681, 1008808, 995680, 982263, 967763, 951613, 934249, 916783, 900041, 884024, 868273, 852713, 838006, 824893, 813299, 802402, 791615, 781157, 771519, 762730, 754384, 746145, 737950, 729907, 722274, 715344, 709071, 702905, 696251, 689013, 681548, 674209, 667146, 660331, 653502, 646183, 638089, 629549, 621344, 614131, 608119, 603123, 598691, 594326, 589844, 585499, 581562, 577916, 574274, 570625, 567158, 563895, 560759, 557902, 555539, 553522, 551510, 549545, 547927, 546435, 544281, 541095, 537426, 533852, 530069, 525402, 519918, 514390, 509296, 504490, 499975, 496338, 494081, 492928]
61987D92928p37n71j98J61K9m66o50k03M53P60Q00J157K137L449M622N513O223
61970E15407O701O762O503O407O818P483P851P874Q129R026J0152J0795J0953
61957F20861J1331J2234J3115J3499J3801J4647J5820J6644J7232J8440K0466
61946G88090K2372K3332K3630K4008K4655K5436K6489K7923K9324L0279L1075
61935A076613L2234L3681L5130L6940L9667M2885M5614M8061N1811N7854O5398
61924A565888P3202Q1227R0145R9924J09955J20291J31658J44267J57392J70336
61914B744285J83029J95373K06498K15068K20052K20850K16796K06777J89341
61905D598069J63305J28586Q6679M0238p950n5494j00094j39241j70699j93417
$$ y = [492928, 492191, 491620, 491422, 491583, 491612, 491146, 490496, 490293, 490746, 491506, 492306, 493463, 495600, 499049, 503671, 509184, 515407, 522108, 528870, 535373, 541780, 548598, 556081, 563932, 571806, 579935, 588961, 599113, 609908, 620861, 632192, 644426, 657541, 671040, 684841, 699488, 715308, 731952, 749184, 767624, 788090, 810462, 833794, 857424, 881432, 906087, 931523, 958012, 985935, 1015259, 1045538, 1076613, 1108847, 1142528, 1177658, 1214598, 1254265, 1297150, 1342764, 1390825, 1442636, 1500490, 1565888, 1639090, 1720317, 1810462, 1910386, 2020341, 2140632, 2272290, 2416557, 2573949, 2744285, 2927314, 3122687, 3329185, 3544253, 3764305, 3985155, 4201951, 4408728, 4598069, 4761374, 4889960, 4976639, 5016877, 5008927, 4953433, 4853339, 4714098, 4543399, 4349982]
61895D349982k07859k15441k17649k15510k09651k00698j89561j77306j64807
61886B551500j52557j40736j29328j18183j07250r6811q7355p9079p1685o4765
61876A503751n8254n2296m6798m1461l6258l1604k7912k5117k2723k0188j7218
61865A123922j3885j0623p953n990m317k466m19J514L115M373N315O070O925P972
61851A113553Q708Q440P145N565M305L360K650K551L427M937O266O907O913O605
61837A191332O344O379O473N868M064J639j89p78n26j87j83n54j118j496j327
61822A215741n81N55K084M150O603R021J1268J3649J6425J9500K2637K5656K8388
61809A375096L0806L3334L6525M0360M4332M8306N2708N7715O2917O8181P4202
$$ y = [4349982, 4142123, 3926682, 3709033, 3493523, 3283872, 3083174, 2893613, 2716307, 2551500, 2398943, 2258207, 2128879, 2010696, 1903446, 1806635, 1719280, 1640201, 1568516, 1503751, 1445497, 1393201, 1346403, 1304942, 1268684, 1237080, 1209168, 1184051, 1161328, 1141140, 1123922, 1110037, 1099414, 1091461, 1085471, 1081154, 1078688, 1078269, 1079783, 1082898, 1087271, 1092586, 1098656, 1105581, 1113553, 1122261, 1130701, 1137846, 1143411, 1147716, 1151076, 1153726, 1156277, 1159704, 1164641, 1170907, 1177814, 1184727, 1191332, 1197676, 1204055, 1210528, 1216396, 1220460, 1222099, 1221910, 1221132, 1220606, 1220419, 1220236, 1219682, 1218564, 1217068, 1215741, 1215160, 1215715, 1217799, 1221949, 1228552, 1237573, 1248841, 1262490, 1278915, 1298415, 1321052, 1346708, 1375096, 1405902, 1439236, 1475761, 1516121, 1560453, 1608759, 1661467, 1719182, 1782099, 1850280, 1924482]
61798A924482Q1619R0096R8882J07981J18088J29650J42603J56864J72494J89372
61788C212131K07321K26461K46942K68372K90064L11728L33286L53841L71409
61779E821555L83792L89158L85589L70694L42273K99277K42063J72228R2662P595
61769H506886p7928j58824k30504k89364l33517l63146l79891l85801l82799l72836
61759E532276l57937l39843l19726k98369k76545k55076k34616k15453j97554
61750C037157j80772j65057j50542j37391j25543j14618j04224r4387q5562p8094
61740A800967p1796o6203o1101n6537n2455m8669m5191m2185l9477l6601l3470
61729A247282l0668k8674k7220k5731k4107k2621k1272j9861j8529j7643j7141
$$ y = [1924482, 2006101, 2096197, 2195079, 2303060, 2421148, 2550798, 2693401, 2850265, 3022759, 3212131, 3419452, 3645913, 3892855, 4161227, 4451291, 4763019, 5096305, 5450146, 5821555, 6205347, 6594505, 6980094, 7350788, 7693061, 7992338, 8234401, 8406629, 8499291, 8506886, 8428958, 8270134, 8039630, 7750266, 7416749, 7053603, 6673712, 6287911, 5905112, 5532276, 5174339, 4834496, 4514770, 4216401, 3939856, 3684780, 3450164, 3234711, 3037157, 2856385, 2691328, 2540786, 2403395, 2277852, 2163234, 2059010, 1964623, 1879061, 1800967, 1729171, 1662968, 1601867, 1545330, 1492875, 1444206, 1399015, 1356830, 1317353, 1280752, 1247282, 1216614, 1187940, 1160720, 1134989, 1110882, 1088261, 1066989, 1047128, 1028599, 1010956, 993815]
61718I93815j6572j5832j5282j5015j4587j3704j2684j1920j1300j0618j0123
61707H46178j0143j0318r892q748p739p673q350q800q313p053n706m741m101l485
61693G41116k771k086j545j135q69q52j132j617k298l376m936o638q041r126j0197
61678F84497j1186j1516j0912j0000r621r705r369q142o575n389m569l717k873
61665E80923k361k085j695j495k340m314o180o692o051n470n536n716n460n042
61651E20486n021n280n150m354l451l184l608m014l734k834j922j411j227j150
61637D74146j151j268j410j451j414j407j469j511j326p42O1M57l7j038j567j157
61621D57716l17J99J40m37j447k464k698j889q78o86j309j965k230k210j956j460
$$ y = [993815, 977243, 961411, 946129, 931114, 916527, 902823, 890139, 878219, 866919, 856301, 846178, 836035, 825717, 815825, 807077, 799338, 791665, 783315, 774515, 766202, 759149, 753443, 748702, 744601, 741116, 738345, 736259, 734714, 733579, 732710, 731858, 730726, 729109, 726811, 723435, 718499, 711861, 703820, 694694, 684497, 673311, 661795, 650883, 640883, 631262, 621557, 612188, 604046, 597471, 592082, 587513, 583796, 580923, 578562, 576477, 574782, 573287, 570947, 566633, 560453, 553761, 547710, 542240, 536704, 530988, 525528, 520486, 515465, 510185, 505035, 500681, 497230, 494046, 490438, 486424, 482690, 479856, 477934, 476523, 475296, 474146, 472995, 471727, 470317, 468866, 467452, 466045, 464576, 463065, 461739, 460997, 461058, 461515, 461478, 460440, 458873, 457716, 457399, 457598, 457738, 457301, 455854, 453390, 450692, 448803, 447925, 447239, 445930, 443965, 441735, 439525, 437569, 436109]
61605D36109j147j438j816j268K25J441J537J066J002J454J947K371K943L567
61591D47993L981M346N062O026O585O376N859N797O458P498Q510R524J0817J2315
61577E47147J3473J3971J4263J5049J6372J7689J8900K0609K3093K5560K6868
61566G52994K6697K5581K4073K2291K0143J7522J4306J0543O668L255N86j333
61554I23326k376k333j395k98L04M58P08J347K083K485K476K258J914J443J001
61539I33401P34L42o99k278l505l816l752m114m713m632l610k408j738j364m69
61524H97379J517M455P518R728J0970J2316J4843J8195K1127K3380K6025K9841
61512A077294L4291L8604M2839M7314N1762N5904O0160O5046P0439P6176Q2794
$$ y = [436109, 434962, 433524, 431708, 430440, 430665, 432106, 433643, 434709, 435711, 437165, 439112, 441483, 444426, 447993, 451974, 456320, 461382, 467408, 473993, 480369, 486228, 492025, 498483, 505981, 514491, 524015, 534832, 547147, 560620, 574591, 588854, 603903, 620275, 637964, 656864, 677473, 700566, 726126, 752994, 779691, 805272, 829345, 851636, 871779, 889301, 903607, 914150, 920818, 924073, 924659, 923326, 920950, 918617, 917222, 916924, 917228, 917686, 918394, 919741, 921824, 924309, 926785, 929043, 930957, 932400, 933401, 934135, 934477, 933778, 931500, 927995, 924179, 920427, 916313, 911600, 906968, 903358, 900950, 899212, 897848, 897379, 898896, 903351, 910869, 920597, 931567, 943883, 958726, 976921, 998048, 1021428, 1047453, 1077294, 1111585, 1150189, 1193028, 1240342, 1292104, 1348008, 1408168, 1473214, 1543653, 1619829, 1702623]
61501A702623R0588R8360J04274J07832J10020J11420J11240J08442J02962R5388
61491B743149Q6036P4825O1771M7326L2437J8307N791m973j3937k0346k3299k3233
61479B983854k2084k1488k1456k1292k1342k3041k7262l3358l9974m6395n2670
61468B653492n8668o3476o5974o5836o3680o0248n5732n0120m3834l7595l1731
61457B056598k6004k0264j4857j0211o201k232K062O437J0404J3837J7058K0388
61445B047015K3838K7350L1201L5814M1167M6626N1397N4763N5781N3288M6707
61434B514947L6756K5116J3513L330m372r198j1780j3191j3771j2976j0639p852
61422B509883n984n038l558m06L899P926J0948J3055J3579J0459K092j0386k3475
$$ y = [1702623, 1793211, 1891571, 1995845, 2103677, 2213697, 2325117, 2436357, 2544799, 2647761, 2743149, 2829185, 2904010, 2965781, 3013107, 3045544, 3063851, 3069642, 3064669, 3050732, 3030386, 3007087, 2983854, 2961770, 2940282, 2918826, 2897534, 2876192, 2853151, 2825889, 2792531, 2752557, 2706162, 2653492, 2594824, 2531348, 2465374, 2399538, 2335858, 2275610, 2219878, 2169758, 2125924, 2088329, 2056598, 2030594, 2010330, 1995473, 1985262, 1979061, 1976829, 1978891, 1985328, 1995732, 2009569, 2026627, 2047015, 2070853, 2098203, 2129404, 2165218, 2206385, 2253011, 2304408, 2359171, 2414952, 2468240, 2514947, 2551703, 2576819, 2590332, 2593662, 2589290, 2580092, 2568312, 2555121, 2541350, 2528374, 2517735, 2509883, 2503899, 2498861, 2495303, 2494897, 2498796, 2506722, 2517670, 2530725, 2544304, 2554763, 2556855, 2546469, 2522994]
61409B522994l4035m1035m4778m5555m3743m0388l6730l3203k9633k6163k3308
61398B124423k1163j9191j6942j4493j2083r707p247m597j584K032O355J1365
61386B037168J7055K3344K9919L6525M3359N0804N8743O6517P3567P9858Q5691
61375B602550R1362R6962J02050J05556J06422J04425R9918R2845Q2481O8422
61365C552993N1261L2146J2204p322k4960l9820n2304o3498p3878q3031r0525
61354C213266r6510j01174j04184j05037j03872j01501r8600r5142r0762q5468
61344B231016p9745p4025o8300o2331n6029m9585m3370l7716l2658k7854k2903
61333A676500j7753j2564p330k000L032P177J0548J4030J8003K1586K3654K4163
$$ y = [2522994, 2488959, 2447924, 2403146, 2357591, 2313848, 2273460, 2236730, 2203527, 2173894, 2147731, 2124423, 2103260, 2084069, 2067127, 2052634, 2040551, 2030844, 2023597, 2019000, 2017416, 2019448, 2025803, 2037168, 2054223, 2077567, 2107486, 2144011, 2187370, 2238174, 2296917, 2363434, 2437001, 2516859, 2602550, 2693912, 2790874, 2892924, 2998480, 3104902, 3209327, 3309245, 3402090, 3484571, 3552993, 3604254, 3636400, 3648604, 3641282, 3616322, 3576502, 3524198, 3460700, 3386822, 3303791, 3213266, 3116756, 3015582, 2911398, 2806361, 2702489, 2600988, 2502388, 2407246, 2316484, 2231016, 2151271, 2077246, 2008946, 1946615, 1890586, 1841001, 1797631, 1759915, 1727257, 1699403, 1676500, 1658747, 1646183, 1638853, 1636853, 1639885, 1647062, 1657610, 1671640, 1689643, 1711229, 1734883, 1759046]
61321A759046K3810K2735K0496J7201J3813J1122R144P703O947O937P196P183
61309A913333O870O665O947P853R178J0319J0694J0384J0046R951R584Q423O776
61296B027023N324M148K682N60k011m623p032r023j0352j1075j1668j2486j3146
61283A958321j2804j1124q745o555m719k861j105l31j133k972m799o268p831r791
61269A877283j1757j3059j3289j2525j1365j0686j0859j1157j0393q181n130j797
61257A757085J884N944R794J2937J5817J9440K4277K9962L5996M2215M8674N5410
61245B059435O2478O9843P6981Q2689Q5513Q4346P8548O7704N1647L1125Q342
61234B758651j3554l1994m6136n6586o4153o8992p0819o9560o5652n9836n2719
$$ y = [1759046, 1782856, 1805591, 1826087, 1843288, 1857101, 1868223, 1877367, 1885070, 1892017, 1898954, 1906150, 1913333, 1920203, 1926868, 1933815, 1941668, 1950846, 1961165, 1971859, 1982243, 1992289, 2002240, 2011824, 2020247, 2027023, 2032347, 2036495, 2039177, 2039737, 2037726, 2033103, 2026071, 2017048, 2006696, 1995621, 1983953, 1971467, 1958321, 1945517, 1934393, 1925648, 1919093, 1914374, 1911513, 1910408, 1910077, 1908944, 1905972, 1901173, 1894905, 1887074, 1877283, 1865526, 1852467, 1839178, 1826653, 1815288, 1804602, 1793743, 1782586, 1772193, 1764012, 1758882, 1757085, 1758969, 1764913, 1774707, 1787644, 1803461, 1822901, 1847178, 1877140, 1913136, 1955351, 2004025, 2059435, 2121913, 2191756, 2268737, 2351426, 2436939, 2521285, 2599833, 2667537, 2719184, 2750309, 2758651, 2745097, 2713103, 2666967, 2610381, 2546228, 2477236, 2406417, 2336857, 2271205, 2211369, 2158650]
61223B158650m4664l5938k6880j7759q867j172L316K578l537j2880k2641l1141
61211A959065l7814m2315m4444m4695m3907m2402l9881l6233l1914k7574k3728
61200A544158k0744j8663j7139j5954j5474j6082j7326j8231j8426j8340j8327
61189A349452j8308j8243j8288j8308j7838j6752j5471j4383j3521j2896j2603
61178A172841j2431j1947j1052r983q774p251n607m295l277k160j133j008k158
61165A091765m250p170j1183j5792j9566k1727k2992k4117k4620k3903k2690k2142
61153H71613k2007k1097j9257j7621j6807j6105j4775j3185j2136j1780j1664
61142F95179j1431j0945j0036q565o736n050l927l360k895k010o15Q75K105L222
$$ y = [2158650, 2113986, 2078048, 2051168, 2033409, 2024542, 2023370, 2026686, 2029264, 2025727, 2012847, 1990206, 1959065, 1921251, 1878936, 1834492, 1789797, 1745890, 1703488, 1663607, 1627374, 1595460, 1567886, 1544158, 1523414, 1504751, 1487612, 1471658, 1456184, 1440102, 1422776, 1404545, 1386119, 1367779, 1349452, 1331144, 1312901, 1294613, 1276305, 1258467, 1241715, 1226244, 1211861, 1198340, 1185444, 1172841, 1160410, 1148463, 1137411, 1127428, 1118654, 1111403, 1105796, 1101501, 1098224, 1096064, 1094931, 1093923, 1091765, 1087515, 1080345, 1069162, 1053370, 1033804, 1012077, 989085, 964968, 940348, 916445, 893755, 871613, 849606, 828509, 809252, 791631, 774824, 758719, 743944, 730759, 718623, 706843, 695179, 683748, 672803, 662767, 654202, 647466, 642416, 638489, 635129, 632234, 630224, 629609, 630484, 632589, 635811]
61128F35811M615O320P966R222J0046J0492J0514R976Q700O549L681P22j531k696
61114G20387l076l233l335l015j927l63Q94J316J003L36m51j138j404j218j104
61099G03672j550k346k914l080l098l129l199l462l890l966l266k226j662j694
61085F64190j846j963k185k170j369j48M52K85L54J312K621L604M301M884N167
61070F77489N254N770O814P488P101O220N909O465P420Q237Q575Q359P979P923
61056G77003Q058P871P446P364P597P567P436Q058R421J0457J0814J1375J2537
61043H93004J3588J4426J6161J9061K1584K2748K3788K6107K9154L1926L5044
61032A146591L9366M3965M7512N0647N4839N9692O3468O5696O7354O9098P1363
$$ y = [635811, 640426, 646746, 654712, 663934, 673980, 684472, 694986, 704962, 713662, 720211, 723892, 724614, 723083, 720387, 717311, 714078, 710743, 707728, 705801, 705438, 706332, 707648, 708651, 708987, 708536, 707398, 705994, 704776, 703672, 702122, 699776, 696862, 693782, 690684, 687555, 684356, 680894, 677004, 673038, 669772, 667546, 665884, 664190, 662344, 660381, 658196, 656026, 654657, 654509, 654961, 655246, 655600, 656912, 659533, 663137, 667438, 672322, 677489, 682743, 688513, 695327, 702815, 709916, 716136, 722045, 728510, 735930, 744167, 752742, 761101, 769080, 777003, 785061, 792932, 800378, 807742, 815339, 822906, 830342, 838400, 847821, 858278, 869092, 880467, 893004, 906592, 921018, 937179, 956240, 977824, 1000572, 1024360, 1050467, 1079621, 1111547, 1146591, 1185957, 1229922, 1277434, 1328081, 1382920, 1442612, 1506080, 1571776, 1639130, 1708228, 1779591]
61021A779591P5487Q2719R2462J03376J15549J29667J44851J59629J74561J92009
61011C049901K14172K43572K83991L37802M03361M78382N64847O66892P85765
61002G028685R22855J087301J293565J548833J845332K157275K425144K537249
60994B0846239K358148J824613J037204K40805l14954n15394m02129r3129K82986
60985B5264389N81558O32956L10773l60385j180690j886239k303228k413492k303268
60976A6342374k076319j808995j549039j321901j132215r71390q30869p07827
60968E943819o01127n08451m28715l62852l10546k68843k34904k07685j86250
60959B834446j68658j53325j39742j27370j15515j04576r5583q8167q0775p3261
$$ y = [1779591, 1855078, 1937797, 2030259, 2133635, 2249184, 2378851, 2523702, 2683331, 2857892, 3049901, 3264073, 3507645, 3791636, 4129438, 4532799, 5011181, 5576028, 6242920, 7028685, 7951540, 9038841, 10332406, 11881239, 13726571, 15883846, 18308990, 20846239, 23204387, 25029000, 26066204, 26307009, 25992055, 25476661, 25074532, 24981403, 25264389, 25845947, 26478903, 26789676, 26429291, 25248601, 23362362, 21059134, 18645642, 16342374, 14266055, 12457060, 10908021, 9586120, 8453905, 7482515, 6651646, 5943819, 5342692, 4834241, 4405526, 4042674, 3732128, 3463285, 3228381, 3020696, 2834446, 2665788, 2512463, 2372721, 2245351, 2129836, 2025260, 1929677, 1841510, 1760735, 1687474]
60949A687474o7415o4297o2621o0495n7288n3158m8173m2699l7547l3014k8719
60938A132048k4756k1955k0510j9449j8043j6731j6061j5687j5026j4079j3052
60927I36699j1868j0538r437q742q254p999q321r175j0082j0919j1889j2606j2257
60914H04612j1049j0361j0855j1515j1266j0553j0449j0876j0821r908q819q267
60902F79873q183q012p333o279n406n086n024m708m230m124m362m266l568k791
60888F06501k291j649m55R09J778K054K161K509L305M370M973M298K448M04j114
60873F30201k160k779k677k037j723j912j461N31L128M582M506M012L920L884
60859F40015L232J820r0k037l319l335k261r52j30op16k528n367q481j0901j2094
$$ y = [1687474, 1620059, 1555762, 1493141, 1432646, 1375358, 1322200, 1274027, 1231328, 1193781, 1160767, 1132048, 1107292, 1085337, 1064827, 1045378, 1027335, 1010604, 994543, 978856, 963830, 949751, 936699, 924831, 914293, 904856, 896114, 887860, 879861, 871540, 862365, 852283, 841364, 829475, 816869, 804612, 793563, 783202, 772347, 760832, 749566, 739013, 728564, 717688, 706867, 696959, 688140, 679873, 671690, 663678, 656345, 650066, 644660, 639574, 634550, 629842, 625612, 621488, 617126, 612860, 609292, 606501, 604210, 602561, 602106, 603015, 604793, 606847, 609008, 611517, 614822, 619192, 624165, 628463, 630911, 631315, 630201, 628041, 625262, 622585, 620548, 618825, 616913, 615452, 615983, 619111, 623693, 628199, 632211, 636131, 640015, 643247, 645067, 644977, 642940, 639621, 636286, 634025, 633073, 632943, 632937, 632221, 629693, 624326, 615845, 604944, 592850]
60843E92850j2118j1339j0180r052q308q069p994p416o010m360l442l473l624
60830D97465l081j985j087q37j135j695k158k160j713j336j395j440o92Q44K250
60815D79845K692K235J569J275J429J705J722J388R78Q39J061J485J892K060J829
60800E04004J275P04L16M6j58j37J49L68K62P3J60L20lq97j840k409k734l064
60782D96435l310l227k857k473k258k191k214k343k612k949l120k852k160j487
60768D60382j363j820k264k030j020J96Q83P90L39K21P62J652K333K500K189J551
60752D65301P27m4m30k77J71M06J15n10r47q96n76l81l41j41L58Q78J090R56N74
60733D66033m8p91j294j325j175j394k125l012l736m301m783n110n184n042m741
$$ y = [592850, 580732, 569393, 559213, 550161, 541853, 533784, 525790, 518374, 512364, 508004, 504562, 501089, 497465, 494384, 492399, 491312, 490475, 489340, 487645, 485487, 483327, 481614, 480278, 478883, 477443, 476751, 477595, 479845, 482537, 484772, 486341, 487616, 489045, 490750, 492472, 493860, 494838, 495677, 496738, 498223, 500115, 502175, 504004, 505279, 505983, 506299, 506345, 506187, 506050, 506199, 506567, 506829, 506902, 507062, 507382, 507379, 506482, 504642, 502233, 499499, 496435, 493125, 489898, 487041, 484568, 482310, 480119, 477905, 475562, 472950, 470001, 466881, 464029, 461869, 460382, 459019, 457199, 454935, 452905, 451885, 452081, 452964, 453754, 454093, 454314, 455076, 456728, 459061, 461561, 463750, 465301, 466028, 465984, 465554, 465277, 465448, 465854, 465969, 465459, 464512, 463616, 463040, 462659, 462318, 462177, 462535, 463413, 464503, 465459, 466033, 465985, 465194, 463900, 462575, 461400, 460006, 457881, 454869, 451133, 446832, 442049, 436939, 431755, 426713, 421972]
60718D21972m332m017m103m580m940m666l852l138l008l342l617l399k604j512
60704C70862n89j84k34l83m38n20o48l58P81K327L085K380R66K17O01J360J683
60687C80908J601J589J810K166K698L410L911L797L360L309L743M017L763L431
60673D23513L406L214K268R63K46K43K23o1J68J483L235M293M352L950L641L661
60657D58798M063M470L971K117j00j105o84k80j125k834m282n070n536n814n763
60642D40826n487n240m886m125l182k692k779k872k581k212k154k275k246k179
60628C95916k459l065l462l192k353j405p09l81m81j053j849k186j506j33P99
60613C72481N11n17j143r61o88j025j581j328L4J631K438K395K221K371K528K189
$$ y = [421972, 417640, 413623, 409520, 404940, 400000, 395334, 391482, 388344, 385336, 381994, 378377, 374978, 372374, 370862, 370273, 370089, 369855, 369472, 369034, 368514, 367866, 367508, 368289, 370616, 373701, 376081, 377047, 377264, 377865, 379225, 380908, 382509, 384098, 385908, 388074, 390772, 394182, 398093, 401890, 405250, 408559, 412302, 416319, 420082, 423513, 426919, 430133, 432401, 433364, 433610, 433853, 434076, 434015, 434183, 435666, 438901, 443194, 447546, 451496, 455137, 458798, 462861, 467331, 471302, 473419, 473319, 472214, 471530, 471250, 470125, 467291, 463009, 457939, 452403, 446589, 440826, 435339, 430099, 425213, 421088, 417906, 415214, 412435, 409563, 406982, 404770, 402616, 400341, 398095, 395916, 393457, 390392, 386930, 383738, 381385, 379980, 379271, 378890, 378409, 377356, 375507, 373321, 371815, 371682, 372481, 372992, 372475, 371332, 370371, 369683, 368658, 367077, 365749, 365783, 367414, 369852, 372247, 374468, 376839, 379367, 381556]
60597C81556J354M05l71q89j023p08k21Ql1J18P51J524J764J105k06j394j585
60580C82157n12J094K122K214J971J942J949J658J362J669K605L525L858L655
60566D11269L364L283L254K885K119J502J553J982K063J785J933K795L561L605
60552D46953L574M486O193P693Q634R634J1237J3399J6011J9085K2324K5299K8252
60539F22774L2055L7072M2627M7745N1875N4555N4911N1992M5448L5672K3493
60528A100219R842m362j8132l0131l8841m3422m4415m3156m0605l7127l3127k9136
60516G47607k5204k0892j6123j1535p776m843k314K76L358P119J1142J4754J7936
60503G13505K1467K5927L1088L6494M2077M7678N2280N4312N2688M7410L9210
$$ y = [381556, 382910, 383315, 382944, 382055, 381032, 380324, 380103, 380111, 380080, 380198, 380949, 382473, 384237, 385342, 385136, 383742, 382157, 381645, 382739, 384861, 387075, 389046, 390988, 392937, 394595, 395957, 397626, 400231, 403756, 407614, 411269, 414633, 417916, 421170, 424055, 426174, 427676, 429229, 431211, 433274, 435059, 436992, 439787, 443348, 446953, 450527, 455013, 461206, 468899, 477533, 487167, 498404, 511803, 527814, 546899, 569223, 594522, 622774, 654829, 691901, 734528, 782273, 834148, 888703, 943614, 995606, 1041054, 1076726, 1100219, 1110061, 1105699, 1087567, 1057436, 1018595, 975173, 930758, 887602, 846997, 809870, 776743, 747607, 722403, 701511, 685388, 673853, 666077, 661234, 658920, 659196, 662554, 669673, 680815, 695569, 713505, 734972, 760899, 791987, 828481, 870558, 918236, 970516, 1024828, 1077516, 1124926, 1164136]
60492A164136K8871J6965M272p537j6064j9610j8389j4006p809k21Q578J8109
60480A157295K7911L7712M6988N4683N9461N9933N4790M3493K7015P424j3334
60469A563371l3707n1914o6147p5677q0961q2461q0270p5126o8691o2189n5646
60458H30582m9010m3065l8443l4583l0625k6679k3366k0652j8041j5465j3160
60447E17493j1041r028p515o725n966m509k753j665j351j163q84p82p01j98N11
60432D63723P79O97R51J405R93o40k392l064k677k027j607j435j368j131m99K80
60416D51988P08Q94J612L153M706N363N287N416O305P619Q594Q728Q227P996Q888
60401E35484J0747J2518J3416J3610J3633J3661J3704J3894J4066J3466J1535
$$ y = [1164136, 1193007, 1209972, 1214244, 1206707, 1190643, 1171033, 1152644, 1138638, 1130829, 1130608, 1139186, 1157295, 1185206, 1222918, 1269906, 1324589, 1384050, 1443983, 1498773, 1542266, 1569281, 1576705, 1563371, 1529664, 1477750, 1411603, 1335926, 1254965, 1172504, 1092234, 1017108, 948417, 886228, 830582, 781572, 738507, 700064, 665481, 634856, 608177, 584811, 564159, 546118, 530653, 517493, 506452, 497424, 489909, 483184, 477218, 472709, 469956, 468291, 466940, 465777, 464893, 464111, 463410, 463212, 463723, 464502, 465199, 466150, 467555, 468548, 467908, 465516, 462452, 459775, 457748, 456141, 454706, 453338, 452207, 451708, 451988, 452696, 453590, 455202, 458355, 463061, 468424, 473711, 479127, 485432, 493051, 501645, 510373, 518600, 526596, 535484, 546231, 558749, 572165, 585775, 599408, 613069, 626773, 640667, 654733, 668199, 679734]
60390F79734Q789O322M561L130J921J502K215L365L852L329K356J527Q93K62l37
60375G23421p66j095j507j975k256k245k095j964j787j432r06m09k21n27j166
60360G03070j662j668j371j232j350j438j383j383j471j329q07k48j21n80j548
60345F85479k771l751m091m102m502n219n260m141k780k297k577k815k881l233
60331F35059l840m237m441m789m990m378l168k392k502k929l300l968n006n684
60317E79435n569n248n325n424n007m438m323m248l203j106J021K407L201L745
60303E45918M014M148M771O255Q011R049R026Q317P209N552L263O38k042m802
60289F09327p558r652j0285r354p520n477l523j775k97J037K375L413L621L170
$$ y = [679734, 688523, 694845, 699406, 702536, 704457, 705959, 708174, 711539, 715391, 718720, 721076, 722603, 723496, 723758, 723421, 722655, 721560, 720053, 718078, 715822, 713577, 711482, 709518, 707731, 706299, 705393, 704984, 704763, 704236, 703070, 701408, 699740, 698369, 697137, 695787, 694349, 692966, 691583, 690112, 688783, 687976, 687728, 687607, 687027, 685479, 682708, 678957, 674866, 670764, 666262, 661043, 655783, 651642, 648862, 646565, 643988, 641173, 638292, 635059, 631219, 626982, 622541, 617752, 612762, 608384, 605216, 602824, 600322, 597393, 594093, 590125, 585119, 579435, 573866, 568618, 563293, 557869, 552862, 548424, 544101, 539853, 536650, 535544, 536565, 538972, 542173, 545918, 549932, 554080, 558851, 565106, 573117, 582166, 591192, 599509, 606718, 612270, 615533, 616171, 614129, 609327, 601769, 592117, 581832, 572478, 564958, 559481, 555958, 554183, 553886, 554923, 557298, 560711, 564332, 567502]
60275E67502L003L673M596M990N029N467O471P564Q474R322J0110J0664J1109
60262F57974J1732J2491J3193J4042J5332J6648J7131J6623J5822J5156J4282
60251H20426J2919J1484J0470R807R256R065R688J1189J3224J5402J7488J9448
60239I69866K1449K3610K5759K7813L0367L4197L9113M3856M7537N0578N3905
60228A368050N7696O1433O4699O7426O9590P1164P2168P2338P1027O7877O3442
60217B106910N8715N4080M9112M3334L6868L0211K3672J7171J0581M164j486o036
60205B427296r746j2933j5306j6303j5941j4814j3136j0435o420j589L400Q591
60193B322664J4525K1420K8863L6203M2999M9225N5043O0198O3756O4880O3806
$$ y = [567502, 570505, 574178, 578774, 583764, 588793, 594260, 600731, 608295, 616769, 626091, 636201, 646865, 657974, 669706, 682197, 695390, 709432, 724764, 741412, 758543, 775166, 790988, 806144, 820426, 833345, 844829, 855299, 865106, 874362, 883427, 893115, 904304, 917528, 932930, 950418, 969866, 991315, 1014925, 1040684, 1068497, 1098864, 1133061, 1172174, 1216030, 1263567, 1314145, 1368050, 1425746, 1487179, 1551878, 1619304, 1688894, 1760058, 1832226, 1904564, 1975591, 2043468, 2106910, 2165625, 2219705, 2268817, 2312151, 2349019, 2379230, 2402902, 2420073, 2430654, 2434818, 2433332, 2427296, 2417550, 2404617, 2389311, 2373008, 2357067, 2342253, 2329117, 2318682, 2312262, 2310673, 2314073, 2322664, 2337189, 2358609, 2387472, 2423675, 2466674, 2515899, 2570942, 2631140, 2694896, 2759776, 2823582]
60182B823582O1445N7955N2504M4704L5450K5830J5898N167o192j7482k8409l9141
60170C031311m9485n8709o6073p1157p3757p3901p1858o7784o1644n3817m5449
60159B337677l7575l0067k2056j3289m465L645J0784J6880K1681K4899K6417K6255
60147B360786K4543K1465J7009J1031L982k889q589j3430j8294k3005k6271k7332
60135B319006k6765k5430k3343k0096j5734j0648m968J443Q639J6709K5927L6357
60123B281097M7392N8218O8739P9569R1161J03281J15455J27504J39343J50425
60113C262184J59780J66581J70537J71715J70256J66232J59546J49779J36361
60104D712971J19279R9497P8443N7026L5335J3177r415l2158n4481p5390r3765
$$ y = [2823582, 2885027, 2942982, 2995486, 3040190, 3075640, 3101470, 3117368, 3122535, 3116343, 3098861, 3070452, 3031311, 2981826, 2923117, 2857044, 2785887, 2712130, 2638229, 2566371, 2498587, 2436943, 2383126, 2337677, 2300102, 2270035, 2247979, 2234690, 2230225, 2233870, 2244654, 2261534, 2283215, 2308114, 2334531, 2360786, 2385329, 2406794, 2423803, 2434834, 2438816, 2435927, 2427338, 2413908, 2395614, 2372609, 2346338, 2319006, 2292241, 2266811, 2243468, 2223372, 2207638, 2196990, 2192022, 2193465, 2202104, 2218813, 2244740, 2281097, 2328489, 2386707, 2455446, 2535015, 2626176, 2729457, 2844912, 2972416, 3111759, 3262184, 3421964, 3588545, 3759082, 3930797, 4101053, 4267285, 4426831, 4576610, 4712971, 4832250, 4931747, 5010190, 5067216, 5102551, 5115728, 5106313, 5074155, 5019674, 4944284, 4850519]
60093D850519j09067j21438j31011j37529j40894j41533j39731j35064j27168
60084C667084j16856j05679r4334q2182o8517n3819l9367k5951j3346r25J1415
60073C077523K2959L2636L9782M4394M6733M6858M4671M0177L3534K4966J4890
60062C469123L981p133j8151k8836l8752m7595n5567o2957o9444p4406p7837q0261
60050B912165q1622q0923p7397p1600o4898n8199n1536m4517l6714k7862j8164
60039B298733q351J032J0238J9836K9715L9149M7769N5756O2895O8176P0790P1024
60027B766762O9469O5812N9232M9929L9392K8963J8796Q422k355j3536k5144l6746
60015C028996m7226n5731o2459o7837p1200p1341o8300o3696n8986n4186m8579
$$ y = [4850519, 4741452, 4620014, 4489003, 4351474, 4210580, 4069047, 3929316, 3794252, 3667084, 3550228, 3444549, 3350215, 3268033, 3199516, 3145697, 3106330, 3080379, 3067033, 3066108, 3077523, 3100482, 3133118, 3172900, 3217294, 3264027, 3310885, 3355556, 3395733, 3429267, 3454233, 3469123, 3473104, 3465971, 3447820, 3418984, 3380232, 3332637, 3277070, 3214113, 3144669, 3070263, 2992426, 2912165, 2830543, 2749620, 2672223, 2600623, 2535725, 2477526, 2425990, 2381473, 2344759, 2316897, 2298733, 2290382, 2291414, 2301652, 2321488, 2351203, 2390352, 2438121, 2493877, 2556772, 2624948, 2695738, 2766762, 2836231, 2902043, 2961275, 3011204, 3050596, 3079559, 3098355, 3106777, 3104422, 3090886, 3065742, 3028996, 2981770, 2926039, 2863580, 2795743, 2724543, 2653202, 2584902, 2521206, 2462220, 2408034, 2359455]
60004B359455m1889l4241k5642j6209o544K690J1446K0051K8617L7055M5556N4451
59992B434796O3665P2652Q0873Q8019R3836R7924R9738R8699R4516Q7506P8367
59981C390591O7434N4537L9851K4470R651m310j7976l1711m5141n7516o8104p6218
59969C285558q1236q2819q0991p6244o9602o2274n4740m6446l6805k6274j5833
59958B652294n696M729J5537K5792L4612M2214M9338N5994O1261O4329O5372O5232
59946C131008O4365O2353N8535N2951M6307L9073L1206K3042J5735J0163N808
59935C540546J536k619n314n533l516J98N849J4032K4714L7198N0782O5016P9595
59922C802484R4408J09519J24753J39413J52722J64250J73577J79675J81114J76925
$$ y = [2359455, 2317566, 2283325, 2257683, 2241474, 2234930, 2237620, 2249066, 2269117, 2297734, 2334789, 2380345, 2434796, 2498461, 2571113, 2651986, 2740005, 2833841, 2931765, 3031503, 3130202, 3224718, 3312224, 3390591, 3458025, 3512562, 3552413, 3576883, 3586534, 3582224, 3564248, 3532537, 3487396, 3429880, 3361776, 3285558, 3204322, 3121503, 3040512, 2964268, 2894666, 2832392, 2777652, 2731206, 2694401, 2668127, 2652294, 2646598, 2651327, 2666864, 2692656, 2727268, 2769482, 2818820, 2874814, 2936075, 3000404, 3065776, 3131008, 3195373, 3257726, 3316261, 3369212, 3415519, 3454592, 3485798, 3508840, 3524575, 3534738, 3540546, 3542082, 3539463, 3534149, 3528616, 3525100, 3525298, 3531147, 3545179, 3569893, 3607091, 3657873, 3722889, 3802484, 3896892, 4006411, 4131164, 4270577, 4423299, 4587549, 4761126, 4940801, 5121915, 5298840]
59912E298840J66845J50759J28380R9885O6677L1165m270l8045o9179r6628j19092
59901E615337j35444j45271j49020j47687j42395j34043j23262j10633r6778q2083
59891D348721o6505n0003l3138j6753r73J5020L1908M9294O6235Q2253R7315J11029
59879D634403J22360J30034J32700J28925J17789R9734P6442M9745K1086q002
59869E505216l5677o0469q1862r9840j14252j24980j32430j37179j39246j38186
59859D441095j34046j27754j20332j11915j01880q9860p6346o2234m8080l3973
59849C534675j9929o131P120J9305K9666L7631M3429M7963N1999N5766N9315O2553
59837C923362O4572O3509N7657M6670L1373J2928p287k7202m4370n7008o4673
$$ y = [5298840, 5465685, 5616444, 5744824, 5844709, 5911386, 5942551, 5938281, 5900236, 5831057, 5734429, 5615337, 5479893, 5334622, 5185602, 5037915, 4895520, 4761477, 4638215, 4527582, 4430804, 4348721, 4282216, 4232213, 4199075, 4182322, 4181349, 4196369, 4228277, 4277571, 4343806, 4426059, 4523374, 4634403, 4756763, 4886797, 5019497, 5148422, 5266211, 5365945, 5442387, 5492132, 5513218, 5505216, 5469539, 5409070, 5327208, 5227368, 5113116, 4988136, 4855706, 4718527, 4579281, 4441095, 4307049, 4179295, 4058963, 3947048, 3845168, 3755308, 3678962, 3616728, 3568648, 3534675, 3514746, 3508615, 3515735, 3535040, 3564706, 3602337, 3645766, 3693729, 3745728, 3801494, 3860809, 3923362, 3987934, 4051443, 4109100, 4155770, 4187143, 4200071, 4192784, 4165582, 4121212, 4064204, 3999531]
59826C999531o8060o8506o7546o6363o5514o5262o5887o7306o8703o9068o8098
59815C259218o6102o3208n9207n4173m8754m3805m0062l7915l7020l6312l5005
59804B737655l3506l2687l2414l1557k9454k6458k2855j8112j1662l792M725J3390
59792B513273K2131L1182M1301N3475O7923Q3680R9668J15834J32755J50272J66869
59781C478363J80077J86992J84485J69599J40541R8001M5965q988n9921j01801
59771D313313j31989j49570j55171j51357j41910j29876j16583j02580q8599p5148
59761C070530o1942m8703l6123k5336j6671r510l086L128R540J6189K2529K8042
59749B948587L3026L8246M3943M9763N5593O1881O9054P7145Q6058R5727J06001
$$ y = [3999531, 3931471, 3862965, 3795419, 3729056, 3663542, 3598280, 3532393, 3465087, 3396384, 3327316, 3259218, 3193116, 3129908, 3070701, 3016528, 2967774, 2923969, 2883907, 2845992, 2808972, 2772660, 2737655, 2704149, 2671462, 2639048, 2607491, 2578037, 2551579, 2528724, 2510612, 2498950, 2495158, 2499883, 2513273, 2535404, 2566586, 2607887, 2661362, 2729285, 2812965, 2912633, 3028467, 3161222, 3311494, 3478363, 3658440, 3845432, 4029917, 4199516, 4340057, 4438058, 4484023, 4475035, 4415114, 4313313, 4181324, 4031754, 3876583, 3725226, 3583316, 3453440, 3336857, 3234277, 3145678, 3070530, 3008588, 2959885, 2923762, 2898426, 2881755, 2872245, 2869159, 2872287, 2881827, 2898016, 2920545, 2948587, 2981613, 3019859, 3063802, 3113565, 3169158, 3231039, 3300093, 3377238, 3463296, 3559023, 3665024]
59738C665024J16750J28245J40964J54927J69568J84429J99587K15262K31276
59729E206032K47131K62322K76274K87952K95766K98003K93606K82743K66686
59720G716515K47116K25679K04222J84963J69901J59947J54957J54503J58114
59711I375917J64683J72135J78304J81885J82368J79196J71660J59692J44256
59702A0910096J26528J06861Q5157O2174L9918K0460M665p546j6049k0188j9437
59691A1292639j3875l774J0902L0407N4655Q2823J13518J45470J78252K12046
59681A2103063K46395K79539L09373L34717L54912L68364L72465L65096L45380
59672A5079304L12686K65942K04716J30689M7639l9589j25858k06323k77269l36381
$$ y = [3665024, 3781774, 3910019, 4050983, 4205910, 4375478, 4559907, 4759494, 4974756, 5206032, 5453163, 5715485, 5991759, 6279711, 6575477, 6873480, 7167086, 7449829, 7716515, 7963631, 8189310, 8393532, 8578495, 8748396, 8908343, 9063300, 9217803, 9375917, 9540600, 9712735, 9891039, 10072924, 10255292, 10434488, 10606148, 10765840, 10910096, 11036624, 11143485, 11228642, 11290816, 11330734, 11351194, 11355859, 11348313, 11332264, 11312076, 11292639, 11278764, 11274990, 11285892, 11316299, 11370954, 11453777, 11567295, 11712765, 11891017, 12103063, 12349458, 12628997, 12938370, 13273087, 13627999, 13996363, 14368828, 14733924, 15079304, 15391990, 15657932, 15862648, 15993337, 16040976, 16001387, 15875529, 15669206, 15391937, 15055556]
59662A5055556l81946m12422m27462m28992m20493m05535l87728l71747l63052
59653A1456179l65654l80060m03013m28787m51026m64693m67479m59867m43984
59644G591616m22401l97525l71314l45085l19564k95149k72026k50213k29637
59635D688702k10159j91449j73213j55692j39608j25253j11987r9095q6790p5859
59625C319597o6550n8486n1516m5890m1580l8064l5019l2656l1171l0299k9684
59614B858682k9346k9509l0259l1465l2866l4235l5651l7464l9608m1061m0668
59603B476550l8540l6017l4080l2394l0210k7585k5189k3428k2290k1742k1624
59592B163451k1344k0237j8202j5602j2653r325n786k462M57L124N600P694R445
$$ y = [15055556, 14673610, 14261188, 13833726, 13404734, 12984241, 12578706, 12190978, 11819231, 11456179, 11090525, 10710465, 10307452, 9878665, 9427639, 8962946, 8495467, 8035600, 7591616, 7169215, 6771690, 6400376, 6055291, 5735727, 5440578, 5168552, 4918339, 4688702, 4478543, 4287094, 4113881, 3958189, 3818581, 3693328, 3581341, 3482246, 3395456, 3319597, 3253047, 3194561, 3143045, 3097155, 3055575, 3017511, 2982492, 2949836, 2918665, 2888366, 2858682, 2829336, 2799827, 2769568, 2738103, 2705237, 2671002, 2635351, 2597887, 2558279, 2517218, 2476550, 2438010, 2401993, 2367913, 2335519, 2305309, 2277724, 2252535, 2229107, 2206817, 2185075, 2163451, 2142107, 2121870, 2103668, 2088066, 2075413, 2066088, 2060302, 2057840, 2058297, 2061421, 2067021, 2074715, 2084160]
59579B084160J1334J3740J6392J8754K0771K2908K5488K8352L1284L4488L8366
59568B346037M2995M7989N2870N7467O1914O6436P1132P5860Q0365Q4559Q8703
59557C076327R3217R8223J03316J07787J11147J13479J15231J16614J17231J16371
59547D168943J13486J08025R8886Q4801O5862M4378K3560N352j0205k3824l6009
59536D643255m7179n7749o7629p6059q2367q6475q8445q8034q5102q0005p3099
59525C811112o4209n3099m0151k6099j1266M456K1107L8567N6762P5437R3835
59514C906452J11028J26340J38938J47341J50008J46425J36951J21619R9930P2119
59504E157151M0013O110k7837o0901r1993j19332j41076j56292j65231j68738
$$ y = [2084160, 2095494, 2109234, 2125626, 2144380, 2165151, 2188059, 2213547, 2241899, 2273183, 2307671, 2346037, 2389032, 2437021, 2489891, 2547358, 2609272, 2675708, 2746840, 2822700, 2903065, 2987624, 3076327, 3169544, 3267767, 3371083, 3478870, 3590017, 3703496, 3818727, 3935341, 4052572, 4168943, 4282429, 4390454, 4489340, 4574141, 4640003, 4684381, 4707941, 4713293, 4703088, 4679264, 4643255, 4596076, 4538327, 4470698, 4394639, 4312272, 4225797, 4137352, 4049318, 3964216, 3884211, 3811112, 3746903, 3693804, 3653653, 3627554, 3616288, 3620744, 3641851, 3680418, 3737180, 3812617, 3906452, 4017480, 4143820, 4282758, 4430099, 4580107, 4726532, 4863483, 4985102, 5085032, 5157151, 5197164, 5203274, 5175437, 5114536, 5022543, 4903211, 4762135, 4605843, 4440612, 4271874]
59494D271874j67530j62092j53148j41797j28968j15015j00130q4827o9586n4258
59484C094523l8487k2660p810N542J7848K9653M0799N0827N9654O7360P3507P7209
59472C447965P7828P5348P0078O2210N1690L8370K2317M106j5294l4876n3757
59461C745985p1018q5795r7723j07082j14250j19159j21529j21456j19487j16135
59451B672351j11665j06322j00502r4527q8522q2531p6662p0927o5152n9256n3461
59440A762824m8059m3054l8298l3931l0267k7165k3886j9870j5373j1088p313
59429A464520l820m03K852N804Q452J0871J3115J5015J5797J4210R643L237k590
59416A556703n789n696k770J874O726J0704J4022J7495K0620K1325J8346J3228
$$ y = [4271874, 4104344, 3942252, 3789104, 3647307, 3518339, 3403324, 3303194, 3218367, 3148781, 3094523, 3056036, 3033376, 3025566, 3031108, 3048956, 3078609, 3119408, 3170235, 3229889, 3297249, 3370756, 3447965, 3525793, 3601141, 3671219, 3733429, 3785119, 3823489, 3845806, 3849912, 3834618, 3799742, 3745985, 3674967, 3589172, 3491449, 3384367, 3270117, 3150958, 3029429, 2907973, 2788486, 2672351, 2560686, 2454364, 2353862, 2259335, 2170813, 2088282, 2011620, 1940693, 1875541, 1816285, 1762824, 1714765, 1671711, 1633413, 1599482, 1569215, 1542050, 1518164, 1498294, 1482921, 1471833, 1464520, 1460700, 1460297, 1463149, 1468953, 1477405, 1488276, 1501391, 1516406, 1532203, 1546413, 1556056, 1559293, 1556703, 1550914, 1545218, 1542448, 1544322, 1551048, 1561752, 1575774, 1593269, 1613889, 1635214, 1653560, 1666788]
59404A666788R139Q106J0044J3875J8579K3322K7649L1793L6248M1040M5972N1286
59392A983841N7369O3849O9874P5423Q1441Q8464R5796J02473J08339J13744J18784
59381B959397J23433J28058J33241J39284J46418J55318J66909J81568J98822
59372D332448K17798K37567K57000K74718K89503L00565L07150L08076L02269
59363F827094K89995K73102K53669K32592K09953J86353J62984J40282J17232
59354H693256R2393O5014L4911J948l3871p2255j12956j55635j98858k39846k75937
59343G798164l05813l28672l43012l47536l42988l31887l16391k97466k76148
59334D908251k54354k33779k14876j97437j81637j67889j56116j45731j36073
$$ y = [1666788, 1675927, 1684033, 1694077, 1707952, 1726531, 1749853, 1777502, 1809295, 1845543, 1886583, 1932555, 1983841, 2041210, 2105059, 2174933, 2250356, 2331797, 2420261, 2516057, 2618530, 2726869, 2840613, 2959397, 3082830, 3210888, 3344129, 3483413, 3629831, 3785149, 3952058, 4133626, 4332448, 4550246, 4787813, 5044813, 5319531, 5609034, 5909599, 6216749, 6524825, 6827094, 7117089, 7390191, 7643860, 7876452, 8086405, 8272758, 8435742, 8576024, 8693256, 8785649, 8850663, 8885574, 8887522, 8853651, 8781396, 8668440, 8512805, 8313947, 8074101, 7798164, 7492351, 7163679, 6820667, 6473131, 6130143, 5798256, 5481865, 5184399, 4908251, 4653897, 4420118, 4205242, 4007805, 3826168, 3658279, 3502163, 3356432, 3220359]
59325C220359j26663j17265j07997r9205r1118q3758p7124p1096o5247n9199n3191
59314B268496m7946m3879m0749l8026l5250l2151k8830k5657k2579j8814j3843
59303A920772q372l447J049O106J1907J7540K2299K5997K7761K6064K0866J4688
59291B083230J0691J0253J2897J7630K3376K8906L3565L7727M1779M5039M6522
59280B391615M6247M4771M1762L6261K8325J9269R985Q5j0889k2137l2211m0462
59268B512621m7194n2696n6744n9150o0235o0484o0062n8940n7314n5485n3372
59257A890945n0619m7295m4012m1063l7922l4104l0034k6401k2994j9035j4557
59246A522909j0472p182m048n38K997O100R011J2096J5152J7935K0827K4334K8323
$$ y = [3220359, 3093696, 2976431, 2868434, 2769229, 2678111, 2594353, 2517229, 2446133, 2380886, 2321687, 2268496, 2220550, 2176671, 2135922, 2097896, 2062646, 2030495, 2001665, 1976008, 1953429, 1934615, 1920772, 1912400, 1908953, 1910002, 1916108, 1928015, 1945555, 1967854, 1993851, 2021612, 2047676, 2068542, 2083230, 2093921, 2104174, 2117071, 2134701, 2158077, 2186983, 2220548, 2258275, 2300054, 2345093, 2391615, 2437862, 2482633, 2524395, 2560656, 2588981, 2608250, 2618235, 2618320, 2607431, 2585294, 2553083, 2512621, 2465427, 2412731, 2355987, 2296837, 2236602, 2176118, 2116056, 2057116, 1999802, 1944317, 1890945, 1840326, 1793031, 1749019, 1707956, 1670034, 1635930, 1605896, 1579495, 1556501, 1537466, 1522909, 1512437, 1505255, 1501207, 1500669, 1503666, 1509766, 1518777, 1530873, 1546025, 1563960, 1584787, 1609121, 1637444]
59233A637444L2432L6846M1994M7630N2986N7887O3133O9694P7829Q7117R7082
59222B302074J07640J18993J31159J43745J56294J68742J81122J92860K02702
59213C705331K09271K11347K07655J97082J79292J54736J24038Q7963M8023O351
59203E131089l5340p5968j14050j47248j73515j92150k03424k07864k06351k00162
59193C575017j90349j77570j62929j48158j34268j20766j06917r3146q0379o8779
59183B291756n7967m7979l8904l0170k1262j2802n847l93M325Q238J0383J0326
59171B109704Q498N020o17q356j7031k5421l3041l9680m4894m8407n0348n0848
59159A804579m9974m8285m6663m5345m3720m1371l8614l5736l2469k8714k5075
$$ y = [1637444, 1669876, 1706722, 1748716, 1796346, 1849332, 1907219, 1970352, 2040046, 2117875, 2204992, 2302074, 2409714, 2528707, 2659866, 2803611, 2959905, 3128647, 3309769, 3502629, 3705331, 3914602, 4125949, 4333604, 4530686, 4709978, 4864714, 4988752, 5076715, 5124738, 5131089, 5095749, 5019781, 4905731, 4758483, 4584968, 4392818, 4189394, 3981530, 3775179, 3575017, 3384668, 3207098, 3044169, 2896011, 2761743, 2640977, 2534060, 2440914, 2360535, 2291756, 2233789, 2185810, 2146906, 2116736, 2095474, 2082672, 2076825, 2076432, 2080757, 2088995, 2099378, 2109704, 2118202, 2123222, 2122605, 2114249, 2097218, 2071797, 2038756, 1999076, 1954182, 1905775, 1855427, 1804579, 1754605, 1706320, 1659657, 1614312, 1570592, 1529221, 1490607, 1454871, 1422402, 1393688, 1368613]
59148A368613k2126j9645j7195j4950j3202j1466q831n257j796N69J858K805L962
59135A263339N284O315O656O365N980O031O432O531N880M886M470N072O156O895
59121A346292P169P551Q338R087R342R517J0518J2542J4638J5650J5399J4788
59109A480831J4753J5296J5704J5587J5368J5581J6019J6110J5938J6240J7334
59098A654761J8723K0016K1566K3808K6422K8869L1279L4208L7613M0681M2699
59087A980645M3624M3756M3085M1148L7455L2044K5509J8246R866j67j1294k1937
59075B241980l1026l8717m5362n0528n3732n5439n6495n6952n6222n4185n1447
59064A691875m8669m6230m4315m2700m0714l8003l5110l2781l0950k9010k6794
$$ y = [1368613, 1346487, 1326842, 1309647, 1294697, 1281495, 1270029, 1261198, 1255941, 1254145, 1254714, 1256572, 1259377, 1263339, 1268623, 1274938, 1281594, 1287959, 1293939, 1299970, 1306402, 1312933, 1318813, 1323699, 1328169, 1333241, 1339397, 1346292, 1353461, 1361012, 1369350, 1378437, 1387779, 1397296, 1407814, 1420356, 1434994, 1450644, 1466043, 1480831, 1495584, 1510880, 1526584, 1542171, 1557539, 1573120, 1589139, 1605249, 1621187, 1637427, 1654761, 1673484, 1693500, 1715066, 1738874, 1765296, 1794165, 1825444, 1859652, 1897265, 1937946, 1980645, 2024269, 2068025, 2111110, 2152258, 2189713, 2221757, 2247266, 2265512, 2275378, 2275211, 2263917, 2241980, 2210954, 2172237, 2126875, 2076347, 2022615, 1967176, 1910681, 1853729, 1797507, 1743322, 1691875, 1643206, 1596976, 1552661, 1509961, 1469247, 1431244, 1396134, 1363353, 1332403, 1303393, 1276599]
59053A276599k4583k2430k0286j8482j7268j6078j4124j1654r758q940q771q900
59041A095325r446j0235j0598j0283r802r580r333q696p772o779n616m159k572
59028I90454j046M00J726K816L738M672N524O016O235O618P369Q343R522J1046
59014A063433J2743J4177J5259J6351J7681J9195K0962K3144K5523K7668K9710
59003A285846L2315L5754L9555M3178M6362M8675M9486M8643M6589M3439L8503
58992A758345L1156K1819J1802K485n253j1388j6660k1753k6381k9660l1334l1963
58980A651215l1893l0900k9141k7573k6805k6247k4969k2954k0895j9135j7333
58969A373370j4965j1775p893l873l48K523M992P023Q224Q663R107R984J0657
$$ y = [1276599, 1252016, 1229586, 1209300, 1190818, 1173550, 1157472, 1143348, 1131694, 1121936, 1112996, 1104225, 1095325, 1085879, 1075644, 1065046, 1054763, 1044961, 1035381, 1026048, 1017352, 1009580, 1002801, 997185, 993026, 990454, 989408, 989808, 991534, 994350, 998088, 1002760, 1008284, 1014300, 1020535, 1027153, 1034522, 1042865, 1052387, 1063433, 1076176, 1090353, 1105612, 1121963, 1139644, 1158839, 1179801, 1202945, 1228468, 1256136, 1285846, 1318161, 1353915, 1393470, 1436648, 1483010, 1531685, 1581171, 1629814, 1676403, 1719842, 1758345, 1789501, 1811320, 1823122, 1825607, 1820354, 1808966, 1792306, 1770553, 1744172, 1714512, 1683178, 1651215, 1619322, 1588422, 1559281, 1531708, 1504903, 1478656, 1453687, 1430733, 1409838, 1390703, 1373370, 1358405, 1346630, 1338737, 1334864, 1334516, 1337039, 1342031, 1349054, 1357278, 1365941, 1375048, 1385032, 1395689]
58956A395689J0319R183Q223P969Q173Q480Q869R488J0495J2070J4223J6597J8676
58943A538454K0324K1893K3891K6644L0240L4668L9814M5313N0539N5081N9309
58932A946170O3920O8620P1595P0962O6556N9828N2300M4788L7988L2859L0175
58921B545761L0211L2896L7716M3561M9458N5565O2723P0954P9286Q7264R5699
58910C191094J05484J16387J27564J38595J49588J60769J72413J84664J96994
58901D543552K08282K17650K24777K29260K30393K28031K23031K16528K09212
58892F530716K01434J93138J83348J70517J53909J33918J10769Q3891N3302K0554
58882G835496j2520m5306p7699j08668j36721j61325j82757k00702k14187k23005
$$ y = [1395689, 1406008, 1415191, 1423414, 1431383, 1439556, 1448036, 1456905, 1466393, 1476888, 1488958, 1503181, 1519778, 1538454, 1558778, 1580671, 1604562, 1631206, 1661446, 1696114, 1735928, 1781241, 1831780, 1886861, 1946170, 2010090, 2078710, 2150305, 2221267, 2287823, 2347651, 2399951, 2444739, 2482727, 2515586, 2545761, 2575972, 2608868, 2646584, 2690145, 2739603, 2795168, 2857891, 2928845, 3008131, 3095395, 3191094, 3296578, 3412965, 3540529, 3679124, 3828712, 3989481, 4161894, 4346558, 4543552, 4751834, 4969484, 5194261, 5423521, 5653914, 5881945, 6104976, 6321504, 6530716, 6732150, 6925288, 7108636, 7279153, 7433062, 7566980, 7677749, 7761640, 7814942, 7835496, 7822976, 7777670, 7699971, 7591303, 7454582, 7293257, 7110500, 6909798, 6695611, 6472606]
58872F472606k28206k30963k31538k29676k25507k19728k13077k05778j97571
58863D490562j88428j79028j70081j61307j51775j41379j31093j21559j12403
58854C133509j03406r5318q8602q2317p5341o8062o1750n6633n1754m6409m0663
58843B363254l4721k8818k3624j9680j6424j2737q436m308o88K980P011J0951
58831B234760J4560J8358K2743K7277L1375L5109L8800M2330M5412M8251N1318
58820B610293N4510N7073N8529N9480O1199O4427O8777P3552P8914Q5757R4429
58809C366940J04212J14356J25033J36740J49274J61924J74336J86540J98340
58800D717695K09329K19298K27980K34491K37674K37051K32718K24365K10973
$$ y = [6472606, 6244400, 6013437, 5781899, 5552223, 5326716, 5106988, 4893911, 4688133, 4490562, 4302134, 4123106, 3953025, 3791718, 3639943, 3498564, 3367471, 3245912, 3133509, 3030103, 2934785, 2846183, 2763866, 2688525, 2620463, 2558713, 2502080, 2450326, 2403917, 2363254, 2328533, 2299715, 2276091, 2256411, 2239987, 2227250, 2218814, 2214506, 2213818, 2216798, 2223809, 2234760, 2249320, 2267678, 2290421, 2317698, 2349073, 2384182, 2422982, 2465312, 2510724, 2558975, 2610293, 2664803, 2721876, 2780405, 2839885, 2901084, 2965511, 3034288, 3107840, 3186754, 3272511, 3366940, 3471152, 3585508, 3710541, 3847281, 3996555, 4158479, 4332815, 4519355, 4717695, 4927024, 5146322, 5374302, 5608793, 5846467, 6083518, 6316236, 6540601, 6751574]
58791F751574J91760J66949J37540J04707O9489L2701m941m2404p8032j10049
58781G219294j37464j60327j79234j94930k08186k19557k29057k36310k40839
58772E413390k42051k39258k32330k22231k10552j98447j86365j74590j63472
58763C544094j53091j43227j33743j24659j15852j07107r8517r0504q3236p6313
58753B417845o9154o1653n4353m7995m2755l8003l3038k8041k3882k0780j7821
58742A980370j4183j0272p023m453j635K075O429J0674J3943J5264J3946J0034
58730B015169M037l751j3093k3002l1703l7759m0966m2205m2700m3420m4693m6127
58718A649787m7030m6973m5944m4126m1740l8904l5468l1176k6162k0969j5877
$$ y = [6751574, 6943334, 7110283, 7247823, 7352530, 7422019, 7454720, 7449779, 7407375, 7329343, 7219294, 7081830, 6921503, 6742269, 6547339, 6339153, 6119596, 5890539, 5654229, 5413390, 5171339, 4932081, 4699751, 4477520, 4266968, 4068521, 3882156, 3707566, 3544094, 3391003, 3247776, 3114033, 2989374, 2873522, 2766415, 2667898, 2577394, 2494158, 2417845, 2348691, 2287038, 2232685, 2184690, 2141935, 2103932, 2070894, 2042853, 2018971, 1998191, 1980370, 1966187, 1955915, 1948892, 1944439, 1942804, 1944879, 1951308, 1961982, 1975925, 1991189, 2005135, 2015169, 2019206, 2015455, 2002362, 1979360, 1947657, 1909898, 1868932, 1826727, 1784027, 1740607, 1695914, 1649787, 1602757, 1555784, 1509840, 1465714, 1423974, 1385070, 1349602, 1318426, 1292264, 1271295, 1255418]
58707A255418j0573m821R10N820R417J1246J0511O599j48q671j7897k6708l3646
58694A197457l7571l8663l8140l6884l4820l1591k7326k2605j8052j4014j0394
58683H87397o846l337k91J985L727N174N999N711M323K318K86j054r59O30K898
58668I07961N139P348R302R725P284K084m637j1768j8438k3397k5622k5517k4493
58655H14971k3283k1595j9251j6720j4345j2025r721p571n482l367j692q48j34
58642F78937J521L778N035M617L708L616M182M567M688N033N622O014O078O112
58628G43508O306O566O883P568R003J1162J3390J4933J5734J6515J7828J9486
58616H88882K1224K3283K5789K8092K9580L0779L2762L5784L9326M3131M7196
$$ y = [1255418, 1244845, 1240024, 1240934, 1246754, 1256171, 1267417, 1277928, 1284527, 1284379, 1275708, 1257811, 1231103, 1197457, 1159886, 1121223, 1083083, 1046199, 1011379, 979788, 952462, 929857, 911805, 897791, 887397, 880551, 877214, 876923, 878908, 882635, 887809, 893808, 899519, 903842, 906160, 906446, 905392, 904433, 905063, 907961, 913100, 920448, 929750, 939475, 946759, 948843, 944206, 932438, 914000, 890603, 864981, 839464, 814971, 791688, 770093, 750842, 734122, 719777, 707752, 698031, 690460, 684978, 681611, 679919, 679071, 678937, 680458, 684236, 689271, 693888, 697596, 701212, 705394, 709961, 714649, 719682, 725304, 731318, 737396, 743508, 749814, 756380, 763263, 770831, 779834, 790996, 804386, 819319, 835053, 851568, 869396, 888882, 910106, 933389, 959178, 987270, 1016850, 1047629, 1080391, 1116175, 1155501, 1198632, 1245828]
58605A245828N1039N4170N7169O1046O5558O9251P1279P1920P1181O8241O2686
58594A949368N5180M6389L6258K4781J2499k37j3433k6337l7189m4852m9864n3228
58582A899335n5025n4978n3518n1403m8700m5127m1011l7154l3937l1132k8452
58571A418898k5813k3175k0549j8007j5634j3601j2333j2267j3357j5236j7827
58560A231099k1134k4535k6914k7828k7814k7440k6738k5783k5160k5390k6365
58549I45998k7531k8210k7716k5839k3333k1308j9990j8788j7511j6597j6040
58538G03135j5138j3603j2021j0845r882r119q983r352r249q192o932o256n902
58525E77661n339m743m406l909k705j029M60J465J984K082K220L076M530N539
$$ y = [1245828, 1296867, 1351037, 1408206, 1469252, 1534810, 1604061, 1675340, 1747260, 1818441, 1886682, 1949368, 2004548, 2050937, 2087195, 2111976, 2124475, 2124238, 2110805, 2084468, 2047279, 2002427, 1952563, 1899335, 1844310, 1789332, 1735814, 1684411, 1635711, 1590584, 1549573, 1512419, 1478482, 1447350, 1418898, 1393085, 1369910, 1349361, 1331354, 1315720, 1302119, 1289786, 1277519, 1264162, 1248926, 1231099, 1209965, 1185430, 1158516, 1130688, 1102874, 1075434, 1048696, 1022913, 997753, 972363, 945998, 918467, 890257, 862541, 836702, 813369, 792061, 772071, 753283, 735772, 719175, 703135, 687997, 674394, 662373, 651528, 641646, 632527, 623544, 614192, 604943, 596751, 589819, 583563, 577661, 572322, 567579, 563173, 559264, 556559, 555530, 555990, 557455, 559439, 561521, 563741, 566817, 571347, 576886]
58511E76886N710O075P583R566J0758J1121J1555J2257J2469J1770J0552R235
58499F95537P739N818L394N56k287m412n375n520n521n619n641n549n564n863
58485F61693o432p079p457p362p090p152p517p692p598p721q117q099p294o368
58471E58715o056o093n733m895m120l678l353l038k961l243l559l324k268q42
58457E05552J45M51P04J411K120K180J880J946K201J830Q69K29K42L83N23J187
58441E23853K230K639K093J540J600J560P03m33q45l23O53J535J768J116L35O09
58425E40633J934L020L128K820K646K409K249K901M237M984M739M685N377N443
58411E91205L836J944J818L384M848N078M151K454O29k58J85J016J401J877K993
$$ y = [576886, 582596, 588671, 596254, 605820, 616578, 627699, 639254, 651511, 663980, 675750, 686302, 695537, 703276, 709094, 712488, 713044, 710757, 706345, 700970, 695450, 689929, 684310, 678669, 673120, 667556, 661693, 655261, 648182, 640725, 633363, 626273, 619121, 611604, 603912, 596314, 588593, 580476, 572377, 565083, 558715, 552659, 546566, 540833, 535938, 531818, 528140, 524787, 521749, 518788, 515545, 511986, 508662, 506394, 505552, 505697, 506148, 506852, 508263, 510383, 512563, 514443, 516389, 518590, 520420, 521289, 521518, 521760, 522143, 522666, 523853, 526083, 528722, 530815, 532355, 533955, 535515, 536218, 535785, 534940, 534617, 535270, 536805, 538573, 539689, 540024, 540633, 542567, 545587, 548715, 551535, 554181, 556590, 558839, 561740, 565977, 570961, 575700, 580385, 585762, 591205, 595041, 596985, 598803, 602187, 607035, 612113, 616264, 618718, 619347, 619089, 619274, 620290, 621691, 623568, 626561]
58396F26561L826L315K227K085K812L073K584K373K956L677L912L754L472L300
58382F69927L580M267M519L694K465K056K699L588M040L940L453L008L159L851
58368G18246M384M572N131O313P222P271P192P662Q045P629P070P216P520P083
58354H12556O363O437P168P569P460P334P163O614O042O060O459O634O635O860
58340I07354P306P943R066J0452J1123J0853J0778J1536J2103J1708J1404J2315
58328A033941J3671J4330J4905J6478J8365J9198J9339K0124K1455K2125K1924
58317A235855K1520K0839J9422J7785J6676J5566J3554J1143R449Q358P213O462
58305A403842O912Q145R425J1186J3849J6158J6761J6457J6869J7840J8283J8559
$$ y = [626561, 630387, 633702, 635929, 638014, 640826, 643899, 646483, 648856, 651812, 655489, 659401, 663155, 666627, 669927, 673507, 677774, 682293, 685987, 688452, 690508, 693207, 696795, 700835, 704775, 708228, 711236, 714395, 718246, 722630, 727202, 732333, 738646, 745868, 753139, 760331, 767993, 776038, 783667, 790737, 797953, 805473, 812556, 818919, 825356, 832524, 840093, 847553, 854887, 862050, 868664, 874706, 880766, 887225, 893859, 900494, 907354, 914660, 922603, 931669, 942121, 953244, 964097, 974875, 986411, 998514, 1010222, 1021626, 1033941, 1047612, 1061942, 1076847, 1093325, 1111690, 1130888, 1150227, 1170351, 1191806, 1213931, 1235855, 1257375, 1278214, 1297636, 1315421, 1332097, 1347663, 1361217, 1372360, 1381809, 1390167, 1397380, 1403842, 1410754, 1418899, 1428324, 1439510, 1453359, 1469517, 1486278, 1502735, 1519604, 1537444, 1555727, 1574286]
58293A574286J9718K1294K2197K2916K4483K6231K6980K7600K9708L2629L4401
58282A862443L5180L6953M0270M3796M6830M9809N2788N5545N8593O1907O3631
58271B407745O2328N9499N7345N5450N2336M8947M7314M7018M6334M5844M7466
58260B977626N0758N3709N6273N9690O3309O5774O8376P3343P9672Q4559Q8189
58249C721278R2981R9010J04432J09675J16724J24821J31469J37116J44338J52933
58239D934777J60587J67733J76831J87390J96819K05797K17486K31878K46202
58230F725500K60560K77556K96806L15646L34865L57786L84195M11345M40307
58221I804566M74653N13512N53182N95095O44567P02071P63796Q30600R07927
$$ y = [1574286, 1594004, 1615298, 1637495, 1660411, 1684894, 1711125, 1738105, 1765705, 1795413, 1828042, 1862443, 1897623, 1934576, 1974846, 2018642, 2065472, 2115281, 2168069, 2223614, 2282207, 2344114, 2407745, 2470073, 2529572, 2586917, 2642367, 2694703, 2743650, 2790964, 2837982, 2884316, 2930160, 2977626, 3028384, 3082093, 3138366, 3198056, 3261365, 3327139, 3395515, 3468858, 3548530, 3633089, 3721278, 3814259, 3913269, 4017701, 4127376, 4244100, 4368921, 4500390, 4637506, 4781844, 4934777, 5095364, 5263097, 5439928, 5627318, 5824137, 6029934, 6247420, 6479298, 6725500, 6986060, 7263616, 7560422, 7876068, 8210933, 8568719, 8952914, 9364259, 9804566, 10279219, 10792731, 11345913, 11941008, 12585575, 13287646, 14051442, 14882042, 15789969]
58212A5789969R97066J095507J205917J335447J486284J657025J853537K087967
58204B7508719K367120K693282L076624L535082M082897M732513N506285O430954
58196E9933476P522390Q793296J0273505J2002961J4010171J6322334J8980859
58189A47838992K1983057K5158993K8081090L0039960L0066877K7120401K0608171
58182C30897541J1039085J57403r828838j7401269k2271416k4958800k6042699
58175B41591007k5850175k4623354k2695191k0428144j8087179j5828350j3749543
58168A00329071j1901564j0282837q868138p640500o586778n684136m909536m250827
58160D0204755l696671l227164k824450k482246k196515j956197j750296j575107
$$ y = [15789969, 16787035, 17882542, 19088459, 20423906, 21910190, 23567215, 25420752, 27508719, 29875839, 32569121, 35645745, 39180827, 43263724, 47996237, 53502522, 59933476, 67455866, 76249162, 86522667, 98525628, 112535799, 128858133, 147838992, 169822049, 194981042, 223062132, 253102092, 283168969, 310289370, 330897541, 341936626, 342094029, 332265191, 314863922, 292592506, 267633706, 241591007, 215740832, 191117478, 168422287, 147994143, 129906964, 114078614, 100329071, 88427507, 78144670, 69276532, 61636032, 55049254, 49365118, 44455582, 40204755, 36508084, 33280920, 30456470, 27974224, 25777709, 23821512, 22071216, 20496109]
58152B0496109j427739j300414j186809j086524r98334r16253q36843p63411o98587
58143A1281195o39289n82865n31652m87386m47129m08572l73887l44825l19497
58134G146093k97176k80705k70595k61920k50575k37958k26351k14502k01132
58125D905179j88297j77713j67637j56591j46414j38685j31696j23890j16822
58116C557434j11921j07581j02160r6850r3016q9634q5692q2184p9593p6343p1810
58105B560650o7930o5760o3449n9688n6012n3570n0653m5819m0592l6777l3809
58094A986591l0992k9473k9722k9744k8317k7293k8241k9402k8638k7026k6771
58083A670972k7700k8505k9439l1016l1864l0662k8755k8216k8647k8302k7137
$$ y = [20496109, 19068370, 17767956, 16581147, 15494623, 14496289, 13580036, 12743193, 11979782, 11281195, 10641906, 10059041, 9527389, 9040003, 8592874, 8184302, 7810415, 7465590, 7146093, 6848917, 6568212, 6297617, 6035697, 5785122, 5547164, 5320813, 5106311, 4905179, 4716882, 4539169, 4371532, 4214941, 4068527, 3929842, 3798146, 3674256, 3557434, 3445513, 3337932, 3235772, 3138922, 3045906, 2956272, 2870580, 2788396, 2708803, 2632460, 2560650, 2492720, 2426960, 2363511, 2303823, 2247811, 2194241, 2143588, 2097769, 2057177, 2020400, 1986591, 1955599, 1926126, 1896404, 1866660, 1838343, 1811050, 1782809, 1753407, 1724769, 1697743, 1670972, 1643272, 1614767, 1585328, 1554312, 1522448, 1491786, 1463031, 1434815, 1406168, 1377866, 1350729]
58072A350729k6360k6090k5629k5005k4388k3110k1057j9704j9879k0003j8478
58061A101026j6324j5288j4881j3713j2428j2620j3769j3980j3199j3093j4049
58050I47682j4636j4119j3241j2461j1293r733q703q681r118r419r472r182q438
58037H09186p514o785o156n434m891m796m876m939n339o088o293n418m374m254
58023G32029m708m669m065l538k943j454R55L290M682N057M885M943O009Q069
58009G48542J0103J1262J1826J2473J3302J4237J5750J8216K1110K3676K5978
57998I26475K8469L0906L2617L3570L4428L5696L7333L8914L9813L9575L8420
57987A316216L6831L4515L0643K5535K1029J8521J7549J7011J6781J7175J7634
$$ y = [1350729, 1324369, 1298279, 1272650, 1247645, 1223257, 1200147, 1179090, 1159386, 1139507, 1119504, 1101026, 1084702, 1069414, 1054533, 1040820, 1028392, 1015772, 1002003, 988023, 974824, 961731, 947682, 933046, 918927, 905686, 893225, 881932, 872199, 863496, 854815, 845697, 836278, 826806, 817624, 809186, 801672, 794887, 788731, 783297, 778406, 773610, 768734, 763795, 758456, 752368, 746075, 740657, 736283, 732029, 727321, 722652, 718587, 715049, 712106, 710652, 711607, 714897, 719579, 724636, 729521, 734464, 740473, 748542, 758645, 769907, 781733, 794206, 807508, 821745, 837495, 855711, 876821, 900497, 926475, 954944, 985850, 1018467, 1052037, 1086465, 1122161, 1159494, 1198408, 1238221, 1277796, 1316216, 1353047, 1387562, 1418205, 1443740, 1464769, 1483290, 1500839, 1517850, 1534631, 1551806, 1569440]
57976A569440J6999J4469R470J350r706k1966l3368m3052n0909n6366n8721n8279
57964A279361n6130n2978m8992m4408l9500l4227k8653k3414j9092j5546j2338
57953I04083r440o897m459k206p88l86n4R77K045K030J033R7j85J41J083K596
57937H89670M180N527P225R870J2896J5306J7137J9188K1537K3308K3687K2253
57925A071784J8537J2372M550l711j1968k0342k8292l4553l8314l9761l9419l7650
57913H53233l4873l1658k8436k5450k2766k0106j7077j3933j1641j0629j0073
57902F26591r130q247q407r555j0710j1317j1539j1474j0995j0305r831r590r273
57889D96218q717p786o207m159k556j898j350J26K170L559M041M430N178N937
$$ y = [1569440, 1586439, 1600908, 1610378, 1611728, 1602022, 1580056, 1546688, 1503636, 1452727, 1396361, 1337640, 1279361, 1223231, 1170253, 1121261, 1076853, 1037353, 1003126, 974473, 951059, 931967, 916421, 904083, 894643, 887746, 883287, 881081, 880293, 879907, 879853, 880830, 882875, 884905, 885938, 886035, 885850, 885991, 887074, 889670, 893850, 899377, 906602, 916472, 929368, 944674, 961811, 980999, 1002536, 1025844, 1049531, 1071784, 1090321, 1102693, 1107243, 1103532, 1091564, 1071222, 1042930, 1008377, 970063, 930302, 890883, 853233, 818360, 786702, 758266, 732816, 710050, 689944, 672867, 658934, 647293, 636664, 626591, 617461, 609214, 600807, 591252, 580542, 569225, 557686, 546212, 535217, 524912, 515081, 505491, 496218, 487501, 479715, 473508, 469349, 466793, 464895, 463545, 463671, 465841, 469400, 473441, 477871, 483049, 488986]
57875D88986O570P401Q355Q766Q338P469O497N346M037K826J678K74j325k600
57861E52618l333l967n049o630q220r071q720p556o553o165n885n281m767m720
57847D66701m539l478j862m97O84K246L853M430L706K568J817J482J271R51K59
57832D79592p59j440j263p07o33j053j301j098n32O42K601M577N559N795O494
57817D96474Q169J0305J2437J4307J5125J4115J1968J0443J0399J1359J3040J5799
57805F43940J9391K2795K5815K9412L3751L7216L8127L6381L2659K7064J9414
57794I65965J0120qj0202j9462k6676l1535l4728l6785l7593l7326l6839l6445
57782F68486l5337l2991l0260k8272k6968k5503k3477k1031j8293j5542j3324
$$ y = [488986, 495556, 502957, 511312, 520078, 528416, 535885, 542382, 547728, 551765, 554591, 556269, 556543, 555218, 552618, 549285, 545318, 540269, 533639, 525419, 516348, 507628, 500072, 493519, 487354, 481469, 476188, 471421, 466701, 462162, 458684, 456822, 456325, 457009, 459255, 463108, 467538, 471244, 473812, 475629, 477111, 478382, 479333, 479592, 478833, 477393, 476130, 475423, 474790, 473737, 472436, 471338, 470806, 471448, 474049, 478626, 484185, 489980, 496474, 504643, 514948, 527385, 541692, 556817, 570932, 582900, 593343, 603742, 615101, 628141, 643940, 663331, 686126, 711941, 741353, 775104, 812320, 850447, 886828, 919487, 946551, 965965, 976085, 976077, 965875, 946413, 919737, 888202, 853474, 816689, 779096, 741770, 704931, 668486, 633149, 600158, 569898, 541626, 514658, 489155, 465678, 444647, 426354, 410812, 397488]
57771C97488j1816j0509r064p830o941n757l877k035j167j193j501j929k458k508
57757C28903j572j24R56J512J887K064J896J837K483L664M830N959P265Q311Q457
57742C78328P959P648P599P138O117N130M358L225J457l71j742k824l741l916
57728D16365k885j286l36l88n83L0J342K408K600K269K219K750L513M146M683
57713D36847N300O014O762P443P804P706P609Q308R939J1699J2862J3623J4546
57700E56462J5708J6902J8284K0194K2569K5046K7495K9988L2473L4953L7817
57689H37891M1497M5956N0908N6309O2119O7828P2849P7256Q1553Q5791Q9489
57678A569446R2378R4526R5630R4902R2192Q8778Q6597Q6776Q9146R2841R6369
$$ y = [397488, 385672, 375163, 366099, 358269, 351328, 345571, 341694, 339659, 338492, 337299, 335798, 333869, 331411, 328903, 327331, 327207, 328163, 329675, 331562, 333626, 335522, 337359, 339842, 343506, 348336, 354295, 361560, 369871, 378328, 386287, 393935, 401534, 408672, 414789, 419919, 424277, 427502, 428959, 428588, 426846, 424022, 420281, 416365, 413480, 412194, 411858, 411470, 410887, 410917, 412259, 414667, 417267, 419536, 421755, 424505, 428018, 432164, 436847, 442147, 448161, 454923, 462366, 470170, 477876, 485485, 493793, 503732, 515431, 528293, 541916, 556462, 572170, 589072, 607356, 627550, 650119, 675165, 702660, 732648, 765121, 800074, 837891, 879388, 925344, 976252, 1032561, 1094680, 1162508, 1235357, 1312613, 1394166, 1479957, 1569446, 1661824, 1756350, 1851980, 1946882, 2039074, 2127852, 2214449, 2301225, 2390371, 2483212, 2579581]
57667B579581R6410Q6946O1312J7073m0169r8234j44554j72047j80618j74831
57657B030869j60814j44035j27909j13467j00328q8057p6714o6576n7766n0079
57647A045124m2998l6154k9829k4613k0370j6131j1423p037l938j843M35L588
57635H54811P374J1275J4922J8150K1182K4537K8195L1381L3793L6487M0530M5191
57623A167828M8657N0440N1766N3533N5061N5246N3803N0791M5858L8726K9744
57612A701453J9357P589n254j7924k8994l8067m5617n1863n6435n9093o0220o0390
57600A304542n9779n8152n5408n2019m8809m6172m3675m0708l7362l4272l1743
57589G96443k9503k7397k5659k4353k3084k1530j9808j8061j6170j4196j2619
$$ y = [2579581, 2675991, 2762937, 2824249, 2841322, 2801153, 2702919, 2558365, 2386318, 2205700, 2030869, 1870055, 1726020, 1598111, 1484644, 1384316, 1296259, 1219545, 1152969, 1095203, 1045124, 1002126, 965972, 936143, 911530, 891160, 875029, 863606, 856569, 852631, 850788, 851223, 854811, 862185, 873460, 888382, 906532, 927714, 952251, 980446, 1011827, 1045620, 1082107, 1122637, 1167828, 1216485, 1266925, 1318691, 1372224, 1427285, 1482531, 1536334, 1587125, 1632983, 1671709, 1701453, 1720810, 1728399, 1723145, 1705221, 1676227, 1638160, 1592543, 1540680, 1484245, 1425152, 1364932, 1304542, 1244763, 1186611, 1131203, 1079184, 1030375, 984203, 940528, 899820, 862458, 828186, 796443, 766940, 739543, 713884, 689531, 666447, 644917, 625109, 607048, 590878, 576682, 564063]
57578E64063j1724j1112j0234r089p975o894n700m559l818l490l277l017k730
57565D80444k374j850j204m78M08J346J848J648J304J673K762L642L668L281L458
57550D99576M612O313P800Q635R007R539J0580J1689J2157J2081J2483J4071J6328
57537F34871J8332K0125K2629K6199L0028L3138L5497L7704M0015M2213M4179
57526I84930M6044M7663M8402M7598M5044M0917L5445K8804K1152J2673L624n608
57514A356688j4616k3068l0580l6613m0752m3091m4072m4026m3127m1708m0158
57503I54877l8444l6271l3802l1594k9688k7346k4220k1173j9246j8138j6525
57492F58430j3747j0509p815n873m202k368k95J782L506M644N343O039P109Q678
$$ y = [564063, 552339, 541227, 530993, 521904, 513929, 507035, 501335, 496776, 492958, 489468, 486191, 483174, 480444, 478070, 476220, 475016, 474538, 474946, 476292, 478140, 479788, 481092, 482765, 485527, 489169, 492837, 496118, 499576, 504188, 510501, 518301, 526936, 535943, 545482, 556062, 567751, 579908, 591989, 604472, 618543, 634871, 653203, 673328, 695957, 722156, 752184, 785322, 820819, 858523, 898538, 940751, 984930, 1030974, 1078637, 1127039, 1174637, 1219681, 1260598, 1296043, 1324847, 1345999, 1358672, 1362296, 1356688, 1342072, 1319004, 1288424, 1251811, 1211059, 1167968, 1123896, 1079870, 1036743, 995035, 954877, 916433, 880162, 846360, 814766, 785078, 757732, 733512, 712339, 693093, 674955, 658430, 644683, 634174, 626359, 620486, 616284, 613916, 613621, 615403, 618909, 623553, 628896, 634935, 642044, 650722]
57478F50722J0660J2806J4841J6742J8790K1181K3742K6262K8879L1822L4908
57467H91355L7651L9758M1167M1741M1325M0038L8060L5141L0707K4488J6758
57456A278189P992j388j0937k0246k8957l6478m1939m4933m6135m6679m7011m6832
57444I14646m6022m4841m3267m0890l7751l4600l2076l0076k8157k6065k3730
57433E27171k1273j9176j7899j7116j5951j4173j2501j1497j0824j0016r252q811
57421C58682q391p586o596n853n356m989n031n598n936n124l417k121k095k951
57407B87638l764l991l616k923k331k072j908j432p23l02m03o01l90J62M93K22
57391B64059m38q72o72L5Q38J541K172K576K390J591P04K27J27J11J09J81K09
$$ y = [650722, 661382, 674188, 689029, 705771, 724561, 745742, 769484, 795746, 824625, 856447, 891355, 929006, 968764, 1009931, 1051672, 1092997, 1133035, 1171095, 1206236, 1236943, 1261431, 1278189, 1286181, 1284793, 1273856, 1253610, 1224653, 1188175, 1146236, 1101303, 1055168, 1008489, 961478, 914646, 868624, 823783, 780516, 739626, 701875, 667275, 635199, 605123, 576966, 550901, 527171, 505898, 486722, 468823, 451707, 435756, 421583, 409082, 397585, 386761, 376745, 367493, 358682, 350291, 342705, 336109, 330256, 324900, 319911, 314880, 309282, 303346, 298222, 294805, 292684, 290589, 287638, 283874, 279883, 276267, 273344, 271013, 268941, 267033, 265601, 264878, 264576, 264173, 263572, 263182, 263344, 263837, 264059, 263621, 262749, 262077, 262112, 262950, 264491, 266663, 269239, 271629, 273220, 273924, 274151, 274278, 274389, 274498, 274679, 274888]
57374B74888R4NJ00J47j77p14r65p28k68N9J09m3j46P4O14J125J374J529J745
57355B78822J766J317O69L56M88P66J027J287J375J103Q05J129K148L093L212
57340B99363K573J882J685J980K403K714L054L657M299M395L833L343L595M227
57326C43003M376L989L906M588N467N824N717N688N933O241O493O806P263P767
57312D23061Q192Q523Q794R004R112R167R376R960J0854J1733J2399J2947J3370
57299E56492J3304J2435J0979R410P904O384M933L657K247K15k366m827o706q175
57285F05886r515j0586j1096j1069j0771j0324r634q661p602o773o260n777m989
57272D92829m010l293k936k493j711r93p33n82Q3J222K259K871L079K832K202
$$ y = [274888, 274982, 274987, 275087, 275234, 275057, 274343, 273378, 272650, 272382, 272441, 272550, 272507, 272361, 272435, 273049, 274174, 275548, 277077, 278822, 280588, 281905, 282574, 282930, 283418, 284184, 285211, 286498, 287873, 288976, 289781, 290910, 293058, 296151, 299363, 301936, 303818, 305503, 307483, 309886, 312600, 315654, 319311, 323610, 328005, 331838, 335181, 338776, 343003, 347379, 351368, 355274, 359862, 365329, 371153, 376870, 382558, 388491, 394732, 401225, 408031, 415294, 423061, 431253, 439776, 448570, 457574, 466686, 475853, 485229, 495189, 506043, 517776, 530175, 543122, 556492, 569796, 582231, 593210, 602620, 610524, 616908, 621841, 625498, 627745, 627960, 625594, 620767, 614061, 605886, 596371, 585785, 574689, 563620, 552849, 542525, 532891, 524230, 516628, 509855, 503595, 497818, 492829, 488819, 485526, 482590, 480097, 478386, 477393, 476660, 476078, 476161, 477383, 479642, 482513, 485592, 488424, 490626]
57257D90626J837K335L288L738L520L335L442L396L182L570M786N905O225O377
57243E45562P243Q435Q817Q178P505P695Q685R821J0538J0670J0520J0590J1138
57230F65397J1996J2925J3828J4557J5023J5517J6466J7615J8215J8290J8910
57219H38739K0627K2485K3316K3385K3737K4470K4810K4644K4801K5739K6900
57208A103653K7640K8030K8455K9084K9940L0963L1832L2237L2466L3205L4558
57197A442063L5825L6496L7030L8241M0248M2364M3912M4895M5937M7581M9557
57186A904149N0777N0202M7653M3806L9590L5809L3022L1300L0172K9124K8104
57175B323708K7347K6980K7092K7869K9121L0109L0389L0560L1412L2564L2865
$$ y = [490626, 492463, 494798, 498086, 501824, 505344, 508679, 512121, 515517, 518699, 522269, 527055, 532960, 539185, 545562, 552805, 561240, 570057, 578235, 585740, 593435, 602120, 611941, 622479, 633149, 643669, 654259, 665397, 677393, 690318, 704146, 718703, 733726, 749243, 765709, 783324, 801539, 819829, 838739, 859366, 881851, 905167, 928552, 952289, 976759, 1001569, 1026213, 1051014, 1076753, 1103653, 1131293, 1159323, 1187778, 1216862, 1246802, 1277765, 1309597, 1341834, 1374300, 1407505, 1442063, 1477888, 1514384, 1551414, 1589655, 1629903, 1672267, 1716179, 1761074, 1807011, 1854592, 1904149, 1954926, 2005128, 2052781, 2096587, 2136177, 2171986, 2205008, 2236308, 2266480, 2295604, 2323708, 2351055, 2378035, 2405127, 2432996, 2462117, 2492226, 2522615, 2553175, 2584587, 2617151, 2650016]
57164B650016L2070L1179L0897L0704K9850K8438K7053K5903K4961K4382K4277
57153B959730K4403K4574K5096K6272K7725K8701K8954K8965K9317L0137L1116
57142C264990L1820L2023L1846L1541L1169L0671L0253L0401L1310L2542L3437
57131C612003L3813L4210L5518L8273M2122M6085M9574N3033N7332O2766O9057
57120D133786P5981Q3357R0532R6575J00981J03685J04593J04023J03653J06106
57110E103272J13388J26391J45824J72410K05831K44756K88637L38761L97118
57101G136388M65256N45041O39621P52750Q87814J048176J237605J459276J714702
57092A5886629K003985K325926K676758L048953L431394L809385M163618M469350
$$ y = [2650016, 2682086, 2713265, 2744162, 2774866, 2804716, 2833154, 2860207, 2886110, 2911071, 2935453, 2959730, 2984133, 3008707, 3033803, 3060075, 3087800, 3116501, 3145455, 3174420, 3203737, 3233874, 3264990, 3296810, 3328833, 3360679, 3392220, 3423389, 3454060, 3484313, 3514714, 3546024, 3578566, 3612003, 3645816, 3680026, 3715544, 3753817, 3795939, 3842024, 3891598, 3944631, 4001963, 4064729, 4133786, 4209767, 4293124, 4383656, 4480231, 4581212, 4684897, 4789490, 4893513, 4997166, 5103272, 5216660, 5343051, 5488875, 5661285, 5867116, 6111872, 6400509, 6739270, 7136388, 7601644, 8146685, 8786306, 9539056, 10426870, 11475046, 12712651, 14171927, 15886629, 17890614, 20216540, 22893298, 25942251, 29373645, 33183030, 37346648, 41815998]
57084D1815998M694417M793094M702437M357779L730803K862698J857003Q31789
57076F9646018j29262r90406j744957k392253k928187l345941l639282l806895
57068E0668835l856777l806706l679823l499300l285334l053590k814392k573780
57060B4099133k336097k105463j885251j677743j484981j309178j151665j012127
57052A1136628q89299p81961o88961o08983n40745m83048m34384l92985l57438
57043E958824l26851l00260k76451k54708k35114k17758k01947j86564j71013
57034C788158j55606j41112j27978j15791j03561r0641p7033o2567m6415k8139
57024B839315q524J1505L1751N0175N9475M9333J5066l5945q7718j25862j44760
$$ y = [41815998, 46510415, 51303509, 56005946, 60363725, 64094528, 66957226, 68814229, 69646018, 69516756, 68526350, 66781393, 64389140, 61460953, 58115012, 54475730, 50668835, 46812058, 43005352, 39325529, 35826229, 32540895, 29487305, 26672913, 24099133, 21763036, 19657573, 17772322, 16094579, 14609598, 13300420, 12148755, 11136628, 10247329, 9465368, 8776407, 8167424, 7626679, 7143631, 6709247, 6316262, 5958824, 5631973, 5331713, 5055262, 4800554, 4565440, 4347682, 4145735, 3959171, 3788158, 3632552, 3491440, 3363462, 3247671, 3144110, 3053469, 2976436, 2913869, 2867454, 2839315, 2830791, 2842296, 2874047, 2924222, 2983697, 3033030, 3048096, 3012151, 2924433, 2798571, 2653811]
57013B653811j47073j38993j26381j13218j01485r1658q3358p5851o8544o1499
57003A645751n5316n0256m5732m1059l6364l2309k9146k6664k4731k3343k2130
56992A258701k0518j8373j6043j3803j1663r679p927o208m285k408j207j103k223
56979A143261m752q710j3330j7203j9324j9685j8859j7448j5935j4598j3371j2058
56967I67988j0732r524q226o550m747l292j987j15K389M722O381P726Q768Q265
56953I61066M944p72o983j2125j5820j8113j8846j8125j6720j5450j4285j2551
56941H16220j0008p340n369l974k193N69L809O704R283J2252J5679J8368J8759
56928H72759J6058J0404K438o732j5469k2102k5832k7006k6517k5041k2895k0445
$$ y = [2653811, 2506738, 2367745, 2241364, 2128146, 2026661, 1935003, 1851645, 1775794, 1707250, 1645751, 1590435, 1540179, 1494447, 1453388, 1417024, 1384715, 1355569, 1328905, 1304174, 1280831, 1258701, 1238183, 1219810, 1203767, 1189964, 1178301, 1168622, 1160695, 1154487, 1150202, 1147794, 1146587, 1145484, 1143261, 1138509, 1129799, 1116469, 1099266, 1079942, 1060257, 1041398, 1023950, 1008015, 993417, 980046, 967988, 957256, 947732, 939506, 932956, 928209, 924917, 922930, 922815, 925204, 929926, 936307, 944033, 952801, 961066, 966010, 965238, 958255, 946130, 930310, 912197, 893351, 875226, 858506, 843056, 828771, 816220, 806212, 798872, 793503, 789529, 787336, 787905, 791714, 798418, 807701, 819953, 835632, 854000, 872759, 888817, 899221, 901659, 894927, 879458, 857356, 831524, 804518, 778001, 752960, 730065, 709620]
56916G09620j8338j7088j6541j6020j5102j3962j2905j1985j1304j1175j1485
56905E53715j1342j0055q161o774o149n691n159m851m599l714k208r45j56J138
56891D85049L557O203P936Q988J0286J1790J2564J2166J0866Q685N223O15m120
56878E79808p839r942j0444r935r328r009q283o310l395p03J207K836M729O895
56864E20287R411J2707J6840K1043K4467K6874K8119K7345K3293J5552N301n211
56852G26028j3882j9724k2827k3614k2367j9533j6024j2684r579o201k312J886
56840E59167O310J1182J6519K1943K7226L2632L8433M4096M7954M7634M1100K8021
56828I22217J0410q102k3949l4918m0534m1791m0390l7675l4146l0006k5804k1997
$$ y = [709620, 691282, 674194, 657653, 641633, 626531, 612569, 599664, 587679, 576375, 565200, 553715, 542373, 532318, 524157, 517383, 511234, 505543, 500384, 495533, 490934, 487220, 485012, 484067, 483911, 485049, 488606, 494809, 502745, 511733, 522019, 533809, 546373, 558539, 569405, 578090, 583313, 583928, 579808, 571969, 562027, 551583, 541648, 532320, 523311, 515028, 508718, 505323, 504620, 505827, 508663, 513392, 520287, 529698, 542405, 559245, 580288, 604755, 631629, 659748, 687093, 710386, 725938, 731239, 726028, 712146, 692422, 669595, 645981, 623614, 604081, 588057, 575373, 565794, 559593, 557281, 559167, 565477, 576659, 593178, 615121, 642347, 674979, 713412, 757508, 805462, 853096, 894196, 922217, 932627, 924525, 900576, 865658, 825124, 783333, 742943, 705268, 671122, 641116, 615312, 593315]
56816E93315j8221j3649q060k023L885R443J4446J8791K2961K7563L1941L3807
56804G14199L0790K2222R442n039j8483k8746l4936l7342l6716l3854k9738k5419
56792E26380k1410j7569j3764j0233p093m032p69K506N535Q456J1496J4491J6839
56779E10833J7681J6030J1322M152l924j1546j8105k3002k5314k4816k2795k0935
56767D09581j9719j8533j7051j5633j4449j3174j1646j0133q712p094n397m384
56755B63656m437m754m267l084k330k567l088k990k332j773j484j098n77m12p93
56740B27670j205j124o55j67K40M99K73n35j305j346q31m34k53J88Q88J197P94
56723B23894J59j59k08k37k60k62l69n16l60J29M47K56m8J62R41J803K355K618
$$ y = [593315, 575094, 561445, 553385, 551362, 555247, 564690, 579136, 597927, 620888, 648451, 680392, 714199, 744989, 767211, 776653, 771614, 753131, 724385, 689449, 652107, 615391, 581537, 551799, 526380, 504970, 487401, 473637, 463404, 456311, 452279, 451510, 454016, 459551, 468007, 479503, 493994, 510833, 528514, 544544, 555866, 560018, 556094, 544548, 526443, 503441, 478127, 453311, 430516, 409581, 389862, 371329, 354278, 338645, 324196, 311022, 299376, 289243, 280531, 273437, 268040, 263656, 259219, 254465, 250198, 247114, 244784, 242217, 239129, 236139, 233807, 232034, 230550, 229452, 228875, 228463, 227670, 226465, 225341, 224686, 224519, 224759, 225258, 225531, 224996, 223691, 222345, 221514, 221080, 220827, 221015, 221903, 223100, 223894, 224053, 223894, 223686, 223449, 223189, 222927, 222558, 222042, 221682, 221811, 222258, 222514, 222466, 222628, 223569, 225372, 227727, 230345]
56705B30345K863L328L966M443M520M362M264M127L684L086K701K452J931J230
56691B77302Q98R35O58j25n84j3J100J723J505Q94M31L93P57J144J083O36L18
56674B89055K50o1p97j378j364j174j362j792k104k413k905l249l139k934l066
56659B61567l287l197l063l237l284k608j671j560k361l016k884k519k599k870
56645B23411k617j688o25O7M43Q92J485J738J255M57J57L87L58j79m50K5M74R5
56627B25685n64m87Q3m1j168k379k874k701k170j527j214j512j868j465n06Mj18
56610B05178N2J021K030K226J811J469J418J569K004K708L223L151K617J893R26
56595B33296k79j162j075j28Q61J257J144R95J038J076Q69N46L95K86k37j130
$$ y = [230345, 233208, 236536, 240502, 244945, 249465, 253827, 258091, 262218, 265902, 268988, 271689, 274141, 276072, 277302, 278200, 279135, 279793, 279668, 279084, 279071, 280171, 281894, 283399, 284293, 284724, 285117, 285874, 287018, 288101, 288737, 289055, 289305, 289244, 288447, 287069, 285705, 284531, 283169, 281377, 279273, 276860, 273955, 270706, 267567, 264633, 261567, 258280, 255083, 252020, 248783, 245499, 242891, 241220, 239660, 237299, 234283, 231399, 228880, 226281, 223411, 220794, 219106, 218481, 218548, 218991, 219883, 221368, 223106, 224361, 224818, 224975, 225362, 225720, 225541, 225091, 225116, 225590, 225685, 225121, 224634, 224717, 224676, 223508, 221129, 218255, 215554, 213384, 211857, 210643, 209131, 207263, 205798, 205292, 205296, 205178, 205230, 206251, 208281, 210507, 212318, 213787, 215205, 216774, 218778, 221486, 224709, 227860, 230477, 232370, 233296, 233017, 231855, 230780, 230652, 231513, 232770, 233914, 234909, 235947, 237023, 237892, 238438, 238833, 239119, 238882, 237752]
56579B37752j585j044r9K93R3K8L34N34M55O04J292K151K802L343L785L640K586
56562B56964J208M79O43R16L90r60k239k593k212k066k575l037k758k175k207
56547B37778k828l203l047k938l180l301k982k722l082l847m343m211l524k541
56533A92029j602r66o10l55k49m28o07k40O52J313J175N07q0m42q81j560k159
56516A85497k169j469o44m83j082j714j865j806j819j433k93P95O77m41j275j309
56500A69167j258j554j558p31L90R89J045J090J389J770J914J568Q18K37L02P20
56484A76298R33J082J671K366K234J262N51P18J177J349J439J574J293N57K28
56469A94732P33J199P74nj42K62L31j60o85q52o20M5R42J402J013K92l5n8l26
$$ y = [237752, 236167, 235123, 235024, 235317, 235410, 235438, 235772, 236306, 236761, 237365, 238657, 240808, 243610, 246953, 250738, 254378, 256964, 258172, 258651, 259294, 260210, 260600, 259640, 257401, 254808, 252596, 250530, 247955, 244918, 242160, 239985, 237778, 234950, 231747, 228700, 225762, 222582, 219281, 216299, 213577, 210495, 206648, 202305, 198094, 194570, 192029, 190427, 189461, 188851, 188496, 188247, 187819, 187212, 186972, 187624, 188937, 190112, 190619, 190539, 190097, 189216, 187656, 185497, 183328, 181859, 181215, 180732, 179650, 177936, 176071, 174265, 172446, 171013, 170720, 171515, 172192, 171751, 170476, 169167, 167909, 166355, 164797, 164066, 164456, 165445, 166490, 167580, 168969, 170739, 172653, 174221, 175039, 175276, 175578, 176298, 177231, 178313, 179984, 182350, 184584, 185846, 186397, 187115, 188292, 189641, 191080, 192654, 193947, 194504, 194732, 195465, 196664, 197438, 197433, 197291, 197553, 197884, 197724, 197039, 196187, 195567, 195612, 196554, 197956, 198969, 199261, 199226, 199168, 198842]
56450A98842p62q15m07k9O4O5J28J61J05l0k85n68n65k46j26o32j425j773j440
56431A90262p85k14Q7Q4r6k40l13m34n08k94M4M3k36j33N38J078J035R41J375
56412A92234J944J959J573J453J734K025K137K067J631Q03J17K7K07O4k98l56
56396B09321r2Q3P6O4p2n54j019q70k27J02k95r53j241j078q01o68n45l1J063
56377B02263K229K616K038J249R30Q85N90P1k53k05J59Q07J553K005K104K256
56361B21297K507K184R51k68k89Q20J911K202J812J176O61O34J201J913K266K335
56345B43313K494K728K745K543K367K327K446K707K778K184J259J170K340L490
56331B76891L264K222K074L181M108L724K611K058K427L033L180K936K975L707
$$ y = [198842, 198080, 197265, 196858, 196829, 196893, 196958, 197086, 197247, 197352, 197322, 197037, 196469, 195904, 195658, 195532, 194900, 193475, 191702, 190262, 189477, 189263, 189350, 189434, 189338, 189098, 188785, 188351, 187843, 187549, 187593, 187636, 187400, 187267, 187805, 188883, 189918, 190859, 192234, 194178, 196137, 197710, 199163, 200897, 202922, 205059, 207126, 208757, 209560, 209677, 209704, 209911, 209975, 209677, 209321, 209229, 209312, 209388, 209452, 209380, 208826, 207807, 206937, 206710, 206812, 206517, 205564, 204323, 203245, 202444, 201776, 201231, 201200, 202263, 204492, 207108, 209146, 210395, 211325, 212210, 212800, 212871, 212618, 212413, 212572, 213379, 214932, 216937, 219041, 221297, 223804, 225988, 226939, 226671, 226382, 227202, 229113, 231315, 233127, 234303, 234964, 235598, 236799, 238712, 240978, 243313, 245807, 248535, 251280, 253823, 256190, 258517, 260963, 263670, 266448, 268632, 269891, 271061, 273401, 276891, 280155, 282377, 284451, 287632, 291740, 295464, 298075, 300133, 302560, 305593, 308773, 311709, 314684, 318391]
56317C18391M599M692L852L045K988L177K790J930J311J109Q94M06k06o60n71
56302C47747L71J722K421K162J976K705L628L576K810K549L139L879M420N132
56288C88237O092O847P247P682Q417R392J0526J1621J2242J2398J2944J4517J6575
56275E24737J8363K0277K3111K6424K8960L0509L2150L4768L8445M3122M8598
56264H69464N3993N8458O2397O6804P1529P5449P8242Q0613Q2681Q3536Q2580
56253A665746P9979P5674O9220O0909N1757M2166L1829K1188J1516L130n048j3576
56241B094490k1505k7936l3334l8537m3571m8259n2921n7601o1494o3942o5230
56230A580160o5708o5106o3513o2026o1347o0488n8023n4224n0708m8270m6121
$$ y = [318391, 322990, 327682, 331534, 334579, 337567, 340744, 343534, 345464, 346775, 347884, 348778, 349184, 348978, 348318, 347747, 348118, 349840, 352261, 354423, 356399, 359104, 362732, 366308, 369118, 371667, 374806, 378685, 383105, 388237, 394329, 401176, 408423, 416105, 424522, 433914, 444440, 456061, 468303, 480701, 493645, 508162, 524737, 543100, 563377, 586488, 612912, 641872, 672381, 704531, 739299, 777744, 820866, 869464, 923457, 981915, 1044312, 1111116, 1182645, 1258094, 1336336, 1416949, 1499630, 1583166, 1665746, 1745725, 1821399, 1890619, 1951528, 2003285, 2045451, 2077280, 2098468, 2109984, 2113114, 2108066, 2094490, 2072985, 2045049, 2011715, 1973178, 1929607, 1881348, 1828427, 1770826, 1709332, 1645390, 1580160, 1514452, 1449346, 1385833, 1323807, 1262460, 1201972, 1143949, 1089725, 1039017, 990747, 944626]
56219I44626m3315l9965l6754l3908l1120k8220k5502k3293k1411j9336j6960
56208F24842j4774j3100j1530r576p503n932m876l855k767j975j658j683j990
56195E43623k432k444j667p12m78p69n06O34J805K328K648L590N264P010Q067
56180E65961Q201P981Q297R308J0203J0466J0778J1963J3573J4462J4368J3949
56168F99510J3640J3521J3906J4934J5853J5880J5542J6106J7901K0396K3578
56157H80767K7970L3456L9417M5960N3761O2958P3497Q6236J02084J20047J37595
56146A663748J52884J65083J72606J72929J64669J48736J27589J04867Q5368P2979
56136C031458O7578O5142O1109N2617L8284J8582k909k0890l2318l8091m0939
$$ y = [944626, 901311, 861346, 824592, 790684, 759564, 731344, 705842, 682549, 661138, 641802, 624842, 610068, 596968, 585438, 575862, 568359, 562427, 557551, 553696, 550929, 548954, 547296, 545613, 543623, 541191, 538747, 537080, 536368, 535890, 535121, 534615, 535249, 537054, 539382, 542030, 545620, 550884, 557894, 565961, 574162, 582143, 590440, 599748, 609951, 620417, 631195, 643158, 656731, 671193, 685561, 699510, 713150, 726671, 740577, 755511, 771364, 787244, 802786, 818892, 836793, 857189, 880767, 908737, 942193, 981610, 1027570, 1081331, 1144289, 1217786, 1304022, 1406106, 1526153, 1663748, 1816632, 1981715, 2154321, 2327250, 2491919, 2640655, 2768244, 2873111, 2958479, 3031458, 3099036, 3164178, 3225287, 3277904, 3316188, 3334770, 3331861, 3310971, 3278653, 3240562, 3199623]
56125C199623m3723m9971o3320q4524j10119j34890j54536j65945j67429j60197
56115B064969j47983j33847j18371j01702q5535p1734o0354n0349m1234l3019
56105A220841k5620j9254j4480j1026p726m352k221k191l272m102m604n248n907
56092A110838o290o572o758o400n599n181n333n134l999k387o92J283L283M449
56078A065508M716N025N744O345O881Q148R955J1044J1216J1702J2938J3858J4001
56065A187081J4356J5389J6225J6491J6998J7859J7967J7167J6893J7795J8822
56054A373043J9409K0398K1924K2719K2427K2428K3402K4420K5211K6899K9454
56043A631734L1103L1318L1835L3563L5291L6530L8685M2039M4607M5542M6664
$$ y = [3199623, 3155900, 3105929, 3042609, 2958085, 2847966, 2713076, 2558540, 2392595, 2225166, 2064969, 1916986, 1783139, 1664768, 1563066, 1477531, 1405797, 1345443, 1295094, 1253860, 1220841, 1195221, 1175967, 1161487, 1150461, 1142735, 1138383, 1136162, 1133971, 1130699, 1126597, 1121993, 1116745, 1110838, 1104548, 1097976, 1091218, 1084818, 1079219, 1074038, 1068705, 1063571, 1059572, 1057185, 1056493, 1057776, 1061059, 1065508, 1070224, 1075249, 1080993, 1087338, 1094219, 1102367, 1112322, 1123366, 1134582, 1146284, 1159222, 1173080, 1187081, 1201437, 1216826, 1233051, 1249542, 1266540, 1284399, 1302366, 1319533, 1336426, 1354221, 1373043, 1392452, 1412850, 1434774, 1457493, 1479920, 1502348, 1525750, 1550170, 1575381, 1602280, 1631734, 1662837, 1694155, 1725990, 1759553, 1794844, 1831374, 1870059, 1912098, 1956705, 2002247, 2048911]
56032B048911M8992N0830N1065N1232N2328N2836N1917N1447N2647N3800N3602
56021B619607N3688N5457N7535N8779O0608O3866O6707O8190P0648P5588Q0673
56010C331346Q3731Q6452R1015R6400J01168J06571J13597J20276J25253J30658
56000D386467J38166J45760J51852J58873J69075J80477J90698K01105K13362
55991E935835K25856K37504K50976K68033K85909L02509L20674L42998L67279
55982H537573L91706M19255M52023M86777N21598N61000O08664O61384P16611
55973A3356591P79312Q54268R38597J029745J133882J257881J400546J561091
55965B2311913J748748J974148K239613K549174K919966L372042L915976M562714
$$ y = [2048911, 2097903, 2148733, 2199798, 2251030, 2303358, 2356194, 2408111, 2459558, 2512205, 2566005, 2619607, 2673295, 2728752, 2786287, 2845066, 2905674, 2969540, 3036247, 3104437, 3175085, 3250673, 3331346, 3415077, 3501529, 3592544, 3688944, 3790112, 3896683, 4010280, 4130556, 4255809, 4386467, 4524633, 4670393, 4822245, 4981118, 5150193, 5330670, 5521368, 5722473, 5935835, 6161691, 6399195, 6650171, 6918204, 7204113, 7506622, 7827296, 8170294, 8537573, 8929279, 9348534, 9800557, 10287334, 10808932, 11369932, 11978596, 12639980, 13356591, 14135903, 14990171, 15928768, 16958513, 18092395, 19350276, 20750822, 22311913, 24060661, 26034809, 28274422, 30823596, 33743562, 37115604, 41031580, 45594294]
55957D5594294N334501O251784P321779Q557071R992244J1664437J3596022J5818796
55949A24130928J8382958K1279768K4324724K7090056K8869929K8664537K5368936
55942B98111836J8352358Q153417l386914j3885493k1547570k5794193k7073398
55935B32930043k6278956k4302282k1843602j9352546j7035036j4937101j3051600
55928I6128920j1367459r868314q536632p366534o355752n489177m744871m110072
55920C8290109l577104l129874k748374k421993k146546j912830j709269j531633
55912A9112486j379758j248304j130020j024290r33534q54437p81011p12989o53372
55903A0394771o00661n51007n05062m65572m30788l97051l65336l38823l16336
$$ y = [45594294, 50928795, 57180579, 64502358, 73059429, 83051673, 94716110, 108312132, 124130928, 142513886, 163793654, 188118378, 215208434, 244078363, 272742900, 298111836, 316464194, 324617611, 321230697, 307345204, 285797634, 260003441, 232930043, 206651087, 182348805, 160505203, 141152657, 124117621, 109180520, 96128920, 84761461, 74893147, 66356515, 58989981, 52634229, 47145052, 42400181, 38290109, 34713005, 31583131, 28834757, 26412764, 24266218, 22353388, 20644119, 19112486, 17732728, 16484424, 15354404, 14330114, 13396580, 12542143, 11761132, 11048143, 10394771, 9794110, 9243103, 8738041, 8272469, 7841681, 7444630, 7079294, 6740471, 6424135]
55894F424135k94362k73239k55367k39577k23021k06602j92884j80675j67157
55885D391251j53469j42756j34440j25599j16387j08971j02764r5865q9953q8626
55875C232421r1644r5378r8073j00323j01313r9127r4398q9700q5642q1068p6332
55864B219423p2901p0313o6862o2635n8826n4950m9818m4310m0110l6677l2470
55853A629551k8188k5623k4404k2861k1152k0559k0721k0531k0635k1928k2805
55842A380144k1126j7972j6101j5619j4528j2771j2176j2894j3323j3356j4503
55831A215775j6783j8452j8870j8990j9130j8771j8363j8778j9272j8532j7327
55820A012507j7567j9026j9683j9028j8364j8048j7202j6086j5952j6372j5349
$$ y = [6424135, 6129773, 5856534, 5601167, 5361590, 5138569, 4931967, 4739083, 4558408, 4391251, 4237782, 4095026, 3960586, 3834987, 3718600, 3609629, 3506865, 3411000, 3321047, 3232421, 3140777, 3045399, 2947326, 2847003, 2745690, 2646563, 2552165, 2462465, 2376823, 2295755, 2219423, 2146522, 2076209, 2009347, 1946712, 1887886, 1832936, 1783118, 1738808, 1698698, 1662021, 1629551, 1601363, 1575740, 1551336, 1528475, 1507323, 1486764, 1466043, 1445512, 1424877, 1402949, 1380144, 1359018, 1341046, 1324945, 1309326, 1294798, 1282027, 1269851, 1256957, 1243634, 1230278, 1215775, 1198992, 1180540, 1161670, 1142680, 1123550, 1104779, 1086416, 1067638, 1048366, 1029834, 1012507, 994940, 975914, 956231, 937203, 918839, 900791, 883589, 867503, 851551, 835179, 819830]
55809H19830j2548r900q655p999p060o095n270m158l003k737l419m150m598n147
55795G35091n597n416n114n799p424r067j0624j2553j4216j4288j2683j0428p908
55782F13974m964k266o93M02K244M215M402K487M4k040m402p380j0252j2573j4487
55767E68711j5622j5383j4424j4104j4416j4184j3327j3007j3416j3352j2324
55756D15152j1213j0471r408p791o559o372o794p354q047q500p990o635n410m687
55742C07921l965l180k986l499m009m080l837l189j957p69n25r39r27l72j46n03
55726B73038q63j223k204l545m022l139j747p35l53p29j821k757k470j027O89
55711B47092K353M045N213N327N189N861O594N819L927L036L852M872M995M810
$$ y = [819830, 807282, 797382, 788727, 780728, 773668, 767573, 762303, 758145, 755142, 752405, 748986, 744836, 740238, 735091, 729494, 724078, 718964, 713165, 705741, 696674, 686050, 673497, 659281, 644993, 632310, 621882, 613974, 609010, 606744, 606051, 606453, 608697, 612912, 617314, 619801, 619845, 617805, 613403, 606023, 595771, 583198, 568711, 553089, 537706, 523282, 509178, 494762, 480578, 467251, 454244, 440828, 427476, 415152, 403939, 393468, 384060, 376269, 369710, 363338, 356544, 349190, 341143, 332643, 324653, 318018, 312608, 307921, 303956, 300776, 297790, 294291, 290282, 286202, 282365, 279176, 277219, 276450, 275925, 274986, 274059, 273687, 273541, 273038, 272175, 270952, 268748, 265203, 261181, 258042, 256295, 255560, 255207, 254478, 252657, 249900, 247430, 246403, 247092, 249445, 253490, 258703, 264030, 269219, 275080, 281674, 287493, 291420, 294456, 298308, 303180, 308175, 312985]
55697C12985M856M643M102M055M516M248K895J808J884K162J569N81J21R7j3k17
55681C50292n52j507l081m405m958n207n488n428n032n099n808o102n287m135
55667B88203l510l003j858k74J177K634M434O216P445Q321R409J0746J1893J2473
55653C54306J2207J0889Q667O024L273N72j641k990l967n442p229q108p485o063
55639C53013m645l259j813o01K50R79J499J238p0k182m914q021j0594j1749j1975
55624B97156j2560j3570j3772j2766j1633j1128j0724j0016r526r398q730p103
55612A66230n518m853m576l889l045k566k227j757j624k098k450k107j768k254
55598A25498l019k884j827r61j020j735k450k695k353j751j408j385j260q16k73
$$ y = [312985, 317841, 322484, 326586, 330641, 335157, 339405, 342300, 344108, 345992, 348154, 349723, 350304, 350425, 350522, 350509, 350292, 349740, 348233, 345152, 340747, 335789, 330582, 325094, 319666, 314634, 309535, 303727, 297625, 292338, 288203, 284693, 281690, 279832, 279558, 280735, 283369, 287803, 294019, 301464, 309785, 319194, 329940, 341833, 354306, 366513, 377402, 386069, 392093, 395366, 395938, 394297, 391307, 387340, 381898, 374669, 366561, 359076, 353013, 348368, 345109, 343296, 342695, 342945, 343924, 345423, 346661, 346591, 344409, 339495, 331474, 320880, 309131, 297156, 284596, 271026, 257254, 244488, 232855, 221727, 211003, 200987, 191461, 182063, 173333, 166230, 160712, 155859, 151283, 147394, 144349, 141783, 139556, 137799, 136175, 134077, 131627, 129520, 127752, 125498, 122479, 119595, 117768, 116807, 115787, 114052, 111602, 108907, 106554, 104803, 103395, 102010, 100750, 99934, 99661]
55583I9661K51P83R58L53n01m66N83J591K012K543L662M701M977M793M568M089
55567A34558L339K961L139K967J891P87O94J262J385P64o5o44q10n69l68q77k058
55550A48356l023l325l471l850m103m079m232m476l839k134p39p35j391j549j410
55535A06000j693k034j586n65J61M51P43J051J209J595K513L344L399L120L470
55520A21178M472N397N968O512P225Q073R011R710R571Q662P879P593O959N314
55506B23524L194J097j542m986p976r374r980j1132j2361j2258j1011j0127r960
55493A27108r369p897o484n864n667n373m901m069k690j305p76j082j472j707
55479F8452k022k091j351l29k58j194j866j580r89p27n35j85j6j18j8L36K63n18
$$ y = [99661, 99912, 100695, 101653, 102006, 101505, 101039, 101622, 103213, 105225, 107768, 111430, 116131, 121108, 125901, 130469, 134558, 137897, 140858, 143997, 146964, 148855, 149642, 150336, 151598, 152983, 153747, 153682, 153038, 152228, 151659, 151291, 150414, 148356, 145333, 142008, 138537, 134687, 130584, 126505, 122273, 117797, 113958, 111824, 111085, 110350, 108959, 107410, 106000, 104307, 102273, 100687, 100122, 100283, 100734, 101477, 102528, 103737, 105332, 107845, 111189, 114588, 117708, 121178, 125650, 131047, 137015, 143527, 150752, 158825, 167836, 177546, 187117, 195779, 203658, 211251, 218210, 223524, 226718, 227815, 226273, 221287, 213311, 203937, 193957, 182825, 170464, 158206, 147195, 137068, 127108, 117739, 109842, 103358, 97494, 91827, 86454, 81553, 77484, 74794, 73489, 72713, 71631, 70159, 68452, 66430, 64339, 62988, 62659, 62401, 61207, 59341, 57761, 56772, 56045, 55510, 55325, 55309, 55191, 55173, 55509, 55772, 55254]
55461E5254j324j615j727j958j764o87N89R02K8j098j474q98J6M84K40k95n60
55444D4113m24q8K87M86J34p92j637j759j351r80p35m17k12l71n58l01J06P9r3
55425C5487M25J591K389K192J350M21l25n79k05K36M0m23j07R89J567Q63l90j242
55407D4279j705k072j999j143j39O5m98q61m50K97O28M18J85L12M48n2j146j973
55389C4594j941j439j119r24m76O1K28J26J45J22l15p76n02L25O78K09l04k61
55371B8431j6m5k27k71j81L9M40O67J73q31j420j181o29j72M53J284J617J042
55353B9173K51O2L04K82n1j59J65N71O55K98l22o81k16R57J898J854J084M08K14
55334C6747L16N03P86J111J260J039M85j43n34o24o72q51r07n09J13L06k04r75
$$ y = [55254, 53930, 52315, 50588, 48630, 46866, 46179, 46768, 47670, 47698, 46600, 45126, 44228, 44244, 44728, 44968, 44673, 44113, 43689, 43601, 43888, 44374, 44508, 43716, 42079, 40320, 38969, 37989, 37254, 36837, 36625, 36254, 35696, 35395, 35501, 35580, 35487, 35912, 37503, 39892, 42084, 43434, 43855, 43530, 42951, 42746, 42982, 43022, 42599, 42492, 43481, 45048, 45911, 45521, 44279, 42574, 40502, 38503, 37360, 37221, 37286, 36788, 35927, 35477, 35774, 36402, 36820, 37005, 37317, 37765, 37713, 36567, 34594, 32653, 31214, 30095, 29171, 28695, 28756, 28984, 29110, 29255, 29377, 29062, 28286, 27784, 28109, 28787, 28996, 28692, 28431, 28415, 28370, 28143, 27872, 27691, 27730, 28170, 28837, 29010, 28179, 26759, 25578, 24949, 24777, 25230, 26514, 28131, 29173, 29424, 29486, 29790, 30072, 30021, 29862, 30027, 30598, 31253, 31551, 31229, 30548, 30332, 31289, 33187, 35041, 36125, 36533, 36747, 37063, 37566, 38352, 39463, 40723, 41762, 42247, 42104, 41570, 40946, 40274, 39423, 38516, 38007, 38120, 38426, 38222, 37247]
55316C7247j376j099k17Q44J367R04j73j030j292j210r73m78J62N26M61K70J61
55299C4094ok71l80k48j50k56l83l69l23l56m25n03o02o09m84m75o54m47O32J932
55279B9717K196J276L24J60K94mn79q65q31p33m82J74J062J677J695J115J82o55
55261C5723r93q39n18k11M8J3n25j172j293r06n73l60J81R32J099N08K1K26N66
55242C1927L69j51m66n87p12o99n18n07o76m04M92J175R82M43L17L57j2m02j7
55223C0911Q96J197M39o76j298j221p02j93j46n36p22l07K19K32pJ47N78O13K20
55204B9644J20O66J379J657J362O71p0m07j47K96M48M40O30Q15N00j93o75q45
55186C6291j129j563j634j147n61k94k48j84j0L29P07O23k05j057q70K06Q28L59
$$ y = [37247, 35871, 34772, 34555, 35399, 36766, 37670, 37497, 36467, 35175, 33965, 32992, 32514, 32676, 33202, 33663, 33933, 34094, 34088, 33817, 33437, 33189, 33039, 32783, 32400, 32031, 31708, 31352, 30927, 30424, 29822, 29213, 28729, 28254, 27600, 27153, 27785, 29717, 31913, 33189, 33513, 33673, 33967, 33963, 33384, 32519, 31688, 30955, 30473, 30647, 31709, 33386, 35081, 36196, 36378, 35723, 34730, 33891, 33373, 33162, 33210, 33223, 32698, 31526, 30233, 29327, 28754, 28394, 28575, 29507, 30606, 31114, 31135, 31361, 31927, 32296, 32145, 31679, 31092, 30380, 29681, 29163, 28656, 27980, 27576, 28068, 29243, 30225, 30668, 30985, 31342, 31330, 30928, 30911, 31807, 33004, 33443, 32767, 31469, 30248, 29546, 29353, 29207, 28671, 27949, 27642, 27861, 28093, 28086, 28233, 28811, 29424, 29644, 29764, 30430, 31809, 33466, 34828, 35499, 35429, 35022, 34875, 35171, 35619, 36059, 36689, 37504, 38004, 37811, 37136, 36291, 35162, 33599, 31965, 30818, 30257, 29963, 29715, 29531, 29521, 29850, 30557, 31180, 30975, 29918, 29048, 29254, 30082, 30441]
55168C0441k01K61J316J667R44Kl82k70j25j66l74o48q42q61q11q13p34l42K58
55149B8320O26N65M01N17P55O07m3o82p79l89N3L19N31P67R16R04P17K64m47r50
55129C2972o58K83J008J041R01J169J474J079J56k77K64J097J317Q27K02j43k85
55112D2427m69p18p97n53j97q3j99j46K67O91P36M36mo27j378j731j217k08N07
55093C6737P52R81J297J241O99K47K54K87j15o01m72K95J051J304J127Q17O43
55076D6544P60J012R05J62p77j212j087r42r98q82m30r3k10l95k56j56n94j132
55058D0219r07j51l9q49j254k15J391J934J268O04N57N52J87l8K90P57R37J123
55040D6366J642K087J887J202O12L07J33P1J33J4n14j053r86k76N80J250J759
$$ y = [30441, 30240, 30501, 31817, 33484, 34428, 34430, 34048, 33778, 33653, 33487, 33113, 32465, 31623, 30762, 29951, 29138, 28404, 28062, 28320, 28946, 29511, 29912, 30429, 31184, 31791, 31748, 31066, 30287, 29898, 29951, 30270, 30801, 31568, 32484, 33388, 34105, 34369, 33922, 32972, 32314, 32597, 33605, 34646, 35547, 36716, 38190, 39269, 39425, 39148, 39412, 40509, 41826, 42653, 42855, 42712, 42427, 41958, 41240, 40443, 39890, 39693, 39610, 39411, 39265, 39532, 40223, 40959, 41395, 41391, 40764, 39386, 37655, 36438, 36230, 36737, 37489, 38470, 39767, 41008, 41707, 41954, 42208, 42495, 42380, 41779, 41307, 41602, 42653, 43957, 45084, 45901, 46544, 47304, 48316, 49221, 49383, 48606, 47394, 46307, 45365, 44367, 43485, 43055, 42962, 42752, 42357, 42101, 41945, 41351, 40219, 39312, 39161, 39122, 38273, 37019, 36804, 38195, 40129, 41397, 42001, 42558, 43110, 43297, 43259, 43549, 44306, 45243, 46366, 48008, 50095, 51982, 53184, 53796, 54103, 54236, 54307, 54440, 54454, 53940, 52887, 51901, 51625, 52205, 53455, 55214]
55023E5214K085K060J687J141N51pl96o21r63j567k073k028j457p05QM60K27p77
55005E2839j753j771r35k32k19n27o41m16J80J143J983J967J099K61N5J11l4j00
54987E3010L22Q36P71L32M01J238K025J970J245N86M02N56Q12J076J308J514J837
54970G0241K463L360M183M604M617M546M780N589P012Q745J0247J1192J1813J2583
54956A65975J3531J4038J3472J1764R208N940J879k865p684j1628j3866j4177
54944A85587j3198j2026j1395j1146j0605r362p615n892m561l613k821k112j656
54931H9585j541j439r23q8N38P50R21J390J999K522L123M012N027N915O796P917
54915A26504R163J0241J1099J1662J1383R689O857L866J273j341m540q056j0850
$$ y = [55214, 57299, 59359, 61046, 62187, 62738, 62731, 62335, 61714, 60751, 59184, 57111, 55083, 53626, 52921, 52929, 53389, 53616, 52839, 51086, 49315, 48380, 48148, 47929, 47402, 46761, 46345, 46525, 47668, 49651, 51618, 52717, 52978, 53033, 53144, 53110, 53010, 53332, 54168, 54939, 55271, 55672, 56910, 58935, 60905, 62150, 62736, 63138, 63694, 64506, 65582, 66890, 68404, 70241, 72704, 76064, 80247, 84851, 89468, 94014, 98794, 104383, 111395, 120140, 130387, 141579, 153392, 165975, 179506, 193544, 207016, 218780, 227988, 233928, 235807, 232942, 225258, 213630, 199764, 185587, 172389, 160363, 148968, 137822, 127217, 117855, 110240, 104348, 99787, 96174, 93353, 91241, 89585, 88044, 86605, 85682, 85594, 86132, 86882, 87803, 89193, 91192, 93714, 96837, 100849, 105876, 111791, 118587, 126504, 135667, 145908, 157007, 168669, 180052, 189741, 196598, 200464, 201737, 200396, 195856, 187800, 176950]
54902A76950j2069j1812j0979j0388j0038r363q197p123o627o339n519m085k684
54889G1727j829j500j454j493j436j201r50q23o77l89k40n13q79p78l40k55p58
54872E6212j296j345r74n30k77n23j427k465k670j764n45J23K23J61J9k72m89
54855D2161m55m73q65j307j208o05j13o3k03k21r5J27M52P10O57L80K44K95J13
54836C9531m79r99q77k80J51K64N93J513K557K903K329J420Q44P36P92P59O99
54819E2456Q88J525K465L190L258K809K477K711L397M233N225O513P906Q958R579
54804A17590J0183J1112J2100J2498J1960J0705R117P246M850J851j381m372o933
54791A96526r062j0570j1120j0676r622q390p220o287n701n267m565l474k318
$$ y = [176950, 164881, 153069, 142090, 131702, 121664, 112301, 104104, 96981, 90354, 84015, 78496, 74411, 71727, 69898, 68398, 66944, 65451, 64015, 62814, 61864, 61041, 60364, 59975, 59735, 59222, 58343, 57565, 57225, 56970, 56212, 54916, 53571, 52597, 52067, 51790, 51267, 49840, 47375, 44705, 42941, 42396, 42519, 42742, 42903, 42922, 42650, 42161, 41706, 41233, 40368, 39061, 37853, 37248, 37135, 37072, 36869, 36648, 36553, 36680, 37132, 37842, 38499, 38879, 39123, 39418, 39531, 39052, 38053, 37176, 36896, 37047, 37311, 37904, 39417, 41974, 44877, 47206, 48626, 49470, 50206, 50998, 51757, 52456, 53344, 54869, 57334, 60524, 63782, 66591, 69068, 71779, 75176, 79409, 84634, 91147, 99053, 108011, 117590, 127773, 138885, 150985, 163483, 175443, 186148, 195265, 202511, 207361, 209212, 207831, 203459, 196526, 187464, 176894, 165774, 155098, 145476, 137086, 129866, 123579, 117878, 112611, 108046, 104572, 102254]
54778A02254j311k27J098K276K782K685K609L064M068N277O259O824P270Q107
54764A53035R386J0554J1202J1519J1768J1674J0768Q981O455L267k26l201n297
54751B39885p252r804j2304j3409j3017j2446j2551j2714j2081j0800r522q404
54739A05581p232o031m948l932k971k385k393k636k556k065j523j220j197j402
54725F3090j687j779j484r17l64lJ59K55M86R15J255J115M75k84q52j165j135
54708E8080o25J30N62M94M18Q15J427J598J117L84j31l33l98m87n76n14k80j09
54690F1572k37m96m14K67J312K285K881L011K798K590K698L023L076K490J425
54675H8281M45R9N14J219J497J079L23l37q01q87r4J624L300L992M102M764O069
$$ y = [102254, 100943, 100716, 101814, 104090, 106872, 109557, 112166, 115230, 119298, 124575, 130834, 137658, 144928, 153035, 162421, 172975, 184177, 195696, 207464, 219138, 229906, 238887, 245342, 248609, 248383, 245182, 239885, 232633, 222829, 210525, 197116, 184099, 171653, 159102, 146388, 134307, 123507, 113985, 105581, 98349, 92318, 87370, 83438, 80467, 78082, 75689, 73053, 70497, 68432, 66909, 65689, 64492, 63090, 61403, 59624, 58140, 57223, 56859, 56856, 57015, 57270, 57756, 58671, 59926, 61041, 61516, 61232, 60380, 59215, 58080, 57455, 57585, 58147, 58641, 59059, 59874, 61301, 62899, 64016, 64400, 64269, 63936, 63538, 63051, 62475, 61961, 61681, 61572, 61335, 60839, 60425, 60692, 62004, 64289, 67170, 70181, 72979, 75569, 78267, 81290, 84366, 86856, 88281, 88726, 88825, 89339, 90558, 92055, 93134, 93457, 93120, 92319, 91432, 91338, 92962, 96262, 100254, 104356, 109120, 115189]
54658A15189O972P011P000P668Q709R651J0589J1351J0847Q279M483J077j346
54645B07480l419n625p675r098r765r787r448r148q969q393p048n499m646m447
54631A04513l970k843j839j716k111k109j429n47J42O27Q35M03p07j831k226j973
54615H3219j804k005k058j578j055j126j530j510j082j017j521j751j046R3P75
54600F5004R07J017J203R92J68q05j336j339j158j073j029q71o76o71q00o94k90
54583E8549j55p81j787k319k051j257j08J233K019J394k25j239p56L71Q76O06
54567E4370J82j09k74m2P70J663J949J636J212Q34L35j58k55P6N03P97R52R30
54549F5371Q03R50J748L052M288N016N203N127N189N539N777N266L893K132L49
$$ y = [115189, 122161, 129172, 136172, 143840, 152549, 162200, 172789, 184140, 194987, 203266, 207749, 208826, 207480, 204061, 198436, 190761, 181663, 171898, 162111, 152663, 143515, 134546, 126153, 119105, 113606, 108960, 104513, 100543, 97700, 95861, 94145, 92034, 89925, 88496, 87949, 88091, 88718, 89553, 89956, 89249, 87418, 85192, 83219, 81415, 79410, 77352, 75774, 74719, 73593, 72063, 70553, 69471, 68454, 66933, 65182, 64136, 64229, 65004, 65911, 66928, 68131, 69123, 69291, 68486, 67150, 65811, 64653, 63580, 62551, 61680, 61004, 60333, 59533, 58839, 58549, 58394, 57613, 55826, 53507, 51456, 50199, 50091, 51324, 53343, 54737, 54512, 53273, 52517, 52888, 53764, 54370, 54552, 54443, 54169, 54127, 54897, 56560, 58509, 60145, 61357, 62191, 62526, 62368, 62113, 62189, 62692, 63489, 64441, 65371, 66174, 67124, 68872, 71924, 76212, 81228, 86431, 91558, 96747, 102286, 108063, 113329, 117222, 119354, 119703]
54534A19703j386k765l335l386l885m989n601m982l910l450l455l202k768k607
54520F9982k450j851j311j581k139j783n20M53O12N77P03N41Qj86K63O96O11L75
54502F3000L85L53Nl59m42n28q52j022n86K49Q83R28L45n92j259j088k78L47L33
54483E9822j1l29o48r72j034p20k54K25P26R54N12k85n90k27P1j08k66o9j2m00
54463E6385n31K55J357J673J109N16L78M62N39O55O81L17l61q34p56l36m6j59
54445F1304n57p95n26N3M69O82J095J590J327J9j132p25Q95J891J182l52j157
54428F5263p88J9N43P37Q45Q84P02L56J70M49J198K088K682K675K142J560J397
54411H2922J616J736J486J125R34P95N83N90J001J255O16o78j556j483j031r86
$$ y = [119703, 118317, 115552, 112217, 108831, 104946, 99957, 94356, 89374, 85464, 82014, 78559, 75357, 72589, 69982, 67532, 65681, 64370, 62789, 60650, 58867, 58347, 58800, 59412, 59989, 60692, 61233, 61241, 61055, 61318, 62014, 62625, 63000, 63385, 63738, 63743, 63384, 62942, 62414, 61562, 60540, 59954, 60203, 61086, 62014, 62359, 61767, 60508, 59420, 59142, 59489, 59822, 59811, 59482, 58834, 57862, 56828, 56108, 55854, 56079, 56805, 57759, 58271, 57986, 57396, 57169, 57240, 57132, 56866, 56797, 56785, 56385, 55854, 56109, 57466, 59139, 60248, 60764, 61142, 61604, 62143, 62798, 63479, 63796, 63435, 62601, 61845, 61509, 61463, 61304, 60747, 59952, 59426, 59479, 59948, 60630, 61725, 63315, 64642, 64661, 63529, 62804, 63699, 65590, 66772, 66420, 65263, 64475, 64494, 65037, 65774, 66619, 67503, 68205, 68561, 68731, 69180, 70378, 72466, 75148, 77823, 79965, 81525, 82922, 84538, 86274, 87760, 88885, 89819, 90614, 91197, 91787, 92788, 94043, 94659, 93981, 92425, 90942, 89911, 88925]
54395H8925j439j954k136j808j140p08r47j457j360m90M20Q10Q07N14k85j372
54379G6380j788j020J69O91L72k56q45j280j311r26o56q97j210r35j94M14P79
54362F7487J229J773K026J819J329P70M96J045K435L630L520K316J230Q48O75
54347I2628K56j21j21o9m55j215j875k153k134k002j815j505j055p42r64j649
54331G5009k106j838j265j146j523j808j762j691j697j413p85l82o18j080j113
54316E4782p22m52n38n50M1J158K095K142J221q8j095j460j196n34Q0J92j80m71
54298E4425k33K76M49R7m77r17j047q45n14l60l37j9O33R33M63j9M77J533J650
54279E6168L28j072r95M29J705J734P81j48m05j62N3J04L05P01P95L19j30R6O27
$$ y = [88925, 87486, 85532, 83396, 81588, 80448, 79740, 78793, 77336, 75976, 75486, 75906, 76716, 77523, 78037, 77752, 76380, 74592, 73572, 73741, 74432, 74804, 74548, 73703, 72423, 71112, 70186, 69530, 68633, 67423, 66488, 66294, 66708, 67487, 68716, 70489, 72515, 74334, 75663, 76433, 76929, 77974, 80409, 84039, 87559, 89875, 91105, 91953, 92628, 92884, 92763, 92642, 92573, 92118, 90903, 89028, 86875, 84741, 82739, 80924, 79419, 78364, 77622, 76658, 75009, 72903, 71065, 69800, 68654, 67131, 65323, 63561, 61870, 60173, 58760, 57975, 57593, 56975, 55895, 54782, 54060, 53608, 53070, 52520, 52561, 53719, 55814, 57956, 59177, 59089, 57994, 56534, 55338, 54804, 54884, 55076, 54896, 54425, 54192, 54468, 54917, 55014, 54537, 53620, 52573, 51728, 51214, 50854, 50517, 50498, 51131, 52064, 52527, 52508, 52985, 54518, 56168, 56496, 55424, 54429, 54858, 56563, 58297, 59078, 58930, 58525, 58363, 58416, 58520, 58825, 59526, 60321, 60640, 60510, 60606, 61233]
54260F1233O35K37L61J144J518P73l80q69o47l85m11n64p15p67n01M6L45O5l57
54241F0761l27kO8q1O2M90N38q3p04m82M73J127O19p62j813j687p92k04k73l99
54221E6529j83q0m82q31l71O05J134J008R42J309J543J135M76K68N29O98M49J5
54203F4693k58k93k37j81o1K20N35N82K76m7l8J20o4o67j208j302j067p90n49
54184E9664m04o18j304k029k103j327k62K15l46j556k385j986n06J000J605J293
54168D8951O84K11j51n21q54j080j202j177q58j67P32J506J819J501P26j7l03
54151D9800j76k5n8q5J09L79L96P2l58o18n90k44L51Q91R28K82o27j119r32m83
54131D7893l14m93o45n10j77J45L08J64l48r02r45m72k32p12j222o66Q28J927
$$ y = [61233, 61868, 62105, 62466, 63610, 65128, 65901, 65521, 64652, 64005, 63620, 63209, 62645, 61930, 61163, 60662, 60708, 61053, 61118, 60761, 60434, 60432, 60500, 60419, 60481, 60971, 61509, 61426, 60722, 60240, 60713, 61840, 62459, 61697, 59884, 58197, 57405, 57201, 56928, 56529, 56346, 56266, 55784, 54953, 54582, 55187, 56321, 57329, 58271, 59580, 61123, 62258, 62734, 63002, 63531, 64229, 64678, 64693, 64435, 64142, 63905, 63724, 63663, 63883, 64418, 65000, 65276, 65229, 65191, 65311, 65247, 64580, 63372, 62070, 61003, 60213, 59664, 59260, 58642, 57338, 55309, 53206, 51879, 51617, 51832, 51486, 49930, 47545, 45559, 45053, 46053, 47658, 48951, 49635, 49846, 49695, 49174, 48320, 47240, 46038, 44861, 44003, 43836, 44568, 46074, 47893, 49394, 50120, 50103, 49800, 49624, 49599, 49541, 49456, 49565, 49944, 50340, 50412, 50054, 49436, 48846, 48602, 48953, 49844, 50772, 51054, 50427, 49308, 48376, 47893, 47579, 47086, 46441, 45931, 45754, 45899, 46207, 46371, 46023, 45121, 44176, 43704, 43472, 42760, 41538, 40872, 41700, 43627]
54113D3627J841J312J352J795J781J245R23J079J150P30J42l11q45j593j996j442
54097E0790j86R05J308J162P69K49k75n96o05m02j63J5J46L67P01P81J07j193
54079E3880k125j832o07M46O86L76L7p3J82Q35J474J474Q86N80J100J849J899
54062F1067J216N53M00O50J094J579J677R96q9o30k36M83Q72J022J246J397J170
54045G4467P43N07M63M62P58J680K875L546L455L072K750K377K013K096K780L544
54029A07588L890L870L655L083K072J111P55R14J053R32P06N39M84N39M86l5q92
54012A30750j306q13r2j15q24j333j354j567k468l652m425m501l943k951j943
53997I9463j358j141q99o83r79j767k249j908j192p52m77Q7P94R43J69j176k426
$$ y = [43627, 45468, 46780, 48132, 49927, 51708, 52953, 53876, 54955, 56105, 56835, 56977, 56666, 55821, 54228, 52232, 50790, 50604, 51509, 52817, 53979, 54748, 54997, 54722, 54126, 53521, 53119, 52956, 52971, 53117, 53484, 54185, 54966, 55073, 53880, 51755, 49923, 49316, 49762, 50448, 50824, 50861, 50788, 50970, 51805, 53279, 54753, 55639, 56219, 57319, 59168, 61067, 62283, 62836, 63236, 63886, 64980, 66559, 68236, 69232, 69143, 68513, 68277, 68760, 69632, 70654, 71900, 73297, 74467, 75210, 75717, 76180, 76642, 77400, 79080, 81955, 85501, 88956, 92028, 94778, 97155, 99168, 101264, 104044, 107588, 111478, 115348, 119003, 122086, 124158, 125269, 126024, 126938, 127991, 128923, 129629, 130168, 130652, 131191, 131677, 131642, 130750, 129444, 128631, 128539, 128424, 127600, 126267, 124913, 123346, 120878, 117226, 112801, 108300, 104357, 101406, 99463, 98105, 96964, 96065, 95382, 94403, 92636, 90387, 88479, 87287, 86535, 86058, 86145, 86939, 87882, 88051, 86875, 84449]
53980H4449l009k688j667m68N04J148J396J139M97r0l10k59j76j97m08p67r19
53963G8175n19J56N33O68J092J593J217r8r31k71J001J486J346J751K791L386
53947I3376L129K839L144L638L790L734L780L940M263M939N744O052N693N240
53933A53301N124M989M252K854J197k09r25p93k35J10J25K02M70O57P86J271K078
53916A75254K507K203J776K013K914L962M764N095M725L743K696J974J394P09
53902B15729L1o00j505k640l173k470j250q60j571k368k438k176k413l320m398
53887A84578n210n688n862n647m968l999l163k850l125l714m220m310l840k958
53873A25024k071j468j072p63p00j033j412j342j008j085j707k238k270k168k302
$$ y = [84449, 81440, 78752, 77085, 76617, 77121, 78269, 79665, 80804, 81301, 81211, 80901, 80642, 80466, 80269, 79861, 79094, 78175, 77656, 77812, 78345, 79013, 80105, 81698, 82915, 82817, 81886, 81615, 82616, 84102, 85448, 87199, 89990, 93376, 96505, 99344, 102488, 106126, 109916, 113650, 117430, 121370, 125633, 130572, 136316, 142368, 148061, 153301, 158425, 163414, 167666, 170520, 171717, 171508, 170583, 169790, 169555, 169665, 169790, 169992, 170462, 171119, 171905, 173176, 175254, 177761, 179964, 181740, 183753, 186667, 190629, 195393, 200488, 205213, 208956, 211652, 213626, 215020, 215729, 215760, 215160, 213655, 211015, 207842, 205372, 204122, 203262, 201691, 199323, 196885, 194709, 192296, 188976, 184578, 179368, 173680, 167818, 162171, 157203, 153204, 150041, 147191, 144066, 140352, 136132, 131822, 127982, 125024, 122953, 121485, 120413, 119650, 118950, 117917, 116505, 115163, 114155, 113070, 111363, 109125, 106855, 104687, 102385]
53858A02385k387k102j732j652j606j175n88m25p46j090j202j199j198j241j413
53843H2629j606j359n48J15j16q77j113n08J91L29P2j10k3L52R12J245Q97N9n51
53824G9990n78l11J9N60J239J561J371J145J148R57L66M6N51J223J087M62O34
53807I1470J872K864K540J635J674K928M049L788K468J489J689K473K686K059
53793A25684J466J728K570L068K778J999J080R3p18q67l77m3m60j113j122o11
53777A35155o16j588k710l067k805k724l068l350l181k712k260j955j849j970
53763A01300k140k036j574j031p21p21r75j371j669j653j415j297j352j310j131
53748H0904j172j492j462o38L23L08p48j727j793j283r02n96J48J301K167K243
$$ y = [102385, 99998, 97896, 96164, 94512, 92906, 91731, 91143, 90718, 89972, 88882, 87680, 86481, 85283, 84042, 82629, 81023, 79664, 79116, 79231, 79115, 78238, 77125, 76617, 76808, 77137, 77209, 77099, 77076, 77428, 78340, 79585, 80482, 80541, 79990, 79412, 79101, 79120, 79680, 80919, 82480, 83851, 84996, 86144, 87101, 87467, 87513, 88064, 89287, 90374, 90836, 91470, 93342, 96206, 98746, 100381, 102055, 104983, 109032, 112820, 115288, 116777, 118466, 120939, 123625, 125684, 127150, 128878, 131448, 134516, 137294, 139293, 140373, 140466, 139748, 138881, 138504, 138461, 138001, 136888, 135766, 135155, 134539, 132951, 130241, 127174, 124369, 121645, 118577, 115227, 112046, 109334, 107074, 105119, 103270, 101300, 99160, 97124, 95550, 94519, 93798, 93077, 92102, 90731, 89062, 87409, 85994, 84697, 83345, 82035, 80904, 79732, 78240, 76778, 76140, 76463, 76771, 76023, 74296, 72503, 71220, 70318, 69722, 69870, 71171, 73338, 75581]
53732G5581J718J042M58J5k67l95l96k78j68l66r19j213n54O24R25k55j677j700
53714G2175m24N91M98J9k6Q0j55l26J72R14R89M22J19N15J170J738K317K717K365
53695H5870J328O10Q76J582J885J812J876K097K084J756J234L39j043k248k352
53680I7706j404m25jL80J354K626L399L373K886K292J642R62M33J99K01K40J72
53663A16035J6o5O6L36M70K67j42l94k64Q7K79J35j35k56l15o45j263j631j227
53644A11354j63Q75J288R79K96k63l54o2J31j08m89m50k2J09m05r17n14P41J805
53625A13831J953J559J306J183P83L16M59J129J274L66o04l53Q77J614J118J74
53609A26985j67K08Q53J517K037K052J477Q67P78J014J082J065J424K142K670
$$ y = [75581, 77299, 78341, 78799, 78814, 78547, 78152, 77756, 77478, 77310, 76944, 76025, 74812, 74258, 74882, 75807, 75552, 73875, 72175, 71751, 72342, 72840, 72859, 72833, 72913, 72758, 72432, 72604, 73518, 74507, 74929, 75048, 75563, 76733, 78471, 80788, 83505, 85870, 87198, 87808, 88684, 90266, 92151, 93963, 95839, 97936, 100020, 101776, 103010, 103349, 102306, 100058, 97706, 96302, 95877, 95876, 96256, 97610, 100236, 103635, 107008, 109894, 112186, 113828, 114790, 115223, 115422, 115623, 115863, 116035, 116051, 115986, 116052, 116388, 116858, 117125, 116983, 116589, 116325, 116412, 116691, 116826, 116691, 116435, 116120, 115475, 114212, 112581, 111354, 111191, 112066, 113354, 114333, 114629, 114366, 114012, 113950, 114081, 113973, 113484, 113034, 113012, 113121, 112716, 111799, 111285, 112026, 113831, 115784, 117343, 118649, 119832, 120615, 120931, 121390, 122519, 123793, 124159, 123555, 123202, 124079, 125693, 126811, 126985, 126818, 127026, 127879, 129396, 131433, 133485, 134962, 135829, 136607, 137621, 138703, 139768, 141192, 143334, 146004]
53594A46004K791K842K982K828K096J236R49J289J652J572J295J311J612J695
53580A72154J364J091J267J421P77n31j469j434q76l50K57J078J580J337R37J167
53564A79770J717J681J091Q23R54M39j126k596k775k037j574j647j525q91l37
53549A71967l41n54l88J48N78O50N48N81P75Q85O66J37l91n90l62R3N10P31P77
53530A76420P47P01O70P11R00J219J537J744J858J999K274K707L108L109K550
53515B02254J905J986L019M337N170N499N758O077O254O307O467O678O652O514
53501B74877O861P921R046R384Q832Q098P952Q623R800J1036J2027J2614J2620
53488C99691J1990J1142J0838J1455J2562J3513J4178J4669J4731J4092J3246
$$ y = [146004, 148795, 151637, 154619, 157447, 159543, 160779, 161728, 163017, 164669, 166241, 167536, 168847, 170459, 172154, 173518, 174609, 175876, 177297, 178074, 177543, 176074, 174640, 173764, 173414, 173671, 174749, 176329, 177666, 178603, 179770, 181487, 183168, 184259, 185082, 186036, 186475, 185349, 182753, 179978, 177941, 176367, 174720, 173195, 172304, 171967, 171626, 171072, 170684, 170832, 171410, 172060, 172608, 173189, 173964, 174849, 175515, 175652, 175261, 174671, 174309, 174402, 174912, 175643, 176420, 177167, 177868, 178538, 179249, 180149, 181368, 182905, 184649, 186507, 188506, 190780, 193487, 196595, 199704, 202254, 204159, 206145, 209164, 213501, 218671, 224170, 229928, 236005, 242259, 248566, 255033, 261711, 268363, 274877, 281738, 289659, 298705, 308089, 316921, 325019, 332971, 341594, 351394, 362430, 374457, 387071, 399691, 411681, 422823, 433661, 445116, 457678, 471191, 485369, 500038, 514769, 528861, 542107]
53477E42107J3093J3723J4243J4048J3537J3268J3057J2457J1591J0938J0609
53466F82671J0343J0056R899R964J0221J0628J0955J0758R867Q740P972P581P132
53453H06787O367N360M177K776J232l30j907l488m826n695o248o838p502q004
53439G81861q251q333q181p735p454q080r663j1197j1582j0758r588q846q632
53426F63561q685q868r221r771j0376j0719j0371r044o894m548k675j506q43m60
53412E69580l40m02k89L34J291K065K499L046M142N551O567O877O917P361Q315
53397F23514R230R582R575R918J0928J2109J2874J3390J4396J6136J7963J9095
53385G78710J9499J9836K0703K2127K3586K4511K4886K5333K6352K7577K8194
$$ y = [542107, 555200, 568923, 583166, 597214, 610751, 624019, 637076, 649533, 661124, 672062, 682671, 693014, 703070, 712969, 722933, 733154, 743782, 754737, 765495, 775362, 784102, 792074, 799655, 806787, 813154, 818514, 822691, 825467, 826699, 826369, 824462, 820974, 816148, 810453, 804205, 797367, 789865, 781861, 773610, 765277, 757096, 749361, 741907, 733827, 724164, 712967, 701385, 690627, 681039, 672193, 663561, 654876, 646008, 636787, 627016, 616640, 605921, 595550, 586506, 579612, 575064, 572389, 570883, 570040, 569580, 569240, 568838, 568549, 568883, 570174, 572239, 574738, 577784, 581926, 587477, 594044, 600921, 607838, 615199, 623514, 632744, 642326, 651901, 661819, 672747, 684856, 697730, 711120, 725516, 741652, 759615, 778710, 798209, 818045, 838748, 860875, 884461, 908972, 933858, 959191, 985543, 1013120, 1041314]
53374A041314K8145K8277K9093K9908K9777K8778K7750K7079K6391K5367K4216
53363A346095K3243K2455K1654K0597J9016J6952J5044J3980J3574J2873J1306
53352A536789R165O800L939K91l689p197j0016j2589j5309j8201k1114k3748k5557
53339A419564k6170k5963k5783k5975k6120k5786k5131k4516k3968k3343k2700
53328A144109k2185k1753k1324k1042k1060k1248k1410k1617k1967k2106k1515
53317I06882k0201j8685j7280j5839j4260j2732j1340r933q601p859p912q144
53305G54096p855p171o817p126p708q039p973p726p663p942q141p439n558l339
53291F53599j930j497j262o03L90J431K385L060L274L339L927N201O515P352P972
$$ y = [1041314, 1069459, 1097736, 1126829, 1156737, 1186514, 1215292, 1243042, 1270121, 1296512, 1321879, 1346095, 1369338, 1391793, 1413447, 1434044, 1453060, 1470012, 1485056, 1499036, 1512610, 1525483, 1536789, 1545954, 1552754, 1556693, 1556984, 1553295, 1546098, 1536082, 1523493, 1508184, 1489983, 1468869, 1445121, 1419564, 1393394, 1367431, 1341648, 1315673, 1289553, 1263767, 1238636, 1214120, 1190152, 1166809, 1144109, 1121924, 1100171, 1078847, 1057805, 1036745, 1015497, 994087, 972470, 950503, 928397, 906882, 886681, 867996, 850716, 834877, 820617, 807885, 796545, 786612, 778011, 770152, 762240, 754096, 746241, 739070, 732253, 725127, 717419, 709380, 701407, 693681, 686018, 678076, 669935, 662496, 656938, 653599, 651669, 650172, 648910, 648307, 648697, 650128, 652513, 655573, 658847, 662186, 666113, 671314, 677829, 685181, 693153]
53276F93153Q839R797J0358J0533J0856J1620J2476J2826J2431J1583J0791J0254
53264H25517R756R125Q630Q563Q561P926O629N376M454L235J255q32k048k442
53250H93705k976m316o363q778j1238j3184j4055j4022j3967j4483j5261j5679
53238G59383j5587j5304j5100j4985j4859j4627j4211j3574j2740j1809j0984
53227F05603j0567j0706j1223j1796j2362j3109j4024j4620j4358j3250j1895
53216D67693j0823r989r020p891p031o671o400n657m543l742l644l977m313m574
53202C79418m912n410o073o838p467p767p941q375q960r104q636q094p836p419
53188B74586o379n099m295m026l915l972m431n003n091m705m425m443m431m440
$$ y = [693153, 701992, 711789, 722147, 732680, 743536, 755156, 767632, 780458, 792889, 804472, 815263, 825517, 835273, 844398, 853028, 861591, 870152, 878078, 884707, 890083, 894537, 897772, 899027, 898195, 896147, 893705, 890729, 886413, 880050, 871272, 860034, 846850, 832795, 818773, 804806, 790323, 775062, 759383, 743796, 728492, 713392, 698407, 683548, 668921, 654710, 641136, 628396, 616587, 605603, 595036, 584330, 573107, 561311, 548949, 535840, 521816, 507196, 492838, 479588, 467693, 456870, 446881, 437861, 429970, 422939, 416268, 409868, 404211, 399668, 395926, 392282, 388305, 383992, 379418, 374506, 369096, 363023, 356185, 348718, 340951, 333010, 324635, 315675, 306571, 297935, 289841, 282005, 274586, 268207, 263108, 258813, 254787, 250872, 246900, 242469, 237466, 232375, 227670, 223245, 218802, 214371, 209931]
53174B09931m980o029o651o174n054m130l538k958k409k170k116j848j404j242
53160A59228j517j858j998k145k482k697k353j566r20p61q46q01n74l38j81j53
53144A38038m30j032j557j607j427j562j908j719p99L9J22j42p7O3l78j166j445
53127A23013j150j113j578j723j061l29l47p21n59P7L39k2l55j89J29J35m5n8
53109A14443L3j19n44r00r43p33l74J22O00O34j5r10j274q77k74p4k33l01r4J63
53089A08330K35J18K1J94O36Q19J45j080j632q72J94J74p38j058j89Q07R54O78
53071A07736P79J083J015Q01J066J609J699J368J389J913K106J486P89R76J912
53056A27727K571K242J136Jn50m71k86n47j156j427r66k21J06j24n56r63j332
$$ y = [209931, 204951, 198922, 192271, 186097, 181043, 176913, 173375, 170417, 168008, 165838, 163722, 161874, 160470, 159228, 157711, 155853, 153855, 151710, 149228, 146531, 144178, 142612, 141692, 140931, 140085, 139284, 138710, 138372, 138191, 138038, 137608, 136576, 135019, 133412, 131985, 130423, 128515, 126796, 125997, 126036, 126158, 126016, 125939, 126002, 125624, 124458, 123013, 121863, 120750, 119172, 117449, 116388, 116059, 115712, 114991, 114432, 114509, 114848, 114826, 114471, 114282, 114411, 114546, 114501, 114443, 114476, 114357, 113813, 112913, 111970, 111237, 110863, 110985, 111585, 112219, 112204, 111294, 110020, 109143, 108869, 108795, 108562, 108261, 108167, 108330, 108565, 108683, 108704, 108898, 109534, 110353, 110498, 109418, 107786, 106914, 107108, 107282, 106544, 105486, 105297, 106104, 107058, 107736, 108515, 109598, 110613, 111414, 112480, 114089, 115788, 117156, 118545, 120458, 122564, 124050, 124839, 125815, 127727, 130298, 132540, 133676, 133677, 133127, 132656, 132370, 131823, 130667, 129240, 128274, 128053, 128159, 128035, 127479, 126516, 125184]
53039A25184j449j006k27J23m01j342j893j778j256n74J94Q44J068Q44M76J58
53023A18965j61m68n28k53R4L30O52J296J989K181J626O17l44q00n28K81J044
53006A25993J309J169R77P77M23R1J45N16P02N23L97O33Q90O83R5m13o53p49o69
52987A32839j37Q46J772K062J630R22M47L41L78L57L50N17P67Q29O82O59R76J347
52969A47584J332R61P18Q90J182J137P31L43J96J30MK8M26R06Q43O8q43j161p41
52950A54734J6O07P62M33j40n70o03l14J13N67R13R38O65M51N00N67L57j1k80
52931A59705m66n87l36L84R25O03j92m27M8L23p3l72K90J636K694K956K575J850
52913A71536J093P12Q66J212J301J043N11l02j191j640j476j236j397j560j097
$$ y = [125184, 123735, 122729, 122502, 122625, 122224, 120882, 118989, 117211, 115955, 115381, 115575, 116419, 117487, 118331, 118807, 118965, 118804, 118336, 117808, 117555, 117649, 117979, 118631, 119927, 121916, 124097, 125723, 126340, 125996, 125196, 124668, 124949, 125993, 127302, 128471, 129448, 130225, 130648, 130739, 130884, 131400, 132102, 132625, 133022, 133655, 134545, 135228, 135323, 134910, 134257, 133508, 132839, 132702, 133548, 135320, 137382, 139012, 139934, 140381, 140722, 141100, 141457, 141807, 142324, 143091, 143920, 144602, 145261, 146237, 147584, 148916, 149877, 150595, 151485, 152667, 153804, 154535, 154878, 155074, 155204, 155208, 155236, 155662, 156568, 157411, 157479, 156636, 155475, 154734, 154750, 155357, 156119, 156552, 156412, 155842, 155239, 154925, 155038, 155605, 156518, 157456, 158121, 158572, 159072, 159639, 159996, 159985, 159705, 159239, 158652, 158316, 158700, 159625, 160228, 160036, 159609, 159657, 159980, 159907, 159535, 159825, 161461, 164155, 167111, 169686, 171536, 172629, 173341, 174207, 175419, 176720, 177763, 178274, 177972, 176781, 175141, 173665, 172429, 171032, 169472, 168375]
52898A68375l06j60r46j871k149j853j524j471j696k009k056j578q83o39j014
52883A48220j444j491j453j685j755r79M16J374J310P51M16L22J55M4L55R82J428
52866A46966J490J239M48j170k988l643k684j396j259k087k483j880j114j043
52852A28396j498j837j812j490q85j36L40K32l24r34j265j142o85m70j017k016
52836A13457k537k163j476j127j044q96p93r56j119q74l63j13l10o40p74o36l58
52819I7278k11m12p31n74K44J139J460J275J074J068J180J428J773J828J291N31
52803A09641K26N16R43J123J058Q86Q07J114J834K453K446J952J545J429J358
52788A29331J219J113R78O40K31O0P6k6k38l05l23o81j374j922k058j959j711
$$ y = [168375, 168069, 167909, 166963, 165092, 162943, 161090, 159566, 158095, 156399, 154390, 152334, 150756, 149873, 149234, 148220, 146776, 145285, 143832, 142147, 140392, 139413, 139829, 141203, 142513, 143264, 143680, 144002, 144157, 144201, 144556, 145538, 146966, 148456, 149695, 150143, 148973, 145985, 142342, 139658, 138262, 137003, 134916, 132433, 130553, 129439, 128396, 126898, 125061, 123249, 121759, 120874, 120738, 121078, 121310, 120986, 120052, 118787, 117645, 116960, 116490, 115473, 113457, 110920, 108757, 107281, 106154, 105110, 104214, 103421, 102465, 101346, 100472, 100109, 99996, 99686, 99046, 98272, 97636, 97278, 97067, 96655, 95924, 95350, 95594, 96733, 98193, 99468, 100542, 101610, 102790, 104218, 105991, 107819, 109110, 109641, 109867, 110383, 111326, 112449, 113507, 114393, 115200, 116314, 118148, 120601, 123047, 124999, 126544, 127973, 129331, 130550, 131663, 132641, 133281, 133512, 133572, 133648, 133622, 133384, 133079, 132756, 132075, 130701, 128779, 126721, 124762, 123051]
52771A23051j151l88J47K78K98L32Q4n73j216j437j344j175q93n00l67p60j259
52754A13127j149l04O77J172J103Q14O07N16M32L63M27N47L89k17r59j438j687
52737A14420j864j712q38M44J220J084O22N81J028J563J920K050J954J700J437
52722A25609J175Q73P40J093J779K177K020J724J669J656J431J221J274J271Q00
52707A46512J39q7J14R1m44r14o29L21J131J146M91j57l53k39n8L36J070J576
52689A50046J097j03q14m84Q5O5j94k6K11k25r50q32J90Q37L12o60j094j059j185
52670A45217j496j601j525j620j839j765j365j111j330j785k031j870j409q87
52656A23583n27l86k61J47R15J808K443K562K233J887J932K192J952Q69l75p07
$$ y = [123051, 121900, 121512, 121659, 121937, 122235, 122567, 122651, 122078, 120862, 119425, 118081, 116906, 116013, 115513, 115146, 114386, 113127, 111978, 111674, 112351, 113523, 114626, 115440, 116047, 116563, 116995, 117358, 117785, 118332, 118721, 118504, 117545, 116107, 114420, 112556, 110844, 110006, 110450, 111670, 112754, 113376, 113957, 114985, 116548, 118468, 120518, 122472, 124172, 125609, 126784, 127657, 128397, 129490, 131269, 133446, 135466, 137190, 138859, 140515, 141946, 143167, 144441, 145712, 146512, 146651, 146564, 146678, 146769, 146325, 145411, 144782, 145103, 146234, 147380, 147871, 147714, 147361, 147122, 147064, 147400, 148470, 150046, 151143, 151040, 150226, 149742, 149827, 149892, 149698, 149672, 149883, 149658, 148708, 147876, 148066, 148903, 149215, 148555, 147461, 146402, 145217, 143721, 142120, 140595, 138975, 137136, 135371, 134006, 132895, 131565, 129780, 127749, 125879, 124470, 123583, 123056, 122670, 122409, 122556, 123471, 125279, 127722, 130284, 132517, 134404, 136336, 138528, 140480, 141349, 140974, 140267]
52640A40267N7J031J381J165Q72N90J14m32o40m83m32p86j219j238q69o09q07
52623A37962j287j555j294o79k66m53j040j423j288r05o49m61o0N44J003J073
52607A29222P83K51m11r38j010o13j06J45P6j72m51n80l61J41N24M48R0j05rL7
52587A26961k16n43n68l43l38q38j553j887j499o04K00L52k06q86j020o11l09
52570A16092m69o43l11K45L84J63K18O28P16J74m44o40o90r55j192j106r85j040
52552A10145p74J91J109R31j50r87j118j051j037o89L4N04M23J98j3o04j482j703
52534A03927q30K46N89M67M82K75p05j713j338M10J921K040J279O18J57m71j069
52517A06285j081n58j50j77k78j24m3n74j550k045j390j2R86R60J83p39j464j881
$$ y = [140267, 140324, 141355, 142736, 143901, 144773, 145363, 145477, 145045, 144405, 143922, 143490, 142704, 141485, 140247, 139378, 138769, 137962, 136675, 135120, 133826, 133147, 132881, 132428, 131388, 129965, 128677, 127772, 127123, 126662, 126602, 127146, 128149, 129222, 130005, 130256, 129845, 128907, 127897, 127284, 127178, 127323, 127399, 127227, 126776, 126196, 125835, 125976, 126500, 126948, 127038, 126933, 126924, 126961, 126745, 126202, 125634, 125291, 124953, 124115, 122562, 120675, 119176, 118572, 118772, 119124, 118918, 118032, 117012, 116401, 116092, 115623, 114980, 114669, 114914, 115298, 115461, 115679, 116307, 117023, 117197, 116753, 116113, 115423, 114468, 113276, 112170, 111185, 110145, 109371, 109562, 110671, 111602, 111452, 110465, 109347, 108296, 107259, 106570, 106604, 107108, 107531, 107729, 107716, 107112, 105630, 103927, 103097, 103343, 103932, 104399, 104881, 105156, 104451, 102738, 101400, 101810, 103731, 105771, 107050, 107668, 107825, 107354, 106285, 105204, 104646, 104496, 104319, 104041, 103917, 103874, 103300, 101750, 99705, 98315, 98303, 99289, 100249, 100432, 99693, 98229, 96348]
52499I6348j858j412q68n38l65j00K62M75M23K65K13K77L05K12J26K41M86M77
52481I4969M3m07l22K30O63P04O23O08M69J97K27Q00J466J583R60k02j550k441
52463I8620k220j092j99k69o72m36L44Q82J021J182J308R28J83j92r7k05p50j022
52445I7314n23K74P13Q23Q11N19p4l79L5O25O32K42K13O09P22K95k2K83Q17Q76
52425A04805M05o4j70l4O1n6m01p90q53l80L11N67J54l68k49N68J380J542J113
52406A07541O24M28M52M56L30J18p2j90k41j73J90Q66J422J238K69p13q90k52
52388A11403M77O63K30m64q91o47K09J092J404J105N75P4l07l71K7N85Q09O73
52370A16646O06P21N91lo09o79k22M56J270K125K522J991Q75K07N84J573K281
$$ y = [96348, 94490, 93078, 92210, 91672, 91307, 91207, 91469, 91944, 92367, 92632, 92845, 93122, 93427, 93639, 93765, 94006, 94492, 94969, 95012, 94605, 94283, 94513, 95176, 95880, 96503, 97111, 97580, 97777, 98004, 98804, 100270, 101853, 102813, 102611, 101061, 98620, 96400, 95308, 95109, 94840, 94168, 93732, 94076, 94958, 95979, 97161, 98469, 99397, 99580, 99388, 99291, 99086, 98336, 97314, 96791, 97065, 97778, 98601, 99412, 99931, 99857, 99478, 99513, 100138, 100770, 101012, 101225, 101834, 102556, 102851, 102829, 103112, 103929, 104805, 105210, 105146, 104976, 104942, 105003, 104947, 104546, 103756, 102903, 102523, 102834, 103401, 103555, 103187, 102938, 103506, 104886, 106428, 107541, 108165, 108593, 109045, 109501, 109831, 109949, 109877, 109687, 109446, 109273, 109463, 110329, 111751, 112989, 113258, 112545, 111655, 111403, 111880, 112543, 112773, 112309, 111418, 110771, 110980, 112072, 113476, 114581, 115156, 115230, 114923, 114552, 114579, 115164, 115973, 116646, 117252, 117973, 118564, 118561, 117952, 117273, 117051, 117507, 118777, 120902, 123424, 125415, 126290, 126497, 127081, 128654, 130935]
52353A30935K263J718J055N49L06L14M55N49M95L82M45Q29J365J638J395Q84O40
52336A46217R11J334J417J195J211J752K388K457J829R45K23j57PQ74K083K778
52320A67464K503J783J498J927K708L481M122M530M698M923N465O052O196O000
52306B23350O147O954P966Q649R010R275R364R010Q212P189O241N804O357P810
52292C31338R215R577Q953Q362Q585R376R965R960R550R033Q527Q106P962Q231
52278D56740Q717Q961Q651P937P273O968O940O817O245N161L902L000K771L087
52264E43170L573L920L930L447K522J544R35O85M44J20N4N37J365K076K418K443
52248E73183K284K059J924K045K514L350M465N561O226O301O103O116O522P180
$$ y = [130935, 133198, 134916, 135971, 136520, 136826, 137140, 137595, 138144, 138639, 139021, 139466, 140295, 141660, 143298, 144693, 145577, 146217, 147128, 148462, 149879, 151074, 152285, 154037, 156425, 158882, 160711, 161656, 161879, 161722, 161729, 162603, 164686, 167464, 169967, 171750, 173248, 175175, 177883, 181364, 185486, 190016, 194714, 199637, 205102, 211154, 217350, 223350, 229497, 236451, 244417, 253066, 262076, 271351, 280715, 289725, 297937, 305126, 311367, 317171, 323528, 331338, 340553, 350130, 359083, 367445, 376030, 385406, 395371, 405331, 414881, 423914, 432441, 440547, 448509, 456740, 465457, 474418, 483069, 491006, 498279, 505247, 512187, 519004, 525249, 530410, 534312, 537312, 540083, 543170, 546743, 550663, 554593, 558040, 560562, 562106, 563041, 563726, 564170, 564290, 564344, 564881, 566246, 568322, 570740, 573183, 575467, 577526, 579450, 581495, 584009, 587359, 591824, 597385, 603611, 609912, 616015, 622131, 628653, 635833]
52234F35833P941Q772R507R769R321Q443P734P579P865Q208Q221P655O513N217
52220G48578M417M332M514M431M073L621K876J557J36m91l08m26j518k747k891
52205G70154k080j536j844k407k609k690l147l900m531m957n424n960o217n911
52191G16941n265m891n109n445n089l979l023k981l496l683l386l160l272l390
52177F60772l275l058k766k209j559j329j600j882j987k413l431m435m697m271
52163F21860l677l116k534k145k198k470k480k166j930k073k517l010l330l279
52149E84935k776j954j075m87n64j369k262k395j810j521k133k939k958k379k124
52134E56189k369k418k033j904k477l150l113k515k187k451k776k589j995j541
$$ y = [635833, 643774, 652546, 662053, 671822, 681143, 689586, 697320, 704899, 712764, 720972, 729193, 736848, 743361, 748578, 752995, 757327, 761841, 766272, 770345, 773966, 776842, 778399, 778535, 778044, 777736, 777310, 775792, 773045, 770154, 768074, 766538, 764694, 762287, 759678, 756988, 753841, 749941, 745410, 740453, 735029, 729069, 722852, 716941, 711676, 706785, 701676, 696231, 691142, 687163, 684140, 681159, 677663, 673980, 670594, 667434, 664162, 660772, 657497, 654439, 651673, 649464, 647905, 646576, 644976, 643094, 641107, 638694, 635263, 630828, 626131, 621860, 618183, 615067, 612533, 610388, 608190, 605720, 603240, 601074, 599144, 597071, 594554, 591544, 588214, 584935, 582159, 580205, 579130, 578643, 578079, 576710, 574448, 572053, 570243, 568722, 566589, 563650, 560692, 558313, 556189, 553820, 551402, 549369, 547465, 544988, 541838, 538725, 536210, 534023, 531572, 528796, 526207, 524212, 522671]
52120E22671j508j659j642j389j042n71K50J443K599L209L142K747K564K995M017
52105E37826N165N919O285O782P742Q885R712J0088J0276J0581J1173J2015J2748
52092F55197J2875J2351J1816J1906J2455J2711J2279J1556J1225J1570J2258
52081G88199J2606J2096J0817R387Q379P844P389O590N255L603K243J737J950
52068H78095K106J577M09j007k369l409l921m138m620n401n744n218m482m354
52054H37524m608m441l818l437l548l690l604l524l462l035k217j496j073n66
52040G95005R2K36n61j634j875r88L03J113J130P64P52J419K191K169J293N06
52024H01915N15Q69O52l31j411j929j751j185p34q69j696k841l874m736n653o801
$$ y = [522671, 521163, 519504, 517862, 516473, 515431, 514860, 515110, 516553, 519152, 522361, 525503, 528250, 530814, 533809, 537826, 542991, 548910, 555195, 561977, 569719, 578604, 588316, 598404, 608680, 619261, 630434, 642449, 655197, 668072, 680423, 692239, 704145, 716600, 729311, 741590, 753146, 764371, 775941, 788199, 800805, 812901, 823718, 833105, 841484, 849328, 856717, 863307, 868562, 872165, 874408, 876145, 878095, 880201, 881778, 882187, 881180, 878811, 875402, 871481, 867343, 862723, 857322, 851578, 846360, 841878, 837524, 832916, 828475, 824657, 821220, 817672, 813982, 810378, 806854, 803392, 800357, 798140, 796644, 795571, 795005, 795097, 795333, 794772, 793138, 791263, 790275, 790578, 791691, 792821, 793585, 794337, 795756, 797947, 800116, 801409, 801915, 802430, 803299, 803951, 803620, 802209, 800280, 798529, 797344, 796610, 795741, 794045, 791204, 787330, 782594, 776941, 770140]
52008G70140q175r637j0905j1656j1830j1764j1917j2519j3497j4577j5403j5804
$$ y = [770140, 761965, 752328, 741423, 729767, 717937, 706173, 694256, 681737, 668240, 653663, 638260, 622456]
$$ [...]
##END NTUPLES=NMR SPECTRUM
##END=
