##TITLE=NES1018_872015066_9266120_aT6socKug7
##JCAMPDX= 6.0         $$ Bruker NMR JCAMP-DX V2.0
##DATA TYPE= NMR SPECTRUM
##DATA CLASS= NTUPLES
##ORIGIN= BRUKER
##OWNER= Administrator
$$ 1.72 TOPSPIN		Version 2.1
$$ 2015-07-09 23:25:25.691 -0700  Administrator@X
$$ Compression mode = diff/dup
##.OBSERVE FREQUENCY= 400.02188249412
##.OBSERVE NUCLEUS= ^1H
##.ACQUISITION MODE= SIMULTANEOUS (DQD)
##.ACQUISITION SCHEME= undefined
##.AVERAGES= 8
##.DIGITISER RES= 22
##SPECTROMETER/DATA SYSTEM= spect
##.PULSE SEQUENCE= zg30
##.SOLVENT NAME= COFFEE_meoh
##.SHIFT REFERENCE= INTERNAL, COFFEE_meoh, 1, 14.98509
##AUDIT TRAIL= $$ (NUMBER, WHEN, WHO, WHERE, PROCESS, VERSION, WHAT)
$$ ##TITLE= Audit trail, TOPSPIN		Version 2.1
$$ ##JCAMPDX= 5.01
$$ ##ORIGIN= Bruker BioSpin GmbH
$$ ##OWNER= Administrator
$$ $$ E:\/data/COFFEE/nmr/NES1018_872015066_9266120_aT6socKug7/10/pdata/1/auditp.txt
$$ ##AUDIT TRAIL=  $$ (NUMBER, WHEN, WHO, WHERE, PROCESS, VERSION, WHAT)
(   1,<2015-07-09 23:25:18.269 -0700>,<Administrator>,<X>,<go>,<TOPSPIN 2.1>,
      <created by zg
	started at 2015-07-09 23:24:12.363 -0700,
	POWCHK enabled, PULCHK disabled,
       configuration hash MD5:
       21 0F 79 D6 B3 7B B4 F6 88 20 88 DB 03 48 BD 9F
       data hash MD5: 64K
       B9 82 86 3B 37 54 C2 AF FE FB 66 B0 B9 A3 85 32>)
(   2,<2015-07-09 23:25:21.519 -0700>,<Administrator>,<X>,<proc1d>,<TOPSPIN 2.1>,
      <Start of raw data processing
       efp LB = 0 FT_mod = 6 PKNL = 1 PHC0 = 0 PHC1 = 0 SI = 32K 
       data hash MD5: 32K
       F0 57 93 5A B0 B3 4A FC F2 6A 4E 44 05 A9 E7 78>)
(   3,<2015-07-09 23:25:21.785 -0700>,<Administrator>,<X>,<proc1d>,<TOPSPIN 2.1>,
      <pk PHC0 = 90.401 PHC1 = 0 
       data hash MD5: 32K
       4F 73 13 D9 04 18 FA 6E 97 76 37 51 27 3B A8 D0>)
(   4,<2015-07-09 23:25:21.910 -0700>,<Administrator>,<X>,<proc1d>,<TOPSPIN 2.1>,
      <abs ABSG = 1 
       data hash MD5: 32K
       3C FB 23 77 FC B1 A2 F2 7F 83 D7 51 C8 57 26 00>)
(   5,<2015-07-09 23:25:21.988 -0700>,<Administrator>,<X>,<proc1d>,<TOPSPIN 2.1>,
      <abs ABSG = 2 
       data hash MD5: 32K
       35 01 0A C0 11 94 6F 1D 48 EB 77 A0 5B 47 5F 13>)
(   6,<2015-07-09 23:25:22.050 -0700>,<Administrator>,<X>,<proc1d>,<TOPSPIN 2.1>,
      <abs ABSG = 3 
       data hash MD5: 32K
       47 4F 9E A9 78 D6 BD F8 BA 78 3A 27 4A 7F 8D 61>)
(   7,<2015-07-09 23:25:22.113 -0700>,<Administrator>,<X>,<proc1d>,<TOPSPIN 2.1>,
      <abs ABSG = 4 
       data hash MD5: 32K
       D6 25 7F DC 2F 33 72 0A D6 FA 09 0E 81 41 BC 5E>)
(   8,<2015-07-09 23:25:22.175 -0700>,<Administrator>,<X>,<proc1d>,<TOPSPIN 2.1>,
      <abs ABSG = 5 
       data hash MD5: 32K
       5E 0F 53 83 D3 3D A1 12 59 8A DC 97 D5 4C 74 F6>)
$$ ##END=
$$ 
$$ $$ hash MD5
$$ $$ E9 0E 97 6C E1 66 73 4A CF 64 53 10 67 63 3B 21
##$RELAX= 
##$RELAX= 
##$RELAX= 
##$RELAX= 
##$RELAX= 
##$RELAX= 
##$RELAX= 
$$ Bruker specific parameters
$$ --------------------------
##$DU= <E:\>
##$EXPNO= 10
##$NAME= <NES1018_872015066_9266120_aT6socKug7>
$$ [...]
##$TP= (0..7)
150 150 150 150 150 150 150 150
##$TP07= 0
##$TPNAME0= <>
##$TPNAME1= <>
##$TPNAME2= <>
##$TPNAME3= <>
##$TPNAME4= <>
##$TPNAME5= <>
##$TPNAME6= <>
##$TPNAME7= <>
##$TPOAL= (0..7)
0.5 0.5 0.5 0.5 0.5 0.5 0.5 0.5
##$TPOFFS= (0..7)
0 0 0 0 0 0 0 0
##$TUNHIN= 0
##$TUNHOUT= 0
##$TUNXOUT= 0
##$USERA1= <user>
##$USERA2= <user>
##$USERA3= <user>
##$USERA4= <user>
##$USERA5= <user>
##$V9= 5
##$VALIST= <valist>
##$VCLIST= <CCCCCCCCCCCCCCC>
##$VD= 0
##$VDLIST= <DDDDDDDDDDDDDDD>
##$VPLIST= <PPPPPPPPPPPPPPP>
##$VTLIST= <TTTTTTTTTTTTTTT>
##$WBST= 2048
##$WBSW= 25
##$XGAIN= (0..3)
0 0 0 0
##$XL= 0
##$YL= 0
##$YMAX_a= 544295
##$YMIN_a= -457774
##$ZGOPTNS= <>
##$ZL1= 120
##$ZL2= 120
##$ZL3= 120
##$ZL4= 120
##$ABSF1= 14.98509
##$ABSF2= -5.573092
##$ABSG= 5
##$ABSL= 3
##$ALPHA= 0
##$AQORDER= 0
##$ASSFAC= 0
##$ASSFACI= 0
##$ASSFACX= 0
##$ASSWID= 0
##$AUNMP= <proc_prof1d_extract_pilot.lims>
##$AXLEFT= 0
##$AXNAME= <>
##$AXNUC= <1H>
##$AXRIGHT= 0
##$AXTYPE= 0
##$AXUNIT= <>
##$AZFE= 0.1
##$AZFW= 0.1
##$BCFW= 0
##$BC_mod= 0
##$BYTORDP= 0
##$COROFFS= 0
##$CY= 15
##$DATMOD= 1
##$DC= 0
##$DFILT= <>
##$DTYPP= 0
##$F1P= 0
##$F2P= 0
##$FCOR= 0.5
##$FTSIZE= 32768
##$FT_mod= 6
##$GAMMA= 0
##$GB= 0
##$INTBC= 1
##$INTSCL= 1
##$ISEN= 128
##$LB= 0
##$LEV0= 0
##$LPBIN= 0
##$MAXI= 10000
##$MC2= 0
##$MEAN= 0
##$ME_mod= 0
##$MI= 0
##$NCOEF= 0
##$NC_proc= -8
##$NLEV= 6
##$NOISF1= 0
##$NOISF2= 0
##$NSP= 0
##$NTH_PI= 0
##$NZP= 0
##$OFFSET= 14.98509
##$PC= 1
##$PHC0= 90.401
##$PHC1= 0
##$PH_mod= 1
##$PKNL= yes
##$PPARMOD= 0
##$PPDIAG= 0
##$PPIPTYP= 0
##$PPMPNUM= 2147483647
##$PPRESOL= 1
##$PSCAL= 4
##$PSIGN= 0
##$PYNMP= <proc.py>
##$REVERSE= no
##$SF= 400.02
##$SI= 32768
##$SIGF1= 0
##$SIGF2= 0
##$SINO= 400
##$SIOLD= 32768
##$SPECTYP= <>
##$SREGLST= <1H.CDCl3>
##$SSB= 0
##$STSI= 32768
##$STSR= 0
##$SW_p= 8223.68421052631
##$SYMM= 0
##$S_DEV= 0
##$TDeff= 65536
##$TDoff= 0
##$TI= <>
##$TILT= no
##$TM1= 0
##$TM2= 0
##$TOPLEV= 0
##$USERP1= <user>
##$USERP2= <user>
##$USERP3= <user>
##$USERP4= <user>
##$USERP5= <user>
##$WDW= 1
##$XDIM= 32768
##$YMAX_p= 416008751
##$YMIN_p= -702831
##$CURPLOT= <Network HP LaserJet P1505>
##$CURPRIN= <$Network HP LaserJet P1505>
##$DFORMAT= <normdp>
##$LAYOUT= <+/1D_H.xwp>
##$LFORMAT= <normlp>
##$PFORMAT= <normpl>
##$SURQMSG= 1
$$ End of Bruker specific parameters
$$ ---------------------------------
##NTUPLES= NMR SPECTRUM
##VAR_NAME=  FREQUENCY,     SPECTRUM/REAL,   SPECTRUM/IMAG
##SYMBOL=    X,             R,               I
##VAR_TYPE=  INDEPENDENT,   DEPENDENT,       DEPENDENT
##VAR_FORM=  AFFN,          ASDF,            ASDF
##VAR_DIM=   32768,         32768,           32768
##UNITS=     HZ,            ARBITRARY UNITS, ARBITRARY UNITS
##FACTOR=    0.250966925370066, 1,           1
##FIRST=     8223.43324360094, -131375,      40468
##LAST=      0,             -87855,          -105239
##MIN=       0,             -702831,         0
##MAX=       8223.43324360094, 416008751,    0
$$ Real data points
##PAGE= N=1
##DATA TABLE= (X++(R..R)), XYDATA
$$ [...]
19523a90018J5633p917p4284A38557n8874c66001a29307p5926f7138j76326O1565
19512a81899n116c5811R175j23471r2791b7968j8641B12021K50411C8426b94352
19500B35361f7027L462k22715A84720a5908l24019B7737i1079j62820a19895G0204
19488c9157J0942D808a2781k22991E6992c76516A39438J21742a04226A01209b98963
19476a41153j29806H2768c5026l6241L5366k25909f3594j16215B6761J47876a76224
19464G9994A6235b6361B2269a90824c379j10080j03477k7155d7469m2344I7422
19452b03879f037A9600k581J69813O916J67798b40040C53772i6702g190j69253
19441a76443A05111c53003A99528b88650C4628a74181k3487O2791B2050i3857
$$ plain form
19523 -190018 -174385 -182302 -256586 138557 79683 -366001 -129307 -205233 -67138 -243464 -181899
19512 -181899 -187015 -35811 -26636 -150107 -242898 -27968 -46609 212021 462432 38426 -294352
19500 235361 -67027 -63565 -286280 184720 -15908 -339927 27737 -91079 -253899 -119895 70204
19488 -39157 -28215 4808 -12781 -235772 56992 -376516 139438 261180 -104226 101209 -298963
19476 -141153 -270959 82768 -35026 -71267 -35901 -261810 -63594 -179809 26761 174637 -176224
19464 79994 16235 -26361 22269 -190824 -3379 -113459 -216936 -244091 -47469 -89813 97422
19452 -203879 -6037 19600 17019 186832 193748 361546 -240040 353772 -96702 -7190 -176443
19441 -176443 105111 -353003 199528 -288650 34628 -174181 -197668 -134877 22050 -93857
19430b45412B08141c1293I0493a90905C6457L7273h3621n547B13778d0244l6999
19419g7243A53930G5511b43681F7945a16605k91979c9970I115J56325G9775a08750
19407b36703I4375J90682I1170b6113B00080a62654N3365G6941a14710J7342A93441
19395c43752a19537A17876B6329g4893e479A65622a73394I7815i120d228m77243
19384d81471J81814J05790C9902B537J9363i8360A82145n7352d09522J90700B54839
19372A17734i1187A86275f6434J2j17266A24896J50756a48730b8935J0789f464
19360a65489L7874k54978N4475a19625I4429a41824j18266N9878J7971A46661
19349a2692e210o3514j93991A3359O7845a08651B05393i4399k41496J56832i844
$$ plain form
19430 -245412 208141 -31293 90493 -190905 36457 73730 -83621 -89168 213778 -40244 -77243
19419 -77243 153930 75511 -243681 67945 -116605 -408584 -39970 9115 165440 79775 -108750
19407 -236703 94375 285057 91170 -26113 200080 -162654 -109289 76941 -114710 -97368 193441
19395 -343752 -119537 117876 26329 -74893 -5479 165622 -173394 97815 -9120 -4228 -481471
19384 -481471 -299657 -193867 39902 2537 21900 -98360 182145 124793 -409522 -218822 254839
19372 117734 -91187 186275 -66434 -66422 -183688 124896 275652 -148730 -28935 -18146 -6464
19360 -165489 -127615 -382593 -328118 -119625 94429 -141824 -260090 -200212 -182241 146661
19349 -12692 -5210 -68724 -262715 13359 81204 -108651 205393 -94399 -335895 -179063 -9844
19337I2224c54301R453o3889J5494C459b08966n653M7726B9451a40484B43311
19325a25226A56586b4518j32252F3005J00146A2490a20835b3408k48955E2539
19314D3854J25829a03898Q806k35163a35661O3592F7651a70914k33364A26538
19303b22337F5002a56268f0245q5710f9130o315h023l9675j29851A51772E6860
19291b64972O6221d4928m5123G805b0166j56170j11404J08862j410A02900j0081
19280I2819a14562B32767d2975l19474g2994j90175C9313a8357A93043A9948a57923
19268H8714A5741J12764h7758q2534C591a94335j02281i4365o1666d2040A81307
19256b61411c4217o1639B08300b38898H179a04314J67a6336j10706N03c6027I9474
$$ plain form
19337 92224 -354301 -344848 -408737 -393243 3459 -208966 -214619 -166893 29451 -140484 243311
19325 -125226 156586 -24518 -156770 63005 163151 12490 -120835 -23408 -272363 52539
19314 43854 169683 -103898 -95092 -330255 -135661 -72069 67651 -170914 -404278 126538
19303 -222337 65002 -156268 -60245 -145955 -69130 -75445 -8023 -47698 -177549 151772 56860
19291 -264972 -198751 -44928 -90051 7805 -20166 -176336 -287740 -178878 -180288 102900 92819
19280 92819 -114562 232767 -42975 -362449 -72994 -263169 39313 -18357 193043 19948 -157923
19268 88714 15741 128505 -87758 -170292 3591 -194335 -296616 -94365 -156031 -42040 181307
19256 -261411 -34217 -95856 208300 -238898 8179 -104314 -104147 -16336 -127042 -126539 -36027 99474
19243a36419p5219O1134P254E5915B3169a38647J343M9343g163j32245a4101F7919
19230B8434O8837J27771a26476r5232D5015b07648O3494d6473k09923l3301a42712
19218a35799c4814m8218C5850L1152K1892j8664c11274I6021a76057A53000b01914
19206d36335a37697f0640k60591M9743C3985a61638A95943a30404e7096E9508
19195H3054c36551f1005C16178a66724K1623N0985l01687A8683R9651N0956c93965
19183c39762A83645b08872a8387I7908h8460A85051J26957g2463r7105j80137
19173c49705B5558N8875i635D9835L59644a26089a308A0131d5767l76925g8908
19161b32534P1485k12359a64746h1790A5637d71181B24815b64976A7501a24082
$$ plain form
19243 -136419 -211638 -150504 -143250 55915 23169 -138647 -137304 -87961 -7163 -139408 -14101 67919
19230 28434 97271 225042 -126476 -221708 45015 -207648 -144154 -46473 -256396 -289697 -142712
19218 -135799 -34814 -83032 35850 67002 88894 70230 -311274 96021 -176057 153000 -201914
19206 -436335 -137697 -60640 -321231 -271488 33985 -161638 195943 -130404 -57096 59508
19195 83054 -336551 -61005 316178 -166724 -145101 -94116 -395803 18683 118334 169290 -393965
19183 -339762 183645 -208872 -18387 97908 -88460 185051 312008 -72463 -169568 -349705
19173 -349705 25558 84433 -9635 49835 409479 -126089 -1308 10131 -45767 -422692 -78908
19161 -232534 -161049 -373408 -164746 -81790 15637 -471181 224815 -264976 17501 -124082
19150i3462l3171i732K882l57746b1103j92226B36494p2746G3211d97528a70281
19138A9472J0307h7564c1108q6129J6249M9759b3888F4866c24709a0309H9297
19126a04056B09515e5420A13947b39267i8026C29972c86218A47779a24248D9299
19115D4814a1244F8423a75560a127j01817b2259k26667G587h5402k1958b8064
19103h9008o2159l10K6346n3100h2961k7900E8982b08525r5462f0378J128l6611
19091i5861B68572f9238p4088b4841l2161p7779A69101a44187M791O4078K2761
19080e2557k35553B16007K098I6500M1330C7161b61241e5984o0103j13698N7183
19069a72602A36642h4514j24207A02598d9878I5915J54268h3977k9587j06587
$$ plain form
19150 -93462 -126633 -9732 -6850 -364596 -21103 -213329 236494 163748 73211 -497528 -170281
19138 19472 29779 -87564 -31108 -117237 -100988 -51229 -23888 64866 -324709 -10309 89297
19126 -104056 209515 -55420 113947 -239267 -98026 329972 -386218 147779 -124248 49299
19115 44814 -11244 68423 -175560 -1127 -102944 -22259 -248926 7587 -85402 -107360 -28064
19103 -89008 -151167 -151477 -125131 -178231 -82961 -110861 58982 -208525 -303987 -60378 -59250 -95861
19091 -95861 268572 -69238 -143326 -24841 -57002 -134781 169101 -144187 -139396 -75318 -52557
19080 -52557 -288110 216007 218105 96500 137830 37161 -261241 -55984 -116087 -229785 -172602
19069 -172602 136642 -84514 -208721 102598 -49878 95915 250183 -83977 -113564 -220151
19059b20151F5990J65608c9499J5519m07867A74690b73243A23456J79196a0263
19048D4380C83J9623L2393h1958q7248p5800D662a05851P584C14729D8114N8894
19036A07008a48281j6709A78756K06706D3269c07848a17970c8580A23245O0871
19026A84116g54j17182a7172B38992C0645M6455J33131a96579F7550n73j2401
19015E4576a77508A3008M2473a157k99351A51626J34053a873k19924c3992B20189
19003a38235a4051A61548a98010E3570B3744d69473a05585L6555c4053r2470k52913
18992c79436a5822f704o4785A40681a45820a5777j05279M9909B4415c122F4390
18980h8667o9692a4022l87635a21681E2511d19127d9683l50605B25d7812Q91A63401
$$ plain form
19059 -220151 65990 231598 -39499 -23980 -431847 174690 -273243 123456 302652 -10263
19048 44380 383 20006 52399 -81958 -169206 -245006 4662 -105851 -98267 314729 48114 107008
19036 107008 -148281 -164990 178756 385462 43269 -307848 -117970 -38580 123245 184116
19026 184116 -754 -117936 -17172 238992 30645 77100 210231 -196579 67550 66977 54576
19015 54576 -177508 13008 55481 -1157 -300508 151626 285679 -1873 -221797 -33992 220189
19003 -138235 -14051 161548 -198010 53570 23744 -469473 -105585 -69030 -34053 -126523 -379436
18992 -379436 -15822 -6704 -71489 140681 -145820 -15777 -121056 -71147 24415 -3122 64390
18980 -88667 -158359 -14022 -401657 -121681 52511 -419127 -49683 -400288 225 -47812 -46921 163401
18967A96238J41610E4581c00737C64287i1547C4681c05945N6627O7499B04804
18956A9755K7348J36368c51610d2088l92251f9802k9187k61328F7284J59531c9834
18944D0861c0825F9680J4341P3614b14676o6201B09908d7672A77391d6147j07996
18933a54143j00616E500P5220K7746c5585A35503k5032a32999E8883N8616l6314
18922H1185c3339p0520G7369i670B9946c855A55700e09901a57864E3808b24219
18910A49144a47224G4654J67611i7073l8510I6457a46410q384A15153a32000I5971
18898f1138A32873e8923q2613j05829i6114B11068a23723r7217B7600J6355A5095
18886a99613G7115R2057b23917B26334A0678d32739c5955j25038d4335k53202
$$ plain form
18967 196238 337848 54581 -300737 364287 -91547 34681 -305945 -249318 -181819 204804
18956 19755 47103 183471 -351610 -42088 -434339 -69802 -98989 -360317 67284 226815 -39834
18944 40861 -30825 69680 84021 157635 -214676 -280877 209908 -47672 177391 -46147 -154143
18933 -154143 -254759 5500 80720 108466 -35585 135503 110471 -132999 58883 117499 81185
18922 81185 -33339 -103859 77369 -9670 29946 -3855 155700 -509901 -157864 53808 -224219
18910 149144 -147224 74654 242265 -97073 -135583 96457 -146410 -154794 115153 -132000 95971
18898 -61138 132873 -58923 -141536 -247365 -96114 211068 -123723 -220940 27600 43955 15095
18886 -199613 77115 169172 -223917 226334 10678 -432739 -35955 -160993 -44335 -297537
18876b97537b1947B47361a27273j94418h4626C22363F8532a74296c7619k04319
18866b41938p3889H4992J91690g2126A69096c42841J15629J8576c0048H2550b85871
18854B2849h8872I5073a36637j55854a8412A29338c43320a63703d5115B20796
18843B03723b9200o301k87784D1279F720J82696c7441A57298b28926i3332k0266
18832a13598j90703n6725C9146a98212A86740J25715a45724A28018a29626A06517
18821B66817A7385c1419C3652N9900f4073A67454a46682h863k01646A07068A4958
18809A13885a33615C3368c2163r3477G3194a45087A15098a9266F7279N0273a05253
18797F8919J17171a32118A43820a14088r2326A57390c76052g6072B87544j07993
$$ plain form
18876 -297537 -21947 247361 -127273 -321691 -84626 322363 68532 -174296 -37619 -241938
18866 -241938 -315827 84992 276682 -72126 169096 -342841 -227212 -208636 -30048 82550 -285871
18854 22849 -88872 95073 -136637 -292491 -18412 129338 -343320 -163703 -45115 220796
18843 203723 -29200 -35501 -323285 41279 6720 189416 -37441 157298 -228926 -93332 -113598
18832 -113598 -304301 -361026 39146 -198212 186740 312455 -145724 128018 -129626 106517
18821 266817 17385 -31419 33652 93552 -64073 167454 -146682 -8863 -210509 107068 14958
18809 113885 -133615 33368 -32163 -125640 73194 -145087 115098 -19266 67279 117552 -105253
18797 68919 186090 -132118 143820 -114088 -206414 157390 -376052 -76072 287544 179551
18787A79551a12586J7309D6094P0236b53504F5939O8002G382a62069B84340r6447
18776A87893i8003k8096o7870I44f6066B30351i3235j92051A8250b39357f2248
18764c49988J58146Q4703k4609a6804r8480k09622G2987L5834a03574b1412r8476
18753a19888k38783B09385A1697d8834C87985i9315k9292l63138A1727N7842K1600
18742I1169a13243E241a11196A3373J8836c04372M9762d1940n9811f595j08578
18731a15173E383J13236C5855b5273E6319c30844f4686r0965o9567M0993k3798
18720b08023i3024b9682m0629A11523c02076D0115h9789A45086a17157A16151
18709a7844A2959l698J39419K2931d13803J20076B6440K01392r6246L16939a67167
$$ plain form
18787 179551 -112586 -95277 46094 116330 -253504 65939 133941 7382 -162069 284340 187893
18776 187893 -98003 -126099 -193969 944 -66066 230351 -93235 -285286 18250 -239357 -62248
18764 -349988 -191842 -107139 -131748 -16804 -115284 -324906 72987 108821 -103574 -21412 -119888
18753 -119888 -358671 209385 11697 -48834 387985 -99315 -128607 -491745 11727 69569 91169
18742 91169 -113243 5241 -111196 13373 32209 -304372 -254610 -41940 -101751 -6595 -115173
18731 -115173 5383 118619 35855 -25273 56319 -330844 -64686 -155651 -225218 -184225 -208023
18720 -208023 -93024 -29682 -70311 111523 -302076 40115 -89789 145086 -117157 116151
18709 -17844 12959 9261 148680 171611 -413803 -293727 26440 227832 131586 448525 -167167
18697c1378C420b54152f9583A37965j9272Q5923m0530e21148a1140j69556P6711
18686a03985E2015K62380d7552j70636K8019M0799r1755A73614K5472c16699e6972
18674B2493L5225f7626g278B3938L77903b1583l3433p9352j64862A85882p1153
18663A14729d55598b03350g6759n5080B0551R9742f5811j3608K9085l82837B3958
18651a64236k76713A18279m6165B6020c29278j13803K16392I4878C703L05617
18641C09320J305j37024b61870N5730K8989f7169J9429e330B71730g2687j78545
18630b51232B0350M3336i7900E7815a3996p8623l0224j93059a29279B6877K4988
18619E1865g844A3466J15277c5269k27649a27603A71186l326k7035J26342p3770
$$ plain form
18697 -31378 3420 -254152 -69583 137965 118693 204616 164086 -521148 -11140 -180696 -103985
18686 -103985 52015 314395 -47552 -218188 -190169 -149370 -241125 173614 199086 -316699 -56972
18674 22493 57718 -67626 -7278 23938 401841 -21583 -55016 -134368 -299230 185882 114729
18663 114729 -455598 -203350 -76759 -131839 20551 120293 -65811 -79419 -50334 -433171 23958
18651 -164236 -440949 118279 72114 26020 -329278 -443081 -226689 94878 3703 309320
18641 309320 310625 173601 -261870 -206140 -177151 -67169 -47740 -5330 271730 -72687 -251232
18630 -251232 20350 63686 -97900 57815 -13996 -92619 -122843 -315902 -129279 26877 51865
18619 51865 -7844 13466 128743 -35269 -262918 -127603 171186 167860 140825 267167 193397
18608A93397b27420G4409i7460j52287e792D5273K12283d097A65987J07433I5111
18596D5530e0941A00423D5929c193A49960e5905k56479E6706g880j99215A71054
18584E2904b32205j33778a74739M0143c5642k69246A5991a43257n4890A01464
18573A21733d0620q07l0503B93636j03935a37697p5123f2680m78722h2034F9278
18561b15796j2721I8775A7786a22272A29765a1288G205c69659g0447A23579b8836
18549a16326j69029L7124C3372a95414J3374O5027A42280L7402f6872j10702A57851
18537b70069B28738e25074E9841a12606A58187a09967n45N2277r4051B95397a81030
18525a56311J7235G5294B7319J76750a30806E2452b58629A9576i8836l3315A09309
$$ plain form
18608 193397 -227420 74409 -97460 -249747 -5792 45273 257556 -4097 165987 273420 95111
18596 45530 -50941 100423 45929 -3193 149960 -55905 -312384 56706 -7880 -207095 171054
18584 52904 -232205 -365983 -174739 -134596 -35642 -304888 15991 -143257 -198147 101464
18573 121733 -40620 -41427 -71930 293636 189701 -137697 -212820 -62680 -541402 -82034 69278
18561 -215796 -228517 98775 17786 -122272 129765 -11288 7205 -369659 -70447 123579 -28836
18549 -116326 -285355 -248231 33372 -195414 -182040 -117013 142280 179682 -66872 -177574 157851
18537 -270069 228738 -525074 59841 -112606 158187 -109967 -110512 -58235 -152286 295397 -181030
18525 -156311 -139076 75294 27319 204069 -130806 52452 -258629 19576 -98836 -132151 109309
18513a09042d5154l8810J0764l1421b6026n6412j28647A66520B4895c10035i6366
18501b21802C27727a11240o9493j24913A53051b39627H6304J26031f4201r200
18491g3401j43593C2873E179c81056B37788a10746A73993c1397l64782B29496
18480b3456H9949a25775J1390A50938a68206m7797A0998a31431k89012a43162
18469b07224M6898g6135K9411j80132l30651A17379f3775p2978O2948m4503k94483
18458d12791C6156a14357E3207p003L7429K39833a6341n1124j0227p1856F5487
18446b0422B08096J09513c15733L2026B65432j24218a2279j6360m4926q8082B71835
18434B8819g0204b1939B7840a08184A33364b1576B11048b90169F5709a7799l6793
$$ plain form
18513 -109042 -45154 -83964 -73200 -104621 -26026 -82438 -211085 166520 24895 -310035 -96366
18501 -221802 327727 -111240 -180733 -305646 153051 -239627 86304 212335 -64201 -73401
18491 -73401 -216994 32873 5179 -381056 237788 -110746 173993 -31397 -396179 229496
18480 -23456 89949 -125775 -114385 150938 -168206 -216003 10998 -131431 -420443 -143162
18469 -207224 -160326 -76135 -46724 -226856 -557507 117379 -63775 -136753 -73805 -118308 -412791
18458 -412791 36156 -114357 53207 46204 83633 323466 -16341 -67465 -77692 -149548 65487
18446 -20422 208096 317609 -315733 -283707 265432 141214 -12279 -28639 -73565 -161647 271835
18434 28819 -70204 -21939 27840 -108184 133364 -21576 211048 -290169 65709 -17799 -54592
18423e4592j40703B7290a49219E4178h2176A45617I557L84a08695b0972j42926
18412a63898O3726B41047a31694G0212E418a52142j72438F7845b8468C83369F9274
18400h637A18646b04853J01165l669I5808a34325A11299i1290j3025k0550j32423
18389b57288c2424D595J65679d2189k19447A49920a39296D0578b23884b3747j42855
18378a66602i964m97687A86117c0435k0436E3376J48458a82849B2978N4930a68613
18366C710f9722j17882P6809k52769a03524a427A71757d04k86002d5305A73770
18354b24893g3137A7714b711j33384N9629A214a08804B94189f6612j77392A76573
18342A02580m4504a80361E8320N6231i3392A55914O4981c18971b9825j94770L4991
$$ plain form
18423 -54592 -195295 27290 -149219 54178 -82176 145617 9557 9941 -108695 -20972 -163898
18412 -163898 -100172 241047 -131694 70212 5418 -152142 -324580 67845 -28468 383369 69274
18400 -8637 118646 -204853 -103688 -107357 95808 -134325 111299 -91290 -104315 -124865 -257288
18389 -257288 -32424 4595 170274 -42189 -261636 149920 -139296 40578 -223884 -23747 -166602
18378 -166602 -9964 -507651 186117 -30435 -50871 53376 201834 -182849 22978 77908 -168613
18366 3710 -69722 -187604 -110795 -363564 -103524 -1427 171757 -404 -286406 -45305 173770
18354 -224893 -73137 17714 -2711 -136095 -76466 1214 -108804 294189 -66612 -244004 176573
18342 102580 58076 -180361 58320 114551 -93392 155914 220895 -318971 -29825 -224595 -189604
18331a89604A31323C1437a82389b339A79202l2260a12477J874B9859N2361e5547
18319G9212b80501d2430q7457K0817j15692A62100a45101P2202r0418r640f637
18307a68574j05212G0402d75943B5944A980R7455f9330j31942Q8889j50450A84756
18295e4975n9089j86283b6899p2044j85712f5236l4053A55099I03L51189b9398
18283A17611N8285J33460c92979a24673A4820i9838d5807C15493f2033D3531J59110
18272B02641o0965c58852A37428a78172c7989B08409c32324E8830a44547C1888
18261D2912L8754C7271J52161a3296j27851j04353P6463N7327H4812a18952L8682
18250h0270B86300a56112j35010J27780P3050E8655j1991a1190D4991J43413J48310
$$ plain form
18331 -189604 131323 31437 -182389 -2339 179202 146942 -112477 -110603 29859 82220 -55547
18319 79212 -280501 -42430 -129887 -109070 -224762 162100 -145101 -72899 -163317 -172957 -6637
18307 -168574 -273786 70402 -475943 25944 1980 99435 -69330 -201272 -112383 -262833 184756
18295 -54975 -114064 -300347 -26899 -98943 -284655 -65236 -99289 155099 903 352092 -29398
18283 117611 175896 309356 -392979 -124673 14820 -99838 -45807 315493 -62033 43531 202641
18272 202641 141676 -358852 137428 -178172 -37989 208409 -332324 58830 -144547 31888
18261 42912 81666 37271 189432 -13296 -141147 -245500 -169037 -111710 84812 -118952 -80270
18250 -80270 286300 -156112 -291122 -163342 -90292 58655 46664 -11190 44991 188404 336714
18239C36714o8719c0726A10370D7272K77225O5597j92416c62220a41947j89226
18229c31173L2673A17568a44687G1709i6034j85662N5129A08998D514b06203B9964
18217A33181c45810d3690D5670P8922f9588A43227n3675J47738F6407a61413O780
18206a54633o4853A61881b15610a0333l7309I6043a20933g698D3279J17363g9931
18194d0233P571A18809a87912E6068A4950c9268k83994D4743J36547a49630n2369
18183b01999i3390M565B5199J87485a67896j96220a50541K2322k21112b231l3864
18172c6095G890g6272A15883N9456c07579B66534j10499d3248B23163E2302c0943
18160b03342I2327c11008a46076A34901A887c38050i325D0243Q8432b27685c8953
$$ plain form
18239 336714 267995 -30726 110370 47272 324497 390094 197678 -362220 -141947 -331173
18229 -331173 -298500 117568 -144687 71709 -96034 -281696 -226567 108998 4514 -206203 29964
18217 133181 -345810 -43690 45670 124592 -69588 143227 89552 237290 66407 -161413 -154633
18206 -154633 -219486 161881 -215610 -10333 -47642 96043 -120933 -7698 43279 160642 -79931
18194 -40233 -32662 118809 -187912 56068 14950 -39268 -323262 44743 181290 -149630 -201999
18183 -201999 -93390 -88825 25199 212684 -167896 -364116 -150541 -128219 -349331 -2231 -36095
18172 -36095 7890 -76272 115883 175339 -307579 266534 156035 -43248 223163 52302 -30943
18160 -203342 92327 -311008 -146076 134901 1887 -338050 -9325 40243 128675 -227685 -38953
18148a15205M0111C4561J19717a22308q4616D9016b93242A05052h0267G0390J52887
18137B23277q0401D9340e9856p7999E7107a70840g7262B6318L39444I5082a30207
18125c3539G6525Q6558c36750A85508a26276i843A43032n5390l8393K16884o6029
18114B00104e2513G0632B7410m203L0468i5031A25199j0468e9781o9674G7184
18102A39735C0562J78491a03420D2227a03280A54067R8806D7132J76002l373F327
18090C1185b11805D0267a5432n1493k80225f4806B05728a39641f0699j28492d2376
18078A43973n637K2057J18783b98523C517a22785C11642r1549h7811M1124b0377
18066b35780D1173K56000A1207O2507J95954D9019b6478j09987B20286E0205b50673
$$ plain form
18148 -115205 -75094 34561 154278 -122308 -206924 49016 -293242 105052 -80267 70390 223277
18137 223277 142876 49340 -59856 -137855 57107 -170840 -77262 26318 365762 95082 -130207
18125 -33539 76525 163083 -336750 185508 -126276 -9843 143032 87642 49249 266133 200104
18114 200104 -52513 70632 27410 23207 53675 -95031 125199 114731 -59781 -129455 77184
18102 139735 30562 209053 -103420 42227 -103280 154067 252873 47132 223134 219761 6327
18090 31185 -211805 40267 -15432 -66925 -347150 -64806 205728 -139641 -60699 -189191 -42376
18078 143973 138336 160393 279176 -298523 3517 -122785 311642 220093 -87811 -46687 -20377
18066 -235780 41173 297173 11207 73714 269668 49019 -26478 -136465 220286 50205 -250673
18054b23055A32308h0945K4287G4538c4017D6415d28927A60331j5573a98001C985
18042a9052j63078A95059a21520e715j93062A4384b07741F1613k7989L5470J97047
18031B66141a62546B18168c07988a31008A91479j6704h6219B73618D1940e4597
18020f381k70636I4676a80469A99135B6070R2030B8504g7046A1796J26334a23066
18008b51880A49075i0347j48114E3947a05303l3779L8469k58453A7055b0958n8326
17997g9284I5611Q8200G6781i4053K0808A7419i4702H5048c02307L2833B38102
17985A02615j0491k1585a55523r0957A40940c08439J46805E7933f4205B6007c02323
17973B77425G8695j6045o950N3507c5804j14809A55710b47500b0858I7443a96018
$$ plain form
18054 -223055 132308 -80945 -56658 74538 -34017 46415 -428927 160331 144758 -198001 3985
18042 -19052 -182130 195059 -121520 -5715 -198777 14384 -207741 61613 33624 69094 266141
18031 266141 -162546 218168 -307988 -131008 191479 174775 -86219 273618 41940 -54597
18020 -6381 -277017 94676 -180469 199135 26070 118100 28504 -77046 11796 138130 -123066
18008 -251880 149075 -90347 -238461 53947 -105303 -139082 -100613 -359066 17055 -20958 -79284
17997 -79284 95611 183811 76781 -94053 -73245 17419 -94702 85048 -302307 -269474 238102
17985 102615 92124 70539 -155523 -246480 140940 -308439 -161634 57933 -64205 26007 -302323
17973 277425 78695 62650 55700 109207 -35804 -150613 155710 -247500 -20858 97443 -196018
17961h5399j57801l98167I4089e761m7009C2255J59595c41038F4305J58552F4536
17949I8219Q8422a73134B12024b99223A23256b9870B37974B216J12806J9089F1245
17937G3691j0576i4202B1923a42110N903A68342o3161O7936J41813a98268B76426
17925a86079P4930d2073l2543D03521I8422L7758c45695h2411F5003g0106b6918
17913a41177L3570j34433a20974D3080b53061J25310r633j6861A99841A8993Q6262
17902A05255L6592C9729Q7746E8096j9830J11448b31253J5528i3246a4311j97926
17891b12237c3585A32767a6859A12143d4776A24069A7262J27898L4129G3409K10976
17880B84385b08761b2410B73956j33747b33980a2977E4241K76349I1551a08105
$$ plain form
17961 -85399 -243200 -641367 94089 -5761 -52770 32255 191850 -341038 64305 222857 64536
17949 98219 186641 -173134 212024 -299223 123256 -29870 237974 2216 115022 134111 61245
17937 73691 63115 -94202 21923 -142110 -136207 168342 105181 173117 314930 -198268 276426
17925 -186079 -111149 -42073 -74616 403521 98422 136180 -345695 -82411 65003 -70106 -26918
17913 -141177 -107607 -242040 -120974 43080 -253061 -127751 -137384 -154245 199841 18993 105255
17902 105255 141847 39729 127475 58096 38266 149714 -231253 -215725 -93246 -14311 -212237
17891 -212237 -33585 132767 -16859 112143 -44776 124069 17262 145160 179289 73409 284385
17880 284385 -208761 -22410 273956 140209 -233980 -12977 54241 330590 91551 -108105
17869C807@A36073J34412k6304A393J49765a12054J1804B22635b4881j35712e2697
17856D1373G299M4980b52962b436o0168E4787J66851D5623a45672O2592c6226
17844B21142q00h5083q932A47105a01115o9318C1518k796c2243C185L93600F4428
17831G0102h8992A01560J04975m7588h0368C8447a97826C48431A49076f9593B51513
17819i9541j1635N3473A8450k542M89445B02901b73155a00593B469h6693A34316
17807B76829a6347k7881n6361I3736A9734i8069A97553b81399f7876n7616L1994
17796i3498C21327I5590j0615b5882A37622c8568C08561j15140a28455D75411
17785A80581a9272A25179g5989A49815l0679i4868p1091b6618A73880b72334K9860
$$ plain form
17869 3807 0 136073 270485 244181 1393 151158 -112054 -100250 222635 -24881 -160593 -52697
17856 41373 7299 52279 -252962 -2436 -62604 54787 221638 45623 -145672 -83080 -36226
17844 221142 220342 -85083 -94015 147105 -101115 -170433 31518 28722 -32243 3185 396785 64428
17831 70102 -88992 101560 206535 158947 -80368 38447 -197826 348431 149076 -69593 251513
17819 -99541 -111176 -57703 18450 15908 505353 202901 -273155 -100593 2469 -86693 134316
17807 276829 -16347 -44228 -100589 93736 19734 -98069 197553 -281399 -67876 -125492 -93498
17796 -93498 321327 95590 84975 -25882 137622 -38568 308561 193421 -128455 475411
17785 180581 -19272 125179 -75989 149815 119136 -94868 -165959 -26618 173880 -272334 -242474
17774b42474B71206B8412K000a01480d0833j74239l2999B36817C6593J49062j6884
17763A68771P9874h866E9465a4404A94M3389a06473G9204J28030a1521A24120
17751b14533O7903B36564M9349j01068f9810j39038E6870c4674A62296b3679H2390
17739C4868N38J0728J10723J75106A64599D0535e9018j31342E8568d10939D3064
17727a88706A68886F3747a98097A10134e17652I7730A8533g4538D6454i2437A94921
17715E9586b37632k52744E1185K75733j26833D4933b51333B15293a26167B88182
17704D48999a1304A08195A4681J8440K07412I7256J21884l8233H1489M536d16856
17692A63392J17868a44609A05746N1386a55334P2924B2339O7916a03351a4839
$$ plain form
17774 -242474 271206 28412 30412 -101480 -40833 -215072 -248071 236817 36593 185655 168771
17763 168771 248645 -8866 59465 -14404 194 43583 -106473 79204 207234 -11521 124120
17751 -214533 -146630 236564 285913 184845 -69810 -208848 56870 -34674 162296 -23679 82390
17739 34868 35406 46134 156857 331963 164599 40535 -59018 -190360 58568 -410939 43064
17727 -188706 168886 63747 -198097 110134 -517652 97730 18533 -74538 46454 -92437 194921
17715 59586 -237632 -490376 51185 326918 200085 44933 -251333 215293 -126167 288182
17704 448999 -11304 108195 14681 33121 240533 97256 219140 180907 81489 86025 -416856
17692 163392 281260 -144609 105746 157132 -155334 -82410 22339 90255 -103351 -14839
17681a39846A99550a01053e0119b393B41033H7812J13560f942J243j88963E417
17669D2169K71834D260L84626P1277A00256c250A16041a01005A377J91695C4906
17657B58930d4752C51130H6461a41117B40125d4652B15594e5324A40747J57873
17647B98620b33719I4673j0294C6706J17768K1356j1331b81433D62072a53535
17636B92150J29795A3870n697d0750D73950j54698G9093M5142f2374A0510L53054
17625C63564A33647a65984d3500A35975K2916a4476A71510K9297O2008j11381
17615A51434h6647D79664b1522A24427h3742m255A20706J17o0046J04655J00781
17604B66213k7186j9807b67931f5324C06963O2605A45071K74116A45428J06572
$$ plain form
17681 -139846 199550 -101053 -50119 -2393 241033 87812 201372 -6942 -5699 -194662 5417
17669 42169 314003 4260 388886 460163 100256 -3250 116041 -101005 1377 193072 34906
17657 258930 -44752 351130 86461 -141117 240125 -44652 215594 -55324 140747 298620
17647 298620 -233719 94673 84379 36706 154474 175830 164499 -281433 462072 -153535
17636 292150 421945 13870 8173 -40750 473950 319252 79093 124235 -62374 10510 363564
17625 363564 133647 -165984 -43500 135975 158891 -14476 171510 200807 262815 151434
17615 151434 -86647 479664 -21522 124427 -83742 -87997 120706 120823 60777 165432 266213
17604 266213 239027 219220 -267931 -65324 306963 369568 145071 419187 145428 252000
17594B52000B5698J20982f5757B84605E7916J41706b1464C9112J65515B7213a70702
17582E1820J60622l5491J18468n153G0427K32805j08401G9933L92963D6300J34181
17571A80481A6663J0505L12595a20858d7580j1759D6908L7881d702r8655A30397
17559C20026j00473A07737O3594l3232a3B09570j1762d17793D3116R6650j981
17548A37785J5350h3007E11655A6897M41314b2049O962j11868b9544A10042J75705
17537B85747d4156p7422H8807L50454j34921M0992A49203M3337J60695J45204
17527D98439A18906Q666J87551q0085J29342J8814q5827m0615J12040J95361j70229
17516C93924j25577j03951j5966a1837B13600m8119K09255b4337C84028m487q565
$$ plain form
17594 252000 25698 146680 -65757 284605 57916 199622 -21464 39112 204627 27213 -170702
17582 51820 212442 176951 295419 290266 70427 303232 194831 79933 472896 46300 180481
17571 180481 16663 27168 339763 -120858 -47580 -59339 46908 84789 -4702 -103357 130397
17559 320026 219553 107737 171331 138099 -13 209570 197808 -417793 43116 139766 137785
17548 137785 153135 -83007 511655 16897 458211 -22049 -15087 -126955 -29544 110042 285747
17537 285747 -44156 -121578 88807 439261 304340 345332 149203 192540 353235 498439
17527 498439 118906 127572 315123 235038 364380 383194 297367 256752 368792 564153 393924
17516 393924 268347 164396 148430 -11837 213600 165481 374736 -24337 384028 379541 370976
17505C70976K12738A99040J1820L52133A4332P546a93937I0189L5016d2024B61569
17493C92886m2857G2263K93137j42978b12126B62022j00071J12269j16700a31930
17482D7655K0887K05829A3989L14919b4373m0697C97319N1513j81626J31853A02703
17470H3827J17468b60196A31922L33799j87777I1052J22175q9545n2694a38896
17459C06533j46143M0889J03066d4622j45649C00863j28957L94519A43312K32083
17449C75395A33958K626P3498o8235K36953a40585B40676n3694K68025A90666
17438c609B52598l2280D488J60425F0619J41747J42009J48787A10883a68544D27729
17426B01019k7328P9669L6666A35670O8848r0381K66173r8368j05959p6758L34033
$$ plain form
17505 370976 583714 199040 210860 562993 14332 21878 -193937 90189 125205 -42024 261569
17493 392886 350029 72263 365400 222422 -212126 262022 161951 274220 157520 -131930
17482 47655 68542 274371 13989 328908 -24373 -65070 397319 448832 267206 399059 102703
17470 83827 201295 -260196 131922 465721 277944 91052 213227 123682 70988 -138896
17459 306533 160390 201279 304345 -44622 -190271 300863 171906 566425 143312 375395
17449 375395 133958 136584 210082 141847 378800 -140585 240676 186982 455007 190666
17438 -3609 252598 220318 4488 164913 60619 202366 344375 493162 110883 -168544 427729
17426 201019 173691 253360 290026 135670 204518 114137 380310 281942 175983 99225 433258
17415D33258n0044J56319A38585n8662k8783a59699E72770I1196K14807J00845
17405D06848J37243H20O3476J40788J36282o1844P1721A68042K80387L1127A05115
17393A6526i4322E22828B46844A16739K04018d282B90950A01855K92136a20928
17382B81689j14063o6412Q3948c0990A31069E5822h5296A55888o593a60489A78277
17370F1783K05464G6306J62690G3574M43396A90456K8253K22591l8455b9226A71580
17358A54319O8199R2559k8793a26369A30707a6180E76491q9922k24850Q8872A48324
17346C60170r8475H4812a11167A36555d712B47681H6446L21346I3153K82803a05836
17334C80563j81905L6189K58424j81892j18576L8184E6862R8897m0402J84116
$$ plain form
17415 433258 383214 539533 138585 79923 51140 -159699 572770 91196 306003 406848
17405 406848 544091 820 64296 205084 341366 279522 351243 168042 448429 479556 105115
17393 16526 -94322 522828 246844 116739 320757 -4282 290950 101855 393991 -120928
17382 281689 167626 101214 185162 -30990 131069 55822 -85296 155888 149295 -160489 178277
17370 61783 267247 76306 238996 73574 516970 190456 218709 441300 402845 -29226 171580
17358 154319 222518 315077 286284 -126369 130707 -16180 576491 486569 261719 350591 148324
17346 360170 261695 84812 -111167 136555 -4712 247681 86446 407792 93153 375956 -105836
17334 380563 198658 234847 493271 311379 192803 230987 56862 155759 115357 299473
17324B99473j25006J72237b28224B66582Q6396j75192O3399q4525J00043C3977
17313A53170C8049J65289o9470R5916J14603o0030a76857B00850K07135j11926
17303B96059E4499J62172O3684n9401l1327L18070p8100A63839L33773j58509
17293C39103A36216O1428R3503H5140L8768K37269A02288C6707P6827J77303j6485
17282B74352g1409C80683j85267M2011r8927J29095o6459a32366g374p7659A72861
17270C7680M09056p9079r2499A33889K9880G3983K1039e90j20518E4739J88366
17259B43105o7740L96087j93085j32629K3428J49707A93969K25394A47868c196
17248A55334J63958A54681P0987O4484J3862P5663N0907L159H6456c857B93828
$$ plain form
17324 299473 174467 346704 -228224 266582 352978 177786 241185 156660 256703 33977
17313 153170 38049 203338 133868 229784 344387 284357 -176857 200850 407985 296059
17303 296059 54499 216671 280355 220954 189627 507697 429597 163839 497612 339103
17293 339103 136216 197644 291147 85140 123908 361177 102288 36707 113534 290837 274352
17282 274352 -71409 380683 195416 237427 138500 267595 201136 -132366 -7374 -85033 172861
17270 37680 446736 367657 275158 133889 163769 73983 95022 -590 -121108 54739 243105
17259 243105 175365 571452 378367 245738 269166 418873 193969 419363 147868 -3196
17248 155334 319292 154681 225668 290152 304014 379677 430584 433743 86456 -3857 293828
17236I8203M09516j48836j51652o1644n111M23961k47559j054J33719h5508A58979
17224A17857R7402J12816K10594m1921G0735K51632n4594H8743M7267L36225A25086
17212D57370j71681p299J81484r5632p4344K9090D6078M70964B14838J2110M1899
17201B68847L6164j06680K21024o2534k8988I5030M43522B37450K75562Q4264
17191E97276B46234K6218M29583B43224j1535O5841G5072M88069k48117J5452
17181C30476G188L61144O6191A93759J56431N9268J42838k67058K09845k46489
17171B48594p8269L59061j27761J55642l3660B11885j3936K93659j81854J21137
17161D30891E8239K77300J00399j8853A75831K41358K16227l10419K08439k20274
$$ plain form
17236 98203 507719 358883 207231 145587 140476 564437 316878 315824 449543 -85508 158979
17224 117857 215259 328075 538669 496748 70735 322367 267773 88743 136010 472235 125086
17212 457370 285689 278390 459874 364242 289898 318988 46078 517042 214838 226948 268847
17201 268847 305011 198331 419355 356821 327833 95030 538552 237450 513012 597276
17191 597276 246234 272452 702035 243224 231689 297530 75072 563141 315024 330476
17181 330476 7188 368332 434523 193759 350190 409458 552296 285238 495083 248594
17171 248594 170325 529386 401625 557267 523607 211885 197949 491608 309754 430891
17161 430891 58239 335539 435938 417085 175831 417189 633416 322997 531436 311162
17151C11162L32146l20614G9377L35350j8474J18429J09111B73564p5308J63253
17141C61509M36017C43221K16958k48049L15666k16454o6615j62031K50360j25507
17131C07549K9816K76925j72654L47873j05301j83919q5964M12181k18732j31904
17121D75870M8547Q6586j91286m0564M2515G8000M32414J12985B44470R5262N82107
17110I21839m53300J6006k27099K59910B52548J23292J77296J09486N4062j31331
17100E85353k00890J61514B57747N16643r9055n3387K59510k02000k83391N5899
17090D51966L94731k93597k9229B47605K56055J75430K52095A87969L89145k23688
17080C53426K81063J44727p9328n5561K66417o5524k97543J87980O5260r7567
$$ plain form
17151 311162 643308 322694 79377 414727 396253 514682 623793 273564 198256 361509
17141 361509 797526 343221 560179 312130 627796 411342 344727 182696 433056 307549
17131 307549 337365 614290 441636 789509 684208 500289 414325 826506 607774 475870
17121 475870 524417 611003 419717 379153 421668 78000 510414 623399 244470 339732 921839
17110 921839 468539 484545 257446 517356 252548 375840 553136 662622 716684 585353
17100 585353 384463 545977 257747 774390 675335 621948 881458 679458 396067 451966
17090 451966 846697 553100 523871 247605 503660 679090 931185 187969 577114 353426
17080 353426 634489 779216 699888 644327 910744 845220 547677 735657 800917 703350
17070G03350J1390o9183j45288J16057K17602J78978m65159K57693k54586K59634
17060H10488M18230l50232k29889J50983J41652j70656J06171j0549k54505K41751
17050H53444J01115q9109n3588M800l53335K00212J70825Q7748k37615N11343
17040A195840k08615r6774J01179j82335p0327K61435j17536O8078l32166L0656
17030F49435K61219L06058k33373o1216K16629k67169K53112n29877K89638R2820
17020I77276j53178R1746L3592M6550J55690j84642K987M5270J24841j6533O500
17009A130099O6604l37023N6312J57965L69698m43307j50493J15193L30404k01089
16999A094363J51543K05406k70001J0004l0321j46465O9058N0864L67892k00639
$$ plain form
17070 703350 714740 645557 500269 616326 833928 1012906 547747 805440 550854 810488
17060 810488 1228718 878486 648597 799580 941232 770576 876747 866198 611693 853444
17050 853444 954559 865450 811862 816662 463327 663539 834364 922112 684497 1195840
17040 1195840 987225 890451 991630 809295 738968 1000403 882867 950945 618779 649435
17030 649435 910654 1216712 983339 922123 1138752 871583 1124695 594818 884456 977276
17020 977276 824098 915844 949436 995986 1151676 967034 970021 1015291 1140132 1123599 1130099
17009 1130099 1196703 859680 915992 1073957 1443655 1000348 849855 965048 1295452 1094363
16999 1094363 1245906 1451312 1181311 1191315 1160994 1014529 1083587 1134451 1502343 1301704
16989A301704k16R3465k87105K87539j37193k72962K24908L2030J0100K83985
16979A536255r5132l7241j11872j83309L13033j19405J05245Q7178j86785P4226
16969A382193O72J13633P441O6809j41723j03638L77475l25695K34993j86133
16959A426027o0497L35020N1050o0205M3071N1709k17666J95989N9739J1545j24906
16948A710876j21083J12787r8000K72521n5452L5150J23808n239j75414o4279
16938A735675K77302R4159o6803J74754m70594Q1265Q3166J65595J3867j93533
16928A894853J23909J52414j54790k7924J12218K68214P1577R5766p33119K61130
16918B064248M22529k76116J17163M19826l09285j03685O37863k56786k38467
$$ plain form
16989 1301704 1301488 1394953 1107848 1395387 1258194 985232 1210140 1242170 1252270 1536255
16979 1536255 1441123 1403882 1292010 1108701 1421734 1302329 1407574 1494752 1307967 1382193
16969 1382193 1382865 1496498 1503939 1570748 1429025 1325387 1702862 1377167 1612160 1426027
16959 1426027 1365530 1700550 1751600 1691395 1734466 1786175 1568509 1764498 1824237 1835782 1710876
16948 1710876 1589793 1702580 1604580 1877101 1821649 1856799 1980607 1975368 1799954 1735675
16938 1735675 2012977 2107136 2040333 2215087 1744493 1825758 1908924 2074519 2088386 1894853
16928 1894853 2018762 2171176 2016386 1988462 2100680 2368894 2440471 2536237 1803118 2064248
16918 2064248 2486777 2210661 2327824 2747650 2438365 2334680 2972543 2715757 2477290
16909B477290K12345j7769L89248n90878M7118M53784K8250q3128j93293K38082
16899B961049j33152J04357r0437R7432J07274r2567q8064K32521K93482m26397
16889B965498J82821L40031J19136j94002M73526k64065j33124j18428L48084
16880C719477N5282J81328R640o0405l0077K08857M6218M4820n169K3851O11270
16869D805092l99753j08339L09436J22998k4639J95845J47949l12332L41256o1062
16859E016451J4055M56806j17108K4164K07954J2855L42602k12294r8787M58111
16849F104809k13887L27055j27408j1028J81273P0999M54654m9613p485n6714
16839F672655P13403j44567K79842j00896J64486j1438K86992j50662L33434K27906
$$ plain form
16909 2477290 2689635 2671866 3061114 2470236 2517354 2971138 2999388 2916260 2722967 2961049
16899 2961049 2827897 2932254 2841817 2939249 3046523 2953956 2865892 3098413 3391895 2965498
16889 2965498 3148319 3488350 3607486 3413484 3887010 3622945 3489821 3371393 3719477
16880 3719477 3774759 3956087 3965727 3905322 3875245 4084102 4130320 4175140 4169971 4193822 4805092
16869 4805092 4405339 4297000 4606436 4729434 4704795 4900640 5048589 4736257 5077513 5016451
16859 5016451 5030506 5487312 5370204 5394368 5602322 5615177 5957779 5745485 5646698 6104809
16849 6104809 5890922 6217977 6090569 6079541 6260814 6331813 6786467 6736854 6729369 6672655
16839 6672655 7386058 7241491 7521333 7420437 7584923 7573485 7860477 7709815 8043249 8271155
16829H271155J81765K42767J42888L798L44805J61590L06504r1809M14524j68604
16819I809383N28679L09479K26831O2119n4535N12760N10416l20021J2391L66733
16809A1964235P58910J97400J20063K13853K08403P70465J88482J56144N16100
16800A5094055O83599l03985O39853K06033O17550M32086N97036K49595L47674
16791A8563496M83970O07733L48298M08653N56966P15747O91681M06560N92885
16782B3375989Q43602L03599M93230R07638J040941K36636J038078N98353O16653
16773B9454719J319797O60863O69497J582827P41479J065973R98047Q68806R93691
16764C8355699J122793J072021R14644J637374J368329R65201J346313J417490
$$ plain form
16829 8271155 8452920 8695687 8838575 8842373 9187178 9348768 9655272 9563463 9977987 9809383
16819 9809383 10338062 10647541 10874372 10936491 10881956 11394716 11905132 11585111 11597502 11964235
16809 11964235 12723145 12920545 13040608 13254461 13462864 14233329 14421811 14577955 15094055
16800 15094055 15777654 15473669 16113522 16319555 16937105 17369191 17966227 18215822 18563496
16791 18563496 19047466 19655199 20003497 20412150 20969116 21684863 22376544 22783104 23375989
16782 23375989 24219591 24523190 25016420 25924058 26964999 27201635 28239713 28838066 29454719
16773 29454719 30774516 31435379 32104876 33687703 34429182 35495155 36493202 37362008 38355699
16764 38355699 39478492 40550513 41465157 43102531 44470860 45436061 46782374 48199864
16756D8199864J136040J542073J516837J367227J422270J377520J458848J564316
16748E9584995J229422J655267J444552J179480J844663J326956J282504J008391
16740G0556230J868983J487792P59179R83906J198294J133439N83004O54683P08024
16731G9933534R35833L5473O45237K16527R7094o10800K61694m88672m75815k02586
16721H0347519o39409o97416q54736r57436j468860n55460j161337j218567j373092
16712G1421206r22444j905995r68702j799393p14750j828417j439321j110569
16704F0731615j601083j477903j197494j732725j657486j137568j263707j177500
16696D9486149j355435j439889r80140j533694r62672j141833j055923o51211
$$ plain form
16756 48199864 49335904 50877977 52394814 53762041 55184311 56561831 58020679 59584995
16748 59584995 60814417 62469684 63914236 65093716 66938379 68265335 69547839 70556230
16740 70556230 72425213 73913005 74672184 75656090 76854384 77987823 78570827 79225510 79933534
16731 79933534 80869367 80904840 81550077 81766604 81863698 81252898 81514592 81025920 80550105 80347519
16721 80347519 79708110 79010694 78155958 77198522 75729662 75174202 74012865 72794298 71421206
16712 71421206 70498762 68592767 67624065 65824672 65109922 63281505 61842184 60731615
16704 60731615 59130532 57652629 56455135 54722410 53064924 51927356 50663649 49486149
16696 49486149 48130714 46690825 45710685 44176991 43214319 42072486 41016563 40365352
16688D0365352j415615q62530r59125j338657r29861p51233j011716q71059n92556
16679C1633000r75425o79880m09017q61454r82557n09053q29990m54907o50963
16670B5279754m49026o40287l53005p51526n72808o34587j25973p60359k37761
16661B0754422q47629l15013j95402m78053m45337p06008l41243j78836k01722
16652A7045179m15146l50252m98593j64134l02236j13548m11534n43790k03491
16643A4042455l71246j51671j07973m15083k06257j45133k42647q3994l80080
16634A1938371o96005M506J03676n2069k62199k09183n26261J84841l76959l6875
16624A0071843N3560m19875k4468j23518l75378k3980r9978m21550K08197l00287
$$ plain form
16688 40365352 38949737 38087207 37128082 35789425 34859564 34108331 33096615 32225556 31633000
16679 31633000 30657575 29977695 29568678 28707224 27724667 27215614 26385624 25930717 25279754
16670 25279754 24830728 24190441 23837436 23085910 22513102 21878515 21752542 20992183 20754422
16661 20754422 19906793 19591780 19396378 18918325 18472988 17766980 17425737 17246901 17045179
16652 17045179 16630033 16279781 15781188 15617054 15314818 15201270 14789736 14245946 14042455
16643 14042455 13671209 13519538 13411565 12996482 12790225 12645092 12402445 12318451 11938371
16634 11938371 11242366 11246872 11350548 11298479 11036280 10827097 10300836 10485677 10108718 10071843
16624 10071843 10125403 9705528 9681060 9557542 9182164 9158184 9058206 8636656 8844853 8544566
16614H544566J26269k69347k12305J38155k84234j18208k90265j91695K2968K3781
16604G489685l35958J32191n47495M20079r1772k84296L14989m77827N2725k5180
16594F647141l59115k93913K57667n9835k27765M9675j16700J27584k86701j05953
16584E632085k01588J19473j63392L12599m06209K69400J3517o08296K58412N0706
16574E276707l57014k2532k03381J45640j72465K11786j58893j41049R1668J9886
16564D690353j34166L2397q7699j64239k57379N53046l53122l5727j839L81127
16554D622752o09388m0695j36177J98683l47898K87785k19526l147m5812K16692
16544C923269r4408j26403P8304m1146m9931j58002j89270J60701L8943l09696
$$ plain form
16614 8544566 8670835 8401488 8189183 8327338 8043104 7924896 7634631 7442936 7465904 7489685
16604 7489685 7153727 7285918 6738423 7158502 7066730 6782434 7097423 6619596 6672321 6647141
16594 6647141 6288026 5994113 6251780 6191945 5964180 6013855 5897155 6024739 5738038 5632085
16584 5632085 5430497 5549970 5386578 5699177 5292968 5562368 5575885 4967589 5226001 5276707
16574 5276707 4919693 4897161 4693780 4839420 4666955 4878741 4719848 4578799 4670467 4690353
16564 4690353 4556187 4588584 4500885 4336646 4079267 4632313 4279191 4243464 4241625 4622752
16554 4622752 4013364 3972669 3836492 4035175 3687277 3975062 3755536 3752389 3706577 3923269
16544 3923269 3828861 3702458 3780762 3739616 3689685 3531683 3342413 3503114 3542057 3232361
16534C232361J44731k29179J55923n1932J66730j79023r6573K63611o3141n15020
16524B828488M96350l31770J94792j73842k64676J90848k29788O7334L07908J4419
16514C100063m3184k84718p0070P8043o2185J690L31322n55419J94888k06812
16504B483618L52154J41878m73283K19727J72137m05289K10873j02390k95181
16495B304244J25533K00487j32576k32356J89992j33899l7535M37962n44363j05198
16485B072291J86524J57628j5679M811j95187j2597o7030J71270j30506J50026
16475B321551j17960k1028q3518K6219R2614j86094J7948J13983J79637m31463
16465A911889l46490M20304k1324m3765R004o2047J30460P1143Q9580j12745N8819
$$ plain form
16534 3232361 3377092 3147913 3303836 3251904 3418634 3239611 3143038 3406649 3343508 2828488
16524 2828488 3324838 2993068 3187860 3014018 2749342 2940190 2710402 2777736 3085644 3100063
16514 3100063 3056879 2772161 2702091 2780134 2717949 2719639 3050961 2495542 2690430 2483618
16504 2483618 2835772 2977650 2504367 2724094 2896231 2490942 2701815 2599425 2304244
16495 2304244 2429777 2630264 2497688 2265332 2455324 2321425 2283890 2721852 2177489 2072291
16485 2072291 2258815 2416443 2400764 2405575 2210388 2197791 2130761 2302031 2171525 2321551
16475 2321551 2203591 2182563 2099045 2125264 2217878 2031784 2049732 2163715 2343352 1911889
16465 1911889 1565399 1985703 1964379 1920614 1929618 1867571 1998031 2069174 2158754 2046009 2104828
16454B104828j64377k56103J09904J75830j23747j48800J17936J77760l41318
16445A651913J86170J97423k39356K64754j33552j27936P5116j88377J6929j66196
16435A536888M01501o1521k03089j35571J52703P712p7627M2359r9962K74813
16425A838206j13110O9933j86925l6146q18M8199l45014N8858J11479L15741k26198
16414A534205o6194k9042r4103Q2631J78669L78866m43406K07335J11366l04942
16404A555385L7150J78440j71071j99738M3805K50609l65529J67413l10004O2870
16394A249330R3845R1257J19729j84114k4303k20886L30086k7261J26397m39371
16384A114709K00750J93397j14367N2415m15191K74906j45836j89866J57910J61967
$$ plain form
16454 2104828 1940451 1684348 1794252 1970082 1846335 1697535 1815471 1993231 1651913
16445 1651913 1838083 2035506 1796150 2060904 1927352 1799416 1874532 1686155 1703084 1536888
16435 1536888 1938389 1876868 1673779 1538208 1690911 1698623 1620996 1663355 1563393 1838206
16425 1838206 1725096 1795029 1608104 1571958 1571140 1619339 1274325 1333183 1444662 1760403 1534205
16414 1534205 1468011 1438969 1344866 1427497 1606166 1985032 1541626 1748961 1860327 1555385
16404 1555385 1592535 1770975 1599904 1400166 1443971 1694580 1329051 1496464 1186460 1249330
16394 1249330 1343175 1434432 1554161 1370047 1345744 1124858 1454944 1427683 1554080 1114709
16384 1114709 1315459 1508856 1394489 1446904 1031713 1306619 1160783 970917 1128827 1290794
16374A290794N517n2496Q3759j53903l3080K9213O3048j77745J79524k07182O3787
16363A091236M1991k67653K43860L60472m65972K09156k57168M80200n32834L08535
16353A211823o6611k03191q550O8148j9391j8770O6658L33914j88536j46033K7244
16342A056705o6591M5797j6506j32791J80812o7833k275P9929J37766p6600n5246
16331A083167Q4461j3972l7404L1546l87034k5273Q5845p3398l8671R8663n5551
16320G52379L23128J38109k97262J07824P5455L89870o72512n4353K25885j34935
16310H53588J66060m43710L36649m5380j90067m1047L73627k10831k37371L38154
16300H99672l42936N34840l16246L90907j34447q4433Q6082o1878o2187K23816
$$ plain form
16374 1290794 1296311 1243815 1327574 1173671 1140591 1169804 1232852 1055107 1234631 1027449 1091236
16363 1091236 1133227 865574 1109434 1469906 1003934 1213090 955922 1436122 903288 1211823
16353 1211823 1145212 942021 933471 1001619 982228 963458 1030116 1364030 1175494 1029461 1056705
16342 1056705 990114 1035911 1019405 886614 1067426 999593 997318 1077247 1215013 1138413 1083167
16331 1083167 1167628 1153656 1116252 1147798 760764 735491 821336 747938 709267 807930 752379
16320 752379 1075507 1213616 916354 1024178 1099633 1489503 816991 762638 988523 853588
16310 853588 1019648 575938 912587 867207 677140 636093 1009720 798889 561518 899672
16300 899672 556736 1091576 775330 1166237 1031790 947357 1033439 971561 909374 1133190
16290A133190m86442J54147J24973m783J53172j02858j8597m10774M61072m13955
16280E89145j06653K74983J40819D05802M53954k07138J26770n787l1604j75474
16270E66523L10310j03980K9375k4898m0311k46152M32963k686k67900J38045
16260G91289j94529J69338p037j69489K70270j94893J96196D19022M50851l20114
16250E49759J40093k4244K23926k56299K3776K04248k81919K49606j70437J45907
16240H04416j90428j55008K49467j17186L75318C18496P19897m15104o4463J07188
16230F66014J83661q9068m870k22747R9049R3769k21619j69537N08567L2652k19345
16219F56526P5030o6153J76284j96114B33487M70126k46625L45260j1966C68672
$$ plain form
16290 1133190 646748 800895 925868 921085 1074257 971399 952802 542028 1003100 589145
16280 589145 482492 757475 898294 405802 859756 652618 779388 773601 741997 566523
16270 566523 876833 772853 802228 777330 737019 490867 923830 921144 653244 791289
16260 791289 596760 766098 759061 589572 859842 664949 861145 419022 869873 549759
16250 549759 689852 665608 889534 633235 657011 861259 579340 828946 658509 804416
16240 804416 613988 458980 708447 591261 966579 318496 1038393 623289 558826 666014
16230 666014 849675 760607 755737 532990 632039 725808 504189 334652 843219 875871 656526
16219 656526 731556 665403 841687 645573 233487 703613 456988 802248 790282 368672
16208H06289l46660j56912M58109k84313K08736B20920L0189M71354k11780k00147
16198C10536O92465C82267K49259j70033j69040J48959j07758L3117Q4003A85419
16187E02986Q8992k85029K79288p3361j66809K74521j32205A8221N32330r1934
16177D58617J58723k15149K56873k64909k439n7366K62359n0241A94339M13238
16167F07577j96744C1334L69458o4666L47520b6091C22123J43841J00261A66475
16156A634L78488Q3870j11702j08183L2663j3600j4031p2468J06873L5450J45640
16145D64634A93600M13780A71255J52158J76237j05700J50395A82357J12469K526
16135B97352K92875p651B52984J62815K89797A12276K18660A52220J72630K08135
$$ plain form
16208 806289 459629 302717 760826 476513 685249 220920 251109 722463 510683 310536
16198 310536 1003001 382267 631526 461493 292453 441412 333654 366771 450774 185419
16187 502986 591978 306949 586237 512876 346067 620588 488383 18221 550551 458617
16177 458617 617340 402191 659064 394155 391716 334350 596709 546468 194339 607577
16167 607577 410833 31334 400792 336126 683646 -26091 322123 465964 566225 166475
16156 1634 380122 463992 352290 244107 276770 263170 249139 176671 283544 318994 464634
16145 464634 193600 607380 171255 323413 499650 393950 544345 182357 294826 297352
16135 297352 590227 582576 252984 415799 705596 112276 330936 152220 324850 532985
16125E32985A13287J88609j36723K73176j975A60563J44225B3357J20342G0534
16114C24623q1292K40811f0104C17943n2280L444L55453M1480j21059r6973A62063
16102f157C40128p2823A20943K13531j44445E9420J83048Q5927p3937M7519M1156
16091C43133j44181D8239K63384A24725J1970N0429k527Q2702J73387r5111A63995
16079C21786h0128D73586D5590J50659N8896O4400j6862m2829l0805J78110k818
16068D04341P8546E8621J92850C6407N6020j4858J71076m6364L76423A62733o3065
16057I9668K56857a57813a0348A32371a13689D86841F4882h0501D27089j78839
16047B48250r0372K76826a1605G0042B4863L33761j22338k5914A02350Q0160L22399
$$ plain form
16125 532985 113287 301896 165173 438349 436374 160563 304788 23357 143699 70534
16114 324623 243331 484142 -60104 317943 265663 269107 624560 666040 544981 448008 162063
16102 -6157 340128 267305 120943 334474 190029 59420 242468 328395 254458 301977 343133
16091 343133 198952 48239 311623 124725 136695 187124 184597 267299 440686 345575 163995
16079 321786 -80128 473586 45590 196249 255145 319545 302683 259854 229049 407159 404341
16068 404341 482887 58621 251471 36407 92427 77569 248645 202281 578704 162733 99668
16057 99668 356525 -157813 -10348 132371 -113689 486841 64882 -80501 427089 248250
16047 248250 157878 434704 -11605 70042 24863 358624 236286 210372 102350 182510 504909
16036E04909B6232L69637j66276K13302l3678A36177J1735c2908D24394J22644
16026E47038k32004b6675H0084A7705J87185J56428j04735j13411g4776G4437
16015D9434j3786L85580c4869B19936I7207Q6583d6666E9790J39738J79552e9605
16003C17907o6861r6548B1994f4900B78911A12822K00864K12322H3365J825R2961
15992A78151J43994m4041K11239J18585J59393P0583m533j39490j17576j13700
15982D62605k00468A1722L15841d15303A6364E309K8072l553a04127G923J80573
15971A88496J21171h2235b7187p0859r547a6774C3412Q2135b14684B26976b0067
15959B7878J24794J15268p7566B8536q254J85235j8699p364n1743b4624C5453
$$ plain form
16036 504909 26232 395869 229593 442895 409217 136177 147912 -32908 424394 547038
16026 547038 315034 -26675 80084 17705 204890 361318 256583 143172 -74776 74437
16015 49434 35648 421228 -34869 219936 97207 183790 -46666 59790 199528 379080 -59605
16003 317907 251046 154498 21994 -64900 278911 112822 313686 526008 83365 85190 178151
15992 178151 322145 278104 489343 607928 767321 837904 833371 693881 576305 462605
15982 462605 262137 11722 327563 -415303 16364 5309 33381 29828 -104127 7923 188496
15971 188496 309667 -82235 -27187 -98046 -107593 -16774 33412 115547 -214684 226976 -20067
15959 27878 152672 267940 190374 28536 20282 205517 186818 179454 127711 -24624 35453
15947H5357K09523p1181g0628B20983h1664D32517a11585B9571K42046q2554R2046
15936B81109C2592Q2147J38613e6150A80059a59111B29584h330A63102M8058b59654
15924B49620E628R6141O0711m2821J0501J91456H8597P736a52876B7693J87370
15913B15063m0300L4871a31082A1791O9951o688K1810a58113A39077m6101c61376
15901A74544K5980a61644r373A29317o0564L7936J23799a08641J6618C5034A1296
15889C6093P638a47561B54983g6323C0975a94813D1778K56739G8673a22306b5007
15877A59584p0150J84486a05197I8478L91960B782R2593J68268i7898J0918m1299
15866a28279A01008C1688A5720J1087O3493a80284F6832a76880B79081A8106K11500
$$ plain form
15947 85357 294880 223699 -70628 220983 -81664 432517 -111585 29571 271617 189063 281109
15936 281109 32592 114739 253352 -56150 180059 -159111 229584 -8330 163102 211160 -259654
15924 249620 5628 101769 162480 119659 130160 321616 88597 96333 -152876 27693 215063
15913 215063 174763 209634 -131082 11791 81742 75054 96864 -158113 139077 92976 -361376
15901 174544 200524 -161644 -171017 129317 68753 106689 230488 -108641 -92023 35034 11296
15889 36093 43731 -147561 254983 -76323 30975 -194813 41778 298517 78673 -122306 -25007
15877 159584 89434 273920 -105197 98478 490438 2782 95375 263643 -97898 -86980 -128279
15866 -128279 101008 31688 15720 26807 90300 -180284 66832 -176880 279081 18106 229606
15855B29606I0365K54119j29445F7623O6342Q1139g7498C740a8979j4223B22345
15843A4726o14b7935C00322A08798l7183A8185O5609J05068b37206B8707K5807
15832E4514l379J06867P3170j01693l6441C3306d0910j58244d5964A34174n055
15821A29119I344J87187k1069c17241D67369A35354b01791B14984B0308J91884
15811B12192j03600D2261b13124B8536a30420j7182N4839B6653J96941c38710
15800C97730d4700C11420C240J35974a14444A23531K35696A28242k0433Q5207
15790A93016J49031A65037E1982a1892C726M4030K86374H8858c08703F9001j0341
15779E8660Q6030J19524h8941r1572F8780R9536h8298A77309J5993g1490j2888
$$ plain form
15855 229606 90365 344484 215039 67623 133965 215104 -77498 3740 -18979 -33202 222345
15843 14726 14112 -27935 300322 108798 71615 18185 83794 188862 -237206 28707 54514
15832 54514 51135 158002 231172 129479 93038 33306 -40910 -199154 -45964 134174 129119
15821 129119 9344 196531 175462 -317241 467369 135354 -201791 214984 20308 212192
15811 212192 108592 42261 -213124 28536 -130420 -147602 -92763 26653 223594 -338710
15800 397730 -44700 311420 3240 139214 -114444 123531 359227 128242 107809 193016
15790 193016 342047 165037 51982 -11892 3726 47756 334130 88858 -308703 69001 58660
15779 58660 144690 264214 -88941 -180513 68780 168316 -88298 177309 193302 -71490 -84378
15768h4378a5063H8360c5868h025m8033I517M0480a13957A63537K65602A89595
15756G4169h6569A03447m7491O5877b20641m0412f3124F6239K4666a18928A34288
15744A38095a07431B89751F628K0205b0620n7139j71926a18757D0976B134J46669
15733A48803k7277d6639p1881M8539A83152d2452l7013j40049D8672L7470K26508
15722C12650b1472G650L22299A30109a18744F0080P4372A1141b1618q503E5142
15710A59595b45947i0647j1329B07302f267A27209g0589j51449q4318a29109j07194
15699b36303p511g0116k12395A7700Q8585G762a18665c93A64686f8640A5974K70382
15687B86356a75015e2281j26270O1752d6136l2423q0738g7967C09717b60990G909
$$ plain form
15768 -84378 -15063 88360 -35868 -8025 -56058 9517 49997 -113957 163537 429139 189595
15756 74169 -86569 103447 55956 121833 -220641 -261053 -63124 66239 90905 -118928 134288
15744 138095 -107431 289751 6628 26833 -20620 -77759 -249685 -118757 40976 2134 148803
15733 148803 121526 -46639 -118520 -69981 183152 -42452 -79465 -219514 48672 86142 312650
15722 312650 -21472 7650 329949 130109 -118744 60080 134452 11141 -21618 -30121 55142
15710 159595 -245947 -90647 -101976 207302 -6267 127209 -70589 -222038 -306356 -129109 -236303
15699 -236303 -243814 -70116 -282511 17700 106285 7762 -118665 -393 164686 -68640 15974 286356
15687 286356 -175015 -52281 -178551 -116799 -46136 -78559 -159297 -77967 309717 -260990 7909
15675a40549A93292J36473b36253A26056J84420a10620A4828c1597j77939a2439
15664c584H3200P3159L7440a94589J5942g0229B40296c27922g0345J4017r512
15653f5840q832k98827A69970g5274j17002f0511k56263C6391b4015a0164j19008
15642a29172L8570D3270J06520J35861a99609e0282B32296b45953J22149J1804
15632a12000p9312B21775Q130I7796a21313k50664N2739d7713b322C1069K13453
15621B44522q2262J4840c63362a64907e766j33476k075I8329m1327J18261Q4681
15610B59944g4186p8089q1913N2925A24952j0056f1256C5044N0886d2106l8936
15599h1042j78034I5163M6593f8778E7906J98691d3412A35115b98212Q0572C5245
$$ plain form
15675 -140549 193292 329765 -236253 126056 310476 -110620 14828 -31597 -209536 -12439
15664 -3584 83200 156359 193799 -194589 -178647 -70229 240296 -327922 -70345 -56328 -65840
15653 -65840 -74672 -373499 169970 -75274 -192276 -60511 -316774 36391 -24015 -10164 -129172
15642 -129172 -90602 43270 149790 285651 -199609 -50282 232296 -245953 -123804 -112000
15632 -112000 -191312 221775 229905 97796 -121313 -371977 -319238 -47713 -2322 31069 244522
15621 244522 162260 177100 -363362 -164907 -5766 -139242 -141317 98329 57002 175263 259944
15610 259944 -74186 -152275 -234188 -181263 124952 114896 -61256 35044 85930 -42106 -81042
15599 -81042 -259076 95163 141756 -68778 57906 256597 -43412 135115 -298212 -217640 35245
15587B21096n0707e275I6628J9407Q1881N3455D748K3817Q4864f7194I4326b84633
15574A03959a20421B41714r4282a9585l12739a05568j852A28199a02811m7553
15564a50364A98489a7099A54692C7853J0934j7476K3643C976b31856B20172D9999
15552a68980B45746n4659b8954j00789M5981C58288b0572j69431l7381D90374
15541A84515c67201C67799F5921i3229B31481B3595K61057g0536F640g6593P215
15530f9378h905A15542b17497D41194c15712B04832h450j68856C4608g0322k07475
15519b77797L8510A38708h9950A23771B2280g1890G2714Q078F494Q2775J552D1351
15506G9098J67718a00752D3706M7676D2033g3971C41804D4881a27013j87414e4668
$$ plain form
15587 221096 170389 -5275 96628 116035 197916 251371 4748 28565 113429 -67194 94326 -284633
15574 103959 -120421 241714 147432 -19585 -332324 -105568 -107420 128199 -102811 -150364
15564 -150364 198489 -17099 154692 37853 48787 31311 54954 3976 -231856 220172 49999
15552 -168980 245746 191087 -28954 -129743 -83762 358288 -20572 -190003 -227384 490374
15541 184515 -367201 367799 65921 -93229 231481 23595 284652 -70536 6640 -76593 -69378
15530 -69378 -8905 115542 -217497 441194 -315712 204832 -8450 -177306 34608 -70322 -277797
15519 -277797 -239287 138708 -89950 123771 22280 -71890 72714 80792 6494 89269 90821 41351
15506 79098 246816 -100752 43706 91382 42033 -73971 341804 44881 -127013 -314427 -54668
15494E5743k7305c01500a22452j76619F2464f5170I593K66841A5181b17050B27408
15482E2275Q4609J36405b17367C36846j13712m1493R8669Q2701b3947G420M69495
15471D76915B9872b05286K8912C72355a24829J8263J5573M0692o4366l3325I9847
15459a4239j22674A80614b19766R7460C07782C0131a60687C08833D9502b14088
15448C15350q0055n3840J43663J44337k8940j18890o6864n169K45204A25852J40923
15437B66775e5274J8946G0793d9972l0601M544l6989b5376I1896Q5350k3465o7053
15425H6728M0020e2551A8867i7099o2556B28567b57034a2972C66279c6598j13749
15414a50347B50969A2576N3790d7707J2110A57991o262n183a00917A78728F9707
$$ plain form
15494 55743 28438 -301500 -122452 -299071 62464 -65170 9593 276434 15181 -217050 227408
15482 52275 136884 273289 -217367 336846 223134 181641 280310 363011 -23947 7420 476915
15471 476915 29872 -205286 -176374 372355 -124829 -106566 -90993 -50301 -114667 -147992 99847
15459 -14239 -136913 180614 -219766 -122306 307782 30131 -160687 308833 49502 -214088
15448 315350 235295 181455 325118 469455 440515 321625 254761 249592 494796 125852 266775
15437 266775 -55274 -36328 70793 -49972 -80573 -76029 -113018 -25376 91896 177246 153781 86728
15425 86728 126748 -52551 18867 -97099 -159655 228567 -257034 -12972 366279 -36598 -150347
15414 -150347 250969 12576 66366 -47707 -35597 157991 151729 146546 -100917 178728 69707
15402g96D7177N6606J62178o3824p261A2395i579k24287R9647A9864L22708A02878
15389A93651q5362J17525K0919n5245d904k848E8486a93100B8323J38509F3770
15377C6012a3183j3109B61778A1225J35978L0826D8058B170f0920A19584A9831
15365E8814J22647L14166H5396h1930A46643n414b7869A38301L873a69330B29993
15353B01472f4529A19487a29627B82463b84693E7759P5785J09487h898m2504H4965
15341b11218D0462a58494b3615b241A52161a14851A18857K7022b07325k7486c9695
15329I6080e01121A37868K7914b27719O2136f833F7858k6943R1275N545J33211
15318B70946j15009a19306A52371n6653a11704e0355h582j98849D07984A55929
$$ plain form
15402 -796 47177 103783 265961 202137 194876 12395 -9579 -233866 -134219 19864 342572 102878
15389 193651 108289 225814 246733 191488 -4904 -7752 58486 -193100 28323 166832 63770
15377 36012 -13183 -26292 261778 11225 147203 178029 48058 2170 -60920 119584 19831
15365 58814 181461 495627 85396 -81930 146643 141229 -27869 138301 142174 -169330 229993
15353 201472 -64529 119487 -129627 282463 -284693 57759 133544 243031 -8898 -51402 84965
15341 -211218 40462 -158494 -23615 -2241 152161 -114851 118857 145879 -207325 -234811 -39695
15329 96080 -501121 137868 165782 -227719 -165583 -6833 67858 40915 132190 137735 270946
15318 270946 155937 -119306 152371 95718 -111704 -50355 -8582 -207431 407984 155929
15307A10336a71751K0051a1993D95976f5728B6972R3109n6941k1582J56008h6604
15295b16799m4986C03453H8128a18778B27949a64449h180n5125A05252N3178b05914
15283g8182C80746M5072j78657r0595e9744C4534d61622E0958a75903l2984H1891
15271b62029B08513P0828G570a45469B102J39298m2109l5673h8822j8494B1922
15259H4468K8588g3457A08610J155a62462G1282C930L17996R9889l9594Q40031
15248A222252N93262o25329L15673j77916n79481a6968C62196j14207e2203A57462
15237A21014a75380G6130L55480j93277D3370P5633J47663a14109j8498A13518
15226A80985o4984j1189K52265g9013C44138o9250e5348J4886J2080k02105C16118
$$ plain form
15307 110336 -171751 -151700 -11993 495976 -65728 26972 120081 63140 41558 197566 -86604
15295 -216799 -261785 303453 88128 -118778 227949 -164449 -8180 -63305 105252 158430 -205914
15283 -78182 380746 425818 247161 156566 -59744 34534 -461622 50958 -175903 -208887 81891
15271 -262029 208513 279341 7570 -145469 2102 141400 99291 63618 -88822 -107316 21922
15259 84468 113056 -73457 108610 109765 -162462 71282 3930 321926 421815 382221 1222252
15248 1222252 1815514 1190185 1505858 1327942 748461 -16968 362196 247989 -52203 157462
15237 121014 -175380 76130 431610 238333 43370 119003 266666 -114109 -132607 113518
15226 180985 116001 104812 357077 -79013 344138 274888 -55348 -40462 -28382 -230487 316118
15214A32964L874n7223B1449Q5486K33453A08176b5887l09424A73026A3699c1770
15202A36314e1537j36381Q1861A40554n8715J60507c35535C55792e7193q2573
15192a39766F5747B514g997j43428F6146J28248p5079d3145E6463Q8387o6611
15181G8239N4492D7178g4452k0798B08195G3947b55478H8208c37851J28813B20359
15169i646j0300B66179a39694G2082J09505a09721b8855o3256J4458l118C8160
15157a2125A77624j1441a482k66756c1377j66673f9763H0926A5956K02667D3803
15145B44357p5443C7828P7990D3466L37133I6355D4185J7008a74136B35448p7064
15134A58384f8519k35167A35297J15528E6162b11j25621E01344A9094K16657M0135
$$ plain form
15214 132964 136838 79615 21449 106935 340388 108176 -25887 -335311 173026 13699 -31770
15202 136314 -51537 -187918 -106057 140554 81839 242346 -335535 355792 -57193 -139766
15192 -139766 65747 2514 -7997 -151425 66146 194394 119315 -43145 56463 144850 78239
15181 78239 132731 47178 -74452 -95250 208195 73947 -255478 88208 -337851 -209038 220359
15169 -9646 -19946 266179 -139694 72082 181587 -109721 -28855 -92111 -77653 -80771 38160
15157 -12125 177624 166183 -1482 -268238 -31377 -198050 -69763 80926 15956 218623 43803
15145 244357 168914 37828 115818 43466 380599 96355 44185 61193 -174136 235448 158384
15134 158384 -68519 -303686 135297 250825 56162 -211 -125832 501344 19094 235751 275886
15123B75886J32783I2052j951Q1163K55103g6757A02678J2090a40235B28656A5388
15111C62386A37436d5104A19275a09460C45670F6042K54386a5492C01670p5587
15101B26083O9578k5102R4548A34606L03169e4051G567L19286j18791L50446i1580
15089I7610J45500p8685C1203J77596d5974j0663D64682d1991D75350A23351J10685
15078B34036J9942j035C4839R6005K26466d553o5562C88268A28574K248J8764
15067A49586g5557J7311A17133Q4606a94897A23255e0179p5336C70823O3684a55868
15055E3689K44171I2266B8560J94671m6409K30109j41313p8348m5023N0290m271
15044A88266k0856M2498J0516D8774R3589N3817a38847b8203b644B2537J13109
$$ plain form
15123 275886 408669 92052 90101 171264 426367 -76757 102678 114768 -140235 228656 15388
15111 362386 137436 -45104 119275 -109460 345670 66042 320428 -15492 301670 226083
15101 226083 295661 270559 365107 134606 437775 -54051 7567 326853 208062 558508 -91580
15089 97610 243110 164425 31203 208799 -45974 -56637 464682 -41991 475350 123351 234036
15078 234036 253978 252943 34839 130844 357310 -4553 -70115 388268 128574 130822 149586
15067 149586 -75557 -58246 117133 201739 -194897 123255 -50179 -125515 370823 434507 -155868
15055 53689 297860 92266 28560 223231 176822 406931 265618 187270 142247 192537 188266
15044 188266 167410 209908 220424 48774 142363 196180 -138847 -28203 -2644 22537 135646
15033A35646k0893e9282C97740A98126J72723I0938M56474A28537J00588L93465
15023F22590k12747j62287j21514J679J68205P986M5714H9573j761L05531p0764
15012C22579J1110j5801m605A18990K47295A59592j7207L97478B69874r6137J51389
15001C25126C7848K60620G5259J73396n2109J89086n3563A10840K50397Q6186
14991D47423j04745r745p1226P7857M4959K08686A94521J83348J17857P8796A84004
14979E36401k58270M74798B78852K57199k35569q7776K02543O289J71900j54895
14969D38543J7930n1328o1663m40m6727k1596J63957K22418B50045A16604P2984
14958A89588M69391p6477k53807j49012O9829Q1591A44829g0551B97594o3063
$$ plain form
15033 135646 114753 -59282 397740 198126 370849 90938 547412 128537 229125 622590
15023 622590 409843 247556 126042 127721 295926 303912 349626 89573 87812 393343 322579
15012 322579 333689 317888 313283 118990 366285 159592 142385 539863 269874 173737 325126
15001 325126 37848 298468 75259 248655 196546 385632 332069 110840 361237 447423
14991 447423 342678 332933 261707 339564 384523 593209 194521 377869 495726 574522 184004
14979 536401 278131 752929 278852 536051 300482 212706 415249 421538 593438 438543
14969 438543 456473 405145 343482 343042 296315 274719 438676 661094 250045 116604 189588
14958 189588 658979 582502 328695 179683 249512 331103 144829 -70551 297594 234531
14948B34531j075i8171C55354K88546C03024A24949J46047k5849J80753A38919
14937A95895a04571C17080j7347R3670N4304j77527L5117M40688k81947J59859
14927F23897K68515l58180J5807P8549j7503K43314k1205k30378J09460m3687
14917F68589J68693M99835l45513k12519j50552L6936j54197k23719P9368q1034
14907B85887L57081k50465K68766k63139B2372M5891J46142K49406O853o0816
14897D09848J42298B47230O7026J84463B15165M2827o3281K71577B614O47248
14887F49862B27353J43735K71897B86985L14316j01211q8018p5104J55725j29149
14877C63544K18406k03818J39822C40L89033C6731M08262J01319j46367M9M1889
$$ plain form
14948 234531 233456 -98171 355354 643900 303024 124949 270996 245147 425900 138919
14937 195895 -104571 317080 299733 393403 447707 270180 305297 745985 464038 623897
14927 623897 892412 534232 550039 628588 611085 854399 833194 602816 712276 668589
14917 668589 837282 1337117 991604 779085 628533 665469 511272 287553 366921 285887
14907 285887 642968 392503 661269 398130 22372 68263 214405 463811 470664 409848
14897 409848 552146 247230 314256 498719 215165 257992 194711 466288 2614 649862
14887 649862 227353 371088 642985 286985 601301 500090 412072 336968 492693 363544
14877 363544 581950 378132 517954 340 389373 36731 444993 546312 399945 399994 441883
14866D41883j13799L28123k31421A92428Q7762o7120L86690k39242j23722Q4941
14856C21737J71536B09645m7887K99452k11219J54352l4118K84802C08221n9649
14846B48572J76680q5634J71868N8623B54974J69782L65158j88583r1779J27839
14836F37391j53605J8587J97477j09134B02733M71158n9139E5166M51269p9755
14826D26680P1970N7736k39754O4617K51302J35847l07899G8897K17871J82799
14816D79567m9817P4641A98330O1119C6113K94349J67611K7065j95594J85978
14806E15522Q7220k63267J59262M9236L7300l8720L26814l43382o0960J58916
14796F27941A26640J85776R3818j10231M0621J56704n9695j36612O6497j22954
$$ plain form
14866 441883 328084 656207 424786 192428 280190 213070 599760 360518 236796 321737
14856 321737 493273 209645 161758 461210 249991 404343 370225 655027 308221 248572
14846 248572 425252 339618 511486 570109 254974 424756 789914 601331 509552 637391
14836 637391 483786 502373 699850 590716 202733 673891 614752 55166 506435 426680
14826 426680 498650 556386 316632 381249 632551 768398 460499 78897 296768 479567
14816 479567 429750 504391 198330 259449 36113 330462 498073 525138 329544 515522
14806 515522 602742 339475 498737 547973 585273 546553 873367 529985 469025 627941
14796 627941 126640 312416 406234 296003 336624 493328 433633 297021 363518 240564
14786B40564l8802L12830k303r7008K0649J41023m1748K0240k69991O99027D86775
14774F17758A54304L04779K00758C00629M74056l29466J47172Q0505K7373n7623
14764F42646k1826C02497K48391j27683B01168L13324j28106M03117l7547l62328
14754C89628j25748K82890M9428n4104K29402l34661K56956k99240K65693l1086
14744F29158L0890C12429Q981J52362K43258k21440j14843K3413K59289M857j02957
14733E65349k7889L2046L6418K75437k17408l7693K33312j73138K47641K89004
14723A223079l23073k49060K42673L13940j80816P1010K2408l39839l34602L68687
14713H14407N820j97543K35457j99564J6283N18228n55759j9542J28482L9315
$$ plain form
14786 240564 201762 514592 512289 415281 435930 576953 535205 555445 285454 984481 486775
14774 617758 154304 459083 659841 300629 774685 445219 592391 672896 700269 642646
14764 642646 620820 302497 550888 423205 201168 514492 386386 789503 751956 389628
14754 389628 263880 546770 596198 542094 771496 436835 693791 394551 660244 629158
14744 629158 660048 312429 321410 473772 717030 495590 380747 404160 663449 668306 565349
14733 565349 537460 569506 605924 881361 663953 626260 859572 686434 934075 1223079
14723 1223079 900006 650946 893619 1207559 1026743 1097753 1120161 780322 445720 814407
14713 814407 820227 622684 858141 658577 674860 1193088 637329 617787 746269 785584
14703G85584J69955j34975n8513r7886M49063B93171O98902K5521J12066m4970
14693A084690k16450L7416k07073N77852l30621J80305m38210J23751N4670J50265
14683A016595l9133k57184J0964L15153n14426L35162K55464l25171q5912J15981
14673H27493C01624L90549J91400j54273K49888k23216q2109J64630K09843n15223
14663E33113M79840L2910k17964J25179R2911k64272L5535o568N4148J31867k56071
14652G40628M21003k78289J15823J57369k27895K51609Q8598l48285m214j67295
14642G49052J01125P6715j15186K33052j40076K0827P9617P5333j06456n5321
14632I18682l886l07344L27637j93754K00083K30712J8384l7875k04311J37740
$$ plain form
14703 785584 955539 820564 762051 664165 1113228 293171 992073 1017594 1129660 1084690
14693 1084690 868240 905656 698583 1276435 945814 1126119 687909 811660 866330 1016595
14683 1016595 977462 720278 731242 1046395 531969 867131 1122595 797424 711512 827493
14673 827493 301624 692173 883573 729300 979188 755972 673863 838493 1048336 533113
14663 533113 1012953 1045863 827899 953078 1045989 781717 817252 810684 864832 996699 740628
14652 740628 1161631 883342 999165 1156534 928639 1180248 1268846 920561 916347 749052
14642 749052 850177 926892 811706 1044758 904682 925509 1005126 1080459 974003 918682
14632 918682 914796 607452 935089 741335 941418 1172130 1190514 1152639 948328 1086068
14622A086068j97686K68393k29733K52735l88736J50183r3701K21406J67726k93894
14612I42761J83716J63306j33270n3554K45356k22801J97642n6682Q0222j6124
14602A330572j21421j5702J69986j98706K02811Q4316J63882j45934l28987L74854
14592A515671j79988r4118M2993J68067k61580M22428K5487m76945O1391K66680
14582A490086P0542m4887J23111k87730L41512k8872k26613j5636J66123L64478
14572A952114p35096K56482O5723J73796L08643k60853k3431J6943K63071m10485
14562A606907O30098J1412j21348J96388J18167Q5108K6467K19678J91466L06281
14552C270624L09609Q31182R34130J676592L234001O896501J2299827J277112
$$ plain form
14622 1086068 888382 1156775 927042 1179777 791041 941224 847523 1068929 1236655 942761
14612 942761 1126477 1289783 1156513 1102959 1348315 1125514 1323156 1266474 1346696 1330572
14602 1330572 1209151 1193449 1363435 1164729 1367540 1451856 1615738 1469804 1140817 1515671
14592 1515671 1335683 1241565 1284558 1452625 1191045 1613473 1638960 1162015 1223406 1490086
14582 1490086 1560628 1515741 1638852 1351122 1692634 1663762 1437149 1421513 1587636 1952114
14572 1952114 1217018 1473500 1539223 1713019 2021662 1760809 1737378 1754321 2017392 1606907
14562 1606907 2237005 2248417 2127069 2323457 2441624 2526732 2553199 2772877 2964343 3270624
14552 3270624 3580233 4411415 5345545 7022137 10256138 17152639 29452466 30729578
14544C0729578j1490682r425649m362218k098194q19414m13520j54770m12196
14536A552935J06616J72373j94195K47474j0533J05344k48082O1243M0586K0201
14526A853962k24580M29297j52366r3960K09175j72889M4270r3998K05647r7639
14516A906919M25987l26861L05021k70481Q9612L5812P3807K16759k09699j72160
14506B074716O2915p6252M86625k18064j26744M9771M10519O8892j16681j98014
14496B417683L1869L03309m1411J6728P2876j55721M22697k77246l8279J58836
14486B911341J58306m95299N41003j34795j98753K52614j2260R0919q6847k18753
14476B807476M63699J231j94264J49409m27333N74434P9915R2122l56207Q9979
$$ plain form
14544 30729578 19238896 9813247 5451029 3352835 2533421 2119901 1965131 1552935
14536 1552935 1659551 1831924 1637729 1885203 1874670 1980014 1731932 1793175 1833761 1853962
14526 1853962 1629382 2058679 1906313 1812353 2021528 1848639 1892909 1798911 2004558 1906919
14516 1906919 2332906 2006045 2311066 2040585 2130197 2166009 2239816 2456575 2246876 2074716
14506 2074716 2137631 2061379 2548004 2329940 2203196 2252967 2663486 2732378 2615697 2417683
14496 2417683 2449552 2752861 2711450 2728178 2801054 2645333 3068030 2790784 2752505 2911341
14486 2911341 3069647 2574348 3115351 2980556 2781803 3034417 3022157 3113076 3026229 2807476
14476 2807476 3271175 3272406 3078142 3227551 2800218 3374652 3454567 3546689 3190482 3280461
14466C280461K37599N6116k28555K61584L01795m6852l09829K01356K1080J61967
14456C936722o5440L3314J72863j98907N69532p0442k59953K37206j58676R2343
14446D288562J28832J11979j48940L12445L05384o16432L12315L08849j57687
14437D845307K09455j2284l5942J94720L9099J17677q9374J71775j00466K41426
14427E581393o3417K77875l6090L51590J49245k95916P9084J21001L27420J10464
14417F602649O7836J12716M22136j01792j12115Q4530O07684k35341J89566j6603
14407G621266K03439K46849r7278K72491L9047m5200M06322l85942M51026M16986
14397I129006J45369L3636O0534j12418L45779j32799J42580K72361M14567O3787
$$ plain form
14466 3280461 3518060 3574176 3345621 3607205 3909000 3862148 3552319 3753675 3774755 3936722
14456 3936722 3871282 3904596 4077459 3878552 4448084 4377642 4117689 4354895 4196219 4288562
14446 4288562 4417394 4529373 4380433 4692878 4998262 4381830 4694145 5002994 4845307
14437 4845307 5054762 5042478 5006536 5201256 5240355 5358032 5268658 5440433 5339967 5581393
14427 5581393 5517976 5795851 5759761 6111351 6260596 5964680 6043764 6164765 6492185 6602649
14417 6602649 6670485 6783201 7205337 7103545 6991430 7075960 7683644 7448303 7637869 7621266
14407 7621266 7824705 8071554 7974276 8246767 8285814 8240614 8646936 8260994 8712020 9129006
14397 9129006 9274375 9308011 9368545 9256127 9601906 9469107 9611687 9884048 10298615 10362402
14387A0362402L15896L40723j20188j5781L87521J68526L42948M55852j28217
14378A2109682N85340k1303K34622l2199O89533M0584K89862L391N65207L49549
14368A4814268J95139O09192j29463O58448J75553K90284L35761K74755N33915
14359A7757852L5248M64804N37916L20157K85238R02235L57688L19922N77832
14350B1558892M58220M90578O83504N38591O89475N40678O85583P33924Q92428
14341B7271873J019509M39936O47699M84196J162763J065031P11209R72530J307308
14332C5082054O46305J689953R41487J200756P80340J712022J336435J774499
14324D5163851R71348K024477J684761J539585J782926J891627K271215K117263
$$ plain form
14387 10362402 10678298 11019021 10898833 10883052 11270573 11439099 11782047 12237899 12109682
14378 12109682 12695022 12673719 12908341 12876142 13565675 13606259 13896121 13899512 14464719 14814268
14368 14814268 15009407 15618599 15489136 16147584 16323137 16613421 16949182 17223937 17757852
14359 17757852 17793100 18257904 18795820 19115977 19401215 20303450 20661138 20981060 21558892
14350 21558892 22017112 22507690 23191194 23729785 24419260 24959938 25645521 26379445 27271873
14341 27271873 28291382 28731318 29379017 29863213 31025976 32091007 32802216 33774746 35082054
14332 35082054 35728359 37418312 38359799 39560555 40340895 42052917 43389352 45163851
14324 45163851 46135199 48159676 49844437 51384022 53166948 55058575 57329790 59447053
14316E9447053K277231K408359K688824K640335K712570K924021L209174L400056
14308H1707623L713741L107616M264397M450318M513821M755375N393261N229814
14300A17135966N313628O290724O739925O885599P429443P923277Q341049Q958749
14292A75018360R622250R471376J0891138J1038504J1844737J1960675J3055949
14285B52902989J3116474J3754441J4267142J3910663J4283119J4595116J3622103
14278C50452047J3331141J2780778J1560806J0230517Q227639O046395L097418
14271D15726741K82010m57154l504586o719497n143323p295828q588028j0866012
14263C73434323j2502170j3545226j4631159j4632682j4880552j4873445j4627551
$$ plain form
14316 59447053 61724284 64132643 66821467 69461802 72174372 75098393 78307567 81707623
14308 81707623 85421364 88528980 92793377 97243695 101757516 106512891 111906152 117135966
14300 117135966 122449594 128740318 135480243 142365842 149795285 157718562 166059611 175018360
14292 175018360 184640610 194111986 205003124 216041628 227886365 239847040 252902989
14285 252902989 266019463 279773904 294041046 307951709 322234828 336829944 350452047
14278 350452047 363783188 376563966 388124772 398355289 406582928 412629323 415726741
14271 415726741 416008751 415551597 412047011 405327514 400184191 392888363 384300335 373434323
14263 373434323 360932153 347386927 332755768 318123086 303242534 288369089 273741538
14256B73741538j3749669j3566706j1744613j2346977j1718615j0602522j0646648
14249A89365788r847266r426097q540990p996231p761347o660489p138933o181377
14241A25813058o231991n722306n022441m833372m526511m610721m070813m050621
14233H6744282l640773k995457l327513l007471l039173k922466k680944k332808
14225F2797677k536593k350453k149550j929340k158199j404890j659061j555121
14217D7054470j912257j495219j374584j122293j052484j368844j364439j023321
14209C6341029r63447j176172n34567j037663r92526j004196r55938n71334n96128
14200B8509058j176356l64079r99871o68723l96625o78699n29300m25298n50082
$$ plain form
14256 273741538 259991869 246425163 234680550 222333573 210614958 200012436 189365788
14249 189365788 179518522 170092425 161551435 153555204 145793857 139133368 131994435 125813058
14241 125813058 119581067 113858761 108836320 104002948 99476437 94865716 90794903 86744282
14233 86744282 83103509 80108052 76780539 73773068 70733895 67811429 65130485 62797677
14225 62797677 60261084 57910631 55761081 53831741 51673542 50268652 48609591 47054470
14217 47054470 45142213 43646994 42272410 41150117 40097633 38728789 37364350 36341029
14209 36341029 35377582 34201410 33666843 32629180 31636654 30632458 29676520 29105186 28509058
14200 28509058 27332702 26968623 25968752 25300029 24903404 24224705 23695405 23270107 22720025
14191B2720025j040692o63594k82477n14543l65809p00107k06332l29924o16503
14182A8000044m38454j14850m67939m37342m04200O0028o32806k66922r03111
14173A4394448J27343l09404n2157k91061o67174M00455o30681l70539j31547
14164A2469683j05630j77892m83641k58065l69494j05092J14524n21089q2669
14155A0480635K7065m36314j0685j77957M4967k34487m40766J1403k11667J37267
14145I189461m82961j64118k228m6186j66087j40820k30952P1484m18080O5058
14135G674571j33903l68586J79369o6370j22069N3129j72171k55820k60843J41681
14125F668988p8369j71905j67906R3134k51723l1943k4042p6291l99188k626L18936
$$ plain form
14191 22720025 21679333 21015739 20733262 20218719 19852910 19152803 18946471 18616547 18000044
14182 18000044 17561590 17446740 16978801 16541459 16137259 16197287 15564481 15297559 14394448
14173 14394448 14521791 14212387 14160230 13869169 13201995 13602450 12971769 12601230 12469683
14164 12469683 12364053 12186161 11702520 11444455 11074961 10969869 11084393 10563304 10480635
14155 10480635 10507700 10071386 10060701 9882744 9927711 9693224 9252458 9263861 9052194 9189461
14145 9189461 8706500 8542382 8540154 8493968 8327881 8187061 7956109 8027593 7609513 7674571
14135 7674571 7540668 7172082 7351451 7285081 7163012 7216141 7043970 6788150 6527307 6668988
14125 6668988 6590619 6418714 6250808 6343942 6092219 6060276 6036234 5959943 5560755 5558129 5877065
14114E877065J2026l6254l43753l00564K71933k1902k3532n30389L33609j1418
14104E226821m3l5533q7017r2385j95437l61285K67976P9180R436k48282J48802
14093D712233m29425L08814j70255k26953j20744J93972P9584n12730K25320K84067
14083D343883m69131k2492j86799K37259P2672k75450p3995O6895J69189m0043
14073C821988k87921m7345j13875M36713k54862o4076m68056K52533J87899p9737
14063C383261j90761J83751j5829j24913J27868k52820J97535l01480q1662l7694
14053B887256P792O2639J43073j80260k68506J43648j10531J8681j67704L59552
14043B895640n24177M15743J00587l71001J51280j05450J77948m38135L66575
$$ plain form
14114 5877065 5889091 5852837 5509084 5208520 5480453 5458551 5435019 4904630 5238239 5226821
14104 5226821 5226778 5191245 5104228 5011843 4816406 4455121 4723097 4802277 4811713 4563431 4712233
14093 4712233 4282808 4591622 4421367 4194414 4073670 4267642 4347226 3834496 4059816 4343883
14083 4343883 3874752 3852260 3665461 3902720 3975392 3699942 3625947 3692842 3862031 3821988
14073 3821988 3534067 3486722 3372847 3809560 3554698 3490622 3022566 3275099 3462998 3383261
14063 3383261 3192500 3376251 3360422 3235509 3363377 3110557 3308092 3006612 2924950 2887256
14053 2887256 2895048 2957687 3100760 2920500 2651994 2795642 2685111 2703792 2536088 2895640
14043 2895640 2371463 2787206 2887793 2516792 2668072 2562622 2740570 2302435 2669010
14034B669010K39881l39801l46530P4319Q2480J77553j77536l44056K84376k64044
14024B055652K70973m31299M30123l05614J57205l44985J46039J80043O8207m64245
14014A762099K63503r6313Q9570k22247K56906n9125k99703O82340m42688j55639
14004A778703L9965k28070M9717l7045J64862K23623j86660j27830J21450J91746
13994A990461k25351K93866j90311O78228M51378Q51447K091500N034688J1031449
13985B2007355R250841q968546r138848n136776k386100j253684p75850k26023
13977C372369k56585j93093k94570l00870l8679j51796l16146L99036k06571p8975
13967A934120q0493j75032J21989K65116l37274L8278l7611J9682K4383l12140
$$ plain form
14034 2669010 2908891 2569090 2222560 2296879 2379359 2556912 2379376 2035320 2319696 2055652
14024 2055652 2326625 1895326 2325449 2019835 2177040 1832055 1978094 2158137 2226344 1762099
14014 1762099 2025602 1929289 2018859 1796612 2053518 1994393 1694690 2377030 1934342 1778703
14004 1778703 1818668 1590598 1640315 1603270 1768132 1991755 1805095 1677265 1798715 1990461
13994 1990461 1765110 2058976 1868665 2546893 2998271 3849718 5941218 10975906 22007355
13985 22007355 31258196 22289650 13150802 8014026 5627926 4374242 3598392 3372369
13977 3372369 3115784 2922691 2628121 2327251 2288572 2136776 1820630 2219666 2013095 1934120
13967 1934120 1853627 1678595 1800584 2065700 1728426 1766704 1729093 1748775 1773158 1461018
13957A461018L40468l30341K82251j49229p1585M5064k31139M7383Q6886j1153
13947A469623O4856k2782k35738J30912L19702k16306k3913k49782M79395m56770
13937A259197P1951p6316j44655K88521r0672J69389l79386j3251J97422j3643
13927A268557k8912m9856j67928J48111O211M7878j48332J50852J10967l7955
13917A299593o2198j49478L21343m03220L7270m0215J5945J02060p5562J66489
13907A212027j79964K85894L1935n84382M04187J12325k03900K20767l98991j02310
13897G97588P7251J7640j30027M0932M65136m88949M34918l45164L5236K08379
13887A112940j8182j7596j06856J23123k1807M612J10829j20203D97525O70439
$$ plain form
13957 1461018 1801486 1471145 1753396 1604167 1532582 1577646 1346507 1393890 1480776 1469623
13947 1469623 1534479 1511697 1275959 1406871 1726573 1510267 1486354 1236572 1715967 1259197
13937 1259197 1331148 1254832 1110177 1398698 1308026 1477415 1098029 1084778 1282200 1268557
13927 1268557 1239645 1189789 1021861 1169972 1176183 1224061 1075729 1226581 1337548 1299593
13917 1299593 1237395 1087917 1409260 1006040 1043310 1003095 1019040 1121100 1045538 1212027
13907 1212027 1032063 1317957 1349892 765510 1169697 1282022 1078122 1298889 899898 797588
13897 797588 874839 892479 762452 803384 1268520 779571 1214489 869325 904561 1112940
13887 1112940 1094758 1077162 970306 1093429 1071622 1076234 1187063 1066860 497525 1167964
13877A167964l30859J20923L6183p8998j35622M33670j53016k09144n0179K63866
13867A064788k8998m56703M90281k21460J62272k1708l36673Q9904J36742j99040
13857F79405P0921J30017n6615O6454k69058J66524n0160J13338j46450j55138
13847E49238N17967j29507j38182J48155C81873K00467L89069k04266q0546k075
13837F84522J90421k04910r0352K63181J73365m55550M36238O7924l24476o9204
13827F71159k17271M6711o0358N12955l50770o2491o8765M01143k66217K32339
13817H38435k01320K91563j89779k07952n1803K14970j9258j45894O009L1366
13807E66337j90408J39206K25128A62895M13648k01188Q5552J55376L0190j2272
$$ plain form
13877 1167964 837105 958028 994211 915213 779591 1213261 1060245 851101 800922 1064788
13867 1064788 1035790 579087 1069368 847908 1010180 988472 651799 741703 878445 679405
13857 679405 750326 880343 823728 890182 621124 787648 737488 850826 704376 549238
13847 549238 1067205 937698 799516 947671 381873 582340 971409 767143 686597 684522
13837 684522 874943 670033 579681 842862 1016227 560677 996915 1064839 740363 671159
13827 671159 453888 500599 440241 953196 602426 539935 471170 872313 606096 838435
13817 838435 637115 928678 738899 530947 479144 694114 674856 528962 534971 566337
13807 566337 375929 515135 740263 162895 576543 375355 460907 616283 646473 634201
13797F34201k63391N82771m02183o5056J33549J56067B53795O35487k65372q5280
13787E38630j61927K44652K42024l34169k56066K64082J62298r5872J98286C42113
13776E76278J41995j23469H2454N70966p0484m7508k23006L90821o4375J0336
13766F49204j3905J40414l40809J16888A99077M86808A86418M21280B61065n2740
13756B08325L07650r4599r3163J1900L56908j88952k46312K86030m5726L32527
13746H34588B09408N95457k73954p0780P1428j9006q5507j63162j30719Q18865
13736I52030C95646J51707l7401j65095J24716j19723L75208j55196o5163p1178
13726D33521j3065n3004K7517L0185I1474M8825M01595k19434O35417B49894L66831
$$ plain form
13797 634201 370810 953581 551398 486342 619891 775958 253795 889282 623910 538630
13787 538630 376703 621355 863379 529210 273144 537226 699524 603652 801938 342113
13776 576278 718273 594804 82454 653420 582936 535428 312422 703243 638868 649204
13766 649204 635299 775713 434904 551792 199077 685885 186418 607698 261065 208325
13756 208325 515975 421376 328213 340113 697021 508069 261757 547787 502061 834588
13746 834588 209408 804865 530911 460131 531559 512553 427046 263884 133165 952030
13736 952030 395646 547353 509952 344857 469573 349850 725058 569862 504699 433521
13726 433521 420456 367452 394969 425154 91474 140299 541894 322460 957877 249894 616725
13715F16725p4053J47351k00092N0558A36400M75412j43714r6097p8357n8483
13705B35161j13111J67265L83873j44725k41732L51962k75480o6649J34412j31497
13695B99479M8334Q3666p3253A17718L93740j53095r085K65161m4325j49401K03658
13684F24371k36323J21310j40646E7890K29365J35769B01013O3911J99647A22242
13673D93251r9725J6078l6233A61350p8953K26968K90661k00324R2553j3280M9541
13662E28516a41377A45580j6705P3154K88516B05218K66484k29271L55478A75229
13651E6849M54923j63380J33080j22460l7388o4563K12876j93160L03784j57548
13641D23013j88230K86306B55110K40540R383j73578R1288A79663L69437k0905
$$ plain form
13715 616725 542672 690023 489931 540489 136400 611812 468098 372001 293644 235161
13705 235161 122050 289315 673188 528463 286731 638693 363213 296564 430976 299479
13695 299479 347813 431479 358226 117718 511458 358363 349278 614439 570114 420713 624371
13684 624371 388048 509358 368712 57890 287255 423024 201013 264924 464571 122242
13673 493251 393526 409604 373371 161350 82397 309365 600026 399702 492255 478975 528516
13662 528516 -141377 145580 128875 202029 490545 205218 471702 242431 597909 175229
13651 56849 511772 348392 481472 359012 321624 257061 469937 276777 580561 423013
13641 423013 234783 521089 255110 495650 505033 331455 422743 179663 549100 528195
13631E28195j88711r1611J38953j73318R0745r4816J65604J72959k73358l3845
13621B40797K40193k22487p8754p4273C9458J9595h0387B36129Q9157J28987n2869
13610D01404j28907D5467K72869K29810k17458H401L78661A77228h5903C6234
13599C26260j42028c11638F42162A17237k663K07545D5147L63277A36190L01315
13589D37505A75875o940k2792M9625o8585h958B18220N4748j25118K2135M15791
13578E85776A38839B4146L30109k2829E1058J16730a2274A04414a54644A89828
13567A31464J22574H1635C384M64175A0883K40913J25422K00969B77559J14174
13557C91733F6729L15684N3349H3928J13165K4744q1336L99370J3262A82024O8452
$$ plain form
13631 528195 339484 247873 386826 213508 304253 209437 375041 548000 274642 240797
13621 240797 480990 258503 179749 105476 39458 59053 -80387 236129 325286 454273 401404
13610 401404 272497 45467 318336 548146 330688 8401 387062 177228 -85903 36234
13599 326260 184232 -311638 642162 117237 114574 322119 45147 408424 136190 437505
13589 437505 175875 168935 146143 195768 127183 -8958 218220 272968 147850 169985 585776
13578 585776 138839 24146 354255 331426 51058 167788 -12274 104414 -154644 189828
13567 131464 254038 81635 3384 467559 10883 251796 377218 578187 277559 391733
13557 391733 66729 382413 435762 83928 197093 221837 140501 539871 553133 182024 250476
13546B50476N5997q865K32362r2596j19451K50803k28949A42955K38087A90507
13535I4636m7311J82177c81777B71070N9568F0313l288J52749J14172K64430F3427
13523A2599L06154K46240A79372N27316B37111L66226a02333C60383j00723b06157
13512A61954p7844L09839I9448b7619D2634K78912j06957J52980Q114a35842B89131
13500E2556J35165a18811A84074a24511B80759j10884H2759R1537a67183A04783
13489C71609m9057o967j42989j9265J04630K3936Q5200Q7009b59405A1400J81430
13478A92830J96066L1479j62246o0605L4783O4112q4169K10647J83161G6674b1014
13466H3355Q8836D2310J90492p5930J32933c051C622N828K01793j4474E777J01137
$$ plain form
13546 250476 306473 297608 529970 437374 317923 568726 339777 142955 381042 190507
13535 94636 47325 229502 -381777 271070 330638 60313 57025 209774 323946 588376 63427
13523 12599 318753 564993 179372 706688 237111 603337 -102333 360383 259660 -206157
13512 161954 84110 393949 99448 -27619 42634 321546 214589 367569 375683 -135842 289131
13500 52556 187721 -118811 184074 -124511 280759 169875 82759 174296 -167183 104783
13489 371609 322552 315585 172596 153331 257961 281897 367097 454106 -259405 11400 192830
13478 192830 388896 420375 258129 197524 232307 296419 212250 422897 606058 76674 -21014
13466 83355 172191 42310 232802 156872 289805 -3051 3622 9450 211243 196769 5777 106914
13454A06914K22775L1616j27588n3037J22407A37562K01090j02197Q3868e7896
13443I1890K6175J88114d344n541C68448A0221b6483C31423f2329A45768J66624
13432C12392j49731D174b4248A32465f1881j54648a01207D31792j30120A03959
13421A17165D0946J98774l9574d4728A87640J82032B0582K35331a3843l0192G985
13409b39993e3219F2503N17260B6413g0265D4881j5158N9408j5641O8651b42579
13397I3305K8483b26866E5723J00373d4000k9442F2907J4030H242L47882H7981
13385A96486O3955M823P5777A63095D4971K22251N5205E3718L21931c7529G3543
13373d674E1179L56822H0456j832M22286A37710c1698A14643J18665A01833K37684
$$ plain form
13454 106914 329689 361305 233717 180680 303087 137562 338652 236455 320323 -57896
13443 91890 118065 306179 -4344 -9885 368448 10221 -26483 331423 -62329 145768 312392
13432 312392 162661 4174 -24248 132465 -61881 -216529 -101207 431792 301672 103959
13421 117165 40946 239720 200146 -44728 187640 369672 20582 255913 -13843 -44035 7985
13409 -239993 -53219 62503 579763 26413 -70265 44881 29723 89131 73490 142141 -242579
13397 93305 121788 -226866 55723 156096 -44000 -73442 62907 76937 8242 356124 87981
13385 196486 260441 265264 341041 163095 44971 267222 322427 53718 375649 -37529 73543
13373 -4674 51179 408001 80456 78624 500910 137710 -31698 114643 233308 101833 339517
13362C39517J04962I1324J45647n2294K41641j96566P1035J36399p3335A9763
13351F9107L9615A8049K85691a9794A34764c42562I7807K59189j15579F2820M6384
13340A09204a07329A91933r4621b50307J17166A43964a81872A05333k3230r309
13330G2794R8658J527D8555J58851L76731B77907j18845n7729a65541F9980J20803
13319A90783a21410G5895R1144E7773P6566R2010g404C05157A31584L88219A92130
13307b1375A30274K00186E6500K79341a2475B44724m4598i8522A66395F3638b5974
13295A01892c3580C00537G9721B5431J76026K12737j91824F3576J28728p4341
13285A17963J98543A02293l004H20K07157b2851A05996i1146K7077J9214F7172
$$ plain form
13362 339517 444479 91324 236971 184677 426318 229752 300787 437186 363851 19763
13351 69107 108722 18049 303740 -19794 134764 -342562 97807 356996 241417 62820 109204
13340 109204 -107329 191933 97312 -250307 -133141 143964 -181872 105333 82103 72794
13330 72794 171452 172979 48555 207406 584137 277907 159062 101333 -165541 69980 190783
13319 190783 -121410 75895 167039 57773 134339 226349 -7404 305157 131584 519803 192130
13307 -21375 130274 330460 56500 335841 -12475 244724 200126 -98522 166395 63638 -25974
13295 101892 -33580 300537 79721 25431 201457 414194 222370 63576 192304 117963
13285 117963 316506 102293 99289 820 207977 -22851 105996 -91146 -64069 -44855 67172
13273g5111E2053O9111N8546o8507m5491K78085E7422K71908B7372N8004A4295
13261e3165D9174P0559R710d736j96362Q8272A14502J07709m2089k0483F9432
13249C12400a62372G8677i6828C52781D1804a46352A76273E4240a9646l1003a8849
13237h1223H9044B6704P2821J77746L0113F982K28369b21592i528B65988B2199
13225A21108b59611f7223A92392n4000h711A53435m6389P1443p410n9394B6520
13213E8261g1824c5232D24365b00431B8718a5695B28650A13690a3407B95959J12332
13202D08291a71214B34457k511P8434q3113J335a88871B06042M6379h392n7981
13191f6373D39548m8251g6521L4638E33386A90853K6912k8467H9700R82f2538
$$ plain form
13273 -75111 52053 121164 179710 111203 65712 343797 57422 329330 27372 85376 14295
13261 -53165 49174 119733 129443 -4736 -201098 -112826 114502 222211 180122 159639 69432
13249 312400 -162372 78677 -96828 352781 41804 -146352 176273 54240 -19646 -50649 -18849
13237 -81223 89044 26704 99525 277271 307384 6982 235351 -221592 -9528 265988 22199
13225 121108 -259611 -67223 192392 138392 -8711 153435 107046 178489 171079 111685 26520
13213 58261 -71824 -35232 424365 -200431 28718 -15695 228650 113690 -13407 295959 408291
13202 408291 -171214 234457 231946 310380 227267 228602 -188871 206042 252421 -8392 -66373
13191 -66373 439548 391297 -76521 -41883 533386 190853 217765 189298 89700 90682 -62538
13179A86087a58115d9502B82711n4571H8827O0662n5963M0524D7069J48982M1953
13168B38004d364j73962G2550i794j9861j62588b6910H6292a2773q4632C4992
13156B10430n3242P5522A1310L02503b2259G3924b53522a01520l9276A07894f1811
13144I080J8542a3728E6758K25804B4347a58888M8061a266F0950K35816C4181
13132a28223j23362J24296F3096J18763a97587B0349b39861B8774J82567m6773
13122A64568J11015E4755b82895C75209a89419A61817F1009B5228K63252c7699
13111B29035H7533a36439H3760J8285a15952a9269l35444B65771p9782q5989K82489
13100C82489A74184b32737g2948h466B74164A6018L3706N7938a60594B9218a09003
$$ plain form
13179 186087 -158115 -49502 282711 228140 88827 149489 93526 134050 47069 196051 238004
13168 238004 -4364 -178326 72550 -9794 -29655 -192243 -26910 86292 -12773 -97405 34992
13156 210430 157188 232710 11310 313813 -22259 73924 -253522 -101520 -140796 107894 -61811
13144 9080 27622 -13728 56758 282562 24347 -158888 -110827 -1266 60950 296766 34181
13132 -128223 -251585 -127289 63096 181859 -197587 20349 -239861 28774 211341 164568
13122 164568 275583 54755 -282895 375209 -189419 161817 61009 25228 288480 -37699
13111 229035 87533 -136439 83760 102045 -115952 -19269 -354713 265771 185989 100000 382489
13100 382489 174184 -232737 -72948 -8466 274164 16018 49724 107662 -160594 29218 -109003
13088A5955L26202C610K40761h0998A52004i1256K3632g173j55407O7663j24885
13077b19802a05538B20395a62743C63647A50037e9455D428J49152G296b6566A32106
13065I1840c7759E9085a4983k4450m0764B91267f1016A66314f7342j2012J5535
13054f3819F6222l1134K2681P6993d1840C33005a50576E4242K27310D8424M02266
13043D50690a48791A20712K2595b64793A34290e2604D7268L4780j1048Q2124b74998
13031A14862a04842D5237a84773C23205E0258f5534A0472L62950a3651E2478J00837
13020A53315a87553N4310C4692K38692D3210L2116J36766J8473G1420g2230A94300
13008A43317J3552f6331j47891C48086g3215k75749F287b5238A92219b47783o6878
$$ plain form
13088 15955 342157 3610 244371 -80998 152004 -91256 -67624 -7173 -162580 -94917 -219802
13077 -219802 -105538 220395 -162743 363647 150037 -59455 4428 153580 7296 -26566 132106
13065 91840 -37759 59085 -14983 -39433 -80197 291267 -61016 166314 -67342 -79354 -63819
13054 -63819 66222 35088 57769 134762 -41840 333005 -150576 54242 281552 48424 450690
13043 450690 -148791 120712 143307 -264793 134290 -52604 47268 82048 71000 153124 -274998
13031 114862 -104842 45237 -184773 323205 50258 -65534 10472 373422 -13651 52478 153315
13020 153315 -187553 -133243 34692 273384 43210 75326 212092 230565 71420 -72230 194300
13008 143317 156869 -66331 -214222 348086 -73215 -348964 6287 -25238 192219 -247783 -314661
12997c14661e759A22336E2754a91707G8187J55615c95963C4962g4167q4619C93976
12985g1375G0526J62890A2135a24337n1626E8819l489b34189M5574O3133A02756
12973I310c7654B71205a79776A72216a30126A14458a71684k8352h8424A00681
12962A05837b1410n5337B9678O9587a80988A92588g8840K7943A40750a7108n0252
12951f7360D3354c35529H2616a00784j40770C71910B3850b9221A23303J54468
12941B77771o1670c89554g9817A24437J37616O2583a2927j55031j08575B65516
12930a67906A1993a2806m1108A07679b2137j48616k4742i2623A58632b45145H0626
12918b0029h73B43984a38612N7196l64858i7657D98709a44951B88582G3196J33121
$$ plain form
12997 -314661 -5759 122336 52754 -191707 78187 233802 -395963 34962 -74167 -158786 393976
12985 -71375 70526 233416 12135 -124337 -175963 58819 55330 -234189 -188615 -125482 102756
12973 9310 -37654 271205 -179776 172216 -130126 114458 -171684 -200036 -88424 100681
12962 105837 -21410 -76747 29678 99265 -180988 192588 -78840 -50897 140750 -17108 -67360
12951 -67360 43354 -335529 82616 -100784 -241554 371910 23850 -29221 123303 277771
12941 277771 216101 -389554 -79817 124437 262053 324636 -12927 -167958 -276533 265516
12930 -167906 11993 -12806 -53914 107679 -22137 -170753 -195495 -92623 158632 -245145 80626
12918 -20029 -873 243984 -138612 -81416 -446274 -97657 498709 -144951 288582 73196 206317
12907B06317F9528a56193b0407C06249F1147h8161B4992K02910o0776j6813G5116
12895a50463o3476B96365L4277A59859a40837A44706m152J23887f7821E4651b61162
12883A36039a17615k52859A80827K7022e3663A39131E5761c8886o8678j73452
12873b81016B21081A2743J94368a00820j29186d7992e093j4811C7376j2434B055
12861A08277a54825a9870j02608F7292J32273a87730A70582C4952J95079c5091
12850d7989j96028A16217O7867J2812a06513j30850f3006G5054f6568l13594c2651
12838e4066A59698O7005d6876A99692a47083b8778j21503H6724c80144a81175
12827a44334o8931e2895j63748P5182b4997j74410A32419c9555F5330Q1817a6402
$$ plain form
12907 206317 69528 -156193 -20407 306249 61147 -88161 24992 227902 167126 150313 75116
12895 -150463 -213939 296365 330642 159859 -140837 144706 140554 264441 -67821 54651 -261162
12883 136039 -117615 -370474 180827 207849 -53663 139131 55761 -38886 -107564 -281016
12873 -281016 221081 12743 207111 -100820 -230006 -47992 -5093 -19904 37376 24942 2055
12861 108277 -154825 -19870 -122478 67292 199565 -187730 170582 34952 230031 -35091
12850 -47989 -244017 116217 184084 196896 -106513 -237363 -63006 75054 -66568 -380162 -32651
12838 -54066 159698 226703 -46876 199692 -147083 -28778 -150281 86724 -380144 -181175
12827 -144334 -213265 -52895 -216643 -141461 -24997 -199407 132419 -39555 65330 147147 -16402
12815b15517j43273A1413b21999o0168Q4026A19612K89354j79440a43698I4404
12804B1828L21175G0219b60818i486q5147A4456J10657c07704J28061B29439b64417
12792C2091i065I8295b34284R4753E0400i1942k5765A85793D0483L2072L76691
12781D49246H8712f4081B1744J7908a01696h606r91k46129N9485j30106I5961
12769d3799F7743a90435A62129D5034A6525e4700j5819H3054b72859c2111F5237
12757e5117j4530m2558d7947j10722A32642f1500A81987C3002a85136C446N1647
12746E5093a24070B22427r7273b2003j60583B44735E4195a03329C23087a27300
12735A98516o4555D6509D88J38678K04947b18475J05128j75518B2587c607o8275
$$ plain form
12815 -215517 -358790 11413 -221999 -282167 -198141 119612 408966 229526 -143698 94404
12804 21828 343003 70219 -260818 -9486 -94633 14456 125113 -307704 -179643 229439 -264417
12792 32091 -9065 98295 -234284 -139531 50400 -91942 -117707 185793 40483 72555 449246
12781 449246 88712 -64081 21744 39652 -101696 -8606 -9597 -255726 -196241 -326347 95961
12769 -43799 67743 -190435 162129 45034 16525 -54700 -70519 83054 -272859 -32111 65237
12757 -55117 -69647 -112205 -47947 -158669 132642 -61500 181987 33002 -185136 3446 55093
12746 55093 -124070 222427 125154 -22003 -182586 244735 54195 -103329 323087 -127300
12735 198516 133961 46509 488 139166 344113 -218475 -113347 -288865 22587 -3607 -71882
12724g1882r0908M374g4308a893j25027M8507l6586A70031a58979B28102G662
12712B18993d3989k04298I6315K74897a57578B54649a30450D53914A08734b17051
12701A43006J64806b53753A73912H1149l9012N2593b84864c1501H7523b13747
12690a9230C0348J0892L3868N1435a34680m4799B06460a96808g5444J9561B15676
12678b74244I3115b35533C55861B874J0527J53546C7381b397A64970b07437F8816
12666a22684A5858R0863C7732b45090h2381j26117L905j02767i7937j03721A86175
12654D2642M9146a52544A15204b43304G0705R1048G0178J72347b53855D7805a64129
12642a12730j40322B7118F692O2821b6203B6650i0320A44170J07902a49510G3446
$$ plain form
12724 -71882 -162790 -158416 -74308 -1893 -126920 -78413 -114999 170031 -158979 228102 7662
12712 218993 -43989 -248287 96315 371212 -157578 254649 -130450 453914 108734 -217051
12701 143006 307812 -253753 173912 81149 42137 94730 -284864 -31501 87523 -213747
12690 -19230 30348 41240 75108 126543 -134680 -179479 206460 -196808 -75444 -55883 215676
12678 -274244 93115 -235533 355861 2874 13401 166947 37381 -2397 164970 -207437 68816
12666 -122684 15858 106721 37732 -245090 -82381 -208498 -204593 -307360 -97937 -201658 186175
12654 42642 91788 -152544 115204 -243304 70705 161753 70178 242525 -253855 47805 -164129
12642 -112730 -253052 27118 6692 69513 -26203 26650 -90320 144170 252072 -149510 73446
12630a27754B56745i1271A45464c0057r5268A86051b74912B45207G2164M5508
12620A17672e5166J1553q9499A28989J84568a53133P776d3046l00657I6688e6156
12608E8071B8855I276N7386J32651a74950A44047b60514B4130J53711F6485e9171
12596G7290O2872J62368j18916b7044A55811o0859c40178a56683c2225A7505Q0719
12585I8224C4860L8821M6338b00438M8087A18250c7637j69604A47574a62624q2095
12574b44719G7642K36932d15379J34825c3765B4394J72811e8607F8713J4326Q6439
12563A69478D9984b51388P2615l6275h5576c9183a2893D08371A43327J56759C858
12551B3093b79421J23266m1958c081A77473J61249D1066L38606d6463A37533F6958
$$ plain form
12630 -127754 256745 -91271 145464 -30057 -125325 186051 -274912 245207 72164 117672
12620 117672 -55166 -43613 -133112 128989 313557 -153133 -145357 -43046 -343703 96688 -56156
12608 58071 28855 9276 66662 199313 -174950 144047 -260514 24130 177841 66485 -59171
12596 77290 140162 302530 183614 -27044 155811 94952 -340178 -156683 -32225 17505 98224
12585 98224 34860 73681 120019 -200438 -152351 118250 -37637 -207241 147574 -162624 -244719
12574 -244719 77642 314574 -415379 -280554 -33765 24394 197205 -58607 68713 83039 169478
12563 169478 49984 -251388 -178773 -215048 -85576 -39183 -12893 408371 143327 300086 3858
12551 23093 -279421 -156155 -198113 -3081 177473 338722 41066 379672 -46463 137533 66958
12539B38699a78315j87906a58304a7629A51326c5407k7156j49709A5702a21696
12528b35738M357B31461h450j10758B4933c2888j83959K0561H5527A9382b05199
12516g5592D22686d0642o759e045A7235K60713B4351c7263m6368D8783J73684
12505B22467a21797G6306M7910a7192m06693g6747C38728b41295A38534L413K75781
12494D17728e70029e9314E1605b15495G8704C1882b8443H1642k1991q22a5782
12482i4510B4167K68408H5578b6215j0559B1647h0901m01401a14971A97534b44981
12470a69531b4845j36301P6067B90909a41101a9624C34753b4478j55362O6432
12460a13408C45728j60061g9473n2975d0071o8134b6379E7085K3014J24743A9773
$$ plain form
12539 238699 -178315 -366221 -158304 -17629 151326 -35407 -62563 -212272 15702 -121696
12528 -235738 -231381 231461 -8450 -119208 24933 -32888 -216847 -196286 85527 19382 -205199
12516 -75592 422686 -40642 -47401 -5045 17235 277948 24351 -37263 -83631 48783 222467
12505 222467 -121797 76306 124216 -17192 -423885 -76747 338728 -241295 138534 141947 417728
12494 417728 -570029 -59314 51605 -215495 78704 31882 -28443 81642 59651 58829 -15782
12482 -94510 24167 292575 85578 -26215 -36774 21647 -80901 -482302 -114971 197534 -244981
12470 -169531 -24845 -161146 -85079 290909 -141101 -19624 334753 -24478 -179840 -113408
12460 -113408 345728 185667 -79473 -132448 -40071 -108205 -26379 57085 80099 204842 19773
12448B68673a35465c2407A33266F1537h8631C1058d28066A97156n9631B536g7942
12436C52811A13232g6286B888h1462a3801j08943b4813j28570j9905K5350j8441
12425a66379e4812C0160c1370m35775A30363e1638b1899e370k3597q1857A98701
12413c83898a38393F9388c58253c6470B12217a9456A75744a33444G1400a8399
12402c32866I2848a60496B25602b921I2111b21479k2812g3285D6016L87600j90735
12391B42881l1865B9248e0384G6822f2640q337A64618a85354I6126a57140H1339
12379b680A9657a03501E227b07554e3112I1025L56504F7394a06607B50912E5563
12367b51908e0684I9332Q1892l5054d5786k7880E830b24682A64576Q7261a91648
$$ plain form
12448 268673 -135465 -32407 133266 61537 -88631 31058 -428066 197156 137525 2536 -77942
12436 352811 113232 -76286 2888 -81462 -13801 -122744 -24813 -153383 -173288 -147938 -166379
12425 -166379 -54812 30160 -31370 -467145 130363 -51638 -21899 -5370 -28967 -110824 198701
12413 -383898 -138393 69388 -358253 -36470 212217 -19456 175744 -133444 71400 -18399
12402 -332866 92848 -160496 225602 -2921 92111 -221479 -244291 -73285 46016 433616 242881
12391 242881 211016 29248 -50384 76822 -62640 -70977 164618 -185354 96126 -157140 81339
12379 -2680 19657 -103501 5227 -207554 -53112 91025 447529 67394 -106607 250912 55563
12367 -251908 -50684 99332 181224 146170 -45786 -73666 5830 -224682 164576 251837 -191648
12355a46281j8599b6807A99430j0157g7566a4971n0268A06579c2879C1021f4726
12343a12034a0968A93475E3976c00307b6486q3317A38635J40578d1942k83786
12333c25728a24041c9496O645B34980F6307a17648e6307G7547a16424A01427b57918
12321G4467d28102C54687a76281A7693J16334l5850d3831j41879A250e0582A98679
12309A54513f8002A6202n218K01806b49734F9480h9611H271a87193A88170F1733
12297a05403j41156k8787O0139A69707r837a68556A69416a95966C8372K58503
12287B96875b36315C27e2421m1931q5017Q9662b1979E8979N2252K21816A57983
12275a83411A39817b0892l92481B63798F8496B4817a38809I7359J14240C0099
$$ plain form
12355 -146281 -164880 -26807 199430 189273 -77566 -14971 -65239 106579 -32879 31021 -64726
12343 -112034 -10968 193475 53976 -300307 -26486 -109803 138635 279213 -41942 -325728
12333 -325728 -124041 -39496 -32851 234980 66307 -117648 -56307 77547 -116424 101427 -257918
12321 74467 -428102 354687 -176281 17693 134027 98177 -43831 -185710 1250 -50582 198679
12309 154513 -68002 16202 10984 212790 -249734 69480 -89611 8271 -187193 188170 61733
12297 -105403 -246559 -275346 -215207 169707 159870 -168556 169416 -195966 38372 296875
12287 296875 -236315 327 -52421 -94352 -179369 -89707 -21979 58979 111231 333047 157983
12275 -183411 139817 -20892 -413373 263798 68496 24817 -138809 97359 211599 30099
12264h8894A38442j6092C9651i0997d2632j66424j4030C30579a59904D0559e3580
12252A82450a27451A38013l438J0555J61680p1532r8587o2239f8351n0339e2553
12240A28012n2320Q5503A3010K58254G1086k6980b41646c0995B38697a40765j26672
12229b67437A77517c5523D3183K23291d9n1844B21063a3206I4310a8786A82485
12217G9086O939D1092J00234I888i7271m5003F1791F354J10995j2245J12514C8881
12204F7272J69129a01122Q236i548p8775A77836p5463L69304I9909a76755A58653
12192D80016A69210E8988J715a55110A14369K01512j55028J15018q8561N3578
12182B40888J56795j70540b17218A17699L14205B09793a7125A35384J02267Q7201
$$ plain form
12264 -88894 138442 122350 39651 -90997 -42632 -209056 -223086 330579 -159904 40559 -53580
12252 182450 -127451 138013 134575 145130 306810 235278 136691 74452 -68351 -118690 -52553
12240 128012 75692 161195 13010 271264 71086 44106 -241646 -30995 238697 -140765 -267437
12229 -267437 177517 -35523 43183 266474 -49 -51893 221063 -13206 94310 -18786 182485
12217 79086 86025 41092 141326 9888 -97271 -142274 61791 6354 117349 105104 217618 38881
12204 67272 236401 -101122 -92886 -9548 -88323 177836 102373 471677 99909 -176755 158653
12192 480016 169210 58988 60703 -155110 114369 315881 160853 275871 187310 240888
12182 240888 397683 227143 -217218 117699 431904 209793 -17125 135384 237651 324852
12172C24852A1555J87414j9567p2118c4001B5583J44779k4818J41160j39200N2338
12161A99842E1954g3313A46690a3617B08179q957a46031A3563a6821l04344A64908
12149c4245n3769j990B931J55180j1554b22322g3574B25835m8202l9110M7426
12138A85949B6608K401K25277C970Q8832K1866f1380A26652a20667K032A2396
12126c13087G9702M424H486J38591f9302j4229C3616g5297j0227K7794H9544b98246
12113a93710B7618e1348k55615N6533a14800D8451R9856p521a94077B18620b6545
12101g4191J722j10178k4155h7326j20930A42626E250K88108D5352Q3032m9814
12090G8570J71607a04459l9843B2832M603J7282c5001j69407E3206a26638m6051
$$ plain form
12172 324852 11555 198969 179402 107284 -34001 25583 170362 145544 286704 147504 199842
12161 199842 51954 -73313 146690 -13617 208179 199222 -146031 13563 -16821 -321165 164908
12149 -34245 -88014 -90004 2931 158111 146557 -222322 -73574 225835 177633 138523 185949
12138 185949 26608 29009 254286 3970 92802 114668 -61380 126652 -120667 -118635 12396
12126 -313087 79702 84126 8486 147077 -69302 -83531 33616 -75297 -85524 -57730 89544 -298246
12113 -193710 27618 -51348 -306963 -250430 -114800 48451 148307 140786 -194077 218620 -26545
12101 -74191 -72469 -182647 -206802 -87326 -208256 142626 5250 293358 45352 128384 78570
12090 78570 250177 -104459 -144302 22832 27435 44717 -35001 -204408 53206 -126638 -172689
12079a72689N2471A10355R701b48592d4647f486B03563H8455c6491A40708K3108
12068A63816k5310b85300I8411L7462R7742L9730K00102A96280M1648A04914J6382
12057A21296J05511b16142a01445n9248C4687a80418k64889c095k06224J035D1214
12045G5268a12732J7335a8901l49115b6960j33920j30690c1611q9077B7563a87110
12033A25946a55909L3206L6854A78054l7190b13234h6862B59436a98854E9016
12022c5584n1153p5311p763L117j73535a52999k1454O2060k3675D6929d9019a2768
12009G0775B8741a73455O6769A18141c64924a48097j21582A80214c3974j14313
11999a48287c1888B21266q1658K5354J2071n9182b49251r434A73833a91764K2863
$$ plain form
12079 -172689 -120218 110355 120056 -248592 -44647 -6486 203563 88455 -36491 140708 163816
12068 163816 138506 -285300 98411 135873 233615 273345 473447 196280 237928 104914 121296
12057 121296 226807 -216142 -101445 -160693 34687 -180418 -445307 -3095 -209319 -208284 41214
12045 75268 -112732 -95397 -18901 -368016 -26960 -160880 -291570 -31611 -120688 27563 -187110
12033 125946 -155909 -122703 -85849 178054 140864 -213234 -86862 259436 -198854 59016
12022 -35584 -86737 -162048 -169811 -166694 -340229 -152999 -174453 -112393 -136068 46929 -49019 -12768
12009 70775 28741 -173455 -106686 118141 -364924 -148097 -269679 180214 -33974 -148287
11999 -148287 -31888 221266 139608 164962 177033 117851 -249251 -258685 173833 -191764 -168901
11988a68901B76568a59750n2047A32949c04593c1026j56480f0064j36078A26094
11977a15412j47027J2311g3252C8878L6764J56333b11535l9899H466i417G1962
11965A85976p6999m949f2475a861q523H8596a50291A29074b97578A60169l5725
11954A24444b83233p3162A11645a05813o3413j03517a08363j27176B43464g9474
11943A66653b3097m0196B07823g1584A38576b08115A47553a71204B6267J6836
11933D3103F241h244B45769I4358b10215C73590b77025B05834a52555A53564e8408
11921A02449c71902m3659C26398A7766J6553a76930n4859B1276K85523a88233
11910b40295G2045c84603J75815K5389Q9577r11A54161b17997P2320D6907J69599
$$ plain form
11988 -168901 276568 -159750 -211797 132949 -304593 -31026 -187506 -60064 -196142 126094
11977 -115412 -262439 -250128 -73252 38878 75642 231975 -211535 -251434 8466 -9417 71962
11965 185976 108977 104028 -62475 -1861 -10384 88596 -150291 129074 -297578 160169 124444
11954 124444 -283233 -356395 111645 -105813 -169226 -272743 -108363 -235539 243464 -79474
11943 166653 -23097 -63293 207823 -71584 138576 -208115 147553 -171204 26267 43103
11933 43103 6241 -8244 245769 94358 -210215 373590 -277025 205834 -152555 153564 -58408
11921 102449 -371902 -415561 326398 17766 34319 -176930 -231789 21276 306799 -188233
11910 -240295 72045 -384603 -208788 -183399 -93822 -94733 154161 -217997 -145677 46907 216506
11899B16506C2489a4131A56708b00666d5164k15021C79577j83280E0048a1645
11888f8226A28431b837B01395I1915c95028J01512J38704o1724b8288j16112k26295
11877c70695F1678a56451j45479A951a73774A91815q5854J0930b59329J19824
11867a39505A66857j8265b07689p5083d170B24883a4165k44348A5894K02908g6703
11855B11195b60153b8119q5501G2211I788b32952B9746d02385a18019j02395C1857
11843d12101g1283D7837a41317A6479K06255G1666h6105M2247l7625j45710K1309
11832b05884Q5789b3296A25060e1711A7464a25653b995q8378I8361C5356K88901
11821C24257a44131e1897o2109n88825G6631f4309j16653A62338R6799p8723C4202
$$ plain form
11899 216506 32489 -14131 156708 -200666 -45164 -260185 379577 196297 50048 -11645
11888 -68226 128431 -2837 201395 91915 -395028 -293516 -154812 -216536 -28288 -144400 -370695
11877 -370695 61678 -156451 -301930 1951 -173774 191815 105961 116891 -259329 -139505
11867 -139505 166857 148592 -207689 -282772 -4170 224883 -14165 -258513 15894 218802 -76703
11855 211195 -260153 -28119 -113620 72211 9788 -232952 29746 -402385 -118019 -220414 31857
11843 -412101 -71283 47837 -141317 16479 222734 71666 -86105 -43858 -81483 -227193 -205884
11832 -205884 -120095 -23296 125060 -51711 17464 -125653 -2995 -91373 98361 35356 324257
11821 324257 -144131 -51897 -114006 -702831 76631 -64309 -180962 162338 259137 180414 34202
11809b011k34212A34127b70444B28161F9056d426l28331f0044b3853A0334c7825
11797a48603D67654B6986O9524a4563k7331H4660a91866L5361b9860j2335B08630
11785a2661B11546J35934g1392D7054c2676I672K9658a06166j26631J1037C90466
11773b3255j87022o078R5168j03090D0145a05425b8622a2079j4762k61858J32425
11762a56274f0132k9953j8636c0445A34655a1235B31473b38819i1763l3832A2309
11750a86605A01946i2343J1665B6198J93535A9558J94115k3437d132k51833J00341
11739a55624e989j35627o4094C04045C0497K34262a5725F4676a63309G5689F692
11727a08654b3395A54721a52572B94724b34826E3599L0372I156J08989J20416
$$ plain form
11809 -2011 -236223 134127 -270444 228161 69056 -4426 -332757 -60044 -23853 10334 -37825
11797 -148603 467654 26986 96510 -14563 -41894 84660 -191866 -156505 -29860 -42195 208630
11785 -12661 211546 347480 -71392 47054 -32676 9672 39330 -106166 -232797 -221760 390466
11773 -23255 -210277 -216355 -121187 -224277 40145 -105425 -28622 -12079 -26841 -288699 -156274
11762 -156274 -60132 -90085 -108721 -30445 134655 -11235 231473 -238819 -91763 -125595 12309
11750 -186605 101946 -92343 -80678 26198 219733 19558 213673 190236 -4132 -255965 -155624
11739 -155624 -5989 -141616 -205710 304045 30497 264759 -15725 64676 -163309 75689 6692
11727 -108654 -23395 154721 -152572 294724 -234826 53599 83971 9156 118145 238561
11717B38561F5077a16945L2377L1085A9922O4792k7264c22382a05174C5924P2500
11706A08424J52488a02045A4583f3699B8870O5558j6191J16601e21704A93787
11695a00702G7036e4949A59379g0121j4539a466j94313h0193O27E6859O9077a92064
11682C8431m918b19682A47946g5053a6759B04699a19189C86000G93a17336k43786
11671c61122B0091b18188C1228e4957l1786A1104a16609E507b57921H5011a18990
11659a0693j00839r172H6660J08782N9428a1749m3131j22891B16615b45485b4160
11647A21898K72820e3032p5937n967D5487a80743b8384A2165O8839a58629m5894
11636b04523f4283k9379M0657j34919a0299B15559H6134Q2688e138q7528J9310
$$ plain form
11717 238561 65077 -116945 -84568 -53483 19922 84714 57450 -322382 -105174 35924 108424
11706 108424 260912 -102045 14583 -63699 28870 94428 78237 194838 -521704 193787
11695 -100702 77036 -54949 159379 -70121 -84660 -1466 -195779 -80193 -79566 56859 125936 -192064
11682 38431 33513 -219682 147946 -75053 -16759 204699 -119189 386000 793 -117336 -361122
11671 -361122 20091 -218188 31228 -54957 -86743 11104 -116609 5507 -257921 85011 -118990
11659 -10693 -111532 -120704 86660 195442 254870 -11749 -54880 -177771 216615 -245485 -24160
11647 121898 394718 -53032 -128969 -134936 45487 -180743 -28384 12165 81004 -158629 -204523
11636 -204523 -64283 -93662 -53005 -187924 -10299 215559 86134 168822 -5138 -92666 -73356
11625g3356E3909K62075b40601k24844H7886h7679c1472r0063A14036C5065i7342
11613B9464a18637E8576f013B33409A2380g7228C35696A32407b73938A08056M4554
11602A52610h265B13611o3610O3864I3501a10058B27856H356e4354l4295O666
11591h1983o0011L5449D0482h9044A07066K00238n5010j11835B865R8978J71312
11580B73155r9742A25f5102P843p7998K2322A59123F8500L3600b03900e548j81294
11568a86842a9498B61007Q0542l7871R1253f3077G7877f3704l5707J4775J1801
11557g2835B23931a86998O6913n9995j37684Q8668A88803G9710k7251e1382k63150
11546c14532A75809d1105A05061B5098c14270D8113d3480A96768p4067C5232a91205
$$ plain form
11625 -73356 53909 315984 -240601 -465445 87886 -87679 -31472 -121535 114036 35065 -97342
11613 29464 -118637 58576 -6013 233409 12380 -77228 335696 132407 -273938 108056 152610
11602 152610 -8265 213611 150001 213865 93501 -110058 227856 8356 -54354 -88649 -81983
11591 -81983 -141994 -106545 40482 -89044 107066 307304 252294 140459 2865 101843 273155
11580 273155 173413 125 -65102 -57259 -135257 -112935 159123 68500 102100 -203900 -5548 -186842
11568 -186842 -19498 261007 341549 303678 394931 -63077 77877 -63704 -99411 -84636 -72835
11557 -72835 223931 -186998 -120085 -180080 -317764 -229096 188803 79710 52459 -51382 -314532
11546 -314532 175809 -41105 105061 25098 -314270 48113 -43480 196768 122701 35232 -191205
11534A00187L60887C9976c16329I0929c5235j95850D1521G558J72501B8402a88834
11522I1602b31150A68796D5751J21408H0231b3251j23400H4821J02850b20972
11511e9590j49929D01151j03927A48362b52818e7621m2243I0287c48778J29389
11501b19389A75732l7584n2778j2294J59557q3728a98385M0044c3160G6787c9598
11489a54658f3707B62362c66490a53985A86422F707J38506l8941m9061h4938j17389
11478b02327F9665a81999A53135O376A7862J03387c06038A35822J71074m4400
11468B62496A15612J51571b43067B06143d948B18822q4408j6703m4071e1148H9466
11456f8531j11316C16809a74288g8327K1551C96770A29448a80995a0125A89415
$$ plain form
11534 100187 461074 39976 -316329 90929 -35235 -231085 41521 7558 180059 28402 -188834
11522 91602 -231150 168796 45751 167159 80231 -23251 -146651 84821 187671 -220972
11511 -59590 -209519 401151 297224 148362 -252818 -57621 -99864 90287 -348778 -219389
11501 -219389 175732 138148 85370 73076 232633 148905 -198385 -158341 -33160 76787 -39598
11489 -154658 -63707 262362 -366490 -153985 186422 6707 145213 106272 57211 -84938 -202327
11478 -202327 69665 -181999 153135 159511 17862 121249 -306038 135822 306896 262496
11468 262496 115612 267183 -243067 206143 -4948 218822 134414 117711 73640 -51148 89466
11456 -68531 -179847 316809 -174288 -78327 -56776 396770 129448 -180995 -10125 189415
11445I964J9829E364M14426j0131e43091B54252J9526g8906D8239a02943c7921
11433A61194A0422N1217b92087J16278A36115n5327J07324b65849c5707F618c4282
11421A14031b54010J04294A10160J98341G5335N3879j8988b44211j35251E0394
11410d2750e483A03006L3870P730J41411b87831I4846a13624h867G8686K5563
11399A04249b6113o9185A07987K0292b61879A99635b03210J9069k21067f9639
11388b01216B71239l7716b54536d8377j27125j8656B3551r678h9675A82032G9491
11376A16819L7337F3902R2198h2883C08155a76114q3895a049G2194a70861C1028
11364A3030N7229L20181B1820a4042D7467j9918P6569A7849R4170L16663a410
$$ plain form
11445 9964 29793 5364 419790 409659 -543091 254252 273778 -78906 48239 -102943 -37921
11433 161194 10422 61639 -292087 -175809 136115 80788 188112 -265849 -35707 6618 -34282
11421 114031 -254010 -149716 110160 308501 75335 129214 110226 -244211 -379462 50394
11410 -42750 -5483 103006 136876 144606 286017 -287831 94846 -113624 -8867 78686 104249
11399 104249 -26113 -95298 107987 128279 -261879 199635 -203210 -184141 -405208 -69639
11388 -201216 271239 233523 -254536 -48377 -175502 -194158 23551 13873 -89675 182032 79491
11376 116819 154156 63902 156100 -82883 308155 -176114 -260009 -1049 72194 -170861 31028
11364 13030 70259 390440 21820 -14042 47467 27549 104118 17849 112019 428682 -1410
11352a75847P5667k15381g4595F1307e7735A72091D7506P9978f5631E17603F4243
11340b95993A82163E7685e5053n7818c1655D71J5081a51867l88223a48683o9269
11329b17952B67310b14389B49871J40022b68891D5193P7424b32503i852k3220
11319c3072N161d150j4453A75265K3624e6072I9051a05632J7526k32131a16853
11307i812l28393f5744j59603j19886A1640a47069G4767h9139L7958k87734g6860
11295b90237C4648J16635g5220o9703B6683b1782r6873A04030a50900f3523j64372
11284b27895B95541a30772p8332R7353j52038J08028j5224k6702h5205E6468K5688
11273H2156h5694M0063J6906F2746d3579k08669P0513F9579j8774P5273K0315
$$ plain form
11352 -175847 -100180 -315561 -74595 61307 -57735 172091 47506 127484 -65631 517603 64243
11340 -295993 182163 57685 -55053 -112871 -31655 471 15552 -151867 -540090 -148683 -217952
11329 -217952 267310 -214389 249871 389893 -268891 45193 122617 -232503 -9852 -33072
11319 -33072 -27911 -4150 -18603 175265 198889 -56072 99051 -105632 -88106 -320237 -116853
11307 -9812 -338205 -65744 -225347 -345233 11640 -147069 74767 -89139 -51181 -338915 -76860
11295 -290237 34648 151283 -75220 -144923 26683 -21782 -118655 104030 -150900 -63523 -227895
11284 -227895 295541 -130772 -209104 -111751 -263789 -155761 -170985 -197687 -85205 56468 82156
11273 82156 -85694 -45631 -28725 62746 -43579 -252248 -181735 69579 50805 126078 146393
11262A46393O0061a52408k84644f5445K7901m6754a7621k00160J01665b7504l31359
11251c58863a0477n0443K335G2785a00162M225c3024A28913h1736j5144B07556
11239A00728J72239b43210M9808F3736K78589a4538F982J94945b22146d3383k57936
11228c01319J19405A17203g2850c5040j53373K7509L7423K0247B26387b45565
11217D4844J01167L6091b19594A45983M5759M3127F9147R4696b47348P7620k30339
11206d00067C9024a18484D2016b51963A44321a56867D30568g2673j28340k19474
11196d20487J54149G0426J67908a4271A18812a19771L1036N301G6887a23274j49890
11185b73164B0133d69445f8200j3714F9989c05601k3983A18137a89680I8617g3876
$$ plain form
11262 146393 206454 -152408 -437052 -65445 -37544 -84298 -17621 -217781 -116116 -27504 -358863
11251 -358863 -10477 -60920 -58585 72785 -100162 -95937 -33024 128913 -81736 -96880 207556
11239 100728 272967 -243210 -193402 63736 342325 -14538 6982 201927 -222146 -43383 -301319
11228 -301319 -181914 117203 -72850 -35040 -188413 -160904 -123481 -103234 226387 -245565
11217 44844 146011 182102 -219594 145983 191742 234869 69147 163843 -247348 -169728 -400067
11206 -400067 39024 -118484 42016 -251963 144321 -156867 430568 -72673 -201013 -420487
11196 -420487 -266338 70426 238334 -14271 118812 -119771 -88735 -83434 76887 -123274 -273164
11185 -273164 20133 -469445 -68200 -81914 69989 -305601 -329584 118137 -189680 98617 -73876
11173h8998A58996a35815c5672k68606A15854k1667c1817K156k44265b2327B1354
11161a34890B23163H039a57777A08795j4891J09265p9761a8024G2939J11304j3054
11150A71189d3210j19395j90135a43838k92933J99985c2416k74155e6310l00644
11140c56954J73119p4338B47733a23159G522a06468I8664J7394a11816A57926
11129B12406b3697j87147d2660b1062A02006E0847F836J89291J7646o6011f9631
11117d1307A91261e52747F7288L47906b17678K8551p3102C09107D8972J11397
11107A60369p8298a83523B48055b16322h4831I6993m7549d8379n7820C15035A43387
11095B17010D6380a8136o3280E8999K8737a8427F9048a78926A07811a64643M5164
$$ plain form
11173 -88998 158996 -135815 -35672 -304278 115854 94187 -31817 -29661 -273926 -22327 21354
11161 -134890 223163 8039 -157777 108795 93904 203169 123408 -18024 72939 184243 171189
11150 171189 -43210 -162605 -352740 -143838 -436771 -236786 -32416 -306571 -56310 -356954
11140 -356954 -183835 -258173 247733 -123159 7522 -106468 98664 116058 -111816 157926
11129 212406 -23697 -210844 -42660 -21062 102006 50847 6836 196127 213773 147762 -69631
11117 -41307 191261 -552747 67288 415194 -217678 -189127 -262229 309107 48972 160369
11107 160369 82071 -183523 248055 -216322 -84831 96993 49444 -48379 -106199 315035 143387
11095 217010 46380 -18136 -81416 58999 87736 -18427 69048 -178926 107811 -164643 -119479
11084a19479B53119a20530B35725A17825J4334F0278J88067A15274j888j6598
11074I6788n943C1549f6068F1662Q900J11498M2200a48730A71083D5905N7489
11063A03394K37997G2329L41967a0131B23656J15701q8816m2847b1566D07248
11052B00033K67696A84568P1742j2074J33611j37542L12018H7302L03098o7560
11042C22840p1610j0811J26773J02594M5168A93328M30243A24510M34745j88223
11032C71032m6871J41405n0338A76365q5739J86194J76534j11812J53227A05357
11021B24663K92804A82117K4802G7498M48863j54847j22749q4008J48308P9577
11011C92642A66323P6128F9687K92670R9610Q7928j16636P7172b40690C92952
$$ plain form
11084 -119479 253119 -120530 235725 117825 132159 60278 248345 115274 113386 96788
11074 96788 90845 31549 -66068 61662 70562 182060 224260 -148730 171083 45905 103394
11063 103394 341391 72329 414296 -10131 223656 339357 250541 207694 -21566 407248
11052 200033 467729 184568 256310 244236 377847 240305 552323 87302 390400 322840
11042 322840 251230 240419 367192 469786 514954 193328 623571 124510 559255 371032
11032 371032 324161 465566 415228 176365 90626 276820 453354 341542 494769 105357
11021 224663 517467 182117 206919 77498 526361 371514 248765 164757 313065 392642
11011 392642 166323 242451 69687 362357 461967 549895 433259 510431 -240690 392952
11000B21982q6149P9794m5234Q9024m4404J64851A73253J28508K18762j81273
10990C39250A59528J12644K31483k00561j15489a731E99612B20276L53274k18734
10980C54816O74928m75387o8537J99525J32507m9299N6856k29920M56081l01899
10970G49671J05629K60993K33276m46286L07836L09936k41970j07022Q7880m63414
10960G96529k28314J73268K58040k23963J79976K0661j7237k10176L11569k11280
10950H49073n5945J14749j93038j44257O6525p7145j56505j35098p7399L4456
10940B25416H0908R1395J72006j29019a54785k9328A06281g3495B56644J12527
10930C69171C6865a38772i710p4338n6071H5527M8616B5955a44510A29433A3718
$$ plain form
11000 221982 135833 215627 170393 259417 215013 379864 173253 301761 520523 339250
10990 339250 159528 272172 503655 303094 187605 -1731 599612 220276 573550 354816
10980 354816 1029744 554357 485820 685345 817852 768553 825409 595489 1051570 749671
10970 749671 855300 1116293 1349569 903283 1211119 1521055 1279085 1172063 1259943 796529
10960 796529 568215 741483 999523 775560 955536 976197 958960 748784 1060353 849073
10950 849073 793128 907877 714839 570582 637107 559962 403457 268359 190960 225416
10940 225416 80908 172303 344309 215290 -154785 -184113 106281 -73495 256644 369171
10930 369171 36865 -138772 -9710 -84048 -140119 85527 134143 25955 -144510 129433 13718
10918c67436A17757b87751l02495A15413K01740k2913j35163Q0186E4247b2518
10907b8278o3593j03191I7069a76719c8374k8608B02463d9960k76772P7948A46838
10895b46513C31211A62688a56318N2706H6025J13965b92106I4781k1436N8243
10885A31588a24448A46081a46786A71657c41581a10514k83698d6117m3970F1745
10874a46840g0672A95118B5575a40226b8649j83562A10616M9705A2888a46781
10863B385Q1953R2649A220K3167b4586j6551l66818A78404B7309b95062a04141
10851a76335B4604A603J26010b3997j66458A4930N6102c88789J73034f2330A6110
10839B31896a09667C74939A6027c14269Q3121B6174d9521a5353D3549a56101j92236
$$ plain form
10918 -367436 117757 -287751 -590246 115413 317153 294240 159077 239263 54247 -22518
10907 -28278 -91871 -195062 97069 -176719 -38374 -66982 202463 -49960 -326732 -248784 146838
10895 -246513 331211 162688 -156318 -103612 86025 199990 -292106 94781 73345 131588
10885 131588 -124448 146081 -146786 171657 -341581 -110514 -394212 -46117 -90087 61745
10874 -146840 -70672 195118 25575 -140226 -28649 -212211 110616 160321 12888 -146781
10863 2385 84338 176987 1220 24387 -24586 -41137 -407955 178404 27309 -295062 -104141
10851 -176335 24604 1603 127613 -23997 -190455 14930 71032 -388789 -215755 -62330 16110
10839 231896 -109667 374939 16027 -314269 -231148 26174 -49521 -15353 43549 -156101 -348337
10828c48337g8376A120a30857o9487A76797d6805H6556l889a3399k89385A59493
10816c7363A93755K911a74857N670A32982b14982E4933f1248m9391j25553i0186
10804C62409j32046c11175P7340A0538a76714A72455E9535a29622a7777j2410
10794c0187r3509B41277a24656l8151d7820A21928B5001a76114L9052m4196E6606
10782a02901J2232j8004B61721I8114h9058A93755a74130A17807h6219j7079r2382
10771a95680M6305C85539E744a38913m2316i582j58647A00429L10927b53453J0701
10760b42752h9407j40823g0866a7315O490k45513e299A31115E6633a39611A53144
10748a36800H602b43771A21122a12827H7407B339e7768A5410N8206f9600j7566
$$ plain form
10828 -348337 -78376 1120 -130857 -200344 176797 -46805 86556 82667 -13399 -302784 159493
10816 -37363 193755 196666 -174857 -169187 132982 -214982 54933 -61248 -110639 -236192 -90186
10804 362409 230363 -311175 -233835 10538 -176714 172455 59535 -129622 -17777 -30187
10794 -30187 -123696 241277 -124656 -162807 -47820 121928 25001 -176114 -137062 -181258 56606
10782 -102901 -90669 -108673 261721 98114 -89058 193755 -174130 117807 -86219 -103298 -195680
10771 -195680 -149375 385539 5744 -138913 -181229 -9582 -168229 100429 411356 -253453 -242752
10760 -242752 -89407 -230230 -70866 -17315 -10825 -256338 -5299 131115 56633 -139611 153144
10748 -136800 8602 -243771 121122 -112827 87407 2339 -57768 15410 73616 -69600 -87166
10737h7166l23181a34245A00803a57435K7633r1679J02540B27408a79274E7676
10726a33757D5557h5355b9806q7413J3904F4262a23978k6338C3904a99998A80576
10714d8452H0097f5619A39063a5735A8606h5648j08970j41022b7127B65912b08351
10702d7023B35814a70685i005B26648h3246c9253q8323j03788B80211f3968b8178
10690C7705N3255d838l7556a7924j79322O3028L0640N1755H5846C6211b27472
10678c36679A26706C9739b13885A589c4613A58930i5987l25756a15118A12480
10667A28611c468j08950j93158J38775k02641J57517K9052o3776R0524r2382l6851
10656b85358J14674j5310g1534A88113a45641A65747d4880j31921A63420a00376
$$ plain form
10737 -87166 -410347 -134245 100803 -157435 -129802 -221481 -118941 227408 -179274 57676
10726 -133757 45557 -85355 -29806 -117219 -103315 64262 -123978 -150316 33904 -199998 180576
10714 -48452 80097 -65619 139063 -15735 18606 -85648 -194618 -335640 -27127 265912 -208351
10702 -47023 235814 -170685 -9005 226648 -83246 -39253 -127576 -231364 280211 -63968 -28178
10690 37705 90960 -4838 -42394 -17924 -197246 -134218 -103578 -51823 85846 36211 -227472
10678 -336679 126706 39739 -213885 1589 -34613 158930 -95987 -421743 -115118 112480
10667 128611 -3468 -112418 -305576 -166801 -369442 -211925 -182873 -246649 -156125 -248507 -285358
10656 -285358 -170684 -185994 -71534 188113 -145641 165747 -44880 -176801 163420 -100376
10645a10140B28065q0779a9417r6946J8628B71213q1603a55791B1768J1521L0382
10634F3671L8907b88790o1163F1291N4867a65438L9668j3736m2878E4606a5593
10622i0607j41309a06762m9322r8268M9327Q6232B34294c58754B45320d20364
10611I6233N855a13138M518c0287A69078D3969a59626A04442a38841B61435c16128
10599b43767A73485P7430a19049G1999B7816J25771a55318c3104o1748j64578
10589b59430B61003n7605b69330q8331Q0304A94160H3968J162a18083A19445M4391
10578A63836K1626c32809a2750B73408B4666b46478J16195d6765F7374a77873
10567g3506B77984c36241i3888j11493m0619c1296j34774A11898n3623b82796
$$ plain form
10645 -110140 228065 147286 -19417 -116363 -97735 271213 189610 -155791 21768 33289 63671
10634 63671 102578 -288790 -349953 61291 116158 -165438 -125770 -139506 -182384 54606 -15593
10622 -90607 -231916 -106762 -156084 -254352 -205025 -118793 234294 -358754 245320 -420364
10611 96233 102088 -113138 -108620 -30287 169078 43969 -159626 104442 -138841 261435 -316128
10599 -243767 173485 250915 -119049 71999 27816 153587 -155318 -33104 -94852 -259430
10589 -259430 261003 203398 -269330 -357661 -277357 194160 83968 85130 -118083 119445 163836
10578 163836 185462 -332809 -12750 273408 24666 -246478 -130283 -46765 67374 -177873
10567 -73506 277984 -336241 -93888 -205381 -246000 -31296 -166070 111898 58275 -282796
10556A40765L3377A0803b5331j57337P1838p1352A6282a51680j65972a55476A55818
10544A30305b51904A75610P8084A23352d2789l6032n7972H2171b26438B4396c7814
10532a62431N5837G2215J7337a39094j83824a57991B6225N3009a03436A59508
10521A34668g8611J8011G5488b41996G7566f5721C42413c48554J57621Q219M8238
10510a34476j25826k3533B18586a52154A29719b09379I9806h2268E6078e988m02178
10499d08166Q5488J10444f2293j16786g1405g064I8952b0600E6506a92094A53780
10487a90048B10603d61654I664b14610i2316A87127E7359A5500b43130C52498
10476A54293J00935h4613G7569J75221q3275B720d2728A89819B9906a05283L5668
$$ plain form
10556 140765 174142 10803 -25331 -182668 -110830 -182182 16282 -151680 -317652 -155476 155818
10544 130305 -251904 175610 253694 123352 -42789 -78821 -136793 82171 -226438 24396 -37814
10532 -162431 -106594 72215 89552 -139094 -322918 -157991 26225 79234 -103436 159508
10521 134668 -78611 -60600 75488 -241996 77566 -65721 342413 -348554 -190933 -182714 -134476
10510 -134476 -260302 -283835 218586 -152154 129719 -209379 99806 -82268 56078 -5988 -408166
10499 -408166 -322678 -212234 -62293 -179079 -71405 -7064 98952 -20600 56506 -192094 153780
10487 -190048 210603 -461654 9664 -214610 -92316 187127 57359 15500 -243130 352498
10476 154293 255228 -84613 77569 252790 169515 2720 -42728 189819 29906 -105283 -69615
10465f9615A03727a48928c8810k5207n7756j85848P4446C2066h6831A49810q145
10454A41665f397l4164A11643c2162m00073g6751C0852J86336g694k58522C05736
10442A20103A9856f3320F2717a17751a6641j03842j49186j29605A95099a63805
10431g4850m19684b3664G1146d06030a570j68030o2154P4814F72K93235h2847
10419a90364A23471i2310F1533d982o1352J4494g088j92487B00156d01186i8839
10407C33429a51355A35276a1448k10193k1319a02320j26946j0873b6463r6446
10397a22909M2270A28028m4351d4479j03530A8823a57667F2686b36328k25282
10387d61610A35851H599J56127a76523B49002a52689A28423J5294g9951J8002
$$ plain form
10465 -69615 103727 -148928 -38810 -64017 -121773 -307621 -233175 32066 -86831 149810 141665
10454 141665 -6397 -40561 111643 -32162 -432235 -76751 30852 217188 -7694 -266216 305736
10442 120103 19856 -63320 62717 -117751 -16641 -120483 -269669 -399274 195099 -163805
10431 -74850 -494534 -23664 71146 -406030 -1570 -169600 -231754 -156940 672 293907 -82847
10419 -190364 123471 -92310 61533 -4982 -66334 -51840 -7088 -199575 200156 -401186 -98839
10407 333429 -151355 135276 -11448 -221641 -242960 -102320 -229266 -240139 -26463 -122909
10397 -122909 -80639 128028 83677 -44479 -148009 18823 -157667 62686 -236328 -461610
10387 -461610 135851 8599 164726 -176523 249002 -152689 128423 143717 -79951 -61949
10377f1949I2646L0897f0659H4378L6823P4148L2140J11687A8992a14421B00522
10365A33198i8137K4065B14761k1609L41447B66865E4041H895g0447C30742B7409
10353a03463d4229F9686N06689C985L61554A53992m0972M2749J41914I774R0104
10342I9878m5684J65535g3172C66961C081a1933j28838O0797E1577O6701a49250
10330B06043M4014k0079a36838D9871g4302L4573e493p7838c5181k24493L1829
10319b27845D3508O012M0310k6613Q2779o9184P1849c6611B73297J1974A34749
10307b23523g5265E0987c25661G7346b37921d1171k40728Q4475B71849c71234
10296A79025D3368g9105k32721J7469a31552e9649k88595g9440A8079K4824Q4840
$$ plain form
10377 -61949 92646 123543 -60659 84378 121201 195349 227489 339176 18992 -114421 200522
10365 133198 -98137 -74072 214761 193152 534599 266865 54041 8895 -70447 330742 27409
10353 -103463 -44229 69686 576375 3985 365539 153992 113020 155769 297683 9774 99878
10342 99878 54194 219729 -73172 366961 3081 -11933 -140771 -79974 51577 118278 -149250
10330 206043 250057 229978 -136838 49871 -74302 -39729 -5493 -83331 -35181 -259674 -227845
10319 -227845 43508 49520 89830 63217 145996 76812 148661 -36611 273297 285271 134749
10307 -223523 -75265 50987 -325661 77346 -237921 -41171 -281899 -197424 271849 -371234
10296 179025 43368 -79105 -311826 -294357 -131552 -59649 -348244 -79440 18079 42903 127743
10285A27743F0040d10315J1882A0224g8350E0290L66284b7858A05671E684O5334
10274G1018i9137n5972d1487A14934R2788b95411a20956B77937H4279f9836H9648
10262A46033J27768d09113J56859A4096b17566E8405M5412b13078A73734L17985
10252D91719B30496J10184l1205o3379C1914g3080j54848i9770B9656e9308j33479
10241a92787B76649j20211h760A08261J00906n5445F3661e5968A2969g3089J3104
10230e9985B30653H8685l4363J62832k7724b21578h0399j37087L8977c2170D4739
10218a43924a3788D0638N8747a80456Q2843B34683j13521b75105G3838l0440J98226
10207B41624A13574j0065K42388c66337a54622d6990k38837A83138p121F7271
$$ plain form
10285 127743 60040 -410315 -398433 10224 -78350 50290 416574 -27858 105671 5684 71018
10274 71018 -99137 -155109 -41487 114934 207722 -295411 -120956 277937 84279 -69836 89648
10262 146033 273801 -409113 -252254 14096 -217566 58405 103817 -213078 173734 491719
10252 491719 230496 340680 309475 246096 31914 -73080 -227928 -99770 29656 -59308 -192787
10241 -192787 276649 156438 -8760 108261 209167 153722 63661 -55968 12969 -73089 -59985
10230 -59985 230653 88685 54322 217154 189430 -221578 -80399 -217486 -178509 -32170 44739
10218 -143924 -13788 40638 99385 -180456 -97613 234683 121162 -275105 73838 43398 241624
10207 241624 113574 103509 345897 -366337 -154622 -46990 -285827 183138 176017 67271
10196A87051H1772i5651L0434r7883l09720f2623p1253d4970j36445C93463r7015
10185B96448b30042F3122d64650a16275j60697O9509c5239j68537P1253l38257
10175d70780A03374m6417d9501l06276J70292B7419K0552L7643a35655L9266A60034
10163b18163P1553I2106b0292A56030c7640E507a86477j36101A13008c22317B50181
10151I367K4369J79577a67807g5558k8186A49185a69547e6963j11352o8110F2810
10139F876e422m7176r220j81381a16494a2257B9700a6433C8658a36742H9651M0470
10127A30121h6265J5290A75862n2840a31811J6136j66694J35407l5269A82099
10116A16629k854b15846k0590r2714J17504j06907g1871b7308n1109m2869L8518
$$ plain form
10196 187051 81772 -95651 -65217 -163100 -472820 -62623 -133876 -44970 -181415 393463 296448
10185 296448 -230042 63122 -464650 -116275 -276972 -207463 -35239 -203776 -132523 -470780
10175 -470780 103374 56957 -49501 -355777 -185485 27419 47971 85614 -135655 -96389 160034
10163 -218163 -146610 92106 -20292 156030 -37640 5507 -186477 -322578 113008 -322317 250181
10151 9367 33736 213313 -167807 -75558 -103744 149185 -169547 -56963 -168315 -236425 62810
10139 6876 -5422 -52598 -61818 -243199 -116494 -12257 29700 -16433 38658 -136742 89651 130121
10127 130121 -86265 -70975 175862 123022 -131811 -115675 -282369 -146962 -182231 182099
10116 116629 113775 -215846 -236436 -329150 -211646 -318553 -71871 -27308 -78417 -121286 -82768
10105h2768B35994a85390B74270G8281l4121b61381a05082B88570e0577q9167
10095a39744m0593A01714a74797c3124J2363A56322e3887k868J0012A0657L3213
10084D3870i1178I8138j4437J76890b00640g3970j43144g3416k7298L9463k47111
10073c08362I9012a70263M5957l5356A01354a48746A48653a67882j02660F7064
10062a55610A7502a66829j61692a60826N8214A08666D7360J48502b14538g5477
10051c3355g549j31305r1959a3922j72754E7654Q1329b77307O3800C3454K31650
10040B65104F8138b11654J4810d1264k23171j66641J54167O3289e3861A04305
10029A37183d4485a0424D7761f3899O297A28490m2101b1072m38794b1430j8637
$$ plain form
10105 -82768 235994 -185390 274270 78281 44160 -261381 -105082 288570 -50577 -139744
10095 -139744 -180337 101714 -174797 -33124 -20761 156322 -53887 -56755 -46743 10657 43870
10084 43870 -91178 98138 83701 260591 -200640 -73970 -217114 -73416 -100714 -61251 -308362
10073 -308362 99012 -170263 -124306 -159662 101354 -148746 148653 -167882 -270542 67064
10062 -155610 17502 -166829 -328521 -160826 -102612 108666 47360 195862 -214538 -75477
10051 -33355 -7549 -138854 -230813 -13922 -186676 57654 138983 -277307 -213507 33454 265104
10040 265104 68138 -211654 -196844 -41264 -264435 -431076 -276909 -213620 -53861 104305
10029 137183 -44485 -10424 47761 -63899 -57602 128490 86389 -21072 -459866 -21430 -40067
10018d0067l16810J07800a18909N2530j96685B0092J4927O9253c55204a67816
10007f4718j74835a19227A03747b63862P8911d912l16484J22345j88733a10837
9996A91390a26438b6138k57176e2455j26450P3912B16328I5378K6797l3897L442
9985I1720a32268J5513d9589D0075K2563r73A3554b47193A06975P16a31478A78249
9972D2869c26736A69070G8807c7540k14189F0108d6393n7105b4613m0956A78099
9960i2629B63178L6564j29228a16551A25411f9729A53346A9969b01045b1162j43856
9949a65018d1660A36339d22996J90684E6754a48410G7153L01509A25283l2106
9939I3177b1362q7179B1973a04582A17861O535m6149K391J72127I4978d14892
$$ plain form
10018 -40067 -356877 -249077 -118909 -66379 -263064 20092 35019 104272 -355204 -167816
10007 -64718 -239553 -119227 103747 -263862 -184951 -4912 -321396 -199051 -387784 -110837
9996 191390 -126438 -26138 -283314 -52455 -178905 -104993 216328 95378 122175 88278 91720
9985 91720 -132268 -116755 -49589 40075 62638 61665 13554 -247193 106975 107691 -131478 178249
9972 42869 -326736 169070 78807 -37540 -251729 60108 -46393 -103498 -24613 -65569 178099
9960 -92629 263178 299742 170514 -116551 125411 -69729 153346 19969 -201045 -21162 -165018
9949 -165018 -41660 136339 -422996 -232312 56754 -148410 77153 378662 125283 93177
9939 93177 -21362 -108541 21973 -104582 117861 124396 78247 80638 252765 94978 -414892
9927i6722j97526K913D0150e7801q2110A9210J14329C9550J00717a16332a9006
9915A044h5240B40002d45076B50039e1111F3774c176A01890b44162B96510F3408
9903b25381C59537a87285H75a89367b3399k16528A83945E5426b05354A04449b24561
9891i8690a6820k77695J7447J29321A06708i6730l8931A7216b8968p6388k9545
9880a34901L8152E1514J9530d67654a66470J9738B23129a42634k5102P9093c1623
9868b3229j10910K7921D3658J39513G8503C1557J48122b86042h7470m6371J0792
9857a23049F5101b8261k10354J12099A35728a46727B8732a27803A04445a03841
9846a42817d075D5206j6920q602N9799P4022a26651k6600B45850f0583O896a8213
$$ plain form
9927 -96722 -294248 -291335 40150 -57801 -139911 19210 133539 39550 140267 -116332 -19006
9915 1044 -85240 240002 -445076 250039 -51111 63774 -3176 101890 -244162 296510 63408
9903 -225381 359537 -187285 875 -189367 -23399 -239927 183945 55426 -205354 104449 -224561
9891 -98690 -16820 -294515 -277068 -147747 106708 -96730 -135661 17216 -28968 -105356 -134901
9880 -134901 -96749 51514 71044 -467654 -166470 -146732 223129 -142634 -167736 -88643 -31623
9868 -23229 -134139 -106218 43658 183171 78503 31557 179679 -286042 -87470 -133841 -123049
9857 -123049 65101 -28261 -238615 -126516 135728 -146727 28732 -127803 104445 -103841
9846 -142817 -4075 45206 28286 19684 79483 153505 -126651 -153251 245850 -60583 -53687 -18213
9833B47460a76178e7942D8930R0664J98214a30641A16611b57432J3073R9332a7335
9821b76516E1224J04200C4249a58830B9944p186K78897e33125h1302K3435k16472
9810b74339j78909H674h7138e663j47700N4096H0463b0571F3426b49351Q7556
9799a61795b6787n50140H427b06609i0714G2165b27815p8975a33038A863b73231
9787b8948q5387r4458a03619j25423n5733J17021F7485g9955j67471a2798j20006
9776a32804B7264a0507k22936f0415B44097c09498A95656m2236B3341a03626c9170
9764C07141d31861B68254b26310c3677H0982h0168p2093a1620B25037c82434A57401
9752b81335b6623j47126j71398A08640Q0085A8516O5981p213b18632e1405j9545
$$ plain form
9833 247460 -176178 -57942 48930 139594 337808 -130641 116611 -257432 -244359 -145027 -17335
9821 -276516 51224 155424 34249 -158830 29944 22758 301655 -533125 -81302 -57867 -274339
9810 -274339 -453248 8674 -87138 -5663 -153363 -99267 80463 -20571 63426 -249351 -161795
9799 -161795 -26787 -576927 8427 -206609 -90714 72165 -227815 -306790 -133038 1863 -273231
9787 -28948 -114335 -208793 -103619 -229042 -284775 -167754 67485 -79955 -247426 -12798 -132804
9776 -132804 27264 -10507 -233443 -60415 244097 -309498 195656 153420 23341 -103626 -39170
9764 307141 -431861 268254 -226310 -33677 80982 -80168 -152261 -11620 225037 -382434 157401
9752 -281335 -26623 -173749 -345147 108640 188725 18516 84497 77284 -218632 -51405 -70950
9741g0950k45706J11731G5609c02658i1421L1261P732A02321a65423b9409n3602
9730h3011J6953j33471M4091P6737p0710k27700Q8840g1538j41259J7025l86607
9719e82379G191a80136P1390G5361b91783Q7663A44297b49256e3527E5510A0793
9707A73126c0674g411D0386J28560R6659p4941o1638c03476J28904k69490A66690
9695I5161d84442J85324k3681g9620H9789b39233K1598c1825j78747a9325j58535
9684a77860L9308N3230m7388j37018R9940H6669a76229j1231E0452a50783a5656
9672a90138r5560J12056F4477C1082h4519C05293f8204A09224a97653A75032a7365
9660E8551J50526J20048a72795j26607B11052a16756a918j25165l37032A16565
$$ plain form
9741 -70950 -316656 -204925 75609 -302658 -91421 -60160 -52428 102321 -165423 -29409 -83011
9730 -83011 -66058 -199529 -155438 -78701 -149411 -377111 -288271 -71538 -212797 -195772 -582379
9719 -582379 7191 -180136 -108746 75361 -291783 -204120 144297 -249256 -53527 55510 10793
9707 173126 -30674 -7411 40386 168946 265605 190664 129026 -303476 -174572 -444062 166690
9695 95161 -484442 -299118 -322799 -79620 89789 -239233 -217635 -31825 -210572 -19325 -177860
9684 -177860 -138552 -85322 -132710 -269728 -169788 86669 -176229 -187460 50452 -150783 -15656
9672 -190138 -285698 -173642 64477 31082 -84519 305293 -68204 109224 -197653 175032 -17365
9660 58551 209077 329125 -172795 -299402 211052 -116756 -1918 -127083 -464115 116565
9649e2232a5812C1145i7459d2582k50664F4370b57366F8638G659O4757b25911
9637A7521b973E0851j0118c54339e7727q3177B97731d19113f6874C2173M7642
9626G9815K066a81616a0351A17516a08249c4018I7620C9829c40984A10156B4376
9614e2010A0729b06554A17013a46540O7188j30301B23513i5190j59215j25629
9604c80034a56291A63605P6822p7937h8888q3428J0692A41804j4850c57266e990
9592h2959A27097a88149I5328J28951a23782A06061M9188b40079E5301a35003
9581B22206c19388H3675b13766M0689g784j29651k1048H7303j6927a59989b8987
9569b66507a3836k03421L8767B90407n6816a0223l04897a5785A34012e0661A05784
$$ plain form
9649 -52232 -15812 31145 -97459 -42582 -293246 64370 -257366 68638 7659 72416 -225911
9637 17521 -2973 50851 40733 -354339 -57727 -140904 297731 -419113 -66874 32173 79815
9626 79815 81881 -181616 -10351 117516 -108249 -34018 97620 39829 -340984 110156 24376
9614 -52010 10729 -206554 117013 -146540 -79352 -209653 223513 -95190 -254405 -380034
9604 -380034 -156291 163605 240427 162490 -88888 -172316 -161624 141804 126954 -357266 -5990
9592 -82959 127097 -188149 95328 224279 -123782 106061 155249 -240079 55301 -135003
9581 222206 -319388 83675 -213766 -173077 -7784 -137435 -158483 87303 70376 -159989 -28987
9569 -266507 -13836 -217257 -178490 290407 233591 -10223 -315120 -15785 134012 -50661 105784
9557F4120K3704a77869E179c91864C23138I0425A2891a90121H5515J59208G6273
9545C22816C5802K11025A2534N8521C1398K43924b61269C3769J26695b30327k3241
9534b53568C69191j34606a37018A64685J2054i953l1738F7567h0091o6071f170
9522a86694B23260F449c06638J02284C0037c3760o4014A99655a9241D7874a10245
9510C2053b9192N899j57698c9206C35095b03811A7003f8999C50229c73895A87640
9498B50165a39571G641g5589m02256K16367p3814A57998c64953d7040B02932J75252
9487C78184j48490h2458r9553E085a7601D2219b99599G697b49645c4479D4204
9475A89425k0923b70693a30945H0467c58733M1309B6285e9879B92747a48464k3335
$$ plain form
9557 64120 87824 -177869 5179 -391864 323138 90425 12891 -190121 85515 244723 76273
9545 322816 35802 246827 12534 71055 31398 275322 -261269 33769 160464 -230327 -253568
9534 -253568 369191 234585 -137018 164685 176739 -9953 -41691 67567 -80091 -146162 -6170
9522 -186694 223260 6449 -306638 -204354 30037 -33760 -97774 199655 -19241 47874 -110245
9510 32053 -29192 -23293 -180991 -39206 335095 -203811 17003 -68999 350229 -373895 187640
9498 250165 -139571 7641 -75589 -477845 -261478 -335292 157998 -364953 -47040 202932 378184
9487 378184 229694 -82458 -182011 5085 -17601 42219 -299599 7697 -249645 -34479 44204
9475 189425 168502 -270693 -130945 80467 -358733 -317424 26285 -59879 292747 -148464 -171799
9464a71799j5877e0668H4619J29422e4367J6944a7751I5292b36765B51387c9075
9452B7031b00602A82339G5805b4042A17125a41292j37895A29779g992k81608e9502
9440a63250c1730j64025j20710B48229g0267k4624k52928a01495A20330m9713
9430G0617e3641q3804C9050b29444a2438l00985a49296o2411B5584a77327M2945
9419a34382A41083c11587A18011P8806c77377J50090g495A20341a31519q1704
9409b13223i9546A68497c33562J49779b5136A16596a09846A20b35133F7478N3664
9398A21142b37997a1724I6019a59974L1227A36374a47123j6159k735E8865N4513
9387A13378a66308J0817E4489b44951i3763B075b2878m9415I8312f5770A04403
$$ plain form
9464 -171799 -187676 -50668 84619 214041 -54367 -37423 -17751 95292 -236765 251387 -39075
9452 27031 -200602 182339 75805 -24042 117125 -141292 -279187 129779 -7992 -289600 -59502
9440 -163250 -31730 -195755 -316465 248229 -70267 -94891 -347819 -101495 120330 70617
9430 70617 -53641 -137445 39050 -229444 -12438 -313423 -149296 -211707 25584 -177327 -134382
9419 -134382 141083 -311587 118011 196817 -377377 -227287 -7495 120341 -131519 -213223
9409 -213223 -99546 168497 -333562 -183783 -25136 116596 -109846 120 -235133 67478 121142
9398 121142 -237997 -11724 96019 -159974 -128747 136374 -147123 -163282 -166017 58865 113378
9387 113378 -166308 -155491 54489 -244951 -93763 2075 -22878 -72293 98312 -65770 104403
9375f1723l0423c6029A12381c47523A47324A554c4559C0489c25979J44711B4160
9363C18148a26262P796b0377j98364b579l2863k89558a22833c2236P75l52984
9352c84445A7900b69303F1421J94040C2401N0700A1178h7119p5494a8122j8865
9341c6987F2257K8697B7113c23334N6886B1742i2548j52574A93281c9439C2261
9329A00197F312L6936a98356d5608n1209C5221i6466a342j86520Q8562M7348B20345
9316A23408e7904j67164i1477m8505B7149f4394j05990q6480i4245A09702e5655
9304B8790h3444C6102b62835J25387A10308e0646K0235o6068K719F6114r733J49656
9292B06037a74376N3835j2898o2379I433J58194a77039E7937d3439B32018n6292
$$ plain form
9375 -61723 -92146 -36029 112381 -347523 147324 1554 -34559 30489 -325979 -181268 24160
9363 318148 -126262 -118466 -20377 -218741 -2579 -35442 -325000 -122833 -32236 -31461 -384445
9352 -384445 17900 -269303 61421 255461 32401 83101 11178 -87119 -162613 -18122 -36987
9341 -36987 62257 90954 27113 -323334 -266448 21742 -92548 -245122 193281 -39439 32261
9329 100197 6312 43248 -198356 -45608 -96817 35221 -96466 -1342 -187862 -99300 -51952 220345
9316 123408 -57904 -225068 -91477 -139982 27149 -64394 -170384 -256864 -94245 109702 -55655
9304 28790 -83444 36102 -262835 -137448 110308 -50646 -30411 -96479 -93760 66114 56381 206037
9292 206037 -174376 -120541 -133439 -195818 9433 167627 -177039 57937 -43439 232018 175726
9281A75726a45330N0540M6542r1408j63645F1481b57136h5354k63657c9419A80395
9269D56893A23079c77684R6606H6137b44306a20976A80732f9761A63046b28924
9258c39663F7591F179i3910B92200a96859c8347o6762B79136b8553j58950P7392
9247a10111o3919M3730A02624a48291B36918b93979G170f6852r3209b5513A46068
9235f0905j71585A50143A6262a99436f9221N58k43889G5793J4684c17434J44417
9224a73017h4148J7893j15004j07326B25772C0478M7399K20402a44889e0921j83999
9213b34920d8642j9153A6500J90859b21561P6376n1475G0709a91305p532j05636
9202c04473A2804J21310g487A69607c48285B45258j21747Q708b12520C2519J4933
$$ plain form
9281 175726 -145330 -94790 -48248 -139656 -303301 61481 -257136 -85354 -349011 -39419 180395
9269 456893 123079 -377684 -281078 86137 -244306 -120976 180732 -69761 163046 -228924
9258 -339663 67591 6179 -93910 292200 -196859 -38347 -105109 279136 -28553 -187503 -110111
9247 -110111 -174030 -130300 102624 -148291 236918 -293979 7170 -66852 -160061 -25513 146068
9235 -60905 -232490 150143 16262 -199436 -69221 -68663 -312552 75793 90477 -317434 -173017
9224 -173017 -84148 -66255 -181259 -288585 225772 30478 77877 298279 -144889 -50921 -234920
9213 -234920 -48642 -67795 16500 207359 -221561 -145185 -196660 70709 -191305 -198837 -304473
9202 -304473 12804 134114 -7487 169607 -348285 245258 123511 132219 -212520 32519 47452
9191D7452o425a68558q3442c5200C0876c6169A11405R649b04133G7085a17211
9179a13803j71043C8369b98454A05765D9115c5863l39156A88669e760j69679m6361
9168b21800D880a45491j58285A30668J32353A18228R7084b9244J085k09084J00818
9157a36425q3843k02346C2729J56399b30368a13813D0488a09381c2345l3461k2904
9146h8710A4833c45952A71245a21607B49784i2805j58610O4132A08692b66587
9135b51719A17426J44092c93835a5945I1002J41882j14411C1107a11454d1949
9124a77441D6522b60451a1905m69018h1585E370b50954j7925G8086l2205J09369
9113A55250c74705A60040H174i7307A7706a91274A1524a15583j33403f5851D3175
$$ plain form
9191 47452 41027 -168558 -252000 -35200 30876 -36169 111405 121054 -204133 77085 -117211
9179 -113803 -284846 38369 -298454 105765 49115 -35863 -375019 188669 -5760 -175439 -221800
9168 -221800 4880 -145491 -303776 130668 263021 118228 215312 -29244 -28159 -237243 -136425
9157 -136425 -220268 -422614 32729 189128 -230368 -113813 40488 -109381 -32345 -65806 -88710
9146 -88710 14833 -345952 171245 -121607 249784 -92805 -251415 -187283 108692 -266587
9135 -251719 117426 261518 -393835 -15945 91002 232884 118473 31107 -111454 -41949
9124 -177441 46522 -260451 -11905 -480923 -81585 5370 -250954 -268879 78086 45881 155250
9113 155250 -374705 160040 8174 -97307 17706 -191274 11524 -115583 -248986 -65851 43175
9101d4104A93721b3088A66319A9387a5291B504a29363j5097o6947B9466a34411
9089D9521K17081r6723c57547a00542j63583B3487K87764c48802B29370e2755
9078A19533i682E9793b01054j32123J02429b6772J323A10595R9276b53432J03530
9067a49902k32211D27527a10320m5763D9601e3331m6187c7966l3371j54681c1391
9055c92167g4994C5709j2474e2255b5940p9670K3943E9557K02956b04342b9396
9043b31995A07252a5277j48583K7491k76849a75128d6508G470c42960A12434b05317
9031e8552A06529i3463B57049f1928l0333A64508b13734E465J58502d1566A06887
9019a23535J9577j40575B8791q568J00217a31723p9548j40596I4498k5416c0617
$$ plain form
9101 -44104 193721 -23088 166319 19387 -15291 2504 -129363 -144460 -211407 29466 -134411
9089 49521 266602 169879 -357547 -100542 -264125 23487 311251 -348802 229370 -52755
9078 119533 -9682 59793 -201054 -333177 -230748 -26772 -25449 110595 209871 -253432 -149902
9067 -149902 -382113 427527 -110320 -156083 49601 -53331 -99518 -37966 -71337 -226018 -31391
9055 -392167 -74994 35709 23235 -52255 -25940 -105610 -81667 59557 262513 -204342 -29396
9043 -231995 107252 -15277 -163860 -136369 -413218 -175128 -46508 7470 -342960 112434 -205317
9031 -58552 106529 -93463 257049 -61928 -92261 164508 -213734 5465 163967 -41566 106887
9019 -123535 -103958 -244533 28791 20223 120440 -131723 -211271 -351867 94498 69082 -30617
9007B35576c90378a60022k01444I1621d534A90225b05997R0955B0666J19536D5634
8995C3767A6228b44556a9579L350G2609k7918a7782j91752A39668b43874a10430
8983a07914L8272j36713B2044P586a19908b0875H4793K8001i1721B63560G5707
8971C5535e9889k06397a01557A43847J85587a91672k42331e4460a6204A09439
8960a11552H4721d6078I3495d03676B64372b8865n3501l5721e1657j48890A7423
8948I4146c22875J45970k15987C14510b78346Q4237e4814r2467a1216C40444H8429
8936a54764G056a21919Q85A2109h9636A9145K54347B0001g5649F825M899a38551
8923D9703i1030J7778n5396A14083J54988O04672m08623C6926J13409D7583J07366
$$ plain form
9007 235576 -390378 -160022 -361466 91621 -4534 190225 -205997 -115042 20666 140202 45634
8995 33767 16228 -244556 -19579 -16229 72609 44691 -17782 -209534 139668 -243874 -110430
8983 -107914 -69642 -206355 22044 29630 -119908 -20875 84793 112794 -91721 263560 75707
8971 35535 -59889 -266286 -101557 143847 329434 -191672 -434003 -54460 -16204 109439
8960 -111552 84721 -46078 93495 -403676 264372 -28865 -82366 -118087 -51657 -200547 17423
8948 94146 -322875 -176905 -392892 314510 -278346 -194109 -54814 -147281 -11216 340444 88429
8936 -154764 7056 -121919 -121034 12109 -89636 19145 273492 20001 -75649 6825 11724 -138551
8923 49703 -91030 -73252 -128648 114083 269071 873743 465120 36926 150335 47583 154949
8912A54949b58974j1528a04626I82a9728j25642e5448j43660c1503l4155b0665
8900b5797q8102A4908b13904O8964e3211A32392i4159j01637f9162K9468A10340
8888b46495f8420j9281J8840m2240d3180A85849c21386m4254L0421a20769A8936
8876a69357A69983K6204d77081K00563G044J0979b39330G2757J52103a10139B89065
8864A13647b76915l5318f4476j61500f826k38008B62145a68103B19088R1297b48832
$$ plain form
8912 154949 -258974 -270502 -104626 982 -19728 -145370 -55448 -199108 -31503 -65658 -20665
8900 -25797 -113899 14908 -213904 -144940 -53211 132392 -94159 -195796 -69162 -39694 110340
8888 -246495 -68420 -87701 -68861 -111101 -43180 185849 -321386 -365640 -335219 -120769 18936
8876 -169357 169983 196187 -477081 -276518 7044 18023 -239330 72757 224860 -110139 289065
8864 113647 -276915 -312233 -64476 -225976 -6826 -244834 262145 -168103 219088 310385 -248832
$$ [...]
##END NTUPLES=NMR SPECTRUM
##END=
