##TITLE=NES1018_872015066_9266120_aT6socKug7
##JCAMPDX= 6.0         $$ Bruker NMR JCAMP-DX V2.0
##DATA TYPE= NMR SPECTRUM
##DATA CLASS= NTUPLES
##ORIGIN= BRUKER
##OWNER= Administrator
$$ 1.72 TOPSPIN		Version 2.1
$$ 2015-08-24 18:15:40.373 -0700  Administrator@X
$$ Compression mode = diff/dup
##.OBSERVE FREQUENCY= 400.02188249412
##.OBSERVE NUCLEUS= ^1H
##.ACQUISITION MODE= SIMULTANEOUS (DQD)
##.ACQUISITION SCHEME= undefined
##.AVERAGES= 64
##.DIGITISER RES= 22
##SPECTROMETER/DATA SYSTEM= spect
##.PULSE SEQUENCE= noesygpps1d.comp
##.SOLVENT NAME= COFFEE_meoh
##.SHIFT REFERENCE= INTERNAL, COFFEE_meoh, 1, 14.96305
##AUDIT TRAIL= $$ (NUMBER, WHEN, WHO, WHERE, PROCESS, VERSION, WHAT)
$$ ##TITLE= Audit trail, TOPSPIN		Version 2.1
$$ ##JCAMPDX= 5.01
$$ ##ORIGIN= Bruker BioSpin GmbH
$$ ##OWNER= Administrator
$$ $$ E:\/data/COFFEE/nmr/NES1018_872015066_9266120_aT6socKug7/22/pdata/1/auditp.txt
$$ ##AUDIT TRAIL=  $$ (NUMBER, WHEN, WHO, WHERE, PROCESS, VERSION, WHAT)
(   1,<2015-08-24 18:15:34.764 -0700>,<Administrator>,<X>,<go>,<TOPSPIN 2.1>,
      <created by zg
	started at 2015-08-24 18:04:05.264 -0700,
	POWCHK enabled, PULCHK disabled,
       configuration hash MD5:
       21 0F 79 D6 B3 7B B4 F6 88 20 88 DB 03 48 BD 9F
       data hash MD5: 64K
       CD BE 56 6C F0 0C 8D 98 D8 9E 8F 9F 82 50 89 F2>)
(   2,<2015-08-24 18:15:38.233 -0700>,<Administrator>,<X>,<proc1d>,<TOPSPIN 2.1>,
      <Start of raw data processing
       efp LB = 0.3 FT_mod = 6 PKNL = 1 PHC0 = 0 PHC1 = 0 SI = 128K 
       data hash MD5: 128K
       8C EC 38 91 5E 50 2D DF 0F 0A 6C 38 CA 65 DC 47>)
(   3,<2015-08-24 18:15:39.108 -0700>,<Administrator>,<X>,<proc1d>,<TOPSPIN 2.1>,
      <pk PHC0 = -86.98975 PHC1 = 0 
       data hash MD5: 128K
       B2 40 18 2C DD E3 B6 64 DB 43 6E 2E 2C 2B 89 E6>)
(   4,<2015-08-24 18:15:39.561 -0700>,<Administrator>,<X>,<proc1d>,<TOPSPIN 2.1>,
      <abs ABSG = 1 
       data hash MD5: 128K
       1F 6B 22 D2 2A BD 87 EE 21 9D F6 85 A1 8C 49 39>)
(   5,<2015-08-24 18:15:39.655 -0700>,<Administrator>,<X>,<proc1d>,<TOPSPIN 2.1>,
      <abs ABSG = 2 
       data hash MD5: 128K
       EE 91 D9 74 A8 83 A8 41 8E BB 1C C7 08 3E 05 A3>)
(   6,<2015-08-24 18:15:39.733 -0700>,<Administrator>,<X>,<proc1d>,<TOPSPIN 2.1>,
      <abs ABSG = 3 
       data hash MD5: 128K
       DC 44 62 D5 4A 72 D1 5F 25 AF 72 AE 31 2A 51 72>)
(   7,<2015-08-24 18:15:39.826 -0700>,<Administrator>,<X>,<proc1d>,<TOPSPIN 2.1>,
      <abs ABSG = 4 
       data hash MD5: 128K
       48 F6 51 45 5D E8 BB 4B 3B 7F 6C D4 55 45 94 22>)
(   8,<2015-08-24 18:15:39.920 -0700>,<Administrator>,<X>,<proc1d>,<TOPSPIN 2.1>,
      <abs ABSG = 5 
       data hash MD5: 128K
       51 71 16 CD C0 7F 03 E4 0C 9D BA 61 43 1D FB F4>)
$$ ##END=
$$ 
$$ $$ hash MD5
$$ $$ 75 00 D7 62 11 41 BB 40 EA 58 D4 FE 58 0F 1B 79
##$RELAX= 
##$RELAX= 
##$RELAX= 
##$RELAX= 
##$RELAX= 
##$RELAX= 
##$RELAX= 
##$RELAX= 
$$ Bruker specific parameters
$$ --------------------------
##$DU= <E:\>
##$EXPNO= 22
$$ [...]
##$TP07= 0
##$TPNAME0= <>
##$TPNAME1= <>
##$TPNAME2= <>
##$TPNAME3= <>
##$TPNAME4= <>
##$TPNAME5= <>
##$TPNAME6= <>
##$TPNAME7= <>
##$TPOAL= (0..7)
0.5 0.5 0.5 0.5 0.5 0.5 0.5 0.5
##$TPOFFS= (0..7)
0 0 0 0 0 0 0 0
##$TUNHIN= 0
##$TUNHOUT= 0
##$TUNXOUT= 0
##$USERA1= <user>
##$USERA2= <user>
##$USERA3= <user>
##$USERA4= <user>
##$USERA5= <user>
##$V9= 5
##$VALIST= <valist>
##$VCLIST= <CCCCCCCCCCCCCCC>
##$VD= 0
##$VDLIST= <DDDDDDDDDDDDDDD>
##$VPLIST= <PPPPPPPPPPPPPPP>
##$VTLIST= <TTTTTTTTTTTTTTT>
##$WBST= 2048
##$WBSW= 25
##$XGAIN= (0..3)
0 0 0 0
##$XL= 0
##$YL= 0
##$YMAX_a= 6129666
##$YMIN_a= -12294989
##$ZGOPTNS= <>
##$ZL1= 120
##$ZL2= 120
##$ZL3= 120
##$ZL4= 120
##$ABSF1= 14.96305
##$ABSF2= -5.595132
##$ABSG= 5
##$ABSL= 3
##$ALPHA= 0
##$AQORDER= 0
##$ASSFAC= 0
##$ASSFACI= 0
##$ASSFACX= 0
##$ASSWID= 0
##$AUNMP= <proc_prof1d_extract.lims>
##$AXLEFT= 0
##$AXNAME= <>
##$AXNUC= <1H>
##$AXRIGHT= 0
##$AXTYPE= 0
##$AXUNIT= <>
##$AZFE= 0.1
##$AZFW= 0.1
##$BCFW= 0
##$BC_mod= 0
##$BYTORDP= 0
##$COROFFS= 0
##$CY= 15
##$DATMOD= 1
##$DC= 0
##$DFILT= <>
##$DTYPP= 0
##$F1P= 0
##$F2P= 0
##$FCOR= 0.5
##$FTSIZE= 131072
##$FT_mod= 6
##$GAMMA= 0
##$GB= 0
##$INTBC= 1
##$INTSCL= 1
##$ISEN= 128
##$LB= 0.3
##$LEV0= 0
##$LPBIN= 0
##$MAXI= 10000
##$MC2= 0
##$MEAN= 0
##$ME_mod= 0
##$MI= 0
##$NCOEF= 0
##$NC_proc= -2
##$NLEV= 6
##$NOISF1= 0
##$NOISF2= 0
##$NSP= 0
##$NTH_PI= 0
##$NZP= 0
##$OFFSET= 14.96305
##$PC= 1
##$PHC0= -86.98975
##$PHC1= 0
##$PH_mod= 1
##$PKNL= yes
##$PPARMOD= 0
##$PPDIAG= 0
##$PPIPTYP= 0
##$PPMPNUM= 2147483647
##$PPRESOL= 1
##$PSCAL= 4
##$PSIGN= 0
##$PYNMP= <proc.py>
##$REVERSE= no
##$SF= 400.02000881815
##$SI= 131072
##$SIGF1= 0
##$SIGF2= 0
##$SINO= 400
##$SIOLD= 131072
##$SPECTYP= <>
##$SREGLST= <1H.CDCl3>
##$SSB= 0
##$STSI= 131072
##$STSR= 0
##$SW_p= 8223.68421052631
##$SYMM= 0
##$S_DEV= 0
##$TDeff= 65536
##$TDoff= 0
##$TI= <>
##$TILT= no
##$TM1= 0
##$TM2= 0
##$TOPLEV= 0
##$USERP1= <user>
##$USERP2= <user>
##$USERP3= <user>
##$USERP4= <user>
##$USERP5= <user>
##$WDW= 1
##$XDIM= 131072
##$YMAX_p= 403364363
##$YMIN_p= -10959
##$CURPLOT= <Network HP LaserJet P1505>
##$CURPRIN= <$Network HP LaserJet P1505>
##$DFORMAT= <normdp>
##$LAYOUT= <+/1D_H.xwp>
##$LFORMAT= <normlp>
##$PFORMAT= <normpl>
##$SURQMSG= 1
$$ End of Bruker specific parameters
$$ ---------------------------------
##NTUPLES= NMR SPECTRUM
##VAR_NAME=  FREQUENCY,     SPECTRUM/REAL,   SPECTRUM/IMAG
##SYMBOL=    X,             R,               I
##VAR_TYPE=  INDEPENDENT,   DEPENDENT,       DEPENDENT
##VAR_FORM=  AFFN,          ASDF,            ASDF
##VAR_DIM=   131072,        131072,          131072
##UNITS=     HZ,            ARBITRARY UNITS, ARBITRARY UNITS
##FACTOR=    0.0627417313425164, 1,          1
##FIRST=     8223.62146879497, -652,         -41712
##LAST=      0,             190,             -41904
##MIN=       0,             -10959,          0
##MAX=       8223.62146879497, 403364363,    0
$$ Real data points
##PAGE= N=1
##DATA TABLE= (X++(R..R)), XYDATA
$$ [...]
$$ plain form
63411 429065 416495 403703 390690 378109 366858 357353 349380 342656 337251 333233 330125 327232 324506
63398 324506 322641 322151 322836 324421 327295 332080 338709 346447 354760 363680 373284 383303 393434 403676
63384 403676 414166 424913 435945 447492 459780 472687 485693 498114 509379 519191 527474 534058
63372 534058 538410 539901 538364 534340 528782 522733 517139 512589 509052 506153 503788 502210 501351 500397 498298
63357 498298 494490 488883 481457 472261 461660 450213 438332 426352 414821 404326 395002 386524 378623
63344 378623 371318 364598 358235 351993 345764 339406 332781 326103 319937 314635 310067 306090 302925 300696
63330 300696 298884 296734 294137 291722 290098 289339 289161 289232 289334 289640 290839 293554 297501 301684 305566 309561
63314 309561 314026 318279 321098 321924 321106 319185 316490 313283 309768 305848 301332 296428 291679 287413 283640
$$ packed form
63411D29065j2570j2792j3013j2581j1251r505p973o724n405m018l108k893k726
63398C24506j865m90O85J585K874M785O629P738Q313Q920R604J0019J0131J0242
63384D03676J0490J0747J1032J1547J2288J2907J3006J2421J1265R812Q283O584
63372E34058M352J491j537m024n558o049n594m550l537k899k365j578q59r54k099
63357D98298l808n607p426r196j0601j1447j1881j1980j1531j0495r324q478p901
63344C78623p305o720o363o242o229o358o625o678o166n302m568l977l165k229
63330C00696j812k150k597k415j624p59j78P1J02L06J199K715L947M183L882L995
63314C09561M465M253K819Q26q18j921k695l207l515l920m516m904m749m266l773
$$ plain form
63299 283640 280470 278104 276307 274398 272042 269650 267758 266336 265008 263571 261990 260195 258266 256591
63285 256591 255496 254922 254731 255065 255936 256721 256576 255388 253885 252824 252405 252432 252627 252686 252356 251620 250716 249976
63267 249976 249822 250759 252978 255986 258973 261602 264097 266576 268739 270440 272238 275017 279141 284115 289036
63252 289036 293288 296877 300185 303456 306653 309880 313688 318672 324881 331953 339702 348229 357554 367595
63238 367595 378516 390604 403701 417227 430897 445012 459839 475191 490865 507034 523825
63227 523825 540852 557593 573976 590231 606334 622017 637203 652153 667362 683550 701568
63216 701568 721816 743724 766103 787982 808903 828511 846103 860560 870566 875044 873717 867240
63204 867240 856658 842801 826272 807725 787819 767074 746096 725815 707180 690680 676394
$$ packed form
63299B83640l170k366j797j909k356k392j892j422j328j437j581j795j929j675
63285B56591j095n74j91L34Q71P85j45j188j503j061m19K7J95N9l30p36r04p40
63267B49976j54R37K219L008K987K629K495K479K163J701J798K779M124M974M921
63252B89036M252L589L308L271L197L227L808M984O209P072P749Q527R325J0041
63238C67595J0921J2088J3097J3526J3670J4115J4827J5352J5674J6169J6791
63227E23825J7027J6741J6383J6255J6103J5683J5186J4950J5209J6188J8018
63216G01568K0248K1908K2379K1879K0921J9608J7592J4457J0006M478j327o477
63204H67240j0582j3857j6529j8547j9906k0745k0978k0281j8635j6500j4286
$$ plain form
63193 676394 664336 654463 646576 640659 637211 636755 639114 643626 650088 658891 670099 682962 696643
63180 696643 711076 726838 744388 763569 783577 803270 821852 839517 857230 875725 894911
63169 894911 914289 933494 952167 969738 985803 1000496 1014070 1026197 1035985 1042567 1045404 1044181
63157 1044181 1038843 1029681 1017040 1000985 981626 959751 936711 913598 890925 869117 848812 830349
63145 830349 813431 797789 783967 772915 764801 758659 753283 748114 743051 737832 731995 725362 718247
63132 718247 711122 704268 697745 691522 685595 680049 675030 670600 666675 663277 660702 659184 658432 657827 657160
63117 657160 656836 657159 657775 658139 658300 658835 660092 661853 663670 665219 666256 666646 666625 666818 667794 669616 671873
63100 671873 674005 675601 676557 677091 677576 678271 679258 680548 682167 684150 686593 689607 693041 696334 698904
$$ packed form
63193F76394j2058r873p887n917l448m56K359M512O462Q803J1208J2863J3681
63180F96643J4433J5762J7550J9181K0008J9693J8582J7665J7713J8495J9186
63169H94911J9378J9205J8673J7571J6065J4693J3574J2127R788O582K837j223
63157A044181n338r162j2641j6055j9359k1875k3040k3113k2673k1808k0305j8463
63145H30349j6918j5642j3822j1052q114o142n376n169n063n219n837o633p115
63132G18247p125o854o523o223n927n546n019m430l925l398k575j518p52o05o67
63117F57160l24L23O16L64J61N35J257J761J817J549J037L90k1J93R76J822K257
63100F71873K132J596R56N34M85O95R87J290J619J983K443L014L434L293K570
$$ plain form
63085 698904 700636 701786 702504 702919 703692 705888 709904 714882 719613 723829 728151 732900 737530 741388 744615
63070 744615 747985 752146 757252 763211 769889 777050 784433 792130 800758 810998 822973 836262 850529
63057 850529 865932 882848 901446 921694 943606 967237 992559 1019583 1048469 1079261 1111537
63046 1111537 1144658 1178368 1212791 1247766 1282508 1316130 1348315 1379343 1409629 1439382 1468596
63035 1468596 1497265 1525670 1554394 1583771 1613296 1641824 1668349 1692194 1712378 1727371 1735866
63024 1735866 1737448 1732093 1719423 1699018 1671298 1637424 1598389 1554820 1507802 1459260 1411069 1364165
63012 1364165 1318916 1276127 1237144 1202987 1173776 1149188 1129194 1114118 1104107 1098867 1098033 1101553
63000 1101553 1109564 1121957 1138313 1158202 1181371 1207553 1236254 1266747 1298154 1329591 1360540
$$ packed form
63085F98904J732J150P18M15P73K196M016M978M731M216M322M749M630L858L227
63070G44615L370M161N106N959O678P161P383P697Q628J0240J1975J3289J4267
63057H50529J5403J6916J8598K0248K1912K3631K5322K7024K8886L0792L2276
63046A111537L3121L3710L4423L4975L4742L3622L2185L1028L0286K9753K9214
63035A468596K8669K8405K8724K9377K9525K8528K6525K3845K0184J4993Q495
63024A735866J582n355j2670k0405k7720l3874l9035m3569m7018m8542m8191m6904
63012A364165m5249m2789l8983l4157k9211k4588j9994j5076j0011n240q34L520
63000A101553Q011J2393J6356J9889K3169K6182K8701L0493L1407L1437L0949
$$ plain form
62989 1360540 1391224 1422375 1454392 1486771 1518391 1548198 1575535 1600110 1621833 1640454 1655115
62978 1655115 1664415 1667046 1662192 1649240 1627586 1597172 1558921 1514178 1463862 1408610 1349554 1288340
62966 1288340 1226383 1164644 1104134 1046025 991038 939285 890986 846868 807489 772460 740706
62955 740706 711242 683486 657212 632656 610491 591196 574486 559613 546118 533944 522897
62944 522897 512400 501923 491378 481055 471343 462547 454715 447542 440625 433916 427796 422600 418176
62931 418176 414010 409704 405261 400969 397122 393759 390601 387205 383285 378932 374509 370380 366743 363624
62917 363624 360866 358179 355424 352964 351461 351073 351057 350510 349445 348650 348435 348094 346903 345147 343596 342315
62901 342315 340639 338262 335705 333583 331940 330536 329289 328167 326963 325539 324142 323234 323101 323699 324690
$$ packed form
62989A360540L0684L1151L2017L2379L1620K9807K7337K4575K1723J8621J4661
62978A655115R300K631m854j2952k1654l0414l8251m4743n0316n5252n9056o1214
62966A288340o1957o1739o0510n8109n4987n1753m8299m4118l9379l5029l1754
62955G40706k9464k7756k6274k4556k2165j9295j6710j4873j3495j2174j1047
62944E22897j0497j0477j0545j0323r712q796p832p173o917o709o120n196m424
62931D18176m166m306m443m292l847l363l158l396l920m353m423m129l637l119
62917C63624k758k687k755k460j503l88j6n47j065p95k15l41j191j756j551j281
62901C42315j676k377k557k122j643j404j247j122j204j424j397r08j33N98R91
$$ plain form
62886 324690 325506 325659 325147 324401 323778 323353 323215 323552 324209 324585 324274 323577 323123 323256 323969 325068 326062 326356
62868 326356 326009 325960 326903 328268 328983 329019 329330 330261 330877 330206 328424 326355 324335 322223 320110 318393 317135
62851 317135 315880 314215 312153 309904 307579 305295 303416 302403 302403 303085 303928 304614 305079 305289 305152 304673 303980
62834 303980 303090 301903 300620 299991 300715 302676 304987 306791 307724 307799 307316 306965 307428 308581 309497 309651 309787
62817 309787 311116 313841 317018 319875 322637 325815 329204 332164 334737 337847 342150 347121 351732 355865
62803 355865 360526 366640 374126 382427 391424 401330 411975 422913 434255 446841 461422 478067 496602
62790 496602 517197 540257 566045 594662 626161 660497 697697 738327 783338 832983 886131
62779 886131 941199 997597 1055685 1115333 1175160 1233307 1288310 1338870 1383280 1419702 1446933
$$ packed form
62886C24690Q16J53n12p46o23m25j38L37O57L76l11o97m54J33P13J099R94K94
62868C26356l47m9R43J365P15L6L11R31O16o71j782k069k020k112k113j717j258
62851C17135j255j665k062k249k325k284j879j013%O82Q43O86M65K10j37m79o93
62834C03980q90j187j283o29P24J961K311J804R33P5m83l51M63J153R16J54J36
62817C09787J329K725L177K857K762L178L389K960K573L110M303M971M611M133
62803C55865M661O114P486Q301Q997R906J0645J0938J1342J2586J4581J6645J8535
62790D96602K0595K3060K5788K8617L1499L4336L7200M0630M5011M9645N3148
62779H86131N5068N6398N8088N9648N9827N8147N5003N0560M4410L6422K7231
$$ plain form
62768 1446933 1464473 1471976 1469106 1456054 1433751 1403344 1365653 1321383 1271625 1217823 1161294 1103153
62756 1103153 1044711 987535 932834 880941 831663 785019 741404 701182 664412 630979 600650
62745 600650 572931 547157 522873 500025 478788 459439 442362 427831 415608 404992 395417 386799
62733 386799 379204 372543 366820 362345 359294 357269 355641 354217 353232 352803 352831 353438 355127 358362 363187
62718 363187 369314 376418 384346 393271 403689 416133 430848 447819 466972 488176 511208 536062
62706 536062 563261 593580 627435 664763 705489 749823 798108 850655 907655 968764 1032656
62695 1032656 1097316 1161010 1222689 1281369 1335509 1383259 1423033 1453516 1473432 1481736 1478092 1462946
62683 1462946 1437256 1402315 1359643 1310703 1256693 1198799 1138531 1077534 1017139 958341 902130
$$ packed form
62768A446933J7540P503k870j3052k2303l0407l7691m4270m9758n3802n6529n8141
62756A103153n8442n7176n4701n1893m9278m6644m3615m0222l6770l3433l0329
62745F00650k7719k5774k4284k2848k1237j9349j7077j4531j2223j0616r575q618
62733C86799p595o661n723m475l051k025j628j424r85m29K8O07J689L235M825
62718C63187O127P104P928Q925J0418J2444J4715J6971J9153K1204K3032K4854
62706E36062K7199L0319L3855L7328M0726M4334M8285N2547N7000O1109O3892
62695A032656O4660O3694O1679N8680N4140M7750L9774L0483J9916Q304l644j5146
62683A462946k5690l4941m2672m8940n4010n7894o0268o0997o0395n8798n6211
$$ plain form
62672 902130 849402 800461 754967 712593 673510 637997 605789 576177 548681 523351 500303
62661 500303 479296 460003 442483 427029 413487 401085 389103 377546 366921 357479 348965 341066
62649 341066 333837 327547 322225 317429 312473 306969 301232 296000 291635 287750 283849 280116 277167 275147
62635 275147 273577 272149 271079 270418 269556 267872 265585 263501 262102 261323 261082 261481 262403 263373 264018 264443
62619 264443 264996 265814 266779 267843 269261 271497 274847 279129 283840 288670 293830 299732 306480 313849 321749
62604 321749 330534 340817 353057 367391 383790 402372 423451 447179 473160 500678 529389 559536
62592 559536 591299 624076 656515 687023 714146 736872 755007 768998 778880 783564 781742 773447
62580 773447 760160 743314 723342 700446 675587 650044 624299 598049 571322 545080 520527
$$ packed form
62672I02130n2728m8941m5494m2374l9083l5513l2208k9612k7496k5330k3048
62661E00303k1007j9293j7520j5454j3542j2402j1982j1557j0625r442q514p899
62649C41066p229o290n322m796m956n504n737n232m365l885l901l733k949k020
62635B75147j570j428j070o61q62j684k287k084j399p79k41L99R22R70O45M25
62619B64443N53Q18R65J064J418K236L350M282M711M830N160N902O748P369P900
62604C21749Q785J0283J2240J4334J6399J8582K1079K3728K5981K7518K8711L0147
62592E59536L1763L2777L2439L0508K7123K2726J8135J3991R882M684j822q295
62580G73447j3287j6846j9972k2896k4859k5543k5745k6250k6727k6242k4553
$$ plain form
62569 520527 498152 477664 458658 441145 425495 412035 400681 390819 381569 372330 363209 354836
62557 354836 347643 341374 335415 329545 324098 319341 314968 310494 305962 301986 299102 297273 296046 294994
62543 294994 293950 292977 292246 291935 292210 293217 294969 297243 299804 302751 306447 311035 316317 322248 329213
62528 329213 337583 347372 358690 372194 388566 407762 429272 452918 478819 506769 536398 567945
62516 567945 602079 638766 677017 716075 756141 797405 838816 878327 914018 944649 969401
62505 969401 987603 998649 1001927 997067 984404 964965 939823 909800 875965 839870 802844 765421
62493 765421 727893 691032 655832 622802 592038 563739 538180 515366 495169 477554 462234
62482 462234 448396 435356 423314 412844 403853 395669 388080 381561 376422 372368 368988 366123 363657
$$ packed form
62569E20527k2375k0488j9006j7513j5650j3460j1354r862r250r239r121q373
62557C54836p193o269n959n870n447m757m373m474m532l976k884j829j227j052
62543B94994j044r73p31l11K75J007J752K274K561K947L696M588N282N931O965
62528C29213Q370R789J1318J3504J6372J9196K1510K3646K5901K7950K9629L1547
62516E67945L4134L6687L8251L9058M0066M1264M1411L9511L5691L0631K4752
62505I69401J8202J1046L278m860j2663j9439k5142l0023l3835l6095l7026l7423
62493G65421l7528l6861l5200l3030l0764k8299k5559k2814k0197j7615j5320
62482D62234j3838j3040j2042j0470q991q184p589o519n139m054l380k865k466
$$ plain form
62469 363657 361503 359887 359137 359075 359206 359612 361014 363733 367203 370860 374923 379875 385666 391912 398451
62454 398451 405196 411712 417520 422612 427174 430890 432963 432834 430522 426287 420390 413322 405921 398924
62440 398924 392369 385581 377945 369712 361896 355241 349501 343998 338704 334292 331176 329086 327704 327194
62426 327194 327759 329190 331251 334142 338125 342946 348050 353242 358780 365022 372275 380719 390006 399146
62412 399146 407330 414836 422641 431182 439919 448158 455810 463257 470821 478477 485776 491978 496618 500031
62398 500031 502994 505743 507737 508541 508575 508662 509100 509514 509499 509116 508839 509290 511020 514353 519366 526065 534516
62381 534516 544726 556571 570019 585343 602917 622833 644897 668955 694991 722948 752793
62370 752793 784809 819426 856395 894335 931451 966569 999131 1028329 1052918 1072124 1086265
$$ packed form
62469C63657k154j616p50o2J31M06J402K719L470L657M063M952N791O246O539
62454C98451O745O516N808N092M562L716K073j29k312m235n897p068p401o997
62440C98924o555o788p636q233p816o655n740n503n294m412l116k090j382n10
62426C27194N65J431K061K891L983M821N104N192N538O242P253Q444R287R140
62412C99146Q184P506P805Q541Q737Q239P652P447P564P656P299O202M640L413
62398E00031K963K749J994Q04L4Q7M38M14j5l83k77M51J730L333N013O699Q451
62381E34516J0210J1845J3448J5324J7574J9916K2064K4058K6036K7957K9845
62370G52793L2016L4617L6969L7940L7116L5118L2562K9198K4589J9206J4141
$$ plain form
62359 1086265 1096109 1101851 1103118 1099695 1091778 1079668 1063695 1044412 1022363 997648 970165 940408
62347 940408 909587 878814 848528 818874 790257 763276 738386 715823 695626 677593 661472
62336 661472 647286 635147 624672 615036 605790 597223 589760 583500 578556 575203 573256 571923 570831
62323 570831 570633 571962 574294 576668 579096 582274 586116 589598 592068 593784 595058 595799 596106 596449 596909
62308 596909 596997 596533 596010 595783 595658 595699 596625 598766 601324 603366 605017 606938 609104 610967 612506 614189
62292 614189 615996 617332 618054 618871 620505 622992 625987 629370 633354 638283 644431 651690 659454 667160 675067
62277 675067 684200 695435 708894 724308 741691 761532 784516 811019 840616 872065 904104 936353
62265 936353 969146 1002404 1034984 1065223 1091792 1113892 1131070 1143299 1151107 1155278 1156313 1154209
$$ packed form
62359A086265R844N742J267l423p917j2110j5973j9283k2049k4715k7483k9757
62347I40408l0821l0773l0286k9654k8617k6981k4890k2563k0197j8033j6121
62336F61472j4186j2139j0475r636r246q567p463o260m944l353j947j333j092
62323E70831j98J329K332K374K428L178L842L482K470J716J274P41L07L43M60
62308E96909Q8m64n23k27j25M1R26K141K558K042J651J921K166J863J539J683
62292F14189J807J336P22Q17J634K487K995L383L984M929O148P259P764P706P907
62277F75067R133J1235J3459J5414J7383J9841K2984K6503K9597L1449L2039L2249
62265I36353L2793L3258L2580L0239K6569K2100J7178J2229P808M171J035k104
$$ plain form
62253 1154209 1148646 1139309 1126227 1109947 1091313 1070980 1049254 1026442 1003181 980316 958627 938806
62241 938806 921361 906276 892953 880893 870344 861882 855383 849850 844431 839259 834985 831768 829094
62228 829094 826474 823932 821769 820147 819063 818447 818042 817288 815578 812757 809329 806128 803744 802205 801140
62213 801140 800220 799421 798884 798719 799101 800436 803065 806823 811212 816146 822133 829487 837756 846340 855376
62198 855376 865473 876730 888636 900931 913977 928020 942599 956965 970726 983881 996603
62187 996603 1009275 1022434 1036335 1050874 1066170 1082847 1101367 1121444 1142652 1165259 1189835
62176 1189835 1216076 1242665 1268335 1292581 1315225 1335794 1353642 1368378 1379978 1388724 1395165 1399906
62164 1399906 1403160 1404560 1403476 1399496 1392738 1383861 1373652 1362338 1349435 1334689 1319057 1304231
$$ packed form
62253A154209n563r337j3082j6280j8634k0333k1726k2812k3261k2865k1689j9821
62241I38806j7445j5085j3323j2060j0549q462o499n533n419n172m274l217k674
62228H29094k620k542k163j622j084o16m05p54j710k821l428l201k384j539j065
62213H01140r20p99n37j65L82J335K629L758M389M934N987P354Q269Q584R036
62198H55376J0097J1257J1906J2295J3046J4043J4579J4366J3761J3155J2722
62187I96603J2672J3159J3901J4539J5296J6677J8520K0077K1208K2607K4576
62176A189835K6241K6589K5670K4246K2644K0569J7848J4736J1600Q746O441M741
62164A399906L254J400j084l980o758q877j0209j1314j2903j4746j5632j4826
$$ plain form
62152 1304231 1291126 1279416 1268674 1259303 1251829 1245808 1240149 1234336 1228658 1223248 1217563 1211108 1204199
62139 1204199 1197602 1191579 1185698 1179607 1173633 1168424 1164119 1160152 1155950 1151621 1147820 1145036 1143210 1142015
62125 1142015 1141271 1141073 1141680 1143380 1146290 1150286 1155267 1161527 1169606 1179566 1190454 1200565 1208251 1212550
62111 1212550 1213339 1211105 1206677 1201162 1196051 1192894 1192318 1193266 1193531 1191245 1185729 1177097 1165677 1152088
62097 1152088 1137355 1122449 1107910 1094266 1082465 1073339 1066743 1061792 1057964 1055542 1054893 1055794 1057706
62084 1057706 1060406 1064079 1068932 1074937 1081919 1089755 1098388 1107555 1116559 1124607 1131582 1138199 1144968 1151131
62070 1151131 1155095 1155975 1154216 1150613 1145278 1137922 1128702 1118203 1106758 1094213 1080331 1065048 1048298
62057 1048298 1030002 1010372 990003 969466 948971 928536 908363 888897 870516 853353 837368
$$ packed form
62152A304231j3105j1710j0742r371p474o021n659n813n678n410n685o455o909
62139A204199o597o023n881o091n974n209m305l967m202m329l801k784j826j195
62125A142015p44j98O07J700K910L996M981O260Q079R960J0888J0111P686M299
62111A212550P89k234m428n515n111l157n76R48K65k286n516q632j1420j3589
62097A152088j4733j4906j4539j3644j1801r126o596m951l828k422o49R01J912
62084A057706K700L673M853O005O982P836Q633R167R004Q048O975O617O769O163
62070A151131L964Q80j759l603n335p356r220j0499j1445j2545j3882j5283j6750
62057A048298j8296j9630k0369k0537k0495k0435k0173j9466j8381j7163j5985
$$ plain form
62046 837368 822506 808718 795919 784017 772950 762609 752739 743049 733521 724536 716522 709444 702779
62033 702779 696040 689249 682779 676813 671022 664731 657334 648651 639062 629348 620265 612147 604876 598200
62019 598200 592009 586347 581300 576986 573510 570777 568382 565914 563416 561394 560195 559543 558777 557469 555613
62004 555613 553328 550704 547973 545550 543676 542090 540142 537153 532755 527175 521311 516251 512423 509327
61990 509327 506246 503051 500132 497800 496121 495167 494981 495358 496067 497296 499458 502421 505433 508042 510695
61975 510695 514113 518440 523391 528953 535395 542651 550216 557743 565311 572991 580566 588038 596141 605891
61961 605891 617562 630334 643048 655150 666902 678931 691795 705908 721529 738652 756988
61950 756988 776234 796322 817366 839481 862803 887599 914095 942174 971413 1001492 1032394
$$ packed form
62046H37368j4862j3788j2799j1902j1067j0341r870r690r528q985q014p078o665
62033G02779o739o791o470n966n791o291p397q683r589r714r083q118p271o676
62019E98200o191n662n047m314l476k733k395k468k498k022j199o52p66j308j856
62004E55613k285k624k731k423j874j586j948k989m398n580n864n060l828l096
61990E09327l081l195k919k332j679r54j86L77P09J229K162K963L012K609K653
61975E10695L418M327M951N562O442P256P565P527P568P680P575P472Q103R750
61961F05891J1671J2772J2714J2102J1752J2029J2864J4113J5621J7123J8336
61950G56988J9246K0088K1044K2115K3322K4796K6496K8079K9239L0079L0902
$$ plain form
61939 1032394 1064255 1097282 1131945 1168884 1208341 1249854 1292773 1337033 1383219 1432115 1484587
61928 1484587 1541885 1605533 1676769 1756310 1844908 1943811 2054423 2177718 2314421 2465816
61918 2465816 2633943 2820624 3026294 3249960 3490289 3746415 4017342 4300451 4590624
61909 4590624 4880597 5161704 5424028 5656350 5846946 5985290 6063672 6077989 6028037 5917580
61899 5917580 5753793 5545896 5303816 5037717 4757905 4474112 4194174 3923318 3664645
61890 3664645 3420069 3190860 2977787 2781268 2601457 2438065 2290256 2156960 2037231
61881 2037231 1930102 1834211 1747967 1670093 1599782 1536305 1478899 1427193 1381346 1341389 1306656
61870 1306656 1276165 1249328 1225885 1205372 1187245 1171582 1159121 1150353 1144912 1142022 1141175 1142235
$$ packed form
61939A032394L1861L3027L4663L6939L9457M1513M2919M4260M6186M8896N2472
61928A484587N7298O3648P1236P9541Q8598R8903J10612J23295J36703J51395
61918B465816J68127J86681K05670K23666K40329K56126K70927K83109K90173
61909D590624K89973K81107K62324K32322J90596J38344P8382J4317m9952j10457
61899E917580j63787k07897k42080k66099k79812k83793k79938k70856k58673
61890C664645k44576k29209k13073j96519j79811j63392j47809j33296j19729
61881B037231j07129r5891q6244p7874p0311o3477n7406n1706m5847l9957l4733
61870A306656l0491k6837k3443k0513j8127j5663j2461q768n441k890q47J060
$$ plain form
61858 1142235 1145304 1150809 1159232 1170261 1182417 1194086 1204793 1215034 1225017 1234241 1242297 1249429 1256023
61845 1256023 1262108 1267745 1273479 1279889 1286952 1294282 1301824 1309822 1318206 1326486 1334286 1341503 1347804 1352451
61831 1352451 1354956 1355621 1355079 1353501 1350684 1346875 1343059 1340195 1338433 1337416 1337242 1338770 1342862 1349586 1358446
61816 1358446 1369343 1383021 1400431 1421849 1446802 1474768 1505771 1540259 1578652 1621153 1667922
61805 1667922 1719275 1775620 1837278 1904416 1977258 2056413 2143033 2238589 2344436 2461557 2590708
61794 2590708 2732817 2889284 3062021 3253295 3465510 3700982 3961795 4249720 4566208
61785 4566208 4912400 5289129 5696816 6135012 6601503 7091327 7596147 8104157 8600363
61776 8600363 9067147 9485242 9835127 10098714 10261237 10313286 10252369 10083194 9816485 9467201
$$ packed form
61858A142235L069N505Q423J1029J2156J1669J0707J0241R983R224Q056P132O594
61845A256023O085N637N734O410P063P330P542P998Q384Q280P800P217O301M647
61831A352451K505O65n42j578k817l809l816k864j762j017j74J528M092O724Q860
61816A358446J0897J3678J7410K1418K4953K7966L1003L4488L8393M2501M6769
61805A667922N1353N6345O1658O7138P2842P9155Q6620R5556J05847J17121J29151
61794B590708J42109J56467J72737J91274K12215K35472K60813K87925L16488
61785D566208L46192L76729M07687M38196M66491M89824N04820N08010M96206
61776H600363M66784M18095L49885K63587J62523N2049o0917j69175k66709l49284
$$ plain form
61766 9467201 9052984 8592678 8104573 7604805 7106694 6620847 6155164 5714732 5302345
61757 5302345 4919594 4567394 4245489 3952146 3684986 3442109 3222088 3023108 2842745
61748 2842745 2678821 2530113 2395968 2275386 2166587 2067371 1975874 1891116 1812916 1741195
61738 1741195 1675446 1614959 1559421 1508852 1462923 1420706 1381294 1344413 1310145 1278308 1248396
61727 1248396 1220051 1193286 1168238 1144882 1123072 1102752 1084020 1066869 1050813 1034910 1018516
61716 1018516 1002065 986776 973327 961050 948649 935484 921772 907808 893604 879413 866070
61705 866070 854355 844160 834585 824800 814688 804709 795456 787384 780749 775586 771731 769011 767443
61692 767443 767165 768049 769456 770482 770430 769016 766272 762456 757906 752610 745849 736663 724857 711269 696886
$$ packed form
61766I467201m14217m60306m88105m99768m98111m85847m65683m40432m12387
61757E302345l82751l52200l21905k93343k67160k42877k20021j98980j80363
61748B842745j63924j48708j34145j20582j08799r9216r1497q4758p8200p1721
61738A741195o5749o0487n5538n0569m5929m2217l9412l6881l4268l1837k9912
61727A248396k8345k6765k5048k3356k1810k0320j8732j7151j6056j5903j6394
61716A018516j6451j5289j3449j2277j2401j3165j3712j3964j4204j4191j3343
61705H66070j1715j0195r575r785j0112r979r253q072o635n163l855k720j568
61692G67443k78Q84J407J026n2j414k744l816m550n296o761r186j1806j3588j4383
$$ plain form
61677 696886 682091 667057 652454 639204 627748 618116 610556 605350 601972 599170 596192 593405 591374
61664 591374 589869 588193 586013 583256 579592 574719 569025 563331 557937 552500 546860 541380 536311 531453
61650 531453 526772 522823 520022 517799 514974 510985 506411 502351 499545 497959 496853 495287 492912 490273
61636 490273 488096 486354 484433 482259 480678 480449 481261 482107 482338 481940 481057 479885 479017 479219 480537 482003
61620 482003 482516 481743 479963 477430 474350 471251 468756 466962 465441 463962 462769 461964 461073 459639 458030
61605 458030 457214 457761 459302 460977 462166 462795 463272 464232 466143 469000 472527 476684 481732 487669 493940
61590 493940 500009 506034 512569 519752 527235 535007 543679 553654 564421 575157 585827 597166 609735
61577 609735 623625 639140 657081 677921 701151 725991 752502 781410 812865 845895 879219
$$ packed form
61677F96886j4795j5034j4603j3250j1456r632p560n206l378k802k978k787k031
61664E91374j505j676k180k757l664m873n694n694n394n437n640n480n069m858
61650E31453m681l949k801k223k825l989m574m060k806j586j106j566k375k639
61636D90273k177j742j921k174j581k29Q12Q46K31l98q83j172q68K02J318J466
61620D82003N13p73j780k533l080l099k495j794j521j479j193q05q91j434j609
61605D58030q16N47J541J675J189O29M77R60J911K857L527M157N048N937O271
61590D93940O069O025O535P183P483P772Q672R975J0767J0736J0670J1339J2569
61577F09735J3890J5515J7941K0840K3230K4840K6511K8908L1455L3030L3324
$$ plain form
61566 879219 912065 943880 973614 999820 1021486 1038460 1051002 1059185 1062945 1062616 1059225 1054189 1048771
61553 1048771 1043750 1039464 1036066 1033747 1032743 1033078 1034368 1036126 1038322 1041297 1044806 1047471 1047825 1045834
61539 1045834 1042795 1039573 1035693 1030515 1024519 1018656 1012943 1006682 999910 993672 988765 985135 982752 982199
61525 982199 983863 987282 992000 998625 1008331 1021543 1037717 1056347 1077679 1102489 1131607 1165581
61513 1165581 1204470 1248000 1296248 1349966 1409858 1475799 1547320 1624803 1709591 1802923 1905294
61502 1905294 2016868 2137710 2267112 2403100 2543067 2684674 2825827 2963976 3095810
61493 3095810 3217562 3325599 3417041 3490313 3545170 3582132 3601982 3605897 3595815 3574418 3544875
61482 3544875 3510666 3475233 3441161 3409498 3379962 3351777 3324080 3295622 3264409 3227907 3183748
$$ packed form
61566H79219L2846L1815K9734K6206K1666J6974J2542Q183L760l29l391n036n418
61553A048771n021m286l398k319j004L35J290J758K196K975L509K665L54j991
61539A045834l039l222l880n178n996n863n713o261o772o238m907l630k383n53
61525I82199J664L419M718O625R706J3212J6174J8630K1332K4810K9118L3974
61513A165581L8889M3530M8248N3718N9892O5941P1521P7483Q4788R3332J02371
61502A905294J11574J20842J29402J35988J39967J41607J41153J38149J31834
61493C095810J21752J08037R1442P3272N4857L6962J9850L915j0082k1397k9543
61482C544875l4209l5433l4072l1663k9536k8185k7697k8458l1213l6502m4159
$$ plain form
61471 3183748 3130507 3068155 2997918 2921636 2841189 2758527 2676041 2596593 2523005 2457364 2400658
61460 2400658 2352875 2313474 2281891 2257671 2240217 2228686 2222305 2220652 2223419 2230090 2240181 2253808
61448 2253808 2271646 2294186 2321336 2352977 2389671 2432470 2482011 2538026 2599626 2665632 2734213
61437 2734213 2802267 2865516 2919532 2960951 2988128 3001234 3002067 2993514 2978649 2959976 2939363 2918367
61425 2918367 2898241 2879710 2863243 2849766 2840754 2837428 2840178 2848888 2863163 2881481 2900306 2914829
61413 2914829 2920876 2915919 2898665 2868774 2827493 2777942 2724099 2669461 2616658 2567595 2523238 2483463
61401 2483463 2447735 2415872 2387780 2362742 2339720 2318500 2299941 2284939 2273623 2265787 2261689 2262098
61389 2262098 2267896 2279892 2298778 2325009 2358909 2401071 2452366 2513352 2584010 2664315 2754713
$$ packed form
61471C183748n3241o2352p0237p6282q0447q2662q2486p9448p3588o5641n6706
61460B400658m7783l9401l1583k4220j7454j1531o381j653K767O671J0091J3627
61448B253808J7838K2540K7150L1641L6694M2799M9541N6015O1600O6006O8581
61437B734213O8054O3249N4016M1419K7177J3106Q33q553j4865j8673k0613k0996
61425B918367k0126j8531j6467j3477r012l326K750Q710J4275J8318J8825J4523
61413B914829O047m957j7254k9891m1281m9551n3843n4638n2803m9063m4357l9775
61401B483463l5728l1863k8092k5038k3022k1220j8559j5002j1316p836m098M09
61389B262098N798J1996J8886K6231L3900M2162N1295O0986P0658Q0305R0398
$$ plain form
61378 2754713 2855537 2966106 3084823 3210022 3340271 3473900 3608597 3741425 3868794
61369 3868794 3986391 4089635 4174493 4237876 4277568 4292436 4282924 4250920 4198887 4129233 4044393
61358 4044393 3946881 3838913 3722318 3599053 3471476 3341844 3211814 3082706 2955937 2832968
61348 2832968 2715101 2603551 2499292 2402474 2312448 2228916 2152697 2084825 2025200 1972843 1927311
61337 1927311 1888975 1857885 1833211 1814132 1800691 1793407 1792485 1797721 1808781 1825248 1846661 1872602
61325 1872602 1902395 1934561 1967126 1998691 2028685 2056347 2080226 2099292 2113964 2125360 2134058
61314 2134058 2140501 2146165 2153060 2161884 2171637 2181350 2191283 2202009 2213226 2224311 2235463 2247389 2260046
61301 2260046 2272474 2283897 2294328 2303931 2312345 2318916 2323203 2324961 2323873 2319676 2312469 2302660 2290559
$$ packed form
61378B754713J00824J10569J18717J25199J30249J33629J34697J32828J27369
61369C868794J17597J03244Q4858O3383L9692J4868r512l2004n2033o9654q4840
61358D044393r7512j07968j16595j23265j27577j29632j30030j29108j26769j22969
61348B832968j17867j11550j04259r6818r0026q3532p6219o7872n9625n2357m5532
61337A927311l8336l1090k4674j9079j3441p284r22N236J1060J6467K1413K5941
61325A872602K9793L2166L2565L1565K9994K7662K3879J9066J4672J1396Q698
61314B134058O443N664O895Q824R753R713R933J0726J1217J1085J1152J1926J2657
61301B260046J2428J1423J0431R603Q414O571M287J758j088m197p207r809j2101
$$ plain form
61288 2290559 2276193 2259623 2241459 2223034 2205956 2191370 2179655 2170812 2164950 2162081 2161530 2161856 2161502
61275 2161502 2159313 2154374 2145885 2133650 2118582 2102169 2085262 2067652 2048941 2029569 2010768 1993643
61263 1993643 1978556 1965406 1954384 1946303 1942131 1942182 1945882 1952588 1962596 1977225 1997877 2025302 2059838
61250 2059838 2102004 2152586 2212281 2281526 2360492 2448911 2545822 2649564 2757740 2866725 2971127
61239 2971127 3064105 3138660 3189081 3211924 3206495 3174837 3121002 3049880 2966267 2874591 2778994
61228 2778994 2683449 2591798 2507597 2433719 2372082 2323868 2289769 2269663 2262016 2263894 2271575 2280894
61216 2280894 2287225 2285984 2273889 2249868 2214832 2170863 2120595 2066742 2011646 1957246 1905453 1858136
61204 1858136 1816445 1780365 1749161 1721947 1697661 1674963 1652712 1630438 1608070 1585482 1562655
$$ packed form
61288B290559j4366j6570j8164j8425j7078j4586j1715q843n862k869n51L26l54
61275B161502k189m939q489j2235j5068j6413j6907j7610j8711j9372j8801j7125
61263A993643j5087j3150j1022q081m172N1L700O706J0008J4629K0652K7425L4536
61250B059838M2166N0582N9695O9245P8966Q8419R6911J03742J08176J08985J04402
61239B971127R2978P4555N0421K2843n429l1658n3835p1122q3613r1676r5597
61228B778994r5545r1651q4201p3878o1637m8214l4099k0106p647J878P681R319
61216B280894O331j241j2095k4021l5036m3969n0268n3853n5096n4400n1793m7317
61204A858136m1691l6080l1204k7214k4286k2698k2251k2274k2368k2588k2827
$$ plain form
61193 1562655 1539928 1517531 1495032 1471853 1448303 1425518 1404312 1384514 1365526 1347036 1329047
61182 1329047 1311609 1294829 1278958 1264302 1251140 1239728 1230168 1222304 1215950 1211191 1208180 1206721
61170 1206721 1206313 1206533 1206854 1206058 1202270 1193847 1180112 1161302 1138184 1111778 1083038 1052676 1021573
61157 1021573 991236 963216 937856 914076 890702 867612 845386 824370 804508 785700 767808
61146 767808 750577 734055 719004 706432 696697 689270 683246 677850 672621 667465 662623 658517 655736
61133 655736 655078 657126 661545 667201 673407 680750 690294 702247 715824 730083 744263 757465 768679
61120 768679 777224 782732 784766 783090 778481 772743 767648 764046 761984 761110 760813 760477 760006 759820 760117 760441
61104 760441 760273 759661 758836 757453 754771 750626 745721 740755 735593 729650 722944 716352 710644 705612 700544
$$ packed form
61193A562655k2727k2397k2499k3179k3550k2785k1206j9798j8988j8490j7989
61182A329047j7438j6780j5871j4656j3162j1412r560p864o354m759l011j459
61170A206721m08K20L21p96l788q423j3735j8810k3118k6406k8740l0362l1103
61157A021573l0337k8020k5360k3780k3374k3090k2226k1016j9862j8808j7892
61146G67808j7231j6522j5051j2572r735p427o024n396n229n156m842m106k781
61133F55736o58K048M419N656O206P343R544J1953J3577J4259J4180J3202J1214
61120G68679Q545N508K034j676m609n738n095l602k062q74k97l36m71j86K97L24
61104G60441j68o12q25j383k682m145m905m966n162n943o706o592n708n032n068
$$ plain form
61089 700544 695394 690890 687376 684151 680516 677014 674885 674363 674271 673469 672087 671013 670755 671265 672513 674599
61073 674599 677430 680769 684652 689434 695350 702240 709714 717458 725379 733619 742395 751645 760850 769317
61059 769317 776690 783170 789259 795317 801270 806651 811040 814571 817967 822030 827136 833194 839967 847434
61045 847434 856053 866633 879723 895028 911733 929487 948724 969892 992861 1017509 1044468 1074679
61033 1074679 1108379 1145148 1184939 1228424 1276171 1328064 1383822 1443527 1507152 1573842 1642231
61022 1642231 1711559 1782316 1856024 1934830 2021291 2118014 2227049 2349492 2485672 2635719
61012 2635719 2800208 2980984 3182218 3411245 3678587 3997119 4380982 4844682 5402855
61003 5402855 6071691 6872914 7838791 9014230 10453584 12213783 14344419 16867679 19740079
$$ packed form
61089G00544n150m504l514l225l635l502k129n22r2q02j382j074k58N10J248K086
61073F74599K831L339L883M782N916O890P474P744P921Q240Q776R250R205Q467
61059G69317P373O480O089O058N953N381M389L531L396M063N106O058O773P467
61045H47434Q619J0580J3090J5305J6705J7754J9237K1168K2969K4648K6959L0211
61033A074679L3700L6769L9791M3485M7747N1893N5758N9705O3625O6690O8389
61022A642231O9328P0757P3708P8806Q6461R6723J09035J22443J36180J50047
61012B635719J64489J80776K01234K29027K67342L18532L83863M63700N58173
61003E402855O68836Q01223R65877J175439J439354J760199K130636K523260K872400
$$ plain form
60994 19740079 22806952 25787795 28331327 30136202 31076861 31258446 30969493 30566498 30353542
60985 30353542 30498057 30988345 31629904 32091901 32012964 31138276 29420387 27024476 24239949
60976 24239949 21361322 18607464 16102705 13897165 11994662 10374264 9005390 7856908
60968 7856908 6899662 6105530 5447710 4902582 4450149 4072575 3753491 3479122 3239267
60959 3239267 3026692 2836062 2663587 2506830 2364021 2233546 2114221 2005621 1907724 1820264
60949 1820264 1742384 1672504 1608382 1547867 1490073 1435639 1385580 1340150 1299108 1262527 1230563
60938 1230563 1202513 1176868 1152521 1129461 1108045 1088110 1069233 1051544 1035675 1021866 1009575
60927 1009575 998116 987335 977365 967959 958438 948280 937396 925711 912891 898781 883942 869376
$$ packed form
60994A9740079L066873K980843K543532J804875R40659J81585k88953m02995k12956
60985C0353542J44515M90288O41559M61997p8937q74688j717889k395911k784527
60976B4239949k878627k753858k504759k205540j902503j620398j368874j148482
60968G856908r57246p94132o57820n45128m52433l77574l19084k74369k39855
60959C239267k12575j90630j72475j56757j42809j30475j19325j08600r7897q7460
60949A820264p7880o9880o4122o0515n7794n4434n0059m5430m1042l6581l1964
60938A230563k8050k5645k4347k3060k1416j9935j8877j7689j5869j3809j2291
60927A009575j1459j0781r970r406r521j0158j0884j1685j2820j4110j4839j4566
$$ plain form
60915 869376 855735 843062 831170 819923 809130 798642 788655 779555 771211 762792 753622 743975 734697
60902 734697 726219 718276 710472 702710 695134 688004 681676 676370 671890 667781 663852 660379 657800 656418
60888 656418 656322 657356 659117 661239 663723 666742 670146 673399 676059 678067 679476 680177 679991 678850 676828
60873 676828 674183 671449 669206 667647 666555 665741 665264 665189 665450 666084 667328 669370 672239 675954 680344 684615
60857 684615 687595 688719 688401 687208 685221 682604 680208 678808 677988 676467 673354 668374 661071 650752
60843 650752 637474 622438 607148 592747 580253 570551 563586 558139 553020 548204 544352 541622 539531
60830 539531 537734 536266 535126 534173 533410 532911 532451 531701 530817 530371 530591 531128 531698 532548 534036 536061 538227
60813 538227 540358 542596 545173 548296 552036 556002 559267 561039 561501 561782 562929 565016 567270 568941 569913
$$ packed form
60915H69376j3641j2673j1892j1247j0793j0488r987r100q344q419r170r647r278
60902G34697q478p943p804p762p576p130o328n306m480m109l929l473k579j382
60888F56418r6J034J761K122K484L019L404L253K660K008J409P01j86j141k022
60873F76828k645k734k243j559j092q14m77p5K61O34J244K042K869L715M390M271
60857F84615K980J124l18j193j987k617k396j400q20j521l113m980p303j0319
60843F50752j3278j5036j5290j4401j2494r702o965n447n119m816l852k730k091
60830E39531j797j468j140r53p63m99m60p50q84m46K20N37N70Q50J488K025K166
60813E38227K131K238K577L123L740L966L265J772M62K81J147K087K254J671R72
$$ plain form
60798 569913 570555 571185 571775 572129 572168 571987 571673 571123 570010 567917 564618 560380 555849 551478 547121 542422
60782 542422 537523 533047 529291 525796 521938 517718 513651 510100 507077 504653 503116 502562 502564 502470 501964 501287
60766 501287 500960 501331 502258 503199 503757 504187 505229 507346 510250 513289 516147 518964 521875 524697 527128 529054
60750 529054 530535 531609 532211 532226 531486 529809 527235 524244 521558 519580 518126 516761 515301 513807 512275
60735 512275 510585 508756 506925 505005 502615 499521 495924 492117 488098 483769 479339 475111 470974 466472
60721 466472 461422 456078 450661 445113 439493 434208 429585 425480 421612 418060 415084 412654 410489 408480
60707 408480 406716 405156 403624 402149 401011 400408 400404 401201 403066 405847 408918 411824 414695 417765 420723
60692 420723 422942 424280 425309 426762 428969 431872 435272 438994 442974 447294 451945 456522 460348 463061
$$ packed form
60798E69913O42O30N90L54L9j81l14n50j113k093l299m238m531m371m357m699
60782E42422m899m476l756l495l858m220m067l551l023k424j537n54Kr4n06o77
60766E01287l27L71R27R41N58M30J042K117K904L039K858K817K911K822K431J926
60750E29054J481J074O02J5p40j677k574k991k686j978j454j365j460j494j532
60735E12275j690j829j831j920k390l094l597l807m019m329m430m228m137m502
60721D66472n050n344n417n548n620n285m623m105l868l552k976k430k165k009
60707D08480j764j560j532j475j138o03mP97J865K781L071K906K871L070K958
60692D20723K219J338J029J453K207K903L400L722L980M320M651M577L826K713
$$ plain form
60678 463061 464941 466556 468280 470295 472801 475825 478895 481373 483238 485185 487718 490417 492485 493846
60664 493846 495293 497566 500608 503822 506758 509379 511861 514346 516834 519152 521019 522149 522214 520837 517795
60649 517795 513283 507737 501436 494492 487277 480483 474588 469590 465432 462284 460086 458175 455832 452989
60635 452989 449956 446696 442996 439218 436158 433972 431861 429092 425887 422961 420653 418907 417717 417000
60621 417000 416153 414344 411471 408525 406767 406585 407224 407604 407307 406738 406388 406201 405869 405518 405688 406617 407966
60604 407966 409404 411090 413379 416349 419853 423679 427348 430031 431134 430939 430348 430031 430017 430008 429793 429386 428967
60587 428967 428746 428749 428812 428831 428862 428869 428677 428441 428875 430632 433525 436662 439270 441155 442575 444015 445982 448581
60569 448581 451367 453914 456380 459105 461817 463774 464677 464938 464996 464936 464868 465203 466307 468288 471191 474933
$$ packed form
60678D63061J880J615J724K015K506L024L070K478J865J947K533K699K068J361
60664D93846J447K273L042L214K936K621K482K485K488K318J867J130O5j377l042
60649E17795m512n546o301o944p215o794n895m998m158l148k198j911k343k843
60635D52989l033l260l700l778l060k186k111k769l205k926k308j746j190p17
60621D17000q47j809k873k946j758j82O39L80k97n69l50j87l32l51J70R29J349
60604D07966J438J686K289K970L504L826L669K683J103j95n91l17j4rk15m07m19
60587D28967k21LO3J9L1Pj92k36M34J757K893L137K608J885J420J440J967K599
60569D48581K786K547K466K725K712J957R03K61N8o0o8L35J104J981K903L742
$$ plain form
60553 474933 478942 482474 485644 489655 495611 503515 512844 523676 536710 552510 571316 593537 619874
60540 619874 650901 686872 727949 774376 826413 884220 947527 1014978 1083745 1150007 1209757
60529 1209757 1259114 1294362 1312526 1312249 1294044 1259921 1213172 1158293 1100235 1043048 989108 939554
60517 939554 895063 856067 822631 794628 771993 754599 741886 732962 727288 725210 727631 735123
60505 735123 747475 764230 785524 812200 845215 885218 932590 987298 1048331 1113481 1179807
60494 1179807 1243966 1301936 1349097 1381516 1397475 1397719 1384591 1361411 1332359 1302088 1274940 1254512
60482 1254512 1243656 1244362 1257591 1283695 1322996 1375529 1440115 1513954 1592896 1671504 1742925 1799792
60470 1799792 1836092 1848252 1834678 1795286 1732077 1649623 1554055 1451412 1346957 1245338 1150350
$$ packed form
60553D74933M009L532L170M011N956P904R329J0832J3034J5800J8806K2221K6337
60540F19874L1027L5971M1077M6427N2037N7807O3307O7451O8767O6262N9750
60529A209757M9357L5248J8164k77j8205l4123m6749n4879n8058n7187n3940m9554
60517I39554m4491l8996l3436k8003k2635j7394j2713q924n674k078K421P492
60505G35123J2352J6755K1294K6676L3015M0003M7372N4708O1033O5150O6326
60494A179807O4159N7970M7161L2419J5959K44j3128k3180k9052l0271k7148k0428
60482A254512j0856P06J3229K6104L9301N2533O4586P3839P8942P8608P1421N6867
60470A799792L6300J2160j3574l9392o3209q2454r5568j02643j04455j01619r4988
$$ plain form
60459 1150350 1064261 987675 920117 860732 808656 763236 723995 690255 660985 635202 612431
60448 612431 592561 575488 561148 549676 541113 534970 530305 526161 521923 517579 513948 512233 512802
60435 512802 514579 516126 517152 518396 520188 521826 522438 521859 520445 518546 516422 514205 511662 508373 504500
60420 504500 501055 499090 498759 499447 500616 502202 504329 506983 510140 514065 519350 526508 535439 545430 555833
60405 555833 566627 578115 590308 603005 616425 631188 647478 664589 681525 697789 713433
60394 713433 728599 743155 756524 767808 776442 782875 788226 793055 796909 799301 800693 802068 803821
60381 803821 805506 806503 806516 805603 804141 802677 801518 800484 799249 797697 795716 792961 789312 785389 782124
60366 782124 779874 778295 776961 775639 774100 772224 770390 769206 768640 767822 765949 763138 760239 758067 756996
$$ packed form
60459A150350q6089p6586o7558n9385n2076m5420l9241l3740k9270k5783k2771
60448F12431j9870j7073j4340j1472q563o143m665m144m238m344l631j715N69
60435E12802J777J547J026J244J792J638O12n79j414j899k124k217k543l289l873
60420E04500l445j965l31O88J169J586K127K654L157L925N285P158Q931R991J0403
60405E55833J0794J1488J2193J2697J3420J4763J6290J7111J6936J6264J5644
60394G13433J5166J4556J3369J1284Q634O433N351M829L854K392J392J375J753
60381H03821J685R97J3r13j462j464j159j034j235j552j981k755l649l923l265
60366G82124k250j579j334j322j539j876j834j184n66q18j873k811k899k172j071
$$ plain form
60351 756996 756996 757700 758461 758552 757510 755356 752483 749153 745039 739514 732520 724908 717625 710864 704313 697977
60335 697977 692205 687099 682523 678584 675472 672737 669383 664904 659698 654232 648328 641634 634383 627301
60321 627301 621015 615805 611591 607906 604132 600056 596006 592289 588868 585754 583286 581710 580865 580598 581144
60306 581144 582749 585300 588751 593542 600050 607925 616434 625331 634890 645267 656154 666794 675840
60293 675840 681570 682942 680386 675059 667547 658035 647519 637813 630106 624275 619836 616838 615383 615057
60279 615057 615440 616723 619221 622634 626394 630474 635235 640664 646415 652631 660132 669549 680631 692556
60265 692556 704635 716567 728425 740768 754555 770469 788148 806291 823772 840570 857405
60254 857405 874479 890880 905427 917917 929258 940440 951738 963016 974513 987048 1001502
$$ packed form
60351G56996%P04P61R1j042k154k873l330m114n525o994p612p283o761o551o336
60335F97977n772n106m576l939l112k735l354m479n206n466n904o694p251p082
60321F27301o286n210m214l685l774m076m050l717l421l114k468j576q45k67N46
60306E81144J605K551L451M791O508P875Q509Q897R559J0377J0887J0640R046
60293F75840N730J372k556n327p512r512j0516r706p707n831m439k998j455l26
60279F15057L83J283K498L413L760M080M761N429N751O216P501R417J1082J1925
60265F92556J2079J1932J1858J2343J3787J5914J7679J8143J7481J6798J6835
60254H57405J7074J6401J4547J2490J1341J1182J1298J1278J1497J2535J4454
$$ plain form
60243 1001502 1018303 1037401 1058653 1082232 1108681 1138545 1171992 1208928 1249481 1294163 1343432
60232 1343432 1397198 1454945 1516337 1581600 1651290 1725575 1803742 1884455 1966684 2050276 2135351
60221 2135351 2221108 2305512 2386282 2461925 2531593 2594290 2648742 2694084 2730272 2757683 2776536
60210 2776536 2786958 2789416 2784842 2774338 2759029 2740209 2719311 2697477 2675279 2653187 2632301 2614389
60198 2614389 2601094 2593412 2592072 2598127 2612800 2636771 2669891 2711626 2761603 2819709 2885758 2958965
60186 2958965 3037552 3118928 3200381 3279544 3354060 3421220 3478447 3524211 3558056 3579706 3588500
60175 3588500 3583804 3565543 3534042 3489602 3432516 3363469 3283998 3196821 3105683 3014365 2925565
60164 2925565 2840976 2762431 2692332 2632507 2583143 2543469 2513343 2493649 2485151 2487420 2498956 2517962
$$ packed form
60243A001502J6801J9098K1252K3579K6449K9864L3447L6936M0553M4682M9269
60232A343432N3766N7747O1392O5263O9690P4285P8167Q0713Q2229Q3592Q5075
60221B135351Q5757Q4404Q0770P5643O9668O2697N4452M5342L6188K7411J8853
60210B776536J0422K458m574j0504j5309j8820k0898k1834k2198k2092k0886j7912
60198B614389j3295p682j340O055J4673K3971L3120M1735M9977N8106O6049P3207
60186B958965P8587Q1376Q1453P9163P4516O7160N7227M5764L3845K1650Q794
60175C588500m696j8261l1501m4440n7086o9047p9471q7177r1138r1318q8800
60164B925565q4589p8545p0099n9825m9364l9674l0126j9694q498K269J1536J9006
$$ plain form
60152 2517962 2542864 2572295 2604700 2637959 2669482 2696869 2718426 2733056 2739980 2738861 2729929 2713645
60140 2713645 2690440 2661229 2627949 2593016 2558194 2524507 2493240 2466338 2445544 2431639 2424871
60129 2424871 2425748 2434997 2453102 2480460 2517964 2567054 2629139 2705202 2795919 2901788 3023038
60118 3023038 3159575 3311148 3477360 3657372 3849592 4051701 4260870 4473922 4687350
60109 4687350 4897342 5099798 5290395 5464806 5619135 5750268 5855785 5933569 5981775 5999404
60099 5999404 5986780 5945196 5876099 5780954 5662001 5522775 5367579 5200558 5025535 4846456
60089 4846456 4667504 4492585 4324878 4166901 4020767 3888272 3770919 3669963 3586332 3520456
60079 3520456 3472288 3441513 3427614 3429759 3446790 3477351 3519749 3571561 3629587 3690464 3751296
$$ packed form
60152B517962K4902K9431L2405L3259L1523K7387K1557J4630O924j119q932j6284
60140B713645k3205k9211l3280l4933l4822l3687l1267k6902k0794j3905o768
60129B424871Q77R249J8105K7358L7504M9090O2085P6063R0717J05869J21250
60118C023038J36537J51573J66212J80012J92220K02109K09169K13052K13428
60109D687350K09992K02456J90597J74411J54329J31133J05517P7784M8206J7629
60099E999404j2624m1584o9097r5145j18953j39226j55196j67021j75023j79079
60089D846456j78952j74919j67707j57977j46134j32495j17353j00956q3631o5876
60079C520456m8168l0775j3899K145J7031L0561M2398N1812N8026O0877O0832
$$ plain form
60068 3751296 3809579 3862608 3907279 3940621 3960572 3966283 3957823 3935712 3900686 3853680 3795749 3727884
60056 3727884 3650975 3566079 3474720 3378857 3280620 3182055 3085061 2991437 2902919 2821080 2747057
60045 2747057 2681433 2624625 2577459 2541119 2516411 2503443 2502264 2513537 2538019 2575476 2624618
60034 2624618 2684161 2753444 2831681 2916895 3005914 3095321 3182173 3263969 3338359 3403228 3457012
60023 3457012 3498702 3527376 3541952 3541731 3527139 3499401 3459287 3406656 3341691 3266239 3183377 3095968
60011 3095968 3006317 2917025 2831132 2751100 2678278 2613628 2558355 2513450 2479214 2455729 2443330
60000 2443330 2442200 2452012 2472620 2504739 2549216 2605828 2673382 2750975 2838536 2936102 3043041
59989 3043041 3157958 3278820 3402881 3526741 3646634 3758664 3859160 3945341 4015731 4069639
$$ packed form
60068C751296N8283N3029M4671L3342J9951N711q460k2111l5026m7006n7931o7865
60056C727884p6909q4896r1359r5863r8237r8565r6994r3624q8518q1839p4023
60045B747057o5624n6808m7166l6340k4708j2968j179J1273K4482L7457M9142
60034B624618N9543O9283P8237Q5214Q9019Q9407Q6852Q1796P4390O4869N3784
60023C457012M1690K8674J4576k21j4592k7738m0114n2631o4965p5452q2862q7409
60011C095968q9651q9292q5893q0032p2822o4650n5273m4905l4236k3485j2399
60000B443330j130R812K0608L2119M4477N6612O7554P7593Q7561R7566J06939
59989C043041J14917J20862J24061J23860J19893J12030J00496Q6181P0390N3908
$$ plain form
59979 4069639 4106300 4124837 4124846 4106467 4069892 4015388 3944103 3858543 3762215 3659070 3553200 3448381
59967 3448381 3347614 3253316 3167968 3094022 3032931 2984775 2949207 2926421 2916964 2921017 2938266
59956 2938266 2968151 3009757 3061737 3122714 3191602 3267095 3347055 3428928 3510709 3591035 3668355
59945 3668355 3740550 3805563 3862136 3909819 3948563 3978486 3999819 4012911 4018368 4017317 4011435 4002739
59933 4002739 3993382 3985601 3981714 3984197 3995874 4019844 4058874 4114707 4188178 4279986 4391165 4522712
59921 4522712 4674932 4847162 5037825 5244490 5463849 5691560 5921854 6147253 6359086
59912 6359086 6548796 6709050 6833818 6917950 6957349 6950006 6897014 6802602 6673142 6515857
59902 6515857 6338052 6147120 5950702 5756309 5570336 5397252 5239623 5098831 4975854
$$ packed form
59979D069639L6661J8537Rj8379l6575n4504p1285q5560r6328j03145j05870j04819
59967C448381j00767r4298q5348p3946o1091m8156l5568k2786r457M053J7249
59956B938266K9885M1606N1980O0977O8888P5493P9960Q1873Q1781Q0326P7320
59945C668355P2195O5013N6573M7683L8744K9923K1333J3092N457j051n882q696
59933D002739r357p781l887K483J1677K3970L9030N5833P3471R1808J11179J31547
59921D522712J52220J72230J90663K06665K19359K27711K30294K25399K11833
59912F359086J89710J60254J24768Q4132L9399p343n2992r4412j29460j57285
59902F515857j77805j90932j96418j94393j85973j73084j57629j40792j22977
$$ plain form
59893 4975854 4871725 4787567 4724317 4682425 4661877 4662591 4684690 4728343 4793414 4879491 4986188
59882 4986188 5113063 5258812 5420171 5591439 5764975 5932241 6084644 6214036 6313320 6377453
59872 6377453 6404263 6394254 6349537 6272922 6167861 6038747 5890815 5729522 5559877 5386003
59862 5386003 5211025 5037370 4867380 4703703 4549101 4406044 4276640 4162791 4066033 3987157
59852 3987157 3926278 3883347 3858431 3851337 3861239 3886903 3927189 3981125 4047523 4124658 4210261 4301685
59840 4301685 4396136 4490940 4583481 4670681 4748521 4812325 4857722 4881364 4881087 4856176 4808126 4741012
59828 4741012 4660512 4572129 4480064 4387211 4295335 4204882 4115102 4024964 3934116 3842982 3752362
59817 3752362 3663405 3577765 3497158 3422540 3354021 3291536 3235151 3184536 3138599 3095938 3055400
$$ packed form
59893D975854j04129q4158o3250m1892k0548P14K2099M3653O5071Q6077J06697
59882D986188J26875J45749J61359J71268J73536J67266J52403J29392R9284O4133
59872F377453K6810j0009m4717p6615j05061j29114j47932j61293j69645j73874
59862E386003j74978j73655j69990j63677j54602j43057j29404j13849r6758p8876
59852C987157o0879m2931k4916p094R902K5664M0286N3936O6398P7135Q5603R1424
59840D301685R4451R4804R2541Q7200P7840O3804M5397K3642k77k4911m8050o7114
59828D741012q0500q8383r2065r2853r1876r0453q9780r0138r0848r1134r0620
59817C752362q8957q5640q0607p4618o8519o2485n6385n0615m5937m2661m0538
$$ plain form
59806 3055400 3016003 2976793 2937370 2898405 2861162 2826508 2794790 2766602 2743206 2726019 2716063
59795 2716063 2714114 2721196 2738742 2768376 2811624 2869803 2944205 3036480 3148696 3282759 3439778
59784 3439778 3619991 3822691 4045088 4280490 4517499 4741018 4934189 5080550 5166829 5186199
59774 5186199 5140147 5037410 4890907 4714870 4523097 4327738 4138277 3961190 3800427 3658107
59764 3658107 3535011 3430976 3345268 3276791 3224086 3185364 3158712 3142399 3135117 3135964 3144124 3158636
59752 3158636 3178791 3204716 3237171 3276494 3322110 3373420 3430945 3496172 3570406 3654191 3747816
59741 3747816 3851909 3967416 4095316 4236550 4392144 4563333 4751550 4958067 5183557
59732 5183557 5428271 5692884 5978645 6285990 6612970 6955439 7308445 7666557 8022841
$$ packed form
59806C055400l9397l9210l9423l8965l7243l4654l1718k8188k3396j7187r956
59795B716063j949P082J7546K9634M3248N8179P4402R2275J12216J34063J57019
59784C439778J80213K02700K22397K35402K37009K23519J93171J46361Q6279J9370
59774E186199m6052j02737j46503j76037j91773j95359j89461j77087j60763j42320
59764C658107j23096j04035q5708o8477n2705l8722k6652j6313p282Q47Q160J4512
59752C158636K0155K5925L2455L9323M5616N1310N7525O5227P4234Q3785R3625
59741C747816J04093J15507J27900J41234J55594J71189J88217K06517K25490
59732E183557K44714K64613K85761L07345L26980L42469L53006L58112L56284
$$ plain form
59723 8022841 8368778 8696314 9000157 9278099 9529968 9757195 9963293 10153959 10336152
59714 10336152 10516872 10702157 10896235 11100865 11315342 11537144 11762597 11987082 12205068
59705 12205068 12410479 12597513 12761467 12899042 13008105 13087425 13136888 13157912 13153565 13128305
59695 13128305 13087747 13038359 12986909 12939952 12903958 12885671 12891766 12927923 12998474 13106965 13256570
59684 13256570 13449742 13687865 13971449 14300081 14671541 15081114 15522088 15986506 16464643
59675 16464643 16943622 17406998 17835953 18210978 18513196 18725668 18835120 18833632 18719590 18497676
59665 18497676 18178154 17775797 17308728 16797146 16261546 15720564 15189223 14677918 14191648
59656 14191648 13729191 13283228 12842229 12393431 11925619 11431577 10910323 10367880 9815222
$$ packed form
59723H022841L45937L27536L03843K77942K51869K27227K06098J90666J82193
59714A0336152J80720J85285J94078K04630K14477K21802K25453K24485K17986
59705A2205068K05411J87034J63954J37575J09063P9320M9463K1024m347k5260
59695A3128305m0558m9388n1450m6957l5994j8287O095L6157P0551J08491J49605
59684A3256570J93172K38123K83584L28632L71460M09573M40974M64418M78137
59675A6464643M78979M63376M28955L75025L02218K12472J09452j488j14042k21914
59665A8497676l19522m02357m67069n11582n35600n40982n31341n11305m86270
59656A4191648m62457m45963m40999m48798m67812m94042n21254n42443n52658
$$ plain form
59647 9815222 9264488 8726252 8208920 7718779 7259632 6832845 6438381 6075703 5743673
59638 5743673 5440380 5163871 4912832 4686113 4481861 4297833 4132516 3985344 3855754
59629 3855754 3742512 3644065 3558982 3485779 3422711 3368155 3321012 3280438 3245225 3213670 3184033
59618 3184033 3155040 3126080 3097115 3068324 3039609 3010380 2979790 2947113 2911781 2873314 2831529
59607 2831529 2786896 2740529 2693726 2647636 2603252 2561407 2522588 2486888 2454235 2424515 2397360
59596 2397360 2372050 2347876 2324582 2302324 2281364 2262033 2244827 2230179 2218185 2208819 2202457 2199803
59584 2199803 2201226 2206423 2214856 2226210 2240306 2256936 2276013 2297697 2322148 2349386 2379543 2412949
59572 2412949 2449721 2489671 2533075 2581235 2635639 2696581 2763192 2834869 2912040 2995248 3084099
$$ packed form
59647I815222n50734n38236n17332m90141m59147m26787l94464l62678l32030
59638E743673l03293k76509k51039k26719k04252j84028j65317j47172j29590
59629C855754j13242r8447q5083p3203o3068n4556m7143m0574l5213l1555k9637
59618C184033k8993k8960k8965k8791k8715k9229l0590l2677l5332l8467m1785
59607B831529m4633m6367m6803m6090m4384m1845l8819l5700l2653k9720k7155
59596B397360k5310k4174k3294k2258k0960j9331j7206j4648j1994r366o362k654
59584B199803J423N197Q433J1354J4096J6630J9077K1684K4451K7238L0157L3406
59572B412949L6772L9950M3404M8160N4404O0942O6611P1677P7171Q3208Q8851
$$ plain form
59561 3084099 3177755 3276243 3380733 3492401 3611363 3736819 3867894 4004017 4144513 4288180
59551 4288180 4433485 4579037 4723580 4865416 5001935 5129605 5244054 5340129 5412714 5458558
59541 5458558 5477690 5472777 5446995 5402679 5341735 5266432 5179211 5082084 4976843 4865784 4751869
59530 4751869 4638241 4527989 4424266 4330114 4247931 4179469 4126567 4091578 4076750 4083487 4112649
59519 4112649 4165404 4243108 4346084 4472925 4621127 4787818 4969219 5159580 5351303 5536158
59509 5536158 5705999 5852621 5968067 6045906 6082064 6074360 6022048 5926584 5792480 5626488
59499 5626488 5435859 5227776 5010022 4790858 4577440 4374572 4185195 4011527 3855347
59490 3855347 3717664 3598868 3499295 3419310 3358831 3317123 3293222 3286525 3296919 3324340 3368084
$$ packed form
59561C084099R3656R8488J04490J11668J18962J25456J31075J36123J40496J43667
59551D288180J45305J45552J44543J41836J36519J27670J14449R6075P2585M5844
59541E458558J9132m913k5782m4316o0944p5303q7221r7127j05241j11059j13915
59530D751869j13628j10252j03723r4152q2183o8462n2902l4989j4828O737K9162
59519D112649N2755P7704J02976J26841J48202J66691J81401J90361J91723J84855
59509E536158J69841J46622J15446P7839L6158p704n2312r5464j34104j65992
59499E626488j90629k08083k17754k19164k13418k02868j89377j73668j56180
59490C855347j37683j18796r9573p9985o0479m1708k3901o697J0394K7421M3744
$$ plain form
59479 3368084 3426550 3497752 3580048 3672140 3772280 3877685 3984873 4090296 4190488 4281700
59469 4281700 4359687 4419999 4458737 4473421 4463328 4428816 4370397 4288819 4186092 4065855 3932340
59458 3932340 3789273 3640075 3488459 3337914 3190601 3047358 2908828 2776056 2649976
59449 2649976 2531064 2419843 2317142 2223384 2137978 2059934 1988858 1924904 1867855 1816832 1770930
59438 1770930 1729780 1693402 1661856 1635199 1613451 1596408 1583592 1574519 1568901 1566571 1567499 1572024
59426 1572024 1580786 1594154 1611772 1632696 1655585 1678409 1698337 1712681 1720332 1722265 1720773 1718479
59414 1718479 1717816 1720670 1728101 1740567 1758432 1781726 1809111 1837513 1863386 1884512 1900794 1913919
59402 1913919 1926662 1942026 1962273 1988531 2021328 2061112 2107906 2161007 2219787 2284762 2357274
$$ packed form
59479C368084N8466P1202Q2296R2092J00140J05405J07188J05423J00192R1212
59469D281700P7987O0312L8738J4684j0093l4512n8419q1578j02727j20237j33515
59458C932340j43067j49198j51616j50545j47313j43243j38530j32772j26080
59449B649976j18912j11221j02701r3758q5406p8044p1076o3954n7049n1023m5902
59438A770930m1150l6378l1546k6657k1748j7043j2816r073n618k330R28M525
59426A572024Q762J3368J7618K0924K2889K2824J9928J4344P651J933j492k294
59414A718479o63K854P431J2466J7865K3294K7385K8402K5873K1126J6282J3125
59402A913919J2743J5364K0247K6258L2797L9784M6794N3101N8780O4975P2512
$$ plain form
59391 2357274 2438163 2527308 2624459 2729830 2843703 2965961 3096212 3233821 3377621 3526118
59381 3526118 3678508 3835434 3998777 4171243 4356283 4557727 4778801 5021509 5287073
59372 5287073 5576492 5890064 6226263 6581151 6948604 7321003 7690272 8049102 8391664
59363 8391664 8713555 9011578 9283836 9529686 9749146 9942270 10108874 10248184 10358262
59354 10358262 10435887 10477113 10477592 10432352 10336227 10185450 9979009 9718478 9407405 9051753
59344 9051753 8660593 8245299 7817573 7388159 6966640 6561166 6177834 5820541 5491364
59335 5491364 5190618 4916746 4667055 4438961 4230283 4038487 3860518 3693889 3537581
59326 3537581 3391580 3255816 3129744 3012662 2904115 2804078 2712744 2629919 2554632 2485689
$$ packed form
59391B357274Q0889Q9145R7151J05371J13873J22258J30251J37609J43800J48497
59381C526118J52390J56926J63343J72466J85040K01444K21074K42708K65564
59372E287073K89419L13572L36199L54888L67453L72399L69269L58830L42562
59363H391664L21891K98023K72258K45850K19460J93124J66604J39310J10078
59354A0358262P7625M1226M79m5240r6125j50777k06441k60531l11073l55652
59344I051753l91160m15294m27726m29414m21519m05474l83332l57293l29177
59335E491364l00746k73872k49691k28094k08678j91796j77969j66629j56308
59326C537581j46001j35764j26072j17082j08547j00037r1334q2825p5287o8943
$$ plain form
59316 2485689 2422530 2365097 2312865 2264678 2219790 2178567 2141775 2109608 2081787 2058177 2038866
59305 2038866 2023870 2013253 2007391 2006762 2011651 2022383 2039626 2063994 2095396 2133066 2175993 2222753
59293 2222753 2270883 2317028 2358289 2393734 2424863 2454880 2487283 2524520 2567448 2615752 2668628
59282 2668628 2724904 2782763 2839784 2893371 2941039 2980454 3009577 3026868 3031148 3021400 2997206 2959557
59270 2959557 2910798 2853458 2789306 2719667 2646165 2570610 2494338 2418210 2343241 2270693 2201387
59259 2201387 2135402 2072716 2013781 1959127 1908773 1862584 1821005 1784883 1754489 1729237 1708541
59248 1708541 1692478 1681277 1674537 1671394 1671299 1674308 1680724 1690857 1705059 1723616 1746499 1773488 1804612
59235 1804612 1840278 1880877 1926486 1977034 2032630 2093749 2161327 2236741 2321469 2416596 2522789
$$ packed form
59316B485689o3159n7433n2232m8187m4888m1223l6792l2167k7821k3610j9311
59305B038866j4996j0617n862o29M889J0732J7243K4368L1402L7670M2927M6760
59293B222753M8130M6145M1261L5445L1129L0017L2403L7237M2928M8304N2876
59282B668628N6276N7859N7021N3587M7668L9415K9123J7291M280r748k4194l7649
59270B959557m8759n7340o4152o9639p3502p5555p6272p6128p4969p2548o9306
59259B201387o5985o2686n8935n4654n0354m6189m1579l6122l0394k5252k0696
59248A708541j6063j1201o740l143r5L009O416J0133J4202J8557K2883K6989L1124
59235A804612L5666M0599M5609N0548N5596O1119O7578P5414Q4728R5127J06193
$$ plain form
59224 2522789 2640846 2772087 2918086 3080111 3258950 3455018 3668280 3897907 4141995
59215 4141995 4397412 4659543 4922009 5176849 5415280 5628552 5808307 5946660 6036793 6074166
59205 6074166 6057351 5987656 5868181 5703670 5501182 5270075 5020547 4761976 4502417 4248805
59195 4248805 4006581 3779035 3567640 3373321 3197110 3039592 2900408 2778705 2673729
59186 2673729 2584637 2510170 2449067 2400717 2364936 2341101 2327853 2323697 2327461 2338046 2353907 2372846
59174 2372846 2392100 2408507 2418978 2421188 2413916 2396600 2368733 2329995 2281072 2224064 2161734 2096296
59162 2096296 2029025 1960984 1893779 1829350 1769138 1713702 1663042 1617024 1575371 1537576 1503103
59151 1503103 1471705 1443543 1419013 1398399 1381499 1367583 1356024 1347061 1341621 1340095 1341589 1344761
$$ packed form
59224B522789J18057J31241J45999J62025J78839J96068K13262K29627K44088
59215D141995K55417K62131K62466K54840K38431K13272J79755J38353R0133L7373
59205F074166j6815o9695j19475j64511k02488k31107k49528k58571k59559k53612
59195D248805k42224k27546k11395j94319j76211j57518j39184j21703j04976
59186B673729q9092p4467o1103m8350l5781k3835j3248m156L764J0585J5861J8939
59174B372846J9254J6407J0471K210p272j7316k7867l8738m8923n7008o2330o5438
59162B096296o7271o8041o7205o4429o0212n5436n0660m6018m1653l7795l4473
59151A503103l1398k8162k4530k0614j6900j3916j1559q963n440j526J494L172
$$ plain form
59139 1344761 1349273 1355865 1365024 1376125 1388078 1400263 1412414 1423927 1433979 1442262 1449168 1455262
59127 1455262 1460982 1466863 1473385 1480395 1487199 1493670 1500899 1510247 1521971 1535237 1549292 1564077 1579784
59114 1579784 1596419 1613975 1632544 1652047 1672139 1692496 1712957 1733343 1753469 1773337 1792993
59103 1792993 1812213 1830867 1849601 1869557 1891292 1914657 1939976 1968539 2001428 2038590 2079742
59092 2079742 2125423 2176185 2231140 2288376 2346609 2405366 2463542 2518838 2568824 2611590 2645051
59081 2645051 2666676 2674645 2668780 2649768 2618052 2574140 2519613 2457015 2388745 2316492 2241665 2165857
59069 2165857 2090759 2017854 1948219 1882407 1820511 1762478 1708355 1658138 1611509 1567915 1526930
59058 1526930 1488508 1452920 1420419 1390847 1363602 1338179 1314746 1293912 1275940 1260427 1246799
$$ packed form
59139A344761M512O592R159J1101J1953J2185J2151J1513J0052Q283O906O094
59127A455262N720N881O522P010O804O471P229R348J1724J3266J4055J4785J5707
59114A579784J6635J7556J8569J9503K0092K0357K0461K0386K0126J9868J9656
59103A792993J9220J8654J8734J9956K1735K3365K5319K8563L2889L7162M1152
59092B079742M5681N0762N4955N7236N8233N8757N8176N5296M9986M2766L3461
59081B645051K1625P969n865j9012l1716m3912n4527o2598o8270p2253p4827p5808
59069B165857p5098p2905o9635o5812o1896n8033n4123n0217m6629m3594m0985
59058A526930l8422l5588l2501k9572k7245k5423k3433k0834j7972j5513j3628
$$ plain form
59047 1246799 1234737 1223924 1213713 1203387 1192624 1181479 1169989 1157962 1145185 1131781 1118423
59036 1118423 1106150 1095760 1087376 1080733 1075830 1072982 1072249 1073204 1075375 1078557 1082537 1086943 1091696 1097340
59022 1097340 1104482 1112969 1121986 1131026 1140538 1151527 1164567 1179323 1195121 1211963 1230733 1252264
59010 1252264 1276492 1302856 1331350 1362747 1397942 1437583 1482264 1532288 1587039 1645193 1705828
58999 1705828 1768709 1833033 1896380 1955455 2007559 2050930 2084057 2105522 2114609 2111734 2098170 2075567
58987 2075567 2045665 2010201 1970898 1929435 1887164 1844839 1802916 1762124 1723293 1686522 1651099
58976 1651099 1616662 1584027 1554475 1528556 1506049 1486679 1470370 1457077 1447034 1441019 1439794 1443217
58964 1443217 1450310 1460083 1471888 1485010 1498478 1511440 1523506 1534715 1545357 1555734 1565790 1575079
$$ packed form
59047A246799j2062j0813j0211j0326j0763j1145j1490j2027j2777j3404j3358
59036A118423j2273j0390q384o643m903k848p33R55K171L182L980M406M753N644
59022A097340P142Q487R017R040R512J0989J3040J4756J5798J6842J8770K1531
59010A252264K4228K6364K8494L1397L5195L9641M4681N0024N4751N8154O0635
58999A705828O2881O4324O3347N9075N2104M3371L3127K1465R087k875j3564k2603
58987B075567k9902l5464l9303m1463m2271m2325m1923m0792l8831l6771l5423
58976A651099l4437l2635k9552k5919k2507j9370j6309j3293j0043o015j225L423
58964A443217P093R773J1805J3122J3468J2962J2066J1209J0642J0377J0056R289
$$ plain form
58952 1575079 1583414 1591535 1600785 1612129 1625653 1640969 1657842 1676478 1697406 1721067 1747510 1776715
58940 1776715 1809319 1846662 1889912 1939416 1995146 2057303 2126017 2200767 2280460 2363615 2447875
58929 2447875 2529684 2605318 2672378 2730031 2778358 2818460 2853166 2886609 2922464 2962805 3008596
58918 3008596 3060668 3119986 3187489 3264111 3350779 3448273 3557268 3678584 3813184 3961925
58908 3961925 4125495 4304488 4499255 4709828 4936281 5178877 5437276 5709621 5992829
58899 5992829 6283559 6578313 6872798 7162264 7443033 7713395 7972749 8220063 8453035
58890 8453035 8667990 8860234 9024842 9157452 9254323 9311923 9327143 9298160 9224890 9108749
58880 9108749 8952584 8760818 8538923 8292298 8025905 7744888 7454767 7160575 6866057
$$ packed form
58952A575079Q335Q121R250J1344J3524J5316J6873J8636K0928K3661K6443K9205
58940A776715L2604L7343M3250M9504N5730O2157O8714P4750P9693Q3155Q4260
58929B447875Q1809P5634O7060N7653M8327M0102L4706L3443L5855M0341M5791
58918C008596N2072N9318O7503P6622Q6668R7494J08995J21316J34600J48741
58908C961925J63570J78993J94767K10573K26453K42596K58399K72345K83208
58899E992829K90730K94754K94485K89466K80769K70362K59354K47314K32972
58890H453035K14955J92244J64608J32610R6871N7600J5220k8983p3270j16141
58880I108749j56165j91766k21895k46625k66393k81017k90121k94192k94518
$$ plain form
58871 6866057 6573852 6286048 6004458 5730857 5467230 5215367 4976069 4749193 4534636
58862 4534636 4332810 4144031 3968090 3804697 3653763 3514867 3386950 3268905 3160008
58853 3160008 3059530 2966562 2880750 2802655 2732821 2670830 2615761 2567148 2524930 2488823 2458363
58842 2458363 2433369 2413761 2399047 2388483 2381672 2378638 2379458 2384214 2393121 2406350 2423861 2445733
58830 2445733 2472368 2503981 2540120 2580186 2624262 2672937 2726444 2784372 2846108 2911106 2978745
58819 2978745 3048394 3119743 3192974 3268833 3348765 3434676 3528164 3630169 3741671 3864383 4000196
58808 4000196 4150237 4315081 4495681 4693267 4908268 5140056 5387890 5651423 5929821
58799 5929821 6220746 6520506 6824801 7128979 7427791 7715279 7984881 8229593 8442316
$$ packed form
58871F866057k92205k87804k81590k73601k63627k51863k39298k26876k14557
58862D534636k01826j88779j75941j63393j50934j38896j27917j18045j08897
58853C160008j00478r2968q5812p8095o9834o1991n5069m8613m2218l6107l0460
58842B458363k4994j9608j4714j0564o811l034Q20M756Q907J3229J7511K1872
58830B445733K6635L1613L6139M0066M4076M8675N3507N7928O1736O4998O7639
58819B978745O9649P1349P3231P5859P9932Q5911R3488J02005J11502J22712J35813
58808D000196J50041J64844J80600J97586K15001K31788K47834K63533K78398
58799E929821K90925K99760L04295L04178K98812K87488K69602K44712K12723
$$ plain form
58790 8442316 8616490 8746710 8829064 8861273 8842726 8774442 8659151 8501467 8307592 8084218
58780 8084218 7837367 7572163 7293230 7004671 6709687 6410885 6111316 5814856 5525335
58771 5525335 5245658 4978019 4724547 4487076 4266332 4061707 3871962 3695940 3532730
58762 3532730 3381619 3242136 3113910 2996286 2888229 2788876 2698085 2616156 2542955 2477631
58752 2477631 2419261 2367472 2322127 2282703 2248416 2218907 2194297 2174496 2158890 2146912 2138514
58741 2138514 2133817 2132737 2135367 2142352 2154282 2170725 2190324 2211658 2233304 2252869 2266586 2270530
58729 2270530 2262326 2241780 2210338 2170343 2124481 2075101 2023552 1970192 1915132 1858900 1802415
58718 1802415 1746552 1691964 1639212 1588818 1541225 1496981 1457096 1422994 1395896 1376363 1364504
$$ packed form
58790H442316J74174J30220Q2354L2209j8547o8284j15291j57684j93875k23374
58780H084218k46851k65204k78933k88559k94984k98802k99569k96460k89521
58771E525335k79677k67639k53472k37471k20744k04625j89745j76022j63210
58762C532730j51111j39483j28226j17624j08057r9353r0791q1929p3201o5324
58752B477631n8370n1789m5345l9424l4287k9509k4610j9801j5606j1978q398
58741B138514m697j080K630O985J1930J6443J9599K1334K1646J9565J3717L944
58729B270530q204k0546l1442l9995m5862m9380n1549n3360n5060n6232n6485
58718A802415n5863n4588n2752n0394m7593m4244l9885l4102k7098j9533j1859
$$ plain form
58707 1364504 1360329 1363554 1373062 1386870 1402659 1418064 1430436 1436740 1434063 1420400 1395201 1359570
58695 1359570 1316124 1268390 1219838 1173105 1129809 1090888 1057041 1028923 1006912 990740 979545
58684 979545 972351 968273 966115 964249 961434 957584 953284 948737 943695 938208 932653 927015 921023 915286
58670 915286 911496 910933 913250 917120 921427 925104 926316 922874 913763 899864 883015 864576 844975
58657 844975 824401 803751 784639 768303 754716 743159 733584 726666 722493 720076 718648 718716 721092
58644 721092 725371 730191 734719 739182 744079 749692 756273 763945 772167 779905 786621 792731 798943 805475
58630 805475 812139 818907 826158 834462 844259 855713 868811 883574 900042 918112 937625 958698
58618 958698 981668 1006637 1033371 1061797 1092290 1125365 1161439 1201039 1244744 1292736 1344966
$$ packed form
58707A364504m175L225R508J3808J5789J5405J2372O304k677j3663k5199l5631
58695A359570m3446m7734m8552m6733m3296l8921l3847k8118k2011j6172j1195
58684I79545p194m078k158j866k815l850m300m547n042n487n555n638n992n737
58670I15286l790n63K317L870M307L677J212l442r111j3899j6849j8439j9601
58657H44975k0574k0650j9112j6336j3587j1557r575o918m173k417j428O8K376
58644G21092M279M820M528M463M897N613O581P672Q222P738O716O110O212O532
58630H05475O664O768P251Q304R797J1454J3098J4763J6468J8070J9513K1073
58618I58698K2970K4969K6734K8426L0493L3075L6074L9600M3705M7992N2230
$$ plain form
58607 1344966 1402009 1465031 1534414 1609106 1687988 1771209 1859234 1951005 2044029 2135922 2224762
58596 2224762 2307964 2381962 2443402 2490008 2520257 2533070 2528208 2506397 2468891 2417514 2355232
58585 2355232 2285937 2213116 2139075 2065531 1994364 1927374 1865698 1809836 1759939 1715838 1676973
58574 1676973 1642578 1611906 1584382 1559786 1538160 1519178 1501668 1484101 1465414 1444852 1421331
58563 1421331 1393779 1362260 1327993 1292027 1254526 1215681 1176703 1139371 1104851 1073189 1043607
58552 1043607 1015085 987020 959669 933767 909589 886707 864719 843818 824400 806503 789885
58541 789885 774332 759633 745462 731525 717745 704310 691660 680327 670413 661316 652372 643700
58529 643700 635992 629601 624350 620131 616955 614404 611863 609534 608427 608997 610489 612057 613887 616740
$$ packed form
58607A344966N7043O3022O9383P4692P8882Q3221Q8025R1771R3024R1893Q8840
58596B224762Q3202P3998O1440M6606L0249J2813m862k1811l7506n1377o2282
58585B355232o9295p2821p4041p3544p1167o6990o1676n5862m9897m4101l8865
58574A676973l4395l0672k7524k4596k1626j8982j7510j7567j8687k0562k3521
58563A421331k7552l1519l4267l5966l7501l8845l8978l7332l4520l1662k9582
58552A043607k8522k8065k7351k5902k4178k2882k1988k0901j9418j7897j6618
58541G89885j5553j4699j4171j3937j3780j3435j2650j1333r914r097q944q672
58529F43700p708o391n251m219l176k551k541k329j107N70J492J568J830K853
$$ plain form
58515 616740 620990 626706 634103 643210 653426 664154 675734 689126 704682 721626 738689 754854
58503 754854 769510 782262 792762 800605 805451 807272 806334 802874 797132 789771 781937 774581 767903 761565
58489 761565 755154 748273 740563 731950 722786 713567 704682 696384 688655 681007 672891 664536 656862 650223
58475 650223 643607 635534 625539 614509 603845 594655 587557 582842 580745 581585 585435 591624 598871 606071
58461 606071 612693 618446 623062 626629 629659 632494 635000 637038 638759 640059 640234 638674 635711 632454
58447 632454 630037 629288 630674 633982 638172 641965 644591 645847 645781 644633 642881 640974 639111 637429 636108
58432 636108 635113 634156 633215 632703 632848 633268 633608 634288 636105 639266 643233 647425 651642 655872 660031 663967
58416 663967 667560 670907 674479 678859 684096 689497 694225 697907 700533 702122 702783 702900 702960 703236 703751 704372
$$ packed form
58515F16740M250N716P397R107J0216J0728J1580J3392J5556J6944J7063J6165
58503G54854J4656J2752J0500P843M846J821r38l460n742p361p834p356o678o338
58489G61565o411o881p710q613r164r219q885q298p729p648q116q355p674o639
58475F50223o616q073r995j1030j0664r190p098m715k097Q40L850O189P247P200
58461F06071O622N753M616L567L030K835K506K038J721J300J75j560k963l257
58447F32454k417p49J386L308M190L793K626J256o6j148j752j907j863j682j321
58432F36108r95r57r41n12J45M20L40O80J817L161L967M192M217M230M159L936
58416F63967L593L347L572M380N237N401M728L682K626J589O61J17O0K76N15O21
$$ plain form
58400 704372 704955 705631 706908 709073 711498 713075 713464 713372 713493 713813 714209 714980 716261 717527 718258 718700 719493
58383 719493 720971 723283 726675 731028 735533 739602 743958 750133 758851 769248 779627 788711 796377 803545
58369 803545 811236 819586 827966 836099 844502 853590 862929 871797 879987 887603 894593 901019 907406 914234
58355 914234 921445 928830 936450 944149 951167 956970 962119 967685 974016 980662 987228 993767 1000545 1007922
58341 1007922 1016203 1025140 1033979 1042490 1051541 1062073 1073881 1086026 1098123 1110570 1123838 1138214
58329 1138214 1153984 1171205 1189437 1208252 1227805 1248532 1270659 1294441 1320349 1348263 1376834
58318 1376834 1404305 1429726 1452887 1473559 1491480 1506663 1519007 1528095 1534114 1538513 1542958 1548034
58306 1548034 1553706 1560415 1568728 1578426 1589069 1601141 1615483 1631901 1649495 1668173 1688640 1710969
$$ packed form
58400G04372N83O76J277K165K425J577L89r2J21L20L96P71J281J266P31M42P93
58383G19493J478K312L392M353M505M069M356O175Q718J0397J0379R084P666P168
58369H03545P691Q350Q380Q133Q403R088R339Q868Q190P616O990O426O387O828
58355I14234P211P385P620P699P018N803N149N566O331O646O566O539O778P377
58341A007922Q281Q937Q839Q511R051J0532J1808J2145J2097J2447J3268J4376
58329A138214J5770J7221J8232J8815J9553K0727K2127K3782K5908K7914K8571
58318A376834K7471K5421K3161K0672J7921J5183J2344R088O019M399M445N076
58306A548034N672O709Q313R698J0643J2072J4342J6418J7594J8678K0467K2329
$$ plain form
58294 1710969 1734459 1758993 1785376 1814060 1844548 1876328 1909565 1944555 1981290 2019855 2060591
58283 2060591 2103627 2148741 2195802 2244868 2295804 2348232 2401735 2455664 2508899 2560229 2608750
58272 2608750 2653567 2693746 2729289 2761700 2792860 2823799 2855196 2888352 2924559 2964033 3006492
58261 3006492 3052306 3102067 3155628 3212806 3274527 3341970 3414955 3492501 3574543 3661723 3753885
58250 3753885 3850335 3951396 4058237 4171281 4290179 4415227 4547383 4686967 4833651 4987596
58240 4987596 5149265 5318469 5495034 5680155 5875564 6081809 6298978 6528705 6773489
58231 6773489 7034247 7310454 7602654 7912938 8243230 8595120 8971333 9375242 9808952
58222 9808952 10273882 10773129 11311214 11891855 12518560 13197286 13936089 14742451 15623901
$$ packed form
58294A710969K3490K4534K6383K8684L0488L1780L3237L4990L6735L8565M0736
58283B060591M3036M5114M7061M9066N0936N2428N3503N3929N3235N1330M8521
58272B608750M4817M0179L5543L2411L1160L0939L1397L3156L6207L9474M2459
58261C006492M5814M9761N3561N7178O1721O7443P2985P7546Q2042Q7180R2162
58250C753885R6450J01061J06841J13044J18898J25048J32156J39584J46684J53945
58240D987596J61669J69204J76565J85121J95409K06245K17169K29727K44784
58231F773489K60758K76207K92200L10284L30292L51890L76213M03909M33710
58222I808952M64930M99247N38085N80641O26705O78726P38803Q06362Q81450
$$ plain form
58213 15623901 16591278 17658456 18839168 20147770 21603636 23231734 25059615 27119228
58205 27119228 29453901 32120889 35188226 38736396 42867257 47708466 53408405 60133029
58197 60133029 68072742 77453277 88548809 101706156 117371577 136082160 158393310
58190 158393310 184753107 215334145 249788227 286903697 324290716 358386862 385046131
58183 385046131 400661900 403364363 393661359 374151195 348472748 320073890 291381602
58176 291381602 263613606 237096238 211778979 187661142 164968427 144074924 125307713
58169 125307713 108807972 94523967 82282911 71857894 63004859 55487847 49098034
58162 49098034 43656974 39009277 35020722 31582141 28607205 26024027 23770934 21797315
$$ packed form
58213A5623901R67377J067178J180712J308602J455866J628098J827881K059613
58205B7119228K334673K666988L067337L548170M130861M841209N699939O724624
58197F0133029P939713R380535J1095532J3157347J5665421J8710583K2311150
58190A58393310K6359797L0581038L4454082L7115470L7387019L4096146K6659269
58183C85046131J5615769K702463r703004j9510164k5678447k8398858k8692288
58176B91381602k7767996k6517368k5317259k4117837k2692715k0893503j8767211
58169A25307713j6499741j4284005j2241056j0425017q853035p517012o389813
58162D9098034n441060m647697l988555l438581k974936k583178k253093j973619
$$ plain form
58154 21797315 20061445 18525556 17155688 15925443 14815576 13809384 12891427 12050370
58146 12050370 11279389 10572922 9925285 9332246 8790959 8297740 7847889 7437652 7064235
58137 7064235 6724005 6412898 6128416 5868753 5629655 5404348 5187108 4975434 4768896
58128 4768896 4567980 4374326 4190082 4016181 3852328 3698652 3555827 3423452 3299753
58119 3299753 3183171 3073029 2968702 2869530 2775662 2687655 2605128 2526895 2452290 2381173 2312943
58108 2312943 2246947 2183598 2123479 2065450 2007294 1948295 1889585 1831907 1774779 1718175 1663311
58097 1663311 1611179 1561791 1515408 1473122 1435495 1401804 1371313 1344140 1320236 1298521 1277807
58086 1277807 1257736 1238235 1218846 1199203 1179519 1159999 1140323 1120060 1099102 1077441 1055182
$$ packed form
58154B1797315j735870j535889j369868j230245j109867j006192r17957q41057
58146A2050370p70981p06467o47637n93039n41287m93219m49851m10237l73417
58137G064235l40230l11107k84482k59663k39098k25307k17240k11674k06538
58128D768896k00916j93654j84244j73901j63853j53676j42825j32375j23699
58119C299753j16582j10142j04327r9172r3868q8007q2527p8233p4605p1117o8230
58108B312943o5996o3349o0119n8029n8156n8999n8710n7678n7128n6604n4864
58097A663311n2132m9388m6383m2286l7627l3691l0491k7173k3904k1715k0714
58086A277807k0071j9501j9389j9643j9684j9520j9676k0263k0958k1661k2259
$$ plain form
58075 1055182 1032945 1011513 990812 969971 948654 927688 908149 890493 874713 860545 847307
58064 847307 834265 821449 809502 798665 788654 779471 771287 763405 754465 744082 733252 722778
58052 722778 712379 701891 692189 684032 676806 669321 661238 652972 644753 636645 629084 622558 616940 611748
58038 611748 606900 602698 599371 597029 595735 595076 593951 591353 587288 582594 578037 573904 570221 566993
58024 566993 564369 562755 562576 563772 565816 568371 571524 575214 579014 582876 587602 594088 602408 612131
58010 612131 623187 635926 650567 667119 685697 706451 729279 754072 781201 811353 844825
57999 844825 881212 919803 960144 1002357 1047187 1095598 1147965 1203478 1260363 1316612 1370472
57988 1370472 1420496 1465496 1504598 1537394 1564163 1586012 1604717 1622300 1640628 1660950 1683278
$$ packed form
58075A055182k2237k1432k0701k0841k1317k0966j9539j7656j5780j4168j3238
58064H47307j3042j2816j1947j0837j0011r183q184p882q940j0383j0830j0474
58052G22778j0399j0488r702q157p226p485q083q266q219q108p561o526n618n192
58038F11748m848m202l327k342j294o59j125k598m065m694m557m133l683l228
58024E66993k624j614j79J196K044K555L153L690L800L862M726O486Q320R723
58010F12131J1056J2739J4641J6552J8578K0754K2828K4793K7129L0152L3472
57999H44825L6387L8591M0341M2213M4830M8411N2367N5513N6885N6249N3860
57988A370472N0024M5000L9102L2796K6769K1849J8705J7583J8328K0322K2328
$$ plain form
57977 1683278 1706018 1726444 1741570 1748501 1744259 1726154 1692865 1645112 1585272 1516695 1443290 1368941
57965 1368941 1296573 1227759 1163382 1104405 1051808 1006139 967511 935774 910398 890446 875081
57954 875081 863974 856846 852802 850558 849319 849028 849744 851116 852598 853916 855159 856499 857968 859512
57940 859512 861291 863985 868733 876638 888255 903516 922068 943676 968355 996188 1026802 1058906
57928 1058906 1090350 1118696 1141752 1157612 1164430 1160429 1144343 1116028 1076836 1029463 977288 923635
57916 923635 871280 822121 777016 736065 699384 667577 641230 620017 602701 588099 575877
57905 575877 566432 560290 557597 557694 558916 559036 556241 549742 539587 526261 510695 494286 478493 464339
57891 464339 452365 442878 435970 431336 428350 426463 425470 425431 426453 428629 432109 437089 443704 451980 461889
$$ packed form
57977A683278K2740K0426J5126O931m242j8105l3289m7753n9840o8577p3405p4349
57965A368941p2368o8814o4377n8977n2597m5669l8628l1737k5376j9952j5365
57954H75081j1107p128m044k244j239k91P16J372J482J318J243J340J469J544
57940H59512J779K694M748P905J1617J5261J8552K1608K4679K7833L0614L2104
57928A058906L1444K8346K3056J5860O818m001j6086k8315l9192m7373n2175n3653
57916I23635n2355m9159m5105m0951l6681l1807k6347k1213j7316j4602j2222
57905E75877r445o142k693R7J222J20k795o499j0155j3326j5566j6409j5793j4154
57891D64339j1974r487o908m634k986j887r93l9J022K176L480M980O615Q276R909
$$ plain form
57876 461889 473274 485575 497831 509214 519532 528927 537162 543665 548303 551563 553713 554291 552748
57863 552748 549145 543838 536975 528831 520091 511082 501170 489829 478074 467778 459591 452509 445677
57850 445677 439595 435181 432579 431465 431774 433402 435757 438331 441419 445601 450674 455628 459505 461869
57836 461869 462662 462168 461028 459799 458375 456129 452675 448350 444017 440542 438354 437341 437244 438241 440887
57821 440887 445413 451418 458554 467243 478343 492239 508600 526905 546779 567785 589187 610149
57809 610149 630216 649731 669943 692616 719311 750944 787864 830023 876761 926403 976235
57798 976235 1022932 1063118 1093707 1112014 1115973 1104815 1079845 1044284 1001779 954893 905088 853730
57786 853730 802456 752549 704664 659329 617159 578350 542529 509470 479531 453009 429495
$$ packed form
57876D61889J1385J2301J2256J1383J0318R395Q235O503M638L260K150N78j543
57863E52748l603n307o863q144q740r009r912j1341j1755j0296q187p082o832
57850D45677o082m414k602j114L09J628K355K574L088M182N073M954L877K364
57836D61869P93m94j140j229j424k246l454m325m333l475k188j013r7R97K646
57821D40887M526O005P136Q689J1100J3896J6361J8305J9874K1006K1402K0962
57809F10149K0067J9515K0212K2673K6695L1633L6920M2159M6738M9642M9832
57798I76235M6697M0186L0589J8307L959j1158k4970l5561m2505m6886m9805n1358
57786H53730n1274m9907m7885m5335m2170l8809l5821l3059k9939k6522k3514
$$ plain form
57775 429495 408243 388870 371378 355871 342625 332020 323925 317423 311622 306459 302280 298917 295779
57762 295779 292650 289807 287437 285489 284086 283544 283877 284717 285856 287515 289974 293224 297118 301638 306937
57747 306937 313283 320989 330206 340769 352328 364531 376927 388747 399010 406808 411467 412656 410636
57734 410636 406300 400681 394524 388421 383069 379023 376300 374604 373862 374189 375408 377046 378925 381405 384953
57719 384953 389613 394920 400156 404799 409029 413814 420173 428249 437245 446291 455213 464541 475077 487453
57705 487453 501817 517779 534793 552653 571548 591739 613476 637182 663422 692582 724772
57694 724772 760191 799368 842963 891463 945243 1004777 1070598 1143095 1222458 1308771 1401957
57683 1401957 1501483 1606230 1714797 1826001 1938948 2052571 2165275 2275197 2380863 2481775
$$ packed form
57775D29495k1252j9373j7492j5507j3246j0605q095o502n801n163m179l363l138
57762B95779l129k843k370j948j403n42L33Q40J139J659K459L250L894M520N299
57747C06937O346P706R217J0563J1559J2203J2396J1820J0263P798M659J189k020
57734D10636m336n619o157o103n352m046k723j696p42L27J219J638J879K480L548
57719C84953M660N307N236M643M230M785O359Q076Q996R046Q922R328J0536J2376
57705D87453J4364J5962J7014J7860J8895K0191K1737K3706K6240K9160L2190
57694G24772L5419L9177M3595M8500N3780N9534O5821P2497P9363Q6313R3186
57683A401957R9526J04747J08567J11204J12947J13623J12704J09922J05666J00912
$$ plain form
57673 2481775 2578886 2674859 2773516 2878133 2989310 3103335 3210958 3296804 3341290 3326571
57663 3326571 3244127 3098756 2906258 2687209 2461036 2242452 2040340 1858785 1699131 1561211
57653 1561211 1443318 1342475 1255968 1182491 1121354 1071021 1029149 993890 964582 941221 923655
57642 923655 911193 902749 897603 896157 899388 907260 918400 931915 948776 970613 997832 1029948
57630 1029948 1067121 1109962 1158087 1210268 1266104 1326272 1390940 1459213 1530463 1604790 1681401
57619 1681401 1757542 1829885 1896229 1955033 2003989 2040045 2060671 2064564 2051517 2022346 1978811
57608 1978811 1923037 1857047 1783013 1703572 1621383 1538512 1456495 1376678 1300155 1227634 1159708
57597 1159708 1096936 1039354 986240 936788 890789 848384 809447 773577 740464 709950 681963
$$ packed form
57673B481775R7111R5973R8657J04617J11177J14025J07623Q5846M4486j4719
57663C326571q2444j45371j92498k19049k26173k18584k02112j81555j59654j37920
57653A561211j17893j00843q6507p3477o1137n0333m1872l5259k9308k3361j7566
57642I23655j2462q444n146j446L231P872J1140J3515J6861K1837K7219L2116
57630A029948L7173M2841M8125N2181N5836O0168O4668O8273P1250P4327P6611
57619A681401P6141P2343O6344N8804M8956L6056K0626L893j3047k9171m3535
57608A978811n5774o5990p4034p9441q2189q2871q2017p9817p6523p2521o7926
57597A159708o2772n7582n3114m9452m5999m2405l8937l5870l3113l0514k7987
$$ plain form
57586 681963 656647 634191 614197 595577 577446 559840 543250 527909 513964 501873 491938 483753
57574 483753 476732 470888 466431 462828 459128 455191 451812 449537 448103 447260 447392 448859 451228 453670 455842
57559 455842 458010 460476 463290 466412 469838 473567 477648 482293 487813 494409 502065 510691 520356 531359
57545 531359 543989 558181 573590 590112 608194 628413 650997 676099 704384 736742 773237
57534 773237 812862 854741 899282 947668 1000378 1056714 1115730 1176980 1239959 1303201 1364450
57523 1364450 1421622 1473200 1517690 1553244 1578055 1590911 1591199 1578715 1553871 1517973 1472990 1421051
57511 1421051 1364201 1304404 1243379 1182525 1123215 1066922 1014608 966049 920316 877064 836984
57500 836984 800953 769124 741035 716207 694375 675355 658952 644945 633167 623748 617134 613495
$$ packed form
57586F81963k5316k2456j9994j8620j8131j7606j6590j5341j3945j2091r935q185
57574D83753p021n844m457l603l700l937l379k275j434q43J32J467K369K442K172
57559D55842K168K466K814L122L426L729M081M645N520O596P656Q626R665J1003
57545E31359J2630J4192J5409J6522J8082K0219K2584K5102K8285L2358L6495
57534G73237L9625M1879M4541M8386N2710N6336N9016O1250O2979O3242O1249
57523A364450N7172N1578M4490L5554K4811J2856K88j2484k4844l5898m4983n1939
57511A421051n6850n9797o1025o0854n9310n6293n2314m8559m5733m3252m0080
57500H36984l6031l1829k8089k4828k1832j9020j6403j4007j1778r419o614l639
$$ plain form
57488 613495 612105 611848 612412 614562 619046 625743 634136 644151 656183 670664 687964 708382 731913
57475 731913 758319 787718 820694 857538 897898 941621 989369 1041708 1097868 1156107 1215015
57464 1215015 1273749 1331113 1385148 1433614 1474254 1504657 1522711 1527468 1519125 1498141 1465002 1420933
57452 1420933 1368111 1308886 1245278 1179287 1112894 1047349 983090 920838 862146 808197 758564
57441 758564 711934 667842 626969 589899 556381 525887 498170 473000 449937 428797 409909
57430 409909 393459 378808 364945 351548 339178 328355 318798 309755 300809 292131 284081 276819 270308
57417 270308 264409 258876 253415 247838 242156 236558 231386 227106 224025 221961 220337 218744 217264 216186
57403 216186 215646 215643 216140 216851 217149 216604 215615 215122 215653 216880 218176 219322 220541 222079 223953 226004 228034
$$ packed form
57488F13495j390k57N64K150M484O697Q393J0015J2032J4481J7300K0418K3531
57475G31913K6406K9399L2976L6844M0360M3723M7748N2339N6160N8239N8908
57464A215015N8734N7364N4035M8466M0640L0403J8054M757q343k0984l3139m4069
57452A420933n2822n9225o3608o5991o6393o5545o4259o2252n8692n3949m9633
57441G58564m6630m4092m0873l7070l3518l0494k7717k5170k3063k1140j8888
57430D09909j6450j4651j3863j3397j2370j0823r557r043q946q678q050p262o511
57417B70308n899n533n461n577n682n598n172m280l081k064j624j593j480j078
57403B16186n40lM97P11K98n45r89m93N31J227J296J146J219J538J874K051K030
$$ plain form
57386 228034 229957 231840 233758 235624 237266 238718 240190 241693 242828 243176 242850 242498 242728 243646 244994
57371 244994 246655 248815 251487 254065 255693 256220 256479 257368 258805 259901 260094 259661 259055 258176 256595 254323
57355 254323 252024 250510 250202 250971 252237 253253 253614 253662 254264 256073 259188 263553 269397 276878 285461 294146
57339 294146 302497 311002 320178 329678 338773 347441 356398 366037 375835 384959 392982 399851 405666 410799
57325 410799 415908 421443 427364 433589 440373 447886 455721 463310 470715 478523 486993 495773 504433 512949
57311 512949 521669 531129 541935 554421 568331 583127 598602 614884 631883 649115 666206 683204
57299 683204 700289 717508 734881 752322 769150 784003 795653 803803 808922 811496 811792 810129 806887
57286 806887 802104 795435 786836 777201 768029 760358 754113 748526 743008 737408 731624 725506 719399 714425
$$ packed form
57386B28034J923J883J918J866J642J452J472J503J135L48l26l52K30R18J348
57371B44994J661K160K672K578J628N27K59Q89J437J096J93m33o06q79j581k272
57355B54323k299j514l08P69J266J016L61M8O02J809L115M365N844P481Q583Q685
57339B94146Q351Q505R176R500R095Q668Q957R639R798R124Q023O869N815N133
57325D10799N109N535N921O225O784P513P835P589P405P808Q470Q780Q660Q516
57311E12949Q720R460J0806J2486J3910J4796J5475J6282J6999J7232J7091J6998
57299F83204J7085J7219J7373J7441J6828J4853J1650Q150N119K574K96j663l242
57286H06887m783o669q599r635r172p671o245n587n518n600n784o118o107m974
$$ plain form
57272 714425 711743 711508 712833 714770 717084 720106 724145 729196 735088 741793 749554 758597 768666 779047
57258 779047 789266 799618 810745 822891 835888 849673 864303 879509 894800 910135 925946
57247 925946 942320 958655 974512 990358 1006925 1024080 1040869 1056697 1072037 1087882 1104820
57236 1104820 1122798 1141552 1160956 1180923 1201156 1221223 1240999 1260959 1281892 1304221 1327602
57225 1327602 1351244 1374583 1397717 1421141 1445055 1468971 1492226 1514901 1537997 1562507 1588561
57214 1588561 1615617 1643196 1671063 1699046 1727195 1756026 1786032 1816954 1848047 1879104 1910680
57203 1910680 1943193 1976343 2009649 2043057 2076683 2110348 2143713 2176551 2208639 2239703 2269776
57192 2269776 2299274 2328379 2356673 2383796 2410115 2436293 2462497 2488613 2515056 2542585 2571164
$$ packed form
57272G14425k682k35J325J937K314L022M039N051N892O705P761R043J0069J0381
57258G79047J0219J0352J1127J2146J2997J3785J4630J5206J5291J5335J5811
57247I25946J6374J6335J5857J5846J6567J7155J6789J5828J5340J5845J6938
57236A104820J7978J8754J9404J9967K0233K0067J9776J9960K0933K2329K3381
57225A327602K3642K3339K3134K3424K3914K3916K3255K2675K3096K4510K6054
57214A588561K7056K7579K7867K7983K8149K8831L0006L0922L1093L1057L1576
57203A910680L2513L3150L3306L3408L3626L3665L3365L2838L2088L1064L0073
57192B269776K9498K9105K8294K7123K6319K6178K6204K6116K6443K7529K8579
$$ plain form
57181 2571164 2599625 2626833 2652812 2678348 2703750 2728450 2751800 2773802 2794863 2815178 2834724
57170 2834724 2853803 2873146 2893317 2914302 2935877 2958093 2981132 3004969 3029601 3055357 3082499
57159 3082499 3110640 3139159 3168109 3198132 3229440 3261563 3294262 3327962 3362954 3398800 3434994
57148 3434994 3471659 3509028 3546640 3583546 3618953 3652155 3682187 3708234 3730362 3749368 3765939
57137 3765939 3780228 3792060 3801309 3808331 3814337 3820973 3829146 3838613 3849066 3860956 3874546 3888653
57125 3888653 3901324 3911551 3919431 3924906 3927677 3928739 3930987 3937704 3950980 3971834 4000858 4037817
57113 4037817 4081098 4128563 4179246 4234152 4295742 4367099 4451356 4551417 4670117 4810898 4978424
57102 4978424 5178626 5418543 5706591 6053072 6470298 6972309 7574504 8293070 9143846
$$ packed form
57181B571164K8461K7208K5979K5536K5402K4700K3350K2002K1061K0315J9546
57170B834724J9079J9343K0171K0985K1575K2216K3039K3837K4632K5756K7142
57159C082499K8141K8519K8950L0023L1308L2123L2699L3700L4992L5846L6194
57148C434994L6665L7369L7612L6906L5407L3202L0032K6047K2128J9006J6571
57137C765939J4289J1832R249P022O006O636Q173R467J0453J1890J3590J4107
57125C888653J2671J0227P880N475K771J062K248O717J3276K0854K9024L6959
57113D037817M3281M7465N0683N4906O1590P1357Q4257J00061J18700J40781J67526
57102D978424K00202K39917K88048L46481M17226N02011O02195P18566Q50776
$$ plain form
57093 9143846 10140858 11295219 12614591 14102570 15757421 17570623 19526331 21602006
57085 21602006 23768991 25991978 28228367 30429067 32539667 34498676 36233010 37657219
57077 37657219 38683288 39239359 39287413 38830838 37910641 36594520 34963155 33097091 31067864
57068 31067864 28935831 26753195 24567633 22423049 20357703 18402054 16577948 14898965
57060 14898965 13370947 11992542 10756649 9653276 8672505 7805531 7043508 6376100 5791583
57051 5791583 5278308 4826015 4426157 4071487 3755658 3473258 3220133 2993336 2790430
57042 2790430 2608775 2445627 2298717 2166325 2046840 1938674 1840670 1752099 1672145 1599876
57032 1599876 1534936 1477809 1428981 1388131 1354580 1328386 1310723 1303432 1308555 1328202 1364494 1419327
$$ packed form
57093I143846R97012J154361J319372J487979J654851J813202J955708K075675
57085B1602006K166985K222987K236389K200700K110600J959009J734334J424209
57077C7657219J026069N56071M8054m56575r20197j316121j631365j866064k029227
57068C1067864k132033k182636k185562k144584k065346j955649j824106j678983
57060A4898965j528018j378405j235893j103373r80771q66974p62023o67408n84517
57051E791583n13275m52293l99858l54670l15829k82400k53125k26797k02906
57042B790430j81655j63148j46910j32392j19485j08166r8004q8571p9954p2269
57032A599876o4940n7127m8828m0850l3551k6194j7663p291N123J9647L6292N4833
$$ plain form
57020 1419327 1493551 1584828 1684554 1776483 1840018 1857790 1823117 1742350 1630776 1505388 1379356
57009 1379356 1260527 1152612 1056635 971945 897346 832026 775358 726013 682059 642208 606401
56998 606401 574752 546382 519732 493796 468677 445215 424395 406764 392045 379453 368658
56987 368658 360128 354337 351194 350633 353121 358662 365520 370853 372748 371139 366845 360479 352493 343604
56973 343604 334677 326394 319179 313208 308414 304801 302805 302999 305413 309508 314912 321768 330279 340361
56959 340361 352005 365562 381202 398052 413982 426254 432589 432085 425411 414108 399685 383453
56947 383453 366887 351461 337944 326281 316395 308797 304128 302402 303019 305444 309729 316546 326841
56934 326841 341258 359688 381383 405308 429950 452762 470421 480209 481112 473588 458776 438386
$$ packed form
57020A419327P4224R1277R9726R1929O3535J7772l4673q0767j11574j25388j26032
57009A379356j18829j07915r5977q4690p4599o5320n6668m9345m3954l9851l5807
56998F06401l1649k8370k6650k5936k5119k3462k0820j7631j4719j2592j0795
56987C68658q530n791l143n61K488N541O858N333J895j609m294o366p986q889
56973C43604q927q283p215n971m794l613j996J94K414M095N404O856Q511J0082
56959C40361J1644J3557J5640J6850J5930J2272O335n04o674j1303j4423j6232
56947C83453j6566j5426j3517j1663r886p598m669j726O17K425M285O817J0295
56934C26841J4417J8430K1695K3925K4642K2812J7659R788R03p524j4812k0390
$$ plain form
56922 438386 414893 390955 368289 347298 327742 309526 292897 278264 265978 256092 248230 241769
56910 241769 236119 230806 225497 220190 215240 210899 206915 202989 199587 197751 197916 199333 200995 202862
56896 202862 205705 209955 215206 220962 227430 235303 244999 256393 269202 283284 298400 313778 327991
56883 327991 339322 346364 348566 346383 340913 333313 324516 315325 306488 298543 291679 285933 281521 278904
56869 278904 278638 281269 287282 296988 310440 327607 348639 373827 403152 435751 469597 501550
56857 501550 527967 545805 553557 551347 540358 522430 500036 475987 452654 431400 412876 397660
56845 397660 386381 379355 376525 377890 383828 394932 411751 434856 464932 502419 546947 597127
56833 597127 650613 703775 751186 786233 803451 801027 781218 748555 707907 663838 620478 580858
$$ packed form
56922D38386k3493k3938k2666k0991j9556j8216j6629j4633j2286r886p862o461
56910B41769n650n313n309n307m950m341l984l926l402j836J65J417J662J867
56896B02862K843M250N251N756O468P873R696J1394J2809J4082J5116J5378J4213
56883C27991J1331P042K202k183n470p600q797r191q837p945o864n746m412k617
56869B78904k66K631O013R706J3452J7167K1032K5188K9325L2599L3846L1953
56857E01550K6417J7838P752k210j0989j7928k2394k4049k3333k1254j8524j5216
56845C97660j1279p026k830J365N938J1104J6819K3105L0076L7487M4528N0180
56833E97127N3486N3162M7411L5047J7218k424j9809l2663m0648m4069m3360l9620
$$ plain form
56821 580858 546317 517048 493229 475273 463194 456361 454121 456308 463100 474829 492117 515760
56809 515760 546006 581905 621228 660586 695478 720830 732385 728099 708626 676927 637459 594975
56797 594975 553159 514082 478925 448784 424391 405394 390698 379712 372819 370519 372576 378282
56785 378282 387217 399466 415278 434680 457066 480638 502286 518440 526426 525171 514984 497138
56773 497138 473690 447243 420239 394223 369788 347147 326619 308533 292890 279363 267635
56762 267635 257551 248856 240979 233312 225744 218760 212910 208299 204717 202125 200709 200373 200449 200192 199495
56747 199495 198885 198782 199016 199109 198845 198400 198093 198116 198437 198764 198764 198447 198252 198564 199263 199912 200242 200204 199697 198623
56727 198623 197214 195945 195025 194298 193750 193735 194514 195813 197059 197877 198180 198030 197618 197255 197153 197352 198014 199589
$$ packed form
56821E80858l4541k9269k3819j7956j2079o833k240K187O792J1729J7288K3643
56809E15760L0246L5899L9323L9358L4892K5352J1555m286j9473l1699l9468m2484
56797E94975m1816l9077l5157l0141k4393j8997j4696j0986o893k300K057N706
56785C78282Q935J2249J5812J9402K2386K3572K1648J6154P986j255j0187j7846
56773D97138k3448k6447k7004k6016k4435k2641k0528j8086j5643j3527j1728
56762B67635j0084q695p877p667p568o984n850m611l582k592j416l36P6k57o97
56747A99495o10j03K34R3k64m45l07K3L21L27%l17j95L12O99O49L30l8n07j074
56727A98623j409j269r20p27n48j5P79J299J246Q18L03j50m12l63j02J99O62J575
$$ plain form
56709 199589 202416 206289 210629 215007 219307 223577 227981 232771 238001 243290 248089 252072 255073 256928
56695 256928 257807 258492 259641 260791 260781 259440 258136 258166 259188 259986 260397 261506 263881 266572 268314 269039
56679 269039 269587 270359 271034 271463 272064 273094 274124 274577 274412 273921 273118 271759 269845 267664 265313 262503
56663 262503 258933 254718 250428 246809 244377 243014 241977 240518 238448 235943 232967 229324 225260 221498
56649 221498 218520 216193 214325 213145 212903 213318 213872 214425 215140 215978 216765 217684 219127 220966 222434 222977
56633 222977 222925 223005 223511 224274 225240 226531 227837 228216 226935 224372 221687 219532 217448 214731 211541 208751
56617 208751 206913 205891 205466 205694 206443 207114 207282 207358 208163 209982 212439 215135 217976 220830 223300 225033
56601 225033 226088 226868 227766 228924 230225 231515 232839 234349 235927 237152 237820 238255 238829 239402 239632 239692
$$ packed form
56709A99589K827L873M340M378M300M270M404M790N230N289M799L983L001J855
56695B56928Q79O85J149J150j0j341j304L0J022P98M11J109K375K691J742P25
56679B69039N48P72O75M29O01J030J030M53j65m91q03j359j914k181k351k810
56663B62503l570m215m290l619k432j363j037j459k070k505k976l643m064l762
56649B21498k978k327j868j180k42M15N54N53P15Q38P87R19J443J839J468N43
56633B22977n2Q0N06P63R66J291J306L79j281k563k685k155k084k717l190k790
56617B08751j838j022m25K28P49O71J68P6Q05J819K457K696K841K854K470J733
56601B25033J055P80Q98J158J301J290J324J510J578J225O68M35N74N73K30O0
$$ plain form
56585 239692 240166 241238 242443 243306 243727 243652 242908 241730 240995 241405 242573 243416 243385 243005 243174 244326 246334
56568 246334 248891 251696 254464 257066 259664 262475 265321 267584 268742 268794 268016 266493 264249 261747 259758
56553 259758 258481 257127 254760 251328 247560 244007 240621 237165 233563 229828 226062 222569 219524 216426
56539 216426 212413 207417 202593 199181 197223 195854 194613 193896 194089 194857 195557 195960 196216 196348 196241 196099
56523 196099 196435 197360 198183 198047 196886 195448 194411 193765 193082 191982 190210 187643 184627 182030 180518 179760
56507 179760 178690 176645 174019 171771 170498 170062 169958 169942 170267 171299 172936 174633 176107 177718 179880
56492 179880 182354 184484 185972 187037 187926 188765 189872 191719 194417 197466 200118 201784 202208 201651 200936
56477 200936 200881 201602 202643 203704 204779 205614 205758 205351 205273 206141 207550 208618 208830 208088 206425 204186 202190
$$ packed form
56585B39692M74J072J205Q63M21p5p44j178p35M10J168Q43l1l80J69J152K008
56568B46334K557K805K768K602K598K811K846K263J158N2p78j523k244k502j989
56553B59758j277j354k367l432l768l553l386l456l602l735l766l493l045l098
56539B16426m013m996m824l412j958j369j241p17J93P68P00M03K56J32j07j42
56523A96099L36R25Q23j36j161j438j037o46o83j100j772k567l016k597j512p58
56507A79760j070k045k626k248j273m36j04j6L25J032J637J697J474J611K162
56492A79880K474K130J488J065Q89Q39J107J847K698L049K652J666M24n57p15
56477B00936n5P21J041J061J075Q35J44m07p8Q68J409J068K12p42j663k239j996
$$ plain form
56460 202190 201245 201574 202872 204609 206043 206442 205804 205045 205030 205689 206471 207233 208096 208718 208524 207577 206567 205895
56442 205895 205384 204887 204544 204274 203646 202581 201707 201637 202180 202586 202385 201701 200903 200218 199674 199231 198922 198864 199100
56423 199100 199496 199937 200564 201619 203041 204455 205592 206545 207523 208523 209358 209977 210692 212047 214341 217219
56407 217219 219851 221670 222799 223642 224259 224394 223957 223145 222156 221142 220400 220279 220799 221686 222786 224171 225731
56390 225731 226937 227218 226443 224951 223235 221638 220239 218989 218037 217759 218256 218969 219187 218908 218767 219080 219417
56373 219417 219329 219040 219067 219428 219699 219744 220026 221076 222912 224991 226643 227494 227621 227406 227261 227483 228256 229621
56355 229621 231398 233285 235142 237078 239203 241430 243653 246002 248695 251634 254342 256425 257975 259394
56341 259394 260896 262400 263877 265545 267575 269863 272400 275601 279779 284354 288151 290700 292792 295501
$$ packed form
56460B02190r45L29J298J737J434L99o38p59j5O59P82P62Q63O22j94r47j010o72
56442B05895n11m97l43k70o28j065q74p0N43M06k01o84p98o85n44m43l09n8K36
56423A99100L96M41O27J055J422J414J137R53R78J000Q35O19P15J355K294K878
56407B17219K632J819J129Q43O17J35m37q12r89j014p42j21N20Q87J100J385J560
56390B25731J206K81p75j492j716j597j399j250r52k78M97P13K18k79j41L13L37
56373B19417q8k89K7L61K71M5K82J050J836K079J652Q51J27k15j45K22P73J365
56355B29621J777J887J857J936K125K227K223K349K693K939K708K083J550J419
56341B59394J502J504J477J668K030K288K537L201M178M575L797K549K092K709
$$ plain form
56327 295501 299103 303270 307786 312486 316816 320192 322784 325402 328586 332233 336038 339709 342738 344656
56313 344656 345742 346924 348664 350372 351284 351499 351756 352480 353519 354688 356079 357751 359447 360827 361936
56298 361936 363374 365937 369983 375108 380516 385715 390847 396424 402873 410223 418058 425867 433673 442143
56284 442143 451759 462012 471900 481268 491171 502808 516571 532347 550262 570738 594077 620327
56272 620327 649450 681409 716279 754529 797050 844744 898114 957261 1022036 1092085 1167062
56261 1167062 1246847 1331350 1420002 1511781 1605664 1700560 1794614 1885233 1970217 2048478 2119263
56250 2119263 2181166 2232516 2272465 2301116 2318812 2325871 2322896 2310734 2290140 2261850 2226881 2186175
56238 2186175 2139944 2087880 2030093 1967377 1900415 1829249 1753780 1674608 1593259 1511899 1432868
$$ packed form
56327B95501L602M167M516M700M330L376K592K618L184L647L805L671L029J918
56313C44656J086J182J740J708R12K15K57P24J039J169J391J672J696J380J109
56298C61936J438K563M046N125N408N199N132N577O449P350P835P809P806Q470
56284D42143R616J0253R888R368R903J1637J3763J5776J7915K0476K3339K6250
56272F20327K9123L1959L4870L8250M2521M7694N3370N9147O4775P0049P4977
56261A167062P9785Q4503Q8652R1779R3883R4896R4054R0619Q4984P8261P0785
56250B119263O1903N1350L9949K8651J7696P059k975j2162k0594k8290l4969m0706
56238B186175m6231n2064n7787o2716o6962p1166p5469p9172q1349q1360p9031
$$ plain form
56227 1432868 1358117 1288831 1225618 1168864 1118427 1072998 1030451 989281 949454 911653 876061
56216 876061 842257 809992 779547 751386 725781 702785 682283 664055 648040 634527 623856
56205 623856 615911 610119 605897 602860 600554 598382 595969 593427 591036 588790 586438 583897 581424 579423
56191 579423 578214 577934 578521 579851 582046 585486 590262 595765 601207 606612 612879 620681 629726 639419 649833
56176 649833 661467 674233 687322 700209 713305 727278 741995 756496 770010 782738 795540
56165 795540 808990 822938 837150 852207 869440 889985 914270 942633 976047 1015896 1063380
56154 1063380 1119685 1186692 1267147 1364170 1480752 1619184 1779889 1960275 2154787 2355889
56144 2355889 2554735 2741753 2908509 3050612 3169202 3269626 3358644 3441915 3522047 3597237
$$ packed form
56227A432868p4751o9286o3213n6754n0437m5429m2547m1170l9827l7801l5592
56216H76061l3804l2265l0445k8161k5605k2996k0502j8228j6015j3513j0671
56205F23856p945n792m222l037k306k172k413k542k391k246k352k541k473k001
56191E79423j209k80N87J330K195L440M776N503N442N405O267P802R045R693J0414
56176F49833J1634J2766J3089J2887J3096J3973J4717J4501J3514J2728J2802
56165G95540J3450J3948J4212J5057J7233K0545K4285K8363L3414L9849M7484
56154A063380N6305O7007Q0455R7023J16582J38432J60705J80386J94512K01102
56144B355889J98846J87018J66756J42103J18590J00424Q9018Q3271Q0132P5190
$$ plain form
56134 3597237 3661697 3708393 3732433 3732931 3712902 3677947 3634033 3584753 3529463 3463498 3380081 3272736
56122 3272736 3137650 2975560 2792151 2596438 2398243 2206394 2027866 1867328 1727043
56113 1727043 1607335 1507183 1424501 1356558 1300879 1255861 1220407 1193279 1173166 1159091 1150268
56102 1150268 1145593 1143651 1143078 1142628 1141122 1137768 1132482 1125608 1117433 1108281 1098847 1089936 1081900 1074676
56088 1074676 1068265 1062853 1058514 1055219 1053127 1052559 1053693 1056459 1060621 1065750 1071372 1077489 1084714 1093469
56074 1093469 1103260 1113210 1123155 1133714 1145325 1157818 1170940 1184815 1199703 1215697 1232737 1250573
56062 1250573 1268638 1286398 1304023 1322414 1342290 1363369 1384597 1405114 1424996 1445182 1466776
56051 1466776 1490342 1515807 1542864 1571238 1600624 1630830 1662160 1695263 1730336 1766749 1803794
$$ packed form
56134C597237O4460M6696K4040M98k0029l4955m3914m9280n5290o5965q3417j07345
56122C272736j35086j62090j83409j95713j98195j91849j78528j60538j40285
56113A727043j19708j00152q2682o7943n5679m5018l5454k7128k0113j4075q823
56102A150268m675j942n73m50j506l354n286o874q175r152r434q911q036p224
56088A074676o411n412m339l295k092n68J134K766M162N129N622O117P225Q755
56074A093469R791R950R945J0559J1611J2493J3122J3875J4888J5994J7040J7836
56062A250573J8065J7760J7625J8391J9876K1079K1228K0517J9882K0186K1594
56051A466776K3566K5465K7057K8374K9386L0206L1330L3103L5073L6413L7045
$$ plain form
56040 1803794 1841449 1880135 1920023 1961004 2002975 2045590 2087871 2128569 2166875 2202515 2235390
56029 2235390 2265622 2293974 2321914 2351276 2383823 2420690 2461921 2506924 2555622 2608646 2666065
56018 2666065 2726643 2789018 2853101 2919614 2988883 3060998 3136755 3217239 3302542 3391855 3484850
56007 3484850 3582167 3684541 3792253 3905541 4024791 4150207 4281948 4420648 4567237 4722191
55997 4722191 4885502 5057260 5237827 5427656 5627609 5839213 6063858 6301980 6553722
55988 6553722 6820172 7103206 7404458 7725349 8067808 8433960 8825375 9243730 9692013
55979 9692013 10174173 10694027 11255771 11865291 12529600 13255344 14049530 14921757 15884282
55970 15884282 16950093 18132822 19449174 20920408 22572156 24435597 26550418 28966681
$$ packed form
56040A803794L7655L8686L9888M0981M1971M2615M2281M0698L8306L5640L2875
56029B235390L0232K8352K7940K9362L2547L6867M1231M5003M8698N3024N7419
56018B666065O0578O2375O4083O6513O9269P2115P5757Q0484Q5303Q9313R2995
56007C484850R7317J02374J07712J13288J19250J25416J31741J38700J46589J54954
55997D722191J63311J71758J80567J89829J99953K11604K24645K38122K51742
55988F553722K66450K83034L01252L20891L42459L66152L91415M18355M48283
55979I692013M82160N19854N61744O09520O64309P25744P94186Q72227R62525
55970A5884282J065811J182729J316352J471234J651748J863441K114821K416263
$$ plain form
55962 28966681 31746061 34966034 38725814 43148013 48375324 54568814 61911570 70616062
55954 70616062 80937766 93199982 107818029 125290887 146136848 170777474 199373572
55947 199373572 231584416 266236741 301017874 332467135 356529113 369638595 369892319
55940 369892319 357682931 335441801 306681104 274903425 242882784 212453340 184632595
55933 184632595 159851011 138165139 119421280 103363354 89691087 78091407 68262826
55926 68262826 59932694 52861616 46841176 41693962 37273996 33462018 30158846 27282649
55918 27282649 24767991 22561773 20618357 18898640 17371117 16010308 14793936 13702793
55910 13702793 12721884 11839064 11042581 10321315 9666461 9071022 8527985 8030631 7574071
$$ packed form
55962B8966681K779380L219973L759780M422199N227311O193490P342756Q704492
55954G0616062J0321704J2262216J4618047J7472858K0845961K4640626K8596098
55947A99373572L2210844L4652325L4781133L1449261K4061978J3109482K53724
55940C69892319j2209388k2241130k8760697l1777679l2020641l0429444k7820745
55933A84632595k4781584k1685872j8743859j6057926j3672267j1599680r828581
55926F8262826q330132p071078o020440n147214m419966l811978l303172k876197
55918B7282649k514658k206218j943416j719717j527523j360809j216372j091143
55910A3702793r80909q82820p96483p21266o54854n95439n43037m97354m56560
$$ plain form
55901 7574071 7154703 6768427 6411055 6080208 5774946 5493416 5232317 4988869 4761876
55892 4761876 4550602 4353820 4170363 3999547 3840643 3692684 3555126 3427972 3310955
55883 3310955 3203113 3103298 3010595 2924235 2843711 2769113 2700778 2638289 2579891 2522693 2463287
55872 2463287 2398758 2328017 2252348 2174272 2095923 2018595 1943262 1870675 1801032 1734190 1670195
55861 1670195 1609101 1550332 1492875 1436310 1381386 1329486 1281721 1238446 1199394 1164282 1133357
55850 1133357 1107122 1085471 1067480 1052181 1039097 1027895 1018119 1009671 1002901 997684 992973 987889
55838 987889 982752 978269 974070 968859 961807 953052 942954 931635 919286 906305 893012 879635 866579
55825 866579 854281 842708 831257 819108 805620 790688 774957 759340 744044 728506 712568
$$ packed form
55901G574071m19368l86276l57372l30847l05262k81530k61099k43448k26993
55892D761876k11274j96782j83457j70816j58904j47959j37558j27154j17017
55883C310955j07842r9815r2703q6360q0524p4598o8335o2489n8398n7198n9406
55872B463287o4529p0741p5669p8076p8349p7328p5333p2587o9643o6842o3995
55861A670195o1094n8769n7457n6565n4924n1900m7765m3275l9052l5112l0925
55850A133357k6235k1651j7991j5299j3084j1202r776q448o770n217m711n084
55838I87889n137m483m199n211p052q755j0098j1319j2349j2981j3293j3377j3056
55825H66579j2298j1573j1451j2149j3488j4932j5731j5617j5296j5538j5938
$$ plain form
55814 712568 697121 683125 670642 659456 650132 643567 639875 638401 638454 639232 639484 638289 636039 633746
55800 633746 631573 628898 625578 622036 618149 613284 607684 602709 599268 596717 593629 588871 581712 571904
55786 571904 560368 549250 540608 535225 532850 533055 535450 539512 544563 549674 553442 554360 551732 545858
55772 545858 537160 525648 511465 495380 478262 460473 442196 423982 406521 390143 374966 361312
55760 361312 349511 339395 330369 322015 314361 307599 301716 296471 291646 287294 283663 280727 277887 274390
55746 274390 270059 265331 260566 255634 250276 244623 239215 234650 231228 228739 226592 224387 222309 220723
55732 220723 219477 217961 215830 213313 210782 208389 206193 204263 202554 200996 199729 198920 198335 197519 196393
55717 196393 195242 194118 192823 191653 191568 193300 196653 200962 205848 211371 217829 225602 234677 244135 252600
$$ packed form
55814G12568j5447j3996j2483j1186r324o565l692j474N3P78K52j195k250k293
55800F33746k173k675l320l542l887m865n600m975l441k551l088m758p159r808
55786E71904j1536j1118q642n383k375K05K395M062N051N111L768R18k628n874
55772E45858q698j1512j4183j6085j7118j7789j8277j8214j7461j6378j5177j3654
55760C61312j1801j0116r026q354p654o762n883n245m825m352l631k936k840l497
55746B74390m331m728m765m932n358n653n408m565l422k489k147k205k078j586
55732B20723j246j516k131k517k531k393k196j930j709j558j267q09n85q16j126
55717A96393j151j124j295j170q5J732L353M309M886N523O458P773R075R458Q465
$$ plain form
55702 252600 259580 265805 271862 277100 280584 282735 285112 288633 292694 296119 298318 299307 299194 298129 296552
55687 296552 295063 293937 292924 291572 289745 287787 286137 284782 283100 280302 275998 270364 263862 256884
55673 256884 249625 242243 235081 228658 223402 219510 217182 216887 219319 225223 235325 250055 268890 290053
55659 290053 311289 330995 348417 363054 374517 383037 389560 395031 399795 403674 406174 406533 404123
55646 404123 399181 392881 386443 380456 375142 370757 367388 364775 362792 361880 362544 364543 366877 368453 368464
55631 368464 366248 361190 352950 341692 328122 313238 297841 282180 266223 250250 234946 220839
55619 220839 208023 196533 186567 178067 170436 163031 155769 149015 143109 138234 134501 131778 129590 127438
55605 127438 125118 122598 119852 117087 114808 113283 112075 110423 107976 104978 101988 99615 98249 97656
$$ packed form
55702B52600O980O225O057N238L484K151K377L521M061L425K199R89j13j065j577
55687B96552j489j126j013j352j827j958j650j355j682k798m304n634o502o978
55673B56884p259p382p162o423n256l892k328k95K432N904J0102J4730J8835K1163
55659B90053K1236J9706J7422J4637J1463Q520O523N471M764L879K500L59k410
55646D04123m942o300o438n987n314m385l369k613j983r12O64J999K334J576J1
55631C68464k216n058q240j1258j3570j4884j5397j5661j5957j5973j5304j4107
55619B20839j2816j1490r966q500p631p405p262o754n906m875l733k723k188k152
55605A27438k320k520k746k765k279j525j208j652k447k998k990k373j366n93
$$ plain form
55591 97656 97100 96258 95728 96235 97536 98730 99451 100084 100780 100994 100316 99263 98879 99781 101907 104918 108474
55574 108474 112236 115912 119388 122674 125735 128543 131302 134444 138171 142085 145487 148129 150423 152716
55560 152716 154653 155649 155817 155865 156019 155691 154488 152918 151570 150067 147489 143651 139288 135021 130818 126599
55544 126599 122727 119561 116887 114153 111114 108023 105262 102999 101172 99713 98754 98538 99078 100035 101107
55529 101107 102431 104338 106746 109158 111298 113473 116163 119498 123405 128122 134280 142401 152394 163562
55515 163562 175050 186246 196831 206618 215518 223573 230801 236855 240910 242065 239822 234228 225719
55502 225719 214890 202307 188427 173812 159424 146402 135284 125561 116290 107126 98558 91196
55490 91196 85107 79905 75272 71192 67714 64646 61672 58789 56432 54930 53912 52616 50809 49053
$$ packed form
55591I7656n56q42n30N07J301J194P21O33O96K14o78j053l84R02K126L011L556
55574A08474L762L676L476L286L061K808K759L142L727L914L402K642K294K293
55560A52716J937R96J68M8J54l28j203j570j348j503k578l838m363m267m203m219
55544A26599l872l166k674k734l039l091k761k263j827j459r59k16N40R57J072
55529A01107J324J907K408K412K140K175K690L335L907M717O158Q121R993J1168
55515A63562J1488J1196J0585R787Q900Q055P228O054M055J155k243n594q509
55502B25719j0829j2583j3880j4615j4388j3022j1118r723r271r164q568p362
55490I1196o089n202m633m080l478l068k974k883k357j502j018j296j807j756
$$ plain form
55476 49053 47897 47168 46335 45246 44161 43235 42335 41331 40276 39315 38608 38280 38245 38201 38003 37927 38324 39104
55458 39104 39800 40054 39816 39132 38016 36582 35112 33971 33465 33711 34525 35533 36378 36745 36312 35085 33805
55441 33805 33454 34093 34719 34632 34373 34758 35463 35421 34404 33385 33287 34055 35049 35694 35615 34762 33643 33009 33098 33542
55421 33542 34088 34899 36007 37063 37878 38737 39822 40751 41070 40810 40192 39109 37370 35310 33676 32916 32852
55404 32852 33031 33203 33479 34155 35354 36744 37737 38042 37920 37779 37702 37485 37006 36414 36012 35991 36182 36067 35210
55385 35210 33765 32389 31603 31425 31597 31908 32191 32331 32427 32737 33230 33432 32968 32125 31588 31606 31635 30921 29345
55366 29345 27596 26438 25884 25288 24297 23420 23446 24523 26102 27579 28552 28610 27491 25618 24017 23462 23943
55349 23943 25012 26256 27295 27764 27592 27097 26624 26347 26490 27315 28662 29867 30457 30664 30983 31484 31845
$$ packed form
55476D9053j156p29q33j089j085r26r00j004j055r61p07l28l5m4j98p6L97P80
55458C9104O96K54k38o84j116j434j470j141n06K46Q14J008Q45L67m33j227j280
55441C3805l51O39O26q7k59L85P05m2j017j019r8P68R94O45p9q53j119o34Q9M44
55421C3542N46Q11J108J056Q15Q59J085R29L19k60o18j083j739k060j634p60o4
55404C2852J79J72K76O76J199J390R93L05j22j41p7k17m79n92m02k1J91j15q57
55385C5210j445j376p86j78J72L11K83J40R6L10M93K02m64q43n37J8K9p14j576
55366B9345j749j158n54n96r91q77K6J077J579J477R73N8j119j873j601n55M81
55349B3943J069J244J039M69j72m95m73k77J43Q25J347J205N90K07L19N01L61
$$ plain form
55332 31845 31852 31592 31305 31259 31556 31890 31725 30935 30005 29438 29245 29203 29269 29419 29367 28867 28057 27225 26479 25883 25590
55311 25590 25498 25166 24537 24367 25293 26732 27433 26998 26195 25775 25732 25835 26127 26576 26771 26439 25910 25747 26156
55292 26156 26996 28056 29043 29587 29620 29552 29761 30073 30040 29555 28864 28104 27240 26514 26537 27706 29701 31739 33246
55273 33246 34167 34758 35259 35727 35987 35676 34488 32543 30463 28941 28220 28022 27946 27822 27681 27561 27434 27303
55255 27303 27287 27568 28171 28773 28873 28325 27573 27103 26765 25971 24599 23338 23001 23749 25159 26682 27814 28138
55237 28138 27618 26744 26094 25794 25620 25453 25328 25176 24877 24595 24747 25528 26606 27376 27467 27067 26813 27190 27977
55218 27977 28438 28210 27742 27637 27883 28088 28176 28300 28233 27506 26221 25148 24748 24587 24033 23153 22531 22442 22672
55199 22672 23046 23733 24903 26391 27875 29217 30442 31371 31531 30682 29382 28660 28901 29287 28753 27420 26631
$$ packed form
55332C1845Pk60k87m6K97L34j65p90r30n67j93m2O6J50n2n00q10q32p46n96k93
55311B5590r2l32o29j70R26J439P01m35q03m20m3J03K92M49J95l32n29j63M09
55292B6156Q40J060R87N44L3o8K09L12l3m85o91p60q64p26K3J169J995K038J507
55273C3246R21N91N01M68K60l11j188j945k080j522p21j98p6j24j41j20j27j31
55255B7303j6K81O03O02J00n48p52m70l38p94j372j261l37P48J410J523J132L24
55237B8138n20q74o50l00j74j67j25j52k99k82J52P81J078P70R1m00k54L77P87
55218B7977M61k28m68j05K46K05Q8J24o7p27j285j073m00j61n54q80o22q9K30
55199B2672L74O87J170J488J484J342J225R29J60q49j300p22K41L86n34j333p89
$$ plain form
55182 26631 27414 29269 30784 31222 31130 31444 32353 33174 33136 32092 30591 29443 29197 29813 30654 30925 30334 29394
55164 29394 28931 29258 29948 30429 30647 31016 31850 33016 34117 34890 35368 35630 35477 34544 32902 31332 30689 31051
55146 31051 31871 32862 34166 35556 36184 35545 34232 33221 32719 32250 31563 30943 30794 31453 33213 35917 38631
55129 38631 40316 40879 41126 41763 42908 44435 46100 47346 47742 47718 48182 49183 49658 48829 47237 45986 45519
55112 45519 45518 45508 45097 44068 42741 41903 41920 42226 42100 41612 41311 41320 41240 40765 39913 38840 37861 37478 37928 38851
55092 38851 39770 40577 41176 41088 40146 39271 39644 41139 42447 42858 42994 43483 43857 43402 42460 42047 42473 43117 43466
55073 43466 43661 43905 43951 43532 42929 42674 42754 42551 41686 40660 40359 40978 41715 41617 40523 39057 37978 37809 38795
55054 38795 40742 42849 44132 44204 43475 42547 41711 41113 40986 41449 42283 43184 44151 45433 47186 49343 51659
$$ packed form
55182B6631P83J855J515M38r2L14R09Q21l8j044j501j148k46O16Q41K71n91r40
55164B9394m63L27O90M81K18L69Q34J166J101P73M78K62j53r33j642j570o43L62
55146C1051Q20R91J304J390O28o39j313j011n02m69o87o20j49O59J760K704K714
55129C8631J685N63K47O37J145J527J665J246L96k4M64J001M75q29j592j251m67
55112D5519jj0m11j029j327q38J7L06j26m88l01Rq0m75q52j073r79l83M50R23
55092C8851R19Q07N99q8r42q75L73J495J308M11J36M89L74m55r42m13M26O44L49
55073D3466J95K44M6m19o03k55Q0k03q65j026l01O19P37r8j094j466j079j69R86
55054C8795J947K107J283P2p29r28q36n98j27M63Q34R01R67J282J753K157K316
$$ plain form
55037 51659 53711 54998 55320 55089 55006 55408 56050 56533 56758 56922 57288 58046 59264 60754 61994 62318 61362 59395
55019 59395 57262 55899 55705 56241 56561 56009 54742 53454 52612 52079 51492 50777 50166 49851 49906 50427 51347 52124
55001 52124 52033 51027 49966 49679 50036 50325 50271 50180 50194 50071 49831 50033 51036 52429 53605 54576 55739 57057
54983 57057 58079 58768 59754 61570 64055 66765 69544 72396 75023 76977 78273 79479 81171 83551 86642
54968 86642 90490 94964 99676 104481 109990 117204 126619 137923 150615 164624 180106 196832 213999
54955 213999 230438 244738 255351 261070 261676 257963 250963 241194 228752 213983 197902 181945 167284
54942 167284 154282 142475 131135 120013 109620 100821 94190 89670 86702 84565 82736 81124 80017
54929 80017 79712 80158 81016 82031 83326 85307 88345 92569 97919 104372 112104 121406 132401 144868 158395
$$ packed form
55037E1659K052J287L22k31q3M02O42M83K25J64L66P58J218J490J240L24r56j967
55019E9395k133j363j94N36L20n52j267j288q42n33n87p15o11l15N5N21R20P77
55001E2124r1j006j061k87L57K89n4r1J4j23k40K02J003J393J176R71J163J318
54983E7057J022O89R86J816K485K710K779K852K627J954J296J206J692K380L091
54968H6642L848M474M712M805N509P214R415J1304J2692J4009J5482J6726J7167
54955B13999J6439J4300J0613N719O06l713p000r769j2442j4769j6081j5957j4661
54942A67284j3002j1807j1340j1122j0393q799o631m520k968k137j829j612j107
54929H0017l05M46Q58J015J295J981L038M224N350O453P732R302J0995J2467J3527
$$ plain form
54914 158395 172640 187304 201748 214763 224947 231383 233900 232643 227587 218723 206696 192945
54902 192945 178945 165344 152074 139212 127420 117348 108875 101255 94003 87405 82082 78288 75729
54889 75729 73913 72495 71345 70407 69538 68451 66998 65570 64935 65366 66028 65712 64292 63009 62961 63647 63473
54872 63473 61600 58797 56412 54938 53820 52360 50446 48529 47195 46765 47095 47670 47997 47984 47883 47891 47893 47631
54854 47631 47071 46445 45846 44908 43230 41189 40003 40554 42291 43716 43962 43444 42935 42578 42100 41503 41042
54837 41042 40823 40885 41434 42527 43692 44377 44684 45151 45870 46476 47009 48098 50042 52245 53972 55208 56402
54820 56402 57733 59058 60379 61905 63781 66098 69073 72906 77557 82931 89164 96438 104647 113556
54806 113556 123246 134100 146409 160155 175075 190561 205552 218819 229317 236139 238434 235931
$$ packed form
54914A58395J4245J4664J4444J3015J0184O436K517j257n056q864j2027j3751
54902A92945j4000j3601j3270j2862j1792j0072q473p620p252o598n323l794k559
54889G5729j816j418j150r38q69j087j453j428o35M31O62l16j420j283m8O86j74
54872F3473j873k803k385j474j118j460j914j917j334m30L30N75L27j3j01QKk62
54854D7631n60o26n99r38j678k041j186N51J737J425K46n18n09l57m78n97m61
54837D1042k19O2N49J093J165O85L07M67P19O06N33J089J944K203J727J236J194
54820E6402J331J325J321J526J876K317K975L833M651N374O233P274Q209Q909
54806A13556R690J0854J2309J3746J4920J5486J4991J3267J0498O822K295k503
$$ plain form
54794 235931 229487 220603 210303 198865 186641 174523 163309 153116 143789 135564 128863 123687 119648
54781 119648 116495 114257 112889 112121 111698 111589 112019 113504 116743 122146 129366 137475 145699 153901 162425
54766 162425 171692 181919 193008 204541 215975 226936 237273 246894 255687 263583 270354 275156 276499
54753 276499 273100 264910 253119 239108 223597 206965 190043 174077 159837 147161 135577 125013
54741 125013 115639 107359 99948 93508 88266 83983 80125 76664 74095 72466 71037 69279 67622 66592
54727 66592 65657 63753 60830 58127 56789 56839 57664 58895 60419 61888 62759 62835 62515 62450 62961 63779 64394 64641
54709 64641 64779 64945 64827 64202 63490 63357 63918 64799 65848 67134 68299 68616 67990 67262 67204 67676 68094 68276
54691 68276 68421 68682 69127 69814 70535 70866 70850 71210 72449 74165 75763 77445 79806 82790 85783 88602 91600
$$ packed form
54794B35931o444q884j0300j1438j2224j2118j1214j0193r327q225o701n176m039
54781A19648l153k238j368p68m23j09M30J485L239N403P220Q109Q224Q202Q524
54766A62425R267J0227J1089J1533J1434J0961J0337R621Q793P896O771M802J343
54753B76499l399q190j1791j4011j5511j6632j6922j5966j4240j2676j1584j0564
54741A25013r374q280p411o440n242m283l858l461k569j629j429j758j657j030
54727F6592r35j904k923k703j338N0Q25J231J524J469Q71P6l20o5N11Q18O15K47
54709F4641J38J66j18o25p12j33N61Q81J049J286J165L17o26p28n8M72M18J82
54691F8276J45K61M45O87P21L31j6L60J239J716J598J682K361K984K993K819K998
$$ plain form
54674 91600 94824 97858 100546 103212 105987 108507 110434 111780 112682 113497 115263 119291 125903 134082 142720
54659 142720 151724 161576 172388 183862 195702 207459 218275 227247 233847 237568 237566 233320 225475 215500
54645 215500 204522 192914 180920 169076 157893 147536 137999 129317 121491 114435 108139 102764 98521
54632 98521 95487 93499 92160 91071 90148 89651 89795 90531 91693 93050 94093 94214 93413 92440 91839 91255 90126
54615 90126 88614 87169 85541 83125 80196 77850 76560 75658 74509 73400 72789 72396 71610 70331 68827
54600 68827 67198 65548 64346 64009 64332 64802 65267 65736 65789 64881 63175 61473 60288 59522 59081 59169 59754 60334
54582 60334 60546 60634 60962 61384 61453 61053 60491 60129 60189 60745 61621 62331 62440 61978 61359 60959 61008 61746 63312 65372
54562 65372 67143 68061 68309 68589 69445 70905 72679 74494 76209 77803 79384 81220 83639 86865 90909
$$ packed form
54674I1600L224L034K688K666K775K520J927J346R02Q15J766M028O612Q179Q638
54659A42720R004R852J0812J1474J1840J1757J0816Q972O600L721km246p845r975
54645B15500j0978j1608j1994j1844j1183j0357r537q682p826p056o296n375m243
54632I8521l034j988j339j089r23m97J44P36J162J357J043J21q01r73o01n84j129
54615I0126j512j445j628k416k929k346j290r02j149j109o11l93p86j279j504
54600F8827j629j650j202l37L23M70M65M69N3r08j706j702j185p66m41Q8N85N80
54582F0334K12Q8L28M22O9m00n62l62O0N56Q76P10J09m62o19m00M9P38J566K060
54562F5372J771R18K48K80Q56J460J774J815J715J594J581J836K419L226M044
$$ plain form
54547 90909 95588 100648 105870 111129 116342 121406 126153 130350 133669 135679 135973 134411 131189 126634 120952
54532 120952 114322 107139 100009 93434 87643 82770 78967 76199 74101 72284 70752 69824 69602 69738 69768
54517 69768 69520 69098 68634 68179 67770 67431 67133 66827 66525 66228 65799 65026 63895 62702 61840 61428 61245 61040
54499 61040 60838 60897 61386 62207 63109 63909 64597 65287 66107 67017 67741 68016 67952 67990 68403 68989 69428 69759 70238 70838
54479 70838 71258 71377 71348 71176 70611 69588 68430 67335 66008 64168 62209 60955 60858 61782 63463 65672 67859
54462 67859 69137 68975 67757 66419 65619 65348 65201 64910 64703 65173 66659 68719 70412 71164 71180 70922 70476
54445 70476 69618 68290 66732 65282 64225 63744 63769 63985 64191 64563 65330 66324 67107 67450 67386 66896 65992 65145
54427 65145 65140 66279 67961 69358 70274 71092 72097 73197 74325 75805 78138 81468 85219 88294 89838 90030
$$ packed form
54547I0909M679N060N222N259N213N064M747M197L319K010K94j562l222m555n682
54532A20952o630p183p130o575n791m873l803k768k098j817j532r28k22J36L0
54517F9768k48m22m64m55m09l39k98l06l02k97m29p73j131j193q62m12j83k05
54499F1040k02N9M89Q21R02Q00O88O90Q20R10P24K75o4L8M13N86M39L31M79O00
54479G0838M20J19k9j72n65j023j158j095j327j840j959j254r7R24J681K209K187
54462F7859J278j62j218j338q00k71j47k91k07M70J486K060J693P52J6k58m46
54445G0476q58j328j558j450j057m81K5K16K06L72P67R94P83L43o4m90r04q47
54427F5145nJ139J682J397R16Q18J005J100J128J480K333L330L751L075J544J92
$$ plain form
54411 90030 90067 91141 93367 95852 97749 99031 100173 101316 102020 101802 100718 99351 98296 97668 97075 96055
54395 96055 94580 93111 92083 91377 90437 88890 86872 84713 82534 80347 78341 76795 75785 75281 75395
54380 75395 76151 77017 77168 76436 75519 74961 74354 72999 71050 69420 68676 68592 68739 68949 69127 69182 69373 70238 71883
54361 71883 73695 75029 75935 76955 78570 81045 84410 88130 91126 92660 93119 93464 93993 94146 93546 92677
54345 92677 92322 92672 93267 93544 93239 92457 91597 91061 90721 89768 87384 83668 79696 76581 74629 73452 72664
54328 72664 72097 71514 70567 69236 68020 67374 67144 66843 66267 65506 64464 62898 60968 59249 57990 56741
54312 56741 55013 53023 51466 50773 50802 51109 51243 51028 50801 51136 52052 52782 52679 52131 52076 52729 53402 53555 53440
54293 53440 53501 53665 53676 53724 54259 55221 55967 56096 56054 56629 57950 59295 59986 60150 60357 60724 60844 60570 60341 60558
$$ packed form
54411I0030L7J074K226K485J897J282J142J143P04k18j084j367j055o28n93j020
54395I6055j475j469j028p06r40j547k018k159k179k187k006j546j010n04J14
54380G5395P56Q66J51p32r17n58o07j355j949j630p44q4J47K10J78N5J91Q65J645
54361G1883J812J334R06J020J615K475L365L720K996J534M59L45N29J53o00q69
54345I2677l55L50N95K77l05p82q60n36l40r53k384l716l972l115j952j177p88
54328G2664n67n83r47j331j216o46k30l01n76p61j042j566j930j719j259j249
54312E6741j728j990j557o93K9L07J34k15k27L35R16P30j03n48n5O53O73J53j15
54293E3440O1J64J1M8N35R62P46J29m2N75J321J345O91J64K07L67J20k74k29K17
$$ plain form
54273 60558 61035 61379 61576 61923 62642 63864 65673 67767 69391 70036 69987 69775 69424 68801 68376 68826 69892 70470
54255 70470 69956 68858 67860 66981 65997 65132 64813 65036 65328 65137 64138 62485 60895 60117 60122 60168 59806 59356 59254
54236 59254 59456 59770 60237 60788 61060 60980 61037 61465 61615 60790 59348 58285 58016 58254 58854 59947 61257 62077
54218 62077 62157 62040 62286 62847 63425 64022 64903 66259 68062 69971 71395 71932 71820 71625 71525 71287 70901 70674
54200 70674 70572 70087 69030 67870 66896 65568 63338 60774 59221 59373 60680 62118 63048 63254 62692 61511
54184 61511 60142 59102 58733 59049 59620 59631 58429 56189 53859 52320 51731 51703 51786 51609 50883 49692 48636
54167 48636 48302 48586 48838 48636 48107 47564 47254 47466 48383 49664 50681 51429 52642 54607 56395 56939 56471
54150 56471 56121 56348 56638 56729 57111 58008 58731 58597 57830 56993 56066 54773 53452 52861 53181 53760 53834 53145 51985
$$ packed form
54273F0558M77L44J97L47P19J222J809K094J624O45m9k12l51o23m25M50J066N78
54255G0470n14j098r98q79r84q65l19K23K92j91r99j653j590p78NM6l62m50j02
54236E9254K02L14M67N51K72q0N7M28J50q25j442j063k69K38O00J093J310Q20
54218F2077Q0j17K46N61N78N97Q81J356J803J909J424N37j12j95j00k38l86k27
54200G0674j02m85j057j160r74j328k230k564j553J52J307J438R30K06n62j181
54184F1511j369j040l69L16N71J1j202k240k330j539n89k8Q3j77p26j191j056
54167D8636l34K84K52k02n29n43l10K12R17J281J017P48J213J965J788N44m68
54150E6471l50K27K90R1L82Q97P23j34p67q37r27j293j321n91L20N79P4o89j160
$$ plain form
54131 51985 50992 50800 51465 52284 52498 52081 51547 51148 50715 50149 49610 49244 49079 49209 49690 50291 50696 50902 51138
54112 51138 51460 51830 52422 53361 54239 54478 54191 54079 54328 54221 53235 52019 51751 52768 54245 55225 55629 56157
54094 56157 57351 58921 60033 60186 59574 58594 57378 56059 55069 54654 54397 53782 53045 52823 53117 53385 53602
54077 53602 54344 55610 56514 56511 56158 56127 56286 56411 57090 58980 61589 63751 65193 66714 68811 70951 72392
54060 72392 73083 73405 73471 73079 72215 71330 71070 71685 72677 73230 73163 73241 74281 76208 78266 79972 81428 82888
54042 82888 84550 86720 89595 92796 95548 97464 98867 100182 101441 102602 104024 106289 109555 113333
54028 113333 116961 120235 123560 127396 131601 135477 138516 140833 142770 144439 145949 147636 149522 150836
54014 150836 150748 149541 148357 147679 146774 144888 142288 139607 136672 132697 127485 121839 116732 112475 108839
$$ packed form
54131E1985r93j92O65Q19K14m17n34l99m33n66n39l66j65J30M81O01M05K06K36
54112E1138L22L70N92R39Q78K39k87j12K49j07r86j216k68J017J477R80M04N28
54094E6157J194J570J112J53o12r80j216j319r90m15k57o15p37k22K94K68K17
54077E3602P42J266R04ll53l1J59J25O79J890K609K162J442J521K097K140J441
54060G2392O91L22O6l92q64q85k60O15R92N53o7P8J040J927K058J706J456J460
54042H2888J662K170K875L201K752J916J403J315J259J161J422K265L266L778
54028A13333L628L274L325L836M205L876L039K317J937J669J510J687J886J314
54014A50836q8j207j184o78r05j886k600k681k935l975n212n646n107m257l636
$$ plain form
53999 108839 105649 103025 101130 99886 99003 98211 97344 96199 94566 92581 90812 89668 88793 87470 85623
53984 85623 83996 83209 83049 82880 82401 81750 81163 80844 80895 81059 80758 79779 78695 78200 78123 77607 76306 74979
53966 74979 74642 75423 76494 77012 76913 76800 77228 78220 79467 80817 82410 84363 86516 88531 90168 91465
53950 91465 92824 94879 97983 101752 105400 108681 112173 116502 121674 127465 134035 141586 149678 157496
53936 157496 164749 171718 178345 183871 187586 189467 189807 188655 186004 182253 178135 174323 171369 169794
53922 169794 169847 171182 173012 174619 175658 176181 176658 177857 180365 184155 188724 193619 198646 203630 208269
53907 208269 212310 215665 218294 220104 221056 221257 220931 220301 219499 218451 216858 214511 211682 208987 206707
53892 206707 204360 201156 196813 191780 186700 181860 177239 172871 168938 165560 162630 159836 156751 152940
$$ packed form
53999A08839l190k624j895j244q83p92q67j145j633j985j769j144q75j323j847
53984H5623j627p87j60j69m79o51n87l19N1J64l01r79j084m95p7n16j301j327
53966G4979l37P81J071N18r9j13M28R92J247J350J593J953K153K015J637J297
53950I1465J359K055L104L769L648L281L492M329N172N791O570P551Q092P818
53936A57496P253O969O627N526L715J881L40j152k651l751m118l812k954j575
53922A69794N3J335J830J607J039N23M77J199K508L790M569M895N027M984M639
53907B08269M041L355K629J810R52K01l26o30q02j048j593k347k829k695k280
53892B06707k347l204m343n033n080m840m621m368l933l378k930k794l085l811
$$ plain form
53878 152940 148240 143056 138257 134616 132340 131140 130580 130283 129955 129487 128959 128327 127197 125143 122232 118943
53862 118943 115563 112015 108315 104822 101876 99532 97816 96820 96216 95121 92968 90315 88236 87087 86422
53847 86422 85959 85826 85773 84925 82870 80491 79192 79520 80864 82236 82958 82848 82273 81985 82462 83379 83952 83781
53829 83781 83122 82454 82096 82185 82620 82985 82912 82589 82641 83363 84400 85306 86148 87310 88889 90536 91812 92528
53811 92528 92837 93100 93650 94530 95448 96117 96682 97764 99971 103268 106811 109648 111719 113969 117219 121102
53795 121102 124539 127185 129862 133328 137170 140369 142660 144723 147048 149139 150059 149511 148157 146933 146201
53780 146201 145544 144329 142424 140278 138310 136427 134288 131876 129485 127199 124717 121819 118690 115635
53766 115635 112704 109832 107208 105157 103667 102335 100965 99978 99937 100649 101062 100289 98588 97001 96024 94994
$$ packed form
53878A52940m700n184m799l641k276j200n60k97l28m68n28o32j130k054k911l289
53862A18943l380l548l700l493k946k344j716r96o04j095k153k653k079j149o65
53847H6422m63j33n3q48k055k379j299L28J344J372P22j10n75k88M77R17N73j71
53829H3781o59o68l58Q9M35L65p3l23N2P22J037R06Q42J162J579J647J276P16
53811I2528L09K63N50Q80R18O69N65J082K207L297L543K837K071K250L250L883
53795A21102L437K646K677L466L842L199K291K063K325K091R20n48j354j224p32
53780A46201o57j215j905k146j968j883k139k412k391k286k482k898l129l055
53766A15635k931k872k624k051j490j332j370r87m1P12M13p73j701j587r77j030
$$ plain form
53750 94994 92989 90019 86966 84521 82679 81313 80697 81071 82042 82816 82995 82850 82865 83279 84039 84874 85384
53733 85384 85304 84804 84292 83897 83375 82627 81998 81853 82050 82093 81671 80881 80031 79441 79255 79228 78812 77767 76546
53714 76546 75781 75506 75305 75168 75619 76838 78146 78692 78371 77761 77413 77520 78027 78696 79191 79493 80152 81832
53696 81832 84534 87559 90196 92244 93884 95370 96907 98586 100319 101924 103299 104425 105298 106012 106789
53681 106789 107695 108435 108765 109072 110099 111985 113910 114957 115066 114955 115254 116032 117046 118162 119404 120676
53665 120676 121625 121910 121609 121233 121167 121236 121065 120767 120934 121834 122924 123346 122799 121774 121103 121402 122783 124824
53647 124824 126769 127891 127910 127151 126276 125698 125217 124372 123134 121979 121163 120330 119159 118059 117700 118068 118564
53630 118564 118898 119251 119584 119572 119401 119883 121338 122982 123880 124039 124050 124116 124072 124061 124552 125782 127639 129940 132390
$$ packed form
53750I4994k005k970l053k445j842j366o16L74R71P74J79j45J5M14P60Q35N10
53733H5384q0n00n12l95n22p48o29j45J97M3m22p90q50n90j86k7m16j045j221
53714G6546p65k75k01j37M51J219J308N46l21o10l48J07N07O69M95L02O59J680
53696H1832K702L025K637K048J640J486J537J679J733J605J375J126Q73P14P77
53681A06789R06P40L30L07J027J886J925J047J09j11K99P78J014J116J242J272
53665A20676R49K85l01l76o6O9j71k98J67R00J090M22n47j025o71K99J381K041
53647A24824J945J122J9p59q75n78m81q45j238j155q16q33j171j100l59L68M96
53630A18564L34L53L33j2j71M82J455J644Q98J59J1O6m4j1M91J230J857K301K450
$$ plain form
53611 132390 134421 135690 136631 138028 140024 142076 143872 145676 147641 149314 150248 150721 151494 153024 155185
53596 155185 157678 160412 163421 166522 169205 170990 171950 172757 174081 175979 177967 179604 180842 181913 183074
53581 183074 184469 186076 187759 189415 191060 192743 194483 196276 198002 199301 199784 199495 198944 198582 198484 198584
53565 198584 198822 198896 198351 197243 196249 195730 195121 193773 191997 190667 190090 189959 190135 190678 191260 191390 191238 191467
53547 191467 192188 192868 193344 194021 194831 194935 194008 193025 193130 194196 195153 195302 194709 193652 192378 191271 190694
53530 190694 190597 190641 190693 190949 191682 193024 194831 196589 197740 198374 199386 201643 205113 209015 212607 215663
53514 215663 218505 221842 226287 231729 237420 242961 248831 255585 262902 269971 276600 283346 290655 298451
53500 298451 306525 314845 323384 332149 341473 351845 363267 375129 386956 399061 412213 426747
$$ packed form
53611A32390K031J269R41J397J996K052J796J804J965J673R34M73P73J530K161
53596A55185K493K734L009L101K683J785R60Q07J324J898J988J637J238J071J161
53581A83074J395J607J683J656J645J683J740J793J726J299M83k89n51l62r8J00
53565A98584K38P4n45j108r94n19o09j348j776j330n77j31J76N43N82J30j52K29
53547A91467P21O80M76O77Q10J04r27r83J05J066R57J49n93j057j274j107n77
53530A90694r7M4N2K56P33J342J807J758J151O34J012K257L470L902L592L056
53514B15663K842L337M445N442N691N541N870O754P317P069O629O746P309P796
53500B98451Q074Q320Q539Q765R324J0372J1422J1862J1827J2105J3152J4534
$$ plain form
53488 426747 442144 457441 472017 486022 500060 514515 529288 544121 558873 573396 587436
53477 587436 600979 614469 628414 642847 657416 671818 685962 699885 713672 727264 740104
53466 740104 751410 761145 770425 780482 791467 802778 814219 826101 838310 850109 860956 870869
53454 870869 879797 887324 893275 898051 901962 904654 905506 904198 900667 895007 887833 880264 872965 865478
53440 865478 856997 847559 837988 828772 819583 809853 799367 788195 776419 764141 751555 738929 726646
53427 726646 715135 704557 694543 684472 674020 663308 652682 642629 633837 626883 621679 617497
53415 617497 613694 610226 607380 605278 603862 603130 603143 603894 605355 607576 610589 614307 618734 624109 630598
53400 630598 637914 645619 653841 663352 674671 687338 700345 713193 726227 740048 754933 770908
$$ packed form
53488D26747J5397J5297J4576J4005J4038J4455J4773J4833J4752J4523J4040
53477E87436J3543J3490J3945J4433J4569J4402J4144J3923J3787J3592J2840
53466G40104J1306R735R280J0057J0985J1311J1441J1882J2209J1799J0847R913
53454H70869Q928P527N951M776L911K692Q52j308l531n660p174p569p299p487
53440H65478q481r438r571r216r189r730j0486j1172j1776j2278j2586j2626j2283
53427G26646j1511j0578j0014j0071j0452j0712j0626j0053q792o954n204m182
53415F17497l803l468k846k102j416p32J3P51J461K221L013L718M427N375O489
53400F30598P316P705Q222R511J1319J2667J3007J2848J3034J3821J4885J5975
$$ plain form
53388 770908 788016 806238 825337 845096 865675 887549 911063 936273 963190 991854 1021915
53377 1021915 1052394 1082345 1111909 1142382 1174904 1209175 1243721 1277379 1310180 1342753 1375217
53366 1375217 1407006 1437528 1466639 1494462 1521049 1546303 1570080 1592289 1612995 1632384 1650511
53355 1650511 1667101 1681785 1694461 1705216 1713896 1719936 1722659 1721554 1716309 1706858 1693462 1676507
53343 1676507 1656137 1632344 1605505 1576581 1546557 1515878 1484608 1452971 1421528 1390938 1361695
53332 1361695 1334061 1308022 1283317 1259468 1235816 1211701 1186876 1161672 1136475 1111108 1085159
53321 1085159 1058900 1033319 1009058 985866 963468 942381 923308 906036 889591 873440 858084
53310 858084 844483 833206 824050 816139 808452 800518 792555 784752 776744 768129 759172 750534 742431 734550
$$ packed form
53388G70908J7108J8222J9099J9759K0579K1874K3514K5210K6917K8664L0061
53377A021915L0479K9951K9564L0473L2522L4271L4546L3658L2801L2573L2464
53366A375217L1789L0522K9111K7823K6587K5254K3777K2209K0706J9389J8127
53355A650511J6590J4684J2676J0755Q680O040K723j105n245r451j3396j6955
53343A676507k0370k3793k6839k8924l0024l0679l1270l1637l1443l0590k9243
53332A361695k7634k6039k4705k3849k3652k4115k4825k5204k5197k5367k5949
53321A085159k6259k5581k4261k3192k2398k1087j9073j7272j6445j6151j5356
53310H58084j3601j1277r156p911p687p934p963p803q008q615q957q638q103p881
$$ plain form
53296 734550 726661 718882 711463 704786 699420 695680 693192 691421 690507 691027 692981 695671 698626 702081 706465
53281 706465 711998 718840 726983 735871 744744 753538 762878 773056 783699 794624 806254 818831 831939
53268 831939 845200 858744 872531 885957 898660 910969 922904 933508 942105 949563 957186 964683
53256 964683 970388 973351 974156 973712 972359 970285 967689 964085 958386 950213 940410 929741 917806 903888
53242 903888 888258 871857 855067 837604 819429 801036 782835 764920 747539 731195 716037
53231 716037 701584 687378 673642 660966 649463 638493 627206 615167 602404 588987 574853
53220 574853 560144 545570 532081 519971 508517 496744 484499 472567 461834 452649 444986 438811
53208 438811 434006 430128 426553 422805 418641 413912 408593 402855 396840 390343 382883 374114 364043 353033
$$ packed form
53296G34550p889p779p419o677n366l740k488j771r14N20J954K690K955L455M384
53281G06465N533O842Q143Q888Q873Q794R340J0178J0643J0925J1630J2577J3108
53268H31939J3261J3544J3787J3426J2703J2309J1935J0604Q597P458P623P497
53256I64683N705K963Q05m44j353k074k596l604n699q173r803j0669j1935j3918
53242I03888j5630j6401j6790j7463j8175j8393j8201j7915j7381j6344j5158
53231G16037j4453j4206j3736j2676j1503j0970j1287j2039j2763j3417j4134
53220E74853j4709j4574j3489j2110j1454j1773j2245j1932j0733r185p663o175
53208D38811m805l878l575l748m164m729n319n738o015o497p460q769j0071j1010
$$ plain form
53194 353033 341909 331901 323860 317278 310571 302709 294295 286696 280515 275350 270638 265963 260745 254566
53180 254566 248008 242309 237748 232987 226598 218807 211121 204575 199034 194037 189518 185562 182003 178569
53166 178569 175126 171590 167921 164344 161309 158969 156915 154647 152189 149990 148356 147213 146362 145701 145107
53151 145107 144376 143444 142582 142122 142000 141771 141166 140396 139742 139035 137882 136359 135049 134194 133228 131482 129174
53134 129174 127267 126343 126040 125684 125103 124561 124122 123565 122885 122494 122634 122836 122305 120857 119182 118103 117798
53117 117798 117852 117853 117712 117589 117764 118404 119223 119542 119046 118376 118549 119795 121339 122349 122645 122413 121766 120888 120143
53098 120143 119662 119095 118141 117099 116478 116288 116104 115733 115437 115459 115705 115952 116176 116553 117212 117963 118312 117900 117021
53079 117021 116471 116794 117859 119280 120886 122584 124149 125487 126835 128382 129996 131677 133860 136765 139754
$$ packed form
53194C53033j1124j0008q041o582o707p862q414p599o181n165m712m675n218o179
53180B54566o558n699m561m761o389p791p686o546n541m997m519l956l559l434
53166A78569l443l536l669l577l035k340k054k268k458k199j634j143q51o61n94
53151A45107p31r32q62m60j22k29o05p70o54p07j153j523j310q55r66j746k308
53134A29174j907r24l03l56n81n42m39n57o80l91J40K02n31j448j675j079l05
53117A17798N4Jj41j23J75O40Q19L19m96o70J73J246J544J010K96k32o47q78p45
53098A20143m81n67r54j042o21j90j84l71k96K2K46K47K24L77O59P51L49m12q79
53079A17021n50L23J065J421J606J698J565J338J348J547J614J681K183K905K989
$$ plain form
53064 139754 141990 143490 144866 146192 146932 147020 147122 147541 147596 146539 144558 142426 140578 138959 137454 136053
53048 136053 134764 133707 133068 132713 132107 130935 129544 128510 127958 127656 127548 127754 128138 128291 127941 127128 126005
53031 126005 124773 123819 123588 124165 125122 125873 126163 126189 126317 126660 126942 126828 126455 126467 127439 129353 131708 133953
53013 133953 135731 136885 137516 137968 138534 139138 139417 139114 138360 137561 137060 136842 136628 136342 136353 136984 137865 138238
52995 138238 137985 137920 138741 140155 141366 142094 142589 142983 143277 143814 145022 146618 147748 148146 148547 149632 151149
52978 151149 152477 153561 154701 155755 156266 156360 156831 158215 160180 162029 163370 164116 164259 164026 164016 164764 166209
52961 166209 167856 169367 170719 171923 172960 174027 175418 176983 178038 178075 177337 176445 175682 174977 174380 174034
52945 174034 173725 173033 172121 171870 172849 174504 175809 176470 176932 177379 177404 176861 176392 176687 177630 178671 179745 181238
$$ packed form
53064A39754K236J500J376J326P40Q8J02M19N5j057j981k132j848j619j505j401
53048A36053j289j057o39l55o06j172j391j034n52l02j08K06L84J53l50q13j123
53031A26005j232r54k31N77R57P51K90K6J28L43K82j14l73J2R72J914K355K245
53013A33953J778J154O31M52N66O04K79l03p54p99n01k18k14k86J1O31Q81L73
52995A38238k53o5Q21J414J211P28M95L94K94N37J208J596J130L98M01J085J517
52978A51149J328J084J140J054N11R4M71J384J965J849J341P46J43k33j0P48J445
52961A66209J647J511J352J204J037J067J391J565J055L7p38q92p63p05n97l46
52945A74034l09o92r12k51R79J655J305O61M62M47K5n43m69K95R43J041J074J493
$$ plain form
52927 181238 183123 184777 185790 186455 187229 188136 189020 190000 191294 192847 194536 196507 198851 201135 202751
52912 202751 203584 203848 203374 201799 199540 197741 196863 195987 194038 191168 188288 185705 183016 180133 177548
52897 177548 175483 173513 171212 168619 165870 162921 159916 157386 155718 154758 154186 153960 154077 154226 154088 153819
52881 153819 153856 154364 155141 155940 156579 156862 156778 156809 157661 159626 162317 165022 167123 168268 168463 168058 167337 166033
52863 166033 163527 159715 155468 151934 149498 147640 145710 143547 141341 139265 137465 136132 135247 134355 132901
52848 132901 130860 128796 127252 126306 125738 125336 124887 124158 123118 122012 120983 119839 118391 116791 115256
52833 115256 113660 111846 110140 109064 108522 107798 106513 105130 104308 104103 104034 103684 103027 102406 102330 103064 104215
52816 104215 104984 105017 104754 104819 105366 106281 107680 109735 112187 114488 116459 118430 120707 123149 125400 127316
$$ packed form
52927A81238J885J654J013O65P74R07Q84R80J294J553J689J971K344K284J616
52912B02751Q33K64m74j575k259j799q78q76j949k870k880k583k689k883k585
52897A77548k065j970k301k593k749k949l005k530j668r60n72k26J17J49j38k69
52881A53819L7N08P77P99O39K83q4L1Q52J965K691K705K101J145J95m05p21j304
52863A66033k506l812m247l534k436j858j930k163k206k076j800j333q85q92j454
52848A32901k041k064j544r46n68m02m49p29j040j106j029j144j448j600j535
52833A15256j596j814j706j076n42p24j285j383q22k05o9l50o57o21p6P34J151
52816A04215P69L3k63O5N47R15J399K055K452K301J971J971K277K442K251J916
$$ plain form
52800 127316 129049 130828 132779 134918 137248 139794 142423 144697 146080 146405 146029 145468 144999 144668 144433 144104
52784 144104 143306 141812 139892 138180 137192 136999 137239 137349 136906 135937 134872 134065 133457 132802 132142 131883 132395
52767 132395 133560 134688 134898 133772 131810 130099 129402 129541 129711 129268 128227 127132 126544 126483 126385 125739 124749
52750 124749 124145 124356 125202 126377 127747 129036 129738 129703 129407 129268 129021 128242 127131 126258 125696 125041 124256 123917
52732 123917 124500 125796 127198 128354 129431 130859 132804 134837 136320 137286 138593 140906 143852 146624 149091
52717 149091 151696 154455 156781 158348 159436 160362 161191 162159 163629 165302 166109 165430 163998 163091 163107 163422
52701 163422 163429 163120 162722 162235 161579 160899 160535 160704 161284 161933 162470 163099 164185 165791 167507 168747 169186 168994
52683 168994 168764 169077 169936 170680 170666 169923 168963 168077 167163 166124 165004 163733 162119 160159 158001 155615 152980
$$ packed form
52800A27316J733J779J951K139K330K546K629K274J383L25l76n61m69l31k35l29
52784A44104p98j494j920j712r88j93K40J10m43r69j065q07o08o55o60k59N12
52767A32395J165J128K10j126j962j711o97J39J70m43j041j095n88o1r8o46r90
52750A24749o04K11Q46J175J370J289P02l5k96j39k47p79j111q73n62o55p85l39
52732A23917N83J296J402J156J077J428J945K033J483R66J307K313K946K772K467
52717A49091K605K759K326J567J088R26Q29R68J470J673Q07o79j432r07J6L15
52701A63422Pl09l98m87o56o80l64J69N80O49N37O29J086J606J716J240M39j92
52683A68994k30L13Q59P44j4p43r60q86r14j039j120j271j614j960k158k386k635
$$ plain form
52666 152980 150674 149619 149917 150352 149504 147167 144389 142306 141237 140790 140547 140582 141274 142600 143813 144183
52650 144183 144008 144414 146119 148898 152306 156213 160252 163392 164697 164294 163069 161746 160663 160130 160308
52635 160308 160799 160861 160090 158646 156884 155131 153662 152513 151387 150131 149187 149158 149930 150620 150379 149003 146874
52618 146874 144706 143263 142843 142931 142681 141841 140909 140400 140318 140362 140301 139993 139382 138651 138211 138350 139018 139943 140772
52599 140772 141189 141163 141132 141690 142962 144429 145400 145541 144984 144082 143038 141706 139902 137983 136794 136743 137193
52582 137193 137219 136714 136241 135978 135539 134778 134053 133483 132630 131259 129851 128951 128486 128158 128085 128547 129333 129876 129932
52563 129932 129723 129431 128862 127627 125549 123019 120990 120326 120957 121924 122437 122512 122352 121674 120204 118478 117363
52546 117363 116880 116222 114977 113667 112884 112513 112189 112008 112273 112770 112815 112075 110975 110211 109985 109839 109222 108200
$$ packed form
52666A52980k306j055K98M35q48k337k778k083j069m47k43L5O92J326J213L70
52650A44183j75M06J705K779L408L907M039L140J305m03j225j323j083n33J78
52635A60308M91O2p71j444j762j753j469j149j126j256r44k9P72O90k41j376k129
52618A46874k168j443m20Q8k50q40r32n09q2M4o1l08o11p31m40J39O68R25Q29
52599A40772M17k6l1N58J272J467R71J41n57r02j044j332j804j919j189n1M50
52582A37193K6n05m73k63m39p61p25n70q53j371j408r00m65l28p3M62P86N43N6
52563A29932k09k92n69j235k078k530k029o64O31R67N13P5j60o78j470j726j115
52546A17363m83o58j245j310p83l71l24j81K65M97M5p40j100p64k26j46o17j022
$$ plain form
52528 108200 107511 107830 108978 110041 110330 110054 109975 110585 111763 113089 114246 115066 115436 115310 114815 114235 113793
52511 113793 113414 112763 111600 110150 109023 108709 109146 109819 110223 110181 109741 108931 107760 106418 105265 104557 104246
52494 104246 104154 104237 104562 105115 105823 106672 107619 108372 108570 108217 107729 107440 107279 107038 106694 106296 105802 105233 104767
52475 104767 104416 103931 103319 103123 103733 104632 104942 104630 104511 104992 105524 105551 105345 105409 105588 105346 104642 103893 103279
52456 103279 102669 102198 102284 102935 103556 103625 103203 102610 101987 101416 101167 101457 102182 103113 104242 105656 107168 108373
52438 108373 109062 109370 109510 109541 109420 109207 109164 109691 111022 112889 114569 115470 115624 115490 115355 115165 114877 114641
52420 114641 114545 114476 114452 114844 115911 117174 117597 116563 114550 112678 111688 111454 111420 111311 111269 111398 111455 111141 110593
52401 110593 110354 110798 111767 112831 113754 114542 115173 115522 115526 115284 114912 114463 113980 113479 112873 112150 111700 112210 113951
$$ packed form
52528A08200o89L19J148J063K89k76p9O10J178J326J157Q20L70j26m95n80m42
52511A13793l79o51j163j450j127l14M37O73M04m2m40q10j171j342j153p08l11
52494A04246r2Q3L25N53P08Q49R47P53J98l53m88k89j61k41l44l98m94n69m66
52475A04767l51m85o12j96O10Q99L10l12j19M81N32K7k06O4J79k42p04p49o14
52456A03279o10m71Q6O51O21O9m22n93o23n71k49K90P25R31J129J414J512J205
52438A08373O89L08J40L1j21k13m3N27J331J867J680R01J54j34j35j90k88k36
52420A14641r6o9k4L92J067J263M23j034k013j872r90k34l4j09m2J29N7l14n48
52401A10593k39M44R69J064R23P88O31L49Mk42l72m49m83n01o06p23m50N10J741
$$ plain form
52382 113951 116277 118103 118926 119166 119485 120021 120462 120680 120948 121502 122146 122522 122621 122795 123234 123732 124111 124658
52364 124658 125820 127532 129143 130115 130589 131143 132182 133681 135389 137078 138672 140169 141428 142025 141640
52349 141640 140688 140274 141184 143091 145054 146597 147906 149155 150226 151150 152263 153701 155121 156186 156968
52334 156968 157623 158018 157999 157801 157814 158123 158582 159231 160337 162089 164502 167452 170645 173743 176777 180192 184175
52317 184175 188225 191824 195285 199376 204276 209505 214814 220502 226749 233305 240015 246983 253964 260221
52303 260221 265452 270394 276037 282602 289763 297447 305726 314176 322090 329388 336739 344644 352817 360729
52289 360729 368461 376716 386109 396585 407538 418406 429139 440000 451004 461760 471927 481573
52277 481573 490909 499933 508620 517195 525862 534412 542506 550206 557835 565241 571721 576803 580818 584506
$$ packed form
52382A13951K326J826Q23K40L19N36M41K18K68N54O44L76R9J74M39M98L79N47
52364A24658J162J712J611R72M74N54J039J499J708J689J594J497J259N97l85
52349A41640r52m14R10J907J963J543J309J249J071R24J113J438J420J065P82
52334A56968O55L95j9j98J3L09M59O49J106J752K413K950L193L098L034L415L983
52317A84175M050L599L461M091M900N229N309N688O247O556O710O968O981O257
52303B60221N231M942N643O565P161P684Q279Q450P914P298P351P905Q173P912
52289C60729P732Q255R393J0476J0953J0868J0733J0861J1004J0756J0167R646
52277D81573R336R024Q687Q575Q667Q550Q094P700P629P406O480N082M015L688
$$ plain form
52263 584506 588335 592386 596655 601085 605336 608831 611278 613074 614971 617205 619175 620246 620672 621260 622167
52248 622167 622646 622223 621524 621491 622334 623868 626397 630352 635273 640192 645123 651255 659316 668506 677561 686267
52232 686267 695341 705208 715570 725986 736326 746586 756639 766282 775400 784075 792545 800943 809073
52219 809073 816626 823596 830139 836041 840789 844374 847562 851070 854762 857946 860068 860822 859958 857515 854036
52204 854036 850063 845533 840048 833549 826317 818489 810142 801786 794183 787499 781160 774751 768643 763422
52190 763422 759006 754727 750208 745802 742076 739056 736146 732742 728760 724516 720304 716311 712855 710320
52176 710320 708673 707272 705337 702498 698807 694522 690115 686201 683100 680535 678001 675323 672594 669761
52162 669761 666651 663380 660331 657669 655203 652833 650755 649035 647219 644696 641403 637935 634896 632339
$$ packed form
52263E84506L829M051M269M430M251L495K447J796J897K234J970J071M26N88R07
52248F22167M79m23o99l3Q43J534K529L955M921M919M931O132Q061R190R055Q706
52232F86267R074R867J0362J0416J0340J0260J0053R643R118Q675Q470Q398Q130
52219H09073P553O970O543N902M748L585L188L508L692L184K122P54q64k443l479
52204H54036l973m530n485o499p232p828q347q356p603o684o339o409o108n221
52190G63422m416m279m519m406l726l020k910l404l982m244m212l993l456k535
52176G10320j647j401j935k839l691m285m407l914l101k565k534k678k729k833
52162F69761l110l271l049k662k466k370k078j720j816k523l293l468l039k557
$$ plain form
52148 632339 629943 627605 625521 623673 621566 618799 615642 612664 609924 607021 603856 600768 597800 594538
52134 594538 591003 588036 586279 585232 583859 581750 579118 576086 572710 569450 566740 564143 560737 556416
52120 556416 552132 548717 546164 544268 543231 543207 543828 544663 545818 547668 550319 553676 557720 562363 567191
52105 567191 571802 576264 580951 586055 591500 597249 603466 610447 618573 628181 639263 651364 663980
52092 663980 676997 690542 704553 718734 732896 747131 761547 776054 790469 804724 818819
52081 818819 832619 845825 858245 870011 881353 892205 902155 910869 918394 925058 931227 937172 942833
52068 942833 947516 950217 950572 949251 947137 944417 940886 936822 932908 929385 925913 922303 918820 915607
52054 915607 912332 908578 904192 899126 893428 887524 882060 877201 872486 867624 863050 859367 856547 854004
$$ packed form
52148F32339k396k338k084j848k107k767l157k978k740k903l165l088k968l262
52134E94538l535k967j757j047j373k109k632l032l376l260k710k597l406m321
52120E56416m284l415k553j896j037k4O21Q35J155J850K651L357M044M643M828
52105E67191M611M462M687N104N445N749O217O981Q126R608J1082J2101J2616
52092F63980J3017J3545J4011J4181J4162J4235J4416J4507J4415J4255J4095
52081H18819J3800J3206J2420J1766J1342J0852R950Q714P525O664O169N945N661
52068I42833M683K701L55j321k114k720l531m064l914l523l472l610l483l213
52054I15607l275l754m386n066n698n904n464m859m715m862m574l683k820k543
$$ plain form
52040 854004 851225 848076 844719 841535 839060 837802 838036 839626 841834 843557 844221 844449 845368 847297 849682
52025 849682 852289 855604 859754 863777 866547 867946 868662 869236 869789 870289 870535 870133 868853 866770 863753 859250
$$ packed form
52040H54004k779l149l357l184k475j258K34J590K208J723O64K28R19J929K385
52025H49682K607L315M150M023K770J399P16N74N53N00K46m02j280k083l017m503
$$ [...]
##END NTUPLES=NMR SPECTRUM
##END=
