##TITLE=NES1019_944594_9265988_20jGaNkMBR
##JCAMPDX= 6.0         $$ Bruker NMR JCAMP-DX V2.0
##DATA TYPE= NMR SPECTRUM
##DATA CLASS= NTUPLES
##ORIGIN= BRUKER
##OWNER= Administrator
$$ 1.72 TOPSPIN		Version 2.1
$$ 2015-07-09 17:20:21.394 -0700  Administrator@X
$$ Compression mode = diff/dup
##.OBSERVE FREQUENCY= 400.02188249412
##.OBSERVE NUCLEUS= ^1H
##.ACQUISITION MODE= SIMULTANEOUS (DQD)
##.ACQUISITION SCHEME= undefined
##.AVERAGES= 8
##.DIGITISER RES= 22
##SPECTROMETER/DATA SYSTEM= spect
##.PULSE SEQUENCE= zg30
##.SOLVENT NAME= COFFEE_meoh
##.SHIFT REFERENCE= INTERNAL, COFFEE_meoh, 1, 14.98509
##AUDIT TRAIL= $$ (NUMBER, WHEN, WHO, WHERE, PROCESS, VERSION, WHAT)
$$ ##TITLE= Audit trail, TOPSPIN		Version 2.1
$$ ##JCAMPDX= 5.01
$$ ##ORIGIN= Bruker BioSpin GmbH
$$ ##OWNER= Administrator
$$ $$ E:\/data/COFFEE/nmr/NES1019_944594_9265988_20jGaNkMBR/10/pdata/1/auditp.txt
$$ ##AUDIT TRAIL=  $$ (NUMBER, WHEN, WHO, WHERE, PROCESS, VERSION, WHAT)
(   1,<2015-07-09 17:20:14.128 -0700>,<Administrator>,<X>,<go>,<TOPSPIN 2.1>,
      <created by zg
	started at 2015-07-09 17:19:07.831 -0700,
	POWCHK enabled, PULCHK disabled,
       configuration hash MD5:
       21 0F 79 D6 B3 7B B4 F6 88 20 88 DB 03 48 BD 9F
       data hash MD5: 64K
       8D C8 36 CB C4 C1 EB 60 1A B3 91 BE 99 44 41 AA>)
(   2,<2015-07-09 17:20:17.300 -0700>,<Administrator>,<X>,<proc1d>,<TOPSPIN 2.1>,
      <Start of raw data processing
       efp LB = 0 FT_mod = 6 PKNL = 1 PHC0 = 0 PHC1 = 0 SI = 32K 
       data hash MD5: 32K
       04 92 A8 A9 97 E6 8B DE D1 A7 B9 9C 45 EA 87 4C>)
(   3,<2015-07-09 17:20:17.597 -0700>,<Administrator>,<X>,<proc1d>,<TOPSPIN 2.1>,
      <pk PHC0 = 91.56006 PHC1 = 0 
       data hash MD5: 32K
       DC 34 1C E8 2E A5 31 F4 76 AE 13 77 0F EA 98 D6>)
(   4,<2015-07-09 17:20:17.722 -0700>,<Administrator>,<X>,<proc1d>,<TOPSPIN 2.1>,
      <abs ABSG = 1 
       data hash MD5: 32K
       CF AD 64 6C 5C 95 6C 5A DA 10 7E 05 68 47 1E D6>)
(   5,<2015-07-09 17:20:17.785 -0700>,<Administrator>,<X>,<proc1d>,<TOPSPIN 2.1>,
      <abs ABSG = 2 
       data hash MD5: 32K
       A4 50 E6 32 0D F8 9C 00 A4 B5 57 13 4E C1 4E B3>)
(   6,<2015-07-09 17:20:17.847 -0700>,<Administrator>,<X>,<proc1d>,<TOPSPIN 2.1>,
      <abs ABSG = 3 
       data hash MD5: 32K
       10 76 25 D7 00 95 54 A3 4C 0F 74 40 3B 22 75 77>)
(   7,<2015-07-09 17:20:17.910 -0700>,<Administrator>,<X>,<proc1d>,<TOPSPIN 2.1>,
      <abs ABSG = 4 
       data hash MD5: 32K
       50 B6 44 0D 5A AB 46 6F 1C 32 49 3F 7E 28 95 7B>)
(   8,<2015-07-09 17:20:17.972 -0700>,<Administrator>,<X>,<proc1d>,<TOPSPIN 2.1>,
      <abs ABSG = 5 
       data hash MD5: 32K
       44 0F 77 1F 41 9F E4 86 33 98 D5 EC 41 32 04 47>)
$$ ##END=
$$ 
$$ $$ hash MD5
$$ $$ 93 15 FC 16 8C E2 4B EC DF 8A 27 90 28 B5 75 98
##$RELAX= 
##$RELAX= 
##$RELAX= 
##$RELAX= 
##$RELAX= 
##$RELAX= 
##$RELAX= 
$$ Bruker specific parameters
$$ --------------------------
##$DU= <E:\>
##$EXPNO= 10
##$NAME= <NES1019_944594_9265988_20jGaNkMBR>
##$PROCNO= 1
$$ [...]
150 150 150 150 150 150 150 150
##$TP07= 0
##$TPNAME0= <>
##$TPNAME1= <>
##$TPNAME2= <>
##$TPNAME3= <>
##$TPNAME4= <>
##$TPNAME5= <>
##$TPNAME6= <>
##$TPNAME7= <>
##$TPOAL= (0..7)
0.5 0.5 0.5 0.5 0.5 0.5 0.5 0.5
##$TPOFFS= (0..7)
0 0 0 0 0 0 0 0
##$TUNHIN= 0
##$TUNHOUT= 0
##$TUNXOUT= 0
##$USERA1= <user>
##$USERA2= <user>
##$USERA3= <user>
##$USERA4= <user>
##$USERA5= <user>
##$V9= 5
##$VALIST= <valist>
##$VCLIST= <CCCCCCCCCCCCCCC>
##$VD= 0
##$VDLIST= <DDDDDDDDDDDDDDD>
##$VPLIST= <PPPPPPPPPPPPPPP>
##$VTLIST= <TTTTTTTTTTTTTTT>
##$WBST= 2048
##$WBSW= 25
##$XGAIN= (0..3)
0 0 0 0
##$XL= 0
##$YL= 0
##$YMAX_a= 575724
##$YMIN_a= -482251
##$ZGOPTNS= <>
##$ZL1= 120
##$ZL2= 120
##$ZL3= 120
##$ZL4= 120
##$ABSF1= 14.98509
##$ABSF2= -5.573092
##$ABSG= 5
##$ABSL= 3
##$ALPHA= 0
##$AQORDER= 0
##$ASSFAC= 0
##$ASSFACI= 0
##$ASSFACX= 0
##$ASSWID= 0
##$AUNMP= <proc_prof1d_extract_pilot.lims>
##$AXLEFT= 0
##$AXNAME= <>
##$AXNUC= <1H>
##$AXRIGHT= 0
##$AXTYPE= 0
##$AXUNIT= <>
##$AZFE= 0.1
##$AZFW= 0.1
##$BCFW= 0
##$BC_mod= 0
##$BYTORDP= 0
##$COROFFS= 0
##$CY= 15
##$DATMOD= 1
##$DC= 0
##$DFILT= <>
##$DTYPP= 0
##$F1P= 0
##$F2P= 0
##$FCOR= 0.5
##$FTSIZE= 32768
##$FT_mod= 6
##$GAMMA= 0
##$GB= 0
##$INTBC= 1
##$INTSCL= 1
##$ISEN= 128
##$LB= 0
##$LEV0= 0
##$LPBIN= 0
##$MAXI= 10000
##$MC2= 0
##$MEAN= 0
##$ME_mod= 0
##$MI= 0
##$NCOEF= 0
##$NC_proc= -8
##$NLEV= 6
##$NOISF1= 0
##$NOISF2= 0
##$NSP= 0
##$NTH_PI= 0
##$NZP= 0
##$OFFSET= 14.98509
##$PC= 1
##$PHC0= 91.56006
##$PHC1= 0
##$PH_mod= 1
##$PKNL= yes
##$PPARMOD= 0
##$PPDIAG= 0
##$PPIPTYP= 0
##$PPMPNUM= 2147483647
##$PPRESOL= 1
##$PSCAL= 4
##$PSIGN= 0
##$PYNMP= <proc.py>
##$REVERSE= no
##$SF= 400.02
##$SI= 32768
##$SIGF1= 0
##$SIGF2= 0
##$SINO= 400
##$SIOLD= 32768
##$SPECTYP= <>
##$SREGLST= <1H.CDCl3>
##$SSB= 0
##$STSI= 32768
##$STSR= 0
##$SW_p= 8223.68421052631
##$SYMM= 0
##$S_DEV= 0
##$TDeff= 65536
##$TDoff= 0
##$TI= <>
##$TILT= no
##$TM1= 0
##$TM2= 0
##$TOPLEV= 0
##$USERP1= <user>
##$USERP2= <user>
##$USERP3= <user>
##$USERP4= <user>
##$USERP5= <user>
##$WDW= 1
##$XDIM= 32768
##$YMAX_p= 451052328
##$YMIN_p= -669299
##$CURPLOT= <Network HP LaserJet P1505>
##$CURPRIN= <$Network HP LaserJet P1505>
##$DFORMAT= <normdp>
##$LAYOUT= <+/1D_H.xwp>
##$LFORMAT= <normlp>
##$PFORMAT= <normpl>
##$SURQMSG= 1
$$ End of Bruker specific parameters
$$ ---------------------------------
##NTUPLES= NMR SPECTRUM
##VAR_NAME=  FREQUENCY,     SPECTRUM/REAL,   SPECTRUM/IMAG
##SYMBOL=    X,             R,               I
##VAR_TYPE=  INDEPENDENT,   DEPENDENT,       DEPENDENT
##VAR_FORM=  AFFN,          ASDF,            ASDF
##VAR_DIM=   32768,         32768,           32768
##UNITS=     HZ,            ARBITRARY UNITS, ARBITRARY UNITS
##FACTOR=    0.250966925370066, 1,           1
##FIRST=     8223.43324360094, 1087,         -57641
##LAST=      0,             -151494,         -115151
##MIN=       0,             -669299,         0
##MAX=       8223.43324360094, 451052328,    0
$$ Real data points
##PAGE= N=1
##DATA TABLE= (X++(R..R)), XYDATA
$$ [...]
19493b38370j43471J87741j08859Q9027A50187a65801L7047j28805a27357Q236
19483a19121e865E6552N3556d2500R023k31634g3640A14488m8107K28118c5421
19471B3811J79106D302J80601b77551A35299c6773k771F7587n696J30053q9454
19460A02490a90508n4619b6629A79115e0960n2205d0961j07168j07198L7144A90646
19448a73920B1850c34669A96561p2191M49997C6639B639a55974j06971E8256b4020
19436e1897r5286J4529l2221c6667j16297C683a46602L6260b127C6086A6092a91146
19423b30530k69093a73844B7478a05242K1499B59140n3831g5498K0177j07287
19413a62608K7938C7133j7804Q0619J82473a1767A94357E4077J15685b4521j08661
$$ y = [-238370, -381841, -194100, -302959, -213932, 150187, -165801, -128754, -257559, -127357, -119121, -5865, 56552, 110108, -42500, -33477, -265111, -73640, 114488, 66381, 294499, -35421, 23811, 202917, 4302, 184903, -277551, 135299, -36773, -39544, 67587, 61891, 191944, 102490, -190508, -245127, -26629, 179115, -50960, -103165, -40961, -148129, -255327, -218183, 190646, -173920, 21850, -334669, 196561, 124370, 574367, 36639, 2639, -155974, -262945, 58256, -24020, -51897, -147183, -132654, -164875, -36667, -152964, 3683, -146602, -110342, -2127, 36086, 16092, -191146, -230530, -499623, -173844, 27478, -105242, -83743, 259140, 205309, -75498, -55321, -162608, -134670, 37133, 19329, 99948, 282421, -11767, 194357, 54077, 169762, -24521, -133182]
19402a33182e6288j74609j25520a61689H0404M8473c5252A36716g0917l9374A13070
19390c74055H3926b9068D6238e6931A69660a49041P2759j92855F939b36603j15375
19379c51978B08037a45040C84484a30349k06377j22990a32255j9492A36041c79241
19368c84231a26809N1517A57899d76828J61781J12408B11138b22915f6345J1126
19358e5219j20647j45548a24485a1957C2100g5413o584I6662e2367j43545H4994
19346g5774l03761a69197L6025r5598P3309G8421j4264L3852h0848H6269b93471
19334h3102n4220A90055a95759b989C0915g3419m8659A01290a40326A65629C3253
19322c04318H4327c4716B41429h8611C27041b88454Q8019l4662j48949A72985
$$ y = [-133182, -56288, -230897, -356417, -161689, 80404, 128877, -35252, 136716, -70917, -110291, 113070, -374055, 83926, -29068, 46238, -56931, 169660, -149041, -76282, -269137, 6939, -236603, -351978, 208037, -145040, 384484, -130349, -336726, -459716, -132255, -151747, 136041, -379241, -384231, -126809, -75292, 157899, -476828, -315047, -202639, 211138, -222915, -66345, -55219, -175866, -321414, -124485, -11957, 32100, -75413, -81997, 96662, -52367, -195912, 84994, -75774, -379535, -169197, -133172, -228770, -155461, 78421, 64157, 98009, -80848, 86269, -293471, -83102, -137322, 190055, -195759, -2989, 30915, -73419, -122078, 101290, -140326, 165629, 33253, -304318, 84327, -34716, 241429, -88611, 327041, -288454, -200435, -235097, -384046, 172985]
19311f8507A25433K24564b44696G0745a5328j53950j45394a39069n9885j1422
19301b10376B91602a14467A47444g0145E9033J33803b8361A74144F5306g0282
19290B53744f9146E4651C076a72046L3036I8445b45370f670k49106A22819g7143
19278a66800B13160b68089j79790G5760a38080A50781f69299L25211E5775b43827
19267b48543A35023a81765B6913O386J69058H5028d411p2264C456a11213B44319
19255i1649n9461j16062P5412B16524G2307P915i0809q6252P7728d4941j41037
19244a85978A34066c02736A40062i7063k26449a42135j2004p2807F1507O8040
19234A29547o587a56153k42036a74073A00575C4497d1448D2889a57635L7769o9014
$$ y = [-68507, 125433, 349997, -244696, 70745, -15328, -169278, -314672, -139069, -198954, -210376, 291602, -114467, 147444, -70145, 59033, 192836, -28361, 174144, 65306, -70282, 253744, -69146, 54651, 3076, -172046, -139010, 98445, -245370, -6670, -255776, 122819, -77143, -166800, 213160, -268089, -447879, 75760, -138080, 150781, -669299, -344088, 55775, -243827, -248543, 135023, -181765, 26913, 33299, 202357, 85028, -4411, -76675, 3456, -111213, 244319, -91649, -151110, -267172, -191760, 216524, 72307, 80222, -90809, -177061, -99333, -44941, -185978, 134066, -302736, 140062, -97063, -323512, -142135, -154139, -226946, 61507, 129547, 122960, -156153, -398189, -174073, 100575, 34497, -41448, 42889, -157635, -119866, -188880]
19223a88880e4926l9722G4913d1729l6811G350R5753J78836D7141a92109d8270
19211E7800J04613b91662B33342q2609c37607i0173D8357b76837F3714a76599
19200b50448i3799r4736i838A28509A6628O2654c7972A79400a6027f699F2545
19188d15166a66393l25704J71347a47122L7134j20018i5160o0828j11825O9704
19178a98109l4583M2966R3420B515e0917m129l6590A00492C624i0008l65899f8019
19165B19929i4026m5398D0019b18274c4998j20043A73387c99927h0945B66366
19154A52890B5926a10041D5048i9194r4595L136A51301c07746J32046g799l1000
19143c8799r1825A65148a30326L7872A06074E1376b40108e4642j3820k58937Q7055
$$ y = [-188880, -54926, -94648, 74913, -41729, -78540, 7350, 103103, 281939, 47141, -192109, -48270, 57800, 162413, -291662, 233342, 150733, -337607, -90173, 48357, -276837, 63714, -176599, -250448, -93799, -188535, -9838, 128509, 16628, 79282, -37972, 179400, -16027, -6699, 62545, -415166, -166393, -492097, -320750, -147122, -109988, -230006, -95160, -155988, -267813, -198109, -232692, -189726, -96306, 2515, -50917, -55046, -91636, 100492, 3624, -90008, -455907, -68019, 219929, -94026, -139424, 40019, -218274, -34998, -155041, 173387, -399927, -80945, 266366, 152890, 25926, -110041, 45048, -99194, -193789, -190653, 151301, -307746, -175700, -7799, -38799, -130624, 165148, -130326, -92454, 106074, 51376, -240108, -54642, -68462, -327399, -240344]
19132b40344f6145A0929a98480B2094P147L6715b92955B24766G3268b04679B5763
19120c53493D2551f0291j9305A88532L9276b15266C29345c9332q1410A1697g1507
19108C4418a44888f5163j71870J0626R5238a9588n8562C0333j153a89625h3695
19096a16192C1064f8108J7173A05869m7975f5695B2823f0369A16695b99806O365
19085b93441K7431r660B4300K42956j21448a06312m62j19605E9110e0974D2090
19073F0332J54182r1913B5650L43485b08153n3950h7014e812j01831M4791p9458
19062a42310H4617b64998g4397m12086J51471a49237C1240d8569o2261p6237h5233
19050g4945B51589j9102a3899E42874A02126c37588i5678k10656a6770H5615b40124
$$ y = [-240344, -66145, 10929, -198480, 22094, 29241, 65956, -292955, 224766, 73268, -204679, 25763, -353493, 42551, -60291, -79596, 188532, 227808, -215266, 329345, -39332, -120742, 11697, -71507, 34418, -144888, -65163, -237033, -226407, -131169, -19588, -78150, 30333, 29180, -189625, -83695, -116192, 31064, -68108, -50935, 105869, 57894, -65695, 22823, -60369, 116695, -299806, -293441, -266010, -275670, 24300, 267256, 145808, -106312, -106774, -226379, 59110, -50974, 42090, 60332, 214514, 122601, 25650, 369135, -208153, -262103, -87014, -5812, -107643, -62852, -142310, 84617, -264998, -74397, -486483, -335012, -149237, 31240, -48569, -110830, -187067, -85233, -74945, 251589, 232487, -13899, 542874, 102126, -337588, -95678, -306334, -16770, 85615, -240124]
19038d1039F6109K8832b9336j18264C1697a95092f5482p2261a0242j74914g3102
19026b46237K6958h3458E8753e6560B54442j23228O1069a4112l32084a2466F5162
19014I9849l9148a48201H2645a92061C78625g3374A07049D2780j2568q68g7852
19002A2118a83260K3801N361j82758J46377k48492J74321a08230D73465c8878
18991a12984A62804b99653A18453a73309B7700J82181A03769a33127L2062m3736
18981a44801j95513a20931B7626b2031n1064j37622e3949g403k98145E23673B33955
18969E69651J7708N9168B85904j26642B713J91318a21754A36359b77655a24810
18958a17429B59779b9154A79054a05647j78528n4015A04599d8769p8072A64002
$$ y = [-41039, 66109, 94941, -29336, -147600, 31697, -195092, -65482, -137743, -10242, -185156, -73102, -246237, -219279, -83458, 58753, -56560, 254442, 131214, 192283, -14112, -346196, -12466, 65162, 99849, 60701, -148201, 82645, -192061, 378625, -73374, 107049, 42780, 30212, 29344, -77852, 12118, -183260, -159459, -154098, -336856, -190479, -438971, -264650, -108230, 473465, -38878, -112984, 162804, -299653, 118453, -173309, 27700, 209881, 103769, -133127, -101065, -144801, -340314, -120931, 27626, -22031, -73095, -210717, -53949, -7403, -305548, 523673, 233955, 569651, 587359, 646527, 285904, 159262, 2713, 194031, -121754, 136359, -277655, -124810, -117429, 259779, -29154, 179054, -105647, -284175, -338190, 104599, -48769, -126841, 164002]
18947B08852a12912A35361G088K3160J42232J14315C2833N8225e4693B0293e7855
18935A24453c73300a33783l04554e8127B5098a45893j1245H4444a43220b6378
18924B6356N008a65476o760B72279b20464B55021D5100A7927a11543E7966g2708
18912c54520B09544a69080c9601f771B13575O87976n1554l37193A9402J89047
18902B08449f4624A54087a6604l328A29114d7028j74712A14933D7844a11003r9408
18891b10411A46001b35411a13864L7018C23950A02779a41986L4371l9729l2869
18881a80213I5586B9639f4879n20839d8508C4653a86799A74238C5679J2002b00262
18869D3462c64173C024b5467a895A2219f4205p3262p7022A43582q802a97168J5730
$$ y = [208852, -112912, 135361, 7088, 30248, 172480, 286795, 32833, 91058, -54693, 20293, -57855, 124453, -373300, -133783, -438337, -58127, 25098, -145893, -157138, 84444, -143220, -26378, 26356, 31364, -165476, -172236, 272279, -220464, 255021, 45100, 17927, -111543, 57966, -72708, -354520, 209544, -169080, -39601, -6771, 213575, 901551, 849997, 512804, 19402, 208449, -64624, 154087, -16604, -19932, 129114, -47028, -221740, 114933, 47844, -111003, -210411, 146001, -235411, -113864, -76846, 323950, 102779, -141986, -107615, -147344, -180213, 95586, 29639, -64879, -585718, -48508, 34653, -186799, 174238, 35679, 47681, -200262, 43462, -364173, 3024, -25467, -1895, 12219, -64205, -137467, -214489, 143582, 134780, -197168, -181438]
18857a81438c7954k7746J3517A23760h0027B92603a03380o729B11903E3559A8102
18845F6392b18699B17912b52913e0275A26569h3932k18819E7919a44756D5163
18834i5148d3885H144e26640a97238A0127Q2036J01187p940a16283d4645k6567
18823g1212o8332B40169c73531A56911a72806Q5253j99021E5288J90672a75245
18812B03265m4541b68189M549B20797j04249E5603J55211I0056K58488a8320G4004
18800B2280N5487a43544L7502k1072D3027Q9819a80861B19307h6680d602g82j46517
18788a47299K744m8729D33121a22001C1391g8413C1581i1188B36194C813a9130
18776A327L927K01043a75725B38243b97602c4085m0761j56657A88475h8167C1041
$$ y = [-181438, -37954, -65700, -52183, 123760, -80027, 292603, -103380, -110109, 211903, 53559, 18102, 66392, -218699, 217912, -252913, -50275, 126569, -83932, -302751, 57919, -144756, 45163, -95148, -43885, 8144, -526640, -197238, 10127, 92163, 193350, 185410, -116283, -44645, -71212, -139544, 240169, -373531, 156911, -172806, -87553, -286574, 55288, 245960, -175245, 203265, 158724, -268189, -263640, 220797, 116548, 55603, 210814, 90056, 348544, -18320, 74004, 22280, 77767, -143544, -106042, -127114, 43027, 132846, -180861, 219307, -86680, -4602, -782, -147299, -144555, -193284, 433121, -122001, 31391, -78413, 31581, -91188, 236194, 3813, -19130, 1327, 5254, 206297, -175725, 238243, -297602, -34085, -74846, -231503, 188475, -88167, 31041]
18764i7416k02829B1361b4380k34571B1197c41970C188i0097o2893D0494b00229
18752i79B32864a56408J664j33307R7023d5899A48749K8131a42218l6393H6077
18740b69574A27027f0177j25611A4442b69078n7076f4557l2852A37110C1881K1934
18729E3815a624k94280C16481j25110a60562A28293j8691b81281K1135J27538
18719a32608I1645b2814j18122A86858b96322R9677P8811j25995j04194g7659
18708F2327a24880B991J43854d649m6584k09885A28423a81169H026a55612B41818
18696b37916i1925k83091C14920a06353C63214d7289J9409F7716a02396j50207
18686b52603k25608c4757j84752k62580a20044e4020l51673p3658g3721C3379
$$ y = [-97416, -300245, 21361, -24380, -258951, 21197, -341970, 3188, -90097, -152990, 40494, -200229, -979, 232864, -156408, -154744, -288051, -191028, -45899, 148749, 176880, -142218, -178611, 86077, -269574, 127027, -60177, -185788, 14442, -269078, -326154, -64557, -97409, 137110, 31881, 53815, -1624, -295904, 316481, 191371, -160562, 128293, 109602, -281281, -260146, -132608, 91645, -22814, -140936, 186858, -296322, -196645, -117834, -243829, -348023, -77659, 62327, -124880, 2991, 146845, -4649, -51233, -261118, 128423, -181169, 8026, -155612, 241818, -237916, -91925, -375016, 314920, -106353, 363214, -47289, -27880, 67716, -102396, -252603, -478211, -34757, -219509, -482089, -120044, -54020, -405693, -479351, -73721, 33379]
18675b39975g158l14200i0162c8841a408A16452b33733B18449a24274b3540l0756
18664e4296m3549m9336j8568d940m1503H6344J4746J89356c28397B29060H429
18652b96138b5929j74967E1014a0315p0054j75300A90926K0183i1971E0448J93445
18641B43893A17847f1981C0885e7622j90085L7280k3968A17927n6360a1955l62246
18630c74201j12185J30482b8978n16122C6664a51083c5418k31143f10j62609j06928
18619b70147A69073G8185j5875P8279E1816A3450J35286f973j27813k51743C22699
18607c2977j42639D452b07048P0043H4398b64845r538A76967f1688A12054L5927
18596A47981o4741b18219A57823b3648C9942a92146B54315g733k00666H705c83062
$$ y = [-239975, -7158, -321358, -90162, -38841, -1408, 116452, -233733, 218449, -124274, -23540, -54296, -97845, -147181, -165749, -4940, -46443, 86344, 101090, 290446, -328397, 229060, 8429, -296138, -25929, -200896, 51014, -10315, -80369, -255669, 190926, 211109, -91971, 50448, 243893, 117847, -61981, 30885, -57622, -247707, -210427, -234395, 117927, 61567, -11955, -374201, -486386, -355904, -28978, -545100, 36664, -151083, -35418, -266561, -610, -163219, -270147, 169073, 78185, 62310, 140589, 51816, 13450, 148736, -6973, -134786, -386529, 322699, -32977, -175616, 4452, -207048, -137005, 84398, -264845, -274383, 176967, -61688, 112054, 147981, 83240, -218219, 157823, -23648, 39942, -192146, 254315, -7733, -208399, 8705, -383062]
18584C13421A04260b53705G8192A6428J3893M143b11348h9345c9507k53721B29291
18572d7563j8795p2691R14a1444m05552Q4646d6117o2789e1360l63198G5850k2275
18560E3575b36675A31906b47574d7107B292O6490g5335G470a85032a9303j57614
18549a76917l9223O4932G1754K566a60604j12945A85161b05234n6683C7229E64
18537E3412g1355m10427K40677b229o7713k2755o3662J1878j1442j40249B19577
18525B0401c62931a29810B21510G4864k5934b50132o3288A32141c02250b0628
18514a23194A65648i9003K4475b3009j21208e5853B82216e2376E2620N1367a50351
18502E8413b85668i2320L8444o0833j66963g8060Q947E3399a35543F317K76852
$$ y = [313421, 104260, -253705, 78192, 16428, 30321, 34464, -211348, -89345, -39507, -293228, 229291, -47563, -66358, -139049, -138135, -11444, -416996, -332350, -46117, -108906, -51360, -414558, 75850, 53575, -236675, 131906, -247574, -47107, 2292, 68782, -75335, 7470, -185032, -19303, -176917, -216140, -151208, 71754, 74320, -160604, -273549, 185161, -205234, -261917, 37229, 564, 53412, -71355, -481782, -241105, -2229, -69942, -92697, -156359, -144481, -155923, -296172, 219577, 20401, -362931, -129810, 221510, 74864, 48930, -250132, -313420, 132141, -302250, -20628, -123194, 165648, -99003, -74528, -23009, -144217, -55853, 282216, -52376, 52620, 103987, -150351, 58413, -285668, -92320, -53876, -114709, -281672, -78060, -69113, 53399, -135543, 6317, 283169]
18491B83169C0421i2252B6260a48307d1554A16610c85329a01018k22543h191j63631
18480a71822C34633e5231l40126J64964E7496J3108b2512j95697C9104i1232L1761
18469e9471G3420a5830l60495f5917l40832a4675B40872i5991J6760D7593a01734
18457e9418e619C01843j42395n6052C2843K39079a9665k15152J13373I7508J18137
18446B15645b61668L17h1055C14517a44816i296A84309a70517d7546E4932b07921
18434a67503j8760j38983a42157l8321a5985E8832j3948a41031J6478b3770D9231
18422c03240h72E6026J4145k5751d8004p5712b3807p8549B39344c9290l9127I1920
18409D7422b38863B53310b69767G2232C4190D99g6091j00906B69854i6658e219
$$ y = [283169, 30421, -92252, 26260, -148307, -41554, 116610, -385329, -101018, -323561, -8191, -171822, 334633, -55231, -395357, -230393, 57496, 70604, -22512, -218209, 39104, -91232, -59471, 73420, -15830, -376325, -65917, -406749, -14675, 240872, -95991, -79231, 47593, -101734, -59418, -5619, 301843, 159448, 103396, 32843, 271922, -19665, -234817, -121444, 97508, 215645, -261668, -261351, -81055, 314517, -144816, -9296, 184309, -170517, -47546, 54932, -207921, -167503, -186263, -325246, -142157, -180478, -15985, 58832, 44884, -141031, -124553, -23770, 49231, -303240, -872, 56026, 70171, 44420, -48004, -123716, -23807, -102356, 239344, -39290, -78417, 91920, 47422, -238863, 253310, -269767, 72232, 34190, 499, -76091, -176997, 269854, -96658, -5219]
18397c1256m9256C02235A33550b04925F3012b21404J082L1733A8737a18510A83424
18385a39123n0912J9177A53084d659j69496I0883d715B64480j6428c24314C2467
18373d8215a209j1697A6346n181K25625c38297a59933A4885K68559A2104b88990
18361a12993M8542P112m5682j51338j0503A49330C828e8401A11373D1686a26125
18349B27878b2863k23602N7842D1096J07514G2648J34096m5450f9906j24195h8671
18337b7691j72503p9768F4719B5981L5594b8246j55267G5732c25163a11342k18381
18326c29723a38088h982B81477B5939a55554e3534E6587N8763a83824O0049f1743
18314B392L2232e7663G5762k7785i6664j28835j46425C4949i9217E6344a63959
$$ y = [-31256, -80512, 302235, 133550, -204925, 63012, -221404, -220322, -188589, 18737, -118510, 183424, -139123, -190035, -170858, 153084, -4659, -174155, 90883, -4715, 264480, 248052, -324314, 32467, -48215, -1209, -12906, 16346, 11165, 236790, -338297, -159933, 14885, 283444, 12104, -288990, -112993, -64451, -57339, -103021, -254359, -264862, 149330, 3828, -58401, 111373, 41686, -126125, 227878, -22863, -246465, -188623, 41096, 148610, 72648, 206744, 161294, -69906, -194101, -88671, -27691, -200194, -279962, 64719, 25981, 61575, -28246, -183513, 75732, -325163, -111342, -329723, -138088, -8982, 281477, 25939, -155554, -53534, 56587, 115350, -183824, -123775, -61743, 2392, 34624, -57663, 75762, 47977, -96664, -225499, -371924, 34949, -99217, 56344, -163959]
18302i6265A49140d1969B15498j07607g3913F0146f0056l95819a757l26932A70913
18290G5264d1741j9325j45765C16042e5022m01187D9884J5462b29726k8896r5
18279b58717b2292k82639c5799j27663A40882n1101H470b38214b7893o1227a5401
18267G1938J00929a02241r297k27830E9598d6148E4727h8318E6473J23718N9719
18256B39910j05908D1968K0435a25829q8978A8495a81062B7230h6611k17329A00124
18244b8289j02051b9420L753B15671d6281C866J74683J42525c11095R0444c6409
18232A67982a5406C44347e3452k76144H0786P2252f6073a4173A60315P145h0611
18220a5813m13377f8759r2028j03461b5476l2809n3167l2332j44257h0264p3712
$$ y = [-96265, 149140, -41969, 215498, 107891, -73913, 60146, -60056, -455875, -1757, -328689, 170913, 75264, -41741, -61066, -206831, 316042, -55022, -456209, 49884, 65346, -229726, -258622, -258717, -22292, -304931, -35799, -163462, 140882, 89781, 8470, -238214, -27893, -89120, -15401, 71938, 172867, -102241, -111538, -339368, 59598, -46148, 54727, -88318, 56473, 180191, 239910, 134002, 41968, 62403, -125829, -214807, 18495, -181062, 27230, -86611, -303940, 100124, -28289, -130340, -29420, -25667, 215671, -46281, 3866, 178549, 321074, -311095, -220651, -36409, 167982, -15406, 344347, -53452, -329596, 80786, 153038, -66073, -14173, 160315, 167460, -80611, -15813, -429190, -68759, -160787, -264248, -25476, -58285, -111452, -143784, -288041, -80264, -153976]
18209a53976A55764b72673H0755P1048f4462j48728J4465L3393j06276B19722
18198A78850d5893B47387C4531b42644A81137c790m06902a36541C085K7926K87391
18187C18402D3295L0240a61777o138N6544e0399j87102a6124A04265a799D1016
18175a32607J4098A89414A4109a09262C954a13692K1165l0685n8440C5426a44352
18163E4343h3466b1803j00631C1004K5103e9705A10797a86806A95825g9748j07244
18152a86992E22941a7773l03145a2581j7371B68094G6963b2973h83m84524C21584
18140I1740R907a78048P7614M2021e256B3258h9445j74691J12338q2892p25I170
18127a36181C70398a75227L9585E9175P5559i28A96233m5207a43977A41688m561
$$ y = [-153976, 155764, -272673, 80755, 151803, -64462, -213190, -198725, -165332, -271608, 219722, 178850, -45893, 247387, 34531, -242644, 181137, -3790, -410692, -136541, 3085, 31011, 318402, 43295, 73535, -161777, -167915, -111371, -50399, -237501, -16124, 104265, -1799, 41016, -132607, -118509, 189414, 14109, -109262, 3954, -113692, -92527, -123212, -181652, 35426, -144352, 54343, -83466, -21803, -122434, 31004, 56107, -59705, 110797, -186806, 195825, -79748, -186992, 522941, -17773, -320918, -12581, -29952, 268094, 76963, -22973, -883, -485407, 321584, 91740, 101647, -178048, -100434, -58413, -5256, 23258, -89445, -264136, -151798, -234690, -235415, 9170, -136181, 370398, -175227, -135642, 59175, 134734, -928, 196233, 151026, -143977, 141688, 137127]
18116A37127K14021A16474a45470M3530B15179A0569b40676B2564a06453D210
18105B0079d0814k3237A68171B1983F738N4988b64159E4997J89071f9144c647
18093A60333b23978R1377k05782B282L21484C475b758j11957C4295j2104d1953
18081i0029l8904d3121e819C46983A35405f395n9285l94609K20087a17505l3614
18070a51119p1406A98038A5074a46659A1223a06496E973c144j32595C42052a86850
18058a97765c5931C8013M24152b59254P4318A4143d3484j14532K3986j1639k09788
18047c55457C7814b31620i4697b2312N095A20635D4486r072g3806A04680a18953
18035A11158a37880l4766h2123A59529b91391F0665L0365K5615b34224B13459
$$ y = [137127, 351148, 116474, -145470, -101940, 215179, 10569, -240676, 22564, -106453, 4210, 20079, -40814, -64051, 168171, 21983, 6738, 61726, -264159, 54997, 244068, -69144, -3647, 160333, -223978, -132601, -338383, 2282, 323766, 3475, -2758, -114715, 34295, 22191, -41953, -90029, -128933, -43121, -5819, 346983, 135405, -6395, -65680, -460289, -240202, -117505, -151119, -222525, 198038, 15074, -146659, 11223, -106496, 5973, -3144, -135739, 342052, -186850, -197765, -35931, 38013, 462165, -259254, -184936, 14143, -43484, -158016, -134030, -145669, -355457, 37814, -231620, -94697, -22312, -17217, 120635, 44486, 35414, -73806, 104680, -118953, 111158, -137880, -172646, -82123, 159529, -291391, 60665, 91030, 116645, -234224, 213459]
18024b52377B681M3969o603J64880j9083h2141A23269J9938d2991A3508b9264
18012A8269Q0413K04100c54815A01268d01894e9751k60637I0301J72422a57708
18001h7708C27892j01333h1012J6015A45036J56702H6721L2862P2369F7590J58592
17990B26182e2351C481J02503m6980a58536C102Q8979C7007R0976B6625f0560
17978A12135a37439A2610J46549G811a1265E94086F5061d7062j0410E3354c6496
17966E1482J36012a09874H3034A0316i3895A50405d1034r1758A33784K3088b94626
17954d7878j6329H4884b04803J0502J8525I5064b80280g0593C0228c43618J62794
17943a80824E9676a23322j46816A73745L2056D3540e7214A47254g352k8566B6328
$$ y = [-252377, 2681, 46650, 40047, 204927, 185844, -82141, 123269, 143207, -42991, 13508, -29264, 18269, 98682, 302782, -354815, 101268, -401894, -59751, -320388, 90301, 262723, -157708, -87708, 327892, 226559, -81012, -64997, 145036, 301738, 86721, 119583, 191952, 67590, 226182, -52351, 3481, 105984, 59004, -158536, 3102, 92081, 37007, 127983, 26625, -60560, 112135, -137439, 12610, 159159, 7811, -11265, 594086, 65061, -47062, -57472, 53354, -36496, 51482, 187494, -109874, 83034, 10316, -93895, 150405, -41034, -132792, 133784, 156872, -294626, -47878, -64207, 84884, -204803, -194301, -175776, 95064, -280280, -70593, 30228, -343618, -180824, 59676, -123322, -270138, 173745, 205801, 43540, -57214, 147254, -7352, -35918, 26328]
17931c49676B1301a24320A48395b8998j76913n0814a00222c5338B39494J17699
17921C57193g5398o6204L9807L4979A40121E7489J854c26815h467C49654a66611
17909A17136a34859M1581k90117F9958i8924B72699g0183l51296J89532A41745
17898a77987C2715a29424G4524C3018c7367B09735a63129A42237a14413A11849
17887C34292b85031G0080Q742k3502b31464A40150b28780l0105F8547f641H1183
17875g4843A4621J10002b80350D5083a97897A37543a96655c6246a1580C4366c0625
17863H2001J86643j28463a44069I080L06385H4361b3642B22071l370E098e6266
17851C69728A49829a84625A64470a31034g452A53545o4279a10926A09523m7192
$$ y = [-349676, 21301, -124320, 148395, -28998, -205911, -256725, -100222, -35338, 239494, 357193, -75398, -141602, -101795, -66816, 140121, 57489, 59343, -326815, -8467, 349654, -166611, 117136, -134859, -93278, -383395, 69958, -98924, 272699, -70183, -421479, -231947, 141745, -177987, 32715, -129424, 74524, 33018, -37367, 209735, -163129, 142237, -114413, 111849, 334292, -285031, 70080, 78822, 55320, -231464, 140150, -228780, -258885, 68547, -6641, 81183, -74843, 14621, 124623, -280350, 45083, -197897, 137543, -196655, -36246, -11580, 34366, -30625, 82001, 268644, 140181, -144069, 9080, 315465, 84361, -23642, 222071, 218701, 5098, -56266, 369728, 149829, -184625, 164470, -131034, -7452, 153545, 89266, -110926, 109523, 62331]
17841F2331O6255M6842q3135e2516H0388a54886K376B2031b86883j57434C5677
17829b98112h0116B37867f1553q3054B61853E5188c7623j70945D4010K96806a45491
17817f122p7665D3020b16026j17930A83670a68965B8839a35662n951J6312A28540
17805A64985b76512a20253G1573K62562j52388K8521b98580A39225C8414K21g6287
17793B50942k1056M79d24521c3681p321B35265b5252o7550A74L58080a44556c4797
17780h4169B85538p6152p1145f056n0395E4519b78412a37107C34766j46873e0540
17768I0372A9913J00437k3359C6718F685b26406k379D4839C447M7886H078M60353
17756D68431H5644o597J79153a8029A06901K5127H406N7074J30356a91860B3717
$$ y = [62331, 128586, 175428, 92293, -52516, 80388, -154886, -152510, 22031, -286883, -444317, 35677, -298112, -80116, 237867, -61553, -144607, 261853, 55188, -37623, -208568, 44010, 340816, -145491, -6122, -83787, 43020, -216026, -333956, 183670, -168965, 28839, -135662, -141613, -125301, 128540, 164985, -276512, -120253, 71573, 334135, 181747, 210268, -298580, 139225, 38414, 38635, -76287, 250942, 229886, 230365, -424521, -33681, -41002, 235265, -25252, -92802, 174, 358254, -144556, -34797, -84169, 285538, 209386, 138241, -6056, -56451, 54519, -278412, -137107, 334766, 187893, -50540, 90372, 19913, 120350, 96991, 36718, 6685, -226406, -228785, 44839, 3447, 51333, 8078, 468431, 85644, 79047, 258200, -18029, 106901, 132028, 8406, 65480, 195836, -191860, 23717]
17744I1089A2575J13461c1241F3487K69624b72178A53689E0325B3811K49648j6774
17733B56685d4449j24274A90213a02856k953F4305a07210j04187A78389D2848
17722A81127M8358a08511j67603A61721a21205B00046J08553A9187R4463H781
17711d3838k3042A60587L9034e9789A06652e3666e953l2006p870A11868P7257
17700A89125f2490K9012B25985f6109B09720M0889j13499a46274l3146A2320P4955
17689H7275e5454a5657A26260J1358A9094a12847N2703H0001M1752P7763Q4823
17678B84339g1849r6135c3401A70021n3068K00420g4140A19496A0555C911M07794
17667D11705D9393i4971B06959n4169i2467j9658f551j2906E8460J33234c7206
$$ y = [91089, 12575, 126036, -31241, 63487, 333111, -272178, 153689, 50325, 23811, 273459, 256685, -44449, -168723, 190213, -102856, -105809, 64305, -107210, -211397, 178389, 42848, 181127, 229485, -108511, -276114, 161721, -121205, 200046, 308599, 19187, 113650, 8781, -43838, -66880, 160587, 199621, -59789, 106652, -53666, -5953, -37959, -45829, 111868, 189125, -62490, -33478, 225985, -66109, 209720, 250609, 137110, -146274, -179420, 12320, 87275, -55454, -15657, 126260, 137618, 19094, -112847, -60144, 80001, 121753, 199516, 284339, -71849, -167984, -33401, 170021, 116953, 317373, -74140, 119496, 10555, 3911, 411705, 49393, -94971, 206959, 152790, -92467, -112125, -6551, -19457, 58460, 191694, -37206]
17655d5876C58395c6373A78792H7695a82709A49611k3983J67229d0145j26074
17645a66219G8284g2456O348j20065B28865N1995A31801M847e3683F4715J29891
17634A94606a35315B43038G8099K40619f7005C4605I002K79178a23456C36021
17623A63539L5410D1905P8617f8534j3965A15649J28439J94855i1558H4416q17
17612H3599d4777k91309A86412c30180A1423L1669a07231B0312e1443a3332k70546
17601b83878C36637D9232d7415B44179b67628J00801A88994I0661B9018N2214
17591H1232R3699H0647R8139N2293q1411A249J29798J62991M3642j46933F8531
17579a43289L4936B09660b05849B41727C5626L47572p5158a8845j18304k263A46862
$$ y = [-45876, 358395, -36373, 178792, 87695, -182709, 149611, 125628, 292857, -40145, -166219, 78284, -72456, -66108, -186173, 228865, 280860, 131801, 136648, -53683, 64715, 194606, -135315, 243038, 78099, 318718, -67005, 34605, 9002, 288180, -123456, 336021, 163539, 198949, 41905, 120522, -68534, -82499, 115649, 244088, 438943, -91558, 84416, 83599, -44777, -336086, 186412, -330180, 11423, 43092, -107231, 20312, -51443, -13332, -283878, 336637, 49232, -47415, 244179, -267628, -166827, 188994, 90661, 29018, 81232, 174931, 80647, 178786, 231079, 149668, 1249, 131047, 294038, 337680, 190747, 68531, -143289, -108353, 209660, -205849, 241727, 35626, 383198, 308040, -18845, -137149, -139412, 146862]
17567B59320I0153J48582q1700J82403J8847j48394H9614L1044J8286C8529R553
17556D8082J68029p0378P552J39310A382K37224P4809E5954k960J16886K6252
17545A96132h4521B58996r0912p1082a01657i374j2526D53472I222K29669m9967
17534A88924C3699J85782L9274J97007J8182a05036F92435r8013k13013O44886
17524A026295M3248r7916j04821l66447J4206k26788K80999k39956Q0354J40003
17514E49177j66747A00767M30239J32862K89028j71123M20494l60513n1013C92404
17503C3042M94356B13565K04430j74402k5997q9575K17035J36157j36023L7316
17493C82506r3897A6585J71583E0198L10369q4047j19880k416F3302K43647A27704
$$ y = [259320, 90153, 238735, 157035, 339438, 358285, 209891, 89614, 120658, 138944, 38529, 48082, 216111, 145733, 153285, 292595, 1382, 238606, 313415, 55954, 52994, 169880, 196132, -84521, 258996, 168084, 97002, -101657, -9374, -21900, 453472, 9222, 238891, 188924, 33699, 219481, 258755, 455762, 473944, -105036, 692435, 594422, 381409, 1026295, 1069543, 971627, 866806, 500359, 514565, 287777, 568776, 328820, 409174, 549177, 382430, 100767, 531006, 663868, 952896, 781773, 1202267, 841754, 790741, 392404, 33042, 527398, 213565, 417995, 243593, 217596, 128021, 345056, 481213, 345190, 382506, 288609, 16585, 188168, 50198, 360567, 276520, 156640, 154224, 63302, 306949, 127704]
17481D24596A41808K15920r0796p3953K28993A91180K38727k1000m0064J9248
17471C88091A18062M10361k08463A23586K17973b0381A95206J41218i3180j53225
17461b46405B9677P37143C36697O0792j03997J95808k06778J40042I2171K69990
17451C62161k8098j33440d308C68424j15557J05929J32832B04792L49224j06350
17441D47666j79732j16574J0711Q1216M1247p6806m1538o442K92772J72142j01207
17430E23455k45248K47220B53384J25458j44277J61935O2399I833K64876M6199
17420C20908j14091B170L87830A61315l6537J67879J33606K81467k83099j4577
17410D10054M0763b8986M270A21028b10079B9515M43845j31433I3485L59153r4033
$$ y = [424596, 141808, 357728, 266932, 192979, 421972, 191180, 429907, 408907, 368843, 388091, 118062, 528423, 319960, 123586, 341559, -20381, 195206, 336424, -93180, -246405, 29677, 766820, 336697, 397489, 293492, 489300, 282522, 422564, 92171, 362161, 334063, 200623, -4308, 368424, 252867, 358796, 491628, 204792, 554016, 447666, 267934, 151360, 162071, 243287, 284534, 207728, 166190, 159748, 452520, 624662, 523455, 278207, 525427, 253384, 378842, 234565, 396500, 458899, 9833, 274709, 320908, 206817, 2170, 390000, 161315, 124778, 292657, 426263, 707730, 424631, 410054, 450817, -28986, -24716, 121028, -210079, 29515, 473360, 341927, 93485, 452638, 358605]
17399C58605j22494m4477K95769J8730C662N92193A15531Q5893B336K49691j9798
17388B32229J56874j44725J3020p0094J42481j51109L25856l0215j52245a901
17377G8359m340l1112K77567I7752O06399A89299r2239O8843J86360o6757K04873
17366D90379A54439C9528N8754M35037j45179j12463F215e516G440J46579j9188
17355A34831k3109L04772a28428A57545K00839j71638m0440J3300D2396K17801
17345B60197K2950j7010F4116M39006k44550p6371L4366q8127L0199K06434I2228
17333G3045L57888I7823J39837J4103L87673l05479q5426A6611L99464Q568a58708
17321H4774M3622J91345F7669M99677B11020g9132C27618k4022a63402A00945
$$ y = [358605, 236111, 191634, 487403, 506133, 3662, 595855, 115531, 201424, 2336, 252027, 232229, 389103, 244378, 257398, 187304, 329785, 178676, 504532, 474317, 322072, -1901, 78359, 74019, 42907, 320474, 97752, 704151, 189299, 97060, 165903, 352263, 285506, 490379, 154439, 39528, 98282, 533319, 388140, 275677, 6215, -5516, 7440, 154019, 134831, 111722, 416494, -128428, 157545, 358384, 186746, 146306, 159606, 42396, 260197, 283147, 266137, 64116, 503122, 258572, 182201, 216567, 128440, 158639, 365073, 92228, 73045, 430933, 97823, 237660, 251763, 639436, 333957, 248531, 16611, 416075, 424643, -158708, 84774, 128396, 319741, 67669, 567346, 211020, -79132, 327618, 303596, -163402, 100945]
17310C17820I8691J00010J62521j12448K43919A05379J54019K79525A62943M3189
17300B06132j3567F9021J07504P7724L7887A26284J12942O691p4856Q1004J18533
17289C70598j32672J29501J76705k56387D5630J8183N4653J82525F5405P2654
17279A38059J66125A25434D5111Q0082J73017r1867R8227q8388M0483q9300J86038
17268C53403l5587K08629b0542B21113H5721A2741K23656K27382n6085B446M4175
17257D6621c2570B91004A17137L41393A32200J30888a03839A80408L3173M3781
17247B57362M08970C28405I4706j6371K22425J29621j47043I4894L45318L5069
17237D75281A49084M9748J64931M9395j21808O2652A58349J6917J2197L1155J42686
$$ y = [317820, 98691, 198701, 361222, 248774, 492693, 105379, 259398, 538923, 162943, 206132, 192565, 69021, 176525, 254249, 292136, 126284, 239226, 245917, 171061, 252065, 370598, 237926, 367427, 544132, 287745, 45630, 63813, 118466, 300991, 65405, 138059, 304184, 125434, 45111, 125193, 298210, 206343, 304570, 216182, 256665, 167365, 353403, 317816, 526445, -20542, 221113, 85721, 12741, 236397, 463779, 407694, 2446, 46621, -32570, 291004, 117137, 458530, 132200, 263088, -103839, 180408, 213581, 257362, 666332, 328405, 94706, 78335, 300760, 430381, 283338, 94894, 440212, 475281, 149084, 198832, 363763, 413158, 291350, 354002, 158349, 175266, 187463, 218618, 361304]
17226C61304p8247C0057M65910o7042J75263r2372j44283J79613k22940n4047
17216B70159L7886p0198N3431A40562K39272A33381q413J74624K49317k50021
17206B98888p596J28857j36413L38051o8442j02783k06381K61559A69107L2421
17196B01528N29903j36049B80587K05371m9050j20447P4819A90029M35699m5094
17186E80634P5340d615E40840k47515K76887j62065j96167J4231N78440l63507
17176D41144R1776k47813L96071j72169K8347Q2261r2917P9327P7473g345E33674
17164F17178p8267k31004k1181J91138j91856c02F58923J33101l86281o1550R1692
17153D35885O3542m0857R6711j14752J41034A31385O52820l26113J87919B04632
$$ y = [361304, 283057, 30057, 495967, 428925, 604188, 511816, 367533, 547146, 324206, 270159, 308045, 237847, 291278, 140562, 379834, 133381, 124968, 299592, 548909, 298888, 291292, 420149, 283736, 621787, 553345, 450562, 244181, 505740, 169107, 201528, 731431, 595382, 280587, 485958, 436908, 316461, 391280, 190029, 625728, 580634, 655974, -4615, 540840, 293325, 570212, 408147, 211980, 226211, 804651, 441144, 532920, 285107, 681178, 509009, 537356, 619617, 526700, 606027, 683500, -7345, 533674, 617178, 538911, 307907, 286726, 477864, 286008, -302, 658923, 792024, 405743, 344193, 435885, 499427, 458570, 555281, 440529, 581563, 131385, 784205, 458092, 646011, 204632]
17142E97299r5607j25445K06502K6826k53280O1986K8292K59454k24173N8183
17132E40037r4031j07081J02731L74006l56728J50644q1723O1952O7490J0964
17122F68261j65526L16449K34648m57937K21262l61362K05385j76911K13823l36780
17112C61312j0017M05475J73537k06274n7228J18236l80268L00106M1789l72183
17102C74485L74041j98656p2526R4381K4551L24266j46823k22989K93312k52712
17092E91330l5578J02556q3984j6633J57215k80194O94280M7370n29217J04999
17082G52144j99094J01444K96780j95058j83478J43535Q5520j69901j49369L04113
17072G86636l4840J03259J84381k78118J70586l41642K40839j18764K72431N9239
$$ y = [597299, 501692, 376247, 582749, 609575, 356295, 418281, 446573, 706027, 481854, 540037, 446006, 338925, 441656, 815662, 458934, 609578, 527855, 589807, 657297, 668261, 502735, 819184, 1053832, 595895, 817157, 455795, 661180, 484269, 698092, 361312, 351295, 756770, 930307, 724033, 666805, 785041, 404773, 704879, 746668, 374485, 748526, 549870, 477344, 571725, 596276, 920542, 773719, 550730, 844042, 591330, 555752, 658308, 574324, 557691, 714906, 434712, 1128992, 1176362, 647145, 752144, 553050, 654494, 951274, 756216, 572738, 716273, 801793, 631892, 482523, 786636, 751796, 855055, 1039436, 761318, 931904, 590262, 831101, 712337, 984768, 1044007]
17062A044007l42082P6020j77617L27590j64808L2151j35540J56682l00103K39169
17052G55469M05281k95593j74147j82297J72832K51553o2281J09124j7690l75537
17042E86714j07058O62975j53608j42055Q8838K0732k27525K60816j31996K57265
17032A115098j63273K29699k05928P5345k08985O2269m42017O15113l9652M7242
17022A084911R9031k05550K24455j59820K34185k2745K1830k44485J49690J15934
17012A297436m78977K55085K00936j11416O225j15470k9881L19057j41349K5186
17002A226832k2901j21415N8614j30558K57220l46866L70716Q0496r8616p1378
16992A202144J2439l14173N03395j75213j62223J50262l85106M11660K88612k80651
$$ y = [1044007, 701925, 777945, 600328, 927918, 763110, 795261, 659721, 816403, 516300, 755469, 1160750, 865157, 691010, 508713, 681545, 933098, 870817, 979941, 962251, 586714, 479656, 1142631, 989023, 846968, 935806, 956538, 729013, 989829, 857833, 1115098, 951825, 1181524, 975596, 1050941, 841956, 904225, 462208, 1077321, 1037669, 1084911, 1183942, 978392, 1202847, 1043027, 1277212, 1254467, 1276297, 1031812, 1181502, 1297436, 818459, 1073544, 1274480, 1163064, 1169289, 1053819, 1023938, 1342995, 1201646, 1226832, 1203931, 1082516, 1141130, 1010572, 1267792, 920926, 1291642, 1372138, 1273522, 1202144, 1214583, 900410, 1403805, 1228592, 1066369, 1216631, 831525, 1243185, 1531797, 1251146]
16982A251146J65083P6557j95602K6659m768N3708p5877K70902j30126K1113n39097
16971I19698Q53545r696j20111Q367q5269n5374l45960M69169j04726K98060k90555
16960A537148K23163k51926K13851j83736J99361J56013j11653M9894k62820J18944
16950A688239M48274j64140j55574J29655l4759R1142q3973q7241o550J79264
16940B004337n1073J75244j36286j67126J68791K32493j58764P0242k71132K01312
16930B068038j77873K24243R7426j78481j07382K5205M65645j67624J75244k11394
16920B213047K21308k03079J81981l41648K47340p174J7244M14947k19714K77555
16910B801807k65207n7983K02736l04222N50774k0893M57642n99773o2313M06789
$$ y = [1251146, 1416229, 1492786, 1297184, 1323843, 1319075, 1372783, 1296906, 1567808, 1437682, 1458795, 919698, 1773243, 1763547, 1643436, 1651803, 1566534, 1511160, 1165200, 1634369, 1529643, 1827703, 1537148, 1760311, 1508385, 1722236, 1538500, 1737861, 1893874, 1782221, 1832115, 1569295, 1688239, 2136513, 1972373, 1816799, 1946454, 1911695, 2002837, 1918864, 1831623, 1825073, 2004337, 1953264, 2128508, 1992222, 1825096, 1993887, 2226380, 2067616, 2137858, 1866726, 2068038, 1890165, 2114408, 2211834, 2033353, 1925971, 1951176, 2416821, 2249197, 2424441, 2213047, 2434355, 2231276, 2413257, 2071609, 2318949, 2311775, 2329019, 2743966, 2524252, 2801807, 2536600, 2478617, 2681353, 2377131, 2927905, 2907012, 3364654, 2764881, 2702568, 3109357]
16900C109357k94934J68149J83706j9702l2298m20693M39533l9917j79575K0505
16890B934131O97119m17251j06011J22432J25066k21617J39309J81517L84552
16881C839247J79171k98532j7830P7546l96837N55752O8614l81311n0585N72645
16871D147880k74752j66725K91410J24458L16475r3311m8642m2029N97311l31985
16861D520090J72949j28083J0215K79911J43698j95377J57979l6997M54531m35808
16851D943108m7148N64291k2396J63096J59212M6708J28775Q3652j96799L13550
16841F136049J75717O8721J20385K8463J90557M2120O7066K39344J76570K86117
16831G531109k43602K63214L83754n7206m8115J45423l4547L24106J49283p4234
$$ y = [3109357, 2814423, 2982572, 3166278, 3146576, 3114278, 2693585, 3133118, 3093201, 2913626, 2934131, 3631250, 3213999, 3107988, 3230420, 3355486, 3133869, 3273178, 3454695, 3839247, 4018418, 3719886, 3702056, 3779602, 3382765, 3938517, 4007131, 3625820, 3575235, 4147880, 3873128, 3706403, 3997813, 4122271, 4438746, 4345435, 4296793, 4254764, 4852075, 4520090, 4693039, 4564956, 4575171, 4855082, 4998780, 4803403, 4961382, 4924385, 5378916, 4943108, 4895960, 5460251, 5437855, 5600951, 5760163, 5806871, 5935646, 6019298, 5822499, 6136049, 6311766, 6380487, 6500872, 6529335, 6719892, 6762012, 6829078, 7068422, 7244992, 7531109, 7287507, 7550721, 7934475, 7877269, 7829154, 7974577, 7940030, 8264136, 8413419, 8339185]
16821H339185K05997L91801j61902N00351l60250O82044J23049J59980j10353
16812I769902L25757M11608J54635K54672L82967L4384K30340J93828K84029K23103
16802A2265225K91167K22426K12508O14966n2510M79221L29921K07654K15969
16793A4786547P01684J03823L51107O31678J62489M63428L88108M01291N00064
16784A8490219L95878L76398P34537N97496K94774N40984Q36435N00430P80967
16775B3548118K05712J137657K44615J132898L34647P89153J170568N97687J162811
16766C0323866K62667J347361J026948P93552J326207N97298J351896J356671
16758C8386466J281500J009413J408726J075359J451224J519378J519623J672028
$$ y = [8339185, 8545182, 8936983, 8775081, 9275432, 8915182, 9597226, 9720275, 9880255, 9769902, 10095659, 10507267, 10661902, 10916574, 11299541, 11333925, 11564265, 11758093, 12042122, 12265225, 12556392, 12778818, 12991326, 13606292, 13553782, 14033003, 14362924, 14570578, 14786547, 15488231, 15592054, 15943161, 16574839, 16737328, 17200756, 17588864, 17990155, 18490219, 18886097, 19262495, 19997032, 20594528, 20889302, 21430286, 22266721, 22767151, 23548118, 23753830, 24891487, 25136102, 26269000, 26603647, 27392800, 28563368, 29161055, 30323866, 30586533, 31933894, 32960842, 33754394, 35080601, 35677899, 37029795, 38386466, 39667966, 40677379, 42086105, 43161464, 44612688, 46132066, 47651689, 49323717]
16750D9323717J308932J642337J741511J599985J843256J696005J964237J603086
16742F2723066J850220K156428J827007J880953J853701K362981K009471J680424
16734G8344251J823288K019197J669185J781952J529561J302232J558820J227178
16726I1255664J290109Q18217J121488O35377J15959N11377J75352j64106M3733
16717I5803170q58253m96566n21416r89549j270388j334752j196360j532207j572164
16708H6031515j795035j729821j679911j763115k230637j700483k234751j705645
16700G1192117j802443k309765j738083j975633k169464j777670j457775k243333
16692E5717951j530309j537822j797548j822633j342059j498638j227849j170990
$$ y = [49323717, 50632649, 52274986, 54016497, 55616482, 57459738, 59155743, 61119980, 62723066, 64573286, 66729714, 68556721, 70437674, 72291375, 74654356, 76663827, 78344251, 80167539, 82186736, 83855921, 85637873, 87167434, 88469666, 90028486, 91255664, 92545773, 93363990, 94485478, 95120855, 95236814, 95748191, 95923543, 95759437, 95803170, 94944917, 94448351, 93926935, 92937386, 91666998, 90332246, 89135886, 87603679, 86031515, 84236480, 82506659, 80826748, 79063633, 76832996, 75132513, 72897762, 71192117, 69389674, 67079909, 65341826, 63366193, 61196729, 59419059, 57961284, 55717951, 54187642, 52649820, 50852272, 49029639, 47687580, 46188942, 44961093, 43790103]
16684D3790103j542813j360806r18519j631206j126487j146576r37310j308703
16676C3817683o26493q48190j446568o97991r23201r72231q29731r30943m77325
16667B6065010o53666p89723m14300q53947q16547l17178p10736m12784r05168
16658B0190961k80388m92393n21440n08454l25967n58517m77780k99222l21207
16649A6405593p67673j88536l51608j60064n20650J12081p59116n74068J99947
16640A3395906k76179n22107j52795l45354O3156n90817k68490o1799k77527N2179
16630A1016173m51029l71595M4768l50181k99575N2872k06243l73659J36804l06344
16620H891991j99003k53261p6738l54566R4876l30880k39918J14845J41224k50388
$$ y = [43790103, 42247290, 40886484, 39967965, 38336759, 37210272, 36063696, 35126386, 33817683, 33191190, 32343000, 30896432, 30198441, 29275240, 28303009, 27473278, 26542335, 26065010, 25411344, 24621621, 24207321, 23353374, 22536827, 22219649, 21508913, 21096129, 20190961, 19910573, 19418180, 18896740, 18388286, 18062319, 17503802, 17026022, 16726800, 16405593, 15637920, 15449384, 15097776, 14937712, 14417062, 14529143, 13770027, 13195959, 13395906, 13119727, 12597620, 12444825, 12099471, 12162627, 11571810, 11303320, 11241521, 10963994, 11016173, 10565144, 10193549, 10238317, 9888136, 9588561, 9641433, 9435190, 9061531, 9198335, 8891991, 8692988, 8439727, 8362989, 8008423, 8103299, 7772419, 7532501, 7647346, 7788570, 7538182]
16610G538182l19221j70337K07270l42581j03694r8835k6969k42501m2257K867
16600F401924m65068M65810n04498p2937j26791q0633l0766l95m39915P6241j95000
16589E027972J82893l70425j11927K24651O1076j07881k61482K15200j52813J0958
16579D718222k51439q887k5223m50234L53891k85245P4401L5898J30353j44046
16569D147691k24015o9262j45391M8250J35140k09084j41979L1635J15794l30985
16559C357794R5204k75071K60072q8631k81853L97758k93914o7247o6148J10457
16549C148421k63791K2970J32463r5565j67791J29705L18197o64065K84028Q7941
16539B932513r9687J62626m17621L55680j21292K80132l64775j12505j03253J53425
$$ y = [7538182, 7218961, 7048624, 7255894, 6913313, 6809619, 6710784, 6683815, 6441314, 6399057, 6401924, 5936856, 6402666, 5898168, 5825231, 5698440, 5617807, 5587041, 5586646, 5146731, 5222972, 5027972, 5210865, 4840440, 4728513, 4953164, 5014240, 4906359, 4644877, 4860077, 4707264, 4718222, 4466783, 4457896, 4432673, 3982439, 4336330, 4051085, 4125486, 4161384, 4291737, 4147691, 3923676, 3854414, 3709023, 3757273, 3892413, 3683329, 3541350, 3572985, 3688779, 3357794, 3452998, 3177927, 3437999, 3349368, 3067515, 3465273, 3171359, 3104112, 3037964, 3148421, 2884630, 2907600, 3040063, 2944498, 2776707, 2906412, 3224609, 2560544, 2844572, 2932513, 2832826, 2995452, 2577831, 2933511, 2812219, 3092351, 2727576, 2615071, 2511818, 2665243]
16529B665243l16920N1007j12773r5006K19785k32407J51281J10242k01251J03941
16519B343142j89442k4755K14913J85181n17246k2865K59829j63010j70389J25263
16509B040621L6387K19349k77531L89556m01807m24767M18181j91343k11966M68130
16499B064810j47807R226R2270l05406M5787L16712j64360r7547k4323j0489p4104
16488A704769r6910J37022M3697p8039j06289j11394K06561l13524J35755J42016
16478A663664p3957J7792l36152K95167p2418J76875p3106p851o5340k75051N59488
16467A809111l29942j64586j13861J11476R0435k11742J05819J72029j60839l36961
16457I70939K51171K32904j53590R64J31392N1670k64897K68424n03011K33916
$$ y = [2665243, 2348323, 2399330, 2286557, 2191551, 2411336, 2178929, 2330210, 2440452, 2239201, 2343142, 2153700, 2128945, 2343858, 2529039, 2011793, 1988928, 2248757, 2085747, 1915358, 2040621, 2077008, 2296357, 2018826, 2408382, 2006575, 1581808, 1999989, 1808646, 1596680, 2064810, 1917003, 1926229, 2018499, 1713093, 1758880, 2075592, 1911232, 1813685, 1789362, 1778873, 1704769, 1607859, 1744881, 1788578, 1710539, 1604250, 1492856, 1699417, 1385893, 1521648, 1663664, 1589707, 1607499, 1271347, 1566514, 1494096, 1670971, 1597865, 1590014, 1524674, 1249623, 1809111, 1479169, 1314583, 1200722, 1312198, 1402633, 1190891, 1296710, 1468739, 1307900, 970939, 1222110, 1455014, 1301424, 1302388, 1433780, 1485450, 1220553, 1488977, 985966, 1219882]
16447A219882J35381L0894J19329m30081M70235j25348l59725k9975k98462M21834
16437A153964P9996P2072j43192j51437J2124p7623J05750q6905J71933k76896
16427H59786P7489L7339M21846m89793O2561j75337Q9489L03762j89126D87108
16416I53901r7249K99310m2506o0077j62889m8790K63509j58177j62003P8131
16406H63160O6836R555K14426l28896J65449P2882j70959k03892M8986P5150k2008
16395G90689j96578K15017J14917j86474k9303Q7425o0520J05717j29347L62354
16385A073897j43762D33329M80304J90982L9217n21518J68056J19085k03723r9486
16375F06246J20342J49819k70632j01K33997j2663l62578M2302J31222J36619
$$ y = [1219882, 1355263, 1386157, 1505486, 1075405, 1545640, 1420292, 1060567, 1030592, 732130, 1153964, 1233960, 1306032, 1162840, 1011403, 1023527, 945904, 1051654, 964749, 1136682, 859786, 937275, 974614, 1396460, 906667, 969228, 793891, 883380, 1187142, 998016, 487108, 953901, 856652, 1155962, 1113456, 1053379, 890490, 841700, 1105209, 947032, 785029, 863160, 929996, 939551, 1153977, 825081, 990530, 1063412, 892453, 688561, 737547, 812697, 790689, 594111, 809128, 924045, 737571, 708268, 795693, 735173, 840890, 711543, 1073897, 930135, 433329, 913633, 1104615, 1143832, 622314, 790370, 909455, 705732, 606246, 726588, 876407, 605775, 605674, 839671, 827008, 464430, 506732, 637954, 774573]
16365G74573C76853L54143M6995B55759O02542k17631j82168K43217B94605J44941
16355D39546R0707L2073K43598l18801N21616D56390p2717L17365j14979J17081
16345G03140j86603N9017L10840k79976k34497K32499j79420n3615m0894M72730
16335H03221p899l69555M96037m12275k0284M0368j26389j0097N5377o4306N4529
16324D38727j26015J08053J63009P7307k08026D3109M98118j44786j89543M53842
16314F60740C05301L84460C07149K02664p9750K15947J2003k64619J70172A98816
16303E08773J43759l02999n3925r0391K99281j11400m0731J92372j32307j87417
16293B25015r4620J80339j45611K07792Q9757O7706j82948K5265J65909B60773
$$ y = [774573, 376853, 730996, 777991, 255759, 858301, 640670, 458502, 701719, 294605, 439546, 530253, 562326, 805924, 487123, 1008739, 456390, 383673, 701038, 586059, 703140, 516537, 575554, 886394, 606418, 371921, 604420, 425000, 371385, 330491, 803221, 795322, 425767, 921804, 509529, 489245, 529613, 403224, 393127, 448504, 384198, 438727, 312712, 420765, 583774, 661081, 453055, 43109, 541227, 396441, 206898, 660740, 305301, 689761, 307149, 509813, 430063, 646010, 658013, 393394, 563566, 198816, 508773, 652532, 349533, 295608, 205217, 504498, 393098, 352367, 544739, 412432, 225015, 130395, 310734, 165123, 372915, 462672, 530378, 347430, 372695, 538604, 260773]
16282A73795K56258M1591j05059m9912J55373p3332j91831J46581O7779J23410
16272E44653k29299k1671L5636O4774M96934m44441p8250J07216G4029K70518
16262C44547p1029j07713L35338k8561m1496o8089K90787J13562B10024J92478
16252D02502J72223r1005I6630L79917K56549B37541K01391j75298P6450n7880
16242B82204O9817K4003J79306k52000O2678O6305A54994J91708J24061j93798
16232B76965r5417M17582B66080r9050J04988J28864r6457J1798j28057p9044
16222A09122J75295J10227p4214a02149F55814j12166j66441N1324k662A19885
16211D12083r6995K3837A47473J78520P7505A60169K33301A87316j5464H1671
$$ y = [173795, 430053, 471644, 366585, 316673, 472046, 398714, 206883, 353464, 421243, 544653, 315354, 293683, 329319, 394093, 891027, 446586, 368336, 475552, 74029, 344547, 273518, 165805, 501143, 472582, 431086, 362997, 653784, 767346, 210024, 402502, 574725, 483720, 96630, 476547, 733096, 237541, 438932, 263634, 340084, 282204, 352021, 376024, 555330, 303330, 366008, 432313, 154994, 346702, 470763, 276965, 181548, 599130, 266080, 167030, 272018, 400882, 304425, 316223, 188166, 109122, 284417, 394644, 320430, -102149, 655814, 543648, 377207, 428531, 425869, 119885, 412083, 315088, 338925, 147473, 325993, 403498, 160169, 393470, 187316, 171852, 81671]
16200B56634Q9214j48902o3311d5971A60901m1185M56388j44564B3035K59079
16190B82114p108R9452A07879J03422j02746L12167B09493B8877g1403D48785
16179C19487a43527B38504b880F31K20852L07099B18800q1228O3937m3096b42978
16167A66234q661L32286A87469J19266G4201J62495N5524g0573l8051C79096E1179
16155C6411P3143C7876J10294K5638R7876o9208J69347k2648J10970j90546j6504
16144B53095L19897A95948a71229C73022g8226j17682C5770L1240J03290J11234
16134B81534F7681B1298K00071J7179K42825k23845f2571a8628k17067f4828A96331
16122A69513J3519J38496G0095J67475C3385K99129j39745F1689i9993A63566
$$ y = [256634, 345848, 196946, 133635, -45971, 160901, 119716, 576104, 431540, 23035, 282114, 275006, 374458, 107879, 211301, 108555, 420722, 209493, 28877, -71403, 448785, 319487, -143527, 238504, -2880, 631, 221483, 528582, 218800, 137572, 201509, 158413, -242978, 166234, 157573, 489859, 187469, 306735, 74201, 236696, 292220, -70573, -108624, 379096, 51179, 36411, 109554, 37876, 148170, 173808, 271684, 202476, 371823, 349175, 460145, 269599, 253095, 572992, 195948, -171229, 373022, -78226, -195908, 35770, 67010, 170300, 281534, 67681, 21298, 221369, 238548, 481373, 257528, -62571, -18628, -235695, -64828, 196331, 169513, 183032, 321528, 70095, 237570, 33385, 332514, 192769, 61689, -99993, 163566]
16111b7177A13351M7029m5652e7892n3614A76174O0632j17082k3626j3842g4468
16099I953N2035K0816J57473A7021a12465H8486b1809C84602A59208J76916b027
16087A12311A4939M87052a28515e6054A52576a30390F8028R2918E1800P5066J21150
16076B48016p1303K7809G4197d0069B00570R2923l5273J08046h838A08821n1431
16065E7390J09436k8523M8604n8218D6510J45603J89589a60280d3261E5086M4977
16054A00063O6285a79800I4679a07375A69524b28967b4419H6657J1026d735A45843
16042I3610A2750J07898C829b94417a09774j25580C18886a61176A66642J35827
16032C02469b09117B82060N2160c49141C37994a01842I3760M9629a7849G8078
$$ y = [-27177, 113351, 160380, 114728, -57892, -111506, 176174, 236806, 119724, 96098, 82256, -74468, 9953, 61988, 82804, 240277, 17021, -112465, 88486, -21809, 384602, 159208, 336124, -2027, 112311, 14939, 501991, -128515, -56054, 152576, -130390, 68028, 160946, 51800, 126866, 248016, 176713, 204522, 74197, -40069, 200570, 293493, 258220, 366266, -8838, 108821, 57390, 166826, 138303, 186907, 128689, 46510, 192113, 381702, -160280, -43261, 55086, 100063, 166348, -179800, 94679, -107375, 169524, -228967, -24419, 86657, 97683, -4735, 145843, 93610, 12750, 120648, 3829, -294417, -109774, -235354, 318886, -161176, 166642, 302469, -209117, 282060, 334220, -349141, 337994, -101842, 93760, 143389, -17849, 78078]
16021C1148K03627L4728i0937B13521k3344B2421J73975B58J10510e6515k548
16010e9063A21897J25339o9801a72320f4251C6511J20157K61860a1518E7486j6487
15999D0999A7657o687L72425d18j9218q9317A7696J09418J04099C6358O3095J01097
15987B00550N11401K82172J12090q7879Q1422k24338q3842l62872A48363R266
15977A57629L0017g3093B05010a00570c3202B8114J4421a34003p4784B77674H0560
15965E59h5656r481B370a41537r020A55468h79F0104R4108c3660j92371A90748
15952b70725B38360a20001A96329q2934b752k21024i5107j3141F5347J54061I9757
15940B70898A14716Q5564q7957a81267A550a51508A00368J63646b67914d1790
$$ y = [31148, 234775, 269503, -90937, 213521, 190177, 22421, 196396, 258, 110768, -56515, -59063, 121897, 247236, 177435, -172320, -64251, 36511, 156668, 418528, -11518, 57486, 40999, 17657, 10970, 383395, -418, -19636, -108953, 17696, 127114, 231213, 36358, 99453, 200550, 711951, 994123, 1106213, 1018334, 1099756, 875418, 791576, 428704, 148363, 157629, 187646, -73093, 205010, -100570, -33202, 28114, 42535, -134003, -208787, 277674, 80560, 559, -85656, -95137, 2370, -141537, -150557, 155468, -879, 60104, 154212, -33660, -226031, 190748, -270725, 238360, -120001, 196329, 113395, -2752, -223776, -95107, -108248, 65347, 219408, 99757, 270898, 114716, 200280, 112323, -181267, 1550, -151508, 100368, 264014, -267914, -41790]
15929A45681a63659c3511B86408c4355B74593b81137J14355O2082A45337J5344
15919A60681O7252g3481k7755p8838H596J20053R542C2570a22310k23497L2522
15908c13285H1833A7659J47362d23335I6371a3045m2623A56641k4671i1190c1074
15896a52412b6541E5742B2711a92858c0839q1372B74245d5441A37008b46450C7900
15884A39097m466j5205d05598g8199G1410f3646A30220d5722k35461a35499H4775
15872I5334k1384J34975n8108j2429D2604a36726A29564b30267n0365A22630a703
15860a18550r634k8718C52108A75699b30632k91153B32089b23893h0117k0918
15850a01035j03858B73547j27216c2367P816D7997f2555b0085A63870c7841m12706
$$ y = [145681, -163659, -33511, 286408, -34355, 274593, -281137, -166782, -104700, 145337, 160681, 227933, -73481, -101236, -180074, 8596, 128649, 138191, 32570, -122310, -345807, -313285, 81833, 17659, 165021, -423335, 96371, -13045, -55668, 156641, 131970, -91190, -31074, -152412, -26541, 55742, 22711, -192858, -30839, -112211, 274245, -45441, 137008, -246450, 37900, 139097, 134631, 119426, -405598, -78199, 71410, -63646, 130220, -45722, -281183, -135499, 84775, 95334, 73950, 208925, 150817, 138388, 42604, -136726, 129564, -230267, -280632, 122630, -1703, -118550, -128184, -156902, 352108, 175699, -230632, -521785, 232089, -223893, -80117, -101035, -204893, 273547, 146331, -32367, -24551, 47997, -62555, -20085, 163870, -37841, -450547]
15839d50547a95411H9655J46288l8453b34581A39567f1902A5253a27744B00370
15828F8708a64302A945J46434i5616K3241j5757A33730m7282L4626K27264j68455
15817A79883c80721I1059K31818B3314J52084b39179j39230F9082R0429a55704
15806A73686d9596l23037A67930g2981A31704h4780K3126E3620c17627E3067a45593
15794a9195l14345A02051b22873G0930b02545D31484a70212E6385c87320i9270
15783a65937p3755B25322b83965C5596b23101B98638e69710C2588R6148a58922
15772a84690C23776C1726j5272L483J29259L0566a14542L4323G2608e3710p2888
15761a26598B6155K55576C6983J55468i106B34689J88620b82747K9986E7122b59660
$$ y = [-450547, -195411, 89655, 235943, 197490, -234581, 139567, -61902, 15253, -127744, 200370, 68708, -164302, 1945, 148379, -95616, -72375, -88132, 133730, 86448, 121074, 348338, 179883, -380721, 91059, 322877, 23314, 175398, -239179, -378409, 69082, 159511, -155704, 173686, -49596, -372633, 167930, -72981, 131704, -84780, -61654, 53620, -317627, 53067, -145593, -19195, -333540, 102051, -222873, 70930, -202545, 431484, -170212, 56385, -387320, -99270, -165937, -239692, 225322, -283965, 35596, -223101, 298638, -569710, 32588, 128736, -158922, -184690, 323776, 31726, 16454, 19937, 149196, 179762, -114542, -80219, 72608, -53710, -126598, 26155, 281731, 36983, 192451, -9106, 234689, 423309, -282747, -252761, 57122, -259660]
15749d15897A20975A345M25920B4877K21899c1251o9992A54878a72453b4420l98
15738b4818k22081j30002B794c9232A48231C8533b96713a26576A9775f7205n9042
15727a26247M1554l50994D31091A64586D052b79748B10097a85952C1686J93127
15717B24813A05092b052m6631l1772b373k95665f1340C7124K69369a23847q0859
15706b04706b7368f845j23314j00860D4055O5744a13800A36783o0449a82457A74197
15694A19779e5525A84799P0906b29377H1224R2731o6149K77201G4927a19486H106
15682a41749q2854j69441J58840a07423m2472K8055M0506A1422d6637o4510A5972
15670a87341A29882C5545M347e17887A63323l1255K31024b13121b5712k3085p6623
$$ y = [-415897, 120975, 1345, 427265, 24877, 246776, -31251, -101243, 154878, -172453, -24420, -24818, -246899, -376901, 2794, -39232, 148231, 38533, -296713, -126576, 19775, -67205, -126247, -84693, -435687, 431091, 164586, 4052, -279748, 210097, -185952, 31686, 224813, 105092, -2052, -48683, -80455, -2373, -298038, -61340, 37124, 306493, -123847, -204706, -27368, -6845, -130159, -231019, 44055, 109799, -113800, 136783, 76334, -182457, 174197, 119779, -55525, 184799, 255705, -229377, 81224, 173955, 107806, 385007, 74927, -119486, 8106, -141749, -224603, -394044, -235204, -107423, -149895, -121840, -81334, 11422, -46637, -111147, 15972, -187341, 129882, 35545, 39892, -517887, 163323, 132068, 363092, -213121, -25712, -48797, -125420]
15659a25420G2789D115K6345h2886k6426b0718l62455A78365E8746b43413A8802
15647h3991I9251J0003b57625e4771n1816J1599B64424a2108j27570l36058c3473
15635d09149B10471J6234B777P1664K85673b7584B67326b32735O9089A22940n3058
15624F9882P409k0003c7640J5535A07115C4344a16728C22864H1867a55097A7415
15612a34784A9811L06326a83256e6149j93344B54872b08172R9410P343A30905
15601i2794k68177A6104L2762J265a30376k49A25370J26251b04707O8589i790
15589f9203b6993H7578K7071b6077n5435b9154R558k41901A46054i7064j48079
15578b45143n1465d5044q4894O4691A35296N9661G7893A0758h2743k53059i1443
$$ y = [-125420, 72789, 4115, 30460, -82886, -109312, -20718, -383173, 178365, 58746, -243413, 18802, -83991, 99251, 109254, -257625, -54771, -106587, -94988, 264424, -12108, -139678, -475736, -33473, -409149, 210471, 226705, 2777, 74441, 360114, -27584, 267326, -232735, -163646, 122940, 69882, 77291, 57288, -37640, -22105, 107115, 34344, -116728, 322864, 81867, -155097, 17415, -134784, 19811, 326137, -183256, -56149, -249493, 254872, -208172, -108762, -101419, 130905, -92794, -360971, 16104, 48866, 50131, -130376, -130625, 125370, 251621, -204707, -136118, -9790, -69203, -26993, 87578, 114649, -26077, -81512, -29154, -19596, -261497, 146054, -97064, -245143, -296608, -45044, -129938, -65247, 135296, 194957, 77893, 10758, -82743, -335802, -91443]
15566b80088B54499D3088J73417I8298a38838H4360J79687b08760f402A45335
15555c9010n8119B5532a22830G0842O2908h9643A30808A2674R3800b27638E9491
15543A41353K27485h0433o3378b0384o5439k30530c3339D0143r162L4142b6430
15531B10971q6242K4603P7900J33556j62692n3685J22378B7043P6476J21958J17729
15520C43206f3223j21709H3524M97860A5659a1888B36689o5251K213i3967B80823
15508E75948A05029L49890a56417C18233G7772J30570a4975D0846L3100A6980
15497D53945a55249B24527o7543b36399G0310d4895K775p723B52682C974b11064
15485b89013a41202H8485J04266F7802A6119L34558g6516E54819B53527M32507
$$ y = [-280088, 254499, 43088, 216505, 98298, -138838, 84360, 264047, -208760, -6402, 145335, -39010, -97129, 25532, -122830, 70842, 133750, -89643, 130808, 12674, 106474, -227638, 59491, 141353, 368838, -80433, -143811, -20384, -85823, -316353, -33339, 40143, 30981, 65123, -26430, 210971, 124729, 149332, 227232, 360788, 198096, 144411, 266789, 27043, 103519, 225477, 343206, -63223, -184932, 83524, 581384, 15659, -11888, 236689, 171438, 173651, -93967, 280823, 575948, 105029, 454919, -156417, 318233, 77772, 208342, -14975, 40846, 73946, 16980, 453945, -155249, 224527, 156984, -236399, 70310, -44895, -42120, -49843, 252682, 3974, -211064, -289013, -141202, 88485, 192751, 67802, 16119, 350677, -76516, 554819, 253527, 686034]
15475F86034n8218k9328q0275l8262b02284I351g4360j77019b338A75928p6240
15464I9688a54091h157I6409K4065a20811k3693m2428E2582J54296n7761k0592
15453A28525a63637A93477G9872k6714Q0627O5581a8545B83688J11178J11387
15443E06253N84096N83869l59560n41080C26970n8354J0947b20875B73712h4625
15432B62568A071Q076K04674k0796m9994a35228b6249A3730J28148a83663g0692
15420A48911e3233p3041j4567d1219B9608J10225a93219Q0324A443L5551K4932
15409F1926K11929c77654a446A36690a68515j62300g2846E5766a67602E1933J11416
15398A63349o3200h9619A12103b50549J17969A392c37189e9344m2353K0550A72870
$$ y = [686034, 627816, 598488, 518213, 479951, -202284, 9351, -74360, -251379, -2338, 175928, 99688, -154091, -8157, 96409, 120474, -120811, -144504, -186932, 52582, 206878, 149117, 128525, -163637, 193477, 79872, 53158, 133785, 199366, -18545, 283688, 394866, 506253, 1090349, 1674218, 1314658, 773578, 326970, 268616, 279563, -220875, 273712, -84625, 262568, 1071, 9147, 213821, 193025, 143031, -135228, -26249, 13730, 141878, -183663, -70692, 148911, -53233, -126274, -140841, -41219, 29608, 139833, -193219, -112895, 1443, 36994, 61926, 273855, -377654, -1446, 136690, -168515, -330815, -72846, 55766, -167602, 51933, 163349, 100149, -89619, 112103, -250549, -132580, 1392, -337189, -59344, -101697, -81147, 172870]
15386C01323G101a66679F2072b38714B21920D4388M653e0728I2412K01058b1321
15374D98541A79487K19192j96229E6686K31984j21754F2410J75312a60536C6745
15363C73339J17960B9540b0251C94345a53108C89392j49179K3260n3414E743N2583
15352E8326J75788n8347a8080A91854R1565q7272a09905D6030L87510A16449J26929
15341B43378L20163A18560m7653c642C02286J03983a17955A86258b4066B89526
15330B17212I4595C5764a36359C3599J84003J39503c8282I3072d4544C48760j68594
15319A80166E4090K75593A5477a45528B3629K88024C4071b28986A15993J5251
15309A31244j9133K41200E2257c625k08478a1026q4758A21992A5265R9525h777
$$ y = [301323, 7101, -166679, 62072, -238714, 221920, 44388, 49041, -50728, 92412, 293470, -21321, 498541, 179487, 398679, 202450, 56686, 288670, 166916, 62410, 237722, -160536, 36745, 373339, 491299, 29540, -20251, 394345, -153108, 389392, 240213, 263473, 210059, 5743, 58326, 234114, 175767, -18080, 191854, 283419, 196147, -109905, 46030, 433540, 116449, 243378, 563541, 118560, 70907, -3642, 302286, 406269, -117955, 186258, -24066, 289526, 217212, 94595, 35764, -136359, 33599, 217602, 357105, -38282, 93072, -44544, 348760, 180166, 54090, 329683, 15477, -145528, 23629, 311653, 34071, -228986, 115993, 131244, 112111, 353311, 52257, -3625, -212103, -11026, -95784, 121992, 15265, 114790, -8777]
15297B48465H1929a61671A79160a52437j55205a48054D7899f7714j87459B01473
15286I7868B9342a22676E7632a04168j42288B39258A16706J65581a47974N7388
15276i0586J0653F2291M8703O0095A5923e3008j54912J3343K7418C2593a56601
15264G1607b09742F6583J83490a5454D2632M4362l8592N1375L11930p1859j09703
15253B30145j10920O2178a01790A68559b92803C5972b38496A02705k7234k5612
15243D9859J4406L05184K08506J346005n08659L3614K16602F12020B17372i2194
15232f2177A74923i5896C7142d319I0724a81538A8020b20422a467n3058E6429
15220G7738J29311d37807d4020p1319p1047b3941H8J19727b44484D0598R2132
$$ y = [248465, 81929, -161671, 179160, -152437, -307642, -148054, 47899, -67714, -255173, 201473, 97868, 29342, -122676, 57632, -104168, -246456, 239258, 116706, 282287, -147974, -90586, -79933, 62291, 110994, 171089, 15923, -53008, -207920, -194577, -167159, 32593, -156601, 71607, -209742, 66583, 250073, -15454, 42632, 86994, 48402, 99777, 411707, 339848, 230145, 119225, 181403, -101790, 168559, -292803, 35972, -238496, 102705, 75471, 49859, 64265, 369449, 577955, 1923960, 1415301, 1448915, 1665517, 612020, 217372, -92194, -62177, 174923, -95896, 37142, -4319, 90724, -181538, 18020, -220422, -1467, -54525, 56429, 77738, 207049, -437807, -44020, -115339, -186386, -23941, 88, 119815, -244484, 40598, 132730]
15209A32730k7908J14928E1755J33201N764l9051c24129A15222d1769B3383R6057
15198A19440E0057a56343A67137a49080A23611k0046l2682h6857m6597F5375J01592
15187A66967e9692n9460B42529H5662a87543P9231e1807A35762m0349Q6686C9081
15175g7656D3696a79537A4878a88549A81667m321N7764b34324C78788g425j41268
15164a48693C05354A11064J20568D6593A5071L4683J67093K1576L9185H5053J19181
15153B04234j6262a70792D5275J22470e6353A82032P3372b2980n6333F1127b22647
15141C52742H8548O0580C8790J09816k448J3524B581L04937a6294j48619A53172
15129c4196C51628A44045K8476K05331A69936h1994E3987P1143e8359H7087M0981
$$ y = [132730, 104822, 219750, 51755, 184956, 190720, 151669, -324129, 115222, -41769, 23383, 119440, 50057, -156343, 167137, -149080, 123611, 103565, 70883, -86857, -133454, 65375, 166967, -59692, -119152, 242529, 85662, -187543, -108312, -51807, 135762, 95413, 182099, 39081, -77656, 43696, -179537, 14878, -188549, 181667, 177346, 235110, -234324, 378788, -7425, -148693, 305354, 111064, 231632, 46593, 15071, 49754, 216847, 238423, 277608, 85053, 204234, 187972, -170792, 45275, 167745, -56353, 182032, 255404, -22980, -79313, 61127, -222647, 352742, 88548, 149128, 38790, 148606, 146158, 159682, 2581, 307518, -16294, -164913, 153172, -34196, 351628, 144045, 172521, 377852, 169936, -81994, 53987, 125130, -58359, 87087, 128068]
15118A28068K26122o8631L1494J82855B5477K2801k0092K64127f5006I739N1500
15107F1239L0948k874l5219c434B37955K6511H8967J5978J19360E5538J34356
15096A89894e9577l368k00367I3015g1380F2245M3183D4465L8219J10352o7162
15085A25874D9836b75272A08641O0928k2241F9781J79829M9605j27189a44529
15074C2543J88914e4616K4346J4964B45020C5336a2813H5858a38756A50585K91229
15063D41814j75724l5033R1904G0970J23573J87808A19642K50034l8479A19959
15052B90582A8575L74383Q1714k23654r4485L1074j1396L19546E9401K37267J9246
15041C15914o2572J79608l9613A8204L33702A51328J70421p6557L03235J78426
$$ y = [128068, 354190, 285559, 317053, 499908, 25477, 48278, 28186, 292313, -65006, 9739, 61239, 92187, 89313, 54094, -3434, 237955, 264466, 88967, 104945, 224305, 55538, 189894, -59577, -62945, -263312, 93015, -71380, 62245, 105428, 44465, 82684, 193036, 125874, 49836, -275272, 108641, 169569, 147328, 69781, 249610, 299215, 172026, -144529, 32543, 221457, -54616, -30270, -15306, 245020, 35336, -12813, 85858, -138756, 150585, 441814, 266090, 231057, 322961, 70970, 194543, 382351, 119642, 369676, 331197, 119959, 290582, 18575, 392958, 474672, 251018, 156533, 187607, 176211, 495757, 59401, 296668, 315914, 253342, 432950, 393337, 18204, 351906, 151328, 321749, 245192, 548427, 726853]
15031G26853r0175K05923j63337j64206k03519G3355J49340r5142K02237j02934
15021B26856p7303J55894M9473j0218J47270j55454A57388K18226j30278J29103
15011C74439J23077j33370M20180k68791j93520n2834J19349A77650D4258M4673
15001H8931M98391A41034J06752L4978J84093B08070J66528e5300B35750J10859
14991C46609q2032M43023B92383J40020M6789j70763G8850L82284M06076l42058
14981E25152m4550K71382j39764J60003M9916l33355j60580M04694C22502L61461
14971F83963l1690l02335K06650E9921N46575k0187o2610o6200j22174A4058M29209
14960D43267j89961C6138K00717E5878J97942J95893B02800A2690J43171l838
$$ y = [726853, 636678, 842601, 679264, 515058, 311539, 73355, 222695, 127553, 329790, 226856, 149553, 305447, 354920, 344702, 491972, 336518, 157388, 375614, 245336, 374439, 497516, 364146, 784326, 515535, 322015, 269181, 388530, 177650, 44258, 88931, 587322, 141034, 247786, 282764, 466857, 208070, 374598, -55300, 235750, 346609, 264577, 707600, 292383, 432403, 479192, 308429, 78850, 461134, 867210, 525152, 480602, 751984, 612220, 772223, 822139, 488784, 328204, 732898, 322502, 683963, 652273, 349938, 556588, 59921, 606496, 586309, 523699, 457499, 335325, 14058, 443267, 253306, 36138, 236855, 55878, 253820, 449713, 202800, 12690, 155861, 152023]
14950A52023K18288j84193l0341J19386P3698M43913q0569J58069J7718C44144
14939B10202q9468L15330p3119P5291j62793M19302l16462L61685J42846K21118
14929A103932m4316O1302K21749Q6129Q4570K46887m01951j16712J29366o3209
14919A307747N58891M33939j48035l55671m56702k37555M6443l78046j17687A84032
14908C15010R9711J5807j98323Q286J54318J50864K44224B81448L40021B67407
14897C19878q2136N1812p1294n3014L66785B44066K71886k8343j93247J86322
14887D80684K95068j76407Q024M13845j99911O8681K29j1463P0834B48596J04914
14876C53510J7640Q1420J92977k60958n4642j20663p6577L28302K79059C00068
$$ y = [152023, 370311, 186118, 155777, 275163, 348861, 792774, 712205, 870274, 887992, 344144, 210202, 120734, 436064, 362945, 438236, 275443, 694745, 378283, 739968, 882814, 1103932, 1059616, 1120918, 1342667, 1428796, 1513366, 1760253, 1358302, 1241590, 1370956, 1307747, 1866638, 2300577, 2152542, 1796871, 1340169, 1102614, 1149057, 771011, 653324, 184032, 315010, 414721, 430528, 232205, 240491, 394809, 545673, 789897, 281448, 621469, 267407, 319878, 237742, 289554, 218260, 165246, 532031, 244066, 515952, 487609, 294362, 480684, 775752, 599345, 607369, 1021214, 821303, 889984, 890213, 878750, 949584, 248596, 353510, 371150, 452570, 645547, 384589, 329947, 209284, 132707, 461009, 740068, 300068]
14865F41280J36217j06475N1933l9748C29277a61360A39205l0248L25096m2808
14855C91245j3568j21847J96961k16460P5903j17979n7429J87451r0225M94495
14845G28547J48764L26104k34170J52557O9617l02276K22608n38866K08891J95926
14835I77702C70238K48019M6492k53872K19867o9158L66580C61677J10386M5861
14825E17924j60476j36491K04456p7448K33376k47968J89516M07840k06405j95812
14815E28512J74721K5378j33331k35732M47633k87328N1119P5844j20777j43873
14805C82166P84409E74788K72323l61427r3563J19222J07341l02740M0108B7192
14794H1212L69261J00480k02583K02658J4685K59015j97907J30386k50550N255
$$ y = [641280, 777497, 671022, 722955, 683207, 329277, -161360, 139205, 108957, 434053, 391245, 377677, 255830, 452791, 236331, 312234, 194255, 136826, 324277, 234052, 728547, 877311, 1203415, 969245, 1121802, 1191419, 889143, 1111751, 572885, 781776, 977702, 370238, 618257, 664749, 410877, 630744, 561586, 928166, 361677, 472063, 517924, 357448, 220957, 425413, 347965, 581341, 333373, 522889, 930729, 724324, 528512, 703233, 728611, 595280, 359548, 807181, 519853, 570972, 646816, 526039, 382166, 1166575, 574788, 847111, 485684, 392121, 511343, 618684, 315944, 356052, 27192, 81212, 450473, 550953, 348370, 551028, 565713, 824728, 626821, 757207, 506657, 511912]
14784E11912k2960N077j194J37601B48179L00731J79716k00060L18696K5414k73922
14773E98754P9970k82694K10428p7215j14224P8847K9518C7964M09178r3088K91220
14762F45274A42312N58239j52679n9539L10617C34758l5988L23681B96061A24198
14751C51820J10975j14862P528J14221k15432L53743j16959j95582M74215l0595
14741G39072P9752k94189B35593M60836j49814N8993K78514o2307j53121J1342
14731F80036L89251r6434L26850K21016M22432m3601l35115n77460n2296K7051
14721I61730j9181j29432D04510J79713J00418J09013j87268o7586J97456k29247
14711E07009L44785j65737p005K59294k50793J34043p9479P15846L869K72134
$$ y = [511912, 488952, 494029, 492835, 630436, 248179, 548910, 728626, 528566, 847262, 872676, 598754, 678724, 396030, 606458, 529243, 415019, 493866, 523384, 37964, 447142, 354054, 645274, 142312, 700551, 547872, 488333, 798950, 334758, 298770, 622451, 296061, 124198, 351820, 462795, 347933, 355461, 469682, 254250, 607993, 491034, 295452, 769667, 739072, 818824, 524635, 235593, 696429, 546615, 605608, 884122, 821815, 668694, 680036, 1069287, 972853, 1299703, 1520719, 1943151, 1899550, 1564435, 986975, 934679, 961730, 942549, 813117, 404510, 584223, 684641, 793654, 606386, 538800, 736256, 507009, 851794, 686057, 679052, 938346, 687553, 821596, 742117, 1457963, 1461832, 1733966]
14701A733966j56969k57863m2601Q6591m95436q2418L96955p9433m60938J4249
14691F56103r2502L52721O913J89145l37734r2201k23812O03407l87143J92105
14681H67002j11748j30226K59457q0529l85373M92989j89449J94571l64485K83117
14671H35326j41189J96366o9177q5240m7748J37835j152l03757J20757J34200
14661G76221m8496j44544j47440K51585J96545J09374l95607K15073L69494J31934
14651A314139l81384k17680k3563J21973K24577J03966k25381K55812r4374k7445
14641A050640j36278o6059K58643l50997K99940O3836m8654L3486k8266L0762
14631A107053L52731n74574L62239n4555j04757J66314m0442j19683j02608J43764
$$ y = [1733966, 1576997, 1319134, 1276533, 1363124, 867688, 785270, 1182225, 1102792, 641854, 656103, 563601, 916322, 923235, 1112380, 774646, 682445, 458633, 1062040, 674897, 867002, 755254, 625028, 884485, 803956, 418583, 911572, 722123, 916694, 552209, 835326, 694137, 890503, 821326, 736086, 688338, 826173, 825021, 521264, 642021, 776221, 727725, 583181, 435741, 687326, 883871, 993245, 597638, 812711, 1182205, 1314139, 932755, 715075, 691512, 813485, 1038062, 1142028, 916647, 1172459, 1078085, 1050640, 914362, 848303, 1106946, 755949, 1055889, 1119725, 1071071, 1104557, 1076291, 1107053, 1459784, 885210, 1247449, 1192894, 1088137, 1254451, 1214009, 1094326, 991718, 1135482]
14621A135482k07349m0660J63242j87751M35240j07123k0897j41393K39973j97367
14611A071397K73934k06992j5869M7220k55655J9748L97598j1237k49294N88298
14601A659148j42034k20597K33491n40439M54711l914m25785N52805j50546o87354
14591G29486J78706K09398K29498P359J70007l414j47940K55283o23436K69775
14581A274722J40646R1143J10540j61064K24396l72728J08260O103N37281l40257
14571A619042M33062n23291K7532K20409k58330Q2075L30891l90185K98175J30634
14561A970014l35613L52078R9072J95408P0652R4045n988K56932q9945L54673
14551B961328O57183O55169K529797L846938P462217J8359220M583066A5975200
$$ y = [1135482, 928133, 887473, 1050715, 862964, 1298204, 1191081, 1170184, 1028791, 1268764, 1071397, 1345331, 1138339, 1122470, 1169690, 914035, 933783, 1331381, 1320144, 1070850, 1659148, 1517114, 1296517, 1530008, 989569, 1444280, 1440366, 1014581, 1567386, 1416840, 729486, 908192, 1117590, 1347088, 1354447, 1524454, 1521040, 1373100, 1628383, 1004947, 1274722, 1415368, 1506511, 1617051, 1455987, 1680383, 1307655, 1415915, 1422018, 1959299, 1619042, 2052104, 1528813, 1556345, 1776754, 1518424, 1600499, 1931390, 1541205, 1839380, 1970014, 1634401, 1986479, 2085551, 2280959, 2351611, 2445656, 2439668, 2696600, 2606655, 2961328, 3618511, 4273680, 6803477, 10650415, 18112632, 36471852, 41054918, 15975200]
14542F865317C315814j198298j47847l20872L85559M05821J138104J513610B440528
14532A600692N6359m786K16519j01179k16249o014K74064m6302J14855J06774
14522A994733k29915J20690m40405N21480j99770K38320j72502R9880o4801j48972
14512A718738M90640o29700P25032j03045J57850R4955J5014k41204j19198K78199
14502B387281L7380J42997j6014j45431L56208K9607l18445M3832P1178L25739
14492B914332k27082k30145K29185J37025l87450K88914N76573n90656K20968
14483B931664j26150K52882j51683L2293J68574j05446r9807K98939q6932L25622
14473C439956m0685j72214k36373K85122J11306j255j385j74670K55712J11232
$$ y = [6865317, 3315814, 2117516, 1969669, 1648797, 2034356, 2440177, 3578281, 5091891, 2440528, 1600692, 1657051, 1652265, 1868784, 1767605, 1551356, 1545342, 1819406, 1773104, 1887959, 1994733, 1764818, 1885508, 1445103, 1966583, 1766813, 2005133, 1832631, 1932511, 1867710, 1718738, 2209378, 1579678, 2304710, 2201665, 2359515, 2454470, 2469484, 2228280, 2109082, 2387281, 2424661, 2567658, 2551644, 2406213, 2762421, 2792028, 2473583, 2517415, 2588593, 2914332, 2687250, 2457105, 2686290, 2823315, 2435865, 2724779, 3301352, 2710696, 2931664, 2805514, 3058396, 2906713, 2939006, 3107580, 3002134, 2902327, 3201266, 3114334, 3439956, 3399271, 3227057, 2990684, 3275806, 3387112, 3385857, 3384472, 3209802, 3465514, 3576746]
14463C576746J43582n5746k10143M50811l37472L02417K09792l60141K65261J10296
14453D095403m2732J03586R5445j08720N0988l9908O48771L3991k06159l10169
14443D320496K58468k51455M76110R3992M09293j84240K06733k86018p1980L44659
14433E316058M9161m0920J69681J34963J05442j20220O0298J51550J41566M4316
14423F011895J65031Q86381l15068k67728N8194J63681J85800K0867K97640r4467
14413G112226J21825j51773Q5768K79753K57769J30940K03155K54792M9095j14447
14403H229103j31931L32660l66166O55616j04464n9311M90044Q3194k5348J49760
14393I253157J06689K38992L15750l4536K53256J01674L66651J91273K89452M15372
$$ y = [3576746, 3720328, 3664582, 3454439, 3905250, 3567778, 3870195, 4079987, 3719846, 3985107, 4095403, 4052671, 4156257, 4251702, 4142982, 4193970, 4154062, 4802833, 4836824, 4630665, 4320496, 4578964, 4327509, 4803619, 4897611, 5306904, 5122664, 5329397, 5043379, 4971399, 5316058, 5365219, 5324299, 5493980, 5628943, 5734385, 5614165, 5674463, 5826013, 5967579, 6011895, 6176926, 7063307, 6748239, 6480511, 6538705, 6702386, 6888186, 6909053, 7206693, 7112226, 7234051, 7082278, 7168046, 7447799, 7705568, 7836508, 8039663, 8294455, 8343550, 8229103, 8097172, 8429832, 8063666, 8719282, 8614818, 8555507, 9045551, 9128745, 9103397, 9253157, 9359846, 9598838, 9914588, 9880052, 10133308, 10234982, 10601633, 10792906, 11082358, 11497730]
14383A1497730R6034O3417J45899J28574K55951J14792O34898k48659K68498N56942
14373A3514076N6698J65781R0439M01619N38021N99861k48691P50937N8929K04096
14363A6131766M07269J86886N28789M54805M44309Q3596M77566M11027N94329
14354A9720342O20196K93690O76915J20318Q97298O00291L27730Q99461L79856
14345B4536097O44530R70011K31835O44024Q63281N99591J457884N19909P03786
14336C1170948J017712J185009M95849J294079J158249P92664J191189J540667
14328C9846366R60926J487317J056521J606480J476771J837689J840146J725830
14320E1838046J926464J862709J326007K840087K026530K431900K578761K789148
$$ y = [11497730, 11593764, 11657181, 11803080, 11931654, 12187605, 12302397, 12937295, 12688636, 12957134, 13514076, 13570774, 13736555, 13826994, 14228613, 14766634, 15366495, 15117804, 15868741, 15927670, 16131766, 16539035, 16725921, 17254710, 17709515, 18153824, 18237420, 18714986, 19126013, 19720342, 20340538, 20634228, 21311143, 21431461, 22328759, 22929050, 23256780, 24156241, 24536097, 25180627, 26150638, 26382473, 27026497, 27889778, 28489369, 29947253, 30467162, 31170948, 32188660, 33373669, 33869518, 35163597, 36321846, 37114510, 38305699, 39846366, 40807292, 42294609, 43351130, 44957610, 46434381, 48272070, 50112216, 51838046, 53764510, 55627219, 56953226, 59793313, 61819843, 64251743, 66830504, 69619652]
14312F9619652K995275L000605L436550L602205L436799M269356L751145M502895
14304I8614482N034319M886308N288808N689719O098209O778966P022010P151443
14296A46564264Q157324Q512871Q794183R543200R929500J1003333J1311510J2383447
14288B26199632J2607662J3297974J4354348J4222611J5167328J5532838J5857166
14281C27239559J6085579J6242679J6173577J5745667J5042739J3731203J2511470
14274D32772473J0060955L278129J68056O85425J674618K412672p543868m451265
14266D39057195n324458j0088089j2438770j4238499j5060951j5957380j6733788
14259C49215260j7065187j7042014j6223298j5822730j5082012j4683924j4006685
$$ y = [69619652, 72614927, 75615532, 79052082, 82654287, 86091086, 90360442, 94111587, 98614482, 103648801, 108535109, 113823917, 119513636, 125611845, 132390811, 139412821, 146564264, 154721588, 163234459, 172028642, 181571842, 191501342, 202504675, 213816185, 226199632, 238807294, 252105268, 266459616, 280682227, 295849555, 311382393, 327239559, 343325138, 359567817, 375741394, 391487061, 406529800, 420261003, 432772473, 442833428, 446111557, 446279613, 446965038, 448639656, 451052328, 443508460, 439057195, 433732737, 423644648, 411205878, 396967379, 381906428, 365949048, 349215260, 332150073, 315108059, 298884761, 283062031, 267980019, 253296095, 239289410]
14252B39289410j3059015j2430602j1791197j0724086j0786467r477500o772482
14245A64248061q485670p696184p790145o974039o683255o173127n955820m749674
14237A09740147m914368n081745m399469m413292l768428l610159k870065l727140
14229G6955481k656726l453276k724578k646868k832407k115461j991928k571037
14221E5963200j560108j818008j885011j714454j802817j550937j538335j106369
14213D2987161j292146j415883j354415j086525j330111j232731k32426r47211
14205C4095713j727337n01362j124087q70863n11240p04074n48104j301692o46783
14196B6160171q88486m20623k09638p65605o46340q13960m25600m12270n82122
$$ y = [239289410, 226230395, 213799793, 202008596, 191284510, 180498043, 171020543, 164248061, 155762391, 148066207, 140276062, 133302023, 126618768, 120445641, 114489821, 109740147, 104825779, 99744034, 95344565, 90931273, 87162845, 83552686, 80682621, 76955481, 74298755, 70845479, 68120901, 65474033, 62641626, 60526165, 58534237, 55963200, 54403092, 52585084, 50700073, 48985619, 47182802, 45631865, 44093530, 42987161, 41695015, 40279132, 38924717, 37838192, 36508081, 35275350, 35042924, 34095713, 32368376, 31867014, 30742927, 29872064, 29360824, 28656750, 28108646, 26806954, 26160171, 25271685, 24851062, 24641424, 23875819, 23229479, 22415519, 21989919, 21577649, 20995527]
14187B0995527o08469p16127K12567p38877k99213l99764o09484n06783j27670
14178A7201707m75533j60516l35860k21144m29302p11913M3620m94138j89933
14169A4226988k03723l07172k06707k01523j10336l87024l7606n62550p9709j31507
14159A1999131n43143k44825P7842n65565N4861j86454m5678j67941m3971r2798
14149A0241459o48884J06798J4344l06055r2892l97360J24465j94553Q790k78995
14139H577117J99n09172K05836l47824p3822J43826m7722m54310Q357Q3618k35969
14128G350134k34217K95099k97450l44324q2723R3707l06038J95944m85544J40538
14118F325126j72176J49151j9160k80816p3443L29549n24052J33351k60889m657
$$ y = [20995527, 20387058, 19670931, 19883498, 19144621, 18845408, 18445644, 17836160, 17329377, 17201707, 16726174, 16565658, 16229798, 16008654, 15579352, 14867439, 14911059, 14416921, 14226988, 14023265, 13716093, 13509386, 13307863, 13197527, 12810503, 12772897, 12210347, 12130638, 11999131, 11455988, 11211163, 11289005, 10723440, 10778301, 10591847, 10546169, 10378228, 10334257, 10241459, 9592575, 9699373, 9713717, 9407662, 9314770, 8917410, 9041875, 8847322, 8856112, 8577117, 8577316, 8068144, 8273980, 7926156, 7852334, 7996160, 7948438, 7494128, 7502485, 7586103, 7350134, 7115917, 7411016, 7113566, 6769242, 6686519, 6780226, 6474188, 6670132, 6184588, 6325126, 6152950, 6302101, 6282941, 6002125, 5928682, 6258231, 5734179, 5867530, 5606641, 5601984]
14108E601984O4266m38572L65815j53707J52315k88601l93240J35743L21712k92310
14098E075405p8425j71371M8613j82609k81856M27019m08882o6467J50328k44846
14088D266909L44066m20628K58616n3640Q5468m07528L28832n09727j157M65285
14078D356496n20707K4247O8817J4994l05180m3482M2027j12554K51902m3912
14068C732648m51598M86430j01608j00691J47210N4682l38386J02527j66862K39573
14058C603925j06554J8767J25870l38110J86265k92457L2973l90978N3547Q4892
14048B978140P9087k92591J6761J88961k4072j36638J32143j53987R7013j68350
14038B716467J02633j54733r4545O1880J74444j48584K30034l78386p0360q2230
$$ y = [5601984, 5666250, 5227678, 5593493, 5439786, 5592101, 5303500, 4910260, 5046003, 5367715, 5075405, 4996980, 4825609, 4874222, 4691613, 4409757, 4836776, 4427894, 4361427, 4511755, 4266909, 4610975, 4190347, 4448963, 4395323, 4480791, 4073263, 4402095, 3892368, 3891211, 4356496, 3835789, 3860036, 3928853, 3943847, 3638667, 3595185, 3637212, 3524658, 3776560, 3732648, 3281050, 3767480, 3665872, 3565181, 3712391, 3767073, 3428687, 3531214, 3364352, 3603925, 3497371, 3516138, 3642008, 3303898, 3490163, 3197706, 3230679, 2839701, 2893248, 2978140, 3057227, 2764636, 2781397, 2970358, 2946286, 2809648, 2941791, 2787804, 2884817, 2716467, 2819100, 2664367, 2569822, 2631702, 2806146, 2657562, 2887596, 2509210, 2438850, 2356620]
14028B356620N48369k29719m18773J9234L5979K10416l35468K78235l92774J68886
14018B241005P573L19554l61994J3799j15022R0441l58178J06781K04665j78104
14008A970520M31505l67969j20044L35266k29369j37103O1277J06165m77790K39489
13998A811947l87554L44631J0252P3064K62810k75657R5153r0012J39847J356988
13988C341469K726839N744429J5654787J8186516k2586373j0968206n119166k431482
13980D548813p48519l82560o00158l1578l03055P2431j38054j36027k14282L9242
13970B106253O2742R911m7209o6154l50240L05822k81943j49238N54047o49998
13960A493993J78180K87204r517l43266J44471J6399k86803J55751J01111k39760
$$ y = [2356620, 2904989, 2675270, 2256497, 2275731, 2311710, 2522126, 2186658, 2464893, 2072119, 2241005, 2248578, 2568132, 2206138, 2219937, 2104915, 2195356, 1837178, 1943959, 2148624, 1970520, 2402025, 2034056, 1914012, 2249278, 2019909, 1882806, 1944083, 2050248, 1572458, 1811947, 1424393, 1769024, 1779276, 1852340, 2115150, 1839493, 1934646, 1844634, 1984481, 3341469, 6068308, 11812737, 27467524, 45654040, 23067667, 12099461, 6980295, 4548813, 3800294, 3417734, 2817576, 2785998, 2482943, 2555374, 2417320, 2281293, 2067011, 2106253, 2168995, 2178906, 2131697, 2065543, 1715303, 2021125, 1739182, 1589944, 2143991, 1493993, 1672173, 1959377, 1949860, 1606594, 1751065, 1767464, 1480661, 1636412, 1737523, 1497763]
13950A497763J30225L68646n18800j3247J17205L1252J85952k28367j95175J05505
13940A480959p0465j61209K49523L7984o7027J43947J22832m65849O1204q9543
13930A242356R0483Q4874l64861M04916q033K28349l54826P7534L1659k83314
13920A149137o7426o1173N95665m60302K21952p4097J14267l44760j99764K80080
13910A153579j00562j9400J23405l751k87108N37896n50438L16544K88228j97003
13900A261390J03136k50977j12571K6177K4448L16581j119l39411L43446k49006
13890A122094L88272m14853k47766Q7983M282j08862k58718J95086K42686j79813
13880H30391N35256m51261J36073j42997J35790l31099K02850K73213k54144J4921
$$ y = [1497763, 1627988, 1996634, 1477834, 1464587, 1581792, 1613044, 1798996, 1570629, 1375454, 1480959, 1410494, 1249285, 1498808, 1536792, 1469765, 1613712, 1736544, 1270695, 1331899, 1242356, 1332839, 1417713, 1052852, 1457768, 1449735, 1678084, 1323258, 1400792, 1432451, 1149137, 1081711, 1020538, 1616203, 1155901, 1377853, 1303756, 1418023, 1073263, 873499, 1153579, 1053017, 1033617, 1157022, 1153271, 866163, 1404059, 853621, 1170165, 1458393, 1261390, 1364526, 1113549, 1000978, 1027155, 1051603, 1368184, 1367065, 1027654, 1371100, 1122094, 1510366, 1095513, 847747, 935730, 940012, 831150, 572432, 767518, 1010204, 830391, 1365647, 914386, 1050459, 907462, 1043252, 712153, 915003, 1188216, 934072, 948993]
13870I48993k5529j8288j27230N54651o16564K27274P9820O859j89269j59837
13860F80880J37757J20451o7282J05409k51757O0818J11543j68516L13667K91545
13850A334515F48236J80896j11323K68426k86463k3013K38554q6352j53825K0744
13840F95880J6624k19341M61942j44401j2330j40633k8629K59019l3307k99507
13830E55317L83880P6660k48045k57963J55743K24727J44455l39241K82179J986
13820I79698k07798M0932j84650r9979R2818L30169k68101J86729j90124Q6866
13810G66560j28532K67288L5808j45470j82640J0929L65964l69825L4470k88643
13800C65909M34922j94854B40197M34586J09270k47683M77577l81973j6373K46258
$$ y = [948993, 923464, 905176, 777946, 1332597, 716033, 943307, 1023127, 1029986, 840717, 680880, 818637, 939088, 871806, 977215, 725458, 786276, 897819, 729303, 1042970, 1334515, 648236, 829132, 717809, 986235, 699772, 676759, 915313, 828961, 675136, 695880, 712504, 493163, 955105, 810704, 798374, 657741, 629112, 888131, 854824, 555317, 939197, 1015857, 767812, 509849, 665592, 890319, 1034774, 695533, 977712, 979698, 771900, 812832, 628182, 528203, 621021, 951190, 683089, 869818, 679694, 766560, 638028, 905316, 941124, 795654, 613014, 623943, 989907, 620082, 654552, 365909, 800831, 605977, 240197, 674783, 784053, 536370, 1013947, 631974, 615601, 861859]
13790H61859k10938p7462J88798k57713R6087j5585r419J51496l2329J63918q5801
13779G72911l32523L17707j27329M9496N2098R1814o6293J37241k3705m6824P7085
13768I01678D26880K23175j8745k2686r3761J66557J6922j69440J87115C54463
13757A17544N93313j41372J96574l80541p443K98672B51309L52776n6443J7925
13747E65567m8283K01543j35310A54613M96960n6624B97370K25408j32205M89044
13737H79617B14662K63105L66502C54909K52312j45590j31517J4181K07255J57479
13727G09029B20135J51789L12860l09662J165J08005J97356j68024A74919o4094
13717A10825M62650j68867j89149M65860j99097B11264M95923l2795k79613j53603
$$ y = [861859, 650921, 573459, 762257, 504544, 600631, 585046, 575627, 727123, 694794, 858712, 772911, 440388, 758095, 630766, 680262, 732360, 824174, 757881, 895122, 871417, 824593, 901678, 426880, 650055, 631310, 608624, 514863, 681420, 698342, 528902, 716017, 354463, 117544, 710857, 569485, 766059, 385518, 378075, 676747, 251309, 604085, 547642, 565567, 517284, 718827, 583517, 154613, 651573, 594949, 297370, 522778, 390573, 879617, 214662, 477767, 844269, 354909, 607221, 461631, 330114, 344295, 551550, 709029, 220135, 371924, 684784, 375122, 376287, 484292, 681648, 513624, 174919, 110825, 573475, 404608, 215459, 681319, 482222, 211264, 707187, 674392, 394779, 241176]
13707B41176L06120K449D8521L04096K39705j83412l1294j3418l2278M26820k63311
13696D95429J63951P7170j27166B54952o8556L97453B76802j24651J99507M7377
13686C99035l3323J51586r253k9717j70400O3337K29409k59799J17946j57877
13676C00944m7941k9128L53248A96659P5764r2466K58734J5131K6058k387j84540
13665B92953J88790j55542r4146L62331B33638j02628R3658j3655J45105g2375
13654F23370A34673J35635k1563J73235A54861K43304N0889O7757j64144K76349
13644F29016m5801p3768A89884n4450J03295k0174O241R0894n6034L55447j99527
13633D15576k7996p8124k2937m8292M8580J7171j00173L52208B35062J21260K07714
$$ y = [241176, 547296, 549745, 48521, 352617, 592322, 408910, 377616, 364198, 331920, 758740, 495429, 659380, 736550, 609384, 254952, 186396, 583849, 276802, 152151, 351658, 399035, 365712, 517298, 508045, 478328, 307928, 371265, 600674, 340875, 458821, 300944, 253003, 223875, 577123, 196659, 272423, 179957, 438691, 453822, 479880, 477493, 292953, 481743, 326201, 232055, 594386, 233638, 131010, 224668, 211013, 356118, -72375, 623370, 134673, 270308, 248745, 421980, 154861, 398165, 449054, 516811, 352667, 629016, 583215, 509447, 189884, 135434, 238729, 218555, 224796, 315690, 259656, 615103, 415576, 387580, 309456, 286519, 238227, 286807, 303978, 203805, 556013, 235062, 356322, 564036]
13622E64036j90233C8855b2632A01477e441D98274C2854K88420j20992m3479M62330
13611F19133j39204E3098K39774G4058J30940L51111j71188j90754J82920M6270
13601D23357j14004B5961K86260D9506L72046p0944j63881C8731a01056C72680
13590E86332k79601q1357K15078A61278M657L35595A98283J48300J21733k33808
13580B34508O1141K109M1517g495I1056K45844P415j31820J8317J57385r8031
13569B90166A34533K04668M7534N9490p7089f8146B70313o5551D9403K6750g692
13557H1517L39987A49206C88L17473j33120J68137n8287M4617A60028i3530A95243
13545C6001J13997L89045k05645j55910a82484D5251M74381A55987L4228J83087
$$ y = [564036, 373803, 38855, -22632, 101477, -5441, 498274, 32854, 321274, 200282, 156803, 619133, 479929, 53098, 292872, 74058, 204998, 556109, 384921, 194167, 377087, 423357, 309353, 25961, 312221, 49506, 421552, 350608, 186727, 38731, -101056, 372680, 586332, 306731, 225374, 440452, 161278, 165935, 501530, 198283, 346583, 468316, 234508, 295649, 297758, 339275, -7495, 91056, 336900, 344315, 212495, 230812, 388197, 290166, 134533, 339201, 386735, 446225, 369136, -68146, 270313, 204762, 49403, 76153, -7692, 81517, 421504, 149206, 388, 317861, 184741, 352878, 294591, 339208, 160028, -93530, 195243, 36001, 149998, 539043, 333398, 177488, -182484, 45251, 519632, 155987, 190215, 373302]
13535C73302b6880A96250K4692k2506L80998k54643e6019A04522L64238B11520
13524A19722L8778r152c9617B60652p6361p250D7750c9774B42796n3410B3140
13512B20721h3090B64753K75850F9269f3616C71632b4792D14282L8040A92791
13501A01164K84149B5141M03539k10658r198j5852J71088c9219B52355D1498J31782
13490A73280J61330d952E5505D140M54816A66687N1194K27364j48816k914n4409
13479B39106b6379B96737j38947J02178e8939r529B07553D5079J48565J12596
13469C06240H2727L13520G7918J25443I5797K75025k6703M5696j08192A31326
13458E76469B22391g3033B20939a75979C22700A30602a84888C58173p3581D9263
$$ y = [373302, -26880, 196250, 220942, 198436, 579434, 324791, -56019, 104522, 468760, 211520, 119722, 158500, 149348, -39617, 260652, 184291, 177041, 47750, -39774, 242796, 189386, 23140, 220721, -83090, 264753, 540603, 69269, -63616, 371632, -24792, 414282, 452322, 192791, 101164, 385313, 25141, 428680, 218022, 208824, 192972, 364060, -39219, 252355, 41498, 173280, 334610, -4952, 55505, 4140, 458956, 166687, 217881, 445245, 296429, 293515, 239106, -26379, 296737, 157790, 259968, -58939, -68468, 207553, 45079, 193644, 306240, 82727, 396247, 77918, 203361, 95797, 370822, 344119, 389815, 281623, 131326, 576469, 222391, -73033, 220939, -175979, 322700, 130602, -184888, 358173, 284592, 49263]
13447I5245J02976M10830A37585K03099A18065K47565l3857l056K5135j54219
13437A99633K05142E4710J21187J35806a29710C95797j42953a73819C09535C3948
13426A03718a42473C41676j57339d3762C41755F0091K46995m6234Q8812a2030
13415d488A54646L90764c8577J7777A29498J80681D9300M70304d6170C6297R1688
13404A27985J31025H8210N9944J1165f2613A52216p0334L7730J89421p6627n2586
13393A79820A9839C73M02794j04498c33781E6438K51306j31923b816B02538J2273
13382B14811F0134R1670J05425a13983B68561j32903i1355A00549h4137A53625
13371A54009F3927K36055R2831L00L14061B05559R7981j43504B6154M4170K19608
$$ y = [95245, 198221, 609051, 137585, 340684, 118065, 365630, 331773, 328717, 353852, 199633, 404775, 54710, 175897, 311703, -129710, 395797, 252844, -173819, 309535, 33948, 103718, -142473, 341676, 184337, -43762, 341755, 60091, 307086, 260852, 349664, -12030, -4488, 154646, 545410, -38577, -20800, 129498, 310179, 49300, 519604, -46170, 36297, 127985, 259010, 88210, 148154, 159319, -62613, 152216, 81882, 119612, 309033, 232406, 179820, 19839, 373, 403167, 298669, -333781, 56438, 307744, 175821, -2816, 202538, 214811, 60134, 151804, 257229, -113983, 268561, 135658, -91355, 100549, -84137, 153625, 154009, 63927, 299982, 392813, 393113, 707174, 205559, 303540, 160036, 26154, 70324, 289932]
13360B89932Q2276j37783q8642N6736i771d210C69159E0720b1849A08636a9620
13348B23147N9222A3774J70093j0664J22658J6852m7721a13541B77340J4244J24678
13337D16262A43698M7217K26757J47294B15321Q3225J3280J103J67631j79286
13327C01274n8519j2090c8430B12843a16629A30248J80694j19679j9974J32689
13317C03978R708n8742n0691H9009P5136J36744A06720i3574E11213e5108A93457
13305A98805G2344J12593F9638a0308C03965P6825a27338C00696b61946A376Q180
13294I556K81270c9580A54819K5351f802C2174P0297J29810R9209a38525d3606
13282B62319r393j15983D8490J36217d6592j08416G2559h7680c8035A24385l8036
$$ y = [289932, 372208, 234425, 145783, 202519, -9771, -4210, 369159, 50720, -21849, 108636, -19620, 223147, 282369, 13774, 183867, 173203, 295861, 312713, 264992, -113541, 277340, 291584, 416262, 143698, 190915, 417672, 564966, 215321, 298546, 311826, 312929, 480560, 301274, 242755, 230665, -38430, 212843, -116629, 130248, 310942, 191263, 171289, 303978, 313686, 254944, 204253, 89009, 164145, 300889, 106720, -93574, 511213, -55108, 193457, 198805, 72344, 184937, 69638, -10308, 303965, 380790, -127338, 300696, -261946, 1376, 9556, 290826, -39580, 154819, 180170, -6802, 32174, 102471, 232281, 331490, -138525, -43606, 262319, 252926, 136943, 48490, 184707, -46592, -155008, 72559, -87680, -38035, 124385, 86349]
13271H6349b04521D1783R4144b3601A42079O6724Q1931A33695A2367J04237K76343
13260C92947r9848C3920J26184K15788j5363a96448h8998r472m7799k9343G1159
13248A82067q2235J01825q1517c9587A77058c5548A90630K4309B2318f6198G3229
13236A25614a780j75790A21855C4029O6880P0948p7364L4768J66666e1005J0314
13225d0691B36045o2785B9401h7676B8230K92994a2200A70972a53414I9692D7038
13213A256a8979j54857C57821d4540h662D2146K82728j23375F3821a45622k5561
13202a71183L2194F4085a72491a2772C18213b72248R339m9925A30181i4943A96738
13190B04427H5344a26435k24724a0493D8239B2147d5789B83116H9170J11392b23117
$$ y = [86349, -204521, 41783, 135927, -23601, 142079, 208803, 290734, 133695, 12367, 116604, 392947, 293099, 33920, 160104, 375892, 360529, -196448, -88998, -98470, -146269, -175612, 71159, 182067, 99832, 201657, 120140, -39587, 177058, -35548, 190630, 214939, 22318, -66198, 73229, 125614, -1780, -177570, 121855, 34029, 100909, 171857, 94493, 129261, 295927, -51005, -40691, 236045, 173260, 29401, -87676, 28230, 321224, -12200, 170972, -153414, 99692, 47038, 1256, -18979, -173836, 357821, -44540, -8662, 42146, 324874, 201499, 63821, -145622, -171183, -138989, 64085, -172491, -12772, 318213, -272248, -262909, -312834, 130181, -94943, 196738, 204427, 85344, -126435, -351159, -10493, 48239, 22147, -45789, 283116, 89170, 200562, -223117]
13178G3918a49022I1805J02105i69l24527A512K00247g2480A50271K92147C7677
13166C03369i616C9450f5913A20887K08285A03579P9898E3899a3464j51412q195
13155a73071A07904b02090A05085L8012P4726d8843B47832q0461H2021K30204
13145C12225E9443a68415d1489B4152J21642k29l0480M14355A09740E3948J84487
13134B38435l2743C9102a65638H327O4672M5791J4024g7481A51756K2064E8555
13122g8203j18060A84948F6368J49863j3710i160F8726B7123c33293H9760b49368
13110b46126b300B51584K7542K21881B17309J14019G5657j8970A5598J8561a78845
13098G2802c9880I7983a57909C14337a60021P7247H7074C9840P0579a93666e9091
$$ y = [73918, -149022, 91805, 193910, -969, -325496, 1512, 201759, -72480, 150271, 442418, 37677, 303369, -9616, 39450, -65913, 120887, 329172, 103579, 183477, 53899, -13464, -164876, -173071, 107904, -202090, 105085, 143097, 217823, -48843, 247832, 167371, 82021, 312225, 59443, -168415, -41489, 24152, 145794, 145565, 115085, 529440, 109740, 53948, 238435, 205692, 39102, -165638, 8327, 72999, 118790, 132814, -77481, 151756, 173820, 58555, -78203, -196263, 184948, 66368, 216231, 202521, -9160, 68726, 27123, -333293, 89760, -249368, -246126, -2300, 251584, 279126, 501007, 217309, 331328, 75657, 56687, 15598, 34159, -178845, 72802, -39880, 97983, -157909, 314337, -160021, -82774, 87074, 39840, 110419, -193666, -59091]
13086A26023b6762B60385H4588r394c59482H3913e15868i5196L5913a864B69845
13074a47969A32830A1448J38549Q2618j6546J95342a22228B15961J9109m6621
13064A88449K07008A35938E365K54084D5030c01188A18580h1802B28363h6574
13053A17880L3514c5523j9594A19601C6259E98K40243Q7281r9126a08347H4077
13041A24652K18384A44148b53181b2607B04532K1720G8410a48408A63438a23181
13030a97857h2224j20951D54755f9101A30278a74455C7801J81015A03298L0014
13020A33312e5612F5512H736K1515K7328K21217A33217a48586B7874J31644G4162
13008i6199F6953A0088Q3316J13973f7443k10065A6578c6013m4393A07110a82604
$$ y = [126023, -26762, 260385, 84588, 75194, -359482, 83913, -515868, -95196, -59283, -1864, 269845, -147969, 132830, 11448, 149997, 232615, 216069, 411411, -122228, 215961, 235070, 188449, 395457, 135938, 5365, 259449, 45030, -301188, 118580, -81802, 228363, -86574, 117880, 151394, -35523, -55117, 119601, 36259, 598, 240841, 328122, 228996, -108347, 84077, 124652, 343036, 144148, -253181, -22607, 204532, 226252, 78410, -148408, 163438, -123181, -197857, -82224, -203175, 454755, -69101, 130278, -174455, 37801, 218816, 103298, 133312, -55612, 65512, 8736, 30251, 57579, 278796, 133217, -148586, 27874, 159518, 74162, -96199, 66953, 10088, 93404, 207377, -67443, -277508, 16578, -36013, -80406, 107110, -182604]
12996A4197N43932h2123B49479k1554I7484O1863b82427e8412A70471P1361a56332
12984B5393g6005H6817e2872e304a819G9639a05851D1691a68748j56593H4087
12972a85206c8323k35592C38483a45444c3274C470K45447i6272A11236Q871e9095
12960C15269b1970A01362a17207j37367A59740J4887E8913J47367J33629B6045
12949f2692F2146J5014M203k4055c8888j06094b4123B1106c95896A00892l1314
12938F9578f6455J7195A59092f156m194A71926b3369j15885b2108k9866o926m3702
12926a02602H8061K67997c4652q1869A41711C6141J34581a8368C21952a89689
12915G9396O7219a33471B8824c7286k8745k66491f8878j5256J5458A15260b9144
$$ y = [14197, 558129, -82123, 249479, 227925, 97484, 159347, -282427, -58412, 170471, 241832, -156332, 25393, -76005, 86817, -52872, -5304, -1819, 79639, -105851, 41691, -168748, -325341, 84087, -185206, -38323, -273915, 338483, -145444, -33274, 3470, 248917, -96272, 111236, 120107, -59095, 315269, -21970, 101362, -117207, -254574, 159740, 174627, 58913, 206280, 339909, 26045, -62692, 62146, 77160, 81363, 57308, -38888, -144982, -24123, 21106, -395896, 100892, 69578, -66455, -49260, 159092, -6156, -10350, 171926, -23369, -139254, -22108, -51974, -58900, -102602, 88061, 356058, -34652, -116521, 141711, 36141, 170722, -18368, 321952, -189689, 79396, 146615, -133471, 28824, -37286, -66031, -332522, -68878, -84134, -68676, 115260, -29144]
12903B03507a23094L7063l6757A18579K42246A21758j3892h531j8593A8589J8816
12892C7405h3759j67204E4900k3871g2684j60996B35565A09117a63011J7845H8807
12880a65503j1168c7606B8870e6929l5705C847a2093r2291r478D8940a1985a070
12867B95735B6050g2004A34299a9618A92487G0694K60063j35875Q9188p2964a11881
12855A81042c5275B78200F2300b93383A72968e2707A70347J39488I6120J33516
12845B29636a94680e1966j32278A72805a76792d9568A73418J67427j63237l810
12835A73798D0176Q6775b22824d2776j4441j65962J931I9933a3861j34074N6644
12824i1291j75356I4909c9662I4576O1674a58331A00952a72196A23404k1671b04746
$$ y = [203507, -123094, -86031, -122788, 118579, 360825, 121758, 107866, -8531, -27124, 18589, 37405, -83759, -250963, 54900, 31029, -72684, -233680, 235565, 109117, -163011, -145166, 88807, -165503, -176671, -37606, 28870, -56929, -92634, 3847, -12093, -104384, -113862, 48940, -11985, -1070, 295735, 26050, -72004, 134299, -19618, 192487, 70694, 330757, 194882, 284070, 211106, -111881, 181042, -35275, 278200, 62300, -293383, 172968, -52707, 170347, 309835, 96120, 229636, -194680, -51966, -184244, 172805, -176792, -49568, 173418, 340845, 177608, 173798, 40176, 126951, -222824, -42776, -57217, -223179, -221248, 99933, -13861, -147935, -91291, -266647, 94909, -39662, 94576, 156250, -158331, 100952, -172196, 123404, 101733, -204746]
12812e8294A18261J1046a88105K1955d2346A84150b10004P270M9436K553G8622
12800e2411j06037f7076q6048f1396k5876c1089I916J20922L1591n6707c9822
12788c89782C26602A9291a19223L4719B00608d0851m6497o3571c6976J0357A28906
12776g7248A86275E6313a40547k15798A2212c44218a61662A33492i0231j0175
12766a00406k0790e5613K635k64864h77A9166J8210R2952b91411D8879a01280
12754G0044d3851H9382a37014r5459i9034I325R5348d02939d672j81808j801f5181
12741c04750I7841N6201O0624n0047g0614C71107A45316d6010D3745a14007j502
12730a15509l2575A54729K5688P8343a33434H2666A2310K03656I5629J24373L1418
$$ y = [-58294, 118261, 129307, -188105, -166150, -42346, 184150, -210004, -202734, -153298, -150745, 78622, -52411, -158448, -67076, -153124, -61396, -87272, -31089, 9916, 130838, 162429, 105722, -39822, -389782, 326602, 19291, -119223, -84504, 200608, -40851, -87348, -150919, -36976, -26619, 128906, -77248, 186275, 56313, -140547, -356345, 12212, -344218, -161662, 133492, -90231, -100406, -121196, -55613, -52978, -317842, -877, 19166, 37376, 130328, -291411, 48879, -101280, 70044, -43851, 89382, -137014, -232473, -99034, 9325, 104673, -402939, -4672, -186480, -188281, -65181, -304750, 97841, 154042, 214666, 164619, -70614, 371107, 145316, -46010, 43745, -114007, -115509, -148084, 154729, 180417, 258760, -133434, 82666, 12310, 215966, 95629, 220002, 251420]
12719B51420A5172a02295F389L77834A15670a6354k59880B45799h944H863K60869
12708B69732Q1348b588B86225M1510a17594A91412d37158B62796a67325l562c857
12696A07205Q8661a26070d4587I1652a02009D00311j54458b05343A40896a57727
12685e7233j24466B28712a91675A41950J00889q768f0674D02534A28761c7787
12674G7565b15362A6071h6663h803p4004l16687H7102M67688E9453J46568n1773
12663A54248D635M0464K03252d1582L896B13567I1367J08015e8880e610C41448
12651B61612j8656N5671j45155f845G5657J29595o8325j4020R613h7059p6730
12640a63789q0525h4931j08179C71232j42161B3958d1589o2877n541B34817j10322
$$ y = [251420, 15172, -102295, 6389, 384223, 115670, -16354, -276234, 245799, -8944, 8863, 269732, 351080, -2588, 286225, 327735, -117594, 191412, -437158, 262796, -167325, -170887, -3857, 107205, 195866, -126070, -44587, 91652, -102009, 400311, 245853, -205343, 140896, -157727, -57233, -181699, 228712, -191675, 141950, 242839, 234071, -60674, 402534, 128761, -37787, 77565, -215362, 16071, -86663, -8803, -82807, -399494, 87102, 554790, 59453, 206021, 154248, 4635, 45099, 248351, -41582, -37686, 213567, 91367, 199382, -58880, -5610, 341448, 261612, 242956, 298627, 153472, -6845, 75657, 205252, 136927, 122907, 132520, -87059, -163789, -244314, -84931, -193110, 371232, 229071, 23958, -41589, -104466, -110007, 234817, 124495]
12629A24495d761E3713J09521C195K44293e4745A85988P2697A9222K0850M2782
12618H2854Q1300d35413J46111E17298C4192P262j6155J44046a35266A74609b06675
12606A6414a82414B34153q7284I274K06088D2063h1618n4979B22701a12715j71759
12595b84474d6398l50202a17164q831j27178B24803b35670B68202j03562P5136
12585B39776j03875i4710A05235a11816F4038K9361N5527a26381F7254H919h4731
12573i5274l6528j57985F90035C5344J77713G5704a98368J3953D2701a01183K8885
12562g2298B04807N4571e4896A58890a57645N2300k7237C6570M09198A54125l7133
12551A16992C7388b13304r6224a08998L8649r7874P4670o9840O0495E8218K747
$$ y = [124495, -4761, 53713, 163234, 3195, 247488, -54745, 185988, 258685, 19222, 40072, 82854, 164154, -435413, -289302, 517298, 34192, 41454, 25299, 169345, -135266, 174609, -206675, 16414, -182414, 234153, 146869, 9274, 215362, 42063, -81618, -136597, 222701, -112715, -284474, -46398, -396600, -117164, -125995, -253173, 224803, -235670, 268202, 164640, 239776, 135901, -94710, 105235, -111816, 64038, 93399, 148926, -126381, 67254, 8919, -84731, -95274, -131802, -289787, 690035, 35344, 213057, 75704, -198368, -184415, 42701, -101183, -72298, 204807, 259378, -54896, 158890, -157645, -105345, -132582, 36570, 445768, 154125, 116992, 37388, -213304, -309528, -108998, -70349, -168223, -93553, -163393, -102898, 58218, 60965]
12540F0965b85382k2302A19069a61866B33521a95752i5422j82889B2339L16670
12530C39009o4069q3394d3201I2606f6226B02130G2780I640J09916H32N7686J18318
12518A76836J6181a5383k9542b436A2292K90635a2440B32612a21320C23677r6811
12507B26866J34554a05331a4998k91275C5599h5129j63884A21101E3701N7757
12497A11458m0785J04878L139p9839b3760A55762f3680C48692Q8327A98824o4433
12486A34391F753L61062J69561b3243E6634J00375a68672C5776h5253C05786A11342
12474d091D380K64728a93078A605c28510e2948B13840a95953B64185i9841M1368
12463e8473K780p1507B43951F8526K40121F5581N073a653B22776H4614a72481
$$ y = [60965, -285382, -307684, 119069, -161866, 233521, -195752, -95422, -278311, 22339, 339009, 274940, 191546, -43201, 92606, -66226, 202130, 72780, 9640, 119556, 832, 58518, 176836, 193017, -15383, -44925, -2436, 12292, 302927, -12440, 232612, -121320, 323677, 226866, 361420, -105331, -14998, -306273, 35599, -85129, -249013, 121101, 53701, 111458, 70673, 175551, 178690, 98851, -23760, 155762, -63680, 348692, 437019, 198824, 134391, 6753, 367815, 537376, -23243, 56634, 157009, -168672, 35776, -85253, 305786, 111342, -4091, 4380, 269108, -193078, 1605, -328510, -52948, 213840, -195953, 264185, -99841, -58473, -55693, -127200, 243951, 68526, 308647, 65581, 70654, -1653, 222776, 84614, -172481]
12451a43305A32551g5620j58440G4829b03457j6044P6827k9708A22141a32910
12440A1149a58238H9951l3169k2739P7426O652b3543N907l16937a38351A04512
12428i9966l2330F3774K20705C3441J3526e2814k58051a03716r7665F3608f9029
12416c8151E4573P1699J94234C5359K2854a7022m8853r261B459K98437a30396
12404C78501a61797E6619b2260d339A09439e7679l59905L8321F104A299c607F2007
12391A20490D8106A3880K69138j02801d7766A78537F9152k6804R2905O1712E9447
12379F2995J72940b10903C7876J23726g594A74788c0917R849l1020B05568a74918
12367d97570d8052E8953B2994a54735n8801A53798b7240r326m2547K5804C11186
$$ y = [-143305, 132551, -75620, -234060, 74829, -203457, -219501, -142674, -172382, 122141, -132910, 11149, -158238, 89951, 56782, 34043, 111469, 118121, -23543, -17636, -334573, -138351, 104512, -99966, -132296, 63774, 284479, 33441, 46967, -52814, -310865, -103716, -201381, 63608, -69029, -38151, 54573, 126272, 320506, 35359, 58213, -17022, -65875, -75136, 2459, 300896, -130396, 378501, -161797, 56619, -22260, -4339, 109439, -57679, -417584, -379263, 6104, 1299, -3607, 62007, 120490, 48106, 13880, 283018, 180217, -47766, 178537, 69152, 42348, 135253, 196965, 59447, 62995, 235935, -210903, 37876, 161602, -7594, 174788, -30917, -21068, -52088, 205568, -174918, -497570, -48052, 58953, 22994, -154735, -213536, 153798, -27240, -36566, -79113, -53309, 311186]
12355A34888b05121j63938i5837b4864A54651a49385B03107F8714J0339a31508
12344C01695b09867m624h1932q9355A38455J65235r5600j4137d2871q7006A97113
12332C47811p530J15170D666K01943J08244j33233a9438B17653r1496L7652J24047
12321B87856H5277L1720L9617L24260B34892o899J90110j05507J9836a75438A89300
12309B84207o0694J0018b6784l12764A94999F4116j1781k3851M22475a10372a9067
12297e6289C94099F5436K90980j36281i028E6584N9146R8189I9961J3803a89069
12285A09523k0453J57677a35606B0182K20899G7250J89536g9098A29180Q1816
12275B10996p8091a84843A92143a20669B15001H2510d9352B64194R7445c6351
$$ y = [134888, -205121, -369059, -95837, -24864, 154651, -149385, 203107, 68714, 79053, -131508, 301695, -209867, -214491, -81932, -171287, 138455, 303690, 208090, 193953, -42871, -129877, 197113, 347811, 340281, 455451, 4666, 206609, 314853, 181620, -19438, 217653, 126157, 163809, 287856, 85277, 116997, 156614, 480874, 234892, 227993, 418103, 312596, 332432, -175438, 189300, 284207, 223513, 233531, -26784, -339548, 194999, 64116, 52335, 28484, 450959, -110372, -19067, -56289, 394099, 65436, 356416, 220135, -9028, 56584, 115730, 213919, 99961, 113764, -189069, 109523, 89070, 246747, -135606, 20182, 241081, 77250, 266786, -79098, 129180, 210996, 132905, -184843, 192143, -120669, 215001, 82510, -49352, 264194, 361639, -36351]
12264I8419K4184K25981L4484m6184A38239K18926q3262n6012O6203j10325n5417
12253A18352J86922n7912K9179b85928J41898o5313C6087L05085A477i5894D6966
12241A5820h2081k5272A68231L19229C0017K92747j21223d9849D652b73742f0285
12229A84050B9586i4540l2351j52922B64021l8715i7834b0648C4844n221K06897
12218B36520B8343J45732L71875a68801A68766J01411j9256J03431j0171J17202
12208D61383B28405a37982A56907C1722J23767L9494b50174B82668d8488j46450
12198a94938j8336A93522L894I5764J52358j20668P9675a20338D5035K88569A49492
12186I992L26648Q2220o1904q1339b03409A14170g0987E17003I4795J438O2171
$$ y = [98419, 122603, 348584, 383068, 336884, 138239, 357165, 273903, 217891, 284094, 173769, 118352, 305274, 247362, 276541, -285928, -144030, -209343, 36087, 341172, 1477, -95894, 46966, 15820, -82081, -107353, 168231, 487460, 30017, 322764, 201541, -49849, 4652, -273742, -60285, 184050, 29586, -94540, -126891, -279813, 264021, 225306, -97834, -20648, 34844, 29623, 236520, 28343, 174075, 545950, -168801, 168766, 270177, 250921, 354352, 344181, 461383, 228405, -137982, 156907, 31722, 155489, 194983, -250174, 282668, -48488, -194938, -213274, 193522, 197416, 95764, 248122, 127454, 207129, -120338, 45035, 333604, 149492, 9992, 336640, 418860, 356956, 275617, -203409, 114170, -70987, 517003, 94795, 96233, 158404]
12175A58404J70564F6688d8149B02961J701K29851G6307K57054K3194m2368a09966
12163D10397A29M30781A70169F1442f920r7975k2190A75454n3791C5209L8611
12152G3820a0075C15485j30948M6052b01334B27676A08765J17721c3738l8260
12142g1998q4741B17623J34196A4259N5621j9410c7376A04844K72438a63814B3752
12130A57568O6224a4218C17557a3337A90018a0305A10870J84409k6578N260r2753
12119A81208C463Q2239K8291J35221b77123B83383N830j17533e0840A86469c4708
12107d3758k2056q0400C00475J46237D0178L39634n3739P8337l76a36858b693
12095C50755a87093F6999M72679a07064A55276J86973j24026a6578C08280g2388
$$ y = [158404, 328968, 66688, -48149, 202961, 204662, 434513, 76307, 333361, 356555, 314187, -109966, 410397, 129, 430910, 170169, 61442, -6920, -104895, -127085, 175454, 121663, 35209, 73820, -10075, 315485, 184537, 230589, -201334, 227676, 108765, 226486, -33738, -71998, -156739, 217623, 351819, 14259, 69880, 50470, -37376, 104844, 377282, -163814, 23752, 157568, 223792, -14218, 317557, -13337, 190018, -10305, 110870, 295279, 268701, 273961, 181208, 3463, 85702, 113993, 249214, -277123, 283383, 289213, 171680, -50840, 186469, -34708, -43758, -65814, -146214, 300475, 446712, 40178, 379812, 326073, 404410, 404034, -136858, -2693, 350755, -187093, 66999, 539678, -107064, 155276, 342249, 218223, -16578, 308280, -72388]
12084b50982D41960j86212H9097L1004K40453j25259L5405b44654E2195J84228
12074B36423c5974A5371b4510m3626E12144A09526L53600B06240J4871P7472a72724
12062b74080C29281G7310C2317J44379D2057c6942C08019g0295G038J36416g895
12050i8377j2680B89686c8320A57127a26099A60237K4631e5030j3813L3219n2811
12039h8435E4502Q9194b8287r8758A74069K3619D7545K80076e7203C86919e673
12027i4335B18207L1128n3857C5283j5296e4097A41428a01861D1289J43989o6335
12016A18943c51422i2692b5635C47602j47964A0844K18024l1532A9030g3680A75430
12004I081b85343P3847A82553a08319J8486j85887A73306L34878F1407a56453
$$ y = [-250982, 441960, 255748, 89097, 120101, 360554, 235295, 270700, -244654, 52195, 236423, -35974, 15371, -24510, -68136, 512144, 109526, 463126, 206240, 221111, 298583, -172724, -274080, 329281, 77310, 32317, 176696, 42057, -36942, 308019, -70295, 7038, 143454, -7895, -98377, -111057, 289686, -38320, 157127, -126099, 160237, 184868, -55030, -68843, -35624, -88435, 54502, 143696, -28287, -127045, 174069, 197688, 47545, 327621, -57203, 386919, -5673, -94335, 218207, 249335, 195478, 35283, 19987, -54097, 141428, -101861, 41289, 185278, 118943, -351422, -92692, -25635, 347602, 199638, 10844, 228868, 197336, 19030, -73680, 175430, 9081, -285343, -211496, 182553, -108319, -89833, -275720, 173306, 508184, 61407, -156453]
11993c06015e5793j76906M8962o2876A09289L7445Q3845j10513C9080d84065A2905
11981b43247a05730A01003a20089A30972b45423D5245L93477a84726N6605j29651
11971b57772L8785H508a27852K9140J8889m9191A2346J23773a27194l9219P2301
11960i4112B2273b54350D9714f1107o4904j19271c861A4254a50043A3381a10443
11948b83689h7014m2307l4129A48925m9669g6618A48994a01847A06859e0117g266
11936a12968J8898B8524a25098a2577A01589a67371k35f8071A56341b54380a17254
11924a24046B04274A4293K49117a49031A0925c0676p5080D2876B228J46411M1655
11913A90294C4579j4960a11402D9404j2856a72022A44141a59549B05255d2596
$$ y = [-306015, -55793, -232699, -183737, -246613, 109289, 146734, 230579, 120066, 39080, -484065, 12905, -243247, -105730, 101003, -120089, 130972, -245423, 45245, 438722, -184726, -128121, -257772, -218987, 8508, -127852, -98712, -79823, -129014, 12346, 136119, -127194, -166413, -94112, 22273, -254350, 49714, -61107, -126011, -245282, -3861, 14254, -150043, 13381, -110443, -283689, -87014, -129321, -163450, 148925, 99256, -76618, 148994, -101847, 106859, -50117, -7266, -112968, -94070, 28524, -125098, -12577, 101589, -167371, -167606, -68071, 156341, -254380, -117254, -124046, 204274, 14293, 263410, -149031, 10925, -30676, -105756, 42876, 2228, 148639, 190294, 34579, 19619, -111402, 49404, 36548, -172022, 144141, -159549, 205255, -42596]
11902G8508J44133b8116j00449i246j51912A23950F619b67888D4417J0504J93724
11891B48645b5590G7378M9894b10953i7684I8036a37147A34731c3048a5469p2755
11880h8224A13009a75267E6959c3743D7044g5424C39969G925a45754j17495J03534
11869a59715F0547b83530k82F7271O180c99889M1096A71209n9032a24843r9775
11858b24618f5506m11627a25288B50598a1998j0152F9097j5197b08194B41139
11847a37555O2521A7475b02900A96693l5431J24524a79692b4272k4518C62632
11836A8267e8636D46372a67909d1168A35632K48131E7178J9932L5496a02954F2138
11824a93707k1619k0971e9526B5260K9519K32021g8457D0990m48b20664A12273
$$ y = [78508, 222641, -28116, -128565, -9246, -161158, 123950, 6619, -267888, 44417, 54921, 248645, -25590, 77378, 127272, -210953, -97684, 98036, -137147, 134731, -33048, -15469, -88224, 113009, -175267, 56959, -33743, 47044, -75424, 339969, 7925, -145754, -263249, -159715, 60547, -283530, -283812, 67271, 73451, -399889, -358793, 171209, 112177, -124843, -224618, -65506, -477133, -125288, 250598, -11998, -22150, 69097, 53900, -208194, 241139, -137555, -75034, 17475, -202900, 196693, 161262, 285786, -179692, -24272, -48790, 362632, 18267, -58636, 446372, -167909, -41168, 135632, 383763, 57178, 77110, 112606, -102954, 62138, -193707, -215326, -236297, -59526, 25260, 54779, 286800, -78457, 40990, 40542, -220664, 112273]
11812b64379e6413m6617J7748B2042b5910p7498A08591c3204B57195f2724A1794
11800a94370A0547c6965I7265a44548A34906M1501a6975m56022Q0142a3028j57135
11789a70163A66888l7046g2732j9539j63298A11475a85767o4249C9439L1001M0697
11778A11137a21025B23001H0570a34347F1785d39433A39878a72019j25694i6543
11767D0342D643b15007j05231H7951l8726a71466N0471B8647J24187m0724B8394
11755C3289j2619b6596I0253J04396b21131r4022A1270J30836a70728A29742o3518
11744F6224h743A2635Q7509e1040k5742l5889D2685b1079o2877F8099N8150j7668
11732A08581f6810A12220d963B89158A34901b95030F1400c1928D04725G0976b28437
$$ y = [-264379, -56413, -103030, -85282, 22042, -25910, -103408, 108591, -33204, 257195, -62724, 11794, -194370, 10547, -36965, 97265, -144548, 134906, 176407, -16975, -472997, -392855, -13028, -170163, 166888, 129842, -72732, -92271, -255569, 111475, -185767, -250016, 39439, 70440, 111137, -121025, 223001, 80570, -134347, 61785, -439433, 139878, -172019, -297713, -96543, 40342, 4643, -215007, -320238, 87951, 49225, -171466, -120995, 28647, 152834, 112110, 28394, 33289, 20670, -26596, 90253, 194649, -221131, -315153, 11270, 142106, -170728, 129742, 66224, -8743, 12635, 100144, -51040, -76782, -112671, 42685, -21079, -83956, 68099, 126249, 108581, -66810, 112220, -4963, 289158, 134901, -295030, 61400, -31928, 404725, 70976, -228437]
11720I2261b0787A39793a30390H3010d5189M217B05998a67084G7036L2711a7021
11708g2428j05226J1690A03784b6421B6578N636K07227j01805d6691b383B06916
11696f6736j20138j60166H0378J14862D4028a48339j645A50081b41531B90529
11685A07423g1283A8167K573M6875h7645l2187C14757C583b91331J755G4136f8536
11672B35804c6473C55439b12141Q1502B7439M6750J62243a66143P1566B79187
11661F4900b19814j07826B6602b38828A15325a50991e8459i67I4815k8444K3784
11650I0155J21132d3265C84738h3577A13097k5693O1505b3864A55163k6626l0333
11639I8204a35656l13703A21850c88785a89241K9135c8400G5480g272k61631L8203
$$ y = [92261, -20787, 139793, -130390, 83010, -45189, -40972, 205998, -167084, 77036, 109747, -17021, -72428, -177654, -165964, 103784, -26421, 26578, 32214, 239441, 137636, -46691, -2383, 206916, -66736, -186874, -347040, 80378, 195240, 44028, -148339, -149984, 150081, -241531, 290529, 107423, -71283, 18167, 20740, 67615, -87645, -119832, 314757, 3583, -291331, -289576, 74136, -68536, 235804, -36473, 355439, -212141, -130639, 27439, 74189, 236432, -166143, -94577, 279187, 64900, -219814, -327640, 26602, -238828, 115325, -150991, -58459, -967, 94815, 66371, 90155, 211287, -43265, 384738, -83577, 113097, 87404, 148909, -23864, 155163, 128537, 98204, -135656, -449359, 121850, -388785, -189241, -160106, -38400, 75480, -7272, -268903, -230700]
11628b30700k6536A33531a9776A93284f3010D4607f612G8442R0992E6228b97401
11616c78401a63518E10558A30739b00222F105M1446J26904a5371k54581m2104
11606c12056f9984E3857a2630B99233I8445K97318b2214G0454a36929a1142B56610
11594e942j49176A73309K83415c7288p0496j21166F8574L8880J30794A10898J15305
11583B26203M5833I8974d7943k21784B13540J66033g0748I1679J85963C8094J38559
11572A76653g7461j48583i276A57787l914g393D4273j8771K28245A74K44139A6259
11559A20942c2992A06074B698e1867B28732b1622B30021A13730Q3205p8777J64437
11548B82595I5362j8287b5527A42176e629j27106B89514c95944h2199B40000n4447
$$ y = [-230700, -257236, 133531, -19776, 193284, -63010, 44607, -6612, 78442, 169434, 56228, -297401, -378401, -163518, 510558, 130739, -200222, 6105, 47551, 174455, -15371, -269952, -312056, -69984, 53857, -12630, 299233, 98445, 395763, -22214, 70454, -136929, -11142, 256610, -5942, -155118, 173309, 456724, -37288, -107784, -228950, 68574, 107454, 238248, 110898, 226203, 272036, 98974, -47943, -269727, 213540, 379573, -70748, 91679, 277642, 38094, 176653, -77461, -226044, -9276, 157787, 153873, -7393, 44273, 25502, 253747, 174, 244313, 16259, 120942, -32992, 106074, 2698, -51867, 228732, -21622, 230021, 113730, 196935, 118158, 282595, 95362, 77075, -25527, 142176, -5629, -132735, 289514, -395944, -82199, 240000, 185553]
11537A85553C0304K8469a78736A23786m0693c1539A29148M6356J5151a49027B91979
11525C08324a48284q2693A34814A7663K84505i5001C11197f3480j43283j31199
11515c37962H1268C3075K85501j20889I7849J70315b21208i6738H8234L13274
11505D01508D967K98609c7799B92125b86639f9246B76153A32791A3882K6720A5953
11493I9868L0302k3103D5898a1741m2307A38934a56779G6214g0474A41034o9339
11482G1695a61805A16385D6486a7910F5134L2457a26090G5501P6674E6410J01074
11471A57484b72769C84050J80874a08494k22806F7417J30966a46635a7299D97947
11460A51096N9286m8884f8006k93292B98855N3079H0277Q7108b43938a0942A06865
$$ y = [185553, 30304, 58773, -178736, 123786, 83093, -31539, 129148, 175504, 190655, -149027, 291979, 308324, -148284, -230977, 134814, 17663, 302168, -95001, 311197, -63480, -206763, -337962, 81268, 33075, 318576, 197687, 97849, 268164, -221208, -96738, 88234, 401508, 4967, 303576, -37799, 292125, -286639, -69246, 276153, 132791, 13882, 40602, 15953, 99868, 130170, 107067, 45898, -11741, -54048, 138934, -156779, 76214, -70474, 141034, 71695, -161805, 116385, 46486, -17910, 65134, 97591, -126090, 75501, 152175, 56410, 157484, -272769, 384050, 564924, -108494, -331300, 67417, 198383, -146635, -17299, 497947, 151096, 210382, 161498, -68006, -361298, 298855, 351934, 80277, 167385, -243938, -10942, 106865]
11448i017c848A17324k5194B3401k875a21666A04879j1467J30784G0545a93264
11436C79633a13261C9088a81471a6545F7303g1924A35528Q3737O3983J0595o5732
11425B28111r6647K09964a28601A19639B2715J76121a18170B27657e9071B1704
11414D8229A6276J2052c28108a29468M4625j29948A02574i9503A86352a38230
11403b06858Q1965B82926c22650A66354Q7790a75000C3720K2022J28742a85488
11392H3628a02201j74208G879O7246N2600a1337A74521b03629p588a77C8989b36485
11379C18792j11884h3391D1738j8396c65182J53841D5303O9044N8032b22157i3530
11367c71741e3023B4248a48921F4576a48687l8024f436G028d6627r018C77552
$$ y = [-9017, -3848, 117324, 92130, 23401, 20526, -121666, 104879, 93412, 224196, 70545, -193264, 379633, -113261, 39088, -181471, -16545, 67303, -71924, 135528, 219265, 283248, 293843, 228111, 131464, 341428, -128601, 119639, 22715, 198836, -118170, 227657, -59071, 21704, 48229, 16276, 28328, -328108, -129468, -84843, -214791, 102574, -99503, 186352, -138230, -206858, -124893, 282926, -322650, 166354, 254144, -175000, 33720, 55742, 184484, -185488, 83628, -102201, -276409, 7879, 75125, 127725, -11337, 174521, -203629, -211217, -177, 38989, -236485, 318792, 206908, -83391, 41738, 23342, -365182, -211341, 45303, 114347, 172379, -222157, -93530, -371741, -53023, 24248, -148921, 64576, -148687, -186711, -6436, 7028, -46627, -55645, 377552]
11355C84254a56086b0891A03678g6507C5794d50323G1858f561F437a5416o7212
11344h2628A90071b3921k23059B14933I0611h5746j05176A74621a02856o108A31913
11332B72120c46710D9614K54012c34841J34902i3463F071a45354C9452b26616
11321g2266n4388j38009L6925J06204K7645C47787j48203i3327A77823g1707m35803
11310e07510c9891k8933A63988c54928a35590H3268A1293g8527A27011d90678
11299b4737k31954A93298K2385A5398f7878m0972C4930J24370b16713A50598a223
11287a02186k55626G4878C1599h4418J798k60800a59586J2013d1203I2061a97630
11275a34508j04678J0535Q231E1747g8805q4816b6807r1580A26893a2674B9804
$$ y = [384254, -156086, -20891, 103678, -76507, 35794, -450323, 71858, -6561, 6437, -15416, -82628, 190071, -23921, -246980, 214933, 90611, -85746, -190922, 174621, -102856, -108964, 131913, 272120, -346710, 49614, 303626, -334841, -199939, -93463, 6071, -145354, 39452, -226616, -72266, -126654, -264663, -227738, -121534, -93889, 347787, 199584, -93327, 177823, -71707, -507510, -39891, -68824, 163988, -354928, -135590, 83268, 11293, -78527, 127011, -490678, -24737, -256691, 193298, 215683, 15398, -67878, -108850, 34930, 159300, -216713, 150598, -1223, -102186, -357812, 74878, 31599, -84418, -82620, -343420, -159586, -147573, -41203, 92061, -197630, -134508, -239186, -228651, -220420, 51747, -78805, -163621, -26807, -118387, 126893, -12674, 29804]
11263b0624r4868n8892H7894a1397d538j8698m6402q8244o4580P1080A33448M4012
11251A77460K60321B00552I6169j4738G001J26615C8530J92881D1890a55195g1574
11239a25391N1541A16617b80537R6235N3459C95497c20526d224H469K16969G0770
11227h7565K6530k65302a9297k71696E2104A1264P7289k8987g5654C23983A43492
11215g7577j10471C8676J64185a73791h2484E0360a83875p8104i1277l355r7177
11204a91809C7472e5343l88475K11357d099k14690m4684G3430a98138B6803J7509
11193D4312M22984b46750B1978J90147a04631A25458Q4960b30851a4335j40386
11183a54721R00k5314A2221g5314r8382o492K5627e5326j68204K7905A49740e2115
$$ y = [-20624, -115492, -174384, 87894, -11397, -4538, -23236, -69638, -157882, -222462, -151382, 133448, 177460, 437781, 200552, 96169, 81431, 7001, 133616, 38530, 231411, 41890, -155195, -71574, -125391, -73850, 116617, -280537, -184302, -130843, 395497, -320526, -4224, 8469, 225438, 70770, -87565, -61035, -326337, -19297, -290993, 52104, 11264, 88553, 59566, -75654, 323983, 143492, -77577, -188048, 38676, 202861, -173791, -82484, 50360, -183875, -261979, -91277, -94632, -191809, 37472, -55343, -443818, -232461, -4099, -218789, -263473, 73430, -198138, 26803, 44312, 467296, -246750, 21978, 212125, -104631, 125458, 210418, -230851, -14335, -154721, -153821, -179135, 12221, -75314, -173696, -180188, -154561, -55326, -223530, -195625, 149740, -52115]
11170C9804e2942B00781F287g6912P813D9719c5170j36114A03172D9211j5171
11159C4040h2644F6113a05865j10945A02821a77825A04146m1642e08227b2859
11148c32462b5696A39094a74212A07573A275J62191a58946E303c07646A2322a14491
11136A81778A3573c00538C6014a3377p6828C6382j0618J11264L7035m5348c14417
11124c1607m8880D7038a47703L7d1420B95195j3854d34182a60799B74542b2257
11112d560E8900b94474C33459f7292C7702R7890a65396A43589m8910M8436K67567
11101D10682A56592n535J66655A17886P1974G8194L02131b6039j44310P7606a7955
11089H6214M78663f8695B82949i691A69172D605Q8668M32460D4110M34409A13302
$$ y = [39804, -52942, 200781, 6287, -76912, -69099, 49719, -35170, -171284, 103172, 49211, 34040, -82644, 66113, -105865, -216810, 102821, -177825, 104146, 62504, -508227, -22859, -332462, -25696, 139094, -174212, 107573, 1275, 163466, -158946, 5303, -307646, 12322, -114491, 181778, 13573, -300538, 36014, -13377, -90205, 36382, 25764, 137028, 174063, 128715, -314417, -31607, -80487, 47038, -147703, -147666, -41420, 295195, 281341, -434182, -160799, 274542, -22257, -4560, 58900, -294474, 333459, -67292, 37702, 135592, -165396, 143589, 94679, 143115, 410682, 156592, 151057, 317712, 117886, 189860, 78194, 380325, -26039, -170349, -92743, -17955, 86214, 564877, -68695, 282949, -9691, 169172, 4605, 93273, 525733, 44110, 478519, 113302]
11077E32723D9676J35657d4907D40772A63670K33112K4210j77618J5071O9580
11067C28025J8609P5483J57254j79737j39890q4439K89496L8781j26611J56317
11057E33288j14951j57842n7497L42678J3942n9472L85504k28899P8236j24935
11047F10052j79481K14497C09523M56377M7676J17351k56597J16605J06814o8381
11037H29368j66031j40505J90028k72687L43903j81283o1309J91715J212j54896
11027E79515K52568C21318K01912K44216j74153n3748l8150L12453J2469p6253
11017G50064P2514C98571K14381j91021l6898j08085L06947B08441L51928j49503
11007D10866o3375K04342M767B68572O8039K34545J07016j42849j35329K31606
$$ y = [532723, 49676, 185333, -44907, 440772, 163670, 396782, 420992, 243374, 258445, 328025, 346634, 422117, 579371, 399634, 259744, 175305, 464801, 503582, 376971, 533288, 418337, 260495, 202998, 545676, 559618, 500146, 885650, 656751, 734987, 610052, 430571, 645068, 309523, 765900, 813576, 930927, 674330, 790935, 897749, 829368, 663337, 522832, 712860, 440173, 784076, 602793, 541484, 733199, 734411, 579515, 832083, 321318, 523230, 767446, 593293, 539545, 501395, 813848, 826317, 750064, 822578, 398571, 612952, 421931, 385033, 276948, 583895, 208441, 560369, 410866, 347491, 551833, 556600, 268572, 336611, 571156, 678172, 535323, 399994, 631600]
10997F31600k14103N9722J83392B33150O76743N8395m18158K94664R0814K1018
10987I56626m32888K18369k1345Q2949k33448J00175N080L9748K07180O9509j47386
10976H44569M2411L79968l56415N80118j87972M00225L49918Q8469j92954N42304
10966B490641n6341N13854l69747j59825J37969l37387k15636l23185k02882j50578
10956A326883r250P9926j67279K91527k82784L39994m00640j21066K42053k17943
10946A081421k45310L91518m89122k9604k73884K0578n6988j05207k4167n5400
10936B13835P1139F5989K45478A40809c8215B68273q7684p5046B017J68498J35064
10925C05579C5534J4494d15193a01536d1498j65450R5684A01980f6700J3496I2235
$$ y = [631600, 417497, 477219, 660611, 233150, 909893, 968288, 550130, 844794, 935608, 956626, 523738, 742107, 720762, 803711, 570263, 670438, 675518, 715266, 922446, 991955, 844569, 886980, 1266948, 910533, 1490651, 1302679, 1702904, 2052822, 2141291, 1948337, 2490641, 2434300, 2948154, 2578407, 2418582, 2556551, 2219164, 2003528, 1680343, 1477461, 1326883, 1317633, 1397559, 1230280, 1521807, 1239023, 1579017, 1178377, 1057311, 1299364, 1081421, 836111, 1227629, 738507, 708903, 435019, 455597, 398609, 293402, 269235, 213835, 284974, 65989, 311467, 140809, -38215, 268273, 180589, 105543, 2017, 170515, 305579, 35534, 50028, -415193, -101536, -41498, -206948, -111264, 101980, -66700, -53204, 92235]
10913a68484D83115k05981H206a23987c074j14599C2887b52390J06009L6188d9054
10901b84095B38092b65574J24898A53779a36195d89l66503a9686k18841b5491
10890G1364C2597c39131H231b1104C99764A8710K76109n1009d6578k84180i4580
10878D2310c72844h4754j38110G5260b30729H2002c33165J27620g3617a3266l60402
10867c73668J47295H1488a24242H9751K60909G6586b8678C1457a42836N8739D287
10855B0223H285b02094F7302a62817M5387G0902a09595E5415K0442j5525a09303
10843a59376A37074n738a92979c5048r883o8214B54735a5598q6270K4283H9456
10831A83736e9799B30936c6923J4425C00786q8608I0931B4665h9988F3001D354
$$ y = [-168484, 483115, 277134, 8206, -123987, -3074, -117673, 32887, -252390, -146381, -110193, -49054, -284095, 238092, -265574, -140676, 153779, -136195, -489, -366992, -19686, -238527, -25491, 71364, 32597, -339131, 8231, -21104, 399764, 18710, 294819, 243810, -46578, -330758, -94580, 42310, -372844, -84754, -222864, 75260, -230729, 82002, -333165, -205545, -73617, -13266, -373668, -226373, 81488, -124242, 89751, 350660, 76586, -28678, 31457, -142836, -84097, 4287, 20223, 8285, -202094, 67302, -162817, -117430, 70902, -109595, 55415, 75857, 60332, -109303, -159376, 137074, 131336, -192979, -35048, -44931, -113145, 254735, -15598, -101868, -77585, 89456, 183736, -59799, 230936, -36923, -22498, 300786, 212178, 90931, 24665, -89988, 63001, 4354]
10819a17540d7883j96491j9604i045j18185n0409D8671b99300C3884M4760j2177
10808F6467e0323A73260b448A50620a56771I4963h6392B90976b88663a40136k5431
10797a65567M7145j41291D7288J29352k3492O2554b435n7903a7336p3147j86582
10786b77065J23530j6787k21740a5493l53409a46367M5351L4790A87532N6862
10776B44394I6981l5329b23126B74507b4019o9290A05317a98548M7119d5710C7661
10764c75089B42033a72625B10802b74455J11524l7921h7005H7325k3794b59659
10753C27628A4536b1387A5056M1759a35732A1798b57808N2778B80250d8338j36288
10742a84626J9247e405A42037D3396K51056C8853R435B2228b35863G9289J44530
$$ y = [-117540, -47883, -244374, -263978, -9045, -127230, -177639, 48671, -299300, 33884, 78644, 66467, -50323, 173260, -2448, 150620, -156771, 94963, -86392, 290976, -288663, -140136, -165567, -118422, -259713, 47288, 176640, 153148, 215702, -2435, -60338, -17336, -90483, -277065, -153535, -170322, -392062, -15493, -368902, -146367, -101016, -66226, 187532, 244394, 96981, 61652, -223126, 274507, -24019, -93309, 105317, -198548, -151429, -45710, 37661, -375089, 242033, -172625, 210802, -274455, -162931, -200852, -87005, 87325, 63531, -259659, 327628, 14536, -21387, 15056, 56815, -135732, 11798, -257808, -205030, 280250, -48338, -184626, -165379, -5405, 142037, 43396, 294452, 38853, 48288, 22228, -235863, 79289, 223819]
10731B23819J27949G2449K9748P5727b62984a5024p3394j33395Q8050A7752h9378
10719B73098B6740P1411J869L941b54221N5504g7210n260A47886a68271K3450
10708a44821H2171j5973J67493a15433l7325B73450c48921G9469g4796B5936b62729
10696a4254j91101A13800a40967q45P0778b2865n7060B39543D9148L043a16047
10684a15158H4405k3693a60030j79524P4367N8468A44475a78416o7655h2609C6844
10672a439r2522j05933E2271M9948O7322b0099A20030b18662i4745F9867b84992
10660A95846f5082G8348a1029j24520K1625B5336c3429E1525i8954p6233P3442
10649a01745b3675k51410A5763o114J4654f9222l8275E9889M4026M1571a44462
$$ y = [223819, 351768, 72449, 102197, 177924, -262984, -15024, -88418, -221813, -133763, 17752, -89378, 273098, 26740, 98151, 100020, 103961, -254221, -198717, -77210, -82470, 147886, -168271, -144821, 82171, 66198, 233691, -115433, -152758, 273450, -348921, 79469, -74796, 25936, -262729, -14254, -205355, 113800, -140967, -141812, -71034, -22865, -79925, 239543, 49148, 52191, -116047, -115158, 84405, 60712, -160030, -339554, -265187, -206719, 144475, -178416, -246071, -82609, 36844, -1439, -93961, -199894, 52271, 102219, 169541, -20099, 120030, -218662, -94745, 69867, -284992, 195846, -65082, 78348, -11029, -135549, -113924, 25336, -33429, 51525, -98954, -175187, -101745, -23675, -275085, 15763, 9649, 24303, -69222, -107497, 59889, 103915, 145486, -144462]
10637a34157m24402E8500d4089A5501a81685B5712g0911j66511B35608A04486
10626b37431R8251A22000R2218a51803q3861A47138D9722h4190b6800q4454o4293
10615a75547a7358B15342a56377I5050b10326h9957J9988L4292b143l06948I865
10603h2154J1291k30886k3027B25995m1950b42920K7B29643E8383g9398m8661
10592a28059F8750a33939r3632p4876J20302C9789a11409A2715a56705O2586C39211
10580g6992G7428a55036M0292j02686H2862d46706a79328F5063j7040b88509p3678
10569c62187A8990g8280j13343A6569a53513D74751k31791a04374A91586h3139
10558a9149G5880J54432a57219A6060a95388j18659H6003K8690b76544B30588
$$ y = [-134157, -558559, 58500, -44089, 15501, -181685, 25712, -70911, -237422, 235608, 104486, -237431, -139180, 122000, 214218, -151803, -235664, 147138, 49722, -84190, -26800, -111254, -175547, -17358, 215342, -156377, 95050, -210326, -89957, -69969, -35677, -2143, -309091, 9865, -82154, -70863, -301749, -324776, 225995, 184045, -242920, -242893, 229643, 58383, -79398, -128059, 68750, -133939, -227571, -302447, -182145, 39789, -111409, 12715, -156705, -94119, 339211, -76992, 77428, -155036, -114744, -217430, 82862, -446706, -179328, 65063, 48023, -288509, -362187, 18990, -78280, -191623, 16569, -153513, 474751, 242960, -104374, 191586, -83139, -19149, 75880, 230312, -157219, 16060, -195388, -314047, 86003, 114693, -276544, 230588]
10547A62185b36685F0334j6712L769j3839J7597Q2207j4968b96354D9838J93110
10536B42948c4080J4259A4229i4804C17480e3285r2366m20077i0669Q700A02138
10524B1711J83864a76394G4095c58395f0206o4757a934A20643i812H2685b5558
10512H6753b6923j9649o315m289m4804A88385c04053C95779I7828c449B5020e2948
10499a91184H0264L0538a60612m1436C04683a79225D9659b00008G3390O183a27613
10487C010a49480O3478G5624C2423h2886k1546j41301D9854c8999r8245I6431
10475c0571A25022b6120E37047k8861k22873J5975M1710j46879m7654b4365B02815
10463c9269B50407c05992I2801i2241A91127c42123A44804l7835c39718a45633
$$ y = [162185, -236685, 60334, 43622, 47391, 33552, 51149, 133356, 118388, -296354, 49838, 242948, -34080, -19821, 14229, -94804, 317480, -53285, -145651, -565728, -90669, -81969, 102138, 21711, 205575, -176394, 74095, -358395, -60206, -124963, -1934, 120643, -9812, 82685, -25558, 86753, -26923, -46572, -52887, -57176, -101980, 188385, -304053, 395779, 97828, -3449, 25020, -52948, -191184, 80264, 110802, -160612, -202048, 304683, -179225, 49659, -200008, 73390, 79573, -127613, 3010, -149480, -86002, 75624, 32423, -82886, -104432, -245733, 49854, -38999, -137244, 96431, -30571, 125022, -26120, 537047, 508186, 285313, 301288, 342998, 196119, 148465, -24365, 202815, -39269, 250407, -305992, 92801, -92241, 191127, -342123, 144804, 106969, -339718, -145633]
10452G6290b05204R4855A79008N347i9493q8535f2942j31801K4147D681a07079
10440c37262h1975a6362C34242a38711A86689b56698A34029n7574k3224b44485
10429A04687Q3360E54b48362i7558J4656d1160F1407j3450b37654N5401O7120
10418a15133e4608K2860k30055A75443a03830J4539E8487k6622j3663a54370b4289
10406A45928J28549a60541A98952b04180A25193A308e9261B6795J41190h1691
10395A45492M3966a0599G9628f2659l3896C67272q4554A10584L8081a00020E9005
10383A18305a23130H8155j2834a26874H3943J32976j6236r2029Q8395q0456L51124
10372D67717A04300K3257J70816j6347j17657L06788F0370a11259A60643L60507
$$ y = [76290, -205204, -110349, 179008, 184355, -99493, -188028, -62942, -194743, -170596, 4681, -107079, -337262, -81975, -16362, 334242, -138711, 186689, -256698, 134029, 76455, 53231, -244485, 104687, 188047, 554, -248362, -97558, -82902, -41160, 61407, 47957, -237654, -182253, -115133, -54608, -31748, -261803, 175443, -103830, -89291, 58487, 31865, 18202, -154370, -24289, 145928, 274477, -160541, 198952, -204180, 125193, 1308, -59261, 26795, 167985, -81691, 145492, 189458, -10599, 79628, -62659, -96555, 367272, 282718, 110584, 148665, -100020, 59005, 118305, -123130, 88155, 75321, -126874, 83943, 216919, 200683, 108654, 197049, 116593, 467717, 104300, 127557, 298373, 282026, 164369, 471157, 60370, -111259, 160643, 521150]
10362E21150k04899p5608K16596j61488D7038N7008K00574H1211K21832A11064
10351C50758A30822D5421M61537M1248j3589J21994j22290B11538Q1073a1942
10340D35162L16857C65078o7314L02035a01660B3942O2966H064P9996L37532E1061
10328B46089L261J02325g6916D83640A56284M0457G8259K83728b1984A54898l8568
10317A16330K25750f2064l57157J57867D6909J17648j4697P4496q17b1747C5327
10305b432B20762m3275h5025G0361A4186a61983C18960c0195k13443O4756b4085
10293a60166G7150h1203f514q4905C41683b8996A66763q0122j319K079J9454e4685
10280b88518g1658j43921f6607j72124B50305g0397m4883k03534F5946K9612o878
$$ y = [521150, 316251, 240643, 457239, 295751, 47038, 104046, 304620, 81211, 303043, 111064, 350758, 130822, 45421, 506958, 548206, 534617, 656611, 534321, 211538, 292611, -11942, 435162, 752019, 365078, 297764, 599799, -101660, 23942, 86908, 8064, 88060, 425592, 51061, 246089, 249350, 351675, -76916, 483640, 156284, 196741, 78259, 361987, -21984, 154898, 116330, 342080, -62064, -419221, -261354, 46909, 164557, 149860, 224356, 223539, -21747, 35327, -2432, 220762, 177487, -85025, 70361, 14186, -161983, 318960, -30195, -243638, -178882, -24085, -160166, 77150, -81203, -6514, -91419, 341683, -28996, 166763, 86641, 85322, 87401, 106855, -54685, -288518, -71658, -215579, -66607, -238731, 250305, -70397, -115280, -318814, 65946, 95558, 88680]
10269H8680A481K78906a30968A38310m0343l6072C806i5692r1439A2628e93749
10257f4206k8219j8088F1708K470J57141G5024C6734L10667G6911J20670q9439
10246A08142l7151R311g2008A84487b0851p1061L1451B60554p5957f5369k70653
10235c36022e7810g073H5003b96319g5433A1478a11295k2895j26086a28877E3505
10223a27407E9785a13500q4625b7759J3502B47483b64354c0242B06253c6220n12870
10212e49090a4137c528j28417f5823D09767j48164a37461d3785k00034b7462B24216
10200e1550b4826k05914a5002D7054J28596h2647k01719e376m4341n7176e627
10188a2121o921B59084E9698a50407K7639d8625k15963C3408a78068q9983c7959
$$ y = [88680, 1481, 280387, -130968, 138310, 97967, 61895, 3806, -95692, -187131, 12628, -593749, -64206, -92425, -110513, 61708, 64178, 221319, 75024, 36734, 347401, 76911, 197581, 108142, 70991, 80302, -72008, 184487, -20851, -91912, -60461, 260554, 184597, -65369, -336022, -57810, -7073, 85003, -296319, -75433, 11478, -111295, -134190, -260276, -128877, 53505, -127407, 59785, -113500, -198125, -27759, -14257, 247483, -264354, -30242, 206253, -36220, -549090, -14137, -3528, -131945, -65823, 409767, 261603, -137461, -43785, -243819, -27462, 224216, -51550, -24826, -230740, -15002, 47054, 175650, -82647, -284366, -5376, -49717, -106893, -5627, -12121, -19042, 259084, 59698, -150407, -122768, -48625, -264588, 33408, -178068, -268051, -37959]
10176f0684J0369n9704M028r2053E6937c6549J6894k13006j1506p004J15641j35681
10164b71211G6786b70967L8624J8556b9331o6958M5920G2626e3744B0949a23509
10152B77529a12607D5718c8194A8512a0928r4122j23826j85153A14138n1452e9873
10140d00053a67095C7108J58226b30795J2764a5175j97496B21347a41103D830
10129a28726A87302l2938J39363D2364c24268B21868b39144f5546l79687a15244
10118a56140E2471K05797c43683e5939D2496a08863k70913b3449o2626j5792A18157
10106B15779g5596H2506c73864a70756B90182c42508d4847j90920e5800E9900
10095c2801C72507A76071a08827j36082k13457a21359B10641g3523j21423C8164
$$ y = [-60684, -50315, -110019, -105991, -198044, 56937, -36549, -19655, -232661, -244167, -251171, -135530, -271211, 76786, -270967, -232343, -213787, -29331, -96289, -50369, 72626, -53744, 20949, -123509, 277529, -112607, 45718, -38194, 18512, -10928, -105050, -228876, -414029, 114138, 62686, -59873, -400053, -167095, 37108, 195334, -230795, -218031, -15175, -212671, 221347, -141103, 4830, -128726, 187302, 154364, 293727, 42364, -324268, 221868, -239144, -65546, -445233, -115244, -156140, 52471, 258268, -343683, -55939, 42496, -108863, -379776, -23449, -86075, -101867, 118157, 215779, -75596, 82506, -373864, -170756, 290182, -342508, -44847, -235767, -55800, 59900, -32801, 372507, 176071, -108827, -244909, -458366, -121359, 210641, -73523, -194946, 38164]
10084c4280C3233J04005a6925p9236n054C46687B0922h2998j63023n0004j4820
10073c10845a22488A3061K03800b6722n148j5538C9409O1975a66149A02475a49857
10061c14633C5444a57334Q327B03934b46405A97339L628a75137d623k95987i6124
10049C1119P185K42551c36568K3213h4195A29231A4063g3308j25512B08566a67970
10037c24376A08222J96611D2884a09674H4699b58410g2549p8642g5265A33256
10026b7744r0626A08567c38235c4088A84299a31668j545o5523h1136m8275A34005
10014e3669k19948G9618a33429e0823A41224j1628a98693B15575d05329a30138
10003E5510e4632k6167k203d0513j71460b4713r3827C0057b3733A1809c3726k28016
$$ y = [-34280, 33233, 137238, -16925, -96161, -101215, 346687, 20922, -82998, -246021, -296025, -310845, -122488, 13061, 216861, -26722, -31870, -47408, 39409, 101384, -166149, 102475, -149857, -314633, 35444, -157334, -149007, 203934, -246405, 197339, 200967, -175137, -4623, -300610, -96124, 31119, 38304, 280855, -336568, -313355, -84195, 129231, 14063, -73308, -198820, 208566, -167970, -324376, 108222, 304833, 42884, -109674, 84699, -258410, -72549, -151191, -75265, 133256, -27744, -118370, 108567, -338235, -34088, 184299, -131668, -133213, -198736, -81136, -129411, 134005, -53669, -273617, 79618, -133429, -50823, 141224, 129596, -198693, 215575, -405329, -130138, 55510, -54632, -80799, -83002, -40513, -211973, -24713, -118540, 30057, -23733, 11809, -33726, -261742]
9991b61742B0119L8072c72039H9384C576b53726k7479f9853k3653G7399O2492
9980A39891B3600J0375b65419a21737M959K1598j11960D8714a41248B60718A20184
9968c96164A13569g5624k3534k67945h9152j77870h2057H9807d01207e1211a4003
9956c75318A75721a28030J6501c5663M535l6437n280p4115N9560j06671E7553
9944A29355a96006i2337k1317B29055a74317A18860c7435l46964D3542J2546d5437
9932g6655k55464A67489d64571a75941j22770B67183D7439J16346b02881o7266
9922b70147l440j20633J39039Q1515A37074a15410j78470J40031J7872K6685F4702
9910a21432k22610P4505f4055A21508b47417d3506B8294J40550J40160r5537a61658
$$ y = [-261742, 20119, 58191, -372039, 89384, 3576, -253726, -281205, -69853, -93506, 77399, 139891, 23600, 33975, -265419, -121737, -116778, -95180, -207140, 48714, -141248, 260718, 120184, -396164, 113569, -75624, -99158, -367103, -89152, -267022, -82057, 89807, -401207, -51211, -14003, -375318, 175721, -128030, -111529, -35663, -31128, -67565, -72845, -146960, -87400, -194071, 57553, 129355, -196006, -92337, -113654, 229055, -174317, 118860, -37435, -384399, 43542, 56088, -45437, -76655, -332119, 167489, -464571, -175941, -298711, 267183, 47439, 163785, -202881, -270147, -273587, -394220, -255181, -173666, 137074, -115410, -293880, -153849, -135977, -109292, 64702, -121432, -344042, -269537, -64055, 121508, -247417, -43506, 28294, 168844, 309004, 213467, -161658]
9898B42474a49028A63685a24157A11269C4667c7609k38371B90097b27169j93716
9888d20885e2457k5185l2827M2557R374j19954k9925e8264j87650O129h9139k84039
9876c73178A15532c0884j71877C10902k8967b30498A70803a57526A03293d2345
9865A13551a89206B981L3357O8993b67557R1484A68939e0989B4029J22149e1642
9853a68401j93011b4804l3780A79655a43978A24873d49571a40200A03242a07391
9842b83410N1292D0403i9012j00227A31942c88792b5375A2449d7298j677j06124
9831a55099A80330A493a83594c6179n9274M819H235a79424D978a23322m1726q8366
9819b53414R2141H9845M047n876k7037d36388H4988h1820A8066K42423a62849
$$ y = [242474, -149028, 163685, -124157, 111269, 34667, -37609, -275980, 290097, -227169, -420885, -52457, -77642, -110469, -67912, -58538, -178492, -208417, -58264, -245914, -239785, -89139, -373178, 115532, -30884, -202761, 310902, 281935, -230498, 170803, -157526, 103293, -42345, 113551, -189206, 2981, 36338, 105331, -267557, -176073, 168939, -50989, 24029, 146178, -51642, -168401, -361412, -24804, -58584, 179655, -143978, 124873, -449571, -140200, 103242, -107391, -283410, -232118, 40403, -99012, -199239, 131942, -388792, -25375, 12449, -47298, -48975, -155099, 180330, 1493, -183594, -36179, -95453, -90634, 8235, -179424, 4978, -123322, -165048, -253414, -161273, 89845, 93892, 88016, 60979, -436388, 84988, -81820, 18066, 260489, -162849]
9807b44512A52754B0671a01762j33165J4737B76998c52370a60754j90165f3585
9796b08019O6588A53208g6703l0482B52191b68529J18396f5933A44663f9864J0086
9785e9778b8960B1720b39720j21338a15766j96291C9174A3856c18642Q4177D9325
9773b14139h1364k1920B89627a93173P7556E4614i6290K1834A69482a00158A27260
9761e2881k7993G786b54776A27981i6663A17935M0291b18362A77861n4650d09425
9749B89381f4652J8759B349a03263L3383L0110B97892b26815A61384a52732k0428
9738a73160C9807c25615Q4201j12529f9233L464a5522C9915c89967A44688a22469
9726c5522j08244j29534a12655q5990R1034A83511d4006n916A7895K63287c9235
$$ y = [-244512, 152754, 20671, -101762, -234927, -220190, 276998, -352370, -160754, -350919, -63585, -208019, -141431, 153208, -76703, -107185, 252191, -268529, -150133, -65933, 144663, -69864, -59778, -28960, 21720, -239720, -361058, -115766, -312057, 39174, 13856, -318642, -234465, 49325, -214139, -81364, -103284, 289627, -193173, -115617, 54614, -96290, -74456, 169482, -100158, 127260, -52881, -80874, 7786, -254776, 127981, -96663, 117935, 158226, -218362, 177861, 123211, -409425, 289381, -64652, -45893, 2349, -103263, -69880, -39770, 297892, -226815, 161384, -152732, -173160, 39807, -325615, -241414, -353943, -69233, -65769, -15522, 39915, -389967, 144688, -122469, -35522, -143766, -273300, -112655, -198645, -107611, 183511, -44006, -49922, 17895, 281182, -39235]
9714c82885J19079a9063l5392j88382J0133d8472k74603A53747a24419B14167
9703b40697b0367l7372A86892q4775a53551B38736e3754k66808i6008B7557a92495
9691d29485a27428a5054G2694b31603j28588a72556A45993F724b73027o9154H9552
9679d59819a38027M3128n2395A84135d6697k1610l1554j24970C2945N2071O3441
9668A48457b04097e7310j54447h5328C19139E2505N8223a64102c7758o5205q0514
9657a83477k9583d5447B59629a9568A06161f944A76580K8945a27467B51934a76096
9645b2989k3724D3105i6629A30531a2156A43026b52384a06929B95202d2127j61027
9634b03154M9164O5391B5298b3513k43522P174R4248A87435a45947P2102m4675
$$ y = [-382885, -263806, -19063, -54455, -242837, -232704, -48472, -323075, 153747, -124419, 214167, -240697, -20367, -57739, 186892, 102117, -153551, 238736, -53754, -320562, -96008, 27557, -192495, -429485, -127428, -15054, 72694, -231603, -360191, -172556, 145993, 6724, -273027, -342181, 89552, -459819, -138027, -94899, -147294, 184135, -46697, -68307, -99861, -224831, 32945, 85016, 148457, -204097, -57310, -211757, -85328, 319139, 52505, 110728, -164102, -37758, -102963, -183477, -213060, -45447, 259629, -19568, 106161, -6944, 176580, 205525, -127467, 251934, -176096, -22989, -46713, 43105, -96629, 130531, -12156, 143026, -252384, -106929, 295202, -42127, -203154, -153990, -88599, 25298, -23513, -267035, -259861, -165613, 187435, -145947, -73845, -118520]
9623a18520m07694d070k19143R2936F2880a34662m5888h5270n1290D0285b08708
9611f8218o810F2277b3067D0023b9285j61865B34010J92807D4980a02893j9523
9600a22416e7262j35938A28941a27194c1410H2473a79455F3387a55787K9341k0051
9589a46497a0471A1776J11639f09760A02075a622k16193C5880d76644H961a90966
9577d49647B10803k8537B9579f95A96613c38896J18181A30696l3536C2934K52534
9566B85468A4171b70763A67509c32028A2216c24103g1513k58095g7040E6913P5991
9555A32904f5269k1274m8293j3786E9089c4634C01713A37828b89069G954b9741
9543C1344a12681Q764j00145c1547j92347b6785j19861j25961a12355j47765O5689
$$ y = [-118520, -526214, -4070, -223213, -130277, 62880, -134662, -180550, -85270, -136560, 40285, -208708, -68218, -75028, 62277, -23067, 40023, -29285, -191150, 234010, 426817, 44980, -102893, -122416, -57262, -193200, 128941, -127194, -31410, 82473, -179455, 63387, -155787, -126446, -146497, -10471, 11776, 123415, -609760, 102075, -1622, -217815, 35880, -476644, 8961, -190966, -449647, 210803, 182266, 29579, -695, 196613, -338896, -220715, 130696, 97160, 32934, 285468, 14171, -270763, 167509, -332028, 12216, -324103, -71513, -329608, -77040, 56913, 132904, -65269, -86543, -134836, -148622, 59089, -34634, 301713, 137828, -289069, 7954, -29741, 31344, -112681, -103917, -204062, -31547, -223894, -26785, -146646, -272607, -112355, -260120, -194431]
9532a94431N4035r2475n5115f3888D226i8126l3385j35936P1210m2545r9950a26529
9519c70276n0510a83090F0873K18248a5506m0483a6150j78429c6453B5415a9999
9507A58661f2454A78007o0104Q3710a82425P9384D5104L3284a24026j60500a1232
9495b06684A3811a30176F4996h3369C89358E8801h2883j6210l8749K4736R323
9484a03783B2779D973R5118b25259N103c8955A50235a05389j02008A27909F76
9472a22620m8619J9106n1332B49213B8578K14391G7643b80205D8118Q3886i4859
9460A31842R4633a03931j23160D31617a79487P6207j83375b0604p5262j41396
9450b37262C56451b95494P7239A09519b84756D8737f4262o5724Q261A59380a68981
$$ y = [-194431, -140396, -232871, -287986, -63888, 4226, -98126, -131511, -267447, -196237, -238782, -338732, -126529, -370276, -420786, -183090, 60873, 279121, -15506, -55989, -16150, -194579, -36453, 25415, -19999, 158661, -62454, 178007, 117903, 201613, -182425, -103041, 45104, 78388, -124026, -284526, -11232, -206684, 13811, -130176, 64996, -83369, 389358, 58801, -82883, -99093, -137842, -113106, -103783, 22779, 4973, 100091, -225259, -220156, -38955, 150235, -105389, -207397, 127909, 676, -122620, -171239, -152133, -203465, 249213, 28578, 242969, 77643, -280205, 48118, 132004, -94859, 131842, 226475, -103931, -227091, 431617, -179487, -103280, -286655, -20604, -95866, -237262, 356451, -295494, -218255, 109519, -284756, 48737, -64262, -129986, -121725, 159380, -168981]
9438A86929a58853a0775r3420r0717M4873n1051K9998A71651f0137l54444J28495
9427b86086Q0293h4892n5729c6606o3887B1006c03021F4672b39482j12892a06959
9415b14857A17968J09969k2930A9233K41784I4003J25374I2943o210i5386A45668
9403b65618a13477o1195j8327e6266I9953a6844j53551A666a79933c0491A24050
9391A19834E045Q722J42598n0065a61541l14096b4659i400H5794g4563D9678c2699
9378B87710a67088j40347j35447a88801r1232D8617a29989A60748E2385k3615
9368B8770h7340j47888Q5433p502E6449d1156o1375j57417p517A0508M0074J14662
9356A65244G669b56964q3600k5129B5968O9930b97992J28133B6559A0015a70008
$$ y = [186929, -158853, -10775, -104195, -194912, -150039, -201090, -171092, 171651, -60137, -414581, -286086, -205793, -84892, -140621, -36606, -100493, 21006, -303021, 64672, -239482, -352374, -106959, -214857, 117968, 227937, 205007, 19233, 261017, 94003, 219377, 92943, 86733, -95386, 145668, -265618, -113477, -174672, -192999, -56266, 99953, -16844, -170395, 1666, -179933, -30491, 124050, 119834, 5045, 13767, 156365, 106300, -161541, -475637, -24659, -9400, 85794, -74563, 49678, -32699, 287710, -167088, -307435, -442882, -188801, -280033, 48617, -129989, 160748, 52385, 28770, -87340, -235228, -149795, -157297, 56449, -41156, -102531, -259948, -267465, 10508, 50582, 165244, 7669, -256964, -340564, -365693, 25968, 95898, -297992, -169859, 26559, 10015, -170008]
9344e6348k5955D8138a90098d9487B01436J36549G7204J7954i4761A7905M0614
9333E8519c2982k78124P1654g1869C372c62858a54218H7317d6522A44042b54738
9321B61641a25717p766d9337A62004b28442D8239b05D4262d4078C51487h0172
9309H3839l2811J51710B233a24650j46702C2034a54003C5937b028j09919A15397
9297f8665c0465q3112e3677h696F0075A1885e5282B5545P947J25473C8290P1317
9285A09607e15435F4486i2295A31419b72744j14987J14439A07387c87060c8300
9274G987a20045N670p1364g6537j32566c5334F3827b74221C36c5871j75568B49790
9261B52414a6128B49429b00334i6883m7479n0656A02045b47356J20619q5056d9555
$$ y = [-56348, -82303, 48138, -190098, -49487, 201436, 337985, 77204, 95158, -94761, 17905, 58519, -32982, -311106, -239452, -71869, 3372, -362858, -154218, 87317, -46522, 144042, -254738, 261641, -125717, -133483, -49337, 162004, -228442, 48239, -205, 44262, -44078, 351487, -80172, 83839, 51028, 202738, 2233, -124650, -271352, 32034, -154003, 35937, -2028, -111947, 115397, -68665, -30465, -113577, -53677, -8696, 60075, 11885, -55282, 25545, 33492, 158965, 38290, 109607, -515435, 64486, -92295, 131419, -272744, -387731, -273292, 107387, -387060, -38300, 7987, -120045, -114375, -185739, -76537, -209103, -35334, 63827, -274221, 336, -35871, -211439, 249790, 252414, -16128, 249429, -200334, -96883, -144362, -195018, 102045, -247356, -126737, -211793, -49555]
9249b14413B01919c15055k6763D8205c36338i7902r8445D7348J48492K42980k06716
9238B32104a48514L2132j58932A65155a84106A40125a58399D221J19399i2347
9227h0106p4477c966k25332D2120d8684A94989b08643A2691g093l97678G7022
9215a01176A13714b40981o6815h0820l7043c9861H3227c29241e8748K2602B4355
9203a54740D1096J14047d1038E2836a69221f2454R17n7342k18749q818J25558
9192b20888j05452a1426A1129a11630n34684c9624A4121e976a705j91317K1222
9181a71800k8092H7714J16929a39071M0794B9066b5959l6914K5491k19323a10164
9169A48881c68558J58167o6765h2557j14172M5082k95l5832k12180R5561A08331
$$ y = [-214413, 201919, -315055, -341818, 48205, -336338, -97902, -196347, 47348, 195840, 438820, 232104, -148514, -116382, -275314, 165155, -184106, 140125, -158399, 4221, 123620, -92347, -80106, -154583, -3966, -229298, 42120, -48684, 194989, -208643, 12691, -7093, -404771, 77022, -101176, 113714, -240981, -307796, -80820, -117863, -39861, 83227, -329241, -58748, -36146, 24355, -154740, 41096, 155143, -41038, 52836, -169221, -62454, -61537, -118879, -337628, -346446, -220888, -326340, -11426, 11129, -111630, -646314, -39624, 14121, -5976, -1705, -193022, -171800, -199892, 87714, 204643, -139071, -98277, 29066, -25959, -62873, -37382, -256705, -110164, 148881, -368558, -210391, -277156, -82557, -196729, -151647, -151942, -187774, -399954, -304393, 108331]
9157i0569k15012g6434j60870G9206a13760L2428J2117A60337e2345A60033k4864
9146A35169J4971p4306b46877F8053f9750k84419H4636b69682H4876b23104a10695
9134a12826L9085G6861i1845q021H32L2059j6020J19905g5766a6487q4171B18648
9121D009e255j07610l1013B24020a61972e5646C3635M7778a54510k0088A12024
9109I7849O7592g4491G9668b99944f6330p1569C6806J9909c63201a22981A22294
9097e7730G2440L5065a48381o1529C361a87529p3471l12077F3206H244a55075
9085e46020a12596A77450L6929D2375J9741a03377j35076L769h8910A18587j7659
9074A00928A2063e6860E2415J84939p0073f6038k72670D3662b25654i9333G5263
$$ y = [-90569, -305581, -76434, -237304, 79206, -113760, -81332, -69215, 160337, -52345, 160033, 135169, 150140, 75834, -246877, 68053, -69750, -354169, 84636, -269682, 84876, -223104, -110695, -112826, -73741, 76861, -91845, -99866, 832, 32891, 16871, 136776, -75766, -16487, -100658, 218648, 4009, -5255, -112865, -143878, 224020, -161972, -55646, 33635, 81413, -154510, -174598, 112024, 97849, 165441, -74491, 79668, -299944, -66330, -137899, 36806, 56715, -363201, -122981, 122294, -57730, 72440, 107505, -148381, -209910, 3361, -187529, -261000, -573077, 63206, 8244, -155075, -546020, -112596, 177450, 214379, 42375, 62116, -103377, -238453, -234684, -88910, 118587, 100928, 12063, -56860, 52415, 237354, 167281, -66038, -338708, 43662, -225654, -99333, 75263]
9062C3373b26827A36800a91930H6648A5383C873J37516h6300E4346L467B2181
9050H5671c23910C49797b28142J09413A14823O7230b75557D03296g4149A6276
9039A56458b4485j24831N7088b4877B1901b0681k71203k6182j4186E7180a30772
9027B04814E004a83645B03128a98966B88646a52142i947l22521J09273N7429A94042
9015C543a5598k41212M6174F6216e5392K4216l46266A01131a55544L9937G7251
9003A23068P9285l4934e1208j04812e8551E6034a93983O2065E975B867M1414N4819
8991I9100K4795d96980A41783c61408G4922f2170l22984f3649C6101j3034J06499
8980A29566l2491J3915g6225j7279a4110B64545I6181a69738G8890a97383q7454
$$ y = [33373, -226827, 136800, -191930, 86648, 15383, 3873, 141389, -86300, 54346, 57813, 22181, 85671, -323910, 349797, -228142, -118729, 114823, 182053, -275557, 403296, -74149, 16276, 156458, -24485, -149316, -92228, -24877, 21901, -20681, -291884, -318066, -332252, 57180, -130772, 204814, 5004, -183645, 203128, -198966, 288646, -152142, -9947, -332468, -223195, -165766, 194042, 3543, -15598, -256810, -210636, 66216, -55392, -31176, -377442, 101131, -155544, -115607, 77251, 123068, 202353, 167419, -51208, -156020, -58551, 56034, -193983, -131918, 5975, 2867, 44281, 99100, 123895, -496980, 141783, -361408, 74922, -62170, -385154, -63649, 36101, 23067, 129566, 97075, 110990, -76225, -93504, -14110, 264545, 96181, -169738, 78890, -197383, -284837]
8969b84837C4815b12806F1788i0742C05169a49653D9796K08136G7031a83746g1092
8957A35000d23438A18713c1879F5858b68813G4478R7594b98246J03072A81286
8946b20207j11162R5537j3459A05162a04103o4534B5543a6694k90250k0003A03924
8934B19562e6776A95539b90106D9800c99403c9805k8937j20635n329a1350n5178
8923f6528k25235P5823F2316J9704K77029O51435f0234I747a23786j178B35822
8911B7994L3711h6713k44729J07083L3756I5039a08633N0959C8910R5140j3374
8900A20676e671k071k76855a3047I6140a43776q4984h3798q8062j48359a39133
8888b44052h5314K9325j45174f7512j61996J7871A32620B0288b66843F7457Q1643
$$ y = [-284837, 34815, -212806, 61788, -90742, 305169, -149653, 49796, 257932, 77031, -183746, -71092, 135000, -423438, 118713, -31879, 65858, -268813, 74478, 172072, -298246, -195174, 181286, -220207, -331369, -235832, -249291, 105162, -104103, -168637, 25543, -16694, -306944, -326947, 103924, 219562, -56776, 195539, -290106, 49800, -399403, -39805, -68742, -189377, -194706, -11350, -66528, -291763, -215940, 62316, 82020, 359049, 1010484, -60234, 9747, -123786, -124964, 235822, 27994, 61705, -86713, -331442, -224359, -190603, 95039, -108633, -57674, 38910, 134050, 120676, -5671, -7742, -284597, -13047, 96140, -143776, -228760, -83798, -171860, -320219, -139133, -244052, -85314, -55989, -201163, -67512, -229508, -211637, 132620, 20288, -266843, 67457, 149100]
8877A49100a40972E633N3092b22404g5698C041K14702a61610A7479P3830Q8571
8866A79880h6350J8860n6769A84361I646D063L2437c7373B6940b29773j3746Q4888
8854a58631b5634A3529J52107b33503B0399a57806k11783A85479a58407q5679
8844b44086O3738k18720g9544j74612a18796A30140F018h4232B0765L1590a63211
8832a22065j80874A02424a32248B67911h4822A10513c26562J44068A21712b5732
$$ y = [149100, -140972, 5633, 58725, -222404, -75698, 3041, 217743, -161610, 17479, 91309, 179880, -86350, -67490, -124259, 184361, 9646, 4063, 36500, -37373, 26940, -229773, -243519, -158631, -25634, 13529, 165636, -233503, 20399, -157806, -369589, 185479, -158407, -244086, -180348, -399068, -79544, -254156, -118796, 130140, 6018, -84232, 20765, 52355, -163211, -122065, -302939, 102424, -132248, 267911, -84822, 110513, -326562, -182494, 121712, -25732]
$$ [...]
##END NTUPLES=NMR SPECTRUM
##END=
