##TITLE=NES1020_964111_9266076_U74jjMK0If
##JCAMPDX= 6.0         $$ Bruker NMR JCAMP-DX V2.0
##DATA TYPE= NMR SPECTRUM
##DATA CLASS= NTUPLES
##ORIGIN= BRUKER
##OWNER= Administrator
$$ 1.72 TOPSPIN		Version 2.1
$$ 2015-07-09 14:24:30.269 -0700  Administrator@X
$$ Compression mode = diff/dup
##.OBSERVE FREQUENCY= 400.02188249412
##.OBSERVE NUCLEUS= ^1H
##.ACQUISITION MODE= SIMULTANEOUS (DQD)
##.ACQUISITION SCHEME= undefined
##.AVERAGES= 8
##.DIGITISER RES= 22
##SPECTROMETER/DATA SYSTEM= spect
##.PULSE SEQUENCE= zg30
##.SOLVENT NAME= COFFEE_meoh
##.SHIFT REFERENCE= INTERNAL, COFFEE_meoh, 1, 14.98509
##AUDIT TRAIL= $$ (NUMBER, WHEN, WHO, WHERE, PROCESS, VERSION, WHAT)
$$ ##TITLE= Audit trail, TOPSPIN		Version 2.1
$$ ##JCAMPDX= 5.01
$$ ##ORIGIN= Bruker BioSpin GmbH
$$ ##OWNER= Administrator
$$ $$ E:\/data/COFFEE/nmr/NES1020_964111_9266076_U74jjMK0If/10/pdata/1/auditp.txt
$$ ##AUDIT TRAIL=  $$ (NUMBER, WHEN, WHO, WHERE, PROCESS, VERSION, WHAT)
(   1,<2015-07-09 14:24:22.847 -0700>,<Administrator>,<X>,<go>,<TOPSPIN 2.1>,
      <created by zg
	started at 2015-07-09 14:23:16.894 -0700,
	POWCHK enabled, PULCHK disabled,
       configuration hash MD5:
       21 0F 79 D6 B3 7B B4 F6 88 20 88 DB 03 48 BD 9F
       data hash MD5: 64K
       E8 76 6A A6 8E EA B6 98 05 A8 40 CD 7F A5 B6 1D>)
(   2,<2015-07-09 14:24:26.160 -0700>,<Administrator>,<X>,<proc1d>,<TOPSPIN 2.1>,
      <Start of raw data processing
       efp LB = 0 FT_mod = 6 PKNL = 1 PHC0 = 0 PHC1 = 0 SI = 32K 
       data hash MD5: 32K
       29 50 0B 28 59 13 FC F2 1C BA 51 94 4F 3B B1 5A>)
(   3,<2015-07-09 14:24:26.441 -0700>,<Administrator>,<X>,<proc1d>,<TOPSPIN 2.1>,
      <pk PHC0 = 89.79126 PHC1 = 0 
       data hash MD5: 32K
       D5 E0 CD 45 5B AC 9E 13 65 12 7B 78 B8 7E A1 9C>)
(   4,<2015-07-09 14:24:26.550 -0700>,<Administrator>,<X>,<proc1d>,<TOPSPIN 2.1>,
      <abs ABSG = 1 
       data hash MD5: 32K
       31 B3 92 A5 C7 3D D3 21 E3 EA 43 EF 93 89 F8 91>)
(   5,<2015-07-09 14:24:26.613 -0700>,<Administrator>,<X>,<proc1d>,<TOPSPIN 2.1>,
      <abs ABSG = 2 
       data hash MD5: 32K
       67 33 D3 13 8B F0 ED A9 98 5B E6 DF A1 D4 BF 07>)
(   6,<2015-07-09 14:24:26.675 -0700>,<Administrator>,<X>,<proc1d>,<TOPSPIN 2.1>,
      <abs ABSG = 3 
       data hash MD5: 32K
       25 77 50 47 A1 63 B6 69 2C 99 E3 67 15 74 E9 36>)
(   7,<2015-07-09 14:24:26.753 -0700>,<Administrator>,<X>,<proc1d>,<TOPSPIN 2.1>,
      <abs ABSG = 4 
       data hash MD5: 32K
       69 C4 35 95 8F 3B C0 25 C3 34 3D 02 F8 A2 1C F7>)
(   8,<2015-07-09 14:24:26.800 -0700>,<Administrator>,<X>,<proc1d>,<TOPSPIN 2.1>,
      <abs ABSG = 5 
       data hash MD5: 32K
       4A F1 16 06 0E 00 20 F7 6B 9C 69 44 84 7E BC BD>)
$$ ##END=
$$ 
$$ $$ hash MD5
$$ $$ 6B AC 1B D6 A9 86 92 68 A0 3B 76 6D 15 02 99 CA
##$RELAX= 
##$RELAX= 
##$RELAX= 
##$RELAX= 
##$RELAX= 
##$RELAX= 
##$RELAX= 
$$ Bruker specific parameters
$$ --------------------------
##$DU= <E:\>
##$EXPNO= 10
##$NAME= <NES1020_964111_9266076_U74jjMK0If>
##$PROCNO= 1
$$ [...]
150 150 150 150 150 150 150 150
##$TP07= 0
##$TPNAME0= <>
##$TPNAME1= <>
##$TPNAME2= <>
##$TPNAME3= <>
##$TPNAME4= <>
##$TPNAME5= <>
##$TPNAME6= <>
##$TPNAME7= <>
##$TPOAL= (0..7)
0.5 0.5 0.5 0.5 0.5 0.5 0.5 0.5
##$TPOFFS= (0..7)
0 0 0 0 0 0 0 0
##$TUNHIN= 0
##$TUNHOUT= 0
##$TUNXOUT= 0
##$USERA1= <user>
##$USERA2= <user>
##$USERA3= <user>
##$USERA4= <user>
##$USERA5= <user>
##$V9= 5
##$VALIST= <valist>
##$VCLIST= <CCCCCCCCCCCCCCC>
##$VD= 0
##$VDLIST= <DDDDDDDDDDDDDDD>
##$VPLIST= <PPPPPPPPPPPPPPP>
##$VTLIST= <TTTTTTTTTTTTTTT>
##$WBST= 2048
##$WBSW= 25
##$XGAIN= (0..3)
0 0 0 0
##$XL= 0
##$YL= 0
##$YMAX_a= 610143
##$YMIN_a= -511753
##$ZGOPTNS= <>
##$ZL1= 120
##$ZL2= 120
##$ZL3= 120
##$ZL4= 120
##$ABSF1= 14.98509
##$ABSF2= -5.573092
##$ABSG= 5
##$ABSL= 3
##$ALPHA= 0
##$AQORDER= 0
##$ASSFAC= 0
##$ASSFACI= 0
##$ASSFACX= 0
##$ASSWID= 0
##$AUNMP= <proc_prof1d_extract_pilot.lims>
##$AXLEFT= 0
##$AXNAME= <>
##$AXNUC= <1H>
##$AXRIGHT= 0
##$AXTYPE= 0
##$AXUNIT= <>
##$AZFE= 0.1
##$AZFW= 0.1
##$BCFW= 0
##$BC_mod= 0
##$BYTORDP= 0
##$COROFFS= 0
##$CY= 15
##$DATMOD= 1
##$DC= 0
##$DFILT= <>
##$DTYPP= 0
##$F1P= 0
##$F2P= 0
##$FCOR= 0.5
##$FTSIZE= 32768
##$FT_mod= 6
##$GAMMA= 0
##$GB= 0
##$INTBC= 1
##$INTSCL= 1
##$ISEN= 128
##$LB= 0
##$LEV0= 0
##$LPBIN= 0
##$MAXI= 10000
##$MC2= 0
##$MEAN= 0
##$ME_mod= 0
##$MI= 0
##$NCOEF= 0
##$NC_proc= -8
##$NLEV= 6
##$NOISF1= 0
##$NOISF2= 0
##$NSP= 0
##$NTH_PI= 0
##$NZP= 0
##$OFFSET= 14.98509
##$PC= 1
##$PHC0= 89.79126
##$PHC1= 0
##$PH_mod= 1
##$PKNL= yes
##$PPARMOD= 0
##$PPDIAG= 0
##$PPIPTYP= 0
##$PPMPNUM= 2147483647
##$PPRESOL= 1
##$PSCAL= 4
##$PSIGN= 0
##$PYNMP= <proc.py>
##$REVERSE= no
##$SF= 400.02
##$SI= 32768
##$SIGF1= 0
##$SIGF2= 0
##$SINO= 400
##$SIOLD= 32768
##$SPECTYP= <>
##$SREGLST= <1H.CDCl3>
##$SSB= 0
##$STSI= 32768
##$STSR= 0
##$SW_p= 8223.68421052631
##$SYMM= 0
##$S_DEV= 0
##$TDeff= 65536
##$TDoff= 0
##$TI= <>
##$TILT= no
##$TM1= 0
##$TM2= 0
##$TOPLEV= 0
##$USERP1= <user>
##$USERP2= <user>
##$USERP3= <user>
##$USERP4= <user>
##$USERP5= <user>
##$WDW= 1
##$XDIM= 32768
##$YMAX_p= 450255884
##$YMIN_p= -682594
##$CURPLOT= <Network HP LaserJet P1505>
##$CURPRIN= <$Network HP LaserJet P1505>
##$DFORMAT= <normdp>
##$LAYOUT= <+/1D_H.xwp>
##$LFORMAT= <normlp>
##$PFORMAT= <normpl>
##$SURQMSG= 1
$$ End of Bruker specific parameters
$$ ---------------------------------
##NTUPLES= NMR SPECTRUM
##VAR_NAME=  FREQUENCY,     SPECTRUM/REAL,   SPECTRUM/IMAG
##SYMBOL=    X,             R,               I
##VAR_TYPE=  INDEPENDENT,   DEPENDENT,       DEPENDENT
##VAR_FORM=  AFFN,          ASDF,            ASDF
##VAR_DIM=   32768,         32768,           32768
##UNITS=     HZ,            ARBITRARY UNITS, ARBITRARY UNITS
##FACTOR=    0.250966925370066, 1,           1
##FIRST=     8223.43324360094, -15832,       -47713
##LAST=      0,             144556,          -25508
##MIN=       0,             -682594,         0
##MAX=       8223.43324360094, 450255884,    0
$$ Real data points
##PAGE= N=1
##DATA TABLE= (X++(R..R)), XYDATA
$$ [...]
23770 -45318 165876 -161264 200101 78084 214230 -54979 -234760 103334 -27719 -13487
23759 72318 129566 -42770 -24591 -415384 -62702 235404 -42165 150996 -129907 207696 -201407
23747 -139330 -128323 186146 -132751 -237423 -65 -87280 202557 -239110 -143686 -39453 94540
23735 67426 93005 -207991 261698 -246450 -130100 -207596 260237 -250336 225311 -74633
23724 -261806 -153977 373961 -114370 -217443 45459 -44175 128699 65633 -37265 -199192
23714 -199192 -231443 -165682 -187924 -33393 171441 340777 247063 -213414 179230 98606 -31895
23702 -23038 -30158 32044 -102356 -155594 134936 130868 175171 -106750 230077 276188 210890
23691 210890 77200 116569 -44168 -28181 216586 110214 -345917 48156 42975 -181208 -199562
23680 -199562 131377 -202897 -259581 -21693 -6922 -132386 42057 -108665 233646 -42803 -290292
23669 -290292 -408316 -103035 -209422 -218953 108079 122346 -63292 -52495 208583 -42876 -259953
23658 -259953 344490 -73512 146713 -54601 73815 -7126 -200813 -228821 -20964 -181581 101269
23646 81535 24845 -22381 -128568 -160505 103701 84086 -265783 394921 -213230 8898 -126400
23634 112275 -141096 249629 -258284 -91661 304006 -62235 23704 95315 -59911 -208234
23624 -208234 136422 -187660 -314992 331357 -1546 -49314 14107 141700 -336288 -18392
23613 37869 224891 125015 -100624 -257823 -215033 -196085 -111677 -205251 78805 39436 4053
23601 191272 -186806 -92328 9792 -164669 -86880 273580 50163 139185 154033 -239069 164437
23589 -1382 213800 184916 83820 168443 450153 206279 251567 309720 -136622 70055 101488
23578 101488 453066 -182853 -221068 88303 -30236 40401 -97430 118758 -261142 143828
23567 302559 -163747 125756 11947 157323 -61909 2917 -33715 172311 238043 262745 -250965
23555 107460 207884 -112136 -96421 -167142 -144124 218911 45584 -118595 166225 21606
23544 -123143 81197 11103 159417 98789 150578 193707 -131149 52162 -93959 -87178 -103865
23533 -103865 -146787 260770 -151862 90666 178640 -83460 -284531 -177579 14696 304023
23523 304023 -347923 88048 -120 -114920 -41477 -88148 66905 -309925 -101954 -52211 110350
23511 -342641 -330883 -40995 -90984 322766 159768 -291972 -14337 79469 -294622 242308
23500 -61880 -67029 -29574 -150301 -223459 298986 -145353 45217 94551 258222 105846 -14597
23488 -155058 57799 -362890 -329739 48433 -44069 -359262 26913 -239937 -244589 -45899 -21426
23476 -208405 38228 97222 -423008 159784 -384741 87786 43188 -465530 31769 -38244 71604
23464 363043 -351223 256058 -99104 38293 -146134 44685 -78447 107268 96666 -56976 339453
23452 -151077 -15907 17162 49632 -127830 -97583 -113783 320370 -63897 15000 -157093 156728
23440 -176553 32684 229272 12675 157811 -73054 -278040 64767 -492728 -62557 -99581 -260258
23429 -260258 -114556 -236140 -155035 25218 82829 234606 51547 159496 -144297 -269123
23419 -269123 35054 -172799 9397 172602 -25161 116659 99026 -160547 217751 221648 -124671
23407 -251666 -199008 203061 -38159 125511 284212 -145962 45026 212020 201145 187178
23397 187178 -91684 -166498 53372 98506 17630 292047 170637 72716 -10218 -238022 -221913
23386 -221913 356092 98986 225868 -127910 -280605 88792 41576 96817 -155855 -199221
23376 -199221 -130948 243212 46373 125076 -128509 -137576 -190262 144565 105263 -245520 -107608
23364 -342342 117358 -89812 3321 -50394 238561 -116821 -180494 -101505 -187378 -59455 -225941
23353 -225941 98724 2999 -17048 204441 -413158 196192 -8818 -112649 186454 -99615 322395
23341 25123 134928 -304680 -34873 -27045 -202233 -23054 -95859 38651 -36746 -116817 31800
23329 73810 -142719 61819 -62901 -266068 97906 -127793 104729 -18640 -61931 184347 -145288
23317 -151392 -395284 -159801 -53820 -346421 -280578 -68144 327360 20557 -208397 -239356
23307 -239356 29476 -73434 -13849 270447 5949 61808 -264323 188051 -110761 47090 77539
23296 77539 81556 210751 133246 -206046 69038 76355 112426 117006 -192619 -79398 -94196 -56817
23284 -56817 -20230 148742 -48189 -120977 93170 -254474 94892 221066 230467 9362 -225771
23272 -215581 63211 -3961 -106705 -138712 -136212 -190546 -49329 73536 -25954 23912 226619
23261 226619 -338627 -29431 -201761 135614 -168056 -223558 121331 -95813 178287 -74975
23250 110737 278933 -192302 16543 -146587 179841 102197 -30154 -21248 -116541 -245387 -275283
23239 -275283 -70708 15408 237303 -321125 -62165 268898 -82089 37377 76112 -57483 -225823
23228 -225823 -159594 165435 101146 -161770 -23212 -134404 -146169 -78117 -157936 59471 -85612
23216 -34213 -155610 9052 -261010 -46211 109481 -99483 -80481 54452 -76720 -75147 -50841
23205 -50841 197305 144258 212596 118047 -322516 117105 -188024 -23757 -65729 -45504 -59559
23194 -59559 -130399 199912 -100175 153002 -18133 -266483 40943 -157311 -84327 -57303 374306
23182 191588 135868 -240513 -298554 3398 -184839 -77933 -108330 208687 55180 9519 -19489
23170 -569 -116635 -98391 9665 121198 290315 -213798 -34430 52345 -88272 -116048 -272486
23159 -272486 -229535 -236232 118748 -73393 -52877 18732 203910 8476 83677 -140144 -73460
23148 -73460 -74286 85568 197151 214742 -10816 -27618 -13393 -99951 9358 29475 -199556 15594
23135 278034 -136627 -249539 88799 239627 115221 -64775 383716 345454 -27952 255270
23124 -135403 51009 -55558 -168169 -310716 54824 -317053 -20728 37685 -247997 38223 -234314
23112 56078 -269698 30096 -365924 -3113 5284 57438 -111730 -405750 11449 35821 220322
23101 220322 37500 -178335 21713 205205 -58928 126803 109765 17556 -123180 320203
23090 -12967 55391 -198564 305147 -4889 -942 39345 189295 225990 1650 -157626 50501 -292332
23077 -152667 -143308 56997 50387 75281 59786 57257 49774 -75658 573 74106 23786 -92735 -139066
23064 -139066 -135230 -164524 -291992 255731 15687 59202 144961 122415 111158 -37785 133747
23052 380949 299872 239014 -155397 -2394 62922 -136515 -6633 -81673 -173747 -372853 65115
23040 -195864 -226242 -165721 -62415 222381 125801 31961 -130063 170713 -216823 210617
23029 100513 67547 34930 200341 260601 -105990 196668 61166 72886 -788 237715 142754
23018 142754 66491 316571 -49913 135178 29786 22142 -63758 245487 -108993 -102916 -305113
23007 -305113 -136379 -218291 -227632 -117670 165430 308865 -166157 -83930 64355 146615 -37729
22995 222294 -109789 82140 176043 -280030 -48366 110084 -39598 245776 308838 -125534
22984 133216 -95402 136461 28700 -64010 -95196 -205673 203157 87653 -83767 79404 -59049
22972 90429 94034 178045 -72016 13862 64029 15948 -57552 -14728 -69806 -86842 -143161 -148381
22960 -148381 -268918 -13244 -31317 159358 156764 -182 34845 -105714 -32641 -49717 -222109
22949 -222109 -38449 5420 -79433 80893 214353 -110539 -11753 -112864 -28476 59106 -52023
22937 -433095 98079 85365 -166874 166923 -163219 182703 -104842 -116569 63531 -36251
22926 136567 -86757 -28326 69186 -129689 47733 159367 -398668 261339 -79549 -80042 -40739
22915 -40739 -68341 -180223 133702 -437910 35367 152924 -94597 -141114 90657 -146679 -304221
22904 -304221 -14455 -268251 59046 -25688 -214283 -188162 -190465 104562 -75247 97863 -58345
22892 -540495 142097 3621 -91888 -121197 238964 43138 -146771 -61715 -172119 -51883 -66003
22881 -66003 138669 -125126 -277574 168479 6367 -161879 157891 159078 100252 -36237 -58281
22870 -58281 -196106 -27133 -382746 -37564 285240 -2847 53606 170493 -130627 6725 -103241
22858 -263787 -77854 197108 115316 -34833 -118504 -150971 318429 139243 25523 14979 -117207
22846 -114637 78948 -66114 -267529 -15698 153423 85688 195406 204803 -272615 -105070 -192779
22835 -192779 18615 29406 -150325 27315 -339016 -74711 80735 -63067 -30782 -262036 -238551
22824 -238551 241863 76751 145749 -302494 152011 146348 285479 -34196 -34639 -112060 221329
22812 -74102 -91310 -171076 217764 338839 134709 64335 -57402 238993 -121282 60396 -76991
22800 110145 -61868 -3613 -159383 536 29074 -246150 -49385 -278802 -104928 -96902 -47766
22788 -167384 185658 103541 -43546 3425 -44588 -10978 -15999 -53333 -281100 210838 217385
22777 217385 41466 -106756 -122729 -221822 18977 -77034 133781 494504 -127433 247963
22766 49969 70013 150704 210 -423636 -75419 -158306 85655 24492 196540 9120 328151 -278124
22753 296929 -215812 -42512 -167330 -58691 116196 9584 -213900 -264575 257602 180937 102331
22742 102331 -166049 -77893 -4233 -328345 -96313 70469 144441 -263634 -197358 -53976 -73665
22731 -73665 -127985 199061 184955 -210393 2897 50103 -145202 -28444 -271122 479520 -77377
22719 -183948 -84151 -163964 228060 -113490 84251 -31734 -280387 -138430 -50609 -202926
22709 -202926 99885 -138469 -359886 -317296 -165497 105836 49870 -70875 208587 28567
22698 -19229 -36385 -395367 -175888 -78421 -411200 94188 -188392 41692 187096 -120983
22687 50753 90315 -120526 53393 49675 -189200 87610 34005 -25458 -162168 42024 326141
22676 326141 100935 -48860 83733 -29302 -110707 -181558 324602 -63478 -62868 -221884 21857
22664 -94708 -231608 6632 111625 -67677 -60156 67500 -115620 73635 -265423 3870 -252239
22652 9152 274543 -146700 18185 -298993 -121626 -82858 -145787 105172 -42295 -201573 207438
22640 -171566 -242928 -155892 82401 -151105 76938 -99090 120110 -171537 -21806 195317 -122521
22628 -141649 71287 19070 -277161 36505 -87604 -58065 -156852 139578 340549 26227 155207
22617 155207 -7232 -60276 -68373 192239 112158 -35183 -18339 144978 -232854 79666 -229837
22605 -215029 -6412 -135930 -158346 39812 -190664 -145534 90305 22384 132816 -304281 -11720
22593 -109100 -35826 -144901 233361 -289262 140501 55999 5704 126022 -165870 50250
22582 316717 -155286 -4829 -3487 -88487 -8446 -89840 -293143 -111102 -170366 -113017 -75156
22571 -75156 -197713 -87966 188247 79569 99881 -221757 88121 27427 52702 -412961 203897
22559 93747 -57307 138380 -42290 278592 -136159 55609 34246 -335567 159774 -256225
22548 -160100 143225 -217353 -466975 -278449 -90109 196234 -129821 42731 42845 -191525
22537 156495 9504 -91886 -5096 168241 -65869 -364231 -337428 -53096 -208221 -216426 234941
22525 -123467 -81470 -124008 -222179 -211518 -120834 -442359 -155492 43576 -17782 240496 -92122
22513 58545 220566 -190439 -54953 44238 -226869 183206 228831 77570 -83910 98463 75709
22502 75709 -83839 -166818 -7474 -28665 31609 -167749 -24336 164474 -267996 60370 -134123
22490 78644 -19040 -106483 152187 -334187 -362676 134305 -992 103771 261807 -37950 -247001
22479 -247001 3065 -65881 36577 22715 260585 131490 134744 -167382 -114837 -298579 31208
22467 -1268 -19502 -2171 216923 -188567 258992 -84255 53295 65746 -209715 -256868 -226257
22456 -226257 -152208 4405 -73878 -54943 5851 -428943 24526 67408 -147151 -155809 -245693 117329
22443 149593 -412079 -66413 -56862 234771 74629 283272 -148891 -137255 170699 291940
22433 291940 -137461 -81891 -29456 -120569 -196874 53561 -334898 -158150 -189345 -64046 144417
22421 -24479 -82911 -3909 67929 -312170 38510 11027 -241932 -61692 -156020 145103 -58663
22409 -41792 70611 -119748 -156711 40373 55399 217056 -165265 -139197 -94563 -221861 27539
22397 124427 -33716 -21030 -64803 201595 130728 -218859 213411 -125408 -124376 -85539 170058
22385 -170179 190192 -143177 34947 -399053 -51027 -170004 95740 349633 -371802 15553
22374 89960 55618 -214017 -150724 164604 171610 9892 -50012 -180026 41566 -384569 175964
22362 -259665 142493 13799 -203642 212486 -25820 101028 -48906 60894 -318157 -822 107404
22350 20200 -150422 -101716 -251300 -415629 84198 -169542 -366910 -503454 -227649 94593
22339 204641 -137513 102828 -130849 182208 232241 229278 -222182 -144096 94430 184040 -204081
22327 -51987 -63954 -106145 -25854 -4184 -523306 -173945 -207957 -9370 -285044 -51551 -119254
22316 -119254 -87541 -99140 -24623 151238 134959 -104786 60112 -270411 215295 54917 -13578
22304 -148497 239629 65905 -236051 -212045 12395 -45919 40414 -111004 -78279 -251247 -119205
22292 -6881 -402675 -148783 281290 31730 -100564 -170351 -10235 -91561 66611 140831 134914
22281 134914 149808 -243718 -15311 -183868 -213826 329582 -192852 86667 -116183 212914
22270 -281120 -118511 -70292 72226 -187211 37164 -179784 135015 -7526 -7247 141918 201492
22259 201492 178271 33417 209257 -295468 20187 -126290 235284 -224896 11780 243835
22249 243835 -96551 -259628 -12450 436763 -20008 -191427 -116649 -303399 125178 -155765
22238 37403 -31782 -25461 -39133 -253513 -255043 -256629 -202572 94170 -165643 -50607 168808 -34885
22225 -112169 208347 -200118 83014 -140651 13016 -256548 66099 -203296 39617 1864 -306763
22213 194678 -233879 458279 -304283 -11983 173669 -133412 -316923 29261 -356957 30559
22202 -133481 115176 -76877 -279892 -71937 -67041 -76244 -12524 -334878 -109419 -149586 -246734
22191 -246734 -128185 80256 -147330 219477 51553 -50874 359295 -140004 -149901 123085
22180 -167290 -187611 131924 -57334 -328043 -71901 -259193 298002 -165182 30200 -21753
22169 -41621 -180013 -304916 75516 -123562 40824 -42963 88461 204093 -148677 273008
22158 -14241 -47860 155596 -107673 -417561 -314156 -28964 -126576 -111039 238560 -205147
22147 7640 83121 264827 -95368 -219710 -232035 -178268 -435173 -158718 -262450 232086 -231029
22135 -16505 -152788 30134 -113368 -223433 -410239 -95953 216598 -168210 -178650 16767
22124 33762 -354572 286293 -54086 -232182 -217049 -161418 -343712 88976 167614 161200 1408
22112 183273 -23108 77937 -24234 -191701 -221795 -176751 -61119 34640 -277220 -122631 -86143
22101 -86143 -67422 46194 130064 -70206 129660 -10905 -278339 -81080 -63533 -30722 -215309
22090 -215309 -380977 -104998 251810 -74859 -17339 -56024 84497 -95835 134730 20847 260370
22079 260370 155828 -155017 -154813 92155 -199523 130875 -1381 -35002 -175274 68168 -29707
22067 -463307 211641 59956 -98463 90793 100992 -65792 210564 1931 65846 -516851 155769
22055 242845 -195363 -61580 -193883 -177317 78429 -88567 -69470 50294 109671 -134061 38525
22043 -145503 32586 18509 -142091 201681 -47747 58699 -206820 -69088 149834 -81276 -29542
22031 -303443 34348 -5651 -84319 -402234 239429 383470 -223965 -69454 -172887 22999 -143994
22019 -57275 -127298 -394161 -170022 321182 -199088 217744 -392555 -287716 103414 -237200
22008 234588 -127561 -42406 33733 -374941 50456 -172627 -77586 157887 90635 10192 77121
21997 77121 -159628 188343 112724 -184559 56648 -77904 -10303 15751 -93627 54997 23765
21985 -143052 -192984 -326677 -107746 -52790 -33034 49079 178858 -298180 46270 -94395 -134903
21974 -134903 43200 75454 -38297 -252366 -110967 213528 -43420 14848 -61794 -21150 -90678
21963 -90678 -266356 240604 -98778 -4863 255938 -69916 137575 -91126 -100116 99623 103942
21952 103942 -130461 87068 -464766 -206147 125866 22456 23024 -35043 104607 -132583 -21290
21940 90182 -366500 33584 -88738 -47944 -76238 -6415 -107801 -224703 46334 -263121 -177785
21929 -177785 56608 -265239 -48005 -90234 -42596 -170085 -82106 59480 -88191 -172850 -132343
21918 -132343 -9 -181985 -290745 -124963 10567 85960 3 31581 104463 -107409 -343641 -63880
21905 -222122 -120575 -307693 93860 -116529 -266963 90323 -130134 67069 81908 -79411
21894 -167505 -40560 -206906 -159191 40179 -327135 -77099 -5198 -312335 -59762 57004 -20539
21882 197554 138281 -15041 -119864 -100788 -113519 -162533 104096 132610 -61404 152230 132319
21871 132319 246900 -62762 147632 -53950 -75600 -215737 -438681 -102393 106353 -19640
21860 -47425 58947 -186235 24199 135929 -63510 62381 -88442 -260582 118908 13621 118129
21849 118129 -57813 92226 -186695 280169 -134864 102557 -46399 -341378 -128417 256952
21838 -217966 -242327 -271723 85220 -272921 88247 1084 -57694 -230467 203602 -47811 -301720
21827 -301720 -326687 -68302 596380 -301344 209967 -93911 -94840 -79298 156026 54145 -47743
21815 -79796 99044 110102 -70258 -169042 -55222 -56731 48182 -144906 53916 -237266 -357656
21804 -357656 185923 -200513 26639 52506 6049 57943 -187383 -139098 -177396 -188363 -366275
21793 -366275 -81922 -82487 -12364 52814 321924 122603 -8746 89881 137123 117864 83101 220878
21781 220878 55919 157193 58030 -163280 123600 -120394 -46862 120754 -199005 -24975
21770 -224469 -30990 76194 172790 -119301 -101038 98576 278358 -99739 292272 141861 84947
21759 84947 45234 -78696 6451 122517 42252 -119590 14994 -274233 -140667 -43949 255602
21747 -14168 153727 -17993 -156889 8400 40758 -243050 181872 -102924 225149 96199 182161
21736 182161 -375831 7043 -381472 156539 -206870 117652 -164631 50317 96120 -260472
21725 -71737 -27721 75766 -130289 -314497 -143207 -88386 57093 -72266 -230994 -187468 267489
21713 -167715 -357021 -63157 -2920 47580 -24323 -74123 146963 -215814 187230 -180613 -33908
21701 -312034 159389 -68914 -278760 -54027 -204143 -413160 -103305 -56542 -35257 202615
21690 -80605 -37856 -118756 -100354 -201070 -315826 -62319 134247 -234310 -47496 162357 369153
21679 369153 -81504 34373 -188536 96253 -256452 -58661 -145071 -87230 80491 32020 94583
21668 94583 -2792 143276 99826 -410100 -75748 310352 -114241 -188596 -49445 -202949 85345
21656 250173 -41875 108303 -451746 438034 -20615 118352 -26838 22373 150316 -23350
21645 -228516 -57670 -230479 35509 -236495 -20606 -8056 39512 -37479 182182 -50022 168481
21633 -365236 -48332 -48683 -183564 41255 -130210 -224487 228709 -64906 312656 -326764 -61602
21621 -240275 -208631 -178592 48465 -47715 -3774 -22286 81179 -39117 -165257 68670 -211471
21609 -246854 -477621 -328908 -249761 72196 19684 14545 -4011 -165813 -28836 105763 -128698
21597 -89221 -64173 167863 370460 -126737 -47262 -332035 -47375 97554 -69404 -241329 112858
21585 44337 -155822 -47821 -66399 -272527 -125590 149767 -170107 -179638 -114629 -212069 -185542
21574 -185542 -228418 362887 57096 30388 428398 -259943 186202 360181 -245694 102898
21563 -133262 -85380 106222 2563 -3784 -241063 -225100 -334114 -5154 -60529 -296095 -156512
21552 -156512 -99334 -309273 41274 50894 -209425 225264 316393 225319 58048 -115892 -144898
21541 -144898 -230929 -98798 230014 -185170 17437 -47460 -144801 126290 -190156 -129940 189395
21529 -68373 -85844 468873 -125450 -252679 -193758 -53422 -40615 101856 -177629 -87451 -344431
21518 -344431 -385106 139489 167505 -21300 127086 -358795 -19652 -110433 -144018 -77321 1621
21506 121530 -6323 -98912 139202 -258297 74956 -95291 -86481 -77067 -233476 -231686 -242653 122421
21493 -18099 -111486 -160096 -143065 -115325 227803 -260736 86846 -160343 -178679 85111 10136
21481 86121 -50589 -166114 -8117 -26584 39831 170600 27068 24816 326070 -199384 93800
21469 130943 88588 68180 177642 145828 -118283 -218979 -49285 179385 -68072 -165637 -256619
21458 -256619 83314 -129158 38381 -25211 -106690 -58483 69535 237552 -59911 -90341 221305
21446 -306536 -198491 74012 -407971 33037 -258421 238637 241391 140975 102913 173155 159308
21435 159308 435173 221765 80110 207225 129226 230214 120622 -55668 110345 -301861
21424 -322613 -7671 -769 194138 -99320 149393 -169643 -52331 -260059 -285341 -73738 -203504
21413 -203504 -188466 -133704 121827 -160122 -119930 -33681 -170036 -176895 -86297 -78380 -136194
21402 -136194 -261285 15413 -151715 213384 92068 200732 289130 -24915 -161591 318945
21391 -224711 201064 -115209 -200437 -107425 139553 37530 -209912 -106576 -124135 -40430
21380 -218802 -405582 22067 199175 -104598 -84576 -167993 -103649 -31120 -296908 -123502
21369 -130454 86754 -305343 41190 -101218 32192 -124972 -185508 220856 38485 -159497
21358 27647 158042 -298279 -40613 53570 -440334 -35587 213705 -5735 -122969 -33244 -111502
21347 -111502 24035 -119360 207936 -337907 -78864 -155553 -41371 -45026 -459378 140182 -131792
21335 -61087 -106041 -84933 -1979 -204760 -124908 -180332 -90856 330906 -97511 57452 -172386
21323 -402764 -135981 -124451 -513983 -210931 120967 194143 -130110 9163 253740 -41139
21312 -134829 34498 -51950 -197890 -138570 247150 48080 -30516 130851 194565 -183976 186244
21300 -291875 -912 -145918 -69585 -214113 -189888 -86432 200606 -203544 147460 -30686 288083
21288 -34589 434528 72782 51335 -199479 37901 117222 -263648 -170792 79583 -239192 -7009
21276 48997 -188854 257838 88221 30035 -305469 -28454 234603 -24424 -133993 56529 -239876
21264 221884 197780 -226096 -256209 -68703 34098 -334030 -138372 84791 -67660 -139634 -342619
21253 -342619 -167614 9015 -392071 -53703 51777 -266130 -80263 -75235 176461 73732 -195325
21241 69784 -180393 -160995 -5819 70528 -63376 -148126 -6356 -68556 -343196 -12648 -147992
21230 -147992 -145149 -267184 -117302 -32273 34872 -111005 -245645 -50149 -31168 -328004 68733
21218 -45321 1401 -20364 -147224 -28040 -418264 -92507 -247140 -12113 -1529 45206 -37153
21206 426257 107200 -269773 275492 -410945 323992 -362148 -35449 -290596 -192655 -112806
21196 -112806 155975 123629 -244986 -96976 -252490 -38869 15686 -234033 24972 -370508
21185 -76715 268819 -126634 -276327 14696 56809 -56932 33648 -328598 60699 -86655 -238033
21174 -238033 104648 -177996 -261004 -207809 -131637 -111460 -114712 -56036 96022 -329979 47854
21162 -51 168940 -249357 104370 -14709 -135919 -60578 -40015 -170863 -322695 -252214 167727
21150 -181850 -99474 -52452 -73385 69428 -2636 -119565 8906 -58272 -145706 167678 -337432
21138 103324 -86937 62728 -145496 -52374 83804 107147 64412 15381 298666 11081 -106414
21126 23064 -134618 -156972 -131894 -148208 -225138 -139498 8572 -80399 -218971 -302803 -36949
21114 -225760 -121952 104224 -184618 71868 55887 155521 -197582 -76097 -160118 199828
21103 -110786 -273805 116030 -330033 229822 90479 178635 -226213 -312943 215141 -132094
21092 -30278 145204 -51266 223399 -9914 157181 -61845 53014 28892 389629 -21805 20230
21080 29517 151149 -176585 -191521 -175878 -190047 -20480 -343765 -151850 -226288 -96243 259649
21068 -259040 -117522 -266409 -178020 138550 -329283 73389 -146356 144164 48072 -21940
21057 -136241 -131834 81443 -66447 -63556 214039 -192106 57234 10329 153515 60815 -419073
21045 -277653 -110465 -170579 -65096 -62870 -38163 -80349 -52740 20363 -215456 126899 44418
21033 -121198 -86678 34989 252314 44915 -56357 179184 -59180 115830 14085 292414 -40356
21021 -51362 -22484 -73418 -137933 -106580 244144 -146579 -162020 311661 82826 300551 7413
21009 -33938 76254 131729 308502 242402 360705 213935 301359 -15028 -158364 18367 -171138
20997 -37199 19673 395989 67909 -158813 -114693 83034 -73177 -74061 -304778 -115757 -121492
20986 -121492 -183256 -220124 -14004 -131391 -259319 132043 42191 35695 1279 27300 94680
20975 94680 112004 87298 -387545 -108171 -321924 109877 -370834 31271 -31541 118951
20964 -121487 -323371 175061 15114 125449 -173263 -7506 -99802 396612 -31012 -62155 -111494
20953 -111494 49048 -29914 98794 8798 -181450 -177075 -216848 153327 262214 335308 430032
20942 430032 95144 229384 -147033 115120 -146409 -138338 -193511 -95133 77867 -343705 -30870
20930 -29307 -94820 -38028 -272711 238453 -57314 67060 -9442 -332524 -187358 132261 -228891
20918 -205004 -160577 248151 -10260 42158 -162225 -330545 -301730 65929 66811 -215449 -220642
20907 -220642 55804 292086 -99176 77782 -197064 19590 107500 -204255 53518 -85839 -1556
20895 106643 -33508 -73093 -25206 -397568 -162305 167908 133413 -41692 108183 38777 4696
20883 -201633 -260414 -178877 -88884 -309575 -39650 -228367 -60383 200373 71181 145512 226009
20872 226009 95685 56972 63741 17919 170394 143053 -78971 101521 50050 75903 -234427
20860 -24771 -125774 56024 -201654 398039 -338177 -37558 -46812 -359890 -307403 2171 -293221
20848 -40336 4098 -59987 -100194 112530 -25812 242095 3593 5515 -258013 -170523 -248782 -107444
20835 -86707 -197827 -298331 -229148 -417999 122400 -95716 -109559 -129694 48763 28611 -373921
20823 132681 -41347 282805 -341364 -400467 -22776 -256045 170949 172027 -152014 -76099 104394
20811 39806 261250 8889 136793 148057 149908 -117712 -11638 15211 -164131 25224 56229
20800 56229 -29180 -53250 137215 143164 12241 3843 291699 -109539 -30951 10477 31093
20789 31093 8743 -293019 -190552 -52740 -89178 -70457 -75792 -105119 -108204 -267331 14577 -117158
20776 -106679 -99983 -133293 -61597 -139797 -120864 -231744 -230397 -82867 -396738 227126 168303
20765 168303 -194162 -52741 -139533 -213115 -227844 -254192 22067 -164833 136545 -149684 -383658
20754 -383658 -51617 -136724 41816 -427020 -308651 -76409 -168279 277093 9611 -49128 -129064
20743 -129064 -162459 -464582 -199017 -94754 -63415 54965 93246 -251230 88404 -293742 165829
20731 92154 -297710 -196074 -387527 71496 212223 -410290 -77508 -136230 9721 132866 -21729
20719 -281640 -6404 5249 85386 125187 -399966 -105742 148091 -44629 -47745 119330 121259
20708 121259 -199829 -222146 196407 49805 -306139 -126571 -105651 -169200 58916 -93057 -338536
20697 -338536 164043 -541557 -300665 214606 -387902 -233282 -204154 -217878 -26453 -337973
20687 -337973 148748 92007 82012 -101461 -212588 194599 -201359 -102835 -84390 -290893
20677 -290893 -80113 151593 -255002 186899 -227983 13709 -3298 53604 168920 -44135 7452
20665 57812 -153331 -90493 194697 -254860 -424092 27735 57566 52139 -479043 47897 174885
20654 174885 301430 225725 -237835 -276100 -356784 195331 -216891 -180373 -9343 -32531 -192185
20643 -192185 -142993 37045 -92234 246421 -90455 17226 -65873 2022 -332932 -130055 10270
20631 182204 239895 -113303 -94600 -201368 189973 -360112 -248844 -116748 106069 -283403
20620 -120798 -364288 -75164 -152346 112217 -133238 -239731 -177639 -88038 70111 -185456
20609 -44153 -195502 -319987 -328742 -187354 17670 -183645 -134085 -102063 -234252 -168378 -126520
20598 -126520 -77646 -25293 211253 16731 -428300 -1615 166431 29665 -150295 83176 -38995
20586 -313289 -361965 17183 18904 -274220 -136749 154633 68707 -103328 99978 -16233 62374
20574 -245782 -34217 -73035 -79705 -130339 134968 67292 231516 -118443 -33449 -116665 -30906
20562 -187541 -311982 85462 78068 -52085 -65240 -194150 53147 58277 -297114 74827 350863
20551 350863 -211597 -137614 -179666 -203891 -323139 113244 -137115 -143414 33379 -79515 172495
20539 132566 118691 2633 -624019 127758 -253733 -260876 -12087 47455 124123 -50405 88373
20527 -21458 -33986 -77475 -231570 -11596 -262978 -57598 39380 -90565 -209358 102144 24292
20515 -314990 231355 -36026 -132530 -98125 -88049 -188538 -88515 84991 -136747 -119075 -63411
20504 -63411 -145751 -108023 366270 -23209 -361234 -262000 -210885 -307519 -17932 39898 191657
20493 191657 -408551 -13219 -54806 387575 -282427 86718 164047 -43075 369461 -173247
20482 -341433 33858 -397130 299533 -275237 31519 39074 -432982 -217834 149763 27818
20471 62993 -245371 87766 -119020 -159095 87783 19284 -92705 116378 -331708 25960 175318
20460 175318 81868 -183896 -152271 -15585 -33090 -174907 -170474 32049 112507 107687 -77546
20448 200435 -144791 -251354 -67609 -105312 -204841 -23808 -141517 -283850 -17871 -527114
20438 -527114 -179958 -68050 -163998 175725 -64209 111951 -63689 -9496 -105349 2215 129112
20427 129112 -251509 -122429 64335 -79716 245869 -168940 -83158 61003 150951 208634 -317302
20415 -206601 111109 -147752 131495 66375 -80369 -279665 138416 165906 -180425 94052
20404 51411 241829 -577678 -128445 -181678 -375481 250207 -103218 68400 -13405 6376 -46371
20392 -203023 -111485 -110234 -230170 -147668 125645 -118992 139262 -237661 -327865 -53554 -517400
20381 -517400 105288 -187259 177593 -103589 -129992 36249 -221667 292572 -190776 48978
20370 -113261 -392386 -124109 95494 -223588 43032 -147223 290209 289104 -107575 -57192
20360 -57192 60081 194448 -169517 63595 142411 -338602 13629 -187970 -116709 73780 -64572
20348 19211 161082 -207195 -437132 200637 -206271 240000 -104621 100286 236508 -8573
20337 56545 -187536 -233085 -355120 -287344 -41133 -81924 -274519 -279331 60351 -24974 -154873
20326 -154873 -246490 -222637 -364598 -46217 216178 -331163 -23310 -159425 109195 -88929
20315 141861 32797 211822 -269196 -223227 -100409 -16898 -57558 -308772 32406 225618
20305 225618 -7594 -68190 -26821 -221347 -48278 -129410 31984 -141842 -107825 -343067 -113602
20293 -19744 258725 -3519 62643 -131861 -286884 -135938 61363 74049 -485257 -110776 -146201
20282 -146201 -29323 -10189 408 10355 103330 -199808 37144 -86353 -49918 -71614 33272 -48907
20269 -347519 164686 -82344 121344 -179000 99260 -24192 28416 55198 120337 166617 -221821
20257 -73171 278297 -179260 -210045 76942 -572954 -190417 -426484 23919 72132 -175747
20246 -101937 -269320 82245 -44840 -24943 -76163 -76488 -156884 -16937 10577 20122 20708 -241652
20233 5162 -180016 66806 -100450 136068 -255076 -55052 31203 -196562 -140760 -151339 -305113
20222 -305113 8695 -472333 2766 -94112 156484 126075 251676 -575594 -9112 -293996 -39837
20210 180805 -235806 -25288 -30341 192312 -235593 -73159 71928 -182277 178176 198757 -250896
20198 86948 18277 -276329 -77292 136254 51416 -364021 -73887 -43087 124571 1610 -218196
20186 187845 194018 41468 49806 83631 -171383 28582 -167008 -317186 322225 32388 246369
20175 246369 -113530 56015 140916 -63815 11375 148202 261019 -208147 -188395 3932 62027
20164 62027 -158906 46014 -60139 20612 -38740 -91382 -10598 335902 -49851 175936 203035
20153 203035 212211 71539 387088 668079 420204 341924 439088 146004 98729 84816 220464
20142 220464 669090 488126 633709 -14367 -66807 190230 -263259 24226 -306500 -52592
20131 -273826 -149285 -163281 -70361 265279 14964 -119143 -302845 237093 -170834 -30904
20120 -40229 -243581 77021 11217 -91864 -58025 -3549 -77857 -131569 -156708 164240 -356244
20108 -30193 -89231 -177874 134318 -364454 166773 -192320 183471 55047 39319 -71630 -77816
20097 -77816 -13706 69878 78739 -116347 248352 -7690 -76015 -350999 -175994 -74336 -68323
20086 -68323 -160948 -264887 -67628 -245627 20647 11371 -44746 -31042 -46187 19647 -142789
20074 -78841 23670 170194 -400082 -86694 -21344 -260450 -97117 -98494 -303769 -29347 -377691
20063 -377691 -137319 -36524 205720 -48212 194532 -177779 -98095 -112812 1149 302308 70754
20051 -1914 77764 -56838 57271 43991 -135325 152083 -225543 296517 -133791 -302697 -122265
20039 -44983 85134 -94610 -58153 -303004 67424 81025 254482 -95592 92881 26216 260495
20028 260495 -303812 -266436 -93588 160903 27272 -318166 -186140 -148535 -174785 26318 105017
20017 105017 3667 -31994 -58414 -362081 -266209 42440 -74326 -14414 -114689 -65784 40487
20005 101655 111498 -85135 -63139 182652 54801 155675 97964 244278 277702 383348 76276
19993 110087 135214 -2953 16093 -101532 310368 579630 259129 -100264 220427 -237087
19982 -138406 141147 -205575 -37315 -344907 -205059 10153 139685 127357 -81749 87253
19971 -173145 -166628 -87606 -68087 -84460 119630 316141 -47268 266281 -25744 253166 81793
19959 83993 -9915 271470 201373 313039 -181064 255937 29337 254493 -156346 -349231
19949 -349231 -94361 -132746 -83584 -141915 255468 -127516 153087 202945 93795 -307947 -190572
19938 -190572 211877 -66236 -7607 -31506 69499 -93559 124451 17666 -234126 -123954 250927
19926 58998 -50391 11975 97919 -356080 -223036 101102 322082 -117011 -424090 -290212
19916 -290212 -4952 -207703 232130 -82908 201988 -323564 -227605 -318371 -259051 -63271 -1183
19904 4655 292 -113326 -55660 -6680 -45886 -285848 56125 -229786 -166199 14919 -3365 -115469
19892 -115469 64667 27228 -22921 264000 78032 282823 39388 218941 -18916 -274706 -364709
19881 -364709 -27782 64560 -23377 -197902 -21674 -273100 -200396 29767 -58045 -76197 -94082
19870 -94082 -47823 49136 21315 -221769 -169939 -219248 21458 -25821 -166960 -145704 -36610
19858 22957 -182612 305557 98034 -30792 -452268 127215 -259207 110536 161034 -439521
19847 11990 -24117 -51518 -84732 -65067 -142091 -122126 -241213 -16659 -29742 -101860 -111384 -71100
19835 -71100 73295 -58618 -348280 -61330 -250984 91105 124552 -102327 -125454 16952 -70633
19823 -40325 -127860 -177698 -180382 -78476 -100840 -21524 -240950 -230253 -16358 26868 -74716 -62501
19811 -62501 -224265 -133942 90296 -289842 76507 -70459 1012 121029 -234568 -326731 -9665
19799 -61507 -222796 42616 -2118 239550 -67579 141400 -87055 -252820 37748 -76830 -112471
19788 -112471 -29611 -93564 -268458 -23208 -149926 -66967 -250471 -139447 368643 85418
19777 -294528 -90812 -67990 -334173 -101510 13890 -168341 98147 -74199 -8763 138051 180255
19766 180255 -86669 34366 125648 -133342 -90157 159334 257548 91809 294683 90498 -177847
19754 238008 64120 -196711 232458 90434 130650 -244064 -133903 -123315 112696 -316161
19743 -168231 -66662 111026 57191 118558 -5518 -51342 63103 80794 107351 108672 480133
19732 480133 538029 643350 106546 -143984 -130555 254451 -102545 53957 86996 -102594
19721 55123 -118604 49875 184234 -72510 28612 -90429 -23475 26116 -201250 -30006 -475086
19710 -475086 -66235 -31428 -63435 107584 -156971 12628 34811 193380 6986 287530 642447
19699 642447 388915 195215 206905 -59704 9126 -349172 -31854 109509 -91310 -126902 -66195
19688 -66195 -262059 91806 -348418 9321 -133060 264222 23814 -579764 -107784 88101 -399808
19676 -234470 155270 -256765 43866 165099 -383240 23547 -299001 29449 430781 75929
19665 85982 -183428 -137632 242292 140953 100515 -122826 58495 -285176 -258172 -163376 -251819
19654 -251819 18122 225402 151276 275272 -293049 -93001 -125341 -546761 95003 52111 -42656
19642 282091 146822 -213491 -263314 -6739 -64998 96547 -177013 -93288 34414 194829 -265274
19630 -47904 -85497 223548 -179834 -91672 -53148 -241797 -36612 -92951 -131964 135010 -10003
19618 -48022 -293672 -34283 -119418 78098 -3569 -51282 72745 -3808 166657 -93983 -256884
19607 -256884 108393 -195726 -420090 71864 -207934 -86533 -132089 -134619 -60167 135980 7851
19595 -117205 99751 -140630 -153098 1819 -110179 -344791 127127 -243661 216089 -81831
19584 -3010 -378662 -351978 -399284 -262979 -244129 -204423 -36673 -154851 -165301 -234775 -40053
19572 -78243 84441 120800 -31666 -69732 110723 -140410 -144394 -17660 41965 -188807 -82874
19560 -101368 -179893 -199957 -273946 -288040 -31869 102650 -127264 -94069 28576 -101754 -83680
19549 -83680 -110427 -5697 64087 122768 -63112 -160007 -53583 157301 -73176 105245 145718
19538 145718 167079 -238348 60694 -132828 -237194 20367 27477 -55989 -415379 -128634 -173707
19527 -173707 43908 -120515 216464 337 6256 -65069 -255592 101764 -67199 -77290 -124149
19516 -124149 -56120 194861 -119190 -395797 -14746 240590 373249 -241343 -101866 -125178
19506 -125178 -153723 177141 -349782 -1958 -292849 -162467 242724 43391 -184822 -391508
19496 -391508 -94328 74064 335935 76798 -409090 120881 173789 55060 176822 -178738
19485 -91074 -90614 -26320 -4473 15136 71519 -31100 63327 -105281 -172889 -98647 -64228 129198
19472 -7892 -24443 190185 -15737 27249 -78934 -4896 -106617 262902 -65821 -164990 -299198
19461 -299198 -240311 -178320 -136147 -178094 -199354 -310136 -207026 -272161 -327871 -77585 -364288
19450 -364288 -354912 106899 -162475 -99319 -13585 -51325 -20571 -201325 50560 -451619 13785
19438 -14018 -13262 -101868 -299344 -53176 -300416 -1137 55022 -427411 98204 24905 -35461 54616
19425 -107692 -488113 -282833 -147785 190565 172241 -176464 145736 103836 50831 -129056
19414 14425 42449 84943 -239118 -156118 -97830 172509 51512 -242132 166559 227240 -93138
19402 399649 -114996 -254394 -48903 -206738 77898 -84752 -236188 47896 -162746 62393
19391 -84201 -71604 -42904 -140254 -47211 -148107 55628 -305006 214329 -170347 -227391 -220951
19380 -220951 142713 -12342 -98454 349875 120900 -166360 -22416 -157223 -79576 -380782
19370 -380782 -141857 16895 -318117 -192251 -209587 9933 229718 -294760 -173168 -210933
19360 -210933 3415 121522 -20949 -327772 -108131 -141102 -208656 -91076 22944 -69512 2616
19348 55321 -65636 -195819 -224770 -173314 -157979 -321244 -355806 84946 -178900 59074 -71 -153485
19336 -153485 36071 -299786 -170791 2619 -198219 -252139 -143581 231588 12489 -45415 -99191
19325 -99191 -256189 -1905 -155895 36798 -163829 -216690 -111960 -8671 116428 -110763 120178
19313 -31091 141398 -331329 9221 -173840 109461 -152674 88308 -99535 -57338 -307988 -10612
19301 -311444 70805 -372848 -83223 43229 70953 -114414 29021 -117044 -219929 -32587 -230213
19290 -230213 59636 12009 -127668 275214 37580 -31068 -332725 39645 -468934 197648
19279 50328 17277 -17731 -46927 95852 -371001 -64970 52957 -8732 -159770 238533 -253540
19267 -221286 -8358 -103559 -149553 45757 -19907 148018 -27350 -187990 63479 -140961 -236629
19256 -236629 -185007 13219 97236 98188 -49689 86967 -352750 150522 -40913 -95474 -199731
19245 -199731 149916 7024 -20329 -61088 359739 -208390 -13049 206275 36255 -49449 197679
19233 -84392 22880 -183494 -29554 -3948 72940 204498 -187745 -229980 -11466 108717 171133
19222 171133 -233227 -10768 148569 11355 -30004 -105382 -75513 51169 -67080 -146970 -22154
19210 -386077 64355 -561202 28466 -6197 -161368 -233225 -309520 -64364 49375 56549 246334
19199 246334 -103974 256105 -213032 -199555 129252 -141229 1344 -76798 -128906 -21841 -11011
19188 -11011 -166257 -137713 -71951 -11622 -284507 -98468 -247127 -27843 -284023 63264 138324
19177 138324 -169890 -266268 -4409 -191916 -451498 122292 350139 -145413 -257875 -260177
19167 -260177 -127284 -276826 -107905 223757 -120272 -105254 -164267 -38105 152759 -179030
19156 25588 21393 -195355 168323 -243183 -7761 -273800 29336 149767 134658 46687 32647
19145 32647 -257473 16070 143125 58965 -10030 221883 -107787 45204 1923 -102200 -64065
19134 -64065 -94595 51568 23182 58673 10414 72684 -225047 174096 61987 -4440 -106177
19123 -106177 -111735 -475619 -50129 -211888 -218124 -75981 -21453 206030 -249566 52182 -158929
19111 -341550 133376 -229292 262303 -619071 -67734 -185945 -83872 -65813 -346486 -80026
19100 -176117 11829 73648 -199317 8714 -92624 145422 224149 346189 -60211 96344 -105841
19088 92067 -211460 -105617 -314335 -238526 274058 -136677 -41877 -126095 287231 -311494
19077 -267331 101674 -198867 50165 321891 46238 310857 -170446 319233 -454753 -28823
19066 -188550 -353488 30462 -382230 280644 228541 102842 64479 -62103 -47577 213292
19055 -133945 -199231 -28635 -105297 -470190 -114343 6034 55992 247968 -9441 59368 -327515
19043 -421786 -271810 -78929 40416 -203169 54102 12218 68268 -201159 108034 -17243 -371433
19032 -371433 62839 -44161 -322531 -15304 -65684 5285 50061 -120431 31757 94181 -215646
19020 -236738 -110345 62757 -15295 159286 -250864 -251657 -130250 -51479 -444831 315731 -75633
19008 104775 22354 -100720 96327 127990 -150285 166125 80544 178907 -345462 -59974 -159116
18997 -159116 -186538 -147502 1355 38631 -184947 -312940 303372 -97594 -153476 149054 -16193
18985 -229296 -178646 342755 -92695 -146397 -114569 142178 -63535 247173 -29921 45066 45723
18974 45723 425927 519813 594345 426233 131015 490193 86465 149964 -201940 -291372 105433
18962 -199032 -169142 224734 441868 -277418 -47672 -604869 -254382 -289974 -229855 213762
18951 74706 -426679 57815 -271629 80740 -95775 56734 -50384 -328426 87772 224281 167636
18940 167636 226051 36305 39071 -113838 -65033 130322 -138262 117966 -98868 108786 135917
18929 135917 -85293 60125 -43098 -70358 -89098 -28567 1499 -162805 174812 53030 -236988
18917 57174 -212529 -66096 -34306 -554800 -51655 14935 113088 13631 663061 473021 222628
18905 181209 236675 -211797 -192855 -200523 -177355 -14809 236378 -211216 -92688 84354 185308
18894 185308 -338410 8305 -118178 -1348 -134484 -149385 -177057 -230653 -30366 299983 -314239
18882 78544 -219870 -156127 -109518 202178 -138979 -45095 -326020 -101092 -95645 126898 -86245
18870 -174627 -128261 -168148 -5899 73822 -146079 138819 81384 169667 -181063 163768 223872
18859 223872 36877 -424555 239175 -301470 -35463 140750 183181 -101795 -25744 7594 -171634
18847 -29165 3372 45006 -34638 -82366 -298914 109044 49873 -218680 -83941 -124251 133183
18835 35691 43154 147679 80238 -196549 405216 11687 6441 -118482 46496 285141 29204
18823 -305689 -336232 -36318 128985 -93258 -125487 -52053 265309 339648 74069 87871 226645
18812 226645 -84060 390709 190938 229427 226167 60787 62068 -94685 18885 262918 119804
18800 14527 -212212 -339420 -15530 -121424 -106994 -55459 -127225 -143558 -382349 7244 205364
18789 205364 -102398 -38511 -287423 2626 -162478 133288 327337 -63650 -253757 -80189
18778 -138339 140077 429529 -195764 -185482 -176665 -48243 109301 24344 -88775 -110939 -310728
18767 -310728 -117259 -293874 -1959 -184252 -209886 39971 -376338 73370 -138859 -29495 -49944
18756 -49944 -157156 86225 123713 4168 69130 -380969 -110883 -44076 128092 367839 -235237
18744 -100646 249874 -191133 32281 -159343 -7768 -16594 -99178 -57699 -38733 -297969 -16227
18732 -76967 -102218 -129431 -19239 53689 -202115 -382706 68237 -299875 -211202 157858 -39036
18720 -117481 -606642 117983 -459282 -222148 -153143 -367458 -190207 28253 -13285 42381
18709 -519 -321385 -120966 122770 -183153 122440 -310042 179073 -179625 -69701 -84715
18699 -84715 -335628 -95895 114228 -18584 68953 73309 -276877 -156385 -234488 74052 101770
18688 101770 -170463 87871 -78637 74918 -426340 838 -80520 4567 40840 114547 167427 -408865
18675 4095 21750 82953 -337185 -219847 -102210 91191 58462 116874 91562 -41304 203597
18663 52083 113517 9853 97850 -72015 126708 23796 -168199 232224 -210676 -47851 -354256
18652 -354256 -62455 -188127 291224 -42785 28987 94489 -141354 -415260 -420659 20218 -72348
18640 130109 -243134 -125870 -14857 -92758 178521 -127127 32356 -15329 197155 -123675
18629 -514487 111907 24790 -308022 66540 -223162 138637 61305 143186 25932 48245 14791
18617 -14207 -136586 33167 31785 -86896 72736 94453 -203170 650 -25407 14030 -20236 20392
18604 -219105 -105503 -65655 -182451 -180771 -137659 -98125 47400 -250988 -127556 59396 260328
18593 260328 170710 -72059 -172497 -236953 -298956 -126084 -100318 -198923 -393592 171766 80002
18581 48295 -38051 -272817 1089 -148385 -167956 -139585 144310 128028 16034 -57435 -238006
18570 -238006 -74592 -38290 16565 -283609 -193436 242728 -76196 -102933 -141511 -146013 -194931
18559 -194931 20534 -95291 -316914 219305 -68547 172679 75471 99456 -219577 -124956 -229342
18548 -229342 -62092 -48724 -136745 -164437 120452 -17036 -21050 113455 39299 -234930 17235
18536 126585 -2134 -229190 -62100 -31367 -141230 -4197 -33375 50241 232773 223564 54233
18524 -129531 -255448 -90727 -114995 -99918 81358 -9451 51780 15381 -26511 -231515 -249729
18513 -249729 26681 -14314 -164688 109501 -305989 -76983 -281061 -26203 -283705 -283250 273277
18501 -2180 104067 -130366 -131671 -25964 -13487 -149375 205435 -228977 107492 -148769 315206
18489 73989 85609 -185443 256236 30375 -41132 -166533 34792 -134682 75460 119632 -141157
18477 448828 -157454 -72837 -68289 -131550 -141996 -284962 122450 -8291 224687 52550 -184341
18465 -313383 -10764 233782 -57545 143066 4962 -191341 -27009 -106986 -28280 -39136 -67499
18454 -67499 16848 2164 -53292 -103805 107883 -3489 -117205 -14473 -169812 -242325 -35109
18442 -67685 -152045 -90772 5707 247407 235508 -81710 -313708 -16590 -10663 390493 47639
18430 -45536 52013 68851 106662 -3659 -198659 69191 48053 123890 -269847 53264 234639
18419 234639 163526 15443 128970 -377810 49933 142160 35519 -36775 52507 -180542 304337
18407 -37597 136043 -37065 7360 -40452 -168384 135213 -64856 257901 -17152 160325 -61806
18395 32385 -135284 209944 -132530 28569 -43073 41886 335957 109908 -211509 189708
18384 -294885 80130 -369713 47237 201355 -190196 90591 -192670 -271954 -101225 -238190
18374 -238190 -172405 152935 -258998 -30370 -200819 48953 -143772 40826 -299815 7475 -197321
18362 207672 -50459 259625 -124179 -217215 -64460 -2148 -20559 39000 -82636 168222 209633
18351 209633 28002 -332428 -4382 11207 148752 103754 -242006 85362 117288 -176526 -154701
18340 -154701 -59821 84883 -336404 -13547 111521 -118936 198454 82606 -86188 -58307 30052
18328 118144 -24872 108577 -107514 -64979 -454039 -158898 -87850 -299887 124421 -354259
18317 -260139 -197273 -96572 417601 -252975 -86595 39959 52043 -338033 -150379 223897
18306 17261 -53303 -198771 -52233 -197090 -277442 -9748 -173482 -80721 -32476 61100 183360
18295 183360 -125055 -229392 -409777 102850 130581 -139954 173219 84225 -7449 89729
18284 -227919 109861 193959 359566 -17347 -2221 282858 19502 -143084 -105826 -248894 251487
18272 -181173 56362 -222776 -189995 -40331 -85415 -114414 -63223 136438 213311 -92652 308293
18260 59883 -73743 -128998 200825 236103 -294621 272794 -121694 -32072 -83405 10904 -384428
18248 -46605 232816 -416083 71500 -218437 -243375 -120633 -25658 -297344 -21218 -4216 49032
18236 -252917 48471 -204359 40689 -309294 -69802 12299 245472 10111 -122650 -133165 231425
18224 -178100 -113282 -209135 16509 40017 -142090 35524 -10869 -99153 69540 -85410 -80009
18213 -80009 35326 99596 -102885 130890 67078 201543 56441 52821 -43144 85673 -145703
18201 30359 -281849 94123 -35119 -90374 -109908 -51783 -249400 -224485 60932 14011 -102704
18189 277449 -291895 207965 25848 -151487 -78234 -63814 92959 202144 16021 -38369 -13210
18177 74637 44457 113746 112343 150902 -16320 80244 -59064 -86060 95017 441848 -41882 370555
18164 42514 -27645 -43635 57620 -211344 -134277 254303 -89708 -54544 -48555 -268897 191635
18152 -229782 200172 -61992 73064 123238 -255084 236347 -234090 -98555 12646 232350
18142 232350 62958 103205 -65586 -69565 406187 66337 189726 -14756 -42149 254638 117469
18130 227023 -271759 -171255 97415 -181168 -56240 212015 175697 302960 -17698 37066
18119 115621 276418 -6697 -26854 -30400 200987 -497542 212187 -241712 10071 -249744 -85516
18107 -20495 -217073 168968 280927 -115635 253280 -74850 134306 6281 385859 116808
18096 129184 -151152 -201570 -50139 -4579 69834 -308500 -158120 -53887 -227973 -102540 -65638
18085 -65638 25059 14704 140954 77208 -196586 -106288 -283863 -147830 166175 -170099
18074 -323438 -190856 -118696 315244 -110675 -172874 -90619 -343464 132887 -49248 130537
18063 152381 -147358 72514 25886 -335193 -9428 187 -144791 -42907 329519 99349 52193
18052 52193 30287 153264 26802 -78940 -82681 -42535 93783 69936 11652 -272419 -127315
18040 -161457 170944 42343 -212567 157932 -71278 287738 156800 210614 29497 -71426
18029 39756 216895 152065 -123708 -192270 -25489 -251393 -42818 -82127 -113004 -6997 -58183
18018 -58183 -270124 258 61410 -34282 45356 33570 92177 -172466 33765 473403 86629
18006 -38841 111105 -71079 159409 145706 168545 97549 -113074 34787 -14269 61506 10407
17994 -250280 89620 136628 -127148 108312 -26001 -5355 -91761 -97320 -59130 -47025 224721
17982 136566 -4016 -131358 29380 -192694 -60532 -656 133622 63995 -16508 -145283 235563
17970 -66070 -61316 -156259 173133 42567 -126431 230146 59987 -157966 254236 367435 192796
17959 192796 -30460 -139436 -54042 -59134 196747 191973 -151866 -130300 5929 61138 -134251
17947 -38012 86005 249816 -198123 -159211 -397923 200425 -185135 -209958 -18723 40753 9664
17935 44785 8382 -212516 -6616 -72301 131186 140964 -78337 -92969 -101814 -147571 15926 143725
17923 143725 42820 -219164 -83868 -55394 212824 -113005 474071 174453 47404 7538 -176557
17911 128147 232277 -52205 -157051 172217 136596 -450258 245762 226653 -236272 78324
17900 -55944 151831 -95289 -42236 18841 140285 -207236 122217 1011 -25666 -248139 -26959
17888 -45778 -145642 -133855 -112035 53126 342528 153944 -39073 153933 -105504 -354000 123178
17876 4922 -12331 -11376 -529 14132 -116662 -93853 -68633 181252 26328 -22092 90283 21019
17863 410140 54493 127207 -187760 213569 95932 -305849 -5193 -77898 5770 -99652 73288
17851 -98721 149444 98324 233810 -63510 3690 -130555 -281810 -42457 -178729 -133468 390035
17839 21197 278078 -351999 134330 110295 -25261 -57302 -118656 -60295 28663 37077 29693
17828 29693 -229963 -27827 197417 -158599 97470 64328 202214 -82456 -14786 -201814 161110
17816 -339934 -2657 270915 255170 4671 167803 72333 328543 -285068 162243 175741 160521
17805 160521 -51265 -12137 350082 184984 112111 -116121 287777 -17068 174560 121661
17795 121661 -30284 32874 189287 372816 156000 -131278 -103031 201528 243666 249446 -126027
17783 -22803 160221 -100919 71317 136471 60023 16352 256993 136089 195782 336116 -44949
17771 110912 -151879 138456 20692 103976 24337 -68118 -137846 25201 206483 25833 -178011
17759 -98264 97099 -75383 365498 -163706 98688 226386 150009 24013 -72698 -35784 419536
17747 157511 88839 176101 57523 -118295 183915 467360 120382 219024 365633 64489
17736 -60331 367984 -116803 2142 -39236 292218 220010 -156932 190437 128980 -54997 -189522
17725 -189522 -110141 76396 -23613 210422 214076 182794 94894 -404365 419856 52064 -160455
17713 -125994 122799 371509 452268 67458 -48198 73008 215995 173353 -22327 184372 232568
17702 232568 -58700 -71129 48659 -117308 72720 -216097 319630 -116568 275529 -73151
17691 -9443 -229649 225868 600254 -56893 147477 261839 267132 221411 -156979 -126359 -160226
17680 -160226 -47802 6526 53934 81917 -25385 190842 107204 102143 -245618 -193613 100104
17668 62710 38096 329268 7118 61423 -74047 105267 176860 82082 134598 55438 243210
17657 243210 47627 36321 472987 -231266 545946 501434 91953 -131299 43861 -239235
17646 -208430 278449 116736 157331 276876 107459 142625 -153587 -112040 47026 280142
17636 280142 299577 -9157 232733 95391 66200 248909 -158859 160665 -183404 177925
17625 121925 347085 -268636 18945 -289053 400560 120818 43262 -3160 9827 27378 53592
17614 53592 114932 36226 175132 335321 -34564 184004 258776 -26560 163808 288620 277122
17603 277122 -332973 70326 59053 -361836 318240 345722 156922 -30765 337457 166054
17592 168208 1138 181332 282867 -31519 64490 48536 -22069 27521 307239 224150 255388
17581 255388 343072 202245 218961 -258175 250408 106537 366750 344498 322942 121379
17570 100176 275207 111077 42153 63609 -21977 346280 -14519 -161485 207047 -145383
17559 378 2085 139557 309312 65457 175524 284544 218721 210446 201520 93992 149460 289990
17547 289990 -183833 111439 -102447 287589 216324 87571 398393 168347 162006 54364
17536 215914 201572 380287 -2591 244665 164490 145454 268913 322153 238104 679273 913836
17525 913836 1177499 1269177 1120294 666700 638728 383948 505992 271672 211542 173971
17515 173971 328739 675566 775146 482986 852113 722530 1032438 1029678 871435 479647
17505 479647 222383 506392 545907 438944 99723 311155 -35684 426080 548271 416949
17495 416949 125212 131964 388032 447721 138071 182869 176594 122411 160139 120176 391134
17484 391134 232200 16515 713113 36755 324294 219576 470576 353240 425767 465713
17474 465713 230123 180405 284362 6529 136493 370285 421450 483417 445275 350444 176346
17463 176346 352319 584712 -167609 142568 460212 250427 6526 378986 153682 -59106
17452 356607 185744 160073 424558 470644 427984 139409 455905 375864 121379 297684
17442 297684 162327 244031 469576 215532 224783 324588 452414 331842 179236 99939
17432 99939 156576 194476 303175 350674 109302 268641 447791 240897 404234 182607
17421 498063 728589 783998 568826 531769 179190 231863 242576 615619 329055 235553
17411 235553 250352 46134 285221 359306 297807 339887 142750 268129 472061 291969
17401 291969 175606 318084 597339 59849 186099 -79650 163325 525735 142521 583005
17391 583005 109104 271890 83369 378977 200619 357789 495516 476580 187169 -51229
17380 202675 108352 -13411 245820 460911 288508 509426 146554 460326 202018 427947
17370 427947 308240 161937 147603 83087 282492 254196 257318 63954 363199 336582 138421
17358 344813 -12344 515078 391461 109069 153964 212574 83363 378890 59364 194433
17348 194433 131644 547297 190167 452599 238481 493849 230580 497965 507752 187729
17337 143023 859 526236 320253 217419 121868 435300 372976 393392 338764 482575 359475
17326 359475 156142 207159 340833 124727 193996 621784 106631 568840 404081 345339
17316 345339 367393 329825 313357 450675 -93937 229668 273429 646197 69452 348425 255411
17305 255411 10463 434726 147511 611380 7112 422754 341561 310708 381408 600578 76908
17293 329804 441821 461663 215820 646613 64366 266550 323507 354598 222665 -31801
17282 213759 497224 229063 527168 271595 328366 231388 -177772 264138 390884 -55929
17271 396474 306373 494214 242338 178385 677316 370922 496059 340454 516720 327584
17261 327584 650034 265616 236249 462642 87604 466768 145567 643782 549441 364036
17251 364036 486629 454156 533803 323577 256731 342753 338127 804487 466132 533296 56528
17239 501210 433737 309488 275899 45026 498402 355055 383317 476288 190346 514162
17229 514162 492119 184450 240900 646650 251868 146314 584798 269334 303095 433569
17219 433569 238018 193228 499391 305301 626863 609931 334752 381384 483282 306673
17209 306673 445064 449153 444585 653355 658215 170391 448567 663967 301140 331939 295837
17198 295837 490647 559406 599219 666502 401910 408135 664502 396549 318718 532677 566174
17187 566174 410452 184086 626181 415433 544421 401664 249803 567629 428030 322034
17177 322034 580475 423148 495222 635035 637072 657835 533989 576148 405015 696082
17167 696082 535740 300806 667306 669933 515083 680911 512718 476684 481008 454885 546870
17156 546870 722825 464859 825017 400121 596493 683363 364031 638325 749063 477774
17146 477774 794325 790022 494011 317535 1014281 536575 735505 512376 578939 470189
17136 470189 587332 670392 399634 525846 643076 994966 483865 691789 646250 987438
17126 987438 851709 615066 390257 811512 697338 846846 762888 725890 295215 647798
17116 647798 788813 471109 992093 662693 560283 690158 723152 879076 841190 556033
17106 556033 773181 581987 753124 663572 584502 660811 1004083 524603 660907 703340
17096 703340 775653 631803 425431 1178680 726791 1030255 613377 520686 851110 827544
17086 827544 811459 1061481 435360 871346 895369 1090696 677361 720557 988170 1108162
17076 1108162 705612 792925 804008 999331 995866 649314 1110462 1066278 891777 900578 933680
17065 933680 831217 863265 876304 1113483 1193427 913251 1200283 1073002 1111515 853110
17055 853110 1011900 1001322 1143750 820527 1103934 735927 909578 1086088 1277426 749464
17045 749464 886551 1064712 1364416 1085788 1160524 994518 1094956 1223214 977640 930567
17035 930567 1005264 1130391 961652 1225600 835706 1175210 1226781 1250597 1154494 1149634 1287682
17024 1287682 1079060 969013 1525807 1451812 1127601 1358873 1050990 1126324 1579158 1127104
17014 1127104 1212174 1262201 1039998 1473730 1322037 1289533 1125748 1434931 1324501 1230682
17004 1230682 1627270 1622623 1327419 1353382 1341841 1445458 1422417 1352634 1590775 1280354
16994 1280354 1477882 1294747 1347926 1803053 1472103 1509467 1435356 1402555 1547176 1397109
16984 1397109 1515764 2003847 1292718 1459636 1543866 1326658 1630908 1732661 1996166 1837176
16974 1837176 1696596 1789589 1690848 1580941 1780017 1998431 1629613 1827442 1863902 1732849
16964 1732849 2053626 1931121 1923812 1911875 1800354 2005926 1838873 2185296 1974491 1857662
16954 1857662 2048615 1890541 2037958 1821367 2130819 2140285 1978093 2447717 2038489 2082697
16944 2082697 2249435 2357984 2126077 2358881 1926274 2362208 2330814 2304344 2250485 2337683
16934 2337683 2255049 2405986 2614455 2632907 2733088 2627396 2507541 2465481 2377818 2583154
16924 2583154 2637694 2302648 2452105 2816909 2990029 2501819 2867495 2828936 2841153 2626127
16914 2626127 3130919 3101438 2718281 2817005 3061160 2941266 3127109 2965430 3037159 3211651
16904 3211651 3084642 3314677 3396771 3308652 3464294 3396126 3654578 3445364 3370015 3464776
16894 3464776 3843483 3520004 3692535 3705506 4002193 3748797 3680954 3897542 4346698 3969447
16884 3969447 4109474 4137970 4271888 4236257 4302308 4061541 4239143 4412869 4530998 4657273
16874 4657273 4768567 4754059 4761533 4561926 4522181 4768855 4826310 4749258 5179812 5116197 5076554
16863 5076554 5316862 5132191 5401956 5475943 5495210 5889824 5698271 6096704 6058139 5723957
16853 5723957 6160206 5865891 6252790 6578220 6516068 6932640 6721477 6532720 6947781 7022754
16843 7022754 7044321 7301612 7402140 7355382 7688822 7482195 7816522 8225986 8162684 8315451
16833 8315451 8350120 8421900 8816832 8866135 8748424 8811056 9130792 9385429 9117099 9743790
16823 9743790 10037624 9788157 10670436 10830853 10740969 10847750 11168958 11338994 11504639 12087479
16813 12087479 12176270 12171126 12610051 12762071 12868923 13229830 13470421 13688570 14157429 14442894
16803 14442894 14439735 15138630 15510706 15571070 16344642 16595723 16792708 17367127 17704715 17987238
16793 17987238 18228946 18940045 19282599 19832346 20177770 20690344 21107664 21855197 22389119
16784 22389119 22604934 23912515 23934096 24646255 25374737 26186252 26723921 27929061 28128707
16775 28128707 29127329 29839488 30597835 31460752 32315302 33222905 34269869 35049512 36312881
16766 36312881 37539019 38329696 39726274 40609108 41324478 43447087 44461372 45719517
16758 45719517 47171411 48665067 49863922 51292313 52876453 54613725 55963976 57519887
16750 57519887 59134952 61169447 62423917 64716465 66209823 68025566 69831309 71713204
16742 71713204 73351833 75329716 77065217 78754369 80755622 82112221 83779783 85558359
16734 85558359 87180577 88771644 89759421 90899209 92281825 93109447 93732540 94570398 95118512
16725 95118512 95604591 95710497 95822252 95922580 95676232 95339483 94323713 93854555 92699805
16716 92699805 91716948 91043914 89401223 88136767 86542916 85003544 83741845 81987285
16708 81987285 79925145 78417487 76841965 74848637 73035218 71149951 69126993 67098410
16700 67098410 65454347 63894603 62194044 60327832 58628731 56965116 55647090 53856799
16692 53856799 51931714 50533566 49281707 47812181 46512136 45059748 43785982 42717796
16684 42717796 41459527 40092239 39006684 37807113 36867310 35777589 34511500 33759001
16676 33759001 32712719 31780952 31159874 30013534 29487101 28351390 27956257 27473709 26738821
16667 26738821 26050969 24972643 24330320 23885193 22923300 22929418 22027716 21458242 20957087
16658 20957087 20844504 20171245 19687249 18981230 18421175 18202002 18051579 17289540 16838195
16649 16838195 16900222 16330760 16267749 15662370 15094340 15164949 14778430 14313003 13870456 13767104
16639 13767104 13778893 12934929 12864202 12483116 12500826 12063157 12131841 11890409 11719474 11302198
16629 11302198 11292702 10867665 10552485 10659965 9970419 10265659 9912478 9804433 9489828 9362387
16619 9362387 9395385 8937911 8783609 8674212 8403103 8436645 8422104 8044866 8113467 7948452
16609 7948452 7798124 7923436 7566592 7422827 7169250 6986435 7089247 6918413 6843475 7026001
16599 7026001 6701789 6483118 6394627 6301809 6342718 6294606 6146801 5803513 5886318 5956645
16589 5956645 6093775 5447334 5602272 5476165 5621575 5500814 5400937 5305751 5071563 4967378
16579 4967378 5226678 4982478 5001553 4877886 5022018 4709201 4629582 4550022 4581153 4872056
16569 4872056 4546624 4256885 4384943 4400225 4233338 4218659 4117502 3791048 4160754 3876859
16559 3876859 4131124 3936969 4117579 3842596 3707463 3745052 3538645 3673899 3575359 3696830
16549 3696830 3392230 3519665 3413809 3541360 3247662 3386952 3480025 3157104 3262215 3241981
16539 3241981 3029631 3267863 3080840 3298956 2795486 3264871 3234472 3276637 3127754 2852299
16529 2852299 2725198 2849108 2640725 2617355 2933140 2328576 2553116 2815620 2542690 2681982
16519 2681982 2483800 2262380 2385178 2527232 2704713 2446617 2656355 2790023 2523900
16510 2523900 2070002 2424361 2140024 2358369 2294612 2381450 2078614 2237187 2429134 2096831
16500 2096831 1901980 1859860 2168686 2297934 2296557 1978725 2344196 2452950 1899456 2186938
16490 2186938 2046109 1906976 1922793 2083739 2166747 2109162 1665976 1840605 1628833 2095874
16480 2095874 1889160 2121575 2107058 1951514 1814608 1816993 1965227 1722671 1571985 1575114
16470 1575114 1742949 1396780 1696965 1452662 1670971 1755005 1686867 1641774 1794788 1686684
16460 1686684 1511841 1599403 1541992 1361003 1549239 1544511 1590909 1598326 1246675 1310393 1709472
16449 1709472 1574040 1385525 1216383 1296561 1254156 1289554 1289007 1570898 1298511 1397870 1171857
16438 1171857 1277203 1279050 1145399 1021278 1652228 1138504 1413336 1132610 1343416 1497580
16428 1497580 1162041 1278485 1116599 1062209 892671 1186945 1485089 1171335 1211610 1341794
16418 1341794 1247441 1259598 1579740 1155230 1233425 1004868 1165712 1148573 1127162 1223750
16408 1223750 1176748 1010822 1102430 1062360 1080013 1215533 728610 1373112 1050196 1054003
16398 1054003 1035697 1024522 1172173 890732 769010 949813 1105050 1027239 1170437 766689
16388 766689 917353 973739 817744 889177 914687 994476 738769 1089127 986401 944478
16378 944478 998908 917530 1259049 804079 395338 769979 790073 671447 1099234 964216
16368 964216 482410 1068109 688999 797899 1050783 645914 851037 645465 486709 460407
16358 460407 858166 804350 808642 693294 666603 1032862 912259 847167 524640 692239
16348 692239 861944 1022668 670248 1051948 693992 746559 707044 735648 930476 557354
16338 557354 660217 673138 599423 712191 518450 654022 432154 571355 542577 512098
16328 512098 675195 369547 378004 679797 700574 430967 478446 827186 708774 932953
16318 932953 689934 699875 566415 434620 359072 638868 278550 627734 788242 520574
16308 520574 577489 539760 536404 221363 570876 664107 573674 428864 380802 746375 506562
16297 506562 288292 526786 640494 445613 495944 190171 418625 696307 814141 441534
16287 441534 690341 382818 820788 726988 386946 229893 552889 685591 600182 508229
16277 508229 427573 433959 598399 630756 659985 250806 285103 230150 349093 687212 604139
16266 604139 505950 311273 543874 563865 76427 230409 283693 156148 73538 335256
16256 335256 489802 422972 173313 672954 500582 612342 213978 487975 478946 451141
16246 451141 118596 732106 487335 488606 457098 628801 648117 496436 179583 480754
16236 480754 575312 267130 309927 325469 323439 573471 605155 266577 354841 320678 250046
16225 250046 347865 286693 349759 282838 321380 627746 355447 328938 371363 446261 313245
16214 313245 407778 166258 460866 185412 232716 274514 405332 209100 192819 299819
16204 299819 330101 457366 283275 90178 657557 171673 175150 168919 568549 137691 357077
16193 357077 544285 246674 304190 146680 -106025 501667 703396 319726 108993 433433
16183 433433 527255 29538 305537 99587 328287 245747 608444 142749 268139 83346
16172 147818 431544 260440 54149 397208 559185 371878 438359 104838 284441 351872
16162 351872 534325 179976 219670 91847 475398 223817 258318 113601 330740 193298
16152 193298 410134 276518 -64569 403900 55334 176197 168628 308978 427756 488234
16142 488234 172926 231011 200934 95335 339897 312665 192281 -184630 449989 48409
16131 -7270 216012 436065 348255 66505 3624 221232 120564 -73072 66440 303356 -19437
16119 -29228 139112 204242 269736 362143 417052 450620 -59882 301974 -30081 297382 244195
16108 244195 242297 17241 86197 -67941 116824 359214 142800 -125533 259764 63861 213919
16097 213919 386929 485377 359686 320910 316401 -80009 -26338 108709 302787 9625 393902
16086 393902 50810 246254 224837 -126509 29182 -197516 -62156 -183471 252698 75831
16075 226628 293226 36162 325224 56644 -43623 97915 210354 491579 221347 -59777 81992
16063 192007 -29386 -37168 228945 177240 -215742 319320 416080 434483 266825 -8690 127051
16051 -58236 26066 27847 77170 351724 26109 304799 -122928 257463 -139255 157406 -58957
16039 36419 214428 -36823 330979 129178 126661 149963 213118 39899 155088 308577 79665
16027 109301 81501 -69647 -8462 340212 -144134 -33145 321276 243316 6378 52938 268426
16016 268426 -81129 478584 130200 -13931 88737 -56711 55518 272410 -65134 147968 177640
16005 177640 68927 -296442 34055 10596 116147 144674 172318 -21579 213021 4891 -83680
15993 -34898 244917 107670 278730 371816 624854 624692 1059587 1207985 1326675 1418730 1099611
15982 1099611 896923 670752 281195 210407 167210 484809 336137 189747 -65975 206724
15971 127732 -113502 347706 96542 -103754 -91332 -128474 -29955 132244 -24357 -18477 60427
15959 -95523 325435 -100042 -53260 116310 66398 -135326 -85198 192518 173681 146727 -142348
15947 142249 -174619 -466510 -200203 -30605 -84330 -132610 166648 -258186 -110330 -131554
15937 -131554 224028 343968 222563 -198441 -169844 42589 -173771 19247 -115751 15383
15926 61413 -70636 101884 258094 -187811 -300283 136227 -312950 -143548 23094 55964
15916 55964 -2054 192317 -58577 109733 -62152 151355 -133869 -15248 78534 20940 -113404
15904 -110808 -278919 -143159 -6996 46860 44668 10420 119322 309414 -20635 174387 357625
15893 357625 -32524 -125510 82526 8000 -112141 147804 -99194 -86067 -93831 -47891 8302 36501
15881 36501 166596 218092 189715 -233458 -51242 308676 -99700 -106098 100463 -141776 105529
15869 226303 359365 63178 21648 129724 -177685 -46519 147608 61560 41794 -288131
15858 -226399 100468 27479 -9286 -175532 -362559 -86367 130020 -109374 395398 -16397
15847 186405 -304275 -167164 34736 53777 -126080 -40422 -68815 370241 151227 -9458 17780
15835 165478 70670 263281 -45943 299803 -197269 134418 56114 -108016 217227 -200535
15824 18505 -48689 -261700 94645 -274310 138246 266951 147816 74457 108305 -82752 61237
15812 573305 87311 9976 103925 17493 2862 64370 207021 -42823 126444 152680 65207
15800 -146918 147486 -56130 173583 -274918 -33234 -156573 -69457 185722 -460575 -156543
15789 101 49008 -39515 73402 62234 176645 -200352 6836 63606 -187879 213499 190572
15778 190572 139803 -225351 -56882 -97231 -171609 101064 -164902 -138529 115513 -210175
15767 347860 53317 -459062 -4540 -310987 -234544 -120358 -16591 8288 -182171 -184728 -43520
15755 14329 24093 152285 -131646 -45494 -137152 134675 -52452 86319 -35975 -159191 -45940
15743 -23291 276392 264994 100747 -96033 -54417 178701 54180 99322 -103702 46559 -167904
15731 -196257 159324 8726 -16806 -200247 -14418 158580 -525503 133272 92654 -300571
15720 -69941 -218089 -133217 -28155 261303 215029 -410124 130235 120176 75117 -379810 132402
15708 190957 -41858 172214 88705 106361 -159876 -22962 -55951 100834 -44037 -186605 113448
15696 26855 168405 85034 36264 254343 101015 -28441 236198 186500 -82954 163828 81453
15684 57122 -14305 -367858 215123 19976 -131178 -82041 -552185 14928 14652 -201564 49348
15672 -318657 -15761 260470 -7243 -129301 -50120 -99097 167544 -144970 -166053 164284 245502
15661 245502 335111 80291 -211594 -84686 255999 -41804 -124386 -154068 -95023 172946 125102
15650 125102 -175431 141112 28562 -149008 15791 -183558 300793 -59805 359588 85518
15639 209084 -137409 3622 -109158 -183851 146222 -79367 338842 66422 -1183 -174250 89869
15627 -27932 -236922 6104 -240853 -160922 45637 336711 248465 -121023 -213261 -93435 163252
15615 256928 151804 91481 -221069 -138920 -24952 -241724 -177955 121423 86129 -8271 41389
15603 -208177 291470 46937 193667 45467 268873 142839 -110075 -98806 147277 -34235
15592 -226394 -32478 -9937 -48516 -8875 93479 25883 -108098 -145803 -358902 223566 327780
15581 327780 -125321 -122443 -247963 -406800 -30702 -22720 107006 214856 23617 -11670 -254915
15570 -254915 -235194 -352841 -193420 -45811 351568 -45669 205456 169651 9529 -156814 64456
15558 -265186 -152901 6230 -112227 12464 -324183 21234 -31384 -209943 -436343 51853 -19182
15546 -103525 -189254 -25039 136801 -139470 112411 81094 -138878 -136849 46635 20334 9167
15534 219571 -124119 -25963 -169042 7775 -70513 136710 -217520 -6960 173867 -154086 126502
15522 247487 43490 98195 -171446 194276 280913 158009 209470 274970 228595 152493 211245
15511 211245 345457 227964 -120611 -396941 15582 98383 233290 42614 161636 81239
15501 81239 -37661 -55058 210264 200430 58155 149557 168714 155469 -70540 -8054 295274 175447
15489 175447 -322095 457689 232157 11411 230532 291272 14033 -1052 101453 253907
15479 253907 -36876 274150 370621 392401 482471 1207728 377264 664325 118453 94492
15469 94492 132242 -97931 -51997 156473 -313304 -75696 -7497 12264 -73653 -104634 -132295
15458 -132295 -7831 334945 63900 -329431 295031 -84633 492578 -134757 150311 255324
15448 255324 263681 186435 -151452 78454 449421 696027 1457735 1264990 1370009 893347
15438 893347 -2016 388728 -309948 -79275 162069 -147180 -119968 -143170 -96469 -121441 -288868
15427 -288868 201116 192734 59108 293388 161588 -272538 50483 229700 11385 89123 -27395
15415 -28192 78224 -192975 -370162 10744 -329050 -885 -33158 163859 54087 -134167 -48743
15403 130169 143830 -359600 -105870 65631 77680 -19060 151636 -48653 -118479 -5892 89477
15391 179985 -99477 58671 -82683 -95142 193876 -81524 -36343 58545 -190679 243918 48736
15379 -178310 -81348 151862 85027 182243 261728 184612 237365 333750 173053 148402 35598
15367 337664 78578 65400 -31071 106430 327208 327876 126947 188351 102505 58473 -84284
15355 142139 540004 139327 83832 496099 444474 258023 512530 -54182 -160532 147593
15344 65517 413975 -48721 324791 401002 295217 398312 287314 -57172 68465 179874
15334 179874 155763 282577 -139318 284453 -5869 -67887 261977 -35229 96414 74934 407096
15323 407096 434552 35424 159108 -50660 -158788 23657 162585 362945 200294 -155057
15312 272714 235653 118227 168778 -39056 501554 -197734 138205 -237637 388115 242109
15302 242109 -151348 4441 -84418 345976 -64917 -24226 111888 28733 205664 -46635 68050
15290 90768 98540 -45931 -226940 289525 -70235 -246920 -90162 91663 21352 258821 335254
15279 335254 -55493 76253 153568 63700 -43209 -139464 -11376 57316 14428 -69296 -28850
15267 -334275 208657 -39358 274174 40865 38283 345472 -29423 -218901 281839 -126539
15256 111202 -4982 -280008 -110110 -155146 61418 95971 70843 440200 -118917 295609 251978
15245 251978 -57203 335315 455805 1673957 1595442 1123592 1910209 1070149 94449 -98218
15234 -6149 -185258 58612 21624 68043 -24029 124721 4721 419806 135340 44277 428088
15223 428088 178048 -3812 -30068 333059 178939 97044 382604 -198848 134658 230115
15213 230115 144995 221428 52680 397859 117040 -9210 126512 232762 490885 194986
15202 19924 -27292 25510 55401 -113172 -128 -68914 -83795 132050 177266 -114326 -20987
15190 124183 -120915 -127239 220023 -27715 -163253 267881 264914 -60564 -147119 -83184 50212
15178 8053 -137955 111111 -23029 255959 284328 -228625 61964 220125 307911 -18666 86274
15166 101574 286468 -292414 -183924 158651 -67227 -13188 76245 -149279 172719 -122789
15155 334423 135765 -50463 154603 322248 32056 346143 -99375 192636 196634 56148 96109
15144 96109 -62969 98237 124515 341141 90133 146329 100939 180261 70501 -8639 44932 534598
15132 534598 32679 5806 -40222 14633 115589 86369 220428 322198 221442 -145314 351380
15120 158958 531007 206461 323206 -126955 426120 320159 317546 30344 95242 85274 403830
15109 403830 -227093 -118829 90845 63315 148622 190737 90562 20331 -57999 86333 52151
15098 52151 -151885 230732 -298120 301616 -21801 90185 -31892 192446 223887 110392
15087 -108983 249361 57863 -57966 94149 295917 292614 248876 42147 124346 379150 -170923
15075 160909 -41608 426147 332144 71966 331173 63128 -97232 155710 85774 371659 -7816
15063 -76909 237982 36609 78596 189484 212307 264515 124615 513177 -36011 285718 320522
15052 320522 277412 59277 493204 339934 439121 436352 353923 368754 448951 124800 -210801
15040 473861 567148 287626 70441 271488 318805 371472 324640 428855 538141 867297
15030 867297 742671 695214 822278 1005097 150401 577338 627534 402030 504575 426110
15020 426110 609183 185505 648408 451958 345885 548074 525075 326211 298469 29676
15009 493404 509642 392573 348314 433405 210458 231367 -4580 401373 449986 620670 446561
14998 446561 383578 415828 278169 324729 427747 679409 400614 550095 116854 555847
14988 555847 519753 512161 299669 481574 693939 613565 422701 842335 981321 875091
14978 875091 762393 859938 305723 355003 325600 383082 546211 490549 716418 561526
14968 561526 326121 485937 40838 465270 237216 476573 253119 396168 30434 11790
14957 18402 183246 280835 595408 238082 692500 176772 512671 211348 499765 61427
14946 47936 250467 638360 862143 543033 46251 497472 493312 769817 212317 437841
14936 437841 135642 497477 500026 647782 717224 1056049 1315595 1207094 1086223 1270090
14926 1270090 1549246 1787963 1483406 1615794 1350337 1315943 1585127 1816072 2466593 2304898
14916 2304898 2057339 1604330 1435767 1254226 665739 810577 479505 590866 372608
14907 372608 351862 442918 411773 356157 495412 123886 158055 310516 522739 236388
14896 434194 333260 327437 257367 273911 247193 529494 244196 578148 435532 662653
14886 662653 809263 875139 876998 844053 734795 890660 802558 599358 777178 562391
14876 562391 620729 514964 369323 509958 433499 438622 586517 466241 543352 1020804
14866 1020804 609370 517330 872846 731658 623236 413154 288684 263974 213901 345918
14856 345918 437565 397298 533834 438280 567144 363019 554112 687537 538309 509680
14846 509680 636323 854659 909809 841696 1124936 972072 964529 621059 421163 556754
14836 556754 703785 631879 748422 221396 553512 606895 533413 517073 375025 293444
14826 293444 560887 708254 731261 452907 646515 802522 516466 655091 511831 361734
14816 361734 644061 645657 367074 727695 597903 343510 997528 832822 720432 1253784
14806 1253784 1234418 946122 472109 752161 606107 446636 724705 480808 441694 495912
14796 495912 292320 575561 669115 370949 617240 341151 450582 589914 895625 634590
14786 634590 894653 395453 469076 921081 607063 697005 828891 790252 642027 1007693
14776 1007693 1026564 904100 862982 864283 659195 823312 683908 787789 510484 743845
14766 743845 535103 531889 548436 719646 575384 703793 694307 238652 178746 592953 487754
14755 487754 873478 662957 565857 217284 653226 543108 741107 747238 635531 884543
14745 884543 1047452 600665 476365 562653 907036 954045 738065 738908 844255 680935
14735 680935 623712 1059898 1082916 871722 1214884 1390137 1699829 1882347 2248368 1721251
14725 1721251 1326375 1146635 763569 711361 785429 581233 817568 868026 701936 677000
14715 677000 788635 763438 886278 878950 707230 733166 907415 1203678 1125285 1025356 1141998
14704 1141998 1143040 1753315 1920148 1999149 1811928 1310057 1121611 1063120 760149 997141
14694 997141 1056782 666235 826917 819011 629247 834901 736206 696677 891997 959596 741643
14683 741643 691979 993301 1050708 871337 924184 926205 567925 913605 1172797 869447
14673 869447 1060011 1011854 1081175 663824 690223 931514 941426 1072831 1131960 756583 726030
14662 726030 800912 784599 899700 947969 1137568 1209566 953412 1557245 1145598 1168132
14652 1168132 1377133 1243323 1205407 962301 1122929 1058269 894616 1460166 1053337 1058174
14642 1058174 1035789 1199433 1000302 906913 1175104 1265059 1132673 1150046 1038705 1049539
14632 1049539 1404617 1107076 830967 948788 1163208 885741 1595826 1248536 1540865
14623 1540865 1406694 1133616 1616924 1081230 1066094 1576248 1415165 964780 1631064 1549781
14613 1549781 1025813 1494757 1285724 1113626 1278469 1255633 1503597 1394006 1306957 1278562
14603 1278562 1298445 1696556 1402854 1423117 1400913 1458952 1515016 1708389 1403778 1723004
14593 1723004 1934268 1603104 1679127 1785775 1718953 1580248 1807743 1852468 1635058 1748828
14583 1748828 1651946 1653053 1449819 1651404 1854790 1806072 1767336 1834585 1973068 2062731 1590171
14572 1590171 1893099 1800612 2034870 2355360 2127911 2443438 2093628 2254847 2099321 2317652
14562 2317652 2465404 2429605 2501572 2872747 2898165 2819963 3365982 2825007 3472176 3441261
14552 3441261 3997384 4231908 5175147 6541630 9643309 18073421 40577167 45941490
14544 45941490 18619003 6667373 2942064 2438884 2066338 2388049 3649713 5494350
14536 5494350 3439363 2167917 1591010 1664349 2056718 1903664 2146490 1820419 2048913
14527 2048913 2196075 1976071 2073705 2387115 2224669 2246519 2223224 2247909 2400954 2380186
14517 2380186 2510904 2360524 2340873 2323904 2391580 2440030 2430494 2504750 2484674 2576809 2497608
14506 2497608 2822030 2847823 3028515 2602776 2986422 2783519 2696358 3021534 2919575 3007609
14496 3007609 2981069 3071476 3045606 3209438 3161609 3066554 3155171 2947019 3095246 3221988
14486 3221988 3278931 3187203 3466544 3511710 3549461 3490979 3671961 3515703 3617294 3493198
14476 3493198 3828345 3588331 3631847 3891554 3735525 4049136 3784742 3927524 4090252 4073883
14466 4073883 4267343 4410378 4114250 4081981 4268430 4256593 4183120 4222251 4494200 4678095
14456 4678095 4832225 4454586 4376066 4694956 4763328 4953106 4955385 4925978 5073908 4742367
14446 4742367 5187398 5137670 5403888 5288673 5242158 5303522 5555122 5558428 5998691 5641728
14436 5641728 5875291 5720938 6078740 6100087 6003214 6418800 6245127 6452015 6344526 6671179
14426 6671179 6981327 6876238 7230525 7460243 7690560 7906295 7527960 7715780 7908629
14417 7908629 7745063 7653698 8040461 8112060 8178818 8264980 8184206 8656076 8832813 8876685
14407 8876685 9185491 9331623 9412243 9291859 9426761 9665780 9607349 9536018 10318514 10032934
14397 10032934 10102353 10129778 10578228 10801317 10941401 11230253 11309736 11755011 11703207 11971714
14387 11971714 12220344 12837913 12771590 12935697 13378835 13303694 13451776 13660095 13809356 14149912
14377 14149912 14183092 14649901 14800613 15536857 15217266 15996959 16580938 16410759 17485263
14368 17485263 17436529 17816973 17992143 18232305 18898020 19248262 19528002 19832579 20048633
14359 20048633 20776744 21504308 21914932 22516227 22880386 23303872 23501219 24247424 24886540
14350 24886540 25454389 26037649 26924230 27693251 27917709 29327567 29365966 30791466 31381424
14341 31381424 32057379 33044982 33923910 34798257 36172532 36807673 37957308 39153222 40202381
14332 40202381 41320692 43003708 44171425 45830437 47048668 48646008 50402100 52094888
14324 52094888 53809851 55717831 57822483 59558420 61882647 63812305 66685822 68713904
14316 68713904 71660910 74221294 76923325 80032754 83419487 86910147 90698936 94705854
14308 94705854 98573307 103330627 107686295 112614538 117549854 123350599 129253851 135580458
14300 135580458 141988708 148907522 156783033 164159548 171988261 180968877 190196485 199353239
14292 199353239 209942530 220646113 232091500 243775250 256056990 269225655 282497445
14285 282497445 296321547 311074795 324931490 339788959 354338190 368683205 382766566
14278 382766566 396392708 408728509 420768826 431290076 440248011 447123799 450255884
14271 450255884 449250786 448329798 446074127 441878693 437970541 432313043 422972341 410838899
14263 410838899 397410541 382728093 367815480 351901925 336415168 320851060 305595149
14256 305595149 290449184 276106508 262072332 248940361 236216632 224050000 212524482
14249 212524482 201760592 192492757 183574109 174314464 165504900 157968783 150266600 143036327
14241 143036327 136212274 130107522 123823961 118854537 113712099 108515339 103827461 99591028
14233 99591028 95249219 91450318 88591870 84667294 80970763 78192843 75189231 71987808
14225 71987808 69626580 66853461 64539850 62178457 60372162 58609264 56222338 54166697
14217 54166697 52468509 50705208 49378442 47849079 46563081 44974726 43574500 42174960
14209 42174960 40949140 40151859 39038432 38152138 36945097 35910651 34191349 33554187
14201 33554187 32982350 32214615 31068677 30158913 29450003 28745296 27954991 27610834 26654458
14192 26654458 26220982 25103864 24610574 24226311 23721118 23211115 22499583 21896374 21776911
14183 21776911 21292939 20599175 20116427 19745406 19020064 19137799 18939404 18411109 17682028
14174 17682028 17614301 17252776 16716084 16354774 16260243 15903819 15298421 15279172 15172835 14427335
14164 14427335 14308133 14175613 13870384 13732503 13729210 13362274 12906649 12974320 12645026 12124000
14154 12124000 12186532 11972603 11880935 11625163 11558392 11082589 10802421 10820965 10561173 10401217
14144 10401217 10373758 10236602 10258029 9842276 9626007 9751062 9257781 9482953 8926563 8896399
14134 8896399 8854220 8717077 8544922 8709680 8482578 8280658 8331176 7965223 8047350 7583921
14124 7583921 7536928 7959081 7695155 7401177 6985630 7148457 7092259 6953458 7187813 6679384
14114 6679384 6638078 6690068 6880729 6385084 6606695 6398457 6497841 6417612 6238790 5909704
14104 5909704 6086828 5955479 6080988 6025460 5636008 5567375 5546856 5429925 5650911 5352387
14094 5352387 5494740 5606036 5468467 5343619 5289741 5099284 5340796 5131825 4644219 5067313
14084 5067313 4994857 5060374 4672862 4682505 4706507 4549485 4396639 4534185 4556352 4221249
14074 4221249 4315216 4332446 4522400 4153075 3843253 3893302 3908219 4132455 3963993 4354381
14064 4354381 4080633 4015929 4146980 4156153 4198823 4020476 3957431 3863131 3789056 4050766 3708886
14053 3708886 3530911 3544834 3585111 3573051 3438881 3355123 3058435 3270964 3268121 3109041
14043 3109041 3420293 3290441 3094999 3114697 2928447 2960767 3004149 2752504 3243804 2848972
14033 2848972 2818286 2965171 3035507 3095675 2943083 2812359 2880106 3016527 2692896 2279839
14023 2279839 2451663 2525419 2797940 2546122 2627728 2487479 2574860 2099992 2325794 2316985
14013 2316985 2685043 2151982 2220970 2504677 2304981 2252361 2456429 2457602 2183392 2064893
14003 2064893 2164243 1948337 2205459 2055670 2207656 2034326 1806191 2015659 1558009 2002426
13993 2002426 1930914 2113374 2133956 2451176 2452704 4445669 10359175 28307343 49999121
13984 49999121 28336588 13058632 7480109 5098276 4196763 3532157 3673264 3088434
13976 3088434 2573219 2560820 2676315 2223951 2539894 2331784 2437924 2422760 1980347 2217999
13966 2217999 2199054 2031592 2099839 1977559 1830464 1919022 2124147 1788889 2255088 1651800
13956 1651800 2133077 1807578 2090508 1940342 1624902 1993475 1766278 1858461 1442265 1821316
13946 1821316 1812693 1647471 1931236 1649386 1694457 1922435 1721924 1784668 1627641 1564310
13936 1564310 1591803 1993374 1422352 1575989 1543661 1510724 1747787 1525827 1512469 1276599
13926 1276599 1220057 1184631 1674198 1639684 1474876 1440975 1365708 1299542 1880112 1315788
13916 1315788 1767284 1199687 1170247 1230548 1393780 1175823 1361790 1402480 1473611 1348743
13906 1348743 1303664 1102642 1179644 1405470 1105046 1214276 1108494 994571 1199541 1115105
13896 1115105 1540307 1302125 939255 1246085 1349947 1407697 1305246 1239352 705892 1218254
13886 1218254 1077283 1136443 947180 1355666 1006467 1068798 1356150 1048957 1122857 1008750
13876 1008750 1042002 1259023 1058611 1259754 1161056 1182361 734524 873313 1120300 735068
13866 735068 1240087 995979 1049063 1080569 889026 1104405 1079550 709370 1080371 850611
13856 850611 922237 1026278 1042936 1091784 841820 867018 1012699 726063 648967 1128168
13846 1128168 1096165 996393 850894 774678 1107990 1151343 720397 968097 1368322 944449
13836 944449 1346818 948785 900229 883085 939635 851261 770200 655871 623327 952200 820887
13825 820887 623918 1035809 813142 785084 934186 664001 880180 715944 890790 819799
13815 819799 819556 951759 698158 748758 741239 647060 911044 688295 434462 562157 478050
13804 478050 802758 996467 849646 575884 924306 684778 710010 819146 812383 862324
13794 862324 998193 802269 829218 862124 592911 749241 762451 748422 561443 795865
13784 795865 701149 639066 915980 399357 798089 703879 694259 481397 474078 715704 549410
13773 549410 457708 680927 536502 460363 664395 753903 925084 550542 678433 745969
13763 745969 837067 648370 716209 626463 178146 369794 521868 467865 816905 945151
13753 945151 577540 742965 545021 323816 420312 632794 755645 492657 567230 350231
13743 350231 591980 483770 929309 905511 625161 509305 621541 594112 409663 484464
13733 484464 517738 399343 267360 671192 623178 578944 406711 507020 465009 562768
13723 562768 542547 842075 343070 624820 760568 511269 600437 844866 379445 876005
13713 876005 460931 667091 733640 469960 610844 504782 718870 584394 543437 262123
13702 582965 368496 698258 528966 478607 548649 694634 552754 468454 332374 594469
13692 594469 319982 234433 811965 400283 231504 106238 505199 555646 640940 104709
13681 628555 332347 366986 284359 143012 249904 421667 521303 467873 594237 402765
13671 402765 223121 276969 256017 416039 520549 404083 206146 888013 522380 467010
13661 467010 -26028 459588 525171 223367 298740 344590 479683 541159 519396 349514 230392
13650 230392 245791 472570 309732 722009 213745 339483 190796 653456 443032 500953
13640 500953 613893 333542 223937 109601 608081 510837 273303 433544 343378 334615
13630 334615 102369 599333 428022 401274 377497 153047 241662 386597 652799 506252
13620 506252 471016 577534 459599 231056 139017 348860 196763 261236 329665 277566
13610 277566 475412 620410 326796 68535 549819 366129 231229 399492 226541 263707
13600 263707 556798 59787 457410 427571 75573 286628 366341 337888 343377 329081 265053
13589 265053 483623 135991 169153 200422 -10348 44550 67188 736179 211416 360210
13579 360210 293307 321240 680636 -41955 417280 444236 205819 130732 112885 176105 366623
13568 366623 474388 108179 479073 570740 331720 213766 255083 59108 218723 78875
13557 210539 16135 397383 356104 372124 48535 352032 320924 403538 459730 107993 319675
13546 319675 179414 153076 374460 144144 151829 471192 348916 354777 394923 225433 558774
13535 558774 513959 96450 422312 344628 42593 205897 56732 274719 390239 100653
13524 310830 62603 197928 537654 157360 134061 260910 63131 399136 298789 325841
13514 325841 299765 189151 540258 210414 416694 438220 44839 425262 -195981 -10342
13503 133514 288143 219142 208492 167277 4765 63886 47189 267223 138436 175867 222715
13492 222715 313736 228976 242053 106957 439842 493975 233556 -97150 394392 312077 193658
13481 193658 99335 474294 343101 314135 87280 252682 198655 243952 372135 -97860 361472
13469 -22619 164163 164069 36018 263802 160249 223250 425069 102396 95508 331619 275674
13458 275674 -115980 637067 -111156 97487 5730 -132172 145749 -69688 368735 272818
13448 272818 80213 -69297 59369 123957 88081 292020 350311 236752 223632 161358 95825
13437 95825 303639 56058 -36449 291329 463492 328704 78951 -27997 169944 84142 163727
13426 163727 306119 85669 -44872 -137645 101933 422375 120720 45993 363307 -44108
13415 198236 316129 -114859 399045 79132 -23122 282660 354795 86943 -173643 241307
13404 160333 163803 -3468 211425 192248 243624 44166 313602 -40273 457521 -165479 265651
13392 172649 40061 450122 410334 243050 141089 343455 376652 381536 171755 174180 107412
13381 107412 206083 -11606 -150086 259616 190477 8741 145006 -22465 -117510 -68604 573464
13369 397334 50976 43876 313741 68552 288392 458685 159208 188849 218818 180724 504389
13358 504389 406492 272625 194991 3316 395609 512674 165332 318265 191494 564803
13348 564803 99226 341243 125190 501045 190879 170064 46917 359551 228738 13435
13337 394999 310007 283342 200985 423009 256697 232993 241712 75090 135942 381796 130751
13325 387115 441974 344935 161374 164129 123882 208348 54505 394402 88101 304520 101467
13313 294237 416429 -82927 148480 222519 398809 -67711 248443 179647 75054 215835
13303 215835 278780 53659 -60221 255746 167240 75322 -96216 187889 513365 -53105 132584
13291 206563 301130 53553 2451 157492 81351 68044 367094 335216 366382 -41235 56132
13279 -78936 -50240 50021 441789 156711 19701 128255 100192 65454 203073 -89743 115438
13267 222810 254749 -256272 38709 -180000 11191 148078 -40867 4111 170944 -31336 107181
13255 45679 3303 202292 274615 -176410 137064 231837 -207626 81195 -266311 9148 90105
13244 90105 -55083 248770 85149 173466 1785 75688 258930 132274 -181142 89722 34385
13232 2758 66714 47404 76768 83041 19040 365611 281794 -53282 207857 117726 -350879
13220 30820 -143893 30964 22080 62657 183847 -46047 55317 109950 -2737 32276 68164 452683
13208 452683 67629 -170508 196078 -134137 107680 211425 -74828 -1951 244337 63592
13197 72116 99157 588172 32424 312013 87986 97288 199601 50469 -38041 204964 -141389
13185 290948 -9506 8030 -120725 -210624 181555 -200047 192401 374313 179568 -31053 57746
13173 295100 -223369 -15987 -213955 -49697 -351266 306541 -47398 -57019 -83759 -59549 61874
13161 -36994 50471 -228958 64712 44694 -49241 121531 96536 -28968 -34067 -191907 404831
13149 219744 102933 230695 140447 -267636 108445 95939 94047 -146623 -39716 38415 -161340
13137 -47256 -38094 -221767 -45686 215464 -1997 -145484 374640 263716 243819 95204 80295
13126 80295 144912 75647 340198 -23385 126224 39950 213284 -146263 -50281 6892 -53368
13114 -127928 77722 7549 167015 103929 -365593 266691 281094 30594 -50098 -42807 -88061
13103 -88061 8051 -179436 171185 108847 178487 191610 93803 250479 251731 696358 302529
13091 113648 192913 85356 201252 11564 105670 -27175 -46309 182569 -51748 139759 83433
13080 83433 350291 -4945 -20494 15414 31397 61886 194869 170837 115004 233827 335226
13069 335226 286178 82999 61429 222853 -193447 107596 -52769 74467 228111 2815 443042
13058 443042 23819 -113643 -3925 115909 -57101 65531 67972 287947 41873 34292 -59715
13046 123469 249473 86399 85275 275771 154621 -56445 -146457 325700 342517 -39952 145555
13034 90240 -59624 -164815 92089 122967 433683 7074 44658 -105489 56205 329942 64624
13022 466468 291596 207463 127075 49891 -143494 -48077 182717 266492 -60931 66195 -50822
13010 77276 51345 96699 84658 178959 -35897 -220781 -93188 167076 211311 -146340 178550
12998 251857 157291 -91643 235755 24257 261161 -272640 213609 -103039 172220 -132446
12987 45313 5754 182246 -83761 38574 190567 91531 231051 147705 -201227 -93731 -153231
12976 -153231 -41054 -27396 337638 -145170 276409 245384 99734 -76487 -56359 101185 -10867
12964 -96707 -221362 78558 -113244 108940 106708 216390 240051 -226692 130160 -102047
12953 -21766 -358113 294473 -58268 118408 -55506 -269805 137229 21806 1903 -46183 205839
12941 160755 -124037 162102 32612 -17345 -9074 -150000 143139 34518 -44550 -239962 149819
12929 -406507 88834 -12484 52973 -136415 -139147 -347986 281412 55378 -50344 40762 -162689
12917 310200 52129 -1872 93424 -172579 93442 -202463 -26261 7085 323098 -19992 100940
12905 29754 1664 -136700 -68651 -10852 -255481 -6259 55488 281723 -179988 -159023 430901
12893 -62781 26761 13172 247100 -113077 86989 32117 208272 -13399 -116946 -20969 31580
12881 -227827 243115 123087 -33795 -101107 -132237 -136547 283584 260741 277683 81679 21902
12869 -172158 -84555 -96944 261217 169177 119291 -354197 167254 122725 -214595 -66045 365505
12857 169975 141077 -14399 -387472 164190 -22749 138301 3694 242400 56248 -115044 76758
12845 48263 3707 -210140 -212409 100034 143258 -57310 193766 -85637 -9711 -482235 -104226
12833 -147151 12177 -101065 59534 -144806 -250590 -101362 70993 35292 161374 92023
12823 92023 96482 32623 186059 -210573 10355 3011 50355 558013 330426 -18581 250960
12811 -81570 -220065 351800 -19537 58467 45440 -213726 -84702 -237278 60118 -1077 -36914
12800 -36914 102811 -53332 98467 -53768 -299722 339950 -172356 -119774 -120101 57811 -228027
12788 72620 -152871 -334825 105241 -72440 -147723 116099 12689 137325 92248 114016 -70265
12776 -202267 55840 244162 144764 287934 312348 -42438 285038 -170640 -153681 -247 -111042
12765 -111042 -161330 207784 -106726 -149591 -84508 213362 -187732 -233236 373602 172159
12754 41317 240565 128710 33708 71363 456286 -58715 253249 146663 -47080 87066 139387
12743 139387 -249564 90976 48897 273186 -15943 -1592 -43374 -342377 126569 148971 341561
12732 341561 -69957 -202118 12854 91115 31408 132581 -70248 179537 44396 -134459 -138151
12721 -138151 -144269 -37787 113381 -54828 -222832 -241034 120833 -207225 120420 185258 -58803
12709 86162 283655 113052 -77098 -122493 222918 167094 381812 -2075 211576 -384945 268922
12697 1241 -43644 200153 -119847 -41850 -75290 -558474 49658 -57693 -78006 -40719 184814
12685 3118 120549 7797 163930 -8386 42737 211377 232417 257556 -225525 74199 -77867
12673 -86287 -2735 93812 506450 97032 213423 -18352 -281012 19123 -220464 93680 158664
12662 158664 -130280 -308449 -294957 287738 33179 -26818 166363 320703 -192429 57842
12651 298595 152744 303707 251303 243719 -118604 254572 -11938 -169414 -146941 111278
12640 -486426 181532 125008 -264546 440972 112728 -63334 -83327 89408 355369 340889
12630 340889 374983 22371 49464 203634 39293 -12302 -193183 158383 -124275 85476 226136
12619 226136 256489 393306 -388266 315621 -71795 -400160 125067 -109347 382857 251922
12609 251922 208917 283805 -42097 133301 141869 -45413 189621 29600 -173906 -124169 17586
12597 129091 -26862 119427 91814 -134951 -134202 249048 -420242 156549 -45789 -15884 -209894
12586 -209894 -254582 -201165 40971 -7205 -41647 80227 -24953 -17755 218453 -21798 -208980
12575 -208980 65605 -74509 -77256 397023 71622 -289845 -88162 -36504 -15197 -274239 20935
12563 60247 194148 -119559 110906 -260681 56838 212916 -20541 72628 2251 163577 -3189
12551 6125 333786 -64575 83067 329507 -44933 123168 79200 100153 39359 212439 117857
12540 117857 78290 -233843 -299102 -177468 -110572 214736 118766 -283905 -100059 217313
12529 44935 204333 122742 -2965 204018 134165 -84642 -261549 11240 113495 -25739 72496
12517 -472289 165442 -112132 -71265 311514 262560 183425 -79569 79122 -51430 -63183 -186864
12506 -186864 195968 92728 137764 -61156 124968 226455 -67005 14889 -307879 -32222 -104006
12495 -104006 15857 -100063 -118695 -42383 187830 -47137 400315 402368 145528 25208 -81973
12483 -30187 -40949 -222415 42643 -151051 158992 6233 293778 -25712 -111820 37053 -25034
12471 253988 78219 -31248 -266825 108273 258384 122494 163606 -36258 153541 23776
12460 14343 509149 112724 102939 -65997 -180459 -133529 142295 -36252 -358197 -6679 33506
12448 -99751 -164115 -157087 -122887 -278882 -297780 -253085 127428 -117459 194911 79829 -172181
12436 48461 -134381 -30808 -101903 109087 -169685 192374 -47319 -102043 110641 7768 116833
12425 116833 -9271 -38534 148643 125888 199053 -364965 -30328 -48213 -133774 -260488 421920
12413 -192016 439 114219 384706 -2735 -161588 -152470 128312 -202708 -25390 97171 -59320
12401 275813 33375 -159956 -173756 22168 -60020 -64904 258669 -158322 155685 -118611 36544
12389 -191968 16653 149113 245006 158095 433812 220545 -2005 129814 -116332 -306389
12379 -306389 115865 -156863 57472 275477 33340 157711 -45008 311451 122573 -103582
12368 -175431 94339 -133627 15071 209090 -196783 116169 383264 -224176 -37021 -85789
12358 -85789 -14360 -159101 39363 -38788 194274 -134004 -209000 -276691 -128157 156761 -115761
12346 270690 -308817 99740 296002 -2038 -5114 -290580 263288 -127258 23210 -72190 -114115
12335 -114115 -214479 -109003 76908 -79641 83129 349924 59809 360438 -102212 19021
12324 204030 88308 180945 -35241 56979 206446 354937 96186 263340 212948 220839 4053
12312 118150 -100354 491226 59284 -33786 254765 99614 -202418 38631 -126030 173961
12301 62073 -64827 -14824 -105260 98806 -27516 -4116 245555 13410 122235 -205226 76112
12289 238856 250095 291874 435949 -35806 -8246 -40273 90243 89782 376100 70998 122222 224023
12277 224023 70742 -78809 28924 -126612 -25124 82153 201647 75803 338601 116495 151255
12266 151255 173230 99643 -15288 442441 397655 294943 376669 250637 31110 338838 86291
12254 141069 317114 -105015 -18337 -119437 325994 13306 343029 180743 99092 147297
12244 147297 186145 129030 115755 110623 230274 280445 131276 338838 -65926 51913 -80574
12232 -65926 187338 -99795 27951 22831 127457 552172 334549 -226793 188244 188863 435553
12221 435553 4464 177526 126849 312394 -251079 120313 192504 360702 405256 175255
12210 553186 297606 197720 50670 162055 14313 33134 -7718 212355 133968 273167 122347
12198 44581 177402 446847 -62316 98162 300979 127564 213735 147212 -72477 280066 252251
12187 252251 -94011 141695 212206 131363 504949 -117557 21226 217791 162163 45629 131410
12176 131410 154538 86464 143865 204100 351333 141990 -222334 -71518 563804 115197
12165 361191 211571 166893 98118 364918 378692 298921 329739 148494 31743 80048 217159
12154 217159 -26708 197294 -137520 -139258 75309 -3431 -303836 49599 72181 -181332 -24036
12142 18391 -68622 263736 131691 306199 361370 40574 148020 111321 253230 177222 403856
12131 403856 36403 116314 86704 17997 76522 159719 162979 -415148 -120781 64128 -120530
12119 373048 154061 145109 247034 -65315 128342 120104 385744 223744 372568 264344
12109 264344 212169 201531 -74468 -33065 424267 26251 165207 33148 66853 -279526 52257
12097 -29396 -113750 79474 52313 94578 -131670 -197778 -13210 -144036 127190 258820 190835
12086 190835 170313 62737 80893 -110600 385921 145144 229389 -84583 -242565 47744 81276
12075 81276 158773 -56775 -29291 331097 60405 221277 213986 193729 204069 -16399 227741
12063 271449 114791 211078 -87749 187615 223574 196978 218544 374953 -158506 -60477 17257
12051 164901 298 -25882 1486 -251879 -286320 313135 -126096 265861 30725 429560 -236199
12039 100572 75106 -171090 125496 -32645 33058 -9102 26631 105145 63346 67055 326157
12028 326157 -247580 -130575 -301463 -95875 -193512 -230239 108508 242931 -268816 -80831
12017 70224 321842 71328 406130 159342 -52445 197552 221560 -40936 32813 292715 -75888
12005 274594 274400 -78584 -60933 168171 18254 50674 -99228 109188 166299 -303024 12819
11993 153325 -169936 -6539 -24254 261992 37391 385325 -63350 235333 37002 -230884 -86089
11981 -261917 410247 -86168 197463 38192 -150565 -6631 256470 75680 -349777 188553
11970 -146976 -190693 225096 67787 -146617 252792 -141184 -356470 -114948 242735 203831
11960 203831 1162 29393 68697 -196954 107255 -133627 81619 144951 50191 55650 -141819
11948 132092 92612 -134242 -55209 -228915 6761 -196846 -4643 -109680 -201877 -55187 24385
11936 66820 77903 60544 -103791 -75023 -55288 -253446 342159 -108780 -236369 -25279 -164791
11925 -164791 370227 -224055 -248579 173184 315092 -19255 111682 -73689 -30341 105874
11914 -349413 -2946 -146045 312504 -37209 -260992 167926 47237 -194584 365527 -162949
11903 -112731 61637 143631 122765 236367 518132 -39193 121507 -307823 174560 99783
11893 99783 -28019 -55616 288540 -168367 82121 58788 -268556 -111192 50655 -145673 -139131
11882 -139131 12701 -41597 112176 23517 70828 -187697 70678 -152586 -80495 -272550 -85019
11870 -254961 -111557 9610 -215793 -389752 100284 -141497 -157813 327417 -313840 -158396
11860 -158396 -4195 -39416 132323 -59396 308830 -293672 44484 -257769 246097 142964
11850 142964 217342 193890 -29904 -214877 114986 -212535 188284 -63357 -169673 -230786
11840 -230786 -198686 -164761 -397290 -89669 146145 -20361 -192 -152282 108141 36324 -232504
11828 -4906 -10677 -71771 -212598 171156 149465 -142878 170039 32152 -378063 -197834 -77488
11816 -133956 -98079 174790 -133538 -161027 129137 -62458 75769 -63785 -67297 -44287 99862
11804 201704 -101631 -239174 81626 -182399 194341 -195335 95689 269378 -168479 -37743
11793 16495 -301549 116031 23465 30950 -235585 114595 -336030 -499110 49689 124057 309871
11782 309871 -268009 -144351 -36632 -230632 -71808 49008 -275578 -147536 -175512 49175
11771 76886 39655 35520 -30958 38004 -375578 57150 -313345 -58600 -76791 -155599 -40444
11759 -302500 50298 91211 49519 -163215 253575 75129 -184595 -184888 97581 27703 -19881
11747 -164354 -21325 47824 -170052 46717 222151 -9046 281442 95043 161740 -20333 -122663
11736 -122663 54590 -24993 120594 107968 -271868 136971 294820 -116598 -349634 60725
11725 89396 -161455 -229158 -166451 735 -231245 168476 64416 181803 -41187 -113450 -40423
11713 -203997 -15992 16690 -73065 25226 81677 -16353 169 59942 -205739 -104506 -86329
11702 -86329 115814 -219065 190386 94414 125311 -263408 26136 -16038 187602 -127876
11691 59466 -10755 -126573 -149381 153806 -197257 -128880 130550 126876 -160645 54459 101683
11680 101683 -360261 249356 73802 -157638 -281255 193912 -79848 8461 493 128025 -123161
11668 -56567 -23871 -214156 10483 93865 -13137 -419653 -114185 135113 -185632 7368 255010
11657 255010 116824 115418 106257 -174888 -171241 226419 -280986 95460 129906 244082 225368
11646 225368 88870 -166073 127650 80726 -592 -137072 43755 175339 337793 111109 -78977
11634 98182 -43519 46908 194443 110372 95140 -24913 -56777 -40778 162304 -77262 -112557
11623 -112557 -57923 249611 262550 142197 -8367 -216706 -331026 -156791 11941 154625
11613 154625 -363996 -33268 -144511 226836 20102 -35326 103061 26909 -174190 500353
11602 45306 -144880 304923 -97158 290959 18739 189440 -20999 2812 105485 -69806 231805
11590 -47537 32665 -38226 135495 541905 -3480 -11764 310892 -15116 158067 163487 202319
11579 202319 242625 -53813 82032 281505 15840 163203 -306805 -12423 -48259 32566 153451
11568 153451 48988 240367 -97797 252970 232100 -210048 -29066 219861 -78839 -302341
11558 -302341 -43130 166528 123888 15223 359219 40448 -9444 198286 -260789 -18697 -74065
11547 -74065 252688 208723 77663 46430 -27870 -219065 305083 -139557 -82580 159536 318105
11536 318105 64044 -16962 74234 -252344 238226 21373 80919 -142189 -442108 169729
11525 9007 173429 13043 147166 -33059 139157 133300 370619 92850 287334 -85339 -25130
11513 -288343 105692 396225 146606 173566 -19056 -23033 186661 312586 149419 -56566
11502 -103152 97466 -158538 -186618 513975 32669 315863 -229392 264557 -138358 138648
11491 170807 328797 33773 81825 -282578 30043 101505 34499 -58336 135889 91294 -260088
11479 139930 308157 17746 65164 182103 -106328 -13319 78842 -64213 219123 83881 -8896
11467 -22249 344313 625329 118077 -272006 178680 103014 -58649 -148511 -309715 -142320
11456 239999 180884 158401 -201818 -22299 172803 164686 228718 239365 25455 -30610 225198
11444 -217396 157171 147736 25432 -84570 405870 -284224 -107150 99681 359636 300129 169365
11433 169365 368620 194968 54335 -139043 -148591 57033 168433 21249 -70923 171197 -143889
11421 118862 -22373 -76810 85660 117555 -132449 156031 -11247 111207 -61888 28392 94147
11410 94147 -297198 -366982 -48699 62534 47874 91027 -227473 -60346 65581 -197961 281521
11398 -57918 280946 26581 -95487 200356 -3867 6993 223400 44816 -38345 123266 473016
11387 473016 156369 100223 -329673 -74897 -113625 -531630 158462 166177 -434395 61280 108978
11376 108978 135505 -159833 -317882 91321 206431 146662 262392 -16237 -75217 281340
11365 13008 -74750 -246959 -329751 -79805 -283315 76071 3993 -326162 371098 123973 -211505
11353 99221 61471 -285708 -15734 87613 -93821 -125535 -60498 -211382 -206718 -110812 10748
11341 374323 -113698 82330 -59582 170529 -21533 -379797 131784 -103131 -222224 -143394
11331 -143394 -121693 18885 71001 2199 -7109 -421066 -330271 -251876 -180589 -82069 -50236 231199
11318 39821 182977 294604 106072 209332 -18427 -129035 20168 -10070 -178425 -271591
11308 -271591 -390550 19324 -103513 340234 -331450 105835 57792 -61166 38064 -432885
11297 -32894 -37853 -176620 10630 -210631 -184131 11525 136304 -5304 -61880 5115 -310784
11285 -64650 -62901 61353 -280724 62013 -107141 -127648 -194018 -374831 -47399 22208 -5535
11273 -203613 -210900 433601 51277 14074 4554 -158340 -202703 62549 -249330 136891 -122711
11261 357938 -253611 208702 248743 95709 154681 -344147 43992 -61546 58262 66526 -43793
11249 -285866 -456662 120217 6362 -34464 -395240 -115963 121316 98516 -201670 -15272
11238 -63575 -114680 -27787 -27362 152834 -199110 71053 46529 -277853 24835 -182457 -48221
11226 -13417 30330 -41778 -205302 88795 50743 199861 53660 -279114 -166779 -58971 -45393
11215 -45393 129935 33495 -106056 -80871 15772 -30628 155148 -254003 88800 -5951 301428
11203 166358 58415 -210572 -381758 -298429 -10749 143177 -37743 -46930 -62418 -490227 -13297
11191 6470 -115418 -123695 -154629 -88890 -211765 -215076 -110677 -70684 -227508 10276 169046
11180 169046 302062 5898 156107 -197657 -134353 74869 13163 3008 -101133 260354 -123141
11168 -28574 -339921 43462 -248762 -162807 -38883 -276458 -116090 14109 -99207 263332 -249263
11156 -165712 -23436 97035 -260450 -128901 -64431 121841 -355287 5573 91158 -88395 49702
11144 -139796 -255305 159182 -46712 181365 -280333 -82351 64386 -205753 -219403 247058
11133 67719 -364883 220017 36886 -123838 -92020 -35792 -106853 301169 145776 -63726 123261
11121 -2809 -63338 177387 -281585 214972 216461 471279 -8920 87808 -37940 61479 158676
11110 158676 71989 433965 46392 -126886 26176 224340 -108884 117492 -26644 72430
11099 57619 306754 -171818 257193 312971 39211 21466 111043 199425 181695 -6854 284851
11087 -160609 131435 -63555 167630 80044 510321 85748 188513 60731 -5073 564505 -34320
11075 -113122 210599 70495 23045 210847 140129 132432 206576 77725 219995 59402 14591
11063 174069 436747 275685 214145 286570 254450 458503 351845 122640 555993 403073
11053 403073 269571 302260 312724 1132858 448998 228797 562895 757911 656052 1100181
11043 1100181 581645 622155 742106 796732 989552 613368 736654 614107 668913 668305
11033 668305 696698 418659 718924 803908 336392 514327 719279 569733 903853 903350
11023 903350 948420 358539 691096 939989 498812 581081 364147 575580 418214 539248
11013 539248 659192 466790 437516 319886 644345 535275 649623 215450 758569 514410
11003 514410 439221 723466 755591 697610 390700 805127 560082 507109 617328 330265
10993 330265 809130 350447 441476 611401 658666 548063 861054 342359 447759 766840
10983 766840 354705 782629 779392 1035523 1245117 1017308 804540 1063725 1290045 1141967
10973 1141967 1075444 1339084 1213840 1738955 1715501 2469113 2623432 2265073 2587371 2671323
10963 2671323 2431255 2542679 2297390 2208119 1935831 1787962 1349356 1349625 1768915 1546988
10953 1546988 1802719 1853027 1387048 1530532 1249862 1193561 1274693 909287 801485 796470
10943 796470 690420 449369 625722 222594 287483 296509 40294 485770 -108888 117329
10932 149312 -26359 136099 373999 -108923 217947 -389393 257826 333207 13993 107624
10922 107624 -181827 162823 68844 155778 -155057 233291 128089 287662 -154086 -31779
10911 -122961 -30332 14618 -372960 33219 -60797 60388 30127 -41636 -379983 55121 -62283
10899 90122 -130458 -81486 -134160 224293 -59148 75553 99402 -111250 143028 -197332 -115394
10888 -115394 -69585 -117144 -64081 -341090 140711 110376 48499 -198878 62732 -32681 -124070
10877 -124070 -61822 72040 -40987 -37805 78094 4708 -263406 -73639 12688 -77822 34806 -105205
10864 -172984 28036 -243272 78279 -273361 95060 59262 3654 187299 72804 139969 -47142
10852 113584 137648 241630 -21735 -78065 -19542 -15851 -73049 -18180 -61860 60581 318787
10841 318787 259700 -17832 -38807 -173834 80317 9540 258113 183827 68112 121781 72289
10830 72289 102335 674 61491 -160704 125041 67086 92730 -385869 -131008 -180701 -209813
10819 -209813 -158432 -142022 67062 -435226 -128698 -31294 143189 -129185 185226 -412676
10808 -23461 81414 12196 20740 -11897 41478 1114 -276526 -3335 -95295 -32998 -90216 -97546
10796 -97546 -75234 166869 7719 -138178 183088 -24943 -50471 195048 -330630 -139159 -279782
10785 -279782 20027 -9133 -387379 142514 -29864 106372 225229 143127 -187805 -240963 -18671
10773 171356 -165775 246 -523016 -167134 -12659 -186688 11688 -87631 -150485 -123814 -227485
10762 -227485 302511 14154 -83008 -192483 -264846 10502 -229061 -36183 -184806 -80224 -47494
10751 -47494 122059 13304 290944 192895 -183401 -52899 136188 70291 -122843 127830
10740 159543 33466 -48115 59996 101190 -139085 -40336 186180 -16166 -121127 -373327 44574
10728 -119596 -1961 -415332 170894 42172 -219044 -57911 110539 -300442 217197 -81927
10717 3949 -180435 73196 122594 -281611 -186988 106953 -260533 -260809 246824 -119703 191257
10705 146049 -109179 -221458 -71079 113700 57044 -161956 211938 -102661 3679 -79001
10694 104708 -87800 -243573 -252106 87690 -40472 253234 -4811 -26469 169576 245256 127385
10683 127385 -179298 -205351 160392 -116798 205087 -25576 15960 100989 76293 -45667 -305959
10672 -305959 -239168 -152847 -178602 -8146 -97342 -18707 877 -107856 1271 -123880 -119820 -182497
10660 -182497 30089 -13114 -10312 38220 126894 270929 88801 46753 -102531 -162656 80217
10648 -33206 -31450 6585 112840 -193403 -64915 -31851 -290807 -127068 125052 -18139 202008
10636 -157480 277913 -83860 -20539 -8650 -9397 -109807 -238339 89064 203707 100726 -360179
10624 -898 -411994 -343809 111932 200100 -198776 207426 -18929 86873 -94728 17426 -388964
10612 148123 -111433 129388 -146142 -539030 -156049 -54208 136907 31546 -66396 -203635
10602 -203635 -574258 78483 -43103 -388028 -85917 -3122 -60138 -190803 8192 51080 -131644
10590 -89244 -50147 15904 100491 -139553 -214535 101111 39669 247346 -117856 62259 -94153
10578 -99642 -51604 -195190 -35040 62007 -108141 -262427 64257 -154153 173106 -115234
10567 35332 -99768 -113075 -213364 -43718 -205870 -69843 -130001 -297497 -282887 -126175 44614
10555 -20891 -9469 124749 -211124 -348214 145742 108345 17087 -330873 110979 -284987
10544 85660 35991 -297981 -127609 13821 38865 243085 -414618 136481 -262036 103869
10533 -65905 -388773 32334 -224095 28441 304822 18345 -167517 -45282 49629 -289093 141820
10521 -75956 -398664 -95099 -77491 -35388 -200960 -195459 -1335 -240839 -212230 -9578 -9037 2611
10508 -465754 -6085 -45487 292766 -120986 -132078 -354849 -45897 -30662 -115490 -320734 -185
10496 211021 128482 -96551 27649 5639 -245032 -646328 13611 -14537 -108063 -182345 -116530
10485 -116530 33428 -202538 5404 -100726 -55460 347282 62460 -19533 -210753 188444 235947
10474 235947 86436 675475 221907 446871 170987 182320 200749 117015 8217 -254549 -90223
10462 75754 -222802 104799 218891 201687 83849 -286763 491 86692 274942 -243927 -237553
10451 -237553 -191985 -255295 -19556 -89745 -179927 186829 -53997 190891 -178786 -12407 -388291
10440 -388291 219347 -97766 51141 -4929 -5946 -4316 196609 76990 -291135 -214917 -73244
10428 -272054 248673 93936 138151 55939 -42120 97642 -460814 93105 80796 -78583 175614
10416 -355192 119661 -66974 -51618 -75712 6229 271386 -217134 -153852 37964 -202713 -151243
10405 -151243 -115108 84689 85916 -74095 -93957 -93238 -129412 47430 227340 -143607 75453 -201308
10392 -225770 248511 150751 -150246 13556 -58306 -92731 72350 -101099 -95738 -187908 93923
10380 204520 37537 316282 44611 153914 221477 350341 350959 72870 150762 165804 380880
10369 380880 440168 189059 327508 258822 -51157 380851 268028 704918 342502 328482
10359 328482 247952 424287 286877 360734 49006 296367 225438 -83975 381763 -50271 -87585
10348 -87585 569889 440477 604991 315662 269005 232475 1174 372019 371385 404016 405836
10337 405836 -159994 181946 106037 -52745 239458 288715 217875 -197844 -2009 -37983 124175
10325 -61411 -92100 -91637 -61929 -22079 92823 217502 142212 55537 -327959 -199091 -173293
10314 -173293 -116922 -9363 38068 286203 169967 -122413 -121077 67398 -107028 -219351 -23217
10302 2886 -246277 -302530 -300176 -554728 27653 65031 -61935 145034 -41349 -38510 36611 125460
10290 125460 82998 -21279 -58882 -264819 23564 56704 26784 -8108 -183150 53834 -119287
10278 60101 -93679 -238286 -63532 -64105 179804 -81369 -115368 27038 18202 172650 -167178
10266 76894 20154 176404 213109 34030 220966 122448 -148473 -30093 -244112 -123957 -99171
10255 -99171 219120 87066 245516 394925 302305 392366 573910 132663 121248 127712 -49960
10243 53287 281539 -83731 -64180 -12149 -97308 151207 -48747 127359 291326 142309 -275079
10231 36524 139659 -294376 -78260 -118714 114522 -138588 193372 -15823 -132651 -149980
10221 -149980 53511 102378 -120393 -314151 265934 217635 171564 30811 -376382 -94988 121323
10209 -257842 -46098 64122 -524679 -167836 -82737 -25499 53278 47910 190984 31405 -315635
10197 96048 9946 -492378 178259 174541 -135099 147612 196201 -305590 -100425 -37363 177511
10185 195598 -306096 -100959 -208813 -93107 -420630 -188563 233156 -282264 211934 -450888
10174 -356026 -313445 -257029 151480 165593 -235781 -221545 -116117 230521 58607 -204033
10163 88163 -101587 -313814 -195597 -139606 20633 -483876 -161274 -262620 195631 -313236
10152 -38604 80819 -87710 -26169 16243 -326527 24001 145509 41438 -282863 -84674 -820
10140 51124 -34872 7 -33152 -172477 -164733 9623 -168941 64308 -57219 -461296 96787 -323322
10127 -62405 -62806 -71099 -26586 -187795 -172775 -243121 117103 -274855 -183216 23137 165820
10116 165820 -143069 175730 -433217 -332156 -48248 -84749 -132227 231343 -343026 -203198
10106 -203198 -35369 -351516 63852 239547 -163404 -422684 -245694 249640 -324246 -300817
10096 -300817 -133808 230230 -310733 51118 13739 -414916 59499 -199659 33558 140256
10086 140256 76602 30663 61355 -103542 7095 130862 140596 -134829 -430685 -110716 188307
10074 -2096 178306 -194413 -139414 -116210 -125613 232068 55460 12647 41995 -290107 -273306
10063 -273306 111635 -65851 -340610 -300363 44369 23825 -41037 167241 181830 51773 34560
10052 34560 114062 125774 -234976 -16105 64402 -173646 137982 -195755 -17352 -40199 -64120
10041 -64120 -286897 -172881 -78270 -127030 264575 -297415 15679 -79580 -117807 79380 -34748
10029 -287451 -9067 535141 6714 -355407 -328068 -92650 54793 -34750 -304173 -108241 -158798
10018 -158798 -14866 137922 56155 44562 196981 176610 37142 152282 -49683 -318663 -61664
10006 53518 -94881 -146077 108350 -165454 -85571 -83227 -213710 -99972 -15186 -63681 42609
9994 31065 -165564 -81434 -136115 -230010 102874 -45987 -230657 -311517 -12089 136019 -159972
9982 12465 -127474 -285171 -148041 79756 -292881 -330759 19188 55764 -268002 -73725 -24613
9970 -176515 4199 -46707 -494251 -143921 -22796 280567 -171919 41991 -23600 15569 -101830
9958 -441405 -197827 -330505 71864 -61312 114555 -8145 -259217 -180416 139722 -358138 208429
9946 209054 -208824 -506830 -441424 2734 -50734 -151895 135438 -192774 -93565 57866 62436
9935 62436 202693 -24878 -326556 30336 94741 17850 70280 -307521 374242 -252449 89079
9923 -244170 -337991 -134014 -59009 -98940 264 180405 167097 -435795 -47811 29327 -16759
9911 -463173 27448 103570 295803 -158715 -49959 51307 9050 71959 -19494 -124091 299167
9899 -313802 5703 -273502 -95339 126810 15419 -6209 98610 265031 -154459 -487505 -376265
9888 -376265 -412140 -216402 -5426 -52718 -146965 -314939 284752 -317034 -174963 -50802 90417
9876 149549 -172325 -268576 -152053 148875 153332 -244292 -466320 -67096 32281 -109039 -70125
9865 -70125 -508559 -270800 110934 -154400 -96811 115219 -433596 -192488 -191472 -271392 -155776
9854 -155776 -36571 -11695 -228313 49596 -119180 -2535 -130977 -67295 -62329 32159 -328940
9842 87232 -111192 -294708 -162409 -147050 -226512 93259 -208664 69845 47738 -84464 59735
9830 -48167 -192564 -87809 -102779 -186760 18304 105588 374428 33627 72273 292209 -201172
9818 148810 -258128 -127238 -547399 -51833 -243891 -242759 -47399 13123 -42384 -175837 -251511
9807 -251511 -46983 -50092 -223230 -369402 -8718 -79896 187900 35475 31698 -145073 171025
9795 116492 -15971 -309303 -297996 98045 -210318 -36139 51912 -40020 -269801 18671 -309885
9783 -123440 -310027 52066 -183345 -143561 -137584 -448137 -344178 -88817 -164205 121837 -116474
9771 -648 -62288 14534 -16057 312943 -203323 -349551 -121982 -289886 137194 -181310 -44074
9759 -192095 -99806 -178080 4763 175115 85262 -25704 156882 -22483 -226398 10379 -82593
9747 -172555 -348133 27563 -239945 -139478 142155 -147546 100259 44440 -271324 5951
9736 -417970 110409 -396534 -241449 -513221 -69982 -168426 86997 -353707 92230 -66901 99488
9724 -77543 -284846 62457 -260288 -316759 -20333 -67467 -75806 -203936 -103541 173123 -126544
9712 -367815 -55351 -241923 183723 115288 182517 60183 298471 -233544 -479971 23567 -197646
9700 75785 -92880 13198 -264749 118418 -270121 -234463 -24024 -32662 -62562 67364 12294
9688 -95084 343585 -147412 86689 27860 -81101 -22601 -44202 -23634 54558 -107857 475597
9676 -172097 -15946 -299056 81377 -422709 72499 193292 46749 -390646 -446887 68131 -50573
9664 119221 -18974 -96801 -150939 -20678 -234370 -89266 339103 32488 137832 -276090 76016
9652 -323821 -267963 -325132 -57123 -27370 377859 -122757 31295 -430161 256184 749 -315326
9640 47054 22434 -159466 -14568 196591 -23647 105917 -1498 185446 -390831 -304027 -11 146683
9627 -30504 61313 -336381 -233777 -70787 -325282 -461625 -75849 -142058 175514 -199526 -98936
9615 -100385 -206196 -64816 -152579 202293 -209082 69724 15047 -73082 148388 -183678 -448699
9604 -448699 -119252 39654 42875 190503 66229 322667 -326576 -119403 16438 -358850 -146078
9592 -5125 81473 -171080 -113234 -183622 -7181 133045 -256706 -315259 -74894 -270194 -82584
9580 -102996 74886 -37639 -218071 -2561 -149737 127673 191490 6741 -191181 -188690 127968
9568 209572 -83489 -173834 29920 -172490 -214428 88940 -206261 -230704 -167284 20840 -101791
9556 -424377 -116553 -436074 -334958 -33553 -276720 155035 -63548 58152 20909 -31670 -320661
9545 -320661 -109283 -161905 400708 193445 68352 164620 -457332 -87112 20866 -136322 25235
9533 240810 70851 -100526 -45844 -208492 96155 7818 -30038 -253092 -487741 79571 -241458
9521 198716 -153215 -114137 79180 -34663 -143656 -271701 -243842 -106727 65429 -187254 -88526
9509 -13353 111683 260905 -127056 26355 -66673 -145651 -65065 -158330 52985 -70744 -273165
9498 -273165 -63192 -231935 -313841 55792 214361 168031 180079 111599 -129930 74479 -46829
9486 -329324 210185 -157323 150514 -84126 154999 -315273 -137004 -218510 -79402 136884
9475 254456 -377378 -164095 -193881 160493 132745 -219186 -402640 -14864 -102357 -119628 -98455
9464 -98455 -265740 -16357 151080 -138914 171559 -182273 21752 -366716 -321046 -227633 113184
9452 -424832 35318 -486651 5123 -32448 33429 113455 -27916 144520 -230469 -182488 -342833
9441 -342833 -90227 66207 -269023 -58794 -4306 213274 14433 -105459 -758 -306804 99980
9429 -131335 -42192 155756 129783 -274366 -33950 128554 -208018 -310258 -308299 -304500 -144273
9417 -11904 -100608 187994 46481 -295051 170946 126850 94301 21492 55008 -414595 184411
9405 -75283 -43222 33004 7940 -5131 -101915 61974 -9611 -183998 -450280 -167987 -67509 -123646
9393 -123646 -6534 -11301 -144476 -58591 -71758 141235 31762 -225536 -293101 -100602 50190
9381 -114023 323003 -66572 -153096 -42045 163167 65074 -101153 -192837 55429 -30086 -120747
9370 -120747 -148274 172196 -274462 112839 237754 1221 104455 -39492 -77887 41593 -262418
9358 -138675 -91871 -89298 309962 -324621 -147653 -314519 182334 -458650 33007 217127
9348 217127 -116011 11387 -28024 53221 -29625 -56474 -71166 -87092 -120363 -38512 -34975 -122510
9336 -122510 -43936 -138102 -115882 122772 42571 82355 -222332 -80588 -23403 -329026 -54308
9324 -30670 -66563 -92326 49000 -350773 -57495 28910 97864 319460 -42739 -289690 116645
9312 210931 -275570 -207483 -198889 76362 -53951 -101834 -5822 -132881 -79009 20358 -5180 -288790
9300 -288790 -133079 -277363 -243285 90255 -29909 -413985 -244967 30881 -125179 254267
9289 8440 -60786 105170 58963 -172983 -198564 -124323 229919 -92424 -31412 -190102 -26775
9277 137948 84020 107706 -47912 -31181 10909 -212963 178131 54170 -171288 -29260 67312
9265 -173152 15458 -11427 -194868 122168 -118512 -194470 -105381 -116800 -77596 -49308 -157053
9254 -157053 138435 58569 219507 -277203 -87608 24678 17885 18320 -50261 -75003 -97939 88138
9241 40815 -7056 -15199 110132 -371591 1181 -150285 -280804 -303345 333724 -81374 -76534 -115498
9229 -115498 -209867 -11479 48607 -233454 -101875 -101750 157525 292592 -35015 -28403 -118312
9218 -118312 -108548 -128607 -12235 -110166 -47943 111567 69155 -116357 -60793 -42682 216230
9206 -156376 70632 -166179 -35856 -67811 -168056 4964 -31454 26263 338620 -177974 583
9194 82275 5018 -204504 -58968 -196865 -201248 -381012 89519 45865 69713 -138149 -212801
9183 -212801 220445 -66187 -443094 -317827 252909 -446254 88138 -8833 38392 178187 76440
9171 10239 67806 55772 127981 -336923 -48140 -252615 -50131 -112705 -78933 -351029 -209845
9160 -209845 -397609 -27812 -142619 -167041 -189410 267638 -406224 -99963 -102616 98397 109309
9149 109309 29427 -371214 -259272 -260235 -118604 -439041 -60732 -68797 -246210 -374645 -194777
9138 -194777 -146334 -164019 -285048 53264 2844 -82516 -21592 189082 -147882 -71911 -426053
9127 -426053 104772 -81441 -126743 54367 44684 234930 353193 -190338 -308210 19644 128778
9116 128778 -61758 101510 -59102 -387432 -2111 -112761 -230713 -80729 1439 215555 7275
9104 -215346 -278536 -31091 29352 -123480 -186935 3337 92298 -169152 -88865 234625 27334
9092 222702 -72059 -52106 -136046 -131681 -95614 75410 -28475 16287 -228322 1399 120695 76373
9080 76373 74923 -10203 -378363 -111503 -261179 -103660 -113101 219056 -86468 -161760 -167243
9069 -167243 -96544 322083 -323707 156617 -366001 340682 180562 -194132 205955 128715
9059 128715 140293 -92131 -131496 37538 61959 -255372 -56607 250281 -274373 -227701 -144500
9048 -144500 -9499 -132479 -261792 -200970 47172 -169333 -321304 -260309 16318 2495 -3470
9036 -172599 12417 46418 128825 99079 -251023 54225 -109475 -127600 -79002 28455 48608
9025 48608 -128952 -177808 -148727 -139724 -10485 -137930 171155 5793 -149387 -247559 32125
9013 -291778 -53440 -67407 -175862 -245473 -93918 -179807 -145666 -191987 -82253 -141704 -95851
9002 -95851 155660 -82922 -61157 -111074 -419042 -22015 41481 -37580 -268555 -344650 -146578
8990 111412 -227067 -196446 97213 140263 -130974 -276732 -111725 -266696 20306 90569 -109312
8978 47518 -224285 -226625 -308388 91734 17294 308691 -255232 240544 16326 142704 -28222
8966 -116115 -29485 -265974 234789 436 16590 -254915 204320 87368 -33066 -43419 -85546
8955 -85546 114410 -22579 244740 -140709 -56583 -345037 -145685 119312 -527095 -258130
8944 -179552 66435 95651 -163015 -175013 -260407 -330237 -114731 179923 -219459 -212348 21298
8932 -21319 127357 321467 -246242 -46573 80324 -364520 101709 128661 358454 32903 -191487
8920 78079 53465 695842 966237 567616 -325818 45839 -124117 -287730 -299657 -150095
8910 -150095 297957 108518 -11338 -61747 33162 -204758 -122814 -92701 -98092 -356772 -270686
8899 -270686 201586 16070 37908 39118 -497689 -54848 341861 -91914 -191034 126970 -41250
8887 49529 233015 -73347 -397606 -374856 -15208 -416260 -298004 -97424 300439 15519 -24055
8875 -45053 117713 -160497 64942 -61721 79855 191490 85343 54404 253533 268779 -120665
8863 -78013 -92449 -46230 -78386 29584 126797 48959 360154 -116087 -74305 136174 89157
8852 89157 -187324 -107534 104469 -257159 -232582 -158456 102395 -49786 -122499 363377 51654
8840 -3636 41758 42736 69392 -170549 -356328 169948 56164 213223 -341905 -402525 -27423
8828 -219740 -51634 64475 -268450 -315092 12509 -257399 105038 -128916 -328739 66386 49501
8817 49501 104275 62342 -162209 -245989 -199595 -70060 -17770 -385270 -184399 21268 -258107
8805 -221280 -348890 -390146 -15018 48026 148348 222442 339953 62917 374352 -165515 -44523
8793 -189035 344342 83321 -46582 208107 -192064 -56647 7555 84874 32108 -250371 -5325
8781 -212925 -189534 41687 -119382 27807 -37612 -277645 -18978 21651 60254 -215243 -498323
8770 -498323 109362 -250802 -293895 88645 45680 -240770 -264105 -63859 -43687 239942 -18944
8758 -197557 -77340 -19574 113840 180333 -43930 -261387 -220488 326602 -282073 75990 -258782
8746 -470967 -232326 22531 -189901 -99635 152607 -296567 -51708 -71007 235678 98398 -214115
8734 3263 -66086 235115 -158892 54823 59439 -212436 -436223 -291802 -111356 -10310 -165315
8723 -165315 -127497 47578 -227974 -329544 -265327 85113 -89748 -157706 -125263 -347286 228917
8711 69123 223796 168872 88937 -299619 -88191 -18711 754 1163 -579662 116694 161318 -27289
8698 119261 -121612 -215909 -262519 133925 164131 -186570 -280438 260584 48045 -132181 -1249
8686 -83949 -120188 -78938 -129455 -210744 74159 -46731 -221749 -26599 143918 -13249 -43106
8675 -43106 184707 166563 -47153 -356799 -102481 -86050 -22733 97882 84956 115101 -317975
8663 -6644 -646 105190 -238433 117693 -162801 -106689 -30572 83540 -68608 -117498 -32718 149351
8650 -175388 137524 39441 -13863 9418 111247 -169900 40671 2929 -196063 29168 146200
8639 146200 -204934 141148 -95726 24520 -324004 -69989 111639 -31919 -163948 117073
8628 71237 -380274 -89446 -26189 53075 -182499 -215003 -9356 -193289 -491609 -80842 -76212
8617 -76212 -19781 25703 30931 -114025 74557 23700 -125047 -311403 -34349 16 -97083 93642
8604 123886 205353 -171235 -284989 40890 -40027 -10145 -84418 -104937 187876 -169034 -242941
8593 -242941 154409 -147003 342421 -147718 -65048 -112468 58683 33335 -462307 48275 269013
8582 269013 -356633 -255334 92919 161269 156926 -12154 -161387 -41947 116903 -52957 -129533
8571 -129533 68334 194166 29741 -82723 270309 132031 -342975 123021 78875 107676 -156793
8559 -205829 -144117 58265 -50702 -45849 -3027 -191522 -221727 -160344 -24259 -56546 366758 89448
8546 -8588 310957 -254426 -81252 29111 122481 -257431 174178 -123068 -76834 -125213 21108
8534 -214486 211942 75373 -197167 36602 173399 -207469 -179263 -18483 -73997 -402915 -213630
8523 -213630 57603 -120528 3479 82765 249821 136798 154776 -336555 -330114 -33027 -485077
8512 -485077 -39319 -107677 79105 -75101 34834 92394 129293 -251530 -339363 -330109 -171428
8501 -171428 -160169 85900 61306 245241 74849 -156791 -137028 204619 -285359 -273532 -114949
8489 -33141 -61824 -249019 -547211 -338179 237026 65718 -212797 -162956 -521552 210903
8478 273651 -213747 -207262 -450144 -19971 -226413 23499 -16486 215178 134408 -78789 -35206
8466 -349809 -137294 -102545 -381395 -121079 -57643 -95570 31172 202383 140285 213541 205261
8455 205261 205673 -55509 -111200 -74964 -217982 -344923 -209986 122153 -132418 -148180 -74130
8444 -74130 -536224 145117 -257244 -258842 147232 89697 131663 -9696 -168653 -32377 -188799
8433 -188799 -148691 64991 -166277 -34457 101627 176432 -213748 -85118 -300084 86283 60481
8422 60481 72311 -39851 -257119 -188186 -81664 -153801 -147433 -142185 -258904 -25554 -165543 36887
8409 -28145 -8694 -255410 -409020 -15057 10836 -94553 79497 -86514 166918 67769 113196
8398 113196 -269811 299432 -196265 180540 167104 -268019 -84716 -233781 -291265 43712
8387 238610 -82167 -52804 -12501 -134082 -145960 -113541 69409 105265 -196968 48410 -5930
8375 -365948 -258207 -202872 -109690 -158124 -309405 67853 126292 -34875 251631 -383054 -104950
8363 -166824 -79461 81955 187043 -26007 -155811 -13993 -156788 -8019 249284 128820 43043
8351 -268818 -91989 -174176 -227409 67776 391249 136268 -145235 -394137 -100949 -331772
8341 -331772 114148 -91113 -75430 12499 -67924 47790 -168256 123940 -198898 -3911 146834
8329 20039 22079 -682594 164484 -135946 373284 -98414 -113105 -198843 -108849 -43505 -97202
8318 -97202 142836 -34609 186050 -112644 -47491 -112711 609634 44212 -80647 -209485 65736
8306 -224554 -66223 -196552 -189653 -135078 -198908 -133062 85007 32915 73421 -206417 26160
8294 140703 54242 -22580 220057 44379 2328 -223590 -130104 8061 -208059 -172887 145355
8282 -198437 -96941 -60917 39144 -55327 -20751 -154962 374419 -435825 -60561 -47688 -342607
8271 -342607 50070 -242643 -110861 -184555 -41026 -157543 77398 198918 -142671 187210
8260 -305884 -370258 -164419 -60089 283499 -62923 -237379 -194596 -148809 -37971 30929 -352330
8248 -185494 -27657 -88685 -48521 -24131 81420 -81417 254916 -173619 62231 37795 -1592
8236 -111666 -239025 194703 79608 100696 -259791 76966 -68123 54658 -173429 -234182 -51139
8224 339609 -40567 -101661 264752 -92165 -103953 -243453 143670 -90682 -32914 -31022 108403
8212 -53688 -83321 22772 -101765 -204499 -122897 76019 284705 3767 -23029 -81109 -79320 -58733
8200 -58733 -77227 192147 -53629 68175 -273819 -250941 75228 -97820 27932 -24965 209188
8188 161039 -78667 -90015 19271 -64300 -560007 -252532 189564 56698 -183984 1678 190271
8177 190271 -125157 -94740 -234913 36052 134028 -63463 -76754 -162526 150133 -208895 -72378
8165 34742 -224334 90358 -243826 220526 465993 9341 122932 -213408 -193769 -331254 -181236
8154 -181236 144854 133686 242351 -123553 69411 -113574 -52009 86865 -58097 185421 -52894
8142 -115594 -123483 -192731 -4692 -215494 -193609 -177777 198823 -89269 65070 -65676 118151
8130 53535 41616 61421 -1938 -110242 -194383 -208324 192785 116785 -249061 98604 139280
8119 139280 -268624 -115301 142144 -66474 245505 7867 -269063 -138336 27510 669 -322004
8107 -95578 -85115 230820 -274820 -63089 137057 -28133 257071 125176 -98979 244466 22191
8095 37784 41474 -408725 249522 -62243 105896 -79335 -278501 164210 146517 -267059 -443717
8084 -443717 -119783 -31408 -141277 -151630 -203856 -86669 -166312 -128126 -205997 -295815 -42500
8072 169283 213045 98758 -132470 -287854 -102790 66565 -236559 114591 -5492 83507 -293715
8060 100496 -157278 74028 -307160 -201473 -79197 -163807 119233 -262360 -211860 184126
8049 -114756 63409 -286975 -151127 -1396 -51627 -39069 -175622 -236224 -31503 -274782 -183493
8038 -183493 -228594 -81544 104954 480779 -162252 -25835 -188061 117258 16877 -186942
8027 -241843 71662 263050 87473 144405 -274601 106003 24559 -294363 79097 -406165 -144928
8015 -133759 140744 -320693 101823 33060 22609 -343191 -47193 -124468 -56909 -156256 -84274
8004 -84274 21699 200583 -8850 -202162 -237953 49218 162933 -96553 -126148 -84167 -31496
7992 -31941 -87767 121611 -231835 397753 285305 -145753 -213165 -185747 -183662 -1453 78553
7980 -73510 113738 -308728 -44605 -112636 202014 -34585 -286934 -324643 -113148 153537 -117601
7968 -59607 -93371 -24945 -13043 124267 332350 97184 -261761 -160314 -80104 -179094 -214456
7957 -214456 -81812 -99738 350097 467203 -38451 -82211 9279 -166888 -2537 -215483 -128244
7946 -128244 -458352 13156 -12254 -37691 50853 -183959 -159708 -373449 -156861 -325537 58426
7934 271203 39715 78696 -9960 -272196 -270589 293192 88737 -103919 129279 19280 -107191
7922 -208389 -156893 137242 62461 507380 30365 37218 40402 -31346 -193905 214127 -139319
7910 -5132 -62258 131711 -7117 -291462 95422 -100051 -154875 -71084 231667 161196 -140601
7898 -177632 -169687 6824 -137257 -436666 11726 159002 -145157 31907 19542 -291328 -515403
7887 -515403 -127683 -93078 -33425 -142026 175854 -50811 -122914 -518133 139501 -15799 -183941
7876 -183941 329748 -116405 -164895 284373 6925 180629 -434333 138455 -321156 -23182
7865 -143800 171250 -238248 280847 -164822 42352 -229564 -113859 -403222 -197838 -108065
7855 -108065 -64697 5092 -141980 -128216 182160 -202141 -89318 -82930 -91226 46868 157840
7844 157840 303127 -113965 29044 152691 -153372 84573 -146708 262939 21515 -86948
7833 161400 115583 411446 135488 -158375 90194 -68367 -51603 112292 -339702 2905 -66348
7821 -16856 -56496 22148 -330323 360273 -89421 440863 -138127 -140060 194566 20950 344965
7810 344965 301124 104702 -26271 -69828 -124414 -35699 -318609 65945 1623 42809 133278
7799 133278 -134852 -65662 -92762 -165637 59065 -149049 69451 345753 -55406 51802 -164487
7787 -283275 -185897 -148703 -73700 -146505 -163553 -127200 -48491 102080 -294516 -364149 -382664
7776 -382664 151370 281114 -127855 -248734 236818 -22284 105847 354008 149721 -50584
7765 65190 -283780 2456 13311 78392 77325 -123425 -141757 -34012 -173394 -68684 23877 -139122
7752 -452315 -224634 -373 -64680 -333477 -145472 71877 -205389 40064 143497 -88105 -111499
7741 -111499 -51491 -145516 -55669 -25308 181729 -18005 -30105 138222 -106351 186023 115209
7730 115209 -18315 37749 -144018 -61192 100430 158356 -131555 125557 -307313 -95870 129591
7718 -293025 77346 -26692 -400051 169801 371853 192405 22739 -64748 -412939 120387
7707 -162745 -249381 -242828 -111411 -59048 -158850 333362 33529 11048 -103630 220304 -40396
7695 -216518 -36388 -247861 -149290 164007 -280168 207622 63707 -43791 -201246 271358
7684 -14597 138457 120637 -109740 -341941 -382687 -54205 -30746 190715 125135 -397000 -244276
7673 -244276 109910 -52092 -108223 -137879 -155114 -191273 95412 14319 14563 -27297 129221 197932
7661 197932 69434 72117 -38504 -41251 -6843 -133818 243136 -239339 206927 97051 -290112
7649 -61834 -131839 233752 -166003 -282023 -189443 -107560 294007 -84768 295855 235742 -66120
7637 -40566 154488 -309702 204954 -114903 -55534 -84740 -59400 106439 147471 -134323 -91568
7626 -91568 82325 -129415 -86777 -33973 -24432 -47759 242415 -249367 -529661 -112312 46308
7614 60607 -55678 -78872 -112750 -109521 -35273 157718 -80991 -74780 264298 79943 178313 89390
7602 89390 63700 232157 -48378 -137829 -16502 54735 261477 -209618 96632 21077 16295
7591 16295 37808 -244890 -43971 30601 -42858 -299181 -92754 -358054 39591 -327504 -92646
7579 -115189 120854 -412236 -101714 -181280 -15612 23755 -19943 82449 14015 -40719 145352
7567 -202838 109258 -219105 -91952 -138895 139975 -87959 -657 97376 79552 -5098 159187
7555 234503 2181 -87803 -95599 -187009 -30912 -235555 -10842 -107 122197 29504 -224516 -245854
7543 -245854 259734 119981 -487789 -62938 168783 162968 -235947 40467 -17270 201557 -115078
7531 222530 -16800 -13566 100092 68266 -3623 345305 -172986 -212446 -92966 263237 103711
7519 79359 -203437 73779 8537 88215 -120320 -226328 267344 -289084 157141 -358690 133880
7507 -94680 3406 -207468 -8079 63873 194376 253876 50775 235094 24679 33006 -142382 -2213
7494 -5945 76439 184776 136820 -377257 87242 -21683 52064 -93138 -380317 -72374 -175695
7483 -175695 -339907 119251 28702 -113905 -61993 -387124 38919 1587 -146889 119146 -265075
7471 -254160 -26047 -140309 -114534 70462 319582 -160192 71608 94901 129175 84625 101337
7460 101337 91681 42088 210678 247491 -81615 -2316 299414 92235 -30633 -55926 207608
7448 94925 283441 -108762 136910 100831 10371 -142129 94634 167713 150577 -166019 198543
7436 139357 -79220 150329 -1279 -12575 -390035 -20010 133892 -237237 -358078 80522 -189565
7424 -149825 5781 -83504 -56048 -3305 -153866 338097 225872 -7334 -271166 30231 -39307
7412 12806 -179968 -108155 -212117 -525281 -94247 -118424 -194233 -9376 -37725 -201637 -11369
7400 -5369 -116461 -62393 134822 -50675 -19786 335745 -69715 -189168 -77761 53544 144863
7389 144863 -27511 62451 -33125 5680 125145 127228 -149378 -38827 241014 -264695 198006
7377 -44770 38561 -62364 9772 124102 -22168 -12245 -31837 16348 -66398 -190456 -57389 -73573
7365 -73573 -250785 -5660 20203 275481 -134028 -355934 233461 -840 -290605 178231 398988
7354 398988 -116204 23776 -216467 113579 -51627 50940 134341 -22189 -23010 -123709 -57499
7342 110081 -83567 -111713 -551007 -2089 203761 -10943 125530 -13930 -116702 -192289 -116920
7331 -116920 -174202 -752 -11441 26842 -84123 12484 -40050 184805 -64251 -22527 -13372 -226334
7319 -226334 165628 -184586 -95230 -55205 12584 97722 201834 -81762 101305 -140488 -11696
7307 -55798 -35633 -68064 259552 -28583 -192766 -187716 -241859 -178909 -141490 -163706 194271
7295 41441 -183339 -74607 -149826 -80025 257269 -93933 -297188 -24426 -260112 -53149 -460231
7284 -460231 -151033 -86192 69763 12701 -124218 -155704 221206 -206208 86171 -28332 195139
7272 -104595 -179578 -24582 -173611 -94132 88706 114594 -94714 266668 69120 -88220 233069
7260 109108 -132189 24181 -57130 -97915 46973 -45151 231602 -123869 -27831 101298 -97756
7248 -188783 288054 -129788 201331 -304987 214382 -195072 -306291 -18312 115211 -168089
7237 -257830 92477 -83947 139363 98694 203579 134011 146707 -121715 -181519 -161098 -114506
7226 -114506 -155825 -44877 -4371 60132 -251625 -57400 -40255 62929 -79169 -43249 127590
7214 -374789 82045 47758 -25624 -61790 -107198 -157651 -211505 27016 209923 -220156 -1885
7202 -326688 868 176362 -526512 -181487 57324 106632 135871 -371534 -256950 -196141 27384
7190 -47727 -476907 -396877 82184 -284838 -207289 151121 -73761 -186538 -82634 97452 -10244
7178 -65401 -166283 -78243 180312 -83726 -237835 134297 73234 57575 -221637 -5076 -117894
7167 -117894 -126549 -237648 135242 21739 -214804 335150 -114294 235320 83490 -149640
7156 373027 -295961 -120517 -56682 35356 -117254 202208 232509 206987 -126425 -105063 102697
7144 -5075 120544 -101882 97663 126711 9167 10278 -182569 -114978 141992 -283836 -1982 67831
7131 -80220 110519 94958 98174 157028 -192436 152708 -198845 29911 -229120 -36657 186868
7119 318447 -214873 -97628 -84635 -29668 248021 -89895 -227135 -166040 52819 -296377 61976
7107 121319 15328 -268374 -132751 43382 -20764 -237606 -169382 96495 -48497 -315114 220303
7095 -104383 -174911 42098 -172345 -16662 12426 -749 168832 6739 29197 233441 -150728
7083 -288212 45068 -54046 132271 -210646 116905 -278871 -46302 -264055 -191139 132167
7072 81373 -215458 -178395 -46949 -129611 -417120 224197 127170 -173913 117266 -30072 -202955
7061 -202955 -145890 143765 -19282 85929 -10551 44413 -113143 -117451 126257 -99438 -244676
7050 -244676 -203825 -114652 -22625 8617 -172897 -46001 -23924 -397485 394420 -109239 -61302
7039 -61302 -75739 -70254 16244 167432 8661 -24567 95264 359149 -181798 -87710 213220
7027 -220551 147515 271640 -8733 336826 -18844 -459184 -89987 75598 -412149 160583 108106
7016 108106 60538 -17312 29964 -69459 -493415 269625 -192770 -230855 211267 168562 151671
7005 151671 -199443 323186 48402 -176978 -263601 -109128 -287751 78544 89126 -385433
6994 11887 375197 -286223 21849 137519 -100485 -21444 -728 46541 102120 193182 -226524
6982 49762 -347645 26967 -15424 8184 167490 151227 -480365 89045 -79894 -13065 -130689
6971 -130689 -136745 11757 -83874 147448 180963 206513 5453 -394998 -98132 -198432 136120
6959 -107768 -58926 41492 379246 199281 -192986 136630 30565 11004 -138207 -37202 30186
6947 -338603 -110299 98471 -143373 116037 -377623 -111103 -170960 -102140 -75354 384175
6936 -33094 124837 35251 -132237 -238626 -123549 -44665 3949 70295 125748 -10276 -101476
6925 -101476 249761 166037 57842 -351993 -137895 223608 -345654 -42864 95661 -61983 -248717
6914 -248717 149108 131529 279737 -92987 23560 309772 3226 79475 253440 -34395 -54440
6903 -54440 50058 -234739 82363 72448 200984 116319 -171615 158935 -4781 -119302 214507
6891 -118335 80477 53692 -18663 -255858 127465 -219434 217877 -167931 -138175 -141058 -118435
6880 -118435 -51452 -100420 112133 -18549 196470 -6727 -102652 82972 -195636 39608 -263005
6868 75608 -86695 -49380 220842 -55608 323005 67843 245531 -6119 -21847 88538 -169919
6856 35340 -70209 348480 97740 -51621 -349428 -93510 -204056 151109 106108 -141799 103758
6844 39809 185741 -173616 -64548 88289 91226 286354 -273146 315924 306193 101852 -79195
6832 65708 43806 124082 -300271 -360411 46228 129104 222849 137374 132433 -21281 -152746 -175924
6820 -175924 -286855 -76152 -159720 -184962 -314369 111496 156834 82356 -54275 24172 -62508
6808 -130280 -13116 -242906 -37485 -147222 -88082 -71418 -37364 86021 -181196 176336 -207005
6796 -103078 9854 -126147 -21405 -138556 43250 -16100 -164907 167635 35538 327777 81839
6784 -121869 33507 -201955 -106836 -374539 -3184 197560 171882 -220790 211004 -432879 -167507
6772 79895 -349793 58751 190989 245449 4420 -5865 34395 -172316 189518 218296 114206
6761 114206 -286748 -266051 -96315 -455173 -79805 52286 -143763 22329 95653 -163374 88272
6749 -79698 60806 -64904 46838 -337641 145284 209727 29921 349546 123982 -416057 66279
6737 -281014 82605 8503 -77153 258133 -23389 -57895 71592 25669 83074 -196352 131960
6725 -100126 -334176 122741 -22114 180280 -105580 -74939 224824 29817 129534 53358 82345
6714 82345 -125579 -198110 -67295 -306526 406945 -330148 -290490 -309542 -22419 19425 45222
6703 45222 116747 175822 90747 175466 -145468 93945 204231 319175 121532 -137208 36452
6691 238490 26783 382696 83991 -209315 -280541 67345 -59530 22633 40624 141105 -19033
6679 80781 -33983 345864 -91465 -5266 -100490 -191386 372738 -211615 -85661 352292 317832
6668 317832 156637 68597 9983 111579 -131335 -234851 -148401 -7459 124054 -161704 -7990
6656 -261675 -96698 53693 -39019 -38123 67360 -75037 -217264 -326128 211555 -13014 10039
6644 -35340 -50618 112480 -2352 179541 144910 -186417 56800 129503 68812 122205 -143486
6632 114092 -755 -142043 265070 21879 -238863 59196 -171463 90253 41789 -195977 -6370
6620 26428 -212355 -84256 -94985 14844 166560 -50150 189229 -97503 -460886 -58378 -437515
6609 -437515 28661 -288404 -28186 -112848 145827 -48190 -295141 -204604 -59927 -163448 59883
6597 -29930 182618 103108 -106585 -63448 122493 79463 171569 -78427 70595 113878 -20961
6585 -33799 -99212 -93443 -15195 150685 -195411 -106702 220783 -308611 110314 39545 -205604
6573 -226559 17908 -49200 -59755 -337147 -37028 116838 -125669 -250209 142173 -74809 18162
6561 -37383 86726 -280567 -367189 259856 42597 210599 -208747 -38493 113130 -192130 -47108
6549 24269 192854 -112366 97154 -331864 -113298 -146251 1828 48377 167904 -97878 -48999
6538 -48999 -125282 33304 -184676 -107581 81266 -260154 108763 237627 -295318 -150832 131644
6526 5303 243363 279133 -68292 -47201 13702 21354 117008 -259975 -121066 272010 -215117
6514 -141170 -67385 131864 -9449 -195318 -80986 -12258 111999 94271 86334 -42696 -179318
6503 -179318 2758 -42635 -299411 285853 -174603 -150068 328457 23488 -146280 23749 311993
6492 311993 -201331 -80564 175031 111337 215646 23046 -246961 -66633 -2636 74939 -189668
6480 -49319 171655 -52020 -95406 24773 182714 64295 -85127 129209 -99103 63128 146053
6469 146053 -159119 77887 265654 -115244 13996 277542 -47350 -140649 -46735 275267 -145941
6457 -123273 -161114 38260 -292267 184002 181555 -111183 207471 -117684 69421 -230566 225605
6445 107591 77138 -298103 20165 38471 -56583 111347 -78317 176031 216920 322158 -102481
6433 -119843 -41334 111756 272676 76620 278847 397234 -253097 39950 -65160 68924 -348987
6421 -261523 -188498 -54064 18066 32037 -228094 1727 -237992 -146893 -146694 45023 -269200 -373225
6409 -373225 327784 -12704 -328014 -154218 -195465 -23372 -231134 152947 -3510 116840 149109
6398 149109 -183664 -165511 28532 -235991 55941 47262 215694 21300 -205072 197169 -10349
6386 158988 -268536 -192977 251690 11624 -12209 173297 151699 123380 -31981 3654 -110851
6374 191025 -345040 -221692 -56874 -108383 1548 75200 -271030 -83712 -202916 -329827 -98960
6362 -51396 -144653 -41093 -21160 -75447 383502 -293227 316151 48189 -56273 -7176 -144124
6351 -144124 173298 149184 214612 274521 16051 -146613 -87457 204289 -41686 -47733 -98785
6340 -98785 70310 22183 -413541 -128054 -218205 62073 -38301 275718 198298 318601 61150
6328 122879 -75856 -26205 -95962 -95148 -62045 -20170 9359 -63958 -38954 -200770 223662 -243007
6315 247160 105078 -24806 14028 -277425 36800 -375117 44030 -314933 25266 -138369 111883
6303 58919 94963 159650 42518 -72708 61417 -13805 -101030 -122498 -171718 -149535 27940 -128294
6290 -66992 -54288 -41879 315998 -125833 422551 -169150 -21277 19627 -99140 226481 -76117
6278 289055 -91402 43398 227494 149782 92151 -76745 82121 -64959 151325 -33766 -319366
6267 -319366 69023 -129374 -324822 -344690 -139620 242386 65478 50333 -61756 -219818 61858
6255 123002 -178311 26486 7233 -112413 106584 -113502 177311 -48753 -67275 -164141 -48165
6243 13255 190607 -257685 147842 30695 139645 -63376 -12158 175950 -88817 -18887 52891
6231 -67457 42696 63182 39034 1762 -117608 -135872 124152 -464612 -117585 -13650 106703
6219 26824 28440 -29164 22778 179479 -158253 -126580 -95082 -198636 94082 -59324 -199107
6208 -199107 -426593 -8014 234061 347200 -177387 48278 -239295 296787 119258 5102 -272260
6196 -322430 74976 6014 4769 -147825 28909 -60185 -120081 -106811 -173350 207218 15852 103167
6184 103167 -26892 -6974 -106159 82494 -318623 249456 153421 56748 271151 -129371 386548
6172 -37513 134468 151742 126206 60558 -195688 19611 41455 134001 9074 48891 263291
6161 263291 -80126 129956 42508 89040 -30637 -9206 -137594 -151370 74925 317891 48559
6149 145592 -232777 -8406 -86378 87314 120821 -11413 -166212 -233515 332207 -11323 -158931
6138 -158931 14523 -158026 -164977 -83748 404231 138348 -280235 177590 -108529 -52991 109815
6126 -128044 180484 -45012 -172265 -141992 -150455 59090 232384 66703 -68398 -76845 111638
6114 53426 77827 -271402 99974 4026 214029 62853 -91082 -98423 63113 -167710 219726
6102 -334851 -119825 117922 -267715 -46885 75458 -33856 68523 -174005 88693 101973 -66674
6090 -64010 280253 -117125 195243 -69088 -109235 215834 21167 74616 185825 280388 -156124
6078 13512 73977 -131389 210020 -48462 -2169 -155973 -256381 175386 -1577 -412767 221249
6066 203346 -264465 68211 69537 154826 -45051 -114693 -222398 -33231 173392 72808 -172802
6054 -112816 286124 -42367 11689 217982 -69847 175511 30443 32552 168981 -229181 158529
6042 71467 -251618 -174534 -212070 -324601 78035 17068 112127 -41032 -193222 111936 348183
6031 348183 -196538 -392753 -25073 60722 266793 81418 286951 27346 -175098 130361
6020 -99302 161262 -95770 76190 -26474 24129 -279846 -15110 110234 -17496 -1983 223519
6008 148472 -181658 -327416 64438 168839 -266067 3414 50643 64611 -35401 -72006 -278595
5997 -278595 155143 -153034 133246 -16721 69117 -52913 245391 -156893 -142767 -211026 -157629
5986 -157629 -12455 244337 -203728 -345325 -398161 -111138 -221824 -96185 194327 -11189
5975 -7595 -15386 -100843 -221862 6627 155442 54188 -76236 -154066 338454 -62859 98408 296381
5963 296381 168772 85805 156732 -115230 1830 11867 -103865 -97048 8908 -142593 15003
5951 -9069 -167699 90005 -4325 -106510 128269 88705 -243922 39637 218399 81893 29451
5939 -40790 -57512 -6276 54817 -186304 90531 395673 210557 -3239 22575 171877 271312
5928 271312 150793 -243697 164921 111115 -17804 238001 -288172 138335 -261165 -217839
5918 -217839 -29783 -146052 -276231 136208 132685 -90258 -160948 -197944 62061 47767 77288
5907 77288 -3642 -365661 -107693 -254569 205330 183442 -246816 -2428 -86461 -243792 -356987
5896 -356987 -236774 50067 -11439 167362 -5996 50661 66492 -43918 64347 204050 231660
5885 231660 -294536 244099 -95554 -5915 406118 -78020 -23496 -249849 -401486 3587 161
5873 -288611 388250 309727 -53416 173799 60873 235413 -71111 -82398 43202 36681 -180871
5861 -279413 294458 -74086 280256 -68374 18311 36022 198169 132411 -338680 -84592 -34164
5849 262551 -321772 -13508 -185392 -147237 175747 -104269 84551 -309878 -227928 28935 84438
5838 84438 -113208 54092 65815 -83562 169783 -42923 -63334 348686 -349640 101454 261502
5827 261502 -127830 -520 -123268 -160112 439070 -199224 -245871 13472 -123013 33695 -18629
5815 89694 183128 -7442 95243 -144265 -107434 -8823 -116848 284671 201842 292 -138280 163497
5802 -124628 -196831 -491 -24634 -44580 -51380 273949 -56742 120243 200806 94208 215927 115844
5790 115844 145833 -301895 11752 16740 -94251 32738 125474 -6590 -59099 -22185 89920 -134085
5777 -116367 -81474 113776 92334 197708 -61435 -29206 -12376 -42463 128273 54991 -1987
5765 -53997 -56810 -154320 -129496 47655 188623 152991 -11253 -156066 123905 -265225 -26520
5753 -41472 49444 2747 -190317 -217640 213341 -68487 11841 56282 -181834 377533 -46847
5741 108181 489781 -20283 -67482 112513 -232047 60849 -27421 -121388 188312 445192 128668
5729 -196002 29333 350468 -223762 -68909 -188820 -159228 -92555 -36425 -6852 189576 77076
5717 -8928 -80087 180378 -158722 26501 61391 180493 274456 -75236 -216560 219754 54396
5705 -270696 347873 54114 -124306 -274601 -80283 1667 334905 -6668 61358 -160974 108431
5693 -469679 -75856 -50063 -112581 206898 -2691 298845 -322409 47537 -156407 -166539 -249526
5682 -249526 11672 -152004 -11666 -67302 157842 122949 83996 520770 -113310 27417 -248956
5670 -73709 168573 -107871 -228404 52877 -280738 263986 -57963 28690 -6236 -57657 -277143
5659 -277143 -199592 -55727 80562 135157 -99726 74269 94439 20224 -520876 83084 -10937
5647 166619 8977 -1242 138814 137475 -86083 92964 92943 136430 56547 103025 -352431 260041
5634 -140412 27997 105204 83175 161211 -104656 -221262 -25628 -4746 37711 -66733 -6969 7298
5621 176070 -130525 292323 -167591 127342 387307 -58250 -177208 169958 90077 -52183
5610 -159593 -22129 -49766 84656 92092 7267 -56690 49511 -247637 70734 34976 -195937 -87368
5597 -23597 -190478 -102124 -21222 -18894 -291927 -344798 -52737 -37404 -23150 -62251 -58842 2158
5584 -185787 -2804 -36883 323079 112531 95921 63910 -22202 -253374 155460 254439 -98295
5572 25703 -145438 150815 -164227 308233 318725 302481 14631 -301415 -242296 34812 -116353
5560 128994 -66191 -221693 -240788 -49607 186372 57748 162447 133398 194452 -109593 151294
5548 86926 -42635 -43382 135362 -32708 -174390 -106127 259821 -151206 -67643 76578 -366845
5536 -76991 -162888 246919 -245196 -56814 257565 -66290 220596 -181994 -6166 220289 63319
5524 152809 -48213 40788 -10916 -53544 -30684 180066 85654 148711 -16025 -56676 -225732
5513 -225732 125992 -276640 64068 -171731 -53954 139248 -318579 53178 -149731 189036
5502 125603 80049 44101 -127931 30814 213503 -53971 192901 -115100 -15211 -65839 -62420
5491 -62420 -169086 -191580 -305625 -44843 -385428 24072 -50556 -49846 169383 139443 -94133
5479 -301963 93088 -154537 81249 254340 -83861 208988 90936 -29195 -23943 -12118 -54858
5468 -54858 136372 41853 47026 -2612 -22247 -11906 -336873 -123272 -142979 151899 39639
5456 -39140 194709 -245238 -154901 -218462 99187 66325 202580 31188 102189 363238 186228
5445 186228 69349 135965 29041 -260952 -191490 223174 -38556 -286403 98790 158417 -2343
5433 -58272 -50530 -107134 -325251 110474 -289004 95590 -70468 274909 125334 -238022 -182306
5422 -182306 351399 14391 97094 77426 -53066 -42558 65526 18521 -16020 -38615 -39035 -169203
5410 -169203 193403 -273526 -283129 65480 45296 346994 233350 108276 -10876 -199311 4787
5398 30565 -186253 -44144 185988 -41234 -25398 -44987 -8050 -100081 -191132 -126151 203032
5386 -48259 52650 -10668 -19375 -390591 358337 -188446 50918 264213 65289 -14710 43486
5374 -94582 -113651 -14020 177571 313723 -132463 247097 -244243 -119095 -50560 105832
5363 -218967 439163 20242 -49286 30511 149407 -96063 106148 20734 172222 40404 -263584
5351 -496863 -1263 -78896 56712 39734 -150830 -124767 -172399 10819 175271 9746 90851 75468
5339 75468 -10227 -17175 -357173 -89192 49603 65717 -97690 139974 72170 219035 23835
5327 28708 301191 -17716 221159 -165724 -51303 -89711 152207 84725 114939 -181620 -189488
5316 -189488 320498 117669 -32815 -119417 74247 -333 -389344 -82616 59883 27360 21012 -88858
5303 190683 367257 -11169 56457 245691 110473 4960 -141518 228935 137643 -88348 310892
5291 -9664 101943 -110395 -328463 -441790 -60978 -263856 227385 -65692 -425795 224249
5280 26227 301226 8288 39862 253068 106132 160576 -16002 101984 -70050 -30320 -31824
5269 -31824 253060 -62026 -6258 68657 56949 72863 159876 78676 12787 76837 310306 41708
5256 242342 -144574 -86978 -16475 262948 77978 42008 -212810 102962 32937 430069 68243
5244 160584 -133840 -9145 12427 -150910 33499 -96586 -82901 -182461 -93385 -73164 118819
5232 -107226 -112416 261509 -32130 -158642 89091 240611 -5972 154298 -149002 -175381 -173124
5221 -173124 36375 212836 -311130 -185208 -157437 -65871 219855 -278107 -15591 -27609 -8506
5209 -21108 -102302 -370314 -111469 132783 83321 289099 -46275 57247 -89362 164350 -77814
5197 105234 387759 3366 -83188 5389 -223801 -139153 -33539 -189952 1408 -47942 -257715
5186 -257715 274741 -251384 -16009 293594 -138650 -216503 94819 247006 -23168 -167021
5176 -167021 91912 -167977 24859 -23841 -257633 -46163 21842 -2475 -228117 -39643 -139938
5165 -139938 -7393 -6907 -101572 32163 -192981 -58427 -96322 -181895 114903 -131966 221517
5153 -257736 -233930 410716 17876 132381 -2688 -67 30459 -180393 -147550 43985 -158690 -160982
5141 -160982 183502 118292 271197 27228 117523 137350 -199284 -179437 -184963 -166486 45182
5129 13944 70668 14657 -45062 248756 22713 -46231 91535 57602 -138740 -70748 39334
5117 384001 25038 334957 59210 240377 -440403 -16872 -69990 -82860 204123 113243 -54945
5105 152158 1606 139093 -76039 -251730 2761 79735 100215 113783 16141 101978 -135378
5093 -92533 -57609 -137627 251599 -152718 122433 96931 -104919 231394 109112 278691
5083 278691 93805 -165456 -96561 -162456 220802 119355 87559 -181153 234572 -201698
5072 -182735 -56774 207773 -165330 -178476 -15306 85999 -111855 41043 489235 64158 -149268
5060 -121082 99147 -75455 -89867 -137985 57125 428708 -213632 -30191 -128207 47475 15980
5048 55539 8841 10894 -58986 42424 -22502 129609 -39780 -124479 -272994 32432 -155165 7807
5035 -312030 205374 -190561 75419 393959 -111880 186545 -71532 -122967 -115022 189919 -24118
5023 -181052 -56409 21379 -79647 144744 121353 28493 285058 178371 66484 -57648 68131
5011 129226 -44399 15653 41477 -36250 -249815 159870 -489109 221943 43748 123413 -177354
4999 -20834 97605 -1366 78799 96722 620 -54653 154836 268230 165379 -135293 -165694 -156123
4987 -156123 33876 338246 -43346 -116404 154987 -222450 251177 42550 128979 -232192 -16525
4975 177870 -304807 239880 29810 105640 221850 38816 63750 -158011 72643 72604 -111856
4963 -132228 -122557 -253151 46254 91850 57886 95451 -157151 -206880 136759 113047 -132215
4951 -101197 -18294 -27557 -40080 -206188 147419 63695 -115468 -188975 98215 -236595 23047
4939 -44287 58446 189303 181663 -124450 92982 50264 -300703 74402 327224 -98614 -59692
4928 -59692 47623 -115795 -179672 -321781 372457 86864 7733 221880 242952 -137577 -125809
4917 -125809 226793 35924 -8575 -57468 -33577 -246482 198948 85167 -148022 -27822 112993
4905 -151033 111674 209621 -80477 111990 -208653 -136565 178690 -47668 -4215 9 -83218 -376586
4893 -376586 -69397 -336 313671 -188398 -80480 248945 -201189 9203 -193917 -81470 128708
4881 -55049 -29060 62295 117484 -131133 106151 64410 172704 133630 38634 -396162 -108967
4869 -147929 -3952 241937 205059 -130096 -196827 -160793 159854 -8897 44535 68685 225905
4858 225905 15843 52171 -268292 -32209 136785 121047 55363 49349 -69927 7990 -33430 -92672
4846 -92672 262345 56043 53505 -9867 284624 -109756 112178 -117357 -105494 -60810 64191
4834 188395 -51221 -52668 210216 22857 106443 -32252 75397 2116 229430 -167018 124766
4822 -75608 42255 -132393 176321 299717 9644 -199293 -314002 131994 51028 437 175899
4811 175899 -41324 -101263 -121378 -81601 -133401 8823 12299 296944 180425 56278 -214137
4799 -172858 -285700 268166 202617 67091 19210 -66263 -42751 196567 89830 181579 133520
4788 133520 78494 224729 151250 307598 202684 218271 -171653 59775 -324511 87357 -69045
4776 172456 -212893 254048 144664 48839 -129191 345019 -339192 -171976 113842 -148453
4765 -173140 287994 86261 -68651 256938 46705 196779 33956 -30825 -109941 23274 262661
4754 262661 42291 -85394 -174820 174768 -47589 309557 -177736 -183863 -36326 256279 -173573
4742 -97811 196867 119850 102505 -237925 -17893 177456 55138 169560 222003 198567 48388
4730 -177413 74489 125696 -47741 -37738 127992 90838 -163247 -200176 110079 -124782 50541
4718 -108111 -40928 12590 48124 16245 16644 -149995 133364 90250 -131653 -156382 -176630
4707 -176630 -289206 -17215 73205 256540 206173 -89151 35586 -241240 13600 -48341 -57752
4696 -57752 -340072 -157597 11129 187941 245546 -31636 -11873 -22649 61026 -327079 -16653
4684 61307 -115666 -55068 213432 -149744 190943 -163635 35361 -139190 -230715 181850
4673 170315 148619 20364 195592 211991 -186136 180679 335259 178120 5895 152208 10328
4661 271812 63140 276555 -171561 -2204 87704 -155447 1189 -36082 21043 106061 127172
4650 127172 -128515 -104346 96699 -64731 285115 261635 -143618 187682 147366 135673 63499
4638 -8391 157529 184303 -9389 84685 193687 -235814 160196 -104264 255717 357878 166135
4626 -188080 6450 151342 -79619 -124670 104911 -327742 19383 241445 174783 284228 154579
4615 154579 -252305 274355 -256273 551858 -96781 -172818 -25751 -293763 156075 291306
4605 291306 -60957 -161104 117102 26867 -223341 111147 25789 -573860 51327 82959 118492
4594 118492 147718 -22306 -180245 361956 88299 96024 100182 267408 -111345 -412746 -45698
4582 -245297 72979 -93218 260384 262558 -191178 288456 207849 -19359 -257600 -315426 -71450
4570 -74897 132675 161071 -177078 -72950 -99857 47317 -92859 -358160 52642 20432 115108
4559 115108 244440 -151324 -147932 -226646 34742 273459 145820 -352029 -49467 196098 12182
4547 -279499 -558863 -216215 -73111 50710 -36311 82226 270190 242749 -128971 -67629 167862
4535 -17745 -66703 -80263 -41717 82267 209620 -35406 -23746 52964 345915 287759 -55188
4523 -106312 -112243 139151 32007 -126004 -189607 -94663 172572 292866 182301 -201674 145884
4511 128961 182309 -120889 -122832 25951 113251 -134712 294709 -24719 -162095 -317161 77694
4499 -152448 4857 -83356 226773 146499 76072 73864 -36936 43206 -145895 -83406 246219
4487 230913 -35285 20447 -272732 -58858 -65421 -108001 31642 36689 102343 -21509 -121034 129214
4474 -136510 -69695 284759 179872 -10866 -179061 -194313 -33803 -134725 20233 4846 356806
4463 356806 -4692 123320 -160643 56111 57191 -179139 -31741 -48816 201724 103534 117948
$$ [...]
##END NTUPLES=NMR SPECTRUM
##END=
