##TITLE=NES1020_964111_9266076_U74jjMK0If
##JCAMPDX= 6.0         $$ Bruker NMR JCAMP-DX V2.0
##DATA TYPE= NMR SPECTRUM
##DATA CLASS= NTUPLES
##ORIGIN= BRUKER
##OWNER= Administrator
$$ 1.72 TOPSPIN		Version 2.1
$$ 2015-07-09 14:37:35.222 -0700  Administrator@X
$$ Compression mode = diff/dup
##.OBSERVE FREQUENCY= 400.02188249412
##.OBSERVE NUCLEUS= ^1H
##.ACQUISITION MODE= SIMULTANEOUS (DQD)
##.ACQUISITION SCHEME= undefined
##.AVERAGES= 64
##.DIGITISER RES= 22
##SPECTROMETER/DATA SYSTEM= spect
##.PULSE SEQUENCE= noesygpps1d.comp
##.SOLVENT NAME= COFFEE_meoh
##.SHIFT REFERENCE= INTERNAL, COFFEE_meoh, 1, 14.96318
##AUDIT TRAIL= $$ (NUMBER, WHEN, WHO, WHERE, PROCESS, VERSION, WHAT)
$$ ##TITLE= Audit trail, TOPSPIN		Version 2.1
$$ ##JCAMPDX= 5.01
$$ ##ORIGIN= Bruker BioSpin GmbH
$$ ##OWNER= Administrator
$$ $$ E:\/data/COFFEE/nmr/NES1020_964111_9266076_U74jjMK0If/12/pdata/1/auditp.txt
$$ ##AUDIT TRAIL=  $$ (NUMBER, WHEN, WHO, WHERE, PROCESS, VERSION, WHAT)
(   1,<2015-07-09 14:37:29.722 -0700>,<Administrator>,<X>,<go>,<TOPSPIN 2.1>,
      <created by zg
	started at 2015-07-09 14:26:00.285 -0700,
	POWCHK enabled, PULCHK disabled,
       configuration hash MD5:
       21 0F 79 D6 B3 7B B4 F6 88 20 88 DB 03 48 BD 9F
       data hash MD5: 64K
       DE 60 16 63 E2 5D 3E 39 41 30 DD 6C 26 C6 2D 11>)
(   2,<2015-07-09 14:37:33.160 -0700>,<Administrator>,<X>,<proc1d>,<TOPSPIN 2.1>,
      <Start of raw data processing
       efp LB = 0.3 FT_mod = 6 PKNL = 1 PHC0 = 0 PHC1 = 0 SI = 128K 
       data hash MD5: 128K
       E3 31 2E B8 05 37 D4 5D 3A C0 C6 42 F6 BC A1 E2>)
(   3,<2015-07-09 14:37:34.035 -0700>,<Administrator>,<X>,<proc1d>,<TOPSPIN 2.1>,
      <pk PHC0 = -87.91809 PHC1 = 0 
       data hash MD5: 128K
       F7 4C 7E F0 B0 C1 E9 2D 74 05 CD BD 9C 56 96 FB>)
(   4,<2015-07-09 14:37:34.410 -0700>,<Administrator>,<X>,<proc1d>,<TOPSPIN 2.1>,
      <abs ABSG = 1 
       data hash MD5: 128K
       92 48 7F E6 67 58 EE F7 6E 4E 4F 1D 8B 75 3B 3A>)
(   5,<2015-07-09 14:37:34.503 -0700>,<Administrator>,<X>,<proc1d>,<TOPSPIN 2.1>,
      <abs ABSG = 2 
       data hash MD5: 128K
       B8 70 8E 3F FC 4B 50 6F D9 EE 85 9F A8 C4 63 A6>)
(   6,<2015-07-09 14:37:34.581 -0700>,<Administrator>,<X>,<proc1d>,<TOPSPIN 2.1>,
      <abs ABSG = 3 
       data hash MD5: 128K
       32 03 01 D3 A0 81 3F 79 69 71 92 AA 49 10 26 FB>)
(   7,<2015-07-09 14:37:34.675 -0700>,<Administrator>,<X>,<proc1d>,<TOPSPIN 2.1>,
      <abs ABSG = 4 
       data hash MD5: 128K
       A5 BE F1 43 F8 F0 8E 9F D2 B0 77 BF 6B 28 63 9F>)
(   8,<2015-07-09 14:37:34.769 -0700>,<Administrator>,<X>,<proc1d>,<TOPSPIN 2.1>,
      <abs ABSG = 5 
       data hash MD5: 128K
       4E F6 5A 80 83 1E F7 EB AA 44 AB 5E BB E4 8D 44>)
$$ ##END=
$$ 
$$ $$ hash MD5
$$ $$ 52 3C B9 B5 84 9D B6 4C 15 91 A2 0A 0D F4 0D 1E
##$RELAX= 
##$RELAX= 
##$RELAX= 
##$RELAX= 
##$RELAX= 
##$RELAX= 
##$RELAX= 
##$RELAX= 
$$ Bruker specific parameters
$$ --------------------------
##$DU= <E:\>
##$EXPNO= 12
$$ [...]
##$TP07= 0
##$TPNAME0= <>
##$TPNAME1= <>
##$TPNAME2= <>
##$TPNAME3= <>
##$TPNAME4= <>
##$TPNAME5= <>
##$TPNAME6= <>
##$TPNAME7= <>
##$TPOAL= (0..7)
0.5 0.5 0.5 0.5 0.5 0.5 0.5 0.5
##$TPOFFS= (0..7)
0 0 0 0 0 0 0 0
##$TUNHIN= 0
##$TUNHOUT= 0
##$TUNXOUT= 0
##$USERA1= <user>
##$USERA2= <user>
##$USERA3= <user>
##$USERA4= <user>
##$USERA5= <user>
##$V9= 5
##$VALIST= <valist>
##$VCLIST= <CCCCCCCCCCCCCCC>
##$VD= 0
##$VDLIST= <DDDDDDDDDDDDDDD>
##$VPLIST= <PPPPPPPPPPPPPPP>
##$VTLIST= <TTTTTTTTTTTTTTT>
##$WBST= 2048
##$WBSW= 25
##$XGAIN= (0..3)
0 0 0 0
##$XL= 0
##$YL= 0
##$YMAX_a= 7940835
##$YMIN_a= -16752256
##$ZGOPTNS= <>
##$ZL1= 120
##$ZL2= 120
##$ZL3= 120
##$ZL4= 120
##$ABSF1= 14.96318
##$ABSF2= -5.595002
##$ABSG= 5
##$ABSL= 3
##$ALPHA= 0
##$AQORDER= 0
##$ASSFAC= 0
##$ASSFACI= 0
##$ASSFACX= 0
##$ASSWID= 0
##$AUNMP= <proc_prof1d_extract.lims>
##$AXLEFT= 0
##$AXNAME= <>
##$AXNUC= <1H>
##$AXRIGHT= 0
##$AXTYPE= 0
##$AXUNIT= <>
##$AZFE= 0.1
##$AZFW= 0.1
##$BCFW= 0
##$BC_mod= 0
##$BYTORDP= 0
##$COROFFS= 0
##$CY= 15
##$DATMOD= 1
##$DC= 0
##$DFILT= <>
##$DTYPP= 0
##$F1P= 0
##$F2P= 0
##$FCOR= 0.5
##$FTSIZE= 131072
##$FT_mod= 6
##$GAMMA= 0
##$GB= 0
##$INTBC= 1
##$INTSCL= 1
##$ISEN= 128
##$LB= 0.3
##$LEV0= 0
##$LPBIN= 0
##$MAXI= 10000
##$MC2= 0
##$MEAN= 0
##$ME_mod= 0
##$MI= 0
##$NCOEF= 0
##$NC_proc= -2
##$NLEV= 6
##$NOISF1= 0
##$NOISF2= 0
##$NSP= 0
##$NTH_PI= 0
##$NZP= 0
##$OFFSET= 14.96318
##$PC= 1
##$PHC0= -87.91809
##$PHC1= 0
##$PH_mod= 1
##$PKNL= yes
##$PPARMOD= 0
##$PPDIAG= 0
##$PPIPTYP= 0
##$PPMPNUM= 2147483647
##$PPRESOL= 1
##$PSCAL= 4
##$PSIGN= 0
##$PYNMP= <proc.py>
##$REVERSE= no
##$SF= 400.020008766192
##$SI= 131072
##$SIGF1= 0
##$SIGF2= 0
##$SINO= 400
##$SIOLD= 131072
##$SPECTYP= <>
##$SREGLST= <1H.CDCl3>
##$SSB= 0
##$STSI= 131072
##$STSR= 0
##$SW_p= 8223.68421052631
##$SYMM= 0
##$S_DEV= 0
##$TDeff= 65536
##$TDoff= 0
##$TI= <>
##$TILT= no
##$TM1= 0
##$TM2= 0
##$TOPLEV= 0
##$USERP1= <user>
##$USERP2= <user>
##$USERP3= <user>
##$USERP4= <user>
##$USERP5= <user>
##$WDW= 1
##$XDIM= 131072
##$YMAX_p= 445898920
##$YMIN_p= -147743
##$CURPLOT= <Network HP LaserJet P1505>
##$CURPRIN= <$Network HP LaserJet P1505>
##$DFORMAT= <normdp>
##$LAYOUT= <+/1D_H.xwp>
##$LFORMAT= <normlp>
##$PFORMAT= <normpl>
##$SURQMSG= 1
$$ End of Bruker specific parameters
$$ ---------------------------------
##NTUPLES= NMR SPECTRUM
##VAR_NAME=  FREQUENCY,     SPECTRUM/REAL,   SPECTRUM/IMAG
##SYMBOL=    X,             R,               I
##VAR_TYPE=  INDEPENDENT,   DEPENDENT,       DEPENDENT
##VAR_FORM=  AFFN,          ASDF,            ASDF
##VAR_DIM=   131072,        131072,          131072
##UNITS=     HZ,            ARBITRARY UNITS, ARBITRARY UNITS
##FACTOR=    0.0627417313425164, 1,          1
##FIRST=     8223.62146879497, -568,         -51903
##LAST=      0,             856,             -53311
##MIN=       0,             -147743,         0
##MAX=       8223.62146879497, 445898920,    0
$$ Real data points
##PAGE= N=1
##DATA TABLE= (X++(R..R)), XYDATA
$$ [...]
60970A7267908L054732L062251K696692K020154J204557M46450r8579l36927k48613
$$ 17267908 20322640 23384891 26081583 28101737 29306294 29752744 29654165 29317238 29068625
60961B9068625Q6673M83343P09488N96015J18630o05922j393548k074227k538320
$$ 29068625 29155298 29638641 30348129 30944144 31062774 30456852 29063304 26989077 24450757
60952B4450757k747712k727148k542227k268744j967121j674127j408416j177497
$$ 24450757 21703045 18975897 16433670 14164926 12197805 10523678 9115262 7937765
60944G937765r81199q15317o76148n61815m69906l96418l37778k92042k57188
$$ 7937765 6956566 6141249 5465101 4903286 4433380 4036962 3699184 3407142 3149954
60935C149954k29878k06962j87016j69449j53323j37981j23788j11128r9445q8180
$$ 3149954 2920076 2713114 2526098 2356649 2203326 2065345 1941557 1830429 1730984 1642804
60925A642804p7973o9954o4447o1033n9243n8319n6951n4250n0515m6434m2073
$$ 1642804 1564831 1494877 1430430 1369397 1310154 1251835 1194884 1140634 1090119 1043685 1001612
60914A001612l7458l3369l0513k8379k5955k3216k0866j8955j6891j4635j2855
$$ 1001612 964154 930785 900272 871893 845938 822722 801856 782901 766010 751375 738520
60903G38520j1866j1303j0836j0381r628q275o770n935n704n019l308j344k47
$$ 738520 726654 715351 704515 694134 684506 676231 669461 663526 657822 652803 649495 648151 647904
60890F47904j36j39N69J988L398M071M001L888M283M992N508N752O025O485P080
$$ 647904 647768 647629 648198 650186 653584 657655 661656 665544 669827 674819 680327 686079 692104 698589 705669
60875G05669P760Q349Q384P571O182M695L234J656j36k269m827p339q878r253
$$ 705669 713429 721778 730162 737733 743915 748610 751844 753500 753364 751095 746268 738929 730051 720798
60861G20798r512j0517j1576j1382r861q183p143o564o073n501m518k855q94Q08
$$ 720798 711286 700769 689193 677811 667950 659767 652624 646060 639987 634486 629968 627113 626219 627027
60847F27027K481M766P405R287R946J0102J0538J1308J2221J3220J3957J3782
$$ 627027 629508 634274 641679 650966 660912 671014 681552 692860 705081 718301 732258 746040
60835G46040J2577J1043R980R762J0584J2349J4181J4824J3873J2092J0352Q915
$$ 746040 758617 769660 779640 789402 799986 812335 826516 841340 855213 867305 877657 886572
60823H86572P843P244O852O102M990M196M058M025L439K324J178M59L90O84M02
$$ 886572 894415 901659 908511 914613 919603 923799 927857 931882 935321 937645 938823 939282 939672 940356 940758
60808I40758j221l766o142q039r975j1994j3480j4428j5601j6987j7399j6374
$$ 940758 939537 935771 929629 921590 911615 899621 886141 871713 856112 839125 821726 805352
60796H05352j5089j4505j3746j1538q425o134n167m336k529J41K890N051O231
$$ 805352 790263 775758 762012 750474 742049 735915 730748 726412 723883 724024 726914 731965 738196
60783G38196O428O106N697N102M098K962K178J748J336R25P04N62K77J08N15J388
$$ 738196 744624 750730 756427 761529 765627 768589 770767 772515 773851 774776 775480 776042 776319 776427 776942 778330
60767G78330K149K569K961L428L592L226K790L043M318O307Q362R964J0983J1620
$$ 778330 780479 783048 786009 789437 793029 796255 799045 802088 806406 812713 821075 831039 842022 853642
60753H53642J2116J2583J3112J3753J4354J4579J4275J3619J2735J1408R388O885
$$ 853642 865758 878341 891453 905206 919560 934139 948414 962033 974768 986176 995564 1002449
60741A002449M491K705J603R79O88Q09J353J858J603L94j135k377l572n285p456
$$ 1002449 1006940 1009645 1011248 1012227 1012915 1013724 1015077 1016935 1018538 1018932 1017797 1015420 1011848 1006563 999107
60726I99107r576j1570j3675j5557j6480j6477j6469j6992j7602j7879j8174j8812
$$ 999107 989531 977961 964286 948729 932249 915772 899303 882311 864709 846830 828656 809844
60714H09844j9244j8676j7172j5546j4386j3616j2816j1707j0324q830p088m723
$$ 809844 790600 771924 754752 739206 724820 711204 698388 686681 676357 667527 660439 655716
60702F55716j858N49J819K647M164O153P398P765Q573J0469J2309J2812J2201
$$ 655716 653858 654407 656226 658873 663037 669190 676588 684353 692926 703395 715704 728516 740717
60689G40717J1310J0115Q170N736L444J242j368m403p452j0308j2896j4871j5857
$$ 740717 752027 762142 770312 776048 779492 780734 779366 774963 767511 757203 744307 729436 713579
60676G13579j5886j5195j4018j2808j2023j1327r784p304n074l930l242k096p71
$$ 713579 697693 682498 668480 655672 643649 632322 622538 615234 610160 606230 602988 600892 600121
60663F00121L1M94J142J531Q09p53j903k012j478p56M1O60Q09Q40J460K612L315
$$ 600121 600152 600646 601788 603319 604128 603375 601472 599460 597982 597226 597267 597927 598736 599576 601036 603648 606963
60646F06963K776J217m83j483j418m74Q23K114L371M566N544O363P280Q249Q983
$$ 606963 609739 610956 610473 608990 607572 607098 607921 610035 613406 617972 623516 629879 637159 645408 654391
60631F54391R634J0607J1571J1664J1028J1002J2178J3486J3943J4108J4744J5278
$$ 654391 664025 674632 686203 697867 708895 719897 732075 745561 759504 773612 788356 803634
60619H03634J4951J4387J4528J4782J3893J2040J0493R592Q607P284N971M428
$$ 803634 818585 832972 847500 862282 876175 888215 898708 908300 916907 924191 930162 934590
60607I34590K098o68k891m396n569o116n577m786n082o245o938p159q224j0148
$$ 934590 936688 936020 933129 928733 923164 917048 911471 906685 901603 895358 888420 881261 873037 862889
60593H62889j1160j0434r341r127r141q348p109o151n132l479j767r68j048j312
$$ 862889 851729 841295 831954 822827 813686 805338 798229 792078 786946 783467 781700 780732 779684 778372
60579G78372j470j536j245n14P9M7k52k55j04k07m71o65j078k073l312m061m072
$$ 778372 776902 775366 774121 773607 773686 773733 773481 773226 773122 772915 772444 771779 770701 768628 765316 761255 757183
60562G57183l637l100k734k769l148l421l193k403j074P04K438L427L660L974
$$ 757183 753546 750446 747712 744943 741795 738374 735181 732778 731704 732408 734846 738273 741933 745907
60548G45907N102O991R247J1605J3829J5853J8294K2093K7389L3422L9785M6759
$$ 745907 751009 758000 767247 778852 792681 808534 826828 848921 876310 909732 949517 996276
60536I96276N4047O0120O3533O3974O1295N4520M2892K7393J0300o481k1784l4474
$$ 996276 1050323 1110443 1173976 1237950 1299245 1353765 1396657 1424050 1434350 1427869 1406085 1371611
60524A371611m3426m8220m9138m6614m1271l4309k7076k0289j4051q451l606O48
$$ 1371611 1328185 1279965 1230827 1184213 1142942 1108633 1081557 1061268 1047217 1038766 1035160 1035808
60512A035808M449P465R261J0066J0612J1308J2067J2903J4167J6301J9691K4760
$$ 1035808 1040257 1047722 1056983 1067049 1077661 1088969 1101036 1113939 1128106 1144407 1164098 1188858
60500A188858L1731M0365N0308O1736P5270R1339J09928J30898J54140J79372
$$ 1188858 1220589 1260954 1311262 1372998 1448268 1539607 1649535 1780433 1934573 2113945
60490B113945K06136K34165K63563K94511L26645L58251L85405M01913M00697
$$ 2113945 2320081 2554246 2817809 3112320 3438965 3797216 4182621 4584534 4985231
60481D985231L76014L25002K48001J48528L3589q6411j99368k94539l65102m08614
$$ 4985231 5361245 5686247 5934248 6082776 6116365 6029954 5830586 5536047 5170945 4762331
60471D762331m26004m20722l98457l66059l29422k92024k55599k21631j91507
$$ 4762331 4336327 3915605 3517148 3151089 2821667 2529643 2274044 2052413 1860906
60462A860906j65594j43135j23336j06047r1273p8648o7692n8229n0261m3657
$$ 1860906 1695312 1552177 1428841 1322794 1231521 1152873 1085181 1026952 976691 933034
60452I33034l8143l3501k9660k6683k4548k2831k0918j8758j7056j6291j5878
$$ 933034 894891 861390 831730 805047 780499 757668 736750 717992 700936 684645 668767
60441F68767j4872j3141j1241r465p814o630o258o245n801n044m765m997m940
$$ 668767 653895 640754 629513 620048 612234 605604 599346 593101 587300 582256 577491 572494 567554
60428E67554m372l882l454k172K2J603J425L82J19R08J881K710L786N040N798
$$ 567554 563182 559300 555846 553674 553696 555299 556724 557106 557225 558133 560014 562724 566510 571550 577348
60413E77348N754N265M597L659K582J888J964K700L689M439M549M142L990M811
$$ 577348 583102 588367 592964 596623 599205 601093 603057 605757 609446 613885 618434 622576 626566 631377
60399F31377O373P680P968P279O102M958M236M073M136L819K835J574P20N70Q17
$$ 631377 637750 645430 653398 660677 666779 671737 675973 680046 684182 688001 690836 692410 693130 693700 694517
60384F94517J029J127J192R61j3j586k932l486l553l610l551l234l185l810m321
$$ 694517 695546 696673 697865 698826 698813 697227 694295 690809 687256 683646 680095 676861 673676 669866 665545
60369F65545l565j817o48q52j544j610j057m73n6K72M76O81J277K325L315L841
$$ 665545 661980 660163 659515 658663 657119 655509 654452 653979 653923 654195 654671 655352 656629 658954 662269 666110
60353F66110M032M074L957L971M642N822O562O347N772N463N171M408L427K745
$$ 666110 670142 674216 678173 682144 686786 692608 699170 705517 711289 716752 721923 726331 729758 732503
60339G32503K370K084K045K400K717K512J960J543J321J169J360K208L365M128
$$ 732503 734873 736957 739002 741402 744119 746631 748591 750134 751455 752624 753984 756192 759557 763685
60325G63685M357M554N092N792O284O379O032N139L494J100j489l470m746o085
$$ 763685 768042 772596 777688 783480 789764 796143 802175 807314 810808 811908 810419 806949 802203 796118
60311G96118p771q644p548n367m225m595m756l492j814j162j285j096n84n51j078
$$ 796118 788347 779703 772155 766788 762563 757968 753212 749720 747906 746744 745459 744363 743779 743228 742150
60296G42150j471j428j223j067j056j446k234k832k770k254j507k50J460K608
$$ 742150 740679 739251 738028 736961 735905 734459 732225 729393 726623 724369 722862 722612 724072 726680
60282G26680K479J953K437L903N115N492N673O275P185Q159R200J0172J0819J1315
$$ 726680 729159 731112 733549 737452 742567 748059 753732 760007 767192 775351 784551 794723 805542 816857
60268H16857J2227J3811J5675J7293J8509J9565K0913K2816K5029K7057K8862
$$ 816857 829084 842895 858570 875863 894372 913937 934850 957666 982695 1009752 1038614
60257A038614L0865L3160L5472L8030M1637M6455N1581N6431O1620O7808P4616
$$ 1038614 1069479 1102639 1138111 1176141 1217778 1264233 1315814 1372245 1433865 1501673 1576289
60246A576289Q1516Q8822R6743J04425J11134J17603J24689J31293J35164J35515
$$ 1576289 1657805 1746627 1843370 1947795 2058929 2176532 2301221 2432514 2567678 2703193
60236B703193J33352J29395J23123J14030J02447Q8873P3584N7096M0066K2641
$$ 2703193 2836545 2965940 3089063 3203093 3305540 3394413 3467997 3525093 3565159 3587800
60226C587800M834j2456k7757m0426n0728n8516o2927o3635o1368n6824m9956
$$ 3587800 3592634 3580178 3552421 3511995 3461267 3402751 3339824 3276189 3214821 3157997 3108041
60215C108041m0713k9683j7633m959Q213K1917L6399N1678O7059Q1750R5805J09654
$$ 3108041 3067328 3037645 3020012 3015053 3023266 3045183 3081582 3133260 3200319 3282069 3377874 3487528
60203C487528J22671J33254J40497J44811J46582J45009J38811J27503J11688
$$ 3487528 3610199 3743453 3883950 4028761 4175343 4320352 4459163 4586666 4698354
60194D698354R2607P1669M9865K7376M141j9250m1739o2715q1953r8628j11254
$$ 4698354 4790961 4862630 4912495 4939871 4944012 4924762 4883023 4820308 4738355 4639727 4528473
60183D528473j18963j22158j21647j17726j10405r9939q6845p1756n5441l8523
$$ 4528473 4409510 4287352 4165705 4047979 3937574 3837635 3750790 3679034 3623593 3585070
60173C585070k1073k960J5442L3357N0333O6221Q0452R1997J00031J03936J02752
$$ 3585070 3563997 3561037 3576479 3609836 3660169 3726390 3806842 3898839 3998870 4102806 4205558
60162D205558R5733Q3677O8824N2837L5682J6976k238j9810l4198m5330n3885
$$ 4205558 4301291 4384968 4453792 4506629 4542311 4559287 4557049 4537239 4503041 4457711 4403826
60151D403826o0133o3438o2695n7344m8002l5921k1889n995J1694L0788N0923
$$ 4403826 4343693 4280255 4217560 4160216 4112214 4076293 4054404 4048409 4060103 4090891 4141814
60140D141814P2069R4317J17699J42224J67849J94381K21760K50202K79673L09277
$$ 4141814 4213883 4308200 4425899 4568123 4735972 4930353 5152113 5402315 5681988 5991265
60130E991265L37681L64018L87857M08334M23984M33448M35864M30441M16309
$$ 5991265 6328946 6692964 7080821 7489155 7913139 8346587 8782451 9212892 9629201
60121I629201L93084L61404L22704K78540K29978J77353J20776O0958o64o2756
$$ 9629201 10022285 10383689 10706393 10984933 11214911 11392264 11513040 11573998 11573334 11510578
60111A1510578j24425j84368k40281k89690l30889l62573l83323l92331l90298
$$ 11510578 11386153 11201785 10961504 10671814 10340925 9978352 9595029 9202698 8812400
60102H812400l78730l58818l31766k99483k63682k24786j82923j39673r7377n6872
$$ 8812400 8433670 8074852 7743086 7443603 7179921 6955135 6772212 6632539 6535162 6478290
60092F478290j7404K1231N7830R1105J20331J44263J60952J69245J69418J61843
$$ 6478290 6460886 6482117 6539947 6631052 6751383 6895646 7056598 7225843 7395261 7557104
60082G557104J46245J22879R3444O0166K4862j0602m4035p4002j00567j24334
$$ 7557104 7703349 7826228 7919672 7979838 8004700 7994098 7950063 7876061 7775494 7651160
60072G651160j45314j63240j78229j90522k00023k06523k09853k09561k05205
$$ 7651160 7505846 7342606 7164377 6973855 6773832 6567309 6357456 6147895 5942690
60063E942690j97236j86838j74545j59952j43112j25120j06616q6810o5022m2250
$$ 5942690 5745454 5558616 5384071 5224119 5081007 4955887 4849271 4762461 4697439 4655189
60053D655189k0075J433K3479M6506O9470R1124J10918J28425J42587J52100J56228
$$ 4655189 4635114 4636547 4660026 4706532 4776002 4867126 4978044 5106469 5249056 5401156 5557384
60042E557384J54989J48679J37434J21304J00685P6469M9677K1086q506l7997
$$ 5557384 5712373 5861052 5998486 6119790 6220475 6296944 6346621 6367707 6359201 6321204
60032F321204o6314r2836j17021j37824j54094j65376j71764j73227j69853j62613
$$ 6321204 6254890 6162054 6045033 5907209 5753115 5587739 5415975 5242748 5072895 4910282
60022D910282j52844j40943j26402j09298r0767p1859n2814l3746j5028L409K2374
$$ 4910282 4757438 4616495 4490093 4380795 4290028 4218169 4165355 4131609 4116581 4119990 4142364
60011D142364M2497O3611Q5395J07758J30231J51670J71087J88136K02284K12146
$$ 4142364 4184861 4248472 4333867 4441625 4571856 4723526 4894613 5082749 5285033 5497179
60001E497179K16126K13260K03208J86180J63251J36085J05886P3132L8567L530
$$ 5497179 5713305 5926565 6129773 6315953 6479204 6615289 6721175 6794307 6832874 6836404
59991F836404l1023o4948r7723j27611j52714j72204j85844j92953j92824j85884
$$ 6836404 6805381 6740433 6642710 6515099 6362385 6190181 6004337 5811384 5618560 5432676
59981E432676j73634j57536j38447j16929r3681o9683m6141k3957l161J6824L6181
$$ 5432676 5259042 5101506 4963059 4846130 4752449 4682766 4636625 4612668 4609507 4626331 4662512
59970D662512N4452P1365Q7162J01793J14352J23814J29843J32513J31658J27001
$$ 4662512 4716964 4788329 4875491 4977284 5091636 5215450 5345293 5477806 5609464 5736465
59960E736465J18560J06723R2166P5930N9155M2533K6306J0836l206j5164k4335
$$ 5736465 5855025 5961748 6053914 6129844 6188999 6231532 6257838 6268674 6265468 6250304 6225969
59949F225969k9746l0629k7043j9269o803J1173L4425O1928R3394J29262J69044
$$ 6225969 6196223 6165594 6138551 6119282 6112479 6123652 6158077 6220005 6313399 6442661 6611705
59938F611705K11132K54637L00049L47398L94990M40488M81875N16485N40386
$$ 6611705 6822837 7077474 7377523 7724921 8119911 8560399 9042274 9558759 10099145
59929A0099145N49820N42359N15914M67953L97322L06286J99914Q4046l5204j51035
$$ 10099145 10648965 11191324 11707238 12175191 12572513 12878799 13078713 13162759 13127555 12976520
59919A2976520k56814l47482m19685m71292n01930n13566n09510m92806m66014
$$ 12976520 12719706 12372224 11952539 11481247 10979317 10465751 9956241 9463435 8997421
59910H997421m31670l92059l48784l03384k57806k13414j70070j27118q4810m3879
$$ 8997421 8565751 8173692 7824908 7521524 7263718 7050304 6880234 6753116 6668306 6624427
59900F624427m181L5080P3939J11422J46537J78628K06779K29572K45404K52584
$$ 6624427 6620246 6655326 6729265 6840687 6987224 7165852 7372631 7602203 7847607 8100191
59890H100191K49300K34150K06580J66647J14908N3312j4198q2749j48163k07306
$$ 8100191 8349491 8583641 8790221 8956868 9071776 9125088 9110890 9028141 8879978 8672672
59880H672672k57522k96640l23584l38492l42377l36895l24057l05658k83176
$$ 8672672 8415150 8118510 7794926 7456434 7114057 6777162 6453105 6147447 5864271
59871E864271k58264k32821k08254j85388j65235j49051j37125j28355j21483
$$ 5864271 5606007 5373186 5164932 4979544 4814309 4665258 4528133 4399778 4278295
59862D278295j16031j11620j07387j02706r7507r1231q2603p1246n8529m5869
$$ 4278295 4162264 4050644 3943257 3840551 3743044 3651813 3569210 3497964 3439435 3393566
59852C393566l3257k0622r462j662K539L935K362l081j2119k3073l4430m5398
$$ 3393566 3360309 3339687 3330225 3328563 3331102 3335037 3337399 3334318 3322199 3299126 3264696 3219298
59840C219298n5157o2782o7951p0679p0541o7104o1071n3935m6473l8420k9451
$$ 3219298 3164141 3101359 3033408 2962729 2892188 2825084 2764013 2710078 2663605 2625185 2595734
59829B595734j9741r662L43R834J9037K8982M0218N1777O2132P0677P7393Q1789
$$ 2595734 2575993 2566331 2566674 2576508 2595545 2624527 2664745 2716522 2778654 2849331 2926724 3008513
59817C008513Q3219Q1879P8389P2916O5611N7274M8375L8053K5508J1901n94j1154
$$ 3008513 3091732 3173611 3252000 3324916 3390527 3447801 3496176 3534229 3559737 3571638 3571044 3559890
59805C559890k0144k6983l0071k8927k4673j8153r145K245J5029K8831M4700O3744
$$ 3559890 3539746 3512763 3482692 3453765 3429092 3410939 3401794 3404039 3419068 3447899 3492599 3556343
59793C556343Q5932J10700J37902J67768K00800K37962K80009L26232L74388M21504
$$ 3556343 3642275 3752975 3890877 4058645 4259445 4497407 4777416 5103648 5478036 5899540
59783E899540M63232M92027M97572M70525M06507L07620J82259M4109r0706k08108
$$ 5899540 6362772 6854799 7352371 7822896 8229403 8537023 8719282 8763391 8672685 8464577
59773H464577k99313l60850l93106l99558l86131l59557l25478k87790k49055
$$ 8464577 8165264 7804414 7411308 7011750 6625619 6266062 5940584 5652794 5403739
59764E403739k11046j75137j42437j13496q7933o4857m3699k4252o111J1277K7976
$$ 5403739 5192693 5017556 4875119 4761623 4673690 4608833 4565134 4540882 4534771 4546048 4574024
59753D574024M3686N8658P3769Q9534J05627J21714J38191J55764J74705J94918
$$ 4574024 4617710 4676368 4750137 4839671 4945298 5067012 5205203 5360967 5535672 5730590
59743E730590K16510K40068K66364K95864L28429L63601M01239M41448M83722
$$ 5730590 5947100 6187168 6453532 6749396 7077825 7441426 7842665 8284113 8767835
59734H767835N26586N68418O08024O43798O72781O91221O95989O85295O58907
$$ 8767835 9294421 9862839 10470863 11114661 11787442 12478663 13174652 13859947 14518854
59725A4518854O18662N68447N13002M57066M06030L66218L42908L38154L51431
$$ 14518854 15137516 15705963 16218965 16676031 17082061 17448279 17791187 18129341 18480772
59716A8480772L81847M28312M87699N54465O22536O86689P41979P82954Q04021
$$ 18480772 18862619 19290931 19778630 20333095 20955631 21642320 22384299 23167253 23971274
59707B3971274Q00160P67436P03952O11034M93372L58076K13848P0238o3716j80749
$$ 23971274 24771434 25538870 26242822 26853856 27347228 27705304 27919152 27989390 27925674 27744925
59697B7744925k75330l43101l81522l90984l74310l34995k76288k01413j13449
$$ 27744925 27469595 27126494 26744972 26353988 25979678 25644683 25368395 25166982 25053533
59688B5053533j4613R3753K10593L34975M66197O03136P43520Q84149J020962
$$ 25053533 25038920 25132673 25343266 25678241 26144438 26747574 27491094 28375243 29396205
59679B9396205J147827J255406J331943J364967J342191J252820J090798Q58018
$$ 29396205 30544032 31799438 33131381 34496348 35838539 37091359 38182157 39040175
59671C9040175N64536K26998j32136m85977q07999j077882j283476j419163j484951
$$ 39040175 39604711 39831709 39699573 39213596 38405597 37327715 36044239 34625076 33140125
59662C3140125j487160j437328j349259j237886j120235j014460r35763q92934
$$ 33140125 31652965 30215637 28866378 27628492 26508257 25493797 24558034 23665100
59654B3665100q87671r14658r61780j013074j054398j077314j078663j058587
$$ 23665100 22777429 21862771 20900991 19887917 18833519 17756205 16677542 15618955
59646A5618955j019796r66906r04826q37697p69203p02476o39052n79021n22724
$$ 15618955 14599159 13632253 12727427 11889730 11120527 10418051 9778999 9199978 8677254
59637H677254m71257m24994l82880l43908l08124k75606k45622k17562j91670
$$ 8677254 8205997 7781003 7398123 7054215 6746091 6470485 6224863 6007301 5815631
59628E815631j68130j46345j25822j06863q9753p4186o0102m8229l9171l2768
$$ 5815631 5647501 5501156 5375334 5268471 5178718 5104532 5044430 4996201 4957030 4924262
59618D924262k8955k8362l1469l7849m6732n7582o9613q1606r2582j02029j09202
$$ 4924262 4895307 4866945 4835476 4797627 4750895 4693313 4623700 4542094 4449512 4347483 4238281
59607D238281j13193j14038j12794j10088j05547r9050r1450q3512p5146o6167
$$ 4238281 4125088 4011050 3898256 3788168 3682621 3583571 3492121 3408609 3333463 3267296
59597C267296n6955m7837l8731k9874k1949j5019q267j267N413J1218J6208K0250
$$ 3267296 3210341 3162504 3123773 3093899 3071950 3056931 3048664 3047397 3052810 3064028 3080236 3100486
59585C100486K2695K3474K3489K3406K3020K2198K1506K1412K1905K3369K6661
$$ 3100486 3123181 3146655 3170144 3193550 3216570 3238768 3260274 3281686 3303591 3326960 3353621
59574C353621L1839L7920M4344N1556N9700O8090P6641Q6429R8026J10559J23312
$$ 3353621 3385460 3423380 3467724 3519280 3578980 3647070 3723711 3810140 3908166 4018725 4142037
59563D142037J37085J52988J70850J89795K09450K29763K50445K71256K91942
$$ 4142037 4279122 4432110 4602960 4792755 5002205 5231968 5482413 5753669 6045611
59554F045611L11397L27992L41304L52234L60699L64637L62319L54353L42393
$$ 6045611 6357008 6685000 7026304 7378538 7739237 8103874 8466193 8820546 9162939
59545I162939L27068L08544K88023K67388K47865K29864K13234J96884J79365
$$ 9162939 9490007 9798551 10086574 10353962 10601827 10831691 11044925 11241809 11421174
59536A1421174J60978J44600J33447J28715J29898J35861J44319J51413J53135
$$ 11421174 11582152 11726752 11860199 11988914 12118812 12254673 12398992 12550405 12703540
59527A2703540J46638J29602R9797N6698K408o0261j29444k02711k75339l42023
$$ 12703540 12850178 12979780 13079577 13136275 13138683 13078422 12948978 12746267 12470928 12128905
59517A2128905l99676m47038m82695n05366n15666n15670n07021m90931m69473
$$ 12128905 11729229 11282191 10799496 10294130 9778464 9262794 8755773 8264842 7795369
59508G795369m45058m18675l90128l59846l29081k98510k68151k38605k11026
$$ 7795369 7350311 6931636 6541508 6181662 5852581 5554071 5285920 5047315 4836289
59499D836289j85771j62213j39996j19465j00746q3387o6937n1218l6015k1100
$$ 4836289 4650518 4488305 4348309 4228844 4128098 4044711 3977774 3926556 3890541 3869441
59489C869441o361Q611K4566M1572N8613P5037R1783J10219J30327J51150J72510
$$ 3869441 3863080 3871691 3896257 3937829 3996442 4071479 4163262 4273481 4403808 4554958 4727468
59478D727468J95060K18900K43227K67109K89551L08903L23184L30930L31020
$$ 4727468 4922528 5141428 5384655 5651764 5941315 6250218 6573402 6904332 7235352
59469G235352L21938L01967K70072K26208J71334J07830L9407l0132r7803j61004
$$ 7235352 7557290 7859257 8129329 8355537 8526871 8634701 8674108 8643976 8546173 8385169
59459H385169k17122k64387l02182l29875l46442l52224l49915l42394l30449
$$ 8385169 8168047 7903660 7601478 7271603 6925161 6572937 6223022 5880628 5550179
59450E550179l13903k94061k73293k52788k32346k12093j92819j74718j57265
$$ 5550179 5236276 4942215 4668922 4416134 4183788 3971695 3778876 3604158 3446893
59441C446893j40411j24753j10505r7392q5453p4916o5283n5571m5497l5720k6930
$$ 3446893 3306482 3181729 3071224 2973832 2888379 2813463 2748180 2692609 2647112 2611392 2584462
59430B584462j9336j2777o806r99M336Q345J1058J3743J7140K0277K2064K3154
$$ 2584462 2565126 2552349 2545543 2544544 2548880 2557225 2568283 2582026 2599166 2619443 2641507 2664661
59418B664661K5128K8626L3353L8938M4545M8384M9213M7864M6271M5724M7161
$$ 2664661 2689789 2718415 2751768 2790706 2835251 2883635 2932848 2980712 3026983 3072707 3119868
59407C119868N1986O0901P2802Q6456J02374J21244J41407J60146J77046J94048
$$ 3119868 3171854 3232755 3305557 3392013 3494387 3615631 3757038 3917184 4094230 4288278
59397D288278K12625K33203K57213K87147L23975L66356M12720M62251N13291
$$ 4288278 4500903 4734106 4991319 5278466 5602441 5968797 6381517 6843768 7357059
59388G357059N62539O06588O42888O68748O80962O77369O57959O24201N78311
$$ 7357059 7919598 8526186 9169074 9837822 10518784 11196153 11854112 12478313 13056624
59379A3056624N23556M64019M03414L44547K89727K40459J96442J55829J16657
$$ 13056624 13580180 14044199 14447613 14792160 15081887 15322346 15518788 15674617 15791274
59370A5791274P7275L5577j0841o3316j21498j83782k47389l08229l61772m04256
$$ 15791274 15868549 15904126 15893285 15829969 15708471 15524689 15277300 14969071 14607299 14203043
59360A4203043m32652m44485m39325m20178l91967l58828l24061k91938k67256
$$ 14203043 13770391 13325906 12886581 12466403 12074436 11715608 11391547 11099609 10832353
59351A0832353k52762k48496k53733k67782k88645l12631l36109l56598l72063
$$ 10832353 10579591 10331095 10077362 9809580 9520935 9208304 8872195 8515597 8143534
59342H143534l80677l81868l76472l65539l49939l31080l10517k88600k64794
$$ 8143534 7762857 7380989 7004517 6638978 6289039 5957959 5647442 5358842 5094048
59333E094048k39648k15040j92220j70968j50961j32567j15803r9863q4378o9989
$$ 5094048 4854400 4639360 4447140 4276172 4125211 3992644 3876841 3776978 3692600 3622611
59323C622611n7174m5492l4416k3951j4056m380N110J4141K2903L1926M1139N0088
$$ 3622611 3565437 3519945 3485529 3461578 3447522 3443142 3448252 3462393 3485296 3517222 3558361 3608449
59311C608449N9088O8897P9262Q9055R7963J06620J14890J21469J25517J27315
$$ 3608449 3667537 3736434 3815696 3904751 4002714 4109334 4224224 4345693 4471210 4598525
59301D598525J26917J23532J16768J07271R5695Q2242O7654N3418M0550K9237
$$ 4598525 4725442 4848974 4965742 5073013 5168708 5250950 5318604 5372022 5412572 5441809
59291E441809K0096J4523J3331J6121K2417L2238M5155N9892P5404R1244J06506
$$ 5441809 5461905 5476428 5489759 5505880 5528297 5560535 5605690 5665582 5740986 5832230 5938736
59280E938736J19498J28908J34129J34188J27593J13920R4468P0999M4843J7451
$$ 5938736 6058234 6187142 6321271 6455459 6583052 6696972 6791440 6862439 6907282 6924733
59270F924733r502l5232o0006q3634j04797j22093j34557j40839j39386j30287
$$ 6924733 6915231 6879999 6819993 6736359 6631562 6509469 6374912 6234073 6094687 5964400
59260E964400j15909r8905q0396o0521l9758j9024P93J8876L4749M8719O1301
$$ 5964400 5848491 5749586 5669190 5608669 5568911 5549887 5550680 5569556 5604305 5653024 5714325
59249E714325P2146Q0389Q6023Q9911R2627R4569R7124J02200J10587J22271J38299
$$ 5714325 5786471 5866860 5952883 6042794 6135421 6229990 6327114 6429314 6539901 6662172 6800471
59238F800471J60419J88678K21248K57015K96087L36903L74866M05023M24460
$$ 6800471 6960890 7149568 7370816 7627831 7923918 8260821 8635687 9040710 9465170
59229I465170M30923M21105L92074L43430K76793J94160R8153o933j15605k22235
$$ 9465170 9896093 10317198 10709272 11052702 11329495 11523655 11621808 11614875 11499270 11277035
59219A1277035l21185m07036m75961n26473n58409n72100n69126n52703n26447
$$ 11277035 10955850 10548814 10072853 9546380 8987971 8415871 7846745 7294042 6767595
59210F767595m93333m56233m18067l80631l44254l09306k76940k47735k20916
$$ 6767595 6274262 5818029 5399962 5019331 4675077 4365771 4088831 3841096 3620180
59201C620180j95848j73166j53465j36054j20072j05879r4151q4459p5864o8282
$$ 3620180 3424332 3251166 3097701 2961647 2841575 2735696 2641545 2557086 2481222 2412940
59191B412940o2263n7832n4348n1048m7320m3034l8916l5852l3404l0072k5348
$$ 2412940 2350677 2292845 2238497 2187449 2140129 2097095 2058179 2022327 1988923 1958851 1933503
59180A933503k0476j6642j3580j0467p124l604L09M530Q582J2454J6616K0829
$$ 1933503 1913027 1896385 1882805 1872338 1865214 1861610 1861919 1866449 1875031 1887485 1904101 1924930
59168A924930K4281K7226L0948L5571L9529M2004M4234M7477N1282N4858N8641
$$ 1924930 1949211 1976437 2007385 2042956 2082485 2124489 2168723 2216200 2267482 2322340 2380981
59157B380981O3258O8311P3457P9409Q6600R4036J00689J06919J13213J18775
$$ 2380981 2444239 2512550 2586007 2665416 2752016 2846052 2946741 3053660 3166873 3285648
59147C285648J22653J25128J26522J25711J21272J13354J03057R0773P6381O0363
$$ 3285648 3408301 3533429 3659951 3785662 3906934 4020288 4123345 4214118 4290499 4350862
59137D350862M3564K6535J0187l855j4545k2221k7163k8503k5673j9628j1204
$$ 4350862 4394426 4420961 4431148 4427293 4412748 4390527 4363364 4334861 4309188 4289560 4278356
59126D278356N37J6719L6429N7747Q0266J04830J31487J59298J87712K16445K44246
$$ 4278356 4278893 4295612 4332041 4389788 4470054 4574884 4706371 4865669 5053381 5269826 5514072
59115E514072K69263K90307L06418L15430L14266L00650K73613K32980J79785
$$ 5514072 5783335 6073642 6380060 6695490 7009756 7310406 7584019 7816999 7996784
59106G996784J17228N0096j6739p8771j31675j72170j99254k13906k17896k13405
$$ 7996784 8114012 8164108 8147369 8068598 7936923 7764753 7565499 7351593 7133697 6920292
59096F920292k03161j89814j75270j61140j49255j40997j36508j35259j36929
$$ 6920292 6717131 6527317 6352047 6190907 6041652 5900655 5764147 5628888 5491959
59087E491959j41151j47113j54069j61712j69489j76273j81257j84419j85606
$$ 5491959 5350808 5203695 5049626 4887914 4718425 4542152 4360895 4176476 3990870
59078C990870j84147j80015j74334j67993j60717j52253j43301j34420j25133
$$ 3990870 3806723 3626708 3452374 3284381 3123664 2971411 2828110 2693690 2568557
59069B568557j15148j05380r6679q8575q0384p2543o5789n9897n4411m9675m6049
$$ 2568557 2453409 2348029 2251350 2162775 2082391 2009848 1944059 1884162 1829751 1780076 1734027
59058A734027m2862l9340l5757l2753l0261k8016k6145k4407k1844j8233j4788
$$ 1734027 1691165 1651825 1616068 1583315 1553054 1525038 1498893 1474486 1452642 1434409 1419621
59047A419621j2485j0791q986p504o810o240n084l662k081O92N155R961J3704
$$ 1419621 1407136 1396345 1387359 1379855 1373045 1366805 1361721 1358059 1355978 1356670 1361825 1371786 1385490
59034A385490J6783K0088K3132K5022K6022K6471K5353K1824J7054J2752Q780
$$ 1385490 1402273 1422361 1445493 1470515 1496537 1523008 1548361 1570185 1587239 1599991 1608771
59023A608771M075r13m624o561p301o928n142k364O86L947P362J0099J1725J3120
$$ 1608771 1612846 1611933 1607309 1600748 1593447 1586519 1581377 1579013 1579699 1583646 1591008 1601107 1612832 1625952
59009A625952J4908J6058J5491J3856J2124R711N815J410j976m383o503p842p784
$$ 1625952 1640860 1656918 1672409 1686265 1698389 1708100 1713915 1715325 1713349 1708966 1702463 1694621 1686837
58996A686837p255p227o707m472j641j12N36K052M360N965O788P962R343R888
$$ 1686837 1679582 1672355 1665648 1661176 1659535 1659423 1659959 1662011 1666371 1672336 1679124 1687086 1696429 1706317
58982A706317J0063J1291J3239J4214J4052J4190J5076J5876J6679J8513K1258
$$ 1706317 1716380 1727671 1740910 1755124 1769176 1783366 1798442 1814318 1830997 1849510 1870768
58971A870768K3773K6110K9333L3242L6620L9607M3476M7944N1144N2465N3190
$$ 1870768 1894541 1920651 1949984 1983226 2019846 2059453 2102929 2150873 2202017 2254482 2307672
58960B307672N4144N4824N5132N5781N6788N7506N8343O0502O3960O7673P1749
$$ 2307672 2361816 2416640 2471772 2527553 2584341 2641847 2700190 2760692 2824652 2892325 2964074
58949B964074P7308Q4311R1659R9466J08812J19246J28969J37833J47789J59915
$$ 2964074 3041382 3125693 3217352 3316818 3425630 3544876 3673845 3811678 3959467 4119382
58939D119382J73278J87299K03039K21435K42203K65132K90764L19356L50812
$$ 4119382 4292660 4479959 4682998 4904433 5146636 5411768 5702532 6021888 6372700
58930F372700L85873M25589M69546N16450N66380O20332O77452P35051P91465
$$ 6372700 6758573 7184162 7653708 8170158 8736538 9356870 10034322 10769373 11560838
58921A1560838Q46336Q97448R39615R67295R76101R61283R17331Q40634P31078
$$ 11560838 12407174 13304622 14244237 15211532 16187633 17148916 18066247 18906881 19637959
58912A9637959N90750M23371K36010L9257j55734l39646n04618o44054p54106
$$ 19637959 20228709 20652080 20888090 20927347 20771613 20431967 19927349 19283295 18529189
58903A8529189q34237q85755r11044r14177r00218q73133q35529p90396p41154
$$ 18529189 17694952 16809197 15898153 14983976 14083758 13210625 12375096 11584700 10843546
58894A0843546o89954o37747n86120n36944m90248m44915m01721l63199l30113
$$ 10843546 10153592 9515845 8929725 8392781 7902533 7457618 7055897 6692698 6362585
58885F362585l00673k73809k50499k30945k13221j96006j80248j66719j54146
$$ 6362585 6061912 5788103 5537604 5306659 5093438 4897432 4717184 4550465 4396319
58876D396319j41290j28888j18041j08387r9162r0446q2185p3607o4795n7208
$$ 4396319 4255029 4126141 4008100 3899713 3800551 3710105 3627920 3554313 3489518 3432310
58866C432310n1520m6532m1172l5919l1254k6397k0748j5043r856m497J560P623
$$ 3432310 3380790 3334258 3293086 3257167 3225913 3199516 3178768 3163725 3153869 3149372 3150932 3158555
58854C158555J3149J8810K5134L1492L7387M3431N0197N7384O4819P2922Q1632
$$ 3158555 3171704 3190514 3215648 3247140 3284527 3327958 3378155 3435539 3500358 3573280 3654912
58843C654912R0244R8900J08672J19746J31246J43200J56730J71711J86466K00645
$$ 3654912 3745156 3844056 3952728 4072474 4203720 4346920 4503650 4675361 4861827 5062472
58833E062472K16289K35084K56527K79884L05876L35186L67270M02040M40976
$$ 5062472 5278761 5513845 5770372 6050256 6356132 6691318 7058588 7460628 7901604
58824G901604M85197N33936N86022O41220O98813P56255Q10402Q58587Q97437
$$ 7901604 8386801 8920737 9506759 10147979 10846792 11603047 12413449 13272036 14169473
58815A4169473R21997R26980R07718Q59591P78714O64534N20537L52068J65512
$$ 14169473 15091470 16018450 16926168 17785759 18564473 19229007 19749544 20101612 20267124
58806B0267124k9838k21940m00010n57240o89151p91872q63771r06863r24920
$$ 20267124 20237286 20015346 19615336 19058096 18368945 17577073 16713302 15806439 14881519
58797A4881519r21486r00582q67236q25581p77801p25989o73236o21739n71714
$$ 14881519 13960033 13059451 12192215 11366634 10588833 9862844 9189608 8567869 7996155
58788G996155n23468m78618m37989m00266l64299l30951l01193k74251k49184
$$ 7996155 7472687 6994069 6556080 6155814 5791515 5460564 5159371 4885120 4635936
58779D635936k26531k06777j88876j72000j57246j45989j37899j31853j27268
$$ 4635936 4409405 4202628 4013752 3841752 3684506 3538517 3400618 3268765 3141497
58770C141497j23272j18314j11997j05696j00121r3997q6441p8521p1154o3502
$$ 3141497 3018225 2899911 2787914 2682218 2582097 2488100 2401659 2323138 2251984 2188482
58760B188482n5092m7372m1325l5648k9201k3268j9354j6591j3451j0277q009
$$ 2188482 2133390 2086018 2044693 2009045 1979844 1956576 1937222 1920631 1907180 1896903 1888894
58749A888894o141m142l286m733p260r228j1400j5482k1040k6181l0223l3555
$$ 1888894 1882753 1878611 1875325 1870592 1863332 1854104 1842704 1827222 1806182 1780001 1749778 1716223
58737A716223l5826l6460l6133l5784l4970l2994l0700k9392k8881k8209k7412
$$ 1716223 1680397 1643937 1607804 1572020 1537050 1504056 1473356 1443964 1415083 1386874 1359462
58726A359462k6981k6526k5467k4092k2707k0868j8644j7101j6388j5034j2570
$$ 1359462 1332481 1305955 1280488 1256396 1233689 1212821 1194177 1177076 1160688 1145654 1133084
58715A133084j0924j1476j2727j2747j2077j1995j1809j0266q187p156o864o000
$$ 1133084 1122160 1110684 1097957 1085210 1073133 1061138 1049329 1039063 1030876 1023720 1016856 1010856
58703A010856m609l519k594j539j185k009k834k952l902o966j0586j2606j3472
$$ 1010856 1006247 1002728 1000134 998595 997410 995401 992567 989615 985713 978747 968161 955555 942083
58690I42083j4680j5667j5046j3507j2622j1829r529o202l665k027n7K170L625
$$ 942083 927403 911736 896690 883183 870561 858732 849203 843001 839336 837309 837252 839422 843047
58677H43047M642O189P529P135N457M299L957L479L073L866N655P307Q983J1590
$$ 843047 847689 853878 861407 868542 873999 878298 882255 885734 888807 892673 898328 905635 914618 926208
58663I26208J4354J5243J3613J0459O455J811k408m902n793n888m871k099J476
$$ 926208 940562 955805 969418 979877 986332 988143 985735 980833 975040 969152 964281 962182 963658
58650I63658M176N962Q011J0617J3227J5938J9109K2207K4748K7583L1554L5843
$$ 963658 967834 973796 981807 992424 1005651 1021589 1040698 1062905 1087653 1115236 1146790 1182633
58638A182633L9470M3311M8674N4966O0858O6732P3912Q2510R2129J03565J17701
$$ 1182633 1222103 1265414 1314088 1369054 1429912 1496644 1570556 1653066 1745195 1848760 1966461
58627A966461J33790J50911J69870J91537K14548K36992K58790K79876K97361
$$ 1966461 2100251 2251162 2421032 2612569 2827117 3064109 3322899 3602775 3900136
58618C900136L07219L07427K96713K71931K30332J73848J08116L7949l3251j00747
$$ 3900136 4207355 4514782 4811495 5083426 5313758 5487606 5595722 5633671 5600420 5499673
58608E499673j58962k04883k38308k59045k66817k63615k53196k38105k19458
$$ 5499673 5340711 5135828 4897520 4638475 4371658 4108043 3854847 3616742 3397284
58599C397284j99181j79692j61598j44234j28238j15134j04773r5708q7753q1779
$$ 3397284 3198103 3018411 2856813 2712579 2584341 2469207 2364434 2268726 2180973 2099194
58589B099194p7325p2749o7499o2014n6022m9128m2447l7385l3540l0027k7708
$$ 2099194 2021869 1949120 1881621 1819607 1763585 1714457 1672010 1634625 1601085 1571058 1543350
58578A543350k7656k8506k8055k6421k4908k2971j9342j5045j1957r396n473j126
$$ 1543350 1515694 1487188 1459133 1432712 1407804 1384833 1365491 1350446 1338489 1329093 1323620 1322494
58566A322494O70q26l859p587j2451j7648k1526k4095k6269k7206k5545k2390
$$ 1322494 1323164 1322338 1318479 1310892 1298441 1280793 1259267 1235172 1208903 1181697 1156152 1133762
58554A133762j9823j7308j3157q573o257n724m104j276K3q28j448p42q2J80J468
$$ 1133762 1113939 1096631 1083474 1074901 1068644 1062920 1058816 1057540 1057563 1056735 1055287 1054545 1054463 1054643 1056111
58539A056111L631M457L231J529l4k550o008q947j1304j4463j8216k0763k1847
$$ 1056111 1059742 1064199 1067430 1068959 1068925 1066375 1060367 1051420 1040116 1025653 1007437 986674 964827
58526I64827k2780k3411k2367k0167j8728j7817j5556j2343j0607j0596j0123
$$ 964827 942047 918636 896269 876102 857374 839557 824001 811658 801051 790455 780332
58515G80332q581p539p192o004m090l158k941j480Q27J497M77M13K012L219L381
$$ 780332 771751 764212 757020 751016 746926 743768 740827 739347 740174 741671 742148 742561 744573 747792 751173
58500G51173M132N598N962N374O213Q602R904R385R213R976R432O830M389L298
$$ 751173 755305 760903 766865 772239 778452 787054 796958 806343 815556 825532 834964 841794 846183 849481
58486H49481K154N16MP95R25J81Q18L391N775P250R484J2430J3472J1890J0072
$$ 849481 851635 852151 852155 852950 853875 854056 854874 858265 864040 871290 880774 893204 906676 918566 928638
58471I28638R051O974L223j67k569o053j1064j4959j6462j7564j9438k0454j9804
$$ 928638 937689 944663 947886 947719 945150 939097 928033 913074 896612 879048 859610 839156 819352
58458H19352j9146j9070j7780j4893j2654j1867j0544q005o308o080n031k221
$$ 819352 800206 781136 763356 748463 735809 723942 713398 705393 699085 693005 687974 685753
58446F85753K62J351K725M955O147N917O511Q393Q930P090N133M102K133j050
$$ 685753 686015 687366 690091 695046 701193 707110 713621 722014 730944 738034 743167 747269 749402 748352
58432G48352k655j713r82j833j796P25L631N192O678Q866J0252J0690J2433J5711
$$ 748352 745697 743984 743002 741169 739373 740098 743729 748921 755599 764465 774717 785407 797840 813551
58418H13551J7675J7541J8080K0146K0736J8530J6281J5410J3443R244N541L582
$$ 813551 831226 848767 866847 886993 907729 926259 942540 957950 971393 980637 986178 989760
58406I89760N22n039r991j2162j3713j6161j7150j5338j3441j3220j2388r706
$$ 989760 990282 985243 975252 963090 949377 933216 916066 900728 887287 874067 861679 851973
58394H51973p914q299p546l638K09J127J131K409L165J981J340K816L540J380
$$ 851973 844059 835760 828214 824576 824785 825912 827043 829452 832617 834598 835938 838754 842294 843674
58380H43674j070j497k004m286n728m310k578k689k363J52K172J742J621L868
$$ 843674 842604 841107 839103 834817 829089 824779 822201 819512 817149 817301 819473 821215 822836 826704
58366H26704N648M826M458P008R326Q304O503P168Q559Q270Q204J0135J1166Q821
$$ 826704 832352 837178 841636 848644 857970 866274 872777 879945 888504 896774 904978 915113 926279 935100
58352I35100N914N236M295N68k962l002j865k692l472j480R96R63L70J955L878
$$ 935100 941014 946250 950545 951113 948151 945149 943284 940592 937120 935640 936636 937599 937969 939924 943802
58337I43802L853M011O397Q348P616P171R549J1553J0146Q305R316J0690R671
$$ 943802 947655 951666 958063 966411 974027 981198 990747 1002300 1012446 1020751 1030067 1040757 1050428
58324A050428R186J2112J5133J4794J4121J6610J9200J8082J5983J6602J7295
$$ 1050428 1059614 1071726 1086859 1101653 1115774 1132384 1151584 1169666 1185649 1202251 1219546
58313A219546J4436J0710R782R185N846L152M939P869P559O776R609J3065J2670
$$ 1219546 1233982 1244692 1254474 1263659 1269505 1272657 1277596 1285465 1293024 1299800 1309409 1322474 1335144
58300A335144J1079J2786J5583J5529J5101J8015K1257K0741J9371K1155K3021
$$ 1335144 1346223 1359009 1374592 1390121 1405222 1423237 1444494 1465235 1484606 1505761 1528782
58289A528782K1140J9279K1879K5059K3878K2271K5925L1620L3735L5051M0482
$$ 1528782 1549922 1569201 1591080 1616139 1640017 1662288 1688213 1719833 1753568 1788619 1829101
58278A829101M6391M7066M5655M7473M8609M2840L4000K9706K8592K5554K3521
$$ 1829101 1875492 1922558 1968213 2015686 2064295 2107135 2141135 2170841 2199433 2224987 2248508
58267B248508K7705L4083L6039L6625M1789M7774M8197M7065N1257N6700N6116
$$ 2248508 2276213 2310296 2346335 2382960 2424749 2472523 2520720 2567785 2619042 2675742 2731858
58256B731858N3791N7893O4692O5670O3919O7749P4350P5915P5740Q1641Q9668
$$ 2731858 2785649 2843542 2908234 2973904 3037823 3105572 3179922 3255837 3331577 3413218 3502886
58245C502886R1351R0862R7458J07278J10742J11529J19463J31055J36586J39910
$$ 3502886 3594237 3685099 3782557 3889835 4000577 4112106 4231569 4362624 4499210 4639120
58235D639120J51082J65894J73666J78705J92264K10084K20525K28146K45456
$$ 4639120 4790202 4956096 5129762 5308467 5500731 5710815 5931340 6159486 6404942
58226F404942K68241K83748K96477L19903L49653L71975L91787M24020M64325
$$ 6404942 6673183 6956931 7253408 7573311 7922964 8294939 8686726 9110746 9575071
58217I575071M98007N30551N78104O35658O87736P42294Q18747R11282J001783
$$ 9575071 10073078 10603629 11181733 11817391 12505127 13247421 14066168 14977450 15979233
58208A5979233J099684J228531J383589J547404J736514J984204K289335K637060
$$ 15979233 17078917 18307448 19691037 21238441 22974955 24959159 27248494 29885554
58200B9885554L058761L612744M321682N200365O331014P827732R734838J2051283
$$ 29885554 32944315 36557059 40878741 46079106 52410120 60237852 69972690 82023973
58192H2023973J4851459J8298294K2578475K7930564L4554538M2007011M8437694
$$ 82023973 96875432 115173726 137752201 165682765 200237303 242244314 290682008
58185B90682008N0789670M6389826L4726654J7823727r21641j8193667l1570860
$$ 290682008 341471678 387861504 422588158 440411885 439490244 421296577 389725717
58178C89725717l9817129m2978018m2150955l8842995l4337507k9494447k4859852
$$ 389725717 349908588 306930570 264779615 225936620 191599113 162104666 137244814
58171A37244814k0739004j7206346j4205713j1684697r607330p897985o462752
$$ 137244814 116505810 99299464 85093751 73409054 63801724 55903739 49440987
58164D9440987n250874m237005l367788k581711j857610j191456n46639J31529
$$ 49440987 44190113 39953108 36585320 34003609 32145999 30954543 30407904 30539433
58156C0539433Q81327J734442K691090L602689M122561L890545K809616J118621
$$ 30539433 31420760 33155202 35846292 39448981 43571542 47462087 50271703 51390324
58148E1390324p80434k515156l817589m550319m736052m526463m097561l574223
$$ 51390324 50609890 48094734 44277145 39726826 34990774 30464311 26366750 22792527
58140B2792527l037598k547441k130380j777499j476533j229763j034275q71810
$$ 22792527 19754929 17207488 15077108 13299609 11823076 10593313 9559038 8687228
58132H687228p30379o14623n25795m52290l87897l39380l08261k83829k60635
$$ 8687228 7956849 7342226 6816431 6364141 5976244 5636864 5328603 5044774 4784139
58123D784139k44808k37135k27527k11888j97441j86434j71244j50382j32766
$$ 4784139 4539331 4302196 4074669 3862781 3665340 3478906 3307662 3157280 3024514
58114C024514j21288j08120r0923p8046p2975o8957o3601o3623p0267p4618p2498
$$ 3024514 2903226 2795106 2704183 2626137 2553162 2484205 2420604 2356981 2286714 2212096 2139598
58103B139598p0095p0117o6255n6492m8540m6630m5311m1365l9686m2337m3633
$$ 2139598 2069503 1999386 1933131 1876639 1828099 1781469 1736158 1694793 1655107 1612770 1569137
58092A569137m1055l9796m1641m0588l4382k9500k9706l0042k7117k5233k7231
$$ 1569137 1528082 1488286 1446645 1406057 1371675 1342175 1312469 1282427 1255310 1230077 1202846
58081A202846k8885k7387k6337k7576k6898k2420j8752j8509j7922j4928j3312
$$ 1202846 1173961 1146574 1120237 1092661 1065763 1043343 1024591 1006082 988160 973232 959920
58070I59920j4789j5072j1977r580j0350j0764q570o964p744p594m865l096m238
$$ 959920 945131 930059 918082 908502 898152 887388 878818 871854 864110 856516 851651 848555 844317
58057H44317n238m529n034p656q750p108o488q232q427n368k837k786j938J172
$$ 844317 839079 834550 829516 821860 813110 806002 799514 791282 782855 777487 774650 771864 769926 771098
58043G71098K829J246K00K057L820L488L785O045O920M823L353M705N718M008
$$ 771098 773927 775173 775373 777430 781250 784738 788523 794568 801488 806311 809664 814369 820087 824095
58029H24095J955J192q11n051p867p177o182p347q307p271o734q241q987p209
$$ 824095 826050 827242 826431 821380 813513 806336 800154 792807 784500 777229 770495 762254 753267 746058
58015G46058n628n989n653l069j182j729j602J306L997L890L259M203M296J433
$$ 746058 740430 734441 728788 725719 724537 722808 721206 722512 726509 730399 733658 737861 742157 743590
58001G43590j833k984l875o407q450q121p819r711j1457j0539q852q909r276p841
$$ 743590 741757 738773 734898 728491 720041 711920 704101 694390 682933 672394 663542 654633 645357 637516
57987F37516n970n468m883k551J7J260K558M827N766L956K039K301K741J011j329
$$ 637516 631546 626078 621195 618644 618661 619921 622479 627306 633072 637028 639067 641368 644109 645120 643791
57972F43791k144k698m573o088n548m813n899p080o087m099k976j626J278L949
$$ 643791 641647 638949 634376 628288 622740 617927 612028 604948 598861 594762 591786 590160 591438 595387
57958E95387M574M814O585Q144P096M707L578L478K941K574L340L900K923J769
$$ 595387 599961 604775 611360 619504 626600 631307 634885 638363 641304 643878 647218 651118 654041 655810
57944F55810J742J205j551m985p006q424j0601j2203j1586j0031r446r087p654
$$ 655810 657552 658757 657206 652221 645215 636791 626190 613987 602401 592370 582924 573837 566183
57931E66183o232o191o462n799n288n809n665l691j874j834j523J158M339N257
$$ 566183 559951 553760 547298 541499 536211 530402 524737 521046 519172 517338 515815 516973 521312 526569
57917E26569M707M768M809L531K472L515N075M696L309L110L402K465J467K338
$$ 526569 531276 536044 540853 544384 546856 550371 555446 560142 563451 566561 569963 572428 573895 576233
57903E76233L619K714O01L4M43r87m164o329o761p291q506r105q707q134p304
$$ 576233 579852 582566 583167 583201 583644 582657 578493 572164 565403 558112 549606 540501 531794 523660 516356
57888E16356n705m360m486n047m365l123k898k967j582O61J946K548L892N395
$$ 516356 510651 506291 501805 496758 492393 489270 486372 483405 481823 482484 484430 486978 490870 496265
57874D96265N569N253O396Q398R052Q419Q411R087Q785P468O699O420N008K426
$$ 496265 501834 507087 513483 521881 530933 539352 547763 556850 565635 573103 579802 586222 591230 593656
57860E93656M04n00j333k380k990l534m963o616o986o390o505p504q024p646p082
$$ 593656 594060 593560 592227 589847 586857 583323 578360 571744 564758 558368 551863 544359 536335 528689 521607
57845E21607o364n077l922l755l738k687j490j724k707k540j426j186k085k876
$$ 521607 515243 510166 506244 502489 498751 496064 494574 492850 490143 487603 486177 484991 482906 480030
57831D80030l493m883o562p054o598o749p572p787p397p545p959p292n817n203
$$ 480030 476537 471654 465092 458038 451440 444691 437119 429332 421935 414390 406431 399139 393322 388119
57817C88119n598n488m455l571l086k175j016p20j084p23N04J348J497J902K825
$$ 388119 382521 377033 372578 369007 365921 363746 362730 362010 360926 360203 360707 362055 363552 365454 368279
57802C68279L688M748O786R230J0700J1295J2284J3752J4626J4762J4811J4302
$$ 368279 371967 376715 383501 392731 403431 414726 427010 440762 455388 470150 484961 499263
57790D99263J2134Q757N716L281O97j667k757l004l631m219l501k207k319l780
$$ 499263 511397 520154 525870 529151 529848 528181 525424 522420 518789 514570 511069 508862 506543 502763
57776E02763m734m886n666p038p200n771m414l844l023j756j235j399n69J495
$$ 502763 498029 493143 487477 480439 473239 467468 463054 459210 456187 454431 453196 451797 451228 452723
57762D52723K921K908K982M069M892M385L447L075K888K563K755L528L753L092
$$ 452723 455644 458552 461534 465603 470495 474880 478327 481402 484290 486853 489608 493136 496889 499981
57748D99981K726L303L966M236M913O194O839O258N649N991O618O820P093P820
$$ 499981 502707 506010 509976 514212 519125 525319 532158 538416 544065 550056 556674 563494 570587 578407
57734E78407Q325Q346Q926J0640J2364J2950J2948J3523J4808J6260J7716J9184
$$ 578407 586732 595078 604004 614644 627008 639958 652906 666429 681237 697497 715213 734397
57722G34397K0466K1621K3075K4832K6466K8142L0512L3468L6182L8570M1471
$$ 734397 754863 776484 799559 824391 850857 878999 909511 942979 979161 1017731 1059202
57711A059202M5182M9190N3655N9674O7693P6953Q6895R7939J10557J24805J40941
$$ 1059202 1104384 1153574 1207229 1266903 1334596 1411549 1498444 1596383 1706940 1831745 1972686
57700A972686J59306J79443K00557K22670K45936K68872K88701L03159L10294
$$ 1972686 2131992 2311435 2511992 2734662 2980598 3249470 3538171 3841330 4151624
57691D151624L06858K89110K55603K07674J47580P8448N895o3034j23443j73406
$$ 4151624 4458482 4747592 5003195 5210869 5358449 5436897 5442792 5379758 5256315 5082909
57681E082909k11292k34927k44043k41180k29195k09767j84729j56409j25549
$$ 5082909 4871617 4636690 4392647 4151467 3922272 3712505 3527776 3371367 3245818
57672C245818r0877n1661r114L4651P6031J07429J18574J02953O2191M052o1260
$$ 3245818 3154941 3103280 3094166 3128817 3204848 3312277 3430851 3533804 3595995 3600047 3538787
57661C538787j22241j67910j92437j97531j88807j71117j48179j23868j00874
$$ 3538787 3416546 3248636 3056199 2858668 2669861 2498744 2350565 2226697 2125823
57652B125823p9222n8127l8365k1157o015Q436K2572L6322N0525O5981Q2115R8226
$$ 2125823 2046601 1988474 1950109 1928952 1922937 1931373 1953945 1990267 2040792 2106773 2188888 2287114
57640B287114J15069J33690J53656J73984J94782K16163K36340K52426K62401
$$ 2287114 2402183 2535873 2689529 2863513 3058295 3274458 3510798 3763224 4025625
57631D025625K64691K56674K35570K00697J53601R6574L2590l3722r6835j52326
$$ 4025625 4290316 4546990 4782560 4983257 5136858 5233432 5266022 5232300 5135465 4983139
57621D983139j97553k30990k52255k62583k64137k58775k47944k33292k16483
$$ 4983139 4785586 4554596 4302341 4039758 3775621 3516846 3268902 3035610 2819127
57612B819127j98708j80842j63686j47547j32250j18008j05587r5176q6011p7536
$$ 2819127 2620419 2439577 2275891 2128344 1996094 1878086 1772499 1677323 1591312 1513776
57602A513776o9983o3298n6728n0102m4374m0116l6594l3095k9939k7422k5045
$$ 1513776 1443793 1380495 1323767 1273665 1229291 1189175 1152581 1119486 1089547 1062125 1037080
57591A037080k2611k0762j9562j7989j5765j4197j3970j3711j2113r959q624p892
$$ 1037080 1014469 993707 974145 956156 940391 926194 912224 898513 886400 876441 867817 859925
57579H59925o937o028n557m649k600n33K90P68K444M844O410P313Q961J1255J2791
$$ 859925 852988 846960 841403 836754 834154 833621 833911 834679 837123 841967 848377 855690 864651 875906 888697
57564H88697J3538J4970J7449J9610K0730K1827K3938K6851L0015L3478L7555
$$ 888697 902235 917205 934654 954264 974994 996821 1020759 1047610 1077625 1111103 1148658
57553A148658M2503M8660N5966O3559P0879P8909Q9117J01520J14970J29011J44043
$$ 1148658 1191161 1239821 1295787 1359346 1430225 1509134 1598251 1699771 1814741 1943752 2087795
57542B087795J59864J75561J90651K04758K16127K21867K19781K08794J87816
$$ 2087795 2247659 2423220 2613871 2818629 3034756 3256623 3476404 3685198 3873014
57533C873014J55906J13901O4627J1403m2499r3029j35861j68541j91113k04465
$$ 3873014 4028920 4142821 4207448 4218851 4176352 4083323 3947462 3778921 3587808 3383343
57523C383343k09210k06534j98644j87587j74352j59600j44384j29614j15580
$$ 3383343 3174133 2967599 2768955 2581368 2407016 2247416 2103032 1973418 1857838
57514A857838j02409r0340p9308o8894n9012n0002m1924l4497k7767k2097j7296
$$ 1857838 1755429 1665089 1585781 1516887 1457875 1407873 1365949 1331452 1303685 1281588 1264292
57503A264292j2581p633k952J002M381P521J0572J3807J7569K1775K6060L0571
$$ 1264292 1251711 1244078 1241126 1242128 1246509 1254030 1264602 1278409 1295978 1317753 1343813 1374384
57491A374384L6048M2929N0952N9800O9582Q0489R2417J05089J18292J31979J46401
$$ 1374384 1410432 1453361 1504313 1564113 1633695 1714184 1806601 1911690 2029982 2161961 2308362
57480B308362J61859J77862J92593K03549K08487K05522J92964J69798J36144
$$ 2308362 2470221 2648083 2840676 3044225 3252712 3458234 3651198 3820996 3957140
57471C957140R2955M1930j3532o8171j16882j56916j87501k08195k18887k20949
$$ 3957140 4050095 4092025 4078493 4010322 3893440 3736524 3549023 3340828 3121941 2900992
57461B900992k16790k08078j95540j80395j64603j49429j34846j20679j07375
$$ 2900992 2684202 2476124 2280584 2100189 1935586 1786157 1651311 1530632 1423257
57452A423257r5324q4439p4775o6720o0172n4241m8211m2255l6966l2623k9132
$$ 1423257 1327933 1243494 1168719 1101999 1041827 987586 939375 897120 860154 827531 798399
57441G98399k6232k3643k1388j9853j9117j8428j6972j4941j3209j2153j1475
$$ 798399 772167 748524 727136 707283 688166 669738 652766 637825 624616 612463 600988
57430F00988j0940j0439r577q109o685o198o494o606o194n726n292m486l484l110
$$ 600988 590048 579609 570032 561923 555238 549040 542546 535940 529746 524020 518728 514242 510758 507648
57416E07648l431l403k395j176q43j436k100k097j266j6Q55P97J80l2N69J460
$$ 507648 504217 500814 498419 497243 496400 494964 492864 490767 489501 489485 490340 491137 491317 491285 491854 493314
57400D93314J947J840J368R12Q38J161J430J319J122J217J400J342J264J463J558
$$ 493314 495261 497101 498469 499381 500219 501380 502810 504129 505251 506468 507868 509210 510474 511937 513495
57385E13495J114N22L98M78J61k57r6K77r3j036j357p18p3o9l32m40m96m23O9
$$ 513495 514609 515131 515529 516007 516168 515911 515815 516092 515999 514963 513606 512888 512815 512746 512414 511974 511478 511055 511124
57366E11124O08L79n50j181j077p19l32L95J246J495J298J687K850L725L802L902
$$ 511124 511732 512111 511561 510380 509303 508584 508252 508647 509893 511388 512686 514373 517223 520948 524750 528652
57350E28652M623N409N803O223O858P095O813O867P441P345N959M652M977O527
$$ 528652 533275 538684 544487 550710 557568 564663 571476 578343 585784 593129 599088 603740 608717 615244
57336F15244P784Q155P946P148N684M315M031M806N883O876P759Q296Q332Q252
$$ 615244 623028 631183 639129 646277 651961 656276 660307 665113 670996 677872 685631 693927 702259 710511
57322G10511Q427Q629Q720R267J0627J1985J2265J1578J0965J0999J1477J2144
$$ 710511 718938 727567 736287 745554 756181 768166 780431 792009 802974 813973 825450 837594
57310H37594J2978J3916J4866J5800J6533J6762J6723J7182J8510K0280K2080
$$ 837594 850572 864488 879354 895154 911687 928449 945172 962354 980864 1001144 1023224
57299A023224K3950K5708K6856K7643K9133L1601L3916L5249L6256L7714L9126
$$ 1023224 1047174 1072882 1099738 1127381 1156514 1188115 1222031 1257280 1293536 1331250 1370376
57288A370376L9743L9800L9480L7745L3707K8325K3197J8337J2665O043p10p347
$$ 1370376 1410119 1449919 1489399 1527144 1560851 1589176 1612373 1630710 1643375 1649418 1648708 1641361
57276A641361j4014j9857k3539k5075k5590k5379k3780k1022j8397j6358j3973
$$ 1641361 1627347 1607490 1583951 1558876 1533286 1507907 1484127 1463105 1444708 1428350 1414377
57265A414377j0759p552m996k498N40L635O120Q194J0273J2103J3291J4156J5248
$$ 1414377 1403618 1396066 1391070 1388572 1389112 1392747 1398867 1407061 1417334 1429437 1442728 1456884 1472132
57252A472132J6535J7693J8822K0223K1656K2483K2493K2213K2330K2997K3864
$$ 1472132 1488667 1506360 1525182 1545405 1567061 1589544 1612037 1634250 1656580 1679577 1703441
57241A703441K4615K5331K6197K7053K7652K8282K9524L1278L2655L3194L3494
$$ 1703441 1728056 1753387 1779584 1806637 1834289 1862571 1892095 1923373 1956028 1989222 2022716
57230B022716L4195L5089L5809L6667L7990L9294M0042M0650M1753M3038M3883
$$ 2022716 2056911 2092000 2127809 2164476 2202466 2241760 2281802 2322452 2364205 2407243 2451126
57219B451126M4728M6495M8975N1055N2487N4170N6597N9266O1724O4183O6799
$$ 2451126 2495854 2542349 2591324 2642379 2694866 2749036 2805633 2864899 2926623 2990806 3057605
57208C057605O9352P1868P4671P7683Q0431Q2707Q4364Q4517Q2176P7809P3291
$$ 3057605 3126957 3198825 3273496 3351179 3431610 3514317 3598681 3683198 3765374 3843183 3916474
57197C916474P0082O8465O8482P0259P3076P5383P6429P6868P7361P7588P7175
$$ 3916474 3986556 4055021 4123503 4193762 4266838 4342221 4418650 4495518 4572879 4650467 4727642
57186D727642P6514P6002P5327P4144P2646P0925O8545O5414O2304N9922N8135
$$ 4727642 4804156 4880158 4955485 5029629 5102275 5173200 5241745 5307159 5369463 5429385 5487520
57175E487520N6676N5847N5941N6606N7302N7799N7854N7141N5872N4651N3308
$$ 5487520 5544196 5600043 5655984 5712590 5769892 5827691 5885545 5942686 5998558 6053209 6106517
57164F106517N0897M7393M4260M2509M1267L9321L7049L5661L5199L4637L3407
$$ 6106517 6157414 6204807 6249067 6291576 6332843 6372164 6409213 6444874 6480073 6514710 6548117
57153F548117L1706K9563K6835K3948K1686K0296J9613J9776K1021K2929K4713
$$ 6548117 6579823 6609386 6636221 6660169 6681855 6702151 6721764 6741540 6762561 6785490 6810203
57142F810203K6149K7575K9228L1187L3563L6110L8099L9331M0640M2554M4049
$$ 6810203 6836352 6863927 6893155 6924342 6957905 6994015 7032114 7071445 7112085 7154639 7198688
57131G198688M3747M1788L9385L7013L4381L1766K9781K7966K5070K0800J6081
$$ 7198688 7242435 7284223 7323608 7360621 7395002 7426768 7456549 7484515 7509585 7530385 7546466
57120G546466J1973R750J1203J6270K0425J8041J0102N889J4185L3987N6320P4301
$$ 7546466 7558439 7568189 7579392 7595662 7616087 7634128 7644230 7650119 7664304 7698291 7754611 7828912
57108G828912Q8958J05512J27092J53453J84087K20656K66496L24905L98480M89967
$$ 7828912 7917870 8023382 8150474 8303927 8488014 8708670 8975166 9300071 9698551 10188518
57098A0188518O03279P43297R14904J122828J371892J665641K003484K379020
$$ 10188518 10791797 11535094 12449998 13572826 14944718 16610359 18613843 20992863
57090B0992863K780651L192726L596896L975309M313564M598551M813331M938641
$$ 20992863 23773514 26966240 30563136 34538445 38852009 43450560 48263891 53202532
57082E3202532M961635M877245M674024M322050L785355L050783K141153J100899
$$ 53202532 58164167 63041412 67715436 72037486 75822841 78873624 81014777 82115676
57074H2115676k1974j175715k297893l323002m199534m894742n385466n655028
$$ 82115676 82093702 80917987 78620094 75297092 71097558 66202816 60817350 55162322
57066E5162322n703966n558454n263098m866342m412054l937357l470181l027602
$$ 55162322 49458356 43899902 38636804 33770462 29358408 25421051 21950870 18923268
57058A8923268k618821k249634j923134j638596j393029j183667j007481q59613
$$ 18923268 16304447 14054813 12131679 10493083 9100054 7916387 6908906 6049293
57050F049293p34732o29472n41789m68790m07100l54795l10973k73884k41368
$$ 6049293 5314561 4685089 4143300 3674510 3267410 2912615 2601642 2327758 2086390
57041B086390k12724j88257j67261j48262j30983j16246j03944r2913q2802p4247
$$ 2086390 1873666 1685409 1518148 1369886 1238903 1122657 1018713 925800 842998 768751
57031G68751o7094o0225n3388m7547m3035l8942l4720l0939k8003k5467k3102
$$ 768751 701657 641432 588044 540497 497462 458520 423800 392861 364858 339391 316289
57020C16289k1278j9887j8187j6133j4599j3825j2973j1661j0555r858q604o092
$$ 316289 295011 275124 256937 240804 226205 212380 199407 187746 177191 167333 158729 152637
57008A52637k678J423O848J3820K1696L0567M1899N6700P4523R5415J20592J48625
$$ 152637 149959 151382 158230 172050 193746 224313 266212 322912 397435 492850 613442 762067
56996G62067J71506J77041J56203J08485M1811l0721r5031j40668j64117j68279
$$ 762067 933573 1110614 1266817 1375302 1417113 1386392 1291361 1150693 986576 818297
56986H18297j58788j40862j18564r5233p3718n6319m4430l7860l4805B4553g302
$$ 818297 659509 518647 400083 304850 231132 174813 130383 92523 57718 24553 -7302
56974c7739k8108k4062j8711j3544r628o858m716k973j404M88L107O422J0252
$$ -37739 -65847 -89909 -108620 -122164 -131792 -138650 -143366 -146339 -147743 -147255 -144148 -137726 -127474
56961a27474J4552J9265K4185K9096f605C0856L8603L5374K7077J4970J770r882
$$ -127474 -112922 -93657 -69472 -40376 -6605 30856 69459 104833 131910 146880 148650 138768
56949A38768j8547k3905k6129k5779B0565e96j7833j3727r365n675k789J59L900
$$ 138768 120221 96316 70187 44408 20565 -596 -18429 -32156 -41521 -47196 -49985 -49826 -45926
56936d5926Q365J3202f033A7771K9784L6415M2940M6736M4554L5289K0897M385
$$ -45926 -37561 -24359 -6033 17771 47555 83970 126910 173646 218200 253489 274386 278771
56924B78771j2027k6440l6620m1173m0877l7827l3645B1114c350k0164j6138j2582
$$ 278771 266744 240304 203684 162511 121634 83807 50162 21114 -3350 -23514 -39652 -52234
56912e2234j0064q670p578o081m469l261k285j276o52p26p51J90J817L058L517
$$ -52234 -62298 -70968 -78546 -84627 -89096 -92357 -94642 -95918 -96570 -97296 -98047 -97857 -96040 -92982 -89465
56897h9465L598L675M000N071P047R148J0552J1681J3640d352A5957K4130K7820
$$ -89465 -85867 -82192 -78192 -73121 -66074 -56926 -46374 -34693 -21053 -4352 15957 40087 67907
56884F7907K9996K8643K3008J4237M234n284j2736j6962j8016j7034j5061j2486
$$ 67907 97903 126546 149554 163791 168025 162741 150005 133043 115027 97993 82932 70446
56872G0446r533o496l337K84M362Q530J2664J7045K1833K7090L3280M1058N0192
$$ 70446 60913 54417 51080 51364 55726 64256 76920 93965 115798 142888 176168 217226 267418
56859B67418N8912O4322O3444N4480L7927J6655n519k5289m0112m8165m9224m5260
$$ 267418 326330 390652 454096 508576 546503 563158 557639 532350 492238 444073 394849 349589
56847C49589l9112l2460k5515j8250j0905l437M534J3078K1956L1287M1646N3537
$$ 349589 310477 278017 252502 234252 223347 219910 224444 237522 259478 290765 332411 385948
56835C85948O7237Q2589R7772J08257J08190R3750O5532K8275j1131m5993p1873
$$ 385948 453185 535774 633546 741803 849993 943743 1009275 1037550 1026419 980426 908553
56824I08553q7392r3326r1297q3445p2441o0636m9188l8461k8792k0168j1689
$$ 908553 821161 727835 636538 553093 480652 420016 370828 332367 303575 283407 271718
56813B71718k429P486J7523K8069M0061N3349O6163P5698P8418P0754N1492K3832
$$ 271718 269289 276775 294298 322367 362428 415777 481940 557638 636056 706810 758302 782134
56801G82134o135l3166n4514o8774p5183p4494o8959o0748n1144m1330l2594k5307
$$ 782134 775999 742833 688319 619545 544362 469868 400909 340161 289017 247687 215093 189786
56789A89786j8679j2039n446J078P862J4836K1502K7979L4820M1278M4606M1932
$$ 189786 171107 159068 153622 154700 162562 177398 198900 226879 261699 302977 347583 389515
56777C89515L2373J7341l09j7136l0215l8319m1929m2067l9612l5558l0944k6344
$$ 389515 421888 439229 438920 421784 391569 353250 311321 269254 229642 194084 163140 136796
56765A36796k1986j8311j5638j3498j1218r051p680o842n650m110l040k498j781
$$ 136796 114810 96499 80861 67363 56145 47094 39414 32572 26922 22812 19772 17274 15493
56752A5493r87j010j761k003j420j182j928B544G6a817j677j517r89n72p25r47
$$ 15493 14506 13496 11735 9732 8312 7130 5202 2544 76 -1817 -3494 -5011 -6000 -6572 -7297 -8244
56736h244o37m8L82P82J182J056K30n61p21n90n61m24j50l22j033j327n68N21
$$ -8244 -8881 -8929 -8547 -7765 -6583 -5527 -5297 -5858 -6579 -7169 -7730 -8154 -8304 -8626 -9659 -10986 -11554 -11033
56718a1033R70P86L80k89j109j336n93L69P64Q45J130J382J203Q51O33L07j70
$$ -11033 -10063 -9277 -8897 -9186 -10295 -11631 -12224 -11855 -11091 -10246 -9116 -7734 -6531 -5680 -5047 -4740 -4910
56701d910j15P79J681g90F04J190R47L51J9P21K067K980L052K561J736Q01K74
$$ -4910 -5025 -4246 -2565 -790 604 1794 2741 3092 3111 3832 5899 8879 11931 14492 16228 17029 17303
56684A7303L53M51N0n04o80o37p88j034j142j262j496j479j010m81k24j32k74
$$ 17303 17656 18107 18157 17653 16973 16336 15548 14514 13372 12110 10614 9135 8125 7644 7420 7288 7014
56667G014r66j784j635m17M76J35n52l85M02R21J097J262J229Q01M47M79L39k71
$$ 7014 6048 4264 2629 2212 2688 2823 2271 1886 2288 3209 4306 5568 6797 7598 8045 8524 8863 8592
56649H592n86m0N51K17o18r31o41k50J84O91Q00M25L85R93J160J06j037p76N46
$$ 8592 8006 7966 8517 8734 8116 7185 6544 6294 6478 7169 7969 8394 8779 9772 10932 11038 10001 9225 9771
56630I771J495J648J502J134N41M85J452K349J889N99j2K09K80M2K38R14J378
$$ 9771 11266 12914 14416 15550 16091 16576 18028 20377 22266 22865 22853 23062 23342 23384 23622 24536 25914
56613B5914J445J354Q27l14j091m58R14J523J322J443K021K023J165L52Q8j0j38
$$ 25914 27359 28713 29540 29226 28135 27677 28591 30114 31436 32879 34900 36923 38088 38440 38528 38518 38380
56596C8380n9P2j17l28p2L06K57K38Q28J254M73o67l39J439K783K778K339K156
$$ 38380 38321 38393 38276 37948 37876 38182 38439 38677 39505 40759 41232 40565 40226 41665 44448 47226 49565 51721
56578E1721J798J238J370K304K845K302J441J019P68M81P54J843K884L112K963
$$ 51721 53519 54757 56127 58431 61276 63578 65019 66038 66806 67287 68041 69884 72768 75880 78843
56563G8843L295M196N104N500N176M340L669L673L989L908L412K996K632J863
$$ 78843 82138 86334 91438 96938 102114 106454 110123 113796 117785 121693 125105 128101 130733 132596
56549A32596Q12J21m6q7j59j73l94j101j878k143k146k485k999l156l155l473
$$ 132596 133408 133529 133483 133396 133237 133064 132670 131569 129691 127548 125402 122917 119918 116762 113607 110134
56533A10134l766l432k867k854l061k589j675j352j642j632j206j125j453j476
$$ 110134 106368 102936 100069 97215 94154 91565 89890 88538 86896 85264 84058 82933 81480 80004
56519H0004j169j270j791j932j560j326j297r04l16l08o91m64L75O45p1q61j080
$$ 80004 78835 77565 75774 73842 72282 70956 69659 68755 68439 68131 67440 66976 67351 67996 67925 67064 65984
56502F5984j125j247j028l77J79M61P54R25N89K20O66J616J964J759K176L422
$$ 65984 64859 63612 62584 62207 62386 62847 63601 64526 65115 65335 66001 67617 69581 71340 73516 76938
56486G6938M278M058L566L583L817L758L410K853K097J604J890K571K845K728
$$ 76938 81216 85274 88840 92423 96240 99998 103408 106261 108358 109962 111852 114423 117268 119996
56472A19996K715K573J832J123J385K095K002J371J631K969M151M755N464O193
$$ 119996 122711 125284 127116 128239 129624 131719 133721 135092 136723 139692 143843 148598 154062 160255
56458A60255N961M900M337M559M408L404K365J577M02r56j283m76O4l59r21j067
$$ 160255 166216 171116 175453 180012 184420 187824 190189 191766 192168 191212 189929 189453 189517 189158 188237 187170
56442A87170j206j392j169j047k128l940m740m267l991m336m067k944k428l061
$$ 187170 185964 184572 183403 182356 180228 176288 171548 167281 163290 158954 154887 151943 149515 146454
56428A46454l565l354l459m066l714k040q42j156j608j086o38j184j650j079n26
$$ 146454 142889 139535 136076 132010 128296 126256 125414 124258 122650 121564 120926 119742 118092 117013 116487
56413A16487j079j852j707j229j299j279l89N90O14J38Q0L13M47Q58J690K151
$$ 116487 115408 113556 111849 110620 109321 108042 107653 108243 108857 108995 109075 109388 109835 110693 112383 114534
56397A14534J910J810K242K318J653J311J851K183J594J144J758K601K684K520
$$ 114534 116444 118254 120496 122814 124467 125778 127629 129812 131406 132550 134308 136909 139593 142113
56383A42113K767K923K575K440K806K634J477N88P90J051N12J27P15J234O84K1
$$ 142113 144880 147803 150378 152818 155624 158258 159735 160323 161113 162164 162676 162803 163518 164752 165436 165457
56367A65457L97J106J041P51J166J676J308O52Q62J745K373K580K590K200J616
$$ 165457 165854 166960 168001 168752 169918 171594 172902 173554 174416 176161 178534 181114 183704 185904 187520
56352A87520J774K789L323K650J884K063K553K554K542L027L468L640M378N818
$$ 187520 189294 192083 195406 198056 199940 202003 204556 207110 209652 212679 216147 219787 224165 229983
56338B29983O664O412O336P087P345O275N151N038N017M369M279N532O637O228
$$ 229983 236647 243059 249395 256482 263827 270102 275253 280291 285308 289677 293956 299488 306125 312353
56324C12353N297N083M797L509K296K321K605J848O79M7q01k560l927l628k628
$$ 312353 317650 322733 327530 331039 333335 335656 338261 340109 340788 340835 340034 337474 333547 329919 327291
56309C27291k206j705l26Q12P42Q13K371M093M148L263L132L520L485L844N677
$$ 327291 325085 323380 323054 323866 324608 325421 327792 331885 336033 339296 342428 345948 349433 353277 358954
56294C58954P926Q996R355J0161J0930J1000J1582J3717J5849J6132J5587J6340
$$ 358954 366880 375876 385231 395392 406322 417322 428904 442621 458470 474602 490189 506529
56282E06529J8231J9854K1389K3700K6058K7546K9288L2688L6859M0317M3749
$$ 506529 524760 544614 566003 589703 615761 643307 672595 705283 742142 782459 826208
56271H26208M8504N4078N9641O6354P5311Q5106R4231J04057J16426J30226J43558
$$ 826208 874712 928790 988431 1054785 1130096 1215202 1309433 1413490 1529916 1660142 1803700
56260A803700J57270J72909J88878K02362K13469K23872K32666K37202K36710
$$ 1803700 1960970 2133879 2322757 2525119 2738588 2962460 3195126 3432328 3669038
56251C669038K31597K20537K01972J77369J49502J18701Q4284M8300J4142j7379
$$ 3669038 3900635 4121172 4323144 4500513 4650015 4768716 4853000 4901300 4915442 4898063
56241D898063m6789p2272r1308j04872j15945j24716j29372j30760j32012j33972
$$ 4898063 4851274 4779002 4687694 4582822 4466877 4342161 4212789 4082029 3950017 3816045
56231C816045j34954j34735j34975j36005j36727j37320j38616j39481j38274
$$ 3816045 3681091 3546356 3411381 3275376 3138649 3001329 2862713 2723232 2584958
56222B584958j36083j34945j33871j30393j25065j20351j15914j09324j00858
$$ 2584958 2448875 2313930 2180059 2049666 1924601 1804250 1688336 1579012 1478154
56213A478154r3265q7120q0518p3139o6518o0570n3844m7010m2164l8905l4968
$$ 1478154 1384889 1297769 1217251 1144112 1077594 1017024 963180 916170 874006 835101 800133
56202H00133l0363k7047k4945k2243j9188j7515j6674j4567j1632r974r143o999
$$ 800133 769770 742723 717778 695535 676347 658832 642158 627591 615959 605985 596842 589843
56190E89843m192l240l679k751n20M15L2Q46K903L668K976L310M922N404M339
$$ 589843 585651 582411 578732 575981 575461 575876 575908 576754 579657 583325 586301 589611 594533 599937 604276
56175F04276L768L848K660M89k89J79n09k111j901N6P12n97j389q85p65p75J294
$$ 604276 608044 611892 614552 615041 614752 614931 614422 612311 610410 610466 611178 610581 609192 608307 607542 606767 608061
56158F08061M855O788O874Q004J0567J1846J1515J2514J5680J8631K0719K4022
$$ 608061 612916 619704 626578 634582 645149 656995 668510 681024 696704 715335 736054 760076
56146G60076K8754L2795L6509M2821N1846O0527O8308P7972R0278J02985J15438
$$ 760076 788830 821625 858134 900955 952801 1013328 1081636 1159608 1249886 1352871 1468309
56135A468309J28507J39516J43200J38554J29272J17203J01586Q5129P3693O8424
$$ 1468309 1596816 1736332 1879532 2018086 2147358 2264561 2366147 2451276 2524969 2593393
56125B593393O4368N8183N0918M2320K9650J3983Q82p458j4424k1889k7890l3350
$$ 2593393 2657761 2715944 2766862 2809182 2838832 2852815 2853697 2846239 2831815 2809926 2782036 2748686
56113B748686m3746o1116q0795r8709j15431j30477j39471j40373j36462j30220
$$ 2748686 2704940 2643824 2563029 2464320 2348889 2218412 2078941 1938568 1802106 1671886
56103A671886j20170j06448r3129q2154p0945n8678m8722m2253l5943k8624k3632
$$ 1671886 1551716 1445268 1352139 1269985 1199040 1140362 1091640 1049387 1013444 984820 961188
56092I61188k1808j9035j3711r818r384q778n808l560l781l291n65J091L60R54
$$ 961188 939380 920345 906634 896816 887432 878654 872846 869286 865505 862214 861649 862740 863100 864054
56078H64054M289O232M896M468P350R730R096Q818J1053J2273J0388R158J0969
$$ 864054 868343 874575 879471 883939 891289 901019 910115 918933 929986 942259 952647 961805 972774
56065I72774J2275J0731R803J1808J3346J2173J1532J3259J3906J1998J1740J5056
$$ 972774 985049 995780 1005583 1017391 1030737 1042910 1054442 1067701 1081607 1093605 1105345 1120401
56053A120401J7624J7142J7584K0771K2073J9297J7359J9111K0169J8025J7332
$$ 1120401 1138025 1155167 1172751 1193522 1215595 1234892 1252251 1271362 1291531 1309556 1326888
56042A326888K0671K3140K1868K1808K6092K9995L0489L2259L7761M1082L8579
$$ 1326888 1347559 1370699 1392567 1414375 1440467 1470462 1500951 1533210 1570971 1612053 1650632
56031A650632L5950L7734L9653L8482L9370M5601N1172N1443N1182N4219N5599
$$ 1650632 1686582 1724316 1763969 1802451 1841821 1887422 1938594 1990037 2041219 2095438 2151037
56020B151037N2131N0036N3635N7116N6100N6251O1571O5763O4533O4639P0979
$$ 2151037 2203168 2253204 2306839 2363955 2420055 2476306 2537877 2603640 2668173 2732812 2803791
56009B803791P6787P6791P7707Q5047R2213R3673R5985J04340J11555J12374J14843
$$ 2803791 2880578 2957369 3035076 3120123 3212336 3306009 3401994 3506334 3617889 3730263 3845106
55998C845106J24981J34471J36696J40197J52277J64484J69120J74527J88527
$$ 3845106 3970087 4104558 4241254 4381451 4533728 4698212 4867332 5041859 5230386
55989E230386K02702K09534K18599K38502K59591K72745K87881L14804L43754
$$ 5230386 5433088 5642622 5861221 6099723 6359314 6632059 6919940 7234744 7578498
55980G578498L64980L88935M25963M65513M97698N34825N88275O46046O98175
$$ 7578498 7943478 8332413 8758376 9223889 9721587 10256412 10844687 11490733 12188908
55971A2188908P60662Q47209R42646J033870J139905J279232J437239J602037
$$ 12188908 12949570 13796779 14739425 15773295 16913200 18192432 19629671 21231708
55963B1231708J800847K061305K371876K726511L172196L763279M512679N449002
$$ 21231708 23032555 25093860 27465736 30192247 33364443 37127722 41640401 47089403
55955D7089403O674894Q294872J0330452J2789600J5778645J9477554K4091746
$$ 47089403 53764297 62059169 72389621 85179221 100957866 120435420 144527166
55948A44527166K9892587L7005408M4650638N0492388N1253766M4617112L0836004
$$ 144527166 174419753 211425161 256075799 306568187 357821953 402439065 433275069
55941D33275069J2623851o345929k2887633l4940541m1703442m3595660m1906214
$$ 433275069 445898920 439552991 416665358 381724817 340021375 296425715 254519501
55934B54519501l8130403l3438827k8586655k4045716k0058764j6657650j3778575
$$ 254519501 216389098 182950271 154363616 130317900 110259136 93601486 79822911
55927G9822911j1378610r422892p831833o516558n436664m572898l876266l292026
$$ 79822911 68444301 59021409 51189576 44673018 39236354 34663456 30787190 27495164
55919B7495164k804810k415642k099167j823051j585787j397367j243071j100602
$$ 27495164 24690354 22274712 20175545 18352494 16766707 15369340 14126269 13025667
55911A3025667r73343q73882p92256p10984o34844n76716n29337m78549m29896
$$ 13025667 12052324 11178442 10386186 9675202 9040358 8463642 7934305 7455756 7025860
55902G025860l95591l68807l36211l03290k82624k68858k48987k26600k13041
$$ 7025860 6630269 6261462 5925251 5621961 5339337 5070479 4821492 4594892 4381851
55893D381851k04482j89809j72244j62161j56643j46162j33643j27824j25195
$$ 4381851 4177369 3987560 3815316 3653155 3496512 3350350 3216707 3088883 2963688
55884B963688j16861j06181j01841j00471r3326q3586q0029p9861p4345o5684
$$ 2963688 2846827 2740646 2638805 2538334 2445008 2361422 2281393 2201532 2127187 2061503
55874B061503o2196o2010n7239m9525m6470m7096m5015m1635m2435m4558m1392
$$ 2061503 1999307 1937297 1880058 1830533 1784063 1736967 1691952 1650317 1607882 1563324 1521932
55863A521932l5230l2585l1364k5400j7199j3500j2374p312k9L071L125N226O440
$$ 1521932 1486702 1454117 1422753 1397353 1380154 1366654 1354280 1346968 1346939 1350010 1353135 1358361 1364801
55850A364801j04j2288k2116k8712l6685m4622m6933m4854m4292m4828m1544l5612
$$ 1364801 1364697 1352409 1330293 1301581 1264896 1220274 1173341 1128487 1084195 1039367 997823 962211
55838I62211l2528l1847k8733k3754k1291k0350j6672j1886j0929j2372j0846
$$ 962211 929683 897836 869103 845349 824058 803708 787036 775150 764221 751849 741003
55827G41003p011n742o437m638j364j316l528l033m08m09k610k515o99j784n332
$$ 741003 733992 728250 721813 717175 715811 714495 710967 707934 707526 707117 704507 701992 701293 699509 694177
55812F94177o641n768p063j0460j1648j0459j0809j2709j2332r618q274q534p311
$$ 694177 687536 681768 674705 664245 652597 642138 631329 618620 606288 596670 588396 579862 572551
55799E72551n000m891o454o334n235o702r917j0851r724j0211j2053j1733r657
$$ 572551 567551 562660 556206 549872 544637 537935 528018 517167 507443 497232 485179 473446 463789
55786D63789r450j0710r622o260m181l405r10K411K407r66l896n897r753j4621
$$ 463789 454339 443629 434007 427747 423566 420161 419251 421662 424069 423103 419207 413310 403557 388936
55772C88936j6328j4678j3667j4282j3631j1310j0085j0064q556n900n157o049
$$ 388936 372608 357930 344263 329981 316350 305040 294955 284891 276335 270435 265278 259229
55760B59229n335l165k806m201m112k612k996n279o140n459o347q579q595o454
$$ 259229 253894 250729 247923 243722 239610 236998 234002 228723 222583 217124 210777 202198 193603 187149
55746A87149o125q208q897o986n508n505m379j632j40n57j65J583K065J022J334
$$ 187149 181024 172816 163919 156933 151425 145920 141541 139909 139769 139212 139047 140630 142695 143717 145051
55731A45051L247L542J536L02P48J81k019k967j846j461k684k864j228n80j946
$$ 145051 148298 151840 153376 153678 154426 154607 152588 149621 147775 146314 143630 140766 139538 138958 137012
55716A37012k692j620r29j383n84K147L971L426K644L066L350L102M134O382O962
$$ 137012 134320 132700 131771 130388 129804 131951 135922 139348 141992 145058 148408 151510 155644 162026 168988
55701A68988M920K734J682O7k615m118l606l188l772l583k094j249j460n76J751
$$ 168988 173908 176642 178324 178391 175776 171658 168052 164864 161092 157509 155415 154166 152706 152130 153881
55686A53881K987K328K147L422M116L496L794N848P384P222P045P404O220L110
$$ 153881 156868 159196 161343 164765 168881 172377 176171 182019 189403 196625 203670 211074 217294 220404
55672B20404R22J048J205j98j428j110p25j344j573o86l98j498k172j445j007
$$ 220404 221326 222374 223579 223381 221953 220843 220118 218774 217201 216515 216117 214619 212447 211002 209995
55657B09995j899k656k368k309l058l315k917l610n523o383n538n099n841n819
$$ 209995 208096 205440 203072 200763 197705 194390 191473 187863 182340 175957 170419 165320 159479 153660
55643A53660m516m320o178p661p200o454o604o157m372l184l608l806k699j956
$$ 153660 149144 144824 138646 130985 123785 117331 110727 104570 100198 97014 93406 89600 86901 84945
55629H4945k426k297q29k07j509k474j599p79j543k195j335p05j750k670j692
$$ 84945 82519 80222 79393 79186 77677 75203 73604 72825 71282 69087 67752 67047 65297 62627 60935
55614F0935k75k74o95r4N33r0r66r59j040k046k546j365J24M41L62Q70J095L99
$$ 60935 60660 60386 59691 59597 60130 60040 59074 58115 57075 55029 52483 51118 51242 51683 52045 52915 54010 54409
55596E4409NN33M63r85k025j331k69j49N0J084J425Q6j184q83l20r47j646j103
$$ 54409 54414 54947 55410 54425 52400 51069 50800 50651 50701 51785 53210 53296 52112 51229 50909 49962 48316 47213
55578D7213l42n69q95n20o69k041k836j769n05o74j012oJ109P94K89J291K696
$$ 47213 46871 46302 45407 44887 44218 42177 39341 37572 37067 36393 35381 35375 36484 37278 37567 38858 41554
55561D1554K538J388J008J267J009M48L21J90l11k02Q92J423N21j93N64J344P56
$$ 41554 44092 45480 46488 47755 48764 49212 49533 49723 49412 49210 50102 51525 52046 51853 52417 53761 54517
55544E4517K82J661L587L863K990K883L569L834L679L688L363K311J619J971K060
$$ 54517 54799 56460 60047 63910 66900 69783 73352 77186 80865 84553 87916 90227 91846 93817 95877
55529I5877Q76k92k90m08j893l277k892k041k827m529n073m580m540m791m151
$$ 95877 96753 96461 96171 95763 93870 90593 87701 85660 82833 78304 73231 68651 64111 59320 55169
55514E5169k999k534k545k284k365l411m111l054j351r94j768k129j930j888j576
$$ 55169 52170 49636 47091 44807 42442 39031 34920 31866 30515 29521 27753 25624 23694 21806 20230
55499B0230l59P43M71m61p13o29j102j453p45J12q3n45j12K80p08k055j973j011
$$ 20230 19871 20614 21085 20624 19911 19282 18180 16727 15982 16094 16011 15466 15354 15634 14926 12871 10898 9887
55481I887q99j327p81L87M89n10j235j443j896D34a073k37K83K18b11I34R41M85
$$ 9887 8988 7661 6880 7267 7756 7246 6011 4568 2672 434 -1073 -1310 -1027 -809 -211 934 1875 2360
55463B360R04J695J470L89k93l96m85k15Q45J514M33j431j931q72J72N14P24R61
$$ 2360 3264 4959 6429 6818 6525 6129 5644 5429 6274 7788 8221 6790 4859 3987 4159 4673 5397 6358
55445F358R13R65J503J643N24q59j028l44j30l86l71m73j292j821q58O25Q16L1
$$ 6358 7271 8236 9739 11382 11906 11047 10019 9675 9545 9159 8788 8315 7023 5202 4344 4969 5785 5816
55427E816k7O94P70k9n31l42j02J09O26R22M11n3N91J574J426N15L13Q93J268
$$ 5816 5789 6483 7253 7224 6693 6351 6249 6358 6984 7906 8317 8264 8855 10429 11855 12370 12683 13576 14844
55408A4844J497K269L028K712J870J746J923J058n54j396j214r24n67L79J120
$$ 14844 16341 18610 21638 24350 26220 27966 29889 30947 30393 28997 27783 26859 26292 26671 27791
55393B7791L64j352k252j910j288p16l3Qj284k663k413j162q59j461j200K25J302
$$ 27791 28155 26803 24551 22641 21353 20637 20604 20612 19328 16665 14252 13090 12231 10770 9570 9795 11097
55376A1097J376J177Q66l8q40k65J080J248J0q89o56l75p31r93n80O7N04N85j01
$$ 11097 12473 13650 14516 14478 13638 13373 14453 15701 15711 14822 14166 13791 13060 12067 11487 11554 12058 12643 12542
55357A2542j558k507j846n36k51q01q51m54o75j300D60e07j211j360k59J078O60
$$ 12542 10984 8477 6631 6095 5844 5043 4192 3738 3063 1763 460 -507 -1718 -3078 -3337 -2259 -1599
55340a599j023j582o06R9lM35J571h95c9C69J103J452O34k32l58m75q71o35K95
$$ -1599 -2622 -4204 -4810 -4711 -4714 -4279 -2708 -895 -39 369 1472 2924 3558 3326 2968 2493 1622 987 1282
55321A282N53l37C78f28p06n88L2g85F11O62K31O83Q65K8q58q14j73M81J070J219
$$ 1282 1835 1498 378 -628 -1334 -1922 -1890 -785 611 1273 1504 2187 3052 3080 2222 1408 1235 1716 2786 4005
55301D005M12o36n14O13J096N28K51P73Q71k2o91l17K20J03j02R4Q4m67p34j50
$$ 4005 4417 3781 3267 3880 4976 5504 5755 6528 7399 7377 6686 6369 6589 6692 6590 6684 6768 6301 5567 5417
55281E417O47R32O88j04j461k451A776l88J42p31e93q99j68JJ15M72M19q0K1A95
$$ 5417 6064 6996 7684 7580 6119 3668 1776 1388 1530 799 -593 -1492 -1660 -1659 -1544 -1072 -653 -733 -712 195
55260A470M48n25F21b12j185j241o64j83j98j39J73Q7l43j19Q29J240P46N93G41
$$ 1470 1918 1393 621 -212 -1397 -2638 -3302 -3485 -3683 -3822 -3649 -3562 -3905 -4024 -3195 -1955 -1209 -616 741
55240B541R52l08q80j000A29i15m17k8k72l83K10h04G01J980K397K150J290P22
$$ 2541 3493 3185 2305 1305 129 -915 -1332 -1360 -1632 -2015 -1805 -804 701 2681 5078 7228 8518 9240
55222I240N63o4j157j460n50M43P83J008J250O80n77j018k64Q6q01j407m44R24
$$ 9240 9803 9739 8582 7122 6572 7015 7798 8806 10056 10736 10159 9141 8877 8963 8162 6755 6311 7235
55204G235J018K07j63j7l9r7K78P37P23M98M77M60L14M46Q50P54M9k84J66M36
$$ 7235 8253 8460 8297 8280 8241 8144 8422 9159 9882 10380 10857 11317 11631 12077 12927 13681 13730 13446 13612 14048
55184A4048j13p38p54o12o34j57R54J487O90m35p91p94j135j332p60l6K0k11K3
$$ 14048 13935 13197 12443 11831 11197 11040 11994 13481 14171 13736 12945 12151 11016 9684 8924 8888 8908 8697 8720
55165H720N35P31N86K66l31r40q96l49l68j145j481p09K62O10P27R25O23k30n04
$$ 8720 9255 9986 10572 10838 10507 9567 8671 8322 7954 6809 5328 4619 4881 5491 6218 7143 7766 7536 7032
55146G032J79N47j63p73j73P79Q53N11P69J286J132M17j77n94q93n76M71J338
$$ 7032 7211 7758 7595 6822 6649 7428 8281 8792 9561 10847 11979 12396 12219 11625 10732 10156 10627 11965
55128A1965J433J354J560J468Q43N74R33O51r47k431k324j236m99r6M64N93k33
$$ 11965 13398 14752 16312 17780 18623 19197 20130 20781 19834 17403 15079 13843 13344 13248 13712 14305 14072
55111A4072r68m03Q89J597J640J558J035k44j270r70O2N81O23Q99J187R28N62
$$ 14072 13104 12701 13590 15187 16827 18385 19420 19176 17906 16936 16998 17579 18202 19101 20288 21216 21778
55094B1778P62J119J011R00J319J567R85M97J128J975J547K56l25j1J70R2M92
$$ 21778 22540 23659 24670 25570 26889 28456 29441 29938 31066 33041 34588 34844 34519 34508 34678 34770 35262
55077C5262J156J032O8p57j097j414j653j229l21K01J20%N1q3m76q07q90o72j02
$$ 35262 36418 37450 37518 36761 35664 34250 32597 31368 31047 31248 31368 31368 31419 31336 30860 30053 29163 28491 28389
55058B8389L82j7j167j729j001J9L21M47J112J581R47k9n8N56O02R2n1K04K09
$$ 28389 28771 28754 27587 25858 24857 24876 25197 25644 26756 28337 29284 29255 29197 29753 30355 30447 30396 30600 30809
55039C0809J72P67J613J683J016N58O02O64O44P97R39P71O32Q09O59m05j684k148
$$ 30809 30981 31748 33361 35044 36060 36618 37220 37884 38528 39325 40264 41035 41667 42476 43135 42730 41046 38898
55021C8898j987j961j950j432p56m99k59M61R38K69q87j203o96l11p1O62J586
$$ 38898 36911 34950 33000 31568 30812 30313 30054 30515 31453 31722 30835 29632 28936 28625 28554 29216 30802
55004C0802J776J189M67l24j256j540n75M92P4j427k199j596n11M33J280J633
$$ 30802 32578 33767 34234 33910 32654 31114 30539 31031 31105 29678 27479 25883 25372 25805 27085 28718
54988B8718R93O4L0O35O02j86n49N5J083K254L729M972N066M168L363L107L163
$$ 28718 29711 29775 29805 30440 31042 30856 30307 30362 31445 33699 37428 42400 47466 51634 54997 58104 61267
54971F1267L712M981O143O240O016P088R432J1507J2784J4315J6580J8626J9605
$$ 61267 64979 69960 76103 82343 88359 95447 104879 116386 129170 143485 160065 178691 198296
54958A98296J9574J8414J5481J0805N335k57n822j0730j3963j5487j6276j6805
$$ 198296 217870 236284 251765 262570 267905 267648 261826 251096 237133 221646 205370 188565
54946A88565j6648j5640j4226j2580j0567q556p185o295n251m157l605l439k983
$$ 188565 171917 156277 142051 129471 118904 110348 103163 96868 91617 87460 83855 80416 77433
54933G7433k266j766j212n1J259J848K029K763L857M420M888O723R996J3025J4647
$$ 77433 75167 73401 72189 72138 73397 75245 77274 80037 83894 88314 93202 99925 109921 122946 137593
54918A37593J5320J5776J6108J6225J5866J4092J0237N295R23k824p051j1574
$$ 137593 152913 168689 184797 201022 216888 230980 241217 246512 247435 244611 237560 225986
54906B25986j4765j6008j6345j6479j5930j4524j2965j1498r621p557o331n994
$$ 225986 211221 195213 178868 162389 146459 131935 118970 107472 97851 90294 83963 77969
54894G7969n364l974k749k267j931j316q85q44o68j96O2ON4rp74j750j745q97
$$ 77969 72605 68631 65882 63615 61684 60368 59483 58639 57971 57775 57837 57843 57897 57888 57114 55364 53619 52722
54876E2722o72j515k281k310k281k564k473j753j110p61j30N29R0j291j881j051
$$ 52722 52050 50535 48254 45944 43663 41099 38626 36873 35763 35002 34872 35401 35491 34200 32319 31268
54860C1268l49r25j727j405m07J20J09P4j5k19n8O13J119J121J166J422J082j39
$$ 31268 30919 29994 28267 26862 26455 26575 26684 26758 26743 26524 26466 27079 28198 29319 30485 31907 32989 32850
54842C2850j180j143n40j97l5K54M51M19M96O56L93j7M78J876K707K128J113P75
$$ 32850 31670 30527 29987 29790 29755 30009 30460 30879 31375 32031 32424 32407 32885 34761 37468 39596 40709 41484
54824D1484R18J125J750K798L252K647K145K883M350N474O229P079P884Q479R381
$$ 41484 42402 43527 45277 48075 51327 53974 56119 59002 63352 68826 75055 82134 90018 98497 107878
54809A07878J0936J2635J4150J5962J8058J9138J8190J5804J2899R195M171j434
$$ 107878 118814 131449 145599 161561 179619 198757 216947 232751 245650 254845 259016 257582
54797B57582o258r783j2177j3470j3850j3989j4157j3752j2462j1042j0098r155
$$ 257582 251324 241541 229364 215894 202044 188055 173898 160146 147684 136642 126544 117389
54785A17389p744o400n575m643l041j394m61J17R28J575J567J444J899K616L120
$$ 117389 109645 103245 97670 93027 89986 88592 88131 88248 89176 90751 92318 93762 95661 98277 101397
54770A01397L901N453P053P854Q480J0138J2727J5108J6737J7709J7660J5953
$$ 101397 105298 110751 117804 125658 134138 144276 157003 172111 188848 206557 224217 240170
54758B40170J2829R226N555J578k693o660r643j1185j1268j0601j0132r826q714
$$ 240170 252999 262225 267780 269358 266665 260005 250362 239177 227909 217308 207176 197350 188636
54745A88636o584m689m109m397m683n032n787o525o777o911p236p118o169n371
$$ 188636 182052 177363 173254 168857 164174 159142 153355 146830 140053 133142 125906 118788 112619 107248
54731A07248n684o333n881m413l239k908k855k670k440k044j311o55n70p56o69
$$ 107248 101564 95231 89350 84937 81698 78790 75935 73265 70825 68781 67470 66815 66245 65489 64820
54716F4820n03p44j130j118q93r95j283j270j065r42m76P63K069K312J548Q07
$$ 64820 64317 63573 62443 61325 60432 59437 58154 56884 55819 54877 54401 55164 57233 59545 61093 61900
54700F1900N42L75K04L81Q63J125R89P29M47N6k36j63Q5K10L76P63R95O42K6k60
$$ 61900 62442 62817 63021 63402 64265 65390 66379 67108 67555 67611 67375 67212 67297 67507 67883 68646 69641 70283 70309 70049
54680G0049j88K0N33J376J815J232K32q4M11J031J503K011K350K170J877K269
$$ 70049 69861 69881 70414 71790 73605 74837 75069 74985 75396 76427 77930 79941 82291 84461 86338 88607
54664H8607L380M545N472O338O984O970O436O023N892N554M668L448K232J236
$$ 88607 91987 96532 102004 108342 115326 122296 128732 134755 140647 146201 150869 154317 156549 157785
54650A57785O32M21L95N52J127J903K064J379R00J693L476N186O441P456Q082
$$ 157785 158417 158838 159233 159785 160912 162815 164879 166258 167158 168851 172327 177513 183954 191410 199492
54635A99492P938P172O116M450J654j921n281p904r886j1206j1704j1595j1258
$$ 199492 207430 214602 220718 225168 226822 224901 219620 211716 201830 190624 178920 167325 156067
54622A56067j0696r742q578p421o138m764l890l741l475k258o28K49K92M32J087
$$ 156067 145371 135629 127051 119630 113492 108728 104838 101097 97622 95364 94736 94985 95277 95709 96796
54607I6796J753J990J932J842J913K345K973L033K011N08m36n88n21p16j331k368
$$ 96796 98549 100539 102471 104313 106226 108571 111544 114577 116588 117096 116660 116072 115551 114835 113504 111136
54591A11136l431l769l356l285m219n116m553k833j534j352j555j502j420j663
$$ 111136 107705 103936 100580 97295 93076 87960 83407 80574 79040 77688 76133 74631 73211 71548
54577G1548k123k487k453j754o00J28k61j415k516l210l373k661j186qL9m55m33
$$ 71548 69425 66938 64485 62731 62131 62259 61998 60583 58067 54857 51484 48823 47637 47629 47668 47213 46780
54560D6780Q4L98M94P64R38N39j3j6J86j71p25n11K96O40M88Q28J764K193J648
$$ 46780 46864 47262 47756 48520 49458 49997 49984 49968 50154 49983 49258 48747 49043 49683 50171 50999 52763 54956 56604
54541E6604R74Q18P70N07N48J265K174K779L318M158N081N647N729N395M780M179
$$ 56604 57578 58396 59166 59673 60221 61486 63660 66439 69757 73915 78996 84643 90372 95767 100547 104726
54525A04726L852L612L057K119R59n28k429m264n346n576n329m856m357m270m686
$$ 104726 108578 112190 115247 117366 118325 117797 115368 111104 105758 100182 94853 89997 85640 81370 76684
54510G6684m877m167k954k018j317m04M03L59l98r64q89m14K50R09R89J95o92
$$ 76684 71807 67640 64686 62668 61351 60947 61350 61709 61311 60347 59458 59044 59294 60203 61192 61387 60695
54493F0695o99m5L37L09M51Q27R95R21Q23M20m62j044n76K72L32j42n0N08M22
$$ 60695 59996 59951 60288 60597 61048 61875 62870 63791 64614 65034 64572 63528 62952 63224 63556 63414 63364 63872 64294
54474F4294m13r67r16r19j082q13k68k92q22r21n42n41r09p04K5Q1p62j313j043
$$ 64294 63881 62914 61998 61079 59997 59184 58916 58624 57802 56881 56339 55798 54889 54185 54210 54291 53529 52216 51173
54455E1173q29j071q64J66R88R27P04Q42O15m46j412j345o46o3M43J028J269J018
$$ 51173 50344 49273 48409 48575 49563 50490 51194 52036 52651 52205 50793 49448 48802 48739 49182 50210 51479 52497
54437E2497Q81J056Q31n2p03n37j82k02j74J50O0p24j164n38J91j41j038j230
$$ 52497 53378 54434 55265 55213 54510 53973 53791 53589 53415 53565 53625 52901 51737 51199 51390 51249 50211 48981
54419D8981n25L78J191J923K140J484M99j4J3K63P93J608K166K077J730J522J245
$$ 48981 48456 48834 50025 51948 54088 55572 56071 56057 56070 56333 57126 58734 60900 62977 64707 66229 67474
54402F7474Q54R85J870K644K695K782L777N090N550N227N111N525N961O150O189
$$ 67474 68328 69313 71183 73827 76522 79304 83081 88171 93721 98948 104059 109584 115545 121695 127884
54387A27884N898N095M251L899L613K534P11r33j895k532l323m339n446o386o753
$$ 127884 133782 138877 143128 147027 150640 153174 153885 152952 151057 148525 145202 140863 135417 129031 122278
54372A22278o366n555m726l866k841j841j146q17r11j505k201k208j408p28r20
$$ 122278 115912 110357 105631 101765 98924 97083 95937 95120 94209 92704 90503 88295 86887 86159 85239
54357H5239j559j812j534r95r3J316K661L118K545J486N32J17N50J615K485K587
$$ 85239 83680 81868 80334 79339 79246 80562 83223 86341 88886 90372 90904 91021 91571 93186 95671 98258
54341I8258K278K263K694L320M024M705N053M936M679M462L966K980J945J330
$$ 98258 100536 102799 105493 108813 112837 117542 122595 127531 132210 136672 140638 143618 145563 146893
54327A46893R86N65Q8m46j472l194m925n716n415m711m306m435m811m920m640
$$ 146893 147879 148444 148532 148086 146614 143420 138495 132779 127364 122653 118347 113912 109101 104181 99541
54312I9541m636n480o389n891l991k436k310k589j951q75o47j234j545j325j343
$$ 99541 94905 89425 83036 77145 73154 70718 68408 65819 63868 62993 62346 61112 59567 58242 56899
54297E6899j855k150j750j053n51j82L12Q57J075O45l29j193j258o21q1p2k12
$$ 56899 55044 52894 51144 50091 49540 49358 49670 50527 51602 52247 51918 50725 49467 48846 48765 48693 48481
54280D8481n4K59M65O19P11M84M3o3K45L03k06p05p39o51o81l83L59P18K74l4
$$ 48481 48427 48686 49151 49770 50481 50965 51008 50945 51190 51493 51287 50582 49843 49192 48511 48128 48487 49205 49479 49445
54260D9445O82J730J900J292Q86Q88P69N26N31N31M1m96j72Q52J431J011J58m76
$$ 49445 50127 51857 53757 55049 55935 56823 57592 58118 58649 59180 59221 58725 58553 59405 60836 61847 62005 61529
54242F1529p54o81l69k82p36j210j030n04n01j033j256q51m00l75o16q91j142
$$ 61529 60775 60094 59725 59443 58707 57497 56467 55963 55462 54429 53173 52322 51922 51547 50931 50040 48898
54225D8898j115n31K50N57L97L99P10P51K10m95r38j160j225r47l45J88M10N43
$$ 48898 47783 47252 47502 48059 48456 48855 49565 50316 50526 50031 49093 47933 46708 45761 45416 45604 46014 46557
54207D6557Q25J116J154Q84M25o9m75p59r30q91n29r8j38p23j153p30M16J596
$$ 46557 47382 48498 49652 50536 50961 50892 50417 49658 48728 47837 47308 47210 47072 46349 45196 44466 44882 46478
54189D6478K254K129J252P9p19r71j055j046n30L16M08p31j934j787m55P61J183
$$ 46478 48732 50861 52113 52192 51473 50502 49447 48401 47871 48187 48595 47864 45930 44143 43688 44449 45632
54172D5632J104Q10L67N1J37L24J98o2p7l2k51m61l16j87n13p95k76P47J382J493
$$ 45632 46736 47546 47913 47964 48101 48425 48623 48561 48484 48452 48201 47740 47424 47237 46724 45929 45653 46400 47782 49275
54152D9275J483J169J69q23o46M79J107O56M3j7R0m9j58j42m80j143j213k70P47
$$ 49275 50758 51927 52096 51273 50627 51106 52213 52869 52912 52895 52985 52936 52778 52636 52156 51013 49800 49530 50277
54133E0277Q01J67j97o6K7j94m84o59q89j352j881j970j157L56J602J729R79L93
$$ 50277 51078 51245 51048 50982 51009 50815 50331 49672 48783 47431 45550 43580 42423 42779 44381 46110 47089 47482
54115D7482N72J138J432J242P57K55m6j28k38n28p42n90l04l91r43j552j801j489
$$ 47482 48054 49192 50624 51866 52623 52878 52832 52704 52466 51938 51196 50606 50302 49911 48968 47416 45615 44126
54097D4126o09M52J002Q05N38Q60J425J434Q46K97Pl02n59l86K0o5p50j267j091
$$ 44126 43517 43969 44971 45776 46314 47174 48599 50033 50879 51176 51183 50881 50322 49936 49956 49891 49141 47874 46783
54078D6783n98l87m62m22K6Q75J803K258J946J223P08N91O73Q03R44R92J049J448
$$ 46783 46185 45798 45336 44914 44940 45815 47618 49876 51822 53045 53753 54344 55017 55820 56764 57756 58805 60253
54060F0253K034J948Q19l55l71M98J038R23Q23R52Q49O20J056K210L042K862K129
$$ 60253 62287 64235 65054 64699 64328 64826 65864 66787 67610 68562 69411 70031 71087 73297 76339 79201 81330
54043H1330J478R12M39N59J440K403K764K678K639K695K684K833L589M985O454
$$ 81330 82808 83720 84159 84718 86158 88561 91325 94003 96642 99337 102021 104854 108443 113428 119882
54028A19882P230P006O416O571P732Q759Q464P155O002N285M373L263K776L078
$$ 119882 127112 134118 140534 147105 154837 163596 172060 179215 185217 190502 194875 198138 200914 203992
54014B03992L241K725K196K293K576K308J505N28o45k075l316l933m150m404m625
$$ 203992 207233 209958 212154 214447 217023 219331 220836 221364 220719 218644 215328 211395 207245 202841 198216
53999A98216m473l987l539l298l146k982k822k658k420k047j576j217j172j246
$$ 198216 193743 189756 186217 182919 179773 176791 173969 171311 168891 166844 165268 164051 162879 161633
53985A61633r61k84J63kk85j36J00j57o20o31m02p13j478j825j551j389j684j905
$$ 161633 160672 160388 160551 160549 160264 160128 160228 160071 159451 158820 158418 157705 156227 154402 152851 151462 149778 147873
53967A47873j673j298j061q75r28j648k821l608l671l401k908j848m47M67P93
$$ 147873 146200 144902 143841 142966 142038 140390 137569 133961 130290 126889 123981 122133 121686 122153 122946
53952A22946J351K293K539J484J81m4P30J552K060K579L309M148M958N479N485
$$ 122946 124297 126590 129129 130613 130794 130750 131480 133032 135092 137671 140980 145128 150086 155565 161050
53937A61050N382O053P631R153R829R952J0023R769Q728P154N677M474L346K162
$$ 161050 166432 172485 180116 189269 199098 209050 219073 228842 237570 244724 250401 254875 258221 260383
53923B60383Q45n30j338p75Q87K266K541K396K707L223L379L534M327N380N771
$$ 260383 261228 260698 259360 258585 259472 261738 264279 266675 269382 272605 275984 279518 283845 289225 294996
53908B94996N499N419N901O439O555O257N672M914M373M398M573L926K087j45
$$ 294996 300495 305914 311815 318254 324809 331066 336738 341652 346025 350423 354996 358922 361009 360864
53894C60864j628k087k269k945l943m439m153l860m338n253n748n854o412p671
$$ 360864 359236 357149 354880 351935 347992 343553 339400 335540 331202 325949 320201 314347 307935 300264
53880C00264q902r578r955j0178r755q472p084o432o443o527o447o271o015n757
$$ 300264 291362 281784 271829 261651 251896 243424 236340 229908 223465 216938 210491 204220 198205 192448
53866A92448n714n789n459m600l887l941m513m904m815m416l954l620l476l257
$$ 192448 186734 180945 175486 170886 166999 163058 158545 153641 148826 144410 140456 136836 133360 130103
53852A30103k664j945j723k112k560k687k669k642k405j945j558j289r29o56q81
$$ 130103 127439 125494 123771 121659 119099 116412 113743 111101 108696 106751 105193 103904 102975 102319 101438
53837A01438j334j267p36o24j170j518j157o57m64j55N09R55R07R82J396J276
$$ 101438 100104 98837 98101 97477 96307 94789 93632 92975 92511 92356 92865 93820 94727 95709 97105 98381
53821I8381J92p64n52J56J16n10n93J51J024J500J510J030L44K85J203K266K601
$$ 98381 98573 97809 97257 97413 97529 97019 96426 96577 97601 99101 100611 101641 101985 102270 103473 105739 108340
53804A08340K478K502K386J752J399K402M320N676N943N855N982O216O483O801
$$ 108340 110818 113320 115706 117458 118857 121259 125579 131255 137198 143053 149035 155251 161734 168535
53790A68535O715N760M487L972M366M828M791M395L757K839K016J794J898J540
$$ 168535 175250 181010 185497 189469 193835 198663 203454 207849 211606 214445 216461 218255 220153 221693
53776B21693O12k26o52j127k097l410m574n056m527l353k656l133m105m437m078
$$ 221693 222305 222079 221427 220300 218203 214793 210219 205163 200636 197283 194627 191494 187389 182952 178874
53761A78874l830l879l658l049k701k977l404l400k870k049j279j006j348j794
$$ 178874 175044 171165 167507 164458 161757 158780 155376 151976 149106 147057 145778 144772 143424 141630
53747A41630j777j420j279j516j900k211k215j607o86m62j342k267k082j210q73
$$ 141630 139853 138433 137154 135638 133738 131527 129312 127705 127019 126557 125215 122948 120866 119656 118783
53732A18783j184j350j263j461j679j063J24N89J6m39l7N40O24O59J144J613J557
$$ 118783 117599 116249 114986 113525 111846 110783 110907 111496 111512 111073 111036 111576 112200 112859 114003 115616 117173
53715A17173J456K004K949L568L725L739L602L127K618K686L408M157M280L673
$$ 117173 118629 120633 123582 127150 130875 134614 138216 141343 143961 146647 150055 154212 158492 162165
53701A62165K773K113J888J921J984K051K088J876J341P84M10q7j047k118k601
$$ 162165 164938 167051 168939 170860 172844 174895 176983 178859 180200 180984 181394 181307 180260 178142 175541
53686A75541k290j491m42P21J576J657J084M03o3k29J16J025J920K071J526R69
$$ 175541 173251 171760 171318 172039 173615 175272 176356 176759 176696 176467 176583 177608 179528 181599 183125 184094
53670A84094Q64J232J968K702K686J633M12J00N57Q42P05P10R96J151J211J685
$$ 184094 184958 186190 188158 190860 193546 195179 195591 195691 196248 197090 197795 198505 199501 200652 201863 203548
53654B03548K427K633K195J969K435L003L053K755K494K234J846J368O64m65j625
$$ 203548 205975 208608 210803 212772 215207 218210 221263 224018 226512 228746 230592 231960 232624 232159 230534
53639B30534k043j650j227j259j413j403j520k000k586l076l546l799l349k319
$$ 230534 228491 226841 225614 224355 222942 221539 220019 218019 215433 212357 208811 205012 201663 199344
53625A99344j510j273j040m58m5k90p96r53q30q16q43n35K34J275K296K917K938
$$ 199344 197834 196561 195521 195063 195018 194728 193932 192979 192149 191333 190490 189955 190189 191464 193760 196677 199615
53608A99615K705K756K978K762K104J772K155K708K860K726K630K690L191M463
$$ 199615 202320 205076 208054 210816 212920 214692 216847 219555 222415 225141 227771 230461 233652 238115
53594B38115N957O329N162L756L505M184M621M425M205M392M796N081N099M796
$$ 238115 244072 250401 255563 259319 262824 267008 271629 276054 280259 284651 289447 294528 299627 304423
53580C04423M351M165M340M364L771K817K080J720J510J397J553J986K447K690
$$ 304423 308774 312939 317279 321643 325414 328231 330311 332031 333541 334938 336491 338477 340924 343614
53566C43614K677K629K829L173L019J994P93N33J309K115K275K066J775J180M47
$$ 343614 346291 348920 351749 354922 357941 359935 360728 361261 362570 364685 366960 369026 370801 371981 372428
53551C72428N14J847L487M195L957L645L686L816L768L495K969K414K387L078
$$ 372428 372942 374789 378276 382471 386428 390073 393759 397575 401343 404838 407807 410221 412608 415686
53537D15686L853M049L902M134M854N527N687N184M036K656J891K196K971L337
$$ 415686 419539 423588 427490 431624 436478 442005 447692 452876 456912 459568 461459 463655 466626 469963
53523D69963L286L399L735L823L638L693M113M393M339M497N343O455P014O873
$$ 469963 473249 476648 480383 484206 487844 491537 495650 500043 504382 508879 514222 520677 527691 534564
53509E34564O741P362Q704R993J0501J0303J0208J0934J2460J4167J5460J6208
$$ 534564 541305 548667 557371 567364 577865 588168 598376 609310 621770 635937 651397 667605
53497F67605J6761J7616J8871K0078K0824K1412K2485K3972K5008K5110K4869
$$ 667605 684366 701982 720853 740931 761755 783167 805652 829624 854632 879742 904611
53486I04611K5090K5779K6481K7117K7880K8533K8485K7560K6227K5117K4628
$$ 904611 929701 955480 981961 1009078 1036958 1065491 1093976 1121536 1147763 1172880 1197508
53475A197508K4789K5164K5005K4052K3035K2910K3646K4272K4171K3695K3387
$$ 1197508 1222297 1247461 1272466 1296518 1319553 1342463 1366109 1390381 1414552 1438247 1461634
53464A461634K3152K2590K1695K0744J9717J8342J6704J5233J4016J2546J0515
$$ 1461634 1484786 1507376 1529071 1549815 1569532 1587874 1604578 1619811 1633827 1646373 1656888
53453A656888Q417O999O267N562M425K881Q98j724m735p334r045j0322j1868j3844
$$ 1656888 1665305 1672304 1678571 1684133 1688558 1691439 1692337 1690613 1685878 1678544 1669499 1659177 1647309 1633465
53439A633465j6030j8228k0086k1060k1209k1507k2712k4306k5325k5758k6293
$$ 1633465 1617435 1599207 1579121 1558061 1536852 1515345 1492633 1468327 1443002 1417244 1390951
53428A390951k7005k7323k7175k7126k7345k7348k6826k5916k4564k2517k0136
$$ 1390951 1363946 1336623 1309448 1282322 1254977 1227629 1200803 1174887 1150323 1127806 1107670
53417A107670j8358j7560j7148j6411j5186j3570j1750j0167r166q332o933m997
$$ 1107670 1089312 1071752 1054604 1038193 1023007 1009437 997687 987520 978354 970022 963089 958092
53405I58092l204j691N8K056L685M932O564Q709J0439J1312J2225J4030J6328
$$ 958092 954888 953197 953255 955311 958996 963928 970492 979201 989640 1000952 1013177 1027207 1043535
53392A043535J8356K0210K2225K4025K5137K6033K7564K9722L1752L3235L4426
$$ 1043535 1061891 1082101 1104326 1128351 1153488 1179521 1207085 1236807 1268559 1301794 1336220
53381A336220L5706L7238L8948M0538M1788M3022M4761M6806M8371M9376N0610
$$ 1336220 1371926 1409164 1448112 1488650 1530438 1573460 1618221 1665027 1713398 1762774 1813384
53370A813384N2289N3453N3422N2903N2790N2834N2432N1897N1804N1660N0460
$$ 1813384 1865673 1919126 1972548 2025451 2078241 2131075 2183507 2235404 2287208 2338868 2389328
53359B389328M8157M5482M2598L9053L4976L1144K7779K4178J9756J4808R995
$$ 2389328 2437485 2482967 2525565 2564618 2599594 2630738 2658517 2682695 2702451 2717259 2727254
53348B727254N603J541k403o451j0695j4940j8777k1841k4079k6016k8643l2551
$$ 2727254 2732857 2734398 2731995 2725544 2714849 2699909 2681132 2659291 2635212 2609196 2580553 2548002
53336B548002l7147m1219m4315m6887m9062n0277n0370n0025m9688m8981m7845
$$ 2548002 2510855 2469636 2425321 2378434 2329372 2279095 2228725 2178700 2129012 2080031 2032186
53325B032186m7181m7515m7925m7277m5793m4456m3504m2591m1770m1205m0335
$$ 2032186 1985005 1937490 1889565 1842288 1796495 1752039 1708535 1665944 1624174 1582969 1542634
53314A542634l8472l5953l3722l1970l0125k7906k5556k3223k0993j9330j8586
$$ 1542634 1504162 1468209 1434487 1402517 1372392 1344486 1318930 1295707 1274714 1255384 1236798
53303A236798j8376j8039j7431j6519j4760j1883q864o932n949m759k968j162
$$ 1236798 1218422 1200383 1182952 1166433 1151673 1139790 1130926 1123994 1118045 1113286 1110318 1109156
53291A109156M18K162M074N626O791Q141R690J0711J0971J1239J2179J3631J5208
$$ 1109156 1109574 1111736 1115810 1121436 1128227 1136368 1146058 1156769 1167740 1178979 1191158 1204789 1219997
53278A219997J6854J8491J9828K0948K2422K4465K6447K7661K8078K8153K8139
$$ 1219997 1236851 1255342 1275170 1296118 1318540 1343005 1369452 1397113 1425191 1453344 1481483
53267A481483K7897K7220K6146K5053K4350K3935K3143K1473J9185J6872J4783
$$ 1481483 1509380 1536600 1562746 1587799 1612149 1636084 1659227 1680700 1699885 1716757 1731540
53256A731540J2848J1031R293P498N687M055K425K93k254m393n795p169r015j0715
$$ 1731540 1744388 1755419 1764712 1772210 1777897 1781952 1784377 1784670 1782416 1778023 1772228 1765059 1756044 1745329
53242A745329j1740j2832j4804j6965j8116j8560j9573k1259k2459k2736k2899
$$ 1745329 1733589 1720757 1705953 1688988 1670872 1652312 1632739 1611480 1589021 1566285 1543386
53231A543386k3445k3879k3867k3855k4113k4194k3701k2839k1937k1163k0767
$$ 1543386 1519941 1496062 1472195 1448340 1424227 1400033 1376332 1353493 1331556 1310393 1289626
53220A289626k0811k0731j9965j8916j8376j8207j7643j6744j6272j6198j5625
$$ 1289626 1268815 1248084 1228119 1209203 1190827 1172620 1154977 1138233 1121961 1105763 1090138
53209A090138j4321j3017j1997j0742r237q310q292q550q779r440j0551j1298
$$ 1090138 1075817 1062800 1050803 1040061 1030824 1022514 1014222 1005672 996893 987453 976902 965604
53197I65604j1460j1890j2956j3761j3661j3338j3478j3549j2907j2140j2152
$$ 965604 954144 942254 929298 915537 901876 888538 875060 861511 848604 836464 824312
53186H24312j2736j3122j3306j3768j4392j4733j4945j5525j6294j6577j6215
$$ 824312 811576 798454 785148 771380 756988 742255 727310 711785 695491 678914 662699
53175F62699j5716j5490j5455j5332j4927j4278j3764j3785j4138j4151j3573
$$ 662699 646983 631493 616038 600706 585779 571501 557737 543952 529814 515663 502090
53164E02090j2797j2113j1402j0851j0992j1610j1533j0180q475p487o960o072
$$ 502090 489293 477180 465778 454927 443935 432325 420792 410612 402137 394650 387690 381618
53152C81618m960m365m189l630k609k034k423l061k832j479K13J261J436J386
$$ 381618 376658 372293 368104 364474 361865 359831 357408 354347 351515 350036 350249 351510 352946 354332
53138C54332J705J989J289n11k398l509m021m439m761m918n386o524p750q157
$$ 354332 356037 358026 359315 358804 356406 352897 348876 344437 339676 334758 329372 322848 315098 306941
53124C06941p732p267p223p317p066o314n250m327m033m416m916n004m680m209
$$ 306941 299209 291942 284719 277402 270336 264022 258772 254445 250412 245996 241080 236076 231396 227187
53110B27187l695l249l164l484l740l522l012k567k173j677j279j312j811k632
$$ 227187 223492 220243 217079 213595 209855 206333 203321 200754 198581 196904 195625 194313 192502 189870
53096A89870l660m531m573l566k220j467j454j706j879j939j932k015k483l237
$$ 189870 186210 181679 177106 173540 171320 169853 168399 166693 164814 162875 160943 158928 156445 153208
53082A53208l571k948j751q07m76o03j055j709k224k272j951j516j062p02o87
$$ 153208 149637 146689 144938 144131 143655 143052 141997 140288 138064 135792 133841 132325 131263 130561 129874
53067A29874q99p95l25l31j225j955j318J24O52j67q80k90R87J594J151L09l17
$$ 129874 128975 128180 127855 127524 126299 124344 123026 123150 123802 123635 122755 122465 123452 125046 126197 126506 126189
53050A26189n92n77m15l18l21k03L1m8o67j305j263o33j66j73j42L23P46M16m67
$$ 126189 125597 125020 124605 124287 123966 123763 123794 123746 123079 121774 120511 119878 119712 119539 119397 119720 120466 120882 120415
53031A20415r69o65j53n6j39J41O63Q29M76k4m54q95j210j031l86K38O02R51J452
$$ 120415 119446 118781 118628 118572 118433 118574 119237 120066 120542 120518 120064 119169 117959 116928 116542 116780 117382 118333 119785
53012A19785J867K020K038J955J673J413J663K346K709K384J969K184K949L765
$$ 119785 121652 123672 125710 127665 129338 130751 132414 134760 137469 139853 141822 144006 146955 150720
52998A50720M417M843M814M375M157M656N501N948N811N352M639L589K354J117
$$ 150720 155137 159980 164794 169169 173326 177982 183483 189431 195242 200594 205233 208822 211176 212293
52984B12293k74j844l025l291l071l302m136m748m530l844l421l435l444k989
$$ 212293 212019 210175 207150 203859 200788 197486 193350 188602 184072 180228 176807 173372 169928 166939
52970A66939k125j355j077j103r25n13m55j099j964k335k087j580j080p23o56
$$ 166939 164814 163459 162382 161279 160354 159841 159386 158287 156323 153988 151901 150321 149241 148518 147862
52955A47862p91o73j17L25M2p05j136r97o92m95k84k5Q3O2K23O89J176J356J081
$$ 147862 147071 146398 146281 146606 146648 145943 144807 143810 143118 142623 142339 142314 142397 142459 142682 143371 144547 145903 146984
52936A46984L83l99n96K06J459K067J621Q64P25J233J637J381O92K24L30P63J075
$$ 146984 147367 146968 146372 146578 148037 150104 151725 152589 153314 154547 156184 157565 158257 158481 158811 159574 160649
52919A60649J106R69P53N00M35P62J211J258Q82O28P33P27K66k08j46K66N13N74
$$ 160649 161755 162724 163477 163977 164412 165174 166385 167643 168525 169153 169886 170613 170879 170671 170525 170791 171304 171878
52901A71878P41R02P11L14K55O35J026J175J278J524J803J977K026J866J435R51
$$ 171878 172619 173521 174232 174546 174801 175436 176462 177637 178915 180439 182242 184219 186245 188111 189546 190497
52885A90497P84J024J455J887K253K406K188J740J490J812K780M091N108N280
$$ 190497 191281 192305 193760 195647 197900 200306 202494 204234 205724 207536 210316 214407 219515 224795
52871B24795M738M260M268M274L629K505J567R36J89p40j374j443j284j311j566
$$ 224795 229533 233793 238061 242335 245964 248469 250036 250972 251161 250421 249047 247604 246320 245009 243443
52856B43443j909k302k681k918l047l253l559l722l542l083k588k266k128j945
$$ 243443 241534 239232 236551 233633 230586 227333 223774 220052 216510 213427 210839 208573 206445 204500
52842B04500j465q38n66q30j156j024n96l64l15QO27Q25m7j739l281l837l375
$$ 204500 203035 202197 201631 200801 199645 198621 198025 197661 197346 197354 197981 198806 198759 197020 193739 189902 186527
52825A86527k561k070j986j979j879j768j530r15j87j25j000k023k328k023j749
$$ 186527 183966 181896 179910 177931 176052 174284 172754 171839 171652 171527 170527 168504 166176 164153 162404
52810A62404j675j540j396j442j375p24K38P00M75K27L86N81L99L8j41k35n12
$$ 162404 160729 159189 157793 156351 154976 154252 154490 155190 155665 155892 156278 156859 157258 157296 157155 156920 156408
52793A56408q58r51q58j000j551k133k233j814j320j117j089r62q14r02j117j058
$$ 156408 155550 154599 153741 152741 151190 149057 146824 145010 143690 142573 141484 140522 139708 138806 137689 136631
52777A36631p10m94n73n99m08l34n43n97k03K66L94L66L85O4q82j896k329k445
$$ 136631 135921 135427 134854 134255 133847 133513 132970 132373 132170 132436 132830 133196 133581 133645 132763 130867 128538 126093
52759A26093k785k978k243q76j21m95j227j489j203n66K73Q05L30j003k063k037
$$ 126093 123308 120330 118087 117211 117090 116595 115368 113879 112676 112110 112383 113188 113518 112515 110452 108415
52743A08415j287n39L0N37P82N57J22m9J52N34R79J480K017K639L384L937L732
$$ 108415 107128 106589 106619 107156 107938 108495 108617 108568 108720 109254 110233 111713 113730 116369 119753 123690 127422
52726A27422K720J722J681K623L613L704K772J452L80l52j047j776k255k385k507
$$ 127422 130142 131864 133545 136168 139781 143485 146257 147709 148089 147737 146690 144914 142659 140274 137767
52711A37767k861l141l002k716k805l207l426l383l525l962m157l677k796k131
$$ 137767 134906 131765 128763 126047 123242 120035 116609 113226 109701 105739 101582 97905 95109 92978
52697I2978j939k055k227k338k318k053j446o33q8j93o59p97m70k58m54n32j32
$$ 92978 91039 88984 86757 84419 82101 80048 78602 77969 77881 77688 77029 76232 75762 75504 75050 74518 74386
52680G4386J55k89r19p41J23N52N7o97r99q81p01o42p82j037j003m90o5l35q01
$$ 74386 74541 74252 73333 72592 72715 73267 73324 72627 71628 70747 70046 69404 68622 67585 66582 66092 66027 65692 64891
52661F4891m51N81J007K96n66o24k20j17k66k05JL5k1L9K5k40m09j47J43j24p65
$$ 64891 64440 65021 66028 66324 65758 65134 64914 64797 64531 64326 64327 64362 64341 64380 64405 64165 63756 63609 63752 63628 62863
52640F2863j086r09o48m29J17J050J754J670R63J73m64j009j352j264q33m76l47
$$ 62863 61777 60868 60220 59791 59908 60958 62712 64382 65345 65518 65054 64045 62693 61429 60596 60120 59773
52623E9773j25L40N67J27n26n51QK77l4j56M23J036R03M05M18R20J173R68P15
$$ 59773 59648 59988 60555 60682 60156 59605 59613 59890 59856 59700 60123 61159 62062 62467 62885 63805 64978 65946 66661
52604F6661N69L08N5K19P33J066R94P42M44J20L8L99P80O37K04P7J24k77r73j121
$$ 66661 67230 67538 67593 67812 68545 69611 70605 71347 71791 71911 71949 72348 73128 73765 73969 74046 74170 73893 72920 71799
52584G1799n80j49k54m25k84r5J0L30Q23R30N77M49Q41J137R14O86R46J328J348
$$ 71799 71219 71070 70816 70391 70107 70012 70022 70352 71175 72105 72682 73131 73972 75109 76023 76709 77655 78983 80331
52565H0331J301J626J999J790J122P40R91J473J587J195P38P59J214J406R61N25
$$ 80331 81632 83258 85257 87047 88169 88909 89900 91373 92960 94155 94893 95652 96866 98272 99233 99758
52549I9758Q10J336J107L59L63J316J852J136J86L14J275J882J717J288J014Q55
$$ 99758 100568 101904 103011 103370 103733 105049 106901 108037 108223 108537 109812 111694 113411 114699 115713 116568
52533A16568O39K01m69q94n07L38N37k09q35m47M59R46R32Q18O28M40Q14J837
$$ 116568 117207 117408 116939 116045 115538 115876 116413 116204 115369 114922 115381 116327 117259 118077 118705 119145 119959 121796
52515A21796K406J609K51j49N38J092Q83M62K96P5m78j011j123q89m89J36R76
$$ 121796 124202 125811 126062 125913 126451 127543 128426 128888 129184 129259 128781 127770 126647 125758 125269 125405 126381
52498A26381J678J872J520Q52Q8o44j251j597j543j117o42m28m08l64l50n05n27
$$ 126381 128059 129931 131451 132303 132391 131747 130496 128899 127356 126239 125597 125169 124761 124397 124047 123542 123015
52481A23015J3Q39J149P08M6m45q27q85j25J161J872J539Q97N42J15n39n85M37
$$ 123015 123028 123867 125016 125724 125770 125325 124498 123613 123488 124649 126521 128060 128957 129499 129614 129075 128490 128927
52463A28927J502J438O36K86N62P70P54R24J167J009O12N76Q39Q25N50N61Q75
$$ 128927 130429 131867 132503 132789 133351 134121 134875 135799 136966 137975 138587 139163 140002 140827 141377 141938 142813
52446A42813R33O35N15Q13J163J309J407J533J516J351J184R61O07N28J235K506
$$ 142813 143746 144381 144896 145709 146872 148181 149588 151121 152637 153988 155172 156133 156740 157268 158503 161009
52430A61009L472L660L409L312L604M150M563M400L563K468J560R11M45J26l46
$$ 161009 164481 168141 171550 174862 178466 182616 187179 191579 195142 197610 199170 200081 200526 200652 200306
52415B00306j481l150m380m557m328m560m965m583l301k063j691k185k957l222
$$ 200306 198825 195675 191295 186738 182410 177850 172885 168302 165001 162938 161247 159062 156105 152883
52401A52883k444j099n14j322k495k694k014j503j431j271j000j132j503j259
$$ 152883 150439 149340 148826 147504 145009 142315 140301 138798 137367 136096 135096 133964 132461 131202
52387A31202k94M07J52n56q50n47JM77P73R36J069J140R33N26M04P15P68n1j291
$$ 131202 130908 131315 131467 130911 130061 129514 129515 129992 130765 131701 132770 133910 134843 135369 135773 136488 137256 137205 135914
52368A35914j970j826j213k55J113K413L003K937K732K409J661P73M31P10J119
$$ 135914 133944 132118 130905 130650 131763 134176 137179 140116 142848 145257 146918 147691 148122 148832 149951
52353A49951J527K139K736K849K617K566K673K623K703L374M109L909K941K415
$$ 149951 151478 153617 156353 159202 161819 164385 167058 169681 172384 175758 179867 183776 186717 189132
52339A89132K737L039K746K323K141J844J312J132J557J948J819J574J653J816
$$ 189132 191869 194908 197654 199977 202118 203962 205274 206406 207963 209911 211730 213304 214957 216773
52325B16773J753J661J703J675J650K200L402M297L948K591J270P97J373K656
$$ 216773 218526 220187 221890 223565 225215 227415 230817 235114 239062 241653 242923 243720 245093 247749
52311B47749L882M449M567M901N429N514N165N259O144P017P222P294Q008R081
$$ 247749 251631 256080 260647 265548 270977 276491 281656 286915 293059 300076 307298 314592 322600 331681
52297C31681R646R541R370R634J0316J1094J1528J1279J0572J0150J0478J1211
$$ 331681 341327 350868 360238 369872 380188 391282 402810 414089 424661 434811 445289 456500
52285D56500J1769J2078J2468J3119J3872J4434J4597J4500J4562J4991J5444
$$ 456500 468269 480347 492815 505934 519806 534240 548837 563337 577899 592890 608334
52274F08334J5597J5745J6285J6850J6681J5804J4970J4489J4036J3610J3677
$$ 608334 623931 639676 655961 672811 689492 705296 720266 734755 748791 762401 776078
52263G76078J4122J4017J2829J1020R182P385N734M655M161L556K428J237N01
$$ 776078 790200 804217 817046 828066 837248 844633 850367 855022 859183 862739 865167 866404 866905
52250H66905Q7k75m48l20k14l57m94l80j68J7L66R45J526K044K707L491M154M896
$$ 866905 866992 866717 866269 865949 865735 865378 864884 864504 864336 864353 864719 865664 867190 869234 871941 875432 879586 884482
52232H84482O201P930R360J0292J1132J1754J1466J0439R962J0711J1853J2529
$$ 884482 890683 898613 907973 918265 929397 941151 952617 963056 973018 983729 995582 1008111
52220A008111J2964J3450J3379J2358J1251J1023J1268J1018J0304R785R481Q944
$$ 1008111 1021075 1034525 1047904 1060262 1071513 1082536 1093804 1104822 1115126 1124911 1134392 1143336
52208A143336Q254P735P025N545L576J996J097N01k9n33j299k583l976m857n211
$$ 1143336 1151590 1159325 1166350 1171895 1175471 1177467 1178564 1179065 1179036 1178503 1177204 1174621 1170645 1165788 1160577
52193A160577n402n397n013m629m893n756o542o828o673o129n225m335l948m051
$$ 1160577 1155175 1149778 1144765 1140136 1135243 1129487 1122945 1116117 1109444 1103315 1098090 1093755 1089807 1085756
52179A085756m224m244m214m197m187m210m209l977l502l072k854k693k609k862
$$ 1085756 1081532 1077288 1073074 1068877 1064690 1060480 1056271 1052294 1048792 1045720 1042866 1040173 1037564 1034702
52165A034702l287l236k572k033k090k244k082k204l126m114m048l081k252j907
$$ 1034702 1031415 1028179 1025607 1023574 1021484 1019240 1017158 1014954 1011828 1007714 1003666 1000585 998333 996426
52151I96426j564j070p52n37M3Q87J283Q95M4j044k478m163n703o955q057q907
$$ 996426 994862 993792 993040 992503 992546 993433 994716 995611 995655 994611 992133 987970 982267 975312 967255 958348
52135I58348r130q683q022p627p635p875p906p354o519o314p014p590o956n491
$$ 958348 949218 940535 932513 924886 917251 909376 901470 894116 887597 881283 874269 866679 859723 854232
52121H54232m539m646n151n329n140m757m175l434k730k228k014k066k040j457
$$ 854232 849693 845047 839896 834567 829427 824670 820495 817061 814331 812103 810089 808023 805983 804526
52107H04526n26k31r98j797j362J65J653K661L675M872N775O204O639P487Q673
$$ 804526 804000 803769 802771 800974 799612 799777 801430 804091 807766 812638 818413 824617 831256 838743 847416
52092H47416R995J1278J2237J2812J3506J4756J6190J7116J7535J7871J8054J7761
$$ 847416 857411 868689 880926 893738 907244 922000 938190 955306 972841 990712 1008766 1026527
52080A026527J7337J7507J8217J8775J8940J8931J8553J7457J6179J5686J5782
$$ 1026527 1043864 1061371 1079588 1098363 1117303 1136234 1154787 1172244 1188423 1204109 1219891
52069A219891J5218J3602J1886J0731R601Q016O448N349M336L031J791Q92j28
$$ 1219891 1235109 1248711 1260597 1271328 1280929 1288945 1295393 1300742 1305078 1308109 1309900 1310792 1310664
52056A310664j542k778l427m154n585p043p401o729o080n906n755n395n259n671
$$ 1310664 1309122 1306344 1302917 1298763 1293178 1286135 1278734 1272005 1265925 1260019 1254264 1248869 1243610 1237939
52042A237939o314o748o902o869o661o306n910n498m964m277l571k979k482j993
$$ 1237939 1231625 1224877 1217975 1211106 1204445 1198139 1192229 1186731 1181767 1177490 1173919 1170940 1168458 1166465
52028A166465j453q89l57J24N56Q64R42Q80J014J480J929J927J492R76N85L68
$$ 1166465 1165012 1164123 1163766 1163890 1164446 1165310 1166252 1167132 1168146 1169626 1171555 1173482 1174974 1175950 1176535 1176903
52012A176903M96J055J608J532P48k76j283k376l448m095m351m906o295q215r998
$$ 1176903 1177399 1178454 1180062 1181594 1182342 1182066 1180783 1178407 1174959 1170864 1166513 1161607 1155312 1147097 1137099
51997A137099j1336j2326j3084j3647j4107j4581j5161j6006j7239j8733k0136
$$ 1137099 1125763 1113437 1100353 1086706 1072599 1058018 1042857 1026851 1009612 990879 970743
51986I70743k1234k2144k3125k4346k5729k6847k7166k6610k5768k5162k4579
$$ 970743 949509 927365 904240 879894 854165 827318 800152 773542 747774 722612 698033
51975F98033k3574k2365k1595k1353k1041k0251j9084j7645j5900j4151j2976
$$ 698033 674459 652094 630499 609146 588105 567854 548770 531125 515225 501074 488098
51964D88098j2465j2146j1725j1324j0826r788q260o954o220n538m487l519l245
$$ 488098 475633 463487 451762 440438 429612 419824 411564 404610 398390 392852 388365 384846 381601
51951C81601l496l742l918m176m232l678k790k317k506k888l030l025l166l499
$$ 381601 378105 374363 370445 366269 362037 358359 355569 353252 350746 347858 344828 341803 338637 335138
51937C35138l820l862l493k903k514k579k867l010k993l087l349l446l053k231
$$ 335138 331318 327456 323963 321060 318546 315967 313100 310090 307097 304010 300661 297215 294162 291931
51923B91931j391q93p38o75n62n26o44o53k45L88O83M38J08J91N83P94O22L80
$$ 291931 290540 289647 288909 288234 287672 287146 286502 285849 285604 285992 286675 287113 287221 287412 287995 288789 289411 289791
51905B89791L61L56k09j525k917l408k776j851j592k057k582k691k528k469k664
$$ 289791 290152 290508 290299 288774 285857 282449 279673 277822 276230 274173 271591 268900 266372 263903 261239
51890B61239k970l049k634j845j164q80p84o15m93o39r09j048j126j259j203p80
$$ 261239 258269 255220 252586 250741 249577 248697 247913 247298 246805 246166 245257 244209 243083 241824 240621 239841
51874B39841m08n45q09l77P60J692J767J255O98L11J67M01R37J433J689J756J679
$$ 239841 239433 238888 238079 237702 238462 240154 241921 243176 243874 244185 244352 244753 245690 247123 248812 250568 252247
51857B52247J486J382J432J216M22l54j51J025K125K432K199J867J486J161J223
$$ 252247 253733 255115 256547 257763 258185 257831 257680 258705 260830 263262 265461 267328 268814 269975 271198
51842B71198J570J631J306J269J858K477K499K154J969K011K193K741L673M350
$$ 271198 272768 274399 275705 276974 278832 281309 283808 285962 287931 289942 292135 294876 298549 302899
51828C02899M187L555L322L744M303M424L861K671J234J64k50l41n72j044j636
$$ 302899 307086 310641 313963 317707 322010 326434 330295 332966 334200 334364 334114 333773 333201 332157 330521
51813C30521k282k789k774k157j454j226j482j821j930j678j048k26M91J021J441
$$ 330521 328239 325450 322676 320519 319065 317839 316357 314536 312606 310928 309880 309654 310145 311166 312607
51798C12607J530R94K63L69J587K846L052K498K348K944L426K932J671O74O73
$$ 312607 314137 315131 315394 315763 317350 320196 323248 325746 328094 331038 334464 337396 339067 339741 340414
51783C40414J331J595Q59l34j040j147j279j648j775j461j236j507j947k049j714
$$ 340414 341745 343340 344199 343865 342825 341678 340399 338751 336976 335515 334279 332772 330825 328776 327062
51768C27062j018r5N87N22P2J60P80Q50jo56k62L48O1p17r00n19l22k06M64J340
$$ 327062 326044 325949 326536 327058 327130 327290 328070 328920 328919 328263 328001 328349 328410 327693 326793 326274 325952 325746 326210 327550
51748C27550J425P98N52R67J084M38j82q4K91K85R6K80Q76J534K058K378K441
$$ 327550 328975 329773 330325 331292 332376 332814 332632 332548 332839 333124 333220 333500 334376 335910 337968 340346 342787
51731C42787K460K868L773M829N826O941Q198R091R032P791N421K199j143l668
$$ 342787 345247 348115 351888 356717 362543 369484 377682 386773 395805 403596 409017 411216 410073 406405
51717D06405n091o057p268q616r431r290q320o930n557m551m044l845l595l008
$$ 406405 401314 395257 387989 379373 369942 360652 352332 345402 339845 335294 331250 327405 323810 320802
51703C20802k159j511j539k127k571k433k156k402l061l490l524l610l881l858
$$ 320802 318643 317132 315593 313466 310895 308462 306306 303904 300843 297353 293829 290219 286338 282480
51689B82480l320k826k958l446l533k913j859o21P60K103K933K861J912M50j097
$$ 282480 279160 276334 273376 269930 266397 263484 261625 261004 261764 263867 266800 269661 271573 272023 270926
51674B70926k386l237l646l665l259k369j229m90p25j762k690k715j810n36N69
$$ 270926 268540 265303 261657 257992 254733 252364 251135 250645 249920 248158 245468 242753 240943 240407 240976
51659B40976J209J316J195J419K192K973L212L176L522M294N088O020P496R015
$$ 240976 242185 243501 244696 246115 248307 251280 254492 257668 261190 265484 270572 276592 284088 293103
51645B93103R366Q390P475P637Q055P348N494L523J919L86j170k491l648n014
$$ 293103 302469 310859 318334 325971 334026 341374 346868 350391 352310 352696 351526 349035 345387 340373
51631C40373o606q085r275j0070j0118r249q026p115o423n535m734m600m866m638
$$ 340373 333767 325682 316407 306337 296219 286970 278944 271829 265406 259871 255137 250537 245671 241033
51617B41033l763l036k969l255l494l583l325k530j647j390j588j310m29j8o73
$$ 241033 237270 234234 231265 228010 224516 220933 217608 215078 213431 212041 210453 209143 208714 208696 208023
51602B08023j496j370n79j99n28q83p65m30l31m76m72L8R52J650J571Q37N7m42
$$ 208023 206527 205157 204578 204379 203851 202968 202203 201773 201442 200966 200494 200532 201484 203134 204705 205542 205599 205157
51584B05157o64l95P24K273L046K410J221P48J235J962K371K496K544K717L304
$$ 205157 204493 204098 204822 207095 210141 212551 213772 214520 215755 217717 220088 222584 225128 227845 231149
51569B31149M402N592O344O758P427Q551R592R963R743R574R922J0592J0917J0431
$$ 231149 235551 241143 247487 254245 261672 270223 279815 289778 299521 309095 319017 329609 340526 350957
51555C50957R375Q381P586O385M202J317j366l252m436n237n724n863n761n544
$$ 350957 360332 368713 376299 382684 386886 388203 386837 383585 379149 373912 368188 362325 356564 351020
51541C51020n091m148k772j442n97j47L66J190K119K911L667M673O029P597R115
$$ 351020 345929 341781 339009 337567 336970 336823 337189 338379 340498 343409 347076 351749 357778 365375 374490
51526C74490J0194J0527J0357J0478J1314J2148J1772R892P434N365L767K182
$$ 374490 384684 395211 405568 416046 427360 439508 451280 461172 468606 473971 477738 479920
51514D79920M49j176k489l501m238m622m586m171l568l058k766k462j720m12J050
$$ 479920 480369 479193 476704 473203 468965 464343 459757 455586 452018 448960 446194 443732 442012 441600 442650
51499D42650K111K606K797K839K442J190p95k691l750m065m332m938n663o313
$$ 442650 444761 447367 450164 453003 455445 456635 455840 453149 449399 445334 441002 436064 430401 424088
51485D24088p029p789q098p710p191p255p692p631o707n464m572m144l884l502
$$ 424088 417059 409270 401172 393462 386271 379016 371324 363693 356986 351522 346950 342806 338922 335420
51471C35420k945k466k429k753k757k013j135j107j871k252j472o7R41J250J263
$$ 335420 332475 330009 327580 324827 322070 320057 318922 317815 315944 313692 312220 312153 313094 314344 315607
51456C15607J305J328J222J058J056J415K099K745L026L122L639M883O415P423
$$ 315607 316912 318240 319462 320520 321576 322991 325090 327835 330861 333983 337622 342505 348920 356343
51442C56343P489O958O629P031P841Q229P864P346P296P349O568M691K401M03
$$ 356343 363832 370790 377419 384450 392291 400520 408384 415730 423026 430375 436943 441634 444035 444438
51428D44438j190k574l857n060o006o199n329l903k785k050r36Q68K648L666M013
$$ 444438 443248 440674 436817 431757 425751 419552 414223 410320 407535 405485 404549 405417 408065 411731 415744
51413D15744M038L458J820o07k957m697n884o691p184p544q066q786r338r355
$$ 415744 419782 423240 425060 424453 421496 416799 410915 404224 397040 389496 381430 372644 363306 353951
51399C53951q874q292p899p519o765n725n089n287n701n346m217l335l236l170
$$ 353951 345077 336785 328886 321367 314602 308877 303788 298501 292800 287454 283237 279902 276666 273496
51385B73496k265q84j80m76p79j8J763L613M811N419N833O136O177O135O469P145
$$ 273496 271231 270347 270167 269691 268912 268894 270657 274270 279081 284500 290333 296469 302646 308781 315250 322395
51369C22395P255N902L231J91k521m847o802q234r266j0351j1694j2849j3170
$$ 322395 329650 335552 338783 338974 336453 331606 324804 316570 307304 296953 285259 272410 259240
51356B59240j2418j0877r147p851p184o780o256n772n621n443m602l328k665l086
$$ 259240 246822 235945 226798 218947 211763 204983 198727 192955 187334 181891 177289 173961 171296 168210
51342A68210l812l921l459k994k699k386k060j838j578j109n63j82N4K87M67N15
$$ 168210 164398 160477 157018 154024 151325 148939 146879 145041 143463 142354 141791 141609 141663 141950 142417 142932
51326A42932N45O68P59O96N29L09j6k77o8P04J542J907J774J395Q75L13j2P6M10
$$ 142932 143477 144145 144904 145600 146129 146438 146422 146145 146077 146781 148323 150230 152004 153399 154274 154587 154575 154651 155061
51307A55061Q31J497K492L482M067M253M268M269M485N302O727Q067Q664Q717
$$ 155061 155892 157389 159881 163363 167430 171683 175951 180220 184705 190007 196734 204801 213465 222182
51293B22182R020R927J1003J1523J1002R383P131N024L527K378R77r09l093n285
$$ 222182 231202 241129 252132 263655 274657 284040 291171 296195 299722 302100 303077 302168 299075 293790
51279B93790p203q548r239r509r567r330q786q302q217q295p966p063n997n209
$$ 293790 286587 278039 268800 259291 249724 240394 231608 223306 215089 206794 198828 191765 185768 180559
51265A80559m726m255l589k928k806l473m403m722m219l456k885k342j642j029
$$ 180559 175833 171578 167989 165061 162255 158782 154379 149657 145438 141982 139097 136755 135113 134084
51251A34084p20n45m27o97j339j534o31Q08J703J826J716J532R19J5l54K97J494
$$ 134084 133364 132819 132392 131695 130356 128822 128191 128999 130702 132528 134244 135776 136695 136710 136356 136653 138147
51234A38147K466K871K745K279J871J938K385K612K265J643J133N99k89j435k290
$$ 138147 140613 143484 146229 148508 150379 152317 154702 157314 159579 161222 162355 162954 162665 161230 158940
51219A58940k505k305k205k425k722k760k505k108j516n22O77J371J034m3j030
$$ 158940 156435 154130 151925 149500 146778 144018 141513 139405 137889 137367 138044 139415 140449 140406 139376
51204A39376j333r81m43k60n96r66o35L92J176R42N3n22m71l31n72j018j215r71
$$ 139376 138043 137062 136619 136359 135763 134797 134162 134554 135730 136672 136725 136203 135732 135401 134829 133811 132596 131625
51186A31625m68n4j4l25o96r35j077j071p22k31k90j165k108k261j830j585j507
$$ 131625 131157 131103 131089 130764 130068 129133 128056 126985 126263 126032 125742 124577 122469 120208 118378 116793 115286
51169A15286q94K46Q97N14r5P3Q12J186R60P66R51J068O47k7l80l73m19n32j69
$$ 115286 114392 114638 115535 116049 115954 116027 116839 118025 118985 119751 120702 121770 122417 122390 122010 121637 121218 120686 120517
51150A20517Q98K002K323J954J655J728J729J423J165J100O58n14j641j656p30
$$ 120517 121415 123417 125740 127694 129349 131077 132806 134229 135394 136494 137152 136638 134997 133341 132611
51135A32611j56p31j853k427k134j567j326j360j135m07L49M72J0l12j08K05J32
$$ 132611 132455 131724 129871 127444 125310 123743 122417 121057 119922 119515 119864 120336 120346 120034 119926 120131 120263
51118A20263j73k99k03M7O79J706K460K392K013K286L200L888L950L812L647L079
$$ 120263 120090 119791 119588 119635 120314 122020 124480 126872 128885 131171 134371 138259 142209 146021 149668 152747
51102A52747K181J824K421L113K819J591L41m08q19j091j203j193j191j158r90
$$ 152747 154928 156752 159173 162286 165105 166696 167037 166629 165810 164719 163516 162323 161132 159974 158984
51087A58984q89j201j804k035j477n93k56p27j328j273o34j49j94k65K50J138
$$ 158984 158095 156894 155090 153055 151578 150985 150729 150002 148674 147401 146767 146618 146424 146159 146409 147547
51071A47547J571J184N08K28L43K83l00j142j737j949k054k212k163j630q76m96
$$ 147547 149118 150302 150810 151038 151381 151664 151364 150222 148485 146536 144482 142270 140107 138477 137601 137105
51055A37105o04o49j99M47P17N58L38K46J45k0m2K66Q09J233J200P02K35L69J067
$$ 137105 136501 135852 135653 136100 136817 137375 137713 137959 138104 138084 138042 138308 139117 140350 141550 142252 142487 142856 143923
51036A43923J658J724J585J701J952J999J943K121K430K518K462K713L328L850
$$ 143923 145581 147305 148890 150591 152543 154542 156485 158606 161036 163554 166016 168729 172057 175907
51022A75907M027M126M353M420L909K890J935J641K104K665K356P94j288k719
$$ 175907 179934 184060 188413 192833 196742 199632 201567 203208 205312 207977 210333 211127 209839 207120
51008B07120k995k523j860j126k02Q74J864K530K836L025L445M215N102N757N968
$$ 207120 204125 201602 199742 198616 198414 199288 201152 203682 206518 209543 212988 217203 222305 228062 234030
50993B34030N679N037M548M810N882P191Q234R040R757J0327J0869J1849J3407
$$ 234030 239709 244746 249294 254104 259986 267177 275411 284451 294208 304535 315404 327253 340660
50980C40660J4967J6058J7109J8832K1194K3697K6278K9163L2124L4766L7372
$$ 340660 355627 371685 388794 407626 428820 452517 478795 507958 540082 574848 612220
50969F12220M0613M4431M8015N0916N3436N5708N7252N7667N7136N5957N4078
$$ 612220 652833 697264 745279 796195 849631 905339 962591 1020258 1077394 1133351 1187429
50958A187429N1331M7742M3395L8427L3226K8322K3896J9765J5806J2155R047
$$ 1187429 1238760 1286502 1329897 1368324 1401550 1429872 1453768 1473533 1489339 1501494 1510541
50947A510541O806N822O124P157Q441J0101J2146J3610J3288J1137Q097M557P6
$$ 1510541 1517347 1523169 1529293 1536450 1544891 1554992 1567138 1580748 1594036 1605173 1613270 1617827 1617903
50934A617903n424j1266j7162k3715l1238l8921m5689n1251n5813n9354o1773
$$ 1617903 1612479 1601213 1584051 1560336 1529098 1490177 1444488 1393237 1337424 1278070 1216297
50923A216297o3232o3882o3540o1970n9201n5359n0692m5941m2025l9007l5967
$$ 1216297 1153065 1089183 1025643 963673 904472 849113 798421 752480 710455 671448 635481
50912F35481l2249k8321k4921k1985j8948j5732j2824j0586q966p745o659n428
$$ 635481 603232 574911 549990 528005 509057 493325 480501 469915 460949 453204 446545 441117
50900D41117m040k858k192j854j394o36R8L50Km70m08J98N81K81r1L06J222J741
$$ 441117 437077 434219 432027 430173 428779 428143 428241 428591 428593 428123 427715 427913 428494 428775 428684 428990 430212 431953
50882D31953J816K381L807N285O143O849Q120R769J1061J1728J2088J2483J3132
$$ 431953 433769 436150 439957 445242 451385 458234 466354 476123 487184 498912 511000 523483 536615
50869E36615J4194J5604J7128J8751K0671K2844K5044K7519L0952L5517M0663
$$ 536615 550809 566413 583541 602292 622963 645807 670851 698370 729322 764839 805502
50858H05502M6059N2093N9035O6368P3503Q0592Q8099R6032J03980J11557J18340
$$ 805502 851561 903654 962689 1029057 1102560 1183152 1271251 1367283 1471263 1582820 1701160
50847A701160J23858J27987J30907J32311J31188J26757J19102J08597R5445Q0315
$$ 1701160 1825018 1953005 2083912 2216223 2347411 2474168 2593270 2701867 2797312 2877627
50837B877627O4694M9941L6374K3862J2850M291j050k755p77M132J0612J7802
$$ 2877627 2942321 2992262 3028636 3052498 3065348 3069639 3068589 3065834 3065057 3069189 3079801 3097603
50825C097603K5699L3879M0603M3988M3442L9141L0712J7583L65j9166l9438n9598
$$ 3097603 3123302 3157181 3197784 3241772 3285214 3324355 3355067 3372650 3373015 3353849 3314411 3254813
50813C254813p8940r6824j13160j28050j40682j49449j53456j53382j50590j45842
$$ 3254813 3175873 3079049 2965889 2837839 2697157 2547708 2394252 2240870 2090280 1944438
50803A944438j39100j30200j19489j07886r6466q5787p5707o5853n6181m6912
$$ 1944438 1805338 1675138 1555649 1447763 1351297 1265510 1189803 1123950 1067769 1020857
50793A020857l8293l0632k4207j8821j3785q761m323j211P46K431M262N732O136
$$ 1020857 982564 951932 927725 908904 895119 886358 882035 880824 881570 884001 888263 893995 900131
50780I00131N405M084K645R44j512m667p580r426j0533j1805j3300j4284j4656
$$ 900131 905536 909620 912265 913209 911697 907030 899450 890024 879491 867686 854386 840102 825446
50767H25446j5152j5862j5780j4481j3097j2677j2555j1428r296p180n410l490
$$ 825446 810294 794432 778652 764171 751074 738397 725842 714414 705118 697938 692528 689038
50755F89038j290P51K549M497O734R079J1607J4481J7435K0207K3228K7068L1392
$$ 689038 687748 688499 691048 695545 702279 711358 722965 737446 754881 775088 798316 825384 856776
50742H56776L5352L8905M2836M7625N3118N9226O5995P2963P9377Q5113R0668
$$ 856776 892128 931033 973869 1021494 1074612 1133838 1199833 1272796 1352173 1437286 1527954
50731A527954R6072J00503J02966J02787R9508R3061Q4118P3535O1419M7327L1380
$$ 1527954 1624026 1724529 1827495 1930282 2029790 2122851 2206969 2280504 2341923 2389250 2420630
50720B420630J4555j895j6677k8453l6489m1249m3444m2727l8344l1004k2808
$$ 2420630 2435185 2433290 2416613 2388160 2351671 2310422 2266978 2224251 2185907 2154903 2132095
50709B132095j5136p797n61N696R916J1906J1709Q744K347p313j9436l3197m7638
$$ 2132095 2116959 2109162 2108601 2114297 2124213 2136119 2147828 2156572 2158919 2151606 2132170 2098973 2051335
50696B051335o1342p2999q2072q8571r2465r3646r2236q8577q3041p6093o8411
$$ 2051335 1989993 1916994 1834922 1746351 1653886 1560240 1468004 1379427 1296386 1220293 1151882
50685A151882o0705n3477m6925m0842l4701k8154k1541j5582j0575o090j444L707
$$ 1151882 1091177 1037700 990775 949933 915232 887078 865537 849955 839380 833290 831846 835553
50673H35553R180J4385J8796K2490K5939K9093L1147L1622L1074L0113K8438K5663
$$ 835553 844733 859118 877914 900404 926343 955436 986583 1018205 1049279 1079392 1107830 1133493
50661A133493K2472J9824J7332J3831R437N738L651K402Q71j050k899m435n437
$$ 1133493 1155965 1175789 1193121 1206952 1216389 1222127 1225778 1228180 1229051 1228001 1225102 1220667 1215230
50648A215230n558m807l610k036L61L715P598J1818J6604K1806K6699L0900L4608
$$ 1215230 1209672 1204865 1201255 1199219 1199580 1203295 1210893 1222711 1239315 1261121 1287820 1318720 1353328
50635A353328L7672L9392L9596L8996L8012L6309L3949L1893L0540K8805K5686
$$ 1353328 1391000 1430392 1469988 1508984 1546996 1583305 1617254 1649147 1679687 1708492 1734178
50624A734178K2035J9730J9642K1227K3688K6492K9104L1177L2943L4669L5812
$$ 1734178 1756213 1775943 1795585 1816812 1840500 1866992 1896096 1927273 1960216 1994885 2030697
50613B030697L5319L2667K8141K2254J5434Q134Q51n980j1936j6856k1276k6107
$$ 2030697 2066016 2098683 2126824 2149078 2164512 2172646 2173497 2167517 2155581 2138725 2117449 2091342
50601B091342l1583l6984m1799m6534n1823n7350o2233o6075o8902p0539p0744
$$ 2091342 2059759 2022775 1980976 1934442 1882619 1825269 1763036 1696961 1628059 1557520 1486776
50590A486776o9777o8134o5957o3190o0025n6629n2736m8152m3402l9225l5602
$$ 1486776 1416999 1348865 1282908 1219718 1159693 1103064 1050328 1002176 958774 919549 883947
50579H83947l1948k8148k4687k1733j8744j5202j1340p907n359l369j132J733
$$ 883947 851999 823851 799164 777431 758687 743485 732145 724238 718879 715510 714378 716111
50567G16111M643O744Q131R786J2218J4857J7132J9395K2138K4974K7145K8690
$$ 716111 720754 727498 735629 745415 757633 772490 789622 809017 831155 856129 883274 911964
50555I11964L0307L2345L4606L6888L9027M0601M1214M0973M0157L8658L6280
$$ 911964 942271 974616 1009222 1046110 1085137 1125738 1166952 1207925 1248082 1286740 1323020
50544A323020L3314L0208K7011K3732K0985J9434J8927J8967J9705K1532K3856
$$ 1323020 1356334 1386542 1413553 1437285 1458270 1477704 1496631 1515598 1535303 1556835 1580691
50533A580691K5442K6119K7093K9279L2282L5413L8867M3253M8536N4067N9205
$$ 1580691 1606133 1632252 1659345 1688624 1720906 1756319 1795186 1838439 1886975 1941042 2000247
50522B000247O3474O6456O8021O8447O7941O6200O2707N7248M9920M0896L0489
$$ 2000247 2063721 2130177 2198198 2266645 2334586 2400786 2463493 2520741 2570661 2611557 2642046
50511B642046J9284P824l729j5408k6933l7597m6775n4406o0781o5668o7864o6029
$$ 2642046 2661330 2669154 2665425 2650017 2623084 2585487 2538712 2484306 2423525 2357857 2289993 2223964
50499B223964o0187n1998m3273l4561k5578j6561q437j784L576P924J1293J3928
$$ 2223964 2163777 2111779 2068506 2033945 2008367 1991806 1983369 1981585 1985161 1993085 2004378 2018306
50487B018306J6300J8180J8358J5774J0498L135o258j7906l1245m4794n7068o7155
$$ 2018306 2034606 2052786 2071144 2086918 2097416 2100551 2094293 2076387 2045142 2000348 1943280 1876125
50475A876125p4529p9063q1382q2477q2621q1073p7314p2062o6606o1410n6047
$$ 1876125 1801596 1722533 1641151 1558674 1476053 1394980 1317666 1245604 1178998 1117588 1061541
50464A061541n0342m4806l9803l4988k9961k4950k0378j6114j1793p557l945j103
$$ 1061541 1011199 966393 926590 891602 861641 836691 816313 800199 788406 780849 776904 775801
50452G75801J379L823O196Q518J0968J3515J5842J7841J9755K1706K3492K5037
$$ 775801 777180 781003 787199 795717 806685 820200 836042 853883 873638 895344 918836 943873
50440I43873K6605K8328K9932L1199L2305L3376L4040L3858L3033L2262L1899
$$ 943873 970478 998806 1028738 1059937 1092242 1125618 1159658 1193516 1226549 1258811 1290710
50429A290710L1519L0340K7969K4852K1943J9872J8393J6887J5286J4090J3505
$$ 1290710 1322229 1352569 1380538 1405390 1427333 1447205 1465598 1482485 1497771 1511861 1525366
50418A525366J3170J2902J3121J4237J6100J8361K0887K3388K5143K5706K5545
$$ 1525366 1538536 1551438 1564559 1578796 1594896 1613257 1634144 1657532 1682675 1708381 1733926
50407A733926K5426K5308K4372K1993J8282J3797R118M557m1n185j1135j7637
$$ 1733926 1759352 1784660 1809032 1831025 1849307 1863104 1872222 1876779 1876738 1871553 1860418 1842781
50395A842781k4468l1853l9882m7834n4615n9772o3590o6311o7800o7919o6768
$$ 1842781 1818313 1786460 1746578 1698744 1644129 1584357 1520767 1454456 1386656 1318737 1251969
50384A251969o4463o0978n6309n0590m4094l7306l0759k4566j8287j1605m896
$$ 1251969 1187506 1126528 1070219 1019629 975535 938229 907470 882904 864617 853012 848116
50373H48116J169O352J0796J4468J7085J8500J8730J7708J5352J1773P097J316
$$ 848116 849285 855637 866433 880901 897986 916486 935216 952924 968276 980049 987146 988462
50361I88462n261j1648j6840k0676k3647k5905k7120k7145k6312k4993k3361k1681
$$ 988462 983201 971553 954713 934037 910390 884485 857365 830220 803908 778915 755554 733873
50349G33873k0267j8998j7377j5283j3290j1993j1231j0257q549o408m673l852
$$ 733873 713606 694608 677231 661948 648658 636665 625434 615177 606628 600220 595547 591695
50337E91695l492k640r55J003K726M435O417Q220R180R491J0028J1224J2743J4142
$$ 591695 588203 585563 584608 585611 588337 592772 599189 607409 616589 626080 636108 647332 660075 674217
50323F74217J5287J6121J6711J7435J8539J9545J9771J9377J9172J9384J9507
$$ 674217 689504 705625 722336 739771 758310 777855 797626 817003 836175 855559 875066
50312H75066J9439J9768K0514K0551J9010J6539J4394J2814J1143R287Q036P875
$$ 875066 894505 914273 934787 955338 974348 990887 1005281 1018095 1029238 1038525 1046561 1054436
50300A054436Q201P998O860N065L064J233o6n88n26n77j428l229n617q283j1313
$$ 1054436 1062637 1070635 1077495 1082560 1085624 1086857 1086791 1086203 1085677 1085100 1083672 1080443 1074826 1066543 1055230
50285A055230j4825j8495k1747k4360k6496k8162k8959k8544k7164k5466k3913
$$ 1055230 1040405 1021910 1000163 975803 949307 921145 892186 863642 836478 811012 787099
50274G87099k2512k1042j9383j7630j6048j4863j4054j3293j2150j0549q987q064
$$ 787099 764587 743545 724162 706532 690484 675621 661567 648274 636124 625575 616588 608524
50262F08524p716p206o108m944m370m030l045j537o89j010j438p92O94K057L154
$$ 608524 600808 593602 587494 582550 578180 574150 571105 569568 568879 567869 566431 565639 566333 568390 571544
50247E71544M579O342P744Q366Q444Q281Q058Q171Q925R805R864Q931P762O925
$$ 571544 576123 582465 590209 598575 607019 615300 623358 631529 640454 650259 660123 669054 676816 683741
50233F83741O175N160L948K657J152n69k183l507m625n446n674n452n381n617
$$ 683741 689916 695076 699024 701681 702833 702264 700081 696574 691949 686503 680829 675377 669996 664379
50219F64379n628n145m714m807m987m579l729l112k870k540j847r70o3R61K107
$$ 664379 658751 653606 648892 644085 639098 634519 630790 627678 624808 622268 620421 619451 619388 620349 622456
50204F22456L176M081M964N898O714P199P294P037O499N873N482N525N718N415
$$ 622456 625632 629713 634677 640575 647289 654488 661782 668819 675318 681191 686673 692198 697916 703331
50190G03331M236K548J120K11p07k208m162o021p546q874j0004j0718j1009j1101
$$ 703331 707567 710115 711235 711446 710739 708531 704369 698348 690802 681928 671924 661206 650197 639096
50176F39096j1052j0714j0132r537q886p865o472n204m415l919l420l107l465
$$ 639096 628044 617330 607198 597661 588775 580910 574438 569234 564819 560900 557480 554373 550908
50163E50908m649o245p592q281q451q507q590q329p387n978m654l702l073k766
$$ 550908 546259 540014 532422 524141 515690 507183 498593 490264 482877 476899 472245 468543 465470 462704
50149D62704k829l122l424l711l964l924l497l242l791m880n562n423m918m484
$$ 462704 459875 456753 453329 449618 445654 441730 438233 434991 431200 426320 420758 415335 410417 405933
50135D05933m016l341k582j819r89k93n5p0K17P04O51P3J17J484L164L663K967
$$ 405933 401917 398576 395994 394175 393186 392893 392838 392768 392985 393689 394340 394413 394530 396014 399178 402841 405808
50118D05808K448L112M688O297P250P261O503N574N005M710M283L693L332L356
$$ 405808 408256 411368 416056 422353 429603 436864 443367 448941 453946 458656 462939 466632 469964 473320
50104D73320L405L057K308J525J010O74J17q60j791j881r57J92O50L48l3J27R61
$$ 473320 476725 479782 482090 483615 484625 485299 485416 484556 482765 480884 479927 480119 480769 481117 481084 481211 482172
50087D82172K265L709M863N406N482N722O700Q340R899J0698J0859J1121J1873
$$ 482172 484437 488146 493009 498415 503897 509619 516319 524659 534558 545256 556115 567236 579109
50074E79109J2730J3269J3767J4703J5798J6200J5577J4413J3216J1993J0599
$$ 579109 591839 605108 618875 633578 649376 665576 681153 695566 708782 720775 731374
50063G31374R110P703O592O134O454O959O817N975N151M734M354L685K943K381
$$ 731374 740484 748187 754779 760913 767367 774326 781143 787118 792269 797003 801357 805042 807985 810366
50049H10366J902J534J592K114K734L318M066M783M907M551M597N316N848N548
$$ 810366 812268 813802 815394 817508 820242 823560 827626 832409 837316 841867 846464 851780 857628 863176
50035H63176M929M493L729K180O25m0l88j621l623n136n743o337p567q984r887
$$ 863176 868105 872598 876327 878507 879132 879092 878704 877083 873460 868324 862581 856244 848677 839693 829806
50020H29806j0147r947r456q965q692q306p289n878m990n062n488n324m093j891
$$ 829806 819659 809712 800256 791291 782599 774293 767004 761126 756136 751074 745586 740262 736169 734278
50006G34278P25K880M004M429N006O068P280Q328R196R734R702R277R012R096
$$ 734278 735003 737883 741887 746316 751322 757390 764670 772998 782194 791928 801630 810907 819919 829015
49992H29015R243R332R679J0397J1174J1848J2713J4097J6086J8825K2539K6981
$$ 829015 838258 847590 857269 867666 878840 890688 903401 917498 933584 952409 974948 1001929
49980A001929L1351L5017L8007M0436M1863M1514L8962L4410K8570K2450J6976
$$ 1001929 1033280 1068297 1106304 1146740 1188603 1230117 1269079 1303489 1332059 1354509 1371485
49969A371485J2636R605Q197Q794J1227J4546J7620J9658K0022J7960J2831M544
$$ 1371485 1384121 1393726 1401923 1410717 1421944 1436490 1454110 1473768 1493790 1511750 1524581 1529125
49957A529125o408j9124l2360m4722n5041o2703o7559o9767o9653o7584o3858
$$ 1529125 1522717 1503593 1471233 1426511 1371470 1308767 1241208 1171441 1101788 1034204 970346
49946I70346n8882n3383m8153m3446l8923l4340l0051k6643k4200k2138j9807
$$ 970346 911464 858081 809928 766482 727559 693219 663168 636525 612325 590187 570380
49935E70380j7128j4635j2820j1604j0490r266q188p423o636n450m071l091k777
$$ 570380 553252 538617 525797 514193 503703 494437 486249 478826 472190 466740 462669 459578 456801
49922D56801k844k877k712k424k265k528l231m011m497m698m784m627l904k654
$$ 456801 453957 451080 448368 445944 443679 441151 437920 433909 429412 424714 419930 415303 411399 408745
49908D08745j427q38j074j763k200j854q47J97Q67J290J700K106K580L429M598
$$ 408745 407318 406480 405406 403643 401443 399589 398742 398939 399806 401096 402796 404902 407482 410911 415509
49893D15509N438N510N298N501O031O304O265O350O687P078P689Q881J0435J1695
$$ 415509 420947 426457 431755 437256 443287 449591 455856 462206 468893 475971 483660 492541 502976 514671
49879E14671J2566J3572J4868J5975J6733J7720J9401K1567K3948K6832L0634
$$ 514671 527237 540809 555677 571652 588385 606105 625506 647073 671021 697853 728487
49868G28487L5299M0509M6128N2136N8444O4952P1356P6736P9889Q0270P8295
$$ 728487 763786 804295 850423 902559 961003 1025955 1097311 1174047 1253936 1334206 1412501
49857A412501P4556O9318O3090N7023N2255M9149M7558M7444M8779N1109N3517
$$ 1412501 1487057 1556375 1619465 1676488 1728743 1777892 1825450 1872894 1921673 1972782 2026299
49846B026299N4886N3942M9456M0839K8488J3401l329k0541l6985n1655o3956
$$ 2026299 2081185 2135127 2184583 2225422 2253910 2267311 2263982 2243441 2206456 2154801 2090845
49835B090845p3445p9757q3030q4005q3492q2007q0093p8411p7101p5458p2732
$$ 2090845 2017400 1937643 1854613 1770608 1687116 1605109 1525016 1446605 1369504 1294046 1221314
49824A221314o8990o4780o0357n5696n0983m6482m2135l7816l3789l0391k7344
$$ 1221314 1152324 1087544 1027187 971491 920508 874026 831891 794075 760286 729895 702551
49813G02551k4018k0425j7384j5532j4584j3747j2585j1311j0488j0528j1298
$$ 702551 678533 658108 640724 625192 610608 596861 584276 572965 562477 551949 540651
49802E40651j2096j2200j1515j0594r915r443q907q317p937p820p650p147o490
$$ 540651 528555 516355 504840 494246 484331 474888 465981 457664 449727 441907 434257 427110 420620
49789D20620o075n923n584m795l927l479l343l018k472k258k625l023k854k239
$$ 420620 414545 408622 403038 398243 394316 390837 387494 384476 382004 379746 377121 374098 371244 369005
49775C69005j700j283n82M82J343J442R16M22L75N51N26L76P16J885L325M141
$$ 369005 367305 366022 365440 365922 367265 368707 369623 370045 370420 370971 371497 371873 372589 374474 377799 381940
49759C81940M189M263N055O379P617Q549R384J0245J1129J2257J4089J6825K0152
$$ 381940 386129 390392 395447 401826 409443 417992 427376 437621 448750 461007 475096 491921 512073
49746E12073K3619K7132L0989L5464M0541M5953N1414N6618O1054O3968O4685
$$ 512073 535692 562824 593813 629277 669818 715771 767185 823803 884857 948825 1013510
49735A013510O2907N8696N2404M4737L6737K9375K3359J9458J8514K0658K4573
$$ 1013510 1076417 1135113 1187517 1232254 1268991 1298366 1321725 1341183 1359697 1380355 1404928
49724A404928K8343L0942L2256L1683K7602J8810N804r807k6556m3163n7946o9197
$$ 1404928 1433271 1464213 1496469 1528152 1555754 1574564 1580368 1570561 1544005 1500842 1442896 1373699
49712A373699p6231p9453p9476p6756p2040o6401o0522n4378m7876m1407l5540
$$ 1373699 1297468 1218015 1138539 1061783 989743 923342 862820 808442 760566 719159 683619
49701F83619l0481k6168k2669k0135j8397j6868j4932j2384r592p295o066n817
$$ 683619 653138 626970 604301 584166 565769 548901 533969 521585 511993 504698 498632 492815
49689D92815n861n615n089m566l944k772j024N60J249J187J117J329J359Q57J93
$$ 492815 486954 481339 476250 471684 467740 464968 463944 464504 465753 466940 468057 469386 470745 471602 471795
49674D71795j01j26l79r21j292j166p01j53M02Q67J043R07P72R38J373J854K187
$$ 471795 471694 471568 471189 470268 468976 467810 467109 466956 467358 468225 469268 470175 470947 471885 473258 475112 477299
49657D77299K203J766R54R0n44q82r12n93j7M92O77N69L01j45p91j407j640j441
$$ 477299 479502 481268 482222 482312 481768 480886 479974 479381 479364 479856 480533 481102 481403 481258 480467 479060 477420 475979
49639D75979j182j269j674j950j709j005j35P83J769K582K799K483K360K947L763
$$ 475979 474797 473528 471854 469904 468195 467190 467055 467838 469607 472189 474988 477471 479831 482778 486541
49624D86541L849K874J340q4r50r20l8R62J227Q44P88J545K478K805K681K854
$$ 486541 490390 493264 494604 494520 493570 492650 492612 493574 494801 495645 496433 497978 500456 503261 505942 508796
49608E08796L619M636N504O153O724P399Q273R267J0197J0945J1424J1461J1043
$$ 508796 512415 517051 522555 528708 535432 542831 551104 560371 570568 581513 592937 604398 615441
$$ [...]
##END NTUPLES=NMR SPECTRUM
##END=
