##TITLE=NES1021_11277_9266032_qIsfAihTUI
##JCAMPDX= 6.0         $$ Bruker NMR JCAMP-DX V2.0
##DATA TYPE= NMR SPECTRUM
##DATA CLASS= NTUPLES
##ORIGIN= BRUKER
##OWNER= Administrator
$$ 1.72 TOPSPIN		Version 2.1
$$ 2015-07-09 13:47:54.675 -0700  Administrator@X
$$ Compression mode = diff/dup
##.OBSERVE FREQUENCY= 400.02188249412
##.OBSERVE NUCLEUS= ^1H
##.ACQUISITION MODE= SIMULTANEOUS (DQD)
##.ACQUISITION SCHEME= undefined
##.AVERAGES= 8
##.DIGITISER RES= 22
##SPECTROMETER/DATA SYSTEM= spect
##.PULSE SEQUENCE= zg30
##.SOLVENT NAME= COFFEE_meoh
##.SHIFT REFERENCE= INTERNAL, COFFEE_meoh, 1, 14.98509
##AUDIT TRAIL= $$ (NUMBER, WHEN, WHO, WHERE, PROCESS, VERSION, WHAT)
$$ ##TITLE= Audit trail, TOPSPIN		Version 2.1
$$ ##JCAMPDX= 5.01
$$ ##ORIGIN= Bruker BioSpin GmbH
$$ ##OWNER= Administrator
$$ $$ E:\/data/COFFEE/nmr/NES1021_11277_9266032_qIsfAihTUI/10/pdata/1/auditp.txt
$$ ##AUDIT TRAIL=  $$ (NUMBER, WHEN, WHO, WHERE, PROCESS, VERSION, WHAT)
(   1,<2015-07-09 13:47:47.550 -0700>,<Administrator>,<X>,<go>,<TOPSPIN 2.1>,
      <created by zg
	started at 2015-07-09 13:46:41.785 -0700,
	POWCHK enabled, PULCHK disabled,
       configuration hash MD5:
       21 0F 79 D6 B3 7B B4 F6 88 20 88 DB 03 48 BD 9F
       data hash MD5: 64K
       B5 66 23 B2 D1 84 EB AA 1E E0 82 3C 3A D1 46 85>)
(   2,<2015-07-09 13:47:50.597 -0700>,<Administrator>,<X>,<proc1d>,<TOPSPIN 2.1>,
      <Start of raw data processing
       efp LB = 0 FT_mod = 6 PKNL = 1 PHC0 = 0 PHC1 = 0 SI = 32K 
       data hash MD5: 32K
       BA 9C B6 D4 4D 02 E0 D0 6C 4F 68 96 B2 42 57 E2>)
(   3,<2015-07-09 13:47:50.878 -0700>,<Administrator>,<X>,<proc1d>,<TOPSPIN 2.1>,
      <pk PHC0 = 93.30688 PHC1 = 0 
       data hash MD5: 32K
       7B B7 0B 26 AF 04 73 F1 3D 95 8C E3 46 99 B2 68>)
(   4,<2015-07-09 13:47:50.988 -0700>,<Administrator>,<X>,<proc1d>,<TOPSPIN 2.1>,
      <abs ABSG = 1 
       data hash MD5: 32K
       2A 48 4A 14 F2 3C 0B 9C 26 6F 0B 7F AF 5B 25 10>)
(   5,<2015-07-09 13:47:51.050 -0700>,<Administrator>,<X>,<proc1d>,<TOPSPIN 2.1>,
      <abs ABSG = 2 
       data hash MD5: 32K
       6F 12 2F 71 F6 2D 62 BF 28 9D 91 FE 2D A0 BB 39>)
(   6,<2015-07-09 13:47:51.113 -0700>,<Administrator>,<X>,<proc1d>,<TOPSPIN 2.1>,
      <abs ABSG = 3 
       data hash MD5: 32K
       D4 FC 7A 46 93 F2 50 55 10 C3 9F F5 90 5F E5 09>)
(   7,<2015-07-09 13:47:51.160 -0700>,<Administrator>,<X>,<proc1d>,<TOPSPIN 2.1>,
      <abs ABSG = 4 
       data hash MD5: 32K
       BB 63 BD DE F9 5F A4 78 8F 56 D3 77 38 81 D3 54>)
(   8,<2015-07-09 13:47:51.222 -0700>,<Administrator>,<X>,<proc1d>,<TOPSPIN 2.1>,
      <abs ABSG = 5 
       data hash MD5: 32K
       27 39 4C 6E 2F 0D 79 EE EA F9 82 CF BC B1 3A E0>)
$$ ##END=
$$ 
$$ $$ hash MD5
$$ $$ B8 4F EB BF E0 39 8E 76 C3 08 98 97 77 C4 23 65
##$RELAX= 
##$RELAX= 
##$RELAX= 
##$RELAX= 
##$RELAX= 
##$RELAX= 
##$RELAX= 
$$ Bruker specific parameters
$$ --------------------------
##$DU= <E:\>
##$EXPNO= 10
##$NAME= <NES1021_11277_9266032_qIsfAihTUI>
##$PROCNO= 1
$$ [...]
150 150 150 150 150 150 150 150
##$TP07= 0
##$TPNAME0= <>
##$TPNAME1= <>
##$TPNAME2= <>
##$TPNAME3= <>
##$TPNAME4= <>
##$TPNAME5= <>
##$TPNAME6= <>
##$TPNAME7= <>
##$TPOAL= (0..7)
0.5 0.5 0.5 0.5 0.5 0.5 0.5 0.5
##$TPOFFS= (0..7)
0 0 0 0 0 0 0 0
##$TUNHIN= 0
##$TUNHOUT= 0
##$TUNXOUT= 0
##$USERA1= <user>
##$USERA2= <user>
##$USERA3= <user>
##$USERA4= <user>
##$USERA5= <user>
##$V9= 5
##$VALIST= <valist>
##$VCLIST= <CCCCCCCCCCCCCCC>
##$VD= 0
##$VDLIST= <DDDDDDDDDDDDDDD>
##$VPLIST= <PPPPPPPPPPPPPPP>
##$VTLIST= <TTTTTTTTTTTTTTT>
##$WBST= 2048
##$WBSW= 25
##$XGAIN= (0..3)
0 0 0 0
##$XL= 0
##$YL= 0
##$YMAX_a= 619907
##$YMIN_a= -517395
##$ZGOPTNS= <>
##$ZL1= 120
##$ZL2= 120
##$ZL3= 120
##$ZL4= 120
##$ABSF1= 14.98509
##$ABSF2= -5.573092
##$ABSG= 5
##$ABSL= 3
##$ALPHA= 0
##$AQORDER= 0
##$ASSFAC= 0
##$ASSFACI= 0
##$ASSFACX= 0
##$ASSWID= 0
##$AUNMP= <proc_prof1d_extract_pilot.lims>
##$AXLEFT= 0
##$AXNAME= <>
##$AXNUC= <1H>
##$AXRIGHT= 0
##$AXTYPE= 0
##$AXUNIT= <>
##$AZFE= 0.1
##$AZFW= 0.1
##$BCFW= 0
##$BC_mod= 0
##$BYTORDP= 0
##$COROFFS= 0
##$CY= 15
##$DATMOD= 1
##$DC= 0
##$DFILT= <>
##$DTYPP= 0
##$F1P= 0
##$F2P= 0
##$FCOR= 0.5
##$FTSIZE= 32768
##$FT_mod= 6
##$GAMMA= 0
##$GB= 0
##$INTBC= 1
##$INTSCL= 1
##$ISEN= 128
##$LB= 0
##$LEV0= 0
##$LPBIN= 0
##$MAXI= 10000
##$MC2= 0
##$MEAN= 0
##$ME_mod= 0
##$MI= 0
##$NCOEF= 0
##$NC_proc= -8
##$NLEV= 6
##$NOISF1= 0
##$NOISF2= 0
##$NSP= 0
##$NTH_PI= 0
##$NZP= 0
##$OFFSET= 14.98509
##$PC= 1
##$PHC0= 93.30688
##$PHC1= 0
##$PH_mod= 1
##$PKNL= yes
##$PPARMOD= 0
##$PPDIAG= 0
##$PPIPTYP= 0
##$PPMPNUM= 2147483647
##$PPRESOL= 1
##$PSCAL= 4
##$PSIGN= 0
##$PYNMP= <proc.py>
##$REVERSE= no
##$SF= 400.02
##$SI= 32768
##$SIGF1= 0
##$SIGF2= 0
##$SINO= 400
##$SIOLD= 32768
##$SPECTYP= <>
##$SREGLST= <1H.CDCl3>
##$SSB= 0
##$STSI= 32768
##$STSR= 0
##$SW_p= 8223.68421052631
##$SYMM= 0
##$S_DEV= 0
##$TDeff= 65536
##$TDoff= 0
##$TI= <>
##$TILT= no
##$TM1= 0
##$TM2= 0
##$TOPLEV= 0
##$USERP1= <user>
##$USERP2= <user>
##$USERP3= <user>
##$USERP4= <user>
##$USERP5= <user>
##$WDW= 1
##$XDIM= 32768
##$YMAX_p= 446894858
##$YMIN_p= -657041
##$CURPLOT= <Network HP LaserJet P1505>
##$CURPRIN= <$Network HP LaserJet P1505>
##$DFORMAT= <normdp>
##$LAYOUT= <+/1D_H.xwp>
##$LFORMAT= <normlp>
##$PFORMAT= <normpl>
##$SURQMSG= 1
$$ End of Bruker specific parameters
$$ ---------------------------------
##NTUPLES= NMR SPECTRUM
##VAR_NAME=  FREQUENCY,     SPECTRUM/REAL,   SPECTRUM/IMAG
##SYMBOL=    X,             R,               I
##VAR_TYPE=  INDEPENDENT,   DEPENDENT,       DEPENDENT
##VAR_FORM=  AFFN,          ASDF,            ASDF
##VAR_DIM=   32768,         32768,           32768
##UNITS=     HZ,            ARBITRARY UNITS, ARBITRARY UNITS
##FACTOR=    0.250966925370066, 1,           1
##FIRST=     8223.43324360094, 31978,        14364
##LAST=      0,             33985,           -160233
##MIN=       0,             -657041,         0
##MAX=       8223.43324360094, 446894858,    0
$$ Real data points
##PAGE= N=1
##DATA TABLE= (X++(R..R)), XYDATA
$$ [...]
19457c58619i8489k57351a62754A11136E3210a90985A98300o0057l3328c77917
$$ -358619 -98489 -355840 -162754 111136 53210 -190985 198300 138243 104915 -377917
19446b18426k567J0247j80707I5640d5482a0102B3788i8879r03M765Q184j77158
$$ -218426 -220993 -210746 -391453 95640 -45482 -10102 23788 -98879 -99782 -95017 -86833 -263991
19434b63991A34191J09372c6959r2508j29197e8893A692h0288A44901b6611A53928
$$ -263991 134191 243563 -36959 -129467 -258664 -58893 1692 -80288 144901 -26611 153928
19422g3760p6784k15265J75984d1493A15812i7675c855E6874J75204c1577l74338
$$ -73760 -150544 -365809 -189825 -41493 115812 -97675 -3855 56874 232078 -31577 -405915
19411d05915a55105d2412j71093h9386r9091D500a18739p3373A02056e9544g450
$$ -405915 -155105 -42412 -213505 -89386 -188477 4500 -118739 -192112 102056 -59544 -7450
19399A98989d5019H8730a20130n7978r5440K9679M1802B1062i3193q4344k8849
$$ 198989 -45019 88730 -120130 -178108 -273548 -243869 -202067 21062 -93193 -177537 -206386
19388b06386H0414i9676j83988E5156b17755g6891i475j9888G8739b21129J8488
$$ -206386 80414 -99676 -283664 55156 -217755 -76891 -9475 -29363 78739 -221129 -202641
19377b02641Q749A2551a52493k8633G2916h6486D0646A1880c5837j77419A29403
$$ -202641 -193892 12551 -152493 -181126 72916 -86486 40646 11880 -35837 -213256 129403
19365c69202A20490e6817j20930K9174b9154j54021D7183r254d6790J6643B57198
$$ -369202 120490 -56817 -177747 -148573 -29154 -183175 47183 37929 -46790 -30147 257198
19353a0417B0570b48686a02012H423J1963a0097A66157F1472L22284A30187M905
$$ -10417 20570 -248686 -102012 8423 20386 -10097 166157 61472 383756 130187 135092
19342A35092i1348j43000B7492K30927a44632j35327J8166o385a7848o5818q4964
$$ 135092 -91348 -234348 27492 258419 -144632 -279959 -261793 -268178 -17848 -83666 -168630
19331a68630K8082J2748b7116j98198L3115P4186l8961e1796r8762e1444j21301
$$ -168630 -140548 -127800 -27116 -225314 -192199 -118013 -156974 -51796 -150558 -51444 -172745
19320a72745j84728c2222m1026a1220l6601k43224a25680l7098o1149A4106K06709
$$ -172745 -357473 -32222 -73248 -11220 -47821 -291045 -125680 -162778 -223927 14106 220815
19309B20815C9401g1209k93261B07140O5970i141E31166E439b1861m33201a45156
$$ 220815 39401 -71209 -364470 207140 273110 -9141 531166 5439 -21861 -455062 -145156
19297a18050A1883P5210b46621N5532d5876k35685K9570Q5980j14941a21477B16145
$$ -118050 11883 87093 -246621 -191089 -45876 -281561 -251991 -166011 -280952 -121477 216145
19285a98059D8536b52122A81943d99087b18125B33881a30200m20308a23182E0594
$$ -198059 48536 -252122 181943 -499087 -218125 233881 -130200 -550508 -123182 50594
19274G5335b00854L1024B7753d2636G824b6105B58388h5221r4230p594i2895k9830
$$ 75335 -200854 -169830 27753 -42636 7824 -26105 258388 -85221 -179451 -187045 -92895 -122725
19262a22725l8706g8708c4608A337b97371e7439m5532j056k20764J50808c2545
$$ -122725 -161431 -78708 -34608 1337 -297371 -57439 -102971 -104027 -324791 -173983 -32545
19250a24347E10023a32943l9873n0278h9612k48151a50151r141D8729k481a30476
$$ -124347 510023 -132943 -172816 -223094 -89612 -337763 -150151 -159292 48729 46248 -130476
19238a17651k88168A906g1902A4462J38408l9831a26401A66429a53991r4109A11880
$$ -117651 -405819 1906 -71902 14462 152870 113039 -126401 166429 -153991 -248100 111880
19226a86075d7778A6184L3325P4375f5108j03085A34442g8197J0325k44020F0389
$$ -186075 -47778 16184 49509 123884 -65108 -168193 134442 -78197 -67872 -311892 60389
19214a21846q5966N8273f4578E3290a16851L7529K4941D7845d87900B97773o7577
$$ -121846 -207812 -149539 -64578 53290 -116851 -79322 -54381 47845 -487900 297773 230196
19203B30196c1453k16586F0796J04800c1979A21129C3655e5498A95835c28096
$$ 230196 -31453 -248039 60796 165596 -31979 121129 33655 -55498 195835 -328096
19192f0245k2623A34165c87178a10236q3279Q1560j47394f8945B8330a23593l39501
$$ -60245 -82868 134165 -387178 -110236 -193515 -111955 -259349 -68945 28330 -123593 -463094
19181d63094b12956N0235j2791G799g8818A80155b9180j230m3078A53375J16701
$$ -463094 -212956 -162721 -175512 7799 -78818 180155 -29180 -30410 -73488 153375 270076
19170B70076d31000J29019E2703b46968N0238B60436a07732n9459j39047J16919
$$ 270076 -431000 -301981 52703 -246968 -196730 260436 -107732 -167191 -306238 -189319
19160a89319A6737P0547b56963A78582a84723A32707J80902A44570d0391B9518
$$ -189319 16737 87284 -256963 178582 -184723 132707 313609 144570 -40391 29518
19149f8049D4405a88916E7919A8153M9271c6145B77911a19395b9001C44518d5601
$$ -68049 44405 -188916 57919 18153 67424 -36145 277911 -119395 -29001 344518 -45601
19137c62031a57596m3395b4845n1265A47879B5727c33681A91323g5078B05542
$$ -362031 -157596 -200991 -24845 -76110 147879 25727 -333681 191323 -75078 205542
19126a45521A0488d9803A17756B499a24320d1215G3301j6847J21355k6341A4376
$$ -145521 10488 -49803 117756 2499 -124320 -41215 73301 56454 177809 151468 14376
19114C0138L0145a30276b2725k45404a1805p5375l28962a05104e1261j6780B30422
$$ 30138 60283 -130276 -22725 -268129 -11805 -87180 -416142 -105104 -51261 -68041 230422
19102E2684a71465G1955b87006B88671j21730a09024A99986b97117H8995a59718
$$ 52684 -171465 71955 -287006 288671 166941 -109024 199986 -297117 88995 -159718
19091a41122a9148j82842O9870e7237j2157l79717J59456i3795l5396m7756I2725
$$ -141122 -19148 -201990 -132120 -57237 -69394 -449111 -289655 -93795 -129191 -176947 92725
19079a93633B00354h224A48244a85065B27301l1786I684b60210A75386a35864
$$ -193633 200354 -8224 148244 -185065 227301 195515 9684 -260210 175386 -135864
19068i6949j8438M5744A275b13705n0807c6324k49246J02397d2226B6286N2226
$$ -96949 -115387 -69643 1275 -213705 -264512 -36324 -285570 -183173 -42226 26286 78512
19057G8512e7060L455l88735F7271Q2730b08932L9144A95571a14089c0573p9651
$$ 78512 -57060 -53605 -442340 67271 150001 -208932 -169788 195571 -114089 -30573 -110224
19046a10224M3871B26964d5925D3701L700h7843k54799F3119g1537k97153J50003
$$ -110224 -66353 226964 -45925 43701 47401 -87843 -342642 63119 -71537 -368690 -218687
19035b18687I3641c63667C448a77832M7866m8165j5716I4033Q0548L08563C3657
$$ -218687 93641 -363667 3448 -177832 -129966 -178131 -193847 94033 174581 483144 33657
19023A32113a32122B84486b61749A05315O5014b7770B60859p9920l9788D6466
$$ 132113 -132122 284486 -261749 105315 170329 -27770 260859 180939 141151 46466
19012A4988J49269l7946f1142E825J36341J19733j19000b38817e3462G5537a76829
$$ 14988 164257 126311 -61142 5825 142166 261899 142899 -238817 -53462 75537 -176829
19000C1812a9257o3736A18911i5210k48170I4157A6622N7685c86080A83707c08569
$$ 31812 -19257 -82993 118911 -95210 -343380 94157 16622 74307 -386080 183707 -308569
18988A05268a24278e3258K3765A38939c3506j19543E3826g0293b1612B28224k7817
$$ 105268 -124278 -53258 -29493 138939 -33506 -153049 53826 -70293 -21612 228224 200407
18977B00407g3944o2293i017A73413J19522L17479j95366l9797A11555O8942G8943
$$ 200407 -73944 -136237 -9017 173413 292935 610414 415048 375251 111555 180497 78943
18965H0132b14613A85125M6191a74319I9140c89497I4659a08878C36145a98643
$$ 80132 -214613 185125 231316 -174319 99140 -389497 94659 -108878 336145 -198643
18954C91365a58853A82129a27355D4036b39258A1620e28009c7065n5984K5016
$$ 391365 -158853 182129 -127355 44036 -239258 11620 -528009 -37065 -93049 -68033
18944f8033j37201e0440A32771a64043O6597j41636A1050a74355J3991j84113
$$ -68033 -205234 -50440 132771 -164043 -97446 -239082 11050 -174355 -160364 -344477
18934c44477A69871d71558F70K09304H8367c4512j14021j5800A63307G7148k5920
$$ -344477 169871 -471558 670 209974 88367 -34512 -148533 -164333 163307 77148 51228
18923E1228g1038j31128A54778b84633P5108l2496J8366f9215B30002e8730k06934
$$ 51228 -71038 -202166 154778 -284633 -209525 -242021 -223655 -69215 230002 -58730 -265664
18912b65664B99486g0050B04761o7024M57085A75195L0735f7323B30640j449b21816
$$ -265664 299486 -70050 204761 137737 594822 175195 205930 -67323 230640 229191 -221816
18900c13453B18567h1832A91769F5624J06002e514E5874a17326b7317k0581p0615
$$ -313453 218567 -81832 191769 65624 171626 -5514 55874 -117326 -27317 -47898 -118513
18889a18513j05861Q1095A70260a9820A14549B4257I736a72141C331b19708m264
$$ -118513 -224374 -143279 170260 -19820 114549 24257 9736 -172141 3331 -219708 -223972
18878b23972I5355b58441j04311a81145I7223k6861a639k13711A03029D6478o234
$$ -223972 95355 -258441 -362752 -181145 97223 70362 -1639 -215350 103029 46478 40244
18867D0244e3429j51027A01186a31907o5462A63626l6236d4163A6005a70588L448
$$ 40244 -53429 -204456 101186 -131907 -197369 163626 127390 -44163 16005 -170588 -167140
18856a67140j99075a43456M456j48312i307k30881F4968e5716B67629a69873B89103
$$ -167140 -366215 -143456 -139000 -287312 -9307 -240188 64968 -55716 267629 -169873 289103
18844A25876d5630A25183a59709M3915m9570K1506q8657i5362b0475j4652m03239
$$ 125876 -45630 125183 -159709 -115794 -165364 -143858 -232515 -95362 -20475 -35127 -438366
18833d38366h1142l0560Q271A32664A3508J25635c7628p0465b6962H2025b60623
$$ -438366 -81142 -111702 -103431 132664 13508 139143 -37628 -108093 -26962 82025 -260623
18821b87281q0836A47638c53176a42929K4084A03122c73191C1071J02380l9033
$$ -287281 -368117 147638 -353176 -142929 -118845 103122 -373191 31071 133451 94418
18811I4418a87585M1768A81562D5695C030h8890A41711N1423p7236d4692A34186
$$ 94418 -187585 -145817 181562 45695 3030 -88890 141711 193134 115898 -44692 134186
18799A07496j508a6661D54349A03701d51768H7924a34211k2593C3772Q7199J0666
$$ 107496 105988 -16661 454349 103701 -451768 87924 -134211 -156804 33772 120971 131637
18788A31637a9773j06545j4829G3003g5950j24027F3413b45313Q8034I2187B7489
$$ 131637 -19773 -126318 -141147 73003 -75950 -199977 63413 -245313 -157279 92187 27489
18776d8834B39486C6651e1526j76322i7419j93143M8811A87250a88350A93943
$$ -48834 239486 36651 -51526 -227848 -97419 -290562 -241751 187250 -188350 193943
18765I262a24913k33169B12929a55513B6866b35005a2425j04221d4151b218I4012
$$ 9262 -124913 -358082 212929 -155513 26866 -235005 -12425 -116646 -44151 -2218 94012
18753A41850i7119k8373k8745k5578b3167H842b21563o410B31911i4942q2489
$$ 141850 -97119 -125492 -154237 -179815 -23167 8842 -221563 -227973 231911 -94942 -177431
18742a77431N7186D601Q9818A6218J16790C8891d1450p3929q0570D0726a6947
$$ -177431 -120245 4601 94419 16218 133008 38891 -41450 -115379 -195949 40726 -16947
18730c31831h1955j36150k815J05178B383b98929J39834M9911p7583i2168d2365
$$ -331831 -81955 -218105 -220920 -115742 2383 -298929 -159095 -109184 -186767 -92168 -42365
18718b72263m3296J22251J9033N2837j44504g7387j9528j45285C83578b73533
$$ -272263 -315559 -193308 -174275 -121438 -265942 -77387 -96915 -242200 383578 -273533
18707b27605A80584b56347l16666K30325A43634c8108o5978A88490C9253h3616
$$ -227605 180584 -256347 -573013 -342688 143634 -38108 -104086 188490 39253 -83616
18696b53973J17597e9125C2797a13038j39672e5511j50354A10279L5818B6701
$$ -253973 -136376 -59125 32797 -113038 -252710 -55511 -205865 110279 146097 26701
18685A17771E8771J05902L6976D6129M3687a16687j59828J36042e0250B8660a51309
$$ 117771 58771 164673 201649 46129 89816 -116687 -276515 -140473 -50250 28660 -151309
18673G096O4008a13036L9820A07975d7192m6153B41634J9878B0269b13196d2520
$$ 7096 71104 -113036 -73216 107975 -47192 -93345 241634 261512 20269 -213196 -42520
18661B4825j2343c7513J2034r1904m21871b2938l4928D4775K33059b77474E7033
$$ 24825 12482 -37513 -25479 -117383 -539254 -22938 -57866 44775 277834 -277474 57033
18649B063a98012n4763L4966C26277G0235c24803c5688k8463q1991A1903b80279
$$ 2063 -198012 -252775 -217809 326277 70235 -324803 -35688 -64151 -146142 11903 -280279
18637a83368b2738B01750a35476A2718N0071d2106B07925a37638c3603j30684
$$ -183368 -22738 201750 -135476 12718 62789 -42106 207925 -137638 -33603 -164287
18627a64287P6312j8463A41437l3311a72857M4634k02200i5285k0291j59683g0639
$$ -164287 -87975 -106438 141437 108126 -172857 -128223 -330423 -95285 -115576 -275259 -70639
18615B5217c6493E08587b41555J01114A3116a12393J6929r2644e2905A56356D6466
$$ 25217 -36493 508587 -241555 -140441 13116 -112393 -95464 -188108 -52905 156356 46466
18603e8593o6889A5739h1204A43820h1234j30709C7178a29182k63556D574J00398
$$ -58593 -125482 15739 -81204 143820 -81234 -211943 37178 -129182 -392738 4574 104972
18592A04972a17595B45952d2618j88735A4957c38268A40551b3057j924L9p7710
$$ 104972 -117595 245952 -42618 -231353 14957 -338268 140551 -23057 -24981 -24942 -102652
18581a02652q3534I9694h2873A25039a21339Q833J5607A20313c6281C49458c81499
$$ -102652 -186186 99694 -82873 125039 -121339 -112506 -96899 120313 -36281 349458 -381499
18569B29363a52596a4829F0513b06700c3725A43522h1038F436a60711m7691j0791
$$ 229363 -152596 -14829 60513 -206700 -33725 143522 -81038 6436 -160711 -208402 -219193
18558b19193K8694f2859B34663B2279b38081g1060k41562g6657j2264F2767R575
$$ -219193 -190499 -62859 234663 22279 -238081 -71060 -312622 -76657 -88921 62767 72342
18547G2342h7179H6868R3305a12257B89528b6660k65360a41325o8738j29760A6686
$$ 72342 -87179 86868 180173 -112257 289528 -26660 -292020 -141325 -210063 -339823 16686
18535b36652b2529p3248A98208b68409C30078A21399a15610e622n3552j27344
$$ -236652 -22529 -95777 198208 -268409 330078 121399 -115610 -5622 -59174 -186518
18525a86518K698K6099B4678i398A51464h2124H6157J6153b45733A42862e9161
$$ -186518 -183820 -157721 24678 -9398 151464 -82124 86157 102310 -245733 142862 -59161
18513g1763j77820A7492b21320A95832d02981A42617F8588a7740A56735G2991
$$ -71763 -249583 17492 -221320 195832 -402981 142617 68588 -17740 156735 72991
18502h5906E484K01623G2721h2544F3055a48571C62354D6744c11390e8177H0485
$$ -85906 5484 207107 72721 -82544 63055 -148571 362354 46744 -311390 -58177 80485
18490h3351E59039F8242k950c24374a40076B4668h0327a7306j02110B4393K52686
$$ -83351 559039 68242 65292 -324374 -140076 24668 -80327 -17306 -119416 24393 277079
18479B77079i8620c8468C4182b25895E40J66251c38584A73856a44601e0603D6897
$$ 277079 -98620 -38468 34182 -225895 540 166791 -338584 173856 -144601 -50603 46897
18467G3700c9I7407e6166m2459R529k77806a36312A7525a61264l4264B11782b01719
$$ 73700 -39 97407 -56166 -98625 -89096 -366902 -136312 17525 -161264 -195528 211782 -201719
18454A0602b65171J2234d252B08637b44950j18776A04319c1490j1204A8558a64310
$$ 10602 -265171 -252937 -4252 208637 -244950 -363726 104319 -31490 -42694 18558 -164310
18442a6238k96865b4659q8733j37758E3109a2458o7004j34472A17234N0365a61402
$$ -16238 -313103 -24659 -113392 -251150 53109 -12458 -79462 -213934 117234 167599 -161402
18430a51780n9492Q5243L1131j967D0991h8742C4760K37918g6195j56416J4959
$$ -151780 -211272 -126029 -94898 -96865 40991 -88742 34760 272678 -76195 -232611 -217652
18419b17652h4314I407b82352a1990k7877N726C09749K08196a213j45484j43675
$$ -217652 -84314 9407 -282352 -11990 -39867 -34141 309749 517945 -1213 -146697 -290372
18408b90372E3360c88566a15871C783L8532b85334d6914j08263j6999j71734E3814
$$ -290372 53360 -388566 -115871 3783 42315 -285334 -46914 -155177 -172176 -343910 53814
18396A26606a79527d4541n7616F9213a38566D1689g4057A27954l6966b38805b6916
$$ 126606 -179527 -44541 -102157 69213 -138566 41689 -74057 127954 90988 -238805 -26916
18384B46200I5669J83417A17265e2831b4776A11284K87440F796b21455i5459j90369
$$ 246200 95669 279086 117265 -52831 -24776 111284 398724 6796 -221455 -95459 -285828
18373b85828L2491A43920b55840f3448A83485a86132A30036n9076d8092I5894
$$ -285828 -253337 143920 -255840 -63448 183485 -186132 130036 70960 -48092 95894
18362c723k17484b303m3994k35368a21835B9662J2574N4652b79851a23050j60802
$$ -3723 -221207 -2303 -46297 -281665 -121835 29662 42236 96888 -279851 -123050 -283852
18351b83852a19608j17258A59396a89920P7692A64162n734O0974Q3660a58416
$$ -283852 -119608 -236866 159396 -189920 -112228 164162 158428 219402 303062 -158416
18340A55016J23404i1029j9730E41112f8753j11264A12997a75506c0373B25684
$$ 155016 278420 -91029 -110759 541112 -68753 -180017 112997 -175506 -30373 225684
18329A59908l1752J07165a83074F0897b80415H4607a75796A81397a08563E1257
$$ 159908 128156 235321 -183074 60897 -280415 84607 -175796 181397 -108563 51257
18318a48733E1001j7614a40602e549A65121m5306b71909A30866a25822p6541n2816
$$ -148733 51001 33387 -140602 -5549 165121 119815 -271909 130866 -125822 -202363 -255179
18307b55179j24716J15928B26472b60900B98697J84915B03711A8694N0975K59060
$$ -255179 -379895 -263967 226472 -260900 298697 483612 203711 18694 69669 328729
18297C28729g8610j35686b3713k06097j13807d1791B75435c29916d8023j48135
$$ 328729 -78610 -214296 -23713 -229810 -343617 -41791 275435 -329916 -48023 -196158
18287a96158I3122e4973j24112e1280A67675n9877a09082A70289a55065B3977
$$ -196158 93122 -54973 -179085 -51280 167675 107798 -109082 170289 -155065 23977
18276A14612N7090a66190D97504a40670A72540b07608L9667l0559A9464a23519
$$ 114612 171702 -166190 497504 -140670 172540 -207608 -167941 -198500 19464 -123519
18265D3697j3527i5122I9817a2333j56219A00432c22195a21938J848b1070j48138
$$ 43697 30170 -95122 99817 -12333 -168552 100432 -322195 -121938 -120090 -21070 -169208
18254a69208K6050m4025k72656J76958B13413r0949a70580Q3819j4955K4948B31892
$$ -169208 -143158 -187183 -459839 -282881 213413 122464 -170580 -86761 -101716 -76768 231892
18242A18075R5337i9976k0040B4013b04710J0985F9003c1996F2090k6948h6540
$$ 118075 213412 -99976 -120016 24013 -204710 -193725 69003 -31996 62090 35142 -86540
18230A63913a49064B95276K0050f2221k07043C54870b60853a0155A7496J84708
$$ 163913 -149064 295276 315326 -62221 -269264 354870 -260853 -10155 17496 202204
18220B02204a04210A28655d9974i65H8988g420B33873K7894p3548D0932i1578
$$ 202204 -104210 128655 -49974 -965 88988 -7420 233873 261767 188219 40932 -91578
18208B07090a52540I1800b3648H8729a9906k27581J03719A12497e457H8603a28123
$$ 207090 -152540 91800 -23648 88729 -19906 -247487 -143768 112497 -5457 88603 -128123
18196A14921a58541B66355d08675e5212J467G5221l4539O4357f5123J1539j21916
$$ 114921 -158541 266355 -408675 -55212 -53745 75221 40682 105039 -65123 -53584 -175500
18185a75500I8512c95841A97411e5769j11186f2242K0374l232l72681A39191b30468
$$ -175500 98512 -395841 197411 -55769 -166955 -62242 -41868 -45100 -417781 139191 -230468
18173D2811a98032F3439c01147R5212i3935J959j62288J21463A17508n3151J23825
$$ 42811 -198032 63439 -301147 -205935 -93935 -91976 -254264 -132801 117508 64357 188182
18162A88182l0989h6976j49770J9119I5257K464b2254B482h9039k4100E6486H63
$$ 188182 157193 -86976 -236746 -217627 95257 97721 -22254 2482 -89039 -113139 56486 863
18149A61273d7480k6856c2803q2810A75807b0494A86489g7055A6337h5293j2384
$$ 161273 -47480 -74336 -32803 -115613 175807 -20494 186489 -77055 16337 -85293 -97677
18138i7677E5864b4392j21938f5735k58306M2189M3234B9467J58623a28969A17300
$$ -97677 55864 -24392 -146330 -65735 -324041 -281852 -238618 29467 188090 -128969 117300
18126a7274q6058A306a21133L3783A68066C5234a94135D489J48274J05365f5494
$$ -17274 -103332 1306 -121133 -87350 168066 35234 -194135 4489 152763 258128 -65494
18114G6549p835c3634k40675g1763A33807E940a58103j6879k8512j539A96573
$$ 76549 68714 -33634 -274309 -71763 133807 5940 -158103 -174982 -203494 -205033 196573
18102b1293o634A27640D2468j9388J77036G0230a8769D8426a4137B16519A02765
$$ -21293 -27927 127640 42468 23080 200116 70230 -18769 48426 -14137 216519 102765
18090d1690k7042B05451P4284C9998O0177a70104C9592a91665G8206a68535A61749
$$ -41690 -68732 205451 279735 39998 100175 -170104 39592 -191665 78206 -168535 161749
18078B99491I3538a84218k48055E0272N2245a0399p1753A05954K14652i6774k6040
$$ 299491 93538 -184218 -432273 50272 102517 -10399 -82152 105954 320606 -96774 -122814
18067a22814C63117b21532L2717M0365p9316F1615K4049O5567C9245J80323q3438
$$ -122814 363117 -221532 -188815 -148450 -227766 61615 85664 151231 39245 219568 136130
18056A36130b4322H8141m3467K0002Q3057n0743a76863B9340L2714k9586b73717
$$ 136130 -24322 88141 44674 64676 147733 96990 -176863 29340 62054 32468 -273717
18044a28341j78450A56079m7248b16450J04888A34240p577a5352B159d4260j14663
$$ -128341 -306791 156079 108831 -216450 -111562 134240 126663 -15352 2159 -44260 -158923
18033a58923f1070D0283J20070J23539A37970i8306K6623A41273E8403b53170
$$ -158923 -61070 40283 160353 283892 137970 -98306 -71683 141273 58403 -253170
18022C46982I1544a31028j22119M3534d2749H101a89847B70403r8181a63310C8950
$$ 346982 91544 -131028 -253147 -209613 -42749 8101 -189847 270403 172222 -163310 38950
18010a95771C73257d43627g1726b1806l49527B2591a9959p5162C2301c0804C05290
$$ -195771 373257 -443627 -71726 -21806 -371333 22591 -19959 -95121 32301 -30804 305290
17998g6475G043b8030I5443c98834j03573e6030J0404A77848i3965I3915a63663
$$ -76475 7043 -28030 95443 -398834 -502407 -56030 -45626 177848 -93965 93915 -163663
17986a78934A33846b14333n9104A74767h3938h23k2226j90809a01397A34961K38312
$$ -178934 133846 -214333 -273437 174767 -83938 -823 -23049 -213858 -101397 134961 373273
17975C73273b06852A22864a51915A1725a69182j64205a44210B5945a12725A42692
$$ 373273 -206852 122864 -151915 11725 -169182 -333387 -144210 25945 -112725 142692
17964a67043d1337A27793a8432G1580e7235j11249a0011B56839n8662F5023k1728
$$ -167043 -41337 127793 -18432 71580 -57235 -168484 -10011 256839 198177 65023 43295
17953D3295a70179e1916k62556j07817a51192h467D4003K00910P4424r8501r9667
$$ 43295 -170179 -51916 -314472 -422289 -151192 -8467 44003 244913 319337 220836 121169
17942A21169C7101r184L932b13025J4060Q0761G4089h6050A74953n3907a62551
$$ 121169 37101 27917 31849 -213025 -198965 -118204 74089 -86050 174953 121046 -162551
17930A03128b57612J09812A51312a54110N4369A6019J43500a94172n7081b7100
$$ 103128 -257612 -147800 151312 -154110 -99741 16019 159519 -194172 -251253 -27100
17919A62012G1281a8068k00536i1604p5693g2503j42818A3890A580K19925b90101
$$ 162012 71281 -18068 -218604 -91604 -167297 -72503 -215321 13890 1580 221505 -290101
17907C40346p9618c8077A02402e7139C1112c1837C83078b21467b4820A51308K9883
$$ 340346 260728 -38077 102402 -57139 31112 -31837 383078 -221467 -24820 151308 181191
17896A81191b9878p052j37750A22557c4983A88230r3448a80988n2251A9943K31755
$$ 181191 -29878 -36930 -174680 122557 -34983 188230 94782 -180988 -233239 19943 251698
17885B51698J07675D8204d9569a3646H6230a06563A19470Q1206l9639a74733A73069
$$ 251698 359373 48204 -49569 -13646 86230 -106563 119470 200676 161037 -174733 173069
17873b1238j4400B8293L83019j97594D939J77493K4925b90109a129B39941c4179
$$ -21238 -35638 28293 411312 213718 4939 182432 207357 -290109 -1129 239941 -34179
17861I8344P5510o0573a66552c4740A11239J37243b88393A00911b42921A53807
$$ 98344 173854 113281 -166552 -34740 111239 248482 -288393 100911 -242921 153807
17850a80167e1270o1632A72829m2322d9912A45045b72852C38415G7957c1985p7475
$$ -180167 -51270 -112902 172829 130507 -49912 145045 -272852 338415 77957 -31985 -109460
17839a09460d8860F5903M9156M110D7303a47681A30814F2955b74018f2426H1419
$$ -109460 -48860 65903 115059 119169 47303 -147681 130814 62955 -274018 -62426 81419
17827B88139j41933O9797b73363m8867C00785a12768A79901J727C8909M7093O9877
$$ 288139 146206 216003 -273363 -322230 300785 -112768 179901 181628 38909 86002 155879
17816A55879a8989j46328A69412B3671e1697h329B20368g2413L2619A56041b24255
$$ 155879 -18989 -165317 169412 23671 -51697 -8329 220368 -72413 -39794 156041 -224255
17804i0910H0678k5083J0578a61380A30256b01404f3838K2834E2255K4533K8335
$$ -90910 80678 55595 66173 -161380 130256 -201404 -63838 -41004 52255 76788 105123
17793A05123l1897J27946j4758A746b27896A23396J19663o4868p925b33915G3112
$$ 105123 73226 201172 186414 1746 -227896 123396 243059 178191 170266 -233915 73112
17781b4350E1746b31142C6260a3824j42107o8162A04637L6230Q5660G9874J79907
$$ -24350 51746 -231142 36260 -13824 -155931 -224093 104637 140867 226527 79874 259781
17770B59781I8526b26975g465B05429C4775J56308b40537A47910B8369O3291e9310
$$ 259781 98526 -226975 -7465 205429 34775 191083 -240537 147910 28369 91660 -59310
17758i5870K6614B92277d15052h5667l2983A68615R3478o1292n3318o3758k030
$$ -95870 -69256 292277 -415052 -85667 -118650 168615 262093 200801 147483 83725 81695
17747H1695B7881b292C06451a9572F6757K90691j77625h8719J8268C6654a12358
$$ 81695 27881 -2292 306451 -19572 66757 357448 179823 -88719 -70451 36654 -112358
17735d22879R8338C7403J02041F365K42461m7381D1615a60728B02211F1230L59293
$$ -422879 -324541 37403 139444 6365 248826 201445 41615 -160728 202211 61230 420523
17724D20523I5545J23073g0274B51407L9246E6681J46986R1305E6666J54144M6533
$$ 420523 95545 218618 -70274 251407 290653 56681 203667 294972 56666 210810 257343
17713B57343c1771j50971e3314B95029I6603J52827q0295m4545K28695h128B56335
$$ 257343 -31771 -182742 -53314 295029 96603 249430 169135 124590 353285 -8128 256335
17701A84166h2683D2497M8831K7012d4851A96420c59125J9216A92559J25211M7221
$$ 184166 -82683 42497 91328 118340 -44851 196420 -359125 -339909 192559 317770 364991
17690C64991a01214D6911J24446E6873K43499A4452J5197a43674K3823B47653
$$ 364991 -101214 46911 171357 56873 300372 14452 29649 -143674 -119851 247653
17679A1571f4085B5476I34P9695l8680a9986A84651a1496D00663j32466N5462
$$ 11571 -64085 25476 934 80629 41949 -19986 184651 -11496 400663 268197 323659
17668C23659j45117j3360J5041i0588C77347f2120A27318A680K32030O9381C5637
$$ 323659 178542 165182 180223 -90588 377347 -62120 127318 1680 233710 303091 35637
17656a16415B37585A14345J24057A14964M9671C0000K63166a6028j91351B18972
$$ -116415 237585 114345 238402 114964 164635 30000 293166 -16028 -207379 218972
17645a71147B11341f5824l3414B58869k5467I7025a68484A15829c39760C43200
$$ -171147 211341 -65824 -99238 258869 233402 97025 -168484 115829 -339760 343200
17634B54597C9210J40543J88643h555I1778b66365C73478n8264C3003c0607C99474
$$ 254597 39210 179753 368396 -8555 91778 -266365 373478 315214 33003 -30607 399474
17622A37028o7758J44565q688P2507m3991B6638K67488a21088b5124r0818H7097
$$ 137028 69270 213835 205147 277654 233663 26638 294126 -121088 -25124 -115942 87097
17610E09591I8472B2560g2055c3441A38016E7823J61454a11959B77808p0433n720
$$ 509591 98472 22560 -72055 -33441 138016 57823 219277 -111959 277808 207375 201655
17599B01655D5763L4469C8738J75449b359A50444n9632a13733G0515K9464a86253
$$ 201655 45763 80232 38738 214187 -2359 150444 90812 -113733 70515 99979 -186253
17587A74567J77054D7205M27510e9741E0440o294j6526a15154B75097b67827B93881
$$ 174567 351621 47205 474715 -59741 50440 44146 27620 -115154 275097 -267827 293881
17575c7684B86206D2934M1810B5214J95187J13776m7884j21901J25148Q6533I6454
$$ -37684 286206 42934 84744 25214 220401 334177 286293 164392 289540 376073 96454
17563I8325a83236B16010H1224D348K50442r3397F6804g9384j02795G3674J76803
$$ 98325 -183236 216010 81224 4348 254790 161393 66804 -79384 -182179 73674 250477
17552B50477a03198B5425M1296K98751j73737K71939A94185m0719j7225P954O5077
$$ 250477 -103198 25425 66721 365472 191735 463674 194185 153466 136241 144195 209272
17541B09272c6475H0983M02339B19016r0920J25609I1518K62982r5997G1289K77882
$$ 209272 -36475 80983 483322 219016 128096 253705 91518 354500 258503 71289 349171
17530C49171J87387A95484K64327k0601L73765j9390n4516L69433l69064l49606
$$ 349171 536558 195484 459811 439210 812975 793585 739069 1108502 739438 389832
17520C89832J87722r0244o1881M4945I6551M15560k04465o862L54592j31770L37797
$$ 389832 577554 487310 425429 470374 96551 512111 307646 300784 655376 523606 861403
17509H61403L36693m32252J09638l50161L9352j83290o9643r3271L33272k26109
$$ 861403 1198096 765844 875482 525321 564673 381383 311740 218469 551741 325632
17499C25632A49274K06549O9059j03828A19237L8424o6206K5603K52694i9097
$$ 325632 149274 355823 424882 321054 119237 157661 91455 117058 369752 -99097
17488D61751p7482J47413A12772B4787J93474o1377L6917n8955M38205k42958
$$ 461751 384269 531682 112772 24787 218261 156884 193801 134846 573051 330093
17478C30093p1132F7899M03226j56602D2865L89541A65091E6739N8173M33793
$$ 330093 258961 67899 471125 314523 42865 432406 165091 56739 114912 548705
17468E48705B14450J38965L26390j56985k53566q5210R0762j19863C6252K93413
$$ 548705 214450 353415 679805 522820 269254 184044 274806 154943 36252 329665
17458C29665D3966K00063k4559M2028O4772J760O9748J7818n59j05725p5506o2676
$$ 329665 43966 244029 219470 261498 326270 328030 397778 415596 415037 309312 233806 171130
17446A71130M25291B14708L18933L08669j63000q3034j84300q8887L02692k57033
$$ 171130 596421 214708 533641 842310 679310 596276 411976 323089 625781 368748
17436C68748M0758K51334o3819J9147k2327H3191O20922l28280R2850M08207C80486
$$ 368748 409506 660840 597021 616168 593841 83191 704113 375833 468683 876890 380486
17424C60541A78218J43496m795K53393q1481j98254k6513N8273r9110J41595q1393
$$ 360541 178218 321714 316919 570312 488831 290577 264064 322337 223227 364822 283429
17413B83429J2865J03369Q7566r1314J08572j99642o8830c3684C53078A53052
$$ 283429 296294 399663 487229 395915 504487 304845 236015 -33684 353078 153052
17402A76752K4697E9837L44805J01676B31694J27823B2452J53965B8851J04121
$$ 176752 201449 59837 404642 506318 231694 359517 22452 176417 28851 132972
17392A32972J35789K15744B15177J65105J56078k65203j14225J74201A55556K67361
$$ 132972 268761 484505 215177 380282 536360 271157 156932 331133 155556 422917
17382D22917k051d9433A65478K63986A11687J49581A18023k7926M05613J54800
$$ 422917 420866 -49433 165478 429464 111687 261268 118023 90097 495710 650510
17372F50510B55849J79782B13899F0311K66638J74674C3723L4548k7958N26996
$$ 650510 255849 435631 213899 60311 326949 501623 33723 68271 40313 567309
17362E67309q6325k07265H7464O5745J62889L900j35862J91927L9342j38421A14635
$$ 567309 480984 273719 87464 153209 316098 319998 184136 376063 415405 276984 114635
17350B32289b26B31058m9145L83018B82401J45753R0688A47666L6563P1114j13873
$$ 232289 -226 231058 181913 564931 282401 428154 518842 147666 184229 255343 141470
17339A41470J38058J17108A93218R7354j18539n4120K30112A51103K17877A17831
$$ 141470 279528 396636 193218 290572 172033 117913 348025 151103 368980 117831
17328E09339A55541K27340E3374J70355J0949K12763F6298i905C73343j49134
$$ 509339 155541 382881 53374 223729 234678 447441 66298 -9905 373343 224209
17318B24209O2422p0753K35743L8281A08871J91008A31438K81075n6099j1518
$$ 224209 286631 215878 451621 489902 108871 299879 131438 412513 356414 344896
17308C44896A09894M11181H7500J20408r8823K26864J02331q2955J3338j83577
$$ 344896 109894 521075 87500 207908 109085 335949 438280 355325 368663 185086
17298A85086G2216j6521O8250K05290O0734j12769K1166j33230J97097A54062
$$ 185086 72216 55695 123945 329235 389969 277200 298366 165136 362233 154062
17287D48473j09682q2745K51175j55837i9020D06680J03345l0695A57862k1562
$$ 448473 338791 256046 507221 351384 -99020 406680 510025 479330 157862 136300
17277A36300J41895E8846L24851O4072K9419N7941q1055J18225k79896R2674K5860
$$ 136300 278195 58846 383697 447769 477188 535129 454074 572299 292403 385077 410937
17266D10937A16362O582K05899K26257j33936I7188J26993K28879j33310j00400
$$ 410937 116362 122944 328843 555100 421164 97188 224181 453060 319750 219350
17256B19350K84067q0376j63285j06732K32092o8722K24871B53121J58779J15239
$$ 219350 503417 423041 259756 153024 385116 316394 541265 253121 411900 527139
17246E27139j52399o3326K18526B18388f7918A09091N1028K83395Q5254B05299
$$ 527139 374740 311414 529940 218388 -67918 109091 160119 443514 528768 205299
17235B16805I2963j1991K39825K32493B74712K29135l6203j14354O342K44774
$$ 216805 92963 80972 320797 553290 274712 503847 467644 353290 359632 604406
17225F04406k21209j24459N8L68611G9765K86736o1333L69723l37096n7249L67186
$$ 604406 383197 258738 258796 627407 79765 366501 305168 674891 337795 280546 647732
17214F47732R770B27008L00819J7754k09629M1435j14678N46436B99779M03223
$$ 647732 657502 227008 527827 545581 335952 377387 262709 809145 299779 703002
17204G03002C09408M6447j4315L39577k51374Q4097k18853L56748k55267J91621
$$ 703002 309408 355855 341540 681117 429743 513840 294987 651735 396468 588089
17194E88089A48464N92444C49372J494K32782p1298m4982K2891r1945M9563A59620
$$ 588089 148464 740908 349372 350866 583648 512350 467368 490259 398314 447877 159620
17182F93524j93155J29420l5416k52749K46210K28015k86114l9665j31101K06047
$$ 693524 500369 629789 594373 341624 587834 815849 529735 490070 358969 565016
17172E65016M95121B88428p1983O12559k65478q2230k1894k3680K0084K73098
$$ 565016 1060137 288428 216445 829004 563526 481296 459402 435722 455806 728904
17162G28904l04785L66614k56470P1260J38152l43175r504M36573j79486m0479
$$ 728904 424119 790733 534263 605523 743675 400500 390996 827569 648083 607604
17152F07604J24982o4653K14654B99904K4226K96753k76597L34428B61336N19214
$$ 607604 732586 667933 882587 299904 324130 620883 344286 678714 261336 780550
17142G80550j97750o1921L44823J46414B91238K17653j4970j51266L44431K69768
$$ 780550 582800 520879 865702 1012116 291238 508891 493921 342655 687086 956854
17132I56854D03784M87734l47563p2397K74901l05982J01035j17003K96980K4928
$$ 956854 403784 891518 543955 471558 746459 440477 541512 424509 721489 746417
17122G46417j62962K22302M0166k64272J96991l64990J46451K98717m2036N2402
$$ 746417 583455 805757 845923 581651 778642 413652 560103 858820 816784 869186
17112H69186P9298m63203J70595q6070M27M08695k60532k80392M12050l0901n7915
$$ 869186 948484 485281 655876 569806 570233 978928 718396 438004 850054 819153 761238
17101G61238j7365J58982k19237J67429q1804j77634K84539k25818J39544k29248
$$ 761238 743873 902855 683618 851047 769243 591609 876148 650330 789874 560626
17091E60626O6520J46135j68025K10585O4092L0611l60186J51678j91879J89412
$$ 560626 627146 773281 605256 815841 879933 910544 550358 702036 510157 699569
17081F99569n8152L14395K3102j32268M43572l88822J60558k06523l42619M52944
$$ 699569 641417 955812 978914 846646 1290218 901396 1061954 855431 512812 965756
17071I65756r2607k2979K45909m68528L19546K05209k77667J08145J26295r133
$$ 965756 873149 850170 1096079 627551 947097 1152306 874639 982784 1109079 1099946
17061A099946m80935N34062l40758m2578J31591J67885n04299N13032j0908l4454
$$ 1099946 619011 1153073 812315 769737 901328 1069213 564914 1077946 1067038 1032584
17051A032584P6647p4306j79122L96369l74041J98513o9220l7253N2764j84710
$$ 1032584 1109231 1034925 855803 1252172 878131 1076644 1007424 970171 1022935 838225
17041H38225K05542J75208j56137k08653K76654k76146J98723l5770J95509l0558
$$ 838225 1043767 1218975 1062838 854185 1130839 854693 1053416 1017646 1213155 1182597
17031A182597j15707J52127j49908K0131N6680m6138K40796k49559L06657j90511
$$ 1182597 1066890 1219017 1069109 1089240 1145920 1099782 1340578 1091019 1397676 1207165
17021A207165O5511k80211k8730K93667q5293K41268J49796k51503j56034k854
$$ 1207165 1272676 992465 963735 1257402 1172109 1413377 1563173 1311670 1155636 1152782
17011A152782J11085m7360o8526K11189j57768J40746J99363l97539L96414k48026
$$ 1152782 1263867 1216507 1147981 1359170 1201402 1342148 1541511 1143972 1540386 1292360
17001A292360J17168J23037l41484J58535O6802r8527M69451n54110K38901j2391
$$ 1292360 1409528 1532565 1191081 1349616 1416418 1317891 1787342 1233232 1472133 1459742
16991A459742L33561k73744j39289J34726p7251J13353r3032L73735n03554J7542
$$ 1459742 1793303 1519559 1380270 1514996 1437745 1551098 1458066 1831801 1328247 1345789
16981A345789L88927j5937j84458j67316J00066J00930l3442J2762N5889k2962
$$ 1345789 1734716 1718779 1534321 1367005 1467071 1568001 1534559 1547321 1603210 1580248
16971A580248j31296M60098r6289N3456L273P5309k55506k9188L17572R1940n35216
$$ 1580248 1448952 1909050 1812761 1866217 1869490 1944799 1689293 1660105 1977677 2069617 1534401
16960A534401M42400n2446P2801k32691J94797J01140l4074k68537N34546k71206
$$ 1534401 1976801 1924355 1997156 1764465 1959262 2060402 2026328 1757791 2292337 2021131
16950B021131N6382j59894r1351L78136J43556p3928j54910J14915j58211L22529
$$ 2021131 2077513 1917619 1826268 2204404 2347960 2274032 2119122 2234037 2075826 2398355
16940B398355Q3214j1643R9996l78335K37758K6098q4052K62683k16818Q0481
$$ 2398355 2481569 2469926 2569922 2191587 2429345 2455443 2371391 2634074 2417256 2497737
16930B497737j9406l40695Q9162R6121N14080J4662M3334j27932K33690m77418
$$ 2497737 2478331 2137636 2226798 2322919 2836999 2851661 2894995 2767063 3000753 2523335
16920B523335J39799K09950R3087M4923k20493j48400J23899L03437l08354J0080
$$ 2523335 2663134 2873084 2966171 3011094 2790601 2642201 2766100 3069537 2761183 2771263
16910B771263J01017K10644j6795J47315L14549l14415p0715k8543K34155r5148
$$ 2771263 2872280 3082924 3066129 3213444 3527993 3213578 3142863 3114320 3348475 3253327
16900C253327L75824k62371M08800n06621L86935J47406Q1682l54056K51967p2992
$$ 3253327 3629151 3366780 3775580 3268959 3655894 3803300 3884982 3530926 3782893 3709901
16890C709901q5485K41117J78737k87453K99365q3438J32950O0646R3305J14202
$$ 3709901 3624416 3865533 4044270 3756817 4056182 3972744 4105694 4166340 4259645 4373847
16880D373847k31720M54324k20137K406L88045l34919K112J51769K08745k63500
$$ 4373847 4142127 4596451 4376314 4378720 4766765 4431846 4433958 4585727 4794472 4530972
16870D530972L94441j18105J40749K7018J99638J05680O7742L58699j29513k7888
$$ 4530972 4925413 4807308 4948057 4975075 5174713 5280393 5348135 5706834 5577321 5549433
16860E549433J24557j22020L12976j59300P6240P4136J89122j5313M1482J2201
$$ 5549433 5673990 5551970 5864946 5705646 5781886 5856022 6045144 6029831 6071313 6083514
16850F083514K56320J75384K12757j613K81645k33952p8155L68621L28791j46990
$$ 6083514 6339834 6515218 6727975 6726362 7008007 6774055 6695900 7064521 7393312 7246322
16840G246322Q0885j61975P96165l71688L16913K98678J48844j53741K91230j04743
$$ 7246322 7327207 7165232 7961397 7589709 7906622 8205300 8354144 8200403 8491633 8386890
16830H386890L37399M74995n9499r4623M18008L3774M72496n9106K24036J2018
$$ 8386890 8724289 9199284 9139785 9045162 9463170 9496944 9969440 9910334 10134370 10146388
16820A0146388O5311M88281J18041L39255J84012l55476Q28571j46097N14984
$$ 10146388 10211699 10699980 10818021 11157276 11341288 10985812 11814383 11668286 12183270
16811A2183270Q4400J69545M34558M04872Q5373O50186J7942P8441M1610O38117
$$ 12183270 12267670 12437215 12871773 13276645 13362018 14012204 14030146 14108587 14150197 14788314
16801A4788314K53589N43478K05296M50942N06746j05694O33479L36786N10504
$$ 14788314 15041903 15585381 15790677 16241619 16748365 16642671 17276150 17612936 18123440
16792A8123440N88507J77709O19939R9711L43118P12524M14673L49688J270157
$$ 18123440 18711947 18889656 19509595 19609306 19952424 20664948 21079621 21429309 22699466
16783B2699466k358L79539O78918J012730L61756N70500M79585J090355R58255
$$ 22699466 22697108 23076647 23755565 24768295 25130051 25700551 26180136 27270491 28228746
16774B8228746L72000Q92508O98990O70252R17597R59902P24279P80801J119011
$$ 28228746 28600746 29493254 30192244 30862496 31780093 32739995 33464274 34245075 35364086
16765C5364086J018576J172485J126309J018407J514325J246525Q42628J308869
$$ 35364086 36382662 37555147 38681456 39699863 41214188 42460713 43303341 44612210
16757D4612210J329370J190973J346136J551185J174491J651945J631912J304830
$$ 44612210 45941580 47132553 48478689 50029874 51204365 52856310 54488222 55793052
16749E5793052J653989J929554J773372J587291J729018J588131J443824K214177
$$ 55793052 57447041 59376595 61149967 62737258 64466276 66054407 67498231 69712408
16741F9712408J707303J797167J758336J840744J770766K063377J330204J909717
$$ 69712408 71419711 73216878 74975214 76815958 78586724 80650101 81980305 83890022
16733H3890022J096276J621636J688941J125603J065150J439162Q40859J138014
$$ 83890022 84986298 86607934 88296875 89422478 90487628 91926790 92767649 93905663
16725I3905663N01074L75984K81636N92717J74350K13871l67981k82187p92563
$$ 93905663 94406737 94782721 95064357 95657074 95831424 96045295 95677314 95395127 94602564
16716I4602564o33429n91040j057935j215104j094976j201176j448935j741726
$$ 94602564 93969135 93378095 92320160 91105056 90010080 88808904 87359969 85618243
16708H5618243j617741j342119j795276j750995j871182j626855j767889j750237
$$ 85618243 84000502 82658383 80863107 79112112 77240930 75614075 73846186 72095949
16700G2095949k142447j693916j604597j916789j785480j836217j414674j821815
$$ 72095949 69953502 68259586 66654989 64738200 62952720 61116503 59701829 57880014
16692E7880014j783431j430703j764830j628049j368341j299939j642288j262080
$$ 57880014 56096583 54665880 52901050 51273001 49904660 48604721 46962433 45700353
16684D5700353j240650j053683j404564j189331j374424r30657j182473q87460
$$ 45700353 44459703 43406020 42001456 40812125 39437701 38507044 37324571 36437111
16676C6437111j073849j315834o63265j056120n37181j213350q63001k60187j109937
$$ 36437111 35363262 34047428 33384163 32328043 31790862 30577512 29714511 29454324 28344387
16667B8344387p82178p00226o43635p91963p99921m06288n49421o58334l76691
$$ 28344387 27562209 26861983 26218348 25426385 24626464 24220176 23670755 23012421 22635730
16658B2635730p11692m72590n77806m90000o10390k90599n13405j3476r85364
$$ 22635730 21924038 21451448 20873642 20383642 19773252 19482653 18969248 18955772 17970408
16649A7970408m92592l59888j95252P7861j018526j72460n33837J48054o47930
$$ 17970408 17477816 17117928 16922676 17000537 15982011 15809551 15275714 15423768 14775838
16640A4775838m22682n7845m83303k20345m45367k02957J9464n79635j47726m72938
$$ 14775838 14353156 14295311 13812008 13591663 13146296 12943339 12962803 12383168 12235442 11762504
16630A1762504K08255r770m53682l94019k22619j29132k20808j72578r7599j00965
$$ 11762504 11970759 11960989 11507307 11113288 10890669 10761537 10540729 10368151 10270552 10169587
16620A0169587m20546j64426j05518k9446o16552O5011m6622M528p52197N64711
$$ 10169587 9749041 9584615 9479097 9449651 8833099 8898110 8851488 8856016 8103819 8668530
16610H668530l85807L0532m73645n2517K28125m55947r4250j61849J06397m56243
$$ 8668530 8282723 8313255 7839610 7787093 8015218 7559271 7465021 7303172 7409569 6953326
16600F953326L02460q1168m44131j24306j39872M91m91689M17407j97613j19367
$$ 6953326 7255786 7174618 6730487 6606181 6466309 6466800 5975111 6392518 6194905 6075538
16590F075538q2978O1226n4180m4547m9540l17417l837o9146M9467k1776k52406
$$ 6075538 5992560 6053786 5999606 5955059 5905519 5588102 5584265 5515119 5564586 5542810 5290404
16579E290404J36418o1791m74484N8877r7934j28845L50759m14023p5200J5201
$$ 5290404 5426822 5365031 4890547 4949424 4851490 4722645 5073404 4659381 4584181 4599382
16569D599382j5712l77615R7809M2480M3544l4743N0164Q6160o8732r9033k23492
$$ 4599382 4583670 4206055 4303864 4346344 4389888 4355145 4405309 4491469 4422737 4323704 4100212
16558D100212j36741j49418j09550K82644k05453L0520N0108j39317j11540L2170
$$ 4100212 3963471 3814053 3704503 3987147 3781694 3812214 3862322 3723005 3611465 3643635
16548C643635j71137j41027K79410k0686k0385j58028O12k2732l88994K26234
$$ 3643635 3472498 3331471 3610881 3590195 3569810 3411782 3412394 3389662 3000668 3226902
16538C226902P7171m4790q7768K9064j38696q6897k33819J79541l0188K10589
$$ 3226902 3304073 3259283 3171515 3200579 3061883 2974986 2741167 2920708 2890520 3101109
16528C101109l31461P7494K15713m14616N8788J96122m6754j4633l90733j0023
$$ 3101109 2769648 2847142 3062855 2648239 2707027 2903149 2856395 2841762 2451029 2441006
16518B441006J87095K71438k53534J67965j40185J11366j97129j7977j52492K26906
$$ 2441006 2628101 2899539 2646005 2813970 2673785 2785151 2588022 2570045 2417553 2644459
16508B644459m05440n2317K6427K23454N7420J32146n76550j38413L68355J69562
$$ 2644459 2239019 2186702 2213129 2436583 2494003 2626149 2049599 1911186 2279541 2449103
16498B449103m64713M0120Q5033L97314n3264K3156o57142L06339j08719O9573
$$ 2449103 1984390 2024510 2109543 2506857 2453593 2476749 1819607 2125946 2017227 2086800
16488B086800j14721m06923J81128M4138q9910K83826j37362J6774l10519J72172
$$ 2086800 1972079 1565156 1746284 1790422 1700512 1984338 1846976 1863750 1553231 1725403
16478A725403K92369m24836O7080j47485L58655k02566k97598M87788K03721j57982
$$ 1725403 2017772 1592936 1660016 1512531 1871186 1668620 1371022 1858810 2062531 1904549
16468A904549k73386N4311l6700P3328J44536n9505l50061J86225j01956P152
$$ 1904549 1631163 1685474 1648774 1722102 1866638 1807133 1457072 1643297 1541341 1548493
16458A548493J17756l42308Q6063K62389j27841R8787n5235j10014o0871O2298
$$ 1548493 1666249 1323941 1410004 1672393 1544552 1643339 1588104 1478090 1417219 1479517
16448A479517j69956M02648m23098J32317l85625N21244p4233J5529L05851o80500
$$ 1479517 1309561 1712209 1289111 1421428 1035803 1557047 1482814 1498343 1804194 1123694
16438A123694M3530N71840k08903J07618k87333k79313K35667O2988j87697j77285
$$ 1123694 1167224 1739064 1530161 1637779 1350446 1071133 1306800 1369788 1182091 1004806
16428A004806O6328K39908m2351K05309l81012P1246O3912j10541j6614K40155
$$ 1004806 1071134 1311042 1268691 1474000 1092988 1164234 1228146 1117605 1100991 1341146
16418A341146k80221r5720J65924o1893l7085L09802j30196k50519K01252j28571
$$ 1341146 1060925 965205 1131129 1069236 1032151 1341953 1211757 961238 1162490 1033919
16408A033919l03046O30062l65011J23562o7644j87952K13675l38807L8101J66651
$$ 1033919 730873 1360935 995924 1119486 1051842 863890 1077565 738758 776859 943510
16398I43510J2930L11045l71082L8756k0032O4768J5108P5791j41615j43955J42729
$$ 943510 956440 1267485 896403 935159 915127 979895 995003 1070794 929179 785224 927953
16387I27953k81730L50027L95757n64820J56384K582k36503J75746K75916j42322
$$ 927953 646223 996250 1392007 827187 983571 986153 749650 925396 1201312 1058990
16377A058990l76965J25715K55915k61560K45354O803k10965J70774J32034n27413
$$ 1058990 682025 807740 1063655 802095 1047449 1054252 843287 1014061 1146095 618682
16367F18682L92125O5347l22147K21611k28548Q310J89763l99253L19945q1445
$$ 618682 1010807 1076154 754007 975618 747070 755380 945143 545890 865835 784390
16357G84390j00922k3327M7523j21330L92143k69483J26791j46325l10522K37450
$$ 784390 683468 660141 707664 586334 978477 708994 835785 689460 378938 616388
16347F16388M46585j10222l91227O4397J14280K95459j91915l8239k96289L31639
$$ 616388 1062973 952751 561524 625921 740201 1035660 843745 805506 509217 840856
16337H40856j84626j66386K07852J09464O7392j80532L59167l17448j16149J89054
$$ 840856 656230 489844 697696 807160 874552 694020 1053187 735739 619590 808644
16327H08644l58263L22992q6003k19427q8017L32758O0752j52896k00065L66844
$$ 808644 450381 773373 687370 467943 379926 712684 773436 620540 420475 787319
16317G87319q726l46290J59499J63359k20439n1250j27458O1969L57242k32981
$$ 787319 778593 432303 591802 755161 534722 483472 356014 417983 775225 542244
16307E42244k02805L45453k6713l7854l08635L3849J68433J73840A93021M87417
$$ 542244 339439 684892 658179 620325 311690 345539 513972 687812 193021 680438
16297F80438j76443k36417K57297J43778r2764B80813K63899J04721B76812M8752
$$ 680438 503995 267578 524875 668653 575889 280813 544712 649433 276812 325564
16287C25564J26243J66490p5922P3954j47443J89P2360j31369p5851l3724N32291
$$ 325564 451807 618297 542375 616329 468886 469075 541435 410066 334215 300491 832782
16276H32782C96294J35400J21911A96732M17772J11768j84338o411j00876M39240
$$ 832782 396294 531694 653605 196732 614504 726272 541934 535523 434647 873887
16266H73887B66653a1040B62952J88443q1452J31369m1106B11592K78151j897
$$ 873887 266653 -11040 262952 451395 369943 501312 460206 211592 489743 487846
16256D87846A93391K02329A89410J98991J13584K1312j05981K4825j25281L09166
$$ 487846 193391 395720 189410 388401 501985 523297 417316 442141 316860 626026
16246F26026O6151j52273B64997L27348j69831j87726K02021n91B11599l1674
$$ 626026 692177 539904 264997 592345 422514 234788 436809 436218 211599 179925
16236A79925L01306j21232q7034o3102K16017K2057k06566I0909K35124K0143
$$ 179925 481231 359999 272965 209863 425880 447937 241371 90909 326033 346176
16226C46176Q3361Q9134B49542J88813n6957j02587J63385j38970L0581j25146
$$ 346176 429537 518671 249542 438355 381398 278811 442196 303226 333807 208661
16216B08661K37495j44511m7918J24394K45069k81583k3199n1633M901E5697J05303
$$ 208661 446156 301645 253727 378121 623190 341607 318408 266775 271676 55697 161000
16205A61000Q1429l8756O455P2599J62534P229j36831K8243L09598F4683P09Q1376
$$ 161000 242429 203673 210128 282727 445261 452490 315659 343902 653500 64683 65392 146768
16193A46768J57766m5796K84465B48248K58q6696J6580n6033O3099J7917L9691
$$ 146768 304534 258738 543203 248248 248506 161810 178390 122357 185456 203373 243064
16182B43064H7883K10651A09411E1688k2372J71605R0398M1849L7982I7194g4158
$$ 243064 87883 298534 109411 51688 29316 200921 291319 333168 371150 97194 -74158
16170D1061M04987a9311B47045O674J66563A72295K06165n6238j2147Q2955j45725
$$ 41061 446048 -19311 247045 253719 420282 172295 378460 322222 310075 393030 247305
16159B47305Q4305N6660A60867N18108A81868K40691A93843K3227J40779F0211
$$ 247305 331610 388270 160867 678975 181868 422559 193843 217070 357849 60211
16148C38405J01908j13162J16039g8807A73833J19992E1226L2435J77843J13685
$$ 338405 440313 327151 443190 -78807 173833 293825 51226 83661 261504 375189
16138C75189j12825L0964A42783A1462K58965n0764J88649O4372k25301Q7103
$$ 375189 262364 293328 142783 11462 270427 219663 408312 472684 247383 334486
16128C34486A26559c9219F9726J61107p4839L13867B34259k9160n7380J03771
$$ 334486 126559 -39219 69726 230833 155994 469861 234259 205099 147719 251490
16118B51490j4867j01656J02661J62907a06835C09040e555I0067L7312L37618
$$ 251490 236623 134967 237628 400535 -106835 309040 -5555 90067 127379 464997
16108D64997j74101E6123J84779j00766n1126a78312D42825F4516J2890K69461
$$ 464997 290896 56123 240902 140136 89010 -178312 442825 64516 77406 346867
16098C46867a06444A52173l3575k2601K51107C049M17797j47974A13449J04966
$$ 346867 -106444 152173 118598 95997 347104 3049 420846 272872 113449 218415
16088B18415R8084J36268A57679j9106J03971A07442Q2635A9727J42517P9759
$$ 218415 316499 452767 157679 138573 242544 107442 190077 19727 162244 242003
16078B42003q1832O6080L2643a1895B0983q755e7496G9451N5335D2112D557J51764
$$ 242003 160171 226251 258894 -11895 20983 12228 -57496 79451 134786 42112 4557 156321
16066A56321Q081j8253P8844E1896a01957n6257b1515B23897A11297J39455N9731
$$ 156321 164402 146149 224993 51896 -101957 -158214 -21515 223897 111297 250752 310483
16055C10483j01315H9230M57767D9905h8466D19118j96531H3237C2431j4075g1401
$$ 310483 209168 89230 546997 49905 -88466 419118 222587 83237 32431 18356 -71401
16043G7803b253A2248L1456a07110c9669j82941C5218K96639D9475a822D0101
$$ 77803 -2253 12248 43704 -107110 -39669 -222610 35218 331857 49475 -1822 40101
16031C72193b01143A08336J57009o1801J17656B9647d06919A29459d1217F3690
$$ 372193 -201143 108336 265345 203544 321200 29647 -406919 129459 -41217 63690
16020B67217a56860f2605A75963L0000o1016J31964B293P5099L7932J68421q4677
$$ 267217 -156860 -62605 175963 205963 144947 276911 2293 77392 115324 283745 199068
16009A99068h3243c06B48576a96448k61365A60899b5507A25846K92178A14759
$$ 199068 -83243 -306 248576 -196448 -457813 160899 -25507 125846 418024 114759
15998B54223j03259K25147A03788C3077J66493c3243I8516L84508B03806K73202
$$ 254223 150964 376111 103788 33077 199570 -33243 98516 483024 203806 477008
15988D77008K29239M00581j735q3419k57708K68559k62437A50131Q6393C4701
$$ 477008 706247 1106828 1105093 1021674 763966 1032525 770088 150131 236524 34701
15977a09463B96247A38403J9759a19424G7204h8756B06964b25654A00419J29410
$$ -109463 296247 138403 158162 -119424 77204 -88756 206964 -225654 100419 229829
15967B29829H3868d1618A75467J25303A9599i3278m6256B96014D431J22482h3982
$$ 229829 83868 -41618 175467 300770 19599 -93278 -139534 296014 4431 126913 -83982
15955a62087C45017a38678c9580A82786h3864G1100L5425B1552J16042a29136
$$ -162087 345017 -138678 -39580 182786 -83864 71100 106525 21552 137594 -129136
15944d3934G2306f5310A3625g149j1843m2106K9860D2665a95399P6673A1491c18932
$$ -43934 72306 -65310 13625 -7149 -18992 -61098 -31238 42665 -195399 -118726 11491 -318932
15931a53182J6650d0584j8250A06511R2128c2337B52744q9833B7163F201P752
$$ -153182 -136532 -40584 -58834 106511 198639 -32337 252744 162911 27163 6201 13953
15920A3953a12370A05082b51649B50611h7010G1337f6027k68840a09640A45825
$$ 13953 -112370 105082 -251649 250611 -87010 71337 -66027 -334867 -109640 145825
15909i1479J0874I2204e7506j69714H3541a8313A26963Q312n369J69667J9678
$$ -91479 -80605 92204 -57506 -227220 83541 -18313 126963 135275 129906 299573 319251
15898C19251H5792a34710D8758a82702D1112b4865A22884K18890a37619D89743
$$ 319251 85792 -134710 48758 -182702 41112 -24865 122884 341774 -137619 489743
15887A05042D8860b13364O259E3031M67243E912a70008A68544h466B37485b04719
$$ 105042 48860 -213364 -207105 53031 520274 5912 -170008 168544 -8466 237485 -204719
15875C9445K0492j3141O6049J03068a03282K2086G2469b68463A35197b9799A5723
$$ 39445 59937 46796 112845 215913 -103282 -81196 72469 -268463 135197 -29799 15723
15863C3728K01462A1046J93376m446a49388g0105B8954K03419a46307L0533B67597
$$ 33728 235190 11046 204422 199976 -149388 -70105 28954 232373 -146307 -115774 267597
15851b62122A01379a37844D4279b11391B11301j00090l2481i419q1424a6735A38681
$$ -262122 101379 -137844 44279 -211391 211301 111211 78730 -9419 -90843 -16735 138681
15839A51959P076d2942o1790A91824P452D9036c8373J6714p3174K6604r086m4914
$$ 151959 159035 -42942 -104732 191824 199276 49036 -38373 -21659 -94833 -68229 -77315 -122229
15827a22229F6260A9361J98802A00006l5366a7889A05372l371P1479H1025c2618
$$ -122229 66260 19361 218163 100006 64640 -17889 105372 102001 173480 81025 -32618
15815b32228a1584j73353F8982O7375b0310C15242b63449j869B683L65441e8686
$$ -232228 -11584 -184937 68982 136357 -20310 315242 -263449 -265318 2683 368124 -58686
15803A9333p446K94264a56435I6299b5865B78404A2830K07733e9244r3464C4494
$$ 19333 11887 306151 -156435 96299 -25865 278404 12830 220563 -59244 -152708 34494
15791e0258m7916B3971g8748c4716l5129n9276L3438A46575n0615a81134l2909
$$ -50258 -98174 23971 -78748 -34716 -69845 -129121 -95683 146575 95960 -181134 -214043
15780b14043A08473B1064K56252h3484j34481B16219d3922K0312H1731a95826
$$ -214043 108473 21064 277316 -83484 -217965 216219 -43922 -23610 81731 -195826
15769b27726B03861J9541e8556D1566Q0200q821A7785Q7012C7537M0744h8352
$$ -227726 203861 223402 -58556 41566 121766 112945 17785 104797 37537 78281 -88352
15757A45754b72009a15047A35020D4557L06978a31843O3553a2487j17464l0924
$$ 145754 -272009 -115047 135020 44557 351535 -131843 -68290 -12487 -129951 -160875
15747a60875G9456J91244I3337B3494O1232b9775A07146m1030a14079C80115e7481
$$ -160875 79456 270700 93337 23494 84726 -29775 107146 66116 -114079 380115 -57481
15735c72406R0796F7274P8364n3090R2596a20581A44708b3690A35626l762F4870
$$ -372406 -281610 67274 145638 92548 185144 -120581 144708 -23690 135626 131864 64870
15723a21318J9463n0849j8078C15043C0385e525B62117j08832K31307e1952j87294
$$ -121318 -101855 -152704 -170782 315043 30385 -5525 262117 153285 384592 -51952 -239246
15712b39246j8190O9667F411a72577j80913B98859o1918a6776k4641j03540o8509
$$ -239246 -257436 -187769 6411 -172577 -353490 298859 236941 -16776 -41417 -144957 -213466
15701b13466N966K124e2542k85929A02570c36363P1207A96340h3372I127J5115
$$ -213466 -207500 -205376 -52542 -338471 102570 -336363 -265156 196340 -83372 9127 24242
15690B4242O7454j4787A5640K81522h3806D3591a54660A75469M438J1023H1315
$$ 24242 91696 76909 15640 297162 -83806 43591 -154660 175469 179907 190930 81315
15678A14158b23402C39597a0055A8740c31728A67304J20541D9814a48733k02045
$$ 114158 -223402 339597 -10055 18740 -331728 167304 287845 49814 -148733 -350778
15668c50778a03261d0543k0919A74543B1855a53002E4323a7540A36387J94107
$$ -350778 -103261 -40543 -61462 174543 21855 -153002 54323 -17540 136387 330494
15658C30494c18594b4734B26163f2401A41105a98082p840h6178j42137G5690g9941
$$ 330494 -318594 -24734 226163 -62401 141105 -198082 -205922 -86178 -228315 75690 -79941
15646A59450c033j57018j19422A17716R2619E9094B4856N5592k6501J73607b6202
$$ 159450 -3033 -160051 -279473 117716 210335 59094 24856 80448 53947 227554 -26202
15634C07867B3594g8446o724A4485Q8366D7871e8009j06830k3410i567j08466
$$ 307867 23594 -78446 -85170 14485 102851 47871 -58009 -164839 -188249 -9567 -118033
15623a18033d4160C5217b26260B23980P9702e3067k5178j13521N4625b2661A92413
$$ -118033 -44160 35217 -226260 223980 303682 -53067 -78245 -191766 -137141 -22661 192413
15611E5199a16800A45618A2455b60998A51516a16427o1113N3533B7752h6894L6112
$$ 55199 -116800 145618 12455 -260998 151516 -116427 -177540 -124007 27752 -86894 -50782
15600e0782p0315L4900A09576a76829q4201O2367A166a37789e9964B2340J22795
$$ -50782 -121097 -86197 109576 -176829 -261030 -198663 1166 -137789 -59964 22340 145135
15589A45135A0558M3310a49495g187j76904e0702i705A5119J66251h0567B20039
$$ 145135 10558 53868 -149495 -7187 -184091 -50702 -9705 15119 181370 -80567 220039
15577e8817B00751e0490p9043B50454f2668A12887l8430F33P9776j656b0154B83647
$$ -58817 200751 -50490 -129533 250454 -62668 112887 74457 633 80409 78753 -20154 283647
15564B23342G5352J8894a90020A34099a14403M90J4653J0171b544A4606b08848
$$ 223342 75352 94246 -190020 134099 -114403 -113913 -99260 -89089 -2544 14606 -208848
15552a76741b2938r0343c1064B6275O8873A7828J84431H6768j3769b47042O8364
$$ -176741 -22938 -113281 -31064 26275 95148 17828 202259 86768 72999 -247042 -178678
15541a78678P1296A54231G1167a1117A05427h22j93359C85781A12191j6628b05837
$$ -178678 -107382 154231 71167 -11117 105427 -822 -194181 385781 112191 95563 -205837
15529c73073D2560K59947A21214B2249g3625m5496l3092B15493g6762A61568a73717
$$ -373073 42560 302507 121214 22249 -73625 -119121 -152213 215493 -76762 161568 -173717
15517e0615C44831A28871n3080J1334O6307l0119P4527e8601A5681L56532f3113
$$ -50615 344831 128871 75791 87125 153432 123313 197840 -58601 15681 372213 -63113
15505A52531F9343A4955N48972a81327C18J50779e991B71883q6768a1226A15006
$$ 152531 69343 14955 563927 -181327 318 151097 -5991 271883 185115 -11226 115006
15493A77054O988f0660r202A89924l6432F687a55455F8514J99658F5840M333J43480
$$ 177054 184042 -60660 -69862 189924 153492 6687 -155455 68514 268172 65840 70173 213653
15481B13653a27008l4773A11437a61301B44065J74802J60803J66087C28923A21042
$$ 213653 -127008 -161781 111437 -161301 244065 418867 579670 745757 328923 121042
15470A16271Q4687B2716b6990I5380M9887f2685m238A48178d9883n4837N1702
$$ 116271 200958 22716 -26990 95380 145267 -62685 -66923 148178 -49883 -104720 -53018
15459e3018D31020c35436B69849C8267J35223p6165C5232a5639I5578g8630A84985
$$ -53018 431020 -335436 269849 38267 173490 97325 35232 -15639 95578 -78630 184985
15447c9231A66565K30809r7272K73626L68755l76419K49756O4101A04828O3752
$$ -39231 166565 397374 300102 573728 942483 566064 815820 879921 104828 168580
15437A68580K2386q0876K3787R62c53233A1516K23067f8057A06084a08959m0078
$$ 168580 190966 110090 133877 134839 -353233 11516 234583 -68057 106084 -108959 -149037
15426a49037e7529A55165a23753a2556A59364i3762I2138J9638J59920j3369A6966
$$ -149037 -57529 155165 -123753 -12556 159364 -93762 92138 111776 271696 258327 16966
15414F2440O3778B4801d7948E3435h3723j72308b1058D6553K14892q208B3742
$$ 62440 126218 24801 -47948 53435 -83723 -256031 -21058 46553 261445 253237 23742
15402d2163B5197a72102A58447F3625j5821a75416M5170e6698C35180E5016m002
$$ -42163 25197 -172102 158447 63625 47804 -175416 -130246 -56698 335180 55016 51014
15391E1014J69425R6035m9558G4219N17405A46357b90690H3084a02835C54638
$$ 51014 220439 316474 266916 74219 591624 146357 -290690 83084 -102835 354638
15380g9543j71426B00027b55560H4962R0219Q9028p488q7508l6451M76242j49542
$$ -79543 -250969 200027 -255560 84962 175181 264209 256721 169213 132762 609004 459462
15369D59462C7364L8933Q2286j6963M5870M3217a90573A27908a45B47141o3216
$$ 459462 37364 76297 158583 141620 187490 230707 -190573 127908 -145 247141 183925
15358A83925m1199p913K3313L22070A78702G4976L58174b07099D67597B05630
$$ 183925 142726 134813 158126 480196 178702 74976 433150 -207099 467597 205630
15347B87120J51557a20485B88055K00360j98344A30012N1260K79811q2735E2083
$$ 287120 438677 -120485 288055 488415 290071 130012 181272 461083 378348 52083
15336A9556K0702P5536g1714L5127A52519k90k0342l2045K6792d9258I0826J54675
$$ 19556 40258 115794 -71714 -36587 152519 152229 131887 99842 126634 -49258 90826 245501
15324B45501d9048B22317M4120n8231J69273g764j37234N9606b0918A50791E3312
$$ 245501 -49048 222317 266437 208206 377479 -7764 -144998 -85392 -20918 150791 53312
15312A28718i3813I9700P1505a04174B37138J08077j26957a8010o4749l8014C57579
$$ 128718 -93813 99700 171205 -104174 237138 345215 218258 -18010 -82759 -120773 357579
15300A68599H0142K02067q0138j4653j7825a67139j56209h4990A26743a17156
$$ 168599 80142 282209 202071 187418 169593 -167139 -323348 -84990 126743 -117156
15289a50449K019A43113g3732A15956a10726b3000k14403B10771a8443k17698
$$ -150449 -148430 143113 -73732 115956 -110726 -23000 -237403 210771 -18443 -236141
15279b36141I0015j8582O0572K58456a79356o2766a01005A30249c00599P2063
$$ -236141 90015 71433 132005 390461 -179356 -242122 -101005 130249 -300599 -228536
15269b28536H1613N3878e3590k5586A13680K7189a37745m50490C49707c2081A82348
$$ -228536 81613 135491 -53590 -79176 113680 140869 -137745 -588235 349707 -32081 182348
15257A74424L9028G0989M03681C8569A2267a9135B34720H6152C5025L519J35433
$$ 174424 213452 70989 474670 38569 12267 -19135 234720 86152 35025 38544 173977
15246A73977J43182M51425k40425J364256m89836n3195J22264F19525j14549B3954
$$ 173977 317159 768584 528159 1892415 1402579 1349384 1471648 619525 504976 23954
15235B85685i5388I8586J7102J05260J41383j59742D4446h374D4714J10408b52341
$$ 285685 -95388 98586 115688 220948 362331 202589 44446 -8374 44714 155122 -252341
15223c56045G5201J00218j7759a31190G8113a47123B78827a754B30091K4633I2318
$$ -356045 75201 175419 157660 -131190 78113 -147123 278827 -1754 230091 254724 92318
15211B07950J53379q8457H5146J10765G7042R0626f49463H9635J07391E3825a43489
$$ 207950 361329 272872 85146 195911 77042 167668 -649463 89635 197026 53825 -143489
15199a02312A35580O4235E6458J44821q793E1232L9574M4926D5074j4679J59726
$$ -102312 135580 199815 56458 201279 192486 51232 90806 135732 45074 30395 190121
15188A90121G6366K62471a65914b6548A1993Q3065N9146a10488d1678j40884b0934
$$ 190121 76366 338837 -165914 -26548 11993 95058 154204 -110488 -41678 -182562 -20934
15176B37968a33304A35270a02653B90003G0893A5051L9877e3719B06945k6013
$$ 237968 -133304 135270 -102653 290003 70893 15051 54928 -53719 206945 180932
15166A80932R9996b99244A31668N043a1234A55696d8199B29442E2533N1405b21293
$$ 180932 280928 -299244 131668 136711 -11234 155696 -48199 229442 52533 103938 -221293
15154C37299j57558j7558a2409j39088P4354H7874l883l7867b22704O8773A07839
$$ 337299 179741 162183 -12409 -151497 -77143 87874 83991 46124 -222704 -153931 107839
15142B24477P2082k8453a76461A9346a33869j2950D44498i9924B56967K68029
$$ 224477 296559 268106 -176461 19346 -133869 -146819 444498 -99924 256967 524996
15132E24996a04426A043b0102B33820a13894B21453Q6433c11065E9473P2576b4003
$$ 524996 -104426 1043 -20102 233820 -113894 221453 307886 -311065 59473 132049 -24003
15120C57162A06185K77793m340j81844J56299G4847M3684O8659a44571D35264
$$ 357162 106185 383978 379638 197794 354093 74847 118531 187190 -144571 435264
15109B79261M4797f8681I9353J04294a59369B62177j20340c2264J4575A33998
$$ 279261 324058 -68681 99353 203647 -159369 262177 141837 -32264 -17689 133998
15098A18942M1366K36600A9500g4996A43797J0153C4628n699e760A02616L77953
$$ 118942 160308 396908 19500 -74996 143797 153950 34628 28929 -5760 102616 480569
15087D80569d1321A60358J4807k9091f9070A74119F6660J9396J26521A9062h2962
$$ 480569 -41321 160358 175165 146074 -69070 174119 66660 86056 212577 19062 -82962
15075C14555a8441A44994c5512A55764L0848O1837P6804H8632N5496a63873A36683
$$ 314555 -18441 144994 -35512 155764 186612 248449 325253 88632 144128 -163873 136683
15063A03052K89753j30502n6315l4264c7475C64257m7804j04423N9956K52870
$$ 103052 392805 262303 205988 171724 -37475 364257 316453 212030 271986 524856
15053E24856B52064K57015E4573b4742H1075J00420N0152k7531m5870K06515k6429
$$ 524856 252064 509079 54573 -24742 81075 181495 231647 204116 158246 364761 338332
15042C38332L1770h4513D44325j21546J68475B29783J00916J35360j71056j9268
$$ 338332 370102 -84513 444325 322779 491254 229783 330699 466059 295003 275735
15032B75735J3147J69510J39019K10479k67272n9883J08195o9427j60134J10991
$$ 275735 288882 458392 597411 807890 540618 480735 588930 519503 359369 470360
15022D70360j26043J33967j46311K9222K28059J2420B74641L04241j90098Q6110
$$ 470360 344317 478284 331973 361195 589254 601674 274641 578882 388784 474894
15012D74894A18495K46766o9536M3638j3746M0593o5467q6674J45299j18902J29420
$$ 474894 118495 365261 295725 339363 325617 366210 300743 214069 359368 240466 369886
15001C69886D560M01141o8963K86545B48865K72845k55171a1845C78465k3581
$$ 369886 4560 405701 336738 623283 248865 521710 266539 -11845 378465 354884
14991C54884J4718l8766L84554k60422r3907A12727M60408o5572K86210j2312
$$ 354884 369602 330836 715390 454968 361061 112727 573135 507563 793773 781461
14981G81461k43789K51011P2839j43353j18520N2976k51475K61084j45665J86267
$$ 781461 537672 788683 861522 718169 599649 652625 401150 662234 516569 702836
14971G02836k79583M92405k12063j68567j07781O8289N6214j75702l9600k8667
$$ 702836 423253 915658 703595 535028 427247 495536 551750 376048 336448 307781
14961C07781O8520K12840I9181K66571A78604L5604J95139O9706k28213J09148
$$ 307781 376301 589141 99181 365752 178604 214208 409347 479053 250840 359988
14951C59988J39965j75834j13114L65183A67454J47116L37343K41597l14732L4738
$$ 359988 499953 324119 211005 576188 167454 314570 651913 893510 578778 613516
14941F13516k82204m9651K68065k66625K07419j82754K61679J45950J1868P3913
$$ 613516 331312 281661 549726 283101 490520 307766 569445 715395 727263 801176
14931H01176K27559J57255j31215j54105M24224K80324K37931m19863J45217m78599
$$ 801176 1028735 1185990 1054775 900670 1324894 1605218 1843149 1423286 1568503 1089904
14921A089904M75614M74691m82494K12626K17476k26890k57648l87756j3094k93374
$$ 1089904 1565518 2040209 1557715 1770341 1987817 1760927 1503279 1115523 1102429 809055
14911H09055j78349J75708k37867j67359M57338B64765K04529j77932J35059Q8391
$$ 809055 630706 806414 568547 401188 858526 264765 469294 291362 426421 514812
14901E14812j89364J53946C2478O35738l30255L8319m8259O4349O5363J03521
$$ 514812 325448 479394 32478 668216 337961 376280 328021 392370 457733 561254
14891E61254j21270A15146K30031O51575D02386K73182j20469J37669J13024k69791
$$ 561254 439984 115146 345177 996752 402386 675568 555099 692768 805792 536001
14881E36001K41923J41130o9907k91817J75930k83921L39207j69699n299J37211
$$ 536001 777924 919054 849147 557330 733260 449339 788546 618847 613548 750759
14871G50759l69131J41204J84750k86178K27262J68525j68164j20101j33089J58390
$$ 750759 381628 522832 707582 421404 648666 817191 649027 528926 395837 554227
14861E54227k32383L11301B50016j4157M3465L71996k04795j77006M50188j46558
$$ 554227 321844 633145 250016 235859 279324 651320 446525 269519 719707 573149
14851E73149B37155J94669K51013k01845K35600m8595O6877M03478j58575q9731
$$ 573149 237155 431824 682837 480992 716592 667997 734874 1138352 979777 890046
14841H90046k538K88932r7500J75616l40217C41586L84952j11192j65563Q5665
$$ 890046 887508 1176440 1078940 1254556 914339 341586 726538 615346 449783 535448
14831E35448J03969J55281l67115K4603j21525K43208J78521j93854q7434J60061
$$ 535448 639417 794698 427583 452186 330661 573869 752390 558536 471102 631163
14821F31163j70250G6454O61492o8277K82831k81071j9805j65391j10177J13182
$$ 631163 460913 76454 737946 669669 952500 671429 651624 486233 376056 489238
14811D89238p2741M13603j76410k61199K15116r9728M4597J85290K56615j29711
$$ 489238 416497 830100 653690 392491 607607 507879 552476 737766 994381 864670
14801H64670l75493J52166p8989j70992L46619k49103l8849P7814N6572j51062
$$ 864670 489177 641343 562354 391362 737981 488878 450029 527843 584415 433353
14791D33353j78007M38199j12380P9965L4014J847J31720l52955N766L97309l78781
$$ 433353 255346 693545 581165 661130 695144 696991 828711 475756 481522 878831 500050
14780E00050K89743j73135K29801L8609j02298K4855J22243L3859J61324m20611
$$ 500050 789793 616658 846459 885068 782770 807625 929868 963727 1125051 704440
14770G04440K01554l55613J57712J8573l36518M53193k86931k01883K613K98365
$$ 704440 905994 550381 708093 726666 390148 843341 556410 354527 357140 655505
14760F55505j40560p9907J06409J09462j05059K10370k54111K14095k18300K5164
$$ 655505 514945 435038 541447 650909 545850 756220 502109 716204 497904 523068
14750E23068K89784B65451M85703J11568j58551j10735P2941J24160r7071j70691
$$ 523068 812852 265451 751154 862722 704171 593436 666377 790537 693466 522775
14740E22775N02470l12205K25661m26210Q0201J89754k61822K66622o9019K20358
$$ 522775 1025245 713040 938701 512491 592692 782446 520624 787246 718227 938585
14730I38585J68003J67096K30725K63765k64677O2731L9418l38475k58771J42610
$$ 938585 1106588 1273684 1504409 1768174 1503497 1566228 1605646 1267171 1008400 1151010
14720A151010k19330q3489J5038J61730p0956l8776O5207D44376K1535J90186
$$ 1151010 931680 848191 863229 1024959 954003 915227 980434 444376 465911 656097
14710F56097m2636M09833P1879j93678K01304k25003M96247L9106K55645j3245
$$ 656097 613461 1023294 1095173 901495 1102799 877796 1374043 1413149 1668794 1655549
14700A655549J68563k24039k20226l82292p0316K26654j02054L8454l52437J39008
$$ 1655549 1824112 1600073 1379847 997555 927239 1153893 1051839 1090293 737856 876864
14690H76864n3102j27855K46189J88110k56958j15436L10949O9496k47607l09015
$$ 876864 823762 695907 942096 1130206 873248 757812 1068761 1138257 890650 581635
14680E81635O41190E90602L58408k17465p5384J37252J98101N4069k00467K10124
$$ 581635 1222825 590602 949010 731545 656161 793413 991514 1045583 845116 1055240
14670A055240l85352N37291j37009J33065j28653p4117J5930k80782K08596q7495
$$ 1055240 669888 1207179 1070170 1203235 1074582 1000465 1016395 735613 944209 856714
14660H56714r3139L15454O3695l703O7007N5822k31668k8342J53671J94914j89975
$$ 856714 763575 1079029 1142724 1139021 1206028 1261850 1030182 1001840 1155511 1350425 1160450
14649A160450l45410K05209O4132p049J19299J21122k87639q8224M94849l19608
$$ 1160450 815040 1020249 1084381 1077332 1196631 1317753 1030114 941890 1436739 1117131
14639A117131L8653k28195L10474L7732j20587L29098k44257j99781J26637m424
$$ 1117131 1155784 927589 1238063 1275795 1155208 1484306 1240049 1040268 1166905 1162481
14629A162481m12175K90573N3600K54613j51515k50416L46263J48730r3128l9977
$$ 1162481 750306 1040879 1094479 1349092 1197577 947161 1293424 1442154 1349026 1309049
14619A309049j89472L30306j6796j85925j8978J41789j1675r8440J91076Q0841
$$ 1309049 1119577 1449883 1433087 1247162 1228184 1369973 1358298 1259858 1450934 1531775
14609A531775j77243j92392L57705j86081o2604J7719N28220l87360M7006k77823
$$ 1531775 1354532 1162140 1519845 1333764 1271160 1288879 1817099 1429739 1476745 1198922
14599A198922J10784K87125j39840m8564J77898K15208J34016k54672K46873j00527
$$ 1198922 1309706 1596831 1456991 1408427 1586325 1801533 1935549 1680877 1927750 1827223
14589A827223j50628M750j79732K19342k6759K53263j34944J57363j17301j25639
$$ 1827223 1676595 1681345 1501613 1720955 1694196 1947459 1812515 1969878 1852577 1726938
14579A726938Q0069K2476L31158m7446j98224J7269j7001L53439q9927m53476
$$ 1726938 1807007 1829483 2160641 2113195 1914971 1932240 1915239 2268678 2178751 1725275
14569A725275N02011l09557Q8379L25051J18488m04922J04505L538K67622L09727
$$ 1725275 2227286 1917729 2006108 2331159 2449647 2044725 2149230 2152768 2420390 2730117
14559B730117K67497k89169K56828j73337L51050N76677l12153L22943M95227
$$ 2730117 2997614 2708445 2965273 2791936 3142986 3719663 3407510 3730453 4225680
14550D225680Q95069K341287M336655P945257J7807691K794377A8093468H120911
$$ 4225680 5120749 7462036 11798691 19743948 37551639 40346016 18093468 8120911
14541D392128j126502J55905J556380p38621j612885n11511l68378K04371j51441
$$ 4392128 3265626 3421531 4977911 4239290 2626405 2114894 1746516 1950887 1799446
14532A799446L80415p8958k18266L98794k19712J67348M0235m48059L84283L0808
$$ 1799446 2179861 2100903 1882637 2281431 2061719 2229067 2269302 1821243 2205526 2236334
14522B236334K233L8273J09321l3205r3549k0625K03157k08093L24712P1418J337
$$ 2236334 2238567 2276840 2386161 2352956 2259407 2238782 2441939 2233846 2558558 2629976 2631313
14511B631313j29467L06550l39566M04522k58890K97503r5099m54434M13384J82040
$$ 2631313 2501846 2808396 2468830 2873352 2614462 2911965 2816866 2362432 2775816 2957856
14501B957856J86523p3393P4345k35779Q2019J33422l11404J71882K99944k4178
$$ 2957856 3144379 3070986 3145331 2909552 2991571 3124993 2813589 2985471 3285415 3261237
14491C261237R3502m1584k30355J72850K02038j07866J00206K9268l34823J84516
$$ 3261237 3354739 3313155 3082800 3255650 3457688 3349822 3450028 3479296 3144473 3328989
14481C328989N07944k74509N36328m16238J49402L57811l31450L52823n58524
$$ 3328989 3836933 3562424 4098752 3682514 3831916 4189727 3858277 4211100 3652576
14472C652576O21773o2730p0700J43399k26993J89365J72028J41049k23301J76971
$$ 3652576 4274349 4211619 4140919 4284318 4057325 4246690 4418718 4559767 4336466 4513437
14462D513437j43747K86702k49607M06261q2088J30215K70115l29908J19409k03664
$$ 4513437 4369690 4656392 4406785 4813046 4730958 4861173 5131288 4801380 4920789 4717125
14452D717125N89821l39905M03242P7781k13937K6938J29330L83838l36377K9091
$$ 4717125 5306946 4967041 5370283 5448064 5234127 5261065 5390395 5774233 5437856 5466947
14442E466947L70211j46048M37092m21102K45023N22336l39985O31958m39221
$$ 5466947 5837158 5691110 6128202 5707100 5952123 6474459 6134474 6766432 6327211
14433F327211J95020J26289k04054P0880O2817L42403K15945j32550o8774L77866
$$ 6327211 6522231 6648520 6444466 6515346 6578163 6920566 7136511 7003961 6935187 7313053
14423G313053l1291K00145M52287J09919k30779L1241M85495l17314L89856L68335
$$ 7313053 7281762 7481907 7934194 8044113 7813334 7844575 8330070 8012756 8402612 8770947
14413H770947k29906m6368J91456K01512J97162K18696J08353M10780M8741j09485
$$ 8770947 8541041 8494673 8686129 8887641 9084803 9303499 9411852 9822632 9871373 9761888
14403I761888N6269j06797J47275K14271K83050j30053J42951L74664L2133L69899
$$ 9761888 9818157 9711360 9858635 10072906 10355956 10225903 10368854 10743518 10775651 11145550
14393A1145550j24360N17351K34326j10964L84316J31440M37274K01060R4822
$$ 11145550 11021190 11538541 11772867 11661903 12046219 12177659 12614933 12815993 12910815
14384A2910815L94555M35746K24542N7108K92912L20608L81224j9223J93794L36050
$$ 12910815 13305370 13741116 13965658 14022766 14315678 14636286 15017510 14998287 15192081 15528131
14374A5528131L44494L48701L53725O8044L77818O10732N79075j5645Q22818j4444
$$ 15528131 15872625 16221326 16575051 16643095 17020913 17631645 18210720 18195075 19017893 19003449
14364A9003449K38564N75118J95415M29252M85333L37788N92692M51841K85408
$$ 19003449 19242013 19817131 20012546 20441798 20927131 21264919 21857611 22309452 22594860
14355B2594860R17874L42697M40619R30952M63620O41444Q64776K87750R54516
$$ 22594860 23512734 23855431 24296050 25227002 25690622 26332066 27196842 27484592 28439108
14346B8439108O03331R30224O99717O04246R01280J296534L31439J204183R28921
$$ 28439108 29042439 29972663 30672380 31276626 32177906 33474440 33805879 35010062 35938983
14337C5938983R33581J175604O59502R92662J387064J219642J707057J110099
$$ 35938983 36872564 38048168 38707670 39700332 41087396 42307038 44014095 45124194
14329D5124194J327931J566027J617996J721402J323366J794134J839174K195299
$$ 45124194 46452125 48018152 49636148 51357550 52680916 54475050 56314224 58509523
14321E8509523J958060J761212K236097K144342K785325K692002K617976L078878
$$ 58509523 60467583 62228795 64464892 66609234 69394559 72086561 74704537 77783415
14313G7783415K575153K873326L634631L660124L771141M092460M325335M419173
$$ 77783415 80358568 83231894 86866525 90526649 94297790 98390250 102715585 107134758
14305A07134758M417562N142743N141293N209553N761550O296381N917081O997212
$$ 107134758 111552320 116695063 121836356 127045909 132807459 139103840 145020921 152018133
14297A52018133P505677P400799Q107097Q539561R275390J0140155R708819J0516221
$$ 152018133 159523810 166924609 175031706 183571267 192846657 202986812 212695631 223211852
14289B23211852J1535134J1408047J2680918J2659028J3635239J3428532J3840175
$$ 223211852 234746986 246155033 258835951 271494979 285130218 298558750 312398925
14282C12398925J4633649J4673654J4966180J5041313J4380174J4109768J3287254
$$ 312398925 327032574 341706228 356672408 371713721 386093895 400203663 413490917
14275D13490917J2454806J0358254O316034O95605P86044K793198j013484m575944
$$ 413490917 425945723 436303977 442620011 443315616 444101660 446894858 445881374 441305430
14267D41305430l707512l322875o961176r892918j2012215j3761978j4987830
$$ 441305430 437597918 434275043 427313867 417420949 405408734 391646756 376658926
14260C76658926j5476279j5994867j6146014j5927905j5312082j5112836j4204109
$$ 376658926 361182647 345187780 329041766 313113861 297801779 282688943 268484834
14253B68484834j3878480j3200829j2707347j1934133r659389j0416627j0282182
$$ 268484834 254606354 241405525 228698178 216764045 207104656 196688029 186405847
14246A86405847r486053q462827q194384p955132p409061o802262o332415o536818
$$ 186405847 176919794 168456967 160262583 152307451 144898390 138096128 131763713 125226895
14238A25226895n330424m965202n532360m684948m602331m102457l935982l195137
$$ 125226895 119896471 114931269 109398909 104713961 100111630 96009173 92073191 88878054
14230H8878054l546920l602440l644417k623243k899132l168847k540406k103168
$$ 88878054 85331134 81728694 78084277 75461034 72561902 69393055 66852649 64749481
14222F4749481k207192k631054j780060j723690k094550j959177j607689j740228
$$ 64749481 62542289 59911235 58131175 56407485 54312935 52353758 50746069 49005841
14214D9005841j482921j138936j653516j379154j187579j619395j032849m84965
$$ 49005841 47522920 46383984 44730468 43351314 42163735 40544340 39511491 39026526
14206C9026526j380573j234856p89151j179276r99435n04761q48107p88805j385767
$$ 39026526 37645953 36411097 35621946 34442670 33443235 32938474 32090367 31301562 29915795
14197B9915795m58592o87927j032989l13236o68964q17548k55619j104411l23387
$$ 29915795 29457203 28769276 27736287 27423051 26754087 25936539 25680920 24576509 24253122
14188B4253122p81409l32947o32665q10494j88853n14212k47872p39368j90848
$$ 24253122 23471713 23138766 22506101 21695607 21506754 20992542 20744670 20005302 19814454
14179A9814454n04097o76390j04620l63533o66950k23741o6446m28704p49687
$$ 19814454 19310357 18633967 18529347 18165814 17498864 17275123 17208677 16779973 16030286
14170A6030286J97927n49330o7688l61315m25135J59587m67428o65022L3248q4133
$$ 16030286 16228213 15678883 15611195 15249880 14824745 14984332 14516904 13851882 13885130 13800997
14160A3800997m04927r818k14357o51831J90378m47157q3384n23302l35647J97491
$$ 13800997 13396070 13386252 13171895 12520064 12710442 12263285 12179901 11656599 11320952 11518443
14150A1518443l0715l62474k57230k04479k06804j18055n0419j87790l71856l25305
$$ 11518443 11487728 11125254 10868024 10663545 10456741 10338686 10288267 10100477 9728621 9403316
14140I403316J43750l20182j14978l3328R7272l03340j42316j24410j45287l0096
$$ 9403316 9547066 9226884 9111906 9078578 9175850 8872510 8730194 8605784 8460497 8430401
14130H430401k55913j66045o3350q9875l07893K68687N0134k83977j60116q18295
$$ 8430401 8174488 8008443 7945093 7855218 7547325 7816012 7866146 7582169 7422053 6603758
14120F603758L56279l9224J31951J63438n27518r8037J03074l43005L39841k75231
$$ 6603758 6960037 6920813 7052764 7216202 6688684 6590647 6693721 6350716 6690557 6415326
14110F415326k68228Q7987L8740k62067k7541j41441K4130l29932m1518J42364
$$ 6415326 6147098 6235085 6273825 6011758 5984217 5842776 5866906 5536974 5495456 5637820
14100E637820R2996k11094j67098J2693j80443k69326L30979j2450k10272k03205
$$ 5637820 5730816 5519722 5352624 5365317 5184874 4915548 5246527 5234077 5023805 4820600
14090D820600M63514n46373K63272n83652L52943o091k4705l21563n7286K11593
$$ 4820600 5284114 4737741 5001013 4417361 4770304 4764213 4739508 4417945 4360659 4572252
14080D572252k02009k09623K41383Q7986m06046K57720k33582m3865J11039k1060
$$ 4572252 4370243 4160620 4402003 4489989 4083943 4341663 4108081 4064216 4175255 4154195
14070D154195k50356L44602k57852k34768K15180j00005L08797l61803L24473
$$ 4154195 3903839 4248441 3990589 3755821 3971001 3870996 4179793 3817990 4142463
14061D142463l47466J18981L5627l02540k28644r708J10063k18581J49673P2517
$$ 4142463 3794997 3913978 3949605 3647065 3418421 3408713 3518776 3300195 3449868 3522385
14051C522385l00265L7635M13117n15079r0193J73288j4335l37099O8928K27335
$$ 3522385 3222120 3259755 3672872 3157793 3067600 3240888 3226553 2889454 2958382 3185717
14041C185717J1448k95626o7515K48018k4269k69670K70882l21457Q5140L89702
$$ 3185717 3197165 2901539 2834024 3082042 3057773 2788103 3058985 2737528 2822668 3212370
14031C212370l36355K7211o4729k00659m7938n2831K40174l36452j73967K68991
$$ 3212370 2876015 2903226 2838497 2637838 2589900 2537069 2777243 2440791 2266824 2535815
14021B535815j68750Q7310j20821k68733L27021P6333j05237J32895m79663J69143
$$ 2535815 2367065 2454375 2333554 2064821 2391842 2468175 2362938 2495833 2016170 2185313
14011B185313J70968j40954J73939j26046J05593j68860l12222M73398m07629
$$ 2185313 2356281 2215327 2389266 2263220 2368813 2199953 1887731 2361129 1953500
14002A953500K95129j39046K7020j32965j29474L29761K8196l97036m5588K24190
$$ 1953500 2248629 2109583 2136603 2003638 1874164 2203925 2232121 1835085 1789497 2013687
13992B013687L40858j00391K3629J392859K820737N626858J5081529J7766759
$$ 2013687 2354545 2254154 2277783 3670642 6491379 12118237 27199766 44966525
13984D4966525j8870506j2280946n371017k821957j509495m34564o61387q0861
$$ 44966525 26096019 13815073 8444056 5622099 4112604 3678040 3016653 2935792
13976B935792l72059K60730k37268k74969K02221k65736J61335k04684P5483k27898
$$ 2935792 2563733 2824463 2587195 2312226 2514447 2248711 2410046 2205362 2280845 2052947
13966B052947J99586k68879J8317q7392K47444k65596O24829o79555O8666R1518
$$ 2052947 2252533 1983654 2001971 1914579 2162023 1896427 2521256 1841701 1910367 2001885
13956B001885j54576O4143l26842J98078p9152J84011K1183p2496O4584K4426
$$ 2001885 1847309 1911452 1584610 1782688 1703536 1887547 1908730 1836234 1900818 1925244
13946A925244k11663p9204J29101k31866l4715q1867L49133J02761k09512k54847
$$ 1925244 1713581 1634377 1763478 1531612 1496897 1415030 1764163 1866924 1657412 1402565
13936A402565j07634L58997Q1708o38730N76221K07445m94106K21999k9645M3190
$$ 1402565 1294931 1653928 1735636 1096906 1673127 1880572 1386466 1608465 1578820 1622010
13926A622010j45841L12588k98402j38228K85259k33119n7260j51501L67804j59865
$$ 1622010 1476169 1788757 1490355 1352127 1637386 1404267 1347007 1195506 1563310 1403445
13916A403445Q8120j72381J14734j34601L83084k66504L664l8961n435j95227
$$ 1403445 1491565 1319184 1433918 1299317 1682401 1415897 1419561 1380600 1375165 1179938
13906A179938J85101R248N6256l78353J98490J39895j09230R8148l2M7080K2789
$$ 1179938 1365039 1374287 1430543 1052190 1250680 1390575 1281345 1379493 1379461 1426541 1449330
13895A449330F52026O05490J96551l87881m438J80464O167n2092J36930k64722
$$ 1449330 652026 1257516 1454067 1066186 1061748 1242212 1248379 1196287 1333217 1068495
13885A068495P5232q0182J89976k62230P2756n606j00551l5325k7772L18518j12283
$$ 1068495 1143727 1063545 1253521 991291 1064047 1058441 957890 922565 894793 1213311 1101028
13874A101028J59604k30415L08501n52222J33026K86773J68345j70115o3683k920
$$ 1101028 1260632 1030217 1338718 786496 919522 1206295 1374640 1204525 1140842 1137922
13864A137922k63554K61563J55860n55337L41001K43164m43131J28061K04644
$$ 1137922 874368 1135931 1291791 736454 1077455 1320619 877488 1005549 1210193
13855A210193j42950J70212j25041k49417J19253j7320J37280j29591j97174J78518
$$ 1210193 1067243 1237455 1112414 862997 982250 964930 1102210 972619 775445 953963
13845I53963p2585j79770J61382k412j05681J17149j33595L72646q8422N3521
$$ 953963 881378 701608 862990 860578 754897 872046 738451 1111097 1022675 1076196
13835A076196k25627J84907l40049K5000K02417q7113J30444n9591j22205N5679
$$ 1076196 850569 1035476 695427 720427 922844 835731 966175 906584 784379 840058
13825H40058J35582m27832J95197L6364r3377J94624j18475m3875J20588J28052
$$ 840058 975640 547808 743005 779369 685992 880616 762141 718266 838854 966906
13815I66906m5139Q400k04177K5801J93188k53513K48892j31858j18935J90594
$$ 966906 921767 930167 725990 751791 944979 691466 940358 808500 689565 880159
13805H80159k4745j34367J6506K07954p5428J62910q4625l21053j02370O6798
$$ 880159 855414 721047 737553 945507 870079 1032989 948364 627311 524941 591739
13795E91739J93226j37387P0023j41975M49358l99922R3885J63970j39916N8967
$$ 591739 784965 647578 717601 575626 1024984 625062 718947 882917 743001 801968
13785H01968J30570p890m23247K40457P4373k37952J22858B95187M17690K13357
$$ 801968 932538 924648 501401 741858 816231 578279 701137 295187 712877 926234
13775I26234D43812K52334j45319L36037l14395k22201J92315J49109p8542J25772
$$ 926234 443812 696146 550827 886864 572469 350268 542583 691692 613150 738922
13765G38922N3799p9491Q5066l42536J17539J11216j37626Q5600j64146L11704
$$ 738922 792721 713230 798296 455760 573299 684515 546889 632489 468343 780047
13755G80047p0194j31967Q0498Q0888C42835R0857j21772N3695L42381J8063j5242
$$ 780047 709853 577886 658384 739272 342835 433692 311920 365615 707996 726059 710817
13744G10817O3131C34933L38523k41103J31592j98118K11981o2080j18204L61344
$$ 710817 773948 334933 673456 432353 563945 365827 577808 515728 397524 758868
13734G58868k83798J95975B04494M99829J45402l31412O7452Q466l4429O2113
$$ 758868 475070 671045 204494 704323 849725 518313 585765 594231 559802 621915
13724F21915r5340J3709K60748l13822J24931n6397m451J93123B79929j1224M70975
$$ 621915 526575 540284 801032 487210 612141 555744 551293 744416 279929 268705 739680
13713G39680p6369k19198n5728P4282r2306Q188J33652N3083k24125J41662B29465
$$ 739680 663311 444113 388385 462667 370361 378549 512201 565284 341159 482821 229465
13701B16729L65269k34216J97583K00454B51423K79284o5043J17178m4470A24249
$$ 216729 581998 347782 545365 745819 251423 530707 465664 582842 538372 124249
13690D61550j93410J04089A45489J45492R6337A27189M56658k9788B37919K12309
$$ 461550 268140 372229 145489 290981 387318 127189 583847 554059 237919 450228
13680D50228l0020R203N0970M07995m34041j07349L983K14502j83059J45275j50893
$$ 450228 420208 429411 480381 888376 454335 346986 350969 565471 382412 527687 376794
13669C76794Q7453r4593m8002L93644N8301B27637k9844L98990j88550N2579g2716
$$ 376794 464247 369654 321652 715296 773597 227637 197793 596783 408233 460812 -72716
13657A98914L21496B41655q8249K73156o4563m337r8194J65998j91688M26126
$$ 198914 520410 241655 153406 426562 361999 357662 259468 425466 233778 659904
13647F59904A28180L68551e3535D18003j22833M061K464J75435P309B04794M86311
$$ 659904 128180 496731 -53535 418003 295170 299231 301695 477130 484439 204794 691105
13636F91105B04187o3123J78945J61368k3661J23916j12529J1617j10991A11458
$$ 691105 204187 141064 320009 481377 457716 581632 469103 480720 369729 111458
13625D18842A31230L9041L67560J604A00053K62668A06478J27288J97881j45954
$$ 418842 131230 170271 537831 539435 100053 362721 106478 233766 431647 285693
13615B85693K85195E5666L35863j33701O5595L16925j30042j24501A79001J51247
$$ 285693 570888 55666 391529 257828 323423 640348 510306 385805 179001 330248
13605C30248n9093J8486j8562M712K4839K1298J34345K07788j32841B55100R2845
$$ 330248 271155 289641 271079 275791 300630 321928 456273 664061 531220 255100 347945
13594C47945r8376J36861j78328O7279I994L91852L32783k21875k49037J44099
$$ 347945 249569 386430 208102 275381 9994 401846 734629 512754 263717 407816
13584D07816j36133O7718J63294k29672A21007M22398c8244D97283d3713D17661
$$ 407816 271683 339401 502695 273023 121007 543405 -38244 497283 -43713 417661
13573C41816l1955R832J92265Q4791j90211O8019j22785P071M590G3442Q1343
$$ 341816 309861 319693 511958 596749 406538 474557 351772 358843 363433 73442 154785
13562A54785K61782L4367J49636B62237L25828B52207J00051R0472j90859L14460
$$ 154785 416567 450934 600570 262237 588065 252207 352258 442730 251871 566331
13552E66331A34357J52348M674A7920J21117k3202K89847A27205L5801N1097J67755
$$ 566331 134357 286705 291379 17920 139037 115835 405682 127205 163006 214103 381858
13541C81858A67334J03880C2998L05227L2125j45825K46389A98251K15544j48759
$$ 381858 167334 271214 32998 338225 370350 224525 470914 198251 413795 265036
13531B65036j23658I507K22793M91392C05281j14691r732Q0997M6342k6558e8771
$$ 265036 141378 9507 232300 723692 305281 190590 180858 261855 308197 281639 -58771
13519A52355d3310B29826O0104A07008J30771I7904Q0397f191A76561J19027R4164
$$ 152355 -43310 229826 289930 107008 237779 97904 178301 -6191 176561 295588 389752
13508C89752o2040a40884D27582r3508I3064N5694L60307b7348p0193q8285D42938
$$ 389752 327712 -140884 427582 334074 93064 148758 509065 -27348 -97541 -185826 442938
13496C21052o1461J4893J91856A67026q0034J78007k101F6051k5957K4557k795
$$ 321052 259591 274484 466340 167026 86992 264999 262898 66051 40094 64651 61856
13485F1856L32728j79337a99296B62393o6923R0799a1709C20174A27732j8901
$$ 61856 394584 215247 -199296 262393 195470 286269 -11709 320174 127732 108831
13475A08831O7419b8079C01443Q4368A09835J90415j14902J27237A44873A8638
$$ 108831 176250 -28079 301443 385811 109835 300250 185348 312585 144873 18638
13464A51705d0204D6116a32001F77104B72288I5070L47189K7004j11484n1666
$$ 151705 -40204 46116 -132001 677104 272288 95070 442259 469263 357779 306113
13454C06113A33482J5055L4185p1309P6629J40906j53918M0698p3289a08090C12781
$$ 306113 133482 148537 182722 111413 188042 328948 175030 215728 142439 -108090 312781
13442e3470C50805J68850k17544A3588J64101P9171A27449B449J68359N5165a29808
$$ -53470 350805 519655 302111 13588 177689 256860 127449 2449 170808 225973 -129808
13430C25972A24957H315P087K22874c8166G8092P5442d4911A39383J23704l9819
$$ 325972 124957 8315 15402 238276 -38166 78092 153534 -44911 139383 263087 223268
13419B23268M64521A68254J76864o804a0981F7992J69525J52335j64997p2960
$$ 223268 687789 168254 345118 338314 -10981 67992 237517 389852 224855 151895
13409A51895A9681J88002J43161c5953A7223K7339H07J29563J35492j07196D0369
$$ 151895 19681 207683 350844 -35953 17223 44562 807 130370 265862 158666 40369
13397A1020K48316J58468g0645A40336J23249J85831G9320K2579K51755h424C6417
$$ 11020 259336 417804 -70645 140336 263585 449416 79320 101899 353654 -8424 36417
13385A75258N644J24968E1524a28645M6292B16249R048J45443G4740O3923J65001
$$ 175258 180902 305870 51524 -128645 -82353 216249 225297 370740 74740 138663 303664
13374C03664A30539b7205B59160o197e3265A04322L7993C5930J16730K11689A23870
$$ 303664 130539 -27205 259160 252963 -53265 104322 142315 35930 152660 364349 123870
13362C76257N0249j18622A42977L66578j78126J11044k11564o9925K10211o0352
$$ 376257 426506 307884 142977 509555 331429 442473 230909 160984 371195 310843
13352C10843J02o3335b1117D26646q4229a4755C09254A21543K00720I3602L97070
$$ 310843 310945 247610 -21117 426646 342417 -14755 309254 121543 322263 93602 490672
13341D90672R0659B36252j3650n9096m2046J03903L68542j70961B4508e7802C27534
$$ 490672 581331 236252 222602 163506 121460 225363 593905 422944 24508 -57802 327534
13329B36420O1044a51606D89946G8854J00385E3207J05354J411L23995b31807
$$ 236420 297464 -151606 489946 78854 179239 53207 158561 159972 483967 -231807
13318C22185J44780r4549A35722K9435J64936A23688L5796n3454J86583r6791
$$ 322185 466965 372416 135722 165157 330093 123688 159484 106030 292613 195822
13308A95822D3957J39188J91217A61501P4204Q6238n1544A2706K8346B961N5958
$$ 195822 43957 183145 374362 161501 235705 321943 270399 12706 41052 2961 58919
13297E8919a92765A71659J02244a53652C31808F0218J87920i3541K2381A8796
$$ 58919 -192765 171659 273903 -153652 331808 60218 248138 -93541 -71160 18796
13286a3833B93947H9345J47073B0108K57254q4922o4078N0539R140C6697J25830
$$ -13833 293947 89345 236418 20108 277362 192440 128362 178901 188041 36697 162527
13275A62527k7983O1850J5063H7845J81196a76855A34627Q3644a19260A01186
$$ 162527 134544 196394 211457 87845 269041 -176855 134627 218271 -119260 101186
13264h9697j3613l2029O3247D3715K45025A43165K7328K00009r8221c3399B02019
$$ -89697 -103310 -135339 -72092 43715 288740 143165 170493 370502 272281 -33399 202019
13252I8816A9595J08896l51J37543j5239F4563K01827e9380j3849L967C08765
$$ 98816 19595 128491 128140 265683 250444 64563 266390 -59380 -73229 -69262 308765
13240A40945F5728k1092j3241b07541i4472B19155B665J08284L5353g8971k2425
$$ 140945 65728 44636 31395 -207541 -94472 219155 2665 110949 146302 -78971 -101396
13229a01396a9254c541B59911D0455P3268h531A10326N8598G6670j0679f4997
$$ -101396 -19254 -3541 259911 40455 113723 -8531 110326 168924 76670 65991 -64997
13217A57198i689A76697i9360B07318A2861L21422e6572n8180j38B47236j04951
$$ 157198 -9689 176697 -99360 207318 12861 334283 -56572 -114752 -114890 247236 142285
13206A42285c6143a2185A27350C3230G471J61904b24231A77911D3314c25425N8644
$$ 142285 -36143 -12185 127350 33230 7471 169375 -224231 177911 43314 -325425 -266781
13195b66781m0463H5818k2241R1094a1928B52390o0985b13374h3137A54391a77946
$$ -266781 -307244 85818 63577 154671 -11928 252390 191405 -213374 -83137 154391 -177946
13183B02597n0215i1090L4455k892H5279a79745b9901A64473n370a62738g1696
$$ 202597 152382 -91090 -56635 -59527 85279 -179745 -29901 164473 159103 -162738 -71696
13171a16212B39197a57946A53554e6754A74668j9808a04859C5713b09461H1807
$$ -116212 239197 -157946 153554 -56754 174668 154860 -104859 35713 -209461 81807
13160a96394D23141k01737G7282a21449m2705I9962J5827b08623A1662a29954
$$ -196394 423141 221404 77282 -121449 -164154 99962 115789 -208623 11662 -129954
13149A33939K7411a62926A10186J14196o3032e9309J1907H3768M4722J77231A8874
$$ 133939 161350 -162926 110186 224382 161350 -59309 -47402 83768 128490 305721 18874
13137B22878f3692F5710O8902Q062a03624M0588b4029f466j05892a1863A22206
$$ 222878 -63692 65710 134612 142674 -103624 -63036 -24029 -6466 -112358 -11863 122206
13125b65155c1816n7864F1639L1031Q5449n6625J37041A17842l4015N912a39256
$$ -265155 -31816 -89680 61639 92670 178119 121494 258535 117842 83827 89739 -139256
13113A19655l5058b4864A4288M3070a38732A61841A2164K73617I2931a52439B3020
$$ 119655 84597 -24864 14288 57358 -138732 161841 12164 285781 92931 -152439 23020
13101a38911l3988C96272a29594E502L9699J14050a5134p413H8962b58001A62289
$$ -138911 -172899 396272 -129594 5502 45201 159251 -15134 -22547 88962 -258001 162289
13089B43542o3070k468o3962h5754r9110D03929B1219a73103A92465h6057B40845
$$ 243542 180472 178004 114042 -85754 -184864 403929 21219 -173103 192465 -86057 240845
13077A6867K52075E1395P6412J30060D5125a04317A11505a21909A44951b4370
$$ 16867 268942 51395 127807 257867 45125 -104317 111505 -121909 144951 -24370
13066H9258J10534a1602F0209L67987c24782A69680I947J8865g6076C1296b64232
$$ 89258 199792 -11602 60209 428196 -324782 169680 9947 28812 -76076 31296 -264232
13054a26294F6796L31891j10625R7948g5331a0725C9227J77134f1328A67814o7610
$$ -126294 66796 398687 288062 386010 -75331 -10725 39227 216361 -61328 167814 100204
13043A00204B8733L04912G7539L51130B8465b16130a05919H2609J3088B4345M5160
$$ 100204 28733 333645 77539 428669 28465 -216130 -105919 82609 95697 24345 69505
13032F9505b68460E5625a0922H076L2165d0109C23442a16689H0837P238F452L3624
$$ 69505 -268460 55625 -10922 8076 40241 -40109 323442 -116689 80837 88075 6452 40076
13020D0076J10324A7501e2640A06845M5834b1325A69477J76882j53299r5890J48293
$$ 40076 150400 17501 -52640 106845 152679 -21325 169477 346359 193060 97170 245463
13009B45463a79995A7903L5224J81407a9286k25783D6790J65723G8700b918j70565
$$ 245463 -179995 17903 53127 234534 -19286 -245069 46790 212513 78700 -2918 -173483
12998a73483B23286n6282B0584R8024J06269a14532A00358a43795J725A68463
$$ -173483 223286 167004 20584 118608 224877 -114532 100358 -143795 -142070 168463
12987B28421H8963J6149B0699a13898G5280l1056i1577j16078r5827e7620A62088
$$ 228421 88963 105112 20699 -113898 75280 44224 -91577 -207655 -303482 -57620 162088
12975a45999A4730R0025J2126i006A03338A8423L1824a16408B26627b82907F3448
$$ -145999 14730 104755 116881 -9006 103338 18423 50247 -116408 226627 -282907 63448
12963c6605h81A20340L37694b12378j49193c7625k04736J4822B49765a10230A40219
$$ -36605 -881 120340 458034 -212378 -361571 -37625 -242361 -227539 249765 -110230 140219
12951A12343J06961c20610B89782H278c18797A95030a38680n2289m860A51953
$$ 112343 219304 -320610 289782 8278 -318797 195030 -138680 -190969 -195829 151953
12940f2722J8090B27729b2110A34273B6372a51298a3787A22610K25806g5540j14771
$$ -62722 -44632 227729 -22110 134273 26372 -151298 -13787 122610 348416 -75540 -190311
12929a90311k5544c4761B39641j06979l1685a84183j22748A99823e9172p607B31834
$$ -190311 -215855 -34761 239641 132662 100977 -184183 -306931 199823 -59172 -66779 231834
12917a28549a1657A50522F1078j9163g047k90985e051n0407A44524o6814a35110
$$ -128549 -11657 150522 61078 41915 -7047 -298032 -5051 -55458 144524 77710 -135110
12905C1511j4709f2161B47267h5787j6432j01531C52838h2389j07184A23818a0500
$$ 31511 16802 -62161 247267 -85787 -102219 -203750 352838 -82389 -189573 123818 -10500
12893A56914a73567N0360A20448B7878b03741k4974h4004P064l0423j52271K7570
$$ 156914 -173567 -123207 120448 27878 -203741 -228715 -84004 -76940 -107363 -259634 -232064
12882b32064A02076Q4315E1907b81539C2009F22J50616l2618A3808R4134a32529
$$ -232064 102076 186391 51907 -281539 32009 622 151238 118620 13808 107942 -132529
12870b1629B14406c29413A57092a2718C84625C3583i0842D4006b22136Q9062j10693
$$ -21629 214406 -329413 157092 -12718 384625 33583 -90842 44006 -222136 -133074 -243767
12859b43767B1824J39292k2210b3054B3967a44932f3233j03362A28654c29091
$$ -243767 21824 161116 138906 -23054 23967 -144932 -63233 -166595 128654 -329091
12848a39345B4633b19362A10742D1216d1811F8024p475a44721l24451B12158a23222
$$ -139345 24633 -219362 110742 41216 -41811 68024 60549 -144721 -469172 212158 -123222
12836A0250a8340A02898k3494B3330a62941r518B3131J1123l962M8069g6703l32321
$$ 10250 -18340 102898 79404 23330 -162941 -172459 23131 34254 30292 78361 -76703 -409024
12824d09024G2189K00247H6404B0805f5127A43874A9136a46344n003A71225e546
$$ -409024 72189 272436 86404 20805 -65127 143874 19136 -146344 -151347 171225 -5546
12812E2094J4161C0023a74309g6064b4036I5958a23084j43373i7483C7511b22441
$$ 52094 66255 30023 -174309 -76064 -24036 95958 -123084 -266457 -97483 37511 -222441
12800a20153J3085m18111C26995b511B57410a12901F9289a41279a3071o8870B68571
$$ -120153 -107068 -525179 326995 -2511 257410 -112901 69289 -141279 -13071 -81941 268571
12788C73878a08414A92461J03164b06599G9051b20641D0256i4774j16876C0363
$$ 373878 -108414 192461 295625 -206599 79051 -220641 40256 -94774 -211650 30363
12777d0441A25863a14841D7398i0931A30681a15236E7491O0184J5909i1392K5286
$$ -40441 125863 -114841 47398 -90931 130681 -115236 57491 117675 133584 -91392 -66106
12766f6106C0346P9139K6336O9840b17597i9787K7913k9700M2631l20520a13447
$$ -66106 30346 109485 135821 205661 -217597 -99787 -71874 -101574 -58943 -379463 -113447
12754B90199D2853A1063d95109I0644m5312c0323j41485N1133M0669o7787A10107
$$ 290199 42853 11063 -495109 90644 45332 -30323 -171808 -120675 -80006 -147793 110107
12742b14744k1293e4673B29380j03183N4951L54776b36310B29689b89542j8275
$$ -214744 -236037 -54673 229380 126197 181148 535924 -236310 229689 -289542 -307817
12732c07817C05812j09236a95090G1752e1139k21793B93426A03640D0663l402
$$ -307817 305812 196576 -195090 71752 -51139 -272932 293426 103640 40663 37261
12722C7261J73456a79178B71024b29171c1845G7437J02989L313o4966f1795a3664
$$ 37261 210717 -179178 271024 -229171 -31845 77437 180426 183739 118773 -61795 -13664
12710F50865D1263L43559c4309A55467l6796g6887p3740j92561a9012k06946A10202
$$ 650865 41263 384822 -34309 155467 118671 -76887 -150627 -343188 -19012 -225958 110202
12698B16518B6506J29421M3817P4993a41304o60h162A12548b57680g6804B97973
$$ 216518 26506 155927 199744 274737 -141304 -141964 -8162 112548 -257680 -76804 297973
12686B28784d2346I5989b75210B92708j25678B2393J20943J2620K5486g2054B76291
$$ 228784 -42346 95989 -275210 292708 167030 22393 143336 155956 181442 -72054 276291
12674A89687a16065k3956m5364B5803J18161P8559b56459h0320m5514A48780r806
$$ 189687 -116065 -140021 -185385 25803 143964 222523 -256459 -80320 -125834 148780 138974
12663A38974e4091E0094L4618b34383K869A62867l0301i7761C42674a06820B73593
$$ 138974 -54091 50094 84712 -234383 -231514 162867 132566 -97761 342674 -106820 273593
12651A02380M0160F0301c23467A87802J51910a01965r1722B85659b3170n4501
$$ 102380 142540 60301 -323467 187802 339712 -101965 -193687 285659 -23170 -77671
12641g7671a916E2654J23281K0447k1056P5494A04153J83786a71138c9669A24978
$$ -77671 -1916 52654 175935 196382 175326 250820 104153 287939 -171138 -39669 124978
12629b6525j5333A22972d3385A37577F1970K53985D9328b1490C99668a3129A93910
$$ -26525 -41858 122972 -43385 137577 61970 315955 49328 -21490 399668 -13129 193910
12617b70875B21336C4151J03351b6879C08234a09536j50245g7330j6298j1906
$$ -270875 221336 34151 137502 -26879 308234 -109536 -259781 -77330 -93628 -105534
12607a05534A00538F837J46812Q0249H0155a68033B51529r1788a20133A06670
$$ -105534 100538 6837 153649 233898 80155 -168033 251529 159741 -120133 106670
12596I1322J2665L0072n9074g6042j25067A92902f3397n3598M4965j92360F6415
$$ 91322 103987 134059 74985 -76042 -201109 192902 -63397 -116995 -72030 -264390 66415
12584A05860D3466o701a60203O1671j9558D2583a25746B92192P3987n4901p1731
$$ 105860 43466 36765 -160203 -98532 -118090 42583 -125746 292192 366179 311278 239547
12573B39547d0285r804C68411i8278A24384C1055J64917b20976C9959e2701j0242
$$ 239547 -40285 -50089 368411 -98278 124384 31055 195972 -220976 39959 -52701 -62943
12562f2943J1623A40598d4645A02798g7676B22986I2008J8492b4997A15580J98869
$$ -62943 -51320 140598 -44645 102798 -77676 222986 92008 110500 -24997 115580 314449
12551C14449a01235a707k68935L9829b1078B03407a98455I2609m5108K50471b1942
$$ 314449 -101235 -1707 -270642 -230813 -21078 203407 -198455 92609 47501 297972 -21942
12539b41455b1720m2447r0123l681r3799C29856i1976A8811h0994C2877P7530
$$ -241455 -21720 -64167 -154290 -157971 -251770 329856 -91976 18811 -80994 32877 110407
12528A10407b26681h1426b2726m8906I4340i8416I569P337J25542J69535J19553
$$ 110407 -226681 -81426 -22726 -71632 94340 -98416 9569 16906 142448 311983 431536
12517D31536a01036a2994E16016A90292o6626Q2767r9669P9484a31565n9612C1175
$$ 431536 -101036 -12994 516016 190292 123666 206433 106764 186248 -131565 -191177 31175
12505c596n7817D1469a69606l5627C73229b7292m2848A97738E5232e2711F8582
$$ -3596 -61413 41469 -169606 -205233 373229 -27292 -70140 197738 55232 -52711 68582
12493a52472H6277J69309J69878e1616D17640G1788K17254J69755a56515A76219
$$ -152472 86277 255586 425464 -51616 417640 71788 289042 458797 -156515 176219
12482A41738J49699g6401I9810a15329H8914c8272j25741J0172m5609k576h3358
$$ 141738 291437 -76401 99810 -115329 88914 -38272 -164013 -153841 -199450 -202026 -83358
12470b70250h9666K6908A40154n1951J90091a17035k9245F6048a3508A20901J93737
$$ -270250 -89666 -62758 140154 88203 278294 -117035 -146280 66048 -13508 120901 314638
12459C14638N4773A3021a63074G9728C7324f6202L251o7701o6505B06565a64745
$$ 314638 369411 13021 -163074 79728 37324 -66202 -62951 -130652 -197157 206565 -164745
12447c40960j23783a57232d6215A41507f8503J5833B60502F3869a58372a8950
$$ -340960 -464743 -157232 -46215 141507 -68503 -52670 260502 63869 -158372 -18950
12436b45318n975d4220B29940a64437g6326G707J2472O0075g18b09H8616i3770
$$ -245318 -251293 -44220 229940 -164437 -76326 7707 20179 80254 -718 -209 88616 -93770
12423a92800A4303K70680j27619c69602A29241e6599e127A11597a38651r4703
$$ -192800 14303 284983 157364 -369602 129241 -56599 -5127 111597 -138651 -233354
12413b33354e3568k0616k68002f4683A6225a49231D66556c48196Q2106q9511B97751
$$ -233354 -53568 -74184 -342186 -64683 16225 -149231 466556 -348196 -266090 -355601 297751
12401B77039b88655A89860K9085a8033B72343c9473r7355C9320c58680D7649l303
$$ 277039 -288655 189860 218945 -18033 272343 -39473 -136828 39320 -358680 47649 44346
12390D4346J60906c1806B47025D2628L36699j78276H3500J07924H7447d6955B30777
$$ 44346 205252 -31806 247025 42628 379327 201051 83500 191424 87447 -46955 230777
12378g1263A75437R5278J2924Q6612a77943A11192a10525B0047J67800J41809
$$ -71263 175437 270715 283639 370251 -177943 111192 -110525 20047 187847 329656
12368C29656e7591m6604B77913n3042B8374J23582i1075M1104p0419j0387A19568
$$ 329656 -57591 -104195 277913 224871 28374 151956 -91075 -49971 -120390 -130777 119568
12356A63686M4738b60277G0247n310N8120B7370E925J33592a26355j17109J16961
$$ 163686 208424 -260277 70247 64937 123057 27370 5925 139517 -126355 -243464 -126503
12345a26503P037A06249C8550P1901g9688q8017B82686a33381C31020n6613A21587
$$ -126503 -119466 106249 38550 110451 -79688 -167705 282686 -133381 331020 274407 121587
12333h5143F9478c59B37012J957n576N735p2323n4445O0991n0619d581C07908
$$ -85143 69478 -359 237012 238969 233393 239128 166805 112360 173351 122732 -4581 307908
12320B62264A26768b3773j24954j7371A20092o373d0917k53236D1412a11350A46512
$$ 262264 126768 -23773 -148727 -166098 120092 113719 -40917 -294153 41412 -111350 146512
12308H2730K7913o667m4631R8760P0194E0692J38546J87082A87193o1048J2962
$$ 82730 110643 103976 59345 158105 228299 50692 189238 376320 187193 126145 139107
12297A39107E6297K50360C1902J49596a37096B32256J05184F3273a21116B44120
$$ 139107 56297 306657 31902 181498 -137096 232256 337440 63273 -121116 244120
12286A4070K03329P453Q8033A07738J18717a42487B20654K64524A85028E3843
$$ 14070 217399 224852 312885 107738 226455 -142487 220654 485178 185028 53843
12275B54489B6445J52836J11167l8171j23166J8877D5926j9381K97635A01572
$$ 254489 26445 179281 290448 252277 129111 147988 45926 26545 324180 101572
12264b02546B03674g9322k51196A21811n0930K19453a14837A43585o1331a07305
$$ -202546 203674 -79322 -330518 121811 70881 290334 -114837 143585 82254 -107305
12253c081o4772k45651A04768P2412C1854J14130J58282j37512h8923A58395H870
$$ -3081 -67853 -313504 104768 177180 31854 145984 304266 166754 -88923 158395 8870
12241e1508A27333J12834F8149J71305J9645A8975h8069F5265j7493J65561L5851
$$ -51508 127333 240167 68149 239454 259099 18975 -88069 65265 47772 213333 249184
12230B49184K42879B38224j16637L8929C2523N67248b5722D01292f7300B75356
$$ 249184 492063 238224 121587 160516 32523 599771 -25722 401292 -67300 275356
12219G3661P6577e2635C4263j4875M56310F7139J59290n5237Q7866K6889A33034
$$ 73661 150238 -52635 34263 19388 475698 67139 226429 171192 259058 285947 133034
12207A86956H9646j5073c9182D69691A63293Q2709n6586R1336q8088B3128K01569
$$ 186956 89646 74573 -39182 469691 163293 246002 189416 280752 192664 23128 224697
12196B24697K0844B2521K08330j13863P4371K1515G9437J51668j5768R4900N0914
$$ 224697 245541 22521 230851 116988 191359 212874 79437 231105 215337 310237 361151
12185C61151A80440O7607l9043k1872K1813l7704N8472J48931A60927K89667k24461
$$ 361151 180440 248047 209004 187132 208945 171241 229713 378644 160927 450594 226133
12174B26133a89584A5341K86032I6043J11039H5301J0707e8583b8562A65020P469
$$ 226133 -189584 15341 301373 96043 207082 85301 96008 -58583 -28562 165020 172489
12163A72489A4761L92474A51308J39110I8268L12916c6460F0800a27989B04591
$$ 172489 14761 407235 151308 290418 98268 411184 -36460 60800 -127989 204591
12152a70285A38594o6684K5824K46937m5018b16130C550J07514l9823l0848j1200
$$ -170285 138594 71910 97734 344671 299653 -216130 3550 111064 71241 40393 29193
12141B9193h5175D8101J83829A12207n0928a94585A84972h6404B5090K05441d6015
$$ 29193 -85175 48101 231930 112207 61279 -194585 184972 -86404 25090 230531 -46015
12129A0648O74185B90455A10065J72038A23207m1654L75136j97660d497B54435
$$ 10648 684833 290455 110065 282103 123207 81553 456689 259029 -4497 254435
12118C30644A4462N8881a1132B08741p0398a5641D5825Q7259g531E2569a61591
$$ 330644 14462 73343 -11132 208741 138343 -15641 45825 133084 -7531 52569 -161591
12106A29562J24319a30749C00360r4196H4904A1328L38358B3025c40778C09206
$$ 129562 253881 -130749 300360 206164 84904 11328 349686 23025 -340778 309206
12095A03911M613P0655a87767A23712O6574q1523c6028l9735B32092g4357b6343
$$ 103911 108524 179179 -187767 123712 190286 108763 -36028 -75763 232092 -74357 -26343
12083A84165R6765P7911j68080N448G0990L7406B3616L54030G33O8920J56955
$$ 184165 280930 358841 190761 196209 70990 108396 23616 377646 733 69653 226608
12072B26608dA79739q435l4372B0361K89382D562K34442b69855J29720A80293
$$ 226608 -4 179739 171304 136932 20361 309743 4562 239004 -269855 -140135 180293
12060c19277d5380j13375j26219i4280n6117B9266N9086a42587A78131f1244n7289
$$ -319277 -45380 -158755 -284974 -94280 -150397 29266 88352 -142587 178131 -61244 -118533
12049a18533m417N6983H0381c21397A81686J78488A05922h7396j0298B02460b73948
$$ -118533 -122950 -65967 80381 -321397 181686 360174 105922 -87396 -97694 202460 -273948
12037a71275r952A36261a812B0312i3605M604m7267C24509h097C67160b4861q7
$$ -171275 -181227 136261 -1812 20312 -93605 -89001 -136268 324509 -8097 367160 -24861 -24948
12025b4948j23723A44323a49948E8220k3053J09718J38558J23793b27184a07326
$$ -24948 -148671 144323 -149948 58220 35167 144885 283443 407236 -227184 -107326
12014G6627a16901C68670g4253A73796a36222A14576b11248e5822A99533A2875
$$ 76627 -116901 368670 -74253 173796 -136222 114576 -211248 -55822 199533 12875
12003e7309B5021b99040Q8442J03409p876J4481A23701a22549J5131q2165a4641
$$ -57309 25021 -299040 -210598 -107189 -115065 -100584 123701 -122549 -107418 -189583 -14641
11991A82157o9993P4725a07702A68052l0621l7273b17610C3240a67529G0191b35402
$$ 182157 112164 186889 -107702 168052 137431 100158 -217610 33240 -167529 70191 -235402
11979g5927D018c9361j85073A93911a03850b7827r6152r5872J1097R2833A14930
$$ -75927 4018 -39361 -224434 193911 -103850 -27827 -123979 -219851 -208754 -115921 114930
11967B296J61518H049e5823A41946J1871a15097A03521i5837m3909A37278a75303
$$ 2296 163814 8049 -55823 141946 153817 -115097 103521 -95837 -139746 137278 -175303
11955B7385j163M529a7023j01256G9168M6439e6873D929a78910H3433a8796q2452
$$ 27385 26222 30751 -17023 -118279 79168 125607 -56873 4929 -178910 83433 -18796 -101248
11943a01248A29016a80288p6700M0592M9545C42789a90074A78358e0470j02293
$$ -101248 129016 -180288 -256988 -216396 -166851 342789 -190074 178358 -50470 -152763
11933a52763g6072j5629B58508b6827C5753a39980m6247A60199B4954b04746n1407
$$ -152763 -76072 -91701 258508 -26827 35753 -139980 -186227 160199 24954 -204746 -256153
11922b56153j56126c3365Q665j64152D2666a06819B59232E225J02852e757A56840
$$ -256153 -412279 -33365 -24700 -188852 42666 -106819 259232 5225 108077 -5757 156840
11910C819d3169C59051a02823A21295J08630A4108b91200N283A00878R2328I3941
$$ 3819 -43169 359051 -102823 121295 229925 14108 -291200 -285917 100878 193206 93941
11898c9313j69415A8638J7257a11516a8201l2098D3626J53793i2092j76956g6028
$$ -39313 -208728 18638 35895 -111516 -18201 -50299 43626 197419 -92092 -269048 -76028
11886h6045A26141d2973A32335n4103c9892k32431e3457j49851H35c46607j3936
$$ -86045 126141 -42973 132335 78232 -39892 -272323 -53457 -203308 835 -346607 -360543
11875c60543d9883A3876O0110b48652O9655B07675J02541a2984n6862n1226k4739
$$ -360543 -49883 13876 73986 -248652 -178997 207675 310216 -12984 -69846 -121072 -145811
11864a45811M8800l00690i0399I4174b22847e1710n8627j8231k21327K1696a08994
$$ -145811 -97011 -397701 -90399 94174 -222847 -51710 -110337 -128568 -349895 -328199 -108994
11852B6624O8945O25c27072C0144b46285A6239c07515a16356A61812d65204b04690
$$ 26624 95569 96194 -327072 30144 -246285 16239 -307515 -116356 161812 -465204 -204690
11840c6330j91803b7700B75456g7335k2996A65612A9364e56805b11753A15271
$$ -36330 -228133 -27700 275456 -77335 -100331 165612 19364 -556805 -211753 115271
11829C3903K3706a04465H9747k3654I417a96363I0520b99788D9252a29845B81274
$$ 33903 57609 -104465 89747 66093 9417 -196363 90520 -299788 49252 -129845 281274
11817a10908A29132d6311J0244A05071c971j19852c0434A46157E5208g2304A23949
$$ -110908 129132 -46311 -36067 105071 -3971 -123823 -30434 146157 55208 -72304 123949
11805c49211h589k9051A46324a04058A36025J8761b9252k1071P048C6574J26824
$$ -349211 -8589 -37640 146324 -104058 136025 154786 -29252 -50323 -43275 36574 163398
11794A63398m8852c63641A09702l6396b12765A92531a53000D979g3567B16713
$$ 163398 114546 -363641 109702 73306 -212765 192531 -153000 4979 -73567 216713
11783d6769j2881j0742j70628a17491r6237A81656a06085j8725n6153h4475G8467
$$ -46769 -59650 -70392 -241020 -117491 -213728 181656 -106085 -124810 -180963 -84475 78467
11771b46797A94640I5962R526k1284J81281c4486j06833D1599b0685A99199c03943
$$ -246797 194640 95962 105488 84204 265485 -34486 -141319 41599 -20685 199199 -303943
11759A23464d8761J2057B09113a94725B90837a48617c5093A36870b05741k78560
$$ 123464 -48761 -36704 209113 -194725 290837 -148617 -35093 136870 -205741 -484301
11749d84301h1029L9857A34975a78266B09038N0208B0918a6393k0383A69823c0849
$$ -484301 -81029 -41172 134975 -178266 209038 259246 20918 -16393 -36776 169823 -30849
11737b17595F3566a72965r9636k0945a08836B74934c7255k3943B35106g7712F6882
$$ -217595 63566 -172965 -272601 -293546 -108836 274934 -37255 -61198 235106 -77712 66882
11725h3969G5417a29492A9124J1393L35568F1507B3610a48846F2231h5441b2578
$$ -83969 75417 -129492 19124 30517 366085 61507 23610 -148846 62231 -85441 -22578
11713a94750h5349j12493A06705l0627a29098D4987b27353D8652R5475f538B05866
$$ -194750 -85349 -197842 106705 76078 -129098 44987 -227353 48652 144127 -6538 205866
11701H2597b39739l4987c7301B04063b86638d1168j95937A33721b19772R4508
$$ 82597 -239739 -274726 -37301 204063 -286638 -41168 -237105 133721 -219772 -125264
11691a25264L6321A45975j1563L9733q5086B4655R203a78839A23744b7312B02794
$$ -125264 -88943 145975 134412 174145 89059 24655 33858 -178839 123744 -27312 202794
11679b61132Q432f8462j79014C3507i5318B51724e5430k57381i5003p504j534
$$ -261132 -252700 -68462 -247476 33507 -95318 251724 -55430 -312811 -95003 -102507 -104041
11668a04041j86746C9145a02896q5854g0910k0977c6902A4521b5290n1624j15523
$$ -104041 -290787 39145 -102896 -188750 -70910 -91887 -36902 14521 -25290 -76914 -192437
11657a92437c570B0959L665a09456p732A55537c09818A46178a33040D41039A7897
$$ -192437 -3570 20959 24624 -109456 -117188 155537 -309818 146178 -133040 441039 17897
11645A82617g1384o2680j88703a30674j29335B58117i3893p8877A50657J77420
$$ 182617 -71384 -134064 -322767 -130674 -260009 258117 -93893 -172770 150657 328077
11635C28077i8498j9062j191l5231d4663A89692f9161a2214o817C84816A91711
$$ 328077 -98498 -117560 -118751 -153982 -44663 189692 -69161 -12214 -19031 384816 191711
11623E4781J44228C4711K39706C2122i9252J3841l1644B10736j02650h8814p2982
$$ 54781 199009 34711 274417 32122 -99252 -85411 -117055 210736 108086 -88814 -161796
11612a61796l8447g455o803m8771B48966k4428M7319n5078b00896g0523j212b9038
$$ -161796 -200243 -7455 -14258 -63029 248966 224538 271857 216779 -200896 -70523 -71735 -29038
11599f5099A63525B0324b6581A82493N7048j19655e4604g749n6638m15053b8863
$$ -65099 163525 20324 -26581 182493 239541 119886 -54604 -7749 -64387 -479440 -28863
11587E11337B24911H3171c83884a81960B94690J6394a92847D75482D1961J50205
$$ 511337 224911 83171 -383884 -181960 294690 311084 -192847 475482 41961 192166
11577A92166Q6453a23745R773l02186h0161A1461J4544a08512I6928J40099g2420
$$ 192166 278619 -123745 -113972 -416158 -80161 11461 26005 -108512 96928 237027 -72420
11565A21206D0592h7263r1900A48323A011J06635B1371M1768K38522R4420d28302
$$ 121206 40592 -87263 -179163 148323 1011 107646 21371 63139 301661 396081 -428302
11553a11279G2810h5189A61642B8895J23678l0974O0659e6910j93229A11113a97402
$$ -111279 72810 -85189 161642 28895 152573 121599 182258 -56910 -250139 111113 -197402
11541H3984i985B93296f5988D7911i2755E1052g2611A27291d267A94827K2756
$$ 83984 -9985 293296 -65988 47911 -92755 51052 -72611 127291 -4267 194827 217583
11530B17583b69587B24853a79713b7547A45282a07851r9478A64321K00870a209
$$ 217583 -269587 224853 -179713 -27547 145282 -107851 -207329 164321 365191 -1209
11519A10645J3486B3134b66440i9996A20821J85593b06425D92099k09927G0630
$$ 110645 124131 23134 -266440 -99996 120821 306414 -206425 492099 282172 70630
11508E2066L35323j44609J27085A55457b5766B74538j12324G8320d80p2485B01056
$$ 52066 387389 242780 369865 155457 -25766 274538 162214 78320 -480 -72965 201056
11496g4317F2630K13490m5901Q7639e8924B8082O4076H872R800h4282A02551A9209
$$ -74317 62630 276120 230219 317858 -58924 28082 92158 8872 18672 -84282 102551 19209
11483F3462L10326A66655m8289q96R1776n2197M0515h712D27017j83838J01738
$$ 63462 373788 166655 118366 117470 209246 157049 197564 -8712 427017 243179 344917
11472C44917A50135R6152a29302C36034a98060A30828J14678L54759C826R9569
$$ 344917 150135 246287 -129302 336034 -198060 130828 245506 600265 3826 103395
11462A03395J13308J58723A29512J26053k6177L3120m0764H743J38406M07330
$$ 103395 216703 375426 129512 255565 229388 262508 221744 8743 147149 554479
11452E54479a05565H3490J57737q4972J75006C2482a33860e6888B97826A6929
$$ 554479 -105565 83490 241227 156255 331261 32482 -133860 -56888 297826 16929
11441e1263j66056B31170j4761C2190h3967C7201J15417A7381K86877p1402A08555
$$ -51263 -217319 231170 216409 32190 -83967 37201 152618 17381 304258 232856 108555
11429a15088f4r9323H4819p342g36E8508J85090n9094C1754e5014b2156A17134
$$ -115088 -64 -99387 84819 77477 -736 58508 243598 184504 31754 -55014 -22156 117134
11416E6395a19274M3840l49990a00185B3443b4463D79416b73710A79286F8146
$$ 56395 -119274 -75434 -425424 -100185 23443 -24463 479416 -273710 179286 68146
11405G5426c0487q0745m3604A06233f8725K1151A91840a04124c5157A85348n8701
$$ 75426 -30487 -111232 -154836 106233 -68725 -47574 191840 -104124 -35157 185348 126647
11394A26647g8079j27025L4662r1254g0663c4511j61837F4642a02920q9299f2519
$$ 126647 -78079 -205104 -170442 -261696 -70663 -34511 -196348 64642 -102920 -192219 -62519
11382I1630J20251a42300A99522D2289L15614a09105d9087G4306j5846d8847j71456
$$ 91630 211881 -142300 199522 42289 357903 -109105 -49087 74306 58460 -48847 -220303
11371b20303g1559G0357J22833a07345c2780d290C700a038p577B14819B4904b50578
$$ -220303 -71559 70357 193190 -107345 -32780 -4290 3700 -1038 -8615 214819 24904 -250578
11358A46533a51477p1493i1458j11142B6765K268a85737G6005J17940B3547g3289
$$ 146533 -151477 -222970 -91458 -202600 26765 29033 -185737 76005 193945 23547 -73289
11346b9794r0399l6893M8187m812k40638B2042E052a03352K9176a2533q6786m6770
$$ -29794 -120193 -157086 -108899 -113711 -354349 22042 5052 -103352 -74176 -12533 -99319 -146089
11334a46089c734A06527a60133d5864M367A10005b51813L1186k5403E888K57767
$$ -146089 -3734 106527 -160133 -45864 -41497 110005 -251813 -220627 -246030 5888 263655
11323B63655b86813A77455b321n8643p977B05655b72365i1138G5517Q0850d7198
$$ 263655 -286813 177455 -2321 -60964 -68941 205655 -272365 -91138 75517 156367 -47198
11311b04650B46527a02873p9671g4939j41471H7332e0482o2586b7868j57823N1723
$$ -204650 246527 -102873 -182544 -74939 -216410 87332 -50482 -113068 -27868 -185691 -133968
11300a33968N0936j88502A57097h0018A23546R0528n5589b09988a4756k8922k05019
$$ -133968 -83032 -271534 157097 -80018 123546 214074 158485 -209988 -14756 -43678 -248697
11289b48697O5045N6479N9236j21964j21078a06251j80190d2454C2632e4993l05773
$$ -248697 -183652 -127173 -67937 -189901 -310979 -106251 -286441 -42454 32632 -54993 -360766
11278c60766B39377a83658M4264q4396J00679k26739B82773I6530D4482b9052
$$ -360766 239377 -183658 -139394 -223790 -123111 -349850 282773 96530 44482 -29052
11267f9355A10800J12521a47838B72501i9026k5104k7546M8712A38355l2513g8427
$$ -69355 110800 223321 -147838 272501 -99026 -124130 -151676 -102964 138355 105842 -78427
11255b16685B3027J7753a95178B76271a22250L1066A20741m0848b48751C3370
$$ -216685 23027 40780 -195178 276271 -122250 -91184 120741 79893 -248751 33370
11244A25879h9778A6318c2482H1385c0957H554h4114p452n2588j7611a2333j49256
$$ 125879 -89778 16318 -32482 81385 -30957 8554 -84114 -91566 -144154 -161765 -12333 -161589
11232a61589B66597c09748a40787c484j09469j15919H8936a68347C3431b6790
$$ -161589 266597 -309748 -140787 -3484 -112953 -228872 88936 -168347 33431 -26790
11221D9985d532j38661C93966A68189a00397K2867J8454j69887e1040J3328n0896
$$ 49985 -4532 -143193 393966 168189 -100397 -77530 -59076 -228963 -51040 -37712 -88608
11210h8608j36478C13347a26934A6440J40651f6017q9938A71898J32172g9557
$$ -88608 -225086 313347 -126934 16440 157091 -66017 -155955 171898 304070 -79557
11199B3852c6080m26073b00516A39864c11283A823a00152k738C8548g482A42995
$$ 23852 -36080 -462153 -200516 139864 -311283 1823 -100152 -102890 38548 -7482 142995
11187F387b45711j24531C28111b01476M2602g6044O868K6063q5599J1768H5170
$$ 6387 -245711 -370242 328111 -201476 -158874 -76044 -69176 -43113 -128712 -116944 85170
11175a7396k16779g4260k57931C02335a79410D1676a22656a2928A42586d3645
$$ -17396 -234175 -74260 -332191 302335 -179410 41676 -122656 -12928 142586 -43645
11164A53505K7347J28405I4570g0706B33863l2508b65358P5914B2466i8025C27489
$$ 153505 180852 309257 94570 -70706 233863 201355 -265358 -189444 22466 -98025 327489
11152e3068j33079C4737M0169B3536g5843B23055a54814F3412J91609I9849K8897
$$ -53068 -186147 34737 74906 23536 -75843 223055 -154814 63412 255021 99849 128746
11141A28746e9938j6759C21226r4215c8038j58275e071k3679R629j37616A33057
$$ 128746 -59938 -76697 321226 227011 -38038 -196313 -5071 -28750 -19121 -156737 133057
11129E3094J02036J20673a67418A41178l5180Q633L2322k1741n0338a00501n1757
$$ 53094 155130 275803 -167418 141178 105998 114631 146953 125212 74874 -100501 -152258
11118a52258A75883e8345G5570a03156A48613a46734e4386j8219G1103c5163K084
$$ -152258 175883 -58345 75570 -103156 148613 -146734 -54386 -72605 71103 -35163 -33079
11107c3079B56680a00185L0335j21092o3005G4622J20210J375c85696B63370o2410
$$ -33079 256680 -100185 -69850 -190942 -253947 74622 194832 196207 -385696 263370 200960
11096B00960o7047K7023K87223I3407h1309B82360Q9423J54996A39495R1897J23535
$$ 200960 133913 160936 448159 93407 -81309 282360 371783 526779 139495 231392 354927
11085C54927p5903O363J79701G6059J94477L95444E7526B3710J89680J82808K11469
$$ 354927 279024 285387 465088 76059 270536 665980 57526 23710 213390 396198 607667
11074F07667E3865J35018J59509J68122A07707J83563P2100J67045A49064J26313
$$ 607667 53865 188883 348392 516514 107707 291270 363370 530415 149064 275377
11064B75377J90690J50104j83204J55425J08236j84319P8921O7317k01925K50019
$$ 275377 466067 616171 432967 588392 696628 512309 591230 658547 456622 706641
11054G06641q3851L07270l16081J99068M724m6150N860r6012M67527j49100Q8831
$$ 706641 622790 930060 613979 813047 817771 771621 777481 681469 1148996 999896 1088727
11043A088727k41048O3321M17478l08457M3971l72483L49748O6077j77607R3046
$$ 1088727 847679 911000 1328478 1020021 1063992 691509 1041257 1107334 929727 1022773
11033A022773J7773p8685n7248K29318k52524L49122l54803j38417K08335R1093
$$ 1022773 1040546 961861 904613 1133931 881407 1230529 875726 737309 945644 1036737
11023A036737r4411m3646k31257J63504K9360k69127N71702m72987P2457j48555
$$ 1036737 942326 898680 667423 830927 860287 591160 1162862 689875 762332 613777
11013F13777K4560N9352J5378K93486p7453k43672k0823K00021o2528r0885j65005
$$ 613777 638337 697689 713067 1006553 929100 685428 664605 864626 802098 711213 546208
11002E46208J61395K35887l30401J14968J14742p4606j81163M25573j51243j58307
$$ 546208 707603 943490 613089 728057 842799 768193 587030 1012603 861360 703053
10992G03053J31670j91104K58240l5196j04349L66385l04063K24816j68689J44606
$$ 703053 834723 643619 901859 866663 762314 1128699 824636 1049452 880763 1025369
10982A025369k17619K0437J72831M8793K02268j43634P88O0467P32639n10072
$$ 1025369 807750 828187 1001018 1049811 1252079 1108445 1109233 1169700 1902339 1392267
10972A392267M75174J53822M53187j09735L39540M87426N28379l05538M28204
$$ 1392267 1867441 2021263 2474450 2364715 2704255 3191681 3720060 3414522 3842726
10963C842726k10606M18861o60293k54789j071032K73936n57544L84219q91225
$$ 3842726 3632120 4050981 3390688 3135899 2064867 2338803 1781259 2165478 1274253
10954A274253J85668M27509k29104J2410j13968m50954P3034J04220m22106N35670
$$ 1274253 1459921 1887430 1658326 1670736 1556768 1105814 1178848 1283068 860962 1396632
10944A396632C56772J98507k6290j91748F5864L01482h1204A05979a23416C16338
$$ 1396632 356772 555279 528989 337241 65864 367346 -81204 105979 -123416 316338
10933A05556K39246A32490R328k2660K0162J2543a52310C1913i3683A10023J4406
$$ 105556 344802 132490 141818 119158 139320 151863 -152310 31913 -93683 110023 124429
10922A24429l6032a44884H4104i4844A08743P9081D7157K9663M5428J99350e1784
$$ 124429 88397 -144884 84104 -94844 108743 187824 47157 76820 122248 321598 -51784
10910f6336K3736A35024b18348A65842C7344a6527A65890F0246M0007g2757j4696
$$ -66336 -42600 135024 -218348 165842 37344 -16527 165890 60246 100253 -72757 -87453
10899h7453l79520B36596r3634a489B32597a49656D54864j94782a52199f9285
$$ -87453 -466973 236596 142962 -1489 232597 -149656 454864 260082 -152199 -69285
10888a17486j28719A93877G8691d62631E4481a74430N1172j14175M8542h8674
$$ -117486 -246205 193877 78691 -462631 54481 -174430 -123258 -237433 -188891 -88674
10877b20633r4267a34853o591j72225A11713m588c9497E4333g3117o1904K9861
$$ -220633 -314900 -134853 -141444 -313669 111713 107125 -39497 54333 -73117 -135021 -105160
10866a05160e2052A03076g4038q4868C72110a87283C23431b02411c6372B16030
$$ -105160 -52052 103076 -74038 -158906 372110 -187283 323431 -202411 -36372 216030
10855A60878i1276J2561A05841b27752e7244o7807B25928m467p4510h2799l0091
$$ 160878 -91276 -78715 105841 -227752 -57244 -125051 225928 221461 146951 -82799 -112890
10844a12890F9903h6689C25344A29284J39307J8700c62201A21486i0119A63864
$$ -112890 69903 -86689 325344 129284 268591 287291 -362201 121486 -90119 163864
10833a49017K1430l8461L350m0568p411a1856C0534b47047M5430c5893J5389M243
$$ -149017 -127587 -166048 -162698 -203266 -210677 -11856 30534 -247047 -201617 -35893 -20504 -16261
10821a6261k48444A72873G8276L0733A6536d0A82503M5155d4131A14986A167K75170
$$ -16261 -264705 172873 78276 109009 16536 -40 182503 227658 -44131 114986 1167 276337
10809B76337h8689h001m84635F0448h6760k7507B74344b55346J06844G2367a39117
$$ 276337 -88689 -8001 -492636 60448 -86760 -114267 274344 -255346 -148502 72367 -139117
10797B95146r3070d338k24349M5633A06620e78708A87574q1046a4833D4568a7846
$$ 295146 202076 -4338 -228687 -183054 106620 -578708 187574 106528 -14833 44568 -17846
10785a05215l500c7854j90783A71493A721M9127b3528G5892a84443j41681J43186
$$ -105215 -108715 -37854 -228637 171493 1721 50848 -23528 75892 -184443 -326124 -182938
10774a82938d2418k44103A67415J5897n8541J60243b59376O3844A91763g9953
$$ -182938 -42418 -286521 167415 183312 124771 285014 -259376 -195532 191763 -79953
10763B14001C2006b16741B83546g4125j62464A457h8883L2843k58356m8999J65707
$$ 214001 32006 -216741 283546 -74125 -236589 1457 -88883 -56040 -314396 -363395 -197688
10752a97688g0931C68173H065P0332k5483L58187b06542B4255a97275i7648q0936
$$ -197688 -70931 368173 8065 78397 52914 411101 -206542 24255 -197275 -97648 -178584
10741a78584A88014K8357c2018A25006d0952i900k23855g3608A12266C4907a8689
$$ -178584 188014 216371 -32018 125006 -40952 -9900 -233755 -73608 112266 34907 -18689
10729G9154b30342P3998A57846J10339f307A68309G5674P4365c72427a82650B92925
$$ 79154 -230342 -156344 157846 268185 -6307 168309 75674 150039 -372427 -182650 292925
10717B5971P7639m3581b93148a37618A16138b49471a05006I6611a46253B39399
$$ 25971 103610 60029 -293148 -137618 116138 -249471 -105006 96611 -146253 239399
10706d1887D0057f14285H3987n847c6657r8517r0722A37857E149d30892A37702
$$ -41887 40057 -614285 83987 78140 -36657 -135174 -225896 137857 5149 -430892 137702
10694C33638f3560A9031p439b63322M4757B1534a58882e0721C83869b89519J24917
$$ 333638 -63560 19031 11592 -263322 -218565 21534 -158882 -50721 383869 -289519 -164602
10683a64602M1864L9887A13873c58459i9518o2955j91242a08682c1292A85101
$$ -164602 -122738 -82851 113873 -358459 -99518 -162473 -353715 -108682 -31292 185101
10672B67043b46691i1602A212h5794M2240A39388i2533j75138d3041m3625k38251
$$ 267043 -246691 -91602 1212 -85794 -43554 139388 -92533 -267671 -43041 -86666 -324917
10661c24917p7070R0078A32558b45947e9184j30710c6384j65803J00856r2757
$$ -324917 -401987 -311909 132558 -245947 -59184 -189894 -36384 -202187 -101331 -194088
10651a94088k0049J5308h9905C896i9071k92228B2621J19247B0442O8232i2269
$$ -194088 -214137 -198829 -89905 3896 -99071 -391299 22621 141868 20442 88674 -92269
10639a09315k06764g3032b8240l33732A04491J0319b87815J18084j180B18129
$$ -109315 -316079 -73032 -28240 -361972 104491 114810 -287815 -169731 -170911 218129
10628a88429P0628n4832R846f782p8907k31377H9213j5501b64361d1455B96603
$$ -188429 -117801 -172633 -162787 -6782 -85689 -317066 89213 73712 -264361 -41455 296603
10616c6901a4092k36777c0579D7707d21123D9948c1498H1427A685c57952e8641
$$ -36901 -14092 -250869 -30579 47707 -421123 49948 -31498 81427 1685 -357952 -58641
10604b55422O0915M9779b5958I9389a18733r9263B73533q3366C9468b68961A810
$$ -255422 -194507 -144728 -25958 99389 -118733 -217996 273533 190167 39468 -268961 1810
10592C9712b99803E3562b54650O0479m5438A03478R1530o6725f5992C48305c1932
$$ 39712 -299803 53562 -254650 -194171 -239609 103478 195008 128283 -65992 348305 -31932
10580f5819k09521B12609G3182c2118A10513b00236e7219m866G0956j8099b11486
$$ -65819 -275340 212609 73182 -32118 110513 -200236 -57219 -62085 70956 52857 -211486
10568c61548A45336m9324l1344Q1210F7759b57354B44148H0386J07157j7699b1455
$$ -361548 145336 96012 64668 145878 67759 -257354 244148 80386 187543 169844 -21455
10556A22717g8314q2083C67442e6037B03216e1984G8700C3826a12345A06167h7886
$$ 122717 -78314 -160397 367442 -56037 203216 -51984 78700 33826 -112345 106167 -87886
10544a56642A1904M7056A0400c41372a2074E0214O0918a0285j006C12909A41267
$$ -156642 11904 58960 10400 -341372 -12074 50214 111132 -10285 -11291 312909 141267
10532a00691H9064e4323q9623A2299k344b17357A37375C5692a21038C8460J57013
$$ -100691 89064 -54323 -143946 12299 9955 -217357 137375 35692 -121038 38460 195473
10521A95473b0304j3803r8111J4855D5552g6727o3403a8014A21818a50807A11193
$$ 195473 -20304 -34107 -132218 -117363 45552 -76727 -140130 -18014 121818 -150807 111193
10509e6672l24233J70783k3780m1530L9263M0317D7253a36926k45332a53338P4739
$$ -56672 -380905 -210122 -233902 -275432 -236169 -195852 47253 -136926 -382258 -153338 -78599
10498g8599j82685h197k34293B1100a67171C54668c40792l5361c9035A81892c94729
$$ -78599 -261284 -8197 -242490 21100 -167171 354668 -340792 -376153 -39035 181892 -394729
10486E8558a76390F3376b38753b6827q6230I2222B6186b089C7354b39984N5436
$$ 58558 -176390 63376 -238753 -26827 -113057 92222 26186 -2089 37354 -239984 -184548
10475a84548A68881R2222D8695L23704C8436a3486j43036f0999A63783a19964
$$ -184548 168881 261103 48695 372399 38436 -13486 -156522 -60999 163783 -119964
10464B28048e3337f164B4350P3943J63541A6296K3212a92134e8181B62126A2070
$$ 228048 -53337 -6164 24350 98293 261834 16296 39508 -192134 -58181 262126 12070
10452b2409C8138c31755h8828C5253L00931G1567k6210i6872L3707E3587K30827
$$ -22409 38138 -331755 -88828 35253 336184 71567 45357 -96872 -63165 53587 284414
10441B84414b05737A3077b08791A03243h7150k06895a3061D08781A90282N8637
$$ 284414 -205737 13077 -208791 103243 -87150 -294045 -13061 408781 190282 248919
10431B48919b38924R6098e8015k6263g558j44817C0653a33350A17428c43878D5964
$$ 248919 -238924 -142826 -58015 -84278 -7558 -152375 30653 -133350 117428 -343878 45964
10419b93359a00699j97963A89507c9797B15220b08617i384n6431r9868j12881
$$ -293359 -100699 -298662 189507 -39797 215220 -208617 -9384 -65815 -165683 -278564
10409b78564a09378c9917A21928a69272A26284n2425a68242B02025F3496h3874
$$ -278564 -109378 -39917 121928 -169272 126284 73859 -168242 202025 63496 -83874
10398i6204r6216D6717g9000A97992a91994B48279N7926A39977K38544o9270I1693
$$ -96204 -192420 46717 -79000 197992 -191994 248279 306205 139977 378521 309251 91693
10386e2830B10229b0177C02805b01098A21324M4691P4219f2226A38334Q9153H7592
$$ -52830 210229 -20177 302805 -201098 121324 166015 240234 -62226 138334 227487 87592
10374D12491A51877m856K83608A16764K69477N3912j08173J77478B00496L9928
$$ 412491 151877 147021 430629 116764 386241 440153 331980 509458 200496 240424
10364B40424K59611J89378j90535J56915j49117K2643k43441J02046q4178M8583
$$ 240424 500035 689413 498878 655793 506676 529319 285878 387924 303746 352329
10354C52329j22167o6026h1485B72986b21007C67160R4433J58545K24768D20420
$$ 352329 230162 164136 -81485 272986 -221007 367160 461593 620138 844906 420420
10343H01080C21220P5155j95582K37284K58565B40737p0238q2427M04987A01201
$$ 801080 321220 396375 200793 438077 696642 240737 170499 88072 493059 101201
10332H4215L50330F8061R9538L44922A74309a61661A71040D5653h0399D74041
$$ 84215 434545 68061 167599 512521 174309 -161661 171040 45653 -80399 474041
10321C84151O1013A54062J16076a5157A16918a2032A24040l5881J05141K3453
$$ 384151 445164 154062 270138 -15157 116918 -12032 124040 88159 193300 216753
10311B16753b53200B9208b07483m8600d2377A70786a41216c7454j85164E6659
$$ 216753 -253200 29208 -207483 -256083 -42377 170786 -141216 -37454 -222618 56659
10300B3903J7951a71043g4298k15788f8312A44758c4044C8618J03236J07567d7076
$$ 23903 41854 -171043 -74298 -290086 -68312 144758 -34044 38618 141854 249421 -47076
10288a34166A71583b33549A16810i2128K5320j26565h6549r3824A81422e7177
$$ -134166 171583 -233549 116810 -92128 -66808 -193373 -86549 -180373 181422 -57177
10277a15282k7110m7412A40667N925f8693A17314b20912j49490E42g9137A83398
$$ -115282 -142392 -189804 140667 146592 -68693 117314 -220912 -370402 542 -79137 183398
10265h1348K7585k31448a30662L7970F6763J87349I4287J79267j34065J2822J18680
$$ -81348 -53763 -285211 -130662 -92692 66763 254112 94287 273554 139489 152311 270991
10254B70991M5254I6771J36295C5537K35264p866E452J4282L93630j32004A14503
$$ 270991 316245 96771 233066 35537 270801 262935 5452 19734 413364 281360 114503
10242B22482d4618F4342h4417L549B7120a31256A06928a48305H8289K8304c4262
$$ 222482 -44618 64342 -84417 -80868 27120 -131256 106928 -148305 88289 116593 -34262
10230E2525O1328e12l6307q1321C49209j47172b39216i2047G7934K69964j47211
$$ 52525 113853 -512 -36819 -118140 349209 202037 -239216 -92047 77934 347898 200687
10219B00687a14832k53343J24722b1028r8333q4102j333c3085a2809k2499F8607
$$ 200687 -114832 -368175 -243453 -21028 -119361 -203463 -204796 -33085 -12809 -35308 68607
10207A07693J13199r9001E9770b80777E9636O085j031h2878j14829B19602D5092
$$ 107693 220892 121891 59770 -280777 59636 65721 64690 -82878 -197707 219602 45092
10195A50184a48471M4904C4117M6485a42687j86954a56284g7940H0679b33158
$$ 150184 -148471 -103567 34117 80602 -142687 -329641 -156284 -77940 80679 -233158
10184c16549H3602K56672g1814C2222e3765J9349l4859A75056E8618J13616b58597
$$ -316549 83602 340274 -71814 32222 -53765 -34416 -69275 175056 58618 172234 -258597
10172g3515p2458A49102d02613J71867l9451R5596o9757O2564g1481H2634b77143
$$ -73515 -145973 149102 -402613 -230746 -270197 -174601 -244358 -181794 -71481 82634 -277143
10160A676b4063J0780j30577j54646E994R2301a92501D22073d4233G6451a72238
$$ 1676 -24063 -13283 -143860 -298506 5994 98295 -192501 422073 -44233 76451 -172238
10148B6943a14854I9527K8974a11720K4500M0286A89670g0266j13599p0321j92304
$$ 26943 -114854 99527 128501 -111720 -87220 -46934 189670 -70266 -183865 -254186 -446490
10137d46490c2500H679i8091N521r8636h7310p8715H7322a69031n7478B02499
$$ -446490 -32500 8679 -98091 -92570 -191206 -87310 -166025 87322 -169031 -226509 202499
10125e8209q4594B57873j11901a28381A51105a39075l9734g7883J9640B60433
$$ -58209 -142803 257873 145972 -128381 151105 -139075 -178809 -77883 -58243 260433
10114a05835p6567k0244C70385A73881K1509b69332B13218N8903c18290g4545
$$ -105835 -182402 -202646 370385 173881 195390 -269332 213218 272121 -318290 -74545
10103b17251Q4388p2081j49667P7212R7977N9674A81963a02301j72224P296a14771
$$ -217251 -132863 -204944 -354611 -277399 -179422 -119748 181963 -102301 -274525 -267229 -114771
10091a39167K0593I3014E255O675b48879j62011d7163B2145c6389A08921J68660
$$ -139167 -118574 93014 5255 11930 -248879 -410890 -47163 22145 -36389 108921 277581
10080B77581a9169j38598E06103b07258l6777a21419K5365C3352J38730G2618
$$ 277581 -19169 -157767 506103 -207258 -244035 -121419 -96054 33352 172082 72618
10069a38649n768F6683K6935c74456a68626g6299j02225j01080j20568a44183
$$ -138649 -144417 66683 93618 -374456 -168626 -76299 -178524 -279604 -400172 -144183
10058A26191k4353g0216q8931l44690b28778H0877h2094I3018a87344C69059a61879
$$ 126191 101838 -70216 -159147 -503837 -228778 80877 -82094 93018 -187344 369059 -161879
10046b98655C47382a42928l7835e8746k04897G553b13970B32442c71135P3413
$$ -298655 347382 -142928 -180763 -58746 -263643 7553 -213970 232442 -371135 -297722
10036b97722k3205e0684J2803A87790a46918O3770j25982E6863c69286f8445j25559
$$ -297722 -320927 -50684 -37881 187790 -146918 -83148 -209130 56863 -369286 -68445 -194004
10025a94004c8029j50423M0334F4615k7781a07230j72699f2830p4964N0497D871
$$ -194004 -38029 -188452 -148118 64615 36834 -107230 -279929 -62830 -137794 -87297 4871
10013D3043k0022N3407a20718A20592e9715g760j78731g6320j88296d9567p875
$$ 43043 23021 76428 -120718 120592 -59715 -7760 -186491 -76320 -264616 -49567 -57442
10002e7442j2258A84357d72407h782j41294H0704k8320O4836b89121c3971q6132
$$ -57442 -69700 184357 -472407 -8782 -150076 80704 52384 117220 -289121 -33971 -120103
9991a20103c3096j22330d5977B31947D5733J25756c22469J16030c3656e256A92125
$$ -120103 -33096 -155426 -45977 231947 45733 171489 -322469 -206439 -33656 -5256 192125
9979i3466l09001E2094a43294B94266C6066A713f8426k11963e3158l10251O1741
$$ -93466 -402467 52094 -143294 294266 36066 1713 -68426 -280389 -53158 -363409 -301668
9968c01668I5883h805k36079A05435A3506g6466l16379b2076r065D6045b44618
$$ -301668 95883 -8805 -244884 105435 13506 -76466 -392845 -22076 -31141 46045 -244618
9956e4641k30786a28949M9792D4587I50a59810m45009A93950C4286b71518c1846
$$ -54641 -285427 -128949 -79157 44587 950 -159810 -604819 193950 34286 -271518 -31846
9944E5044P9378a48909F1302J2142a0732C7820M1977N2647b74524e61C6728b19997
$$ 55044 134422 -148909 61302 73444 -10732 37820 79797 132444 -274524 -561 36728 -219997
9931I8163Q5746a92312J1733e8228j52223Q8126A14662d588j7724j18278o3600
$$ 98163 183909 -192312 -180579 -58228 -210451 -122325 114662 -4588 -22312 -140590 -204190
9920b04190G8869K6547G85L7954d114q4650a2264q8525c6982k90695N9947c9222
$$ -204190 78869 105416 785 38739 -4114 -88764 -12264 -100789 -36982 -327677 -267730 -39222
9907A06011a26450L4359L3723b6981l81402J04798a38497j47344E7002J64004
$$ 106011 -126450 -92091 -58368 -26981 -408383 -303585 -138497 -285841 57002 221006
9897B21006a56737I0b25239f2174D30997O4436G0809h4278j37822q0017g9435
$$ 221006 -156737 90 -225239 -62174 430997 495433 70809 -84278 -222100 -302117 -79435
9885b56229D7788a40195L0134C01343C0034b20614b114n8997H3335a8263p7706
$$ -256229 47788 -140195 -110061 301343 30034 -220614 -2114 -61111 83335 -18263 -95969
9874i5969b672j22539A84017i0943a8650k09305L4739l0259L0343B4580a14647
$$ -95969 -2672 -125211 184017 -90943 -18650 -227955 -193216 -223475 -193132 24580 -114647
9862A56520a86686M0262J6114M3043l3723j37346J12699B53350a87684Q1456M8444
$$ 156520 -186686 -146424 -130310 -87267 -120990 -258336 -145637 253350 -187684 -106228 -57784
9851e7784D7169i4144c5180Ic7133l5611b7886G2781O1218h931A81560B7044e158
$$ -57784 47169 -94144 -35180 9 -37133 -72744 -27886 72781 133999 -8931 181560 27044 -5158
9837a02112C64735G3649b36703b9386B24975b11248j03174C5187J1316K24163
$$ -102112 364735 73649 -236703 -29386 224975 -211248 -314422 35187 46503 270666
9827B70666a7548k31693D3917O566b90529g9576j0526o7223C57742a66928f9091
$$ 270666 -17548 -249241 43917 50483 -290529 -79576 -90102 -157325 357742 -166928 -69091
9815a14424L2528B18381b6435j0262A1131Q565a48439a6372D17791a00555d1208
$$ -114424 -81896 218381 -26435 -36697 11131 19696 -148439 -16372 417791 -100555 -41208
9803c42415e9868j27481o2873C3092c61142A53688c14169E6346k403M3624j4628
$$ -342415 -59868 -187349 -250222 33092 -361142 153688 -314169 56346 53943 97567 82939
9792H2939Q9751H5895K1370i8835B61599b24980A89561p6929h7037E2147e02911
$$ 82939 172690 85895 107265 -98835 261599 -224980 189561 112632 -87037 52147 -502911
9780E1930b80758j6860j3894J08975Q6549e7375p1291j08713E3329b22742Q6782
$$ 51930 -280758 -297618 -311512 -202537 -115988 -57375 -128666 -237379 53329 -222742 -135960
9769a35960b796j87111B95011a18852j45470h9073E8359a57077O737l67905K41617
$$ -135960 -2796 -189907 295011 -118852 -264322 -89073 58359 -157077 -150340 -518245 -276628
9758b76628J7018M3146A97374b18065o7439h9046L4105j33898i2377j18067J01011
$$ -276628 -259610 -216464 197374 -218065 -285504 -89046 -54941 -188839 -92377 -210444 -109433
9747a09433E5199M0852i0122j94143A01983a12407A42463b7205C8985a66802I4361
$$ -109433 55199 96051 -90122 -284265 101983 -112407 142463 -27205 38985 -166802 94361
9735A56641B8258d2144G2035e4205F0347a75273g3659l8575A43906O8330a38224
$$ 156641 28258 -42144 72035 -54205 60347 -175273 -73659 -112234 143906 212236 -138224
9723b19302f4583j76087k58554K17780J8429K2227a10009o9844A7138d9558j23926
$$ -219302 -64583 -240670 -499224 -281444 -263015 -240788 -110009 -179853 17138 -49558 -173484
9712a73484m6765A74998B2934J15125a46952A94791a33201C2766a48039A05434
$$ -173484 -220249 174998 22934 138059 -146952 194791 -133201 32766 -148039 105434
9701a46473A25935d9842b1233l21776i8632E4259K32201D4206C404b22462J10532
$$ -146473 125935 -49842 -21233 -343009 -98632 54259 286460 44206 3404 -222462 -111930
9690a11930N2086j36052f6732A50093b67402L2296k4959R172r9909h2823j58344
$$ -111930 -59844 -195896 -66732 150093 -267402 -235106 -260065 -250893 -350802 -82823 -241167
9679b41167j23131e6972k03509J22031A7474F277K11585a12310R30a8024j82263
$$ -241167 -364298 -56972 -260481 -138450 17474 6277 217862 -112310 -111380 -18024 -200287
9668b00287A19995b38223A0266a8990j81476R785b0204l4922m6406b217j87858
$$ -200287 119995 -238223 10266 -18990 -200466 -190681 -20204 -55126 -101532 -2217 -190075
9657a90075G7113a69085j19479e1929C581a31387B60043B4141c24289I6561b17781
$$ -190075 77113 -169085 -288564 -51929 3581 -131387 260043 24141 -324289 96561 -217781
9645H878a7447j17238C16540f3416I408b33506J12534j94014c7177P713j23866
$$ 8878 -17447 -134685 316540 -63416 9408 -233506 -120972 -314986 -37177 -29464 -153330
9634a53330b2276j73475A7633b01036C83925d3464J0646C7903J32639a15086m9662
$$ -153330 -22276 -195751 17633 -201036 383925 -43464 -32818 37903 170542 -115086 -164748
9623a64748N6460B26803j03130Q7031E9172a28951A05635f7120k57366R8870K5473
$$ -164748 -108288 226803 123673 210704 59172 -128951 105635 -67120 -324486 -225616 -200143
9612b00143D7214i0704D20969a69208Q2031D6102L1497r489J20533a75173m8192
$$ -200143 47214 -90704 420969 -169208 -87177 46102 77599 68110 188643 -175173 -223365
9601b23365J10779Q492j88505a7275m5811j1048k9984m0938A3645f2403A28748
$$ -223365 -112586 -104094 -292599 -17275 -63086 -74134 -104118 -145056 13645 -62403 128748
9589a65449J8564J4684l1792H3594a71137L3679j72016J9437q94B03194a62158
$$ -165449 -146885 -132201 -163993 83594 -171137 -137458 -309474 -290037 -290931 203194 -162158
9577G3971f0916a2710k09271Q6577A94860r6426d4588A77422L2382b6448k40335
$$ 73971 -60916 -12710 -221981 -135404 194860 98434 -44588 177422 209804 -26448 -266783
9566b66783g0665r206j22950j01745C53953e74260A40508c81456A7682c5790h182
$$ -266783 -70665 -79871 -202821 -304566 353953 -574260 140508 -381456 17682 -35790 -8182
9554f9327H643a42465j99688a23336j45154A1981J88303q2646b45467k6021A5246
$$ -69327 8643 -142465 -342153 -123336 -268490 11981 200284 117638 -245467 -271488 15246
9542b01111B73133E0162a3697j98284C7481J17459k9788f9010j29460B16373g403
$$ -201111 273133 50162 -13697 -211981 37481 154940 125152 -69010 -198470 216373 -7403
9530A63618M7565a19762E8865a1033j24889j66096J2480I337K57497A7749a4379
$$ 163618 211183 -119762 58865 -11033 -135922 -302018 -289538 9337 266834 17749 -14379
9518i4383j59505j43463A00153b54707a9372I4600b99274a31434A06564O920b29239
$$ -94383 -253888 -397351 100153 -254707 -19372 94600 -299274 -131434 106564 113484 -229239
9506c13700a39138a8451j13337d1503l90468e3574j6485C8606h3406I2990D3515
$$ -313700 -139138 -18451 -131788 -41503 -431971 -53574 -70059 38606 -83406 92990 43515
9494B9255d62843Q4278A26652b9942k05128R8880A9563c71905e85m4345j00832
$$ 29255 -462843 -378565 126652 -29942 -235070 -136190 19563 -371905 -585 -44930 -145762
9483a45762h80n4129A12878b97698c8878r5602d1632l64495J46425A48708K4228
$$ -145762 -880 -55009 112878 -297698 -38878 -134480 -41632 -406127 -259702 148708 172936
9472A72936o2081j8297k904K9995b2774L488D2655K0506A1662c2022r0848r4005
$$ 172936 110855 92558 89654 119649 -22774 -19286 42655 63161 11662 -32022 -122870 -216875
9460b16875A88765a43904f7042k13424j23924K7732A9791J22147c02004B61274
$$ -216875 188765 -143904 -67042 -280466 -404390 -376658 19791 141938 -302004 261274
9449h2685A8738a36006j3128A26653a99160A4662b32288j03182J23769B46567
$$ -82685 18738 -136006 -149134 126653 -199160 14662 -232288 -335470 -211701 246567
9438a08147A40580a78194O7285L2455m10325a83384r7012A30115j3516d2065B34856
$$ -108147 140580 -178194 -110909 -78454 -488779 -183384 -280396 130115 116599 -42065 234856
9426a08301j34916A27874c5728A2775O3771L312J14733c33674b3362j89585A54727
$$ -108301 -243217 127874 -35728 12775 76546 79858 194591 -333674 -23362 -212947 154727
9414b59769a5231j21126A99130D6420e22730J50714B0162b6476f774j52802f6444
$$ -259769 -15231 -136357 199130 46420 -522730 -372016 20162 -26476 -6774 -159576 -66444
9402A06962K5361g382c175j23762b6713o6215j94253A18339a35579A94725B680
$$ 106962 132323 -7382 -3175 -126937 -26713 -92928 -287181 118339 -135579 194725 2680
9390a52855G1247a98878l1231A62469b11420G1292Q1142j5391A685a9628j95586
$$ -152855 71247 -198878 -230109 162469 -211420 71292 152434 137043 1685 -19628 -215214
9379b15214Q0228k25232K7055d3278k7562q6253B40196c16618J52780B1778J04620
$$ -215214 -134986 -360218 -333163 -43278 -70840 -157093 240196 -316618 -163838 21778 126398
9368A26398f8626A64718G1832k9992K6351b46714A08456a71851J2649j3227J2034
$$ 126398 -68626 164718 71832 41840 68191 -246714 108456 -171851 -159202 -172429 -160395
9357a60395A26631a15774e2065e576k8110q846j78789A02229l4700a49301K682
$$ -160395 126631 -115774 -52065 -5576 -33686 -42532 -221321 102229 67529 -149301 -146619
9346a46619p7232D2491J88252J3214f8636B72361a32140l21995a86987o5653A25697
$$ -146619 -223851 42491 230743 243957 -68636 272361 -132140 -454135 -186987 -252640 125697
9334a5899j23190J1302B04223e6451n4846J84j0461j34511J26555f0343C16286
$$ -15899 -139089 -127787 204223 -56451 -111297 -111113 -121574 -256085 -129530 -60343 316286
9322A23574c57977a74892o021e6213l81841F0046e8936l14088B96270i0928j3846
$$ 123574 -357977 -174892 -180913 -56213 -438054 60046 -58936 -373024 296270 -90928 -104774
9311a04774q4952c399m2741j14503d2770a9437k85373a32189B39943a94148H757
$$ -104774 -189726 -3399 -46140 -160643 -42770 -19437 -304810 -132189 239943 -194148 8757
9299C2786J11135b74016E1198a34098Q151N3612l3288A47030j8428c9380o2446
$$ 32786 143921 -274016 51198 -134098 -125947 -72335 -105623 147030 128602 -39380 -101826
9288a01826A26774A7299c02730i0018D9117d9635l4233B97583b04594l4814b1674
$$ -101826 126774 17299 -302730 -90018 49117 -49635 -83868 297583 -204594 -239408 -21674
9276B9211b95564l239g5556n2430A56780J1711b27418g6521j48554K8394E3516
$$ 29211 -295564 -298803 -75556 -127986 156780 168491 -227418 -76521 -225075 -196681 53516
9264A05140D7295k2036J7439e5983H1544A1734c88251J53365B21443c9282E5166
$$ 105140 47295 25259 42698 -55983 81544 11734 -388251 -234886 221443 -39282 55166
9252c1390C6463a01715o3022j45214B2588d8970k97455A26944k5071a8661H4764
$$ -31390 36463 -101715 -164737 -309951 22588 -48970 -346425 126944 101873 -18661 84764
9240g5422k19733o6401H961b5082l19586B89009f985A59270m9218a82373k77409
$$ -75422 -295155 -361556 8961 -25082 -344668 289009 -6985 159270 110052 -182373 -459782
9229d59782g3975j33473R4342j3272C48994j08843B183d1442A93290i8397B03163
$$ -459782 -73975 -207448 -113106 -126378 348994 240151 2183 -41442 193290 -98397 203163
9217e7681j40623C11119a55955j4742D701a63330l08141K26033C5014f1144K8182
$$ -57681 -198304 311119 -155955 -170697 4701 -163330 -471471 -245438 35014 -61144 -32962
9206c2962A7256F15e8424D9637i1610k66057a91j92541b1089l28603J18424j8064
$$ -32962 17256 615 -58424 49637 -91610 -357667 -191 -192732 -21089 -349692 -231268 -249332
9194b49332G8989L5963a74507o7352A17152d59322a46034p535O8279B24029a30012
$$ -249332 78989 114952 -174507 -241859 117152 -459322 -146034 -153569 -85290 224029 -130012
9182D2823b67819a15912K0973j13349R4140B62614a29829J8020l5895l806K7547
$$ 42823 -267819 -115912 -94939 -208288 -114148 262614 -129829 -111809 -147704 -151510 -123963
9171a23963A2313a74509H0554P7413R3487a75769C2J2363i5648l0177b8610C7495
$$ -123963 12313 -174509 80554 157967 251454 -175769 32 12395 -95648 -125825 -28610 37495
9158b0134l07090h4978E1971i2239a9697B58158c83805E6583h7150Q373F119c06883
$$ -20134 -327224 -84978 51971 -92239 -19697 258158 -383805 56583 -87150 -78777 6119 -306883
9145b46766j77797a66766I1152c16712i9262B10142q2578M5683B1350a06801A42604
$$ -246766 -424563 -166766 91152 -316712 -99262 210142 127564 173247 21350 -106801 142604
9133a76071O1861L7814F6701c80522G9845c91805i9271G1771b50048O1253k1965
$$ -176071 -114210 -76396 66701 -380522 79845 -391805 -99271 71771 -250048 -188795 -210760
9122b10760O4351D8086L2703d2687j18986j10924A60506g4664j10104B31077H807
$$ -210760 -146409 48086 80789 -42687 -161673 -272597 160506 -74664 -184768 231077 8807
9110a6784j46748j76148f5056j18783G1106a25431l1974B5957f1729A04822a54408
$$ -16784 -163532 -339680 -65056 -183839 71106 -125431 -157405 25957 -61729 104822 -154408
9098a12313D6837J00222c33976A51101O0180a19135n1397C0444a66083e2406G973
$$ -112313 46837 147059 -333976 151101 211281 -119135 -170532 30444 -166083 -52406 7973
9086D8335a65150l1258l29541A4667c10047a51787e3610j60931b7191D185b20854
$$ 48335 -165150 -196408 -525949 14667 -310047 -151787 -53610 -214541 -27191 4185 -220854
9074A74777a53741A57722k7043E1539K57196b17310n2784a22734B48354A1739
$$ 174777 -153741 157722 130679 51539 308735 -217310 -270094 -122734 248354 11739
9063a68716A28674N5618K6077J8723b6252E5514c98260a52807P2685j04325C25804
$$ -168716 128674 184292 210369 229092 -26252 55514 -398260 -152807 -80122 -184447 325804
9051a4744k17301B27164b78854K7983A11596a76596B75923a75234j14980J33952
$$ -14744 -232045 227164 -278854 -250871 111596 -176596 275923 -175234 -290214 -156262
9041a56262c2544H7912A8656K0141A6531J80244A1196g0060k12943K6524b7981
$$ -156262 -32544 87912 18656 38797 16531 196775 11196 -70060 -283003 -256479 -27981
9029A2545A041b23516R6989j2679D6189c21762A67323G6429g7211m7895q487r773
$$ 12545 1041 -223516 -126527 -139206 46189 -321762 167323 76429 -77211 -125106 -133593 -143366
9017a43366k6238A51543D205J9182b2690j65400L5753K3801q9830B9273P8499
$$ -143366 -169604 151543 4205 23387 -22690 -188090 -152337 -128536 -218366 29273 107772
9006A07772a54761O1585A02479J8951a12118o1436A94976c742q446q081A19623
$$ 107772 -154761 -93176 102479 121430 -112118 -173554 194976 -3742 -12188 -20269 119623
8994a40606c5483q1314N0203k4492n3201R438n0375l6174O698R7467j57070B468
$$ -140606 -35483 -116797 -66594 -91086 -144287 -134849 -185224 -221398 -214700 -117233 -274303 2468
8981g6069m1429g253l87252c305A46738M3015p7219R1112d9600j96354e044j08598
$$ -76069 -117498 -7253 -394505 -3305 146738 189753 112534 203646 -49600 -245954 -5044 -113642
8969a13642H3768J14099c20481a15413o6851L7232d4693j25395A61492A749b81050
$$ -113642 83768 197867 -320481 -115413 -182264 -145032 -44693 -170088 161492 1749 -281050
8957B334d8034m2656j39498R1871e4376A08677K3076A0282Q6332Q3641E0883b93801
$$ 2334 -48034 -90690 -230188 -138317 -54376 108677 131753 10282 96614 180255 50883 -293801
8944A7371N8795g376H1801b37633g5959L4338k059a5451D7932a30632E4302e1076
$$ 17371 76166 -7376 81801 -237633 -75959 -41621 -43680 -15451 47932 -130632 54302 -51076
8931A29912i8353G6990b35342a01870d9314A52279J4916c4962A20957b12558F5467
$$ 129912 -98353 76990 -235342 -101870 -49314 152279 167195 -34962 120957 -212558 65467
8919B87751A32597N37848A02459a97421J6639j08885B88910A4135a10894A76886
$$ 287751 132597 670445 102459 -197421 -180782 -289667 288910 14135 -110894 176886
8908c12296N8756a14046l02150f2447G5979a79174a2722B06171f1531B0114K93274
$$ -312296 -253540 -114046 -416196 -62447 75979 -179174 -12722 206171 -61531 20114 313388
8897C13388f7258n036k3977E4324K7899b43395G4166a232j3344r9964L211N1115
$$ 313388 -67258 -72294 -96271 54324 82223 -243395 74166 -1232 -14576 -114540 -111329 -60214
8885f0214k32303A33468a07589G9609a56174p9207j37277g8275p197k67B09572
$$ -60214 -292517 133468 -107589 79609 -156174 -235381 -372658 -78275 -85472 -85739 209572
8873A6604b47023h7675C3254J75502f2102j80695N0645J9243D1241a25652k3248
$$ 16604 -247023 -87675 33254 208756 -62102 -242797 -192152 -172909 41241 -125652 -148900
8862a48900J3574a042G1563b10948e5333A64260J09868H8571a58570b5652B13535
$$ -148900 -135326 -1042 71563 -210948 -55333 164260 274128 88571 -158570 -25652 213535
8850A72580J59272A41864a0382j6697j12998A57625a0841q847j39483B65508C114
$$ 172580 331852 141864 -10382 -27079 -140077 157625 -10841 -19688 -159171 265508 3114
$$ [...]
##END NTUPLES=NMR SPECTRUM
##END=
