##TITLE=NES1021_11277_9266032_qIsfAihTUI
##JCAMPDX= 6.0         $$ Bruker NMR JCAMP-DX V2.0
##DATA TYPE= NMR SPECTRUM
##DATA CLASS= NTUPLES
##ORIGIN= BRUKER
##OWNER= Administrator
$$ 1.72 TOPSPIN		Version 2.1
$$ 2015-07-09 14:00:58.456 -0700  Administrator@X
$$ Compression mode = diff/dup
##.OBSERVE FREQUENCY= 400.02188249412
##.OBSERVE NUCLEUS= ^1H
##.ACQUISITION MODE= SIMULTANEOUS (DQD)
##.ACQUISITION SCHEME= undefined
##.AVERAGES= 64
##.DIGITISER RES= 22
##SPECTROMETER/DATA SYSTEM= spect
##.PULSE SEQUENCE= noesygpps1d.comp
##.SOLVENT NAME= COFFEE_meoh
##.SHIFT REFERENCE= INTERNAL, COFFEE_meoh, 1, 14.96306
##AUDIT TRAIL= $$ (NUMBER, WHEN, WHO, WHERE, PROCESS, VERSION, WHAT)
$$ ##TITLE= Audit trail, TOPSPIN		Version 2.1
$$ ##JCAMPDX= 5.01
$$ ##ORIGIN= Bruker BioSpin GmbH
$$ ##OWNER= Administrator
$$ $$ E:\/data/COFFEE/nmr/NES1021_11277_9266032_qIsfAihTUI/12/pdata/1/auditp.txt
$$ ##AUDIT TRAIL=  $$ (NUMBER, WHEN, WHO, WHERE, PROCESS, VERSION, WHAT)
(   1,<2015-07-09 14:00:53.066 -0700>,<Administrator>,<X>,<go>,<TOPSPIN 2.1>,
      <created by zg
	started at 2015-07-09 13:49:23.285 -0700,
	POWCHK enabled, PULCHK disabled,
       configuration hash MD5:
       21 0F 79 D6 B3 7B B4 F6 88 20 88 DB 03 48 BD 9F
       data hash MD5: 64K
       78 47 2C A5 5C 35 59 86 78 41 80 2E 8C 67 13 42>)
(   2,<2015-07-09 14:00:56.238 -0700>,<Administrator>,<X>,<proc1d>,<TOPSPIN 2.1>,
      <Start of raw data processing
       efp LB = 0.3 FT_mod = 6 PKNL = 1 PHC0 = 0 PHC1 = 0 SI = 128K 
       data hash MD5: 128K
       13 00 B9 00 71 3F 86 76 54 AF AC 7D 44 AE EA C7>)
(   3,<2015-07-09 14:00:57.206 -0700>,<Administrator>,<X>,<proc1d>,<TOPSPIN 2.1>,
      <pk PHC0 = -87.06116 PHC1 = 0 
       data hash MD5: 128K
       AC CC 21 64 62 62 78 65 09 0D 4A 15 5D 24 01 EE>)
(   4,<2015-07-09 14:00:57.597 -0700>,<Administrator>,<X>,<proc1d>,<TOPSPIN 2.1>,
      <abs ABSG = 1 
       data hash MD5: 128K
       FF 3F 66 A8 AA 64 5D 8F 7E 1B 1E B9 19 F6 19 E1>)
(   5,<2015-07-09 14:00:57.706 -0700>,<Administrator>,<X>,<proc1d>,<TOPSPIN 2.1>,
      <abs ABSG = 2 
       data hash MD5: 128K
       9D D4 AC 9E C6 C4 2C 75 C5 EF 75 BC FF 30 58 96>)
(   6,<2015-07-09 14:00:57.800 -0700>,<Administrator>,<X>,<proc1d>,<TOPSPIN 2.1>,
      <abs ABSG = 3 
       data hash MD5: 128K
       EE D5 13 53 08 BA 71 97 BF FA B7 33 8A F7 DC 9D>)
(   7,<2015-07-09 14:00:57.894 -0700>,<Administrator>,<X>,<proc1d>,<TOPSPIN 2.1>,
      <abs ABSG = 4 
       data hash MD5: 128K
       03 19 F6 52 F7 C2 F6 69 25 E3 B8 99 CD 19 53 1F>)
(   8,<2015-07-09 14:00:57.972 -0700>,<Administrator>,<X>,<proc1d>,<TOPSPIN 2.1>,
      <abs ABSG = 5 
       data hash MD5: 128K
       40 58 8F 7C 58 F8 2B 97 DB BC 01 E9 07 19 61 61>)
$$ ##END=
$$ 
$$ $$ hash MD5
$$ $$ BE D3 2C 55 EF 78 16 3C 54 E9 10 2C E1 29 23 75
##$RELAX= 
##$RELAX= 
##$RELAX= 
##$RELAX= 
##$RELAX= 
##$RELAX= 
##$RELAX= 
##$RELAX= 
$$ Bruker specific parameters
$$ --------------------------
##$DU= <E:\>
##$EXPNO= 12
$$ [...]
##$TP07= 0
##$TPNAME0= <>
##$TPNAME1= <>
##$TPNAME2= <>
##$TPNAME3= <>
##$TPNAME4= <>
##$TPNAME5= <>
##$TPNAME6= <>
##$TPNAME7= <>
##$TPOAL= (0..7)
0.5 0.5 0.5 0.5 0.5 0.5 0.5 0.5
##$TPOFFS= (0..7)
0 0 0 0 0 0 0 0
##$TUNHIN= 0
##$TUNHOUT= 0
##$TUNXOUT= 0
##$USERA1= <user>
##$USERA2= <user>
##$USERA3= <user>
##$USERA4= <user>
##$USERA5= <user>
##$V9= 5
##$VALIST= <valist>
##$VCLIST= <CCCCCCCCCCCCCCC>
##$VD= 0
##$VDLIST= <DDDDDDDDDDDDDDD>
##$VPLIST= <PPPPPPPPPPPPPPP>
##$VTLIST= <TTTTTTTTTTTTTTT>
##$WBST= 2048
##$WBSW= 25
##$XGAIN= (0..3)
0 0 0 0
##$XL= 0
##$YL= 0
##$YMAX_a= 8974285
##$YMIN_a= -17473676
##$ZGOPTNS= <>
##$ZL1= 120
##$ZL2= 120
##$ZL3= 120
##$ZL4= 120
##$ABSF1= 14.96306
##$ABSF2= -5.595121
##$ABSG= 5
##$ABSL= 3
##$ALPHA= 0
##$AQORDER= 0
##$ASSFAC= 0
##$ASSFACI= 0
##$ASSFACX= 0
##$ASSWID= 0
##$AUNMP= <proc_prof1d_extract.lims>
##$AXLEFT= 0
##$AXNAME= <>
##$AXNUC= <1H>
##$AXRIGHT= 0
##$AXTYPE= 0
##$AXUNIT= <>
##$AZFE= 0.1
##$AZFW= 0.1
##$BCFW= 0
##$BC_mod= 0
##$BYTORDP= 0
##$COROFFS= 0
##$CY= 15
##$DATMOD= 1
##$DC= 0
##$DFILT= <>
##$DTYPP= 0
##$F1P= 0
##$F2P= 0
##$FCOR= 0.5
##$FTSIZE= 131072
##$FT_mod= 6
##$GAMMA= 0
##$GB= 0
##$INTBC= 1
##$INTSCL= 1
##$ISEN= 128
##$LB= 0.3
##$LEV0= 0
##$LPBIN= 0
##$MAXI= 10000
##$MC2= 0
##$MEAN= 0
##$ME_mod= 0
##$MI= 0
##$NCOEF= 0
##$NC_proc= -2
##$NLEV= 6
##$NOISF1= 0
##$NOISF2= 0
##$NSP= 0
##$NTH_PI= 0
##$NZP= 0
##$OFFSET= 14.96306
##$PC= 1
##$PHC0= -87.06116
##$PHC1= 0
##$PH_mod= 1
##$PKNL= yes
##$PPARMOD= 0
##$PPDIAG= 0
##$PPIPTYP= 0
##$PPMPNUM= 2147483647
##$PPRESOL= 1
##$PSCAL= 4
##$PSIGN= 0
##$PYNMP= <proc.py>
##$REVERSE= no
##$SF= 400.020008812759
##$SI= 131072
##$SIGF1= 0
##$SIGF2= 0
##$SINO= 400
##$SIOLD= 131072
##$SPECTYP= <>
##$SREGLST= <1H.CDCl3>
##$SSB= 0
##$STSI= 131072
##$STSR= 0
##$SW_p= 8223.68421052631
##$SYMM= 0
##$S_DEV= 0
##$TDeff= 65536
##$TDoff= 0
##$TI= <>
##$TILT= no
##$TM1= 0
##$TM2= 0
##$TOPLEV= 0
##$USERP1= <user>
##$USERP2= <user>
##$USERP3= <user>
##$USERP4= <user>
##$USERP5= <user>
##$WDW= 1
##$XDIM= 131072
##$YMAX_p= 399305365
##$YMIN_p= -10559
##$CURPLOT= <Network HP LaserJet P1505>
##$CURPRIN= <$Network HP LaserJet P1505>
##$DFORMAT= <normdp>
##$LAYOUT= <+/1D_H.xwp>
##$LFORMAT= <normlp>
##$PFORMAT= <normpl>
##$SURQMSG= 1
$$ End of Bruker specific parameters
$$ ---------------------------------
##NTUPLES= NMR SPECTRUM
##VAR_NAME=  FREQUENCY,     SPECTRUM/REAL,   SPECTRUM/IMAG
##SYMBOL=    X,             R,               I
##VAR_TYPE=  INDEPENDENT,   DEPENDENT,       DEPENDENT
##VAR_FORM=  AFFN,          ASDF,            ASDF
##VAR_DIM=   131072,        131072,          131072
##UNITS=     HZ,            ARBITRARY UNITS, ARBITRARY UNITS
##FACTOR=    0.0627417313425164, 1,          1
##FIRST=     8223.62146879497, -4109,        -63461
##LAST=      0,             -2281,           -64584
##MIN=       0,             -10559,          0
##MAX=       8223.62146879497, 399305365,    0
$$ Real data points
##PAGE= N=1
##DATA TABLE= (X++(R..R)), XYDATA
$$ [...]
60946E650903n83677m93944m20016l60280l12684k74072k41886k15413j94311
60937B554620j77031j61484j46436j31570j17046j03614r2312q3341p5839o9240
60927A396707o4066o0803n8712n6419n3212m9159m4556l9864l5676l2111k8584
60916H73545k4757k1213j8611j6713j4912j3261j2108j1142r726q020o737n899
60904G10446m793l216j821j001l61M63J282J960K706L395L474K960K652K839K675
60889G23660J538J19p29j400k715m355n412o007p058q579r570r639r488r564r369
60874F41432q539p558o905o343n525m668m048l434k478j148M76K270L693M094
60860F01319L835M287O191Q627J0288J1158J2157J3588J4807J5388J5785J6724
$$ plain form
60946 5650903 5067226 4573282 4153266 3792986 3480302 3206230 2964344 2748931 2554620
60937 2554620 2377589 2216105 2069669 1938099 1821053 1717439 1625127 1541786 1465947 1396707
60927 1396707 1332641 1271838 1213126 1156707 1103495 1054336 1009780 969916 934240 902129 873545
60916 873545 848788 827575 808964 792251 777339 764078 751970 740828 731102 723082 716345 710446
60904 710446 705653 702437 700616 699615 699254 699717 700999 702959 705665 709060 712534 715494 718146 720985 723660
60889 723660 725198 725317 724588 723188 720473 716118 710706 704699 697641 689062 679492 669853 660365 650801 641432
60874 641432 632893 625335 618430 612087 606562 601894 597846 594412 591934 590786 591262 593532 597225 601319
60860 601319 605154 609441 615632 624259 634547 645705 657862 671450 686257 701645 717430 734154
60848G34154J8363K0155K1302K1336K0438J9079J7317J4824J1715Q928P376P004
60836I21991P027O815O136M862K994R40p51j976l188m768o537p982q871r563j0556
60821H96573j1747j2422j2182j1591j1483j1785j1607j0501r009p913p472p507
60809G71354p641p240n768l523j557n43j08M28J190J926K471K643K167J198M27
60794G57424J86j04j023k148k636k443k256k377k445k156j593p06Q31L034N308
60779G46896P002P975Q571R249J0354J1924J3527J4607J5058J5277J5510J5390
60767H91340J4400J2616J0683R096P799O587N524M730L981K944J763R67P67Q24
60753I74021Q59J020J374J444P16p16k317l803n272o881q688j0626j2326j3295
$$ plain form
60848 734154 752517 772672 793974 815310 835748 854827 872144 886968 898683 907611 914987 921991
60836 921991 929018 935833 941969 946831 949825 950765 950014 948038 944850 940082 933545 925563 916692 907129 896573
60821 896573 884826 872404 860222 848631 837148 825363 813756 803255 794246 786333 778861 771354
60809 771354 763713 756473 750705 747182 745625 745082 744974 745402 746592 748518 750989 753632 755799 756997 757424
60794 757424 757610 757506 756483 754335 751699 749256 747000 744623 742178 740022 738429 737723 738554 741588 746896
60779 746896 753898 761873 770444 779693 790047 801971 815498 830105 845163 860440 875950 891340
60767 891340 905740 918356 929039 938135 945934 952521 958045 962775 966756 969700 971463 972430 973197 974021
60753 974021 974880 975900 977274 978718 979434 978718 976401 972598 967326 960445 951757 941131 928805 915510
60739I15510j3587j3921j4699j5371j5222j4401j3501j2670j1816j1288j1483
60728G67551j2000j2065j1569j0787r491p381n221m163l985l268j557l4M14N47
60714F86991J465L003M230M836N214N580N768N590N008M110L136K230J113n99
60700G37675k719m657o143p220p714p570p531q450r940j0841j1026j1430j2131
60687F30303j1901j0255q459p670p322o356n002m182l939l550k689j520j49J297
60673E58606K425L130L899N012O035O564O859P198P356P323P671Q510Q908Q171
60659F47667O964O333O293O369O765P969R614J0764J1089J0995J0905J1022J1356
60646G64105J1417J0449Q560O909O173N666M801M342N035N891N320L488K059J797
$$ plain form
60739 915510 901923 888002 873303 857932 842710 828309 814808 802138 790322 779034 767551
60728 767551 755551 743486 731917 721130 711639 704258 699037 694874 690889 687621 686064 686030 686444 686991
60714 686991 688456 691459 695689 700525 705739 711319 717087 722677 727685 731795 734931 737161 738274 737675
60700 737675 734956 730299 724156 716936 709222 701652 694121 685671 675731 664890 653864 642434 630303
60687 630303 618402 608147 599688 592018 584696 578340 573338 569156 565217 561667 558978 557458 557309 558606
60673 558606 561031 564161 568060 573072 579107 585671 592530 599728 607084 614407 622078 630588 639496 647667
60659 647667 654631 660964 667257 673626 680391 688360 697974 708738 719827 730822 741727 752749 764105
60646 764105 775522 785971 794531 801440 807613 813279 818080 822422 827457 833348 838668 842156 844215 846012
60632H46012J803J148o2j388k735l995m875n359n859o687p748q775r482r704r646
60617G72648r752j0010r816q851p590o510n442m148k846j500N00L247N620O668
60603G22218O954P563Q392Q544P926P291P000O758O347N729M704L311K227J946
60589H06910K024J794J282N79q32l097n115n952o394p687r461j0456j0785j1614
60575G41196j2909j3465j3175j3282j4058j4050j2367j0138q851q478p985o858
60563F05580n369m061l470l679l874l036j271L47J373K406L644M313M085M006
60549F00994N115O917Q139Q532R060J0564J2870J5289J7444J9615K2369K5991
60537G62899L0184L4289L7662L9732L9934L7791L2960K5331J5497N169l663j0271
$$ plain form
60632 846012 847815 848963 848901 847513 844778 840783 835908 830549 824690 818003 810255 801480 791998 782294 772648
60617 772648 762896 752886 743070 734219 726629 720119 714677 710529 707683 706183 706683 709930 715550 722218
60603 722218 729172 736735 745127 753671 761597 768888 775888 782646 788993 794722 799426 802737 804964 806910
60589 806910 808934 810728 812010 812589 811757 808660 803545 797593 791199 783512 774051 763595 752810 741196
60575 741196 728287 714822 701647 688365 674307 660257 647890 637752 628901 620423 612438 605580
60563 605580 600211 596150 592680 589001 585127 582091 580820 581167 582540 584946 588590 592903 596988 600994
60549 600994 606109 613026 621165 629697 638757 649321 662191 677480 694924 714539 736908 762899
60537 762899 793083 827372 865034 904766 944700 982491 1015451 1040782 1056279 1061448 1057785 1047514
60525A047514j5372j9497k2116k2742k1827j9718j5902j0426n084j779l41P01
60513H93411J851K644L261M314N352N394M938N654P882J0257J2186J4951J9621
60500I91716K5419L1145L7016M4149N2969O2973P3526Q4172R4656J05117J15942
60489A718800J27223J38843J51231J65519J82588K02230K22921K41802K54954
60480C406111K58392K48948K24151J82335J24282N4570j9798r2225j57452k10867
60470D018447k48922k70745k78119k73695k60179k40922k19508j98122j77314
60461A850921j57532j39611j23610j08653r4462q1859p1352o2396n4521m7976
60451I08949m2686l7725l2534k7723k4062k1461j9412j7630j5862j3922j2229
$$ plain form
60525 1047514 1032142 1012645 990529 967787 945960 926242 910340 899914 894830 893051 892710 893411
60513 893411 895262 897906 901167 905481 910833 916227 921165 926819 934701 944958 957144 972095 991716
60500 991716 1017135 1048280 1085296 1129445 1182414 1245387 1318913 1403085 1497741 1602858 1718800
60489 1718800 1846023 1984866 2136097 2301616 2484204 2686434 2909355 3151157 3406111
60480 3406111 3664503 3913451 4137602 4319937 4444219 4498789 4478991 4386766 4229314 4018447
60470 4018447 3769525 3498780 3220661 2946966 2686787 2445865 2226357 2028235 1850921
60461 1850921 1693389 1553778 1430168 1321515 1227053 1145194 1073842 1011446 956925 908949
60451 908949 866263 828538 796004 768281 744219 722758 703346 685716 669854 655932 643703
60440F43703j1445j1314j0799r639q670q369q117p353o308n280m203l369l394
60427E45443m051m244l568k736k063j017K55N05m94r41O83L340M876M797M324
60412E45109M262M288M049L820L939M311M586M473M038L820M284N131N613N543
60398F07266N296M884L979K912K496K666K441J548Q86R63J145J061J348K273K844
60383F44008K263J198N65J08q19j896k387k331k154j804j219j001j595k256j886
60368F28794n49O98J183J087R03J023J610K391K860L017L375M034M443M440M662
60353F63971N495O417O915P203P480P347O595N745N198M645L903L390L241K798
60339G40343J786R48Q24Q43M56K21P84J695K187K399K809L251L406L550L919M004
$$ plain form
60440 643703 632258 620944 610145 600506 591836 583467 575350 567997 561689 556409 552206 548837 545443
60427 545443 541392 537148 533580 530844 528781 527764 528019 528524 528030 527089 527772 531112 535988 540785 545109
60412 545109 549371 553659 557708 561528 565467 569778 574364 578837 582875 586695 590979 596110 601723 607266
60398 607266 612562 617446 621425 624337 626833 629499 631940 633488 634374 635337 636482 637543 638891 641164 644008
60383 644008 646271 647469 648034 648142 647323 645427 643040 640709 638555 636751 635532 634531 632936 630680 628794
60368 628794 628245 628943 630126 631213 632116 633139 634749 637140 640000 643017 646392 650426 654869 659309 663971
60353 663971 669466 675883 682798 690001 697481 704828 711423 717168 722366 727011 730914 734304 737545 740343
60339 740343 742129 743077 743901 744744 745200 745421 746205 747900 750087 752486 755295 758546 761952 765502 769421 773425
60323G73425L346K300J233k04k081l486l880m233n508o873o904n859n258n559
60309G30459n743n059l834k625j646j087j040j087o49K94J389K411L079K930K088
60294G19880J601K096K725K379J380R22J212J379R38K93n2O6O66J466J832J621
60278G40404J719K898M551N483N577N694O230O809P255P886Q828R841J0796J1771
60264H35742J2749J3843J5403J7484J9452K0778K1797K3120K4814K6773K9262
60253A061217L2299L5120L7064L8677M1051M4535M8858N3959N9823O5913P1762
60242A590278P7705Q4207R0845R6780J01823J06159J09459J11141J11094J09328
60232B588819J05383R9012R0897Q1788P1416N9268M5854L2247J8756N282p572
$$ plain form
60323 773425 776771 779071 780304 780100 778019 774533 770653 766420 760912 754039 747135 741276 736018 730459
60309 730459 724716 719657 715823 713198 711552 710465 709425 708338 707689 707983 709372 711783 714862 717792 719880
60294 719880 721481 723577 726302 728681 730061 730983 732195 733574 734512 734805 734753 734819 735485 736951 738783 740404
60278 740404 742123 745021 749572 755055 760632 766326 772556 779365 786620 794506 803334 813175 823971 835742
60264 835742 848491 862334 877737 895221 914673 935451 957248 980368 1005182 1031955 1061217
60253 1061217 1093516 1128636 1165700 1204377 1245428 1289963 1338821 1392780 1452603 1518516 1590278
60242 1590278 1667983 1752190 1843035 1939815 2041638 2147797 2257256 2368397 2479491 2588819
60232 2588819 2694202 2793214 2884111 2965899 3037315 3096583 3142437 3174684 3193440 3198722 3191150
60221C191150j8847k8388l6496m2672m5916m6131m4188m0729l5761k9345k1721
60210B800956j2910k928P797J8918L0674M3183N5760O7739P9373R0885J01296
60199C280743J09341J15004J18920J20675J19051J13705J05308R4313Q0761O5183
60189D323004M8400L0563J1520p981k6547m3515n8966p2486q3019q9972r3530
60178C937471r3897r1047q5136p6431o5122n1897l8118k4508j0239N518K1741
60167C428335L6474M9074O0210P0008P7620Q2325Q3677Q0949P3825O3522N1781
60156D157800L8989K4645R421m911j7460k8577l8202m5385m9607n1054m9525m4438
60144C901696l6094k5582j3323J022J7166L4222N2176P1832R3131J14982J37031
$$ plain form
60221 3191150 3172303 3143915 3107419 3064747 3018831 2972700 2928512 2887783 2852022 2822677 2800956
60210 2800956 2788046 2785118 2792915 2811833 2842507 2885690 2941450 3009189 3088562 3179447 3280743
60199 3280743 3390084 3505088 3624008 3744683 3863734 3977439 4082747 4177060 4257821 4323004
60189 4323004 4371404 4401967 4413487 4405506 4378959 4335444 4276478 4203992 4120973 4031001 3937471
60178 3937471 3843574 3752527 3667391 3590960 3525838 3473941 3435823 3411315 3401076 3406594 3428335
60167 3428335 3464809 3513883 3574093 3644101 3721721 3804046 3887723 3968672 4042497 4106019 4157800
60156 4157800 4196789 4221434 4230855 4225944 4208484 4179907 4141705 4096320 4046713 3995659 3946134 3901696
60144 3901696 3865602 3840020 3826697 3827719 3844885 3879107 3931283 4003115 4096246 4211228 4348259
60133D348259J60070J84394K09159K33663K57873K81300L02720L21426L37458
60124F636322L50207L58146L60358L57034L48072L32604L10449K82682K50174
60115I586048K12811J70742J25172P7286K7434k3847p5027j24373j70693k12747
60105I592806k48927k77957k99195l11902l15340l09974k97620k79886k57310
60096F994695k30312j99988j67630j34356j01426o9851l9549r957J8275M3416
60086F103317O4648Q2449R6673J05813J08723J05740R7402Q3599O4882M3254K0534
60075F977034k984k7282n1072p2760r2074j09673j25674j39551j51068j60371
60065F044525j67492j72278j74553j73893j69792j62349j52441j40805j27531
$$ plain form
60133 4348259 4508329 4692723 4901882 5135545 5393418 5674718 5977438 6298864 6636322
60124 6636322 6986529 7344675 7705033 8062067 8410139 8742743 9053192 9335874 9586048
60115 9586048 9798859 9969601 10094773 10172059 10199493 10175646 10100619 9976246 9805553 9592806
60105 9592806 9343879 9065922 8766727 8454825 8139485 7829511 7531891 7252005 6994695
60096 6994695 6764383 6564395 6396765 6262409 6160983 6091132 6051583 6041626 6059901 6103317
60086 6103317 6167965 6250414 6347087 6452900 6561623 6667363 6764765 6848364 6913246 6956500 6977034
60075 6977034 6974050 6946768 6895696 6822936 6730862 6621189 6495515 6355964 6204896 6044525
60065 6044525 5877033 5704755 5530202 5356309 5186517 5024168 4871727 4730922 4603391
60056D603391j12564r6116p8440n9819m0889k2180l388J5976L5267N3129O9277
60045D363644Q4536R8918J11038J19809J25309J27403J24973J17355J05342R0023
60035E468350P1688N0642K7985M748j8829m2378o4783q5179j03570j19684j32314
60024E056676j40642j45265j46869j44852j38382j28088j15636j02040q7263p1059
60014C836580n3481l4944j6276J779J9484L7806N6881P5663R3580J11378J29608
60003D258058J47175J62266J73930J81942J85883J85275J79984J69828J54341
59994E798682J33638J08905Q1478N2134K1737q421l7652o6295r4180j19438j39744
59983E730844j54157j62904j66107j63729j56369j45159j31092j14964r7584p9501
$$ plain form
60056 4603391 4490827 4394711 4316271 4256452 4215563 4193383 4189995 4205971 4241238 4294367 4363644
60045 4363644 4448180 4547098 4658136 4777945 4903254 5030657 5155630 5272985 5378327 5468350
60035 5468350 5540038 5590680 5618665 5623413 5604584 5562206 5497423 5412244 5308674 5188990 5056676
60024 5056676 4916034 4770769 4623900 4479048 4340666 4212578 4096942 3994902 3907639 3836580
60014 3836580 3783099 3748155 3731879 3733658 3753142 3790948 3847829 3923492 4017072 4128450 4258058
60003 4258058 4405233 4567499 4741429 4923371 5109254 5294529 5474513 5644341 5798682
59994 5798682 5932320 6041225 6122703 6174837 6196574 6188153 6150501 6084206 5990026 5870588 5730844
59983 5730844 5576687 5413783 5247676 5083947 4927578 4782419 4651327 4536363 4438779 4359278
59973D359278o0907m2117k3707n855J1730K8984M5348O0722P5515Q9379J00846
59962D639216J08826J13470J15219J14063J10190J04122R5633Q3916O9569N4982
59952E609206M1796K9394J6921N370l665r920j3526j3366q157J617J4631L0975
59940E701276N1831P7316J06221J37544J70927K05842K41652K78143L14685L49215
59930G634652L79310M03798M21911M31241M28171M10234L76798L27859K63921
59921A1077895J87292J02005J2259p7879j63301k38318k99100l44813l75995l93093
59911I486952l97054l90055l74587l52340l24610k93093k59544k25002j89939
59902F680728j54852j20261q6374n3203k0866J0532M1140P1097R9962J26591J49624
$$ plain form
59973 4359278 4298371 4256254 4232547 4226692 4238422 4267406 4312754 4373476 4448991 4538370 4639216
59962 4639216 4748042 4861512 4976731 5090794 5200984 5305106 5400739 5484655 5554224 5609206
59952 5609206 5651002 5680396 5697317 5702687 5699022 5689102 5675576 5662210 5654053 5655670 5670301 5701276
59940 5701276 5753107 5830423 5936644 6074188 6245115 6450957 6692609 6970752 7285437 7634652
59930 7634652 8013962 8417760 8839671 9270912 9699083 10109317 10486115 10813974 11077895
59921 11077895 11265187 11367192 11379451 11301572 11138271 10899953 10600853 10256040 9880045 9486952
59911 9486952 9089898 8699843 8325256 7972916 7648306 7355213 7095669 6870667 6680728
59902 6680728 6525876 6405615 6319241 6266038 6245172 6255704 6296844 6367941 6467903 6594494 6744118
59891F744118J68018J81025J87763J87050J77870J59847J33062R7727N4612N809
59881H096901m5391r5608j42106j82642k15462k39769k55817k64296k65938k61712
59871F128160k52831k40437k25793k10692j96951j85228j74940j65407j56457
59862D319424j47896j39324j30665j21991j12665j01728q9422p7235o5906n4528
59852C278064m2234k9874j9213j1314o502n029o853j1233j7368k4964l3583m1968
59840C027929m8658n2884n4496n3628n0938m7469m3619l8813l2615k5524j8184
59829B561101j0486k073O878J5834K4358L1998L8367M3666M8477N2807N6202N8819
59817B925948O1222O2831O1937N7870N1773M4567L5568K4268J2228J847n885j1257
$$ plain form
59891 6744118 6912136 7093161 7280924 7467974 7645844 7805691 7938753 8036480 8091092 8096901
59881 8096901 8051510 7955902 7813796 7631154 7415692 7175923 6920106 6655810 6389872 6128160
59871 6128160 5875329 5634892 5409099 5198407 5001456 4816228 4641288 4475881 4319424
59862 4319424 4171528 4032204 3901539 3779548 3666883 3565155 3475733 3398498 3332592 3278064
59852 3278064 3235830 3205956 3186743 3175429 3168927 3163898 3157045 3145812 3128444 3103480 3069897 3027929
59840 3027929 2979271 2926387 2871891 2818263 2767325 2719856 2676237 2637424 2604809 2579285 2561101
59829 2561101 2550615 2548542 2555420 2571254 2595612 2627610 2665977 2709643 2758120 2810927 2867129 2925948
59817 2925948 2987170 3050001 3111938 3169808 3221581 3266148 3301716 3325984 3338212 3340059 3334174 3322917
59805C322917j4324j4687j2359p741j142P126J6725K7932M1617N8019P6392R6270
59793C596745J18133J42288J68218J95644K25001K56146K87749L18390L46495
59784E654809L67975L75671L62869L26762K68006J89201R5772l058r6741j77059
59774G364207k38924k79524k98917l00707k90100k71156k46676k19410j91599
59765E027194j64063j37324j12812r1533p2465n4093l6701k1407p711N964J9919
59754D354968L3328M6351O0126P4865Q9811J04937J21064J38380J56447J75413
59744E355690J95765K17108K38828K61749K87491L16266L46778L78148M10349
59735H008172M42866M74397N03880N30321N51652N65132N69006N62797N46317
$$ plain form
59805 3322917 3308593 3293906 3281547 3273806 3272664 3279790 3296515 3324447 3366064 3424083 3500475 3596745
59793 3596745 3714878 3857166 4025384 4221028 4446029 4702175 4989924 5308314 5654809
59784 5654809 6022784 6398455 6761324 7088086 7356092 7545293 7641065 7638007 7541266 7364207
59774 7364207 7125283 6845759 6546842 6246135 5956035 5684879 5438203 5218793 5027194
59765 5027194 4863131 4725807 4612995 4521462 4448997 4394904 4358203 4336796 4329085 4335049 4354968
59754 4354968 4388296 4434647 4494773 4569638 4659449 4764386 4885450 5023830 5180277 5355690
59744 5355690 5551455 5768563 6007391 6269140 6556631 6872897 7219675 7597823 8008172
59735 8008172 8451038 8925435 9429315 9959636 10511288 11076420 11645426 12208223 12754540
59726A2754540N19865M85358M46198M06078L68823L38707L19396L12616L18597
59717A6270178L37066L66606M04005M45759M89614N33194N72053O01038O16771
59708B0636284O17152N99431N61344N03802M30292L44038K48130J48113N1595
59699B4140181l5320j09333j67749k07474k26818k26381k07473j71319j19953
59690B2668361n6024J8832J03744J96568K93916L93608M95155N97318O96889P90293
59680B6198660Q74247R43939R92068J010623R92610R32038Q24569O69932M73398
59671C3912084K44833k680k53627m91841p03278q77418j007150j089388j126296
59662B8605239j124487j092779j041621r83669r31783q94937q76668q76785q92237
$$ plain form
59726 12754540 13274405 13759763 14205961 14612039 14980862 15319569 15638965 15951581 16270178
59717 16270178 16607244 16973850 17377855 17823614 18313228 18846422 19418475 20019513 20636284
59708 20636284 21253436 21852867 22414211 22918013 23348305 23692343 23940473 24088586 24140181
59699 24140181 24104861 23995528 23827779 23620305 23393487 23167106 22959633 22788314 22668361
59690 22668361 22612337 22631169 22734913 22931481 23225397 23619005 24114160 24711478 25408367 26198660
59680 26198660 27072907 28016846 29008914 30019537 31012147 31944185 32768754 33438686 33912084
59671 33912084 34156917 34154237 33900610 33408769 32705491 31828073 30820923 29731535 28605239
59662 28605239 27480752 26387973 25346352 24362683 23430900 22535963 21659295 20782510 19890273
59653A9890273r16177r39126r53153r54430r41974r16049q78599q33168p82977
59644A1774620p29932o75797o22771n72182n24049m78482m36158l96973l59929
59635F978347l24951k93215k64976k38763k13476j89654j67919j47740j28709
59626E008944j11479r6475q2995p0505n9624n0960m4283l9569l7507l8175m0545
59615D336827m4127m9673n7389o5851p3655q0749q7153r1761r3559r2970r0895
59604C509045q7437q2590p7059p1392o5123n7726m9603m1455l3503k5956j9196
59593B898005j2893o058J351P951J2780J6472J9819K2430K3674K3917K3833K3357
59581C054638K2218K0759J9503J8627J8473J9740K2677K6856L2014L8270M5319
$$ plain form
59653 19890273 18974096 18034970 17081817 16127387 15185413 14269364 13390765 12557597 11774620
59644 11774620 11044688 10368891 9746120 9173938 8649889 8171407 7735249 7338276 6978347
59635 6978347 6653396 6360181 6095205 5856442 5642966 5453312 5285393 5137653 5008944
59626 5008944 4897465 4800990 4717995 4647490 4587866 4536906 4492623 4453054 4415547 4377372 4336827
59615 4336827 4292700 4243027 4185638 4119787 4046132 3965383 3878230 3786469 3692910 3599940 3509045
59604 3509045 3421608 3339018 3261959 3190567 3125444 3067718 3018115 2976660 2943157 2917201 2898005
59593 2898005 2885112 2879054 2880405 2888356 2901136 2917608 2937427 2959857 2983531 3007448 3031281 3054638
59581 3054638 3076856 3097615 3117118 3135745 3154218 3173958 3196635 3223491 3255505 3293775 3339094
59570C339094N2580O0361O9593Q0186R1098J02276J14952J29528J44862J60195
59560D344725J76129J92914K09518K25235K40604K55685K68940K78896K85487
59551F478133K88853K88291K83432K75090K63892K49444K31813K12343J91899
59542H763190J69780J45582J20657R6461P2871M9716K8765J2730L173N76N279
59531I468780J6881L3690N4064P7470J03026J27924J48477J61939J66224J59067
59521A0517542J38972J06471O3305J1138m8001j10862j73886k34376k90033l38272
59511I641998l77003m05427m23256m30116m26558m14619l96480l73350l46386
59502F048803l17496k88322k59438k31419k05361j81510j58605j35725j13598
$$ plain form
59570 3339094 3391674 3452035 3521628 3601814 3692912 3795188 3910140 4039668 4184530 4344725
59560 4344725 4520854 4713768 4923286 5148521 5389125 5644810 5913750 6192646 6478133
59551 6478133 6766986 7055277 7338709 7613799 7877691 8127135 8358948 8571291 8763190
59542 8763190 8932970 9078552 9199209 9295670 9368541 9418257 9447022 9459752 9462925 9463501 9468780
59531 9468780 9485661 9519351 9573415 9650885 9753911 9881835 10030312 10192251 10358475 10517542
59521 10517542 10656514 10762985 10826290 10837428 10789427 10678565 10504679 10270303 9980270 9641998
59511 9641998 9264995 8859568 8436312 8006196 7579638 7165019 6768539 6395189 6048803
59502 6048803 5731307 5442985 5183547 4952128 4746767 4565257 4406652 4270927 4157329
59493D157329r3058p3516n4114l5145j7048P56J8780L6405N3223P0251Q8427J07057
59481D259347J25155J43226J62220J81638K00104K16969K31884K43652K50873
59472F015068K53008K49594K39213K20468J93221J57995J15268O6523J4767l7283
59462G487842q8486j37558j81539k17611k45431k66086k79771k86124k85951k80854
59452E218431k71811k59455k44978k29456k13050j96159j80224j66031j52378
59443C304889j37977j23653j10955r9672q8532p7402o7103n7773m9156m1665l5499
59432B415502k9557k2923j6511j1527p316k666J756M476N946P976J0946J3862
59420B369964J6643K0060K3540K5362K5197K4503K4230K3897K3204K2865K3617
$$ plain form
59493 4157329 4064271 3990755 3936641 3901496 3884448 3885204 3903984 3940389 3993612 4063863 4152290 4259347
59481 4259347 4384502 4527728 4689948 4871586 5071690 5288659 5520543 5764195 6015068
59472 6015068 6268076 6517670 6756883 6977351 7170572 7328567 7443835 7510358 7525125 7487842
59462 7487842 7399356 7261798 7080259 6862648 6617217 6351131 6071360 5785236 5499285 5218431
59452 5218431 4946620 4687165 4442187 4212731 3999681 3803522 3623298 3457267 3304889
59443 3304889 3166912 3043259 2932304 2832632 2744100 2666698 2599595 2541822 2492666 2451001 2415502
59432 2415502 2385945 2363022 2346511 2334984 2327668 2325002 2326758 2331234 2337180 2345156 2356102 2369964
59420 2369964 2386607 2406667 2430207 2455569 2480766 2505269 2529499 2553396 2576600 2599465 2623082
59409B623082K5721K9637L5942M4423N4175O4420P4329Q2717Q9181R5096J02261
59398C320984J11141J21735J35222J52986J74549J98287K23815K51997K82954
59389D973670L15936L50860L88183M27214M66035N02986N36693N64824N84416
59380I110817N93548N91476N77560N51708N15883M73698M28338L81828L35936
59371A3560792K92272K51532K13710J78812J46280J14213Q0339M3474L139m1290
59361A4843273q9638j39853j89267k36287k79544l16603l45424l66519l81938
59352A2498200l92951m00403m06189m12024m17231m19972m20154m18878m15562
59343H794836m08122l95884l80073l61491l39963l16131k91429k66146k39659
$$ plain form
59409 2623082 2648803 2678440 2714382 2758805 2812980 2877400 2951729 3034446 3123627 3218723 3320984
59398 3320984 3432125 3553860 3689082 3842068 4016617 4214904 4438719 4690716 4973670
59389 4973670 5289606 5640466 6028649 6455863 6921898 7424884 7961577 8526401 9110817
59380 9110817 9704365 10295841 10873401 11425109 11940992 12414690 12843028 13224856 13560792
59371 13560792 13853064 14104596 14318306 14497118 14643398 14757611 14837950 14881424 14884563 14843273
59361 14843273 14753635 14613782 14424515 14188228 13908684 13592081 13246657 12880138 12498200
59352 12498200 12105249 11704846 11298657 10886633 10469402 10049430 9629276 9210398 8794836
59343 8794836 8386714 7990830 7610757 7249266 6909303 6593172 6301743 6035597 5795938
59334E795938k12755j87443j64163j41371j18368r6504p6995n9540m3713k9968
59324D665118j8520q879j041M180O424O193L785q12o953j3688k1059k9506l8116
59311D547126m5248n0860n6239o1393o4759o5725o5339o4053o0874n5431m8902
59300C908303m2061l4161k4651j4400m173O630J8798L2005M5600N9591P4118Q8851
59288D114450J03513J18227J32903J47091J60598J73341J84398J92253J96158
59279E522932J96312J92705J84683J71638J53125J28591R8260O4220K9387m441
59269F737412l6496o5573r0353j10899j28225j42483j53151j60727j66396j70075
59259E513034j70621j68104j64122j59654j54210j47232j38685j28248j15612
$$ plain form
59334 5795938 5583183 5395740 5231577 5090206 4971838 4875334 4798339 4738799 4695086 4665118
59324 4665118 4646598 4637719 4636678 4640858 4647282 4653475 4657260 4656448 4649495 4635807 4614748 4585242 4547126
59311 4547126 4501878 4451018 4394779 4333386 4268627 4202902 4137563 4073510 4012636 3957205 3908303
59300 3908303 3866242 3832081 3807430 3793030 3788857 3795487 3814285 3846290 3891890 3951481 4025599 4114450
59288 4114450 4217963 4336190 4469093 4616184 4776782 4950123 5134521 5326774 5522932
59279 5522932 5719244 5911949 6096632 6268270 6421395 6549986 6648246 6712466 6741853 6737412
59269 6737412 6700916 6635343 6544990 6434091 6305866 6163383 6010232 5849505 5683109 5513034
59259 5513034 5342413 5174309 5010187 4850533 4696323 4549091 4410406 4282158 4166546
59250D166546j01715q8112p4974o1341m7111l2956j8362j879J6538L5570N5116
59239C847320P6736J01061J26925J53607J81962K12506K44260K76273L08659L41173
59229E870482L72068L98863M18983M29366M27047M10711L80470L36133K77347
59220I321470K05612J24396L7082n3400j42820k25667k97709l56997m02227m32058
59210G777682m46611m47885m38158m19443l94521l66455l36709l05542k74295
59201D348063k45217k18715j93303j68687j46665j28279j12475r8310q6242p6235
59191B873935o6893n7585m9432m3102l7477l1504k5492j9767j3874p988l154P93
59179B518460N503J1553J7641K3081K8857L5277M1015M5636N0661N6667O1715
$$ plain form
59250 4166546 4064831 3976719 3901745 3840404 3793293 3760337 3741975 3740096 3756634 3792204 3847320
59239 3847320 3924056 4025117 4152042 4305649 4487611 4700117 4944377 5220650 5529309 5870482
59229 5870482 6242550 6641413 7060396 7489762 7916809 8327520 8707990 9044123 9321470
59220 9321470 9527082 9651478 9688560 9635160 9492340 9266673 8968964 8611967 8209740 7777682
59210 7777682 7331071 6883186 6445028 6025585 5631064 5264609 4927900 4622358 4348063
59201 4348063 4102846 3884131 3690828 3522141 3375476 3247197 3134722 3036412 2950170 2873935
59191 2873935 2807042 2749457 2700025 2656923 2619446 2587942 2562450 2542683 2528809 2520821 2517667 2518460
59179 2518460 2523963 2535516 2553157 2576238 2605095 2640372 2681387 2727023 2777684 2834351 2896066
59168B896066O4239O5313O6304O6369O4179O0215N5332M8771L9621K8897J8242
59157C473548P743l201j4013k3686l2306m0235m6700n0760n2809n3739n3460n1491
59145C058891m8200m4286l9881l4999k9960k4610j8171j0674l301L403J0303J7986
59133B836501K5774L3324M1547N0940O0515O9542P8897Q9571J01187J13006J25078
59122C625882J37450J49618J61624J74216J87120J98788K08543K17235K24902
59113E285378K29893K31307K30191K27185K21049K10943J97936J82663J63536
59104G180081J38982J09551P5970L7191p462n5780j04302j51011j94612k32801
59094F795807k63499k86612l02748l11447l12490l07526k98468k85516k68677
$$ plain form
59168 2896066 2960305 3025618 3091922 3158291 3222470 3282685 3338017 3386788 3426409 3455306 3473548
59157 3473548 3481291 3478090 3464077 3440391 3408085 3367850 3321150 3270390 3217581 3163842 3110382 3058891
59145 3058891 3010691 2966405 2926524 2891525 2861565 2836955 2818784 2808110 2804809 2808212 2818515 2836501
59133 2836501 2862275 2895599 2937146 2988086 3048601 3118143 3197040 3286611 3387798 3500804 3625882
59122 3625882 3763332 3912950 4074574 4248790 4435910 4634698 4843241 5060476 5285378
59113 5285378 5515271 5746578 5976769 6203954 6425003 6635946 6833882 7016545 7180081
59104 7180081 7319063 7428614 7504584 7541775 7534313 7478533 7374231 7223220 7028608 6795807
59094 6795807 6532308 6245696 5942948 5631501 5319011 5011485 4713017 4427501 4158824
59085D158824k49881k31461k13720j96003j79059j64180j50983j38178j25761
59076B509598j14595j04526r4806q5626p7562p0208o2910n6117n0419m5240l9992
59065A707597l5502l2624l0444k7608k4439k1988j9944j7293j4253j1731r606
59054A462165p286n180l910k803r71P83Q78o69k411l581m518n427n970n822m566
59039A410712j696K536P017J1358J6406K2338K7611L0974L3080L4801L5398L3814
59027A664349L0418K5953K0202J3308P020K858K93j650k397j259O19J789K847
59014A764350N059P805R436R750R637R124P726N801L665L03n051j0968j5440j8591
59000A782606k1761k4862k6732k7340k7505k6986k4948k1811j8768j5884j2465
$$ plain form
59085 4158824 3908943 3677482 3463762 3267759 3088700 2924520 2773537 2635359 2509598
59076 2509598 2395003 2290477 2195671 2110045 2032483 1962275 1899365 1843248 1792829 1747589 1707597
59065 1707597 1672095 1639471 1609027 1581419 1556980 1534992 1515048 1497755 1483502 1471771 1462165
59054 1462165 1454879 1449699 1445789 1442986 1442015 1442798 1443676 1443007 1440596 1437015 1432497 1427070 1421100 1415278 1410712
59039 1410712 1409016 1411552 1418569 1429927 1446333 1468671 1496282 1527256 1560336 1595137 1630535 1664349
59027 1664349 1694767 1720720 1740922 1754230 1761250 1764108 1764401 1762751 1760354 1759095 1759714 1761503 1764350
59014 1764350 1769409 1777214 1786650 1796400 1806037 1815161 1822887 1828688 1832353 1832656 1827605 1816637 1801197 1782606
59000 1782606 1760845 1735983 1709251 1681911 1654406 1627420 1602472 1580661 1561893 1546009 1533544
58989A533544q771n706l288j011R22K268L811O185Q451R467R815J0718J2008J2904
58975A591317J3805J5454J7228J8170J8941K0828K3579K6047K8244L0891L3649
58964A838153L5547L6538L7019L6646L5214L3732L3081L2604L1625L1177L2385
58953B213721L4507L6486L9180M3843M9603N4621N8783O3082O7423P1267P5417
58942B807933Q0895Q6924R2174R7139J03259J10776J19490J30284J43593J57733
58932C930200J71267J85774K03635K24285K45519K67407K91862L19199L48139
58923F187287L78664M11948M47887M85396N24613N66032O08012O47748O84162
58914A0941749P16977P43518P59264P61099P47203P14458O59255N80952M81841
$$ plain form
58989 1533544 1524773 1519067 1515779 1514768 1515690 1517958 1521769 1527954 1536405 1545872 1555687 1566405 1578413 1591317
58975 1591317 1605122 1620576 1637804 1655974 1674915 1695743 1719322 1745369 1773613 1804504 1838153
58964 1838153 1873700 1910238 1947257 1983903 2019117 2052849 2085930 2118534 2150159 2181336 2213721
58953 2213721 2248228 2284714 2323894 2367737 2417340 2471961 2530744 2593826 2661249 2732516 2807933
58942 2807933 2888828 2975752 3067926 3165065 3268324 3379100 3498590 3628874 3772467 3930200
58932 3930200 4101467 4287241 4490876 4715161 4960680 5228087 5519949 5839148 6187287
58923 6187287 6565951 6977899 7425786 7911182 8435795 9001827 9609839 10257587 10941749
58914 10941749 11658726 12402244 13161508 13922607 14669810 15384268 16043523 16624475 17106316
58905A7106316L64148K30229Q5652o1018k02085l32193m46519n40798o13655o66405
58895A4923672p00139p15084p12759o96382o69126o34112n95663n57964n22375
58886I120068m88263m56034m26960m00513l74731l49157l24963l02394k80624
58877E716429k59885k41169k24046k07255j91107j76790j63817j50827j38306
58868C963227j27645j18015j07343r5950q6082p8022o9948o1445n3849m7162l9970
58857C077796l2511k6521k1855j6474j0061m369K75N500J1657J7311K2423K8731
58845C051902L6397M3540M9746N6822O5298P3353Q0131Q7185R5680J04881J14233
58834C859168J24352J35299J46399J58193J72091J87867K04241K21895K42820
$$ plain form
58905 17106316 17470464 17700693 17786345 17725327 17523242 17191049 16744530 16203732 15590077 14923672
58895 14923672 14223533 13508449 12795690 12099308 11430182 10796070 10200407 9642443 9120068
58886 9120068 8631805 8175771 7748811 7348298 6973567 6624410 6299447 5997053 5716429
58877 5716429 5456544 5215375 4991329 4784074 4592967 4416177 4252360 4101533 3963227
58868 3963227 3835582 3717567 3610224 3514274 3428192 3350170 3280222 3218777 3164928 3117766 3077796
58857 3077796 3045285 3018764 2996909 2980435 2970374 2966005 2966280 2971780 2983437 3000748 3023171 3051902
58845 3051902 3088299 3131839 3181585 3238407 3303705 3377058 3457189 3544374 3640054 3744935 3859168
58834 3859168 3983520 4118819 4265218 4423411 4595502 4783369 4987610 5209505 5452325
58825E452325K66644K91054L16199L45090L78982M15861M54124M94197N35577
58816H950053N75848O13781O49915O82767P07663P20625P20293P04830O70352
58807A4996127O14117N36517M38828L22193J90428N0897q9076k24422l50127m60255
58797A6025227n50877o21605o72890p04394p17176p14697p00313o76027o44464
58788A0022784o09028n71090n29951m86552m44135m04131l64684l24604k85624
58779F002985k49502k16427j88034j68466j60086j60782j67220j77778j90381
58770D324309k00655k04941k03052j96261j84994j70271j54891j40867j27662
58761B740715j14471j02093r1049q0250o9175n9100n0727m2914l5126k8653k3977
$$ plain form
58825 5452325 5718969 6010023 6326222 6671312 7050294 7466155 7920279 8414476 8950053
58816 8950053 9525901 10139682 10789597 11472364 12180027 12900652 13620945 14325775 14996127
58807 14996127 15610244 16146761 16585589 16907782 17098210 17149107 17060031 16835609 16485482 16025227
58797 16025227 15474350 14852745 14179855 13475461 12758285 12043588 11343275 10667248 10022784
58788 10022784 9413756 8842666 8312715 7826163 7382028 6977897 6613213 6288609 6002985
58779 6002985 5753483 5537056 5349022 5180556 5020470 4859688 4692468 4514690 4324309
58770 4324309 4123654 3918713 3715661 3519400 3334406 3164135 3009244 2868377 2740715
58761 2740715 2626244 2524151 2433102 2352852 2283677 2224577 2173850 2130936 2095810 2067157 2043180
58750B043180j9473j4137r107n153j437J710J737k608r258j5907k2533k9293l4756
58737A882965l7994l9973m1298m1118l9607l8605l8360l6748l3347l1009l1404
58726A473502l2301l1489l0241l0444l1127l0527k9066k7814k6334k4260k2711
58715A157188k2052k0642j7846j5656j5404j5516j4583j3758j3955j3560j1441
58704I82775r358q872q559o869n124m899n007l925k837l445m861n405n502o246
58690I01866p085p231p403p879o999l785L7K760N103P962J0360J1908J4580J9510
58676I33704K4652K8050L0885L4756L8722M1761M5530N1775N9416O6845P4270
58665A430366Q0758Q1715P2886N5034L1910N894k1210m5622o3491p4062p8319
$$ plain form
58750 2043180 2023707 2009570 2000463 1995310 1993873 1995583 1997320 1994712 1985454 1969547 1947014 1917721 1882965
58737 1882965 1844971 1804998 1763700 1722582 1682975 1644370 1606010 1569262 1535915 1504906 1473502
58726 1473502 1441201 1409712 1379471 1349027 1317900 1287373 1258307 1230493 1204159 1179899 1157188
58715 1157188 1135136 1114494 1096648 1080992 1065588 1050072 1035489 1021731 1007776 994216 982775
58704 982775 973417 964545 955986 949117 943993 939094 934087 930162 927325 923880 919019 913614 908112 901866
58690 901866 894781 887550 880147 872268 865269 861484 861521 864281 869384 877346 887706 899614 914194 933704
58676 933704 958356 986406 1017291 1052047 1090769 1132530 1178060 1229835 1289251 1356096 1430366
58665 1430366 1511124 1592839 1665725 1720759 1752669 1758563 1737353 1691731 1628240 1554178 1475859
58654A475859p6507o9624o1030n3342m5603l6301k7037k0207j5196j0022m786
58643A056204n31L506Q400J3176J6735K0266K4968K9423L2122L4576L8956M4619
58631A322420M9858N5106O1455O8164P4534Q2218R2659J04295J15239J26575J39991
58620B292514J54360J67792J80864J94524K06854K15104K18922K18407K11150
58611D060491J94538J69076J36486R6779N0479J496m5540q8841j27434j58334
58601D289196j79342j92337k00185k02572j98327j89405j78822j66874j53101
58592B628231j39537j28100j17059j04076r0638p9446o9720n9243m8898m0900
58582A750614l4489k7665k1250j7027j3751r232m474j496J005N406J0594J4052
$$ plain form
58654 1475859 1399352 1329728 1268698 1215356 1169753 1133452 1106415 1086208 1071012 1060990 1056204
58643 1056204 1055673 1059179 1067579 1080755 1097490 1117756 1142724 1172147 1204269 1238845 1277801 1322420
58631 1322420 1372278 1427384 1488839 1557003 1631537 1713755 1806414 1910709 2025948 2152523 2292514
58620 2292514 2446874 2614666 2795530 2990054 3196908 3412012 3630934 3849341 4060491
58611 4060491 4255029 4424105 4560591 4657370 4707849 4709345 4663805 4574964 4447530 4289196
58601 4289196 4109854 3917517 3717332 3514760 3316433 3127028 2948206 2781332 2628231
58592 2628231 2488694 2360594 2243535 2139459 2048821 1969375 1899655 1840412 1791514 1750614
58582 1750614 1716125 1688460 1667210 1650183 1636432 1627200 1622726 1621230 1622235 1627641 1638235 1652287
58570A652287J6564K0184K3312K2564J8019J1971M168o918j9379k9375l6276m1840
58558A635281m5515m5120m1127l5887k9775k2382j6105j4030j5420j7631k0947
58547A331342k7025l4088l8575m0336m1451m1331l7930l2629k8811k6486k3187
58536I59493j9192j7003j6452j5207j3362j2795j2948j1817j0199j0244j0910
58525H09364r629p300o721p208n888l218k030k057o72J849L044L317N044P510
58511G85405Q032P232P850R255Q667O883P148R111R702R255J0758J3629J4422
58498I07349J3402J4252J7293J9024J8475J7981J7582J4800J0307P647O786L932
58486A068830j569o107q390j1248j5792j9350k0493k0992k1642k0950j8933j7611
$$ plain form
58570 1652287 1668851 1689035 1712347 1734911 1752930 1764901 1769069 1762151 1742772 1713397 1677121 1635281
58558 1635281 1589766 1544646 1503519 1467632 1437857 1415475 1399370 1385340 1369920 1352289 1331342
58547 1331342 1304317 1270229 1231654 1191318 1149867 1108536 1070606 1037977 1009166 982680 959493
58536 959493 940301 923298 906846 891639 878277 865482 852534 840717 830518 820274 809364
58525 809364 799735 792435 785714 778506 772618 769400 767370 765313 764641 766490 769534 772851 777895 785405
58511 785405 793437 800669 808519 817774 826441 833324 840472 849583 859285 868540 879298 892927 907349
58498 907349 920751 935003 952296 971320 989795 1007776 1025358 1040158 1050465 1058112 1064898 1068830
58486 1068830 1067261 1061154 1052764 1041516 1025724 1006374 985881 964889 943247 922297 903364 885753
58474H85753j7098j5653j3795j3677j4511j3484j1055j0180j0609r277o157m222
58462G46035l740k209J97Q62J72J010L036L427K973N204R652J2391J3202J5539
58448H07751J9364K0921K0032K0635K3432K4857K4070K4067K4847K2519J6347
58437A048842J0019M815j782r568j4749j6814j9398k2925k3334j9671j6071j4449
58425I04915j1988p584m129k546r2L724N969O531Q991J3828J7394J8843K1213
58412I75069K4457K4628K1414J8978J7801J3387M955k394o326j0328j5826j9090
58400A046725j8703j8427j9770j9119j5151j1735j0616q536m488k431l780m450
58388I09519k384q26j290o14K160L374K131K536N732P343N784N234P330P969N725
$$ plain form
58474 885753 868655 853002 839207 825530 811019 797535 786480 776300 765691 756414 750257 746035
58462 746035 742295 740086 740283 741145 741317 742327 745363 748790 751763 756967 766619 779010 792212 807751
58448 807751 827115 848036 868068 888703 912135 936992 961062 985129 1009976 1032495 1048842
58437 1048842 1058861 1063676 1061894 1052326 1037577 1020763 1001365 978440 955106 935435 919364 904915
58425 904915 892927 885343 881214 878668 878576 882300 888269 894800 903791 917619 935013 953856 975069
58412 975069 999526 1024154 1045568 1064546 1082347 1095734 1100689 1098295 1091969 1081641 1065815 1046725
58400 1046725 1028022 1009595 989825 970706 955555 943820 933204 924668 920180 917749 913969 909519
58388 909519 907135 906309 905019 904405 906565 909939 912070 914606 920338 927681 933465 938699 946029 953998 959723
58373I59723N185Q247J0228Q564P434R650J1830J1685J2323J5209J6574J4983
58361A091635J4880J8481K1760K2349K3571K6619K6836K2012J6612J3569R707
58350A308031L277k042m621q052j2949j4185j0406p480q201p638l107O29Q78K213
58336A236347P042J0389R502R316J2862J5567J4661J4792J8624K1368K0449K0995
58324A411914K5676K8938K7492K6571K9481L0895K7173K3218K2319J9435J1587
58313A684699M721K951J274l809o882m293j630k806k446L025P612P204P654J3037
58299A710311J7166J5597J4785J9938K5107K4759K3977K7455K9857K7156K6061
58288A962169L1828L8050L8936M0228M7341N4561N6844O0210O9145P5808P3497
$$ plain form
58373 959723 964908 973155 983383 991947 999381 1009031 1020861 1032546 1044869 1060078 1076652 1091635
58361 1091635 1106515 1124996 1146756 1169105 1192676 1219295 1246131 1268143 1284755 1298324 1308031
58350 1308031 1311308 1309266 1304645 1296593 1283644 1269459 1259053 1251573 1243372 1235734 1232627 1233256 1234134 1236347
58336 1236347 1243389 1253778 1263280 1272596 1285458 1301025 1315686 1330478 1349102 1370470 1390919 1411914
58324 1411914 1437590 1466528 1494020 1520591 1550072 1580967 1608140 1631358 1653677 1673112 1684699
58313 1684699 1689420 1692371 1693645 1689836 1682954 1678661 1677031 1674225 1671779 1674804 1682416 1689620 1697274 1710311
58299 1710311 1727477 1743074 1757859 1777797 1802904 1827663 1851640 1879095 1908952 1936108 1962169
58288 1962169 1993997 2032047 2070983 2111211 2158552 2213113 2269957 2330167 2399312 2475120 2548617
58277B548617O8685O8025O5948N7322M9331M7979M5705L5733K5649K3237K2147
58266C058378J5762J1655J7388K5435K7348K9420L8717M7473M7539M6600N3428
58255C419143O0964O0890O0637O8462P6344P5823P5812Q5949R7440R9841J01257
58244D282562J11715J22553J23464J23748J34623J46975J49438J51670J65898
58235E512646J82580J89061J94692K11813K30122K36799K43198K63365K85733
58226G550009K95745L06154L33375L64854L83301M01664M38669M81971N13134
58217A1068876N46169O01302O64406P15045P69988Q53649R51464J041377J144212
58208A8356488J290300J465431J647181J863986K156158K512875K918379L425419
$$ plain form
58277 2548617 2617302 2685327 2751275 2808597 2857928 2905907 2951612 2987345 3012994 3036231 3058378
58266 3058378 3074140 3085795 3103183 3128618 3155966 3185386 3224103 3271576 3319115 3365715 3419143
58255 3419143 3480107 3540997 3601634 3670096 3746440 3822263 3898075 3984024 4081464 4181305 4282562
58244 4282562 4394277 4516830 4640294 4764042 4898665 5045640 5195078 5346748 5512646
58235 5512646 5695226 5884287 6078979 6290792 6520914 6757713 7000911 7264276 7550009
58226 7550009 7845754 8151908 8485283 8850137 9233438 9635102 10073771 10555742 11068876
58217 11068876 11615045 12216347 12880753 13595798 14365786 15219435 16170899 17212276 18356488
58208 18356488 19646788 21112219 22759400 24623386 26779544 29292419 32210798 35636217
58200C5636217M105657M965212N992096P236660Q740654J0441308J2276228J4337068
58192A03731100J6787075J9716392K3269883K7741468L3039494L7897002M0060885
58185C02243299L7725990L0761475K0416724Q157877m791936j7014572k6780960
58178C50717897l2819637l5051055l4386473l1957074k8644236k5066983k1624795
58171A41167644j8471195j5599288j3010549j0748852q807961p116752n625588
58164F1787459m326338l173277k059294r18569J64940R74845J297196J059427
58156E4806389L61125o18506j723814k820087l734091m286549m416885m227639
58148C3339943l875863l458656l020633k607203k252528j946692j665430j415143
$$ plain form
58200 35636217 39741874 44707086 50699182 57935842 66676496 77117804 89394032 103731100
58192 103731100 120518175 140234567 163504450 191245918 224285412 262182414 302243299
58185 302243299 339969289 370730764 391147488 399305365 394513429 377498857 350717897
58178 350717897 317898260 282847205 248460732 216503658 187859422 162792439 141167644
58171 141167644 122696449 107097161 94086612 83337760 74529799 67413047 61787459
58164 61787459 57461121 54287844 52228550 51309981 51474921 52449766 53746962 54806389
58156 54806389 55167514 54549008 52825194 50005107 46271016 41984467 37567582 33339943
58148 33339943 29464080 26005424 22984791 20377588 18125060 16178368 14512938 13097795
58140A3097795j213355j048404q97020p62995o62245n86260n15032m51435m09601
58131F551448l82419l52065l20901l01867k89271k68026k41763k23942k10601
58122C960593j88767j62930j46934j37745j22763j05458r8901j00534r7488r0788
58112B708285r1028r5656r3133q4643q0174p7927o8637n5527m9371m7929m0425
58101A923835k8470k3015k4117k2701j9072k1125k7326k9415k9162l4860m4014
58090A620558m6673m3370m3055m5821m4179l8985l7802l9601l7000l1632l1541
58079A180899l5286l4107k8227k5755k7004k4866j9456j7599j8864j6517j1339
58068I21879j0409j3085j2156p970p573j0615r923n576m754p809p974m832m887
$$ plain form
58140 13097795 11884440 10836036 9939016 9176021 8513776 7927516 7412484 6961049 6551448
58131 6551448 6169029 5816964 5496063 5194196 4904925 4636899 4395136 4171194 3960593
58122 3960593 3771826 3608896 3461962 3324217 3201454 3095996 2997095 2896561 2799073 2708285
58112 2708285 2617257 2521601 2428468 2343825 2263651 2185724 2117087 2061560 2012189 1964260 1923835
58101 1923835 1895365 1872350 1848233 1825532 1806460 1785335 1758009 1728594 1699432 1664572 1620558
58090 1620558 1573885 1530515 1487460 1441639 1397460 1358475 1320673 1281072 1244072 1212440 1180899
58079 1180899 1145613 1111506 1083279 1057524 1030520 1005654 986198 968599 949735 933218 921879
58068 921879 911470 898385 886229 878259 870686 860071 850148 844572 839818 832009 824035 819203 814316
58055H14316q519r347o923p353j0749j0627o513m958p070p013l803k882m831m069
58041G19659r0J235j122j645R14J749K27J272N221O673M854M861P279O810K849
58026G60746J198L429M468K683K560N256O035L489K186L809M380K552K147M294
58012H09232N250M134M676P452Q402O797O652Q506P901L774L70r30l724q784j2191
57997H47517j3063j5272j9476k1321j9584j8368j9069j7904j3635j0126q893o570
57985F64236k162N42K47O44L184M451L196K948N100O279N117M841O554O763M279
57970G16219K845M093M463K108L67J308J965K47j353j076j282l461n124m655m153
57955G12511m890m893l403k613k839j232K599N003M436L828M703M542K234N09
$$ plain form
58055 814316 805797 796450 789527 782174 771425 760798 754285 749327 742257 735244 731441 728559 723728 719659
58041 719659 719569 720804 719682 718037 718951 720700 720927 722199 727420 734093 738947 743808 751087 757897 760746
58026 760746 761944 765373 769841 772524 775084 780340 786375 789864 792050 795859 800239 802791 804938 809232
58012 809232 814482 818616 823292 830744 839146 845943 852595 861101 869002 872776 873146 872216 868492 859708 847517
57997 847517 834454 819182 799706 778385 758801 740433 721364 703460 689825 679699 670806 664236
57985 664236 662074 662616 662863 663507 666691 671142 674338 677286 682386 688665 693782 698623 705177 711940 716219
57970 716219 719064 723157 727620 729728 730095 731403 733368 733615 732262 731186 729904 726443 721319 716664 712511
57955 712511 707621 702728 699325 696712 693873 692641 695240 700243 704679 708507 713210 717752 719986 720495
57941G20495M98o76m301p439q370r384j1649j2696j1580j1251j3025j3881j2081
57928F04660j0381j0805j1120r457p628o994n750l024j068p24N73L671N379M143
57914E51475L154M832O843O785O406P885R983J1053J2062J3649J4022J2437J1077
57901F71663J1007J0064P146M611L973L304J313j75l16j490m765p296p006n816
57887F86217n585m985l179k385l707m473k784r06j104j818j083n1o6K73K194M120
57871F60678M685N074N975N828M464M562O855Q010O068L860L956M323K553L45
57857G27236M4K91r95k520k285j410j657j921o85O41K58o67l02N73N52L78R67
57840G18498J164J08q43r26j770l933m917l397k189l880o737q021q323r338j0341
$$ plain form
57941 720495 720993 720317 716016 708577 700207 690823 679174 666478 654898 643647 630622 616741 604660
57928 604660 594279 583474 572354 562897 555269 548275 542525 539501 538433 537709 538282 541953 547332 551475
57914 551475 554629 559461 566304 573089 579495 587380 597363 608416 620478 634127 648149 660586 671663
57901 671663 682670 692734 699880 704491 708464 711768 713081 712906 712590 711100 706335 699039 692033 686217
57887 686217 680632 675647 672468 670083 666376 661903 659119 658213 657109 655291 654208 654157 654091 654364 656558 660678
57871 660678 665363 670437 676412 682240 686704 691266 698121 706131 712199 716059 720015 724338 726891 727236
57857 727236 727280 727571 726576 724056 721771 720361 718704 716783 716098 716739 716997 716330 716028 716601 717153 717531 718498
57840 718498 719662 719770 718927 718001 716231 712298 707381 703984 701795 697915 691178 683157 674834 665496 655155
57825F55155j0178r945j0515j0191p946o133o698p672o661m887m321l807j717
57812E64484L12J33r37n33P26J278K105M554O981P401P286R006J1592J2791J3119
57797F40298J4164J4888J3529J1301J0387R978Q102N739N236O117O151N229M577
57784G55696L598R92k230m328n987q588j0891j0972r968j0223j1020r982p510
57771F68587o004n584m348k250j132j223r01K95J349K032K897L528L336L297M581
57756F68460O303O968O963P290P277O086M979N353O092N689N332O765Q726Q863
57742G61146P758P640Q361Q174P348P495Q256Q129P716Q672J0290J0580J0002
57729H71567J0626J2320J3277J3739J5506J8176J9519J9419J9976K1707K3021
$$ plain form
57825 655155 644977 635032 624517 614326 606380 600247 593549 585877 579216 574329 570008 566201 564484
57812 564484 564796 564929 563992 563459 564185 565463 567568 572122 579103 586504 593790 602796 614388 627179 640298
57797 640298 654462 669350 682879 694180 704567 714545 722647 728386 733622 739739 745890 751119 755696
57784 755696 759294 760286 758056 753728 747741 739153 728262 717290 707322 697099 686079 676097 668587
57771 668587 662583 656999 652651 650401 649269 648046 647145 647440 648789 650821 653718 657246 660582 663879 668460
57756 668460 674763 681731 688694 695984 703261 709347 714326 719679 725771 731460 736792 743557 752283 761146
57742 761146 768904 776544 784905 793079 800427 807922 816178 824307 832023 840695 850985 861565 871567
57729 871567 882193 894513 907790 921529 937035 955211 974730 994149 1014125 1035832 1058853
57718A058853K3527K4597K6475K7869K8680L0248L2734L5034L7408M1445M7303
57707A414173N3555N9799O6915P4892Q2978R1831J02797J15202J27079J38510
57697B327731J51446J66226J81023J94859K08335K20877K29850K32820K28540
57688D141707K15492J91899J57842J15710O8486J9173k8515p1051j06665j34443
57678D569635j52733j60505j59501j52604j40621j23018j00832p6257n0231k3849
57668C429484j715R620P095p389l0488n9186q9002j14090j30532j37669j36060
57657B740068j26642j12104r6261q1110o6325n1789l8429k6393j4797l575O508
57646B129151J5848K5714L5990M5531N4845O5930P9187R2919J06169J19758J34132
$$ plain form
57718 1058853 1082380 1106977 1133452 1161321 1190001 1220249 1252983 1288017 1325425 1366870 1414173
57707 1414173 1467728 1527527 1594442 1669334 1752312 1844143 1946940 2062142 2189221 2327731
57697 2327731 2479177 2645403 2826426 3021285 3229620 3450497 3680347 3913167 4141707
57688 4141707 4357199 4549098 4706940 4822650 4891136 4910309 4881794 4810743 4704078 4569635
57678 4569635 4416902 4256397 4096896 3944292 3803671 3680653 3579821 3503564 3453333 3429484
57668 3429484 3427769 3437389 3444484 3437095 3406607 3347421 3258419 3144329 3013797 2876128 2740068
57657 2740068 2613426 2501322 2405061 2323951 2257626 2205837 2167408 2141015 2126218 2122643 2129151
57646 2129151 2144999 2170713 2206703 2252234 2307079 2373009 2452196 2545115 2651284 2771042 2905174
57635B905174J48457J62262J75727J87979J97074K01793K01436J93927J76685
57626D550514J49594J14978P4738L0009j6432o0393r9509j33670j61954j81912
57616D265963j92728j96527j95643j90797j82612j72535j61327j48735j35441
57607B689618j23269j12767j02644r2266q2667p4453o6848n9501n3247m8312m3724
57596A829920l9115l5226l2074k8674k5068k2512k1035j9020j5900j3141j1696
57585A566459j0583q878p154o059n235m454m076l723k313J0J821K840M385O793
57571A529833Q553Q824Q792R580J0703J1566J2658J4337J6044J7562J9473K1686
57559A689611K3222K4087K5609K8279L1072L3498L6549M0856M5766N0818N6453
$$ plain form
57635 2905174 3053631 3215893 3391620 3579599 3776673 3978466 4179902 4373829 4550514
57626 4550514 4700108 4815086 4889824 4919833 4903401 4843008 4743499 4609829 4447875 4265963
57616 4265963 4073235 3876708 3681065 3490268 3307656 3135121 2973794 2825059 2689618
57607 2689618 2566349 2453582 2350938 2258672 2176005 2101552 2034704 1975203 1921956 1873644 1829920
57596 1829920 1790805 1755579 1723505 1694831 1669763 1647251 1626216 1607196 1591296 1578155 1566459
57585 1566459 1555876 1546998 1539844 1533785 1528550 1524096 1520020 1516297 1513984 1513994 1515815 1518655 1523040 1529833
57571 1529833 1538386 1547210 1556002 1565582 1576285 1587851 1600509 1614846 1630890 1648452 1667925 1689611
57559 1689611 1712833 1736920 1762529 1790808 1821880 1855378 1891927 1932783 1978549 2029367 2085820
57548B085820O2734O9162P6249Q5225R5727J05903J15293J25325J36315J46512
57538C104265J54926J62487J69197J72479J69759J60506J44526J20778Q9547N3847
57528D502317J6941j9701n4743q5460j09739j27876j40672j47511j48045j44138
57518C541373j38141j30511j20822j09883r9119q8902p9085p0032o1823n3495
57508B589560m4588l6320k9905k4774j9757j4886j0697o801k606J416M590P406
57496B412638J0904J5305K0163K5068K9610L3597L7846M3596N0610N7252O3082
57485B799671O9593P7738Q6596R5502J05503J17229J29169J39653J48909J57402
57475C926965J63552J64950J60584J50244J33000J08250P7374M2772O007l1510
$$ plain form
57548 2085820 2148554 2217716 2293965 2379190 2474917 2580820 2696113 2821438 2957753 3104265
57538 3104265 3259191 3421678 3590875 3763354 3933113 4093619 4238145 4358923 4448470 4502317
57528 4502317 4519258 4499557 4444814 4359354 4249615 4121739 3981067 3833556 3685511 3541373
57518 3541373 3403232 3272721 3151899 3042016 2942897 2853995 2774910 2704878 2643055 2589560
57508 2589560 2544972 2508652 2478747 2453973 2434216 2419330 2408633 2401832 2399226 2400642 2405232 2412638
57496 2412638 2423542 2438847 2459010 2484078 2513688 2547285 2585131 2628727 2679337 2736589 2799671
57485 2799671 2869264 2947002 3033598 3129100 3234603 3351832 3481001 3620654 3769563 3926965
57475 3926965 4090517 4255467 4416051 4566295 4699295 4807545 4884919 4927691 4933698 4902188
57465D902188o7074r7659j21849j39494j50334j54438j53247j48614j41303j31582
57455C596594j20564j09635r9136q8830p9081p0401o2522n5029m8244m2481l7222
57444B783449l2016k7421k3928k0845j7323j3715j0740q245n869m043l117k270
57432B613917n98J455K892L692M393M990N331N890O982P925Q155Q363R376J0671
57418B693434J1284J1487J2275J3681J4838J5316J5333J5072J4743J4819J5376
57407B847658J5660J5197J4712J5242J6799J8562J9760J9896J8936J7842J7872
57396C038136J8827J9153J8336J7810J8607J9709J9923J9878K0696K1884K2222
57385C255181K1771K1468K1460K1282K1067K1269K1664K1829K1999K2459K2748
$$ plain form
57465 4902188 4835114 4737455 4615606 4476112 4325778 4171340 4018093 3869479 3728176 3596594
57455 3596594 3476030 3366395 3267259 3178429 3099348 3028947 2966425 2911396 2863152 2820671 2783449
57444 2783449 2751433 2724012 2700084 2679239 2661916 2648201 2637461 2629216 2623347 2619304 2616187 2613917
57432 2613917 2613319 2614774 2617666 2621358 2625751 2630741 2636072 2641962 2648944 2656869 2665024 2673387 2682763 2693434
57418 2693434 2704718 2716205 2728480 2742161 2756999 2772315 2787648 2802720 2817463 2832282 2847658
57407 2847658 2863318 2878515 2893227 2908469 2925268 2943830 2963590 2983486 3002422 3020264 3038136
57396 3038136 3056963 3076116 3094452 3112262 3130869 3150578 3170501 3190379 3211075 3232959 3255181
57385 3255181 3276952 3298420 3319880 3341162 3362229 3383498 3405162 3426991 3448990 3471449 3494197
57374C494197K2423K1911K1763K1846K2026K2632K3418K3361K2368K1871K2619
57363C740435K3378K3120K2934K4117K5734K6041K5256K4967K5582K6262K6745
57352D014571K7430K8046K7878K7061K6332K5893K5603K5709K6235K6377K5668
57341D306803K4948K5073K5615K5930K6428K7452K8132K7767K7295K7776K8597
57330D601816K8812K9057L0284L1683L1869L1326L1619L2927L4214L5120L5817
57319D954544L5834L4951L4549L5963L8196L9309L9395M0036M1403M2298M2647
57308E379125M3556M5012M5835M5965M6696M8421N0143N1348N2604N4147N5578
57297E918430N6980N8776O0398O0812O0314O0224O0706O0494N8754N5823N2078
$$ plain form
57374 3494197 3516620 3538531 3560294 3582140 3604166 3626798 3650216 3673577 3695945 3717816 3740435
57363 3740435 3763813 3786933 3809867 3833984 3859718 3885759 3911015 3935982 3961564 3987826 4014571
57352 4014571 4042001 4070047 4097925 4124986 4151318 4177211 4202814 4228523 4254758 4281135 4306803
57341 4306803 4331751 4356824 4382439 4408369 4434797 4462249 4490381 4518148 4545443 4573219 4601816
57330 4601816 4630628 4659685 4689969 4721652 4753521 4784847 4816466 4849393 4883607 4918727 4954544
57319 4954544 4990378 5025329 5059878 5095841 5134037 5173346 5212741 5252777 5294180 5336478 5379125
57308 5379125 5422681 5467693 5513528 5559493 5606189 5654610 5704753 5756101 5808705 5862852 5918430
57297 5918430 5975410 6034186 6094584 6155396 6215710 6275934 6336640 6397134 6455888 6511711 6563789
57286F563789M7577M2719L7902L2705K6711K0830J6397J3358J0825Q852Q068Q038
57274F837771P809P635Q456J0145J2025J4483J8081K1700K3773K4904K6930K9830
57262G043542L1984L3293L5321L8278M0492M1283M1858M2842M3267M2744M2452
57251G477356M3080M3667M3356M2617M2115M1820M1733M2084M2521M2471M2391
57240G945211M3066M3875M3536M2502M2517M3716M4420M3952M3325M2801M1302
57229H420223L9065L8552M1502M6902N2648N7504O0572O0846N8515N5242N2195
57218H983766M8977M5063M0911L7040L3351K9997K7572K6050K4777K3668K3062
57207I344234K2383K0663J8447J7181J6693J5285J2650J0452R601R158Q486Q285
$$ plain form
57286 6563789 6611366 6654085 6691987 6724692 6751403 6772233 6788630 6801988 6812813 6821665 6829733 6837771
57274 6837771 6845580 6853215 6861671 6871816 6883841 6898324 6916405 6938105 6961878 6986782 7013712 7043542
57262 7043542 7075526 7108819 7144140 7182418 7222910 7264193 7306051 7348893 7392160 7434904 7477356
57251 7477356 7520436 7564103 7607459 7650076 7692191 7734011 7775744 7817828 7860349 7902820 7945211
57240 7945211 7988277 8032152 8075688 8118190 8160707 8204423 8248843 8292795 8336120 8378921 8420223
57229 8420223 8459288 8497840 8539342 8586244 8638892 8696396 8756968 8817814 8876329 8931571 8983766
57218 8983766 9032743 9077806 9118717 9155757 9189108 9219105 9246677 9272727 9297504 9321172 9344234
57207 9344234 9366617 9387280 9405727 9422908 9439601 9454886 9467536 9477988 9487589 9496747 9505233 9513518
57195I513518Q758Q910Q528Q740R758J0083Q900P360O596O299O132O632P834Q788
57181I626836R261J0157J1488J1965J1331J1086J1975J2800J2647J2222J1982
57170I753750J1044R023O914N037K184k079o315r641j3096j7316k0957k2943k4379
57157I671226k6620k9249l1468l3815l7024m0770m4915n0374n7480o5173p3246
57146I181092q3633r7956j15171j32855j49014j60877j63333j50917j21924q0906
57136G924506l7999m841J1940J4680J1069O586J891l526q948j4187k0268k7136
57124G853767l3513l9762m7767n7046o4269o7664o8464o7005o1409n1683m1226
57113G253959l2271k3365j3047k111R744K5400M6137O9860R5816J27207J67150
$$ plain form
57195 9513518 9522276 9531186 9539714 9548454 9558212 9568295 9577195 9584555 9591151 9597450 9603582 9610214 9618048 9626836
57181 9626836 9636097 9646254 9657742 9669707 9681038 9692124 9704099 9716899 9729546 9741768 9753750
57170 9753750 9764794 9773817 9780731 9785768 9787952 9785873 9779558 9769917 9756821 9739505 9718548 9695605 9671226
57157 9671226 9644606 9615357 9583889 9550074 9513050 9472280 9427365 9376991 9319511 9254338 9181092
57146 9181092 9097459 8999503 8884332 8751477 8602463 8441586 8278253 8127336 8005412 7924506
57136 7924506 7886507 7881666 7893606 7908286 7919355 7925941 7927832 7924306 7915358 7901171 7880903 7853767
57124 7853767 7820254 7780492 7732725 7675679 7611410 7543746 7475282 7408277 7346868 7295185 7253959
57113 7253959 7221688 7198323 7185276 7183165 7192909 7218309 7264446 7334306 7430122 7557329 7724479
57102G724479K16423K77463L56089M56945N82169P36589R28137J159772J426150
57093A3864216J720092K034880K357902K672082K968903L250490L513268L741201
57085C6123034L921731M051379M110424M048114L817489L417723K877452K202237
57077F4569583J372972M06642o09473j563519k383979l047644l547061l878638
57069E1318883m056116m109285m063230l931091l727242l473547l189302k885671
57061B1883399k573478k267897j981834j721237j489408j289839j122102r80331
57053H457273q58640p54505o65694n88428n20402m61812m11721l66783l24975
57044C504313k87391k55039k26794k01788j80883j64315j50342j37484j25966
$$ plain form
57102 7724479 7940902 8218365 8574454 9031399 9613568 10350157 11278294 12438066 13864216
57093 13864216 15584308 17619188 19977090 22649172 25618075 28868565 32381833 36123034
57085 36123034 40044765 44096144 48206568 52254682 56072171 59489894 62367346 64569583
57077 64569583 65942555 66349197 65739724 64176205 61792226 58744582 55197521 51318883
57069 51318883 47262767 43153482 39090252 35159161 31431919 27958372 24769070 21883399
57061 21883399 19309921 17042024 15060190 13338953 11849545 10559706 9437604 8457273
57053 8457273 7598633 6844128 6178434 5590006 5069604 4607792 4196071 3829288 3504313
57044 3504313 3216922 2961883 2735089 2533301 2352418 2188103 2037761 1900277 1774311
57035A774311j15914j06259r6467q7400p9572p2275o5195n9117n4250m9546m4420
57024I43896l9687l6004l2757k9255k5834k2998k0456j7578j4046r774m899PM488
57011F95103R166J5292K3225L2169M1748N3432O9788R1593J14876J31103J31936
57000A409431J14694Q2737M1153n626n1741q9051j11471j19188j16654j07714
56990A046570r4581p9923o6585n5253m4624l4042k4267j5926r153m688l586n713
56978F08229r859j5066k0503k4566k5895k5096k3874k2650k0600j7710j4968j2619
56966C74823r926o762l875j533P76L328O216J0087J5236K0060K2075K0551J6684
56953D67740J1326M227m250j2395j8596k2303k3455k2284j9939j7862j6155j3672
$$ plain form
57035 1774311 1658397 1552138 1455671 1368271 1288699 1216424 1151229 1092112 1037862 988316 943896
57024 943896 904209 868205 835448 806193 780359 757361 736905 719327 705281 695507 690608 690615 695103
57011 695103 704269 719561 742786 774955 816703 870135 939923 1031516 1146392 1277495 1409431
57000 1409431 1524125 1606862 1648015 1642389 1590648 1501597 1390126 1270938 1154284 1046570
56990 1046570 951989 872066 805481 750228 705604 671562 647295 631369 622216 617528 613942 608229
56978 608229 598370 583304 562801 538235 512340 487244 463370 440720 420120 402410 387442 374823
56966 374823 364897 358135 354260 352727 353503 356831 363047 373134 388370 408430 430505 451056 467740
56953 467740 479066 483293 479043 466648 448052 425749 402294 380010 360071 342209 326054 312382
56941C12382r936n817k129J237M500P437J0144J3468J8210K4262L0386L4425L4177
56928D72746K9024K0434J0145j415j3922k5266l2697l5535l5319l3445l0238k6164
56916B98348k2212j8850j5865j3332j1526j0066q443p178p007p206o377m705l624
56903A61957l311k514r97p3j80R0J677L563M490M731N190O026P121Q763J1021
56888B07554J3419J5852J8772K1740K2935K0932J6218J0198L695k869q685j2895
56876C26866j5210j5662j4304j1556q284n074j931J157M127P457J1891J7212K2283
56863C18972K6759L1801L8291M5057M9497M9504M4359L4516K1259O372q362k1362
56851F36663l1165l6734l8032l5900l1378k5449j9090j2835o362P93Q273J5326
$$ plain form
56941 312382 302446 296629 294500 295737 300237 307674 317818 331286 349496 373758 404144 438569 472746
56928 472746 501770 522204 532349 530934 517012 491746 459049 423514 388195 354750 324512 298348
56916 298348 276136 257286 241421 228089 216563 206497 198054 190876 183869 176663 170286 165581 161957
56903 161957 158646 156132 155135 155062 154882 154972 156649 160212 164702 169433 174623 180649 187770 196533 207554
56888 207554 220973 236825 255597 277337 300272 321204 337422 347620 351315 348446 339761 326866
56876 326866 311656 295994 281690 270134 261850 256776 254845 256002 260129 267586 279477 296689 318972
56863 318972 345731 377532 415823 460880 510377 559881 604240 638756 660015 666387 658025 636663
56851 636663 605498 568764 530732 494832 463454 438005 418915 406080 399718 400511 408784 424110
56839D24110K1959K8917L6841M6200N7349O9242P8328Q0336P3445N8798L8312
56828A013837J3675j2448l6139n4126o5141o9256o7290o1200n3582m5835l7658
56817E24837k8721j9762j1570l969L508J0916J8470K6947L6786M7030N5438N9157
56805G19067N5715M4583K7967R173r765k7820m2927n2316n5334n4234n1383m7200
56793E15526m1422l4750k8136k1736j5604j0322o041j843K999Q216J3673J9946
56781D00506K6578L0886L0090K4059J4885M478o237j6319k4556l0266l3489l4394
56769C86221l3164l0357k6797k3131j9781j7047j4873j2875j0901r231p986o868
56757A73210n682m680m119l942m037m310m420m036l416l065k849k230j343r29
$$ plain form
56839 424110 446069 474986 511827 558027 615376 684618 762946 843282 916727 975525 1013837
56828 1013837 1027512 1015064 978925 924799 859658 790402 723112 661912 608330 562495 524837
56817 524837 496116 476354 464784 460815 464323 475239 493709 520656 557442 604472 659910 719067
56805 719067 774782 819365 847332 856505 846740 818920 775993 723677 668343 614109 562726 515526
56793 515526 474104 439354 411218 389482 373878 363556 357515 355672 358671 366887 380560 400506
56781 400506 427084 457970 488060 512119 527004 531482 525245 508926 484370 454104 420615 386221
56769 386221 353057 322700 295903 272772 252991 235944 221071 208196 197295 188064 180078 173210
56757 173210 167528 162848 158729 154787 150750 146440 142020 137984 134568 131503 128654 126424 125081 124152
56743A24152j076j068o78n76j078j523j350r57r99j493j998k171j904j432j294
56728A04555j604j684j084n46q80j414r54J84O80M28M74Q51N56k95m36J65J14
56711I9110o81n00J112K169J383K91O65J725J731Q06K60K76J21k45k90J9M30J072
56693A09454J864K132J704J475J915K170J564Q28Q05J108J147J276J754J769P78
56678A31743k68m21l30j036k160k649k411j959j323n40k85p84j019k65N79M04
56662A17276l43o88q16j313j699j264n40m55p48o44l66n30p96n73l63r46j842
56645A03350j963j271n17KL02jr89j739j549j106j228j339o12L42M10j24j82K46
56627I2032L20o2l04k63j15L66J262J852J613J101Q69M84l19o59j7N17L4m24M00
$$ plain form
56743 124152 123076 122008 121330 120754 119676 118153 116803 115846 114847 113354 111356 109185 107281 105849 104555
56728 104555 102951 101267 100183 99637 98757 97343 96389 96573 97253 97681 98155 99006 99562 99267 98831 98996 99110
56711 99110 98429 97929 99041 101210 102593 102884 103549 105274 107005 107811 108071 108347 108468 108223 107933 107952 108382 109454
56693 109454 111318 113450 115154 116629 118544 120714 122278 123106 123911 125019 126166 127442 129196 130965 131743
56678 131743 131475 131054 130724 129688 127528 124879 122468 120509 119186 118646 118361 117577 116558 116293 116872 117276
56662 117276 116933 116245 115429 114116 112417 111153 110613 110158 109410 108766 108400 107870 107074 106501 106138 105192 103350
56645 103350 101387 100116 99599 99601 99903 99902 98913 97174 95625 94519 93291 91952 91340 91682 92092 91968 91786 92032
56627 92032 92352 92290 91986 91723 91608 91974 93236 95088 96701 97802 98671 99155 98836 98177 98160 98677 98711 98287 98687
56608I8687J666J761Q78L62L44M4l32q7K87j23p32k75R68J628J425J068N98l23
56590A07844j015o24J71J44l25M9J168J943K360L061L520K787J608J527K255K252
56574A28725J607J871L124L704L059K520K900L476L746M203M905N103M802M970
56560A78715N812O378O164N673N254M773M490M774N023M335L167K776L132K969
56546B43435J752J00j465k729l094k390j899k885m533n122m670m375m192l227
56532B04706k071k137k968k776j557j089j884k622k822l333m033l636k275j674
56518A69829k202k278j348r53j974l130l213k665k172j581r94j015j314q13J69
56503A44346K2j438k477k166j454r94k18P45O53m75q29L33J509J676J878K919
$$ plain form
56608 98687 100353 102114 102992 103354 103698 103742 103410 103323 103610 103487 102755 102480 103448 105076 106501 107569 108167 107844
56590 107844 106829 106205 106376 106520 106195 106244 107412 109355 111715 114776 118296 121083 122691 124218 126473 128725
56574 128725 130332 132203 135327 139031 142090 144610 147510 150986 154732 158935 163840 168943 173745 178715
56560 178715 184527 190905 197069 202742 207996 212769 217259 222033 227056 231391 234558 237334 240466 243435
56546 243435 245187 245287 243822 241093 237999 235609 233710 230825 226292 221170 216500 212125 207933 204706
56532 204706 202635 200498 197530 194754 193197 192108 190224 187602 184780 181447 177414 173778 171503 169829
56518 169829 167627 165349 164001 163048 161074 157944 154731 152066 149894 148313 147319 146304 144990 144177 144346
56503 144346 144368 142930 140453 138287 136833 135839 135621 136366 137019 136544 135715 136048 137557 139233 141111 144030
56487A44030L603K771J263N14O92J392K606L870M051L051K287K535K868K559K395
56472A80487K970L351K653J571J228J600K041K284K244J888J701K206K732K095
56458B11051N63m18n92j079k025k179j268o15q13q68l43k15p80q84r3L68j56n78
56440A99076j46L04J51J17N84O34j58p41m23K6L0J68N78K67j008j907j544p44
56422A95264m22m06n93j460k628k797j929j578k343k934k507j872j580r28K15
56407A71502P41L53K43Q80J227R00Q75J273R04k28m67M94Q51l7l79Q28J984J801
56389A83745J311J533J718J459J885L156L456K195J493K590L512K452Q22O49J354
56374B13330J502J489K009J961L99j252j261k91J56K81Q92J455J293J218J968
$$ plain form
56487 144030 147633 150404 151667 152181 152873 154265 156871 160741 164792 167843 170130 172665 175533 178092 180487
56472 180487 183457 186808 189461 191032 192260 193860 195901 198185 200429 202317 204018 206224 208956 211051
56458 211051 211614 211196 210604 209525 207500 205321 204053 203438 202625 201757 201414 201199 200419 199535 199442 199810 199654 199076
56440 199076 198930 199234 199385 199502 200086 200720 200562 199821 199398 199424 199454 199622 200200 200467 199459 197552 196008 195264
56422 195264 194842 194436 193843 192383 189755 186958 185029 183451 181108 178174 175667 173795 172215 171287 171502
56407 171502 172243 172596 172839 173719 174946 175846 176721 177994 178898 178670 178203 178697 179548 179511 179132 179960 181944 183745
56389 183745 185056 186589 188307 189766 191651 194807 198263 200458 201951 204541 208053 210505 211327 211976 213330
56374 213330 214832 216321 218330 220291 220690 219438 218177 217886 218042 218323 219215 220670 221963 223181 225149
56359B25149K546J936R20N75N66M44Q00J658J666M87j25Q54K004K145K345L549
56343B47519M674M929N477O887P431O137M858N145N672N164N116O869Q562Q005
56329C32445O275N550N478M677L764L873M023K900J508J272J302K91p31l94J56
56314C72389p67k225k293j312p52m81J98M82l74j096m78L70K30J64J230K088J648
56297C69021J595L372N108M757L917N004O863P007O139O607Q029Q363P932Q667
56283D52381J0495J1998J3376J5475J7168J7073J6607J8075K1037K3647K6113
56272F43445K9595L3292L5970L8866M3731M9528N4361N9009O5155P1909P7658
56261A202519Q3519R1212R9241J05100J09581J14866J19941J22047J21293J19531
$$ plain form
56359 225149 227695 229631 230551 231126 231692 232136 232936 234594 236260 236747 236622 237476 239480 241625 243970 247519
56343 247519 252193 257122 262599 269486 276917 283054 287912 293057 298729 303893 309009 315878 324440 332445
56329 332445 338720 344270 349748 354425 358189 362062 366085 368985 370493 371765 373067 373358 372627 372233 372389
56314 372389 371622 369397 367104 365792 365040 364559 364757 365239 364865 363769 363291 363661 363891 364055 365285 367373 369021
56297 369021 370616 373988 379096 383853 387770 392774 399637 406644 412783 419390 427419 435782 443714 452381
56283 452381 462876 474874 488250 503725 520893 537966 554573 572648 593685 617332 643445
56272 643445 673040 706332 742302 781168 824899 874427 928788 987797 1052952 1124861 1202519
56261 1202519 1286038 1377250 1476491 1581591 1691172 1806038 1925979 2048026 2169319 2288850
56251B288850J16019J08519R7729Q6415P4972O1860M7549L4140K1897R837j148
56240B946639r457j6004k2750k9239l4196l8860m4952n1055n5171n9068o5568
56229B520319p3199p8329q1260q5189r0202r3351r3912r3676r2731q9777q6021
56218A562672q3860q2243p8039p1620o6316o2722n8299n2416m7049m2638l7737
56207H79733l2671k9277k7089k4051k0520j8464j7285j4748j1467r947r859q662
56195F55693o290m706l623j265J400J973J321K185M016M187L331M233O234O274
56181F74963M783M991O838P162N548M514M145K270l41o32J024J305M7J83J847
56166G18647K320J689K743N197N920M979N607Q066R385R322J0612J3228J4376
$$ plain form
56251 2288850 2404869 2513388 2611117 2697532 2772504 2834364 2881913 2916053 2937950 2947787 2946639
56240 2946639 2937182 2921178 2898428 2869189 2834993 2796133 2751181 2700126 2644955 2585887 2520319
56229 2520319 2447120 2368791 2287531 2202342 2112140 2018789 1924877 1831201 1738470 1648693 1562672
56218 1562672 1478812 1396569 1318530 1246910 1180594 1117872 1059573 1007157 960108 917470 879733
56207 879733 847062 817785 790696 766645 746125 727661 710376 695628 684161 674214 664355 655693
56195 655693 649403 644697 641074 639809 641209 643182 644503 646688 650704 654891 658222 662455 668689 674963
56181 674963 679746 684737 691575 698737 704285 708799 712944 715214 714873 714241 715265 716570 716617 716800 718647
56166 718647 720967 722656 725399 730596 736516 741495 747102 755168 764553 773875 784487 797715 812091
56153H12091J4397J6605K1078K4593K6845L0669L6181M0932M5923N4797O6975
56142A191086P8305Q8713J02357J19785J36726J50983J63433J71936J71806J63310
56132B538440J51650J38821J22877J05662R3084Q6132P9270O9319N8346M6584
56122C490185L0636J0942o714j9516l0441m1143m9704n7360o9514q7458j06170
56111C063743j22460j37859j51570j58537j57189j51748j44458j33027j17915
56102A788980j04257r3840q2825o9990n9526n3051m6557l8088l0982k6888k3005
56091A159971j8580j6480j6230j3465q197n415n664l856O26K203k03n95L128N538
56077A082781M244M034O968Q344O496O567J0368J2395J0327R543J2757J4990J3528
$$ plain form
56153 812091 826488 843093 864171 888764 915609 946278 982459 1023391 1069314 1124111 1191086
56142 1191086 1269391 1358104 1460461 1580246 1716972 1867955 2031388 2203324 2375130 2538440
56132 2538440 2690090 2828911 2951788 3057450 3150534 3236666 3315936 3385255 3443601 3490185
56122 3490185 3520821 3531763 3525049 3505533 3475092 3433949 3384245 3326885 3257371 3169913 3063743
56111 3063743 2941283 2803424 2651854 2493317 2336128 2184380 2039922 1906895 1788980
56102 1788980 1684723 1590883 1508058 1438068 1378542 1325491 1278934 1240846 1209864 1182976 1159971
56091 1159971 1141391 1124911 1108681 1095216 1087019 1081604 1075940 1072084 1072710 1074913 1074710 1074115 1077243 1082781
56077 1082781 1087025 1091059 1098027 1106371 1112867 1119434 1129802 1142197 1152524 1162067 1174824 1189814 1203342
56064A203342J2922J5494J6664J4518J4033J7055J8263J5728J5164J8869K1064
56053A383116J9153J8699K2018K3143J9543J7545K0320K1926J9250J8275K2286
56042A605274K5560K5012K6236L1615L4532L2022L0895L4756L7681L7394M1176
56031A962153N1348N8641N7825N6188N8594N8592N2883M9692N3461N6006N2479
56020B567862N1072N6794O1017N7831N5350N9714O3458O1229O1261O9224P6580
56009C241392P7201P9416Q9153R7801R9508J03247J14506J23013J22503J24088
55999D271828J35424J45806J47274J50602J63957J76144J78300J81519J94966
55990E745820K07880K12033K19772K40067K59774K69280K82659L10522L38293
$$ plain form
56064 1203342 1216264 1231758 1248422 1262940 1276973 1294028 1312291 1328019 1343183 1362052 1383116
56053 1383116 1402269 1420968 1442986 1466129 1485672 1503217 1523537 1545463 1564713 1582988 1605274
56042 1605274 1630834 1655846 1682082 1713697 1748229 1780251 1811146 1845902 1883583 1920977 1962153
56031 1962153 2013501 2072142 2129967 2186155 2244749 2303341 2356224 2405916 2459377 2515383 2567862
56020 2567862 2618934 2675728 2736745 2794576 2849926 2909640 2973098 3034327 3095588 3164812 3241392
56009 3241392 3318593 3398009 3487162 3584963 3684471 3787718 3902224 4025237 4147740 4271828
55999 4271828 4407252 4553058 4700332 4850934 5014891 5191035 5369335 5550854 5745820
55990 5745820 5953700 6165733 6385505 6625572 6885346 7154626 7437285 7747807 8086100
55981H086100L54677L75249M12975M52950M82828N19249N75825O35392O84375
55972A2579620P42647Q27005R19360J006023J112020J258651J426725J603311
55964B1475362J822199K113151K459253K856659L365575M044806M891835N907929
55956D8936769P149985Q639288J0301469J2099315J4145437J6586070J9508742
55949A37367075K3106483K7667223L2923032L7375939L8764402L5571524K7996626
55942C60772304J7410776N248868p261086j8674668k7390743l2431878l3963332
55935B63710241l2936015l0392890k7140941k3754293k0570343j7685640j5088122
55928I6141997j2796440j0838401r179084p760289o569393n605031m818247m148829
$$ plain form
55981 8086100 8440777 8816026 9229001 9681951 10164779 10684028 11259853 11895245 12579620
55972 12579620 13322267 14149272 15068632 16074655 17186675 18445326 19872051 21475362
55964 21475362 23297561 25410712 27869965 30726624 34092199 38137005 43028840 48936769
55956 48936769 56086754 64726042 75027511 87126826 101272263 117858333 137367075
55949 137367075 160473558 188140781 221063813 258439752 297204154 332775678 360772304
55942 360772304 378183080 383431948 376170862 357496194 330105451 297673573 263710241
55935 263710241 230774226 200381336 173240395 149486102 128915759 111230119 96141997
55928 96141997 83345557 72507156 63328072 55567783 48998390 43393359 38575112 34426283
55920C4426283l583778l127366k748829k409879k112032j869675j664469j469588
55912A5440667j292270j151089j034723r21454q17129p37432o72875o05477n41260
55903G666958m94170m55651m10532l66017l36068l13244k83578k53623k36015
55894D518060k23415k02699j80760j70899j66998j55602j40910j34262j30911
55885C011604j20183j07264j02703j01227r2308q1192p8578p9625p3686o5057
55875B109781o3972o6313o2001n4783n4403n7333n3951m6997m4957m4734l8622
55864A521715l0860k9688l0286k2993j1680o914p343m720j052m005j0800j3151
55852A348223j3050j7875k4772k5502k2165k3010k7033k7491k6205k9688l5192
$$ plain form
55920 34426283 30842505 27715139 24966310 22556431 20444399 18574724 16910255 15440667
55912 15440667 14148397 12997308 11962585 11041131 10224002 9486570 8813695 8208218 7666958
55903 7666958 7172788 6717137 6306605 5940588 5604520 5291276 5007698 4754075 4518060
55894 4518060 4294645 4091946 3911186 3740287 3573289 3417687 3276777 3142515 3011604
55885 3011604 2891421 2784157 2681454 2580227 2487919 2406727 2328149 2248524 2174838 2109781
55875 2109781 2045809 1979496 1917495 1862712 1808309 1750976 1697025 1650028 1605071 1560337 1521715
55864 1521715 1490855 1461167 1430881 1407888 1396208 1389294 1381951 1377231 1376179 1372174 1361374 1348223
55852 1348223 1335173 1317298 1292526 1267024 1244859 1221849 1194816 1167325 1141120 1111432 1076240
55841A076240l5078l1230l1058l3074l0448k5274k5106k8436k7374k2097j9307
55830G67758j8967j5684j0865j0566j3245j2119p815o719q611p808m679m431o255
55817F39994n009j989k778o098n898k905l181o613p584n828n998p791o868m372
55803E67082n220q065p181l286k417m948n709m238n016q027q656o749o614q389
55789D82567q187o308o524p936o236k377j383l265l712k943n133r732j2029j1885
55775C94917j3338j6017j5600j2404j1104j2051j1151q158o974p815p139n118
55763B68048n271o951o147l479l346n392m984k046j236l209l870k582l096n714
55749B10725o434m574l796m820m497k601k297l371k266O58J224p66j215L95J89
$$ plain form
55841 1076240 1041162 1009932 978874 945800 915352 890078 864972 836536 809162 787065 767758
55830 767758 748791 733107 722242 711676 698431 686312 678497 671778 663167 655359 650680 646249 639994
55817 639994 634985 632996 630218 624120 618222 615317 612136 605523 597939 592111 586113 578322 571454 567082
55803 567082 561862 553797 546616 543330 540913 535965 530256 526018 521002 512975 504319 497570 490956 482567
55789 482567 474380 468072 461548 453612 447376 444999 443616 440351 436639 433696 428563 418831 406802 394917
55775 394917 381579 365562 349962 337558 326454 314403 303252 295094 288120 280305 273166 268048
55763 268048 262777 255826 249679 246200 242854 237462 232478 230432 229196 225987 222117 219535 216439 210725
55749 210725 204291 199717 195921 191101 186604 184003 181706 178335 176069 176727 177951 177185 175970 176365 176554
55734A76554k304l079j279n54j748j468Q19J405o03j679p46r43l083m011k913
55719A54368k830m368m225j535N02P32J705L878M259K384J695L383M643M387M966
55704A73944O782O988N050L986M588L955J216p71r11j629l711m691l775l272l903
55689A83846l713k551k551l292j948J068K141R85J288L905N452M829N048P054
55675B01561P788O156N059N603N026K426Q96J791K310R77K60J493K336J486R33
55660B46101J412N70k171l886l339l155m715n771n137m938o026o044m290l666
55646A94945n448o761n667m300m542n014m641m893o184o303m633l734m703n144
55632A22978l879l212m360n004l694k464k802l014j883r79j203j017k5k89k183
$$ plain form
55734 176554 174250 171171 169892 169338 167590 166122 166941 168346 167743 166064 165318 164375 161292 157281 154368
55719 154368 151538 147170 142945 141410 141912 142644 144349 148227 152486 154870 156565 159948 164591 168978 173944
55704 173944 180726 187714 192764 196750 201338 205293 206509 205738 204827 203198 199487 194796 191021 187749 183846
55689 183846 180133 177582 175031 171739 169791 170859 173000 173985 175273 179178 184630 189459 194507 201561
55675 201561 209349 215505 220564 226167 231193 233619 234515 236306 238616 239593 239853 241346 243682 245168 246101
55660 246101 247513 248083 245912 242026 238687 235532 230817 225046 219909 214971 208945 202901 198611 194945
55646 194945 189497 182736 177069 172769 168227 163213 158572 153679 147495 141192 136559 132825 128122 122978
55632 122978 119099 115887 111527 106523 102829 100365 97563 94549 92666 91687 90484 89467 89442 89153 86970
55617H6970l120k203j836k912k892p92O58L8k27J250K036O18n96J41P02o48j877
55600G5310j115j2l04p98m64p34k044k038J19J551M87o72R4R54K09l39P79J464
55582G2447Oj444p77L12j22m70J152L104L214K632L244M180M128M286N790O992
55566A08674O386N502N839N805L758J249J44o78k658m401m333l834m542n177m180
55551A07554k914l092l529k564j257j094r77M39J771J387N12R01J680J461J264
55536A01542K328L315K608J300J010J009J92l72L25P94l88j926k386k898m485
55521A01968n422m233k706k818l284k362j490k562m093l747k515k647l436k855
55507E7798j550j435j932j311l28r23k512k974k261j836j637p29J97q0p22k24
$$ plain form
55617 86970 83850 81647 79811 76899 74007 73215 73873 73911 73684 74934 76970 77588 76992 77133 77835 77187 75310
55600 75310 74195 74183 73879 73081 72617 71883 69839 67801 67920 69471 69958 69286 69380 70334 70543 70204 70983 72447
55582 72447 72453 71009 70232 70544 70422 69952 71104 74208 77422 80054 83298 87478 91606 95892 101682 108674
55566 108674 115060 120562 126401 132206 135964 137213 137357 136679 134021 129620 125287 121453 116911 111734 107554
55551 107554 104640 101548 98019 95455 94198 93104 92127 92566 94337 95724 96236 97137 98817 100278 101542
55536 101542 103870 107185 109793 111093 112103 113112 113304 112932 113257 114051 113663 111737 109351 106453 101968
55521 101968 96546 92313 89607 86789 83505 81143 79653 77091 72998 69251 66736 64089 60653 57798
55507 57798 56248 54813 52881 51570 51242 50319 47807 44833 42572 40736 39099 38370 38567 38487 37765 37541
55491C7541P56O48p5jM41l7r14q71l39n32j100j059q45j177j275m47J05o41j330
55472B8848n26O17M49k05J62P66J41r45r52m56q27j510j308q18j080j353p65l66
55454A9872r82j011Q65K801K546J130O86O49n64j903j389Q7K87m54l13L41q0r07
55436B1661l14J075J202K68N1L85k15j215p70Q13J577J328J419J771J181Q0q8
55419C0209L22q1q11l18R24J143M82N09J169J162P70J291K170J736K96m00l14
55402D0259q45j892k091j499j291j326p51l12j184k233j498K84P11k70o46p8l5
55385B5303m96L1J280J290r5q86k83M26M59L45N4j019k161j969q64m94r07p83
55367A9231j84l52j066r89l55n69j338j136k35k93j053n71J171K015J219L64L68
$$ plain form
55491 37541 38297 38945 38870 38869 39310 39273 38359 37488 37149 36617 35517 34458 33613 32436 31161 30714 30819 30178 28848
55472 28848 28322 28939 29388 29183 29345 30111 30252 29307 28355 27899 27072 25562 24254 23436 22356 21003 20238 19872
55454 19872 18890 17879 18744 21545 24091 25221 25907 26556 25992 24089 22700 22787 23074 22620 22307 22648 22568 21661
55436 21661 21347 22422 23624 23892 23943 24328 24113 22898 22128 22941 24518 25846 27265 29036 30217 30297 30209
55419 30209 30531 30450 29639 29321 30245 31388 31870 32379 33548 34710 35480 36771 38941 40677 40973 40573 40259
55402 40259 39414 37522 35431 33932 32641 31315 30564 30252 29068 26835 25337 25621 26332 26062 25416 25338 25303
55385 25303 24807 24838 26118 27408 27313 26427 26144 26570 27029 27374 27428 26409 24248 22279 21415 20921 20014 19231
55367 19231 19047 18695 17629 16640 16285 15716 14378 13242 13007 12714 11661 11090 12261 14276 15495 15859 16227
55350A6227L58lJ62Q76J058O62O76Q92J51j103j198j90J86l20j77Q35J100J47
55332B0339n22j96O5k86m21j49l66j005q51J18M85n5k01M77P54M7o75p47o13m40
55312A5758K07J016J117P01O34O91Q7n76j64O60L49o69o93K8l02j530j592j48
55294A5574Q91P78Q80J671J793Q02O9J44o9q06p91J19L02p15j310o91k42r13j565
55275A5921j090o4O59J162J425J045N74J177K392K343P08o90p94n68p49o79j13
55258B2659K9m51m51L28P47L36P1M21O16L92M96R60Q65K21O3M11K66j81K05R39
55238B8942L26j286j534O8J211O11k22q3j4p85j195m44K17k14p05j93O14Q49R43
55219B7106J303J307Q03O41Q07R5j446j925o29O09K84o78j002j106j586j617m70
$$ plain form
55350 16227 16585 16582 16744 17620 18678 19340 20016 20908 21059 19956 18758 18568 18754 18434 18257 19092 20192 20339
55332 20339 19817 19621 19686 19400 18979 18830 18464 17459 16608 16726 17211 17156 16955 17432 18186 18233 17558 16811 16198 15758
55312 15758 15965 16981 18098 18799 19433 20124 20211 19635 19471 20131 20480 19811 19118 19146 18844 17314 15722 15574
55294 15574 16465 17243 18123 19794 21587 22389 22458 22602 22533 21727 20936 21055 21357 20642 19332 18641 18399 17486 15921
55275 15921 14831 14767 15426 16588 18013 19058 19632 20809 23201 25544 26252 25562 24768 24200 23451 22772 22659
55258 22659 22688 22237 21786 22114 22861 23197 23268 23689 24305 24697 25193 26153 27018 27239 27302 27713 27979 27798 28003 28942
55238 28942 29268 27982 26448 26516 27727 28338 28116 28033 28019 27234 26039 25595 25812 25598 24893 24700 25314 26163 27106
55219 27106 28409 29716 30519 31160 31967 32062 30616 28691 28062 28671 28955 28277 27275 26169 24583 22966 22496
55202B2496R76J629J677J608J280Q52J075J769J715O83j23k93p70j626j548l39
55186C1061L58j78n85k1M08n0l85Q2M69L49O72J515J339j67j058l33L57k36q15
55167C2782k21K81n18j325o18O47Q24K75J27R0m52p59j76K81k99r68o93k60n58
55148B8460o54M01J465J110Q9p3M05M94M54R43J268N66l70l67J14P6pP92J900
55129C7066K163J761J462J012k5q07m32L28J97n61q70o13k69L03J108J171L5r62
55111D2067n99J94j32j108j137j38N48L37j19k65l2N82J219J075J41l51K75J014
55093D3571Q66M32N51P00K02j99M25J455J774J599J703J734R14l37r38o49N5R06
55075E4764J566J348K65o01o33m91o18l85L39M12n74j223n97J76k4l50J60O01
$$ plain form
55202 22496 23472 25101 26778 28386 29666 30518 31593 33362 35077 35760 35637 35344 34574 32948 31400 31061
55186 31061 31419 31241 30656 30635 31043 30993 30608 30690 31159 31508 32180 33695 35034 34867 33809 33476 33833 33597 32782
55167 32782 32561 32842 32324 30999 30381 31028 31852 32127 32254 32344 31892 31133 30957 31238 30939 29971 29278 29018 28460
55148 28460 27806 28207 29672 30782 30871 30798 31203 31697 32151 33094 34362 34928 34558 34191 34305 34381 34374 35166 37066
55129 37066 39229 40990 42452 43464 43439 42632 42200 42528 42725 42164 41294 40681 40412 40715 41823 42994 43029 42067
55111 42067 41468 41662 41530 40422 39285 39147 39695 40032 39913 39648 39616 40198 41417 42492 42633 42282 42557 43571
55093 43571 44437 44869 45420 46120 46322 46123 46548 48003 49777 51376 53079 54813 55727 55390 54452 53803 53858 54764
55075 54764 56330 57678 57943 57342 56709 56218 55600 55215 55554 55966 55392 54169 53572 53748 53724 53374 53534 54135
55057E4135p2r18o19K51N22O62J556K420K100J276J275J703J374N62K62J76m77
55040F6188j067n50M81P34L85L16K07n92j225n49O41P51J1k09K7l93j304j557
55022F2295j203j266j675j467p00k49p5M42Q69L44n54n81k8k25j098j262m14K38
55004E3391Qm54m08J90J077J686J211k39j195p13J64J32l09j23R0p85j993j821
54986D9909k87J081J684K105K424K210J786J770J789J349J241K299L583L721L317
54971G9981L813M766M646L837M301O417Q466R341R666J0165J0798J1506J2123
54958A79826J1703R579O757M623K772l7l445o104q065j0280j2231j2443j1146
54945A51509j0011r430q360o780n876n730n247m440m460n136m820l062j302n29
$$ plain form
55057 54135 54063 53145 52526 52777 53299 53961 55517 57937 60037 61313 62588 64291 65665 66227 66489 66665 66188
55040 66188 65121 64571 65052 65786 66171 66487 66694 66102 64877 64328 64969 65720 65731 65522 65549 65156 63852 62295
55022 62295 61092 59826 58151 56684 55984 55735 55660 56102 56971 57315 56761 56180 56152 55927 54829 53567 53153 53391
55004 53391 53399 52945 52537 52727 53804 55490 56701 56462 55267 54554 54718 54850 54541 54418 54508 53723 51730 49909
54986 49909 49622 50703 52387 54492 56916 59126 60912 62682 64471 65820 67061 69360 72943 76664 79981
54971 79981 83794 88560 93206 97043 101344 107761 116227 125568 135234 145399 156197 167703 179826
54958 179826 191529 201108 207865 212488 215260 215223 211778 205674 197609 187329 175098 162655 151509
54945 151509 141498 132068 123708 116928 111052 105322 100075 95635 91175 86039 81219 78157 76855 76326
54931G6326k30N8J46L57J325K443K489J854K232L933N627O777Q132R662J0304
54916A31435J0117J0290J0709R745P055M220K019o29m188p250q728r312r789r763
54902A35931r001q259p883p181o039n467n732n655m588l475l076k736j876j129
54888F3834r96q32j50M03K79P4L50O23L44j91o03j105j696j716r12n0R9l77j007
54869E6371j458j383p28k25n94j255j083k57l3o78j100p03k6N41J190J716J599
54852E1894J159J129J118J47j286j624p69k45o29q97n91n52r38p50P8K39n60q38
54834D6085P6Q08L70j25M94J490J632J119P63N81M15P16J611K302K371K495L061
54817F6264L326K912K835L939N483O312O478O722P266P958Q751R378R428R177
$$ plain form
54931 76326 76096 76154 76300 76657 77982 80425 82914 84768 87000 90933 96560 103337 111469 121131 131435
54916 131435 141552 151842 162551 172296 179351 183571 185590 184961 180773 173523 164795 155483 145694 135931
54902 135931 126930 118671 110788 103607 97568 92101 86369 80714 76126 72651 69575 66839 64963 63834
54888 63834 62838 62006 61856 62259 62538 62612 62962 63585 63929 63738 63135 62030 60334 58618 57706 57656 57755 57378 56371
54869 56371 54913 53530 52802 52577 51983 50728 49645 49388 49355 48677 47577 46874 46848 47389 48579 50295 51894
54852 51894 53053 54182 55300 55447 54161 52537 51768 51523 50894 49997 49406 48854 47916 47166 47244 47483 46923 46085
54834 46085 46161 46969 47339 47214 47708 49198 50830 51949 52712 53293 53708 54424 56035 58337 60708 63203 66264
54817 66264 69590 72502 75337 79276 84759 91071 97549 104271 111537 119495 128246 137624 147052 156229
54803A56229R318R554Q670O483M218K474L09k911o208q370r350r524q823p459
54789A44610o329n894n678n349n122m729l517k006j747k891l569k538q27J88P29
54774I5331J546K429K959L476M209M634M676N319P051Q883R882J0439J1165J1672
54760A83671J1461J0762R722P899N435L293J606q19m401p678r303r713r841r638
54746A82456r032q775r155r153q156p114o825o533n527m699m908n202m274k663
54732I0440j850k009k157j825j236n80j40l94j011q05L59Q91j51j327r34M47J085
54715G8803O67J08l33r45j313q28J3K26j29k66k6J81K74L32J34k19j6Q53J292
54696G8808O29j67J2O97Q59N95N22M38nk18L56J035R86P56J240K011K036J369
$$ plain form
54803 156229 165547 175101 183771 190254 194472 196946 197255 194344 188136 179766 170416 160892 152069 144610
54789 144610 138281 132387 126709 121360 116238 111509 107992 105986 104239 101348 97779 95241 94414 94602 95331
54774 95331 96877 99306 102265 105741 109950 114584 119260 124579 131630 140513 150395 160834 171999 183671
54760 183671 195132 205894 215616 223515 228950 232243 233849 233030 228629 220951 211648 201935 192094 182456
54746 182456 173424 164649 155494 146341 138185 131071 124246 117713 112186 107487 102579 97377 93103 90440
54732 90440 88590 86581 84424 82599 81363 80783 80643 80249 79238 78433 78792 79683 79532 78205 77271 77718 78803
54715 78803 79470 79578 79245 78300 76987 76159 76172 76398 76269 76003 75977 76158 76432 76764 76898 76679 76663 77516 78808
54696 78808 79437 79270 79282 79979 80838 81433 81955 82393 82388 82170 82526 83561 84547 85303 86543 88554 90590 91959
54678I1959P17J15n30m35J013K789L380K883K533K766L083L312L540L395K731
54663A23251K382K874L108J876L4n73K09R91J251J741K579K870K371K012K368
54648A49344K878K899K578K398K673L462M383M609L735K287Q34q11k812m486n253
54633A68718n698o578p403p180o057n007m381l878l451l138k501j417p87j352
54619A09890k310k375j653j109q00n1J006J597J715K006K417K291J639J073O23
54604A15959q3q07j025j068j652k476k547j823j319j567k120k520k734k616j985
54589H9617j199r01j152j552j931k263k272j860j449j188n29O04J036j09j808
54574G3044k379j729j030p50m33k4L3j41LL73M31K42K63L88J95j28j35Lr5k06
$$ plain form
54678 91959 92676 92791 92261 91826 92839 95628 99008 101891 104424 107190 110273 113585 117125 120520 123251
54663 123251 125633 128507 131615 133491 133525 132952 133161 134152 135403 137144 139723 142593 144964 146976 149344
54648 149344 152222 155121 157699 160097 162770 166232 170615 175224 178959 181246 182080 181269 178457 173971 168718
54633 168718 163020 156442 149039 141859 135802 130795 126414 122536 119085 115947 113446 112029 111242 109890
54619 109890 107580 105205 103552 102443 101643 101592 102598 104195 105910 107916 110333 112624 114263 115336 115959
54604 115959 115876 115069 114044 112976 111324 108848 106301 104478 103159 101592 99472 96952 94218 91602 89617
54589 89617 88418 87517 86365 84813 82882 80619 78347 76487 75038 73850 73321 73925 74961 74852 73044
54574 73044 70665 68936 67906 67156 66723 66699 66732 66591 66594 66967 67398 67640 67903 68291 68486 68358 68223 68226 68131 67925
54554F7925L6L97O86J279K051J837K65r63k80J283J599O21L7M59J087J706K831
54537H2856L994M011L029K445K689K825K374J816J222J61r91j293r09q78j248
54522A02103j168q02j224k352k832k280j770j798j631j085j040j661j849j130
54508G9481m00k04N2O00O18j07m46L13J332J689J621J525J047M3p01o53m14n78
54490H4818p26k94M33R62J349J670J545Q74K36J2k06p66j237j043k34P01J249
54473H9343R68j51j276j451p54l9L03M54K98m05j083q78p6K94J72L46P12L70m43
54454H6704l49Q16J504R47L09N25P43M9p76o40nOn54q52q09j056j735k298k265
54435H0264j549l99N13N50k2j97L75R00O72L8l15j99K47Q89J353J249Q83R23J247
$$ plain form
54554 67925 67961 68358 69044 70323 72374 74211 74476 73513 73233 74516 76115 76736 76773 77232 78319 80025 82856
54537 82856 86850 90861 93890 96335 99024 101849 104223 106039 107261 107422 106431 105138 104229 103351 102103
54522 102103 100935 100133 98909 96557 93725 91445 89675 87877 86246 85161 84121 82460 80611 79481
54508 79481 79081 78877 78929 79529 80147 80040 79594 79907 81239 82928 84549 86074 87121 87164 86463 85810 85396 84818
54490 84818 84092 83798 84231 85193 86542 88212 89757 90631 90867 90879 90673 89907 88670 87627 87393 88094 89343
54473 89343 90311 90160 88884 87433 86679 86640 86943 87397 87695 87290 86207 85329 85253 85547 85719 86065 86777 87147 86704
54454 86704 86355 87171 88675 89622 89931 90456 91199 91248 90472 89832 89827 89833 89279 88427 87618 86562 84827 82529 80264
54435 80264 78715 78316 78829 79379 79357 79160 79535 80435 81107 81145 80830 80631 80878 81767 83120 84369 85252 86175 87422
54416H7422J122O18O20J188J302P28O16J595K622K704K407K634L069L023K796
54401A14466K993L235K896K375K532L205L487L054K274J317Q1j198k090k608l073
54386A32946l460l458l041k516k118j924j903j887j715j601j916k554k901k623
54372I9329j893q74L71J321J192N2j001j078m29J16O4n44j189j065O1J185J164
54355I6782M25M76J648K614K455J902J933K349K557K745L302L885L904L416K866
54340A33259K421K089J952J834J264J70r81j901k632k911k348j480j550k819m115
54325A22252m508m380m335m201l733l297l141k887k443k415k924k977j894m21
54311G8696K70m0r67k181l014k449n31J082J017j58j059j427j837k200j898j011
$$ plain form
54416 87422 88544 89162 89782 90970 92272 93000 93616 95211 97833 100537 102944 105578 108647 111670 114466
54401 114466 117459 120694 123590 125965 128497 131702 135189 138243 140517 141834 141915 140717 138627 136019 132946
54386 132946 129486 126028 122987 120471 118353 116429 114526 112639 110924 109323 107407 104853 101952 99329
54372 99329 97436 96562 96933 98254 99446 99498 98497 97419 96990 97106 97170 96626 95437 94372 94433 95618 96782
54355 96782 97207 97683 99331 101945 104400 106302 108235 110584 113141 115886 119188 123073 126977 130393 133259
54340 133259 135680 137769 139721 141555 142819 142989 142008 140107 137475 134564 132216 130736 129186 126367 122252
54325 122252 117744 113364 109029 104828 101095 97798 94657 91770 89327 86912 83988 81011 79117 78696
54311 78696 78966 78926 77959 75778 72764 70315 69784 70866 71883 71725 70666 69239 67402 65202 63304 62293
54295F2293k29K04N00N70J48m63o29k69J27K48J99J39J60L14M66L45J8r8J55N19
54275F4717Q53J215J315O76m09r94p70m21l40n6O62J211J221J206J464J434P79
54258G3763J63J19J73j39l18J34P33Q80Q34R13O64j57o79j17Q56J117P38N24N34
54239H0735K47k39m07k98l27m13k40k6j36k89o6J60k49j089j607j596j388j063
54221G1709n10k2ok91l42p2J35p2p45j539j646n02J160J834J156L79L94N44J06
54202G1670k98J22Q23Q56M02J16j92r23j490j217p54j117j799j461j97M96l9q29
54184F4169r01m76k38m12p74r44n84J63O08M08J33K83L68k02q52n37O04J423J358
54165F3597R31P26Q02R85J076Q50M02J74K32J8o37j044q35p17j152j308m48N29
$$ plain form
54295 62293 62064 62268 62768 63338 63486 63023 62394 62125 62252 62500 62699 62838 62998 63312 63778 64123 64141 64043 64198 64717
54275 64717 65570 66785 68100 68776 68367 67373 66603 66182 65842 65786 66448 67659 68880 70086 71550 72984 73763
54258 73763 73926 74045 74218 74079 73761 73895 74628 75508 76342 77255 77919 77762 77083 76966 77822 78939 79677 80201 80735
54239 80735 80982 80743 80336 80038 79711 79298 79058 79032 78896 78607 78541 78701 78452 77363 75756 74160 72772 71709
54221 71709 71199 71177 71171 70880 70538 70466 70601 70529 69784 68245 66599 66097 67257 69091 70247 70626 71020 71564 71670
54202 71670 71372 71494 72317 73173 73575 73691 73499 72576 71086 69869 69115 67998 66199 64738 64541 65037 64998 64169
54184 64169 63268 62792 62554 62142 61368 60424 59840 60003 60611 61019 61152 61435 61803 61601 60749 60212 60816 62239 63597
54165 63597 64528 65254 66056 67041 68117 68967 69369 69543 69775 69793 69156 68112 67277 66560 65408 64100 63652 64181
54147F4181L39o62j176j040j082j354j172n85k73j64K98P12J39j106j630r62K7
54130E4490P79J521K051J565J79q60q72m74k40J07P14J024P42L72K46k4o99j303
54112E9318j335q68j55O34J086Q05J29j69n3k00o88p66k11J40l43j125j321p67
54094E4111J57J078J574J230K18o47p78l44J70M82M51R4k26r0M37R61J354J621
54076F1853J438N77l43m81k5J13j78q0O31J072O66K4o1L34P62J205J765K141K014
54057G3427J520R34K66m26p24k63P60J801K513K905L105L131K829K140J483J558
54041I6959K472L393L555L235L228L671M013L937L578L129K837L204M347N456
54027A47014N561M802M097L829L661L467L428L310K614J529Q13O55N28L04M43
$$ plain form
54147 64181 64520 63858 62682 61642 60560 59206 58034 57449 57176 57012 57310 58022 58161 57055 55425 54463 54490
54130 54490 55269 56790 58841 60406 60585 59725 58853 58379 58139 58246 58960 59984 60726 61098 61344 61320 60621 59318
54112 59318 57983 57115 56960 57594 58680 59485 59614 59445 59392 59192 58504 57738 57527 57667 57324 56199 54878 54111
54094 54111 54268 55346 56920 58150 58368 57721 56943 56599 56769 57251 57702 57796 57570 57480 57917 58878 60232 61853
54076 61853 63291 63868 63525 63044 63019 63132 62954 62874 63505 64577 65243 65267 65206 65540 66302 67507 69272 71413 73427
54057 73427 74947 75881 76147 75721 74997 74734 75494 77295 79808 82713 85818 88949 91778 93918 95401 96959
54041 96959 99431 102824 106379 109614 112842 116513 120526 124463 128041 131170 134007 137211 141558 147014
54027 147014 152575 157377 161474 165303 168964 172431 175859 179169 181783 183312 184125 184780 185308 185612 186055
54012A86055R22R04n8j346k182k569k907l258l468l559l638l671l632l571l511
53997A50511l370l117k715k165j761j965k645k856j894k55R93J391J098L09o59
53982A30900j144q91n88q44j139p65k13m65j278j544j028m67j30L03N36j33j290
53965A19820j576o73K33L27J62L13L78k9m24l74k70m97o37k43K82L31M0L2N14
53946A17709J193J785K250K707L284L846L985L589L164L201L509L714L963M375
53932A62274M322L206J645Q00Q01R28J023J470K064K161J910J962K159J936J847
53917A90508K969M764N429M678M288N269O357O258N628N696O279O489O238N843
53903B66693N035L551K023J163O97q3j184k175k938l508l658l374l158l388l852
$$ plain form
54012 186055 186977 187881 187823 186477 184295 181726 178819 175561 172093 168534 164896 161225 157593 154022 150511
53997 150511 147141 144024 141309 139144 137383 135418 132773 129917 128023 127768 128761 130152 131250 131559 130900
53982 130900 129756 128865 128277 127433 126294 125529 125316 124851 123573 122029 121001 120534 120404 120707 121243 121110 119820
53965 119820 118244 117571 117804 118131 118293 118606 118984 118955 118531 118157 117887 117390 116753 116510 116792 117123 117163 117195 117709
53946 117709 118902 120687 122937 125644 128928 132774 136759 140348 143512 146713 150222 153936 157899 162274
53932 162274 166596 169802 171447 172247 173048 173976 174999 176469 178533 180694 182604 184566 186725 188661 190508
53917 190508 193477 198241 203670 208348 212636 217905 224262 230520 236148 241844 248123 254612 260850 266693
53903 266693 271728 275279 277302 278465 279162 279079 277895 275720 272782 269274 265616 262242 259084 255696 251844
53888B51844m373n116n820n684m632l898m557o116p272p420o836o018n519n735
53874A72848o231n899m425k926k512k862k992k770k765l058l115k666k052j742
53860A26833j934k472k908k849k422k087j977j823j502j147o95o7L20qo48p37
53844A03877l08j94n21m82J76O67M85P1k67q39j482j320k55N00J38n15l76L67
53826I9722Q88J004R28O09J11JN14J100J301J406J609J438O28k66p20q47o54K83
53808A09055J802K920L304L828M950N715N274M309L885L965M065M377N098N592
53794A68139N310M797M688M584L951L239K987K681J729P59O66J111J141O62J53
53779B06597l77j067j433j153r16j431k260k687k943l389l445k649j871k007k324
$$ plain form
53888 251844 247471 242355 236535 230851 226219 222321 217764 211648 204376 196956 190120 184102 178583 172848
53874 172848 166617 160718 156293 153367 150855 147993 145001 142231 139466 136408 133293 130627 128575 126833
53860 126833 124899 122427 119519 116670 114248 112161 110184 108361 106859 105712 105017 104950 105270 105262 104614 103877
53844 103877 103569 103375 102854 102372 102548 103215 103700 103771 103504 102665 101183 99863 99608 100108 100246 99731 99355 99722
53826 99722 100610 101614 102542 103151 103262 103263 103777 104877 106178 107584 109193 110631 111259 110993 110273 109426 108772 109055
53808 109055 110857 113777 117081 120909 125859 131574 136848 141157 145042 149007 153072 157449 162547 168139
53794 168139 173449 178246 182934 187518 191469 194708 197695 200376 202105 202864 203530 204641 205782 206444 206597
53779 206597 206220 205153 203720 202567 201651 200220 197960 195273 192330 188941 185496 182847 180976 178969 176645
53764A76645j700p49r16j981k362j610q54q73j380k113l090l790l546k738k339
53749A46604k338k041j611j802k275j930r20n69j092j147j56O57K62o23q49n36
53733A29634n25j001j538j841j785j209k28O49J066J087Q45M25J56L59P66Q31
53717A27691O48Q18J378J673J457J254J461J830K113K505L084L491L479L231K919
53702A59032K431J740J120P94P49R28J255J572J923K687L885M621M010K597J935
53687A91279K670L746L768K535R93J91M54J280J890K106K510L504M535M777M302
53672B30540L904L970M221M374M340L925K984J955J502J601J524Q23k26j061j333
53657B63043r43j13O67R97Q89M43l53j255j614j108k08M59Q11R08N96j5l86m73
$$ plain form
53764 176645 174945 174196 173280 171299 168937 167327 166473 165600 164220 162107 159017 155227 151681 148943 146604
53749 146604 144266 142225 140614 138812 136537 134607 133687 133118 132026 130879 130723 131380 131642 131019 130170 129634
53733 129634 129109 128108 126570 124729 122944 121735 121507 122156 123222 124309 125154 125579 125735 126094 126860 127691
53717 127691 128339 129157 130535 132208 133665 134919 136380 138210 140323 142828 145912 149403 152882 156113 159032
53702 159032 161463 163203 164323 165117 165866 166794 168049 169621 171544 174231 178116 182737 186747 189344 191279
53687 191279 193949 197695 201463 203998 204991 205182 205636 206916 208806 210912 213422 216926 221461 226238 230540
53672 230540 234444 238414 242635 247009 251349 255274 258258 260213 261715 263316 264840 265663 265437 264376 263043
53657 263043 262100 261987 262654 263651 264540 264983 264630 263375 261761 260653 260445 260904 261715 262623 263219 263204 262818 262345
53639B62345r80k001k349j328j29j45p97o31R8j72j601k548k039r25k03K28O68
53622B47491Q77P83Q85J359J715J743J919K374K467J866J256J511K646L988M808
53607B77688M690L869L320L825M953N574N370N034N149N689O546P556Q049P425
53593C54737O272N853O401O939O925O870P090P086O630O383O811P431P639P478
53579D50545P132O450N520M959N081N372N252M848M635M786N158N382M877L338
53565E23335J358o1o52r25j202j350j469j844k265k276k183k682l502l573k754
53550D97955k099k189k428k431k658l195l237k599k409l355m364m125k988k152
53536D57726j857j533j155j093j068m87L91P17N11P87K017L331L662L186L141
$$ plain form
53639 262345 261365 259364 257015 255687 255558 255413 254616 253985 254083 253911 252310 249762 247723 246798 246595 246823 247491
53622 247491 248368 249151 250036 251395 253110 254853 256772 259146 261613 263479 264735 266246 268892 272880 277688
53607 277688 282378 286247 289567 293392 298345 303919 309289 314323 319472 325161 331707 339263 347312 354737
53593 354737 361009 366862 373263 380202 387127 393997 401087 408173 414803 421186 427997 435428 443067 450545
53579 450545 457677 464127 469647 474606 479687 485059 490311 495159 499794 504580 509738 515120 519997 523335
53565 523335 524693 524632 523980 523055 521853 520503 519034 517190 514925 512649 510466 507784 504282 500709 497955
53550 497955 495856 493667 491239 488808 486150 482955 479718 477119 474710 471355 466991 462866 459878 457726
53536 457726 455869 454336 453181 452088 451020 450533 450924 451641 452152 452939 454956 458287 461949 465135 468276
53521D68276M328O174P364P339O823O794P355Q087R034J0566J2391J3650J4038
53508E82219J4118J4438J5122J6328J8193K0102K1021K0922K0986K2016K3513
53497G88978K4830K6195K7960K9614L0457L0746L1341L2477L3581L4186L4515
53486A124880L5203L6584L8188L9010L8578L7673L7413L7870L8250L8293L8541
53475A540483L9228L9955M0643M1683M2881M3304M2617M1482M0202L8127L5028
53464A985633L1936K9715K7830K5486K3123K1643K0849J9839J8602J8067J8685
53453B241408J9795K0357J9762J7973J5430J2668R754O355K523j125m373p823
53441B352704j1859j5795j8819k1220k3948k7185l0137l2106l3225l4206l5682
$$ plain form
53521 468276 472604 478778 486142 493481 500304 507098 514453 522540 531574 542140 554531 568181 582219
53508 582219 596337 610775 625897 642225 660418 680520 701541 722463 743449 765465 788978
53497 788978 813808 840003 867963 897577 928034 958780 990121 1022598 1056179 1090365 1124880
53486 1124880 1160083 1196667 1234855 1273865 1312443 1350116 1387529 1425399 1463649 1501942 1540483
53475 1540483 1579711 1619666 1660309 1701992 1744873 1788177 1830794 1872276 1912478 1950605 1985633
53464 1985633 2017569 2047284 2075114 2100600 2123723 2145366 2166215 2186054 2204656 2222723 2241408
53453 2241408 2261203 2281560 2301322 2319295 2334725 2347393 2357147 2363502 2366025 2364900 2360527 2352704
53441 2352704 2340845 2325050 2306231 2285011 2261063 2233878 2203741 2171635 2138410 2104204 2068522
53430B068522l7713l9688m0936m1503m1988m2510m2499m1700m0663l9945l9434
53419A619943l8904l8464l7990l6817l4576l1773k8981k6075k2788j9441j6388
53408A287746j3386j0077o618l210M25M406Q100J0883J3152J5788J9020K2387
53396A348616K5499K8165L0159L1493L2662L4049L5468L6775L8422M0765M3275
53385A725348M5286M7162M9884N3636N7617O1166O4418O7793P1405P5046P8466
53374B397227Q1562Q4461Q7225Q9513R0915R1731R2788R4280R5418R5603R5169
53363C395892R4464R2893Q9690Q5125Q0222P5638P1406O7498O3974O0810N8085
53352D235697N5952N4064N1502M7756M3235L8326L2531K5201J6452O548m969j8581
$$ plain form
53430 2068522 2030809 1991121 1950185 1908682 1866694 1824184 1781685 1739985 1699322 1659377 1619943
53419 1619943 1581039 1542575 1504585 1467768 1433192 1401419 1372438 1346363 1323575 1304134 1287746
53408 1287746 1274360 1264283 1257665 1254455 1254880 1259286 1267386 1278269 1291421 1307209 1326229 1348616
53396 1348616 1374115 1402280 1432439 1463932 1496594 1530643 1566111 1602886 1641308 1682073 1725348
53385 1725348 1770634 1817796 1867680 1921316 1978933 2040099 2104517 2172310 2243715 2318761 2397227
53374 2397227 2478789 2563250 2650475 2739988 2830903 2922634 3015422 3109702 3205120 3300723 3395892
53363 3395892 3490356 3583249 3672939 3758064 3838286 3913924 3985330 4052828 4116802 4177612 4235697
53352 4235697 4291649 4345713 4397215 4444971 4488206 4526532 4559063 4584264 4600716 4607264 4602295 4583714
53340D583714l3569m8444o2270p4714q5150r2790r7622j00364j01513j01306j00467
53329C685505j00033j00205j00175r9290r7838r6464r5437r4687r4144r3692r3049
53318B620491r1853q9877q7145q3909q0371p6380p1675o6406o1066n5851n0653
53307A805305m5797m1953l8994l5721l1402k6881k3392k0890j8414j5683j3245
53296A492933j1234r044o367l822k214j622j438j049l20M73J259K515M710P409
53282A472189R638J1234J3204J6326K0151K3833K7228L0547L3595L6064L8109
53271A732118L9835M0820M0893M0921M1852M3371M4377M4514M4366M4299M3968
53260B201334M3014M1560L9953L8528L7502L6733L5698L4124L2211K9922K6600
$$ plain form
53340 4583714 4550145 4501701 4439431 4364717 4279567 4186777 4089155 3988791 3887278 3785972 3685505
53329 3685505 3585472 3485267 3385092 3285802 3187964 3091500 2996063 2901376 2807232 2713540 2620491
53318 2620491 2528638 2438761 2351616 2267707 2187336 2110956 2039281 1972875 1911809 1855958 1805305
53307 1805305 1759508 1717555 1678561 1642840 1611438 1584557 1561165 1540275 1521861 1506178 1492933
53296 1492933 1481699 1472655 1466288 1462466 1460252 1458630 1457192 1456143 1455823 1456296 1457555 1460070 1464780 1472189
53282 1472189 1481827 1493061 1506265 1522591 1542742 1566575 1593803 1624350 1657945 1694009 1732118
53271 1732118 1771953 1812773 1853666 1894587 1936439 1979810 2024187 2068701 2113067 2157366 2201334
53260 2201334 2244348 2285908 2325861 2364389 2401891 2438624 2474322 2508446 2540657 2570579 2597179
53249B597179K1896J6533J1491O813J931l335q886j4963k1680k8294l3855l8396
53237B506434m2643m6778n0384n3356n5901n7740n8317n7764n6761n5448n3363
53226A917979n0661m8407m7398m7283m7177m6653m5941m5655m6361m8026m9821
53215A394596n0801n0725m9836m8149m5533m2343l9258l6480l3603l0339k6966
53204I40563k4020k1910k0725k0066j9272j8190j7432j7516j8057j8253j7881
53193G27241j7259j6592j5908j5401j5225j5107j4749j4298j4011j3727j3220
53182E61744j2723j2511j2337j1899j1515j1658j2169j2549j2764j3024j3106
53171D25489j2635j1754j0899j0076r093q188p762p717p681p599p475o944n816
$$ plain form
53249 2597179 2619075 2635608 2647099 2653912 2655843 2652508 2643622 2628659 2606979 2578685 2544830 2506434
53237 2506434 2463791 2417013 2366629 2313273 2257372 2199632 2141315 2083551 2026790 1971342 1917979
53226 1917979 1867318 1818911 1771513 1724230 1677053 1630400 1584459 1538804 1492443 1444417 1394596
53215 1394596 1343795 1293070 1243234 1195085 1149552 1107209 1067951 1031471 997868 967529 940563
53204 940563 916543 894633 873908 853842 834570 816380 798948 781432 763375 745122 727241
53193 727241 709982 693390 677482 662081 646856 631749 617000 602702 588691 574964 561744
53182 561744 549021 536510 524173 512274 500759 489101 476932 464383 451619 438595 425489
53171 425489 412854 401100 390201 380125 371032 362844 355082 347365 339684 332085 324610 317666 311850
53158C11850m688m187l993l361k368j834k186l099m024m477m146l340k920l162
53144B64065l293k772k255k397k552j898j073j261k092k078q79L06O33M58K55
53129B43167N6J13R19K207L000K881K416K174K178K235K052J133n65k113k619
53114B59234k479k616k905k612j980j916k333k353k013k260l118l512l063k564
53100B23510k386j987j338j319k113k759k781k978l848m647m629m127l638l013
53086A81947k289k181k933l575l159j950q30k10j22n80j319j782j847j896j982
53071A55292j740j226r28p64j94N53N67j51m89m0K64r4k55M61J326J405Q93M06
53053A55286ll51k80P2j11q60r37K81J575J649R62O47O23J11p54j209j171j042
$$ plain form
53158 311850 307162 302975 298982 295621 293253 291419 289233 286134 282110 277633 273487 270147 267227 264065
53144 264065 260772 258000 255745 253348 250796 248898 247825 246564 244472 242394 241515 241821 242454 242912 243167
53129 243167 243223 243336 244255 246462 249462 252343 254759 256933 259111 261346 263398 264531 263966 261853 259234
53114 259234 256755 254139 251234 248622 246642 244726 242393 240040 238027 235767 232649 229137 226074 223510
53100 223510 221124 219137 217799 216480 214367 211608 208827 205849 202001 197354 192725 188598 184960 181947
53086 181947 179658 177477 174544 170969 167810 165860 165030 164820 164698 164118 162799 161017 159170 157274 155292
53071 155292 153552 152326 151398 150634 150440 150993 151560 151409 150920 150880 151144 151050 150795 151256 152582 153987 154880 155286
53053 155286 155283 154932 154652 154724 154613 153753 152816 153097 154672 156321 157283 157930 158553 158664 157910 156701 155530 154488
53035A54488q06m30o14j872l377l843l247k522j943j054O0O62N44K66J77P5j29
53018A36435k09j23m7Q5M11O44M03p9j93J23K84r2p94j419j782j861j766j668
53000A28352j527j053k59K49o0q15j022j57J260K182K030J238Q49J410K424L121
52984A38222L478L911M260L951L146K784L269L969M196L908L216K164J287J369
52970A83130K196K481J520O2r54j511j808j578q96p03j560k634k844k319j824
52955A70758j406o56J66L17l59j284j908k013j626j098r39j192j373j331j420
52940A54636j516q82M43J197O26l02m07l3j93q07j023o81k95k4K33J92k46l98
52922A50520J97P10J94p04o11L89R77P78P32J186J234L47n80n40J90O14L09l34
$$ plain form
53035 154488 153682 153252 152638 150766 147389 143546 140299 137777 135834 134780 134840 135502 136046 136312 136489 136564 136435
53018 136435 136226 136103 136056 136141 136552 137196 137599 137520 137327 137450 137734 137642 136848 135429 133647 131786 130020 128352
53000 128352 126825 125772 125513 125762 125702 124887 123865 123708 124968 127150 129180 130418 131267 132677 135101 138222
52984 138222 141700 145611 149871 153822 156968 159752 163021 166990 171186 175094 178310 180474 181761 183130
52970 183130 185326 187807 189327 189389 188435 186924 185116 183538 182642 181939 180379 177745 174901 172582 170758
52955 170758 169352 168696 168862 169179 168820 167536 165628 163615 161989 160891 159952 158760 157387 156056 154636
52940 154636 153120 152238 152681 153878 154504 154202 153795 153762 153569 152762 151739 151058 150763 150739 150972 151164 150918 150520
52922 150520 150717 151427 151621 150917 150306 150695 151672 152450 153182 154368 155602 155949 155369 154829 155019 155633 155942 155608
52904A55608p04m15M84J506K132K231J893J048k76j505j865j159J53J423K033
52889A62587J564L48m66p5R37J325P55N0k8L84O42L31l63p27k20P39J107O32K59
52870A69781O89J303J291J082J588K573K946K401J680J265R95Q58J222J974K385
52855A94033K093J597J525J929K458K809K872K754K643K492J985J079J95m21j057
52840B18986j889k521k671k730l045l179k632j801j443j617j911k185k403k220
52826A86739j602j324j928k754k942k815l137l561l158k102j448j420j361j199
52812A55988j566k342k535j846j118r21q20m44j54k33l91m38o49j003j003n88
52796A39937m45r79j658j727j031O2R39Q89k44j389j119N02J729J211m91j859
$$ plain form
52904 155608 154904 154489 154973 156479 158611 160842 162735 163783 163507 162002 160137 158978 159131 160554 162587
52889 162587 164151 164499 164033 163958 164895 166220 166975 167025 166997 167381 168023 168354 167991 167264 167044 167783 168890 169522 169781
52870 169781 170470 171773 173064 174146 175734 178307 181253 183654 185334 186599 187594 188452 189674 191648 194033
52855 194033 196126 197723 199248 201177 203635 206444 209316 212070 214713 217205 219190 220269 220464 220043 218986
52840 218986 217097 214576 211905 209175 206130 202951 200319 198518 197075 195458 193547 191362 188959 186739
52826 186739 185137 183813 181885 179131 176189 173374 170237 166676 163518 161416 159968 158548 157187 155988
52812 155988 154422 152080 149545 147699 146581 145660 144840 144396 144242 144009 143618 143180 142531 141528 140525 139937
52796 139937 139492 138513 136855 135128 134097 134159 135098 135987 135743 134354 133235 133737 135466 136677 136186 134327
52780A34327k237k095k044k158k127j723j148q87j102j374j300j080j072j128
52766A12852r23o22n69o19n32o75j464k397k558j919j260r52q30j013j696k266
52750I2557j823o83j04m23o85l54m1k02l53j64j21m51m77J77O87K70n15n79J14
52731H6830O59N59J79M0K20M01K03m06r23q39l79j93l05k8Q75J655J581R47O47
52712I1723J135K076K738K573J776J299J837K874L216K459J280L50k79o95q68
52697A13494j003j372j679j342n47k14o63j221j377j400j532j483j155j063j466
52682I5977j865j797j485j258j028p45p36j113j430j294q29k78J78R3q83k090
52666G9417k241j119L7L08J77K66J69o10j450j474r43p30q31n11L57J074J121
$$ plain form
52780 134327 132090 129995 127951 125793 123666 121943 120795 119908 118806 117432 116132 115052 113980 112852
52766 112852 111929 111307 110738 110119 109587 108912 107448 105051 102493 100574 99314 98362 97532 96519 94823 92557
52750 92557 90734 90051 89947 89524 88839 88485 88444 88242 87889 87725 87604 87153 86676 86853 87540 87810 87295 86716 86830
52731 86830 87489 88048 88227 88267 88487 88888 89091 88685 87762 86923 86544 86351 86046 86018 86893 88548 90129 91076 91723
52712 91723 92858 94934 97672 100245 102021 103320 105157 108031 111247 113706 114986 115336 115057 114362 113494
52697 113494 112491 111119 109440 108098 107551 107337 106674 105453 104076 102676 101144 99661 98506 97443 95977
52682 95977 94112 92315 90830 89572 88544 87799 87063 85950 84520 83226 82397 82119 82297 82390 81507 79417
52666 79417 77176 76057 76094 76402 76579 76845 77014 76404 74954 73480 72537 71807 70976 70465 70822 71896 73017
52649G3017P12L29K71N47Q16O34J28N5Q35J926K555K665K603K362J689O75m09
52632I1410j480k437k821k305j298n72m37o40q60q83n72m0L62N02O84J132J629
52615H1374J877J823J410N03n82j063o37O7M63Q33J588K188J763M97m63n03j71
52598I0967k03n25n57j08L95N48N24Q18J504K020J923J541J457J583J401R91J052
52581A05331J746K260J895R53K05j1J99O71J166J381J307J252J325J301J170J209
52565A23360J385J314J063J262K052K595K179J112R4o93j272j331p03P2L47J88
52549A33024J7j45n16r49j093q87m74R7O59Q62O74N36N65K19p20j439j161l12
52531A28957J29J35M05R58R70J13q78j213r41n45j99K41Q20J414J854K001J875
$$ plain form
52649 73017 73729 74058 74329 74876 75692 76326 76454 76509 77344 79270 81825 84490 87093 89455 91144 91819 91410
52632 91410 89930 87493 84672 82367 81069 80497 80060 79420 78560 77677 77105 77065 77427 77929 78613 79745 81374
52615 81374 83251 85074 86484 86987 86405 85342 84705 84772 85235 86068 87656 89844 91607 92104 91641 91138 90967
52598 90967 90764 90239 89682 89574 89969 90517 91041 91859 93363 95383 97306 98847 100304 101887 103288 104279 105331
52581 105331 107077 109337 111232 112185 112390 112379 112578 113249 114415 115796 117103 118355 119680 120981 122151 123360
52565 123360 124745 126059 127122 128384 130436 133031 135210 136322 136416 135723 134451 133120 132417 132489 132836 133024
52549 133024 133041 132896 132380 131431 130338 129451 128977 129074 129733 130595 131269 131805 132370 132589 131869 130430 129269 128957
52531 128957 129086 129221 129626 130584 131554 131667 130789 129576 128635 128090 127891 128132 128952 130366 132220 134221 136096
52514A36096J703J642J480Q30k07r42q27j93M7m81j081q23K01R85R29N55O00R99
52496A41513J218J127R10N27r2n95o90o90q88p47K76J461J527M91l25j83L85P91
52478A46016J049J068N50o7K05J374K230K101J624J353Q91J2o05n24l25n08p16
52461A55728p25j022j660j753r82l81o32q59k86J81o07k057k791k669k379j832
52445A35274o56L55L3j197j763j186m37j87j09L6p9m98p13m28J43P58J234J237
52427A31817O90J44lk00r18j579j330m16K65N72R71J342J133N50L49N79O34M19
52409A35019L84M97L46J38M70J152J363J029Q73J114J218J058J132J441J301N93
52393A49128J68N96J337J631J448J243J278J552J954K224K166J896J612J332J194
$$ plain form
52514 136096 137799 139441 140921 141751 141544 140602 139775 139582 139629 139148 138067 137244 137445 138430 139359 139914 140514 141513
52496 141513 142731 143858 144768 145295 145203 144608 143918 143228 142340 141593 141869 143330 144857 145348 145023 144840 145225 146016
52478 146016 147065 148133 148683 148616 148821 150195 152425 154526 156150 157503 158394 158406 157801 157277 156952 156444 155728
52461 155728 155003 153981 152321 150568 149586 149205 148573 147714 147428 147609 147002 144945 142154 139485 137106 135274
52445 135274 134618 134973 135006 133809 132046 130860 130423 130236 130127 130163 130084 129586 128873 128445 128588 129346 130580 131817
52427 131817 132507 132651 132648 132448 131530 129951 128621 128205 128470 129042 130013 131355 132488 133038 133387 133966 134600 135019
52409 135019 135403 135900 136246 136384 136854 138006 139369 140398 141271 142385 143603 144661 145793 147234 148535 149128
52393 149128 149296 149892 151229 152860 154308 155551 156829 158381 160335 162559 164725 166621 168233 169565 170759
52378A70759J596K455K807J988P16J94M80P83R22J299J759J654J078Q22J119J526
52362A91957J952K675L336L147K238J647J789K040J974J906K004J914J562J445
52348B21586J793K320K827L255L201K380J524J634K373K421J503P14O68P41N28
52333B49468N70J091J392J203J331K226L032K909K334K193K449K534K400K379
52319B77511K563K920L450L813L500K811K833L909N041N326N209N569O381P012
52305C37848P213P113O778O425O493O982P295P147P025P274P544P614P945Q751
52291D39447R350R236R053R620J0595J1107J1152J1458J2188J2777J2865J2667
52279E71515J2403J2076J1758J1697J1979J2327J2237J1300R734Q498Q403R033
$$ plain form
52378 170759 172355 174810 177617 179605 180321 180515 180995 181778 182700 183999 185758 187412 188490 189312 190431 191957
52362 191957 193909 196584 199920 203067 205305 206952 208741 210781 212755 214661 216665 218579 220141 221586
52348 221586 223379 225699 228526 231781 234982 237362 238886 240520 242893 245314 246817 247531 248199 248940 249468
52333 249468 250038 251129 252521 253724 255055 257281 260313 263222 265556 267749 270198 272732 275132 277511
52319 277511 280074 282994 286444 290257 293757 296568 299401 303310 308351 313677 318886 324455 330836 337848
52305 337848 345061 352174 358952 365377 371870 378852 386147 393294 400319 407593 415137 422751 430696 439447
52291 439447 448797 458033 467086 476706 487301 498408 509560 521018 533206 545983 558848 571515
52279 571515 583918 595994 607752 619449 631428 643755 655992 667292 677026 685524 693927 702960
52267G02960R171Q346P288O671O275N701N054M496L883L249K914K653J688Jj220
52252G69130j185o00m33m37R7Q51R03K59k14p2L38P35J214J863K687L797N120
52235G84053O156O626O954P549Q088Q140Q188R035J0479J1467J1563J1325J1220
52222I00843J0936J0070Q896Q090P956Q167Q115P564O926O740O843O448N174L537
52208A006305K157J028J8n57m65k37o66j793k941l591l736l634l652m061m620
52193I79555m679m096l565l603l723l305k736k784l247l280k873k921l686m226
52179I30831l773k924k867l838m915n170m592l845l369l034k669k505k752k951
52165H81627k443j477j090j630k193j949j353j281j631j666j403j652k710l853
$$ plain form
52267 702960 712131 720477 727765 734436 740711 746412 751466 755962 759845 763094 766008 768661 770349 770350 769130
52252 769130 767945 767345 766912 766475 766572 767423 768326 768585 768371 768299 768637 769372 770586 772449 775136 778933 784053
52235 784053 790209 796835 803789 811338 819426 827566 835754 844789 855268 866735 878298 889623 900843
52222 900843 911779 921849 930745 938835 946791 954958 963073 970637 977563 984303 991146 997594 1002768 1006305
52208 1006305 1008462 1009490 1009508 1008951 1008486 1008249 1007583 1005790 1002849 999258 995522 991888 988236 984175 979555
52193 979555 974876 970780 967215 963612 959889 956584 953848 951064 947817 944537 941664 938743 935057 930831
52179 930831 927058 924134 921267 917429 912514 907344 902752 898907 895538 892504 889835 887330 884578 881627
52165 881627 879184 877707 876617 874987 872794 870845 869492 868211 866580 864914 863511 861859 859149 855296
52151H55296m241l740k742j741j188j290j823k405k949l607m351m990n496n914
52137H08819o022n515m586l936m135n095o179o636o137n140m595n000n829o155
52123G33859n657m804m238m189m390m316l707k977k794l126l163k532j971k274
52109F83721k998k974j810j99J180K283L156L613L700L923M596N347N704N947
52095G15189O883Q761J0773J1906J2100J2216J2831J3565J3834J3848J4252J5100
52083H61258J5857J6337J6911J7676J8143J7986J7383J6430J4981J3369J2533
52072A038864J2798J3182J2525J0869R096P673O438N303M464L943L415K418P14
52059A131702j384k989l430l169l351m294n173n461n687o254o506n830m826m435
$$ plain form
52151 855296 851055 847315 844573 842832 841644 840354 838531 836126 833177 829570 825219 820229 814733 808819
52137 808819 802797 797282 792696 788760 784625 779530 773351 766715 760578 755438 750843 745843 740014 733859
52123 733859 728202 723398 719160 714971 710581 706265 702558 699581 696787 693661 690498 687966 685995 683721
52109 683721 680723 677749 675939 675740 676920 679203 682359 685972 689672 693595 698191 703538 709242 715189
52095 715189 722072 730833 741606 753512 765612 777828 790659 804224 818058 831906 846158 861258
52083 861258 877115 893452 910363 928039 946182 964168 981551 997981 1012962 1026331 1038864
52072 1038864 1051662 1064844 1077369 1088238 1097334 1105007 1111445 1116748 1121212 1125155 1128570 1130988 1131702
52059 1131702 1130318 1127329 1123899 1120730 1117379 1113085 1107912 1102451 1096764 1090510 1084004 1078174 1073348 1068913
52045A068913m531m335l705l016k271j338o43o18p87m12L21P79J149K008K912
52030A054426K778J693J041J611K730L516L879L917L414K512K032K411K951K617
52016A091528J233m56j571j733j312j141j688k587l371m380o107p927q633q376
52002A043479q820j0925j3587j5250j5870j6463j7340j7898j7847j7711j7977
51991H73791j8516j9000j9408j9889k0370k0549k0257j9776j9639k0033k0511
51980F55843k0490j9950j9338j8901j8475j7895j7206j6415j5454j4476j3788
51969D63455j3345j2688j1619j0541r904r589r163q511p911p546p202o552n613
51956C43271m792m344l904k918j599r93j728l084l784l496k944k663k348j592
$$ plain form
52045 1068913 1064382 1060047 1056342 1053326 1051055 1049717 1049074 1048456 1047669 1047257 1047578 1048357 1049506 1051514 1054426
52030 1054426 1057204 1058897 1059938 1061549 1064279 1067795 1071674 1075591 1079005 1081517 1083549 1085960 1088911 1091528
52016 1091528 1092761 1092305 1090734 1089001 1087689 1086548 1084860 1082273 1078902 1074522 1068415 1060488 1051855 1043479
52002 1043479 1034659 1023734 1010147 994897 979027 962564 945224 927326 909479 891768 873791
51991 873791 855275 836275 816867 796978 776608 756059 735802 716026 696387 676354 655843
51980 655843 635353 615403 596065 577164 558689 540794 523588 507173 491719 477243 463455
51969 463455 450110 437422 425803 415262 405358 395769 386606 378095 370184 362638 355436 348884 343271
51956 343271 338479 334135 330231 327313 325714 324721 322993 319909 316125 312629 309685 307022 304674 303082
51942C03082o57j77m85j418k550l430l815l839l847m040m386m764m882m289k872
51927B57631j330o69j115j891k160j920j720j854k019j770j109n92p51j380j685
51912B35666j244n97n28j073j551j413o87K54R27R08K35m52n82l80n07j092j604
51895B26280j640j339j001p72p55r99j262j182p42k25K62P83J112P77k21j155
51879B17921j325p78j54O2k8oL02N17J59o22j072o97J74R37J384J514J203N75
51861B20066L14R24J934K439K271J963J802J614J375J312J399J379J334J554J869
51846B43549J776J258Q43P18M66j66q34j091p74J05J285K053J797R04L87M96M77
51829B53249j02n92k92M90R54Q77N88L17J24J51M15N47J84n01j068j389j651j855
$$ plain form
51942 303082 302425 302248 301763 300345 297795 294365 290550 286711 282864 278824 274438 269674 264792 260503 257631
51927 257631 256301 255632 254517 252626 250466 248546 246826 244972 242953 241183 240074 239482 238731 237351 235666
51912 235666 234422 233825 233297 232224 230673 229260 228573 228827 229754 230662 230897 230445 229863 229483 228976 227884 226280
51895 226280 224640 223301 222300 221528 220773 219774 218512 217330 216588 216363 216625 217408 218520 219297 219076 217921
51879 217921 216596 215818 215664 215726 215698 215692 215994 216511 216670 216048 214976 214279 214453 215390 216774 218288 219491 220066
51861 220066 220380 221304 223238 225677 227948 229911 231713 233327 234702 236014 237413 238792 240126 241680 243549
51846 243549 245325 246583 247426 248144 248610 248444 247610 246519 245745 245850 247135 249188 250985 251889 252276 252772 253249
51829 253249 253147 252555 252263 252753 253707 254584 255172 255489 255613 255764 256179 256726 256910 256409 255341 253952 252301 250446
51811B50446j722j165o01n61j053j414j019q5M80J83m02l48N24J527J902J369
51795B48061J85r23j164m81L02N14N02Q68J361J295P77N37O72N95K62L51J067
51778B54781J781K124K517L110L155K075M70n90q54q48j023j445k023k553k831
51763B57846l009l486m204m508m022l188k599k261j944j774j943k164j976j437
51749B19331r86q07p11n75m98n25n26l94j79l8r6l59o68q25p49m67q4J43o0o46
51729B10281j162j321j337j432j372r40n54p93j494j939j800j403j157j319k020
51714A90238k860k812j418J84M40n76j399j328j127j376j584j339j121j229j054
51699A71639j83O51O47K30L06Q56J163J084J221J951K979L823M308M586M903N273
$$ plain form
51811 250446 248724 247559 246958 246397 245344 243930 242911 242826 243306 243489 243087 242739 243263 244790 246692 248061
51795 248061 248246 247323 246159 245678 245980 246494 246996 247864 249225 250520 251297 251834 252506 253101 253363 253714 254781
51778 254781 256562 258686 261203 264313 267468 269543 270013 269423 268569 267721 266698 265253 263230 260677 257846
51763 257846 254837 251351 247147 242639 238617 235429 232830 230569 228625 226851 224908 222744 220768 219331
51749 219331 218345 217538 216827 216252 215754 215229 214703 214309 214130 214092 213996 213637 212969 212144 211395 210928 210844 210987 210927 210281
51729 210281 209119 207798 206461 205029 203657 202717 202163 201370 199876 197937 196137 194734 193577 192258 190238
51714 190238 187378 184566 183148 183332 183772 183196 181797 180469 179342 177966 176382 175043 173922 172693 171639
51699 171639 171456 172107 172754 172984 173290 174146 175309 176393 177614 179565 182544 186367 190675 195261 200164 205437
51683B05437N384N098M888N167N345M400K463R16N47O49K87m97j307k259l439
51668B33079m271m273l837l597l547l421l347l461l399k907k378k142j873j329
51654A89297j001j235j406r12l69p13j617j900j297o67n75p05p13p63r68j091
51638A73365j000q68q11p05m52n6N25J225J707J686J285P91K94j44k69j9K37J68
51620A76959l8l5K70Q50J648K176J719L93o54o45p1L70R55K094L079K845J596
51603A93511N52L22O02J185K177L260L769L607L309L143K969K905L287M008M653
51588B33259N231N983O556O225N011L716K816K104J438J044R31P92N94N35M23
51573B76658j34p98p41Q9P67Q07Q43J516K461K940K896K795K867L054L343L750
$$ plain form
51683 205437 210821 215919 220807 225974 231319 235719 238182 239098 239645 240294 240581 240084 238777 236518 233079
51668 233079 228808 224535 220698 217101 213554 210133 206786 203325 199926 197019 194641 192499 190626 189297
51654 189297 188296 187061 185655 184743 184374 183661 182044 180144 178847 178180 177605 176900 176187 175424 174456 173365
51638 173365 172365 171497 170686 169981 169529 169473 169998 171223 172930 174616 175901 176692 176986 176842 176573 176554 176791 176959
51620 176959 176921 176886 177156 178006 179654 181830 183549 183942 183288 182643 182572 182942 183897 185991 189070 191915 193511
51603 193511 194063 194385 194987 196172 198349 201609 205378 208985 212294 215437 218406 221311 224598 228606 233259
51588 233259 238490 244473 251029 257254 262265 265981 268797 270901 272339 273383 274314 275106 275700 276235 276658
51573 276658 276524 275726 274985 275074 275841 276648 277491 279007 281468 284408 287304 290099 292966 296020 299363 303113
51557C03113M122M275M163L826L328K806K335J766R96K38k96q27j606k313k439
51542C23487k200k309k898l421l688m103m678m749m058l394l523m114m274l732
51528B72346k879k091j579j617k221k810k756k241k051k428k723k356j729j753
51514B41112k617l394l049j639k61J17m32j128j392j316j341j654j888j447l05
51499B19366O62N36m49j085o88J65O20O19N47M18R3j50M4M56O26O00O97Q87J064
51480B25028J595K767L922M075L330K796L047L588L978M484N289N872N738N162
51466B80671M732M544M244L637K849K175J830J693J260J68j263k443l361m498
51452B96238n847o703o647o134n854n915o030o015n796n213m238l168k393k003
$$ plain form
51557 303113 307235 311510 315673 319499 322827 325633 327968 329734 330730 330968 330672 329845 328239 325926 323487
51542 323487 321287 318978 316080 312659 308971 304868 300190 295441 291383 287989 284466 280352 276078 272346
51528 272346 269467 267376 265797 264180 261959 259149 256393 254152 252101 249673 246950 244594 242865 241112
51514 241112 238495 235101 232052 230413 230152 230269 229837 228709 227317 226001 224660 223006 221118 219671 219366
51499 219366 220028 220564 220115 219030 218342 218507 219127 219746 220293 220711 220804 220654 220698 221154 221780 222380 223077 223964 225028
51480 225028 226623 229390 233312 237387 240717 243513 246560 250148 254126 258610 263899 269771 275509 280671
51466 280671 285403 289947 294191 297828 300677 302852 304682 306375 307635 307803 306540 304097 300736 296238
51452 296238 290391 283688 277041 270907 265053 259138 253108 247093 241297 236084 231846 228678 226285 224282
51438B24282j816j607j271q95o43m80j32M55Q62P66N35P74J401J775J635J244
51422B26885O68l69j714k598k594k216k254k852l634m298m783n063n055m639l731
51407A81753k561j816k072l015l661l468k860k572k788l139l219k944k601k552
51393A42485k731k574j797r67p78r88p43Q4P33P79O51O30K29q73j949k029j217
51376A28945n07n26r63j166q15o8N97P14K30l88o52n25k91q7J68M78O69O28M86
51357A26927M51N04M15J08q6K17R40J627K102K600L126L210K615J869J659K022
51341A50306K608L326M156M613M146K953J837J295J226J281J017K2j529k739l128
51326A71390l427m393n280m757l177k456l405m569m303k931j961k006k343k152
$$ plain form
51438 224282 222466 220859 219588 218693 218050 217570 217438 217893 218755 219521 220056 220830 222231 224006 225641 226885
51422 226885 227553 227184 225470 222872 220278 218062 215808 212956 209322 205024 200241 195178 190123 185484 181753
51407 181753 179192 177376 175304 172289 168628 165160 162300 159728 156940 153801 150582 147638 145037 142485
51393 142485 139754 137180 135383 134416 133638 132650 131907 131991 132724 133503 134154 134784 135013 134140 132191 130162 128945
51376 128945 128438 127912 126949 125783 124968 124900 125497 126211 126441 126053 125401 124876 124585 124498 124666 125144 125813 126441 126927
51357 126927 127378 127882 128297 128405 128319 128536 129476 131103 133205 135805 138931 142141 144756 146625 148284 150306
51341 150306 152914 156240 160396 165009 169155 172108 173945 175240 176466 177747 178764 178786 177257 174518 171390
51326 171390 167963 163570 158290 153533 150356 147900 144495 139926 135623 132692 130731 128725 126382 124230
51312A24230j383o11m67j039j594j312l74J38k87r27q99l05J81L22L29K60L3k07
51294A16088j91K3P8j87m81l35M03J222J350P16K38O93J654K034J546Q23K94j68
51276A25800n73p03p78j255j824j649q30n83j399k166j765o99k33o77j310j515
51260A07841j206n19K02M63K11K2K56M79K60p2k0J85L0l70m98k68QK49N72Q76
51240A08701J007J165J596K092K259K060J699J179N14M7Q0L72M50K76J14N5J3
51223A23679M9K06K62N5j42j2L04M94O41R79J340J359J050P18M42J18o3K87J085
51204A32851J651J384M13n09o73m8O79Q10M16J42K86M34J51l50n39k85M7L3m13
51185A36480r32r81m31J85K94N9rm1o90j995l076l187k412j186J51J110J148M01
$$ plain form
51312 124230 122847 122236 121769 120730 119136 117824 117450 117588 117301 116374 115475 115170 115351 115673 116002 116262 116295 116088
51294 116088 115897 115920 115998 115811 115330 114995 115398 116620 117970 118686 118924 119617 121271 123305 124851 125674 125968 125800
51276 125800 125227 124524 123746 122491 120667 119018 118188 117605 116206 114040 112275 111576 111343 110666 109356 107841
51260 107841 106635 106116 106318 106781 106992 107014 107270 107749 108009 107937 107917 108102 108132 107762 107264 106996 107004 107253 107825 108701
51240 108701 109708 110873 112469 114561 116820 118880 120579 121758 122272 122319 122399 122771 123221 123497 123611 123666 123679
51223 123679 123728 123934 124196 124251 124109 124097 124401 124895 125536 126515 127855 129214 130264 130982 131424 131542 131479 131766 132851
51204 132851 134502 135886 136299 135790 135117 135069 135748 136558 136974 137116 137402 137836 137987 137637 137098 136813 136860 136893 136480
51185 136480 135548 134567 134136 134321 134615 134674 134665 134624 133934 131939 128863 125676 123264 122078 122229 123339 124487 124888
51167A24888l16n15m35k65J99Q23R92N76K51L25K64j77k68M40J154R79K33k93
51149A28855o32j175j613j359o70k69k75l35m51p58r03m94J42M29L89K94Qn51
51131A20632q05l59J02j89p43o02L6K01j83l87m03r07j710j684n21P18J131R71
51113A15298P95O47O01J051J954K490K066J108M46L50N39O43M64J09J0M44J060
51096A30075J266J003O50L58N2pN21J337J764J688J533J377R78O25R77J892K416
51079A48505K146J662J360R36M25O74J954L031K612J169L62R12J922K266J801
51064A71737J024J68q88k100l016l225k874k508k418k310j815r91j65N01R45R12
51048A52977K02q57j552j446o77K66Q45P26R9l95l43J5K55L70N50O95O48O07P61
$$ plain form
51167 124888 124572 124057 123622 123357 123556 124379 125371 125947 126198 126523 126787 126610 126342 126782 127936 128915 129148 128855
51149 128855 128223 127048 125435 124076 123406 123137 122862 122527 122076 121318 120415 119921 120063 120492 120881 121175 121183 120632
51131 120632 119827 119468 119570 119381 118638 118036 118072 118273 118090 117703 117300 116393 114683 112999 112478 113196 114327 115298
51113 115298 116093 116740 117341 118392 120346 122836 124902 126010 126456 126806 127345 127988 128452 128561 128571 129015 130075
51096 130075 131341 132344 132994 133352 133404 133397 133918 135255 137019 138707 140240 141617 142595 143220 144197 146089 148505
51079 148505 150651 152313 153673 154609 155034 155708 157662 160693 163305 164474 164836 165748 167670 169936 171737
51064 171737 172761 172929 172041 169941 166925 163700 160826 158318 155900 153590 151775 150784 150619 151120 152065 152977
51048 152977 153179 152322 150770 149324 148647 148913 149758 150484 150583 150188 149845 149860 150115 150485 151035 151730 152378 152985 153746
51029A53746Q18M76J44N34J650K737L191K995K398J683J118P80N39N27J152K264
51013A76752K870K396J616J549J972K080K044K685L879M609M574M460M547M363
50999B20396L916L974M682N104M652M035M206N166O328P336Q074Q535R071J0212
50985C05687J1910J3578J4999J6521J8205J9647K0931K2737K5209K7620K9642
50974E26686L1903L4820L7775M0170M2456M5191M7801M9191M9243M8884M8881
50963A003001M9042M8503M6409M2627L8017L3656K9650K5241K0228J5507J1926
50952A363807R364P319N653M273K878J607J122J481J662R55L3k65n00j979m958
50937A392452q585j2343j6532k1354k6386l1100l5261l8870m2081m5062m7478
$$ plain form
51029 153746 154564 155040 155184 155718 157368 160105 163296 166291 168689 170372 171490 172270 172809 173336 174488 176752
51013 176752 179622 182018 183634 185183 187155 189235 191279 193964 197843 202452 207026 211486 216033 220396
50999 220396 224312 228286 232968 238072 242724 246759 250965 256131 262459 269795 277869 286404 295475 305687
50985 305687 317597 331175 346174 362695 380900 400547 421478 444215 469424 497044 526686
50974 526686 558589 593409 631184 671354 713810 759001 806802 855993 905236 954120 1003001
50963 1003001 1052043 1100546 1146955 1189582 1227599 1261255 1290905 1316146 1336374 1351881 1363807
50952 1363807 1373171 1380490 1386143 1390416 1393294 1394901 1396023 1397504 1399166 1400121 1400154 1399889 1399389 1397410 1392452
50937 1392452 1383867 1371524 1354992 1333638 1307252 1276152 1240891 1202021 1159940 1114878 1067400
50926A067400m8489m7820m6504m5755m5388m4124m1388l7915l4544l1257k7754
50915F16462k4305k1553j9697j8190j6212j3455j0472q183o848n824m487l003
50903D64233j826q44K89J263J353O42J74O27J437J586Q46j50p10o06m0N58Q13
50886D69645Q65J353K612M032M729M781N201O398P411P248O560P034R197J1767
50872E48833J3483J4610J6111J8097J9985K1783K4182K7443L1026L4454L7918
50861H07925M1918M6750N2518N9113O6048P2773P9208Q5657R2140R8238J03517
50850A605805J07779J10805J12375J12438J10862J07069J00511R1540Q1275P0547
50840B611006N9373M7546L5275K3215J2329L655k203n424o461n509k874N84M192
$$ plain form
50926 1067400 1018911 971091 924587 878832 833444 789320 747932 710017 675473 644216 616462
50915 616462 592157 570604 550907 532717 516505 503050 492578 484395 477547 471723 467236 464233
50903 464233 462407 461563 461852 463115 464468 465110 465284 465911 467348 468934 469780 469630 468920 468314 468274 468832 469645
50886 469645 470510 471863 474475 478507 483236 488017 493218 499616 507027 514275 520835 527869 537066 548833
50872 548833 562316 576926 593037 611134 631119 652902 677084 704527 735553 770007 807925
50861 807925 849843 896593 949111 1008224 1074272 1147045 1226253 1311910 1404050 1502288 1605805
50850 1605805 1713584 1824389 1936764 2049202 2160064 2267133 2367644 2459184 2540459 2611006
50840 2611006 2670379 2717925 2753200 2776415 2788744 2792399 2790196 2784772 2778311 2772802 2769928 2770512 2774704
50827B774704Q248J2952J6863J7640J4467Q583J189p885j8973l1275m3608n5691
50815B697214o7840p9883r1014j00328j07112j10924j11804j10060j05903r9712
50805A712634r2462q5081p7279o8088n7621m7280l7918k9029k0087j1505l579
50794A182705M272J2339J9709K5486L0081L4305L7895L9924M0141L8916L6306
50783A502079L2188K6934K1209J5317R365L656j685p017j2521j7732k2238k6326
50771A523229l0401l4328l7910m1279m4239m5988m6225m5678m4802m2866l9350
50760A070163l5281l1961k9060k5311k0628j6088j2139q215m031k2L613P260J1166
50747I09466J5220J9419K3920K8621L3450L8793M4961N1546N7986O4349P0702
$$ plain form
50827 2774704 2782952 2795904 2812767 2830407 2844874 2853457 2854646 2846761 2827788 2796513 2752905 2697214
50815 2697214 2629374 2549491 2458477 2358149 2251037 2140113 2028309 1918249 1812346 1712634
50805 1712634 1620172 1535091 1457812 1389724 1332103 1284823 1246905 1217876 1197789 1186284 1182705
50794 1182705 1186977 1199316 1219025 1244511 1274592 1308897 1346792 1386716 1426857 1465773 1502079
50783 1502079 1534267 1561201 1582410 1597727 1607092 1610748 1609063 1602046 1589525 1571793 1549555 1523229
50771 1523229 1492828 1458500 1420590 1379311 1335072 1289084 1242859 1197181 1152379 1109513 1070163
50760 1070163 1034882 1002921 973861 948550 927922 911834 899695 891480 887449 887427 891040 898300 909466
50747 909466 924686 944105 968025 996646 1030096 1068889 1113850 1165396 1223382 1287731 1358433
50736A358433P6249Q0197Q2993Q5507Q7268Q6824Q3670P8446P1373O1922N0248
50725B203130L7533K4619J1517j351j2700k1680k8649l4068l7515l8347l6629
50714B065860l2880k7581k1421j5358r966n196j159J394J700l50m413j0059j6757
50701A923814k3972l1508l9226m6423n2088n5961n8612o0237o0135n7773n3681
50690A384198m8791m3404l7304l0445k3049j5274p227Q81Q942J7157K5776L4777
50678A266237M3915N2995O1922P0609P8806Q5988R1575R5429R7828R8668R7096
50667B141068R2357Q4794P5402O4774N3019M0610K8485J7253O894k833j2166k1380
50655B568277l0442l8711m5585n1263n6207o0074o2067o2226o1330n9526n6092
$$ plain form
50736 1358433 1434682 1514879 1597872 1683379 1770647 1857471 1941141 2019587 2090960 2152882 2203130
50725 2203130 2240663 2265282 2276799 2275448 2262748 2241068 2212419 2178351 2140836 2102489 2065860
50714 2065860 2032980 2005399 1983978 1968620 1958654 1953458 1952299 1953693 1955393 1955043 1950630 1940571 1923814
50701 1923814 1899842 1868334 1829108 1782685 1730597 1674636 1616024 1555787 1495652 1437879 1384198
50690 1384198 1335407 1292003 1254699 1224254 1201205 1185931 1178704 1179585 1188527 1205684 1231460 1266237
50678 1266237 1310152 1363147 1425069 1495678 1574484 1660472 1752047 1847476 1945304 2043972 2141068
50667 2141068 2233425 2318219 2393621 2458395 2511414 2552024 2580509 2597762 2604656 2601823 2589657 2568277
50655 2568277 2537835 2499124 2453539 2402276 2346069 2285995 2223928 2161702 2100372 2040846 1984754
50644A984754n0855m4834l8947l2941k6156j8742j1556n322l67L196N536P102
50632A770868Q263R117R693J0034J0035R623R237R681J1351J3912J6825J9815
50620A908454K2818K5823K8776L1269L2464L1744K9275K5396J9803J2148L246
50609B171216n249j2435j8625k4202k9017l3051l6690m0061m2954m5641m8919
50598A834372n2962n6944o0140o2514o3947o3899o2414o0459n8608n6208n2619
50587A183658m8486m4883m1777l8302l4186l0059k6532k3646k1003j8007j4225
50576H42552r948o096l183p38J864M533O998R558J2621J5904J8906K1870K5438
50563I40279K9630L3903L8174M2912M8199N3413N8041O2243O6372P0343P3676
$$ plain form
50644 1984754 1933899 1889065 1850118 1817177 1791021 1772279 1760723 1755401 1755034 1758230 1763766 1770868
50632 1770868 1779131 1788248 1797941 1807975 1818010 1827633 1836870 1846551 1857902 1871814 1888639 1908454
50620 1908454 1931272 1957095 1985871 2017140 2049604 2081348 2110623 2136019 2155822 2167970 2171216
50609 2171216 2165967 2153532 2134907 2110705 2081688 2048637 2011947 1971886 1928932 1883291 1834372
50598 1834372 1781410 1724466 1664326 1601812 1537865 1473966 1411552 1351093 1292485 1236277 1183658
50587 1183658 1135172 1090289 1048512 1010210 976024 945965 919433 895787 874784 856777 842552
50576 842552 832604 826508 823325 822587 824451 828984 835982 845540 858161 874065 892971 914841 940279
50563 940279 969909 1003812 1041986 1084898 1133097 1186510 1244551 1306794 1373166 1443509 1517185
50552A517185P5820P6348P5110P2355O8448O3462N7343N0549M4125L8935L4977
50541B174657L1684K8725K6186K4043K1861J9341J6868J5128J4203J3539J2965
50530B399200J3195J4949J7934K1225K4260K6999K9335L0980L1806L1733L0415
50519B672031K7629K3775J9250J3598O090k790j1537j9384k6996l5023m2901m9560
50507B574182n4559n7902n9401n8870n6576n2950m8125m2140l5301k8021k0703
50496B059634j4042q915n571l313j344M89K021L250M100M112K825R9m266j0753
50482B028326j9539k9922m0702n0798n9454o6265p1313p4848p6719p6574p4735
50471A387457p2089o8953o4913o0015n5126n0604m5681l9921l4345l0056k6604
$$ plain form
50552 1517185 1593005 1669353 1744463 1816818 1885266 1948728 2006071 2056620 2100745 2139680 2174657
50541 2174657 2206341 2235066 2261252 2285295 2307156 2326497 2343365 2358493 2372696 2386235 2399200
50530 2399200 2412395 2427344 2445278 2466503 2490763 2517762 2547097 2578077 2609883 2641616 2672031
50519 2672031 2699660 2723435 2742685 2756283 2762373 2759583 2748046 2728662 2701666 2666643 2623742 2574182
50507 2574182 2519623 2461721 2402320 2343450 2286874 2233924 2185799 2143659 2108358 2080337 2059634
50496 2059634 2045592 2036677 2031106 2027793 2026449 2026938 2028959 2032209 2036309 2040421 2043246 2043345 2039079 2028326
50482 2028326 2008787 1978865 1938163 1887365 1827911 1761646 1690333 1615485 1538766 1462192 1387457
50471 1387457 1315368 1246415 1181502 1121487 1066361 1015757 970076 930155 895810 865754 839150
50460H39150k2848j8816j5475j3039j0707q001n180k430L37K831M524N550O684
50447G62580Q307J0168J2096J4175J6199J7798J9224K1140K3438K5276K6546K8347
50435I85294L1359L4670L6913L8034L9050M0448M1744M2566M3260M4222M5258
50424A422818M6013M6582M7206M7650M7388M6463M5631M5401M5379M4903M3903
50413A929337M2648M0929L8181L4386L0115K5610K0521J4787R033L623k015q538
50401B178617j5641k2489k8901l5380m2098m8544n4222n9147o3515o7183o9751
50390A671746p1003p1157p0586o9250o6578o2198n6691n1053m5472l9276l2276
50379A036206k5378j9390j3930q252k521K468O514R968J2752J4266J4312J3278
$$ plain form
50460 839150 816302 797486 782011 768972 758265 750264 745084 742654 742991 745822 750346 755896 762580
50447 762580 770887 781055 793151 807326 823525 841323 860547 881687 905125 930401 956947 985294
50435 985294 1016653 1051323 1088236 1126270 1165320 1205768 1247512 1290078 1333338 1377560 1422818
50424 1422818 1468831 1515413 1562619 1610269 1657657 1704120 1749751 1795152 1840531 1885434 1929337
50413 1929337 1971985 2012914 2051095 2085481 2115596 2141206 2161727 2176514 2185547 2189170 2187155 2178617
50401 2178617 2162976 2140487 2111586 2076206 2034108 1985564 1931342 1872195 1808680 1741497 1671746
50390 1671746 1600743 1529586 1459000 1389750 1323172 1260974 1204283 1153230 1107758 1068482 1036206
50379 1036206 1010828 991438 977508 969256 966735 969203 975717 985685 998437 1012703 1027015 1040293
50367A040293J1317Q060L406j991p286j2135j6561k0573k4040k6758k8471k9041
50355H96220k8676k7834k6836k5751k4561k3256k1753j9971j8044j6247j4700
50344F48591j3223j1580r793q188p021o039m563k250L55K370L572M435N314O154
50330F08134P022Q183R506J0579J1632J3509J6270J8736K0039K0824K2165K4044
50318G90643K5839K7639K9867L2045L3237L3503L3749L4082L3618L2066L0321
50307A136609K9060K7758K5736K3339K1284J9398J6792J3113Q991N216J919j319
50295A327896m716p871j0167j1652j3211j5690j9053k2670k6112k9275l1907l3680
50283A101892l4614l5012l4876l3985l2542l1192l0164k8951k7079k4855k3019
$$ plain form
50367 1040293 1051610 1059670 1063076 1061085 1053799 1041664 1025103 1004530 980490 953732 925261 896220
50355 896220 867544 839710 812874 787123 762562 739306 717553 697582 679538 663291 648591
50344 648591 635368 623788 613995 605807 598786 592747 588184 585934 586289 588659 592231 596666 601980 608134
50330 608134 615156 623339 632845 643424 655056 668565 684835 703571 723610 744434 766599 790643
50318 790643 816482 844121 873988 906033 939270 972773 1006522 1040604 1074222 1106288 1136609
50307 1136609 1165669 1193427 1219163 1242502 1263786 1283184 1299976 1313089 1322080 1327296 1329215 1327896
50295 1327896 1323180 1315309 1305142 1293490 1280279 1264589 1245536 1222866 1196754 1167479 1135572 1101892
50283 1101892 1067278 1032266 997390 963405 930863 899671 869507 840556 813477 788622 765603
50272G65603k1869k0955j9554j7392j4988j3215j2387j1893j0985r684q513p571
50260E96597o444n026l727k773j817o09M45Q19O69P04J355K425L483M359N152
50245E95612N847O181N987N579N524N927O222N825M839L779K819J673J85j258
50231F54741k065k054j708j801k681l922m826n200n301n111m278k993k207k452
50217F08142k974k696j676q63o63n16J00J022J906K720L553M379N231O226P246
50202F31137P904Q049Q046Q440R399J0566J1296J1109J0034Q528O948N261L369
50189G40086J452k10j638l042m522o067p648r147j0383j1371j2218j2690j2313
50176F50289j1185j0161r842r877r653r186q721q042o924n843n448n525n285m481
$$ plain form
50272 765603 743734 722779 703225 685833 670845 657630 645243 633350 622365 612681 604168 596597
50260 596597 590153 585127 581400 578627 576810 576201 576646 577465 578134 578838 580193 582618 586101 590460 595612
50245 595612 601459 607640 613627 619206 624730 630657 636879 642704 647543 651322 654141 655814 655999 654741
50231 654741 652676 650622 648914 647113 644432 640510 635684 630484 625183 620072 615794 612801 610594 608142
50217 608142 605168 602472 600796 599933 599270 598754 598854 599876 601782 604502 608055 612434 617665 623891 631137
50202 631137 639041 647090 655136 663576 672975 683541 694837 705946 715980 724508 731456 736717 740086
50189 740086 741538 741328 739690 736648 732126 726059 718411 709264 698881 687510 675292 662602 650289
50176 650289 639104 628943 619101 609224 599571 590385 581664 573622 566698 560855 555407 549882 544597 540116
50162E40116l555k808k130j517j114q76o69o01p17o65k12J86N3k54j20K89M93
50145E25899P59J596K480K406J664J693K941M184M426M208M399M860N093N302
50131E71910N918O693P083P103P085O983O518N769N104M733M700M981N278N110
50117F54968M500M244M944O091O478N570M154L694N049P684J0151J1520J2286
50104G41333J3667J6141J9200K2315K5503K8943L2695L7013M2380M8998N6626
50093A084814O5047P4288Q4374R5341J07511J21099J35498J49410J61686J71408
50083B250476J77243J77599J71674J59824J42987J22582J01017Q1197O4960N2580
50073C502139M3786L8265L4800L1158K5461J6938M849j2171l4608o0612q7063
$$ plain form
50162 540116 536561 533753 531623 530106 528992 528116 527447 526846 526129 525464 525252 525438 525491 525237 525117 525406 525899
50145 525899 526658 528254 530734 533140 534804 536497 539438 543622 548048 552256 556655 561515 566608 571910
50131 571910 577828 584521 591604 598707 605792 612775 619293 625062 630166 634899 639599 644580 649858 654968
50117 654968 659468 663712 668656 674747 681225 686795 690949 694643 699692 707376 717527 729047 741333
50104 741333 755000 771141 790341 812656 838159 867102 899797 936810 979190 1028188 1084814
50093 1084814 1149861 1224149 1308523 1403864 1511375 1632474 1767972 1917382 2079068 2250476
50083 2250476 2427719 2605318 2776992 2936816 3079803 3202385 3303402 3384599 3449559 3502139
50073 3502139 3545925 3584190 3618990 3650148 3675609 3692547 3697396 3685225 3650617 3590005 3502942
50062C502942j11745j33693j51867j64676j70948j70759j65304j56196j44874
50053B132880j32223j18795j05334r2803q1671p1678o2497n4219m6986m0633l4995
50042A291046l0155k6110k2653j9730j7480j5768j4307j3217j2776j2485j1448
50031A094917r840q947r255r683r300q686q675q889q635q295q463q511p368n322
50017I75048l607k519j210P42K824M591O055P044P332P516Q667J0898J3153J4630
50003A051164J5550J6346J7045J7781J8957K0474K1438K1264K0521K0226K0697
49992A261463K1496K2270K3168K4582K6626K8912L0882L2570L4775L8238M2791
49981A587773M7824N3384O0280O9109P9790R2110J06125J21894J39316J58413
$$ plain form
50062 3502942 3391197 3257504 3105637 2940961 2770013 2599254 2433950 2277754 2132880
50053 2132880 2000657 1881862 1776528 1683725 1602054 1530376 1467879 1413660 1366674 1326041 1291046
50042 1291046 1260891 1234781 1212128 1192398 1174918 1159150 1144843 1131626 1118850 1106365 1094917
50031 1094917 1085077 1076130 1066875 1057192 1047892 1039206 1030531 1021642 1013007 1004712 996249 987738 980370 975048
50017 975048 971441 968922 967712 968454 971278 975869 981924 988968 996300 1003816 1012483 1023381 1036534 1051164
50003 1051164 1066714 1083060 1100105 1117886 1136843 1157317 1178755 1200019 1220540 1240766 1261463
49992 1261463 1282959 1305229 1328397 1352979 1379605 1408517 1439399 1471969 1506744 1544982 1587773
49981 1587773 1635597 1688981 1749261 1818370 1898160 1990270 2096395 2218289 2357605 2516018
49971B516018J79251K01242K22746K41597K55859K64042K65053K58354K44269
49962D648431K24223K00742J76956J55694J38687J26379J17964J11441J04100
49953F004617R3580P8420N7497K9640n376m5638q7654j28177j65001j96430k21138
49942E414340k38977k51062k58521k61590k60254k55180k47376k37340k25213
49933C178827k11627j97742j84243j70771j56659j41956j27545j14350j02706
49924A771228r2465q3412p5412o8358o2175n6757n1796m6924m2317l8840l7039
49913A115733l6216l5049l3186l1462l0461k9706k8549k7130k5857k4557k2860
49902G90700k0952j9306j7938j6484j4777j2865j0835r024q004p748p250n715
$$ plain form
49971 2516018 2695269 2896511 3119257 3360854 3616713 3880755 4145808 4404162 4648431
49962 4648431 4872654 5073396 5250352 5406046 5544733 5671112 5789076 5900517 6004617
49953 6004617 6098197 6176617 6234114 6263754 6258378 6212740 6125086 5996909 5831908 5635478 5414340
49942 5414340 5175363 4924301 4665780 4404190 4143936 3888756 3641380 3404040 3178827
49933 3178827 2967200 2769458 2585215 2414444 2257785 2115829 1988284 1873934 1771228
49924 1771228 1678763 1595351 1519939 1451581 1389406 1332649 1280853 1233929 1191612 1152772 1115733
49913 1115733 1079517 1044468 1011282 979820 949359 919653 891104 863974 838117 813560 790700
49902 790700 769748 750442 732504 716020 701243 688378 677543 668519 660515 652767 645517 639802
49890F39802l727k515k362k513k365j899j129j01N97L66l21j99J159K855M030
49875F31678M799N516N941N832N797O781Q912J1339J3162J4339J5667J7989K1325
49862G69077K4859K7954L1014L4954M0062M5939N2430N9953O8792P8776Q9811
49851A323621J02177J15963J30717J45795J60451J73354J82610J86712J85055
49842B706455J77350J63245J43262J19623R5453P3243N4478M0298L1489K7568
49832C632464K6390K5022K0820J1709l920k6790n5931q8554j21040j50219j73887
49821C096064j90587j99559k01122j96705j88030j76371j62631j47796j32794
49812A500469j18173j04319r1770q0817p1080o2122n4312m8344m3920l9820l5430
$$ plain form
49890 639802 636075 633560 631198 628685 626320 624421 623292 623191 623788 624154 623833 623634 624793 627648 631678
49875 631678 636477 641993 647934 653766 659563 666344 675256 686595 699757 714096 729763 747752 769077
49862 769077 793936 821890 852904 887858 927920 973859 1026289 1086242 1155034 1233810 1323621
49851 1323621 1425798 1541761 1672478 1818273 1978724 2152078 2334688 2521400 2706455
49842 2706455 2883805 3047050 3190312 3309935 3405388 3478631 3533109 3573407 3604896 3632464
49832 3632464 3658854 3683876 3704696 3716405 3712485 3685695 3629764 3541210 3420170 3269951 3096064
49821 3096064 2905477 2705918 2504796 2308091 2120061 1943690 1781059 1633263 1500469
49812 1500469 1382296 1277977 1186207 1105390 1034310 972188 917876 869532 825612 785792 750362
49801G50362l1314k8037k5292k2756k0838j9777j8679j6537j3777j1776j1031
49790E30548j0772j0335r837r361q548p445o852p144p506p068o173n695n537m905
49776D23370l813l207l401l507k790j729j105q34m13K1l8m71o62m85m03n69n65
49759C99399j34M36P95R08R01R67J412K282K936K643J604P34M89N73Q70J663K704
49742D21182K981K052P88K67N35R27J057Q60L60p5J48Q70J004Oj112j095j84L84
49724D30955J49l25n49n06j20O42J225R70J24m12l23j11j44k58l34m09k65M28
49706D30737J445K174K459K566K461J873J032N11L77K54K32P11J377J370O78K73
49690D50530N55P27J99m42m76j37N8L14R84J603J367L10p64j298j330j076p48
$$ plain form
49801 750362 719048 691011 665719 642963 622125 602348 583669 567132 553355 541579 530548
49790 530548 519776 509441 499604 490243 481695 474250 467398 460254 452748 445680 439507 433812 428275 423370
49776 423370 419557 416350 412949 409442 406652 404923 403818 402984 402571 402592 402554 402083 401421 400936 400533 399964 399399
49759 399399 399265 399701 400496 401404 402305 403272 404684 406966 409902 412545 414149 414883 415372 415945 416815 418478 421182
49742 421182 424163 426215 427003 427270 427805 428732 429789 430649 431009 430934 431082 431952 432956 432962 431850 430755 430571 430955
49724 430955 431104 430779 430230 429724 429604 430246 431471 432441 432565 432153 431830 431719 431575 431317 430983 430574 430309 430737
49706 430737 432182 434356 436815 439381 441842 443715 444747 445258 445635 445889 446121 446832 448209 449579 450257 450530
49690 450530 451085 451812 452011 451569 451093 450956 451014 451328 452312 453915 455282 455592 454828 453530 452200 451124 450376
49673D50376o90j036j331r49Q6J059J344R66M04J14K77P54J251J536J528J262
49657D56951R41R20J338J770J629R91O30J055J825K163J893J528J518J683J473
49642D78308O68k47m89J82J195J907K295K666K931K741K213J998K453L228L716
49627E05765L652L106K318J633J279J182J117J067J126J176J059R35J050J244
$$ plain form
49673 450376 449686 448650 447319 446370 446456 447515 448859 449825 450229 450343 450620 451374 452625 454161 455689 456951
49657 456951 457892 458812 460150 461920 463549 464540 465170 466225 468050 470213 472106 473634 475152 476835 478308
49642 478308 478976 478729 478240 478422 479617 481524 483819 486485 489416 492157 494370 496368 498821 502049 505765
49627 505765 509417 512523 514841 516474 517753 518935 520052 521119 522245 523421 524480 525415 526465 527709
$$ [...]
##END NTUPLES=NMR SPECTRUM
##END=
