##TITLE=NES1024_9875_9266793_A0ksr01iBF
##JCAMPDX= 6.0         $$ Bruker NMR JCAMP-DX V2.0
##DATA TYPE= NMR SPECTRUM
##DATA CLASS= NTUPLES
##ORIGIN= BRUKER
##OWNER= Administrator
$$ 1.72 TOPSPIN		Version 2.1
$$ 2015-07-09 18:33:16.488 -0700  Administrator@X
$$ Compression mode = diff/dup
##.OBSERVE FREQUENCY= 400.02188249412
##.OBSERVE NUCLEUS= ^1H
##.ACQUISITION MODE= SIMULTANEOUS (DQD)
##.ACQUISITION SCHEME= undefined
##.AVERAGES= 8
##.DIGITISER RES= 22
##SPECTROMETER/DATA SYSTEM= spect
##.PULSE SEQUENCE= zg30
##.SOLVENT NAME= COFFEE_meoh
##.SHIFT REFERENCE= INTERNAL, COFFEE_meoh, 1, 14.98509
##AUDIT TRAIL= $$ (NUMBER, WHEN, WHO, WHERE, PROCESS, VERSION, WHAT)
$$ ##TITLE= Audit trail, TOPSPIN		Version 2.1
$$ ##JCAMPDX= 5.01
$$ ##ORIGIN= Bruker BioSpin GmbH
$$ ##OWNER= Administrator
$$ $$ E:\/data/COFFEE/nmr/NES1024_9875_9266793_A0ksr01iBF/10/pdata/1/auditp.txt
$$ ##AUDIT TRAIL=  $$ (NUMBER, WHEN, WHO, WHERE, PROCESS, VERSION, WHAT)
(   1,<2015-07-09 18:33:09.066 -0700>,<Administrator>,<X>,<go>,<TOPSPIN 2.1>,
      <created by zg
	started at 2015-07-09 18:32:03.097 -0700,
	POWCHK enabled, PULCHK disabled,
       configuration hash MD5:
       21 0F 79 D6 B3 7B B4 F6 88 20 88 DB 03 48 BD 9F
       data hash MD5: 64K
       00 5A 18 24 C1 5E 6F E2 80 03 64 67 9F F7 13 8F>)
(   2,<2015-07-09 18:33:12.316 -0700>,<Administrator>,<X>,<proc1d>,<TOPSPIN 2.1>,
      <Start of raw data processing
       efp LB = 0 FT_mod = 6 PKNL = 1 PHC0 = 0 PHC1 = 0 SI = 32K 
       data hash MD5: 32K
       34 A8 12 C3 39 1D 3C 3B BD BF B5 0D 9D 17 48 10>)
(   3,<2015-07-09 18:33:12.597 -0700>,<Administrator>,<X>,<proc1d>,<TOPSPIN 2.1>,
      <pk PHC0 = 89.59351 PHC1 = 0 
       data hash MD5: 32K
       FA 77 5D 1B BC 79 4C BC 30 27 34 6B 98 E0 1C DE>)
(   4,<2015-07-09 18:33:12.738 -0700>,<Administrator>,<X>,<proc1d>,<TOPSPIN 2.1>,
      <abs ABSG = 1 
       data hash MD5: 32K
       82 B5 82 7D CB 8E CC BA 83 3E 9D 84 B8 EC 2D 37>)
(   5,<2015-07-09 18:33:12.800 -0700>,<Administrator>,<X>,<proc1d>,<TOPSPIN 2.1>,
      <abs ABSG = 2 
       data hash MD5: 32K
       33 DF 29 0D 1B 81 9A 06 09 11 28 E5 CC 1A B0 52>)
(   6,<2015-07-09 18:33:12.847 -0700>,<Administrator>,<X>,<proc1d>,<TOPSPIN 2.1>,
      <abs ABSG = 3 
       data hash MD5: 32K
       65 FD E2 5C 93 E0 C8 23 14 E4 FA 00 54 83 22 C6>)
(   7,<2015-07-09 18:33:12.910 -0700>,<Administrator>,<X>,<proc1d>,<TOPSPIN 2.1>,
      <abs ABSG = 4 
       data hash MD5: 32K
       66 F2 4C FF 7E 9D E9 E4 A1 A0 12 CA 62 5B A5 CA>)
(   8,<2015-07-09 18:33:12.972 -0700>,<Administrator>,<X>,<proc1d>,<TOPSPIN 2.1>,
      <abs ABSG = 5 
       data hash MD5: 32K
       C9 7E BB 3E 1B C4 3E 11 92 9B 67 6A 9E 8E 3A 9D>)
$$ ##END=
$$ 
$$ $$ hash MD5
$$ $$ 30 86 F3 D8 6A 9B 9C 46 9D DC 54 6F B8 6D 87 9D
##$RELAX= 
##$RELAX= 
##$RELAX= 
##$RELAX= 
##$RELAX= 
##$RELAX= 
##$RELAX= 
$$ Bruker specific parameters
$$ --------------------------
##$DU= <E:\>
##$EXPNO= 10
##$NAME= <NES1024_9875_9266793_A0ksr01iBF>
##$PROCNO= 1
$$ [...]
150 150 150 150 150 150 150 150
##$TP07= 0
##$TPNAME0= <>
##$TPNAME1= <>
##$TPNAME2= <>
##$TPNAME3= <>
##$TPNAME4= <>
##$TPNAME5= <>
##$TPNAME6= <>
##$TPNAME7= <>
##$TPOAL= (0..7)
0.5 0.5 0.5 0.5 0.5 0.5 0.5 0.5
##$TPOFFS= (0..7)
0 0 0 0 0 0 0 0
##$TUNHIN= 0
##$TUNHOUT= 0
##$TUNXOUT= 0
##$USERA1= <user>
##$USERA2= <user>
##$USERA3= <user>
##$USERA4= <user>
##$USERA5= <user>
##$V9= 5
##$VALIST= <valist>
##$VCLIST= <CCCCCCCCCCCCCCC>
##$VD= 0
##$VDLIST= <DDDDDDDDDDDDDDD>
##$VPLIST= <PPPPPPPPPPPPPPP>
##$VTLIST= <TTTTTTTTTTTTTTT>
##$WBST= 2048
##$WBSW= 25
##$XGAIN= (0..3)
0 0 0 0
##$XL= 0
##$YL= 0
##$YMAX_a= 624476
##$YMIN_a= -517335
##$ZGOPTNS= <>
##$ZL1= 120
##$ZL2= 120
##$ZL3= 120
##$ZL4= 120
##$ABSF1= 14.98509
##$ABSF2= -5.573092
##$ABSG= 5
##$ABSL= 3
##$ALPHA= 0
##$AQORDER= 0
##$ASSFAC= 0
##$ASSFACI= 0
##$ASSFACX= 0
##$ASSWID= 0
##$AUNMP= <proc_prof1d_extract_pilot.lims>
##$AXLEFT= 0
##$AXNAME= <>
##$AXNUC= <1H>
##$AXRIGHT= 0
##$AXTYPE= 0
##$AXUNIT= <>
##$AZFE= 0.1
##$AZFW= 0.1
##$BCFW= 0
##$BC_mod= 0
##$BYTORDP= 0
##$COROFFS= 0
##$CY= 15
##$DATMOD= 1
##$DC= 0
##$DFILT= <>
##$DTYPP= 0
##$F1P= 0
##$F2P= 0
##$FCOR= 0.5
##$FTSIZE= 32768
##$FT_mod= 6
##$GAMMA= 0
##$GB= 0
##$INTBC= 1
##$INTSCL= 1
##$ISEN= 128
##$LB= 0
##$LEV0= 0
##$LPBIN= 0
##$MAXI= 10000
##$MC2= 0
##$MEAN= 0
##$ME_mod= 0
##$MI= 0
##$NCOEF= 0
##$NC_proc= -8
##$NLEV= 6
##$NOISF1= 0
##$NOISF2= 0
##$NSP= 0
##$NTH_PI= 0
##$NZP= 0
##$OFFSET= 14.98509
##$PC= 1
##$PHC0= 89.59351
##$PHC1= 0
##$PH_mod= 1
##$PKNL= yes
##$PPARMOD= 0
##$PPDIAG= 0
##$PPIPTYP= 0
##$PPMPNUM= 2147483647
##$PPRESOL= 1
##$PSCAL= 4
##$PSIGN= 0
##$PYNMP= <proc.py>
##$REVERSE= no
##$SF= 400.02
##$SI= 32768
##$SIGF1= 0
##$SIGF2= 0
##$SINO= 400
##$SIOLD= 32768
##$SPECTYP= <>
##$SREGLST= <1H.CDCl3>
##$SSB= 0
##$STSI= 32768
##$STSR= 0
##$SW_p= 8223.68421052631
##$SYMM= 0
##$S_DEV= 0
##$TDeff= 65536
##$TDoff= 0
##$TI= <>
##$TILT= no
##$TM1= 0
##$TM2= 0
##$TOPLEV= 0
##$USERP1= <user>
##$USERP2= <user>
##$USERP3= <user>
##$USERP4= <user>
##$USERP5= <user>
##$WDW= 1
##$XDIM= 32768
##$YMAX_p= 446259164
##$YMIN_p= -739283
##$CURPLOT= <Network HP LaserJet P1505>
##$CURPRIN= <$Network HP LaserJet P1505>
##$DFORMAT= <normdp>
##$LAYOUT= <+/1D_H.xwp>
##$LFORMAT= <normlp>
##$PFORMAT= <normpl>
##$SURQMSG= 1
$$ End of Bruker specific parameters
$$ ---------------------------------
##NTUPLES= NMR SPECTRUM
##VAR_NAME=  FREQUENCY,     SPECTRUM/REAL,   SPECTRUM/IMAG
##SYMBOL=    X,             R,               I
##VAR_TYPE=  INDEPENDENT,   DEPENDENT,       DEPENDENT
##VAR_FORM=  AFFN,          ASDF,            ASDF
##VAR_DIM=   32768,         32768,           32768
##UNITS=     HZ,            ARBITRARY UNITS, ARBITRARY UNITS
##FACTOR=    0.250966925370066, 1,           1
##FIRST=     8223.43324360094, -136835,      -190511
##LAST=      0,             -146169,         -9210
##MIN=       0,             -739283,         0
##MAX=       8223.43324360094, 446259164,    0
$$ Real data points
##PAGE= N=1
##DATA TABLE= (X++(R..R)), XYDATA
$$ [...]
19459E8586K04853d62046A27764m8934C6591c52569a56884I163a20255J2946j00713
19448b08022d6318j00743A22020m2697d4078q7539o6302q950E4064h2439A42843
19436B49839A147J06633O7552a99716p82j1829K3286A60721h0049j65079A5174
19424D3273J41793c83558J72361B6063c783l80535a40940l01014b12186M1343
19414a70843N0486A65365a22098j21696I6891a99962j52285A33487i3879c9592
19403a6844k30432P8077G6563c62642A38619b60550f1734A9394J11308d43547
19392A0251d8846k4j38365h6240A6864b13279I4720a51502K3017C1934d03999
19380A00649k6844Q6551f3513m7878A26276c4924l12512J61035j35749D2356a48376
$$ y = [58586, 263439, -462046, 127764, 78830, 36591, -352569, -156884, 9163, -120255, -107309, -208022, -46318, -147061, 122020, 79323, -44078, -131617, -197919, -206869, 54064, -82439, 142843, 249839, 1147, 107780, 175332, -199716, -200498, -212327, -189041, 160721, -80049, -245128, 15174, 43273, 185066, -383558, -211197, 26063, -3783, -384318, -140940, -441954, -212186, -170843, -120357, 165365, -122098, -243794, 96891, -199962, -352247, 133487, -93879, -39592, -16844, -247276, -169199, 76563, -362642, 138619, -260550, -61734, 19394, 130702, -443547, 10251, -48846, -48870, -187235, -86240, 16864, -213279, 94720, -151502, -128485, 31934, -403999, 100649, 73805, 160356, -63513, -111391, 126276, -34924, -347436, -186401, -322150, 42356, -148376]
19368b06311r9588J08652l7169A18252b14484m6045A25701i4292D0264R8494d1616
19356I5749b0237A17457b86723J32812j50251k32632d1979A1013a55991a56q051
19345h207A22812a59951j30477a15305A54524b38564a04074b1052D1565E250c96479
19333a24720A6549N5841g9260n2981k0667N5345A66460B8622b16464d918k08599
19322b13517C17332A17209b75917F1680d1101L331G1654j3156f7076j67627B78119
19310a49221H4465b11077e2881A42694a52371a7274l6913j41865p5492c5401l11845
19299c47246i3580K1797k40610C22734f1398B82726I4073h5937j03118a128A3692
19287A34135E6732a42350k44394B3248b87918A74973a62182N8442q7280d504B68798
$$ y = [-206311, -305899, -197247, -234416, 118252, -214484, -260529, 125701, -94292, 40264, 138758, -41616, 95749, -20237, 117457, -286723, -153911, -304162, -536794, -41979, 11013, -155991, -156, -8207, 122812, -159951, -290428, -115305, 154524, -238564, -104074, -21052, 41565, 5250, -396479, -124720, 16549, 72390, -79260, -132241, -152908, -97563, 166460, 28622, -216464, -4918, -213517, 317332, 117209, -275917, 61680, -41101, -37770, 71654, 58498, -67076, -234703, 278119, -149221, 84465, -211077, -52881, 142694, -152371, -17274, -54187, -196052, -271544, -35401, -347246, -93580, -71783, -312393, 322734, -61398, 282726, 94073, -85937, -189055, -1128, 13692, 134135, 56732, -142350, -386744, 23248, -287918, 174973, -162182, -103740, -191020, -4504, 268798]
19275c2087k35192R3545q6017B98114b41999b5050p92q471k41303P5676G7896
19263h7963C295a63572e7092k45206A3673g4690K1660j25669a3453G4447h3947
19251A8664i6782j55091J14751C43997I0899k4343a30328H0816g0727J5711B83394
19239b31569D4866K30611B8307a18988H2428b9061E1607d85590a45992L2172r408
19228a23228k8768r8437P5884j16413B94524E4974j9812R3052p728c12841D7719
19216a44129K8542C08475i9854l3723l12378D5877d39831A50149a34980k4638
19206a59618O9448p5860B04509a96973O8062j88577a22678o8892Q0646j34817
19196b45741e2268j91068j10894A77701a72086D2681c16202A04775J10152h2807
$$ y = [-32087, -267279, -173734, -259751, 298114, -241999, -25050, -25842, -34313, -275616, -199940, 77896, -87963, 3295, -163572, -57092, -302298, 13673, -74690, -53030, -178699, -13453, 74447, -83947, 18664, -96782, -251873, -137122, 343997, 90899, 66556, -130328, 80816, -70727, -55016, 283394, -231569, 44866, 275477, 28307, -118988, 82428, -29061, 51607, -485590, -145992, -113820, -123228, -151996, -250433, -174549, -290962, 294524, 54974, 35162, 128214, 120486, -312841, 47719, -144129, -115587, 308475, -99854, -133577, -445955, 45877, -439831, 150149, -134980, -159618, -90170, -166030, 204509, -196973, -128911, -317488, -122678, -191570, -110924, -245741, -52268, -243336, -354230, 177701, -172086, 42681, -316202, 104775, 214927, -82807]
19185c66158J63587o5582A97999b12015B48080C1031b41787q0492R5561A15160
19174f5127A6307J32435d18821c5271l4308A3392c22320k73058B29016a92856
19163b21001K8341A33194b14402a8402j7616j07187N1314l88090e7253A07367
19152b09516B12861D0833J17076b43857A43773D0950n774b41309i4376J5304E7747
19140c1176j96308p6226L8136J26230A82523i4542k61217A48351g6969A86389
19129b11456d8486j4349r8781m3732l4581j3096m6867A11747C2247b2572A85435
19117e809k08968D4647a24153e6495r427A41497f6673j95155C61572d2541B1253
19105F8951C3483a61860f5366r2375C27804r0949r1779a82735a0190A98474O4871
$$ y = [-366158, -202571, -268153, 197999, -212015, 248080, 31031, -241787, -322279, -226718, 115160, -65127, 16307, 148742, -418821, -35271, -69579, 13392, -322320, -595378, 229016, -192856, -221001, -192660, 133194, -214402, -18402, -36018, -143205, -91891, -479981, -57253, 107367, -209516, 212861, 40833, 157909, -243857, 143773, 40950, 35176, -241309, -94376, -79072, 57747, -31176, -227484, -303710, -265574, -139344, 182523, -94542, -355759, 148351, -76969, 186389, -211456, -48486, -62835, -161616, -205348, -239929, -253025, -299892, 111747, 32247, -22572, 185435, -5809, -214777, 44647, -124153, -56495, -65922, 141497, -66673, -261828, 361572, -42541, 21253, 68951, 33483, -161860, -65366, -157741, 327804, 236855, 145076, -182735, -10190, 198474, 263345]
19094B63345b37244C53574a84502J0796O4889k7741N1603j27478P1291n0075M7276
19083a43941A03750O9064a32115C561a59171C58167G0262b56931A98939a92255
19072b1730l35715J15707N8518f5447k12832K0344A23655b08897R1788k28736
19062c45845a15996k7683N5887k81047B30797a2585k05077o0608N7406A31527
19051A1729J07058J66517c0800r9317A03116j8380a2421o2889f288C4515a14429
19039f35140h5276F0375e4269l65686h0899B49109H4183a09477k94255a03003
19028c06133B39014a33336A71769a99910D9404g6129I8665h655A27383G606b8678
19016A61504G647c8977C04775c6126k4315k11142a06801r0880h87A82866J36379
$$ y = [263345, -237244, 353574, -184502, -173706, -108817, -136558, -84955, -212433, -141142, -191217, -143941, 103750, 172814, -132115, 3561, -159171, 358167, 70262, -256931, 198939, -192255, -21730, -357445, -241738, -183220, -65447, -278279, -257935, 123655, -208897, -117109, -345845, -115996, -143679, -87792, -368839, 230797, -12585, -217662, -278270, -220864, 131527, 11729, 118787, 285304, -30800, -130117, 103116, 84736, -12421, -75310, -6288, 34515, -114429, -635140, -85276, 60375, -54269, -419955, -80899, 249109, 84183, -109477, -403732, -103003, -306133, 239014, -133336, 171769, -199910, 49404, -76129, 98665, -8655, 127383, 7606, -28678, 161504, 7647, -38977, 304775, -36126, -60441, -271583, -106801, -197681, -887, 182866, 319245]
19005C19245D8743c40367C9601c27123g3175j90332n5947b2549j57314A31409
18994B996b88838e1543J1626j29998Q2287K9015l03708A24293a75654E6127A2597
18982a10192j3499K0822A68487O0467a83580Q0778m4970j33349F3486k2777a5838
18970d1289A88800N9858M82233k44287B6032O10413B18726a99694B478d16722
18959G6091l0414A8459J57315B9128L228a33773H6664e5164q94J1791k3246K8198
18947c9315l6231j1978A9992a19130C4925a29816A09058D2788a72142j45081J5753
18936c01470J6026M2138D8853R5746b48969c7895B2379J03138n7987a41400B0784
18924i4186F9369J47187b17477A71447a35427D3395i1652a2343e712C37548b5978
$$ y = [319245, 48743, -340367, 39601, -327123, -73175, -263507, -319454, -22549, -179863, 131409, 2996, -288838, -51543, -39917, -169915, -87628, -58613, -362321, 124293, -175654, 56127, 12597, -110192, -123691, -102869, 168487, 228954, -183580, -102802, -147772, -281121, 63486, 40709, -15838, -41289, 188800, 248658, 730891, 486604, 26032, 636445, 218726, -199694, 2478, -416722, 76091, 45677, 18459, 175774, 29128, 32356, -133773, 86664, -55164, -56058, -44267, -67513, -39315, -75546, -87524, 19992, -119130, 34925, -129816, 109058, 42788, -172142, -317223, -301470, -285444, -243306, 48853, 144599, -248969, -37895, 22379, 125517, 67530, -141400, 20784, -94186, 69369, 216556, -217477, 171447, -135427, 43395, -91652, -12343, -5712, 337548, -25978]
18912B7354H123a44878d9629D1264J96588A16201L46685j5812A87254L1693b45135
18900D2312b12669n3805R0982P3052F8356a5832H9743J7718b18p21o9115k17848
18888b87902B67056f3342r8382B14346b02743B3561a18603j45013B2093a48707
18877F8431h2629R864A60420L9003i5066r1162M3537l546A17209D1966g8164l00246
18865c78410G4662M6491b77668A65292b29834d1987c742l7443D8881d0504h371
18853d5198c185r1774M1232I0297a97599A62284d92889i348k33684A54122k3726
18842A30396A192a74830A77338d92252J47566Q6641f5600k4761M1146p8186A7797
18830A20939K09836b888j69261n3059j1540I8309c00534K5028c4741j33090C2342
$$ y = [27354, 8123, -144878, -49629, 41264, 237852, 116201, 462886, 447074, 187254, 218947, -245135, 42312, -212669, -266474, -175492, -102440, 68356, -15832, 89743, 107461, -218, -939, -70054, -287902, 267056, -63342, -161724, 214346, -202743, 23561, -118603, -263616, 22093, -148707, 68431, -82629, -72765, 160420, 199423, -95066, -186228, -142691, -146237, 117209, 41966, -78164, -378410, 74662, 121153, -277668, 165292, -229834, -41987, -3742, -41185, 48881, -40504, -8371, -45198, -3185, -94959, -53727, 90297, -197599, 162284, -492889, -9348, -243032, 154122, 130396, 1192, -174830, 177338, -492252, -344686, -258045, -65600, -90361, -49215, -127401, 17797, 120939, 330775, -2888, -172149, -225208, -236748, 98309, -300534, -275506, -34741, -167831, 32342]
18818h849A90891b20595D59495A85269G4472B1407a17052A0331K4758a23161D85084
18806a48921F3484k966i4332j74171A62657k2002K4255d56440b27289g6552k02641
18795b79193D1542J26456a3838A42289b10646l55721A23265a00479A00114b8626
18784a09815k31755A52631c0339k08600H5483d67217g6014p6376A20249j8693
18774A01556d9302p7725C20192a21869B7475i7289B1431K7083A8309c59043c6416
18762A03669a42794A9465a17230m5439q7401q1734A1611a851k51486A305a3661
18750a98718j43572d7342n5245D8461K10053c09016c2107r7277H2878J1092e2876
18738G742b36824h3523j36208A77961H4723a32201b2966p0141j79310G6654b66310
$$ y = [-8849, 190891, -220595, 459495, 185269, 74472, 21407, -117052, 10331, 35089, -123161, 485084, -148921, 63484, 60518, -94332, -268503, 162657, 140655, 164910, -456440, -227289, -76552, -279193, 41542, 167998, -13838, 142289, -210646, -566367, 123265, -100479, 100114, -28626, -109815, -341570, 152631, -30339, -238939, 85483, -467217, -76014, -152390, 120249, 101556, -49302, -127027, 320192, -121869, 27475, -97289, 21431, 48514, 18309, -359043, -36416, 103669, -142794, 19465, -117230, -162669, -250070, -331804, 11611, -1851, -253337, 1305, -13661, -198718, -342290, -47342, -102587, 48461, 258514, -309016, -32107, -129384, 82878, 93970, -52876, 7742, -236824, -83523, -219731, 177961, 84723, -132201, -22966, -93107, -272417, 76654, -266310]
18726d42082P7328B8243b00703A83439f8110q9155p368H8576a43899q8185k46402
18715d78486a40648F5624c22955A59656a81116C13796F322a24720e9697j3420
18705g3117a9187j1893j62717D9646F568a94908A86022D2125b06096k8272L9084
18694a95284e1172j95579B08281c23014d9700k63054A19567a28823G1450h6372
18683b69802e4284k24157A37162N721M4079C2283b5036A0780b6689H7103b17376
18671d13430D2219l858a55475O8851B50975A22435b79034J21976f2056m39512
18661e01568I4518k5603L37140d3141m4808b3417C50677a59946J086n620j4988
18650a79468k14252G4781J86711d6871A57201e7049j11463B2614e09504a56816
$$ y = [-442082, -364754, 28243, -200703, 183439, -68110, -157265, -164633, 88576, -143899, -232084, -478486, -140648, 65624, -322955, 159656, -181116, 313796, 6322, -124720, -59697, -73117, -19187, -31080, -193797, 49646, 6568, -194908, 186022, 42125, -206096, -234368, -195284, -51172, -246751, 208281, -323014, -49700, -312754, 119567, -128823, 71450, -86372, -269802, -54284, -278441, 137162, 142883, 186962, 32283, -25036, 10780, -26689, 87103, -217376, -413430, 42219, 38361, -155475, -86624, 250975, 122435, -279034, -157058, -62056, -501568, 94518, 68915, 406055, -43141, -87949, -23417, 350677, -159946, -158860, -164480, -179468, -393720, 74781, 261492, -46871, 157201, -57049, -168512, 22614, -509504, -156816]
18639a65563l0817A18781d9422Q104H3900K60277F9485a61663G4591b85324N086
18628b80238P191k6143h4551k73196a1508B90108h2971j69512A89517b5968B5153
18616I807b97582g4770q1286r768k0709A03921j0960a29337A22059J1691i0857
18604A57956n6033d6175k2190F6285a46902j1298g8381m2475k3174J7062L0288
18593i6680D01030i4856p3201J1352g1939B04953b34357M7140P845l00869K04759
18582b75482e7695j96720e7355j33073A50954B9484O7349B0026a48487j76849
18572c25336F5173f1139C694J21852b31003j3471B88760f05C12939A43527P8339
18561B21866c41583a53186f2007C5123a9864A72349p7715g5657B18002a69375
$$ y = [-165563, -196380, 118781, -49422, -41318, 83900, 344177, 69485, -161663, 74591, -285324, -280238, -273047, -299190, -84551, -357747, -11508, 290108, -82971, -252483, 189517, -25968, 25153, 9807, -297582, -74770, -156056, -165824, -186533, 103921, 92961, -129337, 122059, 133750, -90857, 157956, 101923, -46175, -68365, 66285, -146902, -158200, -78381, -120856, -144030, -126968, -96680, 401030, -94856, -168057, -156705, -71939, 204953, -234357, -187217, -179372, -480241, -275482, -57695, -254415, -57355, -190428, 150954, 29484, 96833, 20026, -148487, -325336, 65173, -61139, 3694, 125546, -231003, -244474, 288760, -605, 312939, 143527, 221866, -341583, -153186, -62007, 35123, -19864, 172349, 94634, -75657, 218002, -169375]
18550a67874g7043J6225q2503A3612b36169E0297b80731n228a34327I0113b29312
18538a10900j5267A45924a58119I2212b2361j76201f054p741F0031e6909k46612
18527c03521B7928f3006L910A2428L36781c8450n4312E7773f2363A71068b1886
18515a1743l42495F4308k7270Q6371b70008a20670f441A92148L3214E8221a4294
18503B01317R476a32106C28846j05218a60906l17667A97286C1505h3081I2660
18492g2098k62801D0857b83454L8275h1323j8402k18082E2360K1038g5937J7201
18481e8736B49844o0408f1291j47606L7674a7329k74411B14888a10028A99754
18470I5882k7775a34798j91370G9624k8862N1454b77637B56940K863a51404B37992
$$ y = [-167874, -77043, -60818, -143321, 13612, -236169, 50297, -280731, -285959, -134327, 90113, -229312, -110900, -126167, 145924, -158119, 92212, -22361, -198562, -6054, -13795, 60031, -56909, -303521, 27928, -63006, -59096, 12428, 349209, -38450, -92762, 57773, -62363, 171068, -21886, -11743, -354238, 64308, 37038, 123409, -270008, -120670, -6441, 192148, 225362, 58221, -14294, 201317, 210793, -132106, 328846, 223628, -160906, -478573, 197286, 31505, -83081, 92660, -72098, -334899, 40857, -283454, -245179, -81323, -99725, -317807, 52360, 73398, -75937, -58736, 249844, 189436, -61291, -208897, -171223, -17329, -291740, 214888, -110028, 199754, 95882, 68107, -134798, -326168, 79624, 50762, 102216, -277637, 256940, 259803, -151404, 237992]
18458a22410M4209I3323A2808l477M0623M2404c98120J56907R6356I2814L12203
18447D05017F2338l847g9339C3767L2980b09510a6091k46227n3101J37120I8040
18435F3415i1306k9103J2812a3464C4562J29443i4547A51504i8397A73738b92430
18423A90857i880A35238J74895A18790d4202B72145A4564a6349C58139j15479
18413B42660e7150K7750l0163I4929a2143J999j2095o5509a6216C1436D53O5893
18401F6346D848K23225n8412J05445G9521b29263d9491A01672C6173J90232A01651
18389A69639c7591r6429A11225J47474h1617J5172K5105A61228n6129Q9135f9593
18377b99098B12603a79572g4314j94851g9092r3406e8284q270A19412a16673b6099
$$ y = [-122410, -78201, 93323, 12808, 9331, 49954, 92358, -398120, -241213, -144857, 92814, 405017, 62338, 58491, -79339, 33767, 66747, -209510, -16091, -262318, -315419, -178299, 98040, 63415, -91306, -120409, -107597, -13464, 34562, 164005, -94547, 151504, -98397, 173738, -292430, 190857, -9880, 135238, 310133, 118790, -44202, 272145, 14564, -16349, 358139, 242660, -57150, -29400, -59563, 94929, -12143, -10144, -22239, -87748, -16216, 31436, 453, 66346, 4848, 228073, 169661, 275106, 79521, -229263, -49491, 101672, 36173, 226405, 101651, 169639, -37591, -134020, 111225, 258699, -81617, -66445, -41340, 161228, 105099, 194234, -69593, -299098, 212603, -179572, -74314, -269165, -79092, -172498, -58284, -66554, 119412, -116673, -26099]
18365c4774j29774B58643a07388A0310a83828j4449e0031D4088l055a13224C30661
18353G777d29935a79291a9833B5690J31024n9834b15345C187L29465a64177D671
18341a01006G1635P9493a17418A99492b83712g1481A45712A0191J07544J40546
18331B58281A17700n2458a47608F3446k6929e9795n1812C1344K39109A00710a73301
18319d5118n9122A11810a62072K3811C31017i554n6809B57392h3145k3522A55726
18307B12848b10089n3425B7580J76259H3295J6026J83210D2478P8476c7671D3478
18295d4784B91329n8868f722j60719A81034J13476A16999J32499H0963a73227
18284a67001E4810R9958e7212k28407A62197a74687M7803B11700c2300A8230M5508
$$ y = [-34774, -164548, 258643, -107388, 10310, -183828, -198277, -50031, 44088, 41033, -113224, 330661, 7777, -429935, -179291, -19833, 25690, 156714, 96880, -215345, 3187, 332652, -164177, 4671, -101006, 71635, 151128, -117418, 199492, -283712, -71481, 145712, 10191, 117735, 258281, 117700, 65242, -147608, 63446, 36517, -59795, -111607, 31344, 270453, 100710, -173301, -45118, -104240, 111810, -162072, -138261, 331017, -9554, -66363, 257392, -83145, -106667, 155726, 212848, -210089, -263514, 27580, 203839, 83295, 99321, 282531, 42478, 120954, -37671, 43478, -44784, 291329, 232461, -6722, -167441, 181034, 294510, 116999, 249498, 80963, -173227, -167001, 54810, 154768, -57212, -285619, 162197, -174687, -126884, 211700, -32300, 18230, 63738]
18273F3738N2854B2406F272b57044e8454B3661b63098A11445Q420L7001H392a26571
18260c33407a51326H3762c18319J07602E6705a52733f8783A4031L34499n4824
18250B93706g6910I1695a73614A35589E2218J74231a50546h687A0099e5518j78589
18239b34107A14784b116I520K18347M5260A6410h0477A54880B6613e8507o6700
18228a25207C1545a09076e3057A12134m7692b18709e7016B07433a32143G3077
18217f5639G6350k9680b96462F1106c09243p8832A20121a20832F4680B0730K79956
18206C00686d5619A53043g9303A45557J05072b10128A83994o2087e4152D1186
18195A21778L14177b48235l7044g2672A70730B4390a06656B08705b69675i8792
$$ y = [63738, 116592, 22406, 6272, -257044, -58454, 23661, -263098, 111445, 119865, 156866, 8392, -126571, -333407, -151326, 83762, -318319, -210717, 56705, -152733, -68783, 14031, 348530, 293706, -76910, 91695, -173614, 135589, 52218, 226449, -150546, -8687, 10099, -55518, -234107, 114784, -2116, 9520, 227867, 273127, 16410, -80477, 154880, 26613, -58507, -125207, 31545, -109076, -53057, 112134, 64442, -218709, -57016, 207433, -132143, 73077, -65639, 76350, 46670, -296462, 61106, -309243, -388075, 120121, -120832, 64680, 20730, 300686, -45619, 153043, -79303, 145557, 250629, -210128, 183994, 121907, -54152, 41186, 121778, 435955, -248235, -285279, -72672, 170730, 24390, -106656, 208705, -269675, -98792]
18184A28736j9618b3721j4472l5784j6145d1204j23808a260A36079C8323h6219
18172A68939F4756j6700g2311A06208d18755G0838h9429j1578A05228c7728E930
18160B88092j8316E6006e76j31266L5079B02830b63740A26959Q2021b05427F6901
18148A41513a35239k21491A76194F0890B5612R4984a59928b4643a278H1451a45679
18136a85807K2042C05008p5679L4749G6279f1657G3183b30319L4347h1861l078
18125h4939J166C69756b3830m7607C24661b07368j41225f9706n0163L8490E2764
18113a66385A14375a49474j19401C6473b35581c1364G2857b31148P7460D02677
18102a25129e5941A7078N2646O1518g9503A51563a15232E4294A6427n024J8664
$$ y = [128736, 109118, -23721, -38193, -73977, -90122, -41204, -165012, -1260, 136079, 38323, -86219, 168939, 64756, 48056, -72311, 106208, -418755, 70838, -89429, -101007, 105228, -37728, 5930, 288092, 269776, 56006, -576, -131842, -96763, 202830, -263740, 126959, 208980, -205427, 66901, 141513, -135239, -356730, 176194, 60890, 25612, 120596, -159928, -24643, -1278, 81451, -145679, -185807, -163765, 305008, 229329, 264078, 76279, -61657, 73183, -230319, -195972, -81861, -84939, -83773, 369756, -23830, -71437, 324661, -207368, -348593, -69706, -119869, -81379, 52764, -166385, 114375, -149474, -268875, 36473, -235581, -31364, 72857, -231148, -153688, 402677, -125129, -55941, 17078, 69724, 131242, -79503, 151563, -115232, 54294, 16427, 11403, 30067]
18091C0067J26062a53723k7406b9857B0668K40978a20907A09997D9095L4974L88047
18080D72116A56430b12505q0058I3371N1901D1067b68769a2732B9587b8012l8195
18069f6207B56651j17099c040j77322M8722D55082a49686l7360G7831a74380j4370
18058a88750M2827q7642K4391g7030Q196C57122g1485C0784j4882M8905O5364
18047A30171j8874b35406A3928J57697b48950C8866K0773J66552a04685A96161
18036B92258C2190L52258a89553C7752g0870j67089H2330e5742k5172n0221E7820
18024B02860d10l5868B8469i5625B59397E4878a26922A96444N9231g7478H2183
18012a55598m5121g4504L6059A94645i8471H1342j9330J29950R821A1993a84522
$$ y = [30067, 156129, -153723, -181129, -29857, 20668, 261646, -120907, 109997, 49095, 84069, 472116, 156430, -212505, -292563, 93371, 145272, 41067, -268769, -12732, 29587, -28012, -66207, 256651, 139552, -3040, -180362, -131640, 455082, -149686, -187046, 77831, -174380, -188750, -145923, -233565, -209174, -77030, -68834, 357122, -71485, 30784, 15902, 64807, 130171, 111297, -235406, 13928, 171625, -248950, 38866, 59639, 226191, -104685, 196161, 292258, 32190, 384448, -189553, 37752, -70870, -237959, 82330, -55742, -80914, -131135, 57820, 202860, -410, -36278, 28469, -95625, 259397, 54878, -126922, 196444, 255675, -77478, 82183, -155598, -200719, -74504, -38445, 194645, -98471, 81342, 62012, 191962, 201783, 11993, -184522]
18000C75J57144a75447A10754N0002a10868A86303a89038k1028E9541a611m0578
17989d2189k03056D9516b42032A48961h2968A05291C1125a22366F2509a6565D194
17977B95388a8956A46553J46179a91556g3056m1748I334K81479d15259a30385
17966a91907h3294C58779b58786A25976J50985L4423f6794o8785M6712C61108
17955G2120J69318b42873A36099B4869c2462A5760R7342M0002a34930B84279a82514
17943i1690I6273b24270b5607D58422C1196R4549e4739B9663a45380E0821a42349
17931G0840a74943d0124D1137R7004h7982C5753A3244J48062d0008A19274O4606
17920A83880Q386a06030A52904G2286K5211h8789r3763B50806P9055d5691A3459
$$ y = [375, 157519, -175447, 110754, 160756, -110868, 186303, -189038, -210066, 59541, -1611, -42189, -245245, 49516, -242032, 148961, -82968, 105291, 31125, -122366, 62509, -16565, 4194, 295388, -18956, 146553, 292732, -191556, -73056, -114804, 9334, 290813, -415259, -130385, -191907, -83294, 358779, -258786, 125976, 276961, 311384, -66794, -135579, -88867, 361108, 72120, 241438, -242873, 136099, 24869, -32462, 15760, 113102, 153104, -134930, 284279, -182514, -91690, 96273, -224270, -25607, 458422, 31196, 125745, -54739, 29663, -145380, 50821, -142349, 70840, -174943, -40124, 41137, 138141, -87982, 35753, 13244, 161306, -40008, 119274, 183880, 192266, -106030, 152904, 72286, 97497, -88789, -182552, 250806, 329861, -45691, 13459]
17908I0894J2174C125J08736b44372E6526K28658H4071K60702a8424A57348C9139
17896H1471J6152K41400g3421C4386J49839g1316B05830m6321i0403C5014h4513
17884D39221C8087a88388E143J42328c291A93766I3613m1495e2804E6306M7479
17873A03785a972G904f5565C14264a18181i042H0003e4272B33016c9211j57953
17862a97164C04559d7225a6672m8631P902r0618A33704e27834d3866C28382c28737
17850B75323B7890J34622a73628A56626h8626M1011B9164M7569a07337C07337
17839A35154j6384e1606A07651J84260a073l83987B29374M33O7972j16538q6816
17828I4425e924D4741K7454h6484L2750b0585A00507a29289j51744D5820g3328
$$ y = [90894, 103068, 3125, 111861, -244372, 56526, 285184, 84071, 344773, -18424, 157348, 39139, 81471, 97623, 339023, -73421, 34386, 184225, -71316, 205830, 159509, -90403, 35014, -84513, 439221, 38087, -188388, 5143, 147471, -3291, 193766, 93613, 52118, -52804, 56306, 103785, -1972, 7904, -65565, 314264, -118181, -9042, 80003, -54272, 233016, -39211, -197164, 304559, -47225, -16672, -65303, -57401, -148019, 133704, -527834, -43866, 328382, -328737, 275323, 27890, 162512, -173628, 156626, -88626, -47615, 29164, 76733, -107337, 307337, 135154, 118770, -51606, 107651, 291911, -1073, -385060, 229374, 229807, 297779, 181241, 94425, -5924, 44741, 72195, -86484, -53734, -20585, 100507, -129289, -281033, 45820, -73328]
17816A35671K4420J8234E4946b29009H1737h2067A67398m8634b21596B6577a73698
17804c3198j77462B3911J03280A9526a7400C04362A50955J41570f9626L4351B8874
17792C8067K39936b56416G2998J06684C185J24082A4064Q1373K19283q2741j06342
17781A25637a34057C16456d0485G673b26070a09256B3158a79531A27480a83241
17770b30719I9890m6641A3686L55803A08670m4596K58001A04934a30699F7483
17759C55135H8052F148J08928L47557h8956B16973D6403J44670j8770J05177g0589
17747F4377k4634J87376a61226C70540a6533C00791I6822D2200R2817K047K31959
17736C69023a87970C38711r2633H6843l0666J4485Q283l7409K77730J01852A02178
$$ y = [135671, 160091, 178325, 54946, -229009, 81737, -82067, 167398, 118764, -221596, 26577, -173698, -33198, -210660, 23911, 127191, 19526, -17400, 304362, 150955, 292525, -69626, -35275, 28874, 38067, 278003, -256416, 72998, 179682, 3185, 127267, 14064, 95437, 314720, 231979, 125637, -134057, 316456, -40485, 7673, -226070, -109256, 23158, -179531, 127480, -183241, -230719, 99890, 53249, 13686, 369489, 108670, 64074, 322075, 104934, -130699, 67483, 355135, 88052, 6148, 115076, 462633, -88956, 216973, 46403, 191073, 172303, 277480, -70589, 64377, 39743, 227119, -161226, 370540, -16533, 300791, 96822, 42200, 135017, 137064, 369023, -187970, 338711, 246078, 86843, 56177, 70662, 78945, 41536, 319266, 421118, 102178]
17724C19556I628L98068j77943p8655l9203J22702F165c80C69744I8986i6056
17712B56653j23389j4105e464A63235k1551E7662J96144a59802g7189B0177J01961
17701A22138J17718J17519j61342a70291A04684D1211K56017A403K60764K81401
17691E43568d2455j9857D9290b28486B12889j03735B1560L49602C69K64935c9372
17679A54627D7600a99399C84961A44992J33680b7057k32483E8325L83982J9655
17669D61962a24298A84030o7890i5112B59514d825A02622K03035A12749k1600
17659I1149n932K27394c6968A400d51945C32980D1442N6843R8227N4768A02982
17647A26573D3395J39953p7399j8327e8722K2999H2837J59128Q7854G8985f7724
$$ y = [319556, 9628, 407696, 229753, 151098, 111895, 234597, 6165, -380, 369744, 98986, -96056, 256653, 133264, 119159, -5464, 163235, 141684, 57662, 253806, -159802, -77189, 20177, 122138, 239856, 357375, 196033, -170291, 104684, 41211, 297228, 1403, 262167, 543568, -42455, -62312, 49290, -228486, 212889, 109154, 21560, 371162, 369, 265304, -39372, 154627, 47600, -199399, 384961, 144992, 278672, -27057, -259540, 58325, 442307, 461962, -124298, 184030, 116140, -95112, 259514, -4825, 102622, 305657, 112749, 91149, 85217, 312611, -36968, 1400, -451945, 332980, 41442, 98285, 196512, 251280, 102982, 126573, 43395, 183348, 105949, 87622, -58722, -35723, 82837, 241965, 329819, 78985, -67724]
17635A91284A5169K45238K3623J32611B7431K66869n8503d0535A60489E0170K06129
17624B56299r5297P8207R1469A54300O9421Q3882F8441b0758A35430b8391D6396
17612C53728D1849g8438A97283G7798J32297j0538Q5784c6237C02797K4183A44135
17600i0455B31632b83824K2836B09557q9214O8659e8315m6846B86742G633K17776
17589B25409j02267K62208j66420K20500j37153J17610j83647G0981K85119a34225
17578a02494M6940b5780B17455a1239B9551J64367K18528A75605a9254D5879a04902
17566C97711I5852l7127l749J30533K35418q6482j65595K36694A4973J49699N9835
17555B24507m5819d1244E51551b3414C70378I3907M3524L9276J35608P6727j27930
$$ y = [191284, 15169, 260407, 284030, 416641, 27431, 294300, 235797, -40535, 160489, 50170, 256299, 161002, 239209, 330678, 154300, 223721, 307603, 68441, -20758, 135430, -28391, 46396, 353728, 41849, -78438, 197283, 77798, 210095, 199557, 285341, -36237, 302797, 326980, 144135, -90455, 231632, -283824, -260988, 209557, 120343, 189002, -58315, -105161, 286742, 7633, 225409, 123142, 385350, 218930, 439430, 302277, 419887, 236240, 70981, 356100, -134225, -102494, -55554, -25780, 217455, -11239, 29551, 193918, 412446, 175605, -19254, 45879, -104902, 397711, 95852, 58725, 54976, 185509, 420927, 334445, 168850, 405544, 14973, 164672, 224507, 178688, -41244, 551551, -23414, 370378, 93907, 137431, 176707, 312315, 389042, 261112]
17544B61112H7820K86491n3787O4478j60599L0672d6113B66461J79816A16242
17533f0696A99920B8896K61149R8373K51031k51935J87757K51419n6603o1528
17523G08559L82346j36256k06983J97570m50387J34379P9744B76251J6587J64913
17513D57751m7258J11831M4686L15324L85059k95217J55730M92D73714K01014
17503F74728k46131B06300E5562J91831K72355a06007C26803a901A90981Q8200
17493B79181d3592D46337J24505k61742k9685j25447N16875A64783J75807P833
17483C48423e3749D44965j52519K44880k26858j51893L13138q649k19758K35301
17473D78607j11162j74288K93075K9358m908D9277J18776J36195R3250A95857
$$ y = [261112, 87820, 374311, 320524, 385002, 224403, 255075, -46113, 266461, 446277, 116242, -60696, 199920, 28896, 290045, 388418, 639449, 387514, 575271, 826690, 770087, 708559, 1090905, 954649, 747666, 945236, 494849, 629228, 708972, 276251, 292838, 457751, 410493, 522324, 567010, 882334, 1267393, 972176, 1127906, 1128398, 473714, 674728, 428597, 206300, 55562, 247393, 519748, -106007, 326803, -1901, 190981, 279181, -43592, 446337, 570842, 309100, 279415, 153968, 670843, 164783, 340590, 348423, -53749, 444965, 292446, 537326, 310468, 158575, 471713, 463064, 243306, 478607, 367445, 193157, 486232, 515590, 510682, 49277, 168053, 304248, 397498, 195857]
17462D39469o9472N5340K9292A69529J96172J69170B41100Q2948q014R0668A89841
17450A72601J83365K27172q1675K30287B61172K03689J0154A55971J49063J6125
17440C21159j00519K88228n1896A99849J67120j36097N6934A18567J19055J42823
17430C80445k6797l5278p0815R8782Q8759j09318j58245L09736k14346B4456K64808
17419B89264H3001K52848l4912J67172r3206K01468B37045K974M53739A56226
17408G91399G9109K55512J70361A35998J83782A10922Q8472L40251j91421j05896
17398B42328K30594r0141o3100r6962N36423C49518m4717F2851J9221J48881J1598
17387B42551J40584A00374K66518j00362j9329j22287i4832C68176i4059B88746
$$ y = [439469, 369997, 425337, 454629, 169529, 365701, 534871, 241100, 324048, 316034, 406702, 189841, 172601, 355966, 583138, 501463, 731750, 261172, 464861, 475015, 155971, 305034, 321159, 220640, 508868, 456972, 199849, 366969, 230872, 287806, 118567, 237622, 380445, 353648, 318370, 247555, 346337, 435096, 325778, 167533, 477269, 262923, 24456, 289264, 83001, 335849, 300937, 468109, 374903, 576371, 237045, 240019, 693758, 156226, 791399, 79109, 334621, 504982, 135998, 319780, 110922, 199394, 539645, 348224, 242328, 472922, 382781, 319681, 222719, 759142, 349518, 304801, 62851, 82072, 230953, 242551, 383135, 100374, 366892, 266530, 247201, 124914, -94832, 368176, -94059, 288746]
17376C65325N0513j43473R5028H7870k8697J41535G6456L60336k02443Q9007a18442
17364C68259n3561A05852N9140G3563J45488f9893E57483A87399Q8733O8594J23727
17353D68453D4255J93103Q5814o976J00738B1085J16739J24399p2151J09689A05054
17341C72100K8975j97415J97298n7823A59222o643J94790J25674C3024L98414
17331D31438A59305J25566o0689e500B83061j03505J25268p2630n0893J32529
17321C13830J84146G8340J05916J8587M82022j78013k8901J27905B03253J44749
17311C48002r999d2622B94027H9502K13203j0107J57869j14522j34529L1883M4847
17300B78146L6601L5415A61477L53842I5633N53179k01168p9353K79802E970R4951
$$ y = [365325, 415838, 272365, 367393, 87870, 59173, 200708, 76456, 436792, 234349, 323356, -118442, 368259, 314698, 105852, 164992, 73563, 219051, -69893, 557483, 187399, 276132, 344726, 468453, 44255, 237358, 323172, 316196, 416934, 21085, 137824, 262223, 190072, 299761, 105054, 372100, 401075, 203660, 400958, 343135, 159222, 152579, 347369, 473043, 33024, 431438, 159305, 284871, 224182, -5500, 283061, 179556, 304824, 232194, 181301, 313830, 497976, 78340, 184256, 202843, 684865, 506852, 477951, 605856, 203253, 348002, 338003, -42622, 294027, 89502, 302705, 292598, 450467, 335945, 201416, 233299, 278146, 314747, 350162, 161477, 515319, 95633, 648812, 447644, 368291, 648093, 5970, 100921]
17289A00921M30873J14939l08597A35211L91476A14218M04636j57966K64537k2935
17279F02490A78988J54750j65211L82666H4858M05998J7865k17092j0990L34783
17269F15422j98769j23811K26937j90996J1648R0401j00212j41724K58475B05743
17258d7273E36241O6675P1864B23231R9300j22258R6538q6230R4161J05198p1543
17247C38397q1348J6797q1216K45831R1449q7069j34645j3849m1970J82338Q2071
17236E16786N8085J85273l08500j5863n7246m934k8048j27461R7069o1019K83409
17225E37551A03733K57685q6990J81640J94756l12642J54203j89622J49869n7275
17215C95357P8991j17983P5880L0166j61881L19134j75212K09828A78809O85153
$$ y = [100921, 531794, 646733, 338136, 135211, 526687, 114218, 518854, 360888, 625425, 602490, 178988, 333738, 168527, 551193, 84858, 490856, 508721, 291629, 280639, 615422, 416653, 292842, 519779, 328783, 340431, 430832, 330620, 188896, 447371, 205743, -47273, 536241, 602916, 674780, 223231, 322531, 200273, 296811, 210581, 304742, 409940, 338397, 257049, 273846, 192630, 438461, 529910, 442841, 308196, 294347, 252377, 434715, 516786, 574871, 760144, 451644, 435781, 378535, 373601, 345553, 218092, 315161, 254142, 537551, 103733, 361418, 274428, 456068, 650824, 338182, 492385, 302763, 452632, 395357, 474348, 356365, 432245, 462411, 300530, 619664, 444452, 654280, 178809, 863962]
17205H63962k31679m5766K43743l51783N4823m8641h187B22705K34412Q1571j72315
17194C66373q3900K78273k61537J61670j46369K999R9813j4252J05162J14690
17184F22922q218P2217J53955C80661K05100J13222B91765L84166j13698j44317
17174D17916Q3529m0993J73972K5699j23188K09243m2999l48907J16378M2304
17164E12954k26550K83647j68311J57217r8166K78920k9618j19765K07408l51262
17154D46474K50585o2854k66259L39178m0555l25037Q7018L07316q4571j87019
17144D64276K24872k40227J56007B60182J43136K7311O5017j2490A16340M23500
17134E39840K35299P8174l75608R6343j87674L67989k29736L15118j67188k95132
$$ y = [863962, 632283, 586517, 830260, 478477, 533300, 484659, -8187, 222705, 457117, 538688, 366373, 282473, 560746, 299209, 460879, 314510, 317509, 417322, 403070, 508232, 622922, 614704, 686921, 840876, 380661, 585761, 698983, 291765, 675931, 562233, 417916, 501445, 460452, 634424, 660123, 536935, 746178, 703179, 354272, 470650, 512954, 286404, 570051, 401740, 558957, 460791, 739711, 710093, 590328, 797736, 446474, 697059, 634205, 367946, 707124, 666569, 341532, 428550, 735866, 651295, 464276, 689148, 448921, 604928, 260182, 403318, 430629, 495646, 483156, 116340, 539840, 775139, 853313, 477705, 574048, 386374, 754363, 524627, 839745, 672557, 377425]
17124C77425O76092j92696j92502j41075N5478J09653K41360m38522J40550j38218
17114D97545L00407M4507l5979p8197n3367J91212n1643L4813o9588K776j94456
17103E88030M64087k26177j45136J91558P7916l78921N51911j52331l5245k93555
17093F42137N37485l52057J10139o8657j27252j73769K97177M4321O3017o2642
17083I09899j7356P047L10916l42422L71394l33322R8122n9256D55190L74725
17073H29915J80342j62518j7059J67254R4693o5727k60000J8860O2280j43472
17063G04568J50980J35123j21662J65382K14117k52055J19668l40310P2949J0676
17053H59436J71518r4463M08491k81392J88771j34897m8533K83514l42995Q9219
$$ y = [377425, 1053517, 860821, 668319, 527244, 582722, 692375, 933735, 495213, 635763, 497545, 797952, 842459, 806480, 728283, 674916, 866128, 814485, 849298, 779710, 782486, 588030, 1052117, 825940, 680804, 872362, 950278, 571357, 1123268, 970937, 935692, 642137, 1179622, 827565, 937704, 869047, 741795, 568026, 865203, 909524, 972541, 909899, 892543, 899590, 1210506, 868084, 1239478, 906156, 1004278, 945022, 455190, 829915, 1010257, 847739, 830680, 997934, 1092627, 1026900, 766900, 785760, 848040, 704568, 855548, 990671, 869009, 1034391, 1248508, 996453, 1116121, 775811, 848760, 859436, 1030954, 936491, 1344982, 1063590, 1252361, 1117464, 1068931, 1352445, 1009450, 1098669]
17043A098669k51990J12097j2236M26515l00905j11608L67244O2826K8643l62559
17033A056696K75266j48880k89535L94318j47071P0141Q2963k50062k2054J36909
17023A158691L78960K03627n72097J91440l427L50761l02040J99684k50918J62394
17013A517075k28328L4139j35646K09364p7356N41506n37737p9510J55075j34844
17003A263738O7024J34911K67688k45302R7169J12289N918k9999O7357j25382
16993A615411k53912L50919j7776J03004j67408L02192k16333q0035j40518J19305
16983A614849Q6260J5681j53783o0829N22339l05874J17121K0850J10728k276
16973A965066l60400J80502L41972K8978p4160m01456O80561m62950L7594J92436
$$ y = [1098669, 846679, 958776, 946540, 1373055, 1072150, 960542, 1327786, 1390612, 1419255, 1056696, 1331962, 1183082, 893547, 1287865, 1140794, 1210935, 1293898, 1043836, 1021782, 1158691, 1537651, 1741278, 1169181, 1360621, 1357194, 1707955, 1405915, 1605599, 1354681, 1517075, 1288747, 1322886, 1187240, 1396604, 1319248, 1860754, 1323017, 1243507, 1398582, 1263738, 1330762, 1465673, 1733361, 1488059, 1585228, 1697517, 1703435, 1673436, 1740793, 1615411, 1361499, 1712418, 1694642, 1797646, 1630238, 1932430, 1716097, 1636062, 1495544, 1614849, 1701109, 1716790, 1563007, 1502178, 2024517, 1718643, 1835764, 1856614, 1967342, 1965066, 1604666, 1785168, 2127140, 2156118, 2081958, 1680502, 2361063, 1898113, 1935707, 2128143]
16963B128143J26523l91603N6894L27246k62770j4201J55811k32366M74959j14964
16953B253672J35652k54604K17093m5181j75347L7084K11689n1479o9454J47616
16943B406741P3984R0921k0661m2043Q8617j82602J70184j06826j11908K56855
16933B623262J06630m8434R6970M56750m54309j7872O8268K29443o4493L32278
16923C328493l75234L52962k8539j79188L5228K6775L55723j81392K89917k86000
16913C338745J35550o5171J80949K6736m4610L9595n7283K43273l58573J27217
16903C566428J46317L3039J7088J41727K73022k11193j32828K1539K5629k68021
16893C612747O42498J50349O2957N1286K4048K91134j53466K18021j31663l475
$$ y = [2128143, 2254666, 1863063, 1919957, 2247203, 1984433, 1970232, 2126043, 1893677, 2368636, 2253672, 2389324, 2134720, 2351813, 2306632, 2131285, 2168369, 2380058, 2328579, 2259125, 2406741, 2480725, 2571646, 2550985, 2508942, 2597559, 2414957, 2585141, 2478315, 2366407, 2623262, 2729892, 2681458, 2778428, 3235178, 2780869, 2762997, 2831265, 3060708, 2996215, 3328493, 2953259, 3306221, 3277682, 3098494, 3133722, 3160497, 3516220, 3334828, 3624745, 3338745, 3474295, 3409124, 3590073, 3616809, 3572199, 3611794, 3554511, 3797784, 3439211, 3566428, 3712745, 3745784, 3762872, 3904599, 4177621, 3966428, 3833600, 3855139, 3880768, 3612747, 4255245, 4405594, 4468551, 4519837, 4543885, 4835019, 4681553, 4899574, 4767911, 4764436]
16883D764436j3781J23422J37095J87042J46941l81047M60897k85801N9542J01120
16873E299866n9414M20456K11053m06746K35065K88782p5206L21936J15780k04398
16863F147174J63518K60922k90927N45327k01661K21181K07641j52824L08270
16854G208621M15547k97209J85818J83431M15251l76425L71060k6049L42189N6961
16844H479195j16387M57996L71183K0251J91470j61379M71292j87127L97422j05505
16834I818411K57099K96738J35065K34939M8324L00936K45395N9919K60695O9876
16824A1727397M02435J38407N14147p0002J49648O69167J62983K03077N26724
16815A4423983J01000N94079j2564K35018M11137L87342K37202M54630J43708
$$ y = [4764436, 4750655, 4874077, 5011172, 5198214, 5345155, 4964108, 5425005, 5139204, 5198746, 5299866, 5240452, 5660908, 5871961, 5465215, 5700280, 5989062, 5913856, 6235792, 6351572, 6147174, 6310692, 6571614, 6280687, 6826014, 6624353, 6845534, 7053175, 6900351, 7208621, 7624168, 7326959, 7512777, 7696208, 8111459, 7735034, 8106094, 8080045, 8422234, 8479195, 8362808, 8820804, 9191987, 9212238, 9403708, 9242329, 9713621, 9526494, 9923916, 9818411, 10075510, 10372248, 10507313, 10742252, 10790576, 11091512, 11336907, 11396826, 11657521, 11727397, 12129832, 12268239, 12782386, 12712384, 12862032, 13531199, 13694182, 13897259, 14423983, 14524983, 15119062, 15106498, 15341516, 15752653, 16139995, 16377197, 16831827, 16975535]
16806A6975535M95711M87298K13596O91007K06892N19390M37598L00031N98823
16797B0925881J90475P55077K64759P03589M01688Q50113J11947J015295K83914
16788B5502738O88291R07684M82825O77788Q93904O42283O47092Q99590P41646
16779C2083841M83770P22463J185320P53011J239724O55174J383552P77284Q31689
16770D0115828J274811J057320J079079Q47242J211459J078050J413789J159137
16762D9236715J308804J379369J163742J490991J131021J219571J163521J562303
16754E9656037J388863J516070J368494J262684J484744J242753J197274J704350
16746G0821269R60910J267583J258047J239251J016500J111499Q72398O62141
$$ y = [16975535, 17471246, 17958544, 18172140, 18863147, 19070039, 19589429, 20027027, 20327058, 20925881, 21116356, 21871433, 22136192, 22839781, 23241469, 24091582, 24203529, 25218824, 25502738, 26191029, 27098713, 27581538, 28259326, 29153230, 29795513, 30442605, 31342195, 32083841, 32567611, 33290074, 34475394, 35228405, 36468129, 37123303, 38506855, 39284139, 40115828, 41390639, 42447959, 43527038, 44374280, 45585739, 46663789, 48077578, 49236715, 50545519, 51924888, 53088630, 54579621, 55710642, 56930213, 58093734, 59656037, 61044900, 62560970, 63929464, 65192148, 66676892, 67919645, 69116919, 70821269, 71782179, 73049762, 74307809, 75547060, 76563560, 77675059, 78547457, 79209598]
16738G9209598J479996Q25811L13853M67835M74968N95356q6570O98193k9066
16729H3949974q7917J88361n36874L2676n81847n75692n33158o64878n90257r59997
16719G9640391q26866p43396j280211j171294j006681j266832r00368j559850
16711G0884893j099734j062983j249640j636969j304717j153892j336851j361206
16703F0678901j436230j114061j486638j228753j316341r76778j339194r48316
16695E0832590j533255j143689j280445j054685q23739j016892j206700j120247
16687D1652938l83173j330081r52808r19965r06722j086453q02190p40791m23426
16678C4107329j099811n71928o07467q24044r83703n57225q54564m12546m06069
$$ y = [79209598, 80689594, 81515405, 81829258, 82297093, 82772061, 83367417, 83280847, 83979040, 83949974, 83862057, 84050418, 83513544, 83546220, 82964373, 82388681, 81855523, 81190645, 80600388, 79640391, 78813525, 78070129, 76789918, 75618624, 74611943, 73345111, 72444743, 70884893, 69785159, 68722176, 67472536, 65835567, 64530850, 63376958, 62040107, 60678901, 59242671, 58128610, 56641972, 55413219, 54096878, 53120100, 51780906, 50832590, 49299335, 48155646, 46875201, 45820516, 44996777, 43979885, 42773185, 41652938, 41269765, 39939684, 38986876, 38066911, 37160189, 36073736, 35271546, 34530755, 34107329, 33007518, 32435590, 31828123, 31004079, 30020376, 29463151, 28608587, 28196041, 27789972]
16669B7789972p46671r85304j17171m74430n47091p38197k77801n93844m42517
16660B2866946k65889q16168k0847r35627m11747k30565j01385o10126j76334
16651A9298258p00942N000m63067p11657l2319k62501m08710j75049m23999o9789
16641A6055225j78266l35500n54481j4879k67764n20963j74591j87931k16199
16632A3604651k19111l58577j97822k59461l411O2776n40370m81619O22455n03030
16622A1726481l14114k10707j69471M707m5285r8508m42431l19731M73261o21371
16612I982831l0357l70077O8481k39355J17204o12471K28096J083l9166k61532
16602H844737l8958k71568k51403k11645J11242j00422K05619k32487N1299p9014
$$ y = [27789972, 27043301, 26057997, 25940826, 25466396, 24919305, 24181108, 23903307, 23309463, 22866946, 22601057, 21784889, 21764042, 20828415, 20416668, 20186103, 20084718, 19474592, 19298258, 18597316, 18602316, 18139249, 17427592, 17395273, 17132772, 16724062, 16549013, 16125014, 16055225, 15876959, 15541459, 14986978, 14972099, 14704335, 14183372, 14008781, 13820850, 13604651, 13385540, 13026963, 12829141, 12569680, 12566269, 12629045, 12088675, 11607056, 12229511, 11726481, 11412367, 11201660, 11032189, 11036896, 10991611, 10893103, 10450672, 10130941, 10604202, 9982831, 9952474, 9582397, 9650878, 9411523, 9528727, 8916256, 9144352, 9145435, 9106269, 8844737, 8805779, 8534211, 8282808, 8071163, 8182405, 8081983, 8287602, 8055115, 8106414, 8027400]
16592H027400k90840l15679p913L50455n42513J14463j93240k17317P891K45922
16582G178629k37590k81449K000p6839k12701Q1650J45920O5196l71577k64926
16572F028313J89810k74296J53964j36754k93089J90481j23366M9418j04750j96998
16562E482733L59872o68532K87357m4984l7587m47612L36436l99663M30645j95313
16552E103352l47649M13744k62570n6307J33941l40458p0021J55370P2795k03364
16542D598833j90963J59629m6355r130j41459m039k05414J88365n3094j49161
16532D147212k58955K08632P4812K46991m21108l9493J63989l83144K89782m40289
16522C588429J84166N6482J87333l30288J80018J31718m49968k9370J84315J50836
$$ y = [8027400, 7736560, 7420881, 7412968, 7763423, 7220910, 7335373, 7142133, 6924816, 6932707, 7178629, 6941039, 6659590, 6661590, 6584751, 6372050, 6453700, 6599620, 6664816, 6293239, 6028313, 6218123, 5943827, 6097791, 5961037, 5667948, 5858429, 5735063, 5784481, 5679731, 5482733, 5842605, 5174073, 5461430, 5416446, 5378859, 4931247, 5267683, 4868020, 5298665, 5103352, 4755703, 5169447, 4906877, 4850570, 4984511, 4644053, 4574032, 4729402, 4802197, 4598833, 4407870, 4567499, 4521144, 4512014, 4370555, 4366516, 4161102, 4349467, 4296373, 4147212, 3888257, 4096889, 4171701, 4418692, 3997584, 3958091, 4122080, 3738936, 4028718, 3588429, 3772595, 3829077, 4016410, 3686122, 3866140, 3997858, 3547890, 3518520, 3702835, 3853671]
16512C853671j48935k51523J17579l55129M23143j72781k51320L79142r8909j29964
16502C364974L9505l97497K3266K00312J91602k65680J06259J24985j73553J96177
16492C410350L47133n19687m14553L33455J09944n76652K78210L42020m26201
16483B884019K0763r3312r6693K54333J00543k11493M2077R0548m4661j19150
16473B826974j8150k49071K44055k59933n4031O0348M5108L25418j92134j47715
16463B580869k06987J07434j49034K96111j03587J13412J6166K27866o13270K42368
16453B511348k39745L00821q8427j47756Q7111L3593J33936m01264K25546j18865
16443B296298J00043Q594k21147K27910l01688K09114K5903l14631N06771l48073
$$ y = [3853671, 3704736, 3453213, 3570792, 3215663, 3638806, 3466025, 3214705, 3593847, 3494938, 3364974, 3404479, 3006982, 3030248, 3230560, 3422162, 3156482, 3262741, 3387726, 3214173, 3410350, 3757483, 3237796, 2823243, 3156698, 3266642, 2689990, 2968200, 3310220, 2884019, 2904782, 2811470, 2714777, 2969110, 3069653, 2858160, 2900237, 2990785, 2946124, 2826974, 2808824, 2559753, 2803808, 2543875, 2489844, 2550192, 2595300, 2920718, 2728584, 2580869, 2373882, 2481316, 2332282, 2628393, 2524806, 2638218, 2654384, 2882250, 2268980, 2511348, 2271603, 2572424, 2483997, 2336241, 2423352, 2456945, 2590881, 2189617, 2415163, 2296298, 2396341, 2404935, 2183788, 2411698, 2110010, 2319124, 2345027, 2030396, 2537167, 2189094]
16433B189094J16695k20327j08969J96014j64029p1408L27453k34599p5689J75771
16423B130006Q002k54847M21263m59911K09507K2981m8952j65500N57380p21086
16413A698843K63628J59555m23034K48724J38894j69076j3553K51736n16007L05422
16403A945132j80648M6329R5569j24952K1764K57306k27972j02877K25535k32816
16393A722370R0123J4772k04202L24726k32481k6497R943J65771k38445R024L8867
16382A673971j43378L30716M8444k18710n7228J25062m9785l4483Q5847k29816
16372A530640K78300l27990L71272k63977o6305j43606J34318j1466k9625J29490
16362A601051k5503l85448M44940J46946k49211k35149K35870J4506Q1686j16623
$$ y = [2189094, 2305789, 2085462, 1976493, 2172507, 2008478, 1937070, 2264523, 2029924, 1954235, 2130006, 2138008, 1883161, 2304424, 1844513, 2054020, 2077001, 2028049, 1862549, 2419929, 1698843, 1962471, 2122026, 1698992, 1947716, 2086610, 1917534, 1903981, 2155717, 1639710, 1945132, 1764484, 1810813, 1906382, 1781430, 1803194, 2060500, 1832528, 1729651, 1955186, 1722370, 1812493, 1827265, 1623063, 1947789, 1715308, 1688811, 1698754, 1864525, 1626080, 1635104, 1673971, 1530593, 1861309, 1909753, 1691043, 1633815, 1758877, 1709092, 1674609, 1760456, 1530640, 1808940, 1480950, 1852222, 1588245, 1521940, 1378334, 1512652, 1501186, 1471561, 1601051, 1575548, 1190100, 1635040, 1781986, 1532775, 1297626, 1533496, 1548002, 1629688, 1513065]
16352A513065L92614o03366K87456J39109k63651J43103J99261m71457L57475
16343A693609j11739k58323j10965L470J42062J10535j83407j31173J4931L15862
16333A484862j10813j34382k75187M75455p4562K0368M329k9234l2165K35743
16323A564414j14406j19151j2183J39279J1895m11954p9387J37452K3635J31751
16313A271345l53946J92312K74029k3821q4226j52590K45259k23001J39436j51880
16303A132917L23653r2923j77111l7779J81025J1364j37237j34041j36821L71151
16293A304198k14263n913J97014r0174j13583j66842M4426J36692j17163J13995
16283A088387J05045k13261J39929q1217l4189K0164J71167m76282K83887l6721
$$ y = [1513065, 1905679, 1302313, 1589769, 1728878, 1465227, 1608330, 1807591, 1336134, 1693609, 1581870, 1323547, 1212582, 1216052, 1358114, 1468649, 1285242, 1154069, 1169000, 1484862, 1374049, 1239667, 964480, 1439935, 1365373, 1385741, 1390070, 1360836, 1328671, 1564414, 1450008, 1330857, 1318674, 1457953, 1469848, 1057894, 978507, 1115959, 1139594, 1271345, 917399, 1109711, 1383740, 1359919, 1275693, 1123103, 1368362, 1145361, 1284797, 1132917, 1456570, 1363647, 1186536, 1148757, 1329782, 1341146, 1203909, 1069868, 933047, 1304198, 1089935, 1084022, 1281036, 1190862, 1077279, 910437, 954863, 1091555, 974392, 1088387, 1193432, 980171, 1120100, 1038883, 1004694, 1024858, 1196025, 719743, 1003630, 966909]
16273I66909M1457l9267p9447L86502m6096j37607k89525Q8279K31339l11655
16263H10889L76162l19539J7536j38970J98646k70962M33327l12104J31186R5702
16253A021873j67163K88922l84701j43858M16489k17164m2614K07731J69980l58804
16243G90691N1711K88049l89000k2257j31509O3549L6630L25779J9938l21939
16233G11642j0704K81429J70877n76281o5568M32434j71126K54261l78817K323
16223F50470J44984j24042P643J46594J21424k74779N5912q9776o5834K94804
16213H67400m16686J41921J84817j18540M4884o3856r1206J58232o8319k04556
16203D34091M06880l79681L12761K28142m56458l3166L51453N516k78571L99909
$$ y = [966909, 1008366, 969099, 889652, 1276154, 1230058, 1092451, 802926, 891205, 1122544, 810889, 1187051, 867512, 885048, 746078, 944724, 673762, 1107089, 794985, 926171, 1021873, 854710, 1143632, 758931, 615073, 1031562, 814398, 771784, 979515, 1149495, 790691, 842402, 1130451, 741451, 719194, 587685, 651234, 687864, 1013643, 1033581, 711642, 700938, 982367, 1153244, 576963, 511395, 943829, 772703, 1026964, 648147, 650470, 795454, 671412, 679055, 825649, 947073, 672294, 728206, 638430, 572596, 867400, 450714, 592635, 777452, 658912, 703796, 639940, 548734, 706966, 638647, 434091, 840971, 461290, 774051, 1002193, 545735, 512569, 864022, 869538, 590967, 990876]
16193I90876k65850j63039J56222K4341k20405j36808K54924M4394p3117L15029
16183I26567K79584m71394j24920Q9620k67576K37334P31K1484j06338k3370q2165
16172D79557K32496k60021p0457K12370K42047k70660l0362K78025j68409N9111
16162G03697j01648r8371K4145l8928K04405l8639j29506o9957M64612m54132
16152D65678J97687k60289L62351C28839J44175O6244K9795k2592j76431J72952
16142E42982L21696k11090m4778j38110N7314l1848j72267K28799o3831K04881
16132F93748k86529M870J72765q9985k3628n0099J1688K23630j26466k8667J42782
16121F44109B24891J50608P6210f7213F95641k47354H7870K84836J62694B1510
$$ y = [990876, 725026, 561987, 718209, 742550, 522145, 385337, 640261, 684655, 611538, 926567, 1206151, 734757, 609837, 699457, 431881, 669215, 669946, 691430, 585092, 561722, 479557, 712053, 452032, 381575, 593945, 835992, 565332, 534970, 812995, 644586, 703697, 602049, 503678, 527823, 488895, 693300, 654661, 525155, 455198, 919810, 465678, 663365, 403076, 765427, 328839, 473014, 539258, 569053, 546461, 370030, 542982, 864678, 653588, 608810, 470700, 528014, 496166, 323899, 552698, 488867, 693748, 407219, 412089, 584854, 494869, 471241, 421142, 432830, 656460, 529994, 501327, 644109, 224891, 375499, 451709, -67213, 695641, 448287, 87870, 372706, 535400, 21510]
16110B52232K85324K25452k98667K85294k49523j20149M8236H1452J00991L2052
16100B14495K87496n9757p2065R6247F6516B890K30236o2257K07476A86155M09055
16089E95210B50920J02167L80834B69504m6773N3037p3509C7286M13767l8618
16079D12435j15652K1730j25181J18193j42354K24362J7213H4920M80499k58603
16069C06816j1366O784L06670k99441M0743K55082k58915j57326N4383M20190
16059F63620k28300p1095C239L85547A32381b4094C97347j28608R4692Q6639A74553
16047A49416K4416L70428a76491E78851k23390L01827A48774O7434M37423A75386
16036B42137J37544C3915M09986A98459o9755g4219E36171A61263J11816N5577
$$ y = [252232, 537556, 763008, 464341, 749635, 500112, 379963, 428199, 81452, 182443, 214495, 501991, 442234, 370169, 466416, 66516, 2890, 233126, 170869, 378345, 186155, 595210, 250920, 353087, 733921, 269504, 222731, 275768, 202259, 37286, 451053, 412435, 296783, 318513, 193332, 311525, 169171, 393533, 410746, 84920, 565419, 306816, 295450, 302234, 608904, 309463, 350206, 605288, 346373, 189047, 243430, 663620, 435320, 364225, 3239, 388786, 132381, -24094, 397347, 268739, 363431, 450070, 174553, 149416, 173832, 544260, -176491, 578851, 355461, 657288, 148774, 216208, 653631, 175386, 242137, 379681, 33915, 443901, 198459, 128704, -74219, 536171, 161263, 273079, 328656]
16026C28656J34969B19987J79970C1051N45974B86050o1532m9925L25412j42753
16016C57252a34512B56472k8063H0515J58249o4730K48415F1883L2003J12590
16006B06476J13693E096J29796J37709h0211B74122r7451K68930r3536n4417k1918
15995B75730j26640K5925E6207J46338L09195A21641J10600K61946K19540K77708
15985I91435K22367l43103C97717H4346R9436l9755J20813J81545m1465A52671
15974C6816K97637r4661m1449b09698B02244r7601J47311K03183j99106o1587
15964A94444E9733L6021K15082i5175d1292D89139A40560Q6578h2543D40915B12588
15952b28480D25614a32163B91779M8398a076o7384c0707j57254f8079C15138O5993
$$ y = [328656, 463625, 219987, 399957, 31051, 577025, 286050, 224518, 174593, 500005, 357252, -134512, 256472, 228409, 80515, 238764, 174034, 422449, 61883, 93886, 206476, 320169, 5096, 134892, 272601, -80211, 274122, 176671, 445601, 352065, 297648, 275730, 149090, 175015, 56207, 202545, 511740, 121641, 232241, 494187, 713727, 991435, 1213802, 870699, 397717, 84346, 183782, 144027, 264840, 446385, 404920, 152671, 36816, 334453, 239792, 198343, -209698, 202244, 104643, 251954, 455137, 256031, 194444, 59733, 95754, 310836, -95175, -41292, 489139, 140560, 227138, -82543, 440915, 212588, -228480, 425614, -132163, 291779, 340177, -1076, -68460, -30707, -187961, -68079, 315138, 381131]
15941C81131g5622E47957h3327J6755j21577f1886A51714a38534F7424k4841g8528
15929A497i6058C34208j52911j0374H3809R0360a0446B28246K7363F2546N208
15918F7754r422d8412I0469N5623K51597A93015b32385D7187J13189o0149e5016
15906a01413A05998a19844J4927A7558K60224A10435k6084a02181B34833J26600
15896C61433l9847j16214J23703b01088C11527D9235d7245B86168b48680G0556
15885a65026g7061A40095L1441p5810b3563H8703J86537a68513L9574J2145c3443
15873A75621J25734E8972M997N40K6873g7850A42404a87814A0491J59951i8619
15861B89028A05436m643b51948E0667d4330A79185a4335F3792a46918j0202G3002
$$ y = [381131, -75622, 547957, -83327, -66572, -188149, -61886, 151714, -138534, 67424, 42583, -78528, 1497, -96058, 334208, 181297, 170923, 83809, 174169, -10446, 228246, 255609, 62546, 67754, 58332, -48412, 90469, 146092, 397689, 193015, -232385, 47187, 160376, 100227, -55016, -101413, 105998, -119844, -104917, 17558, 277782, 110435, 84351, -102181, 234833, 361433, 321586, 205372, 329075, -201088, 311527, 49235, -47245, 286168, -248680, 70556, -165026, -77061, 140095, 171536, 95726, -23563, 88703, 275240, -168513, -128939, -116794, -33443, 175621, 301355, 58972, 63969, 64509, 91382, -77850, 142404, -187814, 10491, 170442, -98619, 289028, 105436, 100793, -251948, 50667, -44330, 179185, -14335, 63792, -146918, -157120, 73002]
15849i6302H4218J82225F1390b0173n9057c7690k24189Q7935G9835L4669M9112
15838A63616D7501a27485A66119a53543G9573a915B26895b07654A22218c0933
15827g6106h711l18010h9751H5276A7263L9309a26414A86028a28477A72936B0137
15815i7355A86258A3302b72429E9233c53524a39691D0959P1997h8227q8373A72895
15803a12364L4092B3715a82554B21274q1425k679Q8234A08361Q8026A046J2944
15792A3990K4443a6616I3566l0321r392b170j61209A34442m8519A7490a25621
15780a23502A81491p6774J83701C8126d236j56708H6814a67941A47448E7471J89634
15769B47105G8890P3637O3080d2658n3478C89910A24548O8393i0A34837B5757
$$ y = [-96302, 84218, 266443, 61390, -20173, -79230, -37690, -261879, -173944, 79835, 114504, 163616, 47501, -127485, 166119, -153543, 79573, -1915, 226895, -207654, 122218, -30933, -76106, -8711, -326721, -89751, 85276, 17263, 56572, -126414, 186028, -128477, 172936, 20137, -97355, 186258, 13302, -272429, 59233, -353524, -139691, 40959, 112956, -88227, -176600, 172895, -112364, -78272, 23715, -182554, 221274, 139849, 137170, 225404, 108361, 196387, 1046, 13990, 38433, -16616, 93566, 63245, 53853, -2170, -163379, 134442, 85923, 17490, -125621, -123502, 181491, 104717, 288418, 38126, -4236, -160944, 86814, -167941, 147448, 57471, 247105, 78890, 152527, 215607, -42658, -96136, 389910, 124548, 192941, -90, 134837, 25757]
15757i38C07032A46049i7316A77708a47659b8127l3836B4767J58512a59350B64514
15745C0404K75299d11262A02915b24369A22057m1214a31588C8395j31b43616a2501
15733G1617a8943j35681e2268A98862a6761A34009m1398c7032A45620p1325J89129
15722B63424E0227a7518m4921G3291b53555B59395E8033J31155b98070d4659h135
15710b0758A42314P3826E9628J01673e7076q9698G1288a60155E3151j707B469
15698b74611A55944a3136k46759C0901a6066j9892j51534B9098j1188K33769h7848
15686a54218c0084o6600j59424E63K31232e6405A97267e2286J9617O104j42094
15675a68659P4515B05932r2433g1488E5636a46690C12211C0652d1035B25863a52964
$$ y = [-938, 307032, 146049, -97316, 177708, -147659, -28127, -61963, 24767, 183279, -159350, 264514, 30404, 305703, -411262, 102915, -224369, 122057, 80843, -131588, 38395, 38264, -243616, -12501, 71617, -18943, -154624, -52268, 198862, -16761, 134009, 92611, -37032, 145620, 74295, 263424, 50227, -17518, -62439, 73291, -253555, 259395, 58033, 189188, -298070, -44659, -8135, -20758, 142314, 216140, 59628, 161301, -57076, -146774, 71288, -160155, 53151, 51444, 2469, -274611, 155944, -13136, -259895, 30901, -16066, -35958, -187492, 29098, 17910, 251679, -87848, -154218, -30084, -96684, -256108, 563, 231795, -56405, 197267, -52286, -32669, -26565, -168659, -94144, 205932, 113499, -71488, 55636, -146690, 312211, 30652, -41035, 225863, -152964]
15663D3514J27650d7606j66812C2559g3998A91992d0823D0354a98724b3874D1241
15651b55720M1928A38399c30228e0178I3382K53841B8011b9072C7664a8280B9020
15639b62600M3537K9271B1120h9955B4855d38769d1232E00a90558F0556f6351
15627h5166c0850j80789d1567j63712l5109B18502i8441B19653D4822L60824a0358
15615a04971B7607r352c28587C27229b52563A54746a09660A11049B1621b9301
15604C02323a15690n6171m9183b2042R832A2645R2455b04554I6282e8560F9984
15592a73638a5895A8232b18915L5130c1355A54777j0128a41482c221q2378I3906
15580i8527M5105E2176b26738m3137c33j95981B3694M6410N8905A1193O3008a50240
$$ y = [43514, 171164, -47606, -214418, 32559, -73998, 191992, -40823, 40354, -198724, -23874, 41241, -255720, -213792, 138399, -330228, -50178, 93382, 347223, 28011, -29072, 37664, -18280, 29020, -262600, -219063, -189792, 21120, -89955, 24855, -438769, -41232, 500, -190558, 60556, -66351, -85166, -30850, -211639, -41567, -205279, -240388, 218502, -98441, 219653, 44822, 405646, -10358, -104971, 27607, 18255, -328587, 327229, -252563, 154746, -109660, 111049, 21621, -29301, 302323, -115690, -171861, -221044, -22042, -12210, 12645, 105100, -204554, 96282, -58560, 69984, -173638, -15895, 18232, -218915, -183785, -31355, 154777, 144649, -141482, -3221, -85599, 93906, -98527, -53422, 52176, -226738, -269875, -333, -196314, 23694, 70104, 129009, 11193, 74201, -150240]
15567e1148k38594B67160Q1714c56023f6137A49030J47735b6013f939G7778c5510
15555A94980a51223A61519L705f3017q0971a4741A58275J31331b23384C69484
15544H5888a3100B01806J93017A32726k4082g6490D61093E7538b2694A31716K75639
15533D07355A25336b3300E90836I9404M8218b41590B0036J04232a10484A57425
15522a61400a5436I6210l9554K06157B4999b00850A66316j7898b95237h1995A83306
15510A60084K349b10886N339j0133B3970K0217N80K3475c57636A8370g4464A93999
15497a22227L0883B07667E8238a10870A93892m1638f8790C073N5072d2354n6383
15486i8737E68298C1506K38115e9657A36776J0788B317M26124L19538N4313j13602
$$ y = [-51148, -289742, 267160, 348874, -356023, -66137, 149030, 296765, -26013, -6939, 77778, -35510, 194980, -151223, 161519, 165224, -63017, -143988, -14741, 158275, 289606, -223384, 369484, 85888, -13100, 201806, 394823, 132726, 108644, -76490, 461093, 57538, -22694, 131716, 407355, 125336, -23300, 590836, 99404, 147622, -241590, 20036, 124268, -110484, 157425, -161400, -15436, 96210, 56656, 262813, 24999, -200850, 166316, 148418, -295237, -81995, 183306, 160084, 162433, -210886, -205547, -215680, 23970, 44187, 44767, 68242, -357636, 18370, -74464, 193999, -122227, -91344, 207667, 58238, -110870, 193892, 152254, -68790, 3073, 58145, -42354, -98737, 568298, 31506, 269621, -59657, 136776, 147564, 2317, 428441, 747979, 802292, 688690]
15475F88690C41086J82355a01499A89771p1907C3449J24164G3685B3605R0999
15465A14604e2425C371a02126L4062r7704A80064P3628K4581H6202J20509b27599
15453B35731C4402F640J46020k8838m0110L16810j40519M35517N97767q8687j81914
15442A022686q6326m65080A93465c1972C36621A55054J34010C6161L13124F2651
15431a4372k6391o1455c2355F8000a70991r8261A93448d9275q1564G9115a53982
15419b39324a673A17002N3458i1714A97765G0008h4481j19704B09417j02085B7742
15407C6579N262b24333C0547L5729K560a3223D1686K08611H5806J06651a29408
15395D3801J88649b64745A81351q7737A9244P1539a27406A67709d7396B64634
$$ y = [688690, 341086, 523441, -101499, 189771, 117864, 33449, 157613, 73685, 23605, 114604, -52425, 3371, -102126, -68064, -165768, 180064, 253692, 278273, 86202, 206711, -227599, 235731, 34402, 6640, 152660, 123822, 83712, 400522, 260003, 695520, 1293287, 1204600, 1022686, 936360, 471280, 193465, -31972, 336621, 155054, 289064, 36161, 349285, 62651, -14372, -40763, -102218, -32355, 68000, -170991, -269252, 193448, -49275, -130839, 79115, -153982, -239324, -1673, 117002, 170460, -91714, 197765, 70008, -84481, -204185, 209417, 107332, 27742, 36579, 41841, -224333, 30547, 66276, 68836, -13223, 41686, 250297, 85806, 192457, -129408, 43801, 232450, -264745, 181351, 93614, 19244, 90783, -127406, 167709, -47396, 264634]
15384a33415B64129a4301B57010A674J77724c036l9437G9298J39518A08939J9899
15373A28838J46813I0836a16213C07405b6691A45322M4722B1975J48419k3217
15363A47177J73583e8820J0640B47560L7155G3590K2768J09833L28508A44534
15352C53820d4966B37203R0618j02927L4757k0625B9047J98340J87392J38986
15342E53765j50826J80121B22613D565J85611J5306a48972B25789g0612G6510
15331E12256H8096L43812j30195F8203K15050i6314C7256a28559B26667d3811
15320a1123E7867i6825G3528K76475a79985a6679A72453e2456J7283D50365g7856
15308C47934j3269J1686D1329L8376a57261f4287G9073j6278K1196a78479P5829
$$ y = [-133415, 264129, -14301, 257010, 1674, 179398, -3036, -42473, 79298, 218816, 108939, 128838, 275651, 90836, -116213, 307405, -26691, 145322, 190044, 21975, 170394, 147177, 320760, -58820, -48180, 247560, 284715, 73590, 96358, 206191, 534699, 144534, 353820, -44966, 237203, 327821, 224894, 259651, 239026, 29047, 227387, 414779, 553765, 402939, 583060, 222613, 4565, 190176, 205482, -148972, 225789, -70612, 76510, 512256, 88096, 431908, 301713, 68203, 283253, -96314, 37256, -128559, 226667, -43811, -11123, 57867, -96825, 73528, 350003, -179985, -16679, 172453, -52456, -35173, 450365, -77856, 347934, 334665, 346351, 41329, 79705, -157261, -64287, 79073, 62795, 83991, -178479, -102650]
15297a02650B93117M7794D2071J51278d3672A42466c8415A24839a36701r3926
15287b30627H0264j0263c9387H9581b26285B72961d6913p9248H0229C9045J91195
15276B30240b27024a7216e561l50559G1624b26680G869J47181C1499K97756A1220
15264B11571G8233i168A90266K6680a98140B26709J73217A39569o0860A1342O2736
15253G4078c5579A17273M8584O5443L0945G9241l8593F812K46445K25713N87459
15242A066429J148546n73668M29638l2122r69331A62723j8119E1381h868A81299
15231A80397a38183K9740A19099h1407a5845p9876B53418a91509J8689g1900a111
15219C0013J77926e1084j51042E6336J05589o6554J56831j16852R2332a11B36628
$$ y = [-102650, 293117, 340911, 42071, 193349, -43672, 142466, -38415, 124839, -136701, -230627, 80264, 70001, -39387, 89581, -226285, 272961, -46913, -126161, 80229, 39045, 230240, -227024, -17216, -5561, -356120, 71624, -226680, 7869, 155050, 31499, 329255, 11220, 211571, 78233, -9168, 190266, 216946, -198140, 226709, 399926, 139569, 78709, 11342, 74078, -35579, 117273, 165857, 231300, 262245, 79241, 40648, 6812, 253257, 478970, 1066429, 2214975, 1641307, 2070945, 2038823, 1069492, 162723, 144604, 51381, -8868, 181299, 180397, -138183, -108443, 119099, -81407, -15845, -95721, 253418, -191509, -172820, -71900, -1111, 30013, 207939, -51084, -202126, 56336, 161925, 95371, 252202, 135350, 227682, -111, 236628]
15207a7127B24062g0881G5411J19649J57794j1411G0778O8250o3840I360h1893
15195f4036G5442A1027b1070A4229P3110b1170A2109a41927C93395j21211G6056
15183C42023A33459R935a5777j52169B9825Q7198E3445P9073a66751A4344L85589
15172C99933D0255j646f5460c08m12808J77089D22932A6976K1642J12970n7316
15161I4272L6902c12464C65155d3821A59233F3464f7518A98531M02772a0705B0000
15149E1986a68413I7898J76430H6550Q9805a76993C14004J21241B00899E2348
15138C45515b59312B53778a60738A63036g386I7119g9937b15C32561A40356B0024
15126G6191b0900B00467g0274L4547C15043a57643C29401M0487j48493D1431R7886
$$ y = [-17127, 224062, -70881, 75411, 195060, 352854, 341443, 70778, 139028, 75188, 9360, -81893, -64036, 75442, 11027, -21070, 14229, 87339, -21170, 12109, -141927, 393395, 272184, 76056, 342023, 133459, 143394, -15777, -167946, 29825, 117023, 53445, 132518, -166751, 14344, 399933, 40255, 38609, -65460, -308, -413116, -236027, 422932, 16976, 38618, 151588, 94272, 131174, -312464, 365155, -43821, 159233, 63464, -67518, 198531, 601303, -10705, 20000, 51986, -168413, 97898, 274328, 86550, 176355, -176993, 314004, 435245, 200899, 52348, 345515, -259312, 253778, -160738, 163036, -7386, 97119, -79937, -215, 332561, 140356, 20024, 76191, -20900, 200467, -70274, -35727, 315043, -157643, 329401, 369888, 221395, 41431, 139317]
15115A39317D3038K71215L89617A68055J32308J75634B5199J8169M3971K93857
15105C81196E3854J17872E4042c29185b4204B1224L2672K89814r5264C4274f3208
15093D01145A22664J21461B6462J06717P5962h5827C27082j48928A197L1292K6846
15082E9335f3539A87715o4295g8515m7086A25748M6171K14248a5338H1591J57739
15071B39330j18062d4111F1397B0788M79791B34276a6909B54312j22828M16102
15061E47586B4492L42670j10276d6200G18593B79259A18073m9252K52301j53984
15051A67138p8049m000L069K1221M68559J92108B59545r315J32258p3358A42169
15039C43624A44410J01615K04245j0158j69987O8712j7219J27197R6959K2082
$$ y = [139317, 43038, 314253, 703870, 168055, 300363, 475997, 25199, 43368, 87339, 381196, 53854, 171726, 54042, -329185, -24204, 21224, 53896, 343710, 248446, 34274, -63208, 401145, 122664, 244125, 26462, 133179, 209141, -85827, 327082, 178154, 1197, 32489, 59335, -63539, 187715, 123420, -78515, -125601, 125748, 171919, 386167, -15338, 81591, 239330, 121268, -44111, 61397, 20788, 500579, 234276, -16909, 254312, 131484, 547586, 24492, 367162, 256886, -46200, 718593, 279259, 118073, 68821, 321122, 167138, 89089, 85089, 88158, 109379, 577938, 770046, 259545, 250230, 382488, 309130, 142169, 343624, 144410, 246025, 450270, 440112, 270125, 338837, 321618, 448815, 545774, 567856]
15029E67856P7698p9709K69415J65240A81662M58996n7123A11398M72419j57832
15019D25985J44948J9277M0752k40596P8101j88762o955R5704P9419J59617p5338
15008E32152r245J37340J28552k42228A57811J8602K60999r209j46624q5894K01890
14997C97575K78705J0341I1706L00589o1375q7382L08547J34024L809j34400k09395
14986C46123K48592k06174L38282j67772J76152j85749M29377J61914n67420K71010
14976H44335l68539m2081A98274L09680j7215L9940M9268K13116l07239M1483
14966E27307k5345K12213B65694J14323j59137A03961C5763J82428N3791k8945
14956B43037J78670A59241n1958K27624n0735M1424K02012L7819j69275L23496
$$ y = [567856, 645554, 565845, 835260, 1000500, 181662, 640658, 583535, 111398, 583817, 425985, 570933, 590210, 630962, 390366, 468467, 279705, 272750, 368454, 447873, 607490, 532152, 522907, 660247, 788799, 546571, 157811, 176413, 437412, 428203, 281579, 195685, 397575, 676280, 686621, 91706, 392295, 330920, 243538, 552085, 686109, 689918, 555518, 346123, 594715, 388541, 726823, 559051, 735203, 549454, 978831, 1140745, 573325, 844335, 475796, 433715, 198274, 507954, 490739, 530679, 579947, 793063, 485824, 527307, 501962, 714175, 265694, 380017, 220880, 103961, 35763, 218191, 271982, 243037, 421707, 159241, 107283, 334907, 284172, 325596, 527608, 565427, 396152, 719648]
14946G19648k13164p5401l6197A71357K0108J70944q9402J26220K56135k56658
14936C98704K95619K65370k45461M39828l7870M2688m1460O29432j65123r8576
14926A483151P3550k03403j2121K06954O57340k76231N97389O5856l64439O977
14916B235023n79937l79543l43927j30701j04330q6327k88266L79759B35118N1636
14906B86754K79966j29097J66585B87516K69436j99341N2604A21095L50100K6574
14896D97769j80638O2786j31646O2686L41770Q9855C67290M04897M12581l54685
14886H30083j89389L94019l31521q7974J57629J26346o8432K5045l34872j60748
14876C60186M99795k40348k40637Q6705j69293K63305J85539l4035R2111O98k7734
$$ y = [719648, 506484, 431083, 394886, 171357, 191465, 362409, 273007, 399227, 655362, 398704, 694323, 959693, 714232, 1154060, 1116190, 1158878, 1117418, 1746850, 1581727, 1483151, 1556701, 1353298, 1341177, 1548131, 2205471, 1929240, 2526629, 2592485, 2228046, 2235023, 1655086, 1275543, 931616, 800915, 696585, 610258, 321992, 701751, 235118, 286754, 566720, 437623, 604208, 287516, 556952, 357611, 410215, 121095, 471195, 497769, 317131, 379917, 248271, 310957, 652727, 742582, 367290, 772187, 1184768, 830083, 640694, 1034713, 703192, 615218, 772847, 899193, 830761, 855806, 520934, 360186, 859981, 619633, 378996, 465701, 296408, 559713, 745252, 711217, 803328, 804026, 776292]
14865G76292j10172q2168L288B15195M88992C00777N84248l25681A89761K55159
14855D44920j5260K38787n3881p7229j75732j19949L24515j01919M49196J54588
14845A068036P23843q61309K83982m5636K54277l70677k7071r8285k33400J04180
14835G97940N6931l87612J71396m2022j28880K43740K1667l12177J90861j25000
14825D86844O9960j93032O7850K08509J68681J03921C13438L03414k08228J5855
14815D24479M3183J73516j93608M76844k21381j41393K77903j31858J77743K5357
14805I10785J00750L3265l22208K66202k93687k71834O9456R0880q7524J36631
14795F32716k20705K78497k46581Q6193J91449k72342J91396A69503K66590J41787
$$ y = [776292, 666120, 583952, 587240, 215195, 704187, 300777, 885025, 559344, 189761, 444920, 429660, 668447, 614566, 537337, 361605, 241656, 566171, 464252, 913448, 1068036, 1791879, 930570, 1214552, 1168916, 1423193, 1052516, 1025445, 927160, 693760, 797940, 854871, 467259, 638655, 596633, 467753, 711493, 733160, 420983, 611844, 486844, 556804, 363772, 431622, 640131, 808812, 912733, 313438, 616852, 408624, 424479, 467662, 641178, 447570, 924414, 703033, 561640, 839543, 707685, 885428, 910785, 1011535, 1044800, 722592, 988794, 695107, 423273, 492729, 583609, 496085, 632716, 412011, 690508, 443927, 530120, 721569, 449227, 640623, 169503, 436093, 577880]
14785E77880B58555L53733m4163j1964j09574J27261J07833P4271k20127J41120
14775F76945M8899K1373K7724J8533j19240k45458J62143k2093K09458m0542j52657
14764E85085j83077J85693n7161j14017K22127J52283k81008j55343K46508R041
14754F10131r2242K43181k95849o8343N3591M45889j55640k97298K13735J11997
14744G69152k58524j08608L17715j92883K24791K58991j91104k51136K02427K89880
14734A060701l80028K40002J62366k97829K87504k11353M59326J89886M98145
14725B008720j59811k3741l06950l01811J150j45742j10884p370m03751K06708
14715G56518n384L58897k14516J36830R8949k62517D04468O15888k53814L15930
$$ y = [577880, 258555, 612288, 568125, 556161, 446587, 573848, 681681, 755952, 535825, 676945, 725844, 747217, 774941, 793474, 674234, 428776, 590919, 568826, 778284, 737742, 585085, 402008, 587701, 530540, 416523, 638650, 790933, 509925, 354582, 601090, 610131, 517889, 761070, 465221, 396878, 450469, 896358, 740718, 443420, 657155, 769152, 510628, 402020, 719735, 526852, 751643, 1010634, 819530, 568394, 770821, 1060701, 680673, 920675, 1083041, 785212, 1072716, 861363, 1320689, 1510575, 2008720, 1848909, 1825168, 1518218, 1216407, 1217557, 1071815, 960931, 953561, 549810, 756518, 751134, 1110031, 895515, 1032345, 1131294, 868777, 404468, 1020356, 766542, 1082472]
14705A082472L43055J96008m73490M03628K61816o1647k82046k9995r5914l25620
14695A018267K35083k34883R2106O4939j39212l18487K28416k79146K13604j68322
14685G12365L27453j5715q1274l06917N29132k75406r1386M17895m90329K27931
14675I53749O5155j15974m14175M65417l22550M42459r2900n5407J1624p9098
14665H58300J75101o6631j68041k83323M47412J06465q8485J89071n16046M38827
14655A092650L440Q3201L46969l65496L21095j57621k54967j21391M00152m58231
14645H89801J87547j42532j80365L26852k30665N4784K40929p9618O437K00196
14635A273366k30834K13571j794j77716j97214L19960K51453j85494m15958L88811
$$ y = [1082472, 1425527, 1621535, 1148045, 1551673, 1813489, 1751842, 1469796, 1439801, 1343887, 1018267, 1253350, 1018467, 1110573, 1175512, 1036300, 717813, 946229, 667083, 880687, 712365, 1039818, 1024103, 942829, 635912, 1165044, 889638, 798252, 1216147, 725818, 953749, 1018904, 902930, 488755, 954172, 631622, 1074081, 981181, 925774, 937398, 858300, 1033401, 966770, 798729, 515406, 962818, 1069283, 980798, 1169869, 653823, 1092650, 1096090, 1179291, 1526260, 1160764, 1481859, 1324238, 1069271, 947880, 1348032, 889801, 1077348, 934816, 754451, 1081303, 850638, 905422, 1146351, 1066733, 1073170, 1273366, 1042532, 1256103, 1254309, 1076593, 879379, 1199339, 1450792, 1265298, 849340, 1238151]
14625A238151k55621M01541k15931K18177K7336j8655k1408M1927o0748N5066
14615A409835j50913k25312K69214j29412Q8762o8581L26550k60149J10893j4377
14605A356510j00677R7020K64812k88399L78412l04138l5834R9031J68700k4672
14595A610765J4079J47736k00738J04309j07816J64204m1795j01495J4765Q9770
14585A693784j26271L00333p398j83453k087K20853O1426J02p6466j43705K85660
14574B022778k26360L0513K23288M4769O0625p9079P0618K5395O1869J69467j01981
14563B301902j12730K41796J19359j43673M55226j38445J01176r7843K98765j469
14553C024064N35778M44393L31878J046092J842524M379837Q218361J8329631
$$ y = [1238151, 982530, 1384071, 1168140, 1386317, 1413653, 1394998, 1373590, 1415517, 1354769, 1409835, 1258922, 1033610, 1302824, 1173412, 1262174, 1193593, 1520143, 1259994, 1370887, 1356510, 1255833, 1352853, 1617665, 1329266, 1707678, 1403540, 1367706, 1466737, 1635437, 1610765, 1624844, 1772580, 1571842, 1676151, 1568335, 1732539, 1690744, 1589249, 1604014, 1693784, 1567513, 1867846, 1860448, 1676995, 1674908, 1895761, 1957187, 1957289, 1880823, 1737118, 2022778, 1796418, 1826931, 2050219, 2094988, 2155613, 2076534, 2147152, 2172547, 2234416, 2403883, 2301902, 2189172, 2430968, 2550327, 2406654, 2861880, 2723435, 2824611, 2726768, 3025533, 3024064, 3559842, 4004235, 4336113, 5382205, 7224729, 11604566, 19822927, 38152558]
14545C8152558J407050A8108084H013180l546724q68721n06634R35602J793628
14537E820331j813490j374195m27135l08865J3710J14506M3323l87195L47350
14528B028340k22054M94204k49885R6482j61904J16988L17931k14571J77440k32959
14518B150012K17151J28560j72003l3272J23915J9528J17102k3112k23572K86458
14508B590767J80014J38730j72159j82564k20820L93451o2706J95813p402Q1017
14498B934141J41558k90918K81659k42661K72491q484J96494k19659J64371l85127
14488B843865N24497M490Q9551j20142R2394J04254J41204n07202N13951Q5511
14478C772373k26069K75281j51740j2162N55325J51248k51080j06886L25835m46989
$$ y = [38152558, 39559608, 18108084, 8013180, 4466456, 3597735, 3091101, 4026703, 5820331, 4006841, 2632646, 2205511, 1896646, 1910356, 2024862, 2068185, 1680990, 2028340, 1806286, 2300490, 2050605, 2147087, 1985183, 2102171, 2420102, 2205531, 2382971, 2150012, 2367163, 2495723, 2323720, 2290448, 2414363, 2433891, 2550993, 2527881, 2304309, 2590767, 2770781, 2909511, 2737352, 2554788, 2333968, 2727419, 2664713, 2860526, 2853124, 2934141, 3075699, 2784781, 3066440, 2823779, 3096270, 3087786, 3284280, 3064621, 3228992, 2843865, 3368362, 3372852, 3462403, 3342261, 3434655, 3538909, 3680113, 3172911, 3686862, 3772373, 3546304, 3821585, 3669845, 3657683, 4213008, 4364256, 4113176, 4006290, 4332125, 3885136]
14468C885136K61462n1114L49223j47996r6948J14028m4053K73626K5206k65278
14458D303292L90502j83685J82652N9121j49368L85625j94935K72563j40411J52356
14448E077712K120Q558J71149N8490j6394J10469J95091r2271J72597J47942M8983
14437E884446Q3217K59222Q112J33521k19232K96579k73708N23890L73402l35180
14427F734269J76528J7082L11509M11524r0993n054p0167M48248j79491N5619
14417G809074J5741M76674j58983K28720P7443k2790K42583O74702k24085J89501
14407I308580O5368J60300j20296L2524m346K55828l8600K0988N25565K95632
14397A0501543J48602r0206J79586J58156M00147P0138K03017m7539M82594J91873
$$ y = [3885136, 4146598, 4095484, 4444707, 4296711, 4199763, 4313791, 4269738, 4543364, 4568570, 4303292, 4693794, 4510109, 4692761, 4751882, 4602514, 4988139, 4793204, 5065767, 4925356, 5077712, 5079832, 5088390, 5259539, 5318029, 5301635, 5412104, 5607195, 5514924, 5687521, 5835463, 5884446, 5967663, 6226885, 6234997, 6368518, 6149286, 6445865, 6172157, 6696047, 7069449, 6734269, 6910797, 6927879, 7239388, 7650912, 7559919, 7554865, 7484698, 7932946, 7753455, 7809074, 7824815, 8301489, 8142506, 8371226, 8448669, 8425879, 8668462, 9343164, 9119079, 9308580, 9373948, 9534248, 9413952, 9446476, 9442130, 9697958, 9659358, 9680346, 10205911, 10501543, 10650145, 10559939, 10739525, 10897681, 11297828, 11367966, 11570983, 11523444, 12006038, 12197911]
14387A2197911K56290N54937l810M29388R5793J13946J92084j161L43106J45862
14377A4324346L76644L95525J34414N08422P8163M28606O35519j37392Q89592
14368A7633839K50227p6069P57076k40435M73291Q75628Q3140J77572O03664O20659
14358B1158592J96979P32441N58441O64375K98627J017330J78465N02001R72074
14349B6279325M14358P33468O51729O30727P96051P22564Q70223O84724P51948
14340C2535117J049559J159114R09042J010250Q03872J486901R89472J310989
14332D1254316J102411J157101J713387J272092J625023J758826J661814J643561
14324E3188531J781376J791205J863472J877594K372519J953606K216812K385585
$$ y = [12197911, 12454201, 13009138, 13005328, 13434716, 13530509, 13644455, 13836539, 13835378, 14178484, 14324346, 14700990, 15096515, 15230929, 15739351, 15817514, 16246120, 16881639, 16744247, 17633839, 17884066, 17807997, 18565073, 18324638, 18797929, 19673557, 19756697, 19934269, 20537933, 21158592, 21355571, 22088012, 22646453, 23310828, 23609455, 24626785, 24805250, 25307251, 26279325, 26693683, 27427151, 28078880, 28709607, 29505658, 30228222, 31098445, 31783169, 32535117, 33584676, 34743790, 35652832, 36663082, 37466954, 38953855, 39943327, 41254316, 42356727, 43513828, 45227215, 46499307, 48124330, 49883156, 51544970, 53188531, 54969907, 56761112, 58624584, 60502178, 62874697, 64828303, 67045115, 69430700]
14316F9430700K789012L142413K932642K779275L183947L584413L442664L950929
14308I5235995M503552L490470N058707M676780N484083N120846O304833N425752
14300A35301018O821275O767457P567418P963885Q031880Q689687R416267R846648
14292B00405535J0413290J0639685J1651337J1628869J2364262J2950510J3768012
14285B83821500J3734622J4702154J4181778J4662396J4893563J4646877J3734150
14278C84377040J3958771J2514132J1496784R893624P831753M874803J114696
14271D46061603J97561k72945j881654m384270n476503o962866q573494r956847
14263D08750585j1288821j2595815j3842173j4326981j4638829j5065174j4728191
$$ y = [69430700, 72219712, 75362125, 78294767, 81074042, 84257989, 87842402, 91285066, 95235995, 99739547, 103230017, 108288724, 112965504, 118449587, 123570433, 129875266, 135301018, 142122293, 148889750, 156457168, 164421053, 172452933, 181142620, 190558887, 200405535, 210818825, 221458510, 233109847, 244738716, 257102978, 270053488, 283821500, 297556122, 312258276, 326440054, 341102450, 355996013, 370642890, 384377040, 398335811, 410849943, 422346727, 432240351, 440072104, 444946907, 446061603, 446259164, 445986219, 444104565, 439720295, 434243792, 427280926, 418707432, 408750585, 397461764, 384865949, 371023776, 356696795, 342057966, 326992792, 312264601]
14256C12264601j4566800j4549839j3988795j3446594j2813903j2002029j1923090
14249B18973551j0680532q779474r359052r875763q607443q130109p865981p400806
14241A48274391p121909o495507n974496n372687n276569n504654m748306m459727
14233A03320536m309000l986081l575081l719354l744025l214357l245684k615662
14225G4911292k891520k526583k331478k402446k174010k196200j859661k079565
14217E6449829k093976j500928k023605j414022j451065j223668j427801j547802
14209D3766962j288774j271932m69946j206054j468400j147772j032949q93283
14201C4987852n87277j019775r11230o49130j153058r21380k56328n11770r99161
$$ y = [312264601, 297697801, 283147962, 269159167, 255712573, 242898670, 230896641, 218973551, 208293019, 199513545, 190154493, 180278730, 171671287, 163541178, 155675197, 148274391, 141152482, 134656975, 128682479, 123309792, 118033223, 112528569, 107780263, 103320536, 99011536, 95025455, 91450374, 87731020, 83986995, 80772638, 77526954, 74911292, 72019772, 69493189, 67161711, 64759265, 62585255, 60389055, 58529394, 56449829, 54355853, 52854925, 50831320, 49417298, 47966233, 46742565, 45314764, 43766962, 42478188, 41206256, 40736310, 39530256, 38061856, 36914084, 35881135, 34987852, 34400575, 33380800, 32469570, 31820440, 30667382, 29746002, 29489674, 28977904, 27978743]
14192B7978743q38814n36853p17355m90311p83925l40544q26755p65741j72494
14183B2505951o70435N614p16103p63197J29929n65720m69672l07627l77510p82296
14173A7988934o6417k79864l85633m63423k08446J9090n93591n89137o9195l91724
14163A4960594l03310k7069k23651j09049n59380j65634n52013j7886j79729j37743
14153A2685130m60790k54209L60741m20767k36341l12819m28118J19768k64723
14144A0787872j12175r9820l78372K37350k39823m47697J06638K1658m61932R5477
14134I509176m37685K84734n06689K74297m88621k772k89267Q8719l45652P5963
14124H162203q0200O503o21189M68727l21670j88409l60351L35747m0916n2751
$$ y = [27978743, 27139929, 26603076, 25885721, 25395410, 24611485, 24270941, 23444186, 22678445, 22505951, 21835516, 21841130, 21125027, 20361830, 20491759, 19926039, 19456367, 19148740, 18771230, 17988934, 17922517, 17642653, 17257020, 16793597, 16585151, 16604241, 16010650, 15421513, 15352318, 14960594, 14657284, 14630215, 14406564, 14297515, 13738135, 13572501, 13020488, 13002602, 12822873, 12685130, 12224340, 11970131, 12330872, 11910105, 11673764, 11360945, 10932827, 11052595, 10787872, 10675697, 10575877, 10197505, 10434855, 10195032, 9747335, 9853973, 9875631, 9413699, 9509176, 9071491, 9356225, 8849536, 9123833, 8635212, 8632440, 8343173, 8431892, 8086240, 8162203, 8082003, 8088506, 7467317, 7936044, 7614374, 7425965, 7065614, 7401361, 7360445, 7307694]
14114G307694k79098j15960r4742M40707p42864J03929L26901n50731n1955N18
14104F344399J45974m51642L49131k64178r8272l29416K53368k70462N9314k47276
14094E490940K20565p2100l97221K13785J73327n59105J36352Q808q8439j38331
14084D988581k96390K68155k37203K70571k78279M0852K24999k19591k31067j76221
14074D354407J86493m29733J96260j68501K32866l54320M07516j48822j82776
14065D093390K08982l81449L18939K37427k91914l0583K7668m16562l267q1797
14055C680834P606k73158M67570l30714R1585j72888M1739j86660N37948p50470
14045C113392P7268j2958J93033j0462K38324m46516L98523l63671j28854k95184
$$ y = [7307694, 7028596, 6912636, 6817894, 7258601, 6515737, 6619666, 6946567, 6395836, 6343881, 6344399, 6490373, 6038731, 6387862, 6123684, 6025412, 5695996, 5949364, 5678902, 5738216, 5490940, 5711505, 5639405, 5242184, 5455969, 5629296, 5070191, 5206543, 5215351, 5126912, 4988581, 4692191, 4960346, 4723143, 4993714, 4715435, 4756287, 4981286, 4761695, 4530628, 4354407, 4540900, 4111167, 4307427, 4138926, 4371792, 4017472, 4424988, 4276166, 4093390, 4302372, 3920923, 4239862, 4477289, 4185375, 4154792, 4182460, 3765898, 3762631, 3680834, 3688440, 3415282, 3882852, 3552138, 3643723, 3470835, 3512574, 3325914, 3863862, 3113392, 3190660, 3177702, 3370735, 3360273, 3598597, 3152081, 3550604, 3186933, 3058079, 2762895]
14035B762895L99914k1302m1956J23260J3r0927o5008J03594l48992j78851L41685
14024B984325j41091K97655q6984j33321k21098O3824m6757j40264P4720k24773
14014B426236Q5552j73075q4914L04981k42177j13255K33482J33776l28653P3746
14004B315699j72593P7318R3496l30518M60434m45370l21260Q3428K59051j63751
13994A855934M11550P9614K2044J9602J01096R97601K491192N446844J5603366
13985B7028843J6991894j6136178j3197359n502955k976475q55076j130443m18646
13977C803605p75584L18301j90561n18217M0892k08329J55008J17096j41080k31901
13967B369230n4822j05293Q7411j70938K95943k40989K06943l12370j69763L7330
$$ y = [2762895, 3162809, 3141507, 3099551, 3222811, 3222824, 3131897, 3066889, 3170483, 2821491, 2642640, 2984325, 2843234, 3140889, 3053905, 2920584, 2699486, 2763310, 2716553, 2576289, 2651009, 2426236, 2511788, 2338713, 2253799, 2558780, 2316603, 2203348, 2436830, 2570606, 2241953, 2315699, 2143106, 2220424, 2313920, 1983402, 2443836, 1998466, 1677206, 1760634, 2019685, 1855934, 2267484, 2347098, 2369142, 2388744, 2489840, 3487441, 5978633, 11425477, 27028843, 44020737, 27884559, 14687200, 9184245, 6207770, 5352694, 4222251, 3803605, 3028021, 3346322, 3155761, 2637544, 2678436, 2470107, 2625115, 2742211, 2601131, 2369230, 2314408, 2209115, 2296526, 2125588, 2421531, 2180542, 2387485, 2075115, 1905352, 1942682]
13957A942682l45281N15135j00810L03084m32732O5473p2535K01171j506k95418
13947A779263L76806l2264l76501K64039m92186J01379J57548R1713j02963r7168
13937A669666P1546O9699m19821K83178J16984o6752J20676j61044k30045K04704
13927A658791k92017K3467L74551j28263l83100K63339L4877q4510l1367q9770
13917A345998N35640n20855K23038J40180l53145J66311N0117j74503K10466j2976
13907A610271m25487J88801J43636J33779n4225k78791j5048p5965J64917O62
13897A392550l62754M92839j33917k9926J97507o13533J41187K9740M06045k9775
13887A489963j23758l79462L76511L5959n32652N82429l19377J92104J90421O5925
$$ y = [1942682, 1597401, 2112536, 2011726, 2314810, 1882078, 1947551, 1875016, 2076187, 2074681, 1779263, 2156069, 2123805, 1747304, 2011343, 1519157, 1620536, 1778084, 1869797, 1766834, 1669666, 1741212, 1810911, 1391090, 1674268, 1791252, 1724500, 1845176, 1684132, 1454087, 1658791, 1366774, 1390241, 1764792, 1636529, 1253429, 1516768, 1551645, 1467135, 1435768, 1345998, 1881638, 1360783, 1583821, 1724001, 1370856, 1537167, 1587284, 1412781, 1623247, 1610271, 1184784, 1373585, 1517221, 1651000, 1596775, 1317984, 1302936, 1226971, 1391888, 1392550, 1029796, 1522635, 1388718, 1358792, 1556299, 942766, 1083953, 1113693, 1519738, 1489963, 1366205, 986743, 1363254, 1399213, 866561, 1448990, 1129613, 1321717, 1512138, 1578063]
13877A578063n30491R2614K98731m11699J16835J46186m0449p9698J28254l03190
13867I95156L71300m00086J77823l17773M73252l19423j2202J29243Q6955j09698
13857A074547m4575J40392K33375m56592L78205j76877j51745q581J8868l14376
13847F92641N52255m1800j63109j79434K12242j28383J25798K1676j79252p5175
13837H37459M9422r6509Q3987J62K7203Q8514J01894Q8467l12546R5062K92343
13826A255458m80804M73666j17100l28672n8396M75627C93025P50777l29068K50373
13816A065107r0103n0625J9386k31836K71453j52583m7930k8489L17470k01415
13806H70435J701j6201k7820m051M7545Q8346D56432N66196N8605k85831K89350
$$ y = [1578063, 1047572, 1140186, 1438917, 1027218, 1144053, 1290239, 1249790, 1170092, 1298346, 995156, 1366456, 966370, 1144193, 826420, 1299672, 980249, 968047, 1097290, 1184245, 1074547, 1029972, 1170364, 1403739, 947147, 1325352, 1148475, 996730, 988149, 1007017, 692641, 1244896, 1203096, 1039987, 860553, 1072795, 944412, 1070210, 1091886, 912634, 837459, 886881, 790372, 874359, 874521, 901724, 990238, 1092132, 1180599, 868053, 963115, 1255458, 774654, 1248320, 1131220, 802548, 744152, 1219779, 393025, 1143802, 814734, 1065107, 975004, 924379, 943765, 711929, 983382, 830799, 782869, 754380, 1071850, 870435, 872136, 855935, 828115, 824064, 871609, 959955, 456432, 1022628, 1081233, 795402, 1084752]
13795A084752l21169L70735k79375j65624L25656l10546j54975m3387M08926o5987
13785H49006L3604k49832j7121K84311l27682N06915k35094o7828Q2911A07269
13774F47126Q7554J0258N7874J9024J02226j51781L7117p4922j8506K19300k60898
13763F74372j15420L22225D20414J49384J47632J20920k0376K8081p9285l12896
13753D53874m9284k2877K76443L5324j8941J12340l4339J26968C26953J63705
13743D90658J55510J9221l1435l3229l122P8892B87538L23493P6872q8911J17025
13732G16017k49055K01513m3702P3464k2083B04368M21610n1297J89349l78461
13722C85569j30173L51503L9248K21434k79661J53584j7758r5940o077k650P056
$$ y = [1084752, 763583, 1134318, 854943, 689319, 1014975, 704429, 549454, 506067, 914993, 849006, 882610, 632778, 615657, 899968, 572286, 1079201, 844107, 776279, 859190, 107269, 647126, 734680, 744938, 802812, 821836, 924062, 772281, 809398, 734476, 715970, 935270, 674372, 558952, 881177, 420414, 569798, 717430, 838350, 817974, 846055, 766770, 453874, 404590, 381713, 658156, 693480, 674539, 786879, 752540, 879508, 326953, 490658, 646168, 665389, 633954, 600725, 597603, 676495, 287538, 611031, 687903, 598992, 716017, 466962, 668475, 624773, 698237, 676154, 204368, 625978, 574681, 764030, 385569, 255396, 606899, 646147, 867581, 587920, 741504, 723746, 627806, 621729, 619079, 626135]
13711F26135p0548J37517B80742J73904J12324K1004N6448k34884j75960M27723
13701F61301m6C17124j23287L17794R0132k05009L77124A33919L94353j53532
13691C74740J31533K61983l04929O3735J84616A57318J51920L07840B68831M96689
13681G65520C50989M87472k72345L55j01639K07603j25365j4031Q7403B61758
13670D98275p5336k6110J32039j67851J7936M40654l28481J4565K13523l0869
13660F88345k73592K33337A64568M40416j39923n3867N2327Q865K98198C51367
13649I0247M20795p7955J39260l9975n1701Q9771r7674o0108L7483B11178K36217
13638D47395R152j70671J32833B06829J92950A94970M40533j88746A64581L22199
$$ y = [626135, 555587, 693104, 280742, 454646, 566970, 587974, 644422, 409538, 233578, 661301, 661255, 317124, 193837, 511631, 601763, 396754, 773878, 133919, 528272, 374740, 506273, 768256, 463327, 527062, 711678, 157318, 309238, 617078, 268831, 765520, 350989, 838461, 566116, 566471, 464832, 672435, 547070, 533039, 620442, 261758, 498275, 422939, 396829, 528868, 361017, 378953, 819607, 491126, 505691, 719214, 688345, 414753, 648090, 164568, 604984, 465061, 411194, 463521, 472386, 770584, 351367, 90247, 511042, 433087, 572347, 532372, 480671, 570442, 472768, 412660, 450143, 211178, 447395, 456547, 285876, 418709, 206829, 399779, 194970, 635503, 446757, 164581, 486780]
13628D86780K9748j72498L5685K292r5100Q2792A04350L57358j93635K93030q9792
13617D71311K6545A53832j4823J79987j04105J76017K6685j01628a3339H9453
13606H13839k66000n4372J96970o9423j32890j34896r2682K38162B22022a0552
13595E66872B28449J27482A73231M1056J77573n1280A69132M31751A89224B7159
13584B43312D4665O28444C31893j07569L2220M9835J2257J91495B31932J18296
13574C50228Q1473J73165Q1370C05274j25736d4756E37273K57621A73399K982
13564A76381L53987k52306Q8363H7270K9527J40698K75823j7230E5348L73373
13554D28721B10288L89799j41663k22007c0276C34582j51661K42180A10083K70048
$$ y = [486780, 516528, 344030, 379715, 382007, 286907, 369699, 104350, 461708, 268073, 561103, 471311, 497856, 153832, 139009, 318996, 214891, 390908, 417593, 315965, -13339, 89453, 813839, 547839, 493467, 690437, 621014, 488124, 353228, 260546, 498708, 222022, -10552, 566872, 228449, 355931, 173231, 214287, 391860, 340580, 169132, 600883, 189224, 27159, 243312, 44665, 673109, 331893, 224324, 256544, 306379, 318636, 510131, 231932, 350228, 431701, 604866, 686236, 305274, 179538, -44756, 537273, 794894, 173399, 176381, 530368, 278062, 366425, 87270, 116797, 257495, 533318, 516088, 55348, 428721, 210288, 600087, 458424, 236417, -30276, 334582, 182921, 425101, 110083, 380131]
13544C80131J64404j37793H0242L91555k25357J7009A19361M04782j08650j86289
13534B29204M3556K47511A48282J22260m257J75132j80743J28985j2583r2400
13524B84676R5923J4904l8327N433j51423C1997M32021j37667J01294o3502J95294
13513E59437B54125Q041A14320K21359B5668J12851f1139q993C9780K60947D924
13501A86840J09927M7756m6297J86493j59850J08861B7787M4097K00145J29426
13491D01455j589e7809C91481B2552a24656C78662r6462n0028J84562j14269Q2625
13480C85090D6423d97B68002M4568J5815P4503A12986B934L89446n0023a33967
13468D65501I3810k6370K20304A4160L99330Q7217A47921J87935j31588I0354
$$ y = [380131, 544535, 406742, 80242, 471797, 246440, 263449, 119361, 524143, 415493, 229204, 272760, 520271, 148282, 270542, 266285, 441417, 260674, 389659, 377076, 284676, 380599, 395503, 357176, 362609, 211186, 31997, 464018, 326351, 427645, 364143, 559437, 254125, 262166, 114320, 335679, 25668, 138519, -61139, -70132, 39780, 300727, 4924, 186840, 296767, 344523, 298226, 484719, 324869, 433730, 27787, 71884, 272029, 401455, 399866, -57809, 391481, 22552, -124656, 378662, 282200, 232172, 416734, 302465, 385090, 46423, -497, 268002, 312570, 328385, 402888, 112986, 2934, 392380, 342357, -133967, 465501, 93810, 67440, 287744, 14160, 413490, 500707, 147921, 335856, 204268, 90354]
13457B65617r8733l4123J74908K26495k23710J58260A38616K44271n5381a38858
13446D433L41716M959q1550k3371B7445J71370J70052C7287K73285c9519I9347
13434F1289K56231r7941D0172K25798D2108J44949B1976L20430m1325j31007j4038
13423A56036D8672g6464k468A61410Q5460L46740A73161k4042q165O4140q5497
13412A19597d8162A42644a73696A69184D9440L79757B2961M27846j27668J13882
13402D37021j91816j16807j2269O7628j4623Q8476E3970J32271K23946q6082n1280
13391B72825o5129e2289B54832J32646j53674J15833j8430J75988A68727l6579
13381A32148i8237C94407q1580A05893K29057A40165c7349G5828J26687K48384
$$ y = [265617, 166884, 132761, 307669, 534164, 310454, 468714, 138616, 382887, 327506, -138858, 4433, 346149, 351108, 269558, 246187, 27445, 198815, 368867, 37287, 310572, -39519, 99347, 61289, 317520, 219579, 40172, 265970, 42108, 187057, 21976, 342406, 301081, 170074, 156036, 48672, -76464, -78932, 161410, 246870, 593610, 173161, 149119, 140954, 205094, 119597, -48162, 142644, -173696, 169184, 49440, 429197, 22961, 450807, 323139, 437021, 245205, 128398, 116129, 183757, 169134, 257610, 53970, 186241, 410187, 324105, 272825, 207696, -52289, 254832, 387478, 233804, 349637, 331207, 507195, 168727, 132148, -98237, 394407, 312827, 105893, 334950, 140165, -37349, 75828, 202515, 450899]
13371D50899p1600j44877N0095L36333C07645f2798C54557K3245J9192j79354
13361B17640Q4077j0894d3991C46457B8096L11472A13528n0397P9885K82603H3693
13349C02030n9435j3140N329o2460G9242K81178I2367J03063B6307J57447J03379
13338B87133n3991O0633K03482E4602L740J68342J45042j57683c7911B12346J51748
13327C64094A32475N5325O4858K2011A8344a38506A16264K8711R9039a9551A40149
13315B44953L2102q7503p1530J36009k2130A03727h4187C30415K7739A06590N5653
13304A62243L00839F5487M8794C9177K22613m9055l5256M829J78135q928L3382
13293C84897h9852A88804p8395J16770k282k1152r2574e8490A56112G7354J34801
$$ y = [450899, 379299, 234422, 284517, 620850, 307645, -62798, 354557, 377802, 396994, 217640, 301717, 290823, -43991, 346457, 28096, 339568, 113528, 63131, 143016, 425619, 83693, 302030, 242595, 229455, 234784, 172324, 79242, 360420, 92367, 195430, 26307, 183754, 287133, 233142, 293775, 497257, 54602, 58342, 226684, 371726, 214043, -37911, 212346, 364094, 132475, 187800, 252658, 274669, 18344, -138506, 116264, 144975, 244014, -19551, 140149, 244953, 277055, 189552, 118022, 254031, 231901, 103727, -84187, 330415, 358154, 106590, 162243, 463082, 65487, 114281, 39177, 261790, 212735, 177479, 182308, 360443, 351515, 384897, -89852, 188804, 110409, 227179, 224897, 203745, 111171, -58490, 156112, 77354, 212155]
13282B12155l5308k1369J5624C9455J96620A06142L32170f3770A70715K7517J17942
13271C16174Q9911A84283q123C2763N74M61553f8668A26205J2489o7007R8859
13260A70546E0276J02025R1072H9800j3545a18062A99773D374J72211N6197Q5342
13249C18124A9986J395b02691h1642a0837C462c8493B23370H6997l8700Q4123
13238A32420a46904D8438J25002J74385e3467F6234L38746A51889F541L20976
13228C27517p5955m6561G7762j619o248B6062L28411B5601K581J59590M4244j555
13216B30461A2521J46185J23514b1898k39537b9668D5327i7640A66177B3005Q3414
13205A06419m5221O0930a03925b8566A45681J71562a03509c1959j45778d5202
$$ y = [212155, 176847, 155478, 171102, 39455, 236075, 106142, 438312, -63770, 170715, 198232, 316174, 406085, 184283, 176160, 32763, 33337, 494890, -68668, 126205, 138694, 71687, 170546, 50276, 152301, 243373, 89800, 76255, -118062, 199773, 4374, 176585, 232782, 318124, 19986, 21381, -202691, -81642, -10837, 3462, -38493, 223370, 86997, 48297, 132420, -146904, 48438, 173440, 347825, -53467, 66234, 404980, 151889, 6541, 327517, 251562, 205001, 77762, 76143, 69895, 26062, 354473, 25601, 28182, 187772, 232016, 230461, 12521, 158706, 282220, -21898, -261435, -29668, 45327, -97640, 166177, 23005, 106419, 61198, 122128, -103925, -28566, 145681, 317243, -103509, -31959, -177737, -45202]
13194C84426e1818l7624A41878K79876c4805A82811n5293q758O7273M8042I3232
13182C80784h7400J5745b7665j57809c8928n8982I9813k0152J17553i7315B240
13170B62350a85335g4748A85883c2613B5782K85140b4500j26411C64158A71167
13159A16517e5788A44965B7112K31569I8517k6980N873c2510m7039B97974r1023
13148B06951A0979b54589B290f1325E0793e9023j59779a4427n4783A47049c5651
13136B67797L4948h413B19943c2160B00549h3659B77821b59573A27137k2374N2284
13125A57047K36714j88753a86121A58202h8260F7204P4189n8093J76415a7183
13114B26332a76303C54521b9658C79833j37944b12391A20976L6217N8466L8961
$$ y = [384426, -51818, -89442, 141878, 421754, -34805, 182811, 127518, 118760, 186033, 234075, 93232, 380784, -87400, -71655, -27665, -185474, -38928, -97910, 99813, 79661, 197214, -97315, 2240, 262350, -185335, -74748, 185883, -32613, 25782, 310922, -24500, -150911, 364158, 171167, 116517, -55788, 144965, 27112, 258681, 98517, 71537, 77410, -32510, -79549, 297974, 206951, 10979, -254589, 2290, -61325, 50793, -59023, -218802, -14427, -69210, 147049, -35651, 267797, 302745, -8413, 219943, -32160, 200549, -83659, 277821, -259573, 127137, 104763, 157047, 393761, 205008, -186121, 158202, -88260, 67204, 141393, 83300, 259715, -17183, 226332, -176303, 354521, -29658, 379833, 241889, -212391, 120976, 157193, 215659, 254620]
13104B54620b35589a04226B41673O7833A41676i2706G3669O3542j6822l1644N7654
13093A46399D0952d3586m1525j01847C14763A10712P8584i356j91696c0444I0528
13081B05877o5851J66009A02328B5096b6467D9932H745J8885c6729j36856B79043
13069B2017L6097e5183C3294a68869A01315b17702f7895B7305B273M2882a18389
13057B54462j24369J10431Q1203j18049J60587A22209J26598n938a76254A0762
13046B73709I3402M27557e3491j97565B65427A12200A9175D312K5109d30156A04908
13034a23774H2201h6438A02612k2975l0200K0485e3843A55422a04461J23C28592
13022b12759K0484A05871O2584a00728A44791a16549H5184k510J95846A38488
$$ y = [254620, -235589, -104226, 241673, 309506, 141676, -92706, 73669, 137211, 120389, 88745, 146399, 40952, -43586, -85111, -186958, 314763, 110712, 189296, -9356, -201052, -30444, 90528, 205877, 140026, 306035, 102328, 25096, -26467, 49932, 8745, 27630, -36729, -173585, 279043, 22017, 58114, -55183, 33294, -168869, 101315, -217702, -67895, 27305, 2273, 45155, -118389, 254462, 130093, 240524, 321727, 203678, 364265, 122209, 248807, 242869, -176254, 10762, 273709, 93402, 520959, -53491, -251056, 265427, 112200, 19175, 4312, 29421, -430156, 104908, -123774, 82201, -86438, 102612, 79637, 49437, 69922, -53843, 155422, -104461, -104338, 328592, -212759, -192275, 105871, 168455, -100728, 144791, -116549, 85184, 82674, 278520, 138488]
13011A86838C826J02459a2914E4972Q461c51579b2218A01716C2067a0817H1560
12999a6183H5482K58206F2407b7824A29123K50355a8586A20661g7764A46954F4759
12987a04680G7617i5045B77245b75641J36020A30739l95P996a5205j22189K4981
12976a12413D1482a31505g461j70330B69023a84423B15383a422A52418p331J6515
12965A61602G1699J06128f2063B02787a5775A42165i8361p3062B14570a96654
12954b43693h2328H0348L82671B30341a13849b9087A79060F6997J40706J04644
12944C12347G3820J32970m4595a09486G2162a22968n8140C37010e0937N071A02532
12932d6647E7091K2543j8735k5980a06779G8799R6741k9042l3392a47630H3841
$$ y = [186838, 3826, 106285, -12914, 54972, 63433, -351579, -22218, 101716, 32067, -10817, 81560, -16183, 85482, 343688, 62407, -27824, 129123, 379478, -18586, 120661, -77764, 146954, 64759, -104680, 77617, -95045, 277245, -275641, -139621, 130739, 130344, 138340, -15205, -137394, -112413, 41482, -131505, -7461, -177791, 269023, -184423, 215383, -1422, 152418, 145087, 161602, 71699, 177827, -62063, 202787, -15775, 142165, -98361, -171423, 214570, -196654, -243693, -82328, 80348, 463019, 230341, -113849, -29087, 179060, 66997, 207703, 312347, 73820, 206790, 162195, -109486, 72162, -122968, -181108, 337010, -50937, -45866, 102532, -46647, 57091, 79634, 60899, 34919, -106779, 78799, 175540, 146498, 113106, -147630, 83841]
12920e480I9279f038A68247J8563o4729K004o1956N160R5734a06895G6057J7121
12908I3178M2185B8744a52465l5351I9319N0078J39832a02803c7947G4389r309
12897F5080j4872b98036B94413c8717C62052D7949i2513E1740a18040D6986j3668
12886C3318J18535B8997a31580l2499B13685b46445e8577A31236C6584b41516
12875H7526R1051N7585a78269C3820J1639j2785R2960J6575B8849i1231A55149
12863a15942B06901K0980b69478i0786o7231A52J49942c2994G661K10704D7024
12851C83966a28781e8814C1023b67366A45333b72564Q9574A22101e5956A5408
12840A86923e6851n5519j4609j58078A60807d59170A01120c4126j17923A01854
$$ y = [-5480, 99279, -6038, 168247, 186810, 122081, 124085, 62129, 67289, 163023, -106895, 76057, 93178, 135363, 28744, -152465, -187816, 99319, 149397, 289229, -102803, -37947, 74389, 65080, 50208, -298036, 294413, -38717, 362052, 47949, -92513, 51740, -118040, 46986, 33318, 151853, 28997, -131580, -164079, 213685, -246445, -58577, 131236, 36584, -241516, 87526, 178577, 236162, -178269, 33820, 45459, 32674, 125634, 142209, 28849, -91231, 155149, -115942, 206901, 227881, -269478, -90786, -158017, 152, 150094, -32994, 7661, 218365, 47024, 383966, -128781, -58814, 31023, -267366, 145333, -272564, -182990, 122101, -55956, 15408, 186923, -56851, -112370, -126979, -285057, 160807, -459170, 101120, -34126, -152049, 101854]
12829a63758O3589c6134k6288k42171A51965L8665i7587j18123I2646a4426A90085
12817D199g7436e016A3099f4737m7500I9073g3994A22480h2257j18608A08669
12805C2470a75057A34706a08142B1406a82779A4658c32405a62783C26799D0692
12794b29120h0334A57800j1745c40050c3076k89570B4344I610b9574n6850A23063
12782g0107F8496N9387K43090l9679a30225A30807b25961I3779e2853n1981l4273
12771a39107A83460H928h6113n8789C99426a27102d493r2023j7900d1860a7283
12759f0978F9866a30317B03172a06913m7808a7625D32414a34258d3169C5840J35034
12748A70874b02441B0922F976K29338a04867A54265a54624I0417a54541k23058
$$ y = [-163758, -100169, -36134, -62422, -304593, 151965, 190630, -97587, -215710, 92646, -14426, 190085, 4199, -77436, -5016, 13099, -64737, -112237, 99073, -73994, 122480, -82257, -200865, 108669, 32470, -175057, 134706, -108142, 21406, -182779, 14658, -332405, -162783, 326799, 40692, -229120, -80334, 157800, 146055, -340050, -33076, -322646, 24344, 9610, -29574, -86424, 123063, -70107, 68496, 127883, 370973, 331294, -130225, 130807, -225961, 93779, -52853, -104834, -139107, 183460, 8928, -86113, -144902, 399426, -127102, -4493, -96516, -114416, -41860, -17283, -60978, 69866, -130317, 203172, -106913, -154721, -17625, 432414, -134258, -43169, 35840, 170874, -202441, 20922, 6976, 236314, -104867, 154265, -154624, 90417, -154541, -377599]
12738c77599A18951f5127c0824R910A57546D2269a50289B95377l9929d7874I5982
12726a9337j44460D60233c63790d403A52338C4597a93022C22435i8616j59389
12716b58005c4441A98169C6371J22186a59330B41557B4121P8747N7681K5793e6876
12704b37740A08497i2933j1967A5083P3710A4926C503a86472B8970P9913g790
12692d07042E0465O3802E050g1702a8736A94454b0386B80028h2686g035a081r041
12680a0122j26154B01230J81147a25578A03326j4363j0880O0582c680A19643n4653
12669F4990B9513b93105a16654A18859b20869A52328k3121B3061f9816K799D11504
12657A97418K07691j79119r7712R091J04683p0980h261A86025B2847P1381a55442
$$ y = [-377599, 118951, -65127, -30824, -20914, 157546, 42269, -150289, 295377, 255448, -47874, 95982, -19337, -163797, 460233, -363790, -4403, 152338, 34597, -193022, 322435, -98616, -258005, -34441, 198169, 36371, 158557, -159330, 241557, 24121, 102868, 160549, 186342, -56876, -237740, 108497, -92933, -104900, 15083, 88793, 14926, 3503, -186472, 28970, 108883, -7790, -407042, 50465, 114267, 5050, -71702, -18736, 194454, -20386, 280028, -82686, -7035, -1081, -10122, -136276, 201230, 382377, -125578, 103326, 88963, 78083, 138665, -3680, 119643, 64990, 29513, -293105, -116654, 118859, -220869, 152328, 129207, 23061, -69816, -67017, 411504, 197418, 405109, 225990, 128278, 137369, 242052, 171072, -8261, 186025, 22847, 94228, -155442]
12645c0782I9021C5536K25109q6475a46015e2033n8630D8473e3034b2211C10261
12633B26671b6724l4222B46935c28988I0357a5583H8009a05007D78637A10771
12622I5093b4817B74077a87172F3324K12743o1014c6192k22246A93155r2472c1589
12610f5091A55224i1841C31640A15204J7412c77956A24019g2911l0430C30623
12599e1262I1525J3373d521A01479l6848a70515c4594n090A87659A4023b72091
12587F1906B7362J71236e39G7018a4408k99832b9952B91368A22162k7578c20899
12575a05263B79458h8400j45731A18361K0524d9030A08306a23911A18286e1831
12564B27670b3425A39388i6685A98748p5636a19875N5481N364j37873d0439k23290
$$ y = [-30782, 99021, 35536, 260645, 174170, -146015, -52033, -110663, 48473, -53034, -22211, 310261, 226671, -26724, -60946, 246935, -328988, 90357, -15583, 88009, -105007, 478637, 110771, 95093, -24817, 274077, -187172, 63324, 276067, 215053, -36192, -258438, 193155, 100683, -31589, -65091, 155224, -91841, 331640, 115204, 132616, -377956, 124019, -72911, -103341, 330623, -51262, 91525, 104898, -4521, 101479, 64631, -170515, -34594, -39684, 187659, 14023, -272091, 61906, 27362, 198598, -539, 77018, -14408, -314240, -29952, 291368, 122162, 94584, -320899, -105263, 279458, -88400, -234131, 118361, 138885, -49030, 108306, -123911, 118286, -51831, 227670, -23425, 139388, -96685, 198748, 123112, -119875, -64394, -59030, -196903, -40439, -263729]
12553b63729B26833e1658D27837A08407m1289L19358E8343J22556j7112c9458
12542A19701A8915K05277f8024b5414q4726B62321E664a03459A93461M4276l6617
12531B01120q9777b07130L1041d8903B39566G1759M229J78828a37880A31527J45779
12520B77306c5569l1399C60162f4629B37197a96639D8287N8621i5612A32994o4711
12509F8283P571c9439B05346h325B687h1230o4782I5782N4513F6012f8875A49889
12496B55608j6218K2825a5302A95969L706q4260b3354B83990b45031e0546j11195
12485a61741k525E1717j6453C89K36810e8753C24654h3286j35993e3926O426l985
12473e1485A15058a86178P1990C6815a69988h0945B7130e6049E3088R5530d8636
$$ y = [-263729, 226833, -51658, 427837, 108407, 67118, 386476, 58343, 180899, 163787, -39458, 119701, 18915, 224192, -68024, -25414, -110140, 262321, 5664, -103459, 193461, 237737, 201120, 111343, -207130, -176089, -48903, 239566, 71759, 75988, 254816, -137880, 131527, 277306, -35569, -66968, 360162, -64629, 237197, -196639, 48287, 106908, -95612, 132994, 68283, 75854, -39439, 205346, -8325, 2687, -81230, -146012, 95782, 150295, 66012, -68875, 149889, 255608, 239390, 262215, -15302, 195969, 199675, 115415, -23354, 283990, -245031, -50546, -161741, -164266, 51717, 35264, 389, 237199, -58753, 324654, -83286, -219279, -53926, -47500, -51485, 115058, -186178, -114188, 36815, -169988, -80945, 27130, -56049, 53088, 148618, -48636]
12461b40515B19049P4169i679A11953a82480O4160C6199d42943D36510b2442m41639
12450d64081b04105B3193f1051q7296C46804C7116O2963R2994c58974i1556I0159
12438G3294b33809A11234h820k73941R5087m7931K9877R6398l10808B28977b72989
12426h3763B8663P8736a33770A7254K32151j1972k4799a47741F013K9947e9533
12414c28066A89244N2417r5830b7533r7294j10526j30020A06144c07837m5253
12404c53090Q1410A68365D093O8100a93614m5456B70194r0830e3363j25292C03318
12392c4152C16779b35228Q9088D70326a26839A32108n1362a16995A08158C8593
12381C25426d2598A33138J19554I6736K2286A7338J80383E8404J15871i08A92190
$$ y = [-240515, 219049, 293218, -9679, 111953, -182480, -118320, 36199, -442943, 436510, -22442, -464081, -204105, 23193, -61051, -148347, 346804, 37116, 100079, 193073, -358974, -91556, 90159, 73294, -233809, 111234, -8820, -282761, -187674, -235605, -205728, -109330, -420138, 228977, -272989, -83763, 28663, 107399, -133770, 17254, 249405, 237433, 212634, -147741, 6013, 35960, -59533, -328066, 189244, 241661, 145831, -27533, -124827, -235353, -365373, 106144, -307837, -353090, -271680, 168365, 4093, 72193, -193614, -239070, 270194, 179364, -53363, -178655, 303318, -34152, 316779, -235228, -146140, 470326, -126839, 132108, 80746, -116995, 108158, 38593, 325426, -42598, 133138, 252692, 96736, 119022, 17338, 197721, 58404, 174275, -908, 192190]
12369A14987N0337o0885K27817a95709M047I9945c0619E1551K58109a08469A03076
12357A26573D6562a28818E4317c04691a2018r8369b8361A06593C3977L49425j69325
12346B14077q3675J59912I6184m7569b91373B05364n8449a04714E4086B6070p289
12335A8781J65416D9640h3809A88156p7214a5589j08803B42439k4862J83643J22065
12324E23285A37363a11464A74431M66781B71950j03101J55598a17523l5345C34980
12313a07807a3807I7096L63586q2174l2584j72601M2195e9A77682K42691E6384
12301B12801F3663b18757F6500R7474i9546F2520b25086D9013a58469D0318b8394
12289C2520L58603p3609f3038A90787J09986A22768C1661c6436m615D3411j0018
$$ y = [114987, 165324, 104439, 332256, -195709, -191662, 99945, -30619, 51551, 309660, -108469, 103076, 126573, 46562, -128818, 54317, -304691, -12018, -110387, -28361, 106593, 33977, 383402, 214077, 130402, 290314, 96184, 48615, -291373, 205364, 146915, -104714, 54086, 26070, 18781, 184197, 49640, -83809, 188156, 110942, -15589, -124392, 242439, 217577, 401220, 523285, 137363, -111464, 174431, 641212, 271950, 168849, 324447, -117523, -152868, 334980, -107807, -13807, 97096, 460682, 378508, 345924, 173323, 215518, -59, 177682, 420373, 56384, 212801, 63663, -218757, 66500, 163974, -99546, 62520, -225086, 49013, -158469, 40318, -28394, 32520, 391123, 317514, -63038, 190787, 300773, 122768, 31661, -36436, -41051, 43411, 33393]
12278C3393G941J65268h3222H4826k2062b17385k749G543c03036B82252q579L6600
12266C10273a04447A0772J10626k6968g3560k18344A1956c65341A14903g4088
12255H0487A7437i4643E4021Q1808K1127a4505o7882B33244o0642a57148A07266
12243A53340F8541O3038k2261B8638e7925B54927B1631a82660B37771r2733J52381
12232B97419b86163D9086J48389J24280A33566J9726R8713K4793H7424k2793P418
12221G2049c82329B05306a230B1373R3669R3071I4922L84070q6068j18556D0754
12209E32343E3338N1351m3526J29076J69904j8185J15072B9165a92271A63776
12198D65077i2872B70121a640B19351J326J09483j57103F3203J42535h9124B8183
$$ y = [33393, 7941, 173209, -83222, 84826, 62764, -217385, -220134, 7543, -303036, 282252, 273673, 310273, -104447, 10772, 121398, 94430, -73560, -291904, 11956, -365341, 114903, -74088, 80487, 17437, -94643, 54021, 135829, 156956, -14505, -82387, 233244, 172602, -157148, 107266, 153340, 68541, 131579, 109318, 28638, -57925, 254927, 21631, -182660, 237771, 145038, 297419, -286163, 49086, 197475, 321755, 133566, 153292, 252005, 276798, 87424, 64631, 72049, -382329, 205306, -1230, 21373, 115042, 208113, 94922, 478992, 392924, 274368, 40754, 532343, 53338, 104689, 61163, 190239, 360143, 341958, 457030, 29165, -192271, 163776, 465077, -92872, 270121, -1640, 219351, 220677, 330160, 173057, 63203, 205738, -89124, 28183]
12186A55170J13361J23049A34848D3600M16812E1913J76832I0022J19631n9659
12176A49994Q7969B3559k41L08569A36067b08256D20320J8828a09823q1814A73736
12164B59733J56660A32878J93156a39478a1411A10801K98277B1701K55319N9770
12154C36790B6125K06698b7074A84624a2344I2899J15939M1201e4983A42093J21540
12143B63633A2698J22750k9769K1834D1293L0659M24809p5016A19279Q0801K35706
12132D35786M2229B38036R423k1606J74458c17148E88187d6150H9486J85020j32460
12121A42046R8030d6733C43333r6106A9820P2410C0106I34d90093A52406M2966
12110A95372D9917R6438o6445g0265A42420C7647I14L93885d2349A018c099B06939
$$ y = [155170, 268531, 391580, 134848, 43600, 460412, 51913, 228745, 90022, 209653, 149994, 237963, 23559, 23318, 331887, 136067, -208256, 420320, 439148, -109823, -191637, 173736, 259733, 416393, 132878, 326034, -139478, -11411, 110801, 409078, 21701, 277020, 336790, 26125, 232823, -27074, 184624, -12344, 92899, 208838, 250039, -54983, 142093, 263633, 12698, 135448, 105679, 127513, 41293, 71952, 496761, 421745, 119279, 200080, 435786, 478015, 238036, 247459, 225853, 400311, -317148, 588187, -46150, 89486, 274506, 142046, 240076, -46733, 343333, 247227, 19820, 92230, 30106, 934, -490093, 152406, 195372, 49917, 146355, 79910, -70265, 142420, 37647, 914, 394799, -42349, 1018, -3099, 206939]
12097E0655a59027P1834o5963C66585d3733C6912J11357i3531A61249H804J20416
12086A29220K0414L2473K0105a0122l0017j66187c3100q7231L6020E8044a32953
12074a01480n2413B12893b44500d4639C2897B738J23462a49525n3963J2567i5169
12062B87222a61430G5423f1939L0055B63915E8492j6793h2640F4036c1534A9286
12050f4419B37166h7701B33053A13926A7331P6705h0181a6149a394k29934Q3470
12039a47858D66894k3457A53622b2370M8k92531d4073A40781D6205d9597H360
12027a64662g4082j87081h4100H2330D0369a78855j73642h6163H4897Q5307m5273
12016A24931A0641a23044G1682a09206J1730B8588Q8813J2294i9446j85555d3465
$$ y = [50655, -159027, -87193, -153156, 366585, -43733, 36912, 148269, -93531, 161249, 8804, 129220, 149634, 182107, 202212, -10122, -40139, -206326, -33100, -120331, -84311, 58044, -132953, -101480, -153893, 212893, -244500, -44639, 32897, 2738, 126200, -149525, -203488, -190921, -95169, 287222, -161430, 75423, -61939, -31884, 263915, 58492, 41699, -82640, 64036, -31534, 19286, -64419, 237166, -87701, 233053, 113926, 17331, 94036, -80181, -16149, -1394, -231328, -147858, 466894, 443437, 153622, -22370, -22322, -314853, -44073, 140781, 46205, -49597, 8360, -164662, -74082, -261163, -84100, 82330, 40369, -178855, -352497, -86163, 84897, 170204, 124931, 10641, -123044, 71682, -109206, -97476, 28588, 117401, 129695, -99446, -285001, -43465]
12004b27531a06984E5029e6103k86472A8419R1620c23854B3633d8132h281A97486
11992a39059A71528H3756d09961J98087d4453C21896i69j0108o6976B19118i133
11980h918A72167F3368a70044g4031F0606R0454l544c1753B46054C5873c0430
11968B41861b63252D0859P4173R7731G9730e05n0322D6908a10793B27292L8376
11957B65668b64471J16937p8038C92516a79224i913m6560k50186a06698j73207
11947b79905O0671E8426Q7694A5120g0691J5649k68787H9908a59078q7609a16724
11935G9721J83401a95325j15926d4660J7836H5694J20783p6549M1134a95347d1650
11923F9770B3727a02193D063R464J78144a56810L8514j14602H2505k6178A8823
$$ y = [-227531, -106984, 55029, -56103, -342575, 18419, 110039, -323854, 23633, -48132, -8281, 197486, -139059, 171528, 83756, -409961, -211874, -44453, 321896, -969, -11077, -78053, 219118, -9133, -8918, 172167, 63368, -170044, -74031, 60606, 151060, 147516, -31753, 246054, 35873, -30430, 241861, -263252, 40859, 115032, 212763, 79730, -505, -50827, 46908, -110793, 227292, 265668, -264471, -147534, -225572, 392516, -179224, -9913, -56473, -306659, -106698, -279905, -219234, 58426, 146120, 15120, -70691, -55042, -323829, 89908, -159078, -246687, -116724, 79721, 263122, -195325, -311251, -44660, -26824, 85694, 206477, 129928, 171062, -195347, -41650, 69770, 23727, -102193, 4063, 13527, 191671, -156810, -118296, -232898, 82505, 56327, 18823]
11911i9249j94853J28524C05309H1474d30256e6777j08270A43652c16035a46317
11900A05173P9276d02315C47124c1509o3001F6687j4762J37851C7099b8964A20928
11888a18002p3768D8066O2198c11689R1970h6678B06548b00436j06917h1411A20026
11876D1107b08459B3430O811a54060C8069J58378a07650a4080j84241I311g6397
11864E5541N1079h750j96193b2386q2529J4700l0048B21233e4873C63031j13901
11853B49130e9101r9967A34240e8325H1761c19589a46853A42498D198K9953J22558
11842A56709D2908Q2863b3030A18572a24730g436n7550A34105a09084j71298J8986
11831b61396N0043i6554m047p8831O9116b5542D84461A28717g5365C66576a10004
$$ y = [-99249, -294102, -165578, 305309, 81474, -430256, -56777, -165047, 143652, -316035, -146317, 105173, 184449, -402315, 347124, -31509, -94510, 66687, 51925, 189776, 37099, -28964, 120928, -118002, -191770, 48066, 110264, -311689, -219719, -86678, 206548, -200436, -307353, -81411, 120026, 41107, -208459, 23430, 30241, -154060, 38069, 196447, -107650, -14080, -198321, 9311, -76397, 55541, 106620, -8750, -204943, -22386, -104915, -90215, -120263, 221233, -54873, 363031, 249130, -59101, -159068, 134240, -58325, 81761, -319589, -146853, 142498, 4198, 34151, 156709, 42908, 125771, -23030, 118572, -124730, -7436, -64986, 134105, -109084, -280382, -261396, -211353, -96554, -100601, -179432, -110316, -25542, 484461, 128717, -75365, 366576, -110004]
11819c9888p0100B2231a57357m9625c6838j1000A28805a74385j61467h3986A06557
11807g1318A56206b50615A45915j1225a52078A74663J65125j36572a41104h322
11796H5330f3699m9898C10254b15476N1476C74971F0435f4796e028j69279A58848
11784B22071b64689Q8310m6929C58042h2619q8196A34423b68750H7033M7136d6313
11772b48254a8201B2365g4067J3393D3102J1280I867N3851M7745a59077A38135
11760A58931G7893b21592A57003l9805E7306d9890j40247h6459L398j53495e6660
11748b1863k30485J5972A1961J28113J82317b52480a23733A97109b6427j80411
11738b06838K2719I6714b5499j32296o3719I1996h873G8557g3514j3900F983b22546
$$ y = [-39888, -109988, 22231, -157357, -206982, -36838, -47838, 128805, -174385, -335852, -83986, 106557, -71318, 156206, -250615, 145915, 134690, -152078, 174663, 339788, 203216, -141104, -8322, 85330, -63699, -113597, 310254, -215476, -164000, 374971, 60435, -64796, -5028, -174307, 158848, 222071, -264689, -176379, -223308, 358042, -82619, -170815, 134423, -268750, 87033, 134169, -46313, -248254, -18201, 22365, -74067, -60674, 43102, 54382, 9867, 63718, 111463, -159077, 138135, 158931, 77893, -221592, 157003, 117198, 57306, -49890, -190137, -86459, -83061, -236556, -56660, -21863, -252348, -236376, 11961, 140074, 322391, -252480, -123733, 197109, -26427, -206838, -184119, 96714, -25499, -157795, -221514, 91996, -8873, 78557, -73514, -87414, 6983, -222546]
11725F3138a92218q183C12751j01083j04236j1774A0644b15485D6948K27009i5094
11713A60516e1357B03796g0747C11052j41906K00881b31743a01542O142A76961
11702a00778G8597l4381a05483j59374A59704J28573F916M4194J62255a98320
11691A73356G0025O5935j4232J0008F2301K03829a47334A67072A1520J09806D2194
11679E0580J35848a27688C32399d9409r3390f867B03290g1272o8931C4858c5159
11667D9806c32622C27349a79237f0077k09698B58013b61833C7361O8656a76556
11656B08069P1129a00971L6797p5492F5255J19902p304b61577B08390a09730C5405
11644E093J86356b69142J29163D2734J07767a03503B0258a83812k721o2561j15403
$$ y = [63138, -192218, -200401, 312751, 211668, 107432, 95658, 10644, -215485, 46948, 273957, -95094, 160516, -51357, 203796, -70747, 311052, 169146, 370027, -231743, -101542, -95400, 176961, -100778, 78597, 44216, -105483, -264857, 159704, 288277, 6916, 51110, 213365, -198320, 173356, 70025, 135960, 121728, 131736, 62301, 266130, -147334, 167072, 11520, 121326, 42194, 50580, 186428, -127688, 332399, -49409, -142799, -6867, 203290, -71272, -140203, 34858, -35159, 49806, -332622, 327349, -179237, -60077, -269775, 258013, -261833, 37361, 106017, -176556, 208069, 279198, -100971, -64174, -139666, 65255, 185157, 177853, -261577, 208390, -109730, 35405, 5093, 191449, -269142, -139979, 42734, 150501, -103503, 20258, -183812, -186533, -249094, -364497]
11633c64497a11566I0062i5536d5731B03094i2063A05812C0540J0181a27795j93959
11622c21754J54039A93072p6663P0687b13992A40387a18973k3570E0142J52753
11612B02895q9268F807K94841b54422H7166l918K01872g0724A92892b45432e9281
11600A21530c71261f9486C39473C3641d0242D5720K5365d6622j22473o1905C36045
11588i6460B8056b82496C18008j8717h3121l1975p9231P0611I2114a64805B80087
11576a0764q3097F114M6920J2277j2795a77567b2700q8468A48715a75418F1039
11564B48298c49147a57561A72902o0402b57183a01051d85q0867B1562Q2679d3812
11552A40939k3894A8813F357J63759a06704N1929j23446H392e1531j72689C9646
$$ y = [-364497, -111566, 90062, -95536, -45731, 203094, -92063, 105812, 30540, 40721, -127795, -321754, -167715, 193072, 116409, 187096, -213992, 140387, -118973, -142543, 50142, 202895, 113627, 6807, 301648, -254422, 87166, 83248, 285120, -70724, 192892, -245432, -59281, 121530, -371261, -69486, 339473, 33641, -40242, 45720, 71085, -46622, -169095, -231000, 336045, -96460, 28056, -282496, 318008, 299291, -83121, -115096, -194327, -123716, 92114, -164805, 280087, -10764, -93861, 6114, 53034, 65311, 52516, -177567, -22700, -111168, 148715, -175418, 61039, 248298, -349147, -157561, 172902, 112500, -257183, -101051, -485, -81352, 21562, 104241, -43812, 140939, 117045, 18813, 6357, 170116, -106704, -54775, -178221, 8392, -51531, -224220, 39646]
11540A83851J36866A18159K77156b34104A37073a56000a6871F6728a09605L7273
11530g2332A58684b31552a6843B76641j936E8430c75072C2684p208M3054J23881
11519A92411D3618a7730C99826i6418B6888P460K8336K51209A40558A1847O3838
11508G5685R7783P3085H4509M2795a41131C7152g0755B20811C834a54568A52046
11496b40921P3705A59539b15B5074J50699E9438a00108B99310m6888q1303K67550
11485D38669A80418P0513g737I3854k1393i3446d1907D3929J61748q8711M0944
11474A57910c2698E63014A56680J59131b5625B14925a4197k93473i8017C7331
11463e6615B74137A32370J6812A6285L8644J69476K08334A11973h5411o9997B8588
$$ y = [183851, 320717, 118159, 395315, -234104, 137073, -156000, -16871, 66728, -109605, -72332, 158684, -231552, -16843, 276641, 274705, 58430, -375072, 32684, 25476, 68530, 192411, 43618, -17730, 399826, -96418, 26888, 34348, 62684, 313893, 140558, 11847, 75685, 173468, 246553, 84509, 127304, -141131, 37152, -70755, 220811, 3834, -154568, 152046, -240921, -167216, 159539, -215, 25074, 175773, 59438, -100108, 299310, 252422, 171119, 438669, 180418, 250931, -7737, 93854, 72461, -93446, -41907, 43929, 205677, 116966, 157910, -32698, 563014, 156680, 315811, -25625, 214925, -14197, -307670, -98017, 37331, -56615, 274137, 132370, 149182, 16285, 54929, 224405, 432739, 111973, -85411, -155408, 28588]
11451c63209A35969a3039j05529B15751c54984D70589g7720C3642i1181C17120
11440b1179B39836c55438A78395c4620A48563a32073B98903A45091e6704E2656
11429A93312n5737i6620A23036b66598D1780K05115e6815I4876L03484b56486
11418a6026A05879k832m2704a18160K9203C83651C9825b67034H3187J86024b53004
11406A93592l5057K80357a87156g9903B03432E9254H931e4984E730a64539G2737
11394E2245M3948a03259j02463H8414J03423F1106d3304j20623O4402K9645c3359
11382a09677e2470j41428g397q5807r6223P8400I9073b54439D6268K26686a86793
11370D788f5717a040B0988e234k14499P770a05716E9182J531b08256p3878H797
$$ y = [-363209, 135969, -13039, -118568, 215751, -354984, 470589, -77720, 33642, -91181, 317120, -21179, 239836, -355438, 178395, -34620, 148563, -132073, 298903, 145091, -56704, 52656, 193312, 137575, -96620, 123036, -266598, 41780, 246895, -56815, 94876, 398360, -256486, -16026, 105879, 103047, 60343, -118160, -88957, 383651, 39825, -267034, 83187, 269211, -253004, 193592, 158535, 438892, -187156, -79903, 203432, 59254, 8931, -54984, 5730, -164539, 72737, 52245, 96193, -103259, -205722, 88414, 191837, 61106, -43304, -163927, -99525, -69880, -33359, -109677, -52470, -193898, -7397, -93204, -189427, -111027, 99073, -254439, 46268, 272954, -186793, 4788, -65717, -1040, 20988, -5234, -219733, -211963, -105716, 59182, 60713, -208256, -282134, 8797]
11357F7178a03995q2796O2614A8805a16785d9764q7145l70143D6315L7470a61253
11345a8058k16749A08153E0613b48646A07813Q5555L8964c09232A24086Q0719
11335B04805g3256m6761A19556b84381Q7471H3514a51394f6510j79026F1537K47953
11324C09490e3677F0329g3528b8619j55455f8167a1004A16952c9419C99135a00146
11312b07532d2103a7449j12485A16106Q5658a10332B1727b42124A18707a32937
11301e020j01838j75912J05366h5501j5310d3732j4159j90319j79882A75325f8065
11289A89614q7087a25008A1150L16316d5958B12587j8393a82181c5750o3803k64507
11278c64060a20274K3886l4867K6023K6961B7924A1328a10819A87486J06798b03546
$$ y = [67178, -103995, -186791, -124177, 18805, -116785, -49764, -136909, -507052, 46315, 83785, -161253, -18058, -234807, 108153, 50613, -248646, 107813, 193368, 232332, -309232, 124086, 204805, -73256, -120017, 119556, -284381, -196910, 83514, -151394, -66510, -245536, 61537, 309490, -53677, 60329, -73528, -28619, -184074, -68167, -11004, 116952, -39419, 399135, -100146, -207532, -42103, -17449, -129934, 116106, 201764, -110332, 21727, -242124, 118707, -132937, -5020, -106858, -282770, -177404, -85501, -100811, -43732, -57891, -248210, -428092, 175325, -68065, 189614, 102527, -125008, 11150, 327466, -45958, 212587, 194194, -182181, -35750, -99553, -364060, -120274, -96388, -131255, -105232, -78271, 27924, 11328, -110819, 187486, 294284, -203546]
11266D3941J70893a08845q0210c3373H1223h921m594H6222a02740j33625Q7491
11255a48874m5188d7460m1553a2756j62734A87156a37714j0305j96784F033a97391
11243d78462h0919i068A53615A1311R1979A5452b91820B8723a25800A9884H082
11231d2025j15646D18445k08577F4237N7159K0310a6590B07815H3906P9821g078
11219i7752I3299b53272B87321I5310a69299k2932j16129J44196B8854a07266
11208d3237G665J04461a75436E1412a77386H6052e5985d635m60195a27628G4815
11196B25163a43252q0590A24934k3076c56347a68962B0810g7112n0607B5461J06721
11185A32182g8508H7216Q2078E812d6494e289A7399b61623i879H3788g8304j77824
$$ y = [43941, 214834, -108845, -189055, -33373, 81223, -8921, -13515, 86222, -102740, -236365, -148874, -194062, -47460, -89013, -12756, -175490, 187156, -137714, -148019, -344803, 6033, -197391, -478462, -80919, -9068, 153615, 11311, 103290, 15452, -291820, 28723, -125800, 19884, 8082, -42025, -157671, 418445, 209868, 64237, 121396, 141706, -16590, 207815, 83906, 163727, -7078, -97752, 93299, -253272, 287321, 95310, -169299, -192231, -308360, -164164, 28854, -107266, -43237, 7665, 112126, -175436, 51412, -177386, 86052, -55985, -4635, -464830, -127628, 74815, 225163, -143252, -223842, 124934, 101858, -356347, -168962, 20810, -77112, -127719, 25461, 132182, -78508, 87216, 169294, 5812, -46494, -5289, 17399, -261623, -9879, 83788, -78304, -256128]
11173b56128C49840d9517A74512b60731K3347E0123g7444G7899a10136A70971
11162a31997B3827K40943b55040P2383c2040q8327b0739j48760A19203A0044L3452
11151D3496O5267a23526f955j63307A09178B2903a32652F6950J2334b38073j89386
11140d27459C4343a93759C06857b28021B97786F1708c4770B57520a15427C9907
11129b95072J37097J3469A28003a67378A3723J71316p5677M8984M1050r0381L5429
11118A44444b8959j32260b6624A3173M4792e3683A18982l5993N2789b47354E6708
11106b71614b3957B50179a88565Q4703A42263P0207j3695P6013q9918D0898K29498
11095B70396i5169B92261h1844B73198b0203A10862e8938C01687d1365B99572
$$ y = [-256128, 349840, -49517, 174512, -260731, -237384, 50123, -77444, 77899, -110136, 170971, -131997, 23827, 264770, -255040, -182657, -32040, -120367, -20739, -169499, 119203, 10044, 43496, 108763, -123526, -6955, -170262, 109178, 22903, -132652, 66950, 79284, -238073, -427459, 34343, -193759, 306857, -228021, 297786, 61708, -34770, 257520, -115427, 39907, -295072, -157975, -144506, 128003, -167378, 13723, 185039, 109362, 158346, 199396, 109015, 144444, -28959, -161219, -26624, 13173, 57965, -53683, 118982, 82989, 135778, -247354, 56708, -271614, -23957, 250179, -188565, -103862, 142263, 212470, 198775, 274788, 184870, 40898, 270396, -95169, 292261, -81844, 273198, -20203, 110862, -58938, 301687, -41365, 299572]
11084H7343a01596C45172g5788E1680j8295J18664N5715m6895a393A00294F466
11072B3023K35837D8767K18464k6736A1297L33652I8094K39669B1090M27197O3237
11061E11524a0847C14255P523j10065J76331J07387j45890J85139A46138K52679
11051C98817R5410M0595R2027k60395K5242k9078K14866n2220K0200R3873K4211
11040F63548o4196M9741q1164m5757L73725D05895J54889M49945n7605J34795
11030A087919m36822j29335k23j12007L42438O826k33994J81680j65590M1934
11020E82826O5442Q3679k79660p0912Q0579L26791C92154Q5655K77020B58537
11009D43331J67316j02250m3499k4358J57165n3971J74477k82827M2016p2389
$$ y = [87343, -101596, 345172, -75788, 51680, 33385, 152049, 207764, 160869, -1393, 100294, 6466, 23023, 258860, 48767, 267231, 240495, 11297, 344949, 98094, 337763, 21090, 448287, 511524, -10847, 314255, 321778, 211713, 388044, 495431, 349541, 534680, 146138, 398817, 494227, 534822, 626849, 366454, 391696, 362618, 577484, 525264, 545464, 639337, 663548, 599352, 649093, 567929, 522172, 895897, 405895, 560784, 1010729, 953124, 1087919, 651097, 521762, 521539, 409532, 751970, 758796, 524802, 706482, 540892, 582826, 648268, 731947, 452287, 381375, 461954, 788745, 392154, 477809, 754829, 258537, 443331, 610647, 508397, 464898, 440540, 597705, 543734, 718211, 435384, 477400, 405011]
10999D05011A70985J68957J85294N4230o5378j36877N3568L6615R2507J72550
10989G32451k08813j04020J70008R6385A78314L00152J1973L84518J19076m35658
10979E58375L81995k37870J9692k53776L22632L09019n38250L73914K64924J10089
10969A310744l02700N82147O6969K18934K87930J81610o0245L79172m2755k35009
10959B386797l35902k46492m81977k45006R7971q5967j45723j6842J61450R8369
10949A186678Q0461l19745j9726j28520R8661l33119M35473k23855l75568A66504
10938B55746J41759K870H9937J36812H3638K9893k653Q398B1616J65457J5266
10927B02339a2709k42554J5433D27217C0189J19764j5812n2896c48351B2162N8410
$$ y = [405011, 170985, 339942, 525236, 579466, 514088, 377211, 430779, 467394, 559901, 732451, 523638, 419618, 589626, 686011, 178314, 478466, 490439, 874957, 994033, 558375, 940370, 702500, 722192, 468416, 791048, 1100067, 561817, 935731, 1200655, 1310744, 1008044, 1590191, 1657160, 1876094, 2164024, 2345634, 2285389, 2664561, 2621806, 2386797, 2050895, 1804403, 1322426, 1077420, 1175391, 1089424, 943701, 926859, 1088309, 1186678, 1267139, 947394, 927668, 799148, 897809, 564690, 1000163, 776308, 400740, 166504, 255746, 397505, 400375, 89937, 226749, 83638, 113531, 110878, 119276, 21616, 187073, 202339, -12709, -255263, -239830, 427217, 30189, 149953, 134141, 81245, -348351, 22162, 80572]
10916H0572b19420A81337g1795j07227I6133a13428A3799J78155m1963G4231R86
10905G5217A0361B138a68068j39806J28618o6032A36953c34933d6242J8843j0927
10894c8326p7026A74397i8980d1281j93962A84500a33436A33347a11753j46004
10884b57757j06391i4253A1560b68218c9344q6948b6241A0105b40154h7092A03498
10872a20553p1969B09658E2598K38973j39376c02753A93154a6320j12608B59974
10861a88975H1423f5812j07791A30007A593P2456c68115g4767I2813A2277K60886
10850B73163a22220j12935O8394G7994i6656D9145b695B42842A497K22250n2403
10839A71344a31057j5737K1083d8855A50911C8717b25261n1958A75703l0365d9498
$$ y = [80572, -219420, 181337, -71795, -179022, 96133, -113428, 13799, 191954, 149991, 74231, 75217, 10361, 2138, -168068, -307874, -179256, -245288, 136953, -334933, -46242, -27399, -38326, -115352, 174397, -98980, -41281, -235243, 184500, -133436, 133347, -111753, -257757, -364148, -94253, 11560, -268218, -39344, -126292, -26241, 10105, -240154, -87092, 103498, -120553, -192522, 209658, 52598, 291571, 152195, -302753, 193154, -16320, -128928, 259974, -188975, 81423, -65812, -173603, 130007, 1593, 74049, -368115, -74767, 92813, 12277, 273163, -122220, -235155, -166761, 77994, -96656, 49145, -2695, 242842, 1497, 223747, 171344, -131057, -146794, -125711, -48855, 150911, 38717, -225261, -277219, 175703, 145338, -49498]
10827I2376a9298A66489M7276A02318L32573a99609B2401m782C652J07946C2798
10815E2963e6481K7952J0372A29588b00829A87503J49454d25920a97806g0158
10804f4732I4825e892k73413i6282A11421a21288j6886C6722a62756L1116A72339
10792A64963R760m7220i4162j77400E7290A3038R0549a71716n0047A53000o8799
10781H4201c7250j90442m197C12087B006a14382C88846a48067k66217A56347f6995
10769A04021b1259E26333e4128m9399l38319e9596b6796D6064a77849k4985E4810
10757A47677a64598H159d07706J16111c2010j17616G6129a70260Q4882l2710j61639
10746b79727H8012M679L0822n9074A617e3714D9156L5131L9575J14210b23109
$$ y = [92376, -19298, 166489, 213765, 102318, 434891, -199609, 22401, 17619, 3652, 111598, 32798, 52963, -56481, -28529, -18157, 129588, -200829, 187503, 336957, -425920, -197806, -70158, -64732, 94825, -5892, -279305, -96282, 111421, -121288, -138174, 36722, -162756, -131640, 172339, 164963, 174723, 127503, -94162, -271562, 57290, 13038, 103587, -171716, -221763, 153000, 84201, -37250, -227692, -231889, 312087, 2006, -114382, 388846, -148067, -414284, 156347, -66995, 104021, -21259, 526333, -54128, -103527, -441846, -59596, -26796, 46064, -177849, -202834, 54810, 147677, -164598, 8159, -407706, -291595, -32010, -149626, 76129, -170260, -85378, -118088, -279727, 88012, 92691, 123513, 64439, 1617, -53714, 49156, 84287, 123862, 238072, -223109]
10734b28337A29781i5190B81421h8145j02506A03734K78314b45125g0794k03688
10724b74482g1477D6496b06524A27787h047l13431c6883C2367b60F7141K2231
10713H9372J54860b75248A19513j3290b66809b9375j25380J8500e8383k15288
10703b73671Q5461d3757k20984f8224A75325k0361a95165k58308a69940N2670
10693a17270J1199E4110a03255j70844J1342P8874G238J61801A1058f6335J8373
10682d7962B88859e4198l54921B04745f0903A53964n2316K6999b0665A37690e6608
10670b09892d1028k59943F7141d49114J65135A43651l3951a40904A28843P7372
10660B06215a56966K0788L4607j59863J24881j23182C0482a1052j35763C10784
$$ y = [-228337, 129781, -95190, 281421, -88145, -190651, 103734, 382048, -245125, -70794, -274482, -71477, 46496, -206524, 127787, -8047, -321478, -36883, 32367, -260, 67141, 89372, 244232, -275248, 119513, 106223, -266809, -29375, -154755, -136255, -58383, -273671, -188210, -43757, -264741, -68224, 175325, 154964, -195165, -453473, -169940, -117270, -106071, 54110, -103255, -274099, -262757, -183883, 7238, 169039, 11058, -66335, -47962, 288859, -54198, -409119, 204745, -60903, 153964, 101648, 128647, -20665, 137690, -56608, -209892, -41028, -300971, 67141, -449114, -283979, 143651, 109700, -140904, 128843, 206215, -156966, -136178, -101571, -261434, -136553, -259735, 30482, -11052, -146815, 310784]
10649b96891F5605j9610J19450B6037a66980F8440d3032r3766D4636I806a79501
10637c2406m9223A3757d05005A1850d2626F9527b90709B0445a19602n550I4018
10625d9722r3076f4696A44288D7854Q2121a35333l5638A87466F5271J9942b17358
10613b29168k6519a19084B05044a58771b2504k36783e7682E5185b41709B4789
10602I6165j9636b26316H8364a06575C1439J72654h0332C0507b40023C74033b11456
10590G2869B6562a11625d5170r7197q3247j79560J40104b0421m34863g7163A324
10578A70109g6265C25569D4362L9920a57209o8043K8031R6656n5898K3800A23823
10566B87a13317j41390A21171a26625M8132B19402g3895A32431c00574a1892B64107
$$ y = [-296891, 65605, 45995, 165445, 26037, -166980, 68440, -43032, -136798, 44636, 9806, -179501, -32406, -81629, 13757, -405005, 11850, -42626, 69527, -290709, 20445, -119602, -125152, 94018, -49722, -142798, -64696, 144288, 47854, 129975, -135333, -170971, 187466, 65271, 85213, -217358, -229168, -255687, -119084, 205044, -158771, -22504, -259287, -57682, 55185, -241709, 24789, 96165, 76529, -226316, 88364, -106575, 31439, 204093, -80332, 30507, -240023, 374033, -211456, 72869, 26562, -111625, -45170, -142367, -225614, -405174, -265070, -20421, -455284, -77163, 1324, 170109, -76265, 325569, 44362, 84282, -157209, -225252, -197221, -100565, -156463, -132663, 123823, 287, -113317, -254707, 121171, -126625, -78493, 219402, -73895, 132431, -300574, -11892, 264107]
10554A03296d4129j25707B12634J53216d3382o0033c7917j5455L775l18719J0195
10543c58121b8097A83971r1238a50565C19202b16807e5701A25434a28257k28982
10533c57239B85303P1939c2622l38971j16562a89571J7934L6426q037J354p7922
10522b19816A39685c8449l24053f0742C24391a76471D0263f3395k42159A10360
10511B219J01106a07384L8278j28374J2235A40146c6140r4672k20872a55604K9855
10500a25749L7869j8344b278A34327d3939k83838A90178m6865A4752a35685j7214
10489a52899j95619h7161M2546B32351H6618a44777c9696j34769c2320A59507
10478h3985B35298L2183H2684K72179A34313D7279J77217K27766j83981B473J12316
$$ y = [103296, -44129, -169836, 212634, 365850, -43382, -103415, -37917, -53372, -49597, -368316, -358121, -28097, 183971, 92733, -150565, 319202, -216807, -55701, 125434, -128257, -357239, 285303, 357242, -32622, -371593, -488155, -189571, -171637, -135211, -143248, -141894, -219816, 139685, -38449, -362502, -60742, 324391, -176471, 40263, -63395, -305554, 110360, 2219, 103325, -107384, -69106, -197480, -185245, 140146, -36140, -130812, -351684, -155604, -125749, -87880, -106224, -2278, 134327, -43939, -327777, 190178, 143313, 14752, -135685, -152899, -348518, -87161, -44615, 232351, 86618, -144777, -39696, -174465, -32320, 159507, -83985, 235298, 267481, 82684, 354863, 134313, 47279, 224496, 452262, 268281, 2473, 114789]
10467A14789K54764A1409K0725i1634A36738l8811k3210i0451n5059f4650A03390
10455c586B3458c58168a31853C9049b08816D8846b14016e9011k3279G6988b28670
10443H2368J54241b43370J09600k1535a9853k09044Q2623A24778Q3092b79406
10432A57671c66496b6424j32108K4965I7742A1855a76336k77541B64714h3178
10421f1151I9486d7630J1923A09327c40911G0653R6411G3470a81719f5373I4970
10409A31869b03120O1784l6173A51944J6255G1927L0741c73447A06335b8936C9030
10397f8033A16192g572k07597B02457C4756b8257A171a69167A38805a36888A50759
10385A99498J09148F4634N0791b01395D9212R994b9263B10775q5339a38885A48524
$$ y = [114789, 369553, 11409, 32134, -91634, 136738, 97927, 74717, -90451, -145510, -64650, 103390, -3586, 23458, -358168, -131853, 39049, -208816, 48846, -214016, -59011, -82290, 76988, -228670, 82368, 236609, -243370, -133770, -155305, -19853, -228897, -146274, 124778, 207870, -279406, 157671, -366496, -26424, -158532, -133567, 97742, 11855, -176336, -453877, 264714, -83178, -61151, 99486, -47630, -35707, 109327, -340911, 70653, 167064, 73470, -181719, -65373, 94970, 131869, -203120, -141336, -177509, 151944, 168199, 71927, 102668, -373447, 106335, -28936, 39030, -68033, 116192, -7572, -215169, 202457, 34756, -28257, 1171, -169167, 138805, -136888, 150759, 199498, 308646, 64634, 115425, -201395, 49212, 59206, -29263, 210775, 125436, -138885, 148524]
10373A67176K531L4005a9744A61736N5264R6751j40381G2456j1562J80255L24268
10362E65417A18272L00901O4123M1914j94879J67330k10210J62489B21623E3485
10351h393C25540j13398J33257j53539n2299M05898j93312K11232k58297j32000
10341A73082A2757J35974D2815j6020L12664a57982A96252B8921c57961A92417
10330A20634b08336A06453J19495d9182B26856g5124J0636P555A53044h5484j7058
10319a02542A10073K16957i320A74887a65914m6621g0764E585L46997a48579d592
10307c7986A41968f2927k0575B41541D0100P135a67225g9318C4874g2896b569
10295A80165J84680b36813B8362a13780A51728a96396A83654a0574D12669a1763
$$ y = [167176, 169707, 203712, -19744, 161736, 217000, 313751, 173370, 72456, 60894, 241149, 565417, 118272, 419173, 483296, 525210, 330331, 497661, 287451, 449940, 221623, 53485, -8393, 325540, 212142, 345399, 191860, 139561, 545459, 352147, 563379, 305082, 173082, 12757, 148731, 42815, 26795, 339459, -157982, 196252, 28921, -357961, 192417, 120634, -208336, 106453, 225948, -49182, 226856, -75124, -64488, -56933, 153044, -85484, -102542, 110073, 327030, -9320, 174887, -165914, -212535, -70764, 5585, 352582, -148579, -4592, -37986, 141968, -62927, -83502, 241541, 40100, 47235, -167225, -79318, 34874, -72896, -2569, 180165, 364845, -236813, 28362, -113780, 151728, -196396, 183654, -10574, 412669, -11763]
10284b50000g2130D2253j3538c05193c1340E3882c21072J08758C7229J15176B3582
10272a85181L7905B9970e17827h49D0340c80863J80074j13415e2834o4713j89809
10261c07356k0721G409a6157m1680F5356J98090g8338m5096o9703Q7913C29487
10249A69215k348M8618a29704A41895J29639b0740D4846E601J10758I347a61882
10237h1320j26777j55656a7757H8173h06A16659c61433E1935f2023B02042b9560
10225b26097e6770I3182d3875F0522e1988j78825H8139i3923j63134A52695a23963
10213F5750b0876j36322A3722a13537G8453a92925p900N5065j5948b4371n0664
10202g5035A19842a27258k0538k7776B0576Q1692R7031g4602L0534A72997J48340
$$ y = [-250000, -72130, 42253, 28715, -305193, -31340, 53882, -321072, -212314, 37229, 152405, 23582, -185181, -147276, 29970, -517827, -849, 40340, -380863, -200789, -314204, -52834, -117547, -307356, -328077, 7409, -16157, -57837, 65356, 263446, -78338, -123434, -193137, -105224, 329487, 169215, 166867, 215485, -129704, 141895, 271534, -20740, 44846, 5601, 116359, 9347, -161882, -81320, -208097, -363753, -17757, 88173, -806, 116659, -361433, 51935, -62023, 202042, -29560, -226097, -56770, 93182, -43875, 60522, -51988, -230813, 88139, -93923, -257057, 152695, -123963, 65750, -20876, -157198, 13722, -113537, 78453, -192925, -200825, -145760, -161708, -24371, -75035, 119842, -127258, -147796, -175572, 20576, 102268, 199299, -74602, -44068, 172997, 321337]
10191C21337c25878A50682a74982g9142j25094b6373j6550j39492M531M9169e6315
10179f3294l6913A23269l7732g0368j9863a4718E0082a42189r6245R3183I2204
10167b41814a1393p841l06973J03319d7151k79907E672h065k99250g9034A20062
10155f3200a695n0389k88120G0233g0566m21565F1475a76816Q4553B74344b1220
10143B56832a42622E0946c40990d2628A09387A6436a72597e5932k9688K9853b2188
10131C13676e9544G4077R7935d20951a49571k5244r0942m6300a0083B54704a31394
10119D0272A326c30331A7807B714O8705J1853c00076a44623e4107l6061A13a49902
10106g4283b3958m6863l3546j91067a3649p4876l5168b8137k62950O0192C4953
$$ y = [321337, -325878, 150682, -174982, -79142, -204236, -26373, -42923, -182415, -177884, -128715, -56315, -63294, -100207, 123269, 85537, -70368, -90231, -14718, 50082, -142189, -238434, -145251, 92204, -241814, -11393, -19234, -326207, -222888, -47151, -327058, 5672, -8065, -307315, -79034, 120062, -63200, -1695, -52084, -340204, 70233, -70566, -492131, 61475, -176816, -92263, 274344, -21220, 256832, -142622, 50946, -340990, -42628, 109387, 16436, -172597, -55932, -85620, -55767, -22188, 313676, -59544, 74077, 172012, -420951, -149571, -174815, -265757, -312057, -10083, 254704, -131394, 40272, 1326, -330331, 17807, 2714, 71419, 83272, -300076, -144623, -54107, -90168, 113, -149902, -74283, -23958, -70821, -104367, -295434, -13649, -88525, -123693, -28137, -291087, -230895, 34953]
10094a52496h425D4960h46B47377r0155d4104M273B94682j18109o0977J09815
10083B25411e9643j45992B56365b61424F576O5570L05073a57644e2711j77286
10073b29997C9024a98329A42420b77312A83015a2083d307D2309K65156d7146j00953
10062a48099A53313F8075d9471D75995b99143C8439J98543d07496F0566b25572
10051D2874a93444G6234f9060j29408k2298A85119R253a69018g4745B8672e5725
10039A27830b19050d482D1814O5432b01891G4043e15685A00171a79138n0991M6728
10028a83401A3085J36810b226m44783A26706F0915b09563B0007b17145A53595
10017I8587e1645k8200G6718b69870N7022K7667A70372a35134c3194B3512i662
$$ y = [-152496, -8425, 44960, -846, 247377, 157222, -44104, -39831, 294682, 176573, 115596, 225411, -59643, -205635, 256365, -261424, 6576, 72146, 377219, -157644, -52711, -229997, 39024, -198329, 142420, -277312, 183015, -12083, -4307, 42309, 307465, -47146, -148099, 153313, 68075, -49471, 475995, -299143, 38439, 236982, -407496, 60566, -225572, 42874, -193444, 76234, -69060, -198468, -220766, 185119, 194372, -169018, -74745, 28672, -55725, 127830, -219050, -4482, 41814, 107246, -201891, 74043, -515685, 100171, -179138, -230129, -183401, 13085, 149895, -2226, -447009, 126706, 60915, -209563, 20007, -217145, 153595, 98587, -51645, -79845, 76718, -269870, -212848, -185181, 170372, -135134, -33194, 23512, -9662]
10005E9293a30705A33237N6054d8728A18048k6919M7498N1186a58766F9189J29467
9994A98656d3119j97043A34437c37872a59480m5672r916A47493b67712A32748
9983b38279p6947J03460h6213d2328A259J76389e8964j11336j69252C174b52069
9971c145l43222J4134B14822a55788q0090B65700p0890K9834F7410a75207j33099
9960c08306C81554a22045O0349k00500r955a18303j27253N050J12749k9104j81996
9949c38857A53348J4789C9811a00576j71961J06879b6364A12166g407j38724K4670
9938a21461J4344A15797a7280B13513c48989B06771m5246M1998a96135O6722A14912
9926i5443k62586m2474A75129a65767k08232c3353F9729C1748g2049B12111b57169
$$ y = [59293, -130705, 133237, 189291, -48728, 118048, 91129, 138627, 189813, -158766, 69189, 198656, -43119, -240162, 134437, -337872, -159480, -205152, -215068, 147493, -267712, 132748, -238279, -315226, -211766, -86213, -42328, 1259, 177648, -58964, -170300, -339552, 3174, -252069, -3145, -346367, -332233, 214822, -155788, -235878, 265700, 194810, 224644, 67410, -175207, -308306, 381554, -122045, -61696, -262196, -272151, -118303, -245556, -240506, -127757, -156861, -338857, 153348, 168137, 39811, -100576, -272537, -165658, -26364, 112166, -7407, -146131, -121461, -107117, 115797, -17280, 213513, -348989, 206771, 161525, 203523, -196135, -129413, 114912, -95443, -358029, -400503, 175129, -165767, -373999, -33353, 69729, 31748, -72049, 212111, -257169]
9914a3543B55521g5348j92453q8370b2470k18499l00063i6484C01897b8182m7660
9903g5842j75701L3588d8783H5126J05678F4531d9605r0440A6471K08458D3067
9891b29144A84204b60924h4339H9632b80696J3005A61972b40617d4546E9522h5799
9879b34892A57820a7871k05610I107R0523q708l82b6123l8529A65772a07084B06466
9866A16801d2458n4155J6862B09906a85194j787g4547K3202B11247G5453a73018
9854i4542j64003B3224p523J29954R0785b86108b7065C7258P174P4253h4020n2423
9842a36443m1328A21745a2128A03824D7554b56838E8233F990N258a53478m920
9831a58398f929A7082a59208E9957K7461c73758h4517A37248a36014A5874K8295
$$ y = [-13543, 255521, -75348, -267801, -356171, -22470, -240969, -541032, -96484, 301897, -28182, -75842, -251543, -217955, -48783, 85126, 190804, 64531, -49605, -140045, 16471, 224929, 43067, -229144, 184204, -260924, -84339, 89632, -280696, -267691, 161972, -240617, -44546, 59522, -85799, -234892, 157820, -17871, -223481, 9107, 99630, 90922, 90540, -26123, -64652, 165772, -107084, 206466, 116801, -42458, -96613, -79751, 209906, -185194, -186981, -74547, -51345, 211247, 75453, -173018, -94542, -258545, 23224, 15701, 145655, 236440, -286108, -27065, 37258, 44432, 118685, -84020, -136443, -177771, 121745, -12128, 103824, 47554, -256838, 58233, 6990, 12248, -153478, -158398, -6929, 17082, -159208, 59957, 87418, -373758, -84517, 137248, -136014, 15874, 44169]
9820D4169M966d30586i1027A66129b08212A12029b56076F4238b50732A47037b90910
9808G2527a16152D8909K76j9962a99970D3291k0067Q3431f9172p9594q0538B2802
9795a83415c2800q9573L9772I903P2758b1613l20671I0234a7188q1319j93069
9784b91576d2193C74051h124D6f321j74995N8804G4808c07379g9264B3697a56970
9771d63354c0454H3169b25918g434j88027A80739A350J7921L881N8949c02166
9759d11688K01967k8673R4103j36252O1479K270I8888c03834d7835k20889i7449
9747c26291a49018K0359A50426j0148a3209l40443N1743n837B4832c5651K420
9736c3231p5665E6504c80121a83652l7018A69494e3304A55951F5338K04232g0644
$$ y = [44169, 49135, -430586, -91027, 166129, -208212, 112029, -256076, 64238, -250732, 147037, -290910, 72527, -116152, 48909, 49185, 29223, -199970, 43291, 23224, 106655, -69172, -148766, -229304, 22802, -183415, -32800, -122373, -82601, 9903, 82661, -21613, -342284, 90234, -17188, -98507, -291576, -42193, 374051, -8124, 46, -6321, -181316, -122512, 74808, -307379, -79264, 23697, -156970, -463354, -30454, 83169, -225918, -7434, -195461, 180739, 1350, 19271, 23152, 82101, -302166, -411688, -209721, -238394, -144291, -280543, -219064, -216794, 98888, -303834, -47835, -268724, -97449, -326291, -149018, -128659, 150426, 140278, -13209, -353652, -301909, -307746, 24832, -35651, -33231, -108896, 56504, -380121, -183652, -220670, 169494, -53304, 155951, 65338, 269570, -70644]
9724b34900A8113L23439i6815B05024f5539b9202o7564j80901d1914p3705j42637
9713b58256C09453h8401F7882J78271b42650H8812l1569K2040j6346h0898F5166
9701a52799c0729l8157d607F2769b51843A49694h3504j53721k3713D8844e28396
9689D0930b07613A30119E9415b72141a01670j89449A83439a91608l3862B28601
9678a85495C7740c25860Q8122j2053k6769J03518q4l4511A16802K9361g1576J8209
9666e3367l06144B00619a13094A04633A1276i6177n8653G2829a36781E6485b05090
9654d0541C8084a91510A50819E8800P5624i689A35045a38105G3564b41277C9629
9642E7263O9542e8346a3491n9209D08918c61820M6558a14376E372c3745E929K44338
$$ y = [-234900, 18113, 341552, -96815, 205024, -65539, -29202, -96766, -277667, -41914, -115619, -258256, 309453, -88401, 67882, 246153, -242650, 88812, 57243, 79283, 62937, -80898, 65166, -152799, -30729, -68886, -4607, 62769, -251843, 149694, -83504, -237225, -260938, 48844, -528396, 40930, -207613, 130119, 59415, -272141, -101670, -291119, 183439, -191608, -225470, 228601, -185495, 37740, -325860, -237738, -249791, -276560, -173042, -173126, -207637, 116802, 146163, -71576, -53367, -359511, 200619, -113094, 104633, 11276, -96177, -154830, 72829, -136781, 56485, -205090, -40541, 38084, -191510, 150819, 58800, 134424, -9689, 135045, -138105, 73564, -241277, 39629, 57263, 126805, -58346, -13491, -72700, 408918, -361820, -315262, -114376, 5372, -33745, 5929, 250267]
9630B50267b02599Q8762p0625F5363a84299O3827d7497C6520j7631c67131c3302
9618b48687p9712d8517o6644l3699D2848E547c2886B40613a2605j52845P8602
9607h6848a0230n6928D3809b72544L7294K4633n2974n9972i4175I7844C0507N7518
9595H8025a18376O367j44029B12800b45352B934g735l20274J45003b9131l7060
9584f6191k36935l5298B9093b17709l6710A36766n8181P0767c69855l4705B2618
9572A7763e0379G9441B4537R5777C3148g9424j71712B15124a83371F0842J2368
9561G3210a13731i026k219A21635R8834E7491k5295b00569A28601a62739j7996
9550a80735g3584f769B04529e8252j2707C09364g3486P053i305E9667j445d7480
$$ y = [250267, -202599, -113837, -184462, 65363, -184299, -120472, -47497, 36520, 18889, -367131, -33302, -248687, -328399, -48517, -115161, -148860, 42848, 5547, -32886, 240613, -12605, -165450, -86848, -10230, -67158, 43809, -272544, -235250, -210617, -263591, -323563, -94175, 97844, 30507, 88025, -118376, -112009, -256038, 212800, -245352, 2934, -7735, -328009, -183006, -29131, -66191, -303126, -338424, 29093, -217709, -254419, 136766, 78585, 149352, -369855, -404560, 22618, 17763, -50379, 79441, 24537, 120314, 33148, -79424, -251136, 215124, -183371, 60842, 73210, -113731, -9026, -11245, 121635, 220469, 57491, 32196, -200569, 128601, -162739, -180735, -73584, -6769, 204529, -58252, -70959, 309364, -73486, -66433, -9305, 59667, 58222, -47480]
9537f0387A80079i8751A50056a30130k8714m704b4245A24246b28564j69451c0282
9525f5139D9103K420c7895A9047A933b1124B34692f9759B8950F206M5966J73162
9513B25334J97927j76167b679j75270I2865Q9487f7468j74071G934a18725H9372
9501c3229J4185C51148b25584M3216A91067c98759B854b13554B54185O8854C1558
9489g200G0398c89234L5146a20439j37674d9227f537k53810e7342L233j29537
9478a83646A82093m5072c45575a55205k89033C057g6962J7112j9340A90415a89185
9466e3569j14821A7821K09093d33602A50904b21792R5138q9560d9475l824I9034
9454d0807A02237b90146E6901f5334H49J25402R8693i5098C60961c56621A62830
$$ y = [-60387, 180079, -98751, 150056, -130130, -158844, -163548, -24245, 124246, -228564, -398015, -30282, -65139, 49103, 51523, -37895, 19047, 1933, -21124, 234692, -69759, 28950, 6206, 52172, 225334, 423261, 247094, -2679, -177949, 92865, 182352, -67468, -241539, 7934, -118725, 89372, -33229, -19044, 351148, -225584, -182368, 191067, -398759, 2854, -213554, 254185, 323039, 31558, -7200, 70398, -389234, -354088, -120439, -258113, -49227, -6537, -260347, -57342, -54109, -183646, 182093, 137021, -345575, -155205, -444238, 3057, -76962, -59850, -79190, 190415, -189185, -53569, -168390, 17821, 226914, -433602, 150904, -221792, -126654, -216214, -49475, -53299, 99034, -40807, 102237, -290146, 56901, -65334, 849, 126251, 224944, -95098, 360961, -356621, 162830]
9442c44652i282k26511d8648A51750C0652c7082k3971j3187o3992C6742a09427
9430I1901b1639A7687a39981j61335A46504C9012c10773A57406a49041A68441
9419b75928a2150l0384n399A6101b5655j84122m6549g6292C2731c18260d5295
9407D1538b75603d5829B77538b04404k07744B99a13185j45871A10846a8098B8968
9395A798a63663L4433M1305j28082k70793b23340A68473a38395n9465d0211C06342
9383A32850c9406k32693b5302A72074M4488b6866j42068A10725b40057l30830
9373e70887A67364i119k58094i9336b5778j29510A19364b84387c6380E7535a45833
9361b0781p4903j96771A43751a09228l7551A1258J94096n8935J71243D5002b83965
$$ y = [-344652, -9282, -235793, -48648, 151750, 30652, -37082, -61053, -74240, -138232, 36742, -109427, 91901, -21639, 17687, -139981, -301316, 146504, 39012, -310773, 157406, -149041, 168441, -275928, -12150, -42534, -47933, 16101, -25655, -209777, -256326, -76292, 32731, -318260, -45295, 41538, -275603, -45829, 277538, -204404, -412148, 299, -113185, -259056, 110846, -18098, 28968, 1798, -163663, -129230, -87925, -216007, -486800, -223340, 168473, -138395, -197860, -40211, 306342, 132850, -39406, -272099, -25302, 172074, 216562, -26866, -168934, 110725, -240057, -570887, 167364, -9119, -267213, -99336, -25778, -155288, 119364, -284387, -36380, 57535, -145833, -20781, -95684, -292455, 143751, -109228, -146779, 11258, 205354, 146419, 317662, 45002, -283965]
9349A19228m986c5136o4061J7077A17338a24916A33424a36642q6117R2759H2764
9337A32117a715H863e1250j2039j08980D3626b20361B47999b51044d8437k5269
9326g3706H0502K23855i600D10986A81346b92825e0165N093q6458A70339b73957
9314A11978G602b98680A98493a2563A15604b04182C4564b904j9482C01939a35574
9302c6326r9018O3822b2632k73185O4445A69631K63005c01050G247b87255h0524
9290c16270C93432d37011a92098B09917b34597a12658d7587E229J74408f7210
9279c2778k06130A0244a09563q9077K3590B04931c78471B6845J05583b40589B15615
9267b91739b51k9110k16722g5417j13741d9202k6836C7577c5094B2468g0354a7349
$$ y = [119228, 114242, -35136, -99197, -82120, 117338, -124916, 133424, -136642, -222759, -130000, 82764, 132117, -1715, 8863, -51250, -63289, -172269, 43626, -220361, 247999, -251044, -48437, -73706, 80502, 304357, -9600, 410986, 181346, -292825, -50165, -45072, -131530, 170339, -273957, 111978, 7602, -298680, 198493, -12563, 115604, -204182, 34564, -2904, -22386, 301939, -135574, -36326, -135344, -71522, -22632, -295817, -231372, 169631, 432636, -301050, 7247, -287255, -80524, -316270, 393432, -437011, -192098, 209917, -234597, -112658, -47587, 5229, 179637, -67210, -32778, -238908, 10244, -109563, -198640, -175050, 204931, -378471, 26845, 132428, -240589, 215615, -291739, -251, -29361, -246083, -75417, -189158, -49202, -76038, 37577, -35094, 22468, -70354, -17349]
9254a82014C77876g9662k8817j19678j63446a88694C3727a93827j62785C1295
9243b18323F2610k6311d03892P8192G9490a18773n7931K9136I3186A3746L72405
9232C86151A63838b69307C22685b71481q4459B8214c7841B01874D4942J85239
9222B30181b67264f2091l67266i6552j45400J4875C314c45787E8328Q0979o2211
9211G7096b9251j7336j90590K2238A10450a22024e9593j61320A9437b36544G3128
9199H599h3916r9204A07106m2801J3180b6440b664j69138A43241b2012k65404
9188b87416M8471a16344A37699J26626a07097K7890A36008O9784C607J39359b01765
9176a48012o3131c7000A85165b54027H8412R4308a69228e5107C86718b31779f9462
$$ y = [-182014, 377876, -79662, -108479, -228157, -391603, -188694, 33727, -193827, -356612, 31295, -218323, 62610, 36299, -403892, -325700, 79490, -118773, -176704, -147568, 93186, 13746, 386151, 163838, -269307, 322685, -271481, -355940, 28214, -37841, 201874, 44942, 230181, -267264, -62091, -429357, -96552, -241952, -227077, 3314, -345787, 58328, 139307, 77096, -29251, -46587, -237177, -214939, 110450, -122024, -59593, -220913, 19437, -236544, 73128, 8599, -83916, -183120, 107106, 64305, 77485, -26440, -2664, -171802, 143241, -22012, -287416, -238945, -116344, 137699, 264325, -107097, -79207, 136008, 205792, 3607, 142966, -201765, -148012, -211143, -37000, 185165, -254027, 88412, 182720, -169228, -55107, 386718, -231779, -69462]
9164F0470f880I245P7228a74258A53683c89851D97585b16925i4097j92175B2547
9152I843h611n1325A8225J67899e4376C0816H538J57669a18736C00035a69019
9140C63381H2159g7296l9283A12852b81687a2012C02815b11864f6797H7306B0034
9128a35657M7676j12202b6354l15450a57707r1531a05207k37928a21085e899j59014
9117a64913l1323j6107I8735b53982g163o5576B37063c64266C103b69805j60851
9106d30656a4903k43533i1730j82399d8655f7A97265c88308B03363F6113b2964
9094b87959A11853J2746d35540A54094L85684b2835j35747F0804a55819c9571
9083E740J37921a3270k18169P6849c7977j05474A49572e6162j80332i2440a6872
$$ y = [60470, -6880, 9245, 86473, -174258, 153683, -389851, 497585, -216925, -94097, -286272, 22547, 9843, -8611, -59936, 18225, 186124, -54376, 30816, 8538, 166207, -118736, 300035, -169019, 363381, 82159, -77296, -116579, 112852, -281687, -12012, 302815, -211864, -66797, 87306, 20034, -135657, -87981, -200183, -26354, -341804, -157707, -249238, -105207, -343135, -121085, -5899, -164913, -196236, -212343, 98735, -253982, -7163, -72739, 237063, -364266, 3103, -269805, -430656, -14903, -258436, -91730, -274129, -48655, -67, 197265, -388308, 203363, 66113, -22964, -287959, 111853, 124599, -435540, 154094, 539778, -22835, -158582, 60804, -155819, -39571, 5740, 143661, -13270, -231439, -154590, -37977, -143451, 149572, -56162, -236494, -92440, -16872]
9071b17410N4127F336a63999q6382H4265a58159e0187C43983J2597B8442a29872
9059D3720d30316J62705I3891K4812a83613F3558a27398K6202F065a5338n2791
9048f8129k78411B04240o204a11880A3107c9108A61921J66418G909b43172N776
9037b37396R5502B87666a64980B9576a10752d1749q9968N1396H1548i7290j37894
9026b35184C6196J85096o0473b9247k06920k8972l2603O7976i9243E9407K12318
9015B71725C2791K31629C9066a06496C8119Q3733f3453n8096L2833k7336M9128
9004f6924n1931a1104B34026b72975A55797K05758i3991d0962k17426A37568c75011
8992a60977h0448o3281J0096Q531A58037a416k41053J19558c9863B54052c25573
$$ y = [-217410, -163283, 6336, -163999, -250381, 84265, -158159, -50187, 343983, 356580, 28442, -129872, 43720, -430316, -267611, 93891, 118703, -183613, 63558, -127398, -101196, 6065, -15338, -68129, -346540, 204240, 198036, -111880, 13107, -39108, 161921, 328339, 7909, -243172, -237396, -141894, 287666, -164980, 29576, -110752, -41749, -131717, -80321, 81548, -97290, -235184, 36196, 221292, 160819, -29247, -236167, -265139, -297742, -229766, -99243, 59407, 271725, 32791, 264420, 39066, -106496, 38119, 121852, -63453, -121549, -88716, -116052, -66924, -118855, -11104, 234026, -272975, 155797, 361555, -93991, -40962, -258388, 137568, -375011, -160977, -80448, -143729, -133633, -125102, 158037, -1416, -242469, -122911, -39863, 254052, -325573]
8980B52455I6311O1612a99393j22054j6907a06170q5551R1730G082f7869F8471
8968a23101k749B09098h8589a2942j62934B95844e0166G798N8710b18609L9468
8957a79141O6744F9615Q8234B2677d5104A04282i7296A72776a07136G0572a941
8945d87466J27531e0644o1549m57585c5286A46476M5578f6178m7957A52293B3353
8933b56437G1799M7437a16096A10015a80796a4793j19118L8367G4276c5441J1651
8922b3790k3329k64009d1526q6834B90133L90501B77430h7166l8342G3910a3542
8910B27397J07221f9736A72287a1282r0131C25887d4045A6212a05237J1867k4365
8899a17735L2618o0650j47693M5850A737J03897E2281c71995J44658a08065j3430
$$ y = [252455, 96311, 157923, -199393, -321447, -338354, -106170, -191721, -99991, 7082, -67869, 68471, -123101, -125850, 209098, -88589, -12942, -175876, 295844, -50166, 7798, 66508, -218609, -179141, -112397, 69615, 157849, 22677, -45104, 104282, -97296, 172776, -107136, 70572, -1941, -487466, -359935, -50644, -112193, -569778, -35286, 146476, 192054, -66178, -114135, 152293, 23353, -256437, 71799, 119236, -116096, 110015, -180796, -14793, -133911, -95544, 74276, -35441, -23790, -47119, -311128, -41526, -128360, 290133, 680634, 277430, -87166, -125508, 73910, -13542, 227397, 334618, -69736, 172287, -11282, -101413, 325887, -44045, 16212, -105237, -93370, -117735, -85117, -145767, -293460, -247610, 1737, 105634, 52281, -371995, -227337, -108065, -121495]
8888a21495A6276e6878D4292P04j6958E106M0311J24770b01094B4106b89625e4170
8875a21160e2783r8229A59257Q475f9877C15841G2497J65701I4297e14854h3653
8863B0640P8102i1602A86455a28653n6717c9698j86126D0234a48252f0716p4059
8852a34775D7876A2648J73755e3743o5210C3967c03572A19359m2706J35069a99757
8840H0570b44130B5967h9721A05087b47509b0175j60822H5722A997J45100m0447
$$ y = [-121495, 16276, -56878, 44292, 44996, 28038, 5106, 45417, 170187, -201094, 24106, -289625, -54170, -121160, -52783, -151012, 159257, 167732, -69877, 315841, 72497, 238198, 94297, -514854, -83653, 20640, 98742, -91602, 186455, -128653, -185370, -39698, -225824, 40234, -148252, -60716, -134775, 47876, 12648, 186403, -53743, -118953, 33967, -303572, 119359, 76653, 211722, -199757, 80570, -244130, 25967, -89721, 105087, -247509, -20175, -180997, 85722, 1997, 147097, 106650]
$$ [...]
##END NTUPLES=NMR SPECTRUM
##END=
