##TITLE=NES1024_9875_9266793_A0ksr01iBF
##JCAMPDX= 6.0         $$ Bruker NMR JCAMP-DX V2.0
##DATA TYPE= NMR SPECTRUM
##DATA CLASS= NTUPLES
##ORIGIN= BRUKER
##OWNER= Administrator
$$ 1.72 TOPSPIN		Version 2.1
$$ 2015-07-09 18:46:22.722 -0700  Administrator@X
$$ Compression mode = diff/dup
##.OBSERVE FREQUENCY= 400.02188249412
##.OBSERVE NUCLEUS= ^1H
##.ACQUISITION MODE= SIMULTANEOUS (DQD)
##.ACQUISITION SCHEME= undefined
##.AVERAGES= 64
##.DIGITISER RES= 22
##SPECTROMETER/DATA SYSTEM= spect
##.PULSE SEQUENCE= noesygpps1d.comp
##.SOLVENT NAME= COFFEE_meoh
##.SHIFT REFERENCE= INTERNAL, COFFEE_meoh, 1, 14.96398
##AUDIT TRAIL= $$ (NUMBER, WHEN, WHO, WHERE, PROCESS, VERSION, WHAT)
$$ ##TITLE= Audit trail, TOPSPIN		Version 2.1
$$ ##JCAMPDX= 5.01
$$ ##ORIGIN= Bruker BioSpin GmbH
$$ ##OWNER= Administrator
$$ $$ E:\/data/COFFEE/nmr/NES1024_9875_9266793_A0ksr01iBF/12/pdata/1/auditp.txt
$$ ##AUDIT TRAIL=  $$ (NUMBER, WHEN, WHO, WHERE, PROCESS, VERSION, WHAT)
(   1,<2015-07-09 18:46:15.972 -0700>,<Administrator>,<X>,<go>,<TOPSPIN 2.1>,
      <created by zg
	started at 2015-07-09 18:34:45.785 -0700,
	POWCHK enabled, PULCHK disabled,
       configuration hash MD5:
       21 0F 79 D6 B3 7B B4 F6 88 20 88 DB 03 48 BD 9F
       data hash MD5: 64K
       CF 9D 60 02 77 62 0E 9D BC E6 17 97 3F 73 B1 EB>)
(   2,<2015-07-09 18:46:19.410 -0700>,<Administrator>,<X>,<proc1d>,<TOPSPIN 2.1>,
      <Start of raw data processing
       efp LB = 0.3 FT_mod = 6 PKNL = 1 PHC0 = 0 PHC1 = 0 SI = 128K 
       data hash MD5: 128K
       0C 90 1E E2 D2 39 B2 D2 45 81 59 06 D7 86 F8 CE>)
(   3,<2015-07-09 18:46:20.566 -0700>,<Administrator>,<X>,<proc1d>,<TOPSPIN 2.1>,
      <pk PHC0 = -65.07751 PHC1 = 0 
       data hash MD5: 128K
       5A 27 F5 FF C8 75 90 22 19 F8 EF 4A D6 95 60 E5>)
(   4,<2015-07-09 18:46:21.253 -0700>,<Administrator>,<X>,<proc1d>,<TOPSPIN 2.1>,
      <abs ABSG = 1 
       data hash MD5: 128K
       AA 60 07 B3 B1 DD 95 E3 CA 18 47 36 B9 21 26 2B>)
(   5,<2015-07-09 18:46:21.660 -0700>,<Administrator>,<X>,<proc1d>,<TOPSPIN 2.1>,
      <abs ABSG = 2 
       data hash MD5: 128K
       A9 CA DF B2 D0 DA 78 93 BF D6 00 50 EE C0 CD 3E>)
(   6,<2015-07-09 18:46:21.785 -0700>,<Administrator>,<X>,<proc1d>,<TOPSPIN 2.1>,
      <abs ABSG = 3 
       data hash MD5: 128K
       40 6C 45 93 B9 27 6F C1 C2 39 8F 78 08 00 FA 5E>)
(   7,<2015-07-09 18:46:22.003 -0700>,<Administrator>,<X>,<proc1d>,<TOPSPIN 2.1>,
      <abs ABSG = 4 
       data hash MD5: 128K
       E6 9C F4 D7 25 BA A2 B0 65 D8 35 F4 17 06 37 96>)
(   8,<2015-07-09 18:46:22.113 -0700>,<Administrator>,<X>,<proc1d>,<TOPSPIN 2.1>,
      <abs ABSG = 5 
       data hash MD5: 128K
       07 AE 00 3D 1D 73 43 DB 61 57 E7 78 87 0E CD 7A>)
$$ ##END=
$$ 
$$ $$ hash MD5
$$ $$ 65 C9 7E 6C 8E 2F 47 47 77 0D F4 24 16 75 98 F6
##$RELAX= 
##$RELAX= 
##$RELAX= 
##$RELAX= 
##$RELAX= 
##$RELAX= 
##$RELAX= 
##$RELAX= 
$$ Bruker specific parameters
$$ --------------------------
##$DU= <E:\>
##$EXPNO= 12
$$ [...]
##$TP07= 0
##$TPNAME0= <>
##$TPNAME1= <>
##$TPNAME2= <>
##$TPNAME3= <>
##$TPNAME4= <>
##$TPNAME5= <>
##$TPNAME6= <>
##$TPNAME7= <>
##$TPOAL= (0..7)
0.5 0.5 0.5 0.5 0.5 0.5 0.5 0.5
##$TPOFFS= (0..7)
0 0 0 0 0 0 0 0
##$TUNHIN= 0
##$TUNHOUT= 0
##$TUNXOUT= 0
##$USERA1= <user>
##$USERA2= <user>
##$USERA3= <user>
##$USERA4= <user>
##$USERA5= <user>
##$V9= 5
##$VALIST= <valist>
##$VCLIST= <CCCCCCCCCCCCCCC>
##$VD= 0
##$VDLIST= <DDDDDDDDDDDDDDD>
##$VPLIST= <PPPPPPPPPPPPPPP>
##$VTLIST= <TTTTTTTTTTTTTTT>
##$WBST= 2048
##$WBSW= 25
##$XGAIN= (0..3)
0 0 0 0
##$XL= 0
##$YL= 0
##$YMAX_a= 8355019
##$YMIN_a= -17053808
##$ZGOPTNS= <>
##$ZL1= 120
##$ZL2= 120
##$ZL3= 120
##$ZL4= 120
##$ABSF1= 14.96398
##$ABSF2= -5.594202
##$ABSG= 5
##$ABSL= 3
##$ALPHA= 0
##$AQORDER= 0
##$ASSFAC= 0
##$ASSFACI= 0
##$ASSFACX= 0
##$ASSWID= 0
##$AUNMP= <proc_prof1d_extract.lims>
##$AXLEFT= 0
##$AXNAME= <>
##$AXNUC= <1H>
##$AXRIGHT= 0
##$AXTYPE= 0
##$AXUNIT= <>
##$AZFE= 0.1
##$AZFW= 0.1
##$BCFW= 0
##$BC_mod= 0
##$BYTORDP= 0
##$COROFFS= 0
##$CY= 15
##$DATMOD= 1
##$DC= 0
##$DFILT= <>
##$DTYPP= 0
##$F1P= 0
##$F2P= 0
##$FCOR= 0.5
##$FTSIZE= 131072
##$FT_mod= 6
##$GAMMA= 0
##$GB= 0
##$INTBC= 1
##$INTSCL= 1
##$ISEN= 128
##$LB= 0.3
##$LEV0= 0
##$LPBIN= 0
##$MAXI= 10000
##$MC2= 0
##$MEAN= 0
##$ME_mod= 0
##$MI= 0
##$NCOEF= 0
##$NC_proc= -2
##$NLEV= 6
##$NOISF1= 0
##$NOISF2= 0
##$NSP= 0
##$NTH_PI= 0
##$NZP= 0
##$OFFSET= 14.96398
##$PC= 1
##$PHC0= -65.07751
##$PHC1= 0
##$PH_mod= 1
##$PKNL= yes
##$PPARMOD= 0
##$PPDIAG= 0
##$PPIPTYP= 0
##$PPMPNUM= 2147483647
##$PPRESOL= 1
##$PSCAL= 4
##$PSIGN= 0
##$PYNMP= <proc.py>
##$REVERSE= no
##$SF= 400.020008445621
##$SI= 131072
##$SIGF1= 0
##$SIGF2= 0
##$SINO= 400
##$SIOLD= 131072
##$SPECTYP= <>
##$SREGLST= <1H.CDCl3>
##$SSB= 0
##$STSI= 131072
##$STSR= 0
##$SW_p= 8223.68421052631
##$SYMM= 0
##$S_DEV= 0
##$TDeff= 65536
##$TDoff= 0
##$TI= <>
##$TILT= no
##$TM1= 0
##$TM2= 0
##$TOPLEV= 0
##$USERP1= <user>
##$USERP2= <user>
##$USERP3= <user>
##$USERP4= <user>
##$USERP5= <user>
##$WDW= 1
##$XDIM= 131072
##$YMAX_p= 410394702
##$YMIN_p= -11407
##$CURPLOT= <Network HP LaserJet P1505>
##$CURPRIN= <$Network HP LaserJet P1505>
##$DFORMAT= <normdp>
##$LAYOUT= <+/1D_H.xwp>
##$LFORMAT= <normlp>
##$PFORMAT= <normpl>
##$SURQMSG= 1
$$ End of Bruker specific parameters
$$ ---------------------------------
##NTUPLES= NMR SPECTRUM
##VAR_NAME=  FREQUENCY,     SPECTRUM/REAL,   SPECTRUM/IMAG
##SYMBOL=    X,             R,               I
##VAR_TYPE=  INDEPENDENT,   DEPENDENT,       DEPENDENT
##VAR_FORM=  AFFN,          ASDF,            ASDF
##VAR_DIM=   131072,        131072,          131072
##UNITS=     HZ,            ARBITRARY UNITS, ARBITRARY UNITS
##FACTOR=    0.0627417313425164, 1,          1
##FIRST=     8223.62146879497, 718,          -52866
##LAST=      0,             3320,            -52709
##MIN=       0,             -11407,          0
##MAX=       8223.62146879497, 410394702,    0
$$ Real data points
##PAGE= N=1
##DATA TABLE= (X++(R..R)), XYDATA
$$ [...]
67331 212737 212543 212894 213974 215744 217656 219159 220449 222169 224336 226144 227043 227512 228446 230099 232013
67316 232013 233713 235123 236373 237572 238790 240051 241278 242346 243210 243947 244719 245692 246882 247950 248357
67301 248357 247864 246892 246237 246433 247443 248898 250485 252064 253534 254770 255781 256817 258091 259331 259833
67286 259833 259217 258025 257362 257966 259817 262489 265523 268425 270696 272148 273043 273837 274852 276210 277833
67271 277833 279492 281036 282563 284070 285121 285326 285198 285854 287622 289570 290827 291739 293082 294717 295964
67256 295964 296987 298708 301249 303532 304785 305577 306764 308190 309214 310009 311307 313035 314233 314601 315259
67241 315259 317436 320902 324280 326641 328216 329671 331304 333087 334990 336988 338945 340721 342249 343444
67227 343444 344268 344999 346153 348000 350422 353436 357323 361863 365884 368300 369398 370416 371898 373260 374026
67212 374026 374655 375767 377286 378856 380558 382597 384777 386867 389145 391972 395071 397860 400294 402748
67198 402748 405265 407549 409574 411545 413311 414581 415704 417493 420056 422598 424706 427131 430728 435077
67184 435077 438776 440894 441693 442073 442764 444036 445838 448065 450756 453968 457502 460991 464339 467814 471574
67169 471574 475382 478956 482302 485498 488491 491392 494601 498241 501696 504251 506078 508140 511138 514981
67155 514981 519264 523774 528321 532544 536253 539705 543228 546678 549573 551750 553663 556028 559294 563428
67141 563428 568019 572513 576534 580113 583533 586917 590069 592873 595677 599004 602857 606658 610000 613213
67127 613213 616928 621345 626266 631697 637887 644715 651483 657520 662732 667322 671314 674642 677547 680526
67113 680526 683949 687972 692712 698241 704379 710723 716919 722785 728245 733350 738353 743544 748968 754443
67099 754443 759819 765040 770040 774859 779851 785370 791122 796230 800303 804168 809122 815536 822609 829490
67085 829490 836128 842822 849417 855416 860764 866042 871801 878022 884384 890832 897608 904810 912182 919380
67071 919380 926350 933338 940591 948133 955826 963588 971428 979265 986816 993768 1000105 1006222 1012689 1019880
67057 1019880 1027782 1036139 1044752 1053558 1062378 1070776 1078444 1085683 1093105 1100792 1108161 1114946 1121841 1129672
67043 1129672 1138283 1146874 1155284 1164122 1173657 1183421 1193160 1203339 1214155 1224782 1234332 1243081 1251925
67030 1251925 1260950 1269460 1277346 1285562 1294948 1305234 1315533 1325412 1335123 1345071 1355317 1365516 1375260
67017 1375260 1384610 1394219 1404643 1415546 1425985 1435510 1444611 1453960 1463642 1473407 1483360 1494029 1505715
67004 1505715 1517977 1529806 1540379 1549806 1559078 1569138 1580028 1591129 1602034 1612827 1623576 1634072
66992 1634072 1644176 1654018 1663705 1673200 1682673 1692565 1703041 1713695 1723999 1733827 1743312 1752607 1762037
66979 1762037 1772157 1783224 1794785 1806159 1817196 1828237 1839467 1850700 1861788 1872856 1884050
66968 1884050 1895218 1905929 1915742 1924540 1932707 1940904 1949522 1958373 1966980 1975048 1982596 1989825 1997073
66955 1997073 2004770 2013199 2022240 2031463 2040397 2048720 2056369 2063606 2070783 2077883 2084444 2090168 2095438 2101015
66941 2101015 2107236 2113707 2119752 2125011 2129640 2134085 2138689 2143371 2147729 2151474 2154727 2157833 2161004 2164240
66927 2164240 2167480 2170683 2173843 2177034 2180368 2183822 2187126 2189910 2191923 2193120 2193689 2193992 2194316 2194619 2194687
66912 2194687 2194523 2194344 2194129 2193515 2192318 2190904 2189701 2188519 2186689 2183860 2180461 2177281 2174679 2172216 2169127
66897 2169127 2165231 2161223 2157811 2154673 2150658 2145127 2138605 2131974 2125484 2118925 2112320 2105900 2099590 2093024
66883 2093024 2086114 2079250 2072884 2067088 2061508 2055614 2049106 2042153 2035074 2027809 2020008 2011725 2003467 1995350
66869 1995350 1986769 1977355 1967743 1958739 1950167 1941287 1932046 1923063 1914541 1906108 1897744 1889891 1882406 1874286
66855 1874286 1864942 1855043 1845506 1836162 1826054 1814751 1802787 1790959 1779720 1769190 1759304 1749815
66843 1749815 1740449 1731099 1721750 1712229 1702268 1691897 1681672 1672343 1664134 1656332 1647747 1637809 1627122
66830 1627122 1616727 1606951 1597328 1587476 1577517 1567555 1557382 1547028 1537061 1527824 1518715 1508752 1497708
66817 1497708 1486179 1474714 1463446 1452548 1442397 1433058 1424139 1415456 1407411 1400248 1393264 1385272 1375837
66804 1375837 1365607 1355443 1345702 1336433 1327770 1319726 1311918 1303955 1295913 1288073 1280274 1272031 1263276
66791 1263276 1254487 1245957 1237384 1228455 1219437 1210803 1202572 1194445 1186429 1178844 1171694 1164407 1156337 1147386
66777 1147386 1138087 1129237 1121404 1114560 1108112 1101370 1094032 1086273 1078502 1071140 1064369 1057909 1051164 1043771
66763 1043771 1035912 1028000 1020282 1012907 1006058 999640 993090 985919 978307 970836 963837 957339 951450 946206
66749 946206 941154 935656 929585 923218 916544 909385 902235 896144 891416 887073 882117 876766 871868 867486
66735 867486 862768 857120 850898 844881 839461 834472 829556 824522 819464 814572 809867 805240 800733 796565
66721 796565 792718 788731 784119 778921 773652 768769 764242 759581 754286 748439 742834 738214 734327 730195
66707 730195 725460 720966 717584 714877 711594 707324 702894 699035 695346 690970 685830 680715 676345 672824
66693 672824 669862 667054 663870 659950 655708 652216 650006 648166 645185 640698 635856 631806 628361 624531
66679 624531 619887 614821 609723 604591 599480 594757 590749 587427 584609 582166 579967 577899 575950 573994
66665 573994 571553 568229 564382 560877 557970 554956 551206 547101 543545 540862 538645 536464 534278 532139
66651 532139 529905 527368 524535 521678 519110 516877 514687 512212 509425 506463 503295 499869 496472 493555
66637 493555 491129 488803 486466 484389 482485 480080 476773 473028 469506 466290 463224 460492 458248 456101
66623 456101 453710 451606 450540 450150 449165 447053 444584 442519 440534 438024 435302 433256 432084 431094 429791
66608 429791 428460 427465 426425 424610 421987 419390 417437 415712 413411 410604 408270 406956 405909 403935
66594 403935 400796 397397 394799 393447 393163 393312 392969 391461 389002 386550 384862 383874 383070 382157 381135 379942
66578 379942 378336 376188 373710 371296 369104 366853 364180 361238 358784 357510 357367 357712 357966 357932 357596 356989
66562 356989 356312 355856 355576 354917 353355 351093 349033 347947 347714 347486 346591 345119 343512 341816 339691 337123
66546 337123 334662 332782 331356 329994 328615 327413 326511 325933 325643 325258 324034 321647 318817 316655 315426
66531 315426 314492 313439 312590 312178 311655 310303 308247 306379 305306 304725 303890 302511 301049 300090 299556 298741
66515 298741 297206 295366 293865 292585 290774 288169 285520 283797 283238 283337 283437 283068 282017 280427 278735
66500 278735 277247 275890 274597 273713 273637 274105 274203 273276 271618 270027 268853 267762 266420 265052 264022 263128
66484 263128 261816 260105 258736 258086 257455 256026 254240 253419 254003 254910 254893 253901 252680 251628 250637 249735 249142
66467 249142 248775 248316 247803 247630 247777 247602 246726 245677 245240 245379 245301 244554 243525 242759 242220 241533 240663 239893
66449 239893 239264 238462 237368 236307 235554 234920 234084 233105 232278 231625 230908 230108 229512 229240 228994 228421 227572 226823
66431 226823 226440 226324 226095 225419 224353 223365 222893 222854 222720 222098 221135 220314 219990 220160 220506 220598 220199 219477 218850
66412 218850 218560 218463 218257 217788 217112 216405 215910 215839 216223 216893 217658 218363 218720 218301 216922 215030 213463 212717
66394 212717 212481 211925 210457 208207 205833 203937 202612 201487 200135 198551 197269 196898 197359 197675 196823 194818
66378 194818 192704 191450 191124 191234 191402 191416 191029 190184 189299 188831 188675 188423 188107 188202 188828 189436 189424 188718 187720
66359 187720 187016 187136 188129 189186 189188 187909 186366 185737 186199 187035 187514 187366 186752 186101 185791 185671 185140 183997
66341 183997 182897 182522 182544 181991 180572 179025 178003 177170 175783 173820 172104 171362 171568 172253 173183 174399
66325 174399 175661 176281 175770 174532 173545 173248 173099 172433 171473 171072 171565 172321 172588 172370 172169 172074 171608 170528
66307 170528 169362 168786 168691 168310 167242 165917 164918 164268 163706 163311 163361 163775 164148 164272 164189 163777 162848 161714
66289 161714 161091 161229 161584 161609 161399 161238 160938 160145 159067 158432 158729 159746 160773 161108 160564 159702 159273 159242
66271 159242 158694 157128 155397 154836 155664 156965 158102 159263 160483 161013 160241 158692 157505 157155 157228 157202 156876
66254 156876 156134 154977 153895 153630 154265 154954 154968 154633 154776 155447 155829 155384 154458 153550 152612 151494 150567 150236
66236 150236 150102 149297 147666 145946 144717 143795 142870 142105 141713 141422 140860 140152 139699 139555 139489 139476 139717 140264
66218 140264 141015 141934 142896 143391 142884 141562 140368 140150 140986 142341 143610 144446 144833 144940 144834 144391 143617
66201 143617 142866 142384 141809 140615 138982 137715 137166 136838 136338 136137 136867 138150 138809 138254 137199 136806 137444
66184 137444 138463 139070 139170 139379 140251 141554 142347 141879 140394 138940 138347 138486 138572 138107 137334 136776 136528 136148
66166 136148 135212 133867 132799 132698 133662 135009 135707 135219 133979 132948 132638 132752 132776 132698 132946 133801 135080
66149 135080 136374 137377 138011 138348 138483 138414 138083 137562 137127 137079 137530 138356 139195 139472 138694 136923 134802 133026
66131 133026 131919 131627 132324 133867 135473 136236 135987 135351 134973 135002 135281 135635 135866 135777 135339 134583 133354 131513
66113 131513 129510 128311 128442 129311 129793 129369 128426 127582 127099 127029 127540 128791 130478 131828 132205 131693 130950
66096 130950 130545 130547 130682 130667 130309 129561 128622 127777 127034 126177 125333 125073 125589 126127 125782 124722 124019 124295 125042
66077 125042 125383 125006 124254 123715 123913 124925 126112 126555 126024 125192 124782 124862 125109 125263 125064 124260 123076 122300
66059 122300 122400 122897 123080 122962 122980 123046 122655 121881 121473 121788 122205 121951 121027 119985 119110 118274 117458 117042 117465
66040 117465 118718 120281 121548 122262 122536 122464 122008 121342 121043 121545 122529 123238 123402 123466 123819 124232 124283 124064 124150
66021 124150 124984 126542 128473 130291 131481 131665 130838 129358 127674 126114 124939 124476 125005 126428 128102
66006 128102 129193 129313 128781 128264 128285 129089 130680 132696 134417 135278 135382 135302 135404 135659 136057 136724 137548 138110
65988 138110 138253 138339 138622 138688 137921 136336 134555 133080 131980 131216 130747 130248 129171 127379 125466 124185 123684
65971 123684 123515 123291 123128 123440 124385 125587 126370 126334 125712 125128 124974 125051 124788 123816 122341 120984 120204 119844
65953 119844 119403 118735 118260 118356 118855 119413 120064 120941 121641 121507 120612 119844 119777 120021 119996 119814 119912 120241 120372 120165
65933 120165 119767 119172 118362 117706 117573 117583 117015 116025 115780 117023 119111 120851 121800 122338 122863 123478 124189 124914
65915 124914 125392 125479 125391 125343 125139 124540 123870 123724 124124 124502 124493 124242 123878 123311 122775 122936 123996 125149 125526 125397
65895 125397 125764 126819 127542 127054 125782 124878 124792 124964 124736 124079 123318 122569 121729 120823 120096 119753 119753 119816 119589
65876 119589 118917 118056 117543 117632 117879 117440 115860 113491 111178 109602 108904 108765 108757 108683 108621 108701 108928 109288 109794
65857 109794 110254 110171 109229 107826 106764 106353 106201 105981 105932 106311 106712 106481 105661 105072 105374 106416 107563 108363
65839 108363 108708 108593 108032 107231 106614 106537 107000 107751 108652 109764 110937 111586 111212 110125 109274 109217 109600 109786
65821 109786 109685 109703 110133 110902 111759 112457 112891 113280 113957 114775 115050 114498 113904 114310 115747 117331 118507 119485
65803 119485 120463 121140 121253 120928 120224 118939 117295 116230 116382 117173 117508 117122 116564 116077 115325 114326 113851 114431
65785 114431 115486 115936 115408 114392 113384 112431 111498 110783 110408 110098 109440 108353 107077 105866 104877 104252 103964
65768 103964 103605 102686 101260 99986 99502 99952 101173 102880 104395 104695 103337 101232 99928 100060 100892 101387
65752 101387 101224 100667 99987 99377 99059 99025 98901 98449 98098 98538 99825 101245 102106 102320 102133 101688 101125 100759
65734 100759 100681 100308 98871 96483 94255 93009 92275 91036 89251 87966 87912 88694 89599 90574 91896 93369
65718 93369 94505 95269 96009 96690 96803 96156 95297 95021 95716 97145 98495 98726 97442 95564 94665 95431 97098
65701 97098 98549 99451 100099 100612 100766 100451 99890 99453 99377 99568 99625 99214 98468 97806 97346 96891 96456 96315 96358 95967
65681 95967 94827 93386 92177 91186 90401 90418 91797 94059 96037 97184 97910 98675 99361 99679 99647 99450 99149
65664 99149 98683 97920 96675 95005 93496 92926 93445 94376 94913 94808 94294 93673 93143 92839 92844 93175 93756 94325 94431
65645 94431 93813 92808 92229 92696 94125 95750 96566 95995 94418 93001 92637 93066 93277 92661 91434 90064 88859
65628 88859 88162 88349 89331 90438 91125 91482 91780 91894 91571 91062 90977 91557 92467 93297 93972 94598 95161 95508 95522
65609 95522 95266 94995 94936 94981 94683 93772 92620 91975 92183 92787 92943 92115 90409 88443 86964 86432 86778 87498
65591 87498 88067 88301 88412 88769 89582 90733 91847 92531 92568 91950 90874 89752 89049 88905 88932 88622 88013 87725
65573 87725 88190 89062 89564 89308 88491 87362 85917 84265 82947 82554 83120 84089 84788 84774 83927 82527 81225
65556 81225 80587 80611 80886 81190 81588 81954 81849 81137 80393 80353 81103 82068 82701 82923 83036 83413 84251 85401 86408
65537 86408 86822 86458 85441 84231 83605 84178 85660 86923 87169 86766 86596 86928 87479 88245 89458 90733 91138
65520 91138 90440 89588 89526 90017 90221 90045 90275 91497 93400 95240 96614 97687 98858 100318 101838 103042
65504 103042 103922 104937 106466 108331 110051 111302 111937 111828 111123 110479 110494 110911 110889 110154 109382 109246 109594 109923
65486 109923 110274 111120 112601 114336 115962 117434 118789 120019 121222 122531 123819 124800 125556 126638 128462
65471 128462 130881 133516 136147 138533 140263 141178 141697 142252 142609 142250 141196 139805 137836 134656 130583
65456 130583 127190 125603 125065 123889 121422 118367 115425 112615 109945 107853 106533 105423 103803 101565
65442 101565 99069 96641 94593 93376 93164 93437 93438 92998 92554 92422 92502 92650 92906 93218 93326 93070 92533 91778
65424 91778 90801 89879 89555 89973 90558 90733 90678 90945 91576 92117 92441 92935 93824 94846 95788 96789 97838 98459
65406 98459 98310 97745 97355 97237 97154 97173 97592 98342 98952 99120 98922 98478 97829 97201 97014 97546 98791 100552 102431
65387 102431 103935 105081 106706 109606 113413 117045 120267 123992 128858 134385 140037 146304 153944 162600
65373 162600 170950 177984 183539 187765 190670 192169 192141 190531 187706 184501 181487 178424 174887 171197 168120
65358 168120 165856 163945 162125 160586 159324 157861 155873 153646 151719 150359 149524 149021 148551 147905 147180
65343 147180 146621 146237 145848 145475 145355 145592 146043 146471 146451 145364 143004 140179 138100 137037 136051 134182 131405
65326 131405 128292 125259 122425 119838 117480 115226 112996 110796 108635 106654 105224 104501 103917 102723 101106
65311 101106 100112 100270 100833 100674 99412 97365 94978 92757 91277 90672 90413 89939 89275 88748 88493 88596 89293
65294 89293 90506 91540 91801 91502 91161 90667 89491 87656 85853 84577 83688 82912 82302 82079 82352 83047 83913
65277 83913 84552 84700 84414 83848 83055 82277 82109 82868 83967 84450 84155 83849 84199 85026 85692 85828 85577 85437 85907
65258 85907 86983 88036 88442 88300 88182 88331 88631 89214 90372 91750 92408 92071 91721 92464 94344 96699 99175
65241 99175 101693 103851 105190 105975 106925 108028 108320 107064 104638 101931 99399 97096 95220 94023 93333
65226 93333 92726 92159 92002 92361 92731 92517 91598 90292 89067 88446 88801 89895 90832 90841 90017 88972 87915 86515
65208 86515 84643 82722 81153 79858 78653 77752 77525 77948 78635 79277 79776 80031 79937 79645 79542 79837 80336 80676
65190 80676 80700 80515 80272 79968 79484 78841 78362 78454 79125 79855 80022 79443 78404 77321 76539 76324 76725 77331 77367
65171 77367 76278 74259 72135 70731 70380 70958 72147 73480 74335 74298 73703 73496 74240 75376 75788 75028 73723
65154 73723 72843 72921 73937 75485 76917 77691 77829 77821 77928 77869 77378 76757 76590 77039 77676 77935 77600 76981 76636
65135 76636 76784 76987 76719 76202 76169 76709 76965 76347 75443 75196 75634 76142 76674 77856 79906 82211 84111 85515
65117 85515 86568 87264 87659 88021 88445 88676 88626 88766 89700 91486 93652 95744 97619 99284 100713 101887 102903
65100 102903 103961 105285 107063 109433 112450 115897 119197 121794 123797 126021 129049 132367 134799 135807
65086 135807 136040 136484 137349 137970 137666 136474 135004 133693 132291 130188 127168 123625 120014 116372 112565
65071 112565 108728 105150 101933 99071 96719 95012 93736 92528 91306 90097 88517 85994 82659 79605
65057 79605 77978 77955 78723 79245 78951 77954 76768 75740 74801 73849 73166 73091 73421 73559 73251 72703 72041 71272 70883
65038 70883 71719 73850 76134 77436 77821 77974 77935 77251 76228 75993 77066 78544 79128 78494 77252 75974 74881
65021 74881 74274 74575 75715 76918 77422 77245 77014 77150 77488 77618 77342 76782 76251 76067 76295 76653 76871 77140
65003 77140 77865 78868 79248 78380 76732 75242 74132 72913 71524 70767 71288 72569 73437 73442 73305 73975 75501
64986 75501 76993 77589 77286 76793 76690 76896 76999 76850 76625 76398 75978 75216 74219 73124 71845 70266 68616
64969 68616 67461 67233 67854 68888 70009 71163 72233 72783 72393 71254 70109 69506 69324 69162 68981 69159 69992
64952 69992 71337 72677 73481 73593 73310 73030 72871 72853 73230 74160 75058 74919 73535 71837 70700 70037 69484 69327
64934 69327 70007 71193 72139 72669 73075 73298 73056 72605 72427 72254 71350 69844 68799 68767 69130 69235 69291 69686 70178
64915 70178 70334 70215 70069 69840 69408 68930 68525 68030 67481 67346 67888 68702 69249 69403 69118 68145 66603 65346
64897 65346 65094 65582 66124 66659 67599 68939 70213 71201 72011 72558 72577 72212 72089 72657 73774 74894 75419 75027
64879 75027 73973 72938 72305 71741 70775 69504 68382 67625 67293 67595 68524 69425 69607 69260 69109 69275 69155 68456
64861 68456 67593 66959 66449 66000 65955 66554 67488 68300 68898 69392 69723 69777 69636 69479 69341 69096 68585 67794 67119 67369
64841 67369 69078 71713 73940 74836 74557 73725 72619 71239 69840 68927 68819 69397 70206 70661 70371 69537 68906
64824 68906 69144 70236 71602 72657 73165 73203 73031 72892 72765 72332 71344 70006 68865 68326 68368 68717 69141 69559
64806 69559 69966 70390 70874 71475 72292 73487 75107 76745 77525 76776 74830 72829 71543 70664 69598 68559
64790 68559 68298 68851 69309 69021 68427 68405 69284 70802 72543 73972 74540 74261 73864 73878 73919 73407 72612 72296 72539
64771 72539 72707 72480 72186 72054 71840 71365 70796 70238 69577 68924 68682 68952 69347 69596 69880 70364 70836 71088 71207
64752 71207 71272 71216 71209 71683 72682 73677 74343 74947 75502 75173 73332 70881 69609 70188 71517 72184 71975 71639 71688
64733 71688 71919 71922 71713 71764 72538 73968 75444 76344 76583 76565 76670 76930 77174 77246 77000 76286 75133 73891 72993
64714 72993 72527 72134 71458 70633 70193 70434 71051 71510 71659 71790 72179 72833 73664 74614 75530 76128 76268 76166 76184
64695 76184 76464 76776 76750 76304 75910 76253 77367 78257 77813 76133 74524 74034 74426 74824 74926 75119 75739 76766
64677 76766 78151 79812 81206 81438 80160 78144 76593 75986 75863 75673 75471 75604 75967 75997 75436 74787 74782 75595
64659 75595 76854 78239 79634 80704 80799 79623 77774 76269 75613 75497 75391 75207 75320 76039 77021 77303 76121
64642 76121 73832 71850 71377 72232 73134 73070 72173 71254 70819 70731 70653 70516 70496 70738 71249 71924 72552 72888 72933 73102
64622 73102 73840 74979 75795 75873 75634 75738 76239 76750 77201 77854 78608 78929 78682 78482 78864 79565 79959 79853 79456
64603 79456 78866 78088 77348 76902 76609 76111 75389 74764 74377 74067 73728 73428 73175 72984 73167 74095 75547 76766
64585 76766 77357 77703 78210 78594 78316 77421 76453 75711 75072 74506 74245 74348 74542 74752 75454 77103 79354 81196
64567 81196 81950 81893 81762 81833 81683 80841 79434 78061 77179 76874 77118 77917 79036 79903 80090 79789 79521 79520 79688
64548 79688 80030 80576 80857 80056 78068 76015 75175 75591 76187 76146 75645 75239 75115 75162 75344 75623 75781 75628 75271
64529 75271 74958 74757 74549 74241 73838 73443 73281 73559 74138 74537 74420 73924 73321 72617 71768 71122 71190 72019 73139
64510 73139 74183 75191 76196 76832 76701 75988 75468 75803 76950 78270 79111 79187 78465 77007 75151 73657 73263
64493 73263 73969 75099 76151 77234 78474 79382 79236 77904 75930 73950 72354 71416 71287 71823 72657 73488
64477 73488 74126 74416 74365 74241 74227 74118 73682 73212 73258 73940 74923 76023 77270 78394 78825 78433 77782 77432 77366
64458 77366 77342 77440 77953 78981 80302 81478 82006 81689 80990 80694 81063 81606 81768 81474 80895 80193 79699 79786 80222
64439 80222 80118 78961 77337 76222 75920 76168 76880 78163 79817 81393 82684 83663 84082 83703 82854 82194 81909
64422 81909 81653 81308 81225 81562 81925 81956 81838 81875 81860 81305 80151 78968 78396 78540 78879 78745 77953 76976 76392 76252
64402 76252 76174 75988 75944 76187 76345 75940 75004 74058 73541 73512 73847 74543 75674 77140 78543 79446 79824 80185 81047
64383 81047 82291 83275 83606 83558 83531 83430 82918 82107 81515 81336 81193 80778 80295 79980 79559 78639 77444 76638 76477
64364 76477 76612 76784 77180 77930 78727 79269 79664 80052 80184 79849 79467 79712 80664 81840 82993 84347 86001 87575
64346 87575 88627 89066 89039 88783 88733 89414 90944 92900 94794 96504 98135 99729 101283 102778 104022 104669
64330 104669 104524 103662 102216 100295 98163 96262 94948 94387 94633 95460 96203 96272 95878 95710 95852 95705 95162
64313 95162 95020 95699 96331 95935 94926 94505 94874 95136 94945 95136 96348 97843 98398 97901 97411 97785 98758 99512
64295 99512 99807 100333 101971 104836 108088 110649 112064 112737 113530 115133 117582 120274 122564 124363 126008
64280 126008 127609 128902 129789 130564 131359 131732 131169 129700 127767 125779 124083 122945 122136 120891 118872 116902
64264 116902 116133 116583 117124 116869 116042 115430 115500 116153 116955 117493 117818 118522 120061 122103 123918 125255 126326
64247 126326 127096 127286 127166 127595 129023 131009 133020 135117 137451 139612 141088 142084 143318 145077 146903
64232 146903 148220 148893 149083 148887 148331 147614 147168 147293 147747 147792 146793 144736 142155 139724 138039 137505 138039
64215 138039 138988 139710 140269 141237 142857 144752 146491 148017 149406 150576 151470 152258 153137 154062 154804 155163 155113
64198 155113 154996 155536 157311 160071 162886 165074 166691 167972 168693 168434 167302 165999 165143 164683 164058 162886
64182 162886 161483 160616 160686 161264 161634 161650 161818 162560 163772 165195 166893 169209 172370 176299 180706 185365
64166 185365 190342 195917 202231 209198 216844 225393 234722 244111 252986 261588 270281 278480 285031 289588
64152 289588 292771 294957 295803 295106 293229 290299 285904 280137 274121 268758 263579 257616 250902 244275 238077
64137 238077 231880 225390 218863 212661 207039 202287 198505 195239 191881 188374 185065 181979 178833 175724
64123 175724 173196 171522 170467 169793 169451 169179 168534 167578 167021 167361 168266 169103 169740 170568 171974 174106 176941
64106 176941 180261 183655 186809 189732 192584 195416 198295 201561 205688 210799 216424 221860 226763 231282
64092 231282 235558 239267 241955 243804 245595 247598 248947 248640 246911 244974 243446 241713 239067 235777
64078 235777 232625 229820 226947 223752 220473 217489 215050 213376 212641 212730 213189 213542 213671 213983 215235 217871
64062 217871 221253 223812 224451 223870 224109 226674 231389 237136 243270 249957 257446 265470 273444 280990 288223
64047 288223 295625 303649 312326 321306 330306 339374 348587 357737 366606 375369 384323 393256 401554 408921
64033 408921 415545 421426 426083 429271 431464 433172 434130 433731 432031 429651 426820 423256 419109 415281 412421
64018 412421 410136 407667 405027 403017 402321 402990 404675 406938 409435 412265 416156 421864 429239 437234 445054
64003 445054 452969 461709 471340 481228 491103 501614 513571 526993 541371 556668 573562 592561
63991 592561 613293 634962 657314 680917 706602 734845 765601 798572 833629 871057 911309
63980 911309 954572 1000795 1050201 1103433 1161121 1223760 1292359 1368805 1455154 1552870 1663380
63969 1663380 1789263 1934362 2102816 2298554 2525777 2789379 3094684 3446911 3850543
63960 3850543 4308328 4820429 5384734 5997935 6655903 7353249 8083191 8837738 9606852
63951 9606852 10376779 11129743 11845921 12505833 13091542 13587468 13981769 14267079 14439403
63942 14439403 14496367 14436671 14260522 13969963 13569532 13068016 12479829 11823832 11119999 10386690
63932 10386690 9639933 8893595 8159331 7446677 6763737 6117916 5515918 4963025 4462210
63923 4462210 4013631 3614998 3262667 2952634 2680784 2442859 2234779 2053047 1894569
63914 1894569 1756228 1634912 1527922 1433013 1348175 1271671 1202285 1139217 1081653 1028595 979033
63903 979033 932189 887739 845929 807183 771291 737232 704135 672170 642071 614028 587566
63892 587566 562329 538327 515398 493075 471200 450253 430851 413204 397180 382588 369262
63881 369262 357083 346030 335996 326609 317474 308616 300389 292998 286443 280782 275923 271209 265877
63868 265877 260168 255343 252192 250004 247517 244537 242017 240704 240318 240185 240184 240739 242063 243748 245109 245791
63852 245791 245866 245435 244333 242379 239791 237097 234608 232122 229231 225782 221945 217909 213664 209093 204243
63837 204243 199399 194852 190668 186799 183307 180258 177443 174536 171565 168835 166305 163520 160462 157932
63823 157932 156605 156012 155053 153322 151366 149816 148823 148230 147640 146319 143787 140711 138575 138148 138727 139133
63807 139133 138955 138534 138206 138067 138134 138310 138314 137981 137510 137162 136879 136399 135583 134418 132911 131177 129499 128121
63789 128121 127118 126509 126238 125882 124812 122944 121081 120155 120329 121092 121981 122772 123226 123199 122966 122953 123074 122775
63771 122775 121881 121006 120862 121398 121917 121931 121698 121914 122965 124496 125702 126107 125999 126045 126576 127487 128742 130586
63753 130586 133057 135695 138094 140513 143512 147047 150484 153573 156918 161212 166449 172327 179073 187304
63739 187304 197167 208175 219844 231982 244339 256539 268507 280349 291539 300790 307181 310985
63727 310985 312880 312696 309509 302813 293085 281329 268584 255799 243653 232369 221914 212327 203538
63714 203538 195129 186736 178676 171721 166273 162171 159223 157370 156268 155233 153832 152179 150578 149256
63700 149256 148519 148728 149924 151829 154332 157538 161239 164867 168284 172202 177428 183984 191319 199095 207399
63685 207399 216407 226296 237338 249591 262391 274439 284546 292255 297723 301162 302415 301059 296854
63672 296854 290098 281507 271827 261599 251189 240874 230915 221615 213233 205733 198829 192451 186993
63659 186993 182836 179819 177539 175915 175048 174625 174092 173451 173423 174634 177056 180275 183828 187165 189835 192037
63643 192037 194656 198516 203830 210464 218263 226905 235902 245074 254682 264866 275349 285995 297191
63630 297191 309135 320985 331186 338590 343011 344912 344953 343757 341699 338830 335173 331101 327249 324111
63616 324111 321860 320483 319998 320426 321508 322444 322144 319986 316240 311520 306033 299757 293187 287330 282846
63601 282846 279568 276776 273503 268854 262842 256955 252988 251025 249367 246783 243924 242004 241054 240341 239839
63586 239839 240235 241767 243966 246430 249215 252571 256911 262812 270444 279137 288092 297373 307639 319135
63572 319135 331536 344510 357605 369668 379293 386063 390678 393651 394575 393042 389801 386496 384390
63559 384390 383577 383355 383264 383773 385907 390138 395846 402037 408262 414498 420463 425648 430008 434080 438404
63544 438404 443172 448372 453767 458622 461883 462771 461043 456696 449696 439989 427530 412378 395058 376713
63530 376713 358618 341556 325829 311555 298603 286595 275456 265756 258023 251951 246834 242503
63518 242503 239105 236251 233315 230587 229182 229525 230704 231642 232192 232730 233374 234184 235631 238272 242169 247053
63502 247053 252842 259705 267818 277343 288400 300756 313786 327007 340537 354848 370217 386474
63490 386474 402976 418633 432225 442987 450838 455951 458297 457618 453659 446353 436080 423814 410747
63477 410747 397601 384462 371240 358021 345039 332693 321588 312174 304301 297518 291789 287403
63465 287403 284169 281379 278828 277218 277129 278104 279293 280657 283040 287178 293034 299976 307317 314789 322714
63450 322714 331628 341703 352707 364514 377219 390739 404833 419717 436071 454047 472680 490605
63438 490605 506884 520775 531298 537760 540397 539887 536489 530331 522338 514126 506905 500989 496364 493130
63424 493130 491220 490181 489470 488654 487152 484097 478760 471134 462054 452702 443732 434730 424749 413624
63410 413624 402475 392602 384095 376038 367919 360267 353853 348855 345008 342135 340233 339236 338988 339422 340716
63395 340716 343305 347562 353258 359465 365398 371358 378478 387527 398348 410477 423716 437828 452190
63382 452190 466317 480505 495463 511227 526816 541012 553216 563431 571619 577327 580052 579934
63370 579934 578041 575853 574343 573531 572875 572015 571080 570370 569866 569053 567135 563405 557536 549637 540142 529596
63354 529596 518436 506789 494453 481153 466917 452239 437873 424432 412148 400920 390551
63343 390551 380934 372079 364054 356903 350598 345040 340124 335814 332132 329062 326570 324648 323219 321931
63329 321931 320313 318332 316563 315515 314918 314086 312902 311940 311540 311350 311061 311054 311741 312654 312887 312293 311556 310973
63311 310973 309922 307848 305212 302860 300799 298203 294665 290864 287858 286027 284905 283818 282434 280842
63297 280842 279299 277937 276614 275169 273843 273161 273150 272948 271647 269524 267870 267425 267503 267036 266039 265423 265628
63280 265628 266225 266862 267774 268999 269766 269326 268059 267125 267154 267859 268828 270011 271280 272154 272447 272835 274238
63263 274238 276767 279669 282292 284650 286938 288898 290040 290404 290775 292022 294281 296854 298905 300301 301782
63248 301782 304304 308200 313051 318301 323786 329581 335634 341842 348352 355396 362811 370095 377037 384057
63234 384057 391842 400928 411743 424622 439452 455533 472169 489276 507110 525528 543876 561521
63222 561521 578205 593919 608824 623334 637890 652553 667070 681472 696333 712292 729450
63211 729450 747313 765152 782308 798332 812942 825772 836120 843067 845918 844480 838936 829589
63199 829589 816718 800601 781744 761191 740409 720545 701781 683713 666357 650457 636719
63188 636719 625107 615127 606664 600285 596717 596118 597941 601537 606807 614027 623023 632935 643073 653642
63174 653642 665205 677761 690895 704537 718754 732921 746068 758262 770705 784003 797144
63163 797144 808818 819114 829062 838878 847593 854323 859073 862021 862601 859677 852490 841284 827113
63150 827113 811078 793729 775164 755650 735822 716252 697240 679236 663020 648962 636399
63139 636399 624348 612755 602526 594381 588141 583207 579222 576055 573510 571389 569702 568586 568063 567954
63125 567954 567986 568010 568138 568625 569482 570321 570779 571031 571605 572673 573765 574237 573885 572981 571901 570811 569679 568508
63107 568508 567534 567127 567453 568231 568950 569341 569596 570140 571209 572619 573957 575034 576166 577880 580348 583135
63091 583135 585555 587191 588128 588801 589607 590543 591264 591619 591986 592812 593951 594834 595274 595684 596447 597515 598817
63074 598817 600636 603341 607055 611751 617261 622989 628089 632348 636576 641824 648499 656442 665355 674764
63060 674764 684112 693509 704041 716714 731352 747135 763889 782063 801660 822133 843498 866669
63048 866669 892356 920192 949290 979247 1010254 1042458 1075470 1108393 1140360 1171275 1201892
63037 1201892 1232797 1263462 1292777 1320479 1347473 1374722 1402465 1430622 1459232 1488125 1516651
63026 1516651 1544114 1569956 1593158 1611941 1624615 1630426 1629200 1620506 1603757 1578970 1546938 1508727
63014 1508727 1465452 1418485 1369437 1319836 1271006 1224134 1180136 1139454 1102297 1069025 1040060
63003 1040060 1015505 995175 978949 966726 958130 952739 950701 952575 958287 966699 976653 988107 1001679
62990 1001679 1017271 1033790 1050276 1066709 1083386 1100017 1116009 1131409 1146963 1163166 1179563
62979 1179563 1195088 1208823 1220275 1229126 1234835 1236441 1232839 1223485 1208740 1189306 1165366 1136664
62967 1136664 1103386 1066584 1027587 987402 946727 906047 865490 825120 785716 748776 715274
62956 715274 684774 656254 629412 604628 582000 561218 542289 525593 511088 498080 485976
62945 485976 474719 464301 454394 444861 436238 429235 423860 419288 414631 409742 405243 401750 399062 396272
62931 396272 392783 388927 385326 381983 378514 375071 372313 370398 368632 366388 363886 361801 360513 359994
62917 359994 360038 360252 360146 359638 359311 359803 360994 362049 362209 361345 359804 357870 355375 351867 347279 342398
62901 342398 338393 335735 333785 331511 328422 324729 320914 317428 314638 312737 311641 311042 310561 309845 308665
62886 308665 307028 305114 303052 300808 298271 295424 292512 290164 289142 289592 290626 291005 290334 289258 288475
62871 288475 287920 287106 285881 284541 283403 282538 281846 281235 280757 280609 280909 281460 281918 282207 282556 283116 283823 284719
62853 284719 286065 287942 289964 291575 292589 293296 294192 295618 297511 299444 301034 302270 303272 303863 303739
62838 303739 303060 302463 302360 302541 302550 302135 301289 300242 299497 299404 299514 298844 297117 295319 294705 295545 297182 298938
62820 298938 300464 301532 302034 302204 302482 303181 304544 306953 310731 315778 321653 327908 334026 339170 342534
62805 342534 344133 344970 346253 348532 351657 355309 359408 364078 369489 375876 383576 392762 403019 413492
62791 413492 423847 435001 448475 464966 483889 504399 526453 550660 577455 606860 638911
62780 638911 673995 712696 755395 801969 851835 904461 959823 1018126 1078953 1140920 1202284
62769 1202284 1261631 1317870 1369828 1416099 1455111 1485292 1505438 1515140 1514682 1504445 1484684 1455994
62757 1455994 1419576 1376794 1328778 1276724 1222190 1166701 1111171 1056054 1001866 949269 898778
62746 898778 850696 805262 762648 722885 686038 652303 621722 593910 568257 544334 522091
62735 522091 501784 483791 468216 454613 442346 431285 421759 413739 406574 399762 393511 388238 383954
62722 383954 380499 377902 376047 374378 372514 370870 370210 370817 372575 375483 379500 384185 389177 394907 402200
62707 402200 411312 421969 434266 448779 465708 484594 505100 527523 552336 579689 609634 642486
62695 642486 678656 718269 761077 806511 853667 901288 947907 992034 1032461 1068548 1099996
62684 1099996 1126144 1145770 1157856 1162245 1159214 1148732 1130718 1105811 1075294 1040399 1002233 962156
62672 962156 921468 880702 839876 799543 760939 725031 692004 661766 634226 608902 584987
62661 584987 562235 541212 522281 504923 488508 473232 459722 447997 437360 427171 417269 407714
62649 407714 398492 389533 380852 372624 365179 358766 353283 348405 343992 340089 336494 332727 328545 324201
62635 324201 320061 316275 312918 309998 307143 303743 299765 296067 293470 291792 290200 288247 286124 284089
62621 284089 282202 280684 280027 280546 281979 283666 285090 286301 287887 290441 293945 297812 301681 305946 311247
62606 311247 317603 324444 331522 339446 349095 360707 373761 387708 402628 419072 437376 457282
62594 457282 478274 500123 523063 547523 573807 601888 631342 661472 691639 721320 749744
62583 749744 775667 797855 815715 829143 837855 841247 838977 831313 818915 802709 783994 764052
62571 764052 743267 721044 697032 672128 647856 624885 602618 580203 557585 535498 514728
62560 514728 495521 477595 460580 444448 429465 415814 403401 392064 381765 372511 364282 357105
62548 357105 350981 345574 340223 334513 328726 323546 319459 316596 314940 314266 314000 313502 312675 312104 312469 313903
62532 313903 316012 318397 321094 324453 328659 333403 338132 342650 347389 353012 359810 367612 376224 385820
62518 385820 396774 409119 422328 435856 449933 465583 483653 503934 525487 547684 570582
62507 570582 594286 618382 642146 664961 686223 705050 720426 731700 738826 742161 742066 738630 731708
62494 731708 721328 708035 692708 676049 658440 640261 622027 604148 586883 570644 555949
62483 555949 542819 530579 518645 507289 497202 488483 480559 473056 466271 460578 455765 451213 446537
62470 446537 441897 437858 435098 434014 434327 435139 435664 435899 436378 437296 438190 438593 438706 439097 439830 440268 439801
62453 439801 438492 436872 435319 433767 431825 428950 424702 419149 413033 407303 402431 398268 394460 390778
62439 390778 387136 383568 380304 377696 375938 374886 374206 373720 373688 374751 377400 381381 385799 389953 393918
62424 393918 398186 402986 408225 413854 419883 426166 432515 438976 445626 452195 458197 463371 467690 471099
62410 471099 473647 475755 477857 479826 481195 481923 482475 483199 484125 485308 486737 487901 488171 487698 487316 487437
62394 487437 487788 488391 489933 492764 496370 500379 505314 511746 519361 527665 537065 548409 561881 577139
62380 577139 594197 613298 634165 656252 679616 704711 731310 758450 785511 812644 839990
62369 839990 867057 893023 917122 938706 957385 973145 985819 994524 998244 997014 991920 983972
62357 983972 973713 961852 949319 936420 922775 908407 893977 879513 863923 846589 828666
62346 828666 811871 796573 782099 768463 756551 746676 738164 730598 724433 719942 716375 712692 708609
62333 708609 704451 700540 697244 695101 694233 693934 693446 692831 692473 691940 690259 687377 684551 682946 682474 682351
62317 682351 682186 681947 681301 679797 677679 675916 675341 676131 678210 681663 686525 692447 698809 705115 711252
62302 711252 717536 724555 732790 742307 752928 764601 777364 790959 804891 818905 833080 847347
62290 847347 861314 874802 888202 902014 916274 930730 945356 960332 975680 991279 1007188
62279 1007188 1023614 1040639 1058319 1077123 1097954 1121516 1147717 1175822 1205177 1235803 1268362
62268 1268362 1303568 1341598 1381950 1423697 1465682 1506611 1545337 1581213 1613980 1643329 1668809
62257 1668809 1690223 1707707 1721249 1730578 1735911 1738486 1739876 1740854 1741216 1740557 1738850 1736423 1733869 1731996
62243 1731996 1731486 1732578 1735273 1739772 1746272 1754444 1763542 1773154 1783445 1794592 1806351 1818330 1830288
62230 1830288 1842005 1853220 1863998 1874862 1886282 1898249 1910632 1923657 1937672 1952598 1968061
62219 1968061 1984089 2001255 2019976 2039987 2060665 2081709 2103315 2125862 2149648 2174826 2201334
62208 2201334 2228846 2257072 2286186 2316844 2349691 2385026 2422957 2463599 2506834 2552051 2598424
62197 2598424 2645391 2692572 2739303 2784585 2827498 2867339 2903350 2934714 2961000 2982285 2998725
62186 2998725 3010476 3018335 3024047 3029507 3035831 3043468 3052914 3064714 3078938 3095184 3113134 3132659
62174 3132659 3153305 3174123 3194105 3212405 3228029 3239843 3247288 3250898 3251802 3250879 3248562 3245137 3240713
62161 3240713 3234916 3227077 3216943 3205062 3192353 3179491 3166765 3154290 3142041 3129775 3117221 3104413
62149 3104413 3091694 3079376 3067555 3056181 3045028 3033563 3021255 3008222 2995225 2982784 2970602
62138 2970602 2958170 2945517 2932848 2919813 2905874 2891275 2876903 2863124 2849487 2835694 2822024
62127 2822024 2808474 2794274 2778854 2762709 2746694 2730914 2714919 2698591 2682110 2665252 2647419
62116 2647419 2628395 2608540 2588271 2567714 2546835 2525535 2503735 2481706 2460135 2439447 2419283
62105 2419283 2399151 2379411 2361037 2344453 2329222 2314963 2302050 2291272 2283275 2278505 2277309 2279773
62093 2279773 2285563 2293860 2303277 2311974 2318330 2321725 2322607 2321955 2320766 2319606 2318018 2314417 2307071 2295230
62079 2295230 2278992 2258351 2233069 2203513 2170903 2136498 2100967 2064639 2027811 1990592 1952963
62068 1952963 1915232 1878011 1841559 1805621 1770107 1735452 1701939 1669106 1636209 1602956 1569446
62057 1569446 1535687 1501682 1467869 1435066 1403867 1374222 1345574 1317453 1290081 1264436 1241474
62046 1241474 1221234 1202873 1185558 1169031 1153275 1138090 1123178 1108388 1093736 1079415 1065875
62035 1065875 1053514 1042149 1031068 1019711 1008050 996263 984466 972871 961806 951381 941517
62024 941517 932418 924547 917937 912062 906761 902793 901049 901609 904062 908359 914803 923406 933847 945953
62010 945953 959790 975385 992692 1011518 1030880 1048602 1062233 1070557 1073763 1072150 1065300 1052787
61998 1052787 1035243 1014257 991388 967619 943738 920906 900577 883749 870315 859326 850005
61987 850005 842459 837284 834651 833980 834439 835432 836661 838043 839810 842471 846412 851544 857493 864108 871607
61972 871607 880168 889595 899598 910308 922196 935403 949472 964036 979563 997042 1016935 1038777
61960 1038777 1061879 1086211 1112443 1141318 1173112 1207619 1244638 1284428 1327653 1374796 1425859
61949 1425859 1480758 1539701 1602798 1669613 1739744 1813709 1892653 1977048 2066395 2160426 2260012
61938 2260012 2366552 2481062 2604352 2737651 2882542 3040582 3213544 3403766 3613801
61929 3613801 3845856 4102195 4386099 4702058 5054971 5449346 5889077 6377391 6916480
61920 6916480 7506723 8145407 8825331 9534094 10254196 10963061 11632616 12230015 12721031
61911 12721031 13075216 13270379 13295283 13151016 12851020 12418856 11883869 11276666 10626023
61902 10626023 9957196 9291011 8643587 8026772 7448712 6913988 6423559 5975305 5565446
61893 5565446 5190167 4846449 4531761 4243488 3979097 3736788 3515467 3313832 3129952
61884 3129952 2962098 2809572 2672143 2548855 2437958 2337938 2248069 2167893 2096726 2033834
61874 2033834 1978599 1930269 1887883 1850755 1818781 1792062 1770445 1753602 1741284 1733232 1729138 1728977
61862 1728977 1733213 1742247 1755649 1772188 1790667 1810556 1831786 1854087 1876658 1898469 1918853 1937714
61850 1937714 1955055 1970403 1982990 1992640 2000243 2007099 2013935 2020834 2027962 2035965 2045566 2057163 2070952
61837 2070952 2087081 2105263 2124396 2142957 2159902 2175088 2188939 2202058 2215171 2229078 2244400
61826 2244400 2261541 2281101 2304207 2332184 2365837 2405179 2449918 2500145 2556524 2619740 2689791
61815 2689791 2765980 2847833 2936000 3032017 3137252 3252394 3378055 3515536 3666840 3834264
61805 3834264 4020230 4227216 4457581 4713703 4998609 5316261 5670979 6066909 6508469
61796 6508469 7001046 7550716 8163310 8844080 9598037 10429908 11343266 12339266 13415021
61787 13415021 14561507 15761708 16989671 18209909 19376860 20436176 21329857 22004036
61779 22004036 22416066 22539515 22367941 21916790 21220936 20327777 19289564 18158052 16980792
61770 16980792 15797713 14639110 13526377 12474112 11491400 10582393 9747522 8984992 8291357
61761 8291357 7661602 7090020 6571472 6101602 5676167 5290839 4941678 4625206 4337991
61752 4337991 4076642 3838325 3620859 3422253 3240494 3073814 2920806 2780233 2651037
61743 2651037 2532496 2424006 2324640 2233289 2149284 2072547 2002955 1939792 1882008 1828898 1780341
61732 1780341 1736411 1696873 1661160 1628743 1599243 1571944 1545477 1518548 1491043 1463842 1437306
61721 1437306 1410424 1381781 1350968 1318668 1285757 1252817 1220270 1188463 1157661 1128241 1100733
61710 1100733 1075407 1052060 1030514 1010974 993521 977574 962375 947748 933863 920459 906863
61699 906863 892717 878191 863582 849125 835144 821884 809212 796850 784849 773471 762708
61688 762708 752336 742374 733108 724708 717100 710004 702819 694823 685991 677311 669694 662884 656089 649410
61674 649410 643778 639606 636416 633791 631692 629639 626629 622352 617775 613982 611034 608433 606072 604093
61660 604093 602258 600211 598153 596664 595881 595299 594341 592804 590800 588557 586248 583817 580963 577467 573496
61645 573496 569448 565568 561819 558114 554645 551997 550853 551469 553529 556701 561130 567095 574285 581885
61631 581885 589433 597209 605632 614611 623589 631791 638183 641576 641224 637359 630980 623134 614440 605127
61617 605127 595351 585514 576246 567967 560498 553282 546063 539193 533258 528614 525310 523320 522668 523318 524898
61602 524898 526596 527576 527686 527621 528220 529760 532041 534842 538017 541495 545567 550977 558252 567096 576810
61587 576810 587047 597691 608285 618368 628361 639381 651972 665567 679378 693366 708163 724405
61575 724405 742305 761580 781754 802740 825011 848904 874031 899953 927076 956049 986352
61564 986352 1016442 1045453 1073823 1102023 1129656 1156334 1182573 1209043 1235537 1261419 1286719
61553 1286719 1312118 1338062 1364464 1391012 1417240 1442385 1465682 1486756 1505416 1521115 1532897
61542 1532897 1539886 1541791 1539104 1532864 1524020 1513006 1500162 1486349 1472556 1459009 1445474 1432592
61530 1432592 1421997 1414684 1410092 1407368 1406773 1409098 1414461 1422673 1434388 1450789 1472309 1498556 1529478
61517 1529478 1565767 1608112 1656882 1712718 1776694 1849556 1931422 2022542 2123966 2237177 2363438
61506 2363438 2503822 2659550 2831835 3021398 3228311 3452274 3692686 3947966 4214449
61497 4214449 4485806 4753688 5008973 5242408 5444637 5606871 5722545 5788526 5804779 5773533
61487 5773533 5699268 5588843 5450424 5291746 5119426 4939448 4757432 4578157 4405306 4241763
61477 4241763 4089772 3950717 3825201 3713514 3615738 3531498 3460212 3401778 3356529 3324244
61467 3324244 3303633 3293105 3291676 3298738 3313346 3334238 3360363 3390854 3424476 3459551 3494562 3528563
61455 3528563 3561086 3592044 3621862 3651263 3680661 3710058 3739807 3771211 3805929 3844839 3887782
61444 3887782 3934357 3984589 4038781 4097075 4159262 4224632 4291831 4359100 4424856 4487800 4546339
61433 4546339 4598175 4640760 4671999 4690484 4695490 4687140 4666253 4633710 4590234 4537170 4477123 4413232
61421 4413232 4347965 4283075 4220448 4162196 4109791 4063669 4023834 3990425 3963631 3943542 3930224
61410 3930224 3923585 3923053 3927723 3936821 3949704 3965501 3983201 4002048 4021402 4040270 4057524 4072603
61398 4072603 4085500 4096242 4105084 4113277 4122818 4135277 4151578 4173122 4202307 4241486 4292103 4355319
61386 4355319 4432943 4527255 4640367 4774141 4930112 5108937 5310252 5533394 5777750 6041799
61376 6041799 6322040 6613086 6908265 7199642 7477889 7732934 7954994 8135414 8267611
61367 8267611 8348232 8377342 8357143 8290584 8181146 8033031 7850717 7638503 7400913 7143320
61357 7143320 6871744 6592111 6309783 6029279 5754107 5487164 5231406 4989570 4763089
61348 4763089 4552071 4356741 4178123 4016810 3871950 3742290 3627521 3527792 3442513 3370618
61338 3370618 3311505 3264746 3229314 3204151 3189274 3185215 3191442 3206154 3227581 3254661 3286582 3322589
61326 3322589 3362217 3404909 3449421 3494294 3538734 3582032 3622244 3656629 3683702 3703935 3718151
61315 3718151 3726253 3728178 3725368 3720537 3716232 3713912 3713969 3716134 3719933 3725053 3731149 3737361 3742337 3744802
61301 3744802 3743770 3738193 3726921 3709269 3685375 3655776 3620888 3581021 3536723 3488949 3438989 3388172
61289 3388172 3337528 3287794 3239784 3194500 3152573 3113921 3078369 3046434 3019124 2997144 2980697
61278 2980697 2969768 2963910 2961686 2960838 2959138 2954876 2946778 2934124 2917149 2896933 2874735 2851524 2828088
61265 2828088 2805323 2784418 2766877 2754077 2746608 2744355 2747585 2757695 2776483 2805001 2843522 2892242
61253 2892242 2951370 3020764 3100097 3189399 3289021 3399151 3519541 3649214 3785770 3925241
61243 3925241 4063044 4194620 4314529 4415540 4489807 4531233 4536506 4504624 4436681 4336129
61233 4336129 4208267 4059181 3895428 3724003 3551151 3380795 3214751 3054427 2901613
61224 2901613 2757798 2623822 2500314 2387673 2285507 2192970 2109803 2036267 1972098 1916435
61214 1916435 1868810 1829207 1797013 1770974 1750398 1735186 1724141 1714366 1703188 1690130 1676456
61203 1676456 1663399 1651354 1640254 1630000 1620666 1612492 1605416 1598650 1591224 1582916 1573991 1564141 1552606
61190 1552606 1539470 1525834 1512415 1498856 1484706 1470118 1455155 1439438 1423042 1406818 1391159
61179 1391159 1375348 1358931 1342983 1329093 1317598 1307693 1298928 1291805 1287172 1285712 1287842 1293478 1301802
61166 1301802 1311488 1320910 1328051 1330795 1327752 1318539 1303090 1281324 1253905 1222747 1190177 1157819
61154 1157819 1126492 1096622 1068311 1041372 1015731 991469 968345 945886 924271 904444 886970
61143 886970 871316 856699 843018 830515 819171 809013 800375 793243 786803 780330 774109 768908 764953
61130 764953 761969 759812 758428 757555 757098 757560 759549 763049 767569 772658 777833 782275 785071 785569 783248
61115 783248 777720 769221 758665 746871 734183 721142 708779 697613 686975 676053 665209 655561
61103 655561 647594 640901 634960 629509 624302 619166 614283 609980 606305 603095 600214 597486 594708 592019
61089 592019 589924 588692 588081 587874 588117 588595 588785 588769 589583 592074 595968 600586 605822 611807 618202 624598
61073 624598 631231 638550 646393 654163 661523 668420 674827 680946 687257 693854 700241 706179 712159 718440
61059 718440 724332 729135 733173 737140 740976 744285 747374 750939 755053 759288 763499 767746 771752 775277
61045 775277 778763 782815 787226 791162 794109 796077 797325 798461 800375 803352 806619 809428 812123 815469
61031 815469 819462 823649 828120 833353 839443 846382 854707 865039 877235 890750 905497 921689 939217
61018 939217 957907 978040 999980 1023782 1049729 1078653 1110989 1146208 1183912 1224768 1269625
61007 1269625 1318577 1371739 1430007 1493962 1562796 1635189 1710294 1787082 1864226 1942077 2023586
60996 2023586 2111988 2208954 2316264 2437148 2573563 2723807 2885586 3060430 3253075 3468901
60986 3468901 3715857 4007556 4360320 4787908 5303058 5923057 6669735 7567315 8649625
60977 8649625 9970807 11599962 13600418 16015631 18859534 22074020 25450256 28597392
60969 28597392 31053603 32508548 32970533 32741039 32237168 31824088 31750598 32131964 32897852
60960 32897852 33741761 34188129 33801250 32399512 30112773 27264228 24200682 21190616
60952 21190616 18405061 15932177 13795024 11974205 10433672 9136238 8045932 7128362
60944 7128362 6354478 5701777 5150572 4681587 4277907 3926581 3617273 3341366 3093064
60935 3093064 2869300 2667608 2485348 2321042 2174464 2044713 1929652 1827442 1736852 1655624
60925 1655624 1580241 1508074 1438415 1371030 1305353 1241779 1182227 1128327 1079933 1036018 996020
60914 996020 959732 926873 897464 871740 849147 828303 808515 790445 774758 760961 748191
60903 748191 736348 725757 716363 707838 699994 692647 685640 679392 674797 672136 670618 669402 668483 668251
60889 668251 668792 670024 671907 674080 675815 676767 677321 677846 678119 677825 677111 676275 675404 674667 674427 674647 674727 674399
60871 674399 674245 674810 675636 675797 675075 674105 673527 673532 674010 674670 675101 675113 675020 675310 676103 677132 678192 679394 681037
60852 681037 683404 686622 690632 695264 700301 705381 710029 714010 717611 721341 725421 729753 734147 738218
60838 738218 741333 743234 744573 746349 748911 752066 755958 761006 766951 772843 778118 782872 786872 789262
60824 789262 789776 789485 789648 790355 790871 790811 790314 789445 788173 786717 785304 783693 781416 778442 775185 771946
60808 771946 768697 765274 761493 757247 752780 748663 745264 742435 739967 737954 736316 734405 731668 728491
60794 728491 725795 723903 722377 720850 719442 718326 717475 716915 716721 716619 716113 715235 714776 715516 717540 720514
60778 720514 724244 728569 733004 736982 740450 743895 747698 751699 755477 758811 761698 764017 765376 765343 763757
60763 763757 760759 756598 751503 745707 739495 733172 727037 721362 716322 711903 707934 704286 700965 698020
60749 698020 695378 692779 689837 686259 682120 677934 674214 670867 667175 662585 657471 652929 649792 647877
60735 647877 646206 643863 640591 636650 632255 627305 621629 615317 608688 601961 595107 588036 580832 573843
60721 573843 567542 562206 557634 553268 548818 544659 541328 538667 535779 532008 527670 523692 520800 519295
60707 519295 519275 520588 522552 524221 525185 525940 527341 529796 533105 536912 541053 545550 550445 555693 561103
60692 561103 566397 571435 576428 581788 587751 594240 601140 608590 616898 626256 636646 647916 659886
60679 659886 672463 685776 700043 715120 730309 744853 758560 771729 784539 796778 808026
60668 808026 817733 825214 830108 832961 834801 835868 835243 832075 826780 820530 814016 807302 800611 794412
60654 794412 788639 782508 775389 767410 758907 749713 739364 727841 715791 704106 693398 683772 674935
60641 674935 666620 658974 652414 647054 642483 638245 634293 630775 627611 624633 622118 620797 621206 623212
60627 623212 626268 629980 634262 639061 644150 649285 654426 659762 665550 671997 679194 687065 695358 703771
60613 703771 712076 720145 727902 735385 742796 750370 758189 766217 774466 782977 791681 800450 809250 817963
60599 817963 826002 832407 836429 837851 836589 832312 824738 814147 801307 786939 771491 755397 739331
60586 739331 724141 710570 698953 689048 680209 671879 663894 656267 648884 641524 634117 626794 619711
60573 619711 612985 606706 600939 595710 591015 586758 582722 578799 575301 572772 571379 570754 570541 570766 571398
60558 571398 571921 571753 570925 569916 568906 567605 565812 563772 561874 560283 558995 558104 557876 558631 560532 563478
60542 563478 567207 571577 576647 582547 589473 597846 608128 620330 633982 648789 664969 682738 701911
60529 701911 722443 745047 770736 799937 832572 868857 909414 954575 1003936 1056500 1110645
60518 1110645 1163802 1212640 1253837 1284654 1303162 1308671 1302243 1286382 1263870 1236857 1206874 1175256
60506 1175256 1143361 1112521 1083746 1057347 1033023 1010648 990766 973993 960280 949457 942337
60495 942337 940497 944792 954726 969453 988747 1012793 1041596 1074820 1111438 1149042 1184079 1213378
60483 1213378 1235324 1249418 1255414 1253569 1245269 1232662 1217733 1202221 1188230 1178188 1174007 1176522
60471 1176522 1185737 1201375 1223365 1252229 1289000 1334526 1388999 1452578 1526418 1612728 1713869
60460 1713869 1831905 1969125 2128605 2313967 2528637 2775148 3054416 3364838 3701396
60451 3701396 4054846 4410859 4749776 5048209 5282834 5434713 5492063 5451069 5315917 5098658
60441 5098658 4817992 4496141 4154753 3811827 3480628 3169958 2884814 2627192 2397057
60432 2397057 2193215 2013829 1856823 1720194 1601940 1499642 1410449 1331859 1262395 1201263
60422 1201263 1147524 1099952 1057615 1020130 987278 958652 933734 912008 892890 875778 860243
60411 860243 845963 832492 819366 806471 794011 782062 770353 758640 747059 736051 726152 717817
60399 717817 711224 706163 702310 699541 697733 696435 695187 694201 694210 695504 697577 699891 702530 705809 709583
60384 709583 713225 716018 717426 717354 716423 715572 715101 714407 712966 711124 709480 707905 705796 703089 700376 698089
60368 698089 696175 694622 693709 693583 694057 695053 696820 699404 702268 704830 707238 710231 714276 719159 724424
60353 724424 729897 735587 741294 746610 751279 755341 758868 761784 764090 766077 768009 769616 770118 768895
60339 768895 766105 762659 759650 757696 756689 756163 755963 756502 758306 761462 765630 770370 775189 779422 782533
60324 782533 784639 786476 788690 791274 793668 795263 795899 796062 796508 797444 798257 798395 798280 798796 799947 800705
60308 800705 800362 799446 799031 799679 801390 804098 807711 811906 816266 820437 823935 826077 826463 825275 822827
60293 822827 819097 814039 808106 802024 796181 790530 784972 779546 774446 770191 767574 767007 767964 769417 770872
60278 770872 772679 775384 779047 783267 787733 792653 798681 806302 815258 824836 834767 845482 857252 869503
60264 869503 881442 893083 905133 918022 931602 945820 961163 978309 997717 1019655 1044302
60253 1044302 1071602 1101248 1133016 1167047 1203813 1243876 1287612 1334935 1385404 1438947 1496513
60242 1496513 1559703 1629629 1706373 1789657 1879769 1977570 2083696 2197930 2319249 2446236
60232 2446236 2577378 2711035 2845187 2977224 3104064 3222623 3330379 3425623 3507251 3574324
60222 3574324 3625839 3660937 3679278 3681169 3667528 3639958 3600831 3552988 3499224 3442113 3384266
60211 3384266 3328379 3276911 3231928 3195383 3169295 3155477 3155235 3169496 3198992 3244058 3304496 3379950
60199 3379950 3470363 3575791 3695681 3828401 3971279 4120920 4273570 4425370 4572345 4710222
60189 4710222 4834600 4941630 5028581 5093693 5135798 5154272 5149191 5121141 5070952 4999916 4910348
60178 4910348 4805710 4690142 4567921 4443301 4320533 4203820 4097136 4003849 3926294 3865673
60168 3865673 3822539 3797463 3791220 3804362 3836731 3887410 3954999 4037657 4132667 4236027 4342760
60157 4342760 4447967 4547578 4638187 4716592 4780069 4827031 4857018 4869959 4865904 4845599 4811011
60146 4811011 4765125 4711503 4654103 4597079 4544306 4499066 4464180 4442213 4435581 4446651 4477753
60135 4477753 4530743 4606579 4705661 4828559 4976065 5148760 5347347 5573497 5829394 6115896
60125 6115896 6431648 6774273 7141651 7531407 7939832 8361994 8792365 9224454 9650265
60116 9650265 10061173 10449422 10808197 11130529 11409147 11637665 11811450 11927308 11983045 11977626
60106 11977626 11911494 11786620 11606536 11376256 11101791 10789813 10448066 10085834 9713304
60097 9713304 9340173 8974891 8624808 8296298 7994586 7723799 7487127 7286517 7122438
60088 7122438 6994554 6902722 6846880 6826119 6838433 6881278 6951612 7045151 7156214 7278542 7405879
60077 7405879 7531706 7649176 7751868 7834498 7892947 7924319 7927387 7902637 7851391 7775012 7675023
60066 7675023 7553516 7412977 7255930 7085050 6903442 6714485 6521525 6327999 6137748
60057 6137748 5954846 5782964 5624848 5482336 5356702 5248979 5160003 5090290 5040131 5009909
60047 5009909 5000159 5011211 5042987 5095323 5168194 5261214 5372988 5501149 5642739 5794045 5950204
60036 5950204 6105489 6254068 6390333 6508948 6605385 6676582 6720650 6735963 6721114 6675758
60026 6675758 6600893 6498257 6370120 6219939 6052524 5873130 5686738 5498383 5313457 5137020
60016 5137020 4972913 4823814 4691733 4578050 4483461 4408495 4354071 4321208 4310284 4320944
60006 4320944 4352760 4405811 4480757 4578509 4699740 4844348 5011284 5198778 5404472 5625040
59996 5625040 5855637 6089798 6319990 6538558 6738592 6914273 7060731 7174069 7251942 7293886
59986 7293886 7300513 7272307 7209516 7113249 6986280 6832870 6658437 6469536 6273456 6077139
59976 6077139 5886428 5706172 5540420 5392199 5263563 5156272 5072095 5012183 4976650 4965274
59966 4965274 4978247 5015627 5076228 5157659 5257401 5373260 5502662 5641976 5786770 5932525
59956 5932525 6075084 6210742 6336232 6448664 6545470 6624642 6685156 6727203 6751958 6761121 6756691
59945 6756691 6741106 6717490 6689655 6661846 6638634 6625036 6626405 6647786 6693358 6766568 6870620
59934 6870620 7008526 7182860 7395832 7649436 7944975 8282235 8659408 9073676 9521168
59925 9521168 9995930 10489042 10988640 11480293 11947348 12371843 12736106 13024148 13222550
59916 13222550 13321811 13318186 13214359 13018141 12740861 12396984 12003779 11579310 11139730 10698284
59906 10698284 10266141 9852905 9465938 9110057 8788546 8504201 8259078 8053734 7887513
59897 7887513 7759806 7670745 7620674 7609258 7635352 7697521 7794274 7923723 8083233 8269430
59887 8269430 8478097 8703544 8938141 9172851 9398253 9604834 9782610 9921402 10012191 10048281
59877 10048281 10025483 9942123 9799575 9602443 9357515 9072443 8755563 8416376 8065051 7710931
59867 7710931 7361580 7023132 6700820 6398770 6119514 5864176 5633155 5426554 5244096
59858 5244096 5084904 4947464 4829694 4728938 4641883 4564619 4493057 4423566 4353386 4280565
59848 4280565 4203785 4122443 4036906 3948502 3859127 3770778 3685338 3604593 3530209 3463509 3405179
59837 3405179 3355327 3314043 3282018 3260550 3250817 3253122 3266826 3291048 3325525 3370801 3427472 3495133
59825 3495133 3572112 3656158 3745028 3836040 3925238 4007542 4078093 4133659 4173224 4197839 4210136
59814 4210136 4213554 4211547 4207119 4202710 4200140 4200694 4205706 4217332 4238758 4273676 4325771 4398599 4495648
59801 4495648 4620368 4776260 4966901 5195727 5465865 5780215 6140977 6547694 6994375
59792 6994375 7467330 7944342 8394961 8782774 9071260 9232321 9253323 9139062 8908815 8591045
59782 8591045 8217581 7818245 7417210 7032049 6674642 6352194 6067757 5821095 5610275
59773 5610275 5433124 5287599 5171228 5080731 5012597 4964167 4933967 4920885 4923362 4939817 4969604
59762 4969604 5012941 5069907 5140082 5223349 5320406 5432222 5559517 5703276 5865326 6047783
59752 6047783 6252063 6478915 6729385 7005420 7309560 7644324 8011944 8414408 8853577
59743 8853577 9331034 9847470 10401985 10991945 11613142 12259234 12920429 13583049 14231122
59734 14231122 14849047 15423510 15944286 16404866 16803507 17144207 17436860 17696122 17939245
59725 17939245 18183773 18446110 18740770 19079451 19469893 19915550 20416395 20969632 21569374
59716 21569374 22205933 22865870 23532804 24188527 24814279 25392130 25906057 26342772 26692820
59707 26692820 26951817 27120825 27205678 27216348 27166796 27074283 26957690 26836108 26728662 26654475
59697 26654475 26631537 26675317 26798545 27011834 27323840 27740986 28267573 28905993 29655984 30513229
59687 30513229 31468581 32508040 33612319 34755453 35903551 37014992 38042522 38936886
59679 38936886 39651225 40145480 40390411 40371173 40089755 39564952 38829454 37925215 36898469
59670 36898469 35794715 34653596 33504299 32362277 31227990 30088813 28925181 27719753
59662 27719753 26465442 25168581 23846964 22525046 21228365 19978613 18790818 17673273
59654 17673273 16629055 15657610 14756076 13920635 13147374 12432251 11770942 11159322 10593972
59645 10593972 10071887 9590049 9145720 8736938 8362246 8020048 7708578 7426190 7171218
59636 7171218 6941770 6736106 6553008 6391366 6249621 6126040 6019204 5927597 5848943 5780605
59626 5780605 5720560 5667339 5618948 5572387 5524260 5471499 5411671 5343260 5265926 5180183 5086741
59615 5086741 4986286 4879777 4768705 4655228 4542213 4432687 4328727 4231083 4140209 4057191
59605 4057191 3983161 3918351 3862531 3816017 3779321 3751966 3732629 3720487 3715571 3717688 3725837 3738876
59593 3738876 3755995 3776268 3798424 3821364 3844415 3867013 3888846 3910550 3933597 3959211 3987882
59582 3987882 4020153 4057213 4100421 4150799 4209265 4276830 4354276 4442178 4541479 4653457 4778870
59571 4778870 4917803 5070815 5239571 5425813 5630179 5852513 6092710 6350464 6624424
59562 6624424 6912242 7211228 7518368 7829930 8141707 8449635 8749666 9037177 9307144
59553 9307144 9555177 9778229 9974519 10143258 10284366 10397954 10484035 10543234 10577641 10590146
59543 10590146 10582523 10555002 10508759 10448970 10385138 10328541 10289678 10277470 10299347 10360858 10465120
59532 10465120 10612764 10801830 11026958 11278715 11544213 11808564 12055795 12269378 12433521
59523 12433521 12535074 12564523 12515830 12386520 12178425 11897704 11553544 11156922 10720363 10257591
59513 10257591 9782150 9306078 8839689 8391689 7968680 7574863 7212750 6883874 6588522
59504 6588522 6325550 6093414 5891239 5718386 5573524 5455000 5361915 5294078 5251141 5232560
59494 5232560 5238194 5268115 5321859 5398641 5498270 5621151 5767411 5936692 6128604 6342407
59484 6342407 6575983 6825659 7087038 7355270 7624458 7887481 8136513 8363152 8558276
59475 8558276 8712930 8819959 8874579 8873770 8816285 8703674 8540528 8333274 8089057 7815639
59465 7815639 7521234 7213663 6899879 6586263 6278536 5980940 5696007 5425464 5170946
59456 5170946 4933695 4714106 4511845 4326063 4155553 3999403 3857627 3730582 3617720
59447 3617720 3517639 3429376 3352770 3287362 3231894 3185240 3146957 3116572 3093255 3076605 3066806
59436 3066806 3063428 3064963 3070201 3079137 3091776 3106931 3123181 3140328 3158971 3179280 3201356 3226285
59424 3226285 3255547 3289483 3327444 3369446 3416402 3468293 3522961 3577472 3630565 3683677 3740014
59413 3740014 3802888 3874654 3956705 4050162 4156346 4276470 4410881 4558519 4717094 4884245
59403 4884245 5059411 5244991 5445492 5665441 5908427 6177899 6477871 6812222 7183851
59394 7183851 7595051 8048360 8546440 9091244 9683494 10322347 11004666 11724241 12471540
59385 12471540 13233813 13995562 14740078 15451896 16118592 16731046 17283309 17773086 18201902
59376 18201902 18573933 18894429 19168963 19402953 19600377 19762330 19886699 19968822 20002190 19979140
59366 19979140 19891982 19734094 19500587 19189134 18801227 18342717 17822746 17252095 16642209
59357 16642209 16004539 15349533 14686018 14021808 13364500 12721190 12097703 11498629 10927843
59348 10927843 10388466 9882551 9411269 8975115 8573524 8204694 7866440 7557001 7274548
59339 7274548 7016368 6779344 6561045 6359674 6173144 5998929 5834772 5678842 5529395
59330 5529395 5385101 5245742 5111720 4982707 4857383 4734721 4614916 4498858 4387300
59321 4387300 4280825 4180072 4085501 3997133 3914797 3838482 3768332 3704566 3647608 3598039 3556172
59310 3556172 3521784 3494430 3474036 3461106 3456310 3459909 3471635 3491243 3519174 3556552 3604489 3663615
59298 3663615 3734214 3816498 3910582 4016466 4134077 4262954 4401738 4548372 4700920 4857638
59288 4857638 5015786 5170773 5316939 5448947 5562222 5652636 5716637 5751822 5757282 5733795
59278 5733795 5684116 5612690 5524460 5423914 5315362 5203279 5091225 4980190 4868621 4754470
59268 4754470 4637406 4519580 4404864 4297273 4199527 4112829 4037861 3975545 3926594 3890886
59258 3890886 3867903 3857461 3859465 3873284 3898132 3934072 3982082 4043153 4117806 4206481 4309862
59247 4309862 4428880 4564858 4719676 4895431 5094012 5317440 5568454 5850146 6164941
59238 6164941 6514387 6899871 7322846 7783898 8281587 8811864 9367787 9939186 10512527
59229 10512527 11071255 11596602 12068899 12469206 12780723 12989713 13086423 13066150 12929631 12682528
59219 12682528 12335064 11902285 11403502 10859717 10290541 9712899 9141396 8588366 8063188
59210 8063188 7572104 7118814 6704879 6329763 5991379 5687187 5414818 5171914 4956017
59201 4956017 4764751 4595818 4446796 4315297 4199326 4097215 4007255 3927765 3857441 3795278
59191 3795278 3740175 3690976 3646815 3607122 3571385 3539179 3510213 3483914 3459054 3434246 3408708
59180 3408708 3382212 3354338 3324205 3290843 3253518 3211851 3166006 3116621 3064169 3008593 2949942
59169 2949942 2889113 2827404 2765400 2702791 2639277 2575258 2511749 2449987 2390992 2335074 2281803
59158 2281803 2230790 2182273 2136670 2093878 2053536 2015716 1980787 1948768 1919307 1892188 1867419
59147 1867419 1845022 1825124 1807950 1793282 1780347 1768827 1759618 1753852 1751485 1751616 1753999 1759432 1768753
59134 1768753 1782179 1799559 1820638 1845147 1873263 1905842 1943661 1986717 2034959 2089262 2150760
59123 2150760 2219396 2294127 2374390 2460362 2551893 2648235 2748875 2853610 2961775 3072492
59113 3072492 3185991 3303746 3427171 3557148 3694986 3842596 4001000 4169340 4345664
59104 4345664 4527805 4712914 4896722 5073635 5237015 5379259 5492609 5570699 5609245 5605574
59094 5605574 5558666 5470206 5344783 5188463 5007521 4808474 4598032 4382103 4165268 3951633
59084 3951633 3745359 3549683 3365944 3194256 3034692 2887338 2751743 2627159 2513180
59075 2513180 2409624 2315949 2231141 2154054 2083717 2019564 1961546 1909714 1863686 1822970 1787732
59064 1787732 1758459 1734623 1714430 1696314 1680009 1665743 1652934 1640208 1626176 1609735 1590058
59053 1590058 1566913 1540862 1512881 1484050 1455735 1429549 1406683 1387547 1372231 1360936 1353840
59042 1353840 1350988 1352458 1358164 1367381 1379050 1392656 1408136 1424785 1441059 1455700 1468213 1477988
59030 1477988 1484044 1486312 1486331 1485864 1485441 1484908 1484692 1485608 1487944 1491650 1497094 1504776 1514493 1525525 1537434
59015 1537434 1550025 1562623 1574089 1583478 1590243 1593867 1593875 1590189 1583209 1573637 1562431 1550569 1538423
59002 1538423 1525585 1511671 1497153 1483088 1470314 1459230 1450016 1442688 1437112 1433332 1431615 1431904 1433571
58989 1433571 1436104 1439719 1444867 1451386 1458593 1466094 1474173 1483461 1494450 1507284 1521910 1538487 1557474
58976 1557474 1578951 1602069 1625868 1650571 1677262 1706169 1736222 1766615 1797753 1830061 1862782
58965 1862782 1894827 1926141 1957320 1988426 2019090 2049355 2079522 2109479 2139127 2169301 2201425
58954 2201425 2236327 2274072 2314819 2359041 2406899 2458087 2512476 2570388 2632241 2698343 2769033
58943 2769033 2844579 2924990 3010413 3101668 3199921 3305865 3419663 3541650 3672696 3813944
58933 3813944 3966658 4132335 4312469 4508032 4719431 4947087 5191914 5455372 5739274
58924 5739274 6045532 6375903 6732014 7115690 7529023 7973934 8451933 8964480 9513256
58915 9513256 10099633 10723881 11384831 12079724 12803800 13549955 14308885 15069224 15817307
58906 15817307 16537149 17210948 17819585 18342980 18761557 19059286 19226405 19259719 19161127 18936685
58896 18936685 18596923 18156896 17634766 17049453 16418671 15757979 15080659 14397870 13718669
58887 13718669 13050125 12397764 11765999 11158126 10576298 10022097 9497180 9003001 8540040
58878 8540040 8107861 7705813 7333080 6988103 6668811 6373640 6101701 5851853 5622393
58869 5622393 5411903 5219534 5044065 4883417 4735587 4599502 4474706 4360958 4258493
58860 4258493 4167784 4088391 4018706 3957384 3904362 3859967 3823836 3795400 3774648 3761582 3755546
58849 3755546 3755941 3763131 3777770 3799715 3828444 3864161 3907625 3959132 4018445 4085506 4160561 4243953
58837 4243953 4336481 4439707 4555131 4683282 4824216 4978652 5148001 5333630 5536787 5758985
58827 5758985 6001760 6266275 6553783 6866302 7206296 7575933 7977192 8412256 8883129
58818 8883129 9391087 9936997 10521719 11145280 11805707 12498879 13218829 13957358 14703625
58809 14703625 15444592 16165247 16847678 17470865 18013085 18455151 18781484 18979651 19041182
58800 19041182 18963645 18751301 18413744 17964575 17420840 16801848 16127083 15414746 14681543
58791 14681543 13942506 13210321 12495058 11804621 11145148 10521121 9935655 9390763 8887195
58782 8887195 8424406 8001213 7616124 7266434 6947131 6651245 6371124 6099486 5830616
58773 5830616 5562275 5296619 5038326 4791532 4558649 4341238 4140476 3956527 3788374
58764 3788374 3634692 3494460 3366808 3250894 3146025 3051331 2965444 2887046 2815752 2751856
58754 2751856 2695244 2645002 2600044 2559626 2523240 2490240 2459425 2428789 2396145 2360332 2321438
58743 2321438 2279650 2234762 2187343 2139389 2092824 2048000 2004591 1963087 1924106 1886790 1849397
58732 1849397 1811291 1773084 1735033 1696653 1657934 1619634 1582146 1545170 1508623 1472914 1438221
58721 1438221 1404499 1372313 1342677 1315904 1291509 1269349 1249946 1233528 1219611 1207678 1197375
58710 1197375 1187921 1178195 1167637 1156376 1144372 1131204 1116749 1101304 1085012 1067916 1050608 1034031
58698 1034031 1018596 1004234 991197 979915 970139 961140 952806 945651 939808 935061 931924 931585 934545
58685 934545 940257 948282 958929 972414 988156 1005092 1021984 1037480 1050848 1062905 1075487 1089934
58673 1089934 1106900 1127506 1153496 1185872 1224223 1267579 1314836 1363792 1410332 1448940 1473861
58662 1473861 1480447 1466979 1435940 1393023 1344496 1295449 1249530 1208750 1173245 1142304 1115922
58651 1115922 1094720 1078603 1066703 1058731 1055206 1056193 1060903 1068747 1079673 1093311 1108945 1126679
58639 1126679 1147543 1172122 1200082 1231358 1266661 1306397 1350137 1397705 1449898 1507744 1571891
58628 1571891 1643110 1722428 1810344 1906764 2012128 2127799 2255046 2394423 2546393 2711590
58618 2711590 2890044 3080922 3283293 3496132 3717126 3942043 4165372 4380680 4580300
58609 4580300 4755872 4899823 5005994 5069294 5086385 5057263 4985226 4875051 4732208 4563749
58599 4563749 4378164 4183289 3985016 3788106 3596798 3413906 3240540 3077515 2926194
58590 2926194 2787490 2661096 2546276 2442430 2348368 2262211 2182754 2110133 2044605 1985617
58580 1985617 1932573 1885520 1844421 1808707 1778114 1753112 1733945 1720012 1710383 1703820 1697841 1688984
58568 1688984 1674661 1653950 1626428 1591774 1551109 1507325 1463147 1419947 1379079 1342860 1313007
58557 1313007 1289125 1269839 1254551 1243024 1234048 1225580 1215716 1202904 1186013 1165043 1141252 1115946
58545 1115946 1089739 1063308 1037874 1014282 992432 972119 953551 936563 920341 904519 889596
58534 889596 875802 862564 849516 836880 824413 811363 798042 786037 776089 767250 758913 752077
58522 752077 747470 743886 739847 735704 732734 731135 730216 729678 729523 729581 730221 732618 737131 742321 746727 750713
58506 750713 755517 761490 768554 777374 788614 801703 815616 830259 845902 861919 877213 891266
58494 891266 903687 913532 920197 924314 926592 926504 923232 917168 909331 899939 888686 875815 861886 847147
58480 847147 832081 817688 804134 790019 774215 757675 742227 728385 715644 704127 694410 686215
58468 686215 678634 671391 664791 658915 653826 649988 647437 645105 642068 638883 636665 635527 634923 634885 635782
58453 635782 637465 639782 643346 648746 655575 663166 671644 681241 691278 700843 709773 717962 724409 727983
58439 727983 728578 726720 722803 717528 712113 707250 702811 699273 698018 699180 700759 701270 701896 704510 708875
58424 708875 713537 718304 723917 730206 736543 743468 752032 761895 771661 780551 788392 794572 798519 800679
58410 800679 801622 800791 797472 792355 786877 781692 776958 773215 770626 768244 765366 762801 761539 761289 761642
58395 761642 763421 767197 771643 775132 778006 781567 785808 789865 793752 797895 801858 805201 808595 812550
58381 812550 816244 819283 823184 829172 835914 841664 847258 854534 862991 870636 877215 883944 890814 896831
58367 896831 902372 908834 916313 923905 931773 940638 949875 958441 967075 977063 987284 994938 998932 1000344
58353 1000344 1000033 998096 995306 992816 990709 988782 988133 989914 993277 996799 1001123 1007812 1016413 1025195
58339 1025195 1034043 1044103 1055222 1066335 1077746 1090461 1103853 1116549 1128943 1142344 1156397
58328 1156397 1169919 1183460 1198307 1213820 1228462 1242427 1256378 1268748 1277508 1283626 1289393 1294369
58316 1294369 1296629 1297183 1299228 1303469 1308031 1312693 1319346 1328342 1338182 1348880 1361969 1377055 1391874
58303 1391874 1405910 1420686 1436575 1452690 1469691 1489203 1510676 1532332 1554786 1580165 1608179
58292 1608179 1636994 1667402 1701958 1740379 1780156 1821357 1866296 1914575 1963162 2011367 2060959
58281 2060959 2111089 2157895 2199461 2236657 2268872 2293936 2312781 2329324 2345213 2359443 2373418
58270 2373418 2391142 2413662 2438452 2464967 2495703 2531087 2568647 2608112 2652072 2700732 2751275
58259 2751275 2803205 2858926 2918419 2978990 3040992 3107966 3180355 3255146 3332408 3415733 3505343
58248 3505343 3597396 3691166 3790167 3895135 4003064 4114319 4233198 4360071 4490723 4625079
58238 4625079 4768580 4923214 5085557 5255607 5438689 5636244 5843756 6060607 6292846
58229 6292846 6543337 6808575 7088296 7388487 7711559 8053825 8416395 8808205 9234457
58220 9234457 9692857 10185147 10720845 11305427 11937025 12619403 13365665 14184801 15078749
58211 15078749 16058090 17146053 18361914 19716993 21233478 22950178 24904124 27127686
58203 27127686 29673626 32624305 36071142 40112427 44883213 50560548 57328554 65372721
58195 65372721 74929023 86316054 99926750 116258980 135978202 159850919 188492597
58188 188492597 222099030 260214673 301288294 342007261 377163589 400911649 409086758
58181 409086758 400982296 379282580 348469660 313089871 276806716 242156582 210598613
58174 210598613 182717888 158551918 137879278 120350079 105543964 93057888 82568436
58167 82568436 73805159 66512204 60476557 55560473 51668191 48712471 46652265 45528687
58159 45528687 45412731 46334579 48288115 51218216 54850371 58485654 61082475 61706983
58151 61706983 60009695 56328051 51391762 45943175 40535382 35512631 31051077 27198061
58143 27198061 23918206 21143831 18804307 16830409 15155541 13724233 12496335 11440665
58135 11440665 10529148 9738987 9054277 8460033 7937137 7466946 7038083 6644390 6278519
58126 6278519 5932458 5603096 5292228 5001155 4729343 4477803 4249015 4042835 3856317
58117 3856317 3688029 3538798 3407871 3292158 3189654 3099588 3018386 2939472 2858510 2775713
58107 2775713 2692389 2608921 2527148 2450667 2380764 2314881 2250502 2187638 2126406 2065517 2004840
58096 2004840 1946460 1891421 1838046 1785101 1734041 1686554 1642272 1600365 1561019 1523896 1487474
58085 1487474 1451299 1416656 1383839 1351147 1317788 1285262 1254532 1224416 1194312 1166019 1141057
58074 1141057 1118423 1096751 1076591 1058775 1042515 1026911 1012535 999808 987572 974891 962600
58063 962600 951465 940478 928624 916794 906275 896692 886932 876819 866458 855239 842929 830618
58051 830618 819265 808423 797513 787197 778390 771019 764674 759335 754663 749892 745213 741861 740070
58038 740070 738448 736167 734125 733076 732400 731728 731968 733440 734636 734154 732383 730027 726575 721582 715980
58023 715980 710681 705216 699161 693487 689040 685041 680665 676888 675104 675013 675459 676444 678719 682161 686037
58008 686037 690101 694038 696523 696268 693414 688655 681658 671749 659594 646844 634342 621887 609536
57995 609536 598065 588179 579958 572930 566226 559055 551534 544637 538972 534123 529468 524963 520817 517218
57981 517218 514700 513888 514497 515409 516025 516572 516903 516233 514462 512494 510827 509091 507385 506524 506358 505388 502908
57964 502908 500123 498258 497035 496018 495988 497775 500958 504915 509990 516448 523479 530523 538483 548287 559191
57949 559191 569795 579763 589240 597507 603713 608176 611523 613064 611378 606071 597891 587595 575773
57936 575773 563268 550682 537890 524896 512546 501491 491149 480697 470446 461189 452867 444939
57924 444939 437534 431212 426078 421980 419084 417409 416452 416094 417111 419889 423496 427029 431040 436532 443347
57909 443347 450818 459238 469273 480413 491374 501681 511607 520855 528469 533889 537153 538444 538327
57896 538327 537873 537417 535647 531046 523899 515800 507637 499256 490748 482755 475554 468942 463037 458354 455187
57881 455187 453654 453988 456017 458834 461916 466118 472542 480865 489831 498932 508362 517641 525684 532219
57867 532219 537975 543386 548081 551687 554109 554949 553516 549582 543525 535879 527347 518910 511080 503300
57853 503300 495004 486946 480468 475661 471347 466853 462739 459724 457843 456875 456727 457239 458210 459710 461766
57838 461766 463834 465147 465408 464566 462239 458164 452951 447492 441770 435083 427242 418651 409422 399447 389315
57823 389315 380139 372366 365572 359394 353796 348465 342981 337717 333611 330890 328896 327333 326689 327119 327862
57808 327862 328323 329075 331275 335563 341908 350050 359718 370784 383559 398645 416244 435768 456172
57795 456172 476299 494816 510240 521417 528036 530746 530805 529371 526784 522532 516053 507423 497225
57782 497225 486055 474308 462068 449014 434984 420817 407993 397114 387417 378276 370342 364505
57770 364505 360475 357361 355015 353756 353303 353108 353478 355201 358220 361741 365534 370055 375286 380554 385657
57755 385657 391224 397689 404745 412060 419822 428232 436954 445334 452851 459404 465516 472142 479845 488378
57741 488378 497424 507331 518537 530696 543115 555681 568595 581691 594948 609232 625425 643110
57729 643110 661228 679832 699944 721869 745019 769515 796559 826873 860007 895679 934735
57718 934735 978217 1026365 1079037 1136367 1198654 1266432 1341099 1424793 1519182 1624917 1742444
57707 1742444 1872625 2016325 2174154 2346877 2535161 2738367 2954152 3179425 3410781
57698 3410781 3643365 3869890 4081322 4268264 4421721 4533784 4598862 4614669 4582233 4505490
57688 4505490 4390843 4246197 4079617 3898694 3710605 3521744 3336972 3159835 2993452
57679 2993452 2840418 2701881 2577921 2469207 2377293 2302992 2245768 2205533 2184105 2183968 2206332
57668 2206332 2250991 2316593 2398758 2487387 2566951 2620897 2637439 2613461 2554965 2474082 2384393
57657 2384393 2297270 2220656 2159341 2115463 2089336 2080725 2089551 2115536 2157959 2216307 2290768 2381638
57645 2381638 2488679 2611537 2750256 2904696 3073602 3254552 3444319 3638586 3831530
57636 3831530 4016234 4185382 4331256 4445657 4521030 4552353 4538149 4480154 4382513 4251051
57626 4251051 4092531 3914051 3722756 3525422 3327636 3133282 2945007 2765032 2595240
57617 2595240 2436709 2289614 2153732 2028900 1914905 1811038 1715895 1627908 1546326 1471534
57607 1471534 1404044 1343307 1287940 1237085 1190937 1149838 1113377 1080585 1050544 1022620 996581
57596 996581 972638 950935 930876 911496 892638 875134 859640 846007 834016 823892 815588 808383
57584 808383 801869 796687 793545 792107 791658 792339 794755 798653 802971 807162 811721 817419 824761 834177 846010
57569 846010 860120 876042 893676 913434 935702 960604 988309 1019141 1053354 1091289 1133746
57558 1133746 1181774 1236037 1296798 1364549 1440132 1524144 1616672 1717811 1828086 1948114 2078056
57547 2078056 2217518 2365657 2521033 2681297 2842944 3001147 3149855 3282405 3392411
57538 3392411 3474318 3523684 3537661 3515696 3459747 3373740 3262838 3132961 2990321 2840745
57528 2840745 2689112 2539268 2394245 2256326 2126956 2006820 1896240 1795488 1704630 1623146
57518 1623146 1550022 1484433 1426210 1375498 1332088 1295317 1264456 1238829 1217660 1200276 1186570
57507 1186570 1176924 1171571 1170389 1173374 1180818 1192737 1208557 1227817 1250991 1279263 1313620 1354491
57495 1354491 1402180 1457317 1520758 1593142 1674582 1764869 1864103 1973061 2092602 2222584 2361553
57484 2361553 2507395 2657684 2808986 2956148 3092622 3211462 3306088 3370811 3401554 3396423
57474 3396423 3355757 3281917 3179145 3053060 2909653 2754573 2593165 2430506 2270737 2116456
57464 2116456 1969158 1830127 1700521 1580838 1470822 1369977 1277872 1194012 1117799 1048681
57454 1048681 986082 929210 877226 829650 786360 747168 711563 678830 648336 619805 593459
57443 593459 569757 548689 529467 511161 493590 477298 462727 449708 437731 426397 415515
57432 415515 405018 394959 385521 376875 368964 361446 353921 346417 339517 333817 329177 324788 320016 314889
57418 314889 309719 304681 300056 296434 294200 292943 291752 290033 287829 285525 283515 281964 280641 279122
57404 279122 277388 275922 274942 273960 272596 271457 271463 272387 272885 272160 270926 270417 270923 271745 272234 272396 272629 273293
57386 273293 274562 276399 278525 280529 282150 283407 284382 284897 284532 283096 281028 279192 278271 278485 279690
57371 279690 281447 282978 283588 283395 283366 284322 286142 288154 289945 291484 292746 293809 295192 297532 300882
57356 300882 304636 308202 311460 314584 317749 321052 324445 327643 330360 332700 335154 338181 341929 346295
57342 346295 351080 356068 361092 366031 370724 375099 379518 384726 391180 398641 406610 414857 423163 431017
57328 431017 438242 445761 455008 466439 479234 492562 506597 522024 539069 557393 576671 596957
57316 596957 618653 642212 667698 694571 722190 750559 780180 811083 842377 872909 901938
57305 901938 928947 953293 974394 991844 1004903 1012184 1012395 1005299 991525 971663 946161 916079
57293 916079 883256 849341 815009 780444 746267 713539 682981 654658 628538 604970 584358
57282 584358 566585 551101 537444 525401 514733 505208 496936 490264 485106 480787 476869 473721 471813
57269 471813 470724 469481 467749 466069 464905 464086 463395 463066 463278 463649 463736 463764 464336 465607 467199 468955 471267
57252 471267 474522 478463 482364 485769 488976 492789 497745 503516 509096 513672 517276 520587 524266 528641
57238 528641 533903 540287 547905 556596 566046 575983 586137 596168 605872 615521 625795 637188 649537
57225 649537 662285 675163 688405 702306 716833 731795 747118 762638 777770 791765 804449
57214 804449 816522 828988 842339 856306 870358 884397 898970 914762 931921 950107 969238
57203 969238 989919 1012862 1038045 1064731 1092201 1120107 1148214 1176212 1203974 1231700 1259584
57192 1259584 1287497 1315144 1342462 1369807 1397832 1427173 1458159 1490813 1525237 1561856 1601152
57181 1601152 1643263 1688021 1735087 1783609 1831943 1878444 1922714 1965623 2007954 2049642 2090727
57170 2090727 2132463 2176687 2224108 2273657 2323513 2372387 2419845 2465937 2510943 2555429 2600159
57159 2600159 2645642 2691582 2736958 2780973 2824007 2867398 2912163 2958172 3004604 3050756 3096049
57148 3096049 3139593 3180337 3217733 3251944 3283326 3311910 3337415 3359525 3378040 3392924 3404376
57137 3404376 3412950 3419781 3426759 3436292 3450593 3471049 3498220 3532206 3572707 3618759 3668685 3720515
57125 3720515 3772490 3823282 3872006 3918337 3962788 4006963 4053458 4105344 4165528 4236294 4319042
57114 4319042 4414242 4521791 4641728 4774638 4921418 5083214 5262206 5462478 5689717 5950251
57104 5950251 6251063 6600828 7010446 7492836 8063487 8742022 9552923 10524635 11688715
57095 11688715 13079859 14735082 16691016 18981292 21635596 24678437 28125404 31978147
57087 31978147 36220108 40812578 45691531 50768900 55938258 61075395 66026191 70592589
57079 70592589 74540200 77636447 79699733 80631329 80420089 79130025 76882120 73833564
57071 73833564 70156251 66020110 61584658 56995696 52382459 47854521 43499981 39384984
57063 39384984 35554016 32031765 28826943 25936399 23347918 21042368 18996408 17185253
57055 17185253 15584268 14169727 12919705 11814889 10838397 9974929 9210374 8532100 7929088
57046 7929088 7391504 6910095 6475839 6079962 5714410 5372715 5050882 4747938 4465746
57037 4465746 4207484 3974620 3764140 3568858 3381125 3196388 3013105 2830239 2646506
57028 2646506 2462565 2282644 2112743 1957250 1817678 1693873 1585098 1489849 1405864 1331094
57018 1331094 1264333 1204602 1150640 1101543 1057438 1018959 986397 959895 940063 927848 924141
57007 924141 930056 947197 977250 1022227 1086138 1175651 1297847 1457811 1658724 1900207 2169719
56996 2169719 2433488 2641820 2751549 2747882 2646797 2479957 2279160 2070146 1871674 1694643
56986 1694643 1542727 1415838 1312893 1231360 1166453 1112683 1065663 1021910 978252 932828 886017
56975 886017 839395 794285 751743 712821 677748 645505 615196 587265 562619 541355 523296
56964 523296 509020 499168 493300 490597 491364 496672 506736 520610 537104 554691 570479 580480 581502
56951 581502 572532 554651 530467 503478 476840 452196 429941 410385 393987 380659 369820 361359
56939 361359 355872 353788 354959 359374 367719 380972 399741 424090 453530 486838 521697 554246
56927 554246 579032 590571 586321 568350 541579 510470 477685 445028 414156 386111 361146 339297
56915 339297 320462 303939 288810 275039 263360 253901 245734 238071 231048 224972 219640 214869 210977
56902 210977 208158 205977 204018 202523 201903 202055 202667 203793 205679 208424 212212 217509 224655 233611 244435
56887 244435 257534 272943 289690 306194 320863 331975 337670 336926 330507 320377 308273 295219
56875 295219 282141 270234 260577 253727 249754 248406 249290 252248 257685 266401 279148 296449 318813
56862 318813 346866 381104 421291 465848 511628 554292 589017 611309 618158 609411 588194 559442
56850 559442 527685 496116 467127 442693 423940 410954 403351 400716 402475 408110 417946 433364
56838 433364 455967 486902 527089 577363 637707 706304 779041 849192 907667 945272 956530
56827 956530 941875 906226 856009 797577 736913 678856 626198 580151 541596 511196 488537
56816 488537 472255 461414 456228 457369 465289 480567 504223 537023 578545 626972 679180 730420
56804 730420 774224 803755 814236 804650 777455 737031 688324 636178 584807 537147 494739 458330
56792 458330 428302 404338 385253 369962 358620 352261 351363 355436 364094 377741 396801 420695
56780 420695 447750 475409 500081 517521 524383 519635 504388 480845 451810 420562 390087 362005
56768 362005 336529 313495 293110 275762 261500 249864 240077 231373 223295 215717 208571 201679 194952
56755 194952 188592 182989 178439 174932 172049 169197 166150 163303 161071 159182 157050 154772 153110 152320
56741 152320 151674 150360 148342 146053 143835 142037 141046 140731 140280 139056 137273 135520 134141 133415 133660 134545
56725 134545 134892 133931 132358 131366 131026 130439 129229 128008 127376 127258 127332 127450 127499 127399 127347 127652 128274 128897 129414
56706 129414 129893 130150 129912 129411 129310 129984 131293 133024 135081 137147 138673 139430 139720 139903 140097 140470 141432
56689 141432 143162 145155 146499 146625 145663 144142 142463 140725 139009 137615 136809 136335 135519 133921 131698
56674 131698 129282 126996 125065 123682 122845 122384 122222 122279 122130 121306 120112 119458 119587 119598 118731 117445 116557
56657 116557 115892 114669 112889 111408 110743 110643 110839 111392 112145 112576 112507 112485 113106 114243 115167 115301 114748 114133
56639 114133 113980 114177 114278 114320 114942 116413 118010 118856 119078 119584 120863 122544 124018 124979 125422 125586 126020
56622 126020 127320 129690 132827 136061 138488 139404 138993 138253 137811 137132 135448 133128 131454 131184 131997 133243
56606 133243 134553 135703 136507 137090 137789 138591 139000 138618 137610 136585 136172 136611 137544 138310 138662 139029 139932
56589 139932 141383 143074 144759 146131 146778 146691 146495 146686 147016 147108 147203 147679 148250 148425 148471 149102 150342 151503
56571 151503 152243 152947 154027 155496 157275 159326 161459 163516 165748 168536 171795 175168 178697 182755 187424
56556 187424 192424 197561 202650 207175 210644 213245 215571 217792 219670 221239 222779 224126 224664 224097 222725
56541 222725 220934 218884 216595 213873 210279 205667 200629 195930 191727 187875 184609 182186 180149 177787
56527 177787 175145 172800 170851 169030 167580 166960 166786 166119 164867 163776 162948 161558 159377 157388 156319
56512 156319 155550 154228 152665 151819 151829 151869 151238 150099 149196 149175 150058 151224 152060 152638 153582 155317 157710 160389
56494 160389 163083 165665 168148 170546 172530 173524 173498 173317 173872 175232 177079 179406 182051 184159 185086 185499
56478 185499 186560 188294 189827 190987 192495 194616 196812 198794 200744 202410 203179 203366 204290 206605 209464
56463 209464 211709 213048 213713 213850 213628 213279 212684 211601 210425 209979 210366 210866 211081 211303 211617 211656 211548 212109
56445 212109 213671 215605 217331 218953 220564 221803 222557 223276 224195 225023 225737 226802 228216 229155 229057 228309
56429 228309 227426 226370 225083 223880 222784 221214 218869 216287 214078 212213 210425 208649 206709 204273
56415 204273 201555 199445 198532 198514 198764 198876 198525 197571 196517 196133 196406 196641 196680 197055 197844 198452 198816 199700
56397 199700 201326 202824 203558 204085 205260 207242 209814 212770 215571 217559 218957 220707 222972 224801 225708
56382 225708 226397 227412 228308 228810 229573 230965 232178 232523 232644 233508 234997 236363 237363 238180 239003 240388
56366 240388 243144 247104 250870 253540 255810 258547 261323 263362 265067 267436 270570 273922 277451 281524
56352 281524 286069 290830 296148 302653 310336 318555 326648 334100 340553 346216 351716 357031 361064 362801
56338 362801 362378 360622 358102 355092 351790 348153 344080 340132 337369 336087 335398 334352 332807 330994 329190
56323 329190 328049 328198 329224 330108 330832 332278 334326 335630 335792 336082 337286 338500 338974 339508 340816 342031
56307 342031 342260 342328 343587 346033 348896 352024 355424 358568 361494 365562 371715 378883 385462 391466 397883
56292 397883 404868 412063 419865 428841 438598 448565 459329 471831 485913 500936 517202 535462 555596
56279 555596 577030 599926 624891 652163 682151 716004 754509 797206 843774 895414 953595
56268 953595 1018179 1088043 1162783 1242510 1326743 1414768 1506345 1600872 1696609 1791854 1885885
56257 1885885 1977533 2064043 2142876 2213650 2276767 2331286 2375988 2411602 2439945 2461548 2475944
56246 2475944 2483733 2486339 2484093 2476257 2462589 2443204 2417275 2383533 2341774 2292371 2234854 2168727
56234 2168727 2095351 2017319 1936163 1852222 1766445 1680653 1596105 1513269 1432879 1355911 1282697
56223 1282697 1213306 1148463 1088923 1034369 984100 938296 897400 860886 827923 798562 772989
56212 772989 750410 730057 712443 698154 686293 675749 667075 661330 657960 655697 654702 655803 658311
56199 658311 660746 663154 666641 670990 674878 678071 681374 684541 686171 685601 683289 679544 674463 668763
56185 668763 663147 657295 650898 644898 640126 635660 630473 625764 623553 623704 624501 625422 627139 629531 632102
56170 632102 635769 641769 649271 656438 663424 671950 682436 694029 706949 722122 738736 754868 770534
56157 770534 787686 807273 828739 852237 878812 908443 940462 975997 1017641 1066658 1122900
56146 1122900 1187469 1263133 1352210 1456498 1579288 1724863 1895635 2091537 2311493 2552328
56136 2552328 2805738 3058743 3297989 3512984 3697196 3849879 3977260 4089045 4192444
56127 4192444 4289882 4380160 4458440 4516240 4545992 4547025 4525356 4488178 4440737 4386471 4325004
56116 4325004 4249169 4147772 4012809 3842536 3639226 3408591 3161645 2912518 2672345 2447256
56106 2447256 2241786 2060154 1903337 1768522 1652749 1554435 1471123 1399249 1337015 1284523
56096 1284523 1240633 1202868 1170721 1145473 1126225 1109629 1094213 1081384 1071530 1062848 1054845 1049279
56084 1049279 1046630 1045125 1044151 1045062 1047797 1050374 1052627 1056654 1062608 1067924 1071827 1076744 1084000 1091907
56070 1091907 1099406 1107831 1117656 1127221 1136086 1146132 1158087 1170439 1182864 1197024 1212897 1228155
56058 1228155 1242315 1257741 1275526 1294267 1313753 1335676 1359672 1382997 1405172 1428588 1453568
56047 1453568 1477482 1499828 1523232 1548134 1571543 1592537 1613921 1636823 1658874 1679464 1701582
56036 1701582 1726605 1752541 1779199 1809507 1843784 1878502 1912937 1951165 1994956 2040588 2085442
56025 2085442 2131848 2181548 2232274 2282942 2336485 2394409 2454136 2514664 2579034 2648262 2718952
56014 2718952 2789992 2865361 2947139 3032046 3118132 3208207 3303300 3399646 3495863 3596143 3702507
56003 3702507 3810859 3918631 4029201 4144963 4263659 4385644 4516878 4660275 4811961
55994 4811961 4970332 5140427 5324937 5520012 5724852 5945966 6186583 6441587 6708664
55985 6708664 6994463 7303779 7633399 7983196 8362294 8777161 9224949 9706010 10231055
55976 10231055 10808002 11434226 12110392 12849073 13661003 14547069 15513905 16583238 17775975
55967 17775975 19103150 20583906 22256080 24158322 26321942 28795510 31659944 35008568
55959 35008568 38938213 43577734 49100031 55688485 63523362 72828582 83911832 97158578
55951 97158578 113054809 132253720 155534732 183571459 216657307 254467747 295632304
55944 295632304 337060771 373706924 399661579 410394702 404657734 384672463 354726666
55937 354726666 319440199 282686845 247227027 214705490 185840318 160739807 139197671
55930 139197671 120852930 105269977 92021924 80747656 71140750 62923089 55858068
55923 55858068 49767125 44506886 39942815 35959434 32475112 29425135 26742145 24366914
55915 24366914 22262272 20399407 18741768 17255553 15923369 14733364 13665041 12697782
55907 12697782 11822915 11035197 10321388 9668067 9071873 8531511 8037730 7580913 7160534
55898 7160534 6777693 6425724 6097101 5792443 5513965 5256771 5014770 4788700 4580423
55889 4580423 4385580 4199432 4023928 3861725 3709150 3562116 3423120 3295480 3176334
55880 3176334 3062145 2955452 2859233 2769807 2682128 2597205 2517815 2441836 2366486 2294590 2230067
55869 2230067 2171257 2114843 2062280 2016326 1975153 1935877 1900191 1870772 1845748 1822346 1802544
55858 1802544 1789550 1782013 1776971 1774989 1776707 1777261 1769667 1751415 1723273 1684792 1636079 1581255 1525124
55845 1525124 1468507 1410966 1355248 1304542 1257992 1213286 1171139 1133122 1097936 1064053 1033353
55834 1033353 1007888 985821 964681 945819 931258 919018 906127 893655 884255 877109 869815 862770
55822 862770 857079 850386 839585 825799 812151 798441 782541 765309 749486 735119 720463 706196
55810 706196 694477 684863 675048 664680 654860 645148 634644 624773 617367 611273 604404 597683 593307
55797 593307 590443 586424 581013 575772 570327 563035 554544 547136 541302 536210 532464 530928 529644 525324
55783 525324 517241 506675 493617 477410 459666 443063 427866 412816 398605 387160 378154 369547
55771 369547 361093 354159 348624 343077 337590 333257 329431 324484 318947 314898 312499 309917 306418 302933
55757 302933 299906 297128 295204 294607 293745 290479 285026 278932 272106 263627 254713 247730 242638 237286 230950
55742 230950 224799 219223 213553 208308 204952 203377 202109 200910 200761 201477 201796 201719 202385 203843 205211 206656
55726 206656 208759 210335 209511 206815 204682 204047 203939 204240 206062 209252 212151 214289 217032 221139 225765
55711 225765 230137 234283 237873 240211 241528 242575 242987 241783 239296 236764 234303 231133 227469 224185
55697 224185 220892 216437 211141 206557 203262 200825 199533 199996 201355 202126 202583 204114 206511 208253 209309
55682 209309 211249 214558 218183 221739 225820 229946 232634 233809 234955 236541 237392 236957 236065 235122 233538
55667 233538 231266 228965 226323 222240 217023 212510 209637 207658 205891 204387 202642 199717 196011 193036
55653 193036 191056 188765 185578 182294 179150 175169 169938 164257 158535 152270 145584 139549 134567 130052
55639 130052 126048 123402 121936 120203 117543 114745 112274 109545 106496 104186 103152 102609 101813 100862 99736
55624 99736 97973 95712 93685 91880 89564 86845 84718 83273 81444 78884 76604 75433 75173 75514 76324
55609 76324 76861 76237 74909 74233 74355 74119 73206 72615 72730 72662 71950 71347 71395 71675 71853 72082 72138 71620 71179 71974
55589 71974 73758 75069 75435 75681 75994 75607 74628 74158 74181 73372 71539 70195 70096 70205 69841 69797 70366 70201 68401
55570 68401 66095 64818 64650 64997 65801 67008 68052 68777 69721 70852 71343 71188 71570 72915 74119 74501 74983
55553 74983 76405 78178 79589 81001 82730 84055 84468 84759 85884 87770 90044 92739 95493 97280 97766
55538 97766 97777 97660 96656 94732 93475 93901 94679 93894 91546 89040 87104 85387 83378 80661 76918 72615
55522 72615 68948 66322 63726 60391 57103 55007 53981 53148 52171 51069 49512 47266 44787 42624 40785
55507 40785 39271 38552 38854 39619 40198 40498 40589 40462 40477 41067 41708 41233 39539 37834 36738 35438 33255 30714
55489 30714 28397 26109 23934 22821 23145 23915 24326 24930 26292 27724 28410 28754 29486 30383 30953 31431 32049
55472 32049 32199 31412 30382 30059 30439 31065 31825 32447 32217 31122 30263 30153 29725 28125 26356 25772 25901 25289
55454 25289 23809 22579 22047 21632 21037 20695 20974 21903 23522 25621 27407 28171 28132 27978 27946 27931 28039 28375
55436 28375 28711 28831 28788 28430 27409 26051 25370 25681 26133 26144 26257 26832 27064 26320 25429 25488 26195 26513 26313
55417 26313 26217 26407 26696 27279 28400 29627 30342 30516 30356 29790 28990 28658 29058 29515 29570 29679 29955 29377 27406
55398 27406 25322 24595 24817 24705 24285 24475 25067 24903 23772 22535 21478 20049 18271 17091 17077 17832 18789
55381 18789 19663 20095 19827 19291 19215 19586 19783 19675 19786 20384 21153 21799 22356 22889 23469 24344 25633 26968 27837
55362 27837 28128 27959 27378 26655 26465 27265 28785 30426 31719 32171 31430 30060 29325 29680 30262 30384 30489 30902
55344 30902 30753 29201 26814 24659 22856 21142 20016 20025 20583 20823 21021 21917 23086 23357 22505 21307 20289
55327 20289 19573 19519 20245 20842 20336 19172 18537 18535 18314 17686 17316 17414 17556 17700 18230 19025 19619 20156 21162 22544
55307 22544 23847 25206 26823 27868 27274 25442 23804 22821 21828 20720 20179 20162 19768 18896 18504 18854 19021
55290 19021 18665 18770 19857 20774 20303 19041 18632 19731 21489 22632 22507 21452 20512 20462 20925 20912 20222 19610
55272 19610 19509 19511 19345 19457 20098 20680 20625 20282 20388 21041 21703 21902 21552 20884 20399 20576 21349 22060 22145 21645
55252 21645 20994 20539 20394 20482 20630 20760 20992 21392 21843 22349 23169 24298 25146 25260 25065 25300 25941 26307 26127
55233 26127 25789 25614 25462 25172 24916 24995 25576 26567 27554 28136 28532 29420 30817 31725 31433 30558 30117 30148 30189 30525
55213 30525 31768 33485 34464 34355 33964 33822 33477 32464 31081 29855 28947 28382 28341 28869 29605 29928 29289 27622
55195 27622 25724 24855 25448 26544 26990 26748 26414 26002 25080 23771 22733 22300 22354 22701 22895 22170 20478 19119
55177 19119 19323 20618 21714 22468 23631 25024 25578 25176 24894 25225 25491 25351 25436 26008 26266 25695 25018 25108
55159 25108 25813 26560 27406 28811 30803 32786 33844 33166 30807 28129 26801 27180 28274 29244 30126 31064
55143 31064 31875 32699 34166 36541 39372 42286 45417 48837 52241 55349 57957 59499 59423 58124 56629
55128 56629 55235 53369 50962 48848 47465 46160 44342 42443 41168 40550 40258 40164 40102 39704 39011 38689 39192
55111 39192 40173 40986 41338 41221 40841 40755 41422 42378 42577 41784 40919 40773 41117 41402 41607 42000 42695 43755 45140
55092 45140 46333 46716 46558 46923 48287 49921 50882 50919 50209 49060 48165 48299 49333 50269 50557 50627 50873 51066
55074 51066 51202 51957 53634 55456 56575 57167 57883 58803 59497 59668 59239 58287 57217 56495 55931 54893 53547
55057 53547 53082 54219 56267 58207 60007 62175 64623 66697 68004 68591 68601 68199 67630 67044 66508 66257 66452
55040 66452 66669 66295 65568 65503 66495 67753 68396 68399 68131 67680 67034 66273 65272 63876 62522 61898 61747 60988 59340
55021 59340 57835 57264 57139 56735 56143 55594 54725 53284 51764 50585 49418 48033 46941 46406 45709 44333
55005 44333 43074 42942 43664 44385 45228 46962 49427 51467 52307 52163 51583 51010 50882 51451 52495 53700 55123
54988 55123 56910 58925 61084 63600 66351 68539 69641 70353 71942 75026 79512 85262 92155 99913 108540
54973 108540 118611 130464 143462 156637 169654 182458 194341 204149 211176 215218 215963 213001 206339
54960 206339 196533 184522 171669 159463 148584 138577 128944 120099 112701 106547 100876 95447 90647
54947 90647 86698 83359 80337 77574 75301 74013 73999 74698 75048 74770 74650 75273 76387 77961 80864 85620
54931 85620 91391 97203 103517 111493 121238 131889 142887 153915 163804 170780 173948 173673 170536 164765
54917 164765 156732 147209 136952 126549 116589 107473 99143 91479 84749 79261 74891 71429 68940 67242
54903 67242 65589 63592 61933 61349 61373 61007 60235 59904 60375 61244 62157 62960 63214 62564 61487 60787 60430 59783
54885 59783 58853 58291 58142 57588 56105 54089 52181 50654 49572 48882 48263 47382 46347 45409 44415 43119 41840
54868 41840 41102 40828 40592 40406 40514 40598 40133 39371 39076 39349 39588 39601 39843 40550 41478 42523 43724 44660 44817
54849 44817 44564 44775 45439 45729 45642 46315 48230 50211 50952 50660 50376 50314 49843 48804 47988 48226 49505 51154
54831 51154 52668 54244 56465 59477 62685 65450 67862 70556 74000 78349 83706 90039 97035 104604
54817 104604 113246 123316 134125 144469 153908 162692 170504 176201 179015 179226 177392 173610 167900 160685
54803 160685 152555 143957 135420 127668 121242 116227 112425 109504 106983 104560 102497 101260 100722 100139 98983
54788 98983 97388 95735 94354 93697 94321 96382 99393 102631 105674 108647 112177 117004 123369 130924 139470
54773 139470 149402 161007 173655 186215 197947 208449 217058 223124 226677 228088 227237 223858 218638
54760 218638 213125 208399 204432 200741 196911 192403 186618 179517 171721 163896 156375 149294 142499 135429
54746 135429 127703 119894 113139 107998 104082 100705 97386 93897 90453 87679 85801 84115 81903 79515
54732 79515 77735 76497 75254 74315 74548 75784 76735 76656 76008 75353 74719 74302 74554 75189 75145 74013 72600 71672
54714 71672 71100 70629 70440 70445 69958 68767 67732 67770 68902 70716 72940 75029 76065 75748 74864 74284 74195 74732
54696 74732 76306 78608 80221 80204 79356 79026 79298 79385 79282 79896 81671 84099 86565 88921 91121 92963 94366
54679 94366 95564 96895 98565 100516 102420 104015 105509 107321 109294 110708 111292 111731 112810 114533 116426
54664 116426 118263 120113 122114 124605 128132 132917 138641 145018 152090 159711 167314 174660 182342 191033
54650 191033 200679 210839 221252 231377 239845 245171 246928 245670 241830 235297 226026 214600 202122
54637 202122 189752 178281 167854 158168 149044 140701 133450 127407 122543 118670 115318 112039 108937
54624 108937 106507 104896 103867 103504 104201 105713 106937 107027 106176 104958 103587 102222 101244 100612 99512 97308
54608 97308 94398 91604 89196 87115 85542 84511 83390 81562 79382 77681 76553 75332 73686 72009
54594 72009 70756 69942 69314 68547 67285 65444 63496 62115 61565 61663 62162 62881 63585 64043 64134 63763 62947 62100
54576 62100 61825 62076 61929 60637 58611 56944 56252 56387 56987 57769 58414 58648 58461 58052 57672 57662 58382 59841
54558 59841 61638 63418 65060 66307 66775 66650 66862 68116 70146 72386 74863 77893 81302 84592 87667
54543 87667 90887 94585 98947 104107 109900 115766 121302 126513 131097 133958 134162 132098 128982 125433 121198
54528 121198 116153 110800 105717 101131 97172 93987 91420 88983 86345 83635 81154 79036 77200 75496
54514 75496 73863 72446 71470 70955 70689 70550 70626 70929 71299 71672 72087 72391 72379 72384 73094 74478 75503 75370 74609
54495 74609 74429 75325 76716 77671 77644 76854 76190 76311 76640 75866 73738 71583 70523 70052 69153 68010 67612 68136
54477 68136 68805 69026 68738 67940 66834 66232 66799 67966 68525 68216 67789 67572 67098 66290 65963 66684 67874 68527
54459 68527 68279 67495 66774 66620 67154 67892 68196 68030 67929 68163 68422 68440 68412 68609 68980 69273 69156 68183 66124
54440 66124 63540 61640 61237 62057 63171 63918 64326 64897 66071 67762 69399 70544 71274 71812 72083 72003 71973
54423 71973 72538 73642 74703 75445 76237 77575 79582 82021 84504 86693 88548 90334 92242 94179 96147
54408 96147 98408 100909 102923 103918 104499 105722 107537 108650 108068 106171 104042 102272 100723 99095 97371
54393 97371 95774 94424 93072 91319 89171 87113 85428 83828 82095 80674 80048 79796 78926 77104 74974
54378 74974 73266 72124 71359 70850 70499 70139 69656 69073 68543 68346 68707 69489 70330 71257 72708 74685 76419
54361 76419 77310 77747 78411 79258 79896 80576 82005 84354 87150 89917 92274 93690 93993 93934 94414 95229 95338
54344 95338 94351 92947 91841 91060 90244 89020 87132 84843 83061 82388 82204 81499 80298 79331 78521 77018
54328 77018 74761 72747 71498 70428 69119 68087 67751 67587 66995 66183 65616 65250 64962 65079 65807 66585 66601
54311 66601 65704 64383 63210 62591 62629 62872 62544 61308 59518 57680 56102 55106 54947 55324 55600 55671 55993 56589
54293 56589 56826 56412 55834 55452 54976 54304 54012 54382 54666 54075 52930 52100 51700 51099 49966 48719 48102 48623
54275 48623 50129 51646 52142 51825 52092 53820 56256 58118 59118 59758 60249 60484 60672 61086 61449 61361 61133
54258 61133 61444 62343 63335 64253 65198 65704 64976 63182 61664 61471 62229 62841 62789 62286 61545 60492 59128 57744
54240 57744 56606 55671 54779 54060 53946 54661 55801 56553 56347 55237 53746 52537 52083 52330 52684 52622 52352 52501
54222 52501 53113 53442 52940 52077 51829 52599 53989 55473 56941 58553 60188 61194 60866 59352 57861 57621
54206 57621 58699 60208 61515 62662 63650 64092 63832 63301 62881 62432 61764 61095 60611 60045 59197 58456 58321 58680
54188 58680 59110 59653 60718 62284 63688 64225 63703 62434 60959 59738 58890 58265 57855 57933 58635 59643 60518
54171 60518 61124 61537 61774 61891 62175 62875 63809 64421 64259 63334 62124 61272 61102 61325 61389 61126 60832 60792 61035
54152 61035 61539 62274 62976 63349 63559 64011 64496 64116 62419 60138 58443 57818 58014 58598 59113 59037 58170 56942
54134 56942 55940 55243 54527 53571 52332 50724 48821 47171 46455 46748 47370 47567 47276 47196 48109 50041 52120
54117 52120 53441 53998 54445 55044 55281 54634 53288 51951 51252 51395 52012 52331 51923 51276 51166 51468 51336 50725
54099 50725 50808 52408 54734 56304 56539 55861 54740 53453 52485 52305 52727 52980 52495 51386 50251 49749 50161
54082 50161 51096 51842 52137 52297 52491 52423 52036 51935 52565 53395 53494 52680 51620 51048 51301 52272 53342 53665 53057
54063 53057 52419 52829 54370 56281 58010 59638 61413 63350 65193 66493 66849 66346 65586 65089 64911 64943 65170
54046 65170 65440 65517 65647 66463 68006 69538 70836 72806 76077 79726 82476 84712 88104 93353 99351 104644
54030 104644 108865 112545 116299 120515 125327 130564 135906 141080 145790 149716 152938 156002 159160 161897
54016 161897 163695 164847 165855 166434 165930 164509 163008 161685 159999 157724 155490 153972 153140 152480 151490
54001 151490 149800 147272 144123 140676 137046 133355 130035 127437 125317 123178 120997 119098 117531 116099
53987 116099 114849 113910 113015 111761 110181 108443 106226 103167 99822 97331 96103 95489 94783 93857 92861 92105
53971 92105 92223 93631 95659 96998 97159 96835 96654 96380 95637 94666 93955 93622 93525 93627 94019 94870 96397 98511
53953 98511 100548 101845 102523 103165 103904 104518 105236 106554 108192 109256 109644 110384 112262 114985 118060 121635
53937 121635 125940 130580 134967 138972 142684 145976 148627 150411 150913 149942 148381 147808 148863 150656 152223
53922 152223 153727 155711 158017 160285 162864 166297 170296 174075 177462 180972 184986 189504 194485 199794
53908 199794 204999 209788 214384 219006 223193 226348 228710 231015 233239 234455 234129 232919 231875 231278 230604
53893 230604 229354 227618 225810 224077 222075 219367 215895 211869 207330 202171 196622 191183 185905 180235
53879 180235 173896 167463 161659 156524 151792 147755 145038 143621 142668 141321 139207 136258 132583 128615
53865 128615 124894 121526 118189 114801 111846 109804 108474 107091 105040 102370 99728 97823 96821 96151
53851 96151 94959 92835 90091 87397 85226 83654 82549 81823 81419 81129 80633 79890 79314 79286 79528 79305 78294
53834 78294 76965 75997 75639 75823 76507 77573 78627 79251 79439 79523 79825 80607 82200 84752 87840 90651 92671
53817 92671 93992 94886 95376 95404 95183 95110 95375 95931 96800 98125 99775 101215 102104 102887 104382 106784 109443
53800 109443 111754 113883 116406 119564 123181 127023 130937 134781 138527 142279 145956 149188 151795 154093
53786 154093 156377 158452 160118 161730 163622 165193 165396 164162 162609 161687 161210 160408 158857 156605 153909
53771 153909 151125 148489 145787 142625 139117 135838 132944 129941 126568 123370 121007 119458 118297 117289
53757 117289 116246 114677 112207 109219 106611 104935 103966 103059 101708 99946 98395 97730 97911 98137 97682 96500
53741 96500 94867 92883 90708 88940 88201 88397 88776 88747 88403 88285 88809 89915 91065 91637 91460 90943 90608
53724 90608 90598 90659 90453 89865 89196 89103 90051 91689 92978 93150 92359 91310 90413 89537 88416 87071 85797 84843
53706 84843 84172 83643 83409 83857 84987 86138 86637 86513 86229 86021 86013 86744 88866 92328 96436 100572 104269
53689 104269 106809 107766 107948 108724 110152 110903 110501 110419 112075 114757 116691 117501 118297 119675 121007 121835 122838
53672 122838 124964 128323 132339 136466 140388 143934 147207 150537 153982 156979 158765 159198 159036 159313 160430
53657 160430 161878 162896 163274 163381 163594 163967 164364 164521 163984 162467 160398 158739 158094 158296 158868 159417 159534
53640 159534 158896 157760 156829 156431 156291 156244 156529 157104 157414 157242 157129 157397 157525 157114 156750 157092 157688 157706 157376
53621 157376 157586 158309 158576 158048 157561 157830 158587 159361 160319 161746 163224 163927 163584 162772 162305 162496 162980 163208
53603 163208 163152 163421 164545 166404 168582 171023 173900 177071 180096 182789 185273 187610 189823 192236 195251
53588 195251 198669 201763 204173 206343 208873 211822 214892 218027 221460 225274 229205 232891 236242 239452
53574 239452 242648 245665 248312 250838 253804 257354 260852 263485 265070 266083 267107 268430 269988 271454
53560 271454 272486 273085 273536 273896 273826 273151 272254 271627 271210 270491 269072 266885 264091 261068 258326 256140 254456
53543 254456 253229 252557 252234 251584 250118 248075 246018 244218 242763 241779 241077 239987 238150 236222 235197
53528 235197 235241 235712 236078 236267 236323 236352 236709 237661 238916 239970 240801 241780 243038 244442 246086 248293 251205
53511 251205 254756 258935 263566 268130 272312 276508 281241 286353 291442 296848 303418 311392 320266 329700
53497 329700 339729 350139 360539 371151 382726 395455 408741 422261 436486 451801 467868
53486 467868 484274 501183 518880 537142 555633 574576 594557 615742 637631 659535 681202
53475 681202 703020 725602 749043 772758 796256 819734 843500 867205 890409 913672 938162
53464 938162 964075 990283 1015719 1040373 1064658 1088496 1111450 1133116 1153112 1171225 1187937
53453 1187937 1204162 1220130 1235121 1248785 1262086 1276354 1291815 1307649 1323140 1338077 1352233
53442 1352233 1365086 1376137 1385039 1391424 1394932 1395524 1393560 1389473 1383416 1375199 1364612 1351886 1337766
53429 1337766 1322960 1307613 1291515 1274599 1256850 1237923 1217444 1195710 1173516 1151210 1128518
53418 1128518 1105433 1082618 1060581 1038974 1017083 994641 971907 949391 927903 908446 891587
53407 891587 877096 864420 853260 843503 835016 827863 822439 819018 817401 817288 818761 822123 827455 834577
53393 834577 843220 853064 863893 875980 889987 906183 923951 942393 961241 980963 1002160 1025088
53381 1025088 1049568 1075083 1101093 1127476 1154668 1183304 1213890 1246759 1281989 1319306 1358377
53370 1358377 1399278 1442331 1487421 1533959 1581709 1631130 1682567 1735535 1789162 1843031 1897182
53359 1897182 1951562 2005874 2059791 2112910 2164660 2214560 2262415 2307982 2350629 2389750 2425452
53348 2425452 2458556 2489923 2520011 2548979 2576851 2603392 2627935 2649473 2667108 2680488 2689758
53337 2689758 2694902 2695121 2688944 2674878 2651928 2619821 2579231 2531750 2479258 2423270 2365001 2305669
53325 2305669 2246110 2186264 2125824 2065448 2006691 1950551 1896697 1844319 1792982 1742297 1691426
53314 1691426 1639613 1587015 1534647 1483648 1434674 1387639 1341917 1297201 1254274 1214458 1178244
53303 1178244 1145165 1115137 1089001 1067231 1048887 1032550 1017685 1004351 992159 980461 969285
53292 969285 959186 950204 941741 933528 926031 919741 914569 910147 906362 903408 901461 900458 900182 900603
53278 900603 902047 904844 908830 913602 919264 926448 935476 946042 958034 972058 988692 1007595 1027828
53265 1027828 1048682 1069793 1090842 1111711 1132693 1154157 1176212 1198953 1222580 1246887 1271115
53254 1271115 1294802 1318277 1341677 1363996 1383995 1401757 1418508 1434939 1450489 1464201 1475556
53243 1475556 1484400 1490734 1494748 1496524 1495620 1491403 1483806 1473273 1459820 1442659 1420965 1394775 1365120
53230 1365120 1333547 1301428 1269270 1236704 1203351 1169576 1136066 1102995 1070267 1038428 1008526
53219 1008526 980878 954630 928803 903211 878010 852864 827188 800989 774882 749169 723305
53208 723305 696618 669473 643395 619841 599005 580110 562703 547211 534156 523442 514632 507432
53196 507432 501371 495477 488869 481530 474035 466677 459295 451789 444253 436663 428862 420819 412587 404241
53182 404241 396186 389204 383583 378443 372614 366117 360018 354836 349853 344190 337858 331361 324888 318343
53168 318343 311789 305332 298770 291787 284472 277377 271031 265554 260729 256355 252484 249279 246643 244103
53154 244103 241179 237780 234133 230535 227339 224966 223618 222983 222486 221795 220949 220067 219128 217945 216282 214138
53138 214138 212053 210804 210540 210471 209734 208367 207116 206493 206421 206657 207144 207974 209259 210967 212682 213710 213693
53121 213693 212866 211487 209398 206460 203102 199921 197027 194232 191602 189272 187041 184728 182672 181225
53107 181225 179998 178378 176600 175422 174762 173552 171182 168273 165717 163574 161320 158671 155741 152776
53093 152776 150106 148126 147040 146736 146962 147378 147458 146671 144849 142153 138795 135092 131666 129032 126995 124893
53077 124893 122500 120174 118148 116291 114719 114033 114610 115949 116981 116877 115591 113879 112762 112556 112491 111638
53061 111638 110118 108863 108313 108049 107696 107408 107214 106658 105482 104126 103172 102733 102685 102968 103340 103325 102901 102813
53043 102813 103729 105321 106541 106594 105372 103285 101044 99360 98460 97970 97489 97077 96987 97185 97419 97554 97611 97584
53025 97584 97455 97233 96894 96417 95940 95642 95445 95175 95088 95765 97267 98757 99261 98533 97017 95376 94308 94304
53007 94304 95080 95509 94683 92894 91099 89599 87888 85874 84535 84864 86497 87953 88247 87814 87726 88437 89639
52990 89639 91016 92553 94238 96025 98164 100927 103879 106149 107724 109716 112783 115971 117939 118758 119583
52975 119583 121015 122815 124908 127406 129642 130424 129625 128532 128172 128118 127402 125859 123999 122123 120144 117969
52959 117969 115666 113531 112065 111536 111530 111489 111652 112721 114489 115666 115430 114341 113353 112705 112306 112395 113091 113872
52941 113872 114196 114238 114443 114782 115049 115466 116363 117557 118647 119680 120974 122531 124068 125398 126391 126827 126736
52924 126736 126525 126435 126118 125216 124064 123396 123600 124579 126037 127550 128717 129609 130744 132321 133850 134893
52908 134893 135700 136694 137851 139017 140291 141571 142278 142237 142335 143515 145452 146987 147627 147891 148363 149160 150210
52891 150210 151358 152258 152773 153390 154648 156289 157612 158523 159570 160943 162208 163127 164089 165516 167226 168629
52875 168629 169303 169357 169462 170380 172239 174397 176298 178190 180656 183787 187180 190373 192827 193972 193992 194134
52859 194134 195455 197576 199592 201808 205344 210083 214370 217079 218803 220337 221043 219673 216305 212549
52845 212549 209944 208726 208022 206746 204386 201291 198288 195861 193805 191722 189583 187601 185747 183695
52831 183695 181162 178151 174962 172066 169891 168509 167545 166452 164951 163230 161798 161043 160856 160691 159998
52816 159998 158562 156479 154055 151792 150192 149431 149378 150001 151336 152929 153801 153358 151990 150340 148411 145921
52800 145921 143260 141405 140894 141418 142366 143241 143562 142955 141549 139905 138426 137113 135951 135166 134976 135305
52784 135305 135929 136757 137854 139144 140115 139988 138500 136407 134781 133725 132408 130472 128639 127508 126576
52769 126576 125144 123517 122399 121630 120495 118984 117698 116726 115555 114029 112452 110814 108863 106946 105779
52754 105779 105265 104546 103412 102646 102673 102836 102505 102028 101968 102172 102228 102332 102959 103964 104532 103983 102389 100556
52736 100556 99432 99241 99194 98399 96947 95598 94564 93332 91690 90072 88746 87476 86252 85498 85237 84930
52720 84930 84512 84729 85942 87445 88538 89473 90669 91775 92349 92727 93335 93674 93031 91840 91289 91760 92527
52703 92527 92927 93022 93161 93594 94561 96122 97810 99000 99618 99969 99979 99165 97344 94825 91939 88974 86543
52686 86543 85311 85063 84633 83108 80856 79077 78555 79023 79592 79604 79087 78436 77763 76810 75593 74693 74572 74824
52668 74824 74621 73786 72994 72921 73600 74607 75438 75608 74822 73337 72001 71720 72882 75188 77858 80105 81736
52651 81736 83367 85912 89757 94573 99810 105075 109939 113661 115383 114709 112096 108585 105051 101659 98190
52636 98190 94809 92215 90859 90317 89690 88434 86645 84741 83220 82537 82846 83813 84880 85713 86277 86659
52620 86659 87023 87598 88399 89075 89274 89061 88720 88266 87506 86579 86095 86606 88122 90117 91878 92880 93044 92744
52602 92744 92473 92553 93103 94114 95361 96424 97043 97359 97648 97958 98187 98381 98684 99103 99540 99947 100239 100209 99810
52583 99810 99401 99425 99890 100454 100923 101418 102097 102988 104078 105267 106261 106735 106680 106426 106392 106872 107861 108890 109263
52564 109263 108831 108346 108717 110033 111660 113043 113923 113949 112850 111155 110017 109993 110454 110610 110695 111590 113479
52547 113479 115464 116669 117279 118166 119589 120654 120305 118686 117158 116812 117350 117679 117284 116561 116017 115742 115661
52530 115661 115720 115652 115072 114080 113350 113311 113596 113658 113601 113982 114956 116049 116760 117039 117129 117212 117316 117375 117274 116927 116395
52509 116395 115919 115763 115947 116155 116004 115524 115260 115690 116594 117208 116974 115933 114484 113079 112166 111912 111797 110918
52491 110918 109061 107149 106232 106262 106272 105592 104397 103193 102265 101716 101588 101747 101936 102044 102059 101731 100690 99097
52473 99097 97784 97476 98079 99022 100002 100961 101533 101136 99741 98145 97188 96939 96876 96677 96458 96289 95914 95184
52455 95184 94567 94846 96321 98455 100391 101576 101870 101374 100440 99676 99520 99828 100157 100479 101163 102209 102973
52438 102973 102974 102633 102797 103710 104852 105655 105952 105835 105556 105609 106433 107838 109075 109624 109658 109622 109697 109911 110407 111299
52418 111299 112424 113475 114242 114567 114310 113649 113190 113492 114562 116036 117630 119143 120154 120177 119180 117732
52402 117732 116559 116095 116297 116709 116780 116408 116126 116577 117895 119740 121774 123771 125400 126317 126509 126257 125755
52385 125755 125034 124227 123589 123243 123227 123816 125316 127414 129116 129640 129188 128602 128505 128977 129869 131074 132436 133634
52367 133634 134292 134219 133554 132661 131904 131528 131715 132559 133829 134964 135592 135968 136658 137821 139134 140379 141724
52350 141724 143252 144509 144817 143999 142673 141873 142338 144028 146249 148293 149945 151366 152706 153999 155285
52335 155285 156505 157366 157635 157612 158029 159315 161098 162492 162865 162454 162321 163449 165648 167575 168117 167541 166949
52318 166949 166844 166799 166373 165760 165476 165857 166937 168422 169827 170993 172382 174391 176578 178194 179378 181027
52302 181027 183427 185864 187788 189621 192030 195082 198499 202125 205725 208891 211608 214455 217833 221512
52288 221512 225295 229551 234562 239858 244809 249586 254969 261406 268637 275996 282837 289034 295285 302456
52274 302456 310440 318278 325643 333357 341921 350506 358211 365587 373858 383169 392660 401854 410883 419654
52260 419654 427992 436518 446209 456942 467458 476996 486020 495195 504513 513747 522894 531759 539851 547152
52246 547152 554360 561906 569269 575710 581241 586381 591369 595995 599958 602940 604641 605133 605066 605140 605407 605363
52230 605363 604725 603927 603785 604675 606126 607343 608114 608980 610483 612617 615293 618878 623727 629442 635207 640772
52214 640772 646615 653183 660537 668677 677667 687330 697344 707651 718280 728798 738502 747298 755818
52201 755818 764511 773093 780993 787823 793288 797197 799859 801943 803678 804600 804305 802996 801084 798644 795546
52186 795546 791705 786950 781051 774163 766888 759623 752224 744509 736697 729027 721360 713526 705789 698560
52172 698560 691813 685056 677753 669601 660691 651651 643366 636307 630221 624565 618978 613282 607440 601775
52158 601775 596855 592878 589442 586113 582887 579787 576475 572685 568821 565637 563437 561902 560570 559143
52144 559143 557477 555656 554053 553014 552382 551565 550067 547904 545513 543358 541533 539702 537435 534603 531367
52129 531367 527903 524412 521272 518810 516803 514545 511518 507746 503448 498720 493699 488748 484244 480372
52115 480372 477124 474256 471292 468004 464875 462595 460994 459083 456301 453163 450464 448394 446744 445376
52101 445376 444059 442408 440499 439121 438956 439880 441440 443496 445933 448335 450598 453418 457361 461911 466273
52086 466273 470812 476705 484270 492579 500802 509092 517920 527305 537046 547108 557438 567847 578366
52073 578366 589357 601072 613407 626274 639816 654131 669105 684631 700579 716461 731632
52062 731632 746033 760269 774642 788530 801124 812431 823075 833309 842646 850447 856566 861424
52050 861424 865639 869517 872748 874644 874819 873507 871151 867864 863539 858265 852336 845872 838775 831086
52036 831086 823161 815334 807546 799425 790685 781415 772042 763063 754706 746822 739103 731492 724363 718249
52022 718249 713466 710041 707955 707212 707626 708727 710093 711704 713814 716589 720092 724559 730226 736778 743355
52007 743355 749413 755314 761676 768376 774651 780143 785318 790679 796007 800665 804305 806910 808337 808317 806836
51992 806836 804073 799829 793496 784831 774417 762971 750443 736217 720121 702724 684574 665656
51980 665656 645778 625130 604174 583326 563013 543674 525314 507295 489010 470613 452739
51969 452739 435697 419386 403804 389073 375027 361312 347931 335168 322962 310950 299306
51958 299306 288832 279990 272308 265191 258756 253424 249041 245000 241012 237213 233652 230134 226627 223423
51944 223423 220815 218834 217321 216062 214782 213223 211296 209169 207175 205589 204313 202848 200767 198266
51930 198266 195961 194122 192408 190475 188483 186789 185447 184260 183066 181696 179869 177441 174618 171690
51916 171690 168706 165640 162707 160234 158328 156870 155697 154601 153248 151337 148759 145607 142206 139192
51902 139192 137185 136113 135184 133740 131924 130268 128989 128011 127360 127060 126814 126198 125177 124134 123432 123136
51886 123136 123026 122719 121952 120986 120482 120746 121288 121331 120543 119124 117552 116491 116495 117375 118211 118437 118558 119320 120573
51867 120573 121583 122183 122862 123828 124715 125270 125671 126052 126249 126184 126087 126188 126530 127084 127660 127746 126913 125464 124276
51848 124276 123919 124280 125000 125804 126356 126289 125635 124850 124266 123817 123389 123109 123151 123465 123783 123735 123012 121694 120318
51829 120318 119298 118343 116845 114729 112561 110891 109936 109768 110252 110888 111297 111853 113171 114985 116274 116650
51813 116650 116788 117242 117691 117832 118204 119369 120807 121480 121293 121245 122186 124000 126113 128282 130739 133786 137397
51796 137397 141143 144602 147922 151740 156325 161002 164706 167004 168303 169153 169658 169569 168693 167136 165281
51781 165281 163586 162303 161408 160811 160527 160541 160598 160242 159075 156967 154180 151334 149166 148083 147922 148061 147836
51764 147836 146989 145908 145343 145700 146676 147748 148878 150356 152041 153205 153340 152823 152585 153287 154909 156882
51748 156882 158481 159290 159563 160085 161517 163853 166514 168881 170758 172403 174111 175783 177039 177833 178652
51733 178652 179826 180916 181200 180574 179509 178258 176723 175105 174029 173784 173915 173790 173189 172174 170856 169587
51717 169587 168987 169397 170507 171720 172643 173120 173167 173109 173386 174002 174466 174512 174440 174454 174144 173157 172026 171692 172307
51698 172307 173088 173425 173636 174438 175985 177710 178966 179639 180067 180566 181232 182224 183916 186505 189634 192722
51682 192722 195529 198029 199886 200567 200013 198595 196360 192906 188277 183366 179018 175153 171175 166972 163083
51667 163083 160127 158345 157441 156616 155151 153252 151994 152049 152807 153099 152492 151464 150562 149829 148884 147275 144953
51650 144953 142675 141555 141850 142473 142097 140450 138191 135951 134041 132754 132247 132211 132192 132085 131929 131485 130600
51633 130600 129722 129374 129240 128506 127045 125624 124897 124851 125231 125827 126275 126251 126057 126332 126960 126909 125515 123423
51615 123423 121913 121723 122783 124557 126222 126996 126837 126582 126970 127763 128209 128093 127807 127537 126987 126024 125156
51598 125156 125082 125936 127212 128401 129522 130925 132653 134223 135171 135610 136059 136826 137836 138975 140220 141458
51582 141458 142547 143622 144916 146156 146629 146122 145466 145677 146773 147869 148350 148560 149281 150856 152912 154792
51566 154792 156115 156986 157731 158460 158947 158961 158554 157960 157344 156749 156116 155192 153612 151313 148800 146707 145195
51549 145195 144027 143162 142821 142882 142708 141937 141069 140758 140706 139845 137704 135115 133302 132676 132789 133106 133417 133696
51531 133696 134029 134632 135573 136481 136887 136826 136743 136822 136840 136744 136874 137403 137990 138321 138641 139352 140313 140911 140714 139782
51511 139782 138492 137356 136837 136967 137198 136917 136133 135450 135422 136208 137713 139770 142083 144274 146101 147590
51495 147590 148975 150570 152570 154825 156947 158769 160580 162698 165067 167519 170197 173286 176441 178980
51481 178980 180744 182409 184773 187994 191614 195098 198211 201002 203600 205948 207763 208831 209287 209436 209329
51466 209329 208731 207459 205595 203342 200923 198694 197148 196648 197156 198217 199169 199493 199106 198301 197390 196514
51450 196514 195815 195506 195561 195585 195245 194640 193972 193081 191698 190008 188589 187835 187719 187970 188107 187444 185549 182707
51432 182707 179567 176407 173147 169903 166966 164268 161514 158870 156904 155720 154768 153652 152473 151238
51418 151238 149682 148007 146959 146648 146072 144509 142678 141648 141117 139836 137511 135186 133702 132800 131961
51403 131961 131210 130691 130212 129710 129529 129718 129597 128570 126935 125300 123612 121509 119410 118361 118672 119421
51387 119421 119556 118962 118148 117427 116849 116559 116640 116723 116254 115228 114309 114111 114555 115008 114881 114041 112753 111312
51369 111312 109769 108116 106717 106250 106980 108331 109540 110553 111865 113576 115184 116378 117498 118957 120624
51354 120624 122070 123047 123419 122977 121756 120323 119306 118695 117939 116659 114983 113259 111736 110522 109603 108871
51338 108871 108259 107780 107316 106535 105201 103514 101997 101137 101120 101652 101936 101189 99401 97354 95736 94558 93555
51321 93555 92616 91534 90006 88407 87950 89232 91010 91388 90058 88473 87844 87928 87922 87632 87400 87611 88636
51304 88636 90655 93117 94897 95337 94777 93880 92971 92213 91809 91650 91342 90909 90964 91742 92525 92555 92056 91797 91972
51285 91972 92108 91823 91138 90264 89537 89436 90142 91199 91997 92468 92965 93687 94579 95569 96436 96639 95858 94631
51267 94631 93928 94041 94237 93624 92079 90342 89419 89798 90984 91873 91840 91330 91192 91692 92461 93178 93768 94092
51249 94092 93987 93608 93330 93302 93461 93853 94483 94945 94804 94393 94557 95484 96396 96687 96800 97500 98720 99718 100131
51230 100131 100276 100478 100650 100714 101041 102167 104181 106553 108591 110026 111162 112472 114061 115562 116588 117207
51214 117207 117842 118736 119693 120439 121091 122015 123246 124292 124640 124293 123619 122842 121926 120833 119584 118139 116606
51197 116606 115517 115487 116441 117609 118449 119115 119822 120289 120243 119962 119721 119045 117257 114596 112038 110077 108428
51180 108428 106979 106199 106245 106437 106163 105763 105882 106356 106427 105850 105064 104272 103108 101399 99761 98998 99217 99819
51162 99819 100211 100219 99896 99205 97944 95951 93457 91248 90247 90637 91567 92047 92060 92397 93371 94218 94115 93393
51144 93393 93208 94132 95569 96582 96825 96517 95940 95253 94602 94092 93754 93657 93901 94385 94776 94890 94900 94990 95022 94898
51124 94898 95012 95942 97686 99588 101063 102104 102947 103586 103900 104033 104348 104986 105672 106102 106384 106943 108012
51107 108012 109404 110868 112488 114477 116681 118630 120145 121522 122990 124289 125108 125624 126216 126856 127236
51092 127236 127429 127928 128895 129738 129667 128467 126615 124868 123817 123593 123839 124071 124174 124374 124703 124814 124488 124040
51074 124040 123865 123763 123092 121595 119731 118145 117154 116823 117182 118053 118876 119118 118860 118660 118792 118917 118650 118160
51056 118160 117962 118295 118944 119544 119801 119601 119227 119395 120594 122370 123653 123922 123641 123428 123309 123098 123002 123335
51038 123335 123935 124509 125354 127004 129154 130644 130855 130569 131049 132671 134904 137319 139947 142669 144856 145936
51022 145936 146032 145813 145839 146319 147368 149176 151808 154950 158020 160549 162460 164052 165756 167878 170502 173558
51006 173558 176924 180498 184270 188368 192963 197996 203087 207912 212635 217821 223899 230930 238879 247749
50992 247749 257320 267181 277352 288541 301391 315716 330990 347438 365977 387056 410179 434760
50980 434760 460916 489185 519981 553681 590792 631425 674750 719396 764434 809789 855817
50969 855817 902622 949532 994952 1036918 1074123 1106395 1134058 1157038 1174814 1186981 1193589 1195038
50957 1195038 1191953 1185137 1175466 1163854 1151330 1138812 1126666 1114855 1103747 1094328 1087136 1081317
50945 1081317 1075324 1068303 1060188 1050573 1038381 1022922 1004678 984558 962676 938245 910535 879634
50933 879634 846356 811687 776422 741101 706038 671273 636717 602664 570149 540387 513721
50922 513721 489469 467012 446621 428829 413407 399538 386849 375699 366513 359313 353888 349955
50910 349955 347106 344989 343596 343064 343238 343735 344352 345011 345408 345264 344857 344740 344925 344988 345064 346023 348302 351168
50892 351168 353598 355467 357447 360056 363312 367124 371595 376907 383125 390027 397109 404007 411071 419246
50878 419246 429170 440690 453451 467606 483603 501551 521303 543058 567486 595211 626441 661214
50866 661214 699814 742905 791275 845493 905785 972369 1045778 1126538 1214409 1308251 1406879
50855 1406879 1509761 1616645 1726669 1838049 1948332 2054565 2153428 2241868 2317820 2380117
50845 2380117 2427686 2459325 2474649 2475054 2463319 2442144 2413266 2378129 2339049 2299282 2261890 2228839
50833 2228839 2201267 2180023 2165379 2156402 2151154 2147560 2143575 2136596 2123525 2102117 2072008 2034024
50821 2034024 1988624 1935426 1874106 1805227 1730017 1649761 1565783 1479915 1394603 1312278 1234627
50810 1234627 1162441 1095988 1035328 980366 931017 887478 850132 819030 793748 773901 759417
50799 759417 749956 744484 742047 742827 747810 757364 770642 786406 803805 822172 840587 858007 873574
50786 873574 886748 897483 906289 913552 918696 920551 918640 913460 905312 893720 878462 860461 840955
50773 840955 820375 798807 776987 755944 735870 716209 696748 677861 659846 642987 628300
50762 628300 617301 610578 607167 605645 605420 606819 610526 617269 627491 640838 656383 673818 694151
50749 694151 718746 747893 780819 817057 857333 903014 955062 1013648 1078447 1148954 1224540
50738 1224540 1304433 1387625 1472632 1557249 1638630 1713807 1780248 1836068 1879893 1910705 1927826
50727 1927826 1930954 1920347 1897213 1863928 1823592 1779143 1732912 1686923 1643279 1603992 1570476
50716 1570476 1543241 1521929 1505690 1493700 1485291 1479328 1473557 1465190 1452368 1434684 1412070 1383842
50704 1383842 1349321 1308958 1264155 1216240 1166331 1115957 1066950 1020532 977094 937009 901057
50693 901057 869847 843389 821558 804450 791969 783511 778537 777187 779923 786950 798414 814817
50681 814817 836570 863184 893553 927110 964084 1004377 1046742 1089539 1131962 1173967 1215124
50670 1215124 1254166 1289826 1321589 1349324 1372550 1390528 1402946 1410072 1412251 1409611 1402394 1391245
50658 1391245 1377047 1360623 1342659 1323634 1303768 1283276 1262824 1243411 1225696 1209775 1195789
50647 1195789 1184377 1176202 1171434 1170115 1172678 1179492 1190012 1202983 1217512 1233408 1250411 1267629
50635 1267629 1284053 1299240 1313234 1326082 1337699 1348070 1357313 1365711 1373817 1382452 1392449 1404456
50623 1404456 1418977 1436399 1456708 1479189 1502449 1524726 1544300 1559838 1570510 1575769 1575129 1568328
50611 1568328 1555720 1538327 1517416 1494093 1469169 1443209 1416707 1390312 1364783 1340342 1316077
50600 1316077 1290381 1262116 1231183 1197939 1162510 1124965 1085858 1046232 1007078 968948 931958
50589 931958 896040 861356 828643 798978 772931 750069 729512 710912 694676 681319 670910
50578 670910 663130 657593 654001 652231 652387 654708 659276 665872 674142 683875 695051 707653 721485 736219
50564 736219 751688 768195 786478 807260 830803 856955 885576 916767 950609 986878 1025076
50553 1025076 1064559 1104436 1143507 1180758 1216045 1250010 1283191 1315431 1346420 1376499 1406498
50542 1406498 1436890 1467543 1498285 1529167 1559987 1590157 1619496 1648869 1679570 1712196 1746604
50531 1746604 1782832 1821528 1863219 1907460 1952884 1997963 2041703 2083806 2124198 2162201 2196050
50520 2196050 2223421 2242541 2252810 2254448 2247846 2233305 2211111 2181595 2145181 2102498 2054486 2002444
50508 2002444 1948035 1893114 1839309 1787746 1739350 1695267 1656592 1623557 1595366 1571034 1550080
50497 1550080 1532206 1516688 1502590 1489587 1478226 1469386 1463695 1461431 1462640 1467182 1474636 1484009 1493258
50484 1493258 1499305 1499073 1490844 1474473 1450303 1418337 1378705 1332478 1281520 1227697 1172604 1117845
50472 1117845 1064835 1014178 965787 919851 877199 838398 803045 770526 741161 715906 695029
50461 695029 677642 662585 649253 637504 627369 619073 612879 608601 605590 603436 602377 602851 605041
50448 605041 609110 615441 624208 634993 647198 660675 675595 691954 709611 728637 749256 771606
50436 771606 795871 822446 851511 882616 915100 948817 984042 1020811 1058894 1098324 1139372
50425 1139372 1181948 1225502 1269688 1314634 1360426 1406749 1453217 1499768 1546555 1593714 1641311
50414 1641311 1689098 1736121 1780828 1821692 1857566 1887528 1910824 1927222 1937027 1940481 1937353 1927295
50402 1927295 1910304 1886575 1856094 1818657 1774305 1723712 1668268 1609674 1549182 1487180 1423774
50391 1423774 1359797 1296943 1236867 1180504 1128202 1080010 1035629 994657 957226 924087 895810
50380 895810 872252 853054 838210 827759 821312 818332 818628 822121 828343 836528 845913 855575 864275
50367 864275 871034 875612 877871 876897 871475 861359 847401 830382 810555 788556 765925 744069 723140
50354 723140 702532 682275 663267 646179 630706 616136 602346 589943 579492 570884 563523 557054
50342 557054 551740 548075 546190 545799 546600 548425 550943 553581 555972 558356 561229 564724 568584 572682 577240
50327 577240 582442 588170 594363 601457 610099 620411 631831 643739 656041 669023 682780 697013
50315 697013 711353 725747 740513 756076 772576 789659 806666 823137 839109 854911 870732
50304 870732 886476 901828 916288 929163 939816 948095 954488 959849 964813 969289 972399 972995 970368
50291 970368 964410 955139 942358 925957 906309 884149 860294 835683 811355 787882 765037 742535
50279 742535 720971 701406 684028 667890 652143 636928 622753 609603 597192 585636 575343
50268 575343 566337 558172 550387 542753 535208 527848 520939 514652 508872 503442 498427 493907 489714 485668
50254 485668 481876 478467 475199 471770 468438 465856 464269 463181 461997 460696 459777 459769 460879 462924 465474
50239 465474 468180 471101 474600 478844 483517 488084 492279 496293 500567 505446 510975 516905 522841 528355
50225 528355 533087 536847 539738 542059 544100 546016 547867 549648 551215 552390 553208 553877 554341 554082 552592
50210 552592 550039 547268 545111 543896 543687 544804 547750 552502 558140 563595 568832 574939 582745 591689
50196 591689 600452 608436 616046 623581 630575 636487 641429 645753 649334 651790 653215 654162 654905 655049 654008
50181 654008 651710 648797 646141 644081 642123 639595 636533 633634 631385 629716 628627 628526 629525 630955 632148
50166 632148 633364 635249 637525 638901 638490 636874 635566 635562 636458 636905 636018 634376 633423 633898 635288 636964
50150 636964 639057 641736 644347 646229 647940 650580 654036 656962 658647 659807 661243 662691 663643 664496 666095
50135 666095 668608 671560 674701 678213 682205 686572 691381 697118 704531 714370 727064 742494 760349
50122 760349 780936 805320 834389 868145 906283 949100 997348 1051485 1111652 1178109 1250824
50111 1250824 1328451 1408297 1487516 1563944 1635707 1700769 1757530 1805753 1846564 1881662 1912706
50100 1912706 1941170 1968084 1993502 2016215 2033937 2043824 2043050 2029347 2001374 1958861 1902708 1835128
50088 1835128 1759443 1679323 1597936 1517693 1440547 1368217 1302084 1242957 1190887 1145006 1103791
50077 1103791 1066060 1031866 1002036 976671 954543 934266 915526 898678 883567 869539 856446
50066 856446 844830 834988 826574 819336 813505 809074 805326 801638 798324 796132 795134 794672 794207 793653 792975
50051 792975 791940 790382 788382 786138 783885 781912 780482 779769 779950 781134 783071 785267 787708 791135 796155
50036 796155 802363 808836 815331 822436 830665 839968 850108 860921 872105 883255 894248 905210 916005
50023 916005 926215 935743 945012 954429 964022 973736 983703 994131 1005279 1017623 1031636 1047276 1064157
50010 1064157 1082408 1102909 1126496 1153450 1184072 1219301 1260273 1307670 1361945 1424001 1495144
49999 1495144 1576439 1668352 1770814 1883163 2003980 2131202 2262296 2394205 2523393 2646520
49989 2646520 2761345 2867050 2963982 3053336 3136825 3216028 3291633 3363010 3428193 3484017 3526554
49978 3526554 3551895 3556859 3539212 3497781 3433010 3347436 3245119 3130123 3005380 2872884 2734679
49967 2734679 2593507 2452545 2314660 2181848 2055240 1935502 1823228 1718999 1623156 1535519
49957 1535519 1455385 1381924 1314706 1253798 1199228 1150487 1106708 1067253 1031863 1000212 971639
49946 971639 945493 921560 899932 880495 862654 845616 828880 812453 796532 781023 765616
49935 765616 750387 736042 723281 712154 702360 693951 687212 681948 677413 673042 668825 664851 661022
49922 661022 657336 654009 650970 647639 643409 638110 631868 624950 617943 611635 606339 601698 597406 593711
49908 593711 590837 588390 585905 583681 582461 582422 582985 583593 584281 585516 587843 591573 596459 601814 607344
49893 607344 613740 622014 632369 644248 657376 672167 688961 707473 727387 749229 774345 804106
49881 804106 839249 879891 926073 978307 1037486 1104082 1177598 1256940 1341012 1428413 1516723
49870 1516723 1602777 1683904 1758464 1825112 1882318 1929351 1967610 2000385 2030963 2060819 2089253
49859 2089253 2114326 2133928 2145973 2147823 2135953 2106873 2058833 1992771 1911745 1819755 1721008
49848 1721008 1619627 1519218 1422368 1330608 1244853 1165793 1093880 1029133 971037 918734 871494
49837 871494 829146 791963 760000 732526 708203 685814 664853 645562 628509 613990 601676
49826 601676 590831 580951 572097 564481 557815 551382 544780 538344 532706 528104 524300 520958 517812 514566
49812 514566 511024 507471 504662 503118 502491 501808 500291 497829 494783 491590 488499 485453 482145 478394 474494
49797 474494 470969 467917 464820 461147 456933 452623 448560 444876 441701 439153 437143 435479 434141 433163
49783 433163 432231 430722 428373 425713 423627 422565 422347 422576 422985 423347 423376 422903 422091 421287 420659 420044 419177
49766 419177 417998 416761 415877 415640 415951 416332 416313 415871 415402 415266 415431 415563 415341 414653 413671 412767 412243 412022
49748 412022 411831 411695 412008 412914 413946 414607 415093 416015 417487 418928 419830 420369 421094 422272 423715 425121 426435
49731 426435 427847 429416 430750 431327 431250 431320 431991 432573 432004 430322 428743 428236 428540 428761 428434 427807 427531 428314
49713 428314 430441 433292 435660 436857 437339 438030 439295 440794 442011 442663 442798 442819 443250 444294 445722 447266
49697 447266 448918 450706 452499 454180 455771 457257 458615 460119 462252 465182 468695 472717 477329 482071
49683 482071 485889 488275 489982 492164 495230 498965 503232 507849 512207 515827 519135 522994 527543 532065
49669 532065 535943 539200 542220 545498 549569 554589 559956 564904 569424 574172 579524 585290 591297 597617
49655 597617 604172 610659 617011 623385 629629 635317 640500 645846 651721 657543 662412 666109 669305 672972
49641 672972 677715 683440 689488 695235 700560 705609 710314 714543 718610 723162 728468 734275 740355 746734
49627 746734 753292 759638 765579 771384 777411 783787 790486 797287 803604 808853 813242 817776 823197 829230
49613 829230 835070 840344 845398 850865 857117 863971 870958 878109 886279 896233 907479 918652 929144
49600 929144 939655 950974 962965 975138 987540 1000456 1013775 1027275 1041189 1055810 1070804
49589 1070804 1085545 1100004 1114738 1130044 1145698 1161483 1177457 1193628 1209914 1226603 1244373
49578 1244373 1263485 1283255 1302741 1321878 1341604 1362716 1384905 1407127 1428757 1450019 1471334
49567 1471334 1492751 1514274 1536261 1558934 1581768 1604002 1625730 1647864 1670917 1694319 1717109
49556 1717109 1738807 1759469 1779377 1799021 1818921 1839109 1859013 1878060 1896130 1913349 1929902
49545 1929902 1946180 1962565 1978746 1993770 2007182 2019649 2032011 2044179 2055530 2066015 2076195
49534 2076195 2086383 2096358 2105846 2114738 2122928 2130446 2137771 2145478 2153587 2161641 2169491 2177535 2186114 2195068
49520 2195068 2204050 2213004 2222198 2231926 2242188 2252523 2262170 2270555 2277591 2283432 2288144 2291830 2294847
49507 2294847 2297512 2299650 2300763 2300610 2299323 2297030 2293698 2289347 2284149 2278185 2271341 2263474 2254611 2244979
49493 2244979 2234945 2224770 2214289 2202997 2190588 2177266 2163368 2149031 2134448 2120053 2105926
49482 2105926 2091318 2075360 2058132 2040475 2022855 2005020 1986786 1968425 1950090 1931530 1912775
49471 1912775 1894584 1877719 1862056 1846839 1831628 1816528 1801629 1786685 1771547 1756616 1742647
49460 1742647 1730090 1718670 1707660 1696518 1685268 1674299 1663969 1654453 1645806 1638008 1631034 1624949
49448 1624949 1619746 1614988 1609962 1604537 1599652 1596489 1595212 1594976 1595038 1595263 1595362 1594336 1591168 1585830 1579231
49433 1579231 1572279 1565306 1558321 1551559 1545681 1541470 1539246 1538579 1538742 1539438 1540868 1543003 1545204 1546817 1547909
49418 1547909 1549146 1551066 1553808 1557423 1562057 1567645 1573714 1579703 1585524 1591691 1598834 1607047 1615783 1624441
49404 1624441 1633038 1642114 1651980 1662223 1672108 1681316 1690116 1698897 1707786 1716720 1725634 1734364 1742485 1749562
49390 1749562 1755717 1761766 1768574 1776193 1783806 1790543 1796274 1801512 1806793 1812275 1817842 1823345 1828795 1834503
49376 1834503 1841019 1848763 1857654 1867261 1877254 1887582 1898203 1908958 1919772 1930777 1942127 1953938
49364 1953938 1966503 1980320 1995574 2011720 2027995 2044389 2061760 2080737 2100765 2120575 2139583
49353 2139583 2158465 2178280 2199398 2221497 2244299 2267829 2292019 2316594 2341486 2367011 2393442
49342 2393442 2420709 2448670 2477334 2506559 2535963 2565490 2595736 2627189 2659342 2691122 2722111
49331 2722111 2752830 2783877 2815391 2847438 2880135 2913075 2945202 2975754 3004973 3033461 3061291
49320 3061291 3088266 3114707 3141233 3167888 3194159 3219863 3245306 3270379 3294191 3316001 3336037
49309 3336037 3354975 3373049 3390109 3406092 3420810 3433616 3444117 3453239 3462721 3473244 3483710 3492695
49297 3492695 3500073 3506687 3512898 3518201 3522093 3524746 3526774 3528803 3531250 3534147 3537186 3540280 3543933 3548632
49283 3548632 3554007 3559184 3563969 3568966 3574315 3579004 3581871 3582752 3582164 3580307 3576941 3571973 3565537 3557543
49269 3557543 3547638 3535691 3522032 3507200 3491629 3475410 3458111 3439036 3417983 3395606 3372786
49258 3372786 3349820 3326473 3302511 3277746 3251751 3224176 3195328 3165946 3136379 3106362 3075634
49247 3075634 3044289 3012487 2980273 2947815 2915449 2883352 2851557 2820374 2790337 2761556 2733516
49236 2733516 2705737 2678272 2651297 2624621 2597944 2571362 2545279 2519989 2495621 2472242 2449647
49225 2449647 2427253 2404689 2382398 2361235 2341374 2322002 2302245 2282081 2262161 2243046 2224891
49214 2224891 2207668 2191255 2175294 2159381 2143540 2128203 2113468 2098694 2083227 2067376 2052182
49203 2052182 2038190 2025013 2012198 1999941 1988484 1977277 1965415 1952760 1940106 1928185 1916989
49192 1916989 1906157 1895628 1885718 1876867 1869410 1863365 1858277 1853440 1848403 1843168 1837951 1832929 1828192
49179 1828192 1823659 1819050 1814228 1809605 1805797 1802731 1799446 1795074 1789758 1784322 1779275 1774485 1769770 1765374
49165 1765374 1761699 1758812 1756492 1754710 1753842 1754283 1755957 1758436 1761559 1765760 1771702 1779723 1789716 1801293
49151 1801293 1813929 1827241 1841511 1857715 1876517 1897086 1917266 1935109 1950144 1963168 1975192
49140 1975192 1986806 1998230 2009528 2020688 2031699 2042703 2054019 2065864 2077971 2089580 2099969
49129 2099969 2108946 2116715 2123374 2128831 2133200 2136815 2139666 2141248 2141254 2140015 2137825 2134223 2128535 2121008 2112855
49114 2112855 2105097 2097761 2090216 2081924 2072863 2063533 2054594 2046310 2038401 2030627 2023198 2016343 2009860 2003595
49100 2003595 1998028 1993738 1990557 1987977 1986238 1986186 1988154 1991811 1997060 2004120 2012554 2021282 2029900 2039205
49086 2039205 2050033 2062374 2076014 2091075 2107336 2123878 2140142 2156603 2173581 2190046 2204580
49075 2204580 2217050 2228420 2239188 2249007 2257647 2265356 2272139 2277515 2281149 2283139 2283567 2282337 2279629
49062 2279629 2275995 2271724 2266393 2259214 2249706 2238022 2224812 2210700 2195753 2179618 2162352 2144738
49050 2144738 2127368 2109697 2090511 2069206 2046195 2022212 1997807 1973483 1949771 1926916 1904758
49039 1904758 1882979 1861341 1839815 1818690 1798434 1779250 1761009 1743865 1728470 1715148 1703298
49028 1703298 1692281 1682588 1675259 1670272 1666404 1662801 1659941 1658748 1659432 1661527 1664521 1668048 1671910 1676314
49014 1676314 1681845 1688938 1697500 1707197 1717781 1729015 1740571 1752292 1764348 1776939 1789981 1803159
49002 1803159 1816145 1828762 1841151 1853807 1867184 1881233 1895478 1909512 1923249 1936799 1950433
48991 1950433 1964558 1979353 1994499 2009581 2024602 2039642 2054259 2067854 2080604 2093348 2106506
48980 2106506 2119813 2133190 2147054 2161522 2176113 2190727 2206147 2222962 2240508 2257483 2273217
48969 2273217 2287757 2301135 2313162 2323728 2332730 2339922 2345283 2349276 2352326 2354348 2355336 2355971 2356893 2357610
48955 2357610 2356953 2354553 2351098 2347094 2342185 2335908 2328461 2320434 2312363 2304864 2298605 2293753 2289898 2286866
48941 2286866 2285173 2285217 2286439 2287873 2289383 2291812 2295985 2302067 2309864 2319219 2329876 2341393 2353555 2366702
48927 2366702 2381315 2397265 2413773 2430188 2446598 2463505 2481075 2499019 2517187 2535977 2555937
48916 2555937 2577214 2599625 2623097 2647661 2673034 2698634 2724200 2750136 2777071 2805240 2834472
48905 2834472 2864560 2895430 2927058 2959445 2992561 3026198 3060059 3094268 3129599 3166885 3206295
48894 3206295 3247561 3290807 3336561 3384794 3434535 3484881 3536072 3589125 3644551 3701842 3760123
48883 3760123 3818839 3877829 3937186 3997182 4057955 4119028 4179418 4238383 4295849 4351924 4406234
48872 4406234 4458019 4506764 4552532 4595740 4636756 4675538 4711493 4743857 4772409 4797697 4820336
48861 4820336 4840230 4856738 4869438 4878346 4883430 4884319 4880687 4872647 4860669 4845285 4826902 4805562
48849 4805562 4780796 4752053 4719596 4684724 4648778 4612000 4573609 4532821 4489510 4444001 4396745
48838 4396745 4348368 4299620 4251024 4202710 4154778 4107584 4061425 4016193 3971748 3928503 3887224
48827 3887224 3848189 3811003 3775437 3742124 3712147 3686146 3664075 3645628 3630477 3618242 3608612
48816 3608612 3601649 3597722 3597069 3599578 3604947 3612795 3622627 3634022 3647053 3662255 3680034 3700164 3721981
48803 3721981 3744968 3769088 3794709 3822252 3851788 3882869 3914766 3946871 3978839 4010571 4042304
48792 4042304 4074566 4107630 4141026 4174036 4206659 4239642 4273476 4307883 4342517 4377590 4413391
48781 4413391 4449584 4485519 4521015 4556367 4591769 4627221 4662961 4699565 4737544 4777042 4817919
48770 4817919 4859941 4902926 4946885 4991895 5037778 5084065 5130434 5176879 5223270 5269113 5314021
48759 5314021 5358042 5401133 5442623 5481711 5518253 5552519 5584358 5613135 5638472 5660522 5679532
48748 5679532 5695615 5708902 5719472 5727072 5731278 5732009 5729589 5724366 5716466 5705693 5691270 5671987 5647235
48735 5647235 5617719 5584583 5547974 5507169 5462028 5413452 5362344 5308987 5253785 5197795 5142078
48724 5142078 5087056 5032860 4979657 4927195 4874647 4821562 4768679 4717256 4667881 4620410 4574744
48713 4574744 4531071 4489374 4449244 4410297 4372611 4336660 4302889 4271270 4241299 4212588 4185406
48702 4185406 4160284 4137204 4115603 4095214 4076290 4058898 4042709 4027785 4014861 4004325 3995481
48691 3995481 3987409 3979972 3973329 3966950 3959992 3952468 3945174 3938550 3932314 3926213 3920437 3915190 3910548 3906782
48677 3906782 3904171 3902280 3900110 3897321 3894797 3893555 3893468 3893459 3892706 3891241 3889564 3888139 3887225 3886814 3886692 3886782 3887481
48660 3887481 3889318 3892134 3894906 3896622 3897190 3897200 3896950 3896184 3894912 3893952 3894236 3895801 3897926 3900058 3902154 3904162
48644 3904162 3905744 3906682 3907101 3907095 3906500 3905249 3903609 3901799 3899565 3896310 3891420 3884407 3875107 3863936 3851562
48629 3851562 3838116 3823058 3805975 3787113 3766950 3745797 3724139 3702709 3681678 3660288 3637988
48618 3637988 3615585 3594486 3575051 3556408 3537870 3519782 3502924 3487797 3474555 3463040 3452631
48607 3452631 3442592 3432792 3423751 3415874 3409111 3403424 3398993 3395671 3392718 3389507 3386244 3383644 3382180 3381943
48593 3381943 3383051 3385712 3389887 3395166 3401175 3408054 3416517 3427328 3440659 3455990 3472688 3490493 3509268
48580 3509268 3528505 3547511 3566061 3584454 3602837 3620891 3638338 3655442 3672714 3690362 3708360
48569 3708360 3726977 3746855 3768394 3791159 3814079 3836405 3858473 3881335 3905600 3930813 3956165
48558 3956165 3981509 4007298 4033656 4060002 4085636 4110304 4134008 4156644 4178094 4198510 4218221
48547 4218221 4237405 4255916 4273303 4288965 4302466 4313846 4323581 4332171 4339788 4346214 4351007 4353784
48535 4353784 4354530 4353634 4351417 4347790 4342556 4335909 4328253 4319576 4309414 4297482 4283939 4268953 4252449
$$ [...]
##END NTUPLES=NMR SPECTRUM
##END=
