##TITLE=NES1025_11026_9266837_dCkYX0WH1l
##JCAMPDX= 6.0         $$ Bruker NMR JCAMP-DX V2.0
##DATA TYPE= NMR SPECTRUM
##DATA CLASS= NTUPLES
##ORIGIN= BRUKER
##OWNER= Administrator
$$ 1.72 TOPSPIN		Version 2.1
$$ 2015-07-09 19:09:48.456 -0700  Administrator@X
$$ Compression mode = diff/dup
##.OBSERVE FREQUENCY= 400.02188249412
##.OBSERVE NUCLEUS= ^1H
##.ACQUISITION MODE= SIMULTANEOUS (DQD)
##.ACQUISITION SCHEME= undefined
##.AVERAGES= 8
##.DIGITISER RES= 22
##SPECTROMETER/DATA SYSTEM= spect
##.PULSE SEQUENCE= zg30
##.SOLVENT NAME= COFFEE_meoh
##.SHIFT REFERENCE= INTERNAL, COFFEE_meoh, 1, 14.98509
##AUDIT TRAIL= $$ (NUMBER, WHEN, WHO, WHERE, PROCESS, VERSION, WHAT)
$$ ##TITLE= Audit trail, TOPSPIN		Version 2.1
$$ ##JCAMPDX= 5.01
$$ ##ORIGIN= Bruker BioSpin GmbH
$$ ##OWNER= Administrator
$$ $$ E:\/data/COFFEE/nmr/NES1025_11026_9266837_dCkYX0WH1l/10/pdata/1/auditp.txt
$$ ##AUDIT TRAIL=  $$ (NUMBER, WHEN, WHO, WHERE, PROCESS, VERSION, WHAT)
(   1,<2015-07-09 19:09:40.753 -0700>,<Administrator>,<X>,<go>,<TOPSPIN 2.1>,
      <created by zg
	started at 2015-07-09 19:08:34.441 -0700,
	POWCHK enabled, PULCHK disabled,
       configuration hash MD5:
       21 0F 79 D6 B3 7B B4 F6 88 20 88 DB 03 48 BD 9F
       data hash MD5: 64K
       0C C3 14 BC F9 88 69 DF 2A BD BF 72 23 2B A1 EB>)
(   2,<2015-07-09 19:09:44.316 -0700>,<Administrator>,<X>,<proc1d>,<TOPSPIN 2.1>,
      <Start of raw data processing
       efp LB = 0 FT_mod = 6 PKNL = 1 PHC0 = 0 PHC1 = 0 SI = 32K 
       data hash MD5: 32K
       24 90 12 F8 E0 58 36 67 3C 23 52 DE 61 1B F4 6F>)
(   3,<2015-07-09 19:09:44.597 -0700>,<Administrator>,<X>,<proc1d>,<TOPSPIN 2.1>,
      <pk PHC0 = 91.99402 PHC1 = 0 
       data hash MD5: 32K
       CA ED 32 38 79 D3 9F 3B ED D0 BC D4 1B 0F EB 87>)
(   4,<2015-07-09 19:09:44.706 -0700>,<Administrator>,<X>,<proc1d>,<TOPSPIN 2.1>,
      <abs ABSG = 1 
       data hash MD5: 32K
       0A 9C 0B F9 79 CB AF DE 3B E6 7D 09 41 D1 3D 06>)
(   5,<2015-07-09 19:09:44.769 -0700>,<Administrator>,<X>,<proc1d>,<TOPSPIN 2.1>,
      <abs ABSG = 2 
       data hash MD5: 32K
       80 EC 0B D6 33 04 A7 4A 8A E4 EA 7C 7B 45 B1 09>)
(   6,<2015-07-09 19:09:44.831 -0700>,<Administrator>,<X>,<proc1d>,<TOPSPIN 2.1>,
      <abs ABSG = 3 
       data hash MD5: 32K
       DD D5 4C 6A FD 69 6B 1D DD 30 F1 A9 2F 70 91 33>)
(   7,<2015-07-09 19:09:44.878 -0700>,<Administrator>,<X>,<proc1d>,<TOPSPIN 2.1>,
      <abs ABSG = 4 
       data hash MD5: 32K
       64 66 C7 FF 0E C9 BA 5B 1D BB E4 2C AF 3F 0F C9>)
(   8,<2015-07-09 19:09:44.941 -0700>,<Administrator>,<X>,<proc1d>,<TOPSPIN 2.1>,
      <abs ABSG = 5 
       data hash MD5: 32K
       77 31 01 75 67 35 F3 DD FC D3 EA 7E 22 A3 EB 47>)
$$ ##END=
$$ 
$$ $$ hash MD5
$$ $$ 7E CA 44 A1 91 0F 42 56 E8 4A E1 57 E2 3C 48 EA
##$RELAX= 
##$RELAX= 
##$RELAX= 
##$RELAX= 
##$RELAX= 
##$RELAX= 
##$RELAX= 
$$ Bruker specific parameters
$$ --------------------------
##$DU= <E:\>
##$EXPNO= 10
##$NAME= <NES1025_11026_9266837_dCkYX0WH1l>
##$PROCNO= 1
$$ [...]
150 150 150 150 150 150 150 150
##$TP07= 0
##$TPNAME0= <>
##$TPNAME1= <>
##$TPNAME2= <>
##$TPNAME3= <>
##$TPNAME4= <>
##$TPNAME5= <>
##$TPNAME6= <>
##$TPNAME7= <>
##$TPOAL= (0..7)
0.5 0.5 0.5 0.5 0.5 0.5 0.5 0.5
##$TPOFFS= (0..7)
0 0 0 0 0 0 0 0
##$TUNHIN= 0
##$TUNHOUT= 0
##$TUNXOUT= 0
##$USERA1= <user>
##$USERA2= <user>
##$USERA3= <user>
##$USERA4= <user>
##$USERA5= <user>
##$V9= 5
##$VALIST= <valist>
##$VCLIST= <CCCCCCCCCCCCCCC>
##$VD= 0
##$VDLIST= <DDDDDDDDDDDDDDD>
##$VPLIST= <PPPPPPPPPPPPPPP>
##$VTLIST= <TTTTTTTTTTTTTTT>
##$WBST= 2048
##$WBSW= 25
##$XGAIN= (0..3)
0 0 0 0
##$XL= 0
##$YL= 0
##$YMAX_a= 620828
##$YMIN_a= -519014
##$ZGOPTNS= <>
##$ZL1= 120
##$ZL2= 120
##$ZL3= 120
##$ZL4= 120
##$ABSF1= 14.98509
##$ABSF2= -5.573092
##$ABSG= 5
##$ABSL= 3
##$ALPHA= 0
##$AQORDER= 0
##$ASSFAC= 0
##$ASSFACI= 0
##$ASSFACX= 0
##$ASSWID= 0
##$AUNMP= <proc_prof1d_extract_pilot.lims>
##$AXLEFT= 0
##$AXNAME= <>
##$AXNUC= <1H>
##$AXRIGHT= 0
##$AXTYPE= 0
##$AXUNIT= <>
##$AZFE= 0.1
##$AZFW= 0.1
##$BCFW= 0
##$BC_mod= 0
##$BYTORDP= 0
##$COROFFS= 0
##$CY= 15
##$DATMOD= 1
##$DC= 0
##$DFILT= <>
##$DTYPP= 0
##$F1P= 0
##$F2P= 0
##$FCOR= 0.5
##$FTSIZE= 32768
##$FT_mod= 6
##$GAMMA= 0
##$GB= 0
##$INTBC= 1
##$INTSCL= 1
##$ISEN= 128
##$LB= 0
##$LEV0= 0
##$LPBIN= 0
##$MAXI= 10000
##$MC2= 0
##$MEAN= 0
##$ME_mod= 0
##$MI= 0
##$NCOEF= 0
##$NC_proc= -8
##$NLEV= 6
##$NOISF1= 0
##$NOISF2= 0
##$NSP= 0
##$NTH_PI= 0
##$NZP= 0
##$OFFSET= 14.98509
##$PC= 1
##$PHC0= 91.99402
##$PHC1= 0
##$PH_mod= 1
##$PKNL= yes
##$PPARMOD= 0
##$PPDIAG= 0
##$PPIPTYP= 0
##$PPMPNUM= 2147483647
##$PPRESOL= 1
##$PSCAL= 4
##$PSIGN= 0
##$PYNMP= <proc.py>
##$REVERSE= no
##$SF= 400.02
##$SI= 32768
##$SIGF1= 0
##$SIGF2= 0
##$SINO= 400
##$SIOLD= 32768
##$SPECTYP= <>
##$SREGLST= <1H.CDCl3>
##$SSB= 0
##$STSI= 32768
##$STSR= 0
##$SW_p= 8223.68421052631
##$SYMM= 0
##$S_DEV= 0
##$TDeff= 65536
##$TDoff= 0
##$TI= <>
##$TILT= no
##$TM1= 0
##$TM2= 0
##$TOPLEV= 0
##$USERP1= <user>
##$USERP2= <user>
##$USERP3= <user>
##$USERP4= <user>
##$USERP5= <user>
##$WDW= 1
##$XDIM= 32768
##$YMAX_p= 445698628
##$YMIN_p= -908990
##$CURPLOT= <Network HP LaserJet P1505>
##$CURPRIN= <$Network HP LaserJet P1505>
##$DFORMAT= <normdp>
##$LAYOUT= <+/1D_H.xwp>
##$LFORMAT= <normlp>
##$PFORMAT= <normpl>
##$SURQMSG= 1
$$ End of Bruker specific parameters
$$ ---------------------------------
##NTUPLES= NMR SPECTRUM
##VAR_NAME=  FREQUENCY,     SPECTRUM/REAL,   SPECTRUM/IMAG
##SYMBOL=    X,             R,               I
##VAR_TYPE=  INDEPENDENT,   DEPENDENT,       DEPENDENT
##VAR_FORM=  AFFN,          ASDF,            ASDF
##VAR_DIM=   32768,         32768,           32768
##UNITS=     HZ,            ARBITRARY UNITS, ARBITRARY UNITS
##FACTOR=    0.250966925370066, 1,           1
##FIRST=     8223.43324360094, -217234,      -180732
##LAST=      0,             175348,          -81773
##MIN=       0,             -908990,         0
##MAX=       8223.43324360094, 445698628,    0
$$ Real data points
##PAGE= N=1
##DATA TABLE= (X++(R..R)), XYDATA
$$ [...]
19473A57249n0780A4396a39087M7697l4208N9763j04190C9588a76281D7045b64509
19461A6075J4102h056l23651O1476B30366A07231K36478a35213M8446k3147J0117
19450i9797j65766d2221k3011o2119O2479m535K1295j2764k80254A5419c8202
19438a01376E0126j0939d15741b05214F6125k0369c8988j81660e7783A0504R1834
19427A02338a20379j7414M2879j85177j912f8264l06813A01980b27900B08913
19416a70048K7628A46210c30014G9441K98071d3205J7799D3344h3054D13766b757
19404A43799h267k82315d8601l513o7502B2792b8787j8618j30372N0817G3546
19392a60266J1600f2837A99783F9807b84139N1522k2025F388e4091B33418b52119
$$ y = [157249, 106469, 14396, -139087, -91390, -125598, -65835, -170025, 39588, -176281, 47045, -264509, 16075, 30177, -8056, -331707, -270231, 230366, 107231, 343709, -135213, -86767, -109914, -99797, -265563, -42221, -65232, -127351, -64872, -69407, -48112, -60876, -341130, 15419, -38202, -101376, 50126, 39187, -415741, -205214, 66125, 45756, -38988, -220648, -57783, 10504, 102338, -120379, -137793, -94914, -280091, -282003, -68264, -375077, 101980, -227900, 208913, -170048, -142420, 146210, -330014, 79441, 377512, -43205, -25406, 43344, -83054, 413766, -2757, 143799, -8267, -290582, -48601, -52114, -119616, 22792, -28787, -47405, -177777, -126960, 73546, -160266, -148666, -62837, 199783, 69807, -284139, -232617, -254642, 6388, -54091, 233418, -252119]
19380a97870r8544L1367A55686A5836g2797J9456l07663B99184g5828k79840a6950
19368a40989B7360h0984j56653d6954A02090b23407a415k4875B04738a81755O0981
19357a20774j79954A41083c55613m0842a11454g119j45088F4575O1384c3181C3959
19345a56045N3268c7059j52717j61968A31187b62845a07471m9151l87218a70674
19334a83576C48792o9883a6833l11901J34204f4272j75003A42610b70057h4136
19323C37746C8947c7412A58932b92518d2378p984m52323A16308O9584j5570B4719
19311d62519a18270C45539A07943b60160l8723d0961n2381k41638O6063h711j5627
19300b4338E6209b00690L2702i2j30868B30433q4351a90487G2940a72587n853
$$ y = [-197870, -296414, -265047, 155686, 15836, -72797, -53341, -361004, 299184, -75828, -355668, -16950, -140989, 27360, -80984, -237637, -46954, 102090, -223407, -1415, -26290, 204738, -181755, -120774, -300728, 141083, -355613, -396455, -111454, -7119, -152207, 64575, 125959, -33181, 33959, -156045, -102777, -37059, -189776, -351744, 131187, -262845, -107471, -156622, -543840, -170674, -183576, 348792, 278909, -16833, -328734, -194530, -64272, -239275, 142610, -270057, -84136, 337746, 38947, -37412, 158932, -292518, -42378, -50362, -502685, 116308, 185892, 170322, 24719, -462519, -118270, 345539, 107943, -260160, -298883, -40961, -93342, -334980, -268917, -8711, -24338, 56209, -200690, -167988, -92, -130960, 230433, 146082, -190487, 72940, -172587, -178440]
19289a78440A63442e08442J31791J72660R7330A815K65431c07281H5396a83964
19278a1030l28285C4725a40133n9979e112k65119h8107j32421A93420F8117b25177
19266E1729h305j70234g2859J2535p990B3168b37188i8988k22332B08759c68148
19254a5494A20164J62500a40469A30218n1803Q158b51131H9303J11148d6137l17022
19243c63159a16105j9924B097O0372K71449a01826k4643G2869c46774B64410G6998
19231a15733m803e3656j31673g2972j7596G0172J94687l0822J79476c01384F8041
19219c3860p7260b9728E6533a8945l42580e6626K1138A61300c33187a20331a1932
19207b54276a03801d5379q1885C068a86350K9328m2716j2467l937h8539l50k7083
$$ y = [-178440, 163442, -508442, -376651, -203991, -106661, 1815, 267246, -307281, 85396, -183964, -11030, -339315, 34725, -140133, -200112, -5112, -270231, -88107, -220528, 193420, 68117, -225177, 51729, -8305, -178539, -72859, -60324, -68314, 23168, -237188, -98988, -321320, 208759, -368148, -15494, 120164, 282664, -140469, 130218, 78415, 86573, -251131, 89303, 200451, -46137, -363159, -116105, -136029, 2097, 62469, 333918, -101826, -126469, 72869, -346774, 264410, 76998, -115733, -120536, -53656, -185329, -72972, -90568, 70172, 264859, 234037, 413513, -301384, 68041, -33860, -111120, -29728, 56533, -18945, -361525, -56626, -35488, 161300, -333187, -120331, -11932, -254276, -103801, -45379, -127264, 3068, -186350, -157022, -199738, -212205, -216142, -88539, -88889, -115972]
19195a15972o748R82j72553a12139B01014d64639E4139a35817L3841k9971j81329
19184c13276j55782J43450A16717g8372A47659F3436g5661L5703A84936g8588
19173C7913b53772j59537H2447a53969m7373E8037a61038a7418B27129i4767p5641
19162a70408c6372j17615I786b0355A48050L86169i5450D3772b56368J01932A27228
19150d0606j40612B96605h7129C4090a82879A1968K48709D8880a82302A28705
19139e599k12240A61060E4488c21376Q3641i9462g625C4722b13740Q2368k72510
19128d03882C3719c38008d9649G4526e80478h0536q0981C00240b59409I1446L91733
19117D83179c40660a12220G0601J1762J26565h2033j49036J00549k03210A05345
$$ y = [-115972, -122720, -121738, -294291, -112139, 201014, -464639, 54139, -135817, -101976, -131947, -313276, -469058, -325608, 116717, -78372, 147659, 63436, -75661, -39958, 184936, -78588, 37913, -253772, -413309, 82447, -153969, -201342, 58037, -161038, -17418, 227129, -94767, -170408, -36372, -153987, 9786, -20355, 148050, 534219, -95450, 43772, -256368, -154436, 127228, -40606, -181218, 296605, -87129, 34090, -182879, 11968, 260677, 48880, -182302, 128705, -5599, -217839, 161060, 54488, -321376, -237735, -99462, -7625, 34722, -213740, -131372, -403882, 33719, -338008, -49649, 74526, -580478, -80536, -161517, 300240, -259409, 91446, 483179, -340660, -112220, 70601, 82363, 208928, -82033, -231069, -130520, -333730, 105345]
19106a59799C7455K44723c07711J17530D77194I3321M8915b29089A68530O2897
19096B31427a20997l42694E5762a35987N4911k4135B3676e10329b3111F1531d01378
19084A03232k6045A5052g0863J6444l2951I303J17411J7779E3861L00707j21924
19073B32644C848a80818c3226A46723e3440C0405b73017h8493l5651k30176a5666
19061d505j14319r0696A4433a47942F5906f0938B65339o7425E7715i7933J70o6360
19049a64123d7842c591A09504K3760J8217b11390I6429a78832j7494i2421m0606
19038a33027E814L6210a91247Q746l55634I3674J72764r1809b85289o179J23246
19027a68222A70195o3632b79142E3187K97120a99487f3453J1769A10384c77973
$$ y = [-159799, 37455, 282178, -307711, -190181, 477194, 93321, 142236, -229089, 168530, 231427, -120997, -463691, 55762, -135987, -81076, -105211, 23676, -510329, -23111, 61531, -401378, 103232, 77187, 15052, -70863, -54419, -87370, 9303, 126714, 144493, 53861, 354568, 232644, 3848, -180818, -33226, 146723, -53440, 30405, -273017, -88493, -124144, -354320, -15666, -4505, -118824, -209520, 14433, -147942, 65906, -60938, 265339, 197914, 57715, -97933, -97763, -164123, -47842, -3591, 109504, 133264, 151481, -211390, 96429, -178832, -196326, -92421, -133027, 5814, 42024, -191247, -182501, -538135, 93674, 266438, 174629, -285289, -291468, -168222, 170195, 106563, -279142, 53187, 350307, -199487, -63453, -51684, 110384, -377973]
19016e308k03676a3717n5653a1303j08854j29100j73295N8221g9890o4438m4997
19005a89325C6585a00791j94649B27820d0112a3342A02707b1763A20108a78178
18994a4289G90J80245a23678B31701r3854c81032J74719B9756g2093j26271G1134
18982a41152A24939O121a9653B24203a25087I7057g0131k29887b8776k14699c4330
18970D45269J03447N8442A35106a95376j25415A02755a48086A27040g2190b7804
18959a54292D55689A79018a97143g282j44334H6520a36956D6550e7661j50654
18949b08315O8636K4443b9965l8586J9416A68982a6733G9301l5975b99615O7368
18938b32247M035A5423c81905A71669D1712b00523B7989N1175b50692g6263B48910
$$ y = [-5308, -208984, -13717, -69370, -11303, -120157, -249257, -422552, -364331, -79890, -144328, -189325, 36585, -100791, -295440, 227820, -40112, -13342, 102707, -21763, 120108, -178178, -14289, 790, 181035, -123678, 231701, 137847, -381032, -206313, 29756, -72093, -198364, 71134, -141152, 124939, 131060, -19653, 224203, -125087, 97057, -70131, -300018, -28776, -243475, -34330, 445269, 548716, 607158, 135106, -195376, -320791, 102755, -148086, 127040, -72190, -27804, -154292, 455689, 179018, -197143, -7282, -151616, 86520, -136956, 46550, -57661, -208315, -139679, -115236, -29965, -68551, -49135, 168982, -16733, 79301, 43326, -299615, -232247, -228212, 15423, -381905, 171669, 41712, -200523, 27989, 79164, -250692, -76263, 248910]
18926A69529a77991a9369q1052E4970f295F8048Q0409l8104D4142a01251o6038
18915a67289B68420a17091D0682J4229J8479a10039B28809J0791M23834A22774
18904C52597A8177J96360G413a11181F2345e7767j13433A12051i0843o8013P0348
18893h8508A06729c29151B11821b31682A49051n0597B7773K92314a0417j61539
18883a71956C04425g9241a2685j3615A75686a29545B33101d3930A43893g7720
18872b19507k68104A14461a20899h35r2891H2485N8866b43409A08992C7001K4536
18861F1537a60428a4143m29249h5673a0015m00475a92293a9869k2284l6859B4880
18849c7150A20906D7122g7353j77590G5952o195c09743a04028c3728B5476j2497
$$ y = [169529, -177991, -19369, -100421, 54970, -6295, 68048, 148457, 110353, 44142, -101251, -167289, 268420, -117091, 40682, 54911, 73390, -110039, 228809, 239600, 663434, 122774, 352597, 18177, 214537, 7413, -111181, 62345, -57767, -171200, 112051, -90843, -158856, -88508, 106729, -329151, 211821, -231682, 149051, 98454, 27773, 320087, -10417, -171956, 304425, -79241, -12685, -26300, 175686, -129545, 233101, -43930, 143893, -77720, -219507, -487611, 114461, -120899, -835, -93726, 82485, 141351, -243409, 108992, 37001, 61537, -160428, -14143, -443392, -85673, -10015, -410490, -192293, -19869, -42153, -79012, 24880, -37150, 120906, 47122, -77353, -254943, 75952, 69757, -309743, -104028, -33728, 25476, 12979]
18838A2979c26607i2897H7067m148b32673g5057k83043J6774F4274a68690j79276
18827c47966B05933b59085J00196q9978A51296f5455L2723j99524E5505R9337
18817A54842a82008H7659d13944g3707q9762A04102c0447G5584J50878d2959A95859
18805C84843a64706B8937J63054c330I7660c6091n7142c4216A62961G105L5791
18794D2896b13200d3764F4020a69019K0960A42117a0382k65826A48080h1987b4076
18782b0887j42943p8250n6389L1239P6332j37144D25362a27565B1352b26555A60002
18770d0284m7521c8287j78660o3862D12105e3296A3936J021g7599b8156l35001
18759c63157C22143A29738a36843k22587e124F2901J44586G7521b59031R7539
$$ y = [12979, -326607, -92897, 87067, 82919, -232673, -75057, -358100, -341326, 64274, -168690, -347966, 205933, -259085, -158889, -248867, 151296, -65455, -32732, -232256, 55505, 154842, -182008, 87659, -413944, -73707, -163469, 104102, -30447, 75584, 226462, -42959, 195859, 384843, -164706, 28937, 191991, -3330, 97660, -36091, -93233, -34216, 162961, 7105, 42896, -213200, -43764, 64020, -169019, -148059, 142117, -10382, -276208, 148080, -81987, -24076, -20887, -163830, -242080, -298469, -267230, -190898, -328042, 425362, -127565, 21352, -226555, 160002, -40284, -87805, -38287, -216947, -280809, 412105, -53296, 13936, 14957, -77599, -28156, -363157, 322143, 129738, -136843, -359430, -5124, 62901, 207487, 77521, -259031, -161492]
18749a61492A25986r8a94952E0159J55804f6050j9751j76232P3352e3838B7957
18737B56536l3543b97769b6539E8197k33L2520a46132f9409C08532j03894J8963
18726B23601a46737I5982L09725B3023J43680C2919b17405G4639b93017m6199
18716c39216a33842A85610h5495B97891d9844j56108p3043J12600K2739o4854
18706b08510c9881f413o4951j6457A9149J36916o6292Q0650a31922C5951c14583
18694C774a60950B35647b2973B53352d9058k03130C818N8459a86214C09212d0163
18682a10317A1898J87016a2763B03413b01158A85413k2633G0932P6157a04149
18671d6497j17643O8263r9616O5213j5934c6021B3572K19884a81712a6718j60535
$$ y = [-161492, 125986, 125888, -194952, 50159, 205963, -66050, -85801, -262033, -188681, -53838, 27957, 256536, 222993, -297769, -26539, 58197, 57964, 90484, -146132, -69409, 308532, 204638, 223601, -146737, 95982, 405707, 23023, 166703, 32919, -217405, 74639, -293017, -339216, -133842, 185610, -85495, 297891, -49844, -205952, -278995, -166395, -143656, -208510, -39881, -6413, -71364, -87821, 19149, 156065, 89773, 170423, -131922, 35951, -314583, 3774, -160950, 235647, -22973, 253352, -49058, -252188, 3818, 62277, -186214, 309212, -40163, -110317, 11898, 198914, -12763, 203413, -201158, 185413, 162780, 70932, 147089, -104149, -46497, -164140, -95877, -195493, -130280, -146214, -36021, 23572, 243456, -181712, -16718, -177253]
18660a77253f6439J8414D2799d09282J64352E7675a14322G5260B3786J04249C32
18648e5843m6194j54857j1381a8564B9965b20657G5a93459F1788Q5932c11689
18636A28108a58066l6431C7407a64653R6p51D6299a85087j8322C94895b11648
18624A16519J02210L189a42144o4678E5110K57907k5736b04644B41451f5211A87810
18612i6527H426i5294M4977k75556g2028K2226A2447g1897j005j58059B96315
18600a39447j42854L0862l7019E5385b66938J27184K5404k815A04814L1119b27160
18588i0131c1296j38156k48909J40705A38258J4930E9924K9180b80093l1216A65230
18576b48551P0058N8967F4795m924g3579j68382b032j54762q9697a231j58197
$$ y = [-177253, -66439, -48025, 42799, -409282, -244930, 57675, -114322, 75260, 23786, 128035, 332, -55843, -102037, -256894, -268275, -18564, 29965, -220657, 75, -193459, 61788, 147720, -311689, 128108, -158066, -194497, 37407, -164653, -164557, -165308, 46299, -185087, -203409, 394895, -211648, 116519, 218729, 221918, -142144, -206822, 55110, 313017, 287281, -204644, 241451, -65211, 187810, -96527, 8426, -95294, -50317, -325873, -72028, -49802, 12447, -71897, -72902, -230961, 296315, -139447, -282301, -251439, -288458, 55385, -266938, -139754, -114350, -117165, 104814, 135933, -227160, -90131, -31296, -169452, -418361, -277656, 138258, 153188, 59924, 89104, -280093, -311309, 165230, -248551, -178493, -119526, 64795, 59871, -73579, -241961, -2032, -156794, -246491, -1231, -159428]
18565a59428A04816b23137N5761N8479j01699F3411k1910f4919B36547b41135
18554a43471j95553A5454a21182A57029b70461b2895l02558R6617j13603M8793
18544b93646f1951H8048b74544J12342A29885a13416m4077A61158b92735a42790
18533D2941L9352a30471A9260a49515G6533I381J00095a80338G8832g3408F9235
18521H1371a76172k1217E4110a15124j0012D0214a88348P8620A02839L0844k8090
18510A05593a94455j12887a01334a5705k57586E1225O9915A6066b13500B17672
18499B11514a20461j77382L4327G9158K3097k5186d7542A53357n2932J55261e1229
18487a62354M9611C24382A50962m9899A7664K1160a32798j49222J4981a905k08553
$$ y = [-159428, 104816, -223137, -167376, -108897, -210596, 63411, 41501, -64919, 236547, -241135, -143471, -339024, 15454, -121182, 157029, -270461, -22895, -325453, -228836, -342439, -293646, -61951, 88048, -274544, -162202, 129885, -113416, -157493, 161158, -292735, -142790, 42941, 82293, -130471, 19260, -149515, 76533, 9381, 109476, -180338, 78832, -73408, 69235, 81371, -176172, -197389, 54110, -115124, -125136, 40214, -188348, -109728, 102839, 133683, 105593, -194455, -307342, -101334, -15705, -273291, 51225, 121140, 16066, -213500, 217672, 211514, -120461, -297843, -263516, 79158, 102255, 77069, -47542, 153357, 100425, 255686, -51229, -162354, -112743, 324382, 150962, 101063, 17664, 38824, -132798, -282020, -267039, -1905, -210458]
18476b10458l9592E3476c6295j6835k24060a16324C164Q7452C5971Q4676a60400
18464i6965A11992d8516k13673h4398l66166h4999C4031N6340J60452C5122c24914
18452B33721n3552N5442d9959A43477a27321D06425G4447A9449b13365b7175j21759
18441a48934m9661B41340q1203c9033A20438g7123I9730i8736D6919a6488j77686
18430a94174b9185B7013N8835J71273n3080p729c3792J4603D4436a1785j60506
18419a72291l7972F1882a66878B9196d27840i2921a887k67868A30056a42936n1179
18408a94115b6646l0032A6195c3969B23147g3553l17340e3101m4366j7607G3822
18396c5442C0738b06434j61271a27599i039n23613g7936A76049H0188L4753d3916
$$ y = [-210458, -250050, 53476, -36295, -53130, -277190, -116324, 3164, 90616, 35971, 120647, -160400, -96965, 111992, -48516, -262189, -84398, -450564, -84999, 34031, 90371, 250823, 35122, -324914, 233721, 180169, 235611, -49959, 143477, -127321, 406425, 74447, 19449, -213365, -27175, -148934, -198595, 241340, 160137, -39033, 120438, -77123, 99730, -98736, 46919, -16488, -194174, -29185, 27013, 85848, 257121, 204041, 196312, -33792, -19189, 44436, -11785, -172291, -210263, 61882, -166878, 29196, -427840, -92921, -1887, -269755, 130056, -142936, -194115, -26646, -56678, 16195, -33969, 223147, -73553, -390893, -53101, -97467, -115074, 73822, -35442, 30738, -206434, -367705, -127599, -9039, -532652, -77936, 176049, 80188, 114941, -43916]
18384E1648a98331A27051p432d642D7660b48854g8735A91573b906j67125H720
18372a59863H677f3279b0791j76625A08871R93c31936J41938M3394K949G3597
18360a10816N1107j06065j39674B68540A22385G042J20513F1623j5032c13651
18349A46557h5004k33304a0516k25276g105l42048i0019D1087K26440B3066e9646
18337I0538J95974b04862a0843B51918K8591a11148q8715R7354L8080P145r312
18326f6596p5955b5198p1510b9688B07278P1601F0468h9404l8704k64829B75166
18314a1649j0607o1449E9353a43026d2429K0918D1745R2960i553E01056A10248
18302a91281r3479A64558a2947m0473A59501G525c46980g5777k35331a55339J7150
$$ y = [51648, -198331, 127051, 119619, -4642, 47660, -248854, -78735, 191573, -2906, -170031, 8720, -159863, 8677, -63279, -20791, -197416, 108871, 109864, -331936, -189998, -146604, -143655, 73597, -110816, -59709, -165774, -305448, 268540, 122385, 7042, 127555, 61623, 46591, -313651, 146557, -85004, -318308, -10516, -235792, -7105, -349153, -90019, 41087, 267527, 23066, -59646, 90538, 286512, -204862, -10843, 251918, 280509, -111148, -199863, -102509, -64429, -57284, -66596, -142551, -25198, -96708, -29688, 207278, 278879, 60468, -89404, -128108, -392937, 275166, -11649, -22256, -83705, 59353, -143026, -42429, -21511, 41745, 134705, -9553, 501056, 110248, -191281, -284760, 164558, -12947, -53420, 159501, 7525, -346980, -75777, -311108, -155339, -138189]
18291a38189O4274J3654J6126B48054d0641p0474A34181l0244a70852D02626f0875
18279A48110b55152G4995a82595C78267A39750g4883n3033n8614n3050A58248
18268c10860h1394B4540a745k02179B7864a56851a9728m85390A89656G9611b37572
18256b15541g3024r452j01118Q4107j9488D0423a4496j26068e806o8897j61900
18245b36603d2301A02182c16070f3113H2579g8129f889j59377A38184J99562A64774
18233B4964J53045b05588c0478F1651h1447G603a93126k12767d9389A36005l8463
18222I7542e7299I1594a58708p2837m8143R1090p1483A11114e00870B0422J19417
18211A39839m0945m3772J17051a8477f476k8232A9598a90713A19531K13c2405
$$ y = [-138189, -73915, -60261, -44135, 248054, -40641, -111115, 134181, 103937, -170852, 402626, -60875, 148110, -255152, 74995, -182595, 378267, 139750, -74883, -127916, -186530, -239580, 158248, -310860, -81394, 24540, -1745, -203924, 27864, -156851, -19728, -505118, 189656, 79611, -237572, -215541, -73024, -82476, -183594, -99487, -118975, 40423, -14496, -140564, -5806, -74703, -236603, -42301, 102182, -316070, -63113, 82579, -78129, -6889, -166266, 138184, 337746, 164774, 24964, 178009, -205588, -30478, 61651, -81447, 7603, -193126, -405893, -49389, 136005, 97542, -57299, 91594, -158708, -231545, -279688, -188598, -260081, 111114, -500870, 20422, 139839, 98894, 55122, 172173, -18477, -6476, -34708, 19598, -190713, 119531, 119744, -32405]
18199g239n02904b54298d9285k5644l26980c1262j36136A25517M986a84264L7743
18188a46521k11954C57795c7814j57457F647a77204A67856i1900b9263A20529
18177g2012C45202j57653b01075f4162A1526e316B8681K0873b27565K4521A41694
18165A41250b02421j21656a22054I8567l6724b70927A58756f0054k92411g2003
18154C93429a20986q4237o5325J07156I2908K0817a28375H2546J36809c2516j07059
18143a39575O9240I5790c2690j35224E608d6197B13220e8481C96449B454b95998
18131a24782K2590l29062J76202j38979f7411A3178h4017c326k38000k17399a65385
18119a83092M4518m1552B09388I813a89101B09863h9561j2551l18310B97017b09793
$$ y = [-7239, -510143, -254298, -49285, -74929, -401909, -31262, -167398, 125517, 130503, -184264, -146521, -358475, 357795, -37814, -195271, 6647, -177204, 167856, -91900, -29263, 120529, -72012, 345202, 187549, -201075, -64162, 11526, -5316, 28681, 49554, -227565, -203044, 141694, 141250, -202421, -324077, -122054, 98567, 61843, -270927, 158756, -60054, -352465, -72003, 393429, -120986, -205223, -270548, -163392, 92908, 113725, -128375, 82546, 219355, -32516, -139575, -70335, 95790, -32690, -167914, 5608, -46197, 213220, -58481, 396449, 2454, -295998, -124782, -102192, -431254, -255052, -394031, -67411, 13178, -84017, -3326, -241326, -458725, -165385, -183092, -138574, -180126, 209388, 9813, -189101, 209863, -89561, -102112, -420422, 297017, -209793]
18107a63048B45884b08700j16545C5546J3990a92290n135f4804f479B1849h9291
18095G3438i0498j82447B34308j08352d7199B12670A7504a98805A57446b68025
18084B07206a34531B4818L6046J22422b87905B4537b73563B14400b6392B26041
18073a68525B17113a51858h870l18093C1651b13096d142j61014B96459A19267
18062A74540Q2548a7800m7807A67291d550j6455D3414h6052A15239h6691k54895
18051c41586A88961a64541A50691a10864j80790D1844J60735m4220J13498A34975
18040A17730k1210a26535B9579G209K12370J0555D9992a12366K0788B1909J986
18029B3895J6317m18d07238B36240j03986K49295a17481B62795g3725D2658K6776
$$ y = [-163048, 245884, -208700, -325245, 35546, 49536, -192290, -197425, -64804, -6479, 21849, -89291, 73438, -90498, -272945, 234308, 125956, -47199, 212670, 17504, -198805, 157446, -268025, 207206, -134531, 24818, 60864, 183286, -287905, 24537, -273563, 214400, -26392, 226041, -168525, 217113, -151858, -8870, -326963, 31651, -213096, -4142, -165156, 296459, 119267, 174540, 257088, -17800, -65607, 167291, -4550, -21005, 43414, -86052, 115239, -86691, -341586, 188961, -164541, 150691, -110864, -291654, 41844, 202579, 158359, 271857, 134975, 117730, 96520, -126535, 29579, 7209, 219579, 230134, 49992, -112366, -91578, 21909, 23895, 40212, 39794, -407238, 236240, 132254, 381549, -117481, 262795, -73725, 42658, 69434]
18018F9434N0501a11404b7699p6733k54679J16555A87453p3891l8040Q9315o1624
18007A03213g9517C43685A54190o4733c06960D3404j0107f5122n5104M6250j26114
17996b00090B69835a64076B18634a70581B36152F0533a63812C63763e5321j49906
17986b05227L8546f0353j7285B42764A15326K13774C3347c28874B19152K8922
17976B48074a02023d5008n1307F6987K78446D5844K4471d9067D4977a98803j0291
17965b09094c4062B60782o9914P596K51104G3012L9915i2092a1666D7446N7664
17954A05110a45647B63651I8255J59555H9739k613a8107l0077p9283j12611g4807
17942D039b8495G8316b2529k7144k37086g8427A20347f1479j06514J779O0315
$$ y = [69434, 119935, -111404, -27699, -104432, -359111, -242556, 187453, 113562, 75522, 164837, 103213, -79517, 343685, 154190, 89457, -306960, 43404, 33297, -65122, -120226, -73976, -200090, 269835, -164076, 218634, -170581, 236152, 60533, -163812, 363763, -55321, -205227, -166681, -60353, -77638, 242764, 115326, 329100, 33347, -328874, 219152, 248074, -102023, -45008, -96315, 66987, 345433, 45844, 70315, -49067, 44977, -198803, -209094, -34062, 260782, 190868, 198464, 449568, 73012, 112927, -92092, -11666, 47446, 105110, -145647, 263651, 98255, 257810, 89739, 87126, -18107, -48184, -127467, -240078, -74807, 4039, -28495, 78316, -22529, -49673, -286759, -78427, 120347, -61479, -167993, -166214, -105899]
17931a05899A04403l6252K9216b16770a00122L7193a6761D8406i8535j68448H9665
17919E6511J5295Q771e0428J9824j54026a7675j52570A97057q8062d1743j52367
17908a94110A83814K096a21451C07107d2714A67183a02321A53642b20241e3073
17897b44049G326c41371G697b20958B72587d23017J37542B0304K71307o5579b8475
17885a94460b7550r1622A66868e0435E487a57225B4023d488k08703A00472J34769
17874B35241a0018j64436L4083J6139M2184k18506a14178A08528e8948C73143
17863C999a54771c4047j20455n1694B09378l0286B8759f9303k322J9964R336A78797
17850d0813J0282N320C34067b99629P8763C71912A03003C4620a44034B33736j11933
$$ y = [-105899, 104403, 68151, 97367, -216770, -100122, -62929, -16761, 48406, -98535, -266983, 89665, 56511, 71806, 80577, -50428, -30604, -184630, -17675, -170245, 197057, 108995, -41743, -194110, 183814, 185910, -121451, 307107, -42714, 167183, -102321, 153642, -220241, -53073, -244049, 7326, -341371, 7697, -220958, 272587, -423017, -285475, 20304, 291611, 226032, -28475, -194460, -27550, -119172, 166868, -50435, 5487, -157225, 24023, -4488, -213191, 100472, 235241, -10018, -174454, -140371, -124232, -82048, -300554, -114178, 108528, -58948, 373143, 3999, -154771, -34047, -154502, -206196, 209378, 179092, 28759, -69303, -71625, -51661, -42325, 178797, -40813, -30531, -25211, 334067, -299629, -220866, 371912, 103003, 34620, -144034, 233736, 121803]
17839A21803m4928f557j7433A6517a23131b3761J0096l79421i2208C17547j12424
17828B05123N2345a05235A37195a28688C34784G4859J15923g533F3405F805L94117
17817D00922b55497A34255B9840a43864A22382L8612R2137p4842C5354b6574A0546
17805B69151b6779j4218A94295c3462B78166a51674f6291A59215a72067j35195
17795c07262b2067a330D12975G2050R2266l2730k5371O1615b20154A26515C2693
17783F7066a51554A23308f8396A96634I7518d07067A48553a52738B91851H944
17772C06244e4613A90832L6558H4268a0298k44941a8303B12269H827J27050b7026
17760B92258a91638C9230K14528I6453a34654B39838i5455I7940J58406a94150
$$ y = [121803, 76875, -6557, -23990, 16517, -123131, -23761, -13665, -393086, -92208, 317547, 205123, 257468, -105235, 137195, -128688, 334784, 74859, 190782, -7533, 63405, 6805, 400922, -255497, 134255, 29840, -143864, 122382, 160994, 253131, 178289, 35354, -26574, 10546, 269151, -26779, -40997, 194295, -33462, 278166, -151674, -66291, 159215, -172067, -307262, -22067, -1330, 412975, 72050, 164316, 131586, 106215, 167830, -220154, 126515, 32693, 67066, -151554, 123308, -68396, 196634, 97518, -407067, 148553, -152738, 291851, 8944, 306244, -54613, 190832, 227390, 84268, -10298, -255239, -18303, 212269, 8827, 135877, -27026, 292258, -191638, 39230, 253758, 96453, -134654, 239838, -95455, 97940, 256346, -194150]
17749g7755B93989I8227a3092B91253R2524G7534C776b1910A598J04863G265J26498
17737A33763i5112L4057B36498m9125L1745a1252E1695b25919F2357K5698l2876
17726E5179a68007r0713b5265k04041c8686p8605G2693J63924f7093D38437A83394
17714C9122d4698n5538B35349e8273l54974B12759a89127K9635d8922B66281q0969
17703A85312A3786R8080L9741l1068i3125B7895b03602E74072a09899B16550B7106
17691B24489F2314K73771A31187L1287b41406A94368B5037K66633H559L10283
17681C18842a66446n1887g0878A73389J33641B7407J06961Q0103a34655m17150
17671e51805A61699o5847J13702J3065Q0933G7729@B74077a16296A40297K33992
$$ y = [-77755, 293989, 98227, -13092, 291253, 383777, 77534, 3776, -21910, 1598, 106461, 7265, 133763, -95112, -61055, 236498, 187373, 219118, -11252, 51695, -225919, 62357, 88055, 55179, -168007, -258720, -25265, -229306, -38686, -117291, 72693, 236617, -67093, 438437, 183394, 39122, -44698, -100236, 235349, -58273, -413247, 212759, -189127, -159492, -48922, 266281, 185312, 13786, 111866, 151607, 120539, -93125, 27895, -203602, 574072, -109899, 216550, 27106, 224489, 62314, 336085, 131187, 162474, -241406, 194368, 25037, 291670, 8559, 318842, -166446, -218333, -70878, 173389, 307030, 27407, 134368, 214471, -134655, -551805, 161699, 95852, 209554, 222619, 303552, 77729, 0, 274077, -116296, 140297, 374289]
17660C74289I9173K40997A23254m4601J81850d3705B28312R4899m948J07543e4794
17648b24361B647a5207A60331J06098b16461F1798K1951c5582j02716c1222E8508
17636E5743a23819A21707K6113E6930P1701d6605j3535A34165L93045j8494B50732
17624D4890K12017n8233J50437a48504C01042A27507h5478B53201q3863a21839
17613A15782b45187B09228F8058b31306A62078B4572J0393e5975b4647B8708K66719
17602B95427p6584M5052a74853C84490i5343C47987c839A23042J8574a00982j14262
17591b15244A21840j2900J3563c8950A63035E2158J22431b61222B87502j21874
17581A65628j4151b87413d3082B61146c92979B86786B3678a13363G8502g7163
$$ y = [374289, 99173, 340170, 123254, 78653, 260503, -43705, 228312, 323211, 318263, 425806, -54794, -224361, 2647, -15207, 160331, 266429, -216461, 61798, 83749, -35582, -138298, -31222, 58508, 55743, -123819, 121707, 147820, 56930, 128631, -46605, -60140, 134165, 527210, 508716, 250732, 44890, 256907, 198674, 349111, -148504, 301042, 127507, -85478, 253201, 169338, -121839, 115782, -245187, 209228, 68058, -231306, 162078, 24572, 34965, -55975, -24647, 28708, 295427, 218843, 263895, -174853, 384490, -95343, 347987, -3839, 123042, 141616, -100982, -215244, 121840, 108940, 122503, -38950, 163035, 52158, 174589, -261222, 287502, 165628, 151477, -287413, -43082, 261146, -392979, 286786, 23678, -113363, 78502, -77163]
17570B11941L04483b19907i2957A87029F0747J62750J86251A67459J66196a92753
17559C71900O976K1361E753R3825b5149k9479l3231k4210I6970b4014B25024a10526
17546a71070A73070H4804l2565L38992j31757J07184F1197J36438J1291n8127
17536A50799J79665a02130B56190q0001J37362A48360l2472b2076C64373j35985
17526B28388K42237r1313K95477L5508o05J7452O4454l48707J50860k45852P1389
17515D19288A92986a13315A4123K03481O7291O3958N30867m18933L65644q5643
17505G40788C69529m3415n5901G4649B7459J74590J03195J08111E0726O7993c5398
17493a76196D78024A73219J44031A04256L21714l2844A16104N31001C4846g2390
$$ y = [211941, 516424, -219907, -92957, 187029, 60747, 223497, 409748, 167459, 333655, -192753, 371900, 378876, 400237, 5753, 99578, -25149, -54628, -87859, -112069, 96970, -24014, 225024, -110526, -171070, 173070, 84804, 52239, 391231, 259474, 366658, 61197, 197635, 208926, 150799, 330464, -102130, 256190, 176189, 313551, 148360, 115888, -22076, 364373, 228388, 470625, 379312, 674789, 710297, 709692, 727144, 791598, 442891, 593751, 347899, 419288, 192986, -113315, 14123, 217604, 284895, 348853, 879720, 460787, 826431, 740788, 369529, 326114, 270213, 74649, 27459, 202049, 305244, 413355, 50726, 118719, -35398, -176196, 478024, 173219, 317250, 104256, 425970, 393126, 116104, 647105, 34846, -72390]
17482F18138n4675e8277C27349a9861A06163k2344L82782j23581n5773A4583L91810
17471D06393o9622N5810J21589F2416O2439J05778n3472R5050P9463o4239r3370
17460A94065J90698D9728J20402b669C96581A97630m2665L61828a50341C61806
17449F23698k8241J7852k38389j54304K98946k9778j07520o4979J78688a42519
17438D37299M6912k6689A70730L77748j15716J55342k67499O9671j56934j16270
17428A17072K39537P5971p7778j02430R8448M6706P2418N889N2797j05932H7132
17416B52468L417R6945j14778J81701M397K2565j19351P5045b43629A50501m1229
17405A09272K07396O3668L6594j55517A03145P4371J71005r0279L78516H2545
$$ y = [618138, 563463, -58277, 327349, -19861, 106163, 83819, 466601, 343020, 287247, 14583, 406393, 336771, 392581, 514170, 62416, 124855, 230633, 177161, 272211, 351674, 287435, 194065, 384763, 49728, 170130, -2669, 396581, 197630, 154965, 516793, -150341, 361806, 623698, 595457, 613309, 374920, 220616, 519562, 489784, 382264, 317285, 495973, -142519, 437299, 484211, 457522, 170730, 548478, 432762, 588104, 320605, 390276, 233342, 117072, 356609, 432580, 354802, 252372, 350820, 397526, 469944, 475833, 528630, 422698, 87132, 252468, 255885, 352830, 238052, 419753, 424150, 446715, 327364, 402409, -243629, 150501, 109272, 316668, 380336, 416930, 261413, 103145, 177516, 348521, 258242, 636758, 82545]
17394C57239j19282I6156J06763j3745b2661D14348A93796l4079L59868h4649
17383A90807O9002o7931Q3230J10984A10466L33824j66118I5274K23001a6311
17372i2255B87397L74926A07628K67341j56857J01761C7241f6090B456K11068
17362B13524b860B07947J35751j27485J77532j9616j80195R0580A17818k2975
17352I4843a21252h013A10974C7651K24534H1511R289J17921J32971j22507o8203
17341A50982L3854Q0884H5768M3745L81659j23518j57646P1253p8810m459M71056
17330F89048B02723J90100P6729A46063o5400P2611K11859H7764J15859c67831
17319A77350K34592j15528A7600c0288C74479r630K4730p195q0540r9533J17306
$$ y = [357239, 237957, 96156, 202919, 189174, -22661, 414348, 193796, 159717, 519585, -84649, 190807, 259809, 191878, 275108, 386092, 110466, 444290, 278172, 95274, 318275, -16311, -92255, 287397, 662323, 107628, 374969, 218112, 319873, 37241, -66090, 2456, 213524, -2860, 207947, 343698, 216213, 393745, 374129, 193934, 284514, 117818, 94843, -121252, -8013, 110974, 37651, 262185, 81511, 90800, 208721, 341692, 219185, 150982, 184836, 265720, 85768, 129513, 511172, 387654, 230008, 301261, 222451, 217992, 689048, 202723, 392823, 469552, 146063, 80663, 153274, 365133, 87764, 203623, -367831, 177350, 411942, 296414, 17600, -30288, 374479, 364849, 389579, 382384, 301844, 202311, 319617]
17308C19617r2667j12447K57037O8310j21312N947p5299K86139j96915B2817K07638
17297B30455J75259j29223C294O07297A61467O2089C9598J96445J21588r4614
17287B63017L65275B89472J20258j91249E620M58214j03363p5632k4961K46524
17277E06402j05005A65023O1041J4537L03478A86523L25437n1999j38201L2164
17267C53924L07059A89446K3051J01043J6606L6768k9008j54003K32357j57851
17257B58409j08131K72370B09336K96850A52226n6650J45199Q5287l4841M9647
17247C40868J7962J28403A14471l0260J65876j0318c5858C66474J13445j64491
17237C15428J72199k2792k22432J80218J2986J16397j36162q112j53163K86779
$$ y = [319617, 226950, 114503, 371540, 439850, 318538, 324485, 249186, 535325, 338410, 22817, 230455, 405714, 276491, 3294, 610591, 161467, 223556, 39598, 236043, 357631, 263017, 628292, 289472, 409730, 218481, 5620, 463834, 360471, 284839, 259878, 506402, 401397, 165023, 226064, 240601, 544079, 186523, 511960, 459961, 321760, 353924, 660983, 189446, 212497, 313540, 330146, 366914, 337906, 183903, 416260, 258409, 150278, 422648, 209336, 506186, 152226, 95576, 240775, 326062, 291221, 340868, 358830, 487233, 114471, 84211, 250087, 239769, -35858, 366474, 479919, 315428, 487627, 464835, 242403, 422621, 435607, 552004, 415842, 407730, 254567, 541346]
17227E41346k04343D7757J17456M75165j35502A30915J68326J07228n8402j9106
17217C28961k4404L6223J86221P3674B25859E2949J70483K68097r0763p5898J26298
17206D51166A79772R8298K72383a31246C36389J19602J49684k77638P1464j01091
17196B98410K04356b0295B34041k8686K42956r6679N7381j30409b0767C39836
17185C52490A64702J60764L12172k73076L39482B79901J53716o8690p8205J03624
17175C90346J35776J45881B03406L56961o2408A93421D3295K13656K77407j96528
17165C37830L87319n8747L8941H7195K67067K40914q1542J52500n7786J09376
17155G17724C34987N31081l44916j15929J11083K82404q77k62829J07392j74188
$$ y = [541346, 337003, 47757, 165213, 640378, 504876, 130915, 299241, 406469, 348067, 328961, 304557, 340780, 527001, 600675, 225859, 52949, 223432, 491529, 400766, 324868, 451166, 179772, 278070, 550453, -131246, 336389, 455991, 605675, 328037, 399501, 298410, 502766, -20295, 234041, 205355, 448311, 351632, 409013, 278604, -20767, 339836, 352490, 164702, 325466, 637638, 364562, 704044, 279901, 433617, 364927, 286722, 390346, 526122, 672003, 203406, 560367, 497959, 193421, 43295, 256951, 534358, 337830, 725149, 666402, 705343, 87195, 354262, 595176, 513634, 666134, 608348, 717724, 334987, 866068, 521152, 405223, 516306, 798710, 797833, 535004, 642396, 468208]
17145D68208D9090L91200M4075j57082K66774j65012p0054j5956O22783D79225
17134D50347l3619K63141L9054k03058J82310j56909O1497k63934L37369r2182
17124E84016L42188m03258K20509l50843K40506J2666K94310m46079P59024D65423
17113G40687k89673q3564J54912J08454J67673j9424C36629K47785n8775J04272
17103F29911M1604C05445N63752p2821L615l38982L33883j29011k3660K9063m2386
17092F28898j25041K29601k94308J94398J61797l59332A41501O37476K10312j68305
17082H20984l3459j10897N3323J10731k43852J58480m7620J56249L8176k9562
17072H72553J28157D87364K98059r8121K49491k37884J36813j21070k1285K54317
$$ y = [468208, 49090, 440290, 484365, 327283, 594057, 429045, 358991, 343035, 965818, 479225, 450347, 416728, 679869, 718923, 515865, 698175, 541266, 602763, 338829, 676198, 584016, 926204, 522946, 743455, 392612, 633118, 645784, 940094, 494015, 1253039, 465423, 740687, 451014, 367450, 522362, 630816, 798489, 779065, 336629, 584414, 525639, 629911, 671515, 305445, 869197, 796376, 799991, 461009, 794892, 665881, 642221, 671284, 628898, 503857, 733458, 439150, 633548, 795345, 436013, 141501, 778977, 989289, 820984, 787525, 676628, 729951, 840682, 596830, 755310, 707690, 863939, 902115, 872553, 1000710, 487364, 785423, 687302, 936793, 698909, 835722, 714652, 693367, 947684]
17062I47684j34312q5099L95457m08555j56567J63801O1000j24945M88359l32913
17052H13910n0504J99701J4160o2624o1978M51353k98403N2522j26379O1141j51558
17041H41341K81395r7060k60281L17385o9264m44O54R3099k65138L92027J0595
17030A244309j81989K89534n58648P15831n76236L3374J84584J43382r3490k45857
17020I54794r4805J62802m0881n5199L08593J1286j19451L7354J59308j92651
17010A131150J9067k758J98691J63468l12845k462N11670l71642r1322n72K5141
16999A267586K2547M9484N3681k03106K97933k12813o7980J85712q7557J90955
16989A496442j80159j9646J79664p9745J0544M36759m27392m70355N96142k19405
$$ y = [947684, 813372, 728273, 1123730, 715175, 558608, 722409, 783409, 658464, 1146823, 813910, 763406, 963107, 977267, 914643, 852665, 1304018, 1005615, 1058137, 931758, 992899, 841341, 1122736, 1025676, 765395, 1082780, 1013516, 1013072, 1013726, 1106825, 841687, 1233714, 1244309, 1062320, 1351854, 793206, 1509037, 932801, 966175, 1150759, 1294141, 1200651, 954794, 859989, 1022791, 981910, 926711, 1235304, 1246590, 1127139, 1164493, 1323801, 1131150, 1150217, 1147459, 1346150, 1509618, 1196773, 1194311, 1705981, 1334339, 1243017, 1242445, 1267586, 1290133, 1339617, 1393298, 1190192, 1488125, 1275312, 1207332, 1393044, 1305487, 1496442, 1316283, 1296637, 1476301, 1396556, 1407100, 1843859, 1416467, 946112, 1542254, 1322849]
16979A322849K02238k7184J36198M7549l53796J17765L39071k22207K3053k02081
16969A383455L41454K3001j41018k39547L34405J0117j66739K94891p0650j3929
16959A755440K1561K71616k0009k19717K08520L2304l85932J67396K03486k11924
16949A822741K73599P2438k07538K70048n7073r4626j44209L92382j24259O4272
16939B267775o5942J1586P0873j03363J07337J40796n5128k76316L07976l70366
16929B035228K17744N04141l78548j0201K51106j56318K49772j54687J06448j61637
16919B503048K44232K22965k77019J57003n12887O59527J02605l81160R7519o5066
16909B750767J77323K20292l41987M43158J33187l91199L59458J73264k32637
$$ y = [1322849, 1525087, 1497903, 1634101, 1681650, 1327854, 1445619, 1784690, 1562483, 1585536, 1383455, 1724909, 1747910, 1606892, 1367345, 1701750, 1711867, 1545128, 1840019, 1769369, 1755440, 1777001, 2048617, 2028608, 1808891, 2017411, 2049715, 1663783, 1831179, 2034665, 1822741, 2096340, 2168778, 1961240, 2231288, 2174215, 2079589, 1935380, 2327762, 2203503, 2267775, 2201833, 2213419, 2284292, 2180929, 2288266, 2429062, 2373934, 2097618, 2405594, 2035228, 2252972, 2757113, 2378565, 2368364, 2619470, 2463152, 2712924, 2558237, 2664685, 2503048, 2747280, 2970245, 2693226, 2850229, 2337342, 2996869, 3099474, 2718314, 2815833, 2750767, 2928090, 3148382, 2806395, 3249553, 3382740, 2991541, 3350999, 3524263, 3291626]
16900C291626J8265l49758L70123M86798p13625O09588j15274J62950j02530K3301
16890C681464M06430k41557m2360j79581N27792j44727J10504j96928k44980K72988
16880C949045K86335J2961L68653j20445K23587l28726K49628j4068K08028k84127
16870D550871O70449r7471q6525l5215j98194L00845K03840j74784K87066K6938
16860E447820m7130L85497R325L3736k49700J16990K85354J37059K98928j29608
16850F288271N8851J23344Q574K83759j5504L07331r2998L0513J85258J88977
16840G366376m3257K95179k5323J51492K88546L45112l2240J12054J68322k28788
16830H397473M77056o4432L97278M3535J0608N11433J98490K67740j78348M41579
$$ y = [3291626, 3309891, 2960133, 3330256, 3817054, 3103429, 3713017, 3597743, 3760693, 3658163, 3681464, 4087894, 3846337, 3803977, 3624396, 4152188, 4007461, 4117965, 3921037, 3676057, 3949045, 4235380, 4248341, 4616994, 4496549, 4720136, 4391410, 4641038, 4626970, 4834998, 4550871, 5221320, 5123849, 5037324, 5002109, 4803915, 5104760, 5308600, 5133816, 5420882, 5447820, 5400690, 5786187, 5795512, 5829248, 5579548, 5696538, 5981892, 6118951, 6417879, 6288271, 6347122, 6470466, 6479040, 6762799, 6747295, 7054626, 6961628, 6992141, 7177399, 7366376, 7323119, 7618298, 7592975, 7744467, 8033013, 8378125, 8345885, 8457939, 8626261, 8397473, 8874529, 8810097, 9207375, 9250910, 9261518, 9772951, 9971441, 10239181, 10060833, 10502412]
16820A0502412L15900J11949L86110p7260M64230K13586j4977M94073j15455N36487
16810A2817055K64550J79050J94100K66880L67458L32849K3983O00667L95912
16801A5442504J98586M29711M43875P22732J69349M76979L31182K76137L26958
16792A8818013P55346M01939N78858M80381M39198O31376K39988Q28067Q08470
16783B3981636N01848M14361Q62263M37451Q24867O84834R06442Q74292J074929
16774C0562923O05007R43660P73845J251297J023886O44135J242941J335338J094142
16765C9477174J104244J469864J050837J298238J536568J379939J247082J808375
16757E0372321J349541J794435J627143J337512J941063K066239J632375J665969
$$ y = [10502412, 10818312, 10930261, 11316371, 11239111, 11703341, 11916927, 11901950, 12396023, 12280568, 12817055, 13081605, 13260655, 13454755, 13721635, 14089093, 14421942, 14445925, 15046592, 15442504, 15641090, 16070801, 16514676, 17237408, 17406757, 17883736, 18214918, 18491055, 18818013, 19573359, 19975298, 20554156, 21034537, 21473735, 22105111, 22345099, 23173166, 23981636, 24483484, 24897845, 25760108, 26197559, 27022426, 27707260, 28613702, 29487994, 30562923, 31167930, 32111590, 32885435, 34136732, 35160618, 35804753, 37047694, 38383032, 39477174, 40581418, 42051282, 43102119, 44400357, 45936925, 47316864, 48563946, 50372321, 51721862, 53516297, 55143440, 56480952, 58422015, 60488254, 62120629, 63786598]
16749F3786598J900615K011669K151331J717028K029926J754970K120640K329066
16741G9801843J912698J599941K111775J827976J732526J677960J594158J660776
16733I3919653J664420J008561J067551J154930N12627J011897M25675j77026
16725A00588288L50080n28622j69322k74281p45219q47263r18284j099741j617578
16716I4738058j154578j704009j673792j722768j982444j800599j837163k008542
16708H0854163k333449j955586j758781k206864j469446k292109k023593j867004
16700F4947331j974233j619633k048993j794193j626097j515746k016081j385332
16692E0967023j672248j498420j266363j459162j272634j314504j394090q60423
$$ y = [63786598, 65687213, 67698882, 69850213, 71567241, 73597167, 75352137, 77472777, 79801843, 81714541, 83314482, 85426257, 87254233, 88986759, 90664719, 92258877, 93919653, 95584073, 96592634, 97660185, 98815115, 99327742, 100339639, 100765314, 100588288, 100938368, 100409746, 100240424, 99966143, 99220924, 98373661, 97455377, 96355636, 94738058, 93583480, 91879471, 90205679, 88482911, 86500467, 84699868, 82862705, 80854163, 78520714, 76565128, 74806347, 72599483, 71130037, 68837928, 66814335, 64947331, 62973098, 61353465, 59304472, 57510279, 55884182, 54368436, 52352355, 50967023, 49294775, 47796355, 46529992, 45070830, 43798196, 42483692, 41089602, 40229179]
16684D0229179j534964j016649j179300r82767p91319j193953q14310q80749j085157
16675C0750011q60184o66201r05374j001101k65233j127017k45676r02068m97889
16666B4279268q05746m97259m21398m52866o31491p24109n07450m19516p07236
16657A9112197l83616l91198k34816o39972m48397j69004q7344o02032k98897
16648A5856921n35652l720k42824n93498R0948p02750l71945J03892n91667n17940
16638A2491765K37547m18385p41q2875m88393J44933p39853J31324k74544l52055
16628A0648723K15627p51327j32725m91855K26045j53546j09879j74693j51467
16619I124903l09710L53363n79008k12599R4974m9080l01953n79522M31246k72078
$$ y = [40229179, 38694215, 37677566, 36498266, 35515499, 34724180, 33530227, 32715917, 31835168, 30750011, 29889827, 29223626, 28318252, 27317151, 27051918, 25924901, 25679225, 24777157, 24279268, 23473522, 22976263, 22554865, 22101999, 21470508, 20746399, 20238949, 19819433, 19112197, 18728581, 18337383, 18102567, 17462595, 17014198, 16845194, 16757850, 16155818, 15856921, 15321269, 15317549, 15074725, 14481227, 14572175, 13869425, 13497480, 13601372, 13009705, 12491765, 12729312, 12310927, 12310186, 12227311, 11738918, 11883851, 11143998, 11275322, 11000778, 10648723, 10864350, 10113023, 9980298, 9488443, 9714488, 9560942, 9451063, 9276370, 9124903, 8815193, 9168556, 8589548, 8376949, 8471923, 8422843, 8120890, 7541368, 7972614, 7700536]
16609G700536p0088K90188k99604k35746j63500l28186N03957m39282k46253j17095
16599F594927n6872j79738m1995L2812o3397j5391j3583j42082m52415l3190J23815
16588E752891L26090l95195j05362j51279Q7185n0770j2329k06076n83k54001
16578D990571K34964j59140n3932j02993Q0805j42215j51612j71682k0595M2052
16568D546223k79940K99752J09986l71884L04223j34895k29755J07669k90849
16559D060530j63765J43833M5287k18310K4269O8861k28523K11486j34669q1433
16549C727566k3654p7531k09020J51322k34719K79222m3110j75181j38338J02073
16539C358630k23807j0035Q8320k4681K8100o8758N4494O395p983j8803N9174
$$ y = [7700536, 7630448, 7920636, 7621032, 7385286, 7221786, 6893600, 7397557, 6958275, 6712022, 6594927, 6538055, 6358317, 6316322, 6349134, 6285737, 6270346, 6256763, 6114681, 5662266, 5629076, 5752891, 6078981, 5683786, 5578424, 5427145, 5514330, 5463560, 5451231, 5245155, 5244572, 4990571, 5225535, 5066395, 5012463, 4909470, 4990275, 4848060, 4696448, 4524766, 4504171, 4546223, 4266283, 4566035, 4676021, 4304137, 4608360, 4473465, 4243710, 4351379, 4060530, 3896765, 4040598, 4085885, 3867575, 3891844, 3960705, 3732182, 3943668, 3808999, 3727566, 3703912, 3626381, 3417361, 3568683, 3333964, 3613186, 3570076, 3394895, 3256557, 3358630, 3134823, 3124788, 3213108, 3188427, 3216527, 3147769, 3202263, 3208658, 3200675, 3181872, 3241046]
16528C241046j93569k32085J80032l25811L39277M73106n88091k31939J28148
16519B790114j47537O0802R9091j75303N5712j92071Q5661q1426O6636j72412
16509B389267L1292J70161j90144p0910J3471L83884l79272k6563R3474O1449
16499B476109j01542K99711l39421j29741K67487l4233m6869k19345J5183l12923
16489A874416J06298L43472j00512m7207J73162j85683K5981j84655J55804j19991
16479B041085J14662l24001J07764K06474q3225K9211N536j11863l51879K58839
16469A892603K66680j48581l2457j55077J34959k25017J27261k34492J10599k40607
16459A495871L36364k41712K24611m34425M76352j28027k58725O3542k29929K18280
$$ y = [3241046, 3047477, 2815392, 2995424, 2669613, 3008890, 3481996, 2893905, 2661966, 2790114, 2642577, 2703379, 2802470, 2627167, 2682879, 2490808, 2576469, 2495043, 2561679, 2389267, 2420559, 2590720, 2400576, 2329666, 2343137, 2727021, 2347749, 2321186, 2414660, 2476109, 2374567, 2674278, 2334857, 2205116, 2472603, 2438370, 2391501, 2172156, 2187339, 1874416, 1980714, 2324186, 2223674, 2176467, 2349629, 2163946, 2189927, 2005272, 2161076, 2041085, 2155747, 1831746, 1939510, 2145984, 2062759, 2091970, 2097506, 1985643, 1633764, 1892603, 2159283, 2010702, 1978245, 1823168, 1958127, 1733110, 1860371, 1625879, 1736478, 1495871, 1832235, 1590523, 1815134, 1380709, 1857061, 1729034, 1470309, 1533851, 1303922, 1522202]
16449A522202L54989n8858k09853q7547J49599K61776m8334l23311j94459R2110
16439A458314K55480j3028m63945J47872J18601O5526P350J24094l64868J60057
16429A495453J20813k04707K50101l98662J26507j30497Q1099K86066k14392N1724
16419A463505j64124o8802k10709K65757K09174l04608K32985n8260j07450j70953
16409A086515L43300M6852j84373L0399R1619k72918K36307R3860j29331o3733
16399A278497k6833K36058J29334l76497J34301m2828o5045J82078k21653p950
16389A219462J38640k30862J400K21498j86675J06712l13623J40501J66536k44964
16379A018625m7544J09805J78229k82402K09949r696k05030K55838j30033K38664
$$ y = [1522202, 1877191, 1818333, 1608480, 1520933, 1670532, 1932308, 1883974, 1560663, 1366204, 1458314, 1713794, 1700766, 1236821, 1384693, 1503294, 1568820, 1576170, 1700264, 1335396, 1495453, 1616266, 1411559, 1661660, 1262998, 1389505, 1259008, 1340107, 1626173, 1411781, 1463505, 1299381, 1230579, 1019870, 1285627, 1494801, 1190193, 1423178, 1364918, 1257468, 1086515, 1429815, 1476667, 1292294, 1322693, 1414312, 1141394, 1377701, 1471561, 1342230, 1278497, 1251664, 1487722, 1617056, 1240559, 1374860, 1332032, 1266987, 1449065, 1227412, 1219462, 1358102, 1127240, 1128640, 1350138, 1163463, 1270175, 956552, 1097053, 1263589, 1018625, 971081, 1080886, 1259115, 976713, 1186662, 1176966, 971936, 1227774, 1097741, 1336405]
16369A336405o16152M22864l05869J52872P9060n3421k59460N47424j1678l84333
16359I07712j47350J37087N55962l62809j09114k00320M01981n79671L46631J03820
16349A053929j34796N18456D93053N79028J35216J38804l54849m0342p8444L94528
16339A266994l96059J35113p8562l20174K79347L64758k02030m13741N42202j81766
16329I96082J57237j99539j66917P8197P8424K83257l66100k65262J54599J83714
16319I33692R4493n04627m5986L05254K83967m58224M93321k58622p9151L1464
16309G95581P2280k79050N11863m13289n1351K62072J56837l72887k87444P08848
16299A103460l00275j28961R7277L81j29214k2047j4031J89293k86579O3034K29029
$$ y = [1336405, 720253, 1143117, 837248, 990120, 1069180, 1015759, 756299, 1303723, 1292045, 907712, 760362, 897449, 1453411, 1090602, 981488, 781168, 1183149, 603478, 950109, 1053929, 919133, 1437589, 493053, 1072081, 1207297, 1346101, 991252, 950910, 872466, 1266994, 870935, 1006048, 927486, 607312, 886659, 1251417, 1049387, 635646, 1177848, 996082, 1153319, 953780, 786863, 865060, 943484, 1226741, 860641, 595379, 749978, 933692, 1028185, 523558, 477572, 782826, 1066793, 608569, 1101890, 843268, 764117, 795581, 867861, 588811, 1100674, 687385, 636034, 898106, 1054943, 682056, 394612, 1103460, 803185, 674224, 771501, 771882, 642668, 620621, 606590, 795883, 509304, 572338, 801367]
16288H01367J50661C50692K46645j9933J79465P1193j33530j80161J97033C03658
16277D56728K30378O5800l53621L32199J47099j98928J28301D03681M90977r2583
16267H02075k40840R868j20962P29K03659J72848m1932p5468j95666J33258j39352
16256E08217K55918k2102k20377K32893j06954j71590J68083P5955J49228j83170
16246F86101J69192k94288j88693J65231J33484k79357K18740j20638K49202k90629
16236D48345J06432j38623M8009K1208j55469K36399k1919L0017A90072M83239
16226F73311j74929k7761K05876l32403J76807J71301C39483J722J322J80516
16216E23043k2943A93209N2861J42572o9909L01771k8174B89461J15790P5750
$$ y = [801367, 952028, 350692, 597337, 577404, 756869, 828062, 694532, 514371, 711404, 303658, 456728, 687106, 752906, 399285, 731484, 878583, 679655, 807956, 403681, 894658, 802075, 561235, 571103, 450141, 450870, 654529, 827377, 785445, 709977, 514311, 647569, 508217, 764135, 742033, 521656, 754549, 647595, 476005, 644088, 720043, 869271, 686101, 855293, 561005, 372312, 537543, 671027, 391670, 610410, 489772, 738974, 448345, 554777, 416154, 464163, 485371, 329902, 566301, 544382, 574399, 190072, 673311, 498382, 470621, 676497, 344094, 520901, 692202, 339483, 341205, 342527, 523043, 500100, 193209, 246070, 388642, 318733, 620504, 592330, 289461, 405251, 481001]
16206D81001P7465J8236o6008o8456j71831R5722m6780J5114K67856j94283l6919
16195C71117Q4595r4059O1870j66091J87939L5202P0462p1764B34285K40519j46188
16184C28616R8192k1174J20830M850c0238A99032J7348m9034K71978K1967A83195
16172D20671j27257K40349A80730N942L10587k41527R9324J25799j62535L55414
16162F73734B13774E1645J3969K23964M9697J77526B35943J27751L36542l23778
16152C76458q8998J07975A88874M41327l05783N6614A77742K28893q0332j21674
16142B04629K26598K05240A38816K25157C8752b9141G52157B47224o5752J52821
16132C34293J43205j62301I1769N84n068R8120L84276k63635P0727R8080r6821
$$ y = [481001, 558466, 576702, 510694, 442238, 270407, 366129, 319349, 334463, 602319, 408036, 371117, 455712, 361653, 423523, 257432, 445371, 480573, 551035, 479271, 234285, 474804, 328616, 426808, 405634, 526464, 531314, -30238, 199032, 216380, 167346, 439324, 461291, 183195, 420671, 293414, 533763, 180730, 186672, 497259, 255732, 355056, 480855, 318320, 673734, 213774, 51645, 65614, 289578, 339275, 516801, 235943, 363694, 700236, 376458, 287460, 395435, 188874, 630201, 324418, 381032, 177742, 406635, 326303, 204629, 431227, 636467, 138816, 363973, 38752, -29141, 752157, 247224, 181472, 334293, 477498, 315197, 91769, 92353, 87285, 185405, 569681, 306046, 376773, 474853, 378032]
16121C78032A45721j9951K56068J27982b37295B92200J1111K91277k74466j54105
16111A66017J96504p8066E5421M0434M56829B67920J41590A89650K66955j94053
16101B62552k8166J22687J60765G6596i246E65913A6237L96763e0056B68922q690
16090B60232D1263O30258B15337L9683q4984J89001j50374N4331K62692k39421
16080B86265p6997E9662K83360b50381D54501A24379J61774A12616g3316o0916
16070a34232C30301C6782N5947J12959k8895K85921j21185i2579A48193K99813
16060D48006A31063n5585L04928A81133j7637D6309L75332a08588A83655I063
16049B20511J78273L0225H7057l4109A4839J99452k206B493K10141r5357g4659
$$ y = [378032, 145721, 125770, 381838, 509820, -237295, 292200, 303311, 594588, 320122, 166017, 362521, 284455, 55421, 95855, 552684, 267920, 409510, 189650, 456605, 262552, 234386, 357073, 517838, 76596, -9246, 565913, 16237, 413000, -50056, 268922, 260232, 41263, 671521, 215337, 255020, 170036, 359037, 208663, 262994, 525686, 286265, 209268, 59662, 343022, -250381, 454501, 124379, 286153, 112616, -73316, -134232, 330301, 36782, 92729, 205688, 176793, 462714, 341529, -92579, 148193, 448006, 131063, 75478, 380406, 181133, 163496, 46309, 421641, -108588, 183655, 9063, 220511, 398784, 429009, 87057, 52948, 14839, 214291, 212085, 2493, 212634, 117277, -74659]
16037C45437o3838l1967K93572G3738K8265K63015A7426E267i1745A59117J20050
16026B79167K23572A82541I0544O9047K0831k1330o5528f208B61319l7225l9039
16015A85055q6608K29210A63269K4179h1032A27044J8442L5638l6329r294m4758
16004I0743J35159G3117B5728a62238C39633o3406D188M1423b39830A94678D2464
15992A07530L7535K02959E4427K09832J94395J89745N22633m73644J9251M398
15982G21037j33523D3359K20443A28508J69921F5806K26312j41311a24192C8796
15971H4812a24338j00639K7231j55244F0604B7902M38021g4655B30652j1755J5991
15960B34888h9179l2998G4292B6984J17462m9438H34J7611K29344R707E3789a87510
$$ y = [345437, 281599, 249632, 543204, 73738, 102003, 365018, 17426, 5267, -91745, 159117, 279167, 502739, 182541, 90544, 159591, 180422, 159092, 93564, -6208, 261319, 224094, 185055, 98447, 327657, 163269, 187448, -81032, 127044, 145486, 181124, 144795, 135501, 90743, 225902, 73117, 25728, -162238, 339633, 276227, 4188, 45611, -239830, 194678, 42464, 107530, 145065, 348024, 54427, 264259, 458654, 648399, 1171032, 697388, 716639, 721037, 587514, 43359, 263802, 128508, 298429, 65806, 292118, 150807, -124192, 38796, 84812, -124338, -224977, -197746, -352990, 60604, 27902, 465923, -74655, 230652, 218897, 234888, -89179, -122177, 74292, 26984, 144446, 95008, 834, 18445, 247789, 257496, 53789, -187510]
15947g0472A23572J12385i4658I8269N3685l786b39422B98941c68590C25621A07084
15935A22098a80197j09337h3731A9206a68407B71804q6194J93672j39592P8347
15925C18037A44217o661l5493b58353B14439h1120D39983A1633l277g1602D1296
15913a34741j06733B8044K917L1462a60329B95540b904B1638m352f6097k6386
15902i2483B70444q6540f6671I5873m5129a9002A81772D6315J34010l2101f9040
15890B65818d7448K514A07760b17757B77761e3500j51997M962F4672J73072j09744
15879A28000c2722j74668A51750a01667o9414L3421d5931H3060d9695l40991d0128
15867A42P5541R560c244B5550b265A63471K7812b47446A78256M2955J15458a38074
$$ y = [-70472, 123572, 235957, -94658, 98269, 151954, 148168, -239422, 298941, -368590, 325621, 107084, 122098, -180197, -289534, -83731, 19206, -168407, 271804, 185610, 379282, 239690, 318037, 144217, 137556, 102063, -258353, 214439, -81120, 439983, 11633, 8356, -71602, 41296, -134741, -241474, 28044, 30961, 62423, -160329, 295540, -2904, 21638, 17286, -66097, -92483, 270444, 183904, -66671, 95873, 50744, -19002, 181772, 46315, 180325, 148224, -69040, 265818, -47448, -44934, 107760, -217757, 277761, -53500, -205497, -200535, 64672, 237744, 128000, -32722, -207390, 151750, -101667, -171081, -137660, -45931, 83060, -49695, -390686, -40128, 142, 75683, 85243, -3244, 25550, -2265, 163471, 191283, -247446, 178256, 221211, 336669, -138074]
15854i3531F3044J20148o9336a13620n0908A67009D2203J0973J03271G6919l7314
15843C9605a0424A95238p6844e7578F4948C1252a87435k58770e152B42580a8165
15831a03119j32111E0724g9861B3554a14598j67237O4244i1401D4232a24632j38759
15820b63391A66122D1747a42817r5728d6534j95703C95705b46092A28304a2487
15809B22733b54346J03502c0540A02917N8431b68109d5547A99141C4500b27672
15798A34550F1386M99802A30290J761J95450i1073H7847K26713c6580F1063M8484
15787A09547b23660C23429a40219A25955l8256Q1983b36510A8410h548B0726d8181
15775e5382a6598C02652a11129j02843d6224j7463n4721I7042a05381B72786A15079
$$ y = [-93531, 63044, 183192, 113856, -113620, -164528, 167009, 42203, 53176, 156447, 76919, 39605, -10424, 195238, 118394, -57578, 64948, 31252, -187435, -446205, -5152, 242580, -18165, -103119, -235230, 50724, -79861, 23554, -114598, -281835, -217591, -91401, 44232, -124632, -263391, 166122, 41747, -142817, -238545, -46534, -242237, 395705, -246092, 128304, -12487, 222733, -254346, -150844, -30540, 102917, 161348, -268109, -45547, 199141, 34500, -227672, 134550, 61386, 561188, 130290, 132051, 327501, -91073, 87847, 314560, -36580, 61063, 109547, -223660, 323429, -140219, 125955, 87699, 169682, -236510, 18410, -8548, 20726, -48181, -55382, -16598, 302652, -111129, -213972, -46224, -63687, -118408, 97042, -105381, 272786, 115079]
15763A75670C4524N5785i7775j75045J20943c0562j1671D0961q118K89234a67239
15751A38459k8214b3768r1055E5207c4077A65811o8935J7019K99425A39368m0707
15740I8661a95975A59186a40122B26682b2272l69472B16225a69836A66486H405
15729b80136g8897A86075a62497O19n8707I7641g1633b2012F3514g8086e12C73830
15716G5516b40601r2489J60015A19708e4159I065a60222N0780B65618a99356b0865
15704A98130a60676A37683a18773m9730B4658J79608A3043J99511q4432J0752
15694A38874J04535O3461E0597b48274E0974J91875b10899f199n17936A8104J94672
15683B12776c27938j61228a57943A23471M6485a18464q3730c0758r3953M0274
$$ y = [175670, 34524, 90309, -97775, -272820, -151877, -30562, -42233, 40961, 32843, 322077, -167239, 138459, 110245, -23768, -114823, 55207, -34077, 165811, 96876, 113895, 413320, 139368, 98661, -195975, 159186, -140122, 226682, -22272, -391744, 216225, -169836, 166486, 8405, -280136, -78897, 186075, -162497, -161878, -220585, 97641, -71633, -22012, 63514, -78086, -512, 373830, 75516, -240601, -333090, -173075, 119708, -54159, 9065, -160222, -109442, 265618, -199356, -20865, 198130, -160676, 137683, -118773, -168503, 24658, 204266, 13043, 212554, 128122, 138874, 243409, 306870, 50597, -248274, 50974, 242849, -210899, -6199, -524135, 18104, 212776, -327938, -489166, -157943, 123471, 169956, -118464, -202194, -30758, -124711, -84437]
15673h4437c4796D83800B5655K38508i8634L2013m5666j90880a13704C04404e3912
15661C27649b49779M7280f0540m7446a0129B731P1746b48938A13827i25B35666
15649H5507b3414p0722M22l3294O0144a9927j79969f0877G6676A3547L18143A21842
15636h2452L0397k09581J14386I8916a45532b1172B12403h7795j5903E072e7449
15624b69129c8535G4691A0372N491c5881n8638k69386J08221F7611c13090E1379
15612b38643F5659b23261k20917C3248K6998a34031A32147b2086A14154h0471
15601c9648B3148e6495B79023C9734F506a05380A40302e4297A83152M8536b04322
15589b19955B71865g1706A7039d7644a5441l27356a8053j8489j54654p1827B20056
$$ y = [-84437, -34796, 483800, 25655, 264163, -98634, -66621, -112287, -303167, -113704, 304404, -53912, 327649, -249779, -202499, -60540, -107986, -10129, 2731, 74477, -248938, 113827, -925, 235666, 85507, -23414, -94136, -93714, -127008, -66864, -19927, -199896, -60877, 76676, 13547, 331690, 121842, -82452, -52055, -261636, -147250, 98916, -145532, -21172, 212403, -87795, -103698, 5072, -57449, -269129, -38535, 74691, 10372, 15863, -35881, -94519, -363905, -255684, 67611, -313090, 51379, -238643, 65659, -223261, -444178, 33248, 60246, -134031, 132147, -22086, 114154, -80471, -39648, 23148, -56495, 279023, 39734, 6506, -105380, 140302, -54297, 183152, 231688, -204322, -219955, 271865, -71706, 17039, -47644, -15441, -342797, -18053, -36542, -191196, -263023, 220056]
15577A79812J08727c5672r42a0526D7691K32232c48058j3273A08043d2307A97747
15565c0889q3801B96591d1515B02582A7621M6812J91508a79728H0459A8269a01806
15553b00347e1372A89856K57590a40953C04756I8153B8120K34214F6970e06715
15542A61102F2036o27L3949K41698E6111J33241J68017j07143j10519a91022B60907
15530E7306d1177k36850d2990A8148F261K35894A8172c55349B65893M451n7154
15519B13190f0379D85505k23571j30316L1489A4175J10680L7079J4600c5417D07205
15507a7497F0451J085J90257a18456C11843d4387A98960I8936m0510J11429a77735
15495A90637q831N9509K2901j16023E3044a46791a37l6344j61618o6520a15555
$$ y = [179812, 288539, -35672, -36614, -10526, 47691, 279923, -348058, -361331, 108043, -42307, 197747, -30889, -114690, 296591, -41515, 202582, 17621, 64433, 255941, -179728, 80459, 18269, -101806, -200347, -51372, 189856, 447446, -140953, 304756, 98153, 28120, 262334, 66970, -506715, 161102, 62036, 61409, 95358, 337056, 56111, 189352, 357369, 250226, 139707, -191022, 260907, 57306, -41177, -278027, -42990, 18148, 6261, 242155, 18172, -355349, 265893, 270344, 213190, -60379, 485505, 261934, 131618, 163107, 14175, 124855, 161934, 176534, -35417, 407205, -17497, 60451, 61536, 251793, -118456, 311843, -44387, 198960, 98936, 58426, 169855, -177735, 190637, 181806, 241315, 264216, 148193, 53044, -146791, -137, -36481, -198099, -264619, -115555]
15483f6099o9237A97428I1149c0188B77795H0168K15210M1214E023M20593j40867
15472B84749D0973b08811G3467J21497L7799c79636C00262d1929D8290K31404
15462B79694a0723r8235G4285K3338K95369a46483H6755j9423l0172O7224a78174
15450C17089f4226p6424B6536g817B90596a9802A18868M02716K98644l35964k21243
15439B63021n6563H0193J94595a50674j6986A15056L2521b16873a06102M7491
15429e8611B041a09871a5531o5832A81932l1306a57796e4144b2156A61572G6685
15417A64958e5009D2181J14244a66616b6967k00925f7156i567n2769F2826c8556
15405a15450F5228J4463K22814l1741a40137E1259F667J40480L3161b68014A65917
$$ y = [-66099, -135336, 197428, 91149, -30188, 277795, 80168, 295378, 336592, 5023, 425616, 284749, 40973, -208811, 73467, 194964, 232763, -379636, 300262, -41929, 48290, 279694, -10723, -108958, 74285, 97623, 392992, -146483, 86755, 67332, 37160, 104384, -178174, 317089, -64226, -140650, 26536, -7817, 290596, -19802, 118868, 521584, 820228, 484264, 263021, 206458, 80193, 274788, -150674, -167660, 115056, 147577, -216873, -106102, -58611, 2041, -109871, -15531, -81363, 181932, 150626, -157796, -54144, -22156, 161572, 76685, 164958, -55009, 42181, 156425, -166616, -26967, -227892, -67156, -9567, -62336, 62826, -38556, -115450, 65228, 79691, 302505, 270764, -140137, 51259, 6667, 147147, 180308, -268014, 165917]
15393a54810F1510c181o3123p0036B7384a08532C71171I9228b80293d3801F8013
15381B0401c3299l3853A21568b13297i3928a6374A46058c04114J51254B30490
15370F0148K6780E871J63725E7772A9544c63005a01828A61355J72412A54203b41953
15358d815G7322g8875B04705J27849A00487J64246A04922K99599i942B33252E5960
15346C2024J85392E1634J10700k06O7262H4393J73350J38791A89527G2407a64706
15334f8524A3034K01835R7083a01606l5810A44200O1861j02280b71776B62368
15323G3055k6793M3866D979g2468B42568c04141D56353C489L18893j13899a8498
15311G3546J76083C658c0433A02482J44566g683C30947q7544c04405f2383C32515
$$ y = [-154810, 61510, -3181, -66304, -136340, 27384, -108532, 371171, 99228, -280293, -43801, 68013, 20401, -33299, -67152, 121568, -213297, -93928, -16374, 146058, -304114, -152860, 230490, 60148, 86928, 5871, 169596, 57772, 19544, -363005, -101828, 161355, 333767, 154203, -241953, -4815, 77322, -78875, 204705, 332554, 100487, 264733, 104922, 404521, -9942, 233252, 55960, 32024, 217416, 51634, 162334, 162128, 229390, 84393, 257743, 396534, 189527, 72407, -164706, -68524, 13034, 214869, 311952, -101606, -137416, 144200, 206061, 103781, -271776, 262368, 73055, 46262, 90128, 4979, -72468, 242568, -304141, 456353, 3489, 322382, 208483, -18498, 73546, 249629, 3658, -30433, 102482, 247048, -7683, 330947, 243403, -304405, -62383, 332515]
15299a63194e6009I6512J27756f9040C48191H0164L94632E3636K63556A24050
15288C9625a84711B78854b80131c7144A9118b79557c9396j20440A97295a68902
15277h6280A98017a24530A72063p4254K1070c9887A2254Q0675j1172a074E680
15265f0741r8117D9186M7390d7339B83630N0651A19031J97724a69831d8220A8037
15253C59853F5086L0565j3389l4021L56859j53693L10775P04238k89414j05288
15243H71718M57325E95627k36345G7980a465p3968n1651d921A49519k0763L0617
15232A59373M50423d9381A21237h5324C9658b05819d7071k10729h8328A16054
15221B0954K12146A04449b62530g9476a2000B26970K9627A7382a79443h0211B74272
$$ y = [-163194, -56009, 96512, 224268, -69040, 348191, 80164, 474796, 53636, 317192, 124050, 39625, -184711, 278854, -280131, -37144, 19118, -279557, -39396, -159836, 197295, -168902, -86280, 198017, -124530, 172063, 97809, 118879, -39887, 12254, 92929, 81757, -1074, 5680, -60741, -158858, 49186, 96576, -47339, 283630, 334281, 119031, 316755, -169831, -48220, 18037, 359853, 65086, 95651, 82262, 48241, 405100, 251407, 562182, 1266420, 977006, 871718, 1329043, 595627, 359282, 77980, -1465, -75433, -127084, -4921, 149519, 128756, 159373, 609796, -49381, 121237, -85324, 39658, -205819, -47071, -257800, -88328, 116054, 20954, 233100, 104449, -262530, -79476, -12000, 226970, 256597, 17382, -179443, -80211, 274272]
15209c6231A11647M7173o0743C7516J42712h9020G9403A6805R7824a89690A60990
15197F5856i6046B75593K16760A49649Q7524M2114j25124f2946b3278N527A01555
15185E4469d3990M470r842H5785K80139I7495B9482a58449b4617j50718A20273
15173A06492g322B12428f2198q1190b8610j70760A40502J14579k9564h6723c3098
15161I1191a78223E3995N8869Q5251b04254f5993l2587D4452K83236a45459d2881
15149A38732a8426f042E6514J10944l8527K4269c0871b200k600k09965H4853b5859
15136G366a34883j23189E1186L09925m8017A07944R2717d13066D7647O3634m2550
15125F8731J85817J0380q0443a45092A14622K29610M7321G9003J26351R5723q1625
$$ y = [-36231, 111647, 158820, 98077, 37516, 180228, -89020, 79403, 16805, 114629, -189690, 160990, 65856, -96046, 275593, 492353, 149649, 237173, 279287, 154163, -62946, -23278, -17751, 101555, 54469, -43990, -39520, -49362, 85785, 365924, 97495, 29482, -158449, -24617, -175335, 120273, 106492, -7322, 212428, -62198, -143388, -28610, -199370, 140502, 255081, 225517, -86723, -33098, 91191, -178223, 53995, 112864, 198115, -204254, -65993, -98580, 44452, 327688, -145459, -42881, 138732, -18426, -6042, 56514, 167458, 128931, 153200, -30871, -2200, -4800, -214765, 84853, -25859, 7366, -134883, -258072, 51186, 361111, 313094, 107944, 200661, -413066, 47647, 111281, 68731, 254548, 264928, 184485, -145092, 114622, 344232, 391553, 79003, 205354, 301077, 219452]
15114B19452C7922J88404p7390a68783J0179B96762b07799A28547L49892I205
15103C65159j57803c8633C99472r8803k3996c8521A84700p3805k2260J26459B8733
15091B79678n2420a07123A67193l7451J35248J0661b81097e5529A57235Q9262
15081B46497a2634B91788c8552k302B07828R2132j27275b3183j11221B3160M2622
15070F5782J82855d7426B5001K65475c4630B32179N2769p227a19461A43116a33301
15058A31985k8043c8296C04644J23021H5728j9691a2167B70810A00130N09225
15048F09355A38924M1790K59770J54951j82169J45796i958C39861A16711J57899
15038B74610R9514r2754j35730Q8413M7447p3049J4813Q6319J2625q0829q2460
$$ y = [219452, 37922, 226326, 148936, -168783, -158604, 296762, -207799, 128547, 478439, 9205, 365159, 207356, -38633, 399472, 300669, 276673, -38521, 184700, 110895, 88635, 215094, 28733, 279678, 227258, -107123, 167193, 129742, 264990, 275651, -281097, -55529, 157235, 246497, -12634, 291788, -38552, -40854, 207828, 299960, 172685, -23183, -134404, 23160, 65782, 248637, -47426, 25001, 290476, -34630, 232179, 284948, 277721, -119461, 143116, -133301, 131985, 103942, -38296, 304644, 427665, 85728, 66037, -12167, 270810, 100130, 609355, 138924, 180714, 440484, 595435, 413266, 559062, -9958, 339861, 116711, 274610, 374124, 281370, 145640, 234053, 281500, 208451, 223264, 309583, 322208, 241379, 158919]
15027A58919M2544N65727B59219J12016m2628A46661J08147M1267J53723N5910
15017E05708j17576L80622j20626m1113a09500E55541A54608J7119L11604l4628
15007D48703o7231J17365j06767A82863J70444N1482a8992B9015M36922j83392
14997B82545J39326J801r9973K793G5713L07251j74982K1247d3300c08B54714
14985E88134k29474A56011N8640K31960P9423J6812J61291l0104l03845j12548
14975B57640K39234K0177q8176n5940J32529q719O0760n876k57555G1477L57593
14964D29070n867L0417B14754M5199a41984B13097K07636A73034J33733M9067
14954C55834J63423B54058P8151M2727o7382J37506k01298M30604k00910n8736
$$ y = [158919, 201463, 767190, 259219, 371235, 328607, 146661, 254808, 296075, 449798, 505708, 388132, 768754, 648128, 607015, -109500, 555541, 154608, 171727, 483331, 448703, 381472, 498837, 392070, 182863, 353307, 404789, -18992, 29015, 465937, 282545, 421871, 423672, 323699, 326492, 75713, 382964, 207982, 229229, -43300, -308, 254714, 588134, 358660, 156011, 214651, 446611, 526034, 542846, 704137, 674033, 370188, 257640, 496874, 517051, 428875, 372935, 505464, 496745, 557505, 551629, 294074, 71477, 429070, 423203, 453620, 214754, 259953, -141984, 213097, 420733, 173034, 306767, 355834, 519257, 254058, 332209, 374936, 307554, 445060, 243762, 674366, 473456, 414720]
14944D14720j24610N68061l2546C16012M54478a3541B88789J59493B20813K49683
14934D70496A55306K04907L36505N2310m7884Q6242J45760J63442j01917L07115
14924A301786k77147J54304k38577p2929K09314j91660L22191Q9323J36295J01871
14914A534771m06620k48024q1036K59755k46882j45539K41898l02189k92104M17687
14904G31717J9158j02669C5562J62882K67773j81151A03043M68229j58771j03892
14894C08609H916O08073m9528O6603k43545A71437M46533B95129Q1451M10021
14884G86601j00828N7301J25429k90952k25305O3749n2004J27678J88044j33179
14874E46534P4275k48896l2310K36698B22798J12538K72263Q2239j63880B62451
$$ y = [414720, 290110, 858171, 825625, 316012, 770490, -13541, 288789, 448282, 220813, 470496, 155306, 360213, 696718, 749028, 701144, 787386, 933146, 1096588, 994671, 1301786, 1024639, 1178943, 940366, 867437, 1076751, 885091, 1207282, 1296605, 1432900, 1534771, 1128151, 880127, 799091, 1058846, 811964, 666425, 908323, 606134, 314030, 731717, 750875, 648206, 35562, 198444, 466217, 285066, 103043, 571272, 412501, 308609, 8916, 616989, 567461, 634064, 390519, 171437, 617970, 295129, 376580, 786601, 685773, 743074, 868503, 577551, 352246, 415995, 363991, 491669, 679713, 546534, 620809, 371913, 339603, 576301, 222798, 335336, 607599, 689838, 525958, 262451]
14863I70846D48986K6721J22585j00610p0667J53923k4227K96110l12837n8364
14853D81620j61093J36072B20214J26182K41443M0999B57762L29519k23648K31799
14843E95432K192J19055K33859k00522L47444k56667M968j72035K93475l63699
14833F03502J36105j98113B64246k7114O41696j80099l05324O4766J73625k25005
14823D06791J26233J1947K9680L401o8286p3181j56732N26805J5367l34259J51212
14812F38978m2062k37261P8625N3467J89643Q877j93925J2593K65561O6204j12966
14801G27734J27444J6567l71907r5356M2103N09060k57971J31906l10161J91599
14791G11018j56653R2432P0771j57049J71263m9939r1737k4653K16921M0880k24986
$$ y = [970846, 448986, 475707, 598292, 497682, 427015, 580938, 556711, 852821, 539984, 481620, 320527, 456599, 220214, 346396, 587839, 628838, 257762, 587281, 363633, 595432, 597624, 716679, 950538, 750016, 1097460, 840793, 845761, 673726, 967201, 603502, 739607, 541494, 264246, 237132, 878828, 698729, 393405, 458171, 631796, 406791, 533024, 544971, 574651, 578052, 509766, 436585, 279853, 806658, 822025, 487766, 638978, 596916, 359655, 438280, 491747, 681390, 690267, 496342, 508935, 774496, 840700, 727734, 855178, 871745, 499838, 404482, 446585, 955645, 697674, 829580, 519419, 711018, 554365, 646797, 717568, 560519, 731782, 681843, 590106, 565453, 782374, 823254, 598268]
14780E98268L18438l12594J73139j74436m8786L06161l6645C01577K76454L42228
14770I20259l33142L05339k87401J67454k49680J95690Q5491j266l33873K89597
14760G58468J9195j1896k94496J60503j85921M02468j84093l1602K12138C06591
14749E97557L7031p0625J24433J48778j00187J103n023K09409l34208N21647m58186
14738F71729k46108L66834K3181N6125k99192M65059j28711j96662o308J91401
14728H97348m4738J57811J02229M298O8100K55405j12944J93148m38377p2567
14718A009713K21001k94983R9219J22027n43392M18798l0477l16010L69750k00590
14708H55056j07729K28235k1170p9337l44192N16068J86282P4553J43163J48558
$$ y = [598268, 916706, 604112, 777251, 602815, 554029, 860190, 823545, 301577, 578031, 920259, 587117, 892456, 605055, 772509, 522829, 718519, 804010, 802744, 468871, 758468, 777663, 765767, 471271, 631774, 445853, 848321, 664228, 632626, 844764, 306591, 597557, 634588, 563963, 688396, 837174, 736987, 738090, 733067, 942476, 608268, 1129915, 671729, 425621, 792455, 815636, 871761, 572569, 1037628, 908917, 712255, 705947, 897348, 852610, 1010421, 1112650, 1116948, 1185048, 1440453, 1327509, 1520657, 1082280, 1009713, 1230714, 935731, 1034950, 1156977, 613585, 1032383, 1001906, 685896, 1055646, 855056, 747327, 975562, 954392, 875055, 530863, 1046931, 1233213, 1307766, 1450929, 1599487]
14698A599487m9650m02444K54855K53857n68880R5743j96430J33460l12753L0227
14688H37472K97170K1698k27333L63009m54739K8744m7423Q1836R5595j2812R8331
14677A081548k50165N5860j53844L42219k8992j67075J82951l36488K60955l6131
14667I50838P7577k6861L71991j50261k98464M16110J53890o74807j07588K31582
14657I44007K55443k12981L56235N5579l14971K244J78483n3342L22936k88113
14647A245520J30896j46589K93517j75375k19603O8540O1811Q7600k8359J49427
14637A467385Q11j94320J44749j10675L06624m04002J2141J32163j8471K30966
14627A567371l34069K24381n95317P25698O4716k57265J86274Q6900j56176j80565
$$ y = [1599487, 1549837, 1147393, 1402248, 1656105, 1087225, 1182968, 986538, 1119998, 807245, 837472, 1134642, 1156340, 929007, 1292016, 837277, 866021, 818598, 900434, 996029, 983217, 1081548, 831383, 887243, 733399, 1075618, 1046626, 879551, 1062502, 726014, 986969, 950838, 1028415, 1001554, 1373545, 1223284, 924820, 1340930, 1494820, 820013, 712425, 944007, 1199450, 986469, 1342704, 1398283, 1083312, 1085556, 1264039, 1210697, 1533633, 1245520, 1376416, 1229827, 1523344, 1347969, 1128366, 1196906, 1258717, 1346317, 1317958, 1467385, 1468196, 1273876, 1418625, 1307950, 1614574, 1210572, 1222713, 1354876, 1336405, 1567371, 1233302, 1457683, 862366, 1588064, 1652780, 1395515, 1581789, 1668689, 1512513, 1331948]
14617A331948M28728l10068j08287L22313k97858N5004J4364M9975r2205J66702
14607A560616n1053J35558K95273m5219l22572m8446K24935M4596k55016J97756
14597A736428K58707m65315O7803L36588k24527R0890k57593l1273M45552m00611
14587A556649K23593j28704L30022j83779K07508K48612n20798J49174J28597
14578B010874J48646J1975M1622J02920l18229P0007N49134R3362m84473J60234
14568B386072n8980J18396j86388K3798M86351k81837J33276O6686Q9017R606
14558B785997L00885L60219R2157L64773m18930O37232M71292O51216P22825J592277
14548G559943L832418P308057J6507141N847412A7862079H669347j514841l507265
$$ y = [1331948, 1760676, 1450608, 1342321, 1664634, 1366776, 1421780, 1436144, 1486119, 1393914, 1560616, 1509563, 1645121, 1940394, 1895175, 1572603, 1524157, 1749092, 1793688, 1538672, 1736428, 1995135, 1529820, 1597623, 1934211, 1709684, 1800574, 1542981, 1511708, 1957260, 1556649, 1780242, 1651538, 1981560, 1797781, 2005289, 2253901, 1733103, 1882277, 2010874, 2159520, 2171495, 2213117, 2316037, 1997808, 2067815, 2616949, 2710311, 2225838, 2386072, 2327092, 2445488, 2259100, 2282898, 2769249, 2487412, 2620688, 2687374, 2776391, 2785997, 3086882, 3447101, 3539258, 3904031, 3485101, 4122333, 4593625, 5244841, 5967666, 7559943, 11392361, 18700418, 35207559, 41054971, 17862079, 8669347, 7154506, 3647241]
14540C647241r98464r4368l55441K0395k39377J16439k68887K03987K27974L7987
14530B297486J76291q2717J51942K6654k44964j20239q3948J69165N2949M1225
14520B383844L15857K8915Q3079l16108K89709J32345R2541l00857N4609K9700
14510B793634K46804l14067K85242l37725J59056K50454k44990L03855j27585
14501C014678L71465J06219l07398L63493j66440P8286L09498l33838J53945L61834
14491C951742m81724L71655J60112m66529O22660m64137J1894M25209j71510n8042
14481C901330J23946L4887J13141r9909K37645K2079r6549r9735J3034J76264
14471D326133q5204L62469J34429M24594o45004M05377q5177j66131M87159l1950
$$ y = [3647241, 2648777, 2554409, 2198968, 2219363, 1979986, 2096425, 1827538, 2031525, 2259499, 2297486, 2473777, 2391060, 2543002, 2569656, 2324692, 2204453, 2120505, 2289670, 2342619, 2383844, 2699701, 2728616, 2811695, 2495587, 2785296, 2917641, 3010182, 2709325, 2763934, 2793634, 3040438, 2726371, 3011613, 2673888, 2832944, 3083398, 2838408, 3142263, 3014678, 3386143, 3492362, 3184964, 3548457, 3382017, 3460303, 3769801, 3435963, 3589908, 3951742, 3470018, 3841673, 4001785, 3535256, 4157916, 3693779, 3705673, 4130882, 3959372, 3901330, 4025276, 4060163, 4173304, 4073395, 4311040, 4333119, 4236570, 4136835, 4149869, 4326133, 4240929, 4603398, 4737827, 5162421, 4517417, 4922794, 4837617, 4671486, 5158645, 5126695]
14461E126695p2784o684q408M98052k38607K7762o6869K08334j70620K31855J64252
14450E692978R4028J19414Q3400l12242J18261M67956n580l20713L80893j1588
14440F306807l18000L02556J87093M46973m18530L93931J48690n3041j84865N86300
14430G397914k29775L97595k14210K10169K99879m1533K56616J91657k36018L20657
14420H352951M01659K73273j2260P8254J71798J8923j305M75480J55188n97730
14410I316231O29548l23730K24099J59226R4231L01141L15964j20727N12052P2771
14400A1180806K34736j83403L59423K15431K08027K51455J73885q8295K52881
14391A2604946N44551N0498K36624O444L73815J23610L48015K62100N93815R762
$$ y = [5126695, 5053911, 5047227, 5038819, 5536871, 5298264, 5326026, 5259157, 5467491, 5296871, 5528726, 5692978, 5787006, 5906420, 5989820, 5677578, 5795839, 6263795, 6258215, 5937502, 6318395, 6306807, 5988807, 6291363, 6478456, 6925429, 6506899, 6900830, 7049520, 6996479, 6811614, 7397914, 7168139, 7565734, 7351524, 7561693, 7861572, 7820039, 8076655, 8268312, 8032294, 8352951, 8754610, 9027883, 9015623, 9093877, 9265675, 9284598, 9283293, 9758773, 9913961, 9316231, 9945779, 9622049, 9846148, 10005374, 10099605, 10400746, 10716710, 10595983, 11108035, 11180806, 11415542, 11232139, 11591562, 11806993, 12015020, 12266475, 12440360, 12352065, 12604946, 13149497, 13199995, 13436619, 13443063, 13816878, 13940488, 14288503, 14550603, 15144418, 15154180]
14381A5154180N17795q7706K57313N59577K53472M57666J4033M73708K69435M68734
14371A8338207K84444k02716N96525Q47408N4263N84793Q01477q263N34665j03934
14361B1726869P94567L00534N10884L97481O03177L71741N84773Q88842O38126
14352B6816994K72730P17487Q50152P43259K78895Q71987O85330J060081O15146
14343C2912061J144607M43656J172450Q77944R44211J039597P19237J519161J035444
14334D1808368J062989J522853J442253O94756J951411R20370J746233J704427
14326E2853660J701325J434002K073420J732033K355506J534925K289658K423978
14318F8398507K344861K284749K516154K827954L137371L162264L309825L186661
$$ y = [15154180, 15671975, 15584269, 15841582, 16401159, 16654631, 17112297, 17126330, 17600038, 17869473, 18338207, 18622651, 18419935, 19016460, 19863868, 19918131, 20502924, 21304401, 21296138, 21830803, 21726869, 22521436, 22821970, 23332854, 23730335, 24333512, 24705253, 25290026, 26178868, 26816994, 27089724, 27807211, 28657363, 29400622, 29679517, 30551504, 31236834, 32296915, 32912061, 34056668, 34500324, 35672774, 36550718, 37494929, 38534526, 39253763, 40772924, 41808368, 42871357, 44394210, 45836463, 46531219, 48482630, 49403000, 51149233, 52853660, 54554985, 55988987, 58062407, 59794440, 62149946, 63684871, 65974529, 68398507, 70743368, 73028117, 75544271, 78372225, 81509596, 84671860, 87981685, 91168346]
14310I1168346L894925L812477M093487M208582L781093M930852M596759N044756
14302A25531277N688332N516339O046689O595478O465356P229333P871579Q081363
14294A79025746Q375379Q960903R663000J0087008J0313867J0997725J1242340
14287B48665968J1278301J2766356J2344135J3725548J3854848J3797560J4394601
14280C40827317J4380250J3941790J4042954J3529987J2465497J1868145J0164649
14273D31220589P612346K966602K065795J833296l75076l085452m190222o930142
14265D31117736r062203j1057528j2307327j4506229j4741854j5429409j5488843
14258C38524343j5742447j5187158j5163128j4606786j4068387j3122542j1622417
$$ y = [91168346, 95063271, 98875748, 102969235, 107177817, 110958910, 115889762, 120486521, 125531277, 131219609, 136735948, 142782637, 149378115, 155843471, 163072804, 170944383, 179025746, 187401125, 196362028, 206025028, 216112036, 226425903, 237423628, 248665968, 259944269, 272710625, 285054760, 298780308, 312635156, 326432716, 340827317, 355207567, 369149357, 383192311, 396722298, 409187795, 421055940, 431220589, 438832935, 441799537, 443865332, 445698628, 445323552, 442238100, 438047878, 431117736, 422055533, 410998005, 398690678, 384184449, 369442595, 354013186, 338524343, 322781896, 307594738, 292431610, 277824824, 263756437, 250633895, 239011478]
14251B39011478j2224327j1672695j1377223j0225741r605642q942065q425200
14244A66538585p969443p551763p033316o604692o516100o305282m885769n104536
14236A14567684n201659m861897m650035l926734l800083l033283l946377l364894
14228H1782722l211217l091279l117054k538839k489227k420271k457161j908440
14220F0549234j993533k161588j885509j781672j956349j388067j641489j178557
14212D6562470j657148j234425j308491j023483j468972o40932j130694j446960
14204C6651365r67644p20032j201539n09797r57533j045408q40590l68671j303106
14195B8737045j71778p76187p58762p17377q11692n49286o31160n52516k53039
$$ y = [239011478, 226787151, 215114456, 203737233, 193511492, 183905850, 174963785, 166538585, 158569142, 151017379, 143984063, 137379371, 130863271, 124557989, 119672220, 114567684, 109366025, 104504128, 99854093, 95927359, 92127276, 89093993, 85147616, 81782722, 78571505, 75480226, 72363172, 69824333, 67335106, 64914835, 62457674, 60549234, 58555701, 56394113, 54508604, 52726932, 50770583, 49382516, 47741027, 46562470, 44905322, 43670897, 42362406, 41338923, 39869951, 39229019, 38098325, 36651365, 35683721, 34963689, 33762150, 33252353, 32294820, 31249412, 30408822, 30040151, 28737045, 28565267, 27789080, 27030318, 26312941, 25501249, 24951963, 24320803, 23768287, 23515248]
14186B3515248q61219n15268m34245o36024k99700l98809m71177n42949n23491
14177A8832366j77174l21370q00828r9726k97570j49948k93244l48756l62124
14168A5981626m89283j24044m18781l42057l84764o0560l72896J37780o35010
14159A3292011j22441l11056k35629J2351o801n31872j39255n07868J42152k12150
14149A1379442j94354k09108o867m80873l34786J35194J72878m46829j74184k26071
14139I614442R3856l86204K7718k73458j24197J45854j77838l42855J97384n44973
14129H229729j68200M2225j46766P5476m4601l97316k36387K60607M2783m25174
14119G232376k09137K73832l6209n80573J88848J75522m14817J17830k65029j10101
$$ y = [23515248, 22654029, 22138761, 21704516, 21068492, 20768792, 20369983, 19898806, 19355857, 18832366, 18655192, 18333822, 17532994, 17433268, 17135698, 16985750, 16692506, 16343750, 15981626, 15492343, 15368299, 14949518, 14607461, 14222697, 14162137, 13789241, 13927021, 13292011, 13169570, 12858514, 12622885, 12635236, 12628435, 12096563, 11957308, 11449440, 11591592, 11379442, 11185088, 10975980, 10969113, 10488240, 10153454, 10288648, 10461526, 10014697, 9840513, 9614442, 9708298, 9322094, 9349812, 9076354, 8952157, 9098011, 8920173, 8577318, 8774702, 8229729, 8061529, 8103754, 7956988, 8032464, 7987863, 7590547, 7354160, 7614767, 7657550, 7232376, 7023239, 7297071, 7260862, 6680289, 6869137, 7044659, 6629842, 6747672, 6482643, 6372542]
14109F372542K33138j87457k48210k65295J87713k90901L10901k60543O7328j41041
14099E778175K8981m76262K06499j99945J84374k10361M85084q64948J72940J68602
14089E273139K8327m84549J06928j37334J94716j06553j44612j47396K04002j49786
14079D636882J00580m49084J59848n6687l07416K39147k83585K29984j19872j08442
14069D041355l49474M16062j41824j1808l4978N5629R5261J09759l8966k1230
14059D119786k46919k55225J695p1563K44923k21300j66966j85541M52693k20144
14049C451439j06785M7143K36850o73406L22235j28082P5716m1514j46567J51674
14039C188703J62215j25184j26040N251k40055K25035K11001k3507m69314J72166
$$ y = [6372542, 6605680, 6418223, 6170013, 5904718, 6092431, 5801530, 6112431, 5851888, 5919216, 5778175, 5807156, 5330894, 5537393, 5337448, 5521822, 5311461, 5796545, 4931597, 5104537, 5273139, 5301466, 4816917, 4923845, 4786511, 4981227, 4874674, 4730062, 4582666, 4786668, 4636882, 4737462, 4288378, 4448226, 4391539, 4084123, 4323270, 4039685, 4269669, 4149797, 4041355, 3691881, 4107943, 3966119, 3954311, 3919333, 3974962, 4070223, 4179982, 4141016, 4119786, 3872867, 3617642, 3619337, 3547774, 3792697, 3571397, 3404431, 3218890, 3671583, 3451439, 3344654, 3391797, 3628647, 2955241, 3277476, 3149394, 3225110, 3183596, 3037029, 3188703, 3350918, 3225734, 3099694, 3104945, 2864890, 3089925, 3300926, 3277419, 2808105, 2980271]
14029B980271j94075L24152m54309J11115j96951K19291m02753J0702L28971k41170
14019B485244K2234K6038j14162n0676N02410k41906m87201O39706n69191N3689
14009B266185K54654p7875J9758r1115k6481P6470k80615K29441J1483n1342l53409
13998A977154K30272J62799K1230K1479p3224j44608J01474J73582M42156J069300
13988C981614K454572N442942J3451965J9446047j9856511j1877509n652554j758061
13980E632505j146075q62965k42223n29013K2158j53175j28236j33859k1401j7577
13970B420139r5964R3030J83610l08974N3945j57012j68647J97641q563j31768
13960B077437j01464Q0969Q121o5647l06367K60969N2418k17187J22334q801M19013
$$ y = [2980271, 2786196, 3110348, 2656039, 2767154, 2570203, 2789494, 2386741, 2397443, 2726414, 2485244, 2507478, 2533516, 2419354, 2368678, 2871088, 2629182, 2141981, 2781687, 2212496, 2266185, 2520839, 2442964, 2462722, 2371607, 2345126, 2421596, 2140981, 2370422, 2381905, 2330563, 1977154, 2207426, 2370225, 2391455, 2412934, 2339710, 2195102, 2296576, 2470158, 2912314, 3981614, 6436186, 11879128, 25331093, 44777140, 24920629, 13043120, 7390566, 5632505, 4486430, 3623465, 3381242, 2852229, 2874387, 2721212, 2592976, 2459117, 2437716, 2420139, 2324175, 2417205, 2600815, 2291841, 2345786, 2188774, 2020127, 2217768, 2209205, 2077437, 1975973, 2056942, 2065063, 1999416, 1693049, 1954018, 2006436, 1789249, 1911583, 1902782, 2321795]
13949B321795j62032j91892j29306q9217P0497J09980p09808L84537L34558M5324
13939A984436m12968M245M3129L74845k19157l40500J88570J67259q0926j83518
13929A525415J24542m85990L77452K97211m73076N2608K95679j28486R168P8350
13919A672873l28331j813K92845l15997N1741J97390j23747r2547L5036K10748
13909A598198k54372k72897L87490l44029K5908K91737j18190J77654l9724j43835
13899A307940K28489k1082q8857k97073J11305k01019K18314J33053n846j05349
13889A279875M8297j20586k38352J96197n6303J95631m3151j41930J2785Q0538
13879A213001j97526J29901K3655o0998r6188M1536J40783k843o412j10103J09706
$$ y = [2321795, 2159763, 1967871, 1838565, 1749348, 1819845, 1929825, 1220017, 1604554, 1939112, 1984436, 1571468, 1575713, 1618842, 1993687, 1774530, 1434030, 1622600, 1789859, 1708933, 1525415, 1649957, 1163967, 1541419, 1838630, 1365554, 1418162, 1713841, 1585355, 1594523, 1672873, 1344542, 1342729, 1635574, 1319577, 1371318, 1568708, 1444961, 1352414, 1387450, 1598198, 1343826, 1070929, 1458419, 1114390, 1140298, 1432035, 1313845, 1491499, 1451775, 1307940, 1536429, 1515347, 1426490, 1129417, 1240722, 1039703, 1258017, 1391070, 1385224, 1279875, 1328172, 1207586, 969234, 1165431, 1109128, 1304759, 1261608, 1119678, 1132463, 1213001, 1015475, 1145376, 1169031, 1108033, 1011845, 1053381, 1194164, 1191321, 1184909, 1074806, 1184512]
13868A184512K7697m48468K82113L04658n32307M69586l81756K23401j36791J47734
13858A140379O1454J23151l55938J57113R9817l85445K77931m33220M25314j29416
13848I81140K39534l0122k26599L35044k48083j92901O1687K47889k87141j00765
13838G79683j5593n1160L1083J65608K50557k10448m1803k04221M4999M50991
13828A199696o1106n29884K95251J00109k11644L5034O78818o01324J41536k34964
13818H11522K06217l12473K50484q6645O417N5446o2645K8134l78798m323J38653
13807F51989J16909j54114K18195k22603j0756K69416P2841p0656k05945Q3171
13797G48447j29122L70356k68572N7191N9708N6317l56308K42670J34229k57004
$$ y = [1184512, 1212209, 763741, 1045854, 1350512, 818205, 1287791, 906035, 1129436, 992645, 1140379, 1201833, 1324984, 969046, 1126159, 1225976, 840531, 1118462, 685242, 1110556, 981140, 1220674, 1190552, 963953, 1298997, 1050914, 858013, 919700, 1167589, 880448, 779683, 764090, 712930, 744013, 909621, 1160178, 949730, 907927, 703706, 748705, 1199696, 1138590, 608706, 903957, 1004066, 792422, 827456, 1506274, 904950, 1046486, 811522, 1017739, 705266, 955750, 869105, 875522, 930968, 868323, 896457, 517659, 513336, 651989, 768898, 614784, 832979, 610376, 599620, 869036, 941877, 871221, 665276, 748447, 619325, 989681, 721109, 778300, 838008, 894325, 538017, 780687, 914916, 657912]
13787F57912j36568Q7978j6234M16652l36942p2252j47494J25804J28351K76458
13777I83665l24495J04628o8711n7258N5105L7885J41582o9384k05077q5048r088
13766E03804K48504K05711k98351N9944J81529k29904j91974j19068M66994j53382
13756F73807J53433k68061q1591J38252P7039K22254m43295A15168L56515K13251
13746F84934B42323K0572P84654E21631j59688K31419j39533N55916B77647O7121
13736C44768J68610J0440K19395B69575K23478m28J06734j93796m7340M59826
13726H18049C20940L49170j23620J50126j72126k01895j52450K37359L27451m2714
13716F92241q7233p307k56166K47446k19260J48734p1354J55393B29082M57357
$$ y = [657912, 521344, 609322, 593088, 1009740, 672798, 600546, 453052, 578856, 707207, 983665, 659170, 763798, 695087, 637829, 692934, 730819, 872401, 803017, 597940, 512892, 503804, 752308, 958019, 659668, 719612, 901141, 671237, 479263, 360195, 827189, 673807, 827240, 559179, 477588, 615840, 692879, 915133, 471838, 115168, 471683, 684934, 242323, 262895, 1047549, 521631, 361943, 593362, 453829, 1009745, 277647, 344768, 513378, 523818, 743213, 269575, 493053, 492625, 599359, 405563, 358223, 818049, 320940, 670110, 546490, 696616, 524490, 322595, 170145, 407504, 734955, 692241, 605008, 597701, 341535, 588981, 369721, 518455, 447101, 602494, 229082, 686439]
13706F86439k25656L1863K41762A04667N61197B01265M16504k30177K29543K144
13696F19279k06599M9505n2468L03288C02740L54133l20737q7868K93637j41451
13686D00454n2460J98614o6344j96933Q0452M6901J66722k13276K82531F6818
13675F33736k40536J42999J38822j86344j38197j12127J61925j72729R9300K84759
13665F11608p6194L8054I5956M55163j26346n5906j33204K63566j46021j00191
13655B53017L22924A77653O31414C70546L15338l12442J18011j19333K05462B60143
13644E92541A16383O84925l69385j68023J44731n0219m3375o6204J35744A1683
13633F57722m592n3750k41620J35034k14325j1158j05679M36273k32479l2397
$$ y = [686439, 460783, 492646, 734408, 104667, 665864, 201265, 617769, 387592, 617135, 619279, 412680, 462185, 409717, 713005, 302740, 656873, 336136, 248268, 541905, 400454, 347994, 546608, 480264, 283331, 363783, 410684, 577406, 364130, 646661, 66818, 633736, 393200, 536199, 675021, 488677, 350480, 238353, 400278, 227549, 326849, 611608, 535414, 573468, 95956, 551119, 424773, 368867, 235663, 499229, 353208, 253017, 575941, 177653, 809067, 370546, 685884, 373442, 491453, 372120, 577582, 260143, 592541, 116383, 801308, 431923, 263900, 408631, 358412, 315037, 248833, 384577, 11683, 657722, 653130, 599380, 357760, 492794, 278469, 267311, 161632, 597905, 365426, 333029]
13623C33029J2625p8381L38397m0593A35644L02518J18142j45014R413l0162j15882
13612B74659L04622A41868M36227k5983k37771j33880J89043j01299m045L88872
13602F53032k00748J6156A59685J69518K4068K74018o9578k23744J19623j84933
13592B68657j14704N12017B11977M29912B73558K58292o0339A68823K85612k2486
13582D31949A81879L15076k46325l958J97677M2513j01511i8942B05723M20175
13572F25898B84320j449b64850B71041J95789A44844m6145J05448K44144J1574
13562D59865q1454j55773J93422o4135H1176K64388j08153J92180j81978J45927
13552C93540j19013J714K0661k9011H82K85990k3413L01887A08715N0240K89737
$$ y = [333029, 345654, 267273, 605670, 565077, 135644, 438162, 556304, 411290, 420703, 390541, 274659, 579281, 141868, 578095, 552112, 314341, 180461, 369504, 268205, 264160, 653032, 452284, 468440, 159685, 329203, 353271, 627289, 557711, 333967, 453590, 268657, 153953, 665970, 211977, 641889, 273558, 531850, 471511, 168823, 454435, 431949, 181879, 496955, 250630, 246672, 444349, 486862, 385351, -98942, 205723, 625898, 284320, 282871, -264850, 271041, 466830, 144844, 98699, 204147, 448291, 459865, 378411, 222638, 416060, 351925, 81176, 345564, 237411, 429591, 247613, 393540, 274527, 276241, 296902, 267891, 882, 286872, 263459, 565346, 108715, 158955, 448692]
13541D48692j28918M2115B413J84577M71550C18193K9650l0318j16989L91894
13531E92430B24982j6201K63692B1709K49322o7964l2238L62484j19733p3010
13521C40570o9967m0157k238J93934A47705j2999Q1601C6685J37203K68833j53612
13510B89109A00580D6697K68264A22847J6049F8009N00671j51616Q2798j76015
13500C23847m7321j25761J88964O952j02588j11062J57785D9125f5035D07337
13489C29614j29254J28725r9229A4118K40481k0930j8037f4269B64735o6731j8553
13478A79451a0649A42021D2476J23071J16763o6447q0777K8649A137J75064J41114
13467C17315A36205K63035r1966I9870J45720J04438b64915J24183A92127J25534
$$ y = [448692, 319774, 361889, 2413, 186990, 658540, 318193, 347843, 317525, 200536, 592430, 224982, 208781, 472473, 21709, 271031, 203067, 170829, 533313, 413580, 340570, 270603, 230446, 228208, 422142, 147705, 134706, 216307, 36685, 173888, 442721, 289109, 100580, 46697, 314961, 122847, 138896, 68009, 568680, 417064, 499862, 323847, 276526, 150765, 339729, 346681, 244093, 133031, 290816, 49125, -65035, 407337, 329614, 200360, 329085, 229856, 14118, 254599, 233669, 215632, -64269, 264735, 198004, 179451, -10649, 142021, 42476, 165547, 282310, 215863, 135086, 163735, 1137, 176201, 317315, 136205, 399240, 307274, 99870, 245590, 350028, -264915, -140732, 192127, 317661]
13457C17661m290A49989b8976B47830G8323K92500j32601d2390C51651n0724m1997
13446B58930E2013J27795J56968r0093M4609L1679b39962B65628j17733L4185
13436A82080J03444A9608a9712D01522F4422K67940l8983j06623R8455L9839j1295
13425C13755R7583r8639I1798c7420C28182o4271m1095m5936P4869j21515h0352
13413E17711E5226A8766K58784q6745E1324a06476A74941D1156g9975A48462M8065
13402A96527K17374G3393k1757i5B23574K00673D4581d3408A33463O7994b56708
13390I6322J0474N5888a79166C06150L35569k84090j73509F9024l0472i0826I1854
13378C60572b6419C39433j14397J48201n4968J15822A06139N6619K165J53436
$$ y = [317661, 313371, 149989, -28976, 247830, 78323, 370823, 238222, -42390, 351651, 300927, 258930, 52013, 179808, 336776, 246683, 291292, 322971, -239962, 265628, 147895, 182080, 285524, 19608, -19712, 401522, 64422, 332362, 293379, 186756, 285211, 325050, 313755, 411338, 312699, 91798, -37420, 328182, 263911, 222816, 176880, 251749, 130234, -80352, 517711, 55226, 18766, 277550, 190805, 51324, -106476, 174941, 41156, -79975, 148462, 196527, 413901, 73393, 51636, -95, 223574, 424247, 44581, -43408, 133463, 201457, -256708, 96322, 106796, 162684, -179166, 306150, 641719, 357629, 184120, 69024, 38552, -90826, 91854, 360572, -26419, 339433, 225036, 373237, 318269, 434091, 106139, 162758, 164923, 318359]
13368C18359C8286J73056R3143C4231K19237J07416B9917K57995J0870E1475K84024
13357C35499i5289B36037K88856B02099a24503A98498I2421M0168J7090J53643
13347C03322J54C2389I501D136J85747J21602A46739L60290l3984p1238O8365
13336D70172j08565o5491J44860A51921r879E7111M82134f0321B19518B4471i216
13324a85290A83721G1192K76025g1758B24356a05561C30257j07580m4946j6156
13314A61575e5984C01423O9293J34113A61115N5366d6221J7873B71441m6573J71094
13303C95962H4885K96120p4196l7709j12668K23239B5366L60869C5684J77566
13293B13250D5026N76065B1052o966K52479J21520F7907K59663p9289c99766B85358
$$ y = [318359, 38286, 211342, 304485, 34231, 253468, 360884, 29917, 287912, 298782, 51475, 335499, -95289, 236037, 524893, 202099, -124503, 198498, 92421, 132589, 149679, 303322, 303476, 32389, 9501, 4136, 189883, 311485, 146739, 507029, 473045, 401807, 470172, 361607, 296116, 440976, 151921, 142042, 57111, 539245, -60321, 219518, 24471, -9216, -185290, 183721, 71192, 347217, -71758, 224356, -105561, 330257, 222677, 177731, 161575, -55984, 301423, 370716, 504829, 161115, 216481, -46221, -28348, 271441, 224868, 395962, 84885, 381005, 306809, 269100, 156432, 379671, 25366, 386235, 35684, 213250, 45026, 621091, 21052, 14086, 266565, 388085, 67907, 327570, 248281, -399766, 285358]
13281a8560A32612d2842F2906e8385B9945J0532a51059a7740A50345j1340J95453
13270C34458L1478F3766q836A8757O1015K1606J76886k24c55616B40422q8953
13259A51469e9804B53359i3754J2361A66184c1033B12017N3988L30105D6075J02007
13248A48082B5772c16135i7114A12235k9762J59922b68619B11616p9867a17641
13237g1603D1058e1639B83028c0230j36678b6917J2032A07843K03468B5491i6978
13225a42278p215B39921J19093j03634q9032m5584a7471B21117J36458A6882J59050
13214A75932F9338J28409n6005N9371m7841R9137L5538o0426i1351c56F0182k4745
13202C5437h73k08495Q8658A61774p1357q063j8718L10335A3569O1393J0770M4717
$$ y = [-18560, 132612, -42842, 62906, -58385, 29945, 40477, -151059, -17740, 150345, 139005, 334458, 365936, 63766, 54930, 18757, 79772, 101378, 278264, 278040, -355616, 240422, 151469, -59804, 253359, -93754, -81393, 166184, -31033, 212017, 266005, 596110, 46075, 148082, 25772, -316135, -97114, 112235, 82473, 242395, -268619, 211616, 131749, -117641, -71603, 41058, -51639, 283028, -30230, -166908, -26917, -14885, 107843, 311311, 25491, -96978, -142278, -149493, 239921, 359014, 255380, 166348, 120764, -17471, 221117, 357575, 16882, 175932, 69338, 197747, 141742, 201113, 153272, 252409, 287947, 227521, -91351, -356, 60182, 35437, -873, -209368, -120710, 161774, 90417, 82354, 63636, 373971, 13569, 74962, 85732, 130449]
13190A30449b6121A07275A5644R4162J64085A21424a09411D4281L99656a14063
13179a48213B44293F0375L5852L07590p0120F8538K4473M0296a56344A88709a82968
13167A79067K6328o158B5605J04936g4581A65822j0149J08616f1856a2275B43175
13155F2404b08961A1199O5691C0239N7841K15359J8301f3897A7440K02593a23002
13143C59531i3015D3244A4343K32822j12176B3687R5077a44990A62091h0497a4341
13131d9130I145K55196i7138A42909A4712L41813a19753J2275m4543j21006A71644
13119c16777B10990i6654A34128o2120J28189H2188k0011a26921N0327c930C05135
13107G2730a45584B43432a67363A56382a97649B50204a33081A11451a10375B84732
$$ y = [130449, -26121, 107275, 15644, 109806, 273891, 121424, -109411, 44281, 443937, -114063, -148213, 244293, 60375, 96227, 403817, 333697, 68538, 93011, 133307, -156344, 188709, -182968, 179067, 205395, 199237, 25605, 130541, -74581, 165822, 155673, 264289, -61856, -12275, 243175, 62404, -208961, 11199, 76890, 30239, 88080, 303439, 321740, -63897, 17440, 220033, -123002, 359531, -93015, 43244, 14343, 247165, 134989, 23687, 118764, -144990, 162091, -80497, -14341, -49130, 9145, 264341, -97138, 142909, 14712, 356525, -119753, -107478, -152021, -273027, 171644, -316777, 210990, -96654, 134128, 72008, 200197, 82188, 62177, -126921, -76594, -3930, 305135, 72730, -145584, 243432, -167363, 156382, -197649, 250204, -133081, 111451, -110375, 284732]
13096d6169C19082f9222A69809b0473B09398C5361P3740a7738A26092K64709B9902
13084B82004c43565J69891H8278P7230k385p1391A2569J8898K40402j03054n9244
13073A09571L55849a25567B89467A10466K4379m8918a57757L4934F3537O6067
13063A29604E0095B2590a13011H8188J41310d4053A44562J13603q3916n6740d167
13051I798a25994j26908I5774J1800d5620B01933a80290B98491f0032o8255C03330
13039B11759H602J67347R0130F5063a72675I4463J41400F5070a56019C18617d6519
13027e372B1012M8552L31167a968H8107l3397J50971a4851I283J88537K47584
13016D45404a77987E3364L30309j32076j9407a85637A69303E8549K54171r9722
$$ y = [-46169, 319082, -69222, 169809, -20473, 209398, 35361, 109101, -17738, 126092, 390801, 29902, 282004, -343565, -173674, 88278, 165508, 163123, 91732, 12569, 31467, 271869, 168815, 109571, 465420, -125567, 289467, 110466, 134845, 85927, -157757, -122823, 63537, 129604, 50095, 22590, -113011, 88188, 229498, -44053, 144562, 258165, 174249, 117509, -4167, 9798, -125994, -252902, 95774, 107574, -45620, 201933, -180290, 298491, -60032, -128287, 303330, 211759, 8602, 175949, 266079, 65063, -172675, 94463, 235863, 65070, -156019, 318617, -46519, -5372, 21012, 69564, 400731, -1968, 88107, 54710, 205681, -14851, 9283, 197820, 445404, -177987, 53364, 383673, 251597, 232190, -185637, 169303, 58549, 312720, 212998]
13006B12998a12320q0258D3352K24338G2736g7303D63363j81729B3005c78220
12995H3846J79143j08810l4431e3613A11073J4156l2629c17682a10527B54881
12984F1784B6531p372K30641j24509J24179b88770I8196a56810C5147e4894I9609
12972A92513o7294b79372N410B2486O622J64712j7952G0068a40350M2505A83002
12960B43232D8812A7615K71428c12835k2336i9198E5224j8436K10949I9451b2502
12948F4938M2586B5568M0109a48988g2633k11567R9134A54538E2784J76033L8729
12937B67546e4594A27943a03518B27281b42406H8445d00156I7150P7291m2537
12927A31904J04017n1882A4949K16991q9983a4483A25549b7925l9988j49681d8309
$$ y = [212998, -112320, -192578, 43352, 267690, 72736, -77303, 463363, 281634, 23005, -378220, 83846, 262989, 154179, 119748, -53613, 111073, 125229, 92600, -317682, -110527, 254881, 61784, 26531, 19159, 249800, 125291, 249470, -288770, 98196, -156810, 35147, -54894, 99609, 192513, 125219, -279372, -273962, 22486, 29108, 193820, 175868, 70068, -140350, -97845, 183002, 243232, 48812, 17615, 289043, -312835, -335171, -99198, 55224, 36788, 247737, 99451, -22502, 64938, 107524, 25568, 65677, -148988, -72633, -284200, -185066, 154538, 52784, 228817, 267546, -54594, 127943, -103518, 227281, -242406, 88445, -400156, 97150, 174441, 131904, 235921, 184039, 14949, 231940, 141957, -14483, 125549, -27925, -67913, -217594, -48309]
12915a25681d8220p6652r617j2238L9540A84651b08623C4657d8117q5973A62732
12903b01098c3022O335B06223b56667J05871D4317J8433b92439F1799D900b29490
12891b37320D2658K19032I9555a6229F7657K75274a57331b2017l39151D67958
12880A07173b06006C1197J46694f0342C5115d31740A52970J24003j19073F5328
12869a78878A87866a09435J2956J4335B31004A826K35320c38667I8835b38297
12858C32965A21539a27156R446m9584B29242h0306B29453r9220J51494c0776l003
12847c3779r5860F7213J78280a07617B0241b09309J6186h4641A01478k9490b29395
12835a34395A21506K9960a2479A47987G0881J66596c7720I4751a2822j12007j58606
$$ y = [-125681, -48220, -124872, -134489, -146727, -107187, 184651, -208623, 34657, -48117, -134090, 162732, -201098, -33022, -26687, 206223, -256667, -150796, 44317, 62750, -292439, 61799, 4900, -229490, -237320, 42658, 261690, 99555, -16229, 67657, 342931, -157331, -22017, -361168, 467958, 107173, -206006, 31197, 177891, -60342, 35115, -431740, 152970, 276973, 157900, 65328, -178878, 187866, -109435, -96479, -82144, 231004, 1826, 237146, -338667, 98835, -238297, 332965, 121539, -127156, -117710, -167294, 229242, -80306, 229453, 130233, 281727, -30776, -33779, -129639, 67213, 245493, -107617, 20241, -209309, -193123, -84641, 101478, 71988, -229395, -134395, 121506, 151466, -12479, 147987, 70881, 237477, -37720, 94751, -12822, -124829, -283435]
12824b83435G5508b5056B45078a79903A65378J0663c1768E12a55003B99527j35976
12813A63551p7292b1590R234n1532F9160a05684J1582g075A48355o1332l7526
12802D9497j8030a44150A82272b65063C7181a46111j1887D12559g0229A74405
12791A96202a83398A61761M672J2421D2999b97620D5219M2769c01303D93923i1195
12779G9528J13802a10748D16485A31366J8281b70440B53775b42950a9645p5645
12769i5290B31004f3610I0106a27390m1094B58167f6299k00418c6452o9316C94067
12757A13761c9973j37512l31707k74a49413E6117a27426A41785b65874A74838
12746A83739q2130a05048A44875R0076E8299P8917l9385a99332H0920c71j62880
$$ y = [-283435, 75508, -25056, 245078, -179903, 165378, 176041, -31768, 512, -155003, 299527, 163551, 86259, -21590, -12356, -63888, 69160, -105684, -94102, -7075, 148355, 87023, 49497, 31467, -144150, 182272, -265063, 37181, -146111, -157998, 412559, -70229, 174405, 196202, -183398, 161761, 166433, 178854, 42999, -297620, 45219, 87988, -301303, 493923, -91195, 79528, 193330, -110748, 416485, 131366, 149647, -270440, 253775, -242950, -19645, -95290, 231004, -63610, 90106, -127390, -168484, 258167, -66299, -266717, -36452, -105768, 394067, 113761, -39973, -177485, -509192, -509466, -149413, 56117, -127426, 141785, -265874, 174838, 183739, 101609, -105048, 144875, 234951, 58299, 137216, 97831, -199332, 80920, -371, -163251]
12735a63251d7921G27e4965B75202i8802H4332f4580A89136p4969M8938a24452
12723a80147M891A88648g5955c3485F1043c6531p6889c3153j49096p7745f4609
12711A26691Q9327F9247j1962b86466a2858F02000A79109G8996J44683b25654
12700A6017a37591E8346P0455A5407J32918a03438C15065a9898q7143j74931R3967
12689a88005c4071j91984D56413a45832I4062C9380g888C2141J28204p6310d7588
12677a52414A17047J1746a25264A37234n8420c32510d0261A73176E4069J14327
12667A68396J76239j48473M3683f6784N687h716A46290N8827J39836a91944E232
12655C63025c1484q7688D3891A2947L85468h1447n7535A23917C1972g1893k78118
$$ y = [-163251, -47921, 727, -54965, 275202, -98802, 84332, -64580, 189136, 114167, 163105, -124452, -180147, -175256, 188648, -75955, -33485, 61043, -36531, -113420, -33153, -182249, -259994, -64609, 126691, 216018, 69247, 57285, -286466, -12858, 602000, 179109, 78996, 223679, -225654, 16017, -137591, 58346, 128801, 15407, 148325, -103438, 315065, -19898, -107041, -281972, -188005, -34071, -226055, 456413, -145832, 94062, 39380, -7888, 32141, 160345, 84035, -47588, -152414, 117047, 128793, -125264, 137234, 78814, -332510, -40261, 173176, 54069, 168396, 344635, 196162, 239845, -66784, -61097, -8716, 146290, 205117, 344953, -191944, 5232, 363025, -31484, -119172, 43891, 12947, 398415, -81447, -138982, 123917, 31972, -71893, -350011]
12644c50011b6806j53289h8697J3269K0527j16378F8714P6716C606J53725a89421
12632D56741E7691g0364j5559A29710P3978k5194K2162a05686l693o6739j17232
12621b93350F065a3083l41572E03b84320a18665j16903e5570G9414R9643j1674
12610A67383c0793l4886m5630d2673k79573a6573D9275K25080l99b083A10825
12598A45589m2864O2041G7540A6097K76630a07741j76235A00659Q2650a88432
12587c47843O3491a29179C7761A4758n594a04709d8584l49979A99948F6062J69661
12576B35723o6185d3425a6548E3191P1471J65664A36542c9032C13008b45737G0832
12564A52406a7000A01597b93342c7776j56021P1976c3310G4962K64633I3062c48758
$$ y = [-350011, -26806, -180095, -88697, -75428, -54901, -171279, 68714, 145430, 3606, 157331, -189421, 456741, 57691, -70364, -85923, 129710, 203688, 178494, 200656, -105686, -109379, -176118, -293350, 6065, -13083, -354655, 503, -284320, -118665, -235568, -55570, 79414, 179057, 167383, -30793, -65679, -111309, -42673, -322246, -16573, 49275, 274355, 273956, -2083, 110825, 145589, 102725, 164766, 77540, 16097, 292727, -107741, -283976, 100659, 183309, -188432, -347843, -284352, -129179, 37761, 14758, 9164, -104709, -48584, -398563, 199948, 66062, 235723, 169538, -43425, -16548, 53191, 124662, 290326, 136542, -39032, 313008, -245737, 70832, 152406, -17000, 101597, -293342, -37776, -193797, -121821, -33310, 74962, 339595, 93062, -348758]
12552B3906a18758A04791J33933E1697J66166a2445F0548f6590j42811b0957B80968
12540I509J15961a85251H3797b5143p0766F0376N3461c79266d0165A99785r3309
12529A06476J11955J873H2163k9000J06251K6940E4508c89855i1944A15825a84137
12517A35737k7904b41281J07070O1805G251O9378N7126f764k59758i615j60455
12506a70070k55889c3094B35293K2702b08047B97868J18186D3766L70809l9532
12496C75043A69193K19239D3330J21144B2043b13275a1501j06813F4996j2916
12486E2080D540a94823A3146a08980A52244a22714o4021c7326R927A73942h0880
12474a30820C71600a58532D0701M27465p9787A18525O8096K52849A63437e613
$$ y = [23906, -118758, 104791, 238724, 51697, 217863, -12445, 60548, -66590, -209401, -20957, 280968, 9509, 125470, -185251, 83797, -25143, -95909, 60376, 113837, -379266, -40165, 199785, 106476, 218431, 220304, 82163, 53163, 159414, 186354, 54508, -389855, -91944, 115825, -184137, 135737, 107833, -241281, -134211, -72406, 7251, 76629, 133755, -6764, -266522, -9615, -170070, -425959, -33094, 235293, 257995, -208047, 297868, 416054, 43766, 414575, 375043, 169193, 388432, 43330, 164474, 22043, -213275, -11501, -118314, 64996, 52080, 4540, -194823, 13146, -108980, 152244, -122714, -186735, -37326, -27399, 173942, -80880, -130820, 371600, -158532, 40701, 468166, 388379, 118525, 186621, 439470, 163437, -5613]
12463A98971c8398k73088K5395a11731A92759c33508N1593A3048c52135A9572
12452H6973m0798L3624c3969m0444k1111B92010K6525F8287J33800d3326E2673
12440b45652e7168J5502A41777b36064A06566J41817e64531E35477a4265k23694
12430b37959C825b05882J7480f2795M711K4093n3768L2968j1757n3716A41649
12418d2352C26097A304N6060b43705K7680L3116c5217A55981a70490M0249C4320
12406i8772B32595b81400D1223J8690c9145m6151o7135g0421j47525C8890b9225
12394f3837K8939l03553M2189a1735E3025a73511B20862j2177F6986J79825j21370
12383A25441k7285J26542b5650A45110J1738Q0088p0103B1210M5261i0257F2815
$$ y = [198971, -38398, -311486, -286091, -111731, 192759, -333508, -281915, 13048, -352135, 19572, 86973, 46175, 79799, -33969, -74413, -95524, 292010, 318535, 68287, 202087, -43326, 52673, -245652, -57168, -41666, 141777, -236064, 106566, 248383, -564531, 535477, -14265, -237959, 3825, -205882, -188402, -62795, -58084, -33991, -87759, -54791, -66548, -120264, 141649, -42352, 326097, 1304, 57364, -243705, -216025, -182909, -35217, 155981, -170490, -130241, 34320, -98772, 232595, -281400, 41223, 59913, -39145, -85296, -152431, -70421, -217946, 38890, -29225, -63837, -34898, -338451, -296262, -11735, 53025, -173511, 220862, 208685, 66986, 246811, 125441, 98156, 224698, -25650, 145110, 156848, 236936, 166833, 21210, 66471, -90257, 62815]
12371a29710I5000a42809D5175a23843b9494C70803a13792B8734a49912C39112
12360c3126D7217b49848C24230F6274a8171A23670m5071J51160c9830o8770D8482
12348E1337b60805J11716a6730l4004l05459a30724B19834E4101b43715I3631
12337e14494a55622B29900k8436F4961a63036E6392b95654I3996b74838g9714
12326a64466F2305J76821D1674J70543L504g2931B52697A2145R2540O2512H973
12314e1748A42895M700a9643B08129a1496A76738K9823j02208H434J51901i046
12302A34650A1945M30641o4358b33338A06338e087C43038A07845e5322C7271J53482
12291A90753a33677A11362K2279a06831D0861L26635a9173B78801p4873b3514
$$ y = [-129710, 95000, -142809, 45175, -123843, -29494, 370803, -113792, 28734, -149912, 339112, -33126, 47217, -249848, 324230, 66274, -18171, 123670, 78599, 229759, -39830, -108600, 48482, 51337, -260805, -149089, -16730, -50734, -356193, -130724, 219834, 54101, -243715, 93631, -514494, -155622, 229900, 201464, 64961, -163036, 56392, -295654, 93996, -274838, -79714, -164466, 62305, 239126, 41674, 212217, 215721, -72931, 252697, 12145, 104685, 167197, 8973, -51748, 142895, 147595, -19643, 208129, -11496, 176738, 206561, 104353, 8434, 160335, -9046, 134650, 11945, 442586, 378228, -233338, 106338, -5087, 343038, 107845, -55322, 37271, 190753, -133677, 111362, 133641, -106831, 40861, 367496, -19173, 278801, 203928, -23514]
12280h853j87973D8856L5064a11548B0747a2219C95297A08615a20172A30M58478
12269D58608a76620Q2455j86011C49155I329K56423a41004E3844J95970G6333
12258a47543A01884J43330q970o2841a73730A25517a14153B29892p8761B9528
12247a26888B5466J13693m4076J96642A7024K25433c4334C47154A44830c563D67590
12235c43366H8707b14220A02653h4916A57182b838n924F0129R5199O4552H4728
12223g7377A1708N62315A02920P5374R6015O6645g6372A52105P154G2342J96643
12212B68985q1174p3673b50133C31672A18985b60454A35640C4632a45560A91389
12201A86134J00893n6191a90668E31696g8031B11355G0722R6931m1936J6666J02482
$$ y = [-8853, -196826, 48856, 83920, -111548, 20747, -12219, 395297, 108615, -120172, 130, 458608, -176620, -94165, -280176, 349155, 9329, 265752, -141004, 53844, 249814, 76333, -147543, 101884, 245214, 236244, 173403, -173730, 125517, -114153, 229892, 151131, 29528, -126888, 25466, 139159, 95083, 291725, 17024, 242457, -34334, 347154, 144830, -3563, 467590, -343366, 88707, -214220, 102653, -84916, 157182, -2838, -8762, 60129, 155328, 219880, 84728, -77377, 11708, 574023, 102920, 178294, 274309, 340954, -76372, 152105, 159259, 72342, 268985, 187811, 114138, -250133, 331672, 118985, -260454, 135640, 34632, -145560, 191389, 186134, 287027, 230836, -190668, 531696, -78031, 211355, 70722, 167653, 125717, 142383, 244865]
12190B44865I6961J69697K11837j91027m3284j3643k4896J89330J13941c7079
12179c6469A75846M1965j3505o8223K362P8407D2539L20355A41274i1685k4392
12168a16077C66733A46612h1137A71252j900o242J71286a63565G5811N0780n3238
12157G3353B9225K4322K22206N0755b58997f0630p1473j1764B49334a6368k6892
12146d3260A80642J31891a15834L7805I4710a18933A43882B7511b96029g5618
12135b81140h1290H0737P9074n2397B9431J03022J14474a56169E03M2986J22958
12124A66447Q358a40300A43310K03060k0299E7603c281C11628A18522a30673j44708
12113b75381a17676o5307B36805b7861j44738K6906F1259L00849p9203a63279
$$ y = [244865, 96961, 266658, 478495, 287468, 244184, 230541, 205645, 394975, 508916, -37079, -36469, 175846, 217811, 204306, 136083, 138445, 216852, 42539, 362894, 141274, -91685, -116077, 366733, 146612, -81137, 171252, 169352, 163110, 334396, -163565, 75811, 126591, 73353, 29225, 53547, 275753, 326508, -258997, -60630, -132103, -143867, 249334, -16368, -43260, 180642, 312533, -115834, -78029, 94710, -118933, 143882, 27511, -296029, -75618, -281140, -81290, 80737, 159811, 107414, 29431, 132453, 246927, -156169, 503, 43489, 166447, 174805, -140300, 143310, 346370, 326071, 57603, -3281, 311628, 118522, -130673, -275381, -117676, -182983, 236805, -27861, -172599, -145693, 61259, 362108, 282905, -163279]
12102B17699a22411N5901B2103N2890d23489B14544n6677a1159A53594a67765
12091a30572M6933C0872J31563a14659B60567a08146A25713J0152E714b07950
12080a66005b5467A97582c3010I7162O8236F8652o755a8703A64366C6543J30208
12069A66751o8145K51499A68055e0855r0131D3176J88289q1262b42272A20163
12058a9206A48922f0290A57058J22439f7466B60605j5723f3169A89922b04378
12047B38083I7826i3760E3150a27324B26762m5402L12112A00058D2781J37813
12037A80594g2413L4464H0236N4436a28132E3990c54890I1052i0922b7268P465
12026a9803q8908A04618C2053J07925N690C9878a87972J8935A2213J15094P500
$$ y = [217699, -122411, -66510, 22103, 74993, -423489, 214544, 157867, -11159, 153594, -167765, -130572, -83639, 30872, 162435, -114659, 260567, -108146, 125713, 135865, 5714, -207950, -166005, -25467, 197582, -33010, 97162, 165398, 68652, 61897, -18703, 164366, 36543, 166751, 98606, 350105, 168055, -50855, -140986, 43176, 231465, 150203, -242272, 120163, -19206, 148922, -60290, 157058, 279497, -67466, 260605, 244882, -63169, 189922, -204378, 238083, 97826, -93760, 53150, -127324, 226762, 181360, 493472, 100058, 42781, 180594, -72413, -37949, 80236, 134672, -128132, 53990, -354890, 91052, -90922, -27268, -19803, -108711, 104618, 32053, 139978, 145668, 39878, -187972, -169037, 12213, 127307, 134807]
12015A34807o7257j2888a24335K5299j94149A28540a60117A20344h9133q7303
12005a76436A55970D4313a20333A66303J19399D4664a6292B06216c28980J64110
11995a64870A4681J54576a85622B38914p9928L8049h5432C40592h9209L7827j8554
11984f9936A28439b8375A08580c10093C35756F9747h3117a8732D62b4177n0145
11973g4322r5185j95066j6064J31097N5955C11316D8394c22108F3176G751d4077
11961a95623P4016B1912c35274b4196B27661b22868h4901B8975L42423i3229L4408
11950e8821B09544h3566I2319J0666b5781k27613A5192Q8196M7184a29509A98495
11938b0318l5561p6368I5496a10847B1320i4332J3026q6773o5438I2084a2789
$$ y = [134807, 67550, 54662, -124335, -99036, -293185, 128540, -160117, 120344, -89133, -176436, 155970, 44313, -120333, 166303, 285702, 44664, -16292, 206216, -328980, -164870, 14681, 169257, -185622, 238914, 158986, 197035, -85432, 340592, -89209, -51382, -69936, 128439, -28375, 108580, -310093, 335756, 69747, -83117, -18732, 462, -24177, -74322, -169507, -364573, -380637, -249540, -193585, 311316, 48394, -322108, 63176, 7751, -44077, -195623, -121607, 21912, -335274, -24196, 227661, -222868, -84901, 28975, 371398, -93229, -58821, 209544, -83566, 92319, 102985, -25781, -253394, 15192, 103388, 150572, -129509, 198495, -20318, -55879, -132247, 95496, -110847, 21320, -94332, -81306, -168079, -233517, 92084, -12789]
11926f4574G0555L5674d55648h5452N604j02970P5759A50294a07800l52940A7560
11914b25728j21988a40792e8645G715e3421F3385j376f860n9187C587O0349K52104
11902C16040a19383A9952a0871G022g1911B25334F9571c33400i4091B50873c9341
11890a23415A76650i3502A52232D7077J35044e9114n4595n0636l9883j28714e8677
11878b8512A57163A9188b9432A15749a85978F1562b8692A85017c50297c900k39481
11867b43381m3200H4409a86580k61067h552A2097a43353k00299M9865A27832J61089
11856B88921q7031F9255g5199b420j79699H8568c3998k0523r1301C32421d786
11844b08653m0863A02923M2227H830f283j42559g985G0259A2180K67313D6957
$$ y = [-64574, 70555, 106229, -455648, -85452, -79848, -182818, -107059, 150294, -107800, -460740, 17560, -225728, -347716, -140792, -58645, 7715, -53421, 63385, 62009, -6860, -66047, 3587, 63936, 316040, -119383, 19952, -10871, 7022, -71911, 225334, 69571, -333400, -94091, 250873, -39341, -123415, 176650, -93502, 152232, 47077, 182121, -59114, -113709, -164345, -204228, -332942, -58677, -28512, 157163, 19188, -29432, 115749, -185978, 61562, -28692, 185017, -350297, -3900, -243381, -286581, 84409, -186580, -447647, -8552, 12097, -143353, -343652, -293787, 127832, 288921, 201890, 69255, -75199, -2420, -182119, 88568, -33998, -54521, -145822, 332421, -4786, -208653, -249516, 102923, 145150, 8830, -6283, -148842, -7985, 70259, 12180, 279493, 46957]
11832a74066K5770n8796A74016A5506J05323a54404A03649P2701D1333c14241
11821A9698a18647A17670J55804a96734j90893e7322C1944b30753k06757B9316
11810f6986m06947d0506J9853k25049B33175b55405j73118a11384j19227c9419
11799b28218d4971q6032B3583K42536c20835R8270B3472c20228A33733a84054
11788a00104A46882F3354d7185N630C4808g1199R979q4689a8863A70203E0209
11776f443j96369B28417j00776j4092M5303o7909i5856G8474j3932B8782L1784
11765F0566b73982J24972c44k90503B42162M3002A14555A091J79888L3155i3325
11753b73869B52097b48331A32635e756j303j78180A35239h1487j16995Q129e962
$$ y = [-174066, -148296, -207092, 174016, 15506, 120829, -154404, 103649, 176350, 41333, -314241, 19698, -118647, 117670, 273474, -196734, -387627, -57322, 31944, -230753, -437510, 29316, -66986, -473933, -40506, -20653, -245702, 233175, -255405, -428523, -111384, -230611, -39419, -228218, -44971, -131003, 23583, 266119, -320835, -222565, 23472, -320228, 133733, -184054, -100104, 146882, 63354, -47185, -41555, 34808, -71199, -61220, -145909, -18863, 170203, 50209, -6443, -202812, 228417, 127641, 113549, 158852, 90943, -95856, 78474, 64542, 28782, 60566, -273982, -149010, -344, -290847, 242162, 285164, 114555, 1091, 180979, 214134, -93325, -273869, 252097, -248331, 132635, -5756, -7059, -185239, 135239, -81487, -198482, -190353, -5962]
11741g473A31367a31899G8462C599b59567J8546f9048l85097a77433a9389j01445
11730a20834q6955A60445D6208b7998G5605A0723L23032B2536c40217I9549L9812
11719A39361f0613J0422H5915J1137b24455e6639F2792J85340F9461K37231A48408
11707a83497A22065K0095b8762j9687a9956A17857M5024b04281j39584C1802a02871
11695a45828A38853d8202k69158a50737C21701A20909E5793K17764A8062K07805
11685B25867a93777B53173L8404K37341E3150a99622A68373E7140d02419K4279
11675c78140B10717b01038L6816B20710a22179E249g6407m0294J4428k47895a3710
11663e2345B32062i956A53089c0468D6192a02155A04491K556J20677e9459q1488
$$ y = [-7473, 131367, -131899, 78462, 3599, -259567, -241021, -69048, -454145, -177433, -19389, -120834, -207789, 160445, 46208, -27998, 75605, 10723, 333755, 22536, -340217, 99549, 139361, -60613, -50191, 85915, 97052, -224455, -56639, 62792, 248132, 69461, 306692, 148408, -183497, 122065, 142160, -28762, -48449, -19956, 117857, 162881, -204281, -343865, 31802, -102871, -145828, 138853, -48202, -317360, -150737, 321701, 120909, 55793, 273557, 18062, 225867, -193777, 253173, 291577, 528918, 53150, -199622, 168373, 57140, -402419, -378140, 210717, -201038, -164222, 220710, -122179, 5249, -76407, -116701, -102273, -350168, -13710, -52345, 232062, -9956, 153089, -30468, 46192, -102155, 104491, 107047, 227724, -59459, -140947]
11652a40947B04819a972A10316a95031A06621a5059A14316K67676i2520p4777
11642a67297f0501q8345A32426J31347I3061L52362k14856a15135j4077j76919
11632c06131Q7707H1267J08453a9979A38128n2999J13594f2440A98011E4160a5351
11620d795k71096L7891I9155r239f9012G4473a11129j36269H4953A3361a32314
11608b06476I8146C4672b95928o2075N1092a34385b1514Q308k83234B3216K08295
11597B31511P5722r5887a24532F1047O5262n9331R9281a76182N2620A7914K2364
11586D0278f03455C49580j37378J311g7691F1690J01107F9437B4197J59125a21117
11574a3572B5895J36867c71208R0999A90473k1623a69636A31151a2992n22588
$$ y = [-140947, 204819, -1972, 110316, -195031, 106621, -15059, 114316, 381992, -92520, -167297, -60501, -148846, 132426, 263773, 93061, 445423, 230567, -115135, -129212, -306131, -218424, 81267, 189720, -19979, 138128, 85129, 198723, -62440, 198011, 54160, -15351, -4795, -275891, -238000, 99155, 89916, -69012, 74473, -111129, -247398, 84953, 13361, -132314, -206476, 98146, 34672, -295928, -358003, -306911, -134385, -21514, -13206, -296440, 23216, 231511, 307233, 211346, -124532, 61047, 126309, 66978, 166259, -176182, -123562, 17914, 40278, -603455, 349580, 212202, 213513, -77691, 61690, 162797, 69437, 24197, 183322, -121117, -13572, 25895, 162762, -371208, -280209, 190473, 168850, -169636, 131151, -12992, -535580]
11564e35580D16986A82487c13582G3085f2832n4068H6418B6549J05275J02621
11554B34445d5487A40652J12396b00879E0210a46465H8743b3521r4731A89600
11543c6135C0688J46101J4157n8386a05828B87022d2802a3260A29432J31009j26417
11532A34024i9009B70036b58257O5302B2601c26683G104a13887o4538D88159b4160
11520A25192P6167r0634a25678p4528G3817a25248B56143A27093b3227j69397
11510a92624A63957k8005e8454B78064h3872a564A16331A4530J27587J22371d31012
11498D8204M9873K27639d5110I5054J82896E2658R7141J42967l292A11526K24203
11487C35729a50689l2775L1700A66694m92o9979f0571I4489D5427a21352A71759
$$ y = [-535580, 416986, 182487, -313582, 73085, -62832, -116900, 86418, 26549, 131824, 234445, -45487, 140652, 253048, -200879, 50210, -146465, 88743, -23521, -118252, 189600, -36135, 30688, 176789, 190946, 132560, -105828, 287022, -42802, -13260, 129432, 260441, 134024, -99009, 270036, -258257, -192955, 22601, -326683, 7104, -113887, -178425, 488159, -24160, 125192, 201359, 110725, -125678, -200206, 73817, -125248, 256143, 127093, -23227, -192624, 163957, 135952, -58454, 278064, -83872, -1564, 116331, 14530, 142117, 264488, -431012, 48204, 98077, 325716, -45110, 95054, 277950, 52658, 149799, 292766, 289474, 111526, 335729, -150689, -183464, -151764, 166694, 166202, 96223, -60571, 94489, 45427, -121352, 171759]
11475A93976J72235H3641E772L71644F7163P1993l4200Q2121L7039J45315F9801
11463d2848C08377j20264J31530E7908J9413e0995A74224O3313F8583J90437j22859
11452A36161b22766D24973e9591q0489B89859H2685K50594I0463b48366E2438
11441A02453Q4672D8197L45647H5287a00988A23012F0044c2070A5137j065M8290
11430F2362B7014a11672c9581k1986j91868f5287a7712j06122C57219a22862c5466
11418B14232e7170B06139b91310C8090a78129A44094a02352e0775E1107Q8725
11408A39832i4952B83304E8153B3296L6093b43442f9836A85404L9110a43570m7012
11397a90582d1425E8491K94332A47475F8753h9437A04061k6904g6263l56719A57424
$$ y = [193976, 366211, 83641, 5772, 377416, 67163, 139156, 104956, 187077, 224116, 369431, 69801, -42848, 308377, 188113, 319643, 57908, 77321, -50995, 174224, 237537, 68583, 259020, 136161, -222766, 424973, -59591, -140080, 289859, 82685, 333279, 90463, -248366, 52438, 102453, 187125, 48197, 393844, 85287, -100988, 123012, 60044, -32070, 15137, 14072, 62362, 27014, -111672, -39581, -61567, -253435, -65287, -17712, -123834, 357219, -122862, -35466, 214232, -57170, 206139, -291310, 38090, -178129, 144094, -102352, -50775, 51107, 139832, -94952, 283304, 58153, 23296, 59389, -243442, -69836, 185404, 224514, -143570, -190582, -41425, 58491, 352823, 147475, 68753, -89437, 104061, 77157, -76263, -432982, 157424]
11385B3652e46947a8160L236A68085c0752A99104b88078J41217G9724C7761b9484
11373E17531a96571I3191K18331A02598A1916a65801M7228m3932j43490B39790
11362i5801A1608L40100c94963g3715J6708m0332c6876q1358F1468J08038l8907
11351A30599A7209K17268C5461a21940j94160a40269gj9383I3630d8932E4354
11339a16284m15164a19216C280a36131j51897E4089a0482B09062e8724q4027A20189
11327B06424H4606a38736j3854d9580j36730O3065N9462j27787k21175c0522a2961
11315a37372G1074L2557L9056B3984c09686J50851B90524b43053j68007a24540
11304g0264r0855b4319l71984e4542A35418B0611d8859B94537A06753a96057a608
$$ y = [23652, -546947, -18160, -14924, 168085, -30752, 199104, -288078, -146861, 79724, 37761, -29484, 517531, -196571, 93191, 311522, 102598, 11916, -165801, -118573, -162505, -305995, 239790, -95801, 11608, 351708, -394963, -73715, -57007, -97339, -36876, -118234, 61468, 169506, 130599, 17209, 234477, 35461, -121940, -316100, -140269, -7, -19390, 93630, -48932, 54354, -116284, -531448, -119216, 3280, -136131, -288028, 54089, -10482, 209062, -58724, -142751, 120189, 206424, 84606, -138736, -152590, -49580, -186310, -123245, -63783, -191570, -412745, -30522, -12961, -137372, 71074, 103631, 142687, 23984, -309686, -158835, 290524, -243053, -411060, -124540, -70264, -161119, -24319, -396303, -54542, 135418, 20611, -48859, 294537, 106753, -196057, -1608]
11292A40164o8142a17560M5278l75602e2943k00122Q5778L101M876e5880k66459
11281c22339A55340c20039B09010b00216m4821m6119B24090a32405A42797a89953
11270a5967A9999i9973A95877a98486A38702b24175F8591f8388k4623l3381p82598
11259i08990a51964B83100a93690c2644A30490b76k26842a3361l47227a36883
11248g0324j03953A50670a37661F0760c8364m6994L1632r3249B21666a92271A40644
11236b03927P0786M8182h361k22577k1289G845a2991B46525r7437d1088j43608
11225a84696A49531G3671j7139a8303l54602R6536B71031b23923e2605k01304
11215b53909a14q7451B63927A14247b8540A07100b66321A10718a09859E26023
$$ y = [140164, 72022, -117560, -72282, -447884, -52943, -253065, -167287, -164186, -159310, -55880, -322339, 155340, -320039, 209010, -200216, -245037, -291156, 224090, -132405, 142797, -189953, -15967, 19999, -99973, 195877, -198486, 138702, -224175, 68591, -68388, -93011, -126392, -908990, -151964, 283100, -193690, -32644, 130490, -276, -227118, -13361, -360588, -136883, -70324, -174277, 150670, -137661, 60760, -38364, -85358, -53726, -146975, 221666, -192271, 140644, -203927, -133141, -84959, -8361, -230938, -252227, 7845, -12991, 246525, 149088, -41088, -184696, 149531, 73671, 56532, -18303, -372905, -276369, 271031, -223923, -52605, -253909, -114, -87565, 263927, 114247, -28540, 107100, -266321, 110718, -109859, 526023]
11204G9121a65885j53991e9787D7911a54336A98877D6605L013J25010e8316n1886
11193a10202c2313j98844A10255C4890c19906j42719a92315A12655J7746a45206
11182c4287F3807a99626h9024K7669p0198A12965a42463M8179k98917a14506M1660
11171g2846K5173B41234D667f2805A24755A1617M1810j2207b21642h9932a1774
11159a30646E4438r309a44473b1696A8010K24811o5272k7952i5778A16744J99964
11148C16708D5401a54463q3377D074P9734a85894g9450B23376g9633q6399d6268
11136F6740b43353A09686a40381J4774A21168a00867H3004J8130b96027N9823
11126b36204b554G4672J02740d7590L043D0118K0316R9147M9028H0328k9042J09574
$$ y = [79121, -165885, -319876, -59787, 47911, -154336, 198877, 46605, 49618, 174628, -58316, -110202, -32313, -231157, 110255, 34890, -319906, -462625, -192315, 112655, 130401, -145206, -34287, 63807, -199626, -89024, -61355, -131553, 112965, -142463, -94284, -393201, -114506, -72846, -47673, 241234, 4667, -62805, 124755, 11617, 53427, 41220, -221642, -89932, -11774, -130646, 54438, 45129, -144473, -21696, 18010, 242821, 177549, 149597, -95778, 116744, 316708, 45401, -154463, -237840, 4074, 83808, -185894, -79450, 223376, -79633, -166032, -46268, 66740, -243353, 109686, -140381, -125607, 121168, -100867, 83004, 101134, -296027, -236204, -2554, 74672, 177412, -47590, -44547, 40118, 60434, 159581, 208609, 80328, 51286, 160860]
11114A60860l3896J23459D3458d9880j80029k6137A87433a75469B20787r8877
11104A21910K8760a66784D91061h2095E7204K25614J32040I8936Q7657E8550R404
11093F7954L53836q1450D1150e283A46219J38250i9748F6826K66268j18959J22319
11082C36454B3038Q8080O3931L4751Q4445r3224K16188J08481j34892j06384C0361
11070F0316M55866k15249N6573k0171F8705K47616O997j00434J36585q0597N2865
11059C31737p7344J58182C0870M37856q3458K13111J65876J7915l71698r2975
11049C17497N20577k6138M5282j79759O6914J37765p3201k4646k55102M70640
11039I99829l20756n6563O8225j5618M97213E61691O5723J92404O5934j79578
$$ y = [160860, 126964, 250423, 43458, -49880, -229909, -256046, 187433, -175469, 220787, 121910, 150670, -166784, 491061, -82095, 57204, 282818, 414858, 98936, 186593, 58550, 67954, 421790, 340340, 41150, -5283, 146219, 284469, -99748, 66826, 333094, 214135, 336454, 23038, 111118, 175049, 209800, 294245, 201021, 417209, 525690, 390798, 284414, 30361, 60316, 516182, 300933, 357506, 337335, 68705, 316321, 323318, 222884, 359469, 278872, 331737, 254393, 412575, 30870, 468726, 385268, 598379, 764255, 782170, 410472, 317497, 838074, 811936, 857218, 677459, 744373, 882138, 808937, 784291, 529189, 999829, 679073, 622510, 690735, 675117, 1172330, 561691, 627414, 819818, 885752, 706174]
11029G06174Q8030m5825R8930l33799J79714k73743R2626K19718o8924L43054
11019A005955k68289k3887k99966K94565k61509K13399k2611n3296L6133L329
11009F23823O4608j45898J34113p6797R3923k38750P8480K71146j4842j43718
10999F46088k83459K32873o4099J91022k11613J70816B72282N83961J66266j02658
10989I19851m39522j49128L35807K02366j99149k541J62458j46533J89396j00413
10979G72592L24339K30580j51001j6377o4877K84692L75925q6429K71420P9924
10969B020788M11341R4613L36814J40132K16041l29422J22867j92351q09389m86468
10959A524966Q2040q8230l38884o1126L16458m38440N39206l36148q5631p0745
$$ y = [706174, 794204, 748379, 847309, 513510, 693224, 419481, 512107, 731825, 662901, 1005955, 737666, 713779, 413813, 708378, 446869, 660268, 637657, 584361, 620494, 623823, 688431, 542533, 676646, 599849, 693772, 455022, 533502, 804648, 789806, 646088, 362629, 595502, 531403, 722425, 510812, 681628, 272282, 856243, 1022509, 919851, 480329, 331201, 667008, 869374, 670225, 667684, 830142, 683609, 873005, 772592, 1096931, 1327511, 1176510, 1160133, 1095256, 1379948, 1755873, 1669444, 1940864, 2020788, 2432129, 2526742, 2863556, 3003688, 3219729, 2890307, 3013174, 2820823, 2011434, 1524966, 1607006, 1518776, 1179892, 1118766, 1435224, 996784, 1535990, 1199842, 1114211, 1043466]
10949A043466k10406j60039n1744B82332M44286A89997K38408j15081l2605J47745
10939D28464c16627Q6191I5219a12480N0261E4011O4074B4014R4264N5786L8964
10928B13028b90718j23049R8726h5482D7874J0857J74188O605e8989K2719C9812
10916G3558K14147A15492j7038J77061K7824A43335n5922m0512O670J6285h8974
10904a701A39322g6500C00603j27053O6043C9867a19864m0499G312Q3936e6538
10892a4088q6242p382M305A82614a04975C1883J04293b31888q3128D01411A76236
10880F72697b54916J7870p0579m7044J44544b5210j48972L5686f3028B21761f6813
10868b22533A67243a61646G4375J06393Q5377j07385h2609l734o969C64415a59321
$$ y = [1043466, 833060, 673021, 621277, 282332, 726618, 189997, 428405, 313324, 280719, 428464, -316627, -230436, 95219, -112480, -62219, 54011, 118085, 24014, 118278, 174064, 213028, -290718, -413767, -315041, -85482, 47874, 58731, 232919, 239524, -58989, -36270, 39812, 73558, 287705, 115492, 98454, 275515, 303339, 143335, 87413, 46901, 53571, 69856, -88974, -1701, 139322, -76500, 300603, 173550, 239593, 39867, -119864, -160363, 7312, 91248, -56538, -14088, -100330, -107712, -103407, 182614, -104975, 31883, 136176, -231888, -315016, 401411, 176236, 672697, -254916, -237046, -307625, -354669, -210125, -25210, -174182, -138496, -63028, 221761, -66813, -222533, 167243, -161646, 74375, 180768, 266145, 158760, -82609, -86343, -93312, 364415, -159321]
10856g701k57521F8226R0789A092K20305A7581Q8678a65959B8150b61178I4886
10844i9062I89J05542d6935j28547B72K28661k1176b79469F1364b01690L4602
10833a67088E6799K03765A18378a21316B90689r1626m7053C5216K6907d96797
10822B61839q931l1695r5611C6398A7503P7924a62980k454D11461b3229k31978
10811b55207R4797C7880K38982a69333A18807a96135L0281A97973a6455I1332
10800i6954j42840D398a87333A52741C2850a31178f3694K0205E2433a47213K1729
10789a25484A49716a08383M8136j94664R1072R260I63O5325J32339a5933j88226
10778b04159n2442d8511j61829B85446b67166r2799e1571A74812F6776r803a45344
$$ y = [-7701, -265222, 68226, 159015, 1092, 221397, 17581, 106259, -165959, 28150, -261178, 94886, -99062, 989, 106531, -46935, -175482, 272, 228933, 207757, -279469, 61364, -201690, -167088, 56799, 260564, 118378, -121316, 290689, 199063, 152010, 35216, 62123, -496797, 261839, 252908, 221213, 125602, 36398, 17503, 95427, -162980, -165434, 411461, -23229, -255207, -160410, 37880, 276862, -169333, 118807, -196135, -165854, 197973, -16455, 91332, -96954, -239794, 4398, -187333, 152741, 32850, -131178, -63694, -43489, 52433, -147213, -125484, 149716, -108383, -60247, -254911, -163839, -154579, 963, 66288, 198627, -15933, -204159, -256601, -48511, -210340, 285446, -267166, -359965, -51571, 174812, 66776, 56973, -145344]
10766B48688A6020a83997a3948m80026a9928A2307a16913K6271B26577B2237e66100
10754B3821b05808i2219c2984l94929i7200k16101B1579J04195b04015g7965l54916
10743d32881a75032F8752a22020e0170j33402n4750B3419Q4955K08521a55340
10732a35084e8914k18101J08875C9297c2707j64785G6965M0552C0664b79349J5570
10721b63779J09303A54277F0613j9186a75402C1883a80168n829M5681o7027c7563
10709a01235k48530A11799M2278K2136D98b10100A73061A731J39692a28855k60645
10698c89500a50274B19246o2755d8872C0442b85295R1515K855j841A3390a0453
10686B31351b47712a22406A16852c81513d3607j08088q6320D4741A7030a98028
$$ y = [248688, 16020, -183997, -13948, -493974, -19928, 12307, -116913, -90642, 226577, 22237, -566100, 23821, -205808, -92219, -32984, -427913, -97200, -313301, 21579, 125774, -204015, -77965, -432881, -175032, 68752, -122020, -50170, -183572, -238322, 23419, 108374, 316895, -155340, -135084, -58914, -277015, -168140, 39297, -32707, -197492, 76965, 117517, 30664, -279349, -263779, -154476, 154277, 60613, 41427, -175402, 31883, -180168, -185997, -140316, -207343, -37563, -101235, -349765, 111799, 154077, 176213, 498, -210100, 173061, 1731, 141423, -128855, -389500, -150274, 219246, 156491, -48872, 30442, -285295, -193780, -190925, -192766, 13390, -10453, 231351, -247712, -122406, 116852, -381513, -43607, -151695, -238015, 44741, 17030, -198028]
10675d21992D4480J25160g0831B3532a99066B26823j07045d78417J92356A60761
10664b1637A84616d9283A92901c6630l0386A3198J88141b52192a1240A10950c4715
10652f7647D102J31091J20118b17383a08636A02502a52521A34041a34342N9016
10642g5326R706m4130l6058c6415l1887l21230a88324Q6291M6985j84305g0923
10630E9018b13198d7885l29951B30892b55064A30836c2473B30138b4417A89458
10619f710o2740A1529a15991A17409C4605d21422c4980a6881I6104M1039b76378
10607d15781A02498a08270A2739J15521e0693A60052Q189a7575n171k93799L6309
10596b80236D2482a70449L7787A23504A0514a20419l8651e7490j26177l48853
$$ y = [-421992, 44480, 169640, -70831, 23532, -199066, 226823, 119778, -478417, -286061, 160761, -21637, 184616, -49283, 192901, -36630, -67016, 13198, 201339, -252192, -11240, 110950, -34715, -67647, 4102, 135193, 255311, -217383, -108636, 102502, -152521, 134041, -134342, -75326, -65620, -109750, -145808, -36415, -68302, -389532, -188324, -102033, -55048, -239353, -70923, 59018, -213198, -47885, -377836, 230892, -255064, 130836, -32473, 230138, -24417, 189458, -6710, -69450, 11529, -115991, 117409, 34605, -421422, -34980, -16881, 96104, 137143, -276378, -415781, 102498, -108270, 12739, 128260, -50693, 160052, 168241, -17575, -22746, -316545, -280236, 42482, -170449, -132662, 123504, 10514, -120419, -159070, -57490, -183667, -532520]
10586e32520a43687g1441A7606M16366i3482C04611p6236d87018A63841q1416
10576H2425j1547a36336H8279b64774m6299G7698b24664G3470i1094C9534b12537
10564B4536a02506j1295G3901R3345G0055J8841R9360M1404i2874e112l48342
10553c53454J24498f6572o8327B8287m536K217i0796J0482b0199B24972b95506
10541b37139I3048a47848p879k9759C95630a03119j02005A0793b07852B50522
10530B59544L4991b03266M5050A38122c967l3065j69953F4708b8940F1905J22471
10519A84376D9335b65259A78700a33726N7983A39241b39226A01810a61980b5504
10508b3407k8601k57258I5964i0321j62570b0899m39991A13269b21723A40678
$$ y = [-532520, -143687, -71441, 17606, 433972, -93482, 304611, 228375, -487018, 163841, 82425, 70878, -136336, 88279, -264774, -311073, 77698, -224664, 73470, -91094, 39534, -212537, 24536, -102506, -113801, 73901, 167246, 70055, 88896, 188256, 229660, -92874, -5112, -353454, -228956, -66572, -134899, 28287, 23751, 25968, -90796, -80314, -20199, 224972, -295506, -237139, 93048, -147848, -155727, -185486, 395630, -103119, -205124, 10793, -207852, 250522, 259544, 294535, -203266, -158216, 138122, -3967, -37032, -206985, 64708, -28940, 61905, 184376, 49335, -265259, 178700, -133726, -75743, 139241, -239226, 101810, -161980, -25504, -23407, -52008, -309266, 95964, -90321, -252891, -20899, -460890, 113269, -221723, 140678]
10497a33398J6903b0786G2493G128O2099a0517C41429e9297p2037N393N7313A13804
10484a88542M5327o3259B13411c31004a15418L5295A78753J42471A05628J79708
10474B85336H1506J78031o7255j1952J2028g2356Q256A11688L4086K112F406N8156
10462F4562k5142K6560b47069A12612B0984N8503k5723J98963r6843E7219a8441
10450H5165a3021j5363A55785a39021e6363A42099c08957B4514K01502H5427K09451
10439B94878a13512A52265a58052k0989e0963J6278j14552A51298a26451e4101
10428b25164A92069c27789c7238B80743a48015l34880i4965q759k62419a7060
10417a07898n042k60053A52802D8999h9772l77371J88023I215Q974J4432O8291
$$ y = [-133398, -116495, -20786, 72493, 7128, 69227, -10517, 341429, -59297, -131334, -125941, -68628, 113804, -188542, -143215, -206474, 213411, -331004, -115418, -80123, 178753, 321224, 105628, 285336, 81506, 259537, 192282, 180330, 192358, -72356, -64100, 111688, 145774, 147886, 6406, 64562, 39420, 65980, -247069, 112612, 20984, 79487, 53764, 252727, 155884, 57219, -18441, 85165, -13021, -28384, 155785, -139021, -56363, 142099, -308957, 24514, 226016, 85427, 294878, -113512, 152265, -158052, -179041, -50963, -34685, -149237, 151298, -126451, -54101, -225164, 192069, -327789, -37238, 280743, -148015, -482895, -94965, -103724, -366143, -17060, -107898, -112940, -372993, 152802, 48999, -89772, -467143, -279120, 9215, 18189, 32621, 100912]
10406A00912Q827a42882e3695k8524K4720k90614A16810h3716D8527a86837A49625
10394e0336k34956b0174j16036A9658J05898J4719O8359A04174A8488L15779b9821
10382A67237K29265A74823b20878G5416K58659C6294M64036A09485J47438J13707
10372C70630A82387J95474F8267L51856o0887n2145M7460j71064O5788J5262A28207
10360C07750j41979O6595J4093q3689k7042J75171A30137b91612C81320f637E10540
10348D44872A78904M47941K49380m27110A98580K26046p3120l0830J55974j82323
10338B94327A12746J09788j6017R2742r693j10923i3823B14476l2772J16247a78441
10326I7501J71529E1613b25252B99066c26948c528A58539J05845C8981K76373
$$ y = [100912, 109739, -142882, -53695, -82219, -57499, -348113, 116810, -83716, 48527, -186837, 149625, -50336, -285292, -20174, -136210, 19658, 125556, 140275, 208634, 104174, 18488, 334267, -29821, 167237, 396502, 174823, -220878, 75416, 334075, 36294, 500330, 109485, 256923, 370630, 182387, 377861, 68267, 420123, 359236, 307091, 354551, 183487, 249275, 264537, 128207, 307750, 165771, 232366, 246459, 162770, 135728, 310899, 130137, -291612, 381320, -6637, 510540, 444872, 178904, 626845, 876225, 449115, 198580, 424626, 351506, 320676, 476650, 294327, 112746, 222534, 206517, 299259, 289566, 178643, -93823, 214476, 181704, 297951, -178441, 97501, 269030, 51613, -225252, 299066, -326948, -3528, 158539, 264384, 38981, 315354]
10316C15354r8986D5410g8134A4682h1660C6402a12937l4635e2859h275A90366
10304A42646b26737A84605k8391k5023f214l3965k01897A61325a11214A71906
10293B09633r8352i4668c3459B1361a05963L251j1007L6308n6276j85491B73453
10281d0289k28734A69731K4488O3292a33177c481C67582a15573j96114m4826B38497
10269G451a16683b7582j4970A80329a51311E3263e4276l10430I3828a14217B29065
10257e16710K50029B27173E8820J54616J83167a51744A33038J95160C0021a82364
10246I6799J06373F6911c0180B04948a02056q9691B33632e8899k6055j90267H3358
10234a68509J2777F6860B7603b0798q3506l6098f3355k7277C63380h7405m536
$$ y = [315354, 216368, 45410, -78134, 14682, -81660, 36402, -112937, -147572, -52859, -8275, 190366, 142646, -226737, 184605, 156214, 131191, -6214, -40179, -242076, 161325, -111214, 171906, 209633, 111281, -94668, -33459, 21361, -105963, -102712, -113719, -77411, -133687, -319178, 273453, -40289, -269023, 169731, 194219, 257511, -133177, -3481, 367582, -115573, -311687, -356513, 238497, 7451, -116683, -27582, -42552, 180329, -151311, 53263, -54276, -364706, 93828, -114217, 229065, -516710, -266681, 227173, 58820, 213436, 396603, -151744, 133038, 328198, 30021, -182364, 96799, 203172, 66911, -30180, 204948, -102056, -191747, 233632, -58899, -84954, -275221, 83358, -168509, -155732, 66860, 27603, -20798, -104304, -140402, -63355, -90632, 363380, -87405, -91941]
10223i1941d5297p5984k0061j85594h2966k03253I0105a6490l26758A67013a35376
10211b47077P7297F9081N2074a86965E8461e6128A67300a4060j50603k54577a17316
10199a55338L1062B09597a54625c2409C7469c5237q7909N0743l00807A79390d4668
10187c3910D3218b94471C3856P7157J70878A25795A3979b82280g0811n4661A00629
10175A10845A3926a56706H3286k9465a20685k70455a21009A1844a68950j82611
10165c51561d8128A1792b5324A40661b49902c1327k4332B08954m3229b1293E7039
10153B85486h3207r2462j82436e7203l24128a01916j06416d187k73168J21582
10143a55773C6909K2909a31856j03892F8429g1541C7861a61443c338q2749k56649
$$ y = [-91941, -45297, -121281, -141342, -326936, -82966, -286219, 90105, -16490, -343248, 167013, -135376, -247077, -169780, 69081, 121155, -186965, 58461, -56128, 167300, -14060, -164663, -419240, -117316, -155338, -124276, 209597, -154625, -32409, 37469, -35237, -123146, -72403, -373210, 179390, -44668, -33910, 43218, -294471, 33856, 111013, 281891, 125795, 13979, -282280, -70811, -125472, 100629, 110845, 13926, -156706, 83286, 53821, -120685, -391140, -121009, 11844, -168950, -351561, -48128, 11792, -25324, 140661, -249902, -31327, -55659, 208954, 165725, -21293, 57039, 285486, -83207, -175669, -358105, -57203, -381331, -101916, -208332, -4187, -277355, -155773, 36909, 59818, -131856, -235748, 68429, -71541, 37861, -161443, -3338, -86087, -342736]
10132c42736f0054J6128k3662j95493G221g5258k10022R7359K7291a2726k01490
10121b14216a1974j32318D7833J15828a72824m5007B02366B8895b59623M0178
10111b19445f8593A13136d3154N986A51h0980F3507b37472A0929d4224D6912p885
10099C9027a29315D1376J41337b53948C0271a79615B17643b05066a9849A75368
10088a28614j27234O278A28665A4991e8879o9341j71575a15055j13020b9799A94858
10076H5408a03316o1178Q2235b9836A09248K34301j0145b10254N8820m5457N4988
10065a41903B42716C3820a01972C15308a85015j02595L084a41309C37269F2606
10054A20141a02238B30438E3655g9502C2381b49952B6906b35059F6653b9798B23278
$$ y = [-342736, -60054, -43926, -67588, -263081, 7221, -75258, -285280, -187921, -160630, -12726, -214216, -11974, -144292, 47833, 163661, -172824, -217831, 202366, 28895, -259623, -219445, -68593, 113136, -43154, -37168, 151, -80980, 63507, -237472, 10929, -44224, 46912, 39027, -129315, 41376, 182713, -253948, 30271, -179615, 217643, -205066, -19849, 175368, -128614, -255848, -249570, 128665, 14991, -58879, -128220, -299795, -115055, -228075, -29799, 194858, 85408, -103316, -164494, -82259, -29836, 109248, 343549, 333404, -210254, -151434, -196891, -141903, 242716, 33820, -101972, 315308, -185015, -287610, -284526, -141309, 337269, 62606, 120141, -102238, 230438, 53655, -79502, 32381, -249952, 26906, -235059, 66653, -29798, 223278]
10042a77841Q405c910H1245J9011c05442l288A92800e2950P072K1595B90551g0099
10029b16722C5299b62713a10062j11888f4205f747n6754a3649k2849A48969o0475
10018H8494I83R3568c2699J1952q9286C9289K83703a39684G9876a32788A14253
10006c71624a22213l0450B1305M4154k2078i0784H4909a01148C40962c58141g8710
9994C2662a04422j50716A87401q4919a49179j59023B01029b84417g9384k2217
9984a01601j93077G8643a88580K7486o2608E5956b2121j65570O4667j6710A63403
9972A48609E8733b78673C4042o773a13902L9933D7571O7471c3128j23852C8842
9960b60039f9158b0429A58553E3224b92946B6500J7715a83946A13386D9084f8935
$$ y = [-177841, -169436, -3910, 81245, 100256, -305442, -308730, 192800, -52950, -45878, -24283, 290551, -70099, -216722, 35299, -262713, -110062, -221950, -64205, -6747, -63501, -13649, -36498, 148969, 88494, 983, 94551, -32699, -20747, -110033, 39289, 322992, -139684, 79876, -132788, 114253, -371624, -122213, -152663, 21305, 65459, 43381, -90784, 84909, -101148, 340962, -358141, -78710, 32662, -104422, -255138, 187401, 102482, -149179, -308202, 201029, -284417, -79384, -101601, -294678, 78643, -188580, -161094, -223702, 55956, -22121, -187691, -123024, -139734, 163403, 148609, 58733, -278673, 34042, 27269, -113902, -73969, 47571, 115042, -33128, -156980, 38842, -260039, -69158, -20429, 158553, 53224, -292946, 26500, 44215, -183946, 113386, 49084, -68935]
9948b86901J17226N7854F5229a45877C45217a67571e3060C5362d62436B4751a04023
9936a2258k61430J07013A14100g8947E1101P3785a58840e1138j93918j42690a71171
9924d2915E531a58704J3559K4149k08693N0451a35442k85937g7087A88131r1506
9913I6625l4594b07221Q3070n2536c4099B7839a80951B97062d24283i1996k89111
9902c81107f1057G481b54165J25245Q61q7536d2612B6036K51050c13291A06802
9890e602k01030P1505k54871B30835c3838B43598c3711m3347k39094E9253e5970
9878b15987K9757A7714H776J16664a23125q3520k38047A11843c71339J56637k04307
9867d19009O4484A49530a03337q0399A50678a17411D2795b01366c2006k40608
$$ y = [-286901, -169675, -111821, 65229, -145877, 345217, -167571, -53060, 35362, -462436, 24751, -104023, -12258, -273688, -166675, 114100, -78947, 51101, 124886, -158840, -51138, -245056, -387746, -171171, -42915, 5531, -158704, -145145, -120996, -329689, -279238, -135442, -421379, -77087, 188131, 96625, 62031, -207221, -124151, -176687, -34099, 27839, -180951, 297062, -424283, -91996, -381107, -61057, 7481, -254165, -128920, -128059, -215595, -42612, 26036, 277086, -313291, 106802, -5602, -206632, -135127, -389998, 230835, -33838, 243598, -33711, -77058, -316152, 59253, -55970, -215987, -186230, 17714, 8776, 125440, -123125, -206645, -444692, 111843, -371339, -214702, -419009, -354525, 149530, -103337, -183736, 150678, -117411, 42795, -201366, -32006, -272614]
9857b72614b8284l82644i9514K9680k92183h7992m2478A24391K72992b3807j89420
9846b13227r1528A45201a37030K8841a7380j4599j9211i402H9875a2146H3528
9834b27942d7795A33026B1444f6054k9318n780C38855E9763b7331B38901b55982
9822D6257b74717b804B82925a6249D3099M4466a13421B08684R4455c1609A86509
9810D7174O4677b76046E811b45733B29119c1540l1212j99923b6624k6463k51257
9799c04344J39550N6879j79626H7607a64191k45281B2618a09510j25301R7895
9789a36916d0846e174o0605A61548l9284c30407J03061b1706j20668a7175k14000
9778b31175A016d2833B54593c4713k23272A56551g9567A66643a01039C5627K8894
$$ y = [-272614, -28284, -410928, -99514, -69834, -362017, -87992, -130470, 124391, 397383, -23807, -213227, -304755, 145201, -137030, -108189, -17380, -31979, -51190, -9402, 89875, -12146, 83528, -227942, -47795, 133026, 21444, -66054, -95372, -101152, 338855, 59763, -27331, 238901, -255982, 46257, -274717, -2804, 282925, -16249, 43099, 87565, -113421, 208684, 303139, -31609, 186509, 47174, 111851, -276046, 5811, -245733, 229119, -31540, -62752, -262675, -26624, -53087, -304344, -164794, -107915, -287541, 87607, -164191, -409472, 22618, -109510, -234811, -136916, -40846, -5174, -65779, 161548, 122264, -330407, -227346, -21706, -142374, -17175, -231175, 1016, -42833, 254593, -34713, -257985, 156551, -79567, 166643, -101039, 35627, 64521]
9767F4521a66015f930B8364N6368c59891A3837d09222R8094M9484a17476A24550
9755a52705m5831A19565k8885M8717b21400J3440C47274b69132i9568B71566c36517
9743d7483J3526A73445a19787F176b08605a03859A2048d0823f583k01673P4846
9732a33410H8490J09633e8797k0725A2786c21148B24070a93043c3778j04792A37424
9720i0157E7774a13551b0043G4397c9133j42336H5542J27186c10825J50886d0644
9708a70821p6555O3159A00285e15690a80694L6793r2740D9357a38308A24663F1943
9696d35467a58867C71527H7522C2353L08322a00806j6200A6497a7733j20551B83546
9684I8360J04116c9751j68262N0089D4332N5636b9435F0074e4537j12746r1688
$$ y = [64521, -166015, -6930, 28364, 84732, -359891, 13837, -409222, -311128, -261644, -117476, 124550, -152705, -198536, 119565, 90680, 139397, -221400, -207960, 347274, -269132, -99568, 271566, -336517, -47483, -33957, 173445, -119787, 6176, -208605, -103859, 12048, -40823, -6583, -208256, -133410, 88490, 198123, -58797, -79522, 12786, -321148, 224070, -193043, -33778, -138570, 137424, -90157, 57774, -113551, -20043, 74397, -39133, -181469, 85542, 212728, -310825, -159939, -40644, -170821, -247376, -184217, 100285, -515690, -180694, -143901, -236641, 49357, -138308, 124663, 61943, -435467, -158867, 371527, 87522, 32353, 340675, -100806, -117006, 16497, -17733, -138284, 283546, 98360, 202476, -39751, -208013, -157924, 44332, 99968, -29435, 60074, -54537, -167283, -258971]
9673b58971N0103L1166G6773a24934p319j9678c5477q315L716j18693k7675Q1756
9661a04688q0797A40951f730j00613A83678a49635I1524l1733a70062I950P896
9650A7846a67823P1096j36708L5341E6022a17407B22236b73171I627b75259O6994
9639b08265L7299a442k14088C0458c25451m0113a80433O6719N992p3999q219g8152
9626C3071c54146a22366A4879J09660C3242J63866c6615A4594d44627A22856K3336
9615A46192l9596B5282J75076c0558q6143C2987a92054E878b36271E4831d37433
9603b18778d8322k15504D0583r533J3305O6315b8521A10740b64721F8769a59968
9591c27022e6095A9400i49j11022o7358B7879a42935A01613D5147j2608c0384
$$ y = [-258971, -208868, -177702, 76773, -124934, -132253, -151931, -35477, -43792, -40076, -158769, -186444, -104688, -185485, 140951, -6730, -107343, 183678, -149635, 91524, 59791, -170062, 9950, 17846, -167823, -96727, -233435, -198094, 56022, -117407, 222236, -273171, 9627, -275259, -208265, -170966, -1442, -215530, 30458, -325451, -365564, -180433, -113714, -107722, -181721, -189940, -78152, 33071, -354146, -122366, 14879, 124539, 33242, 197108, -36615, 14594, -444627, 122856, 146192, 106596, 25282, 200358, -30558, -116701, 32987, -192054, 5878, -236271, 54831, -437433, -218778, -48322, -263826, 40583, 31050, 44355, 110670, -28521, 110740, -264721, 68769, -159968, -327022, -56095, 19400, -949, -111971, -179329, 27879, -142935, 101613, 45147, 32539, -30384]
9579F3609g925C01880b04949h7597G461g0374k33562H6069i5421b034D6357b16862
9566a50832B71650b65115L2908f9795K3432k1767k66791c9281j39974b2269C7102
9554F8014a24027q1415L4115j17212M4801B53089a64771h0498j06524A63274h8147
9542C26230b19335Q6397M1067G2520a16679b1916D7592i4743A1410a15461j24195
9531b39656l9874o2060a69884c1480j57950m8601c0204j77152O4760H1672a64989
9519g9290c1090j20666a8537l0360k04410j5047a15038C42218c78805H3152a61647
9507B62505a32643H2466J94181b936B94932b87050A32679a248B15463b86010c8881
9495e8892E3978e7737p2871j96792J52753A58456N0926A01729Q8412h5382I9502
$$ y = [63609, -7925, 301880, -204949, -87597, 7461, -70374, -303936, 86069, -95421, -2034, 46357, -216862, -150832, 271650, -265115, -232207, -69795, -46363, -68130, -334921, -39281, -179255, -22269, 37102, 68014, -124027, -205442, -171327, -288539, -243738, 253089, -164771, -80498, -187022, 163274, -88147, 326230, -219335, -132938, -91871, 72520, -116679, -21916, 47592, -94743, 11410, -115461, -239656, -279530, -341590, -169884, -31480, -189430, -238031, -30204, -207356, -142596, 81672, -164989, -79290, -31090, -151756, -18537, -48897, -253307, -268354, -115038, 342218, -378805, 83152, -161647, 262505, -132643, 82466, 276647, -2936, 294932, -287050, 132679, -1248, 215463, -286010, -38881, -58892, 53978, -57737, -130608, -327400, -174647, 158456, 209382, 101729, 190141, -85382, 99502]
9483A34196b89553A0480a53041q5155h5468A83019F0754b43400L8028C3253a52551
9471A64192l1276a89316E2190c20309j7993B34347h7123A36273N5374a94927n0822
9460b45749i8161M4769B16464a63902a2326A48225L0826g4862o4898j58648R8570
9449a99838C7818a10321C9135N2913a91338p4029o875g0130A41735D8666c87697
9437c87337C01357a48343A40804A3206a78131l5196A97711r3674f3652j9175A45669
9425b71064H1525O4494d7436B58144a65842j49835E4896a21899l8616j26217f0577
9413g5397p198C0346b25372E4320K38252G8339R42a50429b9811j54936I7972d45092
9400E8531J3417B5292b3846G1660k6537b33202a3969r8091j35996Q8156A9845
$$ y = [134196, -289553, 10480, -153041, -238196, -85468, 183019, 60754, -243400, -205372, 33253, -152551, 164192, 132916, -189316, 52190, -320309, -338302, 234347, -87123, 136273, 191647, -194927, -245749, -98161, -53392, 216464, -163902, -12326, 148225, 179051, -74862, -139760, -298408, -199838, 37818, -110321, 39135, 92048, -191338, -265367, -272242, -70130, 141735, 48666, -387697, -387337, 301357, -148343, 140804, 13206, -178131, -213327, 197711, 104037, -63652, -82827, 145669, -271064, 81525, 146019, -47436, 258144, -165842, -315677, 54896, -121899, -160515, -286732, -60577, -75397, -82595, 30346, -225372, 54320, 292572, 78339, 79281, -150429, -29811, -184747, 97972, -445092, 58531, 71948, 25292, -23846, 71660, 45123, -233202, -13969, -112060, -248056, -159900, 19845]
9388a13171a4319j98513p2026M8828A113N2317b30716g0333E2896a98644I4293
9376i1971A22965d8972j26048A03881d1723D7111a41975c7798a1686l026j6787
9365c1499m8637j06529B13257a98313K1531j67561e7526B00588c3737F443b0185
9353B33713a87856j49347A61998a3814l54119B05684a91110E6311L2534a99557
9342D880a32020B4043d80519K11745J8650B67325m7503e7243A47837J68575b86410
9330A14180b11020m050q3200J30334B5377f1208k5729l15311J60992j2205J09613
9319a43848A07566J21840b56356I733K84542c74678b4682B416b96471A22810a74315
9307d9691k38015d0034a963E8603c47666f2509D4638F870K72368a28655d3317
$$ y = [-113171, -14319, -212832, -284858, -236030, 1113, 53430, -230716, -70333, 52896, -198644, 94293, -91971, 122965, -48972, -175020, 103881, -41723, 47111, -141975, -37798, -11686, -14712, -31499, -80136, -186665, 213257, -198313, -176782, -344343, -57526, 200588, -33737, 6443, -20185, 233713, -187856, -337203, 161998, -13814, -367933, 205684, -191110, 56311, 88845, -199557, 4880, -132020, 24043, -480519, -268774, -250124, 267325, 219822, -57243, 147837, 316412, -286410, 114180, -211020, -215070, -298270, -167936, 25377, -61208, -86937, -402248, -241256, -253461, -143848, 107566, 229406, -256356, 9733, 294275, -374678, -24682, 2416, -296471, 122810, -174315, -49691, -287706, -40034, -1963, 58603, -347666, -62509, 44638, 6870, 279238, -128655, -43317]
9295A09460n2503c2920j55692L2271O4115A01631D8307i1270c7811D71077E647
9283a71099g755l5917G1792A2190J26375j3725f6622B66142g2394n0135A44756
9271b22712C19485i1846A60982b551l7364E1266d66910e3088n5861L1599J1204
9260f6146f817G1986b6029B85200G5695b56392e5502J0318r0671r2514A86812
9248I6788K7752c67540a58354K584G985b34344C1344d1086p5246L1536k02974
9237b87770a08682A20253c61491B4368a44416M0669A75942E5020K7321j9459a4380
9225D3112a72613G239O9215d1055m84050B88465C8069i3814k22625h8057j46830
9214b34887a0662B09894e1223A15790l2240b3954k2045j73375B76512b23094l0150
$$ y = [109460, 56957, -32920, -188612, -156341, -92226, 101631, 48307, -91270, -37811, 471077, 5647, -171099, -7755, -43672, 71792, 12190, 138565, 124840, -66622, 266142, -72394, -122529, 144756, -222712, 319485, -91846, 160982, -2551, -39915, 51266, -466910, -53088, -108949, -77350, -66146, -6817, 71986, -26029, 285200, 75695, -256392, -55502, -45184, -135855, -228369, 186812, 96788, 124540, -367540, -158354, -155770, 7985, -234344, 31344, -41086, -116332, -84796, -287770, -108682, 120253, -361491, 24368, -144416, -103747, 175942, 55020, 82341, 62882, -14380, 43112, -172613, 7239, 76454, -41055, -525105, 288465, 38069, -93814, -316439, -88057, -234887, -10662, 209894, -51223, 115790, 83550, -23954, -45999, -219374, 276512, -223094, -253244]
9203b53244A5578h5632A3833c28984i3995j01214B00691b26636C25163k711A3063
9191B81061b87863A00829a14187C8610c39591A74433g9415k10511C6049d850C4149
9179a12389o9625d7117A52335a39087A09123a18908D448J04354g6004K6169k33042
9168b82877g8332K3549q4631A26027Q852E5856b02962J3282B74405b87752E3465
9156a90067a6916A92410G5048k7895a29957j6856d7612G9249a44751K8265l4241
9145a50727k51434A63943k5532h9399H6871a73878j2246D711b480o2171l20872
9134c85523B21638b44423B11044f2778F2611b26511a7108k7579A85633a4699j881
9123a6580n4906A9554e15412a56766O3870D950d03912J9290f6031o5048D652b33863
$$ y = [-253244, 15578, -85632, 13833, -328984, -93995, -195209, 200691, -226636, 325163, 322452, 13063, 281061, -287863, 100829, -114187, 38610, -339591, 174433, -79415, -289926, 36049, -4850, 34149, -112389, -182014, -47117, 152335, -139087, 109123, -118908, 4448, 108802, -76004, -49835, -282877, -78332, -54783, -139414, 126027, 134879, 55856, -202962, -189680, 274405, -287752, 53465, -190067, -16916, 192410, 75048, 47153, -129957, -146813, -47612, 79249, -144751, -116486, -150727, -402161, 163943, 138411, -89399, 86871, -173878, -186124, 4711, -2480, -64651, -385523, 221638, -244423, 211044, -62778, 62611, -226511, -17108, -44687, 185633, -14699, -16580, -71486, 19554, -515412, -156766, -92896, 4950, -403912, -384622, -66031, -131079, 4652, -233863]
9110a76309B9709d26175a30283j8390k5422F1358a89293l7613G4104O1632m3454
9099I2282b68541i8366p7829L2101B41062h0954q084I6074c27596j87385A97077
9087b69805G0308K49407A44635D1024M7183k2333a67660J4405C6435J90582h3955
9075a54028k8110B23837c7184B6163P6718c70000e2795B70375a29541I8259J79697
9064B77956c38272a36698E1119J3912f1074A1230J40868a830B9828a83787m1714
9053b25501e0340j72378p2291g426H5609J07331a61861H6360K1855J4145a74672
9041a83808A12017b91305J36969j20903h4958G3585a89021C6295d5945I0187c12476
9029a33159a1801G3337B619i7893q2155B62051b6720l9246K6274E9372a82900
$$ y = [-176309, 29709, -426175, -130283, -148673, -174095, 61358, -189293, -226906, 74104, 135736, 92282, -268541, -98366, -176195, -144094, 241062, -80954, -89038, 96074, -327596, -514981, 197077, -269805, 70308, 319715, 144635, 41024, 88207, 65874, -167660, -153255, 36435, 227017, -83955, -154028, -182138, 223837, -37184, 26163, 102881, -370000, -52795, 270375, -129541, 98259, 277956, -338272, -136698, 51119, 65031, -61074, 11230, 152098, -1830, 29828, -183787, -225501, -50340, -222718, -295009, -7426, 85609, 192940, -161861, 86360, 108215, 122360, -174672, -183808, 112017, -291305, -154336, -275239, -84958, 73585, -189021, 36295, -45945, 90187, -312476, -133159, -11801, 73337, 2619, -97893, -180048, 262051, -26720, -65966, -39692, 59372, -182900]
9017e7213I8146b57893h2860e329A0578f2980l5336j97209b677A38996e2482a9156
9004D02749A9757h3945i955r4170A55787h6715B00891i0555B23674c39268j02378
8993d41646g6315A63516a32285e6957A88085a05201B36509d70844e7376F8657
8982I9784c0605l60570B29015A3204a98097E0220b27111l4535f0433j40309A88479
8970e0054r5564A04389a62197A93742K6011b21520d8964k80140a64198J7649N4700
8959i1849D5677a47956H4040J69892C9155a04401M0270A31406A6233J9685a74575
8947h3599F65a34196k11825A69944i2174j69350O0070C6393b13682R2938a1634
8935a18245N1009R487j84910a1725o6449a7661k86890C4852a1183A70347b52330
$$ y = [-57213, 98146, -257893, -82860, -5329, 10578, -62980, -98316, -295525, -2677, 138996, -52482, -19156, 402749, 19757, -83945, -9955, -104125, 155787, -86715, 200891, -90555, 223674, -339268, -441646, -76315, 163516, -132285, -56957, 188085, -105201, 236509, -470844, -57376, 68657, 99784, -30605, -391175, 229015, 13204, -198097, 50220, -227111, -261646, -60433, -200742, 188479, -50054, -145618, 104389, -162197, 193742, 219753, -221520, -48964, -329104, -164198, -146549, -91849, 45677, -147956, 84040, 253932, 39155, -104401, -64131, 131406, 16233, 35918, -174575, -83599, 665, -134196, -346021, 169944, -92174, -261524, -201454, 36393, -213682, -120744, -11634, -118245, -67236, -57749, -242659, -11725, -78174, -17661, -304551, 34852, -11183, 170347, -252330]
8923A37979a76025C6738b06308D92363K87205k15490a15817q3220C6948J98284
8913B35232r9557b0830m41560b7242n1968D1265R2091J9104a75023j00671C40302
8901G0102a2083A09353b44844a14236B9419J37399L3621b06628R9190m2050A01305
8889A59777p343c0786A61558b29132A3462J24267c19445e2509n4500l2995j41864
$$ y = [137979, -176025, 36738, -206308, 492363, 779568, 564078, -115817, -199037, 36948, 235232, 135675, -20830, -462390, -27242, -79210, 41265, 133356, 152460, -175023, -275694, 340302, 70102, -12083, 109353, -244844, -114236, 29419, 166818, 200439, -206628, -107438, -149488, 101305, 159777, 152434, -30786, 161558, -229132, 13462, 137729, -319445, -52509, -107009, -140004, -281868]
$$ [...]
##END NTUPLES=NMR SPECTRUM
##END=
