##TITLE=NES1025_11026_9266837_dCkYX0WH1l
##JCAMPDX= 6.0         $$ Bruker NMR JCAMP-DX V2.0
##DATA TYPE= NMR SPECTRUM
##DATA CLASS= NTUPLES
##ORIGIN= BRUKER
##OWNER= Administrator
$$ 1.72 TOPSPIN		Version 2.1
$$ 2015-07-09 19:22:52.581 -0700  Administrator@X
$$ Compression mode = diff/dup
##.OBSERVE FREQUENCY= 400.02188249412
##.OBSERVE NUCLEUS= ^1H
##.ACQUISITION MODE= SIMULTANEOUS (DQD)
##.ACQUISITION SCHEME= undefined
##.AVERAGES= 64
##.DIGITISER RES= 22
##SPECTROMETER/DATA SYSTEM= spect
##.PULSE SEQUENCE= noesygpps1d.comp
##.SOLVENT NAME= COFFEE_meoh
##.SHIFT REFERENCE= INTERNAL, COFFEE_meoh, 1, 14.96272
##AUDIT TRAIL= $$ (NUMBER, WHEN, WHO, WHERE, PROCESS, VERSION, WHAT)
$$ ##TITLE= Audit trail, TOPSPIN		Version 2.1
$$ ##JCAMPDX= 5.01
$$ ##ORIGIN= Bruker BioSpin GmbH
$$ ##OWNER= Administrator
$$ $$ E:\/data/COFFEE/nmr/NES1025_11026_9266837_dCkYX0WH1l/12/pdata/1/auditp.txt
$$ ##AUDIT TRAIL=  $$ (NUMBER, WHEN, WHO, WHERE, PROCESS, VERSION, WHAT)
(   1,<2015-07-09 19:22:47.035 -0700>,<Administrator>,<X>,<go>,<TOPSPIN 2.1>,
      <created by zg
	started at 2015-07-09 19:11:16.816 -0700,
	POWCHK enabled, PULCHK disabled,
       configuration hash MD5:
       21 0F 79 D6 B3 7B B4 F6 88 20 88 DB 03 48 BD 9F
       data hash MD5: 64K
       60 B1 4C DE 2E 5B 2F 70 D4 EC 52 6E CE DA F1 1A>)
(   2,<2015-07-09 19:22:50.472 -0700>,<Administrator>,<X>,<proc1d>,<TOPSPIN 2.1>,
      <Start of raw data processing
       efp LB = 0.3 FT_mod = 6 PKNL = 1 PHC0 = 0 PHC1 = 0 SI = 128K 
       data hash MD5: 128K
       32 CE D9 B4 96 36 60 F3 D0 23 D2 A5 9E FD D6 E2>)
(   3,<2015-07-09 19:22:51.378 -0700>,<Administrator>,<X>,<proc1d>,<TOPSPIN 2.1>,
      <pk PHC0 = -85.91309 PHC1 = 0 
       data hash MD5: 128K
       1A 7F 48 AE 46 7F 94 E2 53 1E 91 A2 35 09 67 EA>)
(   4,<2015-07-09 19:22:51.753 -0700>,<Administrator>,<X>,<proc1d>,<TOPSPIN 2.1>,
      <abs ABSG = 1 
       data hash MD5: 128K
       DF 75 81 E5 F8 96 C6 6F D1 63 0A 3B AD 54 4C 63>)
(   5,<2015-07-09 19:22:51.847 -0700>,<Administrator>,<X>,<proc1d>,<TOPSPIN 2.1>,
      <abs ABSG = 2 
       data hash MD5: 128K
       D0 1B 6E 61 48 F1 06 25 9D 43 F0 0E BD 25 AD 7B>)
(   6,<2015-07-09 19:22:51.941 -0700>,<Administrator>,<X>,<proc1d>,<TOPSPIN 2.1>,
      <abs ABSG = 3 
       data hash MD5: 128K
       76 D4 74 25 CD 73 B3 BB 42 43 92 5A 38 80 7B B0>)
(   7,<2015-07-09 19:22:52.019 -0700>,<Administrator>,<X>,<proc1d>,<TOPSPIN 2.1>,
      <abs ABSG = 4 
       data hash MD5: 128K
       1F 77 61 8A CC 0D 38 D7 80 B8 6C A2 D9 80 58 F2>)
(   8,<2015-07-09 19:22:52.113 -0700>,<Administrator>,<X>,<proc1d>,<TOPSPIN 2.1>,
      <abs ABSG = 5 
       data hash MD5: 128K
       D1 E5 20 79 74 9E 0B 76 01 C0 8B 99 BB 9D 9A F9>)
$$ ##END=
$$ 
$$ $$ hash MD5
$$ $$ 94 01 D1 67 74 5C 48 D9 1A 2F E0 31 00 A6 70 14
##$RELAX= 
##$RELAX= 
##$RELAX= 
##$RELAX= 
##$RELAX= 
##$RELAX= 
##$RELAX= 
##$RELAX= 
$$ Bruker specific parameters
$$ --------------------------
##$DU= <E:\>
##$EXPNO= 12
$$ [...]
##$TP07= 0
##$TPNAME0= <>
##$TPNAME1= <>
##$TPNAME2= <>
##$TPNAME3= <>
##$TPNAME4= <>
##$TPNAME5= <>
##$TPNAME6= <>
##$TPNAME7= <>
##$TPOAL= (0..7)
0.5 0.5 0.5 0.5 0.5 0.5 0.5 0.5
##$TPOFFS= (0..7)
0 0 0 0 0 0 0 0
##$TUNHIN= 0
##$TUNHOUT= 0
##$TUNXOUT= 0
##$USERA1= <user>
##$USERA2= <user>
##$USERA3= <user>
##$USERA4= <user>
##$USERA5= <user>
##$V9= 5
##$VALIST= <valist>
##$VCLIST= <CCCCCCCCCCCCCCC>
##$VD= 0
##$VDLIST= <DDDDDDDDDDDDDDD>
##$VPLIST= <PPPPPPPPPPPPPPP>
##$VTLIST= <TTTTTTTTTTTTTTT>
##$WBST= 2048
##$WBSW= 25
##$XGAIN= (0..3)
0 0 0 0
##$XL= 0
##$YL= 0
##$YMAX_a= 8846457
##$YMIN_a= -16095254
##$ZGOPTNS= <>
##$ZL1= 120
##$ZL2= 120
##$ZL3= 120
##$ZL4= 120
##$ABSF1= 14.96272
##$ABSF2= -5.595462
##$ABSG= 5
##$ABSL= 3
##$ALPHA= 0
##$AQORDER= 0
##$ASSFAC= 0
##$ASSFACI= 0
##$ASSFACX= 0
##$ASSWID= 0
##$AUNMP= <proc_prof1d_extract.lims>
##$AXLEFT= 0
##$AXNAME= <>
##$AXNUC= <1H>
##$AXRIGHT= 0
##$AXTYPE= 0
##$AXUNIT= <>
##$AZFE= 0.1
##$AZFW= 0.1
##$BCFW= 0
##$BC_mod= 0
##$BYTORDP= 0
##$COROFFS= 0
##$CY= 15
##$DATMOD= 1
##$DC= 0
##$DFILT= <>
##$DTYPP= 0
##$F1P= 0
##$F2P= 0
##$FCOR= 0.5
##$FTSIZE= 131072
##$FT_mod= 6
##$GAMMA= 0
##$GB= 0
##$INTBC= 1
##$INTSCL= 1
##$ISEN= 128
##$LB= 0.3
##$LEV0= 0
##$LPBIN= 0
##$MAXI= 10000
##$MC2= 0
##$MEAN= 0
##$ME_mod= 0
##$MI= 0
##$NCOEF= 0
##$NC_proc= -2
##$NLEV= 6
##$NOISF1= 0
##$NOISF2= 0
##$NSP= 0
##$NTH_PI= 0
##$NZP= 0
##$OFFSET= 14.96272
##$PC= 1
##$PHC0= -85.91309
##$PHC1= 0
##$PH_mod= 1
##$PKNL= yes
##$PPARMOD= 0
##$PPDIAG= 0
##$PPIPTYP= 0
##$PPMPNUM= 2147483647
##$PPRESOL= 1
##$PSCAL= 4
##$PSIGN= 0
##$PYNMP= <proc.py>
##$REVERSE= no
##$SF= 400.020008949026
##$SI= 131072
##$SIGF1= 0
##$SIGF2= 0
##$SINO= 400
##$SIOLD= 131072
##$SPECTYP= <>
##$SREGLST= <1H.CDCl3>
##$SSB= 0
##$STSI= 131072
##$STSR= 0
##$SW_p= 8223.68421052631
##$SYMM= 0
##$S_DEV= 0
##$TDeff= 65536
##$TDoff= 0
##$TI= <>
##$TILT= no
##$TM1= 0
##$TM2= 0
##$TOPLEV= 0
##$USERP1= <user>
##$USERP2= <user>
##$USERP3= <user>
##$USERP4= <user>
##$USERP5= <user>
##$WDW= 1
##$XDIM= 131072
##$YMAX_p= 395236079
##$YMIN_p= -10372
##$CURPLOT= <Network HP LaserJet P1505>
##$CURPRIN= <$Network HP LaserJet P1505>
##$DFORMAT= <normdp>
##$LAYOUT= <+/1D_H.xwp>
##$LFORMAT= <normlp>
##$PFORMAT= <normpl>
##$SURQMSG= 1
$$ End of Bruker specific parameters
$$ ---------------------------------
##NTUPLES= NMR SPECTRUM
##VAR_NAME=  FREQUENCY,     SPECTRUM/REAL,   SPECTRUM/IMAG
##SYMBOL=    X,             R,               I
##VAR_TYPE=  INDEPENDENT,   DEPENDENT,       DEPENDENT
##VAR_FORM=  AFFN,          ASDF,            ASDF
##VAR_DIM=   131072,        131072,          131072
##UNITS=     HZ,            ARBITRARY UNITS, ARBITRARY UNITS
##FACTOR=    0.0627417313425164, 1,          1
##FIRST=     8223.62146879497, 2517,         -57461
##LAST=      0,             4113,            -57270
##MIN=       0,             -10372,          0
##MAX=       8223.62146879497, 395236079,    0
$$ Real data points
##PAGE= N=1
##DATA TABLE= (X++(R..R)), XYDATA
$$ [...]
60963G021284r64123q00906o60865n44213m50164l73183l08374k55593k15581
60954B448282j85789j62509j44083j29724j17488j05698r4625q4889p5681o6037
60944A281759n6485m7939m0240l3288k8307k6429k6842k7685k8012k7741k6596
60933I12195k4414k1929k0011j8552j7074j5820j5300j5289j5220j5065j4946
60922G18575j4526j3634j2925j2933j3082j2563j1613j0835r891q157o179n138
60910E87099n062m845l937k809j878j158r73j774l124l996m200m428m867m986
60896E39062m892n520o985p989p567o351n423m897m451m296m598m680l813k439
60882D65161j597j477j413j111r67j194j448j421j211r58n94q4M14P90J150J688
$$ plain form
60963 7021284 6057161 5256255 4595390 4051177 3601013 3227830 2919456 2663863 2448282
60954 2448282 2262493 2099984 1955901 1826177 1708689 1602991 1508366 1423477 1347796 1281759
60944 1281759 1225274 1177335 1137095 1103807 1075500 1049071 1022229 994544 966532 938791 912195
60933 912195 887781 865852 845841 827289 810215 794395 779095 763806 748586 733521 718575
60922 718575 704049 690415 677490 664557 651475 638912 627299 616464 606573 598416 592237 587099
60910 587099 582037 577192 573255 570446 568568 567410 566437 564663 561539 557543 553343 548915 544048 539062
60896 539062 534170 528650 521665 513676 506109 499758 494335 489438 484987 480691 476093 471413 467600 465161
60882 465161 463564 462087 460674 459563 458596 457402 455954 454533 453322 452364 451770 451686 452100 452890 454040 455728
60866D55728K463L306L909M195M585N632P214Q521R048R244R891J1221J2886J4413
60852E62256J5217J4571J2159Q641N238K909K009K369L238L561K849J541J34j640
60838F35052m117o693q330q874r022r093q779q167p993q493q839q322p461p310
60824E23559p980q446p704n737l387j573o97n96r49j570k163k063p87J168K511
60809D83586K442J447O65P33J466K318K830K791K331J892J847K105K099J342M0
60794E09934r02o99M52J539J898J864K042K347K245J708J293J407J978K826L788
60779E33720M460M410L783L153K734K251J706J577K048K594K719K549K404K287
60765E72395K155K166K244J898R88J60m4j13q18j939k502k220j863k039k439k522
$$ plain form
60866 455728 458191 461497 465406 469601 474186 479818 487032 495553 504601 513845 523736 534957 547843 562256
60852 562256 577473 592044 604203 612844 618082 620991 623000 625369 628607 632168 635017 636558 636692 635052
60838 635052 630935 624242 615912 607038 598016 588923 580144 571977 563984 555491 546652 538330 530869 523559
60824 523559 515579 507133 499429 493692 490305 488732 488035 487439 486490 484920 482757 480694 479907 481075 483586
60809 483586 486028 487475 488140 488873 490339 492657 495487 498278 500609 502501 504348 506453 508552 509894 509934
60794 509934 509032 508333 508785 510324 512222 514086 516128 518475 520720 522428 523721 525128 527106 529932 533720
60779 533720 538180 542590 546373 549526 552260 554511 556217 557794 559842 562436 565155 567704 570108 572395
60765 572395 574550 576716 578960 580858 581846 582006 581962 581849 581031 579092 576590 574370 572507 570468 568029 565507
60749E65507k391k513k966l460l916m613n658o681p135o870o313o032o144o148
60735D94667n444m053k699k104k215k233j521l45M24L37j01o2O48J497J968K096
60719D80860K203K417K565K471K180J803J282L75r68k384l458m239n091n980o417
60704D67619o257o052o181o167n465m486m150m540m847m522l795l053k477k302
60690D03325k614k789j950l00Q99J049R89J515K024J509K35n38k39N86J332J987
60674D07020K595K883K717K431K454K913L744M868O078O998P407P513P774Q397
60660D75792R111R449R299R039R080R446J0001J0727J1437J1404J0032P867O204
60647E98888N512M997L968K858K309J968J026m56j607k007k138k611l484m394
$$ plain form
60749 565507 563116 560603 557637 554177 550261 545648 539990 533309 526174 519304 512991 506959 500815 494667
60735 494667 489223 485170 482471 480367 478152 475919 474398 474053 474477 474814 474713 474651 475299 476796 478764 480860
60719 480860 483063 485480 488045 490516 492696 494499 495781 496156 495188 492804 489346 485107 480016 474036 467619
60704 467619 461362 455310 449129 442962 437497 433011 428861 424321 419474 414952 411157 408104 405627 403325
60690 403325 400711 397922 395972 395672 396571 397620 398609 400124 402148 403657 403892 403354 403115 403701 405033 407020
60674 407020 409615 412498 415215 417646 420100 423013 426757 431625 437703 444701 452108 459621 467395 475792
60660 475792 484903 494352 503651 512690 521770 531216 541217 551944 563381 574785 584817 592684 598888
60647 598888 604400 609397 613365 616223 618532 620500 621526 621070 619463 617456 615318 612707 609223 604829
60633F04829m976n135n222n762o780p609p744p541p586p744p434o667o022n685
60619E12922n154m077k735j567p15j81K1J57P41J979L540M992O129O765O677O035
60603E35529N573N835O412O276M881K738Q42j64l05O0N42Q05O14J31o5M21J182
60586E71307J382Q10J76J51M70L23o18j873k738k872k433j877j660j899k355k792
60570E53502l157l409l396l116k745k357j863j416j446k003k507k429j852j008
60556E20798J74J616K637K702K283K266K729L041L060L387M336N472O418P485
60542E68404R196J1599J4364J7132J9640K1779K3812K6098K8439L0025L0181K8754
60530H29423K5635K0366J2793L857m719j1614j6526j9722k1287k1056j9157j6292
$$ plain form
60633 604829 599853 594718 589496 583734 576954 569345 561601 554060 546474 538730 531296 524629 518607 512922
60619 512922 507768 503691 500956 499389 498674 498493 498514 498671 499412 501391 504931 509923 516052 522817 529494 535529
60603 535529 541102 546937 553349 559625 564506 567244 568086 567922 567617 567677 568219 569024 569638 569769 569704 570125 571307
60586 571307 572689 573499 573675 573826 574296 574619 574001 572128 569390 566518 564085 562208 560548 558649 556294 553502
60570 553502 550345 546936 543540 540424 537679 535322 533459 532043 530597 528594 526087 523658 521806 520798
60556 520798 520972 522588 525225 527927 530210 532476 535205 538246 541306 544693 549029 554501 560919 568404
60542 568404 577600 589199 603563 620695 640335 662114 685926 712024 740463 770488 800669 829423
60530 829423 855058 875424 888217 892074 887355 875741 859215 839493 818206 797150 777993 761701
60518G61701j3332j0691q271o023m197k894j686j00J670K922L360L564M408O328
60504G36759R154J2477J5900J9068K1751K4041K6366K9073L1924L4185L5321L5307
60492A031326L4211L1814K8257K4692K2544K2184K3098K5447L0478L8973N0207
60481A363231O3052P7445R3950J12452J32205J52675J73307J92268K06060K10442
60471B777087K01538J76808J36172Q2611K1186m2610j03378j55591j94413k17528
60461B681882k25833k22273k10268j93000j73142j52593j32574j14058r7784q3914
60451A076443p2135o2075n3400m5626l8430l2122k7239k3593k0294j6787j3364
60440F71378j0538q437p047o527o916p737q277q112p337o398n744n507n461n323
$$ plain form
60518 761701 748369 737678 729407 723384 719187 716293 714607 714507 716177 719099 722459 726023 730431 736759
60504 736759 745913 758390 774290 793358 815109 839150 865516 894589 926513 960698 996019 1031326
60492 1031326 1065537 1097351 1125608 1150300 1172844 1195028 1218126 1243573 1274051 1313024 1363231
60481 1363231 1426283 1503728 1597678 1710130 1842335 1995010 2168317 2360585 2566645 2777087
60471 2777087 2978625 3155433 3291605 3374216 3395402 3352792 3249414 3093823 2899410 2681882
60461 2681882 2456049 2233776 2023508 1830508 1657366 1504773 1372199 1258141 1160357 1076443
60451 1076443 1004308 942233 888833 843207 804777 772655 745416 721823 701529 684742 671378
60440 671378 660840 652403 645356 638829 631913 624176 615899 607787 600450 594052 588308 582801 577340 572017
60426E72017n026m600m046l498l190l043k625j748p47J85J345K762L704L632L071
60411E58193K750K406J502O46R97K404L443L419L087L143L219K867K567L001M097
60396E97741N293O181O485N981M865L745K966K442K303K917M026M626M161L215
60382F56947K649K657K977L353L376K594J217N3o20j415k567l215k618j373n81
60367F63434l70r1M77J031J555K373L450M395N044N508N723N543N181N046N213
60352G13512N507O002O860P703P691O400M311K322R10j17j202k378l121l018k437
60337G48945k182k472k711k410j849j564j625j796k026k368k715k935l107l347
60323G15838l570l638l545l310k997k868l148l518l426l031l257m504n909o348
$$ plain form
60426 572017 566991 562391 558345 554847 551657 548614 545989 544241 543494 543679 545024 547786 551490 555122 558193
60411 558193 560943 563349 564851 565497 566494 568898 572341 575760 578847 581990 585209 588076 590643 593644 597741
60396 597741 603034 609215 615700 621681 626546 630291 633257 635699 638002 640919 644945 649571 653732 656947
60382 656947 659596 662253 665230 668583 671959 674553 675770 675823 675203 673788 671221 668006 665388 664015 663434
60367 663434 663064 662973 663450 664481 666036 668409 671859 676254 681298 686806 692529 698072 703253 708299 713512
60352 713512 719019 725021 731881 739584 747275 753675 757986 760308 761218 761101 759899 757521 754400 751382 748945
60337 748945 746763 744291 741580 739170 737321 735757 734132 732336 730310 727942 725227 722292 719185 715838
60323 715838 712268 708630 705085 701775 698778 695910 692762 689244 685818 682787 679530 675026 669117 662769
60309F62769n779n008m529m123l390k179o64O47J170Q24J96j33j69k20l79n45
60293F38488o29m48K14J177J864K053K153K518K972L404M208N597O964P563P542
60278F85640P648Q171Q669Q621P906O820N925N610N518M885L700K952L234L775
60264G69074L599L039L149M063M963N506O243P524Q919R970J0837J1903J3272
60251H62061J4774J6164J7131J7656J8302J9748K1910K4047K5745K7398K9565
60240A094501L2289L5251L8354M1872M6153N1274N6880O2438O7713P2868P7954
60229A677547Q2424Q5384Q6197Q4857Q1907P8096P3730O8279O0978N1979M2420
60218B473798L3169K4068J4713N331l641j2175k0116k6571l0657l2547l3038l2412
$$ plain form
60309 662769 656990 651982 647453 643330 639940 637761 637097 637744 638914 639738 639934 639801 639632 639412 639033 638488
60293 638488 637859 637411 637625 638802 640666 642719 644872 647390 650362 653766 657974 663571 670535 678098 685640
60278 685640 693288 701459 710128 718749 726655 733475 739400 745010 750528 755413 759113 762065 765299 769074
60264 769074 772673 775712 778861 782924 787887 793393 799636 807160 816079 826049 836886 848789 862061
60251 862061 876835 892999 910130 927786 946088 965836 987746 1011793 1037538 1064936 1094501
60240 1094501 1126790 1162041 1200395 1242267 1288420 1339694 1396574 1459012 1526725 1599593 1677547
60229 1677547 1759971 1845355 1931552 2016409 2098316 2176412 2250142 2318421 2379399 2431378 2473798
60218 2473798 2506967 2531035 2545748 2551079 2547438 2535263 2515147 2488576 2457919 2425372 2392334 2359922
60206B359922l0471k7399k3594j8816j2461m732L374J1336J9575K8471L7697M6805
60194B389707N5775O4586P2762P9670Q4878Q8032Q8745Q6894Q2637P6115O7354
60183C237155N6644M4525L1386J7472L341j0244k3044l5405m7320n7828o5702
60172C150980p0386p2078p1186o8067o3102n6618m8797l9804l0006j9860r700
60161B601376L42J0288K0222L0166L9783M8211N4208N6718N5474N1106M4569L6573
60149C049036K7708J8784J0467K547n724j4318k2050k7884l1902l4442l4913l2337
60137B904972k6765j9201j0282J03J1807K3958L5829M7674O0274P3950Q8272J02554
60125C293145J16506J30522J45258J60855J76769J92474K07923K22779K35582
$$ plain form
60206 2359922 2329451 2302052 2278458 2259642 2247181 2242449 2245823 2257159 2276734 2305205 2342902 2389707
60194 2389707 2445482 2510068 2582830 2662500 2747378 2835410 2924155 3011049 3093686 3169801 3237155
60183 3237155 3293799 3338324 3369710 3387182 3390523 3380279 3357235 3321830 3274510 3216682 3150980
60172 3150980 3080594 3008516 2937330 2869263 2806161 2749543 2700746 2660942 2630936 2611076 2601376
60161 2601376 2601718 2612006 2632228 2662394 2702177 2750388 2804596 2861314 2916788 2967894 3012463 3049036
60149 3049036 3076744 3095528 3105995 3108542 3102818 3088500 3066450 3038566 3006664 2972222 2937309 2904972
60137 2904972 2878207 2859006 2848724 2848827 2860634 2884592 2920421 2968095 3028369 3102319 3190591 3293145
60125 3293145 3409651 3540173 3685431 3846286 4023055 4215529 4423452 4646231 4881813
60116D881813K44340K48013K46858K41393K31655K17499J98927J75948J48608
60107F835054J17506Q3946M9189J3772k2242n8502r4012j27368j57250j82669
60097F457424k02878k17207k25165k26738k22344k12529j98015j80068j60279
60088D612201j39724j18696r7439p6530n6263l6323j6573K410K0102L6647N1883
60077D181695O4402P2616P6411P6713P3718O6738N5793M2116K6839J0214p484
60066D739771k5155m1530n6004o8504p9166q8504r7222j05335j11894j15993j17681
60055C832783j17460j15364j11057j04618r6632q7442p6732o4147n0238l6461
60045B972632k3947j2418p33J1588K4005L6182M8586O1286P3011Q2446Q9873R6312
$$ plain form
60116 4881813 5126153 5374166 5621024 5862417 6094072 6311571 6510498 6686446 6835054
60107 6835054 6952560 7036506 7085695 7099467 7077225 7018723 6924711 6797343 6640093 6457424
60097 6457424 6254546 6037339 5812174 5585436 5363092 5150563 4952548 4772480 4612201
60088 4612201 4472477 4353781 4256342 4179812 4123549 4087226 4070653 4073063 4093165 4129812 4181695
60077 4181695 4246097 4318713 4395124 4471837 4545555 4612293 4668086 4710202 4737041 4747255 4739771
60066 4739771 4714616 4673086 4617082 4548578 4469412 4380908 4283686 4178351 4066457 3950464 3832783
60055 3832783 3715323 3599959 3488902 3384284 3287652 3200210 3123478 3059331 3009093 2972632
60045 2972632 2948685 2936267 2935534 2947122 2971127 3007309 3055895 3117181 3190192 3272638 3362511 3458823
60033C458823J01389J03313J00962R4682Q4907P1340N4178L5049J5818k925k1529
60022D096007l9911n7247p2753q6094r7061j05285j10244j11486j08954j03248
60012C203724r5337q5950p5407o3971n2056m0006k7961j5982m071P885J9976L2190
60000B803034M4636N7607P1091Q4592R7801J10960J23898J35092J42505J45133
59990C816349J42951J35759J23275J06356Q6869O6141M4436K2143L25k0300l9972
59979D484332n8900p6499r1992j04871j14287j18856j17952j12612j04574r4895
59969C488894q4012p2503o0951m9346l7272k4579j1482J718J4665K6985L8585
59958C230702M9663O0111O9278P6599Q2080Q5897Q7802Q7256Q3889P7680O9006
$$ plain form
60033 3458823 3560212 3663525 3764487 3859169 3944076 4015416 4069594 4104643 4120461 4117536 4096007
60022 4096007 4056096 3998849 3926096 3840002 3742941 3637656 3527412 3415926 3306972 3203724
60012 3203724 3108387 3022437 2947030 2883059 2831003 2790997 2763036 2747054 2742983 2750868 2770844 2803034
60000 2803034 2847670 2905277 2976368 3060960 3158761 3269721 3393619 3528711 3671216 3816349
59990 3816349 3959300 4095059 4218334 4324690 4411559 4477700 4522136 4544279 4544604 4524304 4484332
59979 4484332 4425432 4348933 4256941 4152070 4037783 3918927 3800975 3688363 3583789 3488894
59969 3488894 3404882 3332379 3271428 3222082 3184810 3160231 3148749 3150467 3165132 3192117 3230702
59958 3230702 3280365 3340476 3409754 3486353 3568433 3654330 3742132 3829388 3913277 3990957 4059963
59947D059963N8739M7962L7401K7360J8074R704K154m422q939j0072p697k759
59935D227468M446J4873K9176M6474O5356Q5304J06498J28842J51937J75528J99226
59924E235128K22158K43274K61630K75825K83733K83356K73532K53425K22057
59915G554118J79199J26415O6617L040o0767j20639j72648k14457k45360k65248
59905F850270k74247k73255k64116k49045k30076k08835j86311j62902j38948
59896D862535j15062r1702o8763m6030k3752k396J7994L7713N6910P5484R3171
59885D796102J09362J23080J33526J40316J42839J39830J30097J13362Q9950O0092
59875E978556K4403j5166n5632r4303j29240j58545j80174j93018j97846j96677
$$ plain form
59947 4059963 4118702 4166664 4204065 4231425 4249499 4259203 4261357 4256935 4247996 4237924 4230227 4227468
59935 4227468 4231914 4246787 4275963 4322437 4387793 4473097 4579595 4708437 4860374 5035902 5235128
59924 5235128 5457286 5700560 5962190 6238015 6521748 6805104 7078636 7332061 7554118
59915 7554118 7733317 7859732 7926349 7929389 7868622 7747983 7575335 7360878 7115518 6850270
59905 6850270 6576023 6302768 6038652 5789607 5559531 5350696 5164385 5001483 4862535
59896 4862535 4747473 4655771 4587008 4540978 4517226 4514830 4532824 4570537 4627447 4702931 4796102
59885 4796102 4905464 5028544 5162070 5302386 5445225 5585055 5715152 5828514 5918464 5978556
59875 5978556 6002959 5987793 5932161 5837858 5708618 5550073 5369899 5176881 4979035 4782358
59865D782358j91284j82503j70866j57548j44392j32901j23330j14956j07077
59856C457501r9587r2619q6025p9274p1618o2468n1952m1049l0735k1030j1451
59845B809693k386M833R458J2317J4797J7279J9005J9069J7011J2675N940l239
59833B936452j4402k6049l5848m1958m4211m3532m0590l5897l1051k8371k8680
59822B565863l0424l1552l1367k9886k6514k0624j2873m797K727R862J6800K3198
59810B430413K8540L2396L4344L4105L1741K7592K2184J6390J1113O563K335j464
59798B676252l763l646j304K586P855J4530K2208L0537L9859N0742O3247P7332
59786B976435R3390J11633J31427J52080J73849J97275K21794K45731K67081K82826
$$ plain form
59865 4782358 4591074 4408571 4237705 4080157 3935765 3802864 3679534 3564578 3457501
59856 3457501 3357914 3265295 3179270 3099996 3028378 2965910 2913958 2872909 2842174 2821144 2809693
59845 2809693 2807307 2812140 2821598 2833915 2848712 2865991 2884996 2904065 2921076 2933751 2939691 2936452
59833 2936452 2922050 2896001 2860153 2818195 2773984 2730452 2689862 2653965 2622914 2594543 2565863
59822 2565863 2535439 2503887 2472520 2442634 2416120 2395496 2382623 2377826 2380553 2390415 2407215 2430413
59810 2430413 2458953 2491349 2525693 2559798 2591539 2619131 2641315 2657705 2668818 2675381 2677716 2676252
59798 2676252 2672489 2668843 2667539 2670125 2677980 2692510 2714718 2745255 2785114 2835856 2899103 2976435
59786 2976435 3069825 3181458 3312885 3464965 3638814 3836089 4057883 4303614 4570695 4853521
59776D853521K87543K74126K37108J75923R5917P155p8326j50077k01914k32190
59766E268786k42507k36709k20138j98019j73725j48720j24021j00925q0399o2551
59756C681072m7084l3772k2357j2466l747M211J2121K0668K9851L9049M7855N6595
59744C771996O5980P6429Q7772R9417J10928J22615J35360J49720J65456J82095
59734D967768J99616K18325K38492K60375K84127L09244L34555L59103L82529
59725G554134M04057M21680M32982M36407M31130M16420L92215L60395L24681
59716A1174101K89247K57762K33296K18123K13191K17981K30795K48996K69510
59707A3353002K89643L07264L19952L24632L18751L01469K73353K35479J89657
$$ plain form
59776 4853521 5141064 5415190 5652298 5828221 5924138 5931293 5852967 5702890 5500976 5268786
59766 5268786 5026279 4789570 4569432 4371413 4197688 4048968 3924947 3824022 3743623 3681072
59756 3681072 3633988 3600216 3577859 3565393 3561646 3565857 3577978 3598646 3628497 3667546 3715401 3771996
59744 3771996 3837976 3914405 4002177 4101594 4212522 4335137 4470497 4620217 4785673 4967768
59734 4967768 5167384 5385709 5624201 5884576 6168703 6477947 6812502 7171605 7554134
59725 7554134 7958191 8379871 8812853 9249260 9680390 10096810 10489025 10849420 11174101
59716 11174101 11463348 11721110 11954406 12172529 12385720 12603701 12834496 13083492 13353002
59707 13353002 13642645 13949909 14269861 14594493 14913244 15214713 15488066 15723545 15913202
59698A5913202J38814Q6092L3813j5942o0199r5717j20666j34803j38212j30843
59688A5475539j13237q6586n1911r938L8160R0723J46393K04297K63429L22601
59678A6279470L80987M37825M91305N38441N76153O01721O11834O01899N66940
59669B1086575N03342M10049K88962J44913j4589j79746l39256m81972n99173
59660B0819105o85869p40416p63677p58843p31133o86712o31997n74407n22896
59651A4723155m86481m71676m80721n10684n53090n95615o26673o39824o34450
59642I723941o13324n80577n40847m98264m55463m14021l75320l40125l07811
59633E598189k77417k49239k24197k01911j80975j61069j43236j27869j13857
$$ plain form
59698 15913202 16052016 16138108 16171921 16155979 16095780 16000063 15879397 15744594 15606382 15475539
59688 15475539 15362302 15275716 15223805 15213867 15252027 15342750 15489143 15693440 15956869 16279470
59678 16279470 16660457 17098282 17589587 18128028 18704181 19305902 19917736 20519635 21086575
59669 21086575 21589917 21999966 22288928 22433841 22419252 22239506 21900250 21418278 20819105
59660 20819105 20133236 19392820 18629143 17870300 17139167 16452455 15820458 15246051 14723155
59651 14723155 14236674 13764998 13284277 12773593 12220503 11624888 10998215 10358391 9723941
59642 9723941 9110617 8530040 7989193 7490929 7035466 6621445 6246125 5906000 5598189
59633 5598189 5320772 5071533 4847336 4645425 4464450 4303381 4160145 4032276 3918419
59624C918419j00234q7274p5468o4554n4307m5234l7821l1806k6890k3365k1553
59613C349913k1207k1957k3853k7055l1445l6717m2370m7525n1431n4216n6476
59602B935661n8047n8039n6194n3306n0036m6183m1467l6230l0980k5930k1321
59591B457928j7419j3924j0069n635j216K785O602J0242J3053J4630J5500J6334
59579B488811J7146J7714J8250J9030J9809K0206K0384K0956K2377K4678K7625
59568B716986L0987L4800L9439M5197N1813N8699O5519P2301P9202Q6547R4870
59557C376360J04286J14112J23641J33070J42991J53161J62452J69873J75052
59548D654998J77875J78360J76676J72743J66228J57279J46377J32551J12966
$$ plain form
59624 3918419 3818185 3730911 3655443 3590889 3536582 3491348 3453527 3421721 3394831 3371466 3349913
59613 3349913 3328706 3306749 3282896 3255841 3224396 3187679 3145309 3097784 3046353 2992137 2935661
59602 2935661 2877614 2819575 2763381 2710075 2660039 2613856 2572389 2536159 2505179 2479249 2457928
59591 2457928 2440509 2426585 2416516 2410881 2409665 2412450 2419052 2429294 2442347 2456977 2472477 2488811
59579 2488811 2505957 2523671 2541921 2560951 2580760 2600966 2621350 2642306 2664683 2689361 2716986
59568 2716986 2747973 2782773 2822212 2867409 2919222 2977921 3043440 3115741 3194943 3281490 3376360
59557 3376360 3480646 3594758 3718399 3851469 3994460 4147621 4310073 4479946 4654998
59548 4654998 4832873 5011233 5187909 5360652 5526880 5684159 5830536 5963087 6076053
59539F076053Q6144N5200K5959J868j7764l4834m9890o2856p4147q3860r1016
59528E830857r4440r3643q8422p8668o4944m8216k8671n887J9641M6409P3625
59517E467641J01600J29890J56383J78778J95659K05506K06028J95464J73579
59508G010528J40917R8288M7733p259o3452j18789j71074k16993k53451k78990
59498F187458k93254k96336k89610k76041k58406k37787k14551j89815j65064
59489C966594j41114j18360r7237p7673n8900m0632k3516p733P800K4031M0543
59478C473803N6548P2039Q6982J00479J11902J21952J31454J39810J45685J48360
59468D589014J47278J41122J28685J10155Q6572N8661K7192o282m0080p3174j04386
$$ plain form
59539 6076053 6162197 6217397 6243356 6245224 6227460 6192626 6142736 6079880 6005733 5921873 5830857
59528 5830857 5736417 5642774 5554352 5475684 5410740 5362524 5333853 5327966 5347607 5394016 5467641
59517 5467641 5569241 5699131 5855514 6034292 6229951 6435457 6641485 6836949 7010528
59508 7010528 7151445 7249733 7297466 7290207 7226755 7107966 6936892 6719899 6466448 6187458
59498 6187458 5894204 5597868 5308258 5032217 4773811 4536024 4321473 4131658 3966594
59489 3966594 3825480 3707120 3609883 3532210 3473310 3432678 3409162 3401429 3409229 3433260 3473803
59478 3473803 3530351 3602390 3689372 3789851 3901753 4023705 4155159 4294969 4440654 4589014
59468 4589014 4736292 4877414 5006099 5116254 5202826 5261487 5288679 5282397 5242317 5169143 5064757
59457E064757j31629j53247j69352j80821j87743j90008j88550j84514j77828
59448C501065j68129j56600j45328j35065j24993j14603j04383r4780q5663p6938
59438B294583o8718o0878n3269m6194l9946l4162k8459k3244j8996j5216j1088
59427A894413o785l095l1L064O367R451J2113J4468J6579J8682K1052K2641K0891
59414B029810J4499N918m99k695j865L30L650Q312J3981K0273K6763L1881L3180
59401B183538K9787K4058K0006K0266K4644L0989L7188M2682M8339N4958O2295
59390B578750O9823P7746Q6510R5884J05480J15704J27163J39518J52070J65259
59380C713907J80363J97790K16955K37847K61481K88387L17659L47819L77664
$$ plain form
59457 5064757 4933128 4779881 4610529 4429708 4241965 4051957 3863407 3678893 3501065
59448 3501065 3332936 3176336 3031008 2895943 2770950 2656347 2551964 2457184 2371521 2294583
59438 2294583 2225865 2164987 2111718 2065524 2025578 1991416 1962957 1939713 1920717 1905501 1894413
59427 1894413 1887628 1884533 1884502 1887566 1893933 1903384 1915497 1929965 1946544 1965226 1986278 2008919 2029810
59414 2029810 2044309 2050227 2049728 2047033 2045168 2045498 2049148 2057460 2071441 2091714 2118477 2150358 2183538
59401 2183538 2213325 2237383 2257389 2277655 2302299 2333288 2370476 2413158 2461497 2516455 2578750
59390 2578750 2648573 2726319 2812829 2908713 3014193 3129897 3257060 3396578 3548648 3713907
59380 3713907 3894270 4092060 4309015 4546862 4808343 5096730 5414389 5762208 6139872
59371F139872M05782M30030M47909M57209M56327M44779M23740L95711L63541
59362I964900L29908K97234K67182K40148K15795J93837J73687J53617J31181
59353A1967489J04375P1754L1759j6844p3662j36476k02238k67444l27734l78509
59343A0772470m16566m40793m51411m49469m37181m17706l93972l67915l40879
59334G056578l14116k88704k65454k45024k27734k13275k00982j90409j81203
59325D929677j72705j64181j55350j46245j36844j27346j18410j10437j02941
59316C695218r5264q7505q0033p2470o4219n5656m7777m0760l3851k6657j9563
59305C071463j2899o551m90N227J0972J7255K3816K9809L4993L9981M5310N0987
$$ plain form
59371 6139872 6545654 6975684 7423593 7880802 8337129 8781908 9205648 9601359 9964900
59362 9964900 10294808 10592042 10859224 11099372 11315167 11509004 11682691 11836308 11967489
59353 11967489 12071864 12143618 12175377 12158533 12084871 11948395 11746157 11478713 11150979 10772470
59343 10772470 10355904 9915111 9463700 9014231 8577050 8159344 7765372 7397457 7056578
59334 7056578 6742462 6453758 6188304 5943280 5715546 5502271 5301289 5110880 4929677
59325 4929677 4756972 4592791 4437441 4291196 4154352 4027006 3908596 3798159 3695218
59316 3695218 3599954 3512449 3432416 3359946 3295727 3240071 3192294 3151534 3117683 3091026 3071463
59305 3071463 3058564 3052013 3051523 3056750 3067722 3084977 3108793 3138602 3173595 3213576 3258886 3309873
59293C309873N7116O4112P2072Q0374Q7973R3616R6018R4563R0071Q4369P9065
59282D209222P4963P2179P0073O7293O2639N5912M7448L7214K4883J0481n758
59271D726549k3711m2766o1426p8366r3507j07167j18710j27130j32440j35305
59261C806021j35801j33796j30242j26422j22082j15954j08082j00011r2394q4150
59251B657087p4602o4874n6363m9011m2052l5464k9642k4306j8671j2468o148
59240B243486k89M843R385J3865J8885K4658L1044L7928M5339N3377O2367P2833
59228B617721Q4780R7390J10100J23698J39578J58149J78647K00354K23044K46379
59218D179840K69547K91437L10438L24264L30609L27801L14429K89038K51232
$$ plain form
59293 3309873 3366989 3431101 3503173 3583547 3671520 3765136 3861154 3955717 4045788 4130157 4209222
59282 4209222 4284185 4356364 4426437 4493730 4556369 4612281 4659729 4696943 4721826 4732307 4726549
59271 4726549 4702838 4660072 4598646 4520280 4426773 4319606 4200896 4073766 3941326 3806021
59261 3806021 3670220 3536424 3406182 3279760 3157678 3041724 2933642 2833631 2741237 2657087
59251 2657087 2582485 2517611 2461248 2412237 2370185 2334721 2305079 2280773 2262102 2249634 2243486
59240 2243486 2243197 2248040 2257425 2271290 2290175 2314833 2345877 2383805 2429144 2482521 2544888 2617721
59228 2617721 2702501 2799891 2909991 3033689 3173267 3331416 3510063 3710417 3933461 4179840
59218 4179840 4449387 4740824 5051262 5375526 5706135 6033936 6348365 6637403 6888635
59209F888635K02641J45847Q2819J5498n2665j17298j75130k24258k62676k88127
59199F215286k99817k99250k89078k71904k50007k25231j98882j72308j47193
59190D061616j24508j03701q3954o5841n0529l7996k7310j8249j1323o669m356
59179C527180n203r520j5627k1456k7234l4559m3086n0479n5633n9593o3028o5184
59167C076578o5910o6413o7118o6755o4514o1250n7736n3516m8416m3406l8926
59156B442618l4023k8217k2591j7926j3382q123k831J709O087J1092J6158K0330
59144B370901K3750K7040L0141L2835L5531L8611M1749M4617M7364M9812N1295
59133B793646N1864N2459N3130N2524M9914M6321M2775L8866L4125K9456K5866
$$ plain form
59209 6888635 7091276 7237123 7319942 7335440 7282775 7165477 6990347 6766089 6503413 6215286
59199 6215286 5915469 5616219 5327141 5055237 4805230 4579999 4381117 4208809 4061616
59190 4061616 3937108 3833407 3749453 3683612 3633083 3595087 3567777 3549528 3538205 3531536 3527180
59179 3527180 3521977 3512457 3496830 3475374 3448140 3413581 3370495 3320016 3264383 3204790 3141762 3076578
59167 3076578 3010668 2944255 2877137 2810382 2745868 2684618 2626882 2573366 2524950 2481544 2442618
59156 2442618 2408595 2380378 2357787 2339861 2326479 2318356 2315525 2317234 2323321 2334413 2350571 2370901
59144 2370901 2394651 2421691 2451832 2484667 2520198 2558809 2600558 2645175 2692539 2742351 2793646
59133 2793646 2845510 2897969 2951099 3003623 3053537 3099858 3142633 3181499 3215624 3245080 3270946
59122C270946K3002K0125J7475J5446J3503J1169R040P573N929L307M79j353k370
59109C394271l547n046o424p642q472p695m182J730R030J7484K7131L7108M6352
59096C490098N4876O2920O9289P1883O9730O3435N3847M1211K5526O953j4018
59085C995750l6189n7921p8187r6833j13417j26627j35506j40424j42101j40636
59075B927909j36266j30097j23047j14871j05329r5430q6437p8313p0260o2213
59065A925646n4767m8098m1989l6450l1572k7220k3557k1219k0250j9651j8605
59054A582268j7231j5388j2059o953j620K488O089J0707J6064K0354K2594K3178
59042A630491K2403J9950J5702J0014L246l883r808j2979j3227j1571q885n461
$$ plain form
59122 3270946 3293948 3314073 3331548 3346994 3360497 3371666 3380706 3388279 3394208 3397515 3397994 3396641 3394271
59109 3394271 3390724 3385678 3379254 3371612 3363140 3355445 3351263 3352993 3362023 3379507 3406638 3443746 3490098
59096 3490098 3544974 3607894 3677183 3749066 3818796 3882231 3936078 3977289 4002815 4009768 3995750
59085 3995750 3959561 3901640 3823453 3726620 3613203 3486576 3351070 3210646 3068545 2927909
59075 2927909 2791643 2661546 2538499 2423628 2318299 2222869 2136432 2058119 1987859 1925646
59065 1925646 1870879 1822781 1780792 1744342 1712770 1685550 1661993 1640774 1620524 1600873 1582268
59054 1582268 1565037 1549649 1537590 1530637 1529017 1531505 1537594 1548301 1564365 1584719 1607313 1630491
59042 1630491 1652894 1672844 1688546 1698560 1701806 1697923 1688115 1675136 1661909 1650338 1641453 1635992
59030A635992j446K944P335J0857J2471J2087J0670Q810O195K949K41j283k379
59017A705443l451l232n89L487P235J0482J4109J7952K0920K2643K3398K2820
59005A841217K0199J5773J0359M003l669j2094j9979k6660l2103l5917l7544l7237
58993A686348l5809l3628l0724k7420k3983k0202j6248j3154j1426r936p393m231
58981A452194j768j59J463L416N426P574R934J1773J2446J2612J3278J4266J4914
58968A557369J5572J6835J7985J7984J7613J8742K1605K4498K6091K6549K6337
58957A787180K5487K4233K2997K1607J9535J6946J4558J2673J1351J1179J2683
58946A980429J5251J7807K0169K2737K5292K7368K9287L1536L3603L4904L6249
$$ plain form
59030 1635992 1634546 1637490 1644825 1655682 1668153 1680240 1690910 1699720 1705915 1708864 1709105 1707822 1705443
59017 1705443 1701992 1698760 1698171 1701658 1708893 1719375 1733484 1751436 1772356 1794999 1818397 1841217
59005 1841217 1861416 1877189 1887548 1891551 1887882 1875788 1855809 1829149 1797046 1761129 1723585 1686348
58993 1686348 1650539 1616911 1586187 1558767 1534784 1514582 1498334 1485180 1473754 1463818 1456425 1452194
58981 1452194 1450426 1450267 1451730 1455146 1460572 1468146 1478080 1489853 1502299 1514911 1528189 1542455 1557369
58968 1557369 1572941 1589776 1607761 1625745 1643358 1662100 1683705 1708203 1734294 1760843 1787180
58957 1787180 1812667 1836900 1859897 1881504 1901039 1917985 1932543 1945216 1956567 1967746 1980429
58946 1980429 1995680 2013487 2033656 2056393 2081685 2109053 2138340 2169876 2203479 2238383 2274632
58935B274632L8881M2480M5776M8744N2416N6746O0477O3143O5569O8338P1383
58924B888585P5145Q0509Q7468R5190J03578J13259J24084J35078J46150J58373
58914D007419J72335J87511K03487K20526K38693K57595K77183K97789L19146
58905F181684L40356L60781L80004L96984M10348M19309M23212M20396M08754
58896I741828L87385L56602L16514K66788K07705J40476O6869j0334q7042j59388
58886A1227403k25282k83478l31902l68565l93498m08145m13325m09631l99234
58877G994343l85094l68410l48832l27132l05660k86008k68158k52102k38361
58868E214586k26602k15520k04462j93663j82841j71245j59190j47753j36852
$$ plain form
58935 2274632 2313513 2355993 2401769 2450513 2502929 2559675 2620152 2683295 2748864 2817202 2888585
58924 2888585 2963730 3044239 3131707 3226897 3330475 3443734 3567818 3702896 3849046 4007419
58914 4007419 4179754 4367265 4570752 4791278 5029971 5287566 5564749 5862538 6181684
58905 6181684 6522040 6882821 7262825 7659809 8070157 8489466 8912678 9333074 9741828
58896 9741828 10129213 10485815 10802329 11069117 11276822 11417298 11484167 11473833 11386791 11227403
58886 11227403 11002121 10718643 10386741 10018176 9624678 9216533 8803208 8393577 7994343
58877 7994343 7609249 7240839 6892007 6564875 6259215 5973207 5705049 5452947 5214586
58868 5214586 4987984 4772464 4568002 4374339 4191498 4020253 3861063 3713310 3576458
58859C576458j25418j13625j02919r3631q4601p5554o7725o1444n5204m7957m0583
58848B707797l4137k8252k2271j6483j1357o727k461J216M607Q551J3080J7199
58836B630762K0432K3349K6308K9067L1947L5861M0822M5815N0582N6028O2488
58825C053461O9120P5521Q2370Q9904R7245J03945J10841J18772J27688J37471
58815D066338J48424J60497J73257J87041K02737K20297K38762K57975K78646
58806E933974L00515L22139L42790L62789L81468L96618M06416M10141M06421
58797I263271L92773L67702L31558K84656K26404J57406Q0777M58q0401j58597
58787A0866007k30244k92258l43330l82753m09739m24708m29706m26670m16564
$$ plain form
58859 3576458 3451040 3337415 3234496 3140865 3056264 2980710 2912985 2851541 2796337 2748380 2707797
58848 2707797 2673660 2645408 2623137 2606654 2595297 2588570 2586109 2587325 2591932 2600483 2613563 2630762
58836 2630762 2651194 2674543 2700851 2729918 2761865 2797726 2838548 2884363 2934945 2990973 3053461
58825 3053461 3122581 3198102 3280472 3370376 3467621 3571566 3682407 3801179 3928867 4066338
58815 4066338 4214762 4375259 4548516 4735557 4938294 5158591 5397353 5655328 5933974
58806 5933974 6234489 6556628 6899418 7262207 7643675 8040293 8446709 8856850 9263271
58797 9263271 9656044 10023746 10355304 10639960 10866364 11023770 11104547 11105005 11024604 10866007
58787 10866007 10635763 10343505 10000175 9617422 9207683 8782975 8353269 7926599 7510035
58778G510035m00898l82374l63031l43132l22787l03182k85126k67815k50170
58769D591520k32253k14556j97165j80504j65655j52975j41475j30307j19689
58760C056941j09863j00429r1368q3222p5667o7438n8308m9528m1697l3927k5873
58749B319621j8666j2817p025k74O547J2273J7025K0858K2489K0793J6181R333
58737B406338M9j1241k2373l1392l8397m4157m8215m9846m9702m8961m7780m5854
58725A968469m3640m1817m0414l9439l9464m0590m1888m2631m3042m3100m2006
58714A510438l9630l7086l4924l2299k8783k5343k2428j8938j4377j0322q171
58703A238137p101n938n470o993r841j2327j4162j6077j7875j8625j8209j7140
$$ plain form
58778 7510035 7109137 6726763 6363732 6020600 5697813 5394631 5109505 4841690 4591520
58769 4591520 4359267 4144711 3947546 3767042 3601387 3448412 3306937 3176630 3056941
58760 3056941 2947078 2846649 2755281 2672059 2596392 2528954 2470646 2421118 2379421 2345494 2319621
58749 2319621 2300955 2288138 2281113 2280839 2287386 2299659 2316684 2337542 2360031 2380824 2397005 2406338
58737 2406338 2406387 2395146 2372773 2341381 2302984 2258827 2210612 2160766 2111064 2062103 2014323 1968469
58725 1968469 1924829 1883012 1842598 1803159 1763695 1723105 1681217 1638586 1595544 1552444 1510438
58714 1510438 1470808 1433722 1398798 1366499 1337716 1312373 1289945 1271007 1256630 1246308 1238137
58703 1238137 1231036 1225098 1219628 1212635 1202794 1190467 1176305 1160228 1142353 1123728 1105519 1088379
58691A088379j5473j3183j0983r397p739n154k060O10K823N042P265R429J2069
58678A061628J5505J9149K2380K5210K7368K7770K5777K1968J7107J1521O147
58667A281530K540J015K30n95q45p60k391o770j1997j5788j8297k0758k2917k3749
58653A160448k3437k2696k1156j8241j4661j1518q759n944l458j710j06J839L604
58640A034205M989O873R362J0802J0248R339R973J1611J2710J3357J4499J5853
58628A163821J6734J7880K0335K3356K5401K6520K8005L0316L2984L5881L9104
58617A460337M2404M5903N0523N6439O2268O7044P1774P7704Q4468R1332R8724
58606B208920J06857J14333J19841J23817J26640J26691J22024J12602R9082Q0937
$$ plain form
58691 1088379 1072906 1059723 1048740 1039343 1031604 1026450 1024390 1025000 1027823 1032865 1040130 1049559 1061628
58678 1061628 1077133 1096282 1118662 1143872 1171240 1199010 1224787 1246755 1263862 1275383 1281530
58667 1281530 1284070 1285085 1285315 1284720 1283875 1283115 1280724 1273954 1261957 1246169 1227872 1207114 1184197 1160448
58653 1160448 1137011 1114315 1093159 1074918 1060257 1048739 1039980 1034036 1030578 1028868 1028762 1030601 1034205
58640 1034205 1039194 1046067 1055429 1066231 1076479 1085818 1095791 1107402 1120112 1133469 1147968 1163821
58628 1163821 1180555 1198435 1218770 1242126 1267527 1294047 1322052 1352368 1385352 1421233 1460337
58617 1460337 1502741 1548644 1599167 1655606 1717874 1784918 1856692 1934396 2018864 2110196 2208920
58606 2208920 2315777 2430110 2549951 2673768 2800408 2927099 3049123 3161725 3260807 3341744
58596C341744N7933L2041N792k0049m5188o7630q5139r7694j06434j11340j11983
58585B792053j09344j04706r7897q8637p8380o8604n8667m7610l6755k8055k1073
58574B052325j4052o884m99N584J2567K0051K6848L3149L9487M4510M6087M3774
58562B302947L7862K7163J0440j0708l2814n3632p1999q5905r3413r4924r2213
58551A842804q6149p7543o8838o2160n6626n0339m3924l9266l5843l1595k6687
58540A263834k3044k0646j7570j3673j1099j0837j1478j1613j1188j0357r111
58529A113218q021p555o997n692m499m231l845k295q63j114j875j064P40J516
58515A067423J527K678M980O852Q220J0270J2596J3677J3642J3740J3722J2626
$$ plain form
58596 3341744 3399677 3431718 3437510 3417461 3372273 3304643 3219504 3121810 3015376 2904036 2792053
58585 2792053 2682709 2578003 2480106 2391469 2313089 2244485 2185818 2138208 2101453 2073398 2052325
58574 2052325 2038273 2031389 2030890 2036474 2049041 2069092 2095940 2129089 2168576 2213086 2259173 2302947
58562 2302947 2340809 2367972 2378412 2367704 2334890 2281258 2209259 2123354 2029941 1935017 1842804
58551 1842804 1756655 1679112 1610274 1548114 1491488 1441149 1397225 1357959 1322116 1290521 1263834
58540 1263834 1240790 1220144 1202574 1188901 1177802 1166965 1155487 1143874 1132686 1122329 1113218
58529 1113218 1105197 1097642 1090645 1084953 1080454 1076223 1072378 1070083 1069220 1068106 1066231 1065167 1065907 1067423
58515 1067423 1068950 1071628 1076608 1083460 1091680 1101950 1114546 1128223 1141865 1155605 1169327 1181953
58503A181953J1362J1456J2058J1435J0548J1829J5084J8110K0738K4634K9488
58492A358695L3115L5117L6929L8233L6896L2486K6662K0090J2263M087k684q597
58480A623292j5716k3758l0344l4805l8375m0795m0308l7158l3666l0733k7476
58469A270158k4155k2027k0401j7373j3400j0746r452p517m869l411l125k015
58457A131667k7Q07L49O35J957K506K225L130N472P237P927R123J1040J2161J2473
58442A208682J3302J3944J2454R914R598J1650J2787J1653J0101Q758N890J473
58430A330206k080m174o673r499r946p492n007m091l195j387J51J339L783P160
58416A289095R060R228R928J1506J1911J1184J1788J3735J4237J2906J2338J2619
$$ plain form
58503 1181953 1193315 1204771 1216829 1228264 1238812 1250641 1265725 1283835 1304573 1329207 1358695
58492 1358695 1391810 1426927 1463856 1502089 1538985 1571471 1598133 1618223 1630486 1634573 1631889 1623292
58480 1623292 1607576 1583818 1553474 1518669 1480294 1439499 1399191 1362033 1328367 1297634 1270158
58469 1270158 1246003 1223976 1203575 1186202 1172802 1162056 1152604 1145087 1140218 1136807 1133682 1131667
58457 1131667 1131640 1132447 1132796 1133431 1135388 1137894 1140119 1143249 1148721 1155958 1163885 1173008 1184048 1196209 1208682
58442 1208682 1221984 1235928 1248382 1258296 1267894 1279544 1292331 1303984 1314085 1322843 1328733 1330206
58430 1330206 1328126 1323952 1317279 1307780 1297834 1290342 1285335 1281244 1278049 1276662 1276813 1278152 1281935 1289095
58416 1289095 1298155 1307383 1317311 1328817 1340728 1351912 1363700 1377435 1391672 1404578 1416916 1429535
58404A429535J0629O012K431J289l49l771n954n160l999m384m340k365l89R3N00
58389A419778J509J237p69k105k030k878n040n333k500N22K042M354Q682J2349
58375A429818J3609J4506J6306J6882J5328J4365J5437J6134J5183J5191J7552
58364A600311J9534J9287J8969K0024K0281J8687J7963J9465K0277J8636J7290
58353A810724J8275J9296J8583J8241J9366J8937J5224J1377R956Q846O197M408
58341A979430N342O534O044O239Q847J1171J1181J1468J4130J6592J6672J6906
58329B110556J9627K2492K3132K3549K5783K7873K8193K9001L1717L3569L2820
58318B408312L2263L3564L3589L0413K7393K6965K6036K2113J8294J7449J7084
$$ plain form
58404 1429535 1440164 1446176 1448607 1449896 1449547 1445776 1439822 1434662 1430663 1426279 1421939 1419574 1419185 1419278 1419778
58389 1419778 1421287 1422524 1421755 1419650 1417620 1414742 1409702 1404369 1401869 1402391 1404433 1408787 1417469 1429818
58375 1429818 1443427 1457933 1474239 1491121 1506449 1520814 1536251 1552385 1567568 1582759 1600311
58364 1600311 1619845 1639132 1658101 1678125 1698406 1717093 1735056 1754521 1774798 1793434 1810724
58353 1810724 1828999 1848295 1866878 1885119 1904485 1923422 1938646 1950023 1959979 1968825 1975022 1979430
58341 1979430 1984772 1991306 1997350 2003589 2012436 2023607 2034788 2046256 2060386 2076978 2093650 2110556
58329 2110556 2130183 2152675 2175807 2199356 2225139 2253012 2281205 2310206 2341923 2375492 2408312
58318 2408312 2440575 2474139 2507728 2538141 2565534 2592499 2618535 2640648 2658942 2676391 2693475
58307B693475J4830J3319J4812J6671J7025J8961K4092K8204K8416K8460L1583
58296B929848L4682L5091L6316M1020M5039M4894M4534M7987N1926N2482N2932
58285C416751N7349O2916O5913O9110P5879Q3150Q7604R2722J02051J11701J16940
58274D342086J19859J22887J21450J11181R6050Q1394O5596M6789L0619K2592
58264E160503J9368J6212J6018K2172K9971L4462L9451M9369N9795O5714P1318
58253E584353Q1564R2010R7549J02925J13637J24705J29962J34075J43490J53946
58243F758216J59236J63863J74275J86059J92753J98732K10273K22883K30955
58234H497245K40425K57806K76613K89348L02476L24176L48181L65993L83968
$$ plain form
58307 2693475 2708305 2721624 2736436 2753107 2770132 2789093 2813185 2841389 2869805 2898265 2929848
58296 2929848 2964530 2999621 3035937 3076957 3121996 3166890 3211424 3259411 3311337 3363819 3416751
58285 3416751 3474100 3537016 3602929 3672039 3747918 3831068 3918672 4011394 4113445 4225146 4342086
58274 4342086 4461945 4584832 4706282 4817463 4913513 4994907 5060503 5107292 5137911 5160503
58264 5160503 5179871 5196083 5212101 5234273 5264244 5298706 5338157 5387526 5447321 5513035 5584353
58253 5584353 5665917 5757927 5855476 5958401 6072038 6196743 6326705 6460780 6604270 6758216
58243 6758216 6917452 7081315 7255590 7441649 7634402 7833134 8043407 8266290 8497245
58234 8497245 8737670 8995476 9272089 9561437 9863913 10188089 10536270 10902263 11286231
58225A1286231M11064M41333M66437M93475N31541N73214O09296O48708P02752
58216A6164051P63574Q20582Q83553R65632J058809J151761J255907J386698J536401
58207B5986968J694605J877328K104928K371853K672614L035765L495209M053232
58199D7292502M713795N523906O532667P737055R119880J0709577J2550603J4667246
58191A18847231J7133668K0121750K3767543K8000164L2503306L6582696L8763644
58184C15720002L6740209K8517037J4258831l003660j8879768l0090463l5733469
58177C07528719l6717909l4552313l0626053k6001953k1358661j7093785j3587869
58170A27590176j1261040j0246710j0128915j0191066r928434r255493q316310
$$ plain form
58225 11286231 11697295 12138628 12605065 13098540 13630081 14203295 14812591 15461299 16164051
58216 16164051 16927625 17748207 18631760 19597392 20656201 21807962 23063869 24450567 25986968
58207 25986968 27681573 29558901 31663829 34035682 36708296 39744061 43239270 47292502
58199 47292502 52006297 57530203 64062870 71799925 80919805 91629382 104179985 118847231
58191 118847231 135980899 156102649 179870192 207870356 240373662 276956358 315720002
58184 315720002 352460211 380977248 395236079 392232419 373352651 343262188 307528719
58177 307528719 270810810 236258497 205632444 179630491 158271830 141178045 127590176
58170 127590176 116329136 106082426 95953511 85762445 75834011 66578518 58262208
58163E8262208p265537o224876n289640m494005l814123l230009k747519k359258
58155B2837241k033921j753736j523385j337140j173409j025648r05710q13482
58147A2270810p32715o58260n99305n54802n11934m69275m36703m12382l83427
58138G512007l49092l20694k99147k74300k46016k24644k10751j94492j75152
58129E217719j62154j56702j50583j42922j40376j41115j35867j24868j17253
58120C945879j13860j06816r5851q8898q6395q0718p1590o6858o7248o5066n8905
58109C043674n5494n5863n3492m7348m3582m2961l9272l1590k5865k3089j7798
58098B607320r564m343l208j046K203L34p696j5929k2317l0804m1161m7321m7789
$$ plain form
58163 58262208 50996671 44771795 39482155 34988150 31174027 27944018 25196499 22837241
58155 22837241 20803320 19049584 17526199 16189059 15015650 13990002 13084292 12270810
58147 12270810 11538095 10879835 10280530 9725728 9213794 8744519 8307816 7895434 7512007
58138 7512007 7162915 6842221 6543074 6268774 6022758 5798114 5587363 5392871 5217719
58129 5217719 5055565 4898863 4748280 4605358 4464982 4323867 4188000 4063132 3945879
58120 3945879 3832019 3725203 3629352 3540454 3454059 3373341 3301751 3234893 3167645 3102579 3043674
58109 3043674 2988180 2932317 2878825 2831477 2787895 2744934 2705662 2674072 2648207 2625118 2607320
58098 2607320 2597756 2593413 2590205 2589159 2591362 2591696 2584000 2568071 2545754 2514950 2473789 2426468 2378679
58085B378679m7701m8823m7177m2289l9134l8923l7170l2747k9941k9722k7763
58074A957289k3074j9992j9714j8172j4241j1883j2242j1523q606p093p939p535
58062A795275m910l515m250l869j934k060m728o016n029n474q209r400p762o690
58048A721429p417o902m271k711l093k374j8N58j309j963k77M39q15p45J621K880
58032A695032J889J932L991M389J691k65Q93K310J697J289K957M642M644M691
58018A731782O053P135P218Q135J0166J0861R825R963J2253J4083J4532J6181
58006A858187J9810K2477K3022K4272K7471K9568K8515K6383K4756K1796J6612
57995B122869J1803Q951N970J561k090l712n683r583j3200j4737j5988j8548k0632
$$ plain form
58085 2378679 2330978 2282155 2234978 2192689 2153555 2114632 2077462 2044715 2014774 1985052 1957289
58074 1957289 1934215 1914223 1894509 1876337 1862096 1850213 1837971 1826448 1817842 1810749 1802810 1795275
58062 1795275 1790365 1786850 1782600 1778731 1776797 1774737 1770009 1763993 1758964 1753490 1745281 1735881 1728119 1721429
58048 1721429 1714012 1707110 1702839 1700128 1697035 1694661 1694643 1695201 1693892 1691929 1691652 1692091 1691276 1690531 1692152 1695032
58032 1695032 1696921 1698853 1702844 1707233 1708924 1708659 1709552 1711862 1713559 1714848 1717805 1722447 1727091 1731782
58018 1731782 1737835 1744970 1752188 1760323 1770489 1781350 1791175 1801138 1813391 1827474 1842006 1858187
58006 1858187 1877997 1900474 1923496 1947768 1975239 2004807 2033322 2059705 2084461 2106257 2122869
57995 2122869 2134672 2143623 2149593 2151154 2149064 2145352 2139669 2130086 2116886 2102149 2086161 2067613 2046981
57982B046981k0435j8993j7266j4021r075m921k659KM372Q202R914J1522J4629
57969B008252J7201J7148J5676J4298J1836P146J735k867p301j1584j3496j2281
57957B045763j0681j0685j0444q003m878l103j712R70M192O585Q566J0495J1079
57944B038144R896Q868Q936Q149N313K607K084K449J925J520K703M426N215N704
57930B107939O582O337L739K63k429n106q690j1766j2900j3134j3726j3659j1817
57917B031633r467q043o639m089j429J51J617M039O314P344Q360J0605J2857J3637
57903B066890J3884J4890J5636J4711J2979J1817J0538Q064N426M085L435K267
57891B184622J120R26R37K11m88l33j64n77k02J897M032M430M106M887O445P649
$$ plain form
57982 2046981 2026546 2007553 1990287 1976266 1967191 1962270 1959611 1959613 1963985 1972187 1982101 1993623 2008252
57969 2008252 2025453 2042601 2058277 2072575 2084411 2091557 2093292 2090425 2083124 2071540 2058044 2045763
57957 2045763 2035082 2024397 2013953 2005950 2001072 1997969 1996257 1997227 2001419 2008004 2016570 2027065 2038144
57944 2038144 2048040 2056908 2065844 2073993 2079306 2081913 2083997 2086446 2088371 2089891 2092594 2097020 2102235 2107939
57930 2107939 2114521 2120858 2124597 2124860 2122431 2117325 2108635 2096869 2083969 2070835 2057109 2043450 2031633
57917 2031633 2022166 2014123 2007484 2003395 2001966 2002117 2003734 2007773 2014087 2021431 2029791 2040396 2053253 2066890
57903 2066890 2080774 2095664 2111300 2126011 2138990 2150807 2161345 2169409 2174835 2178920 2182355 2184622
57891 2184622 2185742 2186668 2187605 2187816 2187328 2186995 2186831 2186254 2186052 2187949 2191981 2196411 2200517 2205404 2211849 2219498
57875B219498Q965J1058J2754J2884J2506J2973J3524J3102J2690J3308J3578
57864B356840J1953R672Q692Q298O660M230K721J910M47j239j601p31J06Q21K012
57849B410791L119L414L831N437P191P638P661Q991J1021J1780J1298J1306J2172
57836B515650J2601J1979J0796R186P145N533M953M297K330j00j350j506j651
57823B579863j596n44R10J686K259L668N322N988O162P265R270J1287J3622J6915
57809B662077J9947K0720J9245J7094J4824J2026R380Q310Q964J0508J2951J6657
57797B832703K0649K3576K5869K8763L1679L2807L1877L0192K8073K4450J8974
57786C129612J2663O509J012l181n795p691r679j1112j1161j0594j0507j0186
$$ plain form
57875 2219498 2228463 2239521 2252275 2265159 2277665 2290638 2304162 2317264 2329954 2343262 2356840
57864 2356840 2368793 2378465 2387157 2395455 2402115 2406345 2409066 2410976 2411423 2410184 2408583 2407852 2407958 2408779 2410791
57849 2410791 2413910 2417324 2421155 2426592 2433783 2441421 2449082 2458073 2469094 2480874 2492172 2503478 2515650
57836 2515650 2528251 2540230 2551026 2560212 2567357 2572890 2577843 2582140 2584470 2584370 2583020 2581514 2579863
57823 2579863 2578267 2577723 2578633 2580319 2582578 2586246 2591568 2597556 2603718 2610983 2620253 2631540 2645162 2662077
57809 2662077 2682024 2702744 2721989 2739083 2753907 2765933 2775313 2783623 2792587 2803095 2816046 2832703
57797 2832703 2853352 2876928 2902797 2931560 2963239 2996046 3027923 3058115 3086188 3110638 3129612
57786 3129612 3142275 3148784 3149796 3146615 3140820 3133129 3123450 3112338 3101177 3090583 3080076 3069890
57774C069890q283n345l055j547L27K527L887M354N081O394P574Q456R540J0675
57760C110475J1269J1533J2055J2570J2645J2841J3702J4420J4225J4077J5165
57749C254977J6766J7553J7935J8872J9518J8620J7257J7396J8396J7902J5788
57738C450980J4247J4104J3960J3165J2832J3474J4152J4379J4720J5150J4947
57727C606110J4506J5145J6875J8307J8971J9694K0574K0690K0059J9804K0184
57716C810919K0373K0289K0745K1664K2173K2405K3290K4586K5262K5753K7497
57705D064956L0216L2051L2581L3323L4941L6397L7274L8617M0857M3187M5518
57694D469918M8879N3393N7974O2616O8688P6369Q4026R0837R7895J05963J14273
$$ plain form
57774 3069890 3061607 3056262 3053207 3051660 3051987 3054514 3058401 3062755 3067836 3074230 3081804 3090260 3099800 3110475
57760 3110475 3121744 3133277 3145332 3157902 3170547 3183388 3197090 3211510 3225735 3239812 3254977
57749 3254977 3271743 3289296 3307231 3326103 3345621 3364241 3381498 3398894 3417290 3435192 3450980
57738 3450980 3465227 3479331 3493291 3506456 3519288 3532762 3546914 3561293 3576013 3591163 3606110
57727 3606110 3620616 3635761 3652636 3670943 3689914 3709608 3730182 3750872 3770931 3790735 3810919
57716 3810919 3831292 3851581 3872326 3893990 3916163 3938568 3961858 3986444 4011706 4037459 4064956
57705 4064956 4095172 4127223 4159804 4193127 4228068 4264465 4301739 4340356 4381213 4424400 4469918
57694 4469918 4518797 4572190 4630164 4692780 4761468 4837837 4921863 5012700 5110595 5216558 5330831
57683E330831J22372J30975J40093J48278J54564J59203J61674J60027J53212
57674F661229J42278J28543J12646R6256Q2677P4548P2161P3783P4595O4777L3098
57663G616591k3362r3625j58894k04177k24417k22904k07002j84371j60066j35943
57653F001830j12809r2120p4886o0380m7342l5676k5890j7761j0637m386R65N840
57641E526748J0576J4948J8845K2663K6572L0262L3867L8082M2896M7428N1510
57630E864397N6162O1926O7958P3508P9018Q5012R1145R7112J03280J09644J15252
57619F804414J19339J21795J21890J17925J08984R5763P8888N7926L3093O580
57609G666597j8849m1612o0791p5348q5004r0716r3210r2090q7429q0974p4551
$$ plain form
57683 5330831 5453203 5584178 5724271 5872549 6027113 6186316 6347990 6508017 6661229
57674 6661229 6803507 6932050 7044696 7140952 7223629 7298177 7370338 7444121 7518716 7583493 7616591
57663 7616591 7593229 7499604 7340710 7136533 6912116 6689212 6482210 6297839 6137773 6001830
57653 6001830 5889021 5796901 5722015 5661635 5614293 5578617 5552727 5534966 5524329 5519943 5520908 5526748
57641 5526748 5537324 5552272 5571117 5593780 5620352 5650614 5684481 5722563 5765459 5812887 5864397
57630 5864397 5920559 5982485 6050443 6123951 6202969 6287981 6379126 6476238 6579518 6689162 6804414
57619 6804414 6923753 7045548 7167438 7285363 7394347 7490110 7568998 7626924 7660017 7666597
57609 7666597 7647748 7606136 7545345 7469997 7384993 7294277 7201067 7108977 7021548 6940574 6866023
57598F866023o8344o1811n5217m9038m2849l6211k9882k4888k0959j6997j2624
57587F447203q356m782k223n84J020L605O797R004R715J0331J1975J3840J4854
57574F512399J5566J7059J8969K0094K0253K0253K0579K1242K2354K3845K5094
57563F737707K5698K6055K6502K6744K6749K7251K8512K9678L0229L0975L2528
57552G048628L4024L4613L5101L6650L8782M0223M1023M2235M4035M5681M7011
57541G488006M8568N0392N2032N3620N5870N9056O2862O7055P1553P6089Q0562
57530H165665Q5392R0854R6483J01742J06608J10812J13210J12833J09902J04853
57520I198354R7010Q5295O9787N1674L2186J2467o043k2146l5471m5767n2225
$$ plain form
57598 6866023 6797679 6735868 6680651 6631613 6588764 6552553 6522671 6497783 6476824 6459827 6447203
57587 6447203 6438847 6434065 6431842 6431258 6432278 6435883 6442680 6451684 6461399 6471730 6483705 6497545 6512399
57574 6512399 6527965 6545024 6563993 6584087 6604340 6624593 6645172 6666414 6688768 6712613 6737707
57563 6737707 6763405 6789460 6815962 6842706 6869455 6896706 6925218 6954896 6985125 7016100 7048628
57552 7048628 7082652 7117265 7152366 7189016 7227798 7268021 7309044 7351279 7395314 7440995 7488006
57541 7488006 7536574 7586966 7638998 7692618 7748488 7807544 7870406 7937461 8009014 8085103 8165665
57530 8165665 8251057 8341911 8438394 8540136 8646744 8757556 8870766 8983599 9093501 9198354
57520 9198354 9295364 9380659 9450446 9502120 9534306 9546773 9540730 9518584 9483113 9437346 9385121
57509I385121n4460n3530n0946m7162m1958l5785k9579k3635j7718j1985o888
57498I011475k386J904O051R941J3693J7269K0248K2570K4924K7678L0222L2154
57486I215743L4228L7147M0187M2302M3838M5930M8743N1552N4158N6882N9502
57475I730212O1554O3508O6507P0845P5753Q0503Q5003Q9346R3652R8182J02898
57464A0617963J07070J09808J10648J09080J04186R5431Q3203O7906M9408K8354
57454A1483057P155j1606k7149l9821m9242n4530n5945n4753n1663m6663m0268
57443A1058572l3734k7929k2870j8230j3553q324k669K396O255R614J3211J6311
57431A0979050J7788J8127J8972K0977K3407K5632K7720K9652L1103L1953L2203
$$ plain form
57509 9385121 9330661 9277131 9226185 9179023 9137065 9101280 9071701 9048066 9030348 9018363 9011475
57498 9011475 9009089 9010993 9017044 9026985 9040678 9057947 9078195 9100765 9125689 9153367 9183589 9215743
57486 9215743 9249971 9287118 9327305 9369607 9413445 9459375 9508118 9559670 9613828 9670710 9730212
57475 9730212 9791766 9855274 9921781 9992626 10068379 10148882 10233885 10323231 10416883 10515065 10617963
57464 10617963 10725033 10834841 10945489 11054569 11158755 11254186 11337389 11405295 11454703 11483057
57454 11483057 11490212 11478606 11451457 11411636 11362394 11307864 11251919 11197166 11145503 11098840 11058572
57443 11058572 11024838 10996909 10974039 10955809 10942256 10933932 10931263 10933659 10939914 10949528 10962739 10979050
57431 10979050 10996838 11014965 11033937 11054914 11078321 11103953 11131673 11161325 11192428 11224381 11256584
57420A1256584L1720L0946L1184L2997L4969L5386L4620L4368L5017L5489L5357
57409A1628637L5362L5833L6252L6540L7213L8153L8627L8684L9084L9730L9664
57398A2043779L8782L8105L8080L7989L7449L7061L7267L7727L8257L9087L9861
57387A2463444L9649L8441L7440L7342L7494L7183L6709L6621L6866L7175L7446
57376A2875810L7398L6745L5999L6099L6997L7572L7235L6526L5871L4931L3655
57365A3274838L2758L2582L2501L2050L1634L1543L1284L0609L0207L0641L1341
57354A3621988L1444L0951L0360K9771K9078K8521K8328K8228K7957K7860K8423
57343A3942909K9446L0157L0015K9133K8079K7448K7339K7244K6632K5603K4659
$$ plain form
57420 11256584 11288304 11319250 11350434 11383431 11418400 11453786 11488406 11522774 11557791 11593280 11628637
57409 11628637 11663999 11699832 11736084 11772624 11809837 11847990 11886617 11925301 11964385 12004115 12043779
57398 12043779 12082561 12120666 12158746 12196735 12234184 12271245 12308512 12346239 12384496 12423583 12463444
57387 12463444 12503093 12541534 12578974 12616316 12653810 12690993 12727702 12764323 12801189 12838364 12875810
57376 12875810 12913208 12949953 12985952 13022051 13059048 13096620 13133855 13170381 13206252 13241183 13274838
57365 13274838 13307596 13340178 13372679 13404729 13436363 13467906 13499190 13529799 13560006 13590647 13621988
57354 13621988 13653432 13684383 13714743 13744514 13773592 13802113 13830441 13858669 13886626 13914486 13942909
57343 13942909 13972355 14002512 14032527 14061660 14089739 14117187 14144526 14171770 14198402 14224005 14248664
57332A4248664K4076K3871K4129K4664K4719K3808K2657K2362K2776K2698K1683
57321A4506107K0545J9910J9378J8468J7490J6996J7029J7284J7454J7241J6582
57310A4704484J5937J5851J6201J6512J6816J7495J8426J9126J9566J9975K0089
57299A4900478J9613J9180J9673K0725K1126K0648K0107J9670J8647J7082J5911
57288A5112860J5121J3316R723N261R82l214p663j2057j6211k0502k4737k7756
57276A5045123k8851k8596k7552k5444k2390j9662j8089j6774j4509j1568r019
57265A4822669p049n173l459k351j681q46L29J608K934M279N261N514N174M555
57251A4831764L772K967K394J962J336P03N88O31l87k825n463p135q040q718q732
$$ plain form
57332 14248664 14272740 14296611 14320740 14345404 14370123 14393931 14416588 14438950 14461726 14484424 14506107
57321 14506107 14526652 14546562 14565940 14584408 14601898 14618894 14635923 14653207 14670661 14687902 14704484
57310 14704484 14720421 14736272 14752473 14768985 14785801 14803296 14821722 14840848 14860414 14880389 14900478
57299 14900478 14920091 14939271 14958944 14979669 15000795 15021443 15041550 15061220 15079867 15096949 15112860
57288 15112860 15127981 15141297 15151020 15156281 15157263 15154049 15146386 15134329 15118118 15097616 15072879 15045123
57276 15045123 15016272 14987676 14960124 14934680 14912290 14892628 14874539 14857765 14843256 14831688 14822669
57265 14822669 14815620 14810447 14806988 14804637 14802956 14802110 14802439 14804047 14806981 14811260 14816521 14822035 14827209 14831764
57251 14831764 14835536 14838503 14840897 14842859 14844195 14844898 14845486 14846117 14845730 14842905 14837442 14830307 14822267 14813549 14804817
57236A4804817p352m913k645j675k679n806j0241j4613j8373k2033k5686k8415
57224A4660386k9893l1349l3921l7140m0043m2762m5810m8666n0388n0956n0825
57213A4198633m9827m7774m5436m3627m1811l9041l5835l3700l3065l3047l3165
57202A3762305l3935l5618l7569l9068l9987m0479m0699m0873m1000m0601l9371
57191A3333105l7915l7199l7394l7851l8000l7732l7143l6474l6012l5585l4596
57180A2927204l3037l1843l1599l1525l0571k8932k7608k6988k6792k6886k7192
57169A2604231k7234k6721k6203k6325k7026k8323l0988l5191l9279m1575m2782
57158A2252584m4932m8342n1635n4399n7307n9373n8233n5026n6653p0136r4791
$$ plain form
57236 14804817 14797465 14792552 14789907 14788232 14785553 14779747 14769506 14754893 14736520 14714487 14688801 14660386
57224 14660386 14630493 14599144 14565223 14528083 14488040 14445278 14399468 14350802 14300414 14249458 14198633
57213 14198633 14148806 14101032 14055596 14011969 13970158 13931117 13895282 13861582 13828517 13795470 13762305
57202 13762305 13728370 13692752 13655183 13616115 13576128 13535649 13494950 13454077 13413077 13372476 13333105
57191 13333105 13295190 13257991 13220597 13182746 13144746 13107014 13069871 13033397 12997385 12961800 12927204
57180 12927204 12894167 12862324 12830725 12799200 12768629 12739697 12712089 12685101 12658309 12631423 12604231
57169 12604231 12576997 12550276 12524073 12497748 12470722 12442399 12411411 12376220 12336941 12295366 12252584
57158 12252584 12207652 12159310 12107675 12053276 11995969 11936596 11878363 11823337 11766684 11696548 11601757
57147A1601757j21877j42152j52534j55657j55066j52293j47579j41480j34889
57138A0298230j28109j20589j11706j01469r0553q0006p0979o4361o0451n9083
57128I410924o0103o3428o8592p4566q0068q3842q4817q2571p7723p1423o4356
57117H599435n6627m8486m0419l2543k4645j6773q848M67J3567L2146N6411Q6226
57105H559911J21946J63777K11531K65937L29625M06395N00236O15418P56552
57096A1931328R27725J131916J371161J646089J954714K292394K653230L030748
57088B6939305L417276L803229M175947M517134M801391M997330N065902M953179
57080F2670693M592118L932081K984357J839888O32368n24534j571733k492442
$$ plain form
57147 11601757 11479880 11337728 11185194 11029537 10874471 10722178 10574599 10433119 10298230
57138 10298230 10170121 10049532 9937826 9836357 9745804 9665798 9594819 9530458 9470007 9410924
57128 9410924 9350821 9287393 9218801 9144235 9064167 8980325 8895508 8812937 8735214 8663791 8599435
57117 8599435 8542808 8494322 8453903 8421360 8396715 8379942 8371094 8371561 8385128 8417274 8473685 8559911
57105 8559911 8681857 8845634 9057165 9323102 9652727 10059122 10559358 11174776 11931328
57096 11931328 12859053 13990969 15362130 17008219 18962933 21255327 23908557 26939305
57088 26939305 30356581 34159810 38335757 42852891 47654282 52651612 57717514 62670693
57080 62670693 67262811 71194892 74179249 76019137 76651505 76126971 74555238 72062796
57072G2062796l281853l930976m428012m764329m938721m960069m846691m622161
57064C6289984m312084l943999l546217l143386k753299k388167k056598j762864
57056A2383370j506408j284426j094440r33740p98237o83718n87410n07089m39783
57047D548119l82670l34287k93733k59488k30026k04690j83022j64115j47497
57038B348591j33581j22349j12576j03264r4727q7328q0322p3031o6014n9920
57028A415479n4105m7641m0707l3826k6686j8948j1164l476N556J7202L0742M5171
57016A277597O1395P9243R1869Q6729N5494L298n3018r6246j18897j24066j18970
57005A144428j08908r6312q2978p0968o1333n3425m6285m0010l5266l2073k9740
$$ plain form
57072 72062796 68780943 64849967 60421955 55657626 50718905 45758836 40912145 36289984
57064 36289984 31977900 28033901 24487684 21344298 18590999 16202832 14146234 12383370
57056 12383370 10876962 9592536 8498096 7564356 6766119 6082401 5494991 4987902 4548119
57047 4548119 4165449 3831162 3537429 3277941 3047915 2843225 2660203 2496088 2348591
57038 2348591 2215010 2092661 1980085 1876821 1782094 1694766 1614444 1541413 1475399 1415479
57028 1415479 1361374 1313733 1273026 1239200 1212514 1193566 1182402 1178926 1184482 1201684 1232426 1277597
57016 1277597 1338992 1418235 1510104 1596833 1652327 1655625 1602607 1506361 1387464 1263398 1144428
57005 1144428 1035520 939208 856230 785262 723929 670504 624219 584209 548943 516870 487130
56994D87130k7635k5579k3697k2210k1059j9615j7224j4003j0537o748k023L384
56982C00184Q038J0728J1235R414M884j525p287j0326j0908j0464r351p036l819
56969B83767q92J143K648L889M724N325O288P824R612J1565J3997J6922J9758
56956C86570K1876K2738K1361J6364P313m062j4488k1286k4030k4133k3028k1053
56944C44142j8072j4475j0924p537m086q45J617L555O025R505J3352J6923K0535
56931C59715K4757K9189L2159L1316K4752J2534k581j6597k6856l2804l4739l3121
56919C67724k9254k5180k2085j9634j7306j5286j3576j1406q494n866m508l995
56907A91134l361k535k019j757j314o24J59J112K133K724K839L255M419N620O108
$$ plain form
56994 487130 459495 433916 410219 388009 366950 347335 330111 316108 305571 298823 296800 300184
56982 300184 308222 318950 330185 339599 344483 342958 335671 325345 314437 303973 294622 287586 283767
56969 283767 282875 284018 286666 290555 295279 300604 306892 314716 324328 335893 349890 366812 386570
56956 386570 408446 431184 452545 468909 476222 472160 457672 436386 412356 388223 365195 344142
56944 344142 326070 311595 300671 293134 289048 288203 289820 293375 299400 308905 322257 339180 359715
56931 359715 384472 413661 445820 477136 501888 514422 511841 495244 468388 435584 400845 367724
56919 367724 338470 313290 291205 271571 254265 238979 225403 213997 205503 199637 195129 191134
56907 191134 187773 185238 183219 181462 180148 179524 179683 180795 182928 185652 188491 191746 196165 201785 207893
56892B07893O303P023Q279R785J1911J5008J8346K0719K1591K0634J6873R792
56880C74157J007o537j1186j3381j4126j3729j2241r986p309m375j438J240L783
56867B85879O576R730J3050J6438J9961K3728K8003L3112L8619M2765M3084L7615
56855E98560K5754Q878r419k4537l3430l6085l4431l0460k5609k0791j6053j0737
56843C91640m723J047N937J0720J6466K3032K9688L6612M4666N3949O3344P0804
56831G43182P3101O6088M7258J8696j3111m0765n9436o8128o8907o4945n8361
56820E74672m9745l9688k9881k1912j5682j0026m312J513P776J4693K1581K7733
56808D76722L3812M0958M8307N2383M9237L6873J6341q331l1329m7723n5801n6930
$$ plain form
56892 207893 214196 221219 229498 239283 251194 266202 284548 305267 326858 347492 364365 374157
56880 374157 375164 368627 357441 344060 329934 316205 303964 293978 286669 282294 280856 282096 285879
56867 285879 292455 302185 315235 331673 351634 375362 403365 436477 475096 517861 560945 598560
56855 598560 624314 633192 623773 599236 565806 529721 495290 464830 439221 418430 402377 391640
56843 391640 386917 387964 393901 404621 421087 444119 473807 510419 555085 609034 672378 743182
56831 743182 816283 882371 929629 948325 935214 894449 835013 766885 697978 633033 574672
56820 574672 524927 485239 455358 433446 417764 407738 403426 404939 412715 427408 448989 476722
56808 476722 510534 551492 599799 652182 701419 738292 754633 746302 714973 667250 611449 554519
56796E54519n3554m7850m1467l5197k8816k1995j5295r663n284j627J757N246
56784C00774R376J4171J8669K2056K4638K6560K6030K0471R495m232j7082k6567
56772D24359l1813l3317l2538l0744k8110k4384k0104j6401j3764j1880j0373
56761A70931q978p333n484m197l957m065l575k607j833j323r10r64j613j843q42
56746A21407M64O20j75n79k85k8J12O77J366J300O04R7k95j121j794j258j41j22
56728A20849j159j505o32%m22q92o25l28n34n24J63P20M98L5k24p36j613j925
56710A11146j226m61m18m91M5O96P04L70M12P74R65R34Q94Q33P36P48Q44R36J333
56691A19774K238K882K281R39M24J086J575R65n2n48n03r5P61J551J230j75j244
$$ plain form
56796 554519 500965 453115 411648 376451 347635 325640 310345 300682 295398 293771 295528 300774
56784 300774 310150 324321 342990 365046 389684 416244 442274 462745 472240 468008 450926 424359
56772 424359 392546 359229 326691 295947 267837 243453 223349 206948 193184 181304 170931
56761 170931 161953 154620 149136 144939 140982 136917 133342 130735 128902 127579 126669 125705 124092 122249 121407
56746 121407 121871 122491 122316 121737 121452 121424 121536 122213 123579 124879 125483 125580 125285 124164 122370 121112 120971 120849
56728 120849 119690 118185 117553 117553 117131 116239 115614 115286 114752 114228 114391 115111 115609 115644 115420 114684 113071 111146
56710 111146 109920 109459 109041 108550 108595 109291 109995 110365 110777 111551 112516 113450 114344 115177 115913 116661 117505 118441 119774
56691 119774 122012 124894 127175 128114 128538 129624 131199 132164 132112 131564 131061 130966 131727 133278 134508 134333 133089
56674A33089j104m19L3M62J001J009K36m97n91n49q44j111j132j442k211k663
56658A23267k330j770j414q73o8K98O0L8M51L04p63j527j042j01K81M78J138J687
56640A18114J262J80o96j170j292p24M42J206J038O92Q15Q54L25k0N00J144R95
56623A23665N08N50Q70Q17O67R68J333J132O49M49L82K75O31J549J924J053N6
56606A37478L22J377J737J216Q31R81J080P87K98k65q16r32m06K99P44J185J769
56589A47685J915J257M06Jj99n03n42j41J06j4L10J405K240K088J823K306K800
56572A62943K381J755K046K860L172L216L815M692M999M860M807M456L320K248
56558B11570K384L354L940L956L957L827L214K614K500K081N97r53j167n67p46
$$ plain form
56674 133089 131985 131566 131599 132061 133062 134071 134307 133810 133219 132670 131826 130715 129583 128141 125930 123267
56658 123267 120937 119167 117753 116880 116812 117110 117170 117208 117659 117963 117200 115673 114631 114530 114811 115289 116427 118114
56640 118114 119376 119556 118860 117690 116398 115674 116116 117322 118360 119052 119867 120721 121046 121026 121526 122670 123665
56623 123665 124173 124723 125593 126410 127077 128045 129378 130510 131159 131608 131990 132265 132896 134445 136369 137422 137478
56606 137478 137800 139177 140914 142130 142961 143942 145022 145809 146107 145842 145026 144094 143688 143987 144731 145916 147685
56589 147685 149600 150857 151263 151264 151065 150562 150020 149879 149985 149971 150281 151686 153926 156014 157837 160143 162943
56572 162943 165324 167079 169125 171985 175157 178373 182188 186880 191879 196739 201546 206002 209322 211570
56558 211570 213954 217308 221248 225204 229161 232988 236202 238816 241316 243397 243994 243041 241874 241307 240561
56543B40561j805k634l112m031n112n252m604m414m822m702l760k998k847k587
56529A87881j794r98n73l21l04q52j652k027k090k480l106l237k796k397k252
56514A61002k104j958j861j422n42r8o81j352r73n7J61k31l03j48m19o16K46J651
56496A50295K157J662J248J080M58l03j17Q03J143P55P63J313J260L38k87l5L24
56479A62857L89Q35J929K822K871K364J666Q80M71J005K087K812L107L399L342
56464A92836K441J571J972K976K774J336M51Q23J241R33N49M35L1m81o7J067J244
56447B12132Oj021p08J6J46K23Q39J170M02p80j276j146j032j021r73j072j298
56430B04607j238r53j085j628j625o49N09J079J212J156P29J19J16R81J923K255
$$ plain form
56543 240561 238756 236122 233010 228979 223867 218615 214011 209597 204775 200073 196313 193315 190468 187881
56529 187881 186087 185089 184516 184195 183891 183039 181387 179360 177270 174790 171684 168447 165651 163254 161002
56514 161002 158898 156940 155079 153657 153115 153017 152336 150984 150011 149954 150115 149884 149581 149433 149014 148398 148644 150295
56496 150295 152452 154114 155362 156442 156900 156597 156480 157283 158426 159181 159944 161257 162517 162855 162568 162533 162857
56479 162857 163246 164081 166010 168832 171703 174067 175733 176613 177084 178089 180176 182988 186095 189494 192836
56464 192836 195277 196848 198820 201796 204570 205906 206357 207180 208421 209354 209903 210338 210369 209888 209821 210888 212132
56447 212132 212138 211117 210409 210425 210571 210794 211633 212803 213205 212425 211149 210003 208971 207950 206977 205905 204607
56430 204607 203369 202416 201331 199703 198078 197429 197938 199017 200229 201385 202114 202233 202349 203330 205253 207508
56414B07508K176K030J730J252Q46M92l0m04o1P52J134Q22L50m2n05p41k25P20
56396B17804J246J251J195R73K30m79l21L26N26N00J133K080K248J823J923K408
56380B34866K143J252R02R80K92q25o09J073K229J857J220J378J715J698J887
56365B52058K329K085J202J142K303L153K711J968J893J967J660J571K070K466
56351B80578K423K561K948K683J683J092J268J303J057J599K900L307K263J370
56337C09035J673K114J775J520K059K486K124J905K519L036K758K647L501M442
56323C43594M623M780N698O720P102P300P685P533O537N657N355M626L034J886
56309D22130K142K792K584J793J108M27p3M66J770K074Q60J3Q90K189K307J837
$$ plain form
56414 207508 209684 211714 213444 214696 215542 216034 216004 215600 215539 216291 217425 218247 218597 218555 218050 217309 217084 217804
56396 217804 219050 220301 221496 222469 222699 222220 221899 222225 222751 223251 224384 226464 228712 230535 232458 234866
56380 234866 237009 238261 239163 240143 240435 239610 239001 240074 242303 244160 245380 246758 248473 250171 252058
56365 252058 254387 256472 257674 258816 261119 264272 266983 268951 270844 272811 274471 276042 278112 280578
56351 280578 283001 285562 288510 291193 292876 293968 295236 296539 297596 299195 302095 305402 307665 309035
56337 309035 310708 312822 314597 316117 318176 320662 322786 324691 327210 330246 333004 335651 339152 343594
56323 343594 348217 352997 358695 365415 372517 379817 387502 395035 401572 407229 412584 417210 420244 422130
56309 422130 424272 427064 429648 431441 432549 432976 432903 433369 435139 437213 438073 438086 438976 441165 443472 445309
56293D45309K005K430K274K070K618L364L570L780M697N746O264O824Q128R764
56279E08843J1135J2337J3280J3424J3196J3996J5938J7516J8304J9806K2702
56268F80477K5579K7610L0023L3596L7149M0061M3687M8644N3125N5860N8325
56257A134136O1899O5300O6932O7539O8137O7501O4168N9066N3780M7941M0672
56246A797071L2900K5972J9542J2932O870J892l169q975j3929j6748j8870k2094
56234A813394k5760k8578l1325l5262l9638m3228m6550n0287n3236n4194n4115
56223A351221n4085n3138n0431m7594m6193m4843m1606l7427l4351l2071k9133
56212H80349k5918k3533k1306j8150j4993j3124j1660r350p239o726o625n084
$$ plain form
56293 445309 447314 449744 452018 454088 456706 460070 463640 467420 472117 477863 484127 490951 499079 508843
56279 508843 519978 532315 545595 559019 572215 586211 602149 619665 637969 657775 680477
56268 680477 706056 733666 763689 797285 834434 874495 918182 966826 1019951 1075811 1134136
56257 1134136 1196035 1261335 1328267 1395806 1463943 1531444 1595612 1654678 1708458 1756399 1797071
56246 1797071 1829971 1855943 1875485 1888417 1895287 1897179 1894010 1885035 1871106 1854358 1835488 1813394
56234 1813394 1787634 1759056 1727731 1692469 1652831 1609603 1563053 1512766 1459530 1405336 1351221
56223 1351221 1297136 1243998 1193567 1145973 1099780 1054937 1013331 975904 941553 909482 880349
56212 880349 854431 830898 809592 791442 776449 763325 751665 742315 735076 728350 721725 716641
56200G16641k894j945j880j217k71p5J48J440K557J944Q48J433L141L910L733
56185G27513M005M681M970N588P421R265R675R624J0610J1784J1835J1848J3307
56172H42126J5088J5586J5915J7625J9186J8426J6585J6253J6868J6211J4823
56161A024692J4893J6057J6335J6114J7327J9676K1464K3215K6731L1549L5954
56150A264007M0594M7405N6026O4933P5107Q8876J06070J24817J45021J67315
56140B180171J89544K07561K18361K19423K07343J81688J48963J18562R5585Q0570
56130C847771P3435P2455P1032O1278M1316J5591j0697l3587m8916n4615n4590
56119C980473n6336o4902q1870j07695j40098j71710j94379k05414k06169j96907
$$ plain form
56200 716641 713747 711802 709922 708705 708434 708359 708507 709947 712504 714448 715296 716729 719870 723780 727513
56185 727513 731518 736199 741169 746757 754178 763443 773118 782742 793352 805136 816971 828819 842126
56172 842126 857214 872800 888715 906340 925526 943952 960537 976790 993658 1009869 1024692
56161 1024692 1039585 1055642 1071977 1088091 1105418 1125094 1146558 1169773 1196504 1228053 1264007
56150 1264007 1304601 1352006 1408032 1472965 1548072 1636948 1743018 1867835 2012856 2180171
56140 2180171 2369715 2577276 2795637 3015060 3222403 3404091 3553054 3671616 3767201 3847771
56130 3847771 3921206 3993661 4064693 4125971 4167287 4182878 4172181 4138594 4089678 4035063 3980473
56119 3980473 3924137 3859235 3777365 3669670 3529572 3357862 3163483 2958069 2751900 2554993
56109B554993j78050j54351j31920j11927r2071p2758n6596m3372l1107k0824
56099A662017j4729j1055o431k029j438l674m528l737m495o670o932n188m508
56086A586603n015l915j260L49J256L995P635Q934Q452R438J1497J1694J0924
56073A650587J2591J5839J6891J6194J7305J9685J9860J8744K0223K3343K3740
56062A855002K2076K2952K6083K6853K5302K5953K8874K9663K8303K9237L2419
56051B152717L3275L1804L2640L5689L6061L3931L4831L9241M1524M0380M0646
56040B552739M3481M4529M3321M4720M9388N2500N3381N6493O1485O2600N9612
56029C124249N8901O2012O3750O3248O5814P1807P5087P4643P6399Q1286Q3306
$$ plain form
56109 2554993 2376943 2222592 2090672 1978745 1886674 1813916 1757320 1713948 1682841 1662017
56099 1662017 1647288 1636233 1629802 1627773 1626335 1622661 1618133 1614396 1609901 1603231 1596299 1591111 1586603
56086 1586603 1581588 1577673 1576413 1576762 1578018 1582013 1589648 1598582 1607034 1616472 1627969 1639663 1650587
56073 1650587 1663178 1679017 1695908 1712102 1729407 1749092 1768952 1787696 1807919 1831262 1855002
56062 1855002 1877078 1900030 1926113 1952966 1978268 2004221 2033095 2062758 2091061 2120298 2152717
56051 2152717 2185992 2217796 2250436 2286125 2322186 2356117 2390948 2430189 2471713 2512093 2552739
56040 2552739 2596220 2640749 2684070 2728790 2778178 2830678 2884059 2940552 3002037 3064637 3124249
56029 3124249 3183150 3245162 3308912 3372160 3437974 3509781 3584868 3659511 3735910 3817196 3900502
56018C900502Q1752Q3176Q8702R1798R1395R4445J02434J08395J10477J15186
56008D868262J23865J29680J31539J36869J46946J54045J56932J63906J76405
55999F188449J85506J89278J96991K11105K22195K27515K36936K54156K69931
55990H182062K80809K96147L19318L40778L57363L79040M08691M35475M56542
55981A1456225M84212N22801N60465N93429O34990O90354P47054Q01325Q68268
55972A7359123R53933J044461J135690J244997J380238J527660J685469J876754
55964B8208325K113588K384150K693099L076140L556208M129021M813503N666959
55956E6640993O722852P964769R389811J1040201J2948771J5136679J7708960
$$ plain form
56018 3900502 3982254 4065430 4154132 4245930 4337325 4431770 4534204 4642599 4753076 4868262
56008 4868262 4992127 5121807 5253346 5390215 5537161 5691206 5848138 6012044 6188449
55999 6188449 6373955 6563233 6760224 6971329 7193524 7421039 7657975 7912131 8182062
55990 8182062 8462871 8759018 9078336 9419114 9776477 10155517 10564208 10999683 11456225
55981 11456225 11940437 12463238 13023703 13617132 14252122 14942476 15689530 16490855 17359123
55972 17359123 18313056 19357517 20493207 21738204 23118442 24646102 26331571 28208325
55964 28208325 30321913 32706063 35399162 38475302 42031510 46160531 50974034 56640993
55956 56640993 63363845 71328614 80718425 91758626 104707397 119844076 137553036
55949A37553036K0854945K4675037K9052225L3629582L7574128L9137044L5851951
55942C58327948K6008335J0444129p250941k2668098l2969247l7745101l8176906
55935B55970119l5830929l2050179k7821570k3735379k0027690j6761230j3970920
55928H5772222j1654014r738339q142402o829528n770238m903701m175198l570819
55920C0987983l082758k677075k323833k024435j782218j576436j388991j227713
55912A4904524j100245r91168q86000p93034p21202o59231n95765n38637m96030
55903H123212m58442m16577l78514l52636l30971l04844k80494k64532k49773
55894E086429k29581k11141k01060j92177j77596j63688j56766j50329j37865
$$ plain form
55949 137553036 158407981 183083018 212135243 245764825 283338953 322475997 358327948
55942 358327948 384336283 394780412 387529471 364861373 331892126 294147025 255970119
55935 255970119 220139190 188089011 160267441 136532062 116504372 99743142 85772222
55928 85772222 74118208 64379869 56237467 49407939 43637701 38734000 34558802 30987983
55920 30987983 27905225 25228150 22904317 20879882 19097664 17521228 16132237 14904524
55912 14904524 13804279 12813111 11927111 11134077 10412875 9753644 9157879 8619242 8123212
55903 8123212 7664770 7248193 6869679 6517043 6186072 5881228 5600734 5336202 5086429
55894 5086429 4856848 4645707 4444647 4252470 4074874 3911186 3754420 3604091 3466226
55885C466226j25310j18968j13542j03619r4681r1454q7318p6698o6483o3873
55875B524280o3749n9146n3786n3296n4096n1909n1775n8726o7205p0056o9697
55864A870839p0725o9904o3352n5742n2552n0518m4899l8913l7065l6166l1779
55853A319224k6764k5001k3509j9000j5436j6824j9173j7744j5633j7071j8716
55842A104353j6036j2069j1531j2047r418o056o091p411o470n812r099j3563j4945
55829I73805j5175j7793k0520j9726j7702j8319j9872j9139j8044j9496k1052
55818G66967j9565j7593j8426j9282j6404j2419j1545j1801r128n202l968m134
55806F17500k223N10J116J318L922O370M858J571Q55J270j401o142q728r249j0653
$$ plain form
55885 3466226 3340916 3221948 3108406 3004787 2910106 2818652 2731334 2654636 2588153 2524280
55875 2524280 2460531 2401385 2347599 2294303 2240207 2188298 2136523 2077797 2010592 1940536 1870839
55864 1870839 1800114 1730210 1666858 1611116 1558564 1508046 1463147 1424234 1387169 1351003 1319224
55853 1319224 1292460 1267459 1243950 1224950 1209514 1192690 1173517 1155773 1140140 1123069 1104353
55842 1104353 1088317 1076248 1064717 1052670 1043252 1037196 1031105 1023694 1017224 1011412 1002313 988750 973805
55829 973805 958630 940837 920317 900591 882889 864570 844698 825559 807515 788019 766967
55818 766967 747402 729809 711383 692101 675697 663278 651733 639932 630804 625602 621634 617500
55806 617500 615277 615787 616903 618221 622143 628513 633371 634942 635797 637067 635666 629524 620796 611547 600894
55791F00894j2164j0924q166p197p107m861j798j826m704p020q232j0018j1398
55778E05479j0269q235q391r786r399p891q057r304r045p991q698j0371j0289
55765C87753q846q233p759n524l033k946l903k718j30P64K63R95K518K237M96
55750C51934l30o64k644n302n918n207o212q921j0692j1130j1851j2300j0526
55737B60237p427n718n403m512l293l334l639k097P3j21k307l598l564m017m767
55722B06513m152k932l287m616m622l659l692l991k434r3J78j060q06R23J364
55707A73634L18K81J549J867R97J091K346K629J552Q75Q57R6r82m97J165J921
55691A89699J965L185M961M751K740J662K022J658J34p07p27j864m098n044m085
$$ plain form
55791 600894 588730 577806 569640 562443 555336 550475 548677 546851 542147 535127 526895 516877 505479
55778 505479 495210 486975 478584 468798 459399 451508 443451 434147 425102 417111 408413 398042 387753
55765 387753 378907 370674 362915 357391 354358 351412 347509 344791 344661 345425 345688 346683 349201 351438 351934
55750 351934 351604 350940 348296 342994 337076 331869 325657 316736 306044 294914 283063 270763 260237
55737 260237 252810 247092 241689 237177 233884 230550 226911 224814 224887 224766 222459 218861 215297 211280 206513
55722 206513 202361 199429 196142 191526 186904 183245 179553 175562 173128 173035 173213 172153 171347 172270 173634
55707 173634 173952 174233 175782 177649 178646 179737 182083 184712 186264 187139 187996 188092 187110 186613 187778 189699
55691 189699 191664 194849 199810 204561 207301 208963 210985 212643 212777 212070 211343 209479 205381 200337 196252
55676A96252l178l228l223l111l894m668l456j087m92j878k439j075M74J399K818
55661A69214M603N153M727N240O332N598L197K111L140L694K491J431J658J543
55647B20132j2j735k770m037n616n861m375k955k565k184j439j371j874j466m09
55632A81463q81l187m912m839m618n442o188n960n638n711n340m571m787n937
55618A13452o086m628l270k929k461j337q17j374j679j147q90j237r49J40L61
55603H5149q30j765j380o89n43m25k67r27k073k154j213j054j941j945m46O73
55587F8170K96l87n54j112k173k133o21M45P8k09N62R85N4q10l37M30K36k07J77
55568F2890R07J171J174J018N8j495k167j467p46r23j264j170j134j224p59j99
$$ plain form
55676 196252 193074 189846 186623 183512 179618 174950 171494 170407 169915 168037 165598 164523 164997 166396 169214
55661 169214 173817 178970 183697 188937 195269 200867 204064 206175 209315 213009 215500 216931 218589 220132
55647 220132 220120 218385 215615 211578 205962 200101 195726 192771 190206 188022 186583 185212 183338 181872 181463
55632 181463 180582 177395 172483 167644 163026 157584 151396 145436 139798 134087 128747 124176 119389 113452
55618 113452 107366 102738 99468 96539 94078 92741 91924 90550 88871 87724 86834 85597 84648 84788 85149
55603 85149 84319 82554 81174 80485 79942 79517 79250 78323 76250 74096 72883 71829 69888 67943 67497 68170
55587 68170 68466 68079 67525 66413 64240 62107 61486 61931 62009 61800 62362 63347 63401 62591 62254 62684 62920 62713 62890
55568 62890 63797 64968 66142 67160 67218 65723 63556 62089 61343 60420 59156 57986 56852 55628 54869 54670
55552E4670r28k551k879j448l59o90r26j10M16j96n25L53J002K63o59m92ll9K84
55533D5183J575K496J956J039R85J176Q01O89J642K757L025L000L334L313K342
55518G5313J292R93J017J067J763K877K931J756J252K260K947J854J26r62k323
55503I4163m756o595o004l930k544k268k329k680l367l432k436j653k001k289
55489D7879j364l66q60k237k929k917k951k640j401j40om74m45j20j04J35J070
55472C0130J637Q29l83n36o2k84j104j515j461j352o86J009K658K828J746O07
55456C4061l27j310j789j170k00M5j50J05N44L72j47j73J83K01j65n68j129j886
55438B6497k090j270k15J31L8K43P19J095J365J366O57l11k24J055J861J170N6
$$ plain form
55552 54670 53742 51191 48312 46864 46505 45815 44889 44779 45195 44999 44474 44827 45829 46092 45433 44941 44938 44899 45183
55533 45183 46758 49254 51210 52249 53234 54410 55211 55900 57542 60299 63324 66324 69658 72971 75313
55518 75313 76605 77598 78615 79682 81445 84322 87253 89009 90261 92521 95468 97322 97448 96486 94163
55503 94163 89407 82812 76808 72878 70334 68066 65737 63057 59690 56258 53822 52169 50168 47879
55489 47879 46515 46149 45289 43052 40123 37206 34255 31615 30214 30074 30068 29594 29149 29029 28925 29060 30130
55472 30130 31767 32596 32213 31677 31615 31331 30227 28712 27251 25899 25213 26222 28880 31708 33454 34061
55456 34061 33734 32424 30635 29465 29265 29310 29160 29265 29809 30181 30034 29861 30044 30245 30080 29512 28383 26497
55438 26497 24407 23137 22922 23053 23091 23334 24053 25148 26513 27879 28536 28225 28001 29056 30917 32087 32143
55421C2143l51n75j168j186N7J329J371R58J334J966J778J187J056Q56j90j282
55405C9283j328r73j371j979j562m48J54K63O28R57M91l75q25j158j863k150j199
55388B6545N9K74q0K35R23Q89M33N32O69l49j964k485j782j239j330j252p89n65
55370A8724n31p7M55J42p21q88k13J82j90n75l45L38J128J729J673R37L41L96
55352B2505M31j26m82O8N62j49j195r00M86J193O73l2k63l07k01K66N76J08m88
55333B2725j33P44P76o9n40k58o9l03k75K82P38O38J67m79j084j113m51k3n16
55314B0757j082n50N91R28K57m72q11r33n72M74J278Q28k09l53M21R27Q16P23
55296B3018O72J16o17o12pK10j33m16n94j067j391p75M01J034J008R90R10K85
$$ plain form
55421 32143 31792 31217 30049 28863 28920 30249 31620 32578 33912 35878 37656 38843 39899 40755 40565 39283
55405 39283 37955 36982 35611 33632 32070 31622 31776 32039 32667 33624 34115 33740 32915 31757 29894 27744 26545
55388 26545 26604 26878 26798 27033 27956 28845 29278 29810 30479 30130 28166 25681 23899 22660 21330 20078 19289 18724
55370 18724 18193 18116 18571 18713 17992 17104 16891 17073 16883 16308 15963 16301 17429 19158 20831 21768 22109 22505
55352 22505 22936 22810 22328 22396 22958 22809 21614 20714 21200 22393 23066 23034 22771 22464 22263 22529 23105 23213 22725
55333 22725 22592 23336 24112 24043 23503 23245 23176 22873 22598 22880 23618 24256 24423 23944 22860 21747 21296 21273 20757
55314 20757 19675 19125 19716 20644 20901 20429 19618 18685 18113 18587 19865 20693 20484 20131 20552 21479 22295 23018
55296 23018 23690 23806 23189 22577 22570 22780 22647 22231 21637 20570 19179 18404 18805 19839 20847 21837 22747 23032
55278B3032l92k21M14M34k0j0K90m9p69p95l40o17j581j911j295p87p98o04kL52
55258A4331L89P26J228J117N28L03L12k39r81p95M5J81l76k53O56Q07k94j233
55240A6452j043m38j1P53J906K334J527N58L63N45N32N70Q66R80P06M19J57m34
55222B6742j040r01k89k97r48j101m34J45L16Q08J634J710Q32K12M41N43j78j010
55204B7185j297j467j761j463k80Q57J195J102R56M19n14j013p22l28k45j6M59
55187B3067M95jq7N59J002O84L11L56J54o76j321j165q41r92j239j191j252j551
55169A6312j304k46N20J39n77l84O45J539J811J574J000M39L42N18J77p94j456
55152B0255j126k15O36J290J612J237L24l91o54q89j167j033n02q4K95J062J683
$$ plain form
55278 23032 22640 22419 22833 23267 23247 23237 23527 23478 22709 21914 21574 20957 19376 17465 16170 15383 14585 13981 13979 14331
55258 14331 14720 15446 16674 17791 18319 18622 18934 18695 17714 16919 16964 17145 16769 16516 17172 17979 17685 16452
55240 16452 15409 14971 14960 15713 17619 19953 21480 22038 22401 22946 23478 24048 24914 25894 26600 27019 27176 26742
55222 26742 25702 24801 24512 24215 23267 22166 21732 21877 22193 23001 24635 26345 27177 27389 27830 28373 28195 27185
55204 27185 25888 24421 22660 21197 20917 21774 22969 24071 25027 25446 24932 23919 23197 22869 22624 22608 23067
55187 23067 23562 23561 23474 24033 25035 25719 26030 26386 26540 25864 24543 23378 22537 21545 20306 19115 17863 16312
55169 16312 15008 14762 15282 15421 14844 14460 15105 16644 18455 20029 21029 21468 21810 22328 22505 21711 20255
55152 20255 19129 18914 19550 20840 22452 23689 24013 23622 22968 22079 20912 19879 19377 19293 19588 20650 22333
55135B2333J168j3k97M09N13m58q94K26J679K081J854J900K028J927K148K853
55119C9457L005K057J084R74R53J67o01l55K55j8j051j857k116k043j560p74l59
55102C7218m87l77J40Mj096j634n59P63O03l80l76O28J102N60o4k58m40q05r97
55083C3545q45m58J40O15K82o74q48M03J650J408M41M72J432J840J317Q55Q82
55066D2457Q09M12J35Ol41o01j46O45P10J8l69m1J89k54p91o03L38J471K202K128
55046D8374J253J36n79p30m94nN02O84O13Q06J311J407P82J68J93M44M34N41J014
55027E6854J052J20p24k58P90P33n08j361r95j05O18J268J759J538O26j35l30
55010F0942m77r48j279r88l72q3l36q35j072o33M18J421J673J062k2j096j668
$$ plain form
55135 22333 23501 23488 23191 23600 24113 23655 22761 22987 24666 26747 28601 30501 32529 34456 36604 39457
55119 39457 42462 44519 45603 46577 47530 47697 47096 46741 46996 46978 45927 44070 41954 39911 38351 37577 37218
55102 37218 36731 36354 36494 36498 35402 33768 33209 33972 34575 34195 33819 34447 35549 36109 36045 35787 35347 34542 33545
55083 33545 32700 32242 32382 32997 33279 32605 31757 32160 33810 35218 35659 36131 37563 39403 40720 41575 42457
55066 42457 43266 43678 43813 43819 43478 42877 42731 43376 44086 44104 43735 43694 43883 43629 42838 42235 42573 44044 46246 48374
55046 48374 49627 49763 49184 48454 47960 47955 48457 49141 49754 50560 51871 53278 54060 54228 54421 54865 55299 55840 56854
55027 56854 57906 58026 57302 57044 57834 58567 58059 56698 55703 55598 56216 57484 59243 60781 61407 61272 60942
55010 60942 60465 59517 58238 57250 56878 56795 56459 55624 54552 53919 54337 55758 57431 58493 58471 57375 55707
54993E5707j395o49l68q43j182n87M26Q83P92P74P63K23n93p79j44N35P40P76
54975E5079R90J261J442J714K188K639K782K569K184J990K333L121L852M280M761
54960I3185N640O729P724Q673R629J0366J0920J1857J3504J5319J6525J6787J5790
54947B42648J2870P865J854l711q290j2051j4939j6629j7082j6503j5054j3163
54935A47815j1592j0612r658q261o773n611m529l315k454k306k317j904j411j289
54921G5783r83K60K009L164L447L517L973N042O804Q857J0354J1099J2054J3821
54907A59201J5446J5653J4468J2505R473M820p19n745r816j3122j5120j5142j4038
54894A57864j3434j3441j2696j0762q784p521o343m646k987k137k056k257k412
$$ plain form
54993 55707 54312 53663 53295 52452 51270 50683 51109 51992 52784 53558 54321 54544 53951 53172 53028 53563 54303 55079
54975 55079 56069 57330 58772 60486 62674 65313 68095 70664 72848 74838 77171 80292 84144 88424 93185
54960 93185 98825 105554 113278 121951 131580 141946 152866 164723 178227 193546 210071 226858 242648
54947 242648 255518 263383 265237 261526 253236 241185 226246 209617 192535 176032 160978 147815
54935 147815 136223 125611 115953 107692 100919 95308 90779 87464 85010 82704 80387 78483 77072 75783
54921 75783 74800 75060 77069 80233 83680 87197 91170 96212 103016 111873 122227 133326 145380 159201
54907 159201 174647 190300 204768 217273 226746 231566 230847 225102 215286 202164 187044 171902 157864
54894 157864 144430 130989 118293 107531 98747 91226 84883 80237 77250 75113 73057 70800 68388
54881F8388k222j489o74n76j233j775j558p67J25P61P56n6j103j593j565j736
54865E3683k217k291j582o31q8J0j01l86q16j166j160p14j0M77K96l88r10j021
54847D0985j106j279j034l78k88j185j936j377q2O07N92P14J037R28N18N91J144
54830C8451J364R92N21K19O3M18J507K431K043P14q0J92P54J108J530K038K229
54813E6494K234K582L027K822K166K068K764L600M489N953P639Q430Q317Q670
54799A21255J0184J2028J3447J4682J5755J5811J4341J1822Q523M054j265n922
54787B34715q973j1084j3016j4198j3768j2088j0253q783p607o678n872m893l848
54774A13654l286l206k766j485O9J270K257L262L948M132M335N018N913O732P827
$$ plain form
54881 68388 66166 64677 64003 63427 62194 60419 58861 58094 58219 58980 59736 59680 58577 56984 55419 53683
54865 53683 51466 49175 47593 46962 46874 46884 46783 46397 45581 44415 43255 42541 42531 43008 43304 42916 42006 40985
54847 40985 39879 38600 37566 37188 36900 35715 33779 32402 32320 32927 33519 34233 35270 36198 36716 37307 38451
54830 38451 39815 40807 41328 41547 41610 42028 43535 45966 48009 48723 48643 48835 49589 50697 52227 54265 56494
54813 56494 58728 61310 64337 67159 69325 71393 74157 77757 82246 88199 95838 104268 112585 121255
54799 121255 131439 143467 156914 171596 187351 203162 217503 229325 237848 241902 240637 234715
54787 234715 225742 214658 201642 187444 173676 161588 151335 142552 134945 128267 122395 117502 113654
54774 113654 110368 107162 104396 102911 102980 104250 106507 109769 113717 117849 122184 127202 133115 139847 147674
54759A47674R519J1409J3017J4508J6213J7989J9623K1153K2257K1913J9350J4885
54747C49510R268K787m379j1402j7132k0981k2996k3406k2568k1036j9272j7356
54735A81037j5253j3136j1240r686q508p627o776n787m934m595m584m360l774
54722H0777l098k429j768j478j920k641k722j908p48L47J289J757J392O16K98
54707F7764N48P48P11P81Q25L13n24q16m67k59l70j78K90J28p53j165m96L50N69
54688F7999O48J121J421J015N73Q80J451J382Q87Q81J536K241K623K788K850K853
54672I3149K966L243L446L411L162K594J606O26K84M63N01M34R23J846K182J734
54656A22570J570K258K978L144L586N087O998Q347R316J0441J1396J1773J2346
$$ plain form
54759 147674 157193 168602 181619 196127 212340 230329 249952 271105 293362 315275 334625 349510
54747 349510 358778 361565 357186 345784 328652 307671 284675 261269 238701 217665 198393 181037
54735 181037 165784 152648 141408 131722 123214 115587 108811 103024 98090 93495 88911 84551 80777
54722 80777 77679 75250 73482 72004 70084 67443 64721 62813 62065 62412 63701 65458 66850 67466 67764
54707 67764 68312 69060 69771 70552 71377 71690 71166 70350 69883 69624 69254 69076 69366 69494 68741 67576 67080 67430 67999
54688 67999 68647 69768 71189 72204 72777 73657 75108 76490 77377 78258 79794 82035 84658 87446 90296 93149
54672 93149 96115 99358 102804 106215 109377 111971 113577 114203 114487 114950 115451 115885 116808 118654 120836 122570
54656 122570 124140 126398 129376 132520 136106 141193 148191 156538 165854 176295 187691 199464 211810
54643B11810J4172J6886J9041J9778J9291J7941J5750J2461P568P79o971j3668
54631C34838j8006k0347k1413k1114j9458j7569j6502j5742j4140j1722r434p560
54619A41831n649l739k506k259k616l051l136k623j799j405j639j870j771j948
54605A05820k698l114k462j541j512k032j942j208p76q55p42k50l8m52j121j628
54589H3449j749j159J39J193R80j86j078j208j122j170j091q74r54j302j262n76
54573G2030J53K97p9n78r34r93o97k27J32K94K96J24o9O6M76N07j59p84m96M23
54553F9782R17O36K02J52L53N12N62N31N19Q10J626K750L762M502M979N185N326
54536A03106N874O922P862Q176Q133Q230Q361Q158P717P281O555M937K251j139
$$ plain form
54643 211810 225982 242868 261909 281687 300978 318919 334669 347130 354698 355477 348506 334838
54631 334838 316832 296485 275072 253958 234500 216931 200429 184687 170547 158825 149391 141831
54619 141831 136182 132443 129937 127678 125062 122011 118875 116252 114453 113048 111409 109539 107768 105820
54605 105820 103122 100008 97546 96005 94493 92461 90519 89311 88535 87680 86938 86688 86650 86198 85077 83449
54589 83449 81700 80541 80680 81873 82853 82667 81589 80381 79259 78089 76998 76124 75170 73868 72606 72030
54573 72030 72183 72480 72401 71823 70889 69896 69199 68972 69104 69398 69694 69818 69749 69815 70291 70798 70639 69855 69359 69782
54553 69782 70699 71335 71537 71689 72042 72554 73116 73647 74166 74976 76602 79352 83114 87616 92595 97780 103106
54536 103106 108980 115902 123764 131940 140073 148303 156664 164822 172539 179820 186375 191312 193563 192424
54522A92424m647p447q823q996r016r320r116p907o555n977n591m402k896k346
54508I9385k668k499j339j99K9m48j186k146l086l268k284o20Q86J692J651J040
54492H4940N14M81N85K57m35r59j050o47M45J993K891K289R22K58N60Q18M75M3
54474I4380l8n4k87n49p07q36p21j2J018J589J424R03K45o49j419j334l74N41
54456I3120O58P3p62j500j701j021J23P96O92M02M24M92J66n90j519k253k271
54439H5329j317N4R23J033P95L58m82j409j597r00k42l54p84o71K0M81J08q51
54421H0494j538j298l43M51O09N90R92J587J775J593J590J911K219K428K723K993
54405I8776K998K967L303L738L647L079K646K382J649K77j095j966k428k521k031
$$ plain form
54522 192424 187777 180330 171507 162511 153495 144175 135059 127152 120597 114620 109029 104627 101731 99385
54508 99385 96717 94218 92879 92680 92709 92261 91075 88929 85843 82575 80291 79671 80557 82249 83900 84940
54492 84940 85454 85935 86520 86777 86342 85383 84333 83686 84131 86124 89015 91304 92226 92484 93044 93862 94337 94380
54474 94380 94342 94288 94001 93452 92745 91909 91188 91176 92194 93783 95207 96110 96355 95706 94287 92953 92579 93120
54456 93120 93778 93851 93089 91589 89888 88867 88990 89786 90478 90880 91304 91796 91962 91372 89853 87600 85329
54439 85329 84012 84066 84989 86022 86817 87175 86693 85284 83687 82787 82545 82191 81407 80736 80756 81237 81345 80494
54421 80494 78956 77658 77315 77766 78375 78965 79957 81544 83319 84912 86502 88413 90632 93060 95783 98776
54405 98776 101774 104741 108044 111782 115429 118508 121154 123536 125185 125462 124367 122401 119973 117452 115421
54390A15421j140n22m88o90q64j204j815k394k705k749k458j849j473j917k822
54375I0331l180k670j907j300n90K46O52M13M0j36m22r08r65k36O43Q77N96N23
54357H2007R26J477J811J889J934K239K818L295L376L256L157K725J612L80m9
54342A12853K04R3p50j603j996k338k833k868k118j321j260j654j763j562j527
54327H9557j752j909j879j842j965k274k584k433j515l26J54k93q55r01q67j373
54311F6943k100k197j495o92m76q29j192j036l84J63K5p22j512j915j851j361
54295D9369o34j13j1Q9N52R33O47J75N25J533J842Q65l31n45Q5O59P19L34l20
54276E6373r22j005m97R2L53L71L05J92K82Q65J553J519O80o0p9L09P26J320K065
$$ plain form
54390 115421 114281 113759 113271 112581 111717 110513 108698 106304 103599 100850 98392 96543 95070 93153 90331
54375 90331 87151 84481 82574 81274 80684 80930 81582 81995 82035 81899 81477 80569 79604 79368 80011 80888 81484 82007
54357 82007 82933 84410 86221 88110 90044 92283 95101 98396 101772 105028 108185 110910 112522 112902 112853
54342 112853 113057 113150 112400 110797 108801 106463 103630 100762 98644 97323 96063 94409 92646 91084 89557
54327 89557 87805 85896 84017 82175 80210 77936 75352 72919 71404 71078 71232 70939 70084 69183 68316 66943
54311 66943 64843 62646 61151 60459 59983 59154 57962 56926 56542 56705 56730 56008 54496 52581 50730 49369
54295 49369 48735 48622 48611 48700 49252 50185 50832 51007 51532 53065 54907 55772 55441 54896 54981 55640 56359 56693 56373
54276 56373 55451 54446 53949 54041 54394 54765 55070 55262 55544 56409 57962 59481 60161 60101 60022 60331 61057 62377 64442
54257F4442K400K135J889K061K152J676R76N06J05l37l38K51N73o5r96j103m33
54240G5894J32L23N40O88J79r17j661j458p78m04n19p04n72j53J23j76r34j467
54222F8136j279o87m09o50q67m80L68Q63M09o31j271j097p04o95p23j85O05Q24
54204F1527M71L16N43M81j32o93p77o27l07N48J660J876O66r88j857j886j675
54187E9146j419j063q44q14n04K01N11j40r81q97j24J13n86j340j273n01K88O11
54169E0384L89j12m54l75j6K96L86K62M2r9j27l44j003j775j982j458o42P4N86
54150D4032P34M75L14P25J127N31p55j218l74M21rj002j255p35m21p77j340j391
54132C9082m67J271K733K669J160l50q97q77q44n75j2K15k4J47J013J436P27K9
$$ plain form
54257 64442 66842 68977 70866 72927 75079 76755 77731 78237 78342 78005 77667 77918 78491 78426 77430 76327 75894
54240 75894 76026 76349 76889 77577 77756 76839 75178 73720 72942 72538 72019 71315 70743 70590 70713 70537 69603 68136
54222 68136 66857 66170 65761 65111 64244 63764 64132 64995 65404 64773 63502 62405 61701 61006 60283 60098 60703 61527
54204 61527 61998 62314 62857 63338 63206 62513 61736 61109 60802 61350 63010 64886 65552 64564 62707 60821 59146
54187 59146 57727 56664 55820 55006 54502 54703 55214 55074 54093 53196 53072 53185 52599 51259 49986 49485 49773 50384
54169 50384 50773 50661 50207 49832 49816 50112 50498 50760 50802 50703 50576 50232 49229 47454 45472 44014 43372 43446 44032
54150 44032 44766 45241 45555 46280 47407 47938 47183 45965 45591 46012 46003 45001 43746 43011 42590 41813 40473 39082
54132 39082 38615 39886 42619 45288 46448 46098 45201 44324 43480 42905 42893 43108 43084 43231 44244 45680 46407 46436
54114D6436N28J452J440P87O46Q59N29J4M17J409J544O37n4k8j07n98n99L18J268
54095E6898J423R95M36k56q68p92k1N44L82L9Q2J63k38p70o24L41J384J648R06
54076F1672k79j057j088p35l70J04P53J150J047R18J178J333P51j32m15j70j64
54059F4496l93j31O47J134J053J044J393J554J241J041J478K328L201M025M615
54044H8726M544L882L367L463L760L646L087K496K299K806L933M996N231M672
54030A40908L954L369K765K308K459L070L343K935K294J720R25j21q12q79r94
54015A67244j802k946l600l537l144k767k573k710l090l230k799k174k081k729
54001A28062l561l834l262k170j141n84n99j175k159k983k863j718n43m04j149
$$ plain form
54114 46436 46964 48416 49856 50643 51289 52148 52677 52691 53108 54517 56061 56698 56644 56616 56509 55911 55312 55630 56898
54095 56898 58321 59316 59752 59496 58628 57836 57815 58359 58741 58780 58862 59025 58787 58017 57393 57734 59118 60766 61672
54076 61672 61393 60336 59248 58513 58143 58247 59000 60150 61197 62115 63293 64626 65377 65245 64830 64660 64496
54059 64496 64103 63972 64619 65753 66806 67850 69243 70797 72038 73079 74557 76885 80086 84111 88726
54044 88726 93270 97152 100519 103982 107742 111388 114475 116971 119270 122076 126009 131005 136236 140908
54030 140908 144862 148231 150996 153304 155763 158833 162176 165111 167405 169125 170050 169929 169117 168238 167244
54015 167244 165442 162496 158896 155359 152215 149448 146875 144165 141075 137845 135046 132872 130791 128062
54001 128062 124501 120667 117405 115235 114094 113510 112911 111736 109577 106594 103731 102013 101470 101066 99917
53986I9917j665j240k44N04N14j37r44j330j232j181j512j783j452p77m28m22
53970H6588k28K56M96K05k60m49k56J57M53K01n78j091n84O47J561J636J236R23
53952I0913R64J393J986K274K168K290L080L930L997L575L675M448N034N010M905
53937A39642N209N752O269O709O837O312N356M605M141L437K319J275O58L50K64
53922A99135M08M49Qn29k69R43K411L665M750N411N123M167L612L819L945L263
53906B40311K043Q15l28j226j455j147j150j812k411k376k178k429k904l175l484
53891B17094m242n181n750n879n798n512n024m653m628m693m578m431m415m324
53877A47986l982l636l466l244k779k317k053j799j469j414j810k163j925j299
$$ plain form
53986 99917 98252 97012 96768 97272 97786 97649 96705 95375 94143 92962 91450 89667 88215 87438 87010 86588
53970 86588 86360 86616 87112 87317 87057 86608 86352 86509 86962 87163 86585 85494 84910 85557 87118 88754 89990 90913
53952 90913 91877 93270 95256 97530 99698 101988 105068 108998 112995 116570 120245 124693 129727 134737 139642
53937 139642 144851 150603 156872 163581 170418 176730 182086 186691 190832 194269 196588 197863 198521 198871 199135
53922 199135 199543 199992 200000 199471 199202 200145 202556 206221 210971 216382 221505 225672 229284 233103 237048 240311
53906 240311 242354 243169 242841 241615 240160 239013 237863 236051 233640 231264 229086 226657 223753 220578 217094
53891 217094 212852 207671 201921 196042 190244 184732 179708 175055 170427 165734 161156 156725 152310 147986
53877 147986 144004 140368 136902 133658 130879 128562 126509 124710 123241 121827 120017 117854 115929 114630
53863A14630r75j280j969k588k795k554k180j932j570p42K37N54j1p51j018r53
53847I4103r93j219j436j473j207o51j04K35O36J300J634R88n3j48R18J934K044
53830I6508J709J567J460J196J133J383J355P76L21N07Q17O41L28M70Q26Q33O09
53813A12439O28Q53R07P74P00P84J100J784K601K959K754K587K824L101L162L331
53797A43288L664L587K939K463K557K490J719R51R75J274R85M00K91M05r2j083
53781A66813j739j942k265k690k598j991j603j741j965j963j906j804j400p63
53767A40443l50l47n05o15o90p09p20j027j752k439k591k315j998j698j435j594
53751A19658k296k801k416j610j354j677j852j740j796j878j309k66Q3p38j714
$$ plain form
53863 114630 113655 112375 110406 107818 105023 102469 100289 98357 96787 96045 96282 96836 96825 96074 95056 94103
53847 94103 93110 91891 90455 88982 87775 87124 87020 87255 87891 89191 90825 91813 91760 91612 92530 94464 96508
53830 96508 98217 99784 101244 102440 103573 104956 106311 107087 107408 107915 108732 109373 109701 110171 110997 111830 112439
53813 112439 113067 113920 114827 115601 116301 117085 118185 119969 122570 125529 128283 130870 133694 136795 139957 143288
53797 143288 146952 150539 153478 155941 158498 160988 162707 163658 164633 165907 166892 167292 167583 167988 167896 166813
53781 166813 165074 163132 160867 158177 155579 153588 151985 150244 148279 146316 144410 142606 141206 140443
53767 140443 140093 139746 139241 138626 137936 137227 136507 135480 133728 131289 128698 126383 124385 122687 121252 119658
53751 119658 117362 114561 112145 110535 109181 107504 105652 103912 102116 100238 98929 98663 98746 98008 96294
53736I6294j775j152p13o18l87P0K60n3l43O8J132J999J893R34m6m54l98k04J29
53717I6636P41J472J935J843J138N5q53j057n96Q5Q82K045L376M110L919L425
53701A19156L177K860K031J030N58Q19J620K813M026M526M004L113K613K433K142
53686A56921J837J825J925J789J554J541J687J895K423L265L747L400K769K553
53672A89131K550K230J762J596J532J210R49J152J403J139P05N97L54n48j310
53657B04452q41L05N99r3m88j96j90q76j362j179j078j493j683j132n40n62p16
53640A92927m36j80n55j118j038l99M5p6n68j135j418r71J28J040J079N88L99
53623A88312P25J095J122R32R10J298J958K398K228J629J129R73J070J484K394
$$ plain form
53736 96294 94519 93367 92654 92036 91649 91719 91979 91926 91583 91651 92783 94782 96675 97609 97563 97109 96711 96507 96636
53717 96636 97377 98849 100784 102627 103765 103820 102967 101910 101314 101399 102281 104326 107702 111812 115731 119156
53701 119156 122333 125193 127224 128254 128812 129631 131251 134064 138090 142616 146620 149733 152346 154779 156921
53686 156921 158758 160583 162508 164297 165851 167392 169079 170974 173397 176662 180409 183809 186578 189131
53672 189131 191681 193911 195673 197269 198801 200011 200960 202112 203515 204654 205359 205956 206310 205762 204452
53657 204452 203611 203916 204515 204422 203934 203738 203548 202672 201310 200131 199053 197560 195877 194745 194205 193643 192927
53640 192927 192491 192311 191756 190638 189600 189201 189246 189170 188602 187467 186049 185078 185206 186246 187325 187913 188312
53623 188312 189037 190132 191254 192186 193096 194394 196352 198750 200978 202607 203736 204709 205779 207263 209657
53608B09657L483M041L870L597L788M273M573M585M489M327L999L546L258L470
53594B64956M190M822M657L889L684M651N765N618M388L512L654M105M249M293
53580C26433M282L593K124Q93P88J351J629J513J503J633J451Q11M0n65r34j011
53564C45534p53k57K70N46K64n95j423j533j106j048j739k461k483k037j837k045
53548C27297k291k369k347k215j851j300p59l43m5J57K95L58K24j65n71o48l39
53531C13088J84R22J902K734K893K494K241K437K646K522K440K905L853M920O023
53516C54204P251Q491R528J0384J1193J1921J2390J2572J2649J2922J3598J4624
53504D91727J5720J6734J7756J8720J9228J9219J9463K0741K2682K4167K4789
$$ plain form
53608 209657 213140 217181 221051 224648 228436 232709 237282 241867 246356 250683 254682 258228 261486 264956
53594 264956 269146 273968 278625 282514 286198 290849 296614 302232 306620 310132 313786 317891 322140 326433
53580 326433 330715 334308 336432 337325 338113 339464 341093 342606 344109 345742 347193 348004 348044 347479 346545 345534
53564 345534 344781 344524 344794 345340 345604 345009 343586 342053 340947 339899 338160 335699 333216 331179 329342 327297
53548 327297 325006 322637 320290 318075 316224 314924 314165 313822 313777 313934 314229 314587 314811 314646 314075 313427 313088
53531 313088 313272 314194 316096 318830 321723 324217 326458 328895 331541 334063 336503 339408 343261 348181 354204
53516 354204 361455 369946 379474 389858 401051 412972 425362 437934 450583 463505 477103 491727
53504 491727 507447 524181 541937 560657 579885 599104 618567 639308 661990 686157 710946
53493G10946K5199K5945K6809K7508K8214K8945K9119K8206K6537K5078K4642
53482A007148K5516K7376K9324L0484L0897L1493L2889L4569L5425L4845L2976
53471A352942L0336K7496K4953K2942K1361J9923J8385J6765J5527J5246J5894
53460A581770J6705J7087J7290J7622J7482J6000J3356J0555Q032N391K441m85
53448A723246l364o639j0268j3491j5834j7549j8903j9869k0752k2173k4062k5530
53436A524812k6223k6857k7965k8960k9140k8832k8804k9107k9190k8752k7943
53425A213039k7008k6185k5584k4873k3496k1411j9147j6982j4741j2529j0828
53414I90255r494p544m531j311J166L081N167P540R850J2025J4124J5932J7352
$$ plain form
53493 710946 736145 762090 788899 816407 844621 873566 902685 930891 957428 982506 1007148
53482 1007148 1032664 1060040 1089364 1119848 1150745 1182238 1215127 1249696 1285121 1319966 1352942
53471 1352942 1383278 1410774 1435727 1458669 1480030 1499953 1518338 1535103 1550630 1565876 1581770
53460 1581770 1598475 1615562 1632852 1650474 1667956 1683956 1697312 1707867 1715899 1721290 1723731 1723246
53448 1723246 1719882 1713243 1702975 1689484 1673650 1656101 1637198 1617329 1596577 1574404 1550342 1524812
53436 1524812 1498589 1471732 1443767 1414807 1385667 1356835 1328031 1298924 1269734 1240982 1213039
53425 1213039 1186031 1159846 1134262 1109389 1085893 1064482 1045335 1028353 1013612 1001083 990255
53414 990255 980761 973217 968686 967375 968541 971622 976789 984329 994179 1006204 1020328 1036260 1053612
53401A053612J8803K0638K2543K4007K5016K5803K6415K7044K8201L0014L1856
53390A333952L3228L4589L6656L9367M2126M4702M7201M9574N1795N4218N7129
53379A824537O0140O2605O4333O5554O6399O6875O7046O6900O6355O5565O4826
53368B541135O3899O2064N9085N5521N1828M7946M4094M1011L8852L6813L4464
53357C076712L2468L1212K9742K7143K3972K1138J8110J3532P048r16j0614k2658
53345C246889l6256m9174n9673o7523p3120p6649p8304p8402p7181p5107p3278
53334B502222p2569p2450p1577o9641o7707o6661o6281o5983o5642o5317o4833
53323A753561o3951o2415n9826n6042n1833m8389m5992m3668m0414l6243l1884
$$ plain form
53401 1053612 1072415 1093053 1115596 1139603 1164619 1190422 1216837 1243881 1272082 1302096 1333952
53390 1333952 1367180 1401769 1438425 1477792 1519918 1564620 1611821 1661395 1713190 1767408 1824537
53379 1824537 1884677 1947282 2011615 2077169 2143568 2210443 2277489 2344389 2410744 2476309 2541135
53368 2541135 2605034 2667098 2726183 2781704 2833532 2881478 2925572 2966583 3005435 3042248 3076712
53357 3076712 3109180 3140392 3170134 3197277 3221249 3242387 3260497 3274029 3281077 3280161 3269547 3246889
53345 3246889 3210633 3161459 3101786 3034263 2961143 2884494 2806190 2727788 2650607 2575500 2502222
53334 2502222 2429653 2357203 2285626 2215985 2148278 2081617 2015336 1949353 1883711 1818394 1753561
53323 1753561 1689610 1627195 1567369 1511327 1459494 1411105 1365113 1321445 1281031 1244788 1212904
53312A212904k7916k4483k1491j8876j6697j5019j3597j2046j0357q883p581n870
53300A030088l619j596l00Q95K598M143M527M084L969M370M545M476N086O716
53286A069982Q678J0567J2800J5462J7827J9541K1272K3511K5623K6753K7017
53275A279033K7151K7497K7948K8445K8938K9173K8941K8336K7554K6672K5752
53264A585440K4831K3713K2253K0909K0401K0602K0303J8446J5176J1425P896
53253A791395M695J545j958n973j0179j4125j7935k2191k6980l1598l5370l8357
53241A592969m0925m3109m4674m5514m5634m4990m3589m1629l9340l6860l4357
53230A132348l2123l0432k9449k9215k9567l0176l0867l1745l2752l3357l3111
$$ plain form
53312 1212904 1184988 1160505 1139014 1120138 1103441 1088422 1074825 1062779 1052422 1043539 1035958 1030088
53300 1030088 1026469 1024873 1024573 1025468 1028066 1032209 1036736 1040820 1044789 1049159 1053704 1058180 1063266 1069982
53286 1069982 1078660 1089227 1102027 1117489 1135316 1154857 1176129 1199640 1225263 1252016 1279033
53275 1279033 1306184 1333681 1361629 1390074 1419012 1448185 1477126 1505462 1533016 1559688 1585440
53264 1585440 1610271 1633984 1656237 1677146 1697547 1718149 1738452 1756898 1772074 1783499 1791395
53253 1791395 1796090 1797635 1795677 1789704 1779525 1765400 1747465 1725274 1698294 1666696 1631326 1592969
53241 1592969 1552044 1508935 1464261 1418747 1373113 1328123 1284534 1242905 1203565 1166705 1132348
53230 1132348 1100225 1069793 1040344 1011129 981562 951386 920519 888774 856022 822665 789554
53219G89554l2244l1235k9995k8034k5317k2313j9348j6429j3703j1435r603q117
53207E41781p301p466q034q019p412p227p895q560q387p736p478p757q053q042
53193D32414p777p271o516n776n502n852o469o713o169n101m359m529n306o001
53179C49073o439o852p094o703n767m989m751m709m517m234l918l430k927k864
53165B79879l212l308k802k247k321k976l645l889l601l035k805l352m152m117
53151B34417l008j821j410j497j470j362j445j467j194j182k161l802m873m674
53137B03051l691k853k575k633k624k367j992j679j372r57o27o63r19r64q40j026
53121A75269j548j823j648j541j706j495n79J53k34j175j310m27L51K44l47p80
$$ plain form
53219 789554 757310 726075 696080 668046 642729 620416 601068 584639 570936 559501 549898 541781
53207 541781 534480 527014 518980 510961 503549 496322 488427 479867 471480 463744 456266 448509 440456 432414
53193 432414 424637 417366 410850 405074 399572 393720 387251 380538 374369 369268 364909 360380 355074 349073
53179 349073 342634 335782 328688 321985 316218 311229 306478 301769 297252 293018 289100 285670 282743 279879
53165 279879 276667 273359 270557 268310 265989 263013 259368 255479 251878 248843 246038 242686 238534 234417
53151 234417 231409 229588 228178 226681 225211 223849 222404 220937 219743 218561 216400 212598 207725 203051
53137 203051 199360 196507 193932 191299 188675 186308 184316 182637 181265 180308 179681 179018 178099 177135 176295 175269
53121 175269 173721 171898 170250 168709 167003 165508 164929 165082 164848 163673 162363 161936 162287 162531 162184 161404
53105A61404j032j304j494j461j381j382j304j056r10j123j451j446j048o19m40
53090A43953m20l65l09m78q69j085o74L21J295J699J550J309J270J295J124P57
53074A50373M35L19K94J89M1p5l83j234k416l086k709j796j251j254j331j314
53058A34802j501j885k032j858j808j991j859j193o61p91j020n35K94K11j218
53043A16955k977l748l182j872n94J75L56K24J32J25p5o28j304j703j677j398
53027I8809j097q68p33p83j110j560j716j283m75J81L93K73Ql98r44j424j567
53010H5706j276p09j82L2k9l5K05L65l6q85j461j288p04l07j72P1M65N03j96j220
52990G8847j672j173l32Ok24l31J60Q97J248J089P94P30R68J286J304Q78M99Q33
$$ plain form
53105 161404 160372 159068 157574 156113 154732 153350 152046 150990 150080 148957 147506 146060 145012 144393 143953
53090 143953 143533 143168 142859 142381 141512 140427 139753 140074 141369 143068 144618 145927 147197 148492 149616 150373
53074 150373 150808 151127 151421 151610 151651 151576 151193 149959 147543 144457 141748 139952 138701 137447 136116 134802
53058 134802 133301 131416 129384 127526 125718 123727 121868 120675 120014 119223 118203 117668 117962 118173 116955
53043 116955 113978 110230 107048 105176 104582 104757 105113 105337 105469 105594 105519 104891 103587 101884 100207 98809
53027 98809 97712 96844 96111 95328 94218 92658 90942 89659 89184 89365 89758 90031 90039 89641 88697 87273 85706
53010 85706 84430 83721 83539 83571 83542 83507 83712 84077 84041 83156 81695 80407 79703 79396 79224 79295 79760 80263 80067 78847
52990 78847 77175 76002 75670 75676 75452 75121 75281 76178 77426 78515 79309 80039 81007 82293 83597 84475 84974 85807
52972H5807J658J856Q62m36q90n82l95n08l41K92R47J422J896K187J845J092P18
52955I7430Q66Q30K79k04k06r0j26J20R24J718J921J820J959K171J950J330P79
52938A13471N23M88O40Q79J012J181J888L132M035L854K985K330K072J752J266
52923A41508R79R16N93k12j056j378j147q38r37j481j990j898j089MQ16R59K30
52906A33979j140k305k430j669r79q45p75l90j96p31j530j709j177n94l50k27
52890A16932K6L93P78J045R48M07k19m69l29j28nJ71M33N70L95ql73m95m23l66
52870A19283k71K21J109J608J031r4n20K6N94N74N48J103J783J956J893K239K883
52853A35966L279L371L413L217K438J354O71N40M62O0n76j262j903k400k656k704
$$ plain form
52972 85807 87465 89321 90183 89747 88857 88275 87880 87372 87031 87323 88270 89692 91588 93775 95620 96712 97430
52955 97430 98296 99126 99405 99201 98995 98905 98779 98899 99823 101541 103462 105282 107241 109412 111362 112692 113471
52938 113471 113994 114482 115122 116001 117013 118194 120082 123214 127249 131103 134088 136418 138490 140242 141508
52923 141508 142487 143403 143996 143784 142728 141350 140203 139365 138428 136947 134957 133059 131970 131974 132790 133749 133979
52906 133979 132839 130534 128104 126435 125456 124611 123836 123446 123250 122519 120989 119280 118103 117509 117159 116932
52890 116932 116958 117351 118129 119174 120122 120529 120310 119841 119512 119384 119379 119550 119983 120553 120948 120940 120567 120072 119649 119283
52870 119283 119012 119233 120342 121950 122981 122887 122367 122393 122987 123561 124109 125212 126995 128951 130844 133083 135966
52853 135966 139245 142616 146029 149246 151684 153038 153709 154249 154711 154771 154195 152933 151030 148630 145974 143270
52837A43270k538k091j568j391j556j496r38l76k91m42m85o83j304j818j544p54
52821A23995l54n90p97l65O05J512J697Q96k66o07L06J536J948J552J096Q86P51
52804A33801P75J161J569J416O85k21j191k183k679k234j409j216j716k033j740
52789A22785j357j397j688j866j919k052k353k631k406j332M7N07l55j366j225
52774A01392j68O20O44J62p54j954k485j577k25k10j573k530k097j249j004r73
52758H6019n49k03n92j288j503j336j405j725j736j197m35P4L2m96r50p34KN04
52740G2482M09J33Q3J70L10O51J033R60M31M3k7l54j104j465q76k5J32l12p20
52721G1954j089j755k291j784k88R69R72N9p46r31q40r49j165r79k59M00L73j69
$$ plain form
52837 143270 140732 138641 137073 135682 134126 132630 131692 131316 131025 130583 130098 129415 128111 126293 124749 123995
52821 123995 123641 123051 122254 121889 122494 124006 125703 126599 126333 125726 126032 127568 129516 131068 132164 133050 133801
52804 133801 134576 135737 137306 138722 139407 139186 137995 135812 133133 130899 129490 128274 126558 124525 122785
52789 122785 121428 120031 118343 116477 114558 112506 110153 107522 105116 103784 103831 104338 103983 102617 101392
52774 101392 101224 101844 102488 102650 101896 99942 97457 95880 95655 95445 93872 91342 89245 87996 86992 86019
52758 86019 85470 85267 84675 83387 81884 80548 79143 77418 75682 74485 74050 74124 74156 73660 72710 71976 71978 72482
52740 72482 72891 73024 73107 73277 73587 74238 75271 76231 76662 76705 76678 76324 75220 73755 72879 72854 72986 72674 71954
52721 71954 70865 69110 66819 65035 64747 65716 66688 66747 66001 65070 64230 63281 62116 61137 60878 61278 61651 61482
52703F1482n59o34q46j322j489q73K23J175J628J460O60l58p99l25M34O21J41
52686F0619l76m35p2L73O31O33N04L56J95J31M80J297J980J888J224P38O08L50
52668G1124p9j7Q23J792K228K251K171J851J229Q85J364K285K744K371J478M66
52652I4966m66j158j470j330p56J7M03J4o49o65j7M07L28N84J538K056J059o88
52634I4173j564j373j328k013k644k567k241k244k279j788r80n38o17o57j83O45
52618G1802J246J244Q04M21M26O78P57L81l53j011j093m37M98R96P95L57K77O27
52600G8415J021J141J022Q98R57J146J208R66N25J15j60k08J72Q83J210N27p16
52583H9122j294o76M79J355J803J919J583Q75K89K1l15q19q50n3P73P30J73O9
$$ plain form
52703 61482 60923 60289 59443 58121 56632 55759 55982 57157 58785 60245 60905 60547 59748 59423 59857 60478 60619
52686 60619 60243 59808 59736 60109 60740 61373 61877 62233 62428 62559 63039 64336 66316 68204 69428 70166 70774 71124
52668 71124 71045 71028 71851 73643 75871 78122 80293 82144 83373 84258 85622 87907 90651 93022 94500 94966
52652 94966 94500 93342 91872 90542 89786 89803 90206 90220 89571 88906 88889 89296 89624 90208 91746 93802 94861 94173
52634 94173 92609 91236 89908 87895 85251 82684 80443 78199 75920 74132 73152 72614 71997 71340 71157 71802
52618 71802 73048 74292 75096 75517 75943 76621 77378 77759 77406 76395 75302 74865 75363 76359 77154 77511 77788 78415
52600 78415 79436 80577 81599 82497 83454 84600 85808 86774 87299 87414 87254 87046 87218 88101 89311 89838 89122
52583 89122 87828 87152 87631 88986 90789 92708 94291 95166 95455 95476 95161 94342 93492 93439 94212 94942 95115 95184
52565I5184M43M95J01LM51O84J89m60n28k04j92n96q41n34J19O18O59K75j91l13
52545I5362P2O97J141J221J031P50N51N83P99P97J73q10j238n47O29J088N02l00
52527A02501m95j95R0K44L41J14n73j165j029m23m9J13O27J294J172J33o56l03
52509A01741O07R85O97L58K65K30J57P0k12q24j414j431p79P4N61M21j43n44l62
52490A00457J24L02J39K00N87O40j5p90j014q26o69n05j69O1n1j02K75O44M63
52471I9751J71N63J355J387M14l56J20J332J985J651J090J088J479J522R12J51
52455A14615j54q8j14l16l77k65k47k28J94Q26Q42N4n69k47M30L89l96j040j012
52436A12297n14J14O35P99O15M85O01N22p1n84k69N84J016P36K87L7j01l8N00
$$ plain form
52565 95184 95627 96122 96223 96226 96677 97361 97550 97090 96562 96358 96166 95570 94729 94195 94314 94932 95591 95866 95675 95362
52545 95362 95434 96131 97272 98493 99524 100274 100825 101408 102207 103004 103177 102367 101129 100582 101211 102299 102801 102501
52527 102501 102006 101811 101901 102145 102486 102600 102027 100862 99833 99410 99361 99474 100101 101395 102567 102700 102044 101741
52509 101741 102348 103333 104030 104388 104653 104883 105040 105110 104898 104074 102660 101229 100450 100524 101085 101506 101363 100819 100457
52490 100457 100581 100883 101022 101222 101809 102449 102434 101644 100630 99804 99135 98630 98461 98522 98471 98369 98644 99288 99751
52471 99751 99922 100485 101840 103227 103641 103285 103405 104737 106722 108373 109463 110551 112030 113552 114464 114615
52455 114615 114461 114373 114259 113943 113566 113301 113054 112826 113020 113846 114688 114742 114173 113926 114356 114745 114349 113309 112297
52436 112297 111783 111897 112532 113331 113946 114431 115032 115554 115483 114899 114630 115214 116230 116966 117253 117290 117189 117151 117651
52417A17651J266J511R46J23k39Q2Q31J550J803J604J428J475J229L46m85l70
52401A30751L83O57K38R4P67J483J296L48m69n42J15J068J684J501O61k31p54
52384A39050q53n18K57J083J376J037M76o0o80j254j301o70J63Q00J389K121K682
52367A45098K565J700M69o39j218j046k57O78J317J481J244Q90Q20J248J960K559
52351A58869K867K863K449J630Q48O60J087J577J646J325J009J098J656K158J924
52336A83666J082P35J654L135L788L146J884P18r6l21K99J485K482K856K698K188
52320B11399J567J476K422L886M781M933N277O282P117O846N780N089N467O652
52306B78974P864Q428Q254P972Q221Q780Q839Q232P783Q164R043R700R919R856
$$ plain form
52417 117651 118917 120428 121374 121497 121258 121340 122171 123721 125524 127128 128556 130031 131260 131606 131121 130751
52401 130751 131134 131791 132029 132123 132890 134373 135669 136017 135548 135006 135121 136189 137873 139374 140035 139804 139050
52384 139050 138197 137679 137936 139019 140395 141432 141908 141848 141168 139914 138613 137943 138106 138906 140295 142416 145098
52367 145098 147663 149363 149832 149193 147975 146929 146672 147350 148667 150148 151392 152282 153102 154350 156310 158869
52351 158869 161736 164599 167048 168678 169526 170186 171273 172850 174496 175821 176830 177928 179584 181742 183666
52336 183666 184748 185483 187137 190272 194060 197206 199090 199808 199712 199391 199690 201175 203657 206513 209211 211399
52320 211399 212966 214442 216864 220750 225531 230464 235741 242023 249140 255986 261766 266855 272322 278974
52306 278974 286838 295266 303520 311492 319713 328493 337332 345564 353347 361511 370554 380254 390173 400029
52292D00029R573R185R076R456R943J0024R687R265Q878Q382P774P275P030O936
52278E22513O755O232N167L533J582r1p93l31N62P95J41n50o25n02q54j498j866
52261E40170k030k314k293j302K25J112J145J285K068K922L419M024N053N914
52247E59398O064N918O207P007P914Q610Q891Q731Q652R256J0127J0061Q848P840
52233F73524Q087Q803Q595P371O166N538N211M832M254L277J904O77J03m4l22
52218G37976q04j348k151l355m405m670m469m618n162n366m983m546m372m044
52204F83683l246k378j878j524r33m06o50j613k224j548kJ081J065O88Q79J457
52188F72451J532Q75J39k12l41l85j61K28K37k59o86o59n62p89j108j258j553
$$ plain form
52292 400029 409602 418787 427863 437319 447262 457286 466973 476238 485116 493498 501272 508547 515577 522513
52278 522513 529268 535500 540667 544200 545782 545691 544898 544567 545129 545924 546065 545515 544890 544388 543534 542036 540170
52261 540170 538140 535826 533533 532231 532456 533568 534713 535998 538066 540988 544407 548431 553484 559398
52247 559398 565462 571380 577587 584594 592508 601118 610009 618740 627392 636648 646775 656836 665684 673524
52233 673524 681611 690414 699009 706380 712546 718084 723295 728127 732381 735658 737562 738239 738342 738298 737976
52218 737976 737172 735824 733673 730318 725913 721243 716774 712156 706994 701628 696645 692099 687727 683683
52204 683683 680437 678059 676181 674657 673724 673318 672668 671055 668831 667283 667281 668362 669427 670115 670994 672451
52188 672451 673983 674858 674997 674785 674444 674059 673898 674126 674363 674104 673418 672759 672197 671408 670300 669042 667489
52171F67489k221k710k399j663j513k368l701m721m892m067k647j442r95j118
52157F31032j390j742k260k794l149l417l703l828l666l420l310l308l410l684
52143E87951l860l519k936k938l516l519k409j372j708k918l516l200k910l141
52129E46489l449l485l379l098k508k043k284k833k622j472l24K23N91J183J727
52114E22716K085K711L740M402M067L312L264M278N800P205Q280R040R591J0154
52100F00645J0916J1811J2606J3119J3316J3326J3438J3911J4722J5517J5808
52089G49135J5257J3957J2508J1556J1028J0204Q744P253O354N676M447K778J510
52076H60407R08L19p36j887k599k891l037l042k829k650k988m032n450o510o592
$$ plain form
52171 667489 665268 662558 660159 658496 656983 654615 650914 646193 641301 637234 634587 633145 632150 631032
52157 631032 629642 627900 625640 622846 619697 616280 612577 608749 605083 601663 598353 595045 591635 587951
52143 587951 584091 580572 577636 574698 571182 567663 565254 563882 562174 559256 555740 552540 549630 546489
52129 546489 543040 539555 536176 533078 530570 528527 526243 523410 520788 519316 518992 519215 519806 520989 522716
52114 522716 524801 527512 531252 535654 539721 543033 546297 550575 556375 563580 571860 580900 590491 600645
52100 600645 611561 623372 635978 649097 662413 675739 689177 703088 717810 733327 749135
52089 749135 764392 778349 790857 802413 813441 823645 832389 839642 845996 851672 856119 858897 860407
52076 860407 861315 861634 860898 859011 856412 853521 850484 847442 844613 841963 838975 834943 829493 822983 816391
52061H16391n730m666m075l888l565k827j799o47N03J400J946K438L105L527L077
52046H05190J870P75M80J028K123L369M239M433M234M053L727K906J971J770K379
52031H44547K896K628J763O77o51k189l529m429n148n851o220o055n850o292p510
52016G98787r086j0509j1374j1527j1321j1417j2072j2901j3522j3949j4198j3984
52004F52927j3193j2310j1957j2268j2929j3583j3948j3884j3605j3570j3904
51993E07776j4221j4156j3818j3505j3306j3166j2994j2561j1685j0657j0050
51982C67657r919r699r170q863r154r598r653r465r296q743p399n890n229n292
51968B50287m972l925l121l302l801l622k975k924l708m337m004l139k708k893
$$ plain form
52061 816391 810661 805995 801920 798032 794467 791640 789841 789194 789697 791097 793043 795481 798586 802113 805190
52046 805190 807060 807835 808315 809343 811466 814835 819074 823507 827741 831794 835521 838427 840398 842168 844547
52031 844547 847443 850071 851834 852511 851860 849671 846142 841713 836565 830714 824494 818439 812589 806297 798787
52016 798787 789701 779192 767818 756291 744970 733553 721481 708580 695058 681109 666911 652927
52004 652927 639734 627424 615467 603199 590270 576687 562739 548855 535250 521680 507776
51993 507776 493555 479399 465581 452076 438770 425604 412610 400049 388364 377707 367657
51982 367657 357738 348039 338869 330006 320852 311254 301601 292136 282840 274097 266698 260808 255579 250287
51968 250287 245315 241390 238269 234967 231166 227544 224569 221645 217937 213600 209596 206457 203749 200856
51954B00856k985k480j773j565j940k316k256j985k010k396k661k321j485p10
51940A71973l92m10m87o44j071j617j840j668j642k196k927k994k157j098p19
51925A50111j219j941k049j375n99m74q93j042m79L11O90O06L29j48q30j266j010
51908A38722l97j55m27p29q63j144j641j917j742j494j491j374n89P36J756J737
51892A28988P97j86m30n2J86o6l14q5K38qp57j369j564j473j004K6J226J886J908
51873A27947J747J499Q66J13RN73Q01Q3r09j200o69K11J083J652J578R25K93N5
51855A36657LRL25Q40Q55J86l06N7P20Q23M97L47K64j76o23l91K74M79J03r6J90
51834A41037M95N82Q35J344J565J272J010J194J396J118O40N72R31J264J404J552
$$ plain form
51954 200856 197871 195391 193618 192053 190113 187797 185541 183556 181546 179150 176489 174168 172683 171973
51940 171973 171581 171171 170684 170040 168969 167352 165512 163844 162202 160006 157079 154085 151928 150830 150111
51925 150111 148892 146951 144902 143527 142928 142454 141561 140519 140040 140351 141041 141647 141976 141828 140998 139732 138722
51908 138722 138325 138170 137743 137014 136151 135007 133366 131449 129707 128213 126722 125348 124759 125495 127251 128988
51892 128988 129785 129599 129169 129117 129303 129237 128923 128838 129076 129068 128311 126942 125378 123905 122901 122927 124153 126039 127947
51873 127947 129694 131193 132059 132172 132181 132754 133555 133638 132729 131529 130860 131071 132154 133806 135384 136309 136602 136657
51855 136657 136660 136669 136994 137834 138689 138875 138569 138626 139346 140169 140666 141013 141277 141101 140478 140087 140361 140840 140943 140847 141037
51834 141037 141532 142114 142949 144293 145858 147130 148140 149334 150730 151848 152488 153060 153991 155255 156659 158211
51818A58211J752J743J382Q56M83M98R26J522J923K072K447L538N130O370O758
51803A95611O816P478Q978J0563J1316J0834R101O146K261j752n113p637r413
51790B45189j0157r606q421p760p723p083n116k876j907k234k532k031j270r82
51776A75491j079j036o58j37K88M24J94k08m79o13q83j310j489j171p02n80p56
51759A65296p31l15J44K43L7j72l16m95n73k73K64M70J32k06j9L13K8q22j380
51740A61625j216q48q15r09p25m17l78n65o61o54p82j027j164j133r83o11P6P61
51722A49574R73O73K70L6p5l9L40R31J056J51j373k310j852m52P37J144J135J096
51704A52015P77m3p16l87P10J394J055K32m55j064j672j818j223m69k14j61M49
$$ plain form
51818 158211 159963 161706 163088 163944 164427 164925 165851 167373 169296 171368 173815 177353 182483 188853 195611
51803 195611 202427 209905 218883 229446 240762 251596 260697 266843 269104 267352 262239 254602 245189
51790 245189 235032 225426 217005 209245 201522 194439 189323 186447 184540 182306 179774 177743 176473 175491
51776 175491 174412 173376 172718 172581 172869 173293 173487 173279 172800 172187 171304 169994 168505 167334 166632 166052 165296
51759 165296 164565 164250 164394 164637 164674 164502 164186 163691 163118 162845 163109 163579 163711 163505 163486 163799 163827 163005 161625
51740 161625 160409 159561 158746 157837 157112 156695 156317 155752 155091 154437 153655 152628 151464 150331 149348 148737 148813 149574
51722 149574 150547 151220 151490 151526 151451 151412 151752 152683 153739 153890 152517 150207 148355 147903 148640 149784 150919 152015
51704 152015 152792 152749 152033 151646 152356 153750 154805 155037 154582 153518 151846 150028 148805 148336 148122 147961 148410
51687A48410J651K771L429L759L693K704M66k502n003n902n006l365k433k639
51673A40033l151l142k670k032j127j29M8j035k166j802k50O73J42p18o69J5L28
51656A22348L2l43m56m14l84l25j26K61O66P11K38l46m79j36K80O12Q94Q26Nj194
51636A22670j792j457q40m71j06M16N13k51j232j472j000o52p62q51n17N7N67
51619A12820J026J466J667J459J103J125J723K479K715K196J405J030J200J434
51605A34848J290Q87O48P61J026J081P42J99j22o2Ol34q48q62j72P31J417K043
51587A43279K776L259L043K327J729J481J266Q23L39J30K16L25K04j60n46p90
51571A59701j032j548k240k584k264j671j446j656j694j076r0M86K03n56j010
$$ plain form
51687 148410 150061 152832 156261 160020 163713 166417 166883 164381 159378 153476 148470 145105 142672 140033
51673 140033 136882 133740 131070 129038 127911 127782 127830 126795 124629 122827 122577 123250 123392 122674 122005 122020 122348
51656 122348 122380 122037 121581 121167 120783 120458 120332 120593 121259 121970 122208 121862 121383 121247 121527 122139 123033 123859 123864 122670
51636 122670 120878 119421 118581 118110 118004 118420 118933 118682 117450 115978 114978 114326 113564 112713 112196 112253 112820
51619 112820 113846 115312 116979 118438 119541 120666 122389 124868 127583 129779 131184 132214 133414 134848
51605 134848 136138 137025 137673 138434 139460 140541 141283 141482 141360 141298 141304 140970 140122 139260 139088 139819 141236 143279
51587 143279 146055 149314 152357 154684 156413 157894 159160 159983 160322 160452 160668 160993 161197 161037 160491 159701
51571 159701 158669 157121 154881 152297 150033 148362 146916 145260 143566 142490 142400 142886 143089 142533 141523
51556A41523p94l54l52p72r18l53M76P77M19L0J40N58O91K97k49l23L64J523K498
51537A45181K800K415J700R76L81mn7J81L36J4p36j352j362q35k20J80L12J32
51519A50042l96j002j130m70O88J728K217K109J597R97N34K63K06N40J330K143
51503A61396K367K040J833K039K070J425N94M48J046J682J933J963J929J736J467
51488A85968J448J751K079K202K100J687R05Qo64j238k072k928l147k691k302
51473A83106k307k074j169l18n28j680k726l026k796k378j806j140o00j93L57
51458A60722J101J658J723J485J266R70K06j124k594l707m359m707m706m109k958
51443A40867j856j422j688k184k589k917l131k998k456j852j574j602j575j231
$$ plain form
51556 141523 140729 140375 140023 139251 138333 137980 138456 139233 139652 139682 139822 140380 141071 141368 141119 140796 141160 142683 145181
51537 145181 147981 150396 152096 153072 153453 153449 153392 153573 153909 153923 153187 151835 150473 149638 149418 149598 149910 150042
51519 150042 149646 148644 147514 147044 147732 149460 151677 153786 155383 156380 156914 157177 157383 157923 159253 161396
51503 161396 163763 165803 167636 169675 171745 173170 173764 174212 175258 176940 178873 180836 182765 184501 185968
51488 185968 187416 189167 191246 193448 195548 197235 198140 198148 197484 196246 194174 191246 188099 185408 183106
51473 183106 180799 178725 177556 177238 176710 175030 172304 169278 166482 164104 162298 161158 160558 160365 160722
51458 160722 161823 163481 165204 166689 167955 168925 169131 168007 165413 161706 157347 152640 147934 143825 140867
51443 140867 139011 137589 135901 133717 131128 128211 125080 122082 119626 117774 116200 114598 113023 111792
51429A11792o75j97K9O5j2l61j178k165k569j998r86l55k08K4N79J002Q13R2p22
51410A02970j265j342r58l97k8O2J6j54m95p57o20k83k71n38m60J62P39Q67R61
51391I8209J432J831J482N56j87l94k61J07P33J266J118J90r36j643j767j431
51375A00305q69m15k71k55L0P05J542K307K829K863K349J763J724K120K087J108
51359A19922l30j391j931k392k967l279l031k463k061j933j782j376q23l82j98
51344I3583k52m38o23p42r08j263j651j705j387j114j115j015m57J65K04k18l79
51327H0685r1R1p5o7M64R93Q79L04j9K52R46J738K279K258J787J403J277Q95j9
51308I5980q08p80l84n97j383j722j148l22J03K83N13M75j72j008j241p56k32
$$ plain form
51429 111792 111117 110920 110949 111014 111002 110641 109463 107298 104729 102731 101745 101390 101182 101206 101785 102787 103600 103692 102970
51410 102970 101705 100363 99405 99008 98980 99042 99058 98904 98409 97652 97032 96749 96478 95940 95480 95642 96381 97248 98209
51391 98209 99641 101472 102954 103510 103323 102929 102668 102775 103508 104774 105892 106082 105146 103503 101736 100305
51375 100305 99436 99021 98750 98495 98525 99230 100772 103079 105908 108771 111120 112883 114607 116727 118814 119922
51359 119922 119592 118201 116270 113878 110911 107632 104601 102138 100077 98144 96362 94986 94163 93781 93583
51344 93583 93331 92893 92270 91528 90620 89357 87706 86001 84614 83500 82385 81370 80913 81078 81282 81064 80685
51327 80685 80594 80685 80610 80543 81007 82000 82879 83183 83164 83416 84362 86100 88379 90637 92424 93827 95104 95999 95980
51308 95980 95172 94392 94008 93411 92028 90306 89158 88836 88939 89222 89735 90210 90038 89030 87789 87033 86801
51291H6801k24m93m23J68Q08J058J097J316J478Q90l76j092l44J069J468L90r71
51274I2620j459j163p93n96m12k67l02m30m73m53m48l41p2J43J02QK47Q40J353
51255H8104J340P45k3l63M3Q54J408J420J152Q51M22j74n71m63q3J22J23K35N36
51236I5678P91Q72R36J142J430J608J482R63K81n5K01O03M86j23m42Q6J097J760
51218A08796J722J314R92Q17N70R9m47o72j89J008K347K887K095M83p31q67n01
51201A19723o72j468j949j505o89l10l30j87J40J49k69o92r49j251j389o97P43
51184A08398J646R81o04j604j571j352j545j690j224m65j13k72n18o28p87j116
51168I7536j421j440j087m66J72M87K78k49n57k69L80O92K30o06r59m90K42N81
$$ plain form
51291 86801 86577 86084 85661 85829 86637 87695 88792 90108 91586 92476 92100 91008 90664 91733 93201 93591 92620
51274 92620 91161 89998 89205 88609 88197 87930 87628 87198 86725 86272 85824 85483 85411 85554 85656 85664 85911 86751 88104
51255 88104 89444 90189 90166 89803 89846 90700 92108 93528 94680 95531 95953 95779 95208 94745 94662 94784 94907 95142 95678
51236 95678 96469 97341 98277 99419 100849 102457 103939 104902 105183 105128 105329 105932 106418 106295 105853 105939 107036 108796
51218 108796 110518 111832 112824 113641 114211 114310 113863 113191 113002 114010 116357 119244 121339 121822 121091 120224 119723
51201 119723 119051 117583 115634 114129 113440 113130 112800 112613 112753 112902 112633 111941 110992 109741 108352 107655 108398
51184 108398 110044 111025 110421 108817 107246 105894 104349 102659 101435 100970 100857 100585 100067 99439 98652 97536
51168 97536 96115 94675 93588 93122 93294 93781 94059 93810 93253 92984 93364 94056 94286 93680 92721 92231 92473 93054
51150I3054N98P88J157J178O47J3k51k17j62j37o0M6J55L09M37L86L05N75J152
51131I9973J444J136O65M94L73j32p24o83J53J251K093K567K679K450K073J766
51115A17578J500J200J030J097J114Q31N28N42N56J11l98r7R54J606J106k1q02
51098A28435q48l48M09J046J214R57O20K81k25o90o65l41m96j187j364m13O89
51081A27074N35q28j937j631j41J372J872J195J71j34L84P63K73n91q97o36n81
51064A26263j039j412j076j56O81R28O17J95N8J30J01k6J07N26P47M74M6p5J28
51045A27217N25J182K001K499K366J962J763J739J658J571J512J155L78k10j5
51030A47303O99J286J698K170K407J917J030O11Q29J074J085J277J789K040J623
$$ plain form
51150 93054 93652 94440 95597 96775 97422 97435 97184 96967 96805 96668 96608 96654 96809 97118 97555 97941 98246 98821 99973
51131 99973 101417 102553 103218 103712 104085 103953 103229 102546 102699 103950 106043 108610 111289 113739 115812 117578
51115 117578 119078 120278 121308 122405 123519 124350 124878 125420 125976 126087 125689 125592 126546 128152 129258 129237 128435
51098 128435 127587 127239 127648 128694 129908 130865 131485 131766 131541 130851 130186 129845 129349 128162 126798 126385 127074
51081 127074 127609 126781 124844 123213 123072 124444 126316 127511 127682 127548 127932 128695 128968 128377 127480 126844 126263
51064 126263 125224 123812 122736 122580 123261 124189 124806 125001 125059 125189 125290 125264 125371 125897 126644 127118 127164 127089 127217
51045 127217 127742 128924 130925 133424 135790 137752 139515 141254 142912 144483 145995 147150 147528 147318 147303
51030 147303 148002 149288 150986 153156 155563 157480 158510 159121 159950 161024 162109 163386 165175 167215 168838
51015A68838R96R63J828L209M345M596M054L611L967M698M868M350L884L841L846
51000B21894L675L694M148M759N342O096O874O949N969M737M419N363P039Q799
50986B99757J0285J1378J2233J3143J4153J5008J5762J7059J9410K2450K5279
50975D75917K7442K9207L0962L2713L4276L5714L7306L9050M0268M0111L8566
50964H61532L6669L5352L4233L2043K8204K3500J9092J5347J1852Q220M604J589
50952A112237l45j244j644j924j892j206JJ231K172K733K640J558m90l251o751
50937A103825j1143j6020k0522k4207k7341l0227l2792l4922l6724l8200l9094
50926G92633l9250l8758l7706l6066l3883l1229k8040k4435k0983j8213j5939
$$ plain form
51015 168838 169834 170797 172625 175834 180179 184775 188829 192440 196407 201105 205973 210323 214207 218048 221894
51000 221894 225569 229263 233411 238170 243512 249608 256482 263431 269400 274137 278556 283919 290958 299757
50986 299757 310042 321420 333653 346796 360949 375957 391719 408778 428188 450638 475917
50975 475917 503359 532566 563528 596241 630517 666231 703537 742587 782855 822966 861532
50964 861532 898201 933553 967786 999829 1028033 1051533 1070625 1085972 1097824 1106044 1110648 1112237
50952 1112237 1111892 1110648 1109004 1107080 1105188 1103982 1103983 1105214 1107386 1110119 1112759 1114317 1113827 1110576 1103825
50937 1103825 1092682 1076662 1056140 1031933 1004592 974365 941573 906651 869927 831727 792633
50926 792633 753383 714625 676919 640853 606970 575741 547701 523266 502283 484070 468131
50915D68131j3709j1743j0599j0026r098p614o336n556m478k489k40J218J683
50902C89144J603J288Q78O37O52O51M78L21K09r8l61K20J829L462M169M188M206
50885D13476M221L983L904M546N637O514P249Q357R633J0290J0273J0515J1715
50872E10313J3531J5187J6384J7462J8997K1281K3988K6486K8677L1246L4771
50861G58323L9055M3745M8994N4884O0707O5723P0292P5325Q0831Q5859Q9712
50850A473450R2307R3368R2358Q9364Q5048P9472P1851O1870N0455L8781K7250
50839B255574J5951N549l014r316j3405j5253j4813j2413q555l413K906R560J4914
50826B224272J7630J7516J5034J0170K392q204k0258l2178m3449n4397o4891p4089
$$ plain form
50915 468131 454422 442679 432080 422054 412956 405342 399006 393450 388972 386483 386243 387461 389144
50902 389144 390747 392035 392913 393550 394202 394853 395331 395652 395861 395763 395402 395622 397451 400913 405082 409270 413476
50885 413476 417697 421680 425584 430130 435767 442281 449530 457887 467520 477810 488083 498598 510313
50872 510313 523844 539031 555415 572877 591874 613155 637143 663629 692306 723552 758323
50861 758323 797378 841123 890117 945001 1005708 1071431 1141723 1217048 1297879 1383738 1473450
50850 1473450 1565757 1659125 1751483 1840847 1925895 2005367 2077218 2139088 2189543 2228324 2255574
50839 2255574 2271525 2277074 2274060 2264744 2251339 2236086 2221273 2208860 2200305 2196892 2199798 2209358 2224272
50826 2224272 2241902 2259418 2274452 2284622 2287014 2278810 2258552 2226374 2182925 2128528 2063637 1989548
50814A989548q1464q7198r1285r3032r1929q8377q3096p6453o8947o1457n4352
50803A111958m7007l9022l1206k4326j7658j0042j912N214J0974J6320K1489K5470
50791A020252K7747K8908K9045K7098K2765J7612J3151Q867L442k843q333j2183
50779A175528j5042j7680k0094k2124k3921k5582k6925k7861k8584k9209k9588
50768I08918k9525k8865k7477k5421k3127k1036j9146j7209j5145j2952j0348
50757F78667p070l458k37K367M830P582J0455J3122J5758J8936K2896K7222L1247
50744H22317L4780L8289M2383M7222N2537N8081O3679O8820P2564P4166P3611
50733A448449P1283O7374O1876N4981M7072L8382K8958J8904Q439k205j2637k2056
$$ plain form
50814 1989548 1908084 1820886 1729601 1636569 1544640 1456263 1373167 1296714 1227767 1166310 1111958
50803 1111958 1064951 1025929 994723 970397 952739 942697 940785 945999 956973 973293 994782 1020252
50791 1020252 1047999 1076907 1105952 1133050 1155815 1173427 1186578 1195445 1198887 1196044 1187711 1175528
50779 1175528 1160486 1142806 1122712 1100588 1076667 1051085 1024160 996299 967715 938506 908918
50768 908918 879393 850528 823051 797630 774503 753467 734321 717112 701967 689015 678667
50757 678667 671597 668139 667902 670269 675099 682681 693136 706258 722016 740952 763848 791070 822317
50744 822317 857097 895386 937769 984991 1037528 1095609 1159288 1228108 1300672 1374838 1448449
50733 1448449 1519732 1587106 1648982 1703963 1751035 1789417 1818375 1837279 1845718 1843513 1830876 1808820
50721A808820k9470l4244l6363l6124l3884l0043k4988j8998j2444o139j093K296
50709A547326M590O419P401O334K487l671j1102j9130k7358l5032m1157m5264
50697A391843m7498m7890m6083m2155l7115l1966k6620k0418j3500o937j398L470
50685A073733Q169J2477J5922J8604K1069K3746K6935L0917L5563M0053M3669
50674A350857M6646M9572N1921N1977M8593M2517L5549K8824K2378J6087J0275
50663A755196N246P55l693q240j2666j6789k0551k3777k6188k7698k8452k8518
50651A564625k7784k6190k3853k0852j7227j3210r153n042n06M363Q713J1817
50639A445701J3980J5879J7274J7158J5251J2663J0673R414Q144O399M516L188
$$ plain form
50721 1808820 1779350 1745106 1708743 1672619 1638735 1608692 1583704 1564706 1552262 1546123 1545030 1547326
50709 1547326 1551916 1558335 1565736 1572070 1574557 1570886 1559784 1540654 1513296 1478264 1437107 1391843
50697 1391843 1344345 1296455 1250372 1208217 1171102 1139136 1112516 1092098 1078598 1071661 1070263 1073733
50685 1073733 1081902 1094379 1110301 1128905 1149974 1173720 1200655 1231572 1267135 1307188 1350857
50674 1350857 1397503 1447075 1498996 1550973 1599566 1642083 1677632 1706456 1728834 1744921 1755196
50663 1755196 1760442 1761197 1757504 1749264 1736598 1719809 1699258 1675481 1649293 1621595 1593143 1564625
50651 1564625 1536841 1510651 1486798 1465946 1448719 1435509 1426356 1421314 1420808 1425171 1433884 1445701
50639 1445701 1459681 1475560 1492834 1509992 1525243 1537906 1548579 1557993 1566137 1572536 1577052 1580240
50627A580240K904L773N639Q278J1557J5362J9434K3389K6721K8673K8300K5157
50615A779427J9848J3467O535r58q526j4995j9645k2951k5744k8227l0308l2419
50603A635504l5241l8825m2569m6009m9137n1902n3899n4651n3984n2134m9647
50592A107506m7023m4252m0844l6626l2237k8462k5324k2263j9022j5772j2495
50581G83186q868m894j037K379N423P930R247R008P914P225P518Q258Q510P929
50567H49728P085O977Q229J0664J3671J6948K0704K5094K9743L4005L7578M0637
50555A101063M3399M5705M7065M7026M5518M2927L9850L6746L3889L1537L0014
50544A544739K9511K9872L0694L1616L2474L3155L3499L3428L3223L3442L4447
$$ plain form
50627 1580240 1583144 1586917 1592556 1600834 1612391 1627753 1647187 1670576 1697297 1725970 1754270 1779427
50615 1779427 1799275 1812742 1819277 1818319 1809793 1794798 1775153 1752202 1726458 1698231 1667923 1635504
50603 1635504 1600263 1561438 1518869 1472860 1423723 1371821 1317922 1263271 1209287 1157153 1107506
50592 1107506 1060483 1016231 975387 938761 906524 878062 852738 830475 811453 795681 783186
50581 783186 774318 769424 768387 770766 776189 784119 793366 802374 810288 817513 825031 833289 841799 849728
50567 849728 856813 863790 872019 882683 896354 913302 934006 959100 988843 1022848 1060426 1101063
50555 1101063 1144462 1190167 1237232 1284258 1329776 1372703 1412553 1449299 1483188 1514725 1544739
50544 1544739 1574250 1604122 1634816 1666432 1698906 1732061 1765560 1798988 1832211 1865653 1900100
50533A900100L6100L8143M0745M4223M8144N1227N2547N2466N1862N0736M8240
50522B414533M3928L8161L1146K2501J2249J480q716j8483k8543l8615m7454n4420
50510B367767o0075o4897o8212o8883o6574o1856n5467m7986l9922l1627k3226
50499A779042j5078q022k744R35L716N913P427Q448R466J0528J0964J0034P202
50486A827831J723p239j9465l3102m5785n6169o4142o9965p3815p5748p5657p3350
50474A235117o9199o4360n9847n5521n0659m5316m0344l6127l2130k7920k3876
50463G29818k0516j7810j5495j3576j1922r927p194m281k127q27L47J842L291
50450F31623M219M838N795P384R243J0782J1747J2373J3051J3965J5061J6312
$$ plain form
50533 1900100 1936200 1974343 2015088 2059311 2107455 2158682 2211229 2263695 2315557 2366293 2414533
50522 2414533 2458461 2496622 2527768 2550269 2562518 2563998 2555282 2536799 2508256 2469641 2422187 2367767
50510 2367767 2307692 2242795 2174583 2105700 2039126 1977270 1921803 1873817 1833895 1802268 1779042
50499 1779042 1763964 1755942 1753198 1754133 1757849 1763762 1771189 1779637 1789103 1799631 1810595 1820629 1827831
50486 1827831 1829554 1822315 1802850 1769748 1723963 1667794 1603652 1533687 1459872 1384124 1308467 1235117
50474 1235117 1165918 1101558 1041711 986190 935531 890215 849871 813744 781614 753694 729818
50463 729818 709302 691492 675997 662421 650499 640572 633378 629097 626970 626143 626490 628332 631623
50450 631623 635842 640680 646475 653859 663102 673884 685631 698004 711055 725020 740081 756393
50438G56393J7763J9324K0720K1851K3030K4646K6644K8599L0285L2040L4421
50427A035716L7499M0644M3100M4750M6098M7406M8266M8371M8404M9471N1630
50416A541355N3579N3927N2344M9268M5157M0398L5420L0250K4255J6908Q613
50405A951474L62p249j4202k0570k6494l2525l9280m6615n3617n9467o3893o6839
50393A521085o8299o8650o8476o7750o5669o1673n6265n0332m4093l7224k9924
50382I02730k3133j7518j2689p717k274L075P567J0991J3547J5281J5957J5360
50370I21177J3464J0170N324p98p275j3167j8178k2472k6027k8600l0188l1038
50358G72392l1153l0205k8167k5649k3471k1985k0902j9559j7452j4789j2566
$$ plain form
50438 756393 774156 793480 814200 836051 859081 883727 910371 938970 969255 1001295 1035716
50427 1035716 1073215 1113859 1156959 1201709 1247807 1295213 1343479 1391850 1440254 1489725 1541355
50416 1541355 1594934 1648861 1701205 1750473 1795630 1836028 1871448 1901698 1925953 1942861 1951474
50405 1951474 1951836 1944587 1930385 1909815 1883321 1850796 1811516 1764901 1711284 1651817 1587924 1521085
50393 1521085 1452786 1384136 1315660 1247910 1182241 1120568 1064303 1013971 969878 932654 902730
50382 902730 879597 862079 849390 841673 839399 842474 850041 861032 874579 889860 905817 921177
50370 921177 934641 944811 950135 949337 942062 928895 910717 888245 862218 833618 803430 772392
50358 772392 741239 711034 682867 657218 633747 611762 590860 571301 553849 539060 526494
50347E26494j1650j1698j1388r839p451n184l503k288j324m45N59J743K874L781
50333D70681M635N591O379O666O617O708P147P859Q843R988J0696J0363R348Q891
50319E80412R775J1528J3134J4144J4728J5052J5144J5218J5706J6753J8004J8988
50307G58586J9616K0177K0817K1147K0529J8815J6588J4552J2887J1380R926Q450
50295I53470O525L643j22m204q365j2868j7690k2107k5416k7501k8381k7860k6178
50282G62946k4412k3423k2755k1385j9324j7532j6391j5274j3733j2164j0924
50271E65629r651p959o126m543l074j544l32J49K27N44J191J856K528L368M066
50256E46329M086L503L012L014L250L347L167K613J627N56l1r2j85o79j284j560
$$ plain form
50347 526494 514844 503146 491758 481919 474468 469284 465781 463493 462169 461724 462283 464026 466900 470681
50333 470681 475316 480907 487286 493952 500569 507277 514424 522283 531126 541114 551810 562173 571521 580412
50319 580412 590187 601715 614849 628993 643721 658773 673917 689135 704841 721594 739598 758586
50307 758586 778202 798379 819196 840343 860872 879687 896275 910827 923714 935094 945020 953470
50295 953470 959995 963638 963516 959312 950947 938079 920389 898282 872866 845365 816984 789124 762946
50282 762946 738534 715111 692356 670971 651647 634115 617724 602450 588717 576553 565629
50271 565629 555978 548019 541893 537350 534276 532732 532400 532549 532776 533320 534511 536367 538895 542263 546329
50256 546329 550415 553918 556930 559944 563194 566541 569708 572321 573948 574504 574473 574381 574196 573517 572233 570673
50240E70673j462j214j023j070j441j909k123k172k460k929l004k528k141k287
50226E42910k432j865q05qM44J221K605L996M671M599M355M499N090N597N388
50211E80265M529L846L881M067L475K152R99M39ro43r38m60K68L28m54j491k294
50194E97960k848l329l801m214m420m307m078m151m607m971m814m307l865l525
50180E40723l060k401j503j17J724L216L525K965K716L287M014M278M314M417
50166E68098M125K943J463Q84J529K454K559J740Q43Q52K048L749M976N522O068
50151F09853P094Q111Q519Q716R677J1636J3969J6242J8565K0901K2953K4970
50139G81206K7918L2470L8352M4952N1955N9164O6472P4413Q3961R5195J06746
$$ plain form
50240 570673 569211 567997 566974 565904 564463 562554 560431 558259 555799 552870 549866 547338 545197 542910
50226 542910 540478 538613 537808 537800 538244 539465 542070 546066 550737 555336 559691 564190 569280 574877 580265
50211 580265 584794 588640 592521 596588 600063 602215 603214 603653 603644 603001 602063 601603 601871 602199 601745 600254 597960
50194 597960 595112 591783 587982 583768 579348 575041 570963 566812 562205 557234 552420 548113 544248 540723
50180 540723 537663 535262 533759 533642 535366 538582 542107 545072 547788 551075 555089 559367 563681 568098
50166 568098 572223 575166 576629 577513 579042 581496 584055 585795 586638 587490 589538 593287 598263 603785 609853
50151 609853 616947 625058 633577 642293 651970 663606 677575 693817 712382 733283 756236 781206
50139 781206 809124 841594 879946 924898 976853 1036017 1102489 1176902 1260863 1356058 1462804
50128A462804J17070J25563J31692J33754J29709J19181J03881Q6271O8624N3094
50118B531643M1548L4794L2388L3185L5522L6899L4400K5854J0442j1570l8861
50107B766244o8689r7299j21394j39070j49564j52767j49404j41115j29817j17018
50097A500107j03777r0885p8859o7995n8531n0497m3412l6621l0071k4351j9870
50086H95238j6379j3429j0833q559o541m878l743l016k367j779j527j612j731
50073H18844j885k339k799k427r61Q41K207L160L959M545N103O378Q672J1117
50059H54415J2653J3269J3551J3521J2836J1749J0929J0550J0351J0395J0869
50048I85088J1376J1306J0838J0660J0715J0246R213Q615R061R914J0371J0608
$$ plain form
50128 1462804 1579874 1705437 1837129 1970883 2100592 2219773 2323654 2409925 2478549 2531643
50118 2531643 2573191 2607985 2640373 2673558 2709080 2745979 2780379 2806233 2816675 2805105 2766244
50107 2766244 2697555 2600256 2478862 2339792 2190228 2037461 1888057 1746942 1617125 1500107
50097 1500107 1396330 1305445 1226586 1158591 1100060 1049563 1006151 969530 939459 915108 895238
50086 895238 878859 865430 854597 846038 839497 834619 830876 827860 825493 823714 822187 820575 818844
50073 818844 816959 814620 811821 809394 808433 809274 811481 814641 818600 823145 828248 834626 843298 854415
50059 854415 867068 880337 893888 907409 920245 931994 942923 953473 963824 974219 985088
50048 985088 996464 1007770 1018608 1029268 1039983 1050229 1059442 1068057 1077118 1087032 1097403 1108011
50036A108011J1235J2279J3387J4638J6408J8692K1144K3750K6810L0268L3584
50025A330206L6499L9607M3851M9630N6621O4482P3459Q4130R6705J10795J25907
50014B111892J41955J59085J77007J94504K09459K19384K22163K16648K02918
50005C855015J82532J58816J36396J19278J08845J03849J02240J02268J01663
49996D970902R6857Q4110O1267K8202j3592o0815j08291j50539j84191k08720
49986D515190k25170k34842k39053k39017k35470k28760k19436k08266j95641
49977B489535j81547j66309j50845j35944j21754j08144r5269q3519p3300o4800
49967A308104n7733n1358m5249l9983l6400l4166l1852k8669k5451k3485k2937
$$ plain form
50036 1108011 1119246 1131525 1144912 1159550 1175958 1194650 1215794 1239544 1266354 1296622 1330206
50025 1330206 1366705 1406312 1450163 1499793 1556414 1620896 1694355 1778485 1875190 1985985 2111892
50014 2111892 2253847 2412932 2589939 2784443 2993902 3213286 3435449 3652097 3855015
50005 3855015 4037547 4196363 4332759 4452037 4560882 4664731 4766971 4869239 4970902
49996 4970902 5067759 5151869 5213136 5241338 5227746 5166931 5058640 4908101 4723910 4515190
49986 4515190 4290020 4055178 3816125 3577108 3341638 3112878 2893442 2685176 2489535
49977 2489535 2307988 2141679 1990834 1854890 1733136 1624992 1529723 1446204 1372904 1308104
49967 1308104 1250371 1199013 1153764 1113781 1077381 1043215 1011363 982694 957243 933758 910821
49956I10821k2918k2634k1973k1222k0696k0501k0419k0077j9377j8523j7562
49945F84919j6266j4609j2956j1541j0171q754p660p179o928o272n064l694k492
49932E71333j512p11n7M92R37J249J614K406L682M944N559N374M687L912L407
49917F07316L377L644L741L513L435M084N478P119Q588R852J1173J2924J5332
49904F99576J8275K1451K4849K8780L3359L8369M3864N0425N8437O7564P7347
49893A162296Q7985R9833J12392J24514J35303J43955J48712J47018J37536J21580
49883B421124J02162Q2032O3152M7480L7094L2976L4105L7957M1607M1977L5675
49872B977341J9883n913l9222p5862j11841j43819j68588j83457j87729j83293
$$ plain form
49956 910821 887903 865269 843296 822074 801378 780877 760458 740381 721004 702481 684919
49945 684919 668653 654044 641088 629547 619376 610622 602962 595783 588855 582583 577519 573825 571333
49932 571333 569821 569110 569053 569545 570482 571731 573345 575751 579433 584377 589936 595310 599997 603909 607316
49917 607316 610693 614337 618078 621591 625026 629110 634588 641707 650295 660147 671320 684244 699576
49904 699576 717851 739302 764151 792931 826290 864659 908523 958948 1017385 1084949 1162296
49893 1162296 1250281 1350114 1462506 1587020 1722323 1866278 2014990 2162008 2299544 2421124
49883 2421124 2523286 2605318 2668470 2715950 2753044 2786020 2820125 2858082 2899689 2941666 2977341
49872 2977341 2997224 2991311 2952089 2876227 2764386 2620567 2451979 2268522 2080793 1897500
49862A897500j73209j59847j44492j28258j12498r8242q5654p4314o3885n4493
49852H02608m6552m0361l5725l1979k8496k5074k1881j9048j6564j4505j3051
49841E09372j2173j1484j0538r199p696o384n587n429n634n641n166m619m632
49828D15190n141n348m731l748l144k933k541j823j321j436j888k180k121j761
49814C75074j164n67k98l60m00l16m26q34j164j269j629k512l309l343k939k906
49798C51638l324l602l558l564l664l342k324r85J10O28M90l3l57k23r6m28p73
49781C26593m25L95Q85R16R95J049N05l87n74J72Q29P78O97J171J565J110K09
49764C36483k35j04J38L39N49N58L41M49J219K010K017J459J189J441J738J765
$$ plain form
49862 1897500 1724291 1564444 1419952 1291694 1179196 1080954 995300 920986 857101 802608
49852 802608 756056 715695 679970 647991 619495 594421 572540 553492 536928 522423 509372
49841 509372 497199 485715 475177 465978 458282 451898 446311 440882 435248 429607 424441 419822 415190
49828 415190 410049 404701 399970 396222 393078 390145 387604 385781 384460 383024 381136 378956 376835 375074
49814 375074 373910 373343 373045 372685 372285 371969 371543 370709 369545 368276 366647 364135 360826 357483 354544 351638
49798 351638 348314 344712 341154 337590 333926 330584 328260 327275 327385 328013 328503 328470 328113 327890 327794 327366 326593
49781 326593 326168 326563 327448 328364 329359 330408 330913 330526 329952 330124 330953 331731 332428 333599 335164 336274 336483
49764 336483 336248 336144 336282 336621 337170 337728 338069 338518 339737 341747 343764 345223 346412 347853 349591 351356
49748C51356J625J384J057Q71J014J230J177R98J087J528K120K682K969K652J817
49733C75567J130J003J013O02o0m54m85l52j03J22j31r41j590j470r46o63n36
49716C71706k11K5k79p93r36r11j253j678j472p58k33O6N36Q10J30j025j193j11
49698C62420P40L00o06p20j96n9n73j094j158r31p10n32k94M3K97J30n03j046
49680C55508r25l08J69M05Q19J387J486R60N40Q21J431J657J394J059R69J098
49664C68470J215R75K72m48o00k62m0n9K02R16J455J340J019J195J859K484K800
49647C82793K970L194L490L660L327K291R53N4j42rQ6J80L73O29J047J710K234
49630D08840K084J457J141J352J525J487J883K974L889L798L047K446K126J880
$$ plain form
49748 351356 352981 354365 355422 356293 357307 358537 359714 360712 361799 363327 365447 368129 371098 373750 375567
49733 375567 376697 377700 378713 379315 379255 378801 378316 377964 377861 377983 377852 376911 375321 373851 372905 372242 371706
49716 371706 371495 371520 371241 370448 369512 368601 367348 365670 364198 363440 363207 363273 363809 364619 364749 363724 362531 362420
49698 362420 363160 363460 362854 362134 361938 361879 361306 360212 359054 358123 357413 356881 356587 356630 356927 357057 356554 355508
49680 355508 354583 354275 354444 354849 355668 357055 358541 359501 360041 360862 362293 363950 365344 366403 367372 368470
49664 368470 369685 370660 370932 370484 369884 369622 369582 369523 369725 370641 372096 373436 374455 375650 377509 379993 382793
49647 382793 385763 388957 392447 396107 399434 401725 402678 402732 402590 402581 402667 402847 403220 403849 404896 406606 408840
49630 408840 410924 412381 413522 414874 416399 417886 419769 422743 426632 430430 433477 435923 438049 439929
49616D39929J986K753L680L982L696L466L422L142K590K343K805L742M630N014
49602D87180M716M103M018M923O279P214P555P718P871P913Q024Q450Q887Q783
49588E83634Q358Q516R648J1124J2218J2908J3539J4181J4717J5135J5523J5967
49576G35468J6654J7789J9243K0556K1461K2173K3058K4221K5509K6746K7836
$$ plain form
49616 439929 441915 444668 448348 452330 456026 459492 462914 466056 468646 470989 473794 477536 482166 487180
49602 487180 491896 495999 500017 504940 511219 518433 525988 533706 541577 549490 557514 565964 574851 583634
49588 583634 591992 600508 610156 621280 633498 646406 659945 674126 688843 703978 719501 735468
49576 735468 752122 769911 789154 809710 831171 853344 876402 900623 926132 952878 980714
$$ [...]
##END NTUPLES=NMR SPECTRUM
##END=
