##TITLE=NES1026_17915_9266881_sXGIX0Gfx3
##JCAMPDX= 6.0         $$ Bruker NMR JCAMP-DX V2.0
##DATA TYPE= NMR SPECTRUM
##DATA CLASS= NTUPLES
##ORIGIN= BRUKER
##OWNER= Administrator
$$ 1.72 TOPSPIN		Version 2.1
$$ 2015-07-10 19:45:08.019 -0700  Administrator@X
$$ Compression mode = diff/dup
##.OBSERVE FREQUENCY= 400.02188249412
##.OBSERVE NUCLEUS= ^1H
##.ACQUISITION MODE= SIMULTANEOUS (DQD)
##.ACQUISITION SCHEME= undefined
##.AVERAGES= 64
##.DIGITISER RES= 22
##SPECTROMETER/DATA SYSTEM= spect
##.PULSE SEQUENCE= noesygpps1d.comp
##.SOLVENT NAME= COFFEE_meoh
##.SHIFT REFERENCE= INTERNAL, COFFEE_meoh, 1, 14.96344
##AUDIT TRAIL= $$ (NUMBER, WHEN, WHO, WHERE, PROCESS, VERSION, WHAT)
$$ ##TITLE= Audit trail, TOPSPIN		Version 2.1
$$ ##JCAMPDX= 5.01
$$ ##ORIGIN= Bruker BioSpin GmbH
$$ ##OWNER= Administrator
$$ $$ E:\/data/COFFEE/nmr/NES1026_17915_9266881_sXGIX0Gfx3/12/pdata/1/auditp.txt
$$ ##AUDIT TRAIL=  $$ (NUMBER, WHEN, WHO, WHERE, PROCESS, VERSION, WHAT)
(   1,<2015-07-10 19:45:02.675 -0700>,<Administrator>,<X>,<go>,<TOPSPIN 2.1>,
      <created by zg
	started at 2015-07-10 19:33:33.066 -0700,
	POWCHK enabled, PULCHK disabled,
       configuration hash MD5:
       21 0F 79 D6 B3 7B B4 F6 88 20 88 DB 03 48 BD 9F
       data hash MD5: 64K
       5E 2C CB 25 0F AB 81 7A 12 2C ED 2E D7 A9 45 91>)
(   2,<2015-07-10 19:45:05.910 -0700>,<Administrator>,<X>,<proc1d>,<TOPSPIN 2.1>,
      <Start of raw data processing
       efp LB = 0.3 FT_mod = 6 PKNL = 1 PHC0 = 0 PHC1 = 0 SI = 128K 
       data hash MD5: 128K
       42 74 00 A1 ED 78 F3 CA 94 1A 59 7A 3C 9B 4B 55>)
(   3,<2015-07-10 19:45:06.816 -0700>,<Administrator>,<X>,<proc1d>,<TOPSPIN 2.1>,
      <pk PHC0 = -85.0177 PHC1 = 0 
       data hash MD5: 128K
       3D 0D 4A 82 D8 A5 60 90 35 04 BB FE E0 51 46 05>)
(   4,<2015-07-10 19:45:07.191 -0700>,<Administrator>,<X>,<proc1d>,<TOPSPIN 2.1>,
      <abs ABSG = 1 
       data hash MD5: 128K
       30 B4 B4 A2 2E C4 FE 76 AD E3 27 BF D8 C0 F4 89>)
(   5,<2015-07-10 19:45:07.300 -0700>,<Administrator>,<X>,<proc1d>,<TOPSPIN 2.1>,
      <abs ABSG = 2 
       data hash MD5: 128K
       FE 2F 0C A8 E0 9E A5 AF B3 10 79 90 F9 42 BD 7A>)
(   6,<2015-07-10 19:45:07.378 -0700>,<Administrator>,<X>,<proc1d>,<TOPSPIN 2.1>,
      <abs ABSG = 3 
       data hash MD5: 128K
       2C FD 4C 5F C4 88 E8 0E 4E FB EC FA F8 02 54 AC>)
(   7,<2015-07-10 19:45:07.488 -0700>,<Administrator>,<X>,<proc1d>,<TOPSPIN 2.1>,
      <abs ABSG = 4 
       data hash MD5: 128K
       68 1D E6 0E 62 BF 46 6F D5 48 F5 B8 0F 5C D4 ED>)
(   8,<2015-07-10 19:45:07.597 -0700>,<Administrator>,<X>,<proc1d>,<TOPSPIN 2.1>,
      <abs ABSG = 5 
       data hash MD5: 128K
       5D 96 D6 FF D6 11 93 A3 C9 CB A0 9E 00 BD 79 68>)
$$ ##END=
$$ 
$$ $$ hash MD5
$$ $$ 18 2C 35 49 49 18 EA E0 C5 A9 F1 59 A8 64 E0 27
##$RELAX= 
##$RELAX= 
##$RELAX= 
##$RELAX= 
##$RELAX= 
##$RELAX= 
##$RELAX= 
##$RELAX= 
$$ Bruker specific parameters
$$ --------------------------
##$DU= <E:\>
##$EXPNO= 12
$$ [...]
##$TP07= 0
##$TPNAME0= <>
##$TPNAME1= <>
##$TPNAME2= <>
##$TPNAME3= <>
##$TPNAME4= <>
##$TPNAME5= <>
##$TPNAME6= <>
##$TPNAME7= <>
##$TPOAL= (0..7)
0.5 0.5 0.5 0.5 0.5 0.5 0.5 0.5
##$TPOFFS= (0..7)
0 0 0 0 0 0 0 0
##$TUNHIN= 0
##$TUNHOUT= 0
##$TUNXOUT= 0
##$USERA1= <user>
##$USERA2= <user>
##$USERA3= <user>
##$USERA4= <user>
##$USERA5= <user>
##$V9= 5
##$VALIST= <valist>
##$VCLIST= <CCCCCCCCCCCCCCC>
##$VD= 0
##$VDLIST= <DDDDDDDDDDDDDDD>
##$VPLIST= <PPPPPPPPPPPPPPP>
##$VTLIST= <TTTTTTTTTTTTTTT>
##$WBST= 2048
##$WBSW= 25
##$XGAIN= (0..3)
0 0 0 0
##$XL= 0
##$YL= 0
##$YMAX_a= 8039058
##$YMIN_a= -17366562
##$ZGOPTNS= <>
##$ZL1= 120
##$ZL2= 120
##$ZL3= 120
##$ZL4= 120
##$ABSF1= 14.96344
##$ABSF2= -5.594742
##$ABSG= 5
##$ABSL= 3
##$ALPHA= 0
##$AQORDER= 0
##$ASSFAC= 0
##$ASSFACI= 0
##$ASSFACX= 0
##$ASSWID= 0
##$AUNMP= <proc_prof1d_extract.lims>
##$AXLEFT= 0
##$AXNAME= <>
##$AXNUC= <1H>
##$AXRIGHT= 0
##$AXTYPE= 0
##$AXUNIT= <>
##$AZFE= 0.1
##$AZFW= 0.1
##$BCFW= 0
##$BC_mod= 0
##$BYTORDP= 0
##$COROFFS= 0
##$CY= 15
##$DATMOD= 1
##$DC= 0
##$DFILT= <>
##$DTYPP= 0
##$F1P= 0
##$F2P= 0
##$FCOR= 0.5
##$FTSIZE= 131072
##$FT_mod= 6
##$GAMMA= 0
##$GB= 0
##$INTBC= 1
##$INTSCL= 1
##$ISEN= 128
##$LB= 0.3
##$LEV0= 0
##$LPBIN= 0
##$MAXI= 10000
##$MC2= 0
##$MEAN= 0
##$ME_mod= 0
##$MI= 0
##$NCOEF= 0
##$NC_proc= -2
##$NLEV= 6
##$NOISF1= 0
##$NOISF2= 0
##$NSP= 0
##$NTH_PI= 0
##$NZP= 0
##$OFFSET= 14.96344
##$PC= 1
##$PHC0= -85.0177
##$PHC1= 0
##$PH_mod= 1
##$PKNL= yes
##$PPARMOD= 0
##$PPDIAG= 0
##$PPIPTYP= 0
##$PPMPNUM= 2147483647
##$PPRESOL= 1
##$PSCAL= 4
##$PSIGN= 0
##$PYNMP= <proc.py>
##$REVERSE= no
##$SF= 400.020008661786
##$SI= 131072
##$SIGF1= 0
##$SIGF2= 0
##$SINO= 400
##$SIOLD= 131072
##$SPECTYP= <>
##$SREGLST= <1H.CDCl3>
##$SSB= 0
##$STSI= 131072
##$STSR= 0
##$SW_p= 8223.68421052631
##$SYMM= 0
##$S_DEV= 0
##$TDeff= 65536
##$TDoff= 0
##$TI= <>
##$TILT= no
##$TM1= 0
##$TM2= 0
##$TOPLEV= 0
##$USERP1= <user>
##$USERP2= <user>
##$USERP3= <user>
##$USERP4= <user>
##$USERP5= <user>
##$WDW= 1
##$XDIM= 131072
##$YMAX_p= 428426762
##$YMIN_p= -12511
##$CURPLOT= <Network HP LaserJet P1505>
##$CURPRIN= <$Network HP LaserJet P1505>
##$DFORMAT= <normdp>
##$LAYOUT= <+/1D_H.xwp>
##$LFORMAT= <normlp>
##$PFORMAT= <normpl>
##$SURQMSG= 1
$$ End of Bruker specific parameters
$$ ---------------------------------
##NTUPLES= NMR SPECTRUM
##VAR_NAME=  FREQUENCY,     SPECTRUM/REAL,   SPECTRUM/IMAG
##SYMBOL=    X,             R,               I
##VAR_TYPE=  INDEPENDENT,   DEPENDENT,       DEPENDENT
##VAR_FORM=  AFFN,          ASDF,            ASDF
##VAR_DIM=   131072,        131072,          131072
##UNITS=     HZ,            ARBITRARY UNITS, ARBITRARY UNITS
##FACTOR=    0.0627417313425164, 1,          1
##FIRST=     8223.62146879497, 2704,         -56750
##LAST=      0,             4978,            -56061
##MIN=       0,             -12511,          0
##MAX=       8223.62146879497, 428426762,    0
$$ Real data points
##PAGE= N=1
##DATA TABLE= (X++(R..R)), XYDATA
$$ [...]
$$ plain form
60949 32415251 30283442 27556950 24555114 21559629 18758384 16246100 14050151 12158673
60941 12158673 10542726 9170056 8010381 7035575 6219069 5536079 4964062 4482920 4075087
60932 4075087 3725477 3421551 3153722 2915594 2703156 2513348 2343389 2191128 2055240
60923 2055240 1934729 1828488 1735301 1653578 1580772 1513633 1449590 1387759 1328439 1272004 1218670
60912 1218670 1168909 1123406 1082533 1046192 1014215 986520 962770 942123 923613 906793 891897
60901 891897 879277 868730 859527 851162 843844 838081 833902 830785 828241 826070 824034 821718 818876 815523
60887 815523 811462 806066 798870 790139 780515 770335 759653 748680 737720 726690 715227 703389
60875 703389 691922 681638 672775 665132 658605 653328 649370 646513 644426 642977 642289 642482 643482 645284
$$ packed form
60949C2415251k131809k726492l001836k995485k801245k512284k195949j891478
60941A2158673j615947j372670j159675r74806q16506o82990n72017m81142m07833
60932D075087l49610l03926k67829k38128k12438j89808j69959j52261j35888
60923B055240j20511j06241r3187q1723p2806o7139o4043o1831n9320n6435n3334
60912A218670m9761m5503m0873l6341l1977k7695k3750k0647j8510j6820j4896
60901H91897j2620j0547r203q365p318n763m179l117k544k171k036k316k842l353
60887H15523m061n396p196q731r624j0180j0682j0973j0960j1030j1463j1838
60875G03389j1467j0284q863p643o527n277l958k857k087j449o88J93J000J802
$$ plain form
60861 645284 648345 653348 660303 668167 675803 683236 691543 701542 713061 725633 739282 754226 770155
60848 770155 786385 802572 818834 835193 851292 866746 881404 895196 907977 919629 930087
60837 930087 939215 946943 953623 959847 965591 969802 971223 969637 966053 961744 957328 952762 947869 942617
60823 942617 936962 930590 922914 913416 902049 889292 875820 862234 849132 837133 826522 816984
60811 816984 808089 800054 793701 789481 786927 785298 784524 785156 787522 791324 796048 801326 806756 811716 815795
60796 815795 819321 823107 827521 831902 834975 835814 834502 832060 829783 828417 827737 826913 825457 823841 823152
60781 823152 824240 827289 832071 838269 845485 853317 861675 870853 880971 891496 901649 911209 920568
60768 920568 929966 939049 947328 954711 961276 966757 970680 972965 974109 974683 974885 974623 973836 972624 971221
$$ packed form
60861F45284L061N003O955P864P636P433Q307R999J1519J2572J3649J4944J5929
60848G70155J6230J6187J6262J6359J6099J5454J4658J3792J2781J1652J0458
60837I30087R128P728O680O224N744M211J421j586l584m309m416m566m893n252
60823I42617n655o372p676r498j1367j2757j3472j3586j3102j1999j0611r538
60811H16984q895q035o353m220k554j629p74O32K366L802M724N278N430M960M079
60796H15795L526L786M414M381L073Q39j312k442k277j366o80q24j456j616o89
60781H23152J088L049M782O198P216P832Q358R178J0118J0525J0153R560R359
60768I20568R398R083Q279P383O565N481L923K285J144N74K02k62p87j212j403
$$ plain form
60753 971221 969948 969095 968688 968476 968230 967950 967643 966986 965474 962884 959303 954598 948175 939559 929083 917694
60737 917694 906066 894185 881814 869036 856179 843472 831038 819092 807907 797601 788137 779443
60725 779443 771401 763895 757068 751404 747195 743984 740910 737766 735377 734749 735866 737506 738259 737788 737169
60710 737169 737900 740393 743530 745842 746945 747511 748031 748177 747448 745788 743295 739814 735239 729841 723878
60695 723878 717172 709561 701457 693400 685258 676516 667321 658564 650847 643923 637367 631219 625723 620931
60681 620931 616948 614151 612723 612302 612543 613728 616315 620088 624348 628914 634304 640778 647791 654700 661585
60666 661585 668937 676729 684227 690776 696468 702027 708161 715009 722104 728900 735429 742405 750600 760186
60652 760186 770782 782008 793782 806115 818807 831373 843189 853778 863048 871158 878067 883485
$$ packed form
60753I71221j273q53m07k12k46k80l07o57j512k590l581m705o423q616j0476j1389
60737I17694j1628j1881j2371j2778j2857j2707j2434j1946j1185j0306r464q694
60725G79443q042p506o827n664m209l211l074l144k389o28J117J640P53m71o19
60710G37169P31K493L137K312J103N66N20J46p29j660k493l481m575n398n963
60695G23878o706p611q104q057q142q742r195q757p717o924o556o148n496m792
60681F20931l983k797j428m21K41J185K587L773M260M566N390O474P013O909O885
60666F61585P352P792P498O549N692N559O134O848P095O796O529O976Q195R586
60652G60186J0596J1226J1774J2333J2692J2566J1816J0589R270Q110O909N418
$$ plain form
60640 883485 887489 890867 894289 897314 898891 898924 898550 898514 897975 895550 891102 885742 880317 874658 868279 861055
60624 861055 853074 844381 835065 825159 814397 802655 790723 779968 770922 762789 754791 747383 741624
60611 741624 737761 735180 733452 732702 733025 734269 736578 740515 746407 753967 762855 773303 785857 800588
60597 800588 816788 833374 849465 864636 878669 891108 901147 908066 911750 912650 911316 908127 903426
60584 903426 897627 891058 883731 875358 865584 854291 841725 828251 813991 798874 783124 767388
60572 767388 752191 737501 723196 709700 697677 687177 677602 668544 660191 652798 646229 640287 635162
60559 635162 631258 628811 627863 628294 629665 631289 632797 634415 636433 638619 640567 642415 644783 648042 652127
60544 652127 657123 663544 671722 681293 691783 703545 717706 735093 755697 779421 806966 839394
$$ packed form
60640H83485M004L378L422L025J577L3l74l6n39k425m448n360n425n659o379p224
60624H61055p981q693r316r906j0762j1742j1932j0755r046q133p998p408n759
60611G41624l863k581j728p50L23J244K309L937N892P560Q888J0448J2554J4731
60597H00588J6200J6586J6091J5171J4033J2439J0039O919L684R00j334l189m701
60584I03426n799o569p327q373r774j1293j2566j3474j4260j5117j5750j5736
60572G67388j5197j4690j4305j3496j2023j0500r575r058q353p393o569n942n125
60559F35162l904k447r48M31J371J624J508J618K018K186J948J848K368L259M085
60544F52127M996O421Q178R571J0490J1762J4161J7387K0604K3724K7545L2428
$$ plain form
60532 839394 876849 918257 962355 1008285 1054639 1098396 1135712 1163912 1182158 1190290 1187935 1175361
60520 1175361 1154658 1129286 1102466 1076327 1052268 1031406 1014501 1001921 993882 990348 990546 992967
60508 992967 996253 1000018 1004544 1009842 1015307 1020383 1025360 1031393 1039791 1051313 1066165 1084571 1107297
60495 1107297 1135598 1170722 1213558 1264773 1325154 1395669 1477107 1569576 1672425 1784806 1906472
60484 1906472 2038030 2180465 2334804 2502664 2687121 2892458 3122527 3379112 3661229
60475 3661229 3964422 4279066 4588882 4872048 5105108 5267175 5342519 5322274 5206334 5004305
60465 5004305 4733677 4415825 4072335 3722817 3383270 3064602 2772394 2508469 2272835
60456 2272835 2064562 1881904 1722521 1583793 1462883 1357050 1264293 1183464 1113408 1052422
$$ packed form
60532H39394L7455M1408M4098M5930M6354M3757L7316K8200J8246Q132k355j2574
60520A175361k0703k5372k6820k6139k4059k0862j6905j2580q039l534J98K421
60508I92967L286L765M526N298N465N076M977O033Q398J1522J4852J8406K2726
60495A107297K8301L5124M2836N1215O0381P0515Q1438R2469J02849J12381J21666
60484A906472J31558J42435J54339J67860J84457K05337K30069K56585K82117
60475C661229L03193L14644L09816K83166K33060J62067P5344k0245j15940k02029
60465E004305k70628l17852l43490l49518l39547l18668k92208k63925k35634
60456B272835k08273j82658j59383j38728j20910j05833r2757q0829p0056o0986
$$ plain form
60446 1052422 998969 952411 912323 877475 846373 818661 794982 775274 758064 741811 726185
60435 726185 711609 698190 685728 674276 664041 654969 646902 639922 634113 629262 625206 622212 620479
60422 620479 619522 618585 617514 616720 616393 616412 617009 618775 621758 625106 627923 630155 632340 634840 637659 640725
60406 640725 643901 646815 649056 650657 652188 654236 656818 659345 661180 662254 663151 664598 666936 670155
60392 670155 674206 678970 683901 688087 690967 692909 694847 697449 700718 704285 707706 710416 711717 711162
60378 711162 709019 706139 703285 700647 698062 695551 693491 692304 692130 692765 693739 694452 694494 693947 693285 692919
60362 692919 692981 693550 694825 696866 699411 702266 705717 710227 715766 721825 728109 734858 742267 749929 757232
60347 757232 764198 771555 779838 788612 796843 803876 809894 815380 820399 824577 827590 829391 830052 829716 828772
$$ packed form
60446A052422n3453m6558m0088l4848l1102k7712k3679j9708j7210j6253j5626
60435G26185j4576j3419j2462j1452j0235r072q067o980n809m851m056k994j733
60422F20479r57r37j071p94l27J9N97J766K983L348K817K232K185K500K819L066
60406F40725L176K914K241J601J531K048K582K527J835J074Q97J447K338L219
60392F70155M051M764M931M186K880J942J938K602L269L567L421K710J301n55
60378G11162k143k880k854k638k585k511k060j187j74O35R74P13M2n47o62l66
60362F92919O2N69J275K041K545K855L451M510N539O059O284O749P409P662P303
60347G57232O966P357Q283Q774Q231P033O018N486N019M178L013J801O61l36r44
$$ plain form
60332 828772 827785 827068 826517 826070 826171 827558 830632 835094 840066 844504 847750 849881 851389 852365 852223 850425
60316 850425 847196 843186 838692 833677 828363 823231 818450 813879 809727 806614 804751 803573 802540 801849
60302 801849 801934 802669 803621 804877 806990 810146 813913 817937 822346 827222 831979 835602 837367 837152 835205
60287 835205 831924 827833 823567 819718 816658 814431 812755 811308 810204 810151 811891 815440 820061 825058 830392
60272 830392 836325 842740 849248 855969 863764 873453 885071 898141 912460 928218 945542 964331 984704
60259 984704 1007315 1033041 1062485 1095806 1132721 1172624 1214999 1260059 1308858 1362507 1421329
60248 1421329 1484925 1552988 1625759 1703735 1787283 1876691 1972322 2074308 2181986 2293819 2407991
60237 2407991 2523010 2637592 2750061 2858152 2959533 3052417 3135494 3207490 3267046 3313047
$$ packed form
60332H28772r87p17n51m47J01J387L074M462M972M438L246K131J508R76j42j798
60316H50425l229m010m494n015n314n132m781m571m152l113j863j178j033o91
60302H01849Q5P35R52J256K113L156L767M024M409M876M757L623J765k15j947
60287H35205l281m091m266l849l060k227j676j447j104n3J740L549M621M997N334
60272H30392N933O415O508O721P795R689J1618J3070J4319J5758J7324J8789K0373
60259I84704K2611K5726K9444L3321L6915L9903M2375M5060M8799N3649N8822
60248A421329O3596O8063P2771P7976Q3548Q9408R5631J01986J07678J11833J14172
60237B407991J15019J14582J12469J08091J01381R2884Q3077P1996N9556M6001
$$ plain form
60227 3313047 3344831 3362078 3364907 3354297 3332173 3300778 3262046 3217696 3169699 3120315 3071792
60216 3071792 3026376 2986602 2955118 2933970 2924198 2926188 2940119 2965971 3003502 3052684 3114122 3188698
60204 3188698 3276710 3377405 3489157 3609757 3736509 3866341 3996037 4122288 4241640 4350702
60194 4350702 4446673 4527540 4591695 4637526 4663554 4668925 4653701 4618844 4566006 4497207 4414616
60183 4414616 4320685 4218560 4112060 4005048 3900916 3802726 3713477 3635785 3571468 3521720
60173 3521720 3487526 3469512 3467646 3481734 3512210 3559752 3623804 3701936 3790767 3886900 3986610
60162 3986610 4085371 4178598 4262877 4335972 4395821 4440218 4467572 4477565 4470984 4449331 4414793 4370242
60150 4370242 4318943 4264321 4209948 4159504 4116584 4084519 4066190 4063723 4078443 4111488 4164460
$$ packed form
60227C313047L1784J7247K829j0610k2124l1395l8732m4350m7997m9384m8523
60216C071792m5416l9774l1484k1148r772J990J3931K5852L7531M9182O1438P4576
60204C188698Q8012J00695J11752J20600J26752J29832J29696J26251J19352J09062
60194D350702R5971Q0867O4155M5831K6028N371j5224l4857n2838o8799q2591
60183D414616r3931j02125j06500j07012j04132r8190q9249p7692o4317m9748
60173C521720l4194j8014j866J4088L0476M7542O4052P8132Q8831R6133R9710
60162C986610R8761R3227Q4279P3095N9849M4397K7354R993o581k1653l4538m4551
60150D370242n1299n4622n4373n0444m2920l2065j8329k467J4720L3045N2972
$$ plain form
60139 4164460 4239107 4336320 4455964 4597997 4763412 4953792 5170177 5412714 5681055 5974490
60129 5974490 6291590 6630110 6987335 7360055 7743855 8132702 8519688 8898209 9262160
60120 9262160 9605125 9920032 10200080 10439805 10634932 10781512 10875976 10916213 10902101 10834653
60110 10834653 10715076 10545147 10328262 10069826 9776863 9457742 9121932 8779208 8438658
60101 8438658 8108450 7796140 7508331 7249726 7022947 6829563 6670918 6547748 6459492 6404516
60091 6404516 6380909 6386830 6420332 6479300 6561401 6663527 6781047 6907739 7036593 7160654
60081 7160654 7273398 7368803 7441535 7487368 7503664 7489670 7446402 7376060 7281404 7165411 7031103
60070 7031103 6881326 6718604 6545360 6364340 6178770 5992085 5807530 5628004 5456115
$$ packed form
60139D164460P4647R7213J19644J42033J65415J90380K16385K42537K68341K93435
60129E974490L17100L38520L57225L72720L83800L88847L86986L78521L63951
60120I262160L42965L14907K80048K39725J95127J46580R4464M0237j4112o7448
60110A0834653j19577j69929k16885k58436k92963l19121l35810l42724l40550
60101H438658l30208l12310k87809k58605k26779j93384j58645j23170q8256n4976
60091F404516k3607N921L3502N8968Q2101J02126J17520J26692J28854J24061
60081G160654J12744R5405P2732M5833J6296j3994m3268p0342r4656j15993j34308
60070G031103j49777j62722j73244j81020j85570j86685j84555j79526j71889
$$ plain form
60061 5456115 5294239 5144494 5008667 4888238 4784444 4698316 4630640 4581890 4552206 4541466
60051 4541466 4549542 4576596 4622979 4688510 4771804 4870556 4982484 5105533 5236839 5371866 5505051
60040 5505051 5631227 5746072 5845501 5925473 5982730 6015375 6022511 6003656 5958782 5888745 5795419
60029 5795419 5681502 5550248 5405225 5250277 5089779 4928775 4772388 4624781 4488740
60020 4488740 4366142 4258530 4167270 4093533 4038262 4001936 3984418 3985442 4005224 4044124 4101722
60009 4101722 4176903 4269125 4378994 4507154 4653031 4814887 4990355 5176165 5367730 5559654
59999 5559654 5746574 5923140 6083705 6222971 6337050 6423476 6480420 6506485 6501276 6465545
59989 6465545 6400750 6308913 6192909 6056431 5903714 5739723 5570456 5402251 5240418 5088779
$$ packed form
60061E456115j61876j49745j35827j20429j03794q6128o7676m8750k9684j0740
60051D541466Q076K7054M6383O5531Q3294R8752J11928J23049J31306J35027J33185
60040E505051J26176J14845R9429P9972N7257L2645P136j8855m4874p0037r3326
60029E795419j13917j31254j45023j54948j60498j61004j56387j47607j36041
60020D488740j22598j07612r1260p3737n5271l6326j7518J024J9782L8900N7598
60009D101722P5181R2222J09869J28160J45877J61856J75468J85810J91565J91924
59999E559654J86920J76566J60565J39266J14079Q6426N6944K6065n209l5731
59989F465545o4795r1837j16004j36478j52717j63991j69267j68205j61833j51639
$$ plain form
59979 5088779 4950376 4827973 4723680 4638614 4573215 4527614 4501645 4494968 4507329 4538293 4586645
59968 4586645 4650598 4728760 4820341 4924109 5037571 5157475 5280578 5403573 5522820 5634807
59958 5634807 5736698 5826118 5900944 5959945 6003435 6032616 6048390 6051468 6043616 6028213 6009385
59947 6009385 5991134 5977492 5973052 5982791 6011367 6062660 6139802 6245453 6382152 6552547 6759178
59936 6759178 7003827 7287005 7608006 7965229 8356074 8776338 9219659 9677490 10139367
59927 10139367 10592752 11022553 11411352 11741148 11995817 12162685 12233079 12203061 12074727 11856574
59917 11856574 11561775 11205677 10804508 10375096 9933885 9495077 9069700 8666370 8292227
59908 8292227 7952624 7650500 7386961 7162624 6978023 6832852 6725518 6653960 6616789 6613471
$$ packed form
59979E088779j38403j22403j04293q5066o5399m5601k5969o677J2361L0964M8352
59968D586645O3953P8162R1581J03768J13462J19904J23103J22995J19247J11987
59958E634807J01891Q9420P4826N9001M3490K9181J5774L078p852j5403j8828
59947F009385j8251j3642m440R739K8576N1293P7142J05651J36699J70395K06631
59936F759178K44649K83178L21001L57223L90845M20264M43321M57831M61877
59927A0139367M53385M29801L88799L29796K54669J66868P0394l0018j28334k18153
59917A1856574k94799l56098m01169m29412m41211m38808m25377m03330l74143
59908H292227l39603l02124k63539k24337j84601j45171j07334p1558l7171l318
$$ plain form
59898 6613471 6643531 6705687 6797639 6916500 7059399 7223532 7405327 7599335 7797984 7992404
59888 7992404 8173357 8331406 8456874 8540569 8575214 8556598 8483838 8359006 8186567 7972877
59878 7972877 7725859 7454733 7169304 6878739 6590634 6311054 6044864 5795306 5563264
59869 5563264 5347633 5146765 4959253 4783362 4616635 4456993 4304097 4159056 4022922
59860 4022922 3895975 3778374 3670750 3573857 3488079 3413702 3351347 3301634 3264207 3237227 3217879
59849 3217879 3203359 3191335 3179518 3165164 3145420 3118359 3083543 3041602 2993669 2941392 2886989
59838 2886989 2832757 2780587 2732182 2689349 2653460 2624741 2602639 2586879 2577819 2575959 2581775 2596035
59826 2596035 2619484 2651973 2692434 2739893 2794038 2854622 2920984 2992430 3068333 3147220 3226192
$$ packed form
59898F613471L0060O2156R1952J18861J42899J64133J81795J94008J98649J94420
59888G992404J80953J58049J25468Q3695L4645j8616p2760j24832j72439k13690
59878G972877k47018k71126k85429k90565k88105k79580k66190k49558k32042
59869E563264k15631k00868j87512j75891j66727j59642j52896j45041j36134
59860D022922j26947j17601j07624r6893q5778p4377o2355m9713l7427k6980j9348
59849C217879j4520j2024j1817j4354j9744k7061l4816m1941m7933n2277n4403
59838B886989n4232n2170m8405m2833l5889k8719k2102j5760r060j860N816J4260
59826B596035K3449L2489M0461M7459N4145O0584O6362P1446P5903P8887P8972
$$ plain form
59815 3226192 3301807 3371197 3431848 3480976 3516308 3537776 3547889 3550234 3547921 3543359 3538823 3536685
59803 3536685 3539086 3547506 3562791 3585861 3618554 3663590 3723609 3800702 3897191 4016294 4161226
59792 4161226 4333810 4534809 4765658 5029033 5327268 5660361 6024968 6413666 6813564
59783 6813564 7205300 7563911 7861663 8072171 8175469 8163024 8040198 7824446 7540430 7214812
59773 7214812 6872149 6532013 6207790 5907714 5636999 5398924 5194447 5022108 4879256
59764 4879256 4763488 4672848 4605181 4557939 4528711 4515797 4518387 4536414 4570026 4618876 4682008
59753 4682008 4758759 4849760 4956772 5081470 5224573 5386085 5566065 5765228 5985187 6228276
59743 6228276 6496824 6792453 7116206 7469332 7853500 8270104 8719763 9202671 9718791
$$ packed form
59815C226192P5615O9390O0651M9128L5332K1468J0113K345k313m562m536k138
59803C536685K401Q420J5285K3070L2693M5036O0019P7093R6489J19103J44932
59792D161226J72584K00999K30849K63375K98235L33093L64607L88698L99898
59783F813564L91736L58611K97752K10508J03298j2445j22826k15752k84016l25618
59773G214812l42663l40136l24223l00076k70715k38075k04477j72339j42852
59764D879256j15768r0640o7667m7242k9228j2914K590J8027L3612M8850O3132
59753D682008P6751R1001J07012J24698J43103J61512J79980J99163K19959K43089
59743F228276K68548K95629L23753L53126L84168M16604M49659M82908N16120
$$ plain form
59734 9718791 10266902 10843351 11441891 12054394 12671294 13281684 13873943 14436950 14961268
59725 14961268 15440432 15872715 16262391 16618874 16954277 17281739 17615266 17969228 18356254
59716 18356254 18785216 19261171 19786417 20360454 20978644 21631312 22304170 22979359 23636553
59707 23636553 24254279 24811418 25288520 25669226 25942363 26104071 26158324 26115387 25989818 25799559
59697 25799559 25565728 25311682 25061015 24835508 24654067 24532604 24484268 24519668 24647086 24872730
59687 24872730 25200983 25634683 26175408 26823365 27576449 28428837 29370106 30385011 31452837
59678 31452837 32545473 33625540 34646743 35556985 36302839 36834397 37110767 37105913 36812946
59669 36812946 36245125 35433713 34423835 33269008 32024940 30743946 29471026 28241265
$$ packed form
59734I718791N48111N76449N98540O12503O16900O10390N92259N63007N24318
59725A4961268M79164M32283L89676L56483L35403L27462L33527L53962L87026
59716A8356254M28962M75955N25246N74037O18190O52668O72858O75189O57194
59707B3636553O17726N57139M77102L80706K73137J61708N4253m2937j25569j90259
59697B5799559k33831k54046k50667k25507j81441j21463m8336L5400J27418K25644
59687B4872730L28253M33700N40725O47957P53084Q52388R41269J014905J067826
59678C1452837J092636J080067J021203R10242P45854N31558K76370m854k92967
59669C6812946n67821q11412j009878j154827j244068j280994j272920j229761
$$ plain form
59661 28241265 27077697 25989749 24973048 24011081 23079045 22149984 21201947 20223323 19214267
59652 19214267 18184799 17151422 16133111 15147140 14206223 13318230 12487529 11715964 11003170
59643 11003170 10347302 9746096 9197090 8697143 8242586 7830092 7456902 7120120 6816474
59634 6816474 6543014 6297547 6078144 5882806 5709892 5558263 5426509 5312424 5213639 5128387
59624 5128387 5055176 4992083 4936922 4887901 4843520 4801832 4760188 4715772 4666150 4609455 4544428
59613 4544428 4470499 4387842 4297482 4201299 4101542 4000024 3897935 3796582 3697984 3604352 3517183
59602 3517183 3437235 3365206 3301920 3247752 3202252 3164660 3134730 3112927 3099721 3094670 3096338 3103318
59590 3103318 3115198 3132101 3153350 3177163 3201920 3227155 3252852 3278355 3302722 3325957 3349195
$$ packed form
59661B8241265j163568j087948j016701r61967r32036r29061r48037r78624j009056
59652A9214267j029468j033377j018311r85971r40917q87993q30701p71565p12794
59643A1003170o55868o01206n49006m99947m54557m12494l73190l36782l03646
59634F816474k73460k45467k19403j95338j72914j51629j31754j14085r8785q5252
59624E128387p3211o3093n5161m9021m4381m1688m1644m4416m9622n6695o5027
59613D544428p3929q2657r0360r6183r9757j01518j02089j01353r8598r3632q7169
59602C517183p9948p2029o3286n4168m5500l7592k9930k1803j3206n051J668O980
59590C103318J1880J6903K1249K3813K4757K5235K5697K5503K4367K3235K3238
$$ plain form
59579 3349195 3373631 3399868 3428335 3459794 3495234 3535694 3582391 3636680 3699615 3771816 3853942
59568 3853942 3947110 4052706 4171878 4305331 4453480 4616724 4795681 4991237 5204321 5435618
59558 5435618 5685366 5953092 6237307 6535594 6845201 7163322 7486620 7810800 8131102
59549 8131102 8443125 8742894 9026568 9290970 9534501 9757032 9958833 10140182 10302041
59540 10302041 10446245 10574526 10687750 10786521 10872310 10947948 11017649 11086998 11162187 11248114
59530 11248114 11346602 11456021 11571814 11686715 11790850 11872668 11920580 11924305 11875609 11768854
59520 11768854 11601332 11373174 11087147 10748803 10366481 9950458 9511605 9060503 8606985
59511 8606985 8159513 7724584 7306991 6910692 6539143 6194770 5878540 5590344 5329775
$$ packed form
59579C349195K4436K6237K8467L1459L5440M0460M6697N4289O2935P2201Q2126
59568C853942R3168J05596J19172J33453J48149J63244J78957J95556K13084K31297
59558E435618K49748K67726K84215K98287L09607L18121L23298L24180L20302
59549H131102L12023K99769K83674K64402K43531K22531K01801J81349J61859
59540A0302041J44204J28281J13224R8771Q5789P5638O9701O9349P5189Q5927
59530A1248114R8488J09419J15793J14901J04135Q1818M7912L725m8696j06755
59520A1768854j67522k28158k86027l38344l82322m16023m38853m51102m53518
59511H606985m47472m34929m17593l96299l71549l44373l16230k88196k60569
$$ plain form
59502 5329775 5096496 4890065 4709546 4553366 4419653 4306849 4213841 4139468 4082259 4041065
59492 4041065 4015754 4006861 4014648 4038977 4079991 4138296 4214245 4307547 4417862 4545456 4691026
59481 4691026 4855170 5038185 5239987 5459778 5695854 5945883 6207075 6475753 6746790
59472 6746790 7013678 7268952 7504375 7710950 7879377 8001085 8069404 8080499 8033700 7930985
59462 7930985 7776077 7574111 7332062 7058818 6764082 6456887 6144924 5834631 5531164
59453 5531164 5238271 4958662 4694718 4448610 4221662 4013874 3824233 3651480 3494593
59444 3494593 3352820 3225474 3111796 3011008 2922424 2845294 2778532 2720873 2671505 2630254
59434 2630254 2596893 2570477 2549808 2534414 2524573 2520379 2521147 2525812 2533513 2543689 2555978 2570183
$$ packed form
59502E329775k33279k06431j80519j56180j33713j12804r3008p4373n7209m1194
59492D041065k5311q893P787K4329M1014N8305P5949R3302J10315J27594J45570
59481D691026J64144J83015K01802K19791K36076K50029K61192K68678K71037
59472F746790K66888K55274K35423K06575J68427J21708O8319J1095m6799j02715
59462G930985j54908k01966k42049k73244k94736l07195l11963l10293l03467
59453E531164k92893k79609k63944k46108k26948k07788j89641j72753j56887
59444C494593j41773j27346j13678j00788q8584p7130o6762n7659m9368m1251
59434B630254l3361k6416k0669j5394r841m194P68M665P701J0176J2289J4205
$$ plain form
59422 2570183 2586056 2603142 2621259 2641276 2664872 2693256 2726522 2764510 2807628 2855958 2907892
59411 2907892 2960701 3012964 3066106 3123406 3188022 3262318 3348539 3449223 3566668 3702305 3856697
59400 3856697 4029795 4220966 4429229 4654406 4898579 5166292 5462970 5793061 6159557
59391 6159557 6564718 7010370 7497162 8023731 8586506 9179664 9794643 10419940 11042023
59382 11042023 11647050 12222317 12757176 13243852 13678082 14058918 14387663 14666800 14899518
59373 14899518 15089505 15240414 15354960 15434069 15476505 15479219 15438276 15349877 15211114 15020635
59363 15020635 14779504 14492002 14165736 13810917 13439269 13062714 12691641 12333091 11989864
59354 11989864 11661112 11343712 11033350 10725070 10413897 10095742 9768212 9430897 9085306
$$ packed form
59422B570183J5873J7086J8117K0017K3596K8384L3266L7988M3118M8330N1934
59411B907892N2809N2263N3142N7300O4616P4296Q6221J00684J17445J35637J54392
59400C856697J73098J91171K08263K25177K44173K67713K96678L30091L66496
59391F159557M05161M45652M86792N26569N62775N93158O14979O25297O22083
59382A1042023O05027N75267N34859M86676M34230L80836L28745K79137K32718
59373A4899518J89987J50909J14546P9109M2436K714m0943q8399j38763j90479
59363A5020635k41131k87502l26266l54819l71648l76555l71073l58550l43227
59354A1989864l28752l17400l10362l08280l11173l18155l27530l37315l45591
$$ plain form
59345 9085306 8734746 8384099 8039177 7705578 7387619 7088081 6808947 6552275 6320209
59336 6320209 6114062 5933646 5777714 5645042 5534909 5446528 5378268 5327639 5291948 5268846
59326 5268846 5256223 5251734 5252535 5255542 5257974 5257585 5252364 5240166 5219008 5187841 5146842 5096793 5038434
59313 5038434 4972734 4901494 4827011 4751002 4674369 4598247 4524744 4456187 4393915 4338320 4289824
59302 4289824 4249199 4217067 4193820 4180316 4178079 4188466 4211918 4248409 4298367 4362795 4442577
59291 4442577 4538007 4648949 4775196 4916593 5072921 5243672 5427873 5624051 5830228 6043692
59281 6043692 6260671 6476374 6685427 6882254 7061210 7216863 7344548 7440688 7502766 7529416
59271 7529416 7520830 7478887 7406669 7307938 7187020 7048646 6897336 6736850 6570067 6398754
$$ packed form
59345I085306l50560l50647l44922l33599l17959k99538k79134k56672k32066
59336F320209k06147j80416j55932j32672j10133q8381o8260n0629l5691k3102
59326E268846j2623m489Q01L007K432l89n221j2198k1158l1167m0999n0049n8359
59313E038434o5700p1240p4483p6009p6633p6122p3503o8557o2272n5595m8496
59302D289824m0625l2132k3247j3504k237J0387K3452L6491M9958O4428P9782
59291D442577R5430J10942J26247J41397J56328J70751J84201J96178K06177K13464
59281F043692K16979K15703K09053J96827J78956J55653J27685R6140O2078K6650
59271G529416q586m1943p2218r8731j20918j38374j51310j60486j66783j71313
$$ plain form
59261 6398754 6223111 6042174 5855673 5665834 5477160 5294653 5122547 4964300 4822750
59252 4822750 4699809 4596355 4512763 4449392 4406618 4384873 4384927 4408016 4455607 4529145 4629934
59241 4629934 4758882 4916406 5103043 5320219 5569949 5853550 6170918 6520898 6901353
59232 6901353 7308028 7733457 8167397 8598051 9012448 9396009 9732874 10007591 10206995
59223 10206995 10321125 10343359 10270599 10103906 9849226 9517438 9123205 8682916 8212837 7728245
59213 7728245 7243127 6769647 6317366 5892882 5500080 5140642 4814543 4520736 4257931
59204 4257931 4024952 3820428 3642279 3487693 3353709 3237872 3138366 3053638 2982032 2921877
59194 2921877 2871841 2831019 2798577 2773413 2754251 2740108 2730658 2726150 2726909 2732894 2743725 2759147
$$ packed form
59261F398754j75643j80937j86501j89839j88674j82507j72106j58247j41550
59252D822750j22941j03454q3592o3371m2774k1745N4K3089M7591P3538J00789
59241D629934J28948J57524J86637K17176K49730K83601L17368L49980L80455
59232F901353M06675M25429M33940M30654M14397L83561L36865K74717J99404
59223A0206995J14130K2234p2760j66693k54680l31788l94233m40289m70079m84592
59213G728245m85118m73480m52281m24484l92802l59438l26099k93807k62805
59204D257931k32979k04524j78149j54586j33984j15837r9506q4728p1606o0155
59194B921877n0036m0822l2442k5164j9162j4143r450m508P59N985J0831J5422
$$ plain form
59182 2759147 2779316 2804555 2835004 2870689 2911818 2958709 3011368 3069391 3132222 3199290 3269861
59171 3269861 3343058 3418067 3493989 3569286 3641710 3709029 3769640 3822194 3864851 3895411 3912361
59160 3912361 3915627 3906230 3885327 3853710 3812161 3762030 3705287 3643943 3579659 3514029 3448947 3386228
59148 3386228 3326902 3271337 3220206 3174932 3136867 3106386 3083120 3066927 3058263 3057700 3065474 3081519
59136 3081519 3105682 3137846 3178079 3226782 3284603 3352192 3430124 3519001 3619470 3732165 3857709
59125 3857709 3996733 4149760 4317039 4498552 4694096 4903248 5125239 5358871 5602442
59116 5602442 5853642 6109676 6367600 6624407 6876605 7119738 7348501 7557237 7740191
59107 7740191 7891439 8004945 8074876 8095888 8063522 7975130 7831188 7635888 7396295 7120623
$$ packed form
59182B759147K0169K5239L0449L5685M1129M6891N2659N8023O2831O7068P0571
59171C269861P3197P5009P5922P5297P2424O7319O0611N2554M2657L0560J6950
59160C912361L266r397k0903l1617m1549n0131n6743o1344o4284o5630o5082o2719
59148C386228n9326n5565n1131m5274l8065l0481k3266j6193q664n63P774J6045
59136C081519K4163L2164M0233M8703N7821O7589P7932Q8877J00469J12695J25544
59125C857709J39024J53027J67279J81513J95544K09152K21991K33632K43571
59116E602442K51200K56034K57924K56807K52198K43133K28763K08736J82954
59107G740191J51248J13506O9931K1012l2366q8392j43942j95300k39593k75672
$$ plain form
59097 7120623 6817091 6493954 6159835 5823197 5491021 5168046 4857451 4562082 4284752
59088 4284752 4027387 3790276 3572355 3372166 3188625 3021204 2869538 2732631 2608395
59079 2608395 2494265 2388455 2290436 2200113 2116961 2040241 1969661 1905282 1846841 1793618 1744994
59068 1744994 1700828 1661186 1625952 1594698 1566659 1540773 1516079 1492287 1469856 1449343 1430626
59057 1430626 1412825 1394972 1376765 1358679 1341425 1325392 1310678 1297411 1285719 1275394 1265997
59046 1265997 1257468 1250352 1245224 1242098 1240577 1240401 1241685 1244881 1250704 1259818 1272336 1287787 1305754
59033 1305754 1326241 1349154 1373725 1398727 1422957 1445133 1463746 1477691 1487015 1492609 1495322 1495847
59021 1495847 1495212 1494714 1495241 1497218 1501122 1507470 1516184 1526598 1538330 1551655 1566773 1583034 1599098
$$ packed form
59097G120623l03532l23137l34119l36638l32176l22975l10595k95369k77330
59088D284752k57365k37111k17921k00189j83541j67421j51666j36907j24236
59079B608395j14130j05810r8019r0323q3152p6720p0580o4379n8441n3223m8624
59068A744994m4166l9642l5234l1254k8039k5886k4694k3792k2431k0513j8717
59057A430626j7801j7853j8207j8086j7254j6033j4714j3267j1692j0325r397
59046A265997q529p116n128l126j521j76J284L196N823R114J2518J5451J7967
59033A305754K0487K2913K4571K5002K4230K2176J8613J3945R324N594K713N25
59021A495847o35m98N27J977L904O348Q714J0414J1732J3325J5118J6261J6064
$$ plain form
59008 1599098 1613464 1624790 1632165 1635376 1634669 1630172 1621969 1610779 1598009 1584853 1571726 1558740
58996 1558740 1546184 1534340 1523391 1513897 1506752 1502229 1499603 1498269 1498660 1501377 1505936 1511313 1517519
58983 1517519 1525522 1535558 1546516 1557380 1568502 1580948 1595190 1611076 1628703 1648615 1671105
58972 1671105 1695850 1722451 1751118 1782622 1817488 1855259 1894742 1935114 1976619 2019814 2064249
58961 2064249 2108417 2151224 2193002 2234823 2277301 2320610 2365234 2411920 2460953 2512212 2566165
58950 2566165 2624193 2687682 2757265 2833252 2916207 3006548 3104038 3208459 3320649 3442213 3574184
58939 3574184 3716632 3869821 4035147 4214655 4410168 4623332 4856224 5111380 5391299
58930 5391299 5698116 6033573 6399097 6796149 7226786 7693640 8198985 8743983 9329083
$$ packed form
59008A599098J4366J1326P375L211p07m497q203j1190j2770j3156j3127j2986
58996A558740j2556j1844j0949r494p145m523k626j334L91K717M559N377O206
58983A517519Q003J0036J0958J0864J1122J2446J4242J5886J7627J9912K2490
58972A671105K4745K6601K8667L1504L4866L7771L9483M0372M1505M3195M4435
58961B064249M4168M2807M1778M1821M2478M3309M4624M6686M9033N1259N3953
58950B566165N8028O3489O9583P5987Q2955R0341R7490J04421J12190J21564J31971
58939C574184J42448J53189J65326J79508J95513K13164K32892K55156K79919
58930E391299L06817L35457L65524L97052M30637M66854N05345N44998N85100
$$ plain form
58921 9329083 9954707 10620861 11326080 12067013 12838572 13633357 14440397 15244669 16027889
58912 16027889 16769347 17446175 18034115 18509685 18852831 19048756 19088965 18972116 18704442
58903 18704442 18299075 17774429 17152379 16456430 15709742 14933418 14145765 13362519 12597256
58894 12597256 11861303 11163314 10509083 9901899 9343054 8831942 8365797 7939795 7547948
58885 7547948 7184248 6843419 6521420 6216045 5927112 5655581 5402205 5167031 4949840
58876 4949840 4750397 4568028 4401417 4249220 4110683 3985415 3872734 3771393 3679892 3596976
58866 3596976 3522065 3455269 3396738 3345833 3301152 3261539 3226856 3197616 3174121 3156178 3143458
58855 3143458 3135833 3133434 3136589 3145741 3161305 3183623 3212957 3249376 3292672 3342652 3399562 3464079
$$ packed form
58921I329083O25624O66154P05219P40933P71559P94785Q07040Q04272P83220
58912A6027889P41458O76828N87940M75570L43146J95925M0209j16849k67674
58903A8704442m05367n24646o22050o95949p46688p76324p87653p83246p65263
58894A2597256p35953o97989o54231o07184n58845n11112m66145m26002l91847
58885G547948l63700l40829l21999l05375k88933k71531k53376k35174k17191
58876D949840j99443j82369j66611j52197j38537j25268j12681j01341r1501q2916
58866C596976p4911o6796n8531n0905m4681l9613l4683k9240k3495j7943j2720
58855C143458p625k399L155R152J5564K2318K9334L6419M3296M9980N6910O4517
$$ plain form
58843 3464079 3536870 3618433 3709338 3810241 3921599 4043746 4177390 4323661 4483533 4657722
58833 4657722 4847375 5054384 5280614 5527272 5795511 6087347 6405468 6752423 7130569
58824 7130569 7542560 7991181 8478633 9006414 9575768 10187462 10840675 11532289 12257197
58815 12257197 13008602 13777290 14550412 15311021 16038754 16711197 17305295 17798525 18169947
58806 18169947 18401718 18481297 18403585 18171836 17796950 17295824 16689539 16001553 15255867 14475274
58796 14475274 13679988 12886873 12109379 11357964 10640559 9962801 9328228 8738601 8194253
58787 8194253 7694368 7237333 6821214 6444060 6103984 5799255 5528429 5290241 5083259
58778 5083259 4905661 4754948 4626956 4514451 4406950 4292826 4162745 4012470 3843802
$$ packed form
58843C464079P2791Q1563R0905J00903J11358J22147J33644J46271J59872J74189
58833D657722J89653K07009K26230K46658K68239K91836L18121L46955L78146
58824G130569M11991M48621M87452N27781N69354O11694O53213O91614P24908
58815A2257197P51405P68688P73122P60609P27733O72443N94098M93230L71422
58806A8169947K31771P9579p7712k31749l74886n01126o06285o87986p45686p80593
58796A4475274p95286p93115p77494p51415p17405o77758o34573n89627n44348
58787H194253m99885m57035m16119l77154l40076l04729k70826k38188k06982
58778E083259j77598j50713j27992j12505j07501j14124j30081j50275j68668
$$ plain form
58769 3843802 3663449 3480137 3301408 3132052 2974748 2831252 2702458 2587972 2486550
58760 2486550 2397129 2318998 2251140 2192136 2140829 2096615 2058801 2026114 1997136 1971023 1947591
58749 1947591 1926779 1908187 1891027 1874441 1857856 1840963 1823255 1803779 1781648 1756807 1730080
58738 1730080 1702451 1674506 1646528 1618807 1591656 1565187 1539157 1513072 1486483 1459276 1431563
58727 1431563 1403341 1374501 1345197 1315965 1287284 1259319 1232267 1206555 1182387 1159439 1137437
58716 1137437 1116729 1097809 1080529 1064393 1049463 1036341 1025256 1015783 1007522 1000436 994398 988967
58704 988967 983843 979047 974394 969175 962588 954154 943582 930744 916107 900841 886151 872675 860633
58691 860633 850179 841262 833506 826663 821106 817511 816151 816726 818857 822535 828175 836420 847855 862639
$$ packed form
58769C843802j80353j83312j78729j69356j57304j43496j28794j14486j01422
58760B486550q9421p8131o7858n9004n1307m4214l7814l2687k8978k6113k3432
58749A947591k0812j8592j7160j6586j6585j6893j7708j9476k2131k4841k6727
58738A730080k7629k7945k7978k7721k7151k6469k6030k6085k6589k7207k7713
58727A431563k8222k8840k9304k9232k8681k7965k7052k5712k4168k2948k2002
58716A137437k0708j8920j7280j6136j4930j3122j1085r473q261p086o038n431
58704I88967n124m796m653n219o587q434j0572j2838j4637j5266j4690j3476j2042
58691H60633j0454q917p756o843n557l595j360N75K131L678N640Q245J1435J4784
$$ plain form
58677 862639 880341 900201 921607 944408 968873 995464 1024718 1057516 1095448 1140570 1194377
58666 1194377 1257018 1327473 1403809 1482162 1555279 1613045 1645710 1647624 1619037 1565736 1497305
58655 1497305 1424323 1355036 1293355 1239669 1193423 1154864 1124767 1103329 1089774 1082916 1081907 1086456
58643 1086456 1096482 1111666 1131456 1155506 1183916 1216991 1254924 1297915 1346471 1401315 1462980
58632 1462980 1531684 1607697 1691701 1784684 1887518 2000792 2125076 2261236 2410376 2573485
58622 2573485 2751185 2943698 3150668 3370719 3601150 3837958 4075930 4308441 4527244
58613 4527244 4722750 4884857 5004096 5072852 5086488 5044066 4948636 4807120 4629436 4426504
58603 4426504 4208085 3982124 3755567 3534750 3324367 3126702 2942618 2772939 2618285
$$ packed form
58677H62639J7702J9860K1406K2801K4465K6591K9254L2798L7932M5122N3807
58666A194377O2641P0455P6336P8353P3117N7766L2665J914k8587n3301o8431
58655A497305p2982o9287o1681n3686m6246l8559l0097k1438j3555o858j009M549
58643A086456J0026J5184J9790K4050K8410L3075L7933M2991M8556N4844O1665
58632A462980O8704P6013Q4004R2983J02834J13274J24284J36160J49140J63109
58622B573485J77700J92513K06970K20051K30431K36808K37972K32511K18803
58613D527244J95506J62107J19239O8756J3636m2422r5430j41516j77684k02932
58603D426504k18419k25961k26557k20817k10383j97665j84084j69679j54654
$$ plain form
58594 2618285 2478143 2351236 2236913 2135288 2045996 1967637 1898682 1838161 1785173 1738419
58584 1738419 1696572 1658586 1623416 1590085 1558435 1529166 1502697 1478468 1455790 1434852 1416341
58573 1416341 1400472 1387004 1375956 1367689 1362292 1359152 1356997 1354076 1348553 1339133 1325380 1307498 1286231
58560 1286231 1263136 1240357 1219670 1201993 1188036 1178875 1175261 1176721 1181807 1188880 1195945 1200039 1197760
58547 1197760 1186846 1167094 1139910 1107443 1072116 1036304 1001979 970442 942185 916843 893648
58536 893648 872395 853742 838136 824702 811796 798633 785758 773923 763211 753437 744716 737170
58524 737170 730538 724576 719588 716035 713757 712050 710552 709687 710116 712065 715327 719689 725069 731331 738236
58509 738236 745644 753508 761518 768899 774798 778940 781801 784116 786283 788224 789769 791075 792585 794483
$$ packed form
58594B618285j40142j26907j14323j01625q9292p8359o8955o0521n2988m6754
58584A738419m1847l7986l5170l3331l1650k9269k6469k4229k2678k0938j8511
58573A416341j5869j3468j1048q267n397l140k155k921n523r420j3753j7882k1267
58560A286231k3095k2779k0687j7677j3957r161l614J460N086P073P065M094k279
58547A197760j0914j9752k7184l2467l5327l5812l4325l1537k8257k5342k3195
58536H93648k1253j8653j5606j3434j2906j3163j2875j1835j0712r774q721p546
58524G37170o632n962m988l553k278j707j498q65M29J949L262M362N380O262O905
58509G38236P408P864Q010P381N899M142K861K315K167J941J545J306J510J898
$$ plain form
58495 794483 796308 797408 797787 798109 798661 798741 797500 795107 792513 790218 787818 784744 780851 776233 771038
58480 771038 765687 760829 756776 753279 750008 746896 743846 740449 736216 730913 724590 717570 710436 703699
58466 703699 697451 691648 686658 683025 680702 679123 678119 678087 679140 680754 682602 685018 688262 691949 695678
58451 695678 699677 704404 710021 716684 724767 734228 744279 754186 763961 773686 782664 789809 794436 796049
58437 796049 793894 787644 778248 767337 755896 744147 732459 721539 711777 703145 695810 690260 686704
58424 686704 684791 684030 684222 685508 688213 692536 698247 704973 712854 722378 733316 744540 755324 765969
58410 765969 776447 785272 790828 793224 793667 792477 789035 783454 776846 769904 762585 755420 749752 746102
58396 746102 743368 740356 737286 735180 734472 734838 735828 737055 738183 739269 740798 743023 745624 748341 751509
$$ packed form
58495G94483J825J100L79L22N52Q0j241k393k594k295k400l074l893m618n195
58480G71038n351m858m053l497l271l112l050l397m233n303o323p020p134o737
58466G03699o248n803m990l633k323j579j004l2J053J614J848K416L244L687L729
58451F95678L999M727N617O663Q083R461J0051R907R775R725Q978P145M627J613
58437G96049k155o250r396j0911j1441j1749j1688j0920r762q632p335n550l556
58424F86704j913p61J92J286K705M323N711O726P881R524J0938J1224J0784J0645
58410G65969J0478Q825N556K396M43j190l442n581o608o942p319p165n668l650
58396G46102k734l012l070k106p08L66R90J227J128J086J529K225K601K717L168
$$ plain form
58381 751509 755606 760599 766095 771828 777632 783235 788442 793379 798331 803470 808848 814419 819984 825377
58367 825377 830774 836543 842759 849211 855953 863436 871956 881321 891208 901499 912041 922329 931637
58354 931637 939372 945218 949106 951050 950933 948576 944285 939163 934586 931398 929832 929892 931469 934299 938307
58339 938307 943837 951078 959420 967942 976426 985445 995552 1006847 1019155 1032035 1044759 1056914 1068940
58326 1068940 1081502 1094494 1107326 1120026 1133292 1147499 1162372 1177583 1192808 1207183 1219509
58315 1219509 1229198 1236378 1241062 1243139 1243347 1243400 1244724 1247609 1251787 1257113 1263428 1270455 1278316 1287628 1298843
58300 1298843 1311848 1326420 1342554 1360096 1378510 1397279 1416328 1436027 1456923 1479321 1502781
58289 1502781 1526404 1550074 1574931 1601997 1630895 1660814 1692180 1726087 1762417 1799859 1837676
$$ packed form
58381G51509M097M993N496N733N804N603N207M937M952N139N378N571N565N393
58367H25377N397N769O216O452O742P483Q520R365R887J0291J0542J0288R308
58354I31637P735N846L888J944j17k357m291n122m577l188j566O0J577K830M008
58339I38307N530P241Q342Q522Q484R019J0107J1295J2308J2880J2724J2155J2026
58326A068940J2562J2992J2832J2700J3266J4207J4873J5211J5225J4375J2326
58315A219509R689P180M684K077K08N3J324K885M178N326O315P027P861R312J1215
58300A298843J3005J4572J6134J7542J8414J8769J9049J9699K0896K2398K3460
58289A502781K3623K3670K4857K7066K8898K9919L1366L3907L6330L7442L7817
$$ plain form
58278 1837676 1876021 1914433 1951472 1986221 2018958 2050049 2079443 2107656 2136000 2165331 2195599
58267 2195599 2227064 2260887 2297983 2338197 2380973 2425875 2472200 2519184 2566982 2616458 2667803
58256 2667803 2720488 2774826 2832252 2893674 2958819 3027597 3100688 3178247 3259413 3343787 3432200
58245 3432200 3525512 3623900 3727820 3838209 3955113 4077591 4205664 4340951 4484615 4636150
58235 4636150 4795033 4962140 5138710 5325329 5522856 5732993 5957040 6195276 6448273
58226 6448273 6717586 7004790 7311393 7640100 7994328 8375966 8785641 9225840 9701851
58217 9701851 10219245 10782966 11399528 12077532 12825328 13651173 14567035 15589939 16739540
58208 16739540 18038533 19517426 21216877 23186132 25484495 28185727 31376624 35150988
$$ packed form
58278A837676L8345L8412L7039L4749L2737L1091K9394K8213K8344K9331L0268
58267B195599L1465L3823L7096M0214M2776M4902M6325M6984M7798M9476N1345
58256B667803N2685N4338N7426O1422O5145O8778P3091P7559Q1166Q4374Q8413
58245C432200R3312R8388J03920J10389J16904J22478J28073J35287J43664J51535
58235D636150J58883J67107J76570J86619J97527K10137K24047K38236K52997
58226F448273K69313K87204L06603L28707L54228L81638M09675M40199M76011
58217I701851N17394N63721O16562O78004P47796Q25845R15862J022904J149601
58208A6739540J298993J478893J699451J969255K298363K701232L190897L774364
$$ plain form
58200 35150988 39610503 44870369 51053717 58277992 66660572 76353344 87582193 100671715
58192 100671715 116057190 134271848 155885772 181418915 211261327 245491612 283368417
58185 283368417 322539462 358592537 385760483 398863756 395450209 376734283 346798184
58178 346798184 310765061 273140650 237020934 204096047 175026969 149860487 128343991
58171 128343991 110113219 94776342 81943753 71243814 62335065 54913423 48718361
58164 48718361 43539041 39212701 35613445 32641677 30220263 28290737 26805256 25722189
58156 25722189 25010946 24658159 24667232 25056135 25858791 27123042 28900496 31238591 34173778
58147 34173778 37687456 41595193 45432395 48479074 49996731 49558005 47236094 43525529
$$ packed form
58200C5150988M459515N259866O183348P224275Q382580R692772J1228849J3089522
58192A00671715J5385475J8214658K1613924K5533143K9842412L4230285L7876805
58185B83368417L9171045L6053075K7167946J3103273l413547j8715926k9936099
58178C46798184l6033123l7624411l6119716l2924887k9069078k5166482k1516496
58171A28343991j8230772j5336877j2832589j0699939q908749p421642o195062
58164D8718361n179320m326340l599256k971768k421414j929526j485481j083067
58156B5722189p11243l52787R073L88903Q02656J264251J777454K338095K935187
58147C4173778L513678L907737L837202L046679J517657m38726k321911l710565
$$ plain form
58139 43525529 39082976 34483612 30110858 26162926 22706125 19730613 17194332 15048144
58131 15048144 13242591 11727995 10457681 9391750 8496571 7742874 7106213 6567144 6108504
58122 6108504 5713416 5367038 5058618 4780108 4523907 4283408 4054823 3837189 3631160
58113 3631160 3438328 3260412 3097924 2950117 2816480 2697114 2591343 2497467 2414458 2342170
58103 2342170 2278851 2220023 2161154 2100445 2038176 1974807 1911068 1848555 1788466 1730242 1672664
58092 1672664 1615682 1560097 1506254 1454354 1405499 1361040 1321064 1284462 1250227 1217833 1186699
58081 1186699 1156280 1126571 1097902 1070428 1044296 1019881 997270 975944 955482 936078 917935
58070 917935 900778 884558 869921 857224 845752 834723 824447 815648 808183 801330 794884 789007
$$ packed form
58139D3525529m442553m599364m372754l947932l456801k975512k536281k146188
58131A5048144j805553j514596j270314j065931q95179p53697o36661n39069m58640
58122F108504l95088l46378l08420k78510k56201k40499k28585k17634k06029
58113C631160j92832j77916j62488j47807j33637j19366j05771r3876q3009p2288
58103B342170o3319n8828n8869o0709o2269o3369o3739o2513o0089n8224n7578
58092A672664n6982n5585n3843n1900m8855m4459l9976l6602l4235l2394l1134
58081A186699l0419k9709k8669k7474k6132k4415k2611k1326k0462j9404j8143
58070I17935j7157j6220j4637j2697j1472j1029j0276q799p465o853o446n877
$$ plain form
58058 789007 783440 777812 772269 766796 760249 751314 740386 729389 719610 710727 702138 694227 687795 682969
58044 682969 679237 676168 673642 671598 669964 668820 668447 669193 671257 674566 678859 683821 689036 693903 697935
58029 697935 701170 703929 706165 707472 707763 707361 706249 703941 700475 696899 694189 692107 689672 686434 682732
58014 682732 679034 675567 672416 669438 666258 662762 659487 657095 655539 653975 651383 647083 641020 633875
58000 633875 626645 619806 613135 606456 600115 594461 589448 585219 582563 582135 583477 585274 586327 585942 583860
57985 583860 580485 576892 574015 571959 570451 569599 569679 570539 571775 573217 574623 575259 574544 572987 571808 571590
57969 571590 571771 571333 569531 566135 561489 556299 551030 545726 540658 536638 534110 532491 531163 530604 531583
57954 531583 533628 535483 536975 539204 542760 546929 551035 555394 560305 564947 568138 569685 570228 569982 568259
$$ packed form
58058G89007n567n628n543n473o547q935j0928j0997r779q883q589p911o432m826
58044F82969l732l069k526k044j634j144l73P46K064L309M293M962N215M867M032
58029F97935L235K759K236J307K91m02j112k308l466l576k710k082k435l238l702
58014F82732l698l467l151k978l180l496l275k392j556j564k592m300o063p145
58000F33875p230o839o671o679o341n654n013m229k656m28J342J797J053l85k082
57985E83860l375l593k877k056j508q52Q0Q60J236J442J406O36p15j557j179k18
57969E71590J81m38j802l396m646n190n269n304n068m020k528j619j328n59R79
57954E31583K045J855J492K229L556M169M106M359M911M642L191J547N43k46j723
$$ plain form
57939 568259 564197 557644 549382 540645 532277 524260 516136 507779 499417 491044 482414 473628 465143 456994
57925 456994 448675 440120 432202 425775 420677 416298 412817 411158 411719 413700 415926 418087 421022 425856
57911 425856 432876 441232 449794 458299 467467 477898 489136 500070 510101 519525 528673 537037 543519
57898 543519 547453 549091 549021 547446 544295 539819 534589 528837 522203 514371 505652 496758 488276 480579 473950
57883 473950 468394 463582 459348 456164 454772 455448 457845 461323 465147 468748 472291 476769 482964 490410
57869 490410 497947 505135 512427 519997 527214 533496 538932 543632 547155 549155 550159 550987 551594 551141 549171
57854 549171 546167 542741 538743 533618 527475 521311 515969 511225 506298 501104 496493 493147 490798 488869
57840 488869 487361 486564 486219 485615 484338 482305 479136 474169 467237 458923 449989 440965 432247 423890 415207
$$ packed form
57939E68259m062o553q262q737q368q017q124q357q362q373q630q786q485q149
57925D56994q319q555p918o427n098m379l481j659N61J981K226K161K935M834
57911D25856P020Q356Q562Q505R168J0431J1238J0934J0031R424R148Q364O482
57898E43519L934J638p0j575l151m476n230n752o634p832q719q894q482p697o629
57883D73950n556m812m234l184j392O76K397L478L824L601L543M478O195P446
57869D90410P537P188P292P570P217O282N436M700L523K000J004Q28O07m53j970
57854E49171l004l426l998n125o143o164n342m744m927n194m611l346k349j929
57840D88869j508p97l45o04j277k033l169m967o932q314q934r024q718q357q683
$$ plain form
57825 415207 405290 394253 383379 373746 365289 357485 350233 343481 336714 329650 323137 318455 315775 314009
57811 314009 312189 310338 308892 307990 307717 308543 310962 314814 319369 324194 329717 336851 346080 356996 368729
57796 368729 380775 393345 406874 421380 436380 451335 465939 479924 492638 502935 509567 511828
57784 511828 509860 504356 495989 485221 472553 458746 444646 430862 417609 404842 392549 381043
57772 381043 370930 362661 356171 351128 347465 345350 344573 344372 344167 344279 345612 348666 353066 357967 362676
57757 362676 366869 370496 373672 376613 379531 382597 385943 389717 394010 398735 403572 408116 412144 415775
57743 415775 419428 423601 428605 434408 440749 447474 454711 462621 471062 479768 488824 498669 509482 520855
57729 520855 532350 544205 557203 571830 587776 604342 621334 639558 660328 684321 710978
$$ packed form
57825D15207r917j1037j0874r633q457p804p252o752o767p064o513m682k680j766
57811C14009j820j851j446r02k73Q26K419L852M555M825N523P134R229J0916J1733
57796C68729J2046J2570J3529J4506J5000J4955J4604J3985J2714J0297O632K261
57784E11828j968n504q367j0768j2668j3807j4100j3784j3253j2767j2293j1506
57772C81043j0113q269o490n043l663k115p77k01k05J12J333L054M400M901M709
57757C62676M193L627L176K941K918L066L346L774M293M725M837M544M028L631
57743D15775L653M173N004N803O341O725P237P910Q441Q706R056R845J0813J1373
57729E20855J1495J1855J2998J4627J5946J6566J6992J8224K0770K3993K6657
$$ plain form
57718 710978 739301 769122 801224 836255 874246 915396 960638 1010935 1066576 1127848 1196000
57707 1196000 1272770 1359190 1455589 1562708 1682052 1815016 1962221 2123819 2299936 2490659
57697 2490659 2695847 2914822 3145672 3384677 3626491 3864306 4089174 4289695 4453846
57688 4453846 4571964 4638126 4649594 4606736 4514070 4380205 4215636 4030644 3834997 3638058
57678 3638058 3447658 3269050 3105635 2960415 2836185 2734832 2657438 2605138 2579317 2580983
57668 2580983 2610259 2665738 2742658 2830395 2911722 2965918 2975196 2931325 2838459 2710328 2564030
57657 2564030 2414854 2274293 2149884 2045241 1960700 1895129 1847522 1817094 1802888 1804170 1820840
57646 1820840 1852710 1898742 1957852 2030321 2117538 2220366 2338418 2471013 2618010 2779374
$$ packed form
57718G10978K8323K9821L2102L5031L7991M1150M5242N0297N5641O1272O8152
57707A196000P6770Q6420R6399J07119J19344J32964J47205J61598J76117J90723
57697B490659K05188K18975K30850K39005K41814K37815K24868K00521J64151
57688D453846J18118O6162J1468m2858r2666j33865j64569j84992j95647j96939
57678C638058j90400j78608j63415j45220j24230j01353p7394n2300k5821J666
57668B580983K9276N5479P6920Q7737Q1327N4196R278m3871r2866j28131j46298
57657B564030j49176j40561j24409j04643q4541o5571m7607l0428j4206J282J6670
57646A820840L1870M6032N9110P2469Q7217J02828J18052J32595J46997J61364
$$ plain form
57636 2779374 2954307 3140960 3336529 3537204 3737984 3932324 4111719 4265927 4384471
57627 4384471 4458759 4483488 4457045 4381514 4262269 4106837 3923528 3720718 3506663 3289017
57617 3289017 3074097 2866597 2669742 2485372 2314159 2156301 2011972 1880882 1761827
57608 1761827 1653420 1555131 1466952 1388157 1317116 1252507 1194030 1141736 1095239 1053763 1016454
57597 1016454 982407 950877 921714 895166 871115 848985 828572 810325 794429 780155 766621
57586 766621 753859 742652 733552 726468 720952 716454 712336 708130 703872 700082 697464 696643 697935 701113
57572 701113 705554 710875 717312 725299 734816 745396 756726 769021 782791 798372 815773 834997
57560 834997 856518 881241 909796 942013 977475 1016608 1060784 1111153 1167726 1229947 1297974
$$ packed form
57636B779374J74933J86653J95569K00675K00780J94340J79395J54208J18544
57627D384471P4288K4729k6443p5531j19245j55432j83309k02810k14055k17646
57617C289017k14920k07500j96855j84370j71213j57858j44329j31090j19055
57608A761827j08407r8289q8179p8795p1041o4609n8477n2294m6497m1476l7309
57597A016454l4047l1530k9163k6548k4051k2130k0413j8247j5896j4274j3534
57586G66621j2762j1207r100p084n516m498m118m206m258l790k618q21J292L178
57572G01113M441N321O437P987R517J0580J1330J2295J3770J5581J7401J9224
57560H34997K1521K4723K8555L2217L5462L9133M4176N0369N6573O2221O8027
$$ plain form
57549 1297974 1373129 1457146 1551164 1655321 1769221 1892769 2026546 2171124 2325954 2489070
57539 2489070 2657697 2828515 2996914 3156360 3298996 3416959 3503267 3552274 3560457 3527382
57529 3527382 3455857 3351048 3219427 3068112 2904368 2734984 2565733 2401157 2244539 2098006
57519 2098006 1962817 1839709 1728937 1630092 1542147 1464014 1395084 1335167 1283913 1240426 1203534
57508 1203534 1172319 1146325 1125309 1108998 1097031 1088967 1084280 1082577 1083971 1089090 1098539 1112459
57496 1112459 1130737 1153459 1180954 1213542 1251582 1295759 1347022 1406193 1473790 1550157 1635534
57485 1635534 1730056 1833967 1947807 2072057 2206511 2350144 2501350 2657707 2815256 2968384
57475 2968384 3110620 3235377 3335904 3405268 3437318 3428251 3377631 3288429 3166351 3018779
$$ packed form
57549A297974P5155Q4017R4018J04157J13900J23548J33777J44578J54830J63116
57539B489070J68627J70818J68399J59446J42636J17963Q6308M9007Q183l3075
57529C527382p1525j04809j31621j51315j63744j69384j69251j64576j56618j46533
57519B098006j35189j23108j10772r8845q7945p8133o8930n9917n1254m3487l6892
57508A203534l1215k5994k1016j6311j1967q064m687j703J394N119R449J3920
57496A112459J8278K2722K7495L2588L8040M4177N1263N9171O7597P6367Q5377
57485A635534R4522J03911J13840J24250J34454J43633J51206J56357J57549J53128
57475B968384J42236J24757J00527O9364L2050r067n0620q9202j22078j47572
$$ plain form
57465 3018779 2853586 2678287 2499633 2323277 2153360 1992410 1841792 1702257 1574093
57456 1574093 1457178 1351211 1255920 1170945 1095607 1028907 969701 916921 869819 828007 791028
57445 791028 757890 727396 699004 673009 649688 628665 609341 591524 575269 560514 547315
57434 547315 536042 526666 518070 508863 498939 489531 481539 474457 467263 459781 452678 446526 441455 437506
57420 437506 434609 432193 429378 425873 422389 419929 418835 418652 418737 418750 418696 418775 419196 419950 420778 421484 422235 423370
57402 423370 425035 427275 430325 434326 438600 441801 443319 444229 446294 450030 454232 457415 459250 460464
57388 460464 461852 463745 466131 468812 471472 473877 476078 478307 480708 483261 485935 488793 491961 495524
57374 495524 499406 503310 506865 509955 512855 516022 519724 523858 527989 531596 534471 537022 540082 544264
$$ packed form
57465C018779j65193j75299j78654j76356j69917j60950j50618j39535j28164
57456A574093j16915j05967r5291q4975p5338o6700n9206n2780m7102m1812l6979
57445G91028l3138l0494k8392k5995k3321k1023j9324j7817j6255j4755j3199
57434E47315j1273r376q596r207r924r408p992p082p194p482p103o152n071l949
57420D37506k897k416k815l505l484k460j094j83Q5J3n4P9M21P54Q28P06P51J135
57402D23370J665K240L050M001M274L201J518R10K065L736M202L183J835J214
57388D60464J388J893K386K681K660K405K201K229K401K553K674K858L168L563
57374D95524L882L904L555L090K900L167L702M134M131L607K875K551L060M182
$$ plain form
57360 544264 549492 555256 561279 567826 575291 583577 592148 600774 610023 620633 632425 644219 655042
57347 655042 665026 674826 684516 693621 702077 710578 719848 729992 740622 751244 761430 771073 780614
57334 780614 790685 801296 811754 821540 830889 840243 849587 858712 867815 877310 887213 897250 907578
57321 907578 918927 931843 946045 960707 975309 990136 1005965 1023266 1041690 1060431 1079092
57310 1079092 1098042 1117831 1138545 1160044 1182620 1206993 1233539 1261852 1291237 1321442 1352733
57299 1352733 1385471 1419779 1455501 1492121 1528805 1564873 1600340 1635610 1670413 1703376 1733071
57288 1733071 1759163 1781974 1801052 1814968 1822719 1824578 1821223 1812825 1799701 1783357 1765998 1749115
57276 1749115 1733193 1718512 1705398 1693717 1683015 1673398 1665682 1660526 1657956 1657856 1660300 1665226 1672388
$$ packed form
57360E44264N228N764O023O547P465Q286Q571Q626R249J0610J1792J1794J0823
57347F55042R984R800R690R105Q456Q501R270J0144J0630J0622J0186R643R541
57334G80614J0071J0611J0458R786R349R354R344R125R103R495R903J0037J0328
57321I07578J1349J2916J4202J4662J4602J4827J5829J7301J8424J8741J8661
57310A079092J8950J9789K0714K1499K2576K4373K6546K8313K9385L0205L1291
57299A352733L2738L4308L5722L6620L6684L6068L5467L5270L4803L2963K9695
57288A733071K6092K2811J9078J3916P751J859l355q398j3124j6344j7359j6883
57276A749115j5922j4681j3114j1681j0702r617p716n156k570j00K444M926P162
$$ plain form
57263 1672388 1681809 1693647 1707414 1721948 1736563 1751636 1767753 1784830 1802494 1820841 1840279
57252 1840279 1860999 1882874 1905529 1928153 1949862 1970687 1991761 2014078 2037590 2061975 2087646
57241 2087646 2115105 2143671 2171812 2198775 2225198 2252061 2279655 2307671 2335696 2363365 2390356
57230 2390356 2416519 2441917 2466713 2491093 2515254 2539345 2563502 2587975 2613008 2638556 2664371
57219 2664371 2690505 2717424 2745517 2774862 2805552 2837723 2870990 2904384 2937296 2970105 3003505
57208 3003505 3037609 3072113 3106871 3141793 3176572 3211051 3245568 3280455 3315484 3350248 3384632
57197 3384632 3418380 3450651 3480751 3509075 3536653 3564048 3591351 3618863 3646879 3674935 3702195
57186 3702195 3728715 3755605 3783864 3813727 3845183 3878366 3913136 3948821 3984678 4020272 4055272
$$ packed form
57263A672388R421J1838J3767J4534J4615J5073J6117J7077J7664J8347J9438
57252A840279K0720K1875K2655K2624K1709K0825K1074K2317K3512K4385K5671
57241B087646K7459K8566K8141K6963K6423K6863K7594K8016K8025K7669K6991
57230B390356K6163K5398K4796K4380K4161K4091K4157K4473K5033K5548K5815
57219B664371K6134K6919K8093K9345L0690L2171L3267L3394L2912L2809L3400
57208C003505L4104L4504L4758L4922L4779L4479L4517L4887L5029L4764L4384
57197C384632L3748L2271L0100K8324K7578K7395K7303K7512K8016K8056K7260
57186C702195K6520K6890K8259K9863L1456L3183L4770L5685L5857L5594L5000
$$ plain form
57175 4055272 4089377 4122602 4155299 4187678 4219506 4250331 4279759 4307464 4333247 4357200 4379666
57164 4379666 4401027 4421636 4441884 4462188 4482955 4504523 4526928 4549754 4572684 4596316 4621945
57153 4621945 4650385 4681543 4715246 4751665 4790574 4831019 4872413 4915251 4960109 5006529 5053539
57142 5053539 5100571 5147143 5192315 5235364 5276450 5315806 5352909 5387384 5420019 5451776 5482300
57131 5482300 5510492 5536103 5559756 5581992 5603591 5626426 5652708 5683575 5719366 5760754 5808370
57120 5808370 5861806 5920350 5984415 6055115 6133011 6218782 6314778 6424553 6551283 6698063 6869225
57109 6869225 7069842 7304549 7578692 7900497 8280949 8732758 9271907 9920331 10705963
57100 10705963 11661498 12825217 14241774 15959181 18024945 20485952 23389195 26779230
$$ packed form
57175D055272L4105L3225L2697L2379L1828L0825K9428K7705K5783K3953K2466
57164D379666K1361K0609K0248K0304K0767K1568K2405K2826K2930K3632K5629
57153D621945K8440L1158L3703L6419L8909M0445M1394M2838M4858M6420M7010
57142E053539M7032M6572M5172M3049M1086L9356L7103L4475L2635L1757L0524
57131E482300K8192K5611K3653K2236K1599K2835K6282L0867L5791M1388M7616
57120E808370N3436N8544O4065P0700P7896Q5771R5996J09775J26730J46780J71162
57109F869225K00617K34707K74143L21805L80452M51809N39149O48424P85632
57100A0705963R55535J163719J416557J717407K065764K461007K903243L390035
$$ plain form
57092 26779230 30696857 35182807 40277682 46010607 52386364 59377593 66900943 74762950
57084 74762950 82625074 90068549 96755129 102557260 107534538 111779035 115271148 117850980
57076 117850980 119289151 119380686 118013059 115197602 111063255 105819638 99712269 92990778
57068 92990778 85890436 78619388 71354045 64246011 57430276 51022297 45107871 39738450
57060 39738450 34934191 30688233 26971195 23739563 20945292 18540098 16475178 14702522
57052 14702522 13178394 11864563 10727085 9736504 8869267 8106772 7432748 6832947 6296651
57043 6296651 5816121 5384080 4993140 4637510 4313455 4017872 3747781 3501204 3276917
57034 3276917 3073002 2886843 2716581 2561338 2419883 2290365 2171529 2062999 1964155 1873832
$$ packed form
57092B6779230L917627M485950N094875N732925O375757O991229P523350P862007
57084G4762950P862124P443475O686580N802131M977278M244497L492113K579832
57076A17850980J438171R1535j367627k815457m134347n243617o107369o721491
57068I2990778p100342p271048p265343p108034o815735o407979n914426n369421
57060C9738450m804259m245958l717038l231632k794271k405194k064920j772656
57052A4702522j524128j313831j137478r90581q67237p62495o74024n99801n36296
57043F296651m80530m32041l90940l55630l24055k95583k70091k46577k24287
57034C276917k03915j86159j70262j55243j41455j29518j18836j08530r8844r0323
$$ plain form
57024 1873832 1791324 1716530 1648870 1587042 1530178 1478221 1430878 1387125 1346197 1308220 1273433
57013 1273433 1241522 1212157 1185624 1162386 1142434 1125365 1110802 1098622 1089216 1083699 1083494 1089658
57001 1089658 1103059 1125245 1158515 1204996 1266379 1344918 1444056 1567550 1718681 1901224 2119890
56990 2119890 2375423 2654095 2920198 3122656 3216528 3185369 3047289 2841424 2607655 2374064
56980 2374064 2155321 1956335 1776431 1613212 1465402 1333219 1216908 1115881 1029208 956001
56970 956001 895060 844834 803967 771363 745601 724884 707875 694249 684274 678171 676041 678171
56958 678171 685192 697829 716083 738091 759651 775206 779798 770856 749113 718239 683031 647164
56946 647164 612522 580407 552446 529747 511917 497900 487516 481436 479953 482749 489789 501662
$$ packed form
57024A873832q2508p4794o7660o1828n6864n1957m7343m3753m0928l7977l4787
57013A273433l1911k9365k6533k3238j9952j7069j4563j2180r406n517k05O164
57001A089658J3401K2186L3270M6481O1383P8539R9138J23494J51131J82543K18666
56990B119890K55533K78672K66103K02458R3872l1159j38080k05865k33769k33591
56980B374064k18743j98986j79904j63219j47810j32183j16311j01027q6673p3207
56970I56001o0941n0226m0867l2604k5762k0717j7009j3626r975o103k130K130
56958F78171P021J2637J8254K2008K1560J5555M592q942k1743l0874l5208l5867
56946F47164l4642l2115k7961k2699j7830j4017j0384o080j483K796P040J1873
$$ plain form
56934 501662 518952 541890 570560 604699 643007 682823 720126 749490 764869 762098 741394 707097
56922 707097 664969 619961 575737 534629 497408 463871 434137 408879 388208 371150 356589
56911 356589 344072 333387 324047 315707 308566 302883 298502 295166 292888 291656 291207 291365 292218 293706
56897 293706 295593 298155 302351 308781 316867 325600 334837 345467 358566 374791 394282 416659 441132
56884 441132 466686 491761 513468 527785 531553 524618 509838 491063 471307 452348 435237 420725
56872 420725 409422 401765 397908 397775 401390 409071 421144 437588 458237 483317 513600 550065 593437
56859 593437 643580 698478 753305 800753 833110 845010 835284 807101 766640 721027 676310 636220
56847 636220 602327 575235 555564 543779 539469 541544 549462 563941 586252 617240 657412 707630
$$ packed form
56934E01662J7290K2938K8670L4139L8308L9816L7303K9364J5379k771k0704l4297
56922G07097m2128m5008m4224m1108l7221l3537k9734k5258k0671j7058j4561
56911C56589j2517j0685r340q340p141n683m381l336k278j232m49J58Q53J488
56897B93706J887K562M196O430Q086Q733R237J0630J3099J6225J9491K2377K4473
56884D41132K5554K5075K1707J4317L768o935j4780j8775j9756j8959j7111j4512
56872D20725j1303p657l857j33L615P681J2073J6444K0649K5080L0283L6465M3372
56859E93437N0143N4898N4827M7448L2357J1900r726k8183m0461m5613m4717m0090
56847F36220l3893k7092j9671j1785m310K075P918J4479K2311L0988M0172N0218
$$ plain form
56835 707630 769049 842310 926800 1019711 1114358 1199216 1260205 1285999 1272680 1224544 1151456
56824 1151456 1065161 976196 891937 816334 751111 697061 654231 621680 598005 582400 574985
56813 574985 576202 586283 605387 633892 672312 721011 779740 846575 916371 980138 1026816 1047187
56801 1047187 1037598 1000984 944765 877507 806585 737511 674025 618120 570219 529913 496947
56790 496947 471511 453574 442215 436062 434588 438711 449766 467996 492444 522105 556297 593283
56778 593283 628815 656674 670994 668502 649491 617501 577884 535680 494106 454700 418446 386299
56766 386299 358763 335669 316585 301133 288737 278433 269256 260756 253097 246726 241922 238429 235479
56753 235479 232328 228856 225509 222684 220337 218156 215911 213517 210898 207949 204701 201553 199113 197510
$$ packed form
56835G07630O1419P3261Q4490R2911R4647Q4858O0989K5794j3319m8136p3088
56824A151456q6295q8965q4259p5603o5223n4050m2830l2551k3675j5605p415
56813E74985J217J0081J9104K8505L8420M8699N8729O6835O9796O3767M6678K0371
56801A047187r589l6614n6219o7258p0922o9074o3486n5905m7901m0306l2966
56790D96947k5436j7937j1359o153j474M123J1055J8230K4448K9661L4192L6986
56778E93283L5532K7859J4320k492j9011l1990l9617m2204m1574l9406l6254l2147
56766C86299k7536k3094j9084j5452j2396j0304r177q500p659o371m804l493k950
56753B35479l151l472l347k825k347k181k245k394k619k949l248l148k440j603
$$ plain form
56739 197510 196047 194021 191899 190942 191372 191688 190415 187895 185561 184038 182955 182204 182085 182268 181841 180678
56723 180678 179649 179139 178392 176878 175372 174938 175554 176444 177165 177586 177364 176287 174932 174153 173982 173669 172789
56706 172789 171816 171519 172143 173200 173854 173657 173118 173345 174902 177230 179420 181167 182642 183871 184837 185979
56690 185979 187876 190429 192843 194532 195587 196257 196373 195550 193819 191857 190532 190150 190091 189355 187591 185459
56674 185459 183888 183180 182961 182691 181955 180507 178492 176532 175267 174743 174424 173728 172412 170611 168804 167642
56658 167642 167506 168083 168526 168116 166824 165371 164708 165173 166105 166471 165974 165280 165133 165636 166511 167547 168443 168684
56640 168684 168086 167207 166684 166394 165714 164438 162909 161367 159737 158099 156778 155896 155271 154942 155347 156718
56624 156718 158577 160089 160773 160727 160339 159984 159914 160235 160891 161699 162423 162918 163257 163664 164222 164714 164861 164704 164606
$$ packed form
56739A97510j463k026k122r57M30L16j273k520k334j523j083p51j19J83m27j163
56723A80678j029n10p47j514j506m34O16Q90P21M21k22j077j355p79j71l13q80
56706A72789r73k97O24J057O54j97n39K27J557K328K190J747J475J229R66J142
56690A85979J897K553K414J689J055O70J16q23j731j962j325l82n9p36j764k132
56674A85459j571p08k19k70p36j448k015j960j265n24l19o96j316j801j807j162
56658A67642j36N77M43m10j292j453o63M65R32L66m97o94j47N03Q75J036Q96K41
56640A68684n98q79n23k90o80j276j529j542j630j638j321q82o25l29M05J371
56624A56718J859J512O84m6l88l55p0L21O56Q08P24M95L39M07N58M92J47j57r8
$$ plain form
56605 164606 164884 165448 165863 165764 165240 164743 164560 164559 164618 165086 166381 168228 169801 170751 171618 173028 174941 176940
56587 176940 178826 180507 181664 182035 181865 181716 181960 182738 184177 186255 188592 190753 192740 194836 197103
56572 197103 199298 201235 202964 204655 206475 208535 210835 213436 216676 220845 225493 229581 232663 235468
56558 235468 238880 242811 246633 250219 253807 257113 259509 261039 262516 264441 266488 268166 269362 270084
56544 270084 270193 269622 268395 266284 262921 258486 253879 249975 246968 244508 242075 239103 235233 230720 226343
56529 226343 222738 220011 218002 216516 215229 213844 212468 211376 210265 208328 205341 202172 199723 197854
56515 197854 195884 193800 192244 191393 190551 189082 187275 185999 185675 185859 185742 184939 183762 182856 182611 182894
56499 182894 183329 183801 184674 186431 189014 191603 193281 193968 194477 195541 197075 198549 199785 200947 202019
$$ packed form
56605A64606K78N64M15r9n24m97j83jN9M68J295J847J573R50Q67J410J913J999
56587A76940J886J681J157L71j70j49K44P78J439K078K337K161J987K096K267
56572A97103K195J937J729J691J820K060K300K601L240M169M648M088L082K805
56558B35468L412L931L822L586L588L306K396J530J477J925K047J678J196P22
56544B70084J09n71j227k111l363m435m607l904l007k460k433k972l870m513m377
56529B26343l605k727k009j486j287j385j376j092j111j937k987l169k449j869
56515A97854j970k084j556q51q42j469j807j276l24J84j17q03j177r06k45K83
56499A82894M35M72Q73J757K583K589J678O87N09J064J534J474J236J162J072
$$ plain form
56484 202019 202839 203644 205038 207238 209704 211741 213190 214339 215437 216496 217434 218231 218988 219877 220924 221822
56468 221822 222162 221897 221434 221264 221627 222491 223633 224783 225938 227495 229677 231961 233514 234309 235282 237067
56452 237067 239017 239931 239513 238683 238578 239627 241543 243777 245834 247380 248289 248663 248844 249353 250561 252210
56436 252210 253385 253272 251974 250339 248925 247419 245265 242571 239970 237653 235058 231807 228547 226372
56422 226372 225534 225214 224576 223600 222753 222330 222402 223023 224050 224967 225264 224949 224453 224210 224541 225674 227500 229440
56404 229440 230937 232005 232981 233849 234219 233940 233354 232854 232530 232364 232590 233647 235764 238566 241153 242829
56388 242829 243788 244748 245914 246832 247498 248854 251573 254852 257239 258394 259206 260326 261518 262482 263403 264386
56372 264386 265107 265444 265888 266947 268561 270374 272203 273913 275296 276400 277644 279304 281114 282653 283901
$$ packed form
56484B02019Q20Q05J394K200K466K037J449J149J098J059R38P97P57Q89J047Q98
56468B21822L40k65m63j70L63Q64J142J150J155J557K182K284J553P95R73J785
56452B37067J950R14m18q30j05J049J916K234K057J546R09L74J81N09J208J649
56436B52210J175j13j298j635j414j506k154k694k601k317k595l251l260k175
56422B26372q38l20o38r76q47m23P2O21J027R17K97l15m96k43L31J133J826J940
56404B29440J497J068R76Q68L70k79n86n00l24j66K26J057K117K802K587J676
56388B42829R59R60J166R18O66J356K719L279K387J155Q12J120J192R64R21R83
56372B64386P21L37M44J059J614J813J829J710J383J104J244J660J810J539J248
$$ plain form
56357 283901 285174 286728 288581 290553 292397 294151 296368 299653 303937 308597 313355 318576 324528 330825
56343 330825 336894 342585 348031 353339 358755 364711 371303 377945 383953 389244 394124 398607 402390 405496
56329 405496 408506 411996 415907 419607 422590 424970 427160 429033 429738 428575 425817 422328 418621 414807
56315 414807 411277 408741 407475 407056 406944 406875 406664 406278 406250 407347 409529 411837 413666 415598 418592 422861
56299 422861 428003 433704 439729 445585 450819 455558 460384 465863 472481 480653 490300 500716 511376 522721
56285 522721 535679 550505 566533 583006 599788 617305 636222 657161 680419 705910 733588
56274 733588 763926 797719 835411 876891 922109 971804 1027458 1090409 1161010 1238806 1323591
56263 1323591 1415981 1516721 1625722 1742232 1865688 1995766 2131594 2271552 2413914 2556977
$$ packed form
56357B83901J273J554J853J972J844J754K217L285M284M660M758N221N952O297
56343C30825O069N691N446N308N416N956O592O642O008N291M880M483L783L106
56329D05496L010L490L911L700K983K380K190J873P05j163k758l489l707l814
56315D14807l530k536j266m19j12o9k11l86k8J097K182K308J829J932K994M269
56299D22861N142N701O025N856N234M739M826N479O618Q172R647J0416J0660J1345
56285E22721J2958J4826J6028J6473J6782J7517J8917K0939K3258K5491K7678
56274G33588L0338L3793L7692M1480M5218M9695N5654O2951P0601P7796Q4785
56263A323591R2390J00740J09001J16510J23456J30078J35828J39958J42362J43063
$$ plain form
56253 2556977 2698325 2834612 2962458 3079206 3182689 3270993 3342912 3398184 3436921 3459363
56243 3459363 3466654 3461259 3445871 3422165 3391046 3353713 3311729 3266156 3217142 3164332 3107251 3045308
56231 3045308 2977867 2904383 2824449 2737949 2645353 2547686 2445981 2341026 2233748 2125475
56221 2125475 2017565 1911139 1807388 1707633 1612702 1522654 1437561 1358192 1285412 1219186 1158660
56210 1158660 1103040 1052023 1005571 963743 926632 894141 865885 841464 820543 802538 786670
56199 786670 772603 760639 750986 743342 737577 734199 733482 734535 735979 737326 739061 741572 744647 747938
56185 747938 751244 754302 756785 758609 759865 760470 760179 758970 757076 754676 751736 748186 744165 740164 736925
56170 736925 734879 733668 732630 731888 732454 735056 739290 744230 749430 755063 761589 769607 779563 791251
$$ packed form
56253B556977J41348J36287J27846J16748J03483Q8304P1919N5272L8737K2442
56243C459363P291n395j5388k3706l1119l7333m1984m5573m9014n2810n7081o1943
56231C045308o7441p3484p9934q6500r2596r7667j01705j04955j07278j08273
56221B125475j07910j06426j03751r9755r4931r0048q5093p9369p2780o6226o0526
56210A158660n5620n1017m6452m1828l7111l2491k8256k4421k0921j8005j5868
56199G86670j4067j1964r653p644n765l378p17J053J444J347J735K511L075L291
56185G47938L306L058K483J824J256O05k91j209j894k400k940l550m021m001l239
56170G36925k046j211j038p42N66K602M234M940N200N633O526Q018R956J1688
$$ plain form
56156 791251 804059 817950 833647 851512 870976 891641 914348 940578 971294 1006957 1048162
56145 1048162 1095618 1150001 1212496 1285209 1370537 1470427 1586514 1720249 1872157 2041220
56135 2041220 2225101 2420037 2619831 2815908 2999573 3164451 3307115 3427133 3527701
56126 3527701 3615016 3694834 3768979 3835161 3889104 3926128 3942403 3937174 3914071 3878873 3835651
56115 3835651 3785277 3726256 3654977 3565614 3452260 3312535 3148861 2966769 2773339 2576964
56105 2576964 2386325 2208105 2045855 1901006 1773967 1664130 1569944 1489643 1421530 1363700
56095 1363700 1314394 1272729 1238333 1210242 1186926 1167338 1151070 1137562 1126086 1116500 1109065 1103532
56083 1103532 1099331 1096559 1095765 1096661 1098156 1099784 1102178 1105941 1110953 1116897 1123628 1130884 1138430 1146544
$$ packed form
56156G91251J2808J3891J5697J7865J9464K0665K2707K6230L0716L5663M1205
56145A048162M7456N4383O2495P2713Q5328R9890J16087J33735J51908J69063
56135B041220J83881J94936J99794J96077J83665J64878J42664J20018J00568
56126C527701Q7315P9818P4145O6182N3943L7024J6275n229k3103l5198m3222
56115C835651n0374n9021p1279q9363j13354j39725j63674j82092j93430j96375
56105B576964j90639j78220j62250j44849j27039j09837r4186q0301o8113n7830
56095A363700m9306m1665l4396k8091k3316j9588j6268j3508j1476r586p435n533
56083A103532m201k772p94Q96J495J628K394L763N012N944O731P256P546Q114
$$ plain form
56069 1146544 1155598 1165283 1175049 1185221 1196686 1209567 1223154 1237031 1251312 1265847 1280262 1294726
56057 1294726 1309743 1325302 1341234 1358195 1377122 1397814 1419216 1441031 1463910 1488174 1513527
56046 1513527 1539941 1567572 1595885 1624134 1652654 1682448 1713550 1745020 1776427 1808086 1839999
56035 1839999 1871894 1904191 1937577 1971929 2006975 2043622 2083046 2124886 2168029 2212738 2260043
56024 2260043 2309451 2359391 2409695 2461362 2514112 2566686 2619629 2675161 2733982 2794822 2857573
56013 2857573 2924216 2995904 3071710 3151137 3235374 3324992 3418671 3515411 3616039 3721575 3832060
56002 3832060 3947764 4069563 4197389 4330315 4468796 4614648 4768275 4928340 5094758
55993 5094758 5269530 5453879 5647244 5849926 6064202 6292109 6534735 6794320 7074120
$$ packed form
56069A146544R054R685R766J0172J1465J2881J3587J3877J4281J4535J4415J4464
56057A294726J5017J5559J5932J6961J8927K0692K1402K1815K2879K4264K5353
56046A513527K6414K7631K8313K8249K8520K9794L1102L1470L1407L1659L1913
56035A839999L1895L2297L3386L4352L5046L6647L9424M1840M3143M4709M7305
56024B260043M9408M9940N0304N1667N2750N2574N2943N5532N8821O0840O2751
56013B857573O6643P1688P5806P9427Q4237Q9618R3679R6740J00628J05536J10485
56002C832060J15704J21799J27826J32926J38481J45852J53627J60065J66418
55993E094758J74772J84349J93365K02682K14276K27907K42626K59585K79800
$$ plain form
55984 7074120 7375474 7698015 8043491 8416314 8819807 9255480 9726744 10239693 10799513
55975 10799513 11410122 12078300 12814193 13627335 14527112 15528271 16651302 17917079 19347605
55966 19347605 20974506 22842572 25005765 27527857 30488954 33984812 38119475 43006607
55958 43006607 48776034 55564978 63501246 72713836 83375909 95743075 110169527 127119368
55950 127119368 147162749 170919248 198965296 231733304 269260786 310548830 352671080
55943 352671080 390434063 417443279 428426762 421452820 398571158 364597665 325059263
55936 325059263 284563357 246143929 211374790 180801345 154381588 131805830 112671694
55929 112671694 96555949 83043147 71742274 62295084 54380950 47724625 42100876
$$ packed form
55984G074120L01354L22541L45476L72823M03493M35673M71264N12949N59820
55975A0799513O10609O68178P35893Q13142Q99777J001159J123031J265777J430526
55966A9347605J626901J868066K163193K522092K961097L495858M134663M887132
55958D3006607N769427O788944P936268R212590J0662073J2367166J4426452J6949841
55950A27119368K0043381K3756499K8046048L2768008L7527482M1288044M2122250
55943C52671080L7762983K7009216J0983483o973942k2881662l3973493l9538402
55936C25059263m0495906l8419428l4769139l0573445k6419757k2575758j9134136
55929A12671694j6115745j3512802j1300873r447190p914134o656325n623749
$$ plain form
55922 42100876 37328152 33257937 29769504 26766788 24171173 21915114 19942554 18210277
55914 18210277 16683519 15330911 14125381 13046626 12078781 11206855 10417571 9701426 9051075
55905 9051075 8458970 7918449 7425304 6976085 6566249 6191480 5849022 5536052 5248457
55896 5248457 4982879 4738101 4512831 4303906 4108334 3925374 3754885 3595298 3444964
55887 3444964 3303956 3172638 3049695 2933224 2822745 2718639 2620658 2528226 2441209 2359270
55877 2359270 2281523 2207781 2138921 2075148 2015244 1958369 1904975 1854825 1805760 1755846 1705374
55866 1705374 1655612 1607133 1560828 1519010 1483622 1454289 1429638 1409522 1394456 1383785 1376004
55855 1376004 1370148 1365525 1360869 1355210 1349010 1343179 1337510 1331165 1323917 1315515 1304202 1287089 1261819
$$ packed form
55922D2100876m772724m070215l488433l002716k595615k256059j972560j732277
55914A8210277j526758j352608j205530j078755r67845q71926p89284p16145o50351
55905I051075n92105n40521m93145m49219m09836l74769l42458l12970k87595
55896E248457k65578k44778k25270k08925j95572j82960j70489j59587j50334
55887C444964j41008j31318j22943j16471j10479j04106r7981r2432q7017q1939
55877B359270p7747p3742o8860o3773n9904n6875n3394n0150m9065m9914n0472
55866A705374m9762m8479m6305m1818l5388k9333k4651k0116j5066j0671p781
55855A376004n856m623m656n659o200n831n669o345p248q402j1313j7113k5270
$$ plain form
55842 1261819 1227403 1184364 1135179 1083962 1034521 988862 947840 912108 881424 854146 828774
55831 828774 805469 785072 767509 752360 740208 731921 727049 724211 722654 722219 722166 721315 719126 715589
55817 715589 710380 703282 695152 687251 679681 671554 662500 652924 642865 631797 619709 607462 595835
55804 595835 584958 574828 565724 557875 551191 545334 539698 533506 526390 518665 510562 501551 491071
55791 491071 479619 468358 457811 447708 437997 429283 422148 416622 412475 409700 408566 409252 411149
55778 411149 412388 410572 404403 394393 381850 367799 353163 339078 326177 314110 302425 291478
55766 291478 281796 273243 265686 259859 256397 254408 252265 249732 248152 248428 249881 251400 252835 254794
55752 254794 257618 260880 263582 264710 263794 260914 255999 248645 239128 229105 220400 213266 206624 199874
$$ packed form
55842A261819l4416m3039m9185n1217m9441m5659m1022l5732l0684k7278k5372
55831H28774k3305k0397j7563j5149j2152q287m872k838j557m35n3q51k189l537
55817G15589n209p098q130p901p570q127r054r576j0059j1068j2088j2247j1627
55804E95835j0877j0130r104p849o684n857n636o192p116p725q103r011j0480
55791D91071j1452j1261j0547j0103r711q714p135n526m147k775j134O86J897
55778D11149J239j816o169j0010j2543j4051j4636j4085j2901j2067j1685j0947
55766B91478r682q553p557n827l462j989k143k533j580K76J453J519J435J959
55752B54794K824L262K702J128r16k880m915p354r517j0023q705p134o642o750
$$ plain form
55738 199874 193534 188142 183547 179549 176439 174435 173163 172070 171006 170148 169657 169529 169483 168979 167691 165970
55722 165970 164462 163352 162368 161386 160525 159738 158977 158760 159977 162951 167187 172109 177578 183576 189913 196437
55706 196437 203099 209696 215883 221467 226266 229644 230718 229165 225415 220068 213641 207009 201371 197395
55692 197395 194745 192733 191079 189790 188715 187627 186550 185685 185189 185194 185896 187422 189691 192469 195457 198340
55676 198340 200947 203400 205898 208333 210277 211338 211376 210479 209022 207634 206771 206324 205907 205423 204944 204214
55660 204214 202800 200750 198509 196065 192804 188484 183764 179382 175213 170600 165314 159742 154335 149311
55646 149311 144757 140589 136406 131757 126659 121636 117232 113632 110765 108494 106557 104506 101936 98858
55632 98858 95694 92869 90448 88256 86234 84490 82992 81458 79688 77855 76317 75238 74521 73967 73352
$$ packed form
55738A99874o340n392m595l998l110k004j272j093j064q58m91j28m6n04j288j721
55722A65970j508j110r84r82q61p87p61k17J217K974M236M922N469N998O337O524
55706A96437O662O597O187N584M799L378J074j553l750n347o427o632n638l976
55692A97395k650k012j654j289j075j088j077q65m96NP02J526K269K778K988K883
55676A98340K607K453K498K435J944J061L8q97j457j388q63m47m17m84m79p30
55660B04214j414k050k241k444l261m320m720m382m169m613n286n572n407n024
55646A49311m554m168m183m649n098n023m404l600k867k271j937k051k570l078
55632I8858l164k825k421k192k022j744j498j534j770j833j538j079p17n54o15
$$ plain form
55617 73352 72451 71217 69886 68788 68060 67626 67277 66688 65578 64083 62830 62367 62617 63060 63340 63480 63655
55600 63655 63990 64469 64827 64656 63882 62994 62510 62348 61987 61113 59802 58229 56642 55538 55412 56247 57514
55583 57514 58670 59421 59601 59230 58708 58528 58722 58898 58867 58856 59040 59203 59043 58534 57863 57265 57045 57505 58644
55564 58644 60096 61462 62605 63568 64425 65292 66280 67383 68485 69570 70791 72258 73865 75312 76300 76815
55548 76815 77299 78355 80080 81856 83009 83558 84092 85085 86619 88569 90685 92593 94144 95629 97270
55533 97270 98592 98813 97835 96319 94747 92882 90316 87076 83480 79792 76256 73102 70275 67431 64442
55518 64442 61652 59429 57650 55863 53786 51515 49338 47452 45715 43702 41184 38536 36436 35133
55504 35133 34310 33598 32899 32131 31089 29709 28150 26548 25017 23972 23941 24754 25335 24742 23229 21981 21905
$$ packed form
55617G3352r01j234j331j098p28m34l49n89j110j495j253m63K50M43K80J40J75
55600F3655L35M79L58j71p74q88m84j62l61q74j311j573j587j104j26Q35J267
55583E7514J156P51J80l71n22j80J94J76l1j1J84J63j60n09o71n98k20M60J139
55564E8644J452J366J143R63Q57Q67R88J103J102J085J221J467J607J447R88N15
55548G6815M84J056J725J776J153N49N34R93J534J950K116J908J551J485J641
55533I7270J322K21r78j516j572j865k566l240l596l688l536l154k827k844k989
55518F4442k790k223j779j787k077k271k177j886j737k013k518k648k100j303
55504C5133q23p12o99p68j042j380j559j602j531j045l1Q13N81n93j513j248p6
$$ plain form
55487 21905 22936 24350 25474 26102 26408 26551 26411 25833 25043 24509 24308 23968 23113 21995 21157 20719 20294 19570
55469 19570 18759 18409 18832 19686 20241 20085 19512 19109 19073 19143 19023 18659 18203 18008 18450 19411 20109 19891 19009 18144
55449 18144 17362 16289 15191 14919 15606 16311 16379 16286 16577 16771 16178 15263 15231 16470 18207 19644 20664 21408
55431 21408 21870 22161 22608 23308 23904 24066 23959 24046 24508 25073 25364 25293 25039 24688 24115 23379 22959 23198 23668 23653
55411 23653 23233 23273 24143 25180 25788 26339 27377 28535 29067 29057 29225 29707 29934 29743 29770 30480 31399 31596 30499
55392 30499 28139 25043 22107 20187 19496 19566 19896 20368 21090 22132 23451 24721 25308 24874 24066 24071 25257
55375 25257 26690 27236 26713 25702 24632 23488 22219 21027 20253 20191 20877 21878 22473 22271 21534 20694 19706
55358 19706 18198 16170 14245 13136 13024 13518 14069 14351 14316 14059 13712 13444 13427 13645 13847 13841 13756 13783 13693 12973
$$ packed form
55487B1905J031J414J124O28L06J43j40n78p90n34k01l40q55j118q38m38m25p24
55469A9570q11l50M23Q54N55j56n73m03l6P0j20l64m56j95M42R61O98k18q82q65
55449A8144p82j073j098k72O87P05O8r3K91J94n93r15l2J239J737J437J020P44
55431B1408M62K91M47P00N96J62j07Q7M62N65K91p1k54l51n73p36m20K39M70j5
55411B3653m20M0Q70J037O08N51J038J158N32j0J68M82K27j91K7P10R19J97j097
55392C0499k360l096k936j920o91P0L30M72P22J042J319J270N87m34q08NJ186
55375B5257J433N46n23j011j070j144j269j192p74o2O86J001N95k02p37q40r88
55358A9706j508k028j925j109j12M94N51K82l5k57l47k68j7K18K02oq5K7r0p20
$$ plain form
55338 12973 11591 10335 10101 11034 12546 14045 15272 16069 16259 15946 15598 15533 15502 15051 14277 13862 14288 15275
55320 15275 16118 16426 16288 15973 15727 15779 16132 16394 16230 16020 16668 18480 20624 22010 22423 22403 22290 21936 21278
55301 21278 20619 20217 19985 19809 19811 20046 20261 20203 20029 20101 20420 20543 20118 19270 18385 17639 16950 16357 16167 16564
55281 16564 17211 17560 17566 17803 18743 20171 21476 22252 22427 22097 21566 21318 21539 21806 21648 21253 21115 21058 20273
55262 20273 18551 16861 16347 17105 18319 19241 19644 19596 19359 19418 20130 21248 22155 22604 22886 23221 23421 23362 23463
55243 23463 24328 25965 27707 28873 29334 29396 29397 29524 29836 30272 30650 30812 30781 30679 30506 30112 29407 28504 27581
55224 27581 26727 25995 25537 25547 26045 26743 27160 26973 26325 25776 25805 26375 27077 27675 28261 28879 29268 29180 28735 28284
55204 28284 28031 27996 28238 28860 29769 30644 31133 31119 30871 30986 31912 33370 34441 34467 33742 33002 32424 31469 29699
$$ packed form
55338A2973j382j256k34R33J512J499J227P97J90l13l48o5l1m51p74m15M26R87
55320A5275Q43L08j38l15k46N2L53K62j64k10O48J812K144J386M13k0j13l54o58
55301B1278o59m02k32j76KK35K15n8j74P2L19J23m25q48q85p46o89n93j90L97
55281A6564O47L49OK37R40J428J305P76J75l30n31k48K21K67j58l95j38n7p85
55262B0273j722j690n14P58J214R22M03m8k37N9P12J118R07M49K82L35K00n9J01
55243B3463Q65J637J742J166M61O2JJ27L12M36L78J62l1j02j73l94p05r03r23
55224B7581q54p32m58J0M98O98M17j87o48n49K9N70P02N98N86O18L89q8m45m51
55204B8284k53l5K42O22R09Q75M89j4k48J15R26J458J071K6p25p40n78r55j770
$$ plain form
55185 29699 27438 25533 24650 24776 25247 25373 25215 25561 26899 28620 29673 29828 29754 29893 29882 29226 27958 26395
55167 26395 24783 23532 23351 24652 26921 29078 30364 30759 30796 31169 32298 33984 35603 36777 37655 38461
55151 38461 39193 40067 41717 44521 47966 51250 54252 57463 61100 64876 68647 72780 77824 84225 92272
55136 92272 101779 111756 120940 128849 135801 141727 145546 146113 143440 138549 132459 125791 119077 112781 106894
55121 106894 100941 94614 88245 82577 78143 74900 72372 70121 68119 66589 65517 64532 63397 62279
55107 62279 61293 60057 58204 56186 54993 54999 55595 56211 57145 58988 61573 64045 65786 66788 67214 67162 67045
55090 67045 67658 69572 72621 76107 79319 81740 83170 83941 84763 85996 87271 88151 88953 90404 92517 94414
55074 94414 95428 95920 96707 98071 99764 101705 104089 106789 109190 110894 112239 113800 115603 117216 118547
$$ packed form
55185B9699k261j905q83J26M71J26j58L46J338J721J053J55p4J39j1o56j268j563
55167B6395j612j251j81J301K269K157J286L95L7L73J129J686J619J174Q78Q06
55151C8461P32Q74J650K804L445L284L002L211L637L776L771M133N044O401Q047
55136I2272R507R977R184P909O952N926L819N67k673m891o090o668o714o296n887
55121A06894n953o327o369n668m434l243k528k251k002j530j072r85j135j118
55107F2279r86j236j853k018j193ON96O16R34J843K585K472J741J002M26n2j17
55090F7045O13J914L049L486L212K421J430P71Q22J233J275Q80Q02J451K113J897
55074I4414J014M92P87J364J693J941K384K700K401J704J345J561J803J613J331
$$ plain form
55059 118547 120086 122206 124604 126788 128881 131501 134897 138725 142729 147138 152021 156630 159911 161527
55045 161527 161979 161820 161225 160221 158745 156397 152761 148272 144260 141665 140072 138456 136516 134676 133006
55030 133006 130891 127926 124492 121164 117991 114688 111174 107572 103897 100183 96794 94219 92508 91230
55016 91230 89998 88745 87445 85916 84148 82576 81692 81443 81214 80437 79040 77379 75925 75000 74586 74346
55000 74346 74014 73768 73959 74433 74561 74136 73886 74625 76177 77626 78489 79089 79830 80713 81753 83261 85376
54983 85376 87805 90372 93433 97248 101364 105249 109377 114919 122297 130673 139100 147698 157325 168458
54969 168458 180807 193874 207485 221689 236391 251231 265827 280036 293791 306554 317058
54958 317058 323882 326355 324818 320028 312428 301950 288326 271689 253120 234470 217196 201319
$$ packed form
55059A18547J539K120K398K184K093K620L396L828M004M409M883M609L281J616
55045A61527M52j59n95j004j476k348l636m489m012k595j593j616j940j840j670
55030A33006k115k965l434l328l173l303l514l602l675l714l389k575j711j278
55016I1230j232j253j300j529j768j572q84k49k29p77j397j661j454r25m14k40
55000G4346l32k46J91M74J28m25k50P39J552J449Q63O00P41Q83J040J508K115
54983H5376K429K567L061L815M116L885M128N542P378Q376Q427Q598R627J1133
54969A68458J2349J3067J3611J4204J4702J4840J4596J4209J3755J2763J0504
54958C17058O824K473j537m790p600j0478j3624j6637j8569j8650j7274j5877
$$ plain form
54946 201319 185899 170651 156574 144745 135038 126514 118741 112119 107025 103227 100243 97840 96029
54933 96029 94889 94537 95036 96230 97886 100049 103052 107132 112251 118375 125677 134330 144237 155085 166558
54918 166558 178409 190470 202598 214405 224973 233001 237314 237211 232499 223623 211832 198776 185578
54905 185578 172414 159110 145923 133535 122497 112941 104675 97359 90791 85218 81191 78875 77678
54892 77678 76770 75720 74416 72668 70398 68036 66216 65093 64318 63636 63077 62636 62268 62157 62477 62800 62306
54875 62306 60815 59095 57950 57412 57042 56526 55707 54523 53322 52772 52993 53181 52618 51664 51173 51227 51240 51117
54857 51117 51490 52618 53787 54116 53484 52358 51136 50016 49227 48952 49097 49381 49634 49860 50059 50072 49629 48659
54839 48659 47570 47112 47673 48842 49957 51031 52760 55527 58833 61813 64021 65505 66469 67131 67715 68314
$$ packed form
54946B01319j5420j5248j4077j1829r707q524p773o622n094l798k984k403j811
54933I6029j140l52M99J194J656K163L003M080N119O124P302Q653R907J0848J1473
54918A66558J1851J2061J2128J1807J0568Q028M313j03m712q876j1791j3056j3198
54905A85578j3164j3304j3187j2388j1038r556q266p316o568n573m027k316j197
54892G7678r08j050j304j748k270k362j820j123p75o82n59m41l68j11L20L23m94
54875F2306j491j720j145n38l70n16q19j184j201n50K21J88n63r54m91N4J3j23
54857E1117L73J128J169L29o32j126j222j120p89k75J45K84K53K26J99J3m43r70
54839D8659j089m58N61J169J115J074J729K767L306K980K208J484R64O62N84N99
$$ plain form
54823 68314 68924 69755 71274 73738 76925 80621 85130 90915 97778 104827 111428 118013 125785 135618 147277
54808 147277 159731 172227 184970 198567 212832 226368 237383 244735 248059 247337 242756 234944 224986
54795 224986 213985 202642 191205 179747 168517 158068 148987 141464 135242 130005 125651 122116 119254
54782 119254 117064 115758 115369 115485 115720 116284 117742 120328 123861 128218 133377 139002 144628 150496 157735
54767 157735 167224 178567 190654 203052 216270 230596 245236 258866 270592 279895 285936 287654
54755 287654 284780 278348 269843 260097 249245 237468 225258 212945 200486 187891 175572 164070
54743 164070 153616 144144 135596 128128 122045 117476 113904 110129 105229 99667 95031 92413 91382 90754
54729 90754 89908 88974 88160 87525 87191 87241 87443 87504 87453 87370 86941 85887 84650 84013 84003 83909 83476 83319 83830 84360
$$ packed form
54823F8314O10Q31J519K464L187L696M509N785O863P049O601O585P772R833J1659
54808A47277J2454J2496J2743J3597J4265J3536J1015P352L324p22m581p812r958
54795B24986j1001j1343j1437j1458j1230j0449r081p523o222n237m354l535k862
54782A19254k190j306l89J16K35N64J458K586L533M357N159N625N626N868P239
54767A57735R489J1343J2087J2398J3218J4326J4640J3630J1726R303O041J718
54755B87654k874o432q505r746j0852j1777j2210j2313j2459j2595j2319j1502
54743A64070j0454r472q548p468o083m569l572l775m900n562m636k618j031o28
54729I0754q46r34q14o35l34N0K02O1n1q3m29j054j237o37j0r4m33j57N11N30
$$ plain form
54709 84360 84034 82894 81691 80861 80253 79669 79150 78815 78802 79351 80596 82294 83984 85363 86337 86852 86937 86794
54691 86794 86603 86396 86286 86608 87479 88444 88973 89191 89683 90651 91823 93115 94853 97111 99354 101088 102506
54674 102506 104167 106285 108727 111518 114888 118788 122692 126125 129272 132907 137659 143316 148902 153507
54660 153507 157001 159873 162460 164651 166326 167743 169231 170805 172398 174293 176939 180374 184224 188291
54646 188291 192735 197543 202232 206409 210283 214126 217310 218409 216496 211983 205929 198784 190240 180234
54632 180234 169671 159838 151333 143917 137304 131752 127593 124504 121667 118696 116058 114414 113829 113910 114414
54617 114414 115250 115953 115800 114716 113681 113830 115356 117558 119746 121592 122772 122889 122007 120875 120253 120181
54601 120181 120129 119680 118757 117248 114792 111194 106895 102843 99701 97330 95134 92874 90937 89719 88977
$$ packed form
54709H4360l26j140j203q30o08n84n19l35j3N49J245J698J690J379R74N15Q5j43
54691H6794j91k07j10L22Q71R65N29K18M92R68J172J292J738K258K243J734J418
54674A02506J661K118K442K791L370L900L904L433L147L635M752N657N586M605
54660A53507L494K872K587K191J675J417J488J574J593J895K646L435L850M067
54646A88291M444M808M689M177L874L843L184J099j913m513o054p145q544j0006
54632A80234j0563r833q505p416o613n552m159l089k837k971k638j644n85Q1N04
54617A14414Q36P03j53j084j035J49J526K202K188J846J180J17q82j132o22p2
54601A20181n2m49r23j509k456l598m299m052l142k371k196k260j937j218p42
$$ plain form
54586 88977 88010 86362 84155 81796 79637 77879 76551 75573 74989 75042 75741 76413 76158 74798 72981 71351
54570 71351 70101 69438 69727 70723 71312 70736 69730 69650 70645 71505 71372 70790 70750 71399 72203 72933 73899 75304 76906
54551 76906 78398 79880 81743 84139 86659 88649 89912 90959 92404 94253 96004 97372 98619 100246
54537 100246 102648 105998 110061 114093 117395 120035 122587 125050 126560 126424 124868 122453 119302 115434
54523 115434 111421 107954 104964 101828 98389 95191 92649 90597 88764 87199 86000 85004 83978 82923
54509 82923 81993 81375 81272 81782 82654 83401 83759 83788 83532 82917 82184 82081 83275 85628 88214 89986 90387 89550
54491 89550 88144 86963 86496 86766 87485 88227 88594 88469 88116 87795 87323 86328 84932 83770 83215 82963 82625 82368
54473 82368 82593 83191 83511 83027 81844 80570 79841 79845 80184 80327 80230 80314 80728 80985 80510 79318 77887 76671 75963
$$ packed form
54586H8977r67j648k207k359k159j758j328r78n84N3O99O72k55j360j817j630
54570G1351j250o63K89R96N89n76j006q0R95Q60j33n82m0O49Q04P30R66J405J602
54551G6906J492J482J863K396K520J990J263J047J445J849J751J368J247J627
54537A00246K402L350M063M032L302K640K552K463J510j36j556k415l151l868
54523A15434m013l467k990l136l439l198k542k052j833j565j199r96j026j055
54509H2923r30o18j03N10Q72P47L58K9k56o15p33j03J194K353K586J772M01q37
54491H9550j406j181m67K70P19P42L67j25l53l21m72r95j396j162n55k52l38k57
54473H2368K25N98L20m84j183j274p29ML39J43r7Q4M14K57m75j192j431j216p08
$$ plain form
54454 75963 75938 76426 76833 76718 76324 76184 76379 76561 76578 76620 76894 77582 78942 80876 82416 82403 80886 79280 78782
54435 78782 79093 79008 77861 75996 74182 73075 73019 73915 75261 76639 78071 79644 80942 81316 80720 79926 79722
54418 79722 80170 80844 81557 82555 84064 85956 87960 90005 92153 94264 96000 97310 98742 101105 104800
54403 104800 109534 114548 119075 122721 125614 128164 130606 132875 134962 137115 139393 141288 142168 142001 141259
54388 141259 140181 138596 136516 134414 132651 130937 128611 125299 121217 117002 113336 110492 108182 106010
54374 106010 103985 102316 100806 99014 97010 95425 94549 93959 93286 92733 92446 91977 90996 90139 90395 91834
54358 91834 93505 94521 94679 94218 93642 93765 95256 97915 100882 103760 107030 111085 115328 118711 121026
54343 121026 123191 126157 129734 132674 133925 133686 133098 132990 133195 133095 132397 131101 129099 126361 123356 120810
$$ packed form
54454G5963k5M88M07j15l94j40J95J82J7M2K74O88J360J934J540j3j517j606m98
54435G8782L11q5j147j865j814j107n6Q96J346J378J432J573J298L74n96p94k04
54418G9722M48O74P13R98J509J892K004K045K148K111J736J310J432K363L695
54403A04800M734N014M527L646K893K550K442K269K087K153K278J895Q80j67p42
54388A41259j078j585k080k102j763j714k326l312m082m215l666k844k310k172
54374A06010k025j669j510j792k004j585q76n90o73n53k87m69r81q57K56J439
54358I1834J671J016J58m61n76J23J491K659K967K878L270M055M243L383K315
54343A21026K165K966L577K940J251k39n88j08K05j00o98j296k002k738l005k546
$$ plain form
54327 120810 118999 117627 116345 114970 113221 110701 107321 103475 99640 96078 92928 90308 88143 86102
54313 86102 83897 81543 79326 77612 76606 76118 75586 74562 73149 71741 70481 69211 67872 66578 65347
54298 65347 64067 62727 61401 60063 58784 57992 58108 58956 59969 60883 61732 62264 62135 61747 62101 63483 64947
54281 64947 65543 65441 65328 65300 65006 64526 64320 64419 64287 63522 62334 61284 60848 61174 62018 63013 64124 65652
54263 65652 67632 69517 70737 71276 71409 71209 70712 70233 69995 69741 69207 68749 68883 69406 69575 69086 68241 67260
54245 67260 66155 65289 65301 66224 67319 68048 68608 69256 69712 69695 69530 69688 70061 70198 69979 69582 68980 67976 66654
54226 66654 65344 64256 63502 63359 63951 64651 64386 62888 61241 60814 61821 63212 63911 63810 63471 63246 62981
54209 62981 62494 61956 61668 61698 61949 62476 63414 64587 65428 65443 64603 63298 62077 61494 61905 63177 64713 65926
$$ packed form
54327A20810j811j372j282j375j749k520l380l846l835l562l150k620k165k041
54313H6102k205k354k217j714j006m88n32j024j413j408j260j270j339j294j231
54298F5347j280j340j326j338j279p92J16Q48J013R14Q49N32j29l88L54J382J464
54281F4947N96j02j13k8k94m80k06R9j32p65j188j050m36L26Q44R95J111J528
54263F5652J980J885J220N39J33k00m97m79k38k54n34m58J34N23J69m89q45r81
54245F7260j105q66J2R23J095P29N60O48M56j7j65J58L73J37k19l97o02j004j322
54226F6654j310j088p54j43N92P00k65j498j647m27J007J391O99j01l39k25k65
54209F2981m87n38k88L0K51N27R38J173Q41J5q40j305j221n83M11J272J536J213
$$ plain form
54191 65926 66613 66792 66428 65618 64864 64790 65473 66381 67067 67688 68619 69748 70433 70213 69376 68691 68595 68779 68656
54172 68656 68086 67440 66920 66234 65172 64267 64343 65411 66491 66774 66511 66456 66786 67100 67261 67611 68288 68942 69388
54153 69388 70077 71518 73486 75242 76363 76989 77337 77407 77231 77058 77077 77179 77155 77040 77107 77553 78267 78911 79200
54134 79200 79120 78863 78589 78369 78286 78420 78668 78834 78981 79360 79791 79542 78232 76521 75288 74336 72689 70199
54116 70199 68043 67245 67455 67682 67698 67975 68560 68786 68174 67013 65915 65099 64304 63132 61396 59282 57284
54099 57284 55908 55391 55627 56219 56590 56345 55719 55409 55708 56094 55939 55376 55050 55235 55685 56289 57214 58367
54081 58367 59210 59368 59089 58906 59090 59555 60057 60326 60272 60183 60483 61172 61760 61856 61561 61165 60794 60609 61014 62218
54061 62218 63731 64728 64994 65217 66193 67960 69825 71116 71720 71952 72166 72663 73786 75729 78166 80333
$$ packed form
54191F5926O87J79l64q10p54p4O83R08O86O21R31J129O85k20q37o85r6J84j23
54172F8656n70o46n20o86j062r05P6J068J080K83k63n5L30L14J61L50O77O54M46
54153F9388O89J441J968J756J121O26L48P0j76j73J9J02k4j15O7M46P14O44K89
54134G9200q0k57k74k20q3J34K48J66J47L79M31k49j310j711j233r52j647k490
54116G0199k156p98K10K27J6K77N85K26o12j161j098q16p95j172j736k114j998
54099E7284j376n17K36N92L71k45o26l10K99L86j55n63l26J85M50O04R25J153
54081E8367Q43J58k79j83J84M65N02K69n4q9L00O89N88R6k95l96l71j85M05J204
54061F2218J513R97K66K23R76J767J865J291O04K32K14M97J123J943K437K167
$$ plain form
54045 80333 81733 82575 83382 84339 85316 86344 87674 89385 91302 93356 95676 98254 100857 103393 106073
54030 106073 109113 112545 116431 120895 125776 130638 135426 140742 147060 153896 160189 165397 169729 173389
54016 173389 176114 177704 178609 179630 181118 182704 183802 184213 184152 183830 183159 181937 180225 178374 176691 175168
54000 175168 173537 171458 168672 165208 161559 158408 156006 153968 151847 149731 148023 146787 145619 144243
53986 144243 142880 141941 141547 141538 141768 142148 142422 142113 140890 138963 136967 135445 134491 133955 133833 134233 134982 135601
53968 135601 135825 135944 136337 136804 136717 135875 134893 134558 135002 135780 136608 137706 139268 140933 142047 142415 142462 142594
53950 142594 142662 142254 141361 140482 140155 140618 141936 144092 146862 149811 152656 155542 158813 162608 166844 171440
53934 171440 176277 180934 184717 187098 188051 187874 186777 184817 182203 179498 177408 176361 176348 177054 178042 178905
$$ packed form
54045H0333J400Q42Q07R57R77J028J330J711J917K054K320K578K603K536K680
54030A06073L040L432L886M464M881M862M788N316O318O836O293N208M332L660
54016A73389K725J590R05J021J488J586J098M11o1l22o71j222j712j851j683j523
54000A75168j631k079k786l464l649l151k402k038k121k116j708j236j168j376
53986A44243j363r39l94rK30L80K74l09j223j927j996j522r54n36j22M00P49O19
53968A35601K24J19L93M67q7q42r82l35M44P78Q28J098J562J665J114L68M7J32
53950A42594O8m08q93q79l27M63J318K156K770K949K845K886L271L795M236M596
53934A71440M837M657L783K381R53j77j097j960k614k705k090j047j3P06R88Q63
$$ plain form
53918 178905 179489 180056 181055 182652 184615 186762 189230 192134 195217 198237 201518 205684 210819 216330 221722
53903 221722 227015 232267 237159 241426 245305 249057 252264 254143 254589 254479 254756 255477 255864 255092 252968 249955
53887 249955 246707 243513 240186 236468 232438 228398 224430 220280 215658 210524 205078 199607 194304 189133
53873 189133 183897 178621 173761 169795 166586 163537 160417 157673 155646 153820 151295 147943 144612 142049
53859 142049 139985 137557 134431 131154 128423 126315 124322 121938 119083 116081 113371 111181 109363 107613
53845 107613 105955 104873 104760 105271 105516 104945 103861 102901 102198 101293 99829 98109 96836 96415 96637 97034 97397
53828 97397 97749 97927 97503 96309 94857 93908 93705 93901 94264 95014 96306 97744 98748 99281 99816 100622 101442
53811 101442 101927 102142 102469 103189 104302 105663 107082 108351 109381 110396 111875 114238 117519 121367 125301
$$ packed form
53918A78905N84N67R99J597J963K147K468K904L083L020L281M166N135N511N392
53903B21722N293N252M892M267L879L752L207J879M46j10K77P21L87p72k124l013
53887B49955l248l194l327l718m030m040l968m150m622n134n446n471n303n171
53873A89133n236n276m860l966l209l049l120k744k027j826k525l352l331k563
53859A42049k064k428l126l277k731k108j993k384k855l002k710k190j818j750
53845A07613j658j082j13N11K45n71j084r60p03r05j464j720j273m21K22L97L63
53828I7397L52J78m24j194j452r49k03J96L63P50J292J438J004N33N35Q06Q20
53811A01442M85K15L27P20J113J361J419J269J030J015J479K363L281L848L934
$$ plain form
53796 125301 129029 132621 136435 140787 145557 150235 154476 158567 163083 168004 172430 175424 177042 178324
53782 178324 180252 182886 185437 187061 187555 187456 187512 188018 188659 188917 188458 187098 184758 181738 178823 176637
53766 176637 174926 172852 170032 167005 164603 163167 162391 161633 160383 158733 157450 157178 157523 157320 155973
53751 155973 154031 152270 150702 148975 147360 146664 147216 148405 149306 149453 148930 148019 146899 145641 144344 143214
53735 143214 142365 141536 140241 138294 136062 134073 132542 131338 130241 129123 128079 127421 127242 126950 125657
53720 125657 123268 120781 119235 118781 119104 120203 122139 124390 126232 127573 128795 129856 130317 130353 130938 132683
53704 132683 135015 136856 137794 138243 138791 139756 141227 143181 145581 148437 151756 155434 159358 163543 167935
53689 167935 172078 175305 177349 178524 179254 179781 180415 181638 183598 185730 187254 188027 188659 189822 191615
$$ packed form
53796A25301L728L592L814M352M770M678M241M091M516M921M426K994J618J282
53782A78324J928K634K551J624M94r9N6N06O41K58m59j360k340l020k915k186
53766A76637j711k074k820l027k402j436p76p58j250j650j283k72L45k03j347
53751A55973j942j761j568j727j615o96N52J189R01J47n23r11j120j258j297j130
53735A43214q49q29j295j947k232j989j531j204j097j118j044o58j79k92j293
53720A25657k389k487j546m54L23J099J936K251J842J341J222J061M61L6N85J745
53704A32683K332J841R38M49N48R65J471J954K400K856L319L678L924M185M392
53689A67935M143L227K044J175P30N27O34J223J960K132J524P73O32J163J793
$$ plain form
53674 191615 193576 195165 196191 196917 197815 199211 201049 202891 204117 204290 203503 202365 201579 201527 202236 203495
53658 203495 204833 205641 205644 205194 204837 204608 204088 203138 202254 202060 202645 203481 203863 203450 202518 201691 201330 201287 201357 201720
53638 201720 202614 203742 204455 204475 204026 203298 202290 201242 200706 200899 201370 201581 201516 201510 201670 201752 201522 201152 201323
53619 201323 202786 205567 208662 210930 212181 213000 213652 213878 213887 214713 217130 220822 225097 229800 234869 239546
53603 239546 242936 245186 247368 250192 253498 257011 260866 265130 269437 273525 277835 283110 289475 296152
53589 296152 302078 306716 310352 313776 317723 322502 327934 333477 338522 342900 347148 351947 357102 361446
53575 361446 364090 365550 367219 369833 372884 375526 377625 379728 382300 385228 387950 389893 390803 390761 390062
53560 390062 389173 388714 389092 390003 390594 390400 389889 389770 389924 389479 387861 385360 382602 379956 377649 376031 375346
$$ packed form
53674A91615J961J589J026P26Q98J396J838J842J226J73p87j138p86n2P09J259
53658B03495J338Q08Lm50l57k29n20r50q84j94N85Q36L82m13r32q27l61m3P0L63
53638B01720Q94J128P13K0m49p28j008j048n36J93M71K11o5oJ60Q2k30l70J71
53619B01323J463K781L095K268J251Q19O52K26RQ26K417L692M275M703N069M677
53603B39546L390K250K182K824L306L513L855M264M307M088M310N275O365O677
53589B96152N926M638L636L424L947M779N432N543N045M378M248M799N155M344
53575C61446K644J460J669K614L051K642K099K103K572K928K722J943R10m2o99
53560C90062q89m59L78R11N91j94n11j19J54m45j618k501k758k646k307j618o85
$$ plain form
53543 375346 375322 375348 375133 375051 375694 377125 378672 379533 379553 379234 379041 378986 379010 379433 380606 382256 383635 384382 384955
53524 384955 386128 388330 391529 395437 399620 403664 407536 411723 416776 422745 429184 435739 442530 449887
53510 449887 457844 466101 474511 483398 493235 504090 515623 527577 540029 553033 566282 579431
53498 579431 592642 606613 622036 639141 657746 677530 698170 719295 740507 761547 782570
53487 782570 804159 826961 851232 876742 903001 929442 955514 980944 1005957 1031058 1056507
53476 1056507 1082151 1107673 1132738 1157051 1180741 1204698 1229923 1256353 1282895 1308853 1334637
53465 1334637 1360621 1386048 1409899 1432354 1454412 1476270 1497057 1516187 1534004 1550834 1566268
53454 1566268 1579864 1591974 1603400 1614641 1625838 1636978 1647641 1656842 1663592 1667489 1668553 1666864
$$ packed form
53543C75346k4K6k15q2O43J431J547Q61K0l19j93n5K4M23J173J650J379P47N73
53524C84955J173K202L199L908M183M044L872M187N053N969O439O555O791P357
53510D49887P957Q257Q410Q887R837J0855J1533J1954J2452J3004J3249J3149
53498E79431J3211J3971J5423J7105J8605J9784K0640K1125K1212K1040K1023
53487G82570K1589K2802K4271K5510K6259K6441K6072K5430K5013K5101K5449
53476A056507K5644K5522K5065K4313K3690K3957K5225K6430K6542K5958K5784
53465A334637K5984K5427K3851K2455K2058K1858K0787J9130J7817J6830J5434
53454A566268J3596J2110J1426J1241J1197J1140J0663R201O750L897J064j689
$$ plain form
53442 1666864 1662709 1656804 1649788 1641512 1631260 1618718 1604357 1588798 1572126 1554023 1534414 1513754
53430 1513754 1492628 1471119 1448705 1424860 1399732 1374099 1348618 1323297 1297745 1271806 1245866
53419 1245866 1220622 1196645 1174154 1153159 1133778 1116220 1100381 1085720 1071796 1058817 1047303
53408 1047303 1037343 1028670 1021465 1016494 1014245 1014377 1016291 1019813 1025019 1031848 1040331 1050920 1064055 1079525
53394 1079525 1096673 1115110 1134880 1156012 1178363 1201887 1226710 1252888 1280394 1309337 1339904
53383 1339904 1372101 1405848 1441332 1478870 1518435 1559671 1602504 1647349 1694539 1743843 1794803
53372 1794803 1847300 1901518 1957588 2015505 2075221 2136435 2198350 2260008 2320946 2381381 2441658
53361 2441658 2501709 2561089 2619256 2675526 2728848 2778059 2822637 2863105 2900421 2934900 2965883
$$ packed form
53442A666864m155n905p016q276j0252j2542j4361j5559j6672j8103j9609k0660
53430A513754k1126k1509k2414k3845k5128k5633k5481k5321k5552k5939k5940
53419A245866k5244k3977k2491k0995j9381j7558j5839j4661j3924j2979j1514
53408A047303r960q673p205m971k249J32J914L522N206O829Q483J0589J3135J5470
53394A079525J7148J8437J9770K1132K2351K3524K4823K6178K7506K8943L0567
53383A339904L2197L3747L5484L7538L9565M1236M2833M4845M7190M9304N0960
53372A794803N2497N4218N6070N7917N9716O1214O1915O1658O0938O0435O0277
53361B441658O0051N9380N8167N6270N3322M9211M4578M0468L7316L4479L0983
$$ plain form
53350 2965883 2992608 3015232 3034774 3052034 3066741 3077818 3084339 3086078 3083253 3075948 3063910 3046829
53338 3046829 3024588 2997061 2963714 2923691 2876640 2823454 2766008 2706096 2644787 2582832 2521240
53327 2521240 2460979 2402194 2344264 2286783 2230190 2175200 2121894 2069645 2017811 1966220 1915158
53316 1915158 1865216 1817081 1771127 1727171 1684880 1644346 1605970 1569840 1535768 1503975 1475223
53305 1475223 1449954 1427704 1407664 1389366 1372459 1356264 1340230 1324706 1310654 1298572 1288147
53294 1288147 1278837 1270284 1262165 1254256 1246877 1240776 1236352 1233359 1231523 1231020 1232003 1234122 1236817 1239868
53280 1239868 1243351 1247482 1252900 1260775 1271964 1286053 1301662 1317858 1335018 1354234 1376129 1400354
53268 1400354 1425997 1452266 1478806 1505491 1532122 1558473 1584530 1610411 1635968 1660734 1684386
$$ packed form
53350B965883K6725K2624J9542J7260J4707J1077O521J739k825p305j2038j7081
53338C046829k2241k7527l3347m0023m7051n3186n7446n9912o1309o1955o1592
53327B521240o0261n8785n7930n7481n6593n4990n3306n2249n1834n1591n1062
53316A915158m9942m8135m5954m3956m2291m0534l8376l6130l4072l1793k8752
53305A475223k5269k2250k0040j8298j6907j6195j6034j5524j4052j2082j0425
53294A288147r310q553q119p909p379o101m424k993j836n03R83K119K695L051
53280A239868L483M131N418P875J1189J4089J5609J6196J7160J9216K1895K4225
53268A400354K5643K6269K6540K6685K6631K6351K6057K5881K5557K4766K3652
$$ plain form
53257 1684386 1707002 1728615 1748779 1766884 1782789 1796891 1809662 1821352 1831990 1841288 1848569 1853097
53245 1853097 1854543 1852943 1848282 1840442 1829502 1815799 1799649 1781206 1760555 1737594 1711794 1682580
53233 1682580 1650227 1616159 1582037 1548686 1515991 1483555 1451127 1418571 1385879 1353409 1321854
53222 1321854 1291768 1263114 1235302 1207692 1180038 1152550 1125614 1099500 1074309 1050005 1026324
53211 1026324 1002756 978855 954712 930989 908438 887502 868456 851616 837073 824274 812232
53200 812232 800238 788143 775811 762604 747806 731547 714989 699418 685262 672010 658924
53189 658924 645608 632091 618675 605829 593992 583280 573383 563747 553792 543027 531239 518733
53177 518733 506198 494100 482279 470334 458243 446315 434622 422899 411124 399792 389349
$$ packed form
53257A684386K2616K1613K0164J8105J5905J4102J2771J1690J0638R298P281M528
53245A853097J446j600m661p840j0940j3703j6150j8443k0651k2961k5800k9214
53233A682580l2353l4068l4122l3351l2695l2436l2428l2556l2692l2470l1555
53222A321854l0086k8654k7812k7610k7654k7488k6936k6114k5191k4304k3681
53211A026324k3568k3901k4143k3723k2551k0936j9046j6840j4543j2799j2042
53200H12232j1994j2095j2332j3207j4798j6259j6558j5571j4156j3252j3086
53189F58924j3316j3517j3416j2846j1837j0712r897r636r955j0765j1788j2506
53177E18733j2535j2098j1821j1945j2091j1928j1693j1723j1775j1332j0443
$$ plain form
53166 389349 379630 370237 361262 353250 346429 340330 334248 327861 321347 315172 309802 305328 301251 296992
53152 296992 292746 289485 287820 287178 286539 285713 285319 285666 286309 286840 287430 288283 289048 289286 289163 289203 289505 289666
53134 289666 289357 288513 286981 284462 280985 277146 273625 270535 267346 263442 258766 253922 249587 245824 242167
53119 242167 238385 234753 231477 228288 224986 221904 219306 216669 213344 209724 206898 205085 203271 200691
53105 200691 197929 196076 195336 194969 194220 192793 190765 188530 186649 185312 184139 182761 181355 180187 178941
53090 178941 177037 174499 172047 170321 169351 168680 167701 166021 163850 161881 160460 159104 157283 155455 154612
53075 154612 154843 155038 154234 152680 151299 150552 150200 149844 149280 148468 147465 146329 145008 143461 141993 141139
53059 141139 141055 141224 141019 140458 140165 140686 141984 143482 144400 144190 142937 141419 140578 140768 141480 141804 141185 139837
$$ packed form
53166C89349r719r393q975q012o821o099o082o387o514o175n370m474m077m259
53152B96992m246l261j665o42o39q26l94L47O43N31N90Q53P65K38j23M0L02J61
53134B89666l09q44j532k519l477l839l521l090l189l904m676m844m335l763l657
53119B42167l782l632l276l189l302l082k598k637l325l620k826j813j814k580
53105B00691k762j853p40l67p49j427k028k235j881j337j173j378j406j168j246
53090A78941j904k538k452j726r70o71r79j680k171j969j421j356j821j828q43
53075A54612K31J95q04j554j381p47l52l56n64q12j003j136j321j547j468q54
53059A41139q4J69k05n61k93N21J298J498R18k10j253j518q41J90P12L24o19j348
$$ plain form
53041 139837 138434 137368 136307 134655 132423 130457 129716 130377 131757 132939 133384 133045 132151 130940 129557
53026 129557 128178 127183 127034 127835 129078 130004 130255 130099 130050 130399 131165 132323 133839 135452 136686 137268 137469
53009 137469 137794 138378 138914 139244 139712 140733 142238 143835 145407 147176 149166 150975 152281 153371 154895
52994 154895 157099 159536 161610 163307 165258 168087 171745 175487 178373 179815 179803 178829 177528 176224 174774
52979 174774 172944 170772 168414 165744 162551 159126 156232 154300 153014 151867 150789 149934 149225 148458 147598
52964 147598 146570 145083 143093 141175 139928 139254 138761 138625 139317 140592 141565 141942 142309 142945 143193 142507 141417
52947 141417 140834 140878 141132 141601 142619 143964 144856 144945 144644 144426 144359 144537 145336 146863 148579 149864 150702 151453
52929 151453 152186 152715 153163 153891 154805 155263 155025 154913 155947 157930 159461 159550 158739 158328 158883 160017 161369
$$ packed form
53041A39837j403j066j061j652k232j966p41O61J380J182M45l39q94j211j383
53026A29557j379r95j49Q01J243R26K51j56m9L49P66J158J516J613J234N82K01
53009A37469L25N84N36L30M68J021J505J597J572J769J990J809J306J090J524
52994A54895K204K437K074J697J951K829L658L742K886J442j2r74j301j304j450
52979A74774j830k172k358k670l193l425k894j932j286j147j078q55p09p67q60
52964A47598j028j487j990j918j247o74m93j36O92J275R73L77L67O36K48o86j090
52947A41417n83M4K54M69J018J345Q92Q9l01k18o7J78P99J527J716J285Q38P51
52929A51453P33N29M48P28R14M58k38j12J034J983J531Q9q11m11N55J134J352
$$ plain form
52912 161369 163054 165026 166621 167212 166995 166717 166809 167169 167688 168478 169492 170335 170697 170728 170793 171013 171306 171725
52894 171725 172427 173363 174268 175075 175994 177036 177828 178233 178853 180432 182847 185208 187059 188887 191258 193975
52878 193975 196444 198456 200177 201759 203471 205927 209503 213613 217182 219886 222366 225188 228124 230639
52864 230639 232537 233864 234561 234542 233853 232585 230847 228962 227370 226140 224893 223401 221959 220952 220336
52849 220336 219747 218921 217803 216506 215367 214813 214979 215621 216472 217374 217953 217657 216410 214883 213725 212793 211398
52832 211398 209120 206113 202937 200340 198836 198047 196791 194319 191258 188882 187689 187190 186847 186594 186476
52817 186476 186378 186174 185711 184662 182838 180671 178868 177557 176281 174880 173848 173587 173791 173822 173291 172070
52801 172070 170139 167797 165726 164465 163950 163754 163557 163165 162327 160902 159109 157389 155996 154824 153543
$$ packed form
52912A61369J685J972J595N91k17k78R2L60N19P90J014Q43L62L1O5K20K93M19
52894A71725P02R36R05Q07R19J042P92M05O20J579K415K361J851J828K371K717
52878A93975K469K012J721J582J712K456L576M110L569K704K480K822K936K515
52864B30639J898J327O97j9o89j268j738j885j592j230j247j492j442j007o16
52849B20336n89q26j118j297j139n54J66O42Q51R02N79k96j247j527j158r32j395
52832B11398k278l007l176k597j504p89j256k472l061k376j193m99l43k53j18
52817A86476r8k04m63j049j824k167j803j311j276j401j032k61K04L1n31j221
52801A72070j931k342k071j261n15j96j97l92q38j425j793j720j393j172j281
$$ plain form
52786 153543 151837 149651 147366 145586 144615 144227 144021 143816 143621 143452 143362 143450 143605 143408 142533 141137 139663
52769 139663 138361 137264 136465 136073 135879 135437 134551 133496 132607 131874 131045 129944 128528 126720 124382 121526
52753 121526 118445 115654 113625 112488 111915 111362 110572 109790 109485 109832 110516 110981 110839 110076 108995 108014 107411
52736 107411 107255 107521 108225 109312 110531 111635 112787 114526 117174 120391 123456 125904 127716 129000 129727
52721 129727 129819 129381 128796 128574 128937 129436 129196 127774 125649 123598 121792 119890 117829 115951 114350 112728
52705 112728 111073 109854 109171 108239 106232 103341 100471 98171 96305 94606 92995 91359 89486 87318 85030
52690 85030 82905 81364 80953 81850 83373 84392 84333 83574 82877 82713 83088 83687 84070 84015 83692 83356 82952 82287
52672 82287 81471 80816 80346 79848 79316 78929 78571 77896 76963 76287 76102 76043 75793 75528 75438 75235 74543 73472 72455
$$ packed form
52786A53543j706k186k285j780r71l88k06k05j95j69r0Q8J55j97q75j396j474
52769A39663j302j097p99l92j94m42q86j055q89p33q29j101j416j808k338k856
52753A21526l081k791k029j137n73n53p90p82l05L47O84M65j42p63j081r81o03
52736A07411j56K66P04J087J219J104J152J739K648L217L065K448J812J284P27
52721A29727R2m38n85k22L63M99k40j422k125k051j806j902k061j878j601j622
52705A12728j655j219o83r32k007k891k870k300j866j699j611j636j873k168k288
52690H5030k125j541m11Q97J523J019n9p59o97j64L75N99L83n5l23l36m04o65
52672H2287q16o55m70m98n32l87l58o75r33o76j85n9k50k65r0k03o92j071j017
$$ plain form
52653 72455 71743 71381 71395 71680 71966 72201 72673 73401 73765 73318 72708 73161 75006 77294 79007 80108 81203 82584
52635 82584 83968 84942 85373 85474 85612 85959 86257 86054 85269 84307 83530 82847 82044 81289 80949 80974 80826 80118 79082
52616 79082 78235 77782 77567 77507 77799 78606 79721 80699 81317 81797 82548 83693 84853 85474 85432 85216 85377 85844 86037
52597 86037 85695 85336 85675 86756 87903 88487 88518 88522 89017 90093 91283 91851 91449 90591 90330 91346 93408 95686
52579 95686 97478 98582 99144 99315 99150 98826 98861 99842 101795 104016 105737 106891 108050 109762 112174 115091
52563 115091 118045 120337 121462 121666 121819 122594 123935 125373 126612 127694 128771 129887 130928 131744 132301
52548 132301 132598 132423 131517 130270 129839 131071 133447 135670 137145 138227 139091 139301 138757 138214 138316 138759 138950
52531 138950 138935 139039 139094 138725 138131 137812 137718 137277 136185 134571 132590 130543 129274 129597 131100 132289 132199 131386
$$ packed form
52653G2455p12l62J4K85K86K35M72P28L64m47o10M53J845K288J713J101J095J381
52635H2584J384R74M31J01J38L47K98k03p85r62p77o83q03p55l40K5j48p08j036
52616G9082q47m53k15o0K92Q07J115R78O18M80P51J145J160O21m2k16J61M67J93
52597H6037l42l59L39J081J147N84L1MM95J076J190N68m02q58k61J016K062K278
52579I5686J792J104N62J71j65l24L5R81J953K221J721J154J159J712K412K917
52563A15091K954K292J125K04J53P75J341J438J239J082J077J116J041Q16N57
52548A32301K97j75r06j247m31J232K376K223J475J082Q64K10n44n43J02M43J91
52531A38950j5J04N5l69n94l19r4m41j092j614j981k047j269L23J503J189r0q13
$$ plain form
52513 131386 130990 131404 132254 133215 134272 135410 136535 137670 138862 139927 140599 140969 141466 142357 143434 144249
52497 144249 144527 144269 143644 142916 142396 142238 142263 142163 141930 141925 142453 143431 144661 146167 147928 149494 150301 150460
52479 150460 150765 151773 153251 154671 155868 156992 158190 159618 161341 162907 163521 163152 163086 164679 167751
52464 167751 170744 172362 172483 171658 170488 169561 169229 169112 168356 166633 164544 162809 161501 160313 159102 157799
52448 157799 156127 153883 151399 149373 148219 147738 147343 146519 145166 143615 142267 141235 140446 139971 139992 140440
52432 140440 140970 141292 141305 140950 140265 139554 139093 138691 137994 137206 136956 137271 137302 136365 134759 133251 132256 131910 132416
52413 132416 133749 135316 136473 137159 137620 137839 137779 137892 138692 139935 140841 141115 141189 141467 141952 142668 143800 145175
52395 145175 146090 146099 145645 145611 146436 147833 149202 150122 150615 151117 152075 153497 155015 156450 158092 160326 163169
$$ packed form
52513A31386l96M14Q50R61J057J138J125J135J192J065O72L70M97Q91J077Q15
52497A44249K78k58o25p28n20j58K5j00k33nN28R78J230J506J761J566Q07J59
52479A50460L05J008J478J420J197J124J198J428J723J566O14l69o6J593L072
52464A67751K993J618J21q25j170r27l32j17p56j723k089j735j308j188j211j303
52448A57799j672k244k484k026j154m81l95q24j353j551j348j032p89m75K1M48
52432A40440N30L22J3l55o85p11m61m02o97p88k50L15L1r37j606j508r95l46N06
52413A32416J333J567J157O86M61K19o0J13Q00J243R06K74P4K78M85P16J132J375
52395A45175R15Rm54l4Q25J397J369R20M93N02R58J422J518J435J642K234K843
$$ plain form
52378 163169 166339 169547 172579 175216 177322 178983 180505 182247 184426 186915 189189 190649 191178 191339 191932
52363 191932 193321 195181 196833 197909 198726 199983 201978 204270 206233 207835 209577 211726 213980 215919
52349 215919 217453 218676 219587 220250 221040 222437 224591 227220 229919 232478 234917 237347 239776 242118 244349
52334 244349 246536 248597 250198 251108 251546 251937 252432 253028 254033 255833 258118 259898 260638 260945 261793 263441
52318 263441 265507 267771 270381 273438 276832 280360 283663 286289 288262 290402 293552 297525 301381 304698
52304 304698 308037 312081 316858 321938 326902 331461 335615 339919 345090 351073 356998 362387 367921 374538
52290 374538 382140 389748 396677 403032 409164 415273 421611 428651 436772 445955 455801 465762 475510 485270
52276 485270 495716 507291 519720 532377 544923 557330 569555 581660 594142 607648 622288
$$ packed form
52378A63169L170L208L032K637K106J661J522J742K179K489K274J460N29J61N93
52363A91932J389J860J652J076Q17J257J995K292J963J602J742K149K254J939
52349B15919J534J223R11O63P90J397K154K629K699K559K439K430K429K342K231
52334B44349K187K061J601R10M38L91M95N96J005J800K285J780P40L07Q48J648
52318B63441K066K264K610L057L394L528L303K626J973K140L150L973L856L317
52304C04698L339M044M777N080M964M559M154M304N171N983N925N389N534O617
52290C74538P602P608O929O355O132O109O338P040Q121R183R846R961R748R760
52276D85270J0446J1575J2429J2657J2546J2407J2225J2105J2482J3506J4640
$$ plain form
52265 622288 637552 652821 667545 681094 693065 703892 714586 725686 736914 748058 759492
52254 759492 771403 783017 793243 801860 809568 816992 824138 830732 836531 841211 844352 845770 845687 844549
52240 844549 842807 840896 839146 837647 836297 835029 833867 832822 831882 831098 830526 830091 829671 829354 829500 830579
52224 830579 832992 836996 842639 849798 858276 867780 877821 887945 898261 909425 921809 934847 947573
52211 947573 959647 971451 983259 994847 1005989 1016831 1027499 1037673 1046852 1054866 1061866 1067973
52199 1067973 1073104 1077074 1079730 1081069 1081237 1080298 1077973 1073810 1067747 1060248 1051819 1042637 1032843 1022928
52185 1022928 1013467 1004484 995307 985059 973214 959862 945700 931754 918783 906818 895360 884061
52173 884061 873163 863200 854275 845701 836468 826150 815337 805116 796210 788764 782734 777994 773945
$$ packed form
52265F22288J5264J5269J4724J3549J1971J0827J0694J1100J1228J1144J1434
52254G59492J1911J1614J0226Q617P708P424P146O594N799M680L141J418q3j138
52240H44549j742j911j750j499j350j268j162j045r40p84n72m35m20l17J46J079
52224H30579K413M004N643P159Q478R504J0041J0124J0316J1164J2384J3038J2726
52211I47573J2074J1804J1808J1588J1142J0842J0668J0174R179Q014P000O107
52199A067973N131L970K656J339J68r39k325m163o063p499q429r182r794r915
52185A022928r461q983r177j0248j1845j3352j4162j3946j2971j1965j1458j1299
52173H84061j0898r963q925q574r233j0318j0813j0221q906p446o030m740m049
$$ plain form
52160 773945 769540 764107 758013 752161 746998 742393 738329 735177 733101 731550 729635 726919 723729 720833
52146 720833 718881 717974 717567 716837 715273 712947 710282 707635 705132 702681 700050 697055 693810 690673 687832
52131 687832 685025 681776 677847 673279 668137 662505 656743 651441 646919 642946 639102 635277 631592 627951
52117 627951 623993 619567 614957 610506 606225 602017 598139 595120 593128 591612 589731 587148 584347 582201
52103 582201 581205 581077 581051 580603 579932 579723 580485 582176 584464 587235 590814 595694 602120 609894 618563 627745
52087 627745 637273 647126 657322 668020 679523 692038 705373 719083 733017 747617 763474 780584
52075 780584 798211 815600 832768 850397 868998 888401 908179 928233 948609 968856 988096
52064 988096 1005915 1022852 1039787 1057026 1074172 1090532 1105356 1117956 1128165 1136602 1144045 1150470
$$ packed form
52160G73945m405n433o094n852n163m605m064l152k076j551j915k716l190k896
52146G20833j952r07m07p30j564k326k665k647k503k451k631k995l245l137k841
52131F87832k807l249l929m568n142n632n762n302m522l973l844l825l685l641
52117F27951l958m426m610m451m281m208l878l019j992j516j881k583k801k146
52103E82201r96j28k6m48o71k09P62J691K288K771L579M880O426P774Q669R182
52087F27745R528R853J0196J0698J1503J2515J3335J3710J3934J4600J5857J7110
52075G80584J7627J7389J7168J7629J8601J9403J9778K0054K0376K0247J9240
52064I88096J7819J6937J6935J7239J7146J6360J4824J2600J0209Q437P443O425
$$ plain form
52052 1150470 1155052 1157204 1157250 1155971 1153828 1150817 1146793 1141663 1135458 1128391 1120741 1112531 1103548 1093785
52038 1093785 1083678 1073687 1063834 1053914 1044016 1034540 1025748 1017569 1009909 1002895 996692 991219 986279 981977
52024 981977 978815 977193 976868 977140 977631 978640 980573 983324 986538 990340 995328 1001802 1009334 1017198 1024949
52009 1024949 1032507 1040005 1047623 1055306 1062543 1068710 1073687 1077821 1081230 1083508 1084275 1083604 1081701 1078491
51995 1078491 1073726 1067181 1058554 1047620 1034765 1020865 1006244 990145 971751 951339 929837 907536
51983 907536 883949 858815 832592 805928 779214 752687 726464 700397 674327 648524 623515
51972 623515 599502 576431 554575 534444 515913 498048 480110 462359 445579 430127 415730
51961 415730 401965 388722 376341 365468 356538 349300 343045 337351 332341 328184 324723 321727 319082
$$ packed form
52052A150470M582K152M6j279k143l011m024n130o205p067p650q210q983r763
52038A093785j0107r991r853r920r898r476q792q179p660p014o203n473m940m302
52024I81977l162j622l25K72M91J009J933K751L214L802M988O474P532P864P751
52009A024949P558P498P618P683P237O167M977M134L409K278P67o71j903l210
51995A078491m765o545q627j0934j2855j3900j4621j6099j8394k0412k1502k2301
51983I07536k3587k5134k6223k6664k6714k6527k6223k6067k6070k5803k5009
51972F23515k4013k3071k1856k0131j8531j7865j7938j7751j6780j5452j4397
51961D15730j3765j3243j2381j0873q930p238o255n694n010m157l461k996k645
$$ plain form
51948 319082 316510 313482 309757 305762 302159 299228 296908 295162 293976 293163 292468 291825 291323 290971 290633 290074
51932 290074 289041 287470 285704 284178 282801 280979 278410 275469 272542 269374 265484 260956 256367 252163
51918 252163 248496 245484 243026 240510 237276 233474 230028 227624 226085 224751 223085 220852 218176 215628
51904 215628 213834 212681 211192 208580 205281 202579 201251 200893 200592 199963 199315 198924 198409 197012 194466 191458
51888 191458 189092 187984 187942 188434 189107 189790 190243 190196 189652 188953 188499 188437 188600 188660 188377 187838 187561 188134 189581
51869 189581 191151 191935 191720 191037 190469 190229 190478 191524 193385 195450 197077 198361 199857 201667 203290 204357
51853 204357 204996 205444 205837 206520 207975 210162 212438 214370 216120 217722 218621 218497 217996 217942 218188 217979 217212
51836 217212 216566 216461 216684 217029 217578 218209 218511 218437 218481 218990 219787 220712 221921 223431 224855 225933 226820 227541
$$ packed form
51948C19082k572l028l725l995l603k931k320j746j186q13o95o43n02l52l38n59
51932B90074j033j571j766j526j377j822k569k941k927l168l890m528m589m204
51918B52163l667l012k458k516l234l802l446k404j539j334j666k233k676k548
51904B15628j794j153j489k612l299k702j328l58l01o29o48l91n15j397k546l008
51888A91458k366j108m2M92O73O83M53m7n44o99m54o2J63O0k83n39k77N73J447
51869A89581J570P84k15o83n68k40K49J046J861K065J627J284J496J810J623J067
51853B04357O39M48L93O83J455K187K276J932J750J602Q99j24n01n4K46k09p67
51836B17212o46j05K23L45N49O31L02p4M4N09P97R25J209J510J424J078Q87P21
$$ plain form
51818 227541 227757 227539 227796 229246 231292 232658 232956 232931 233234 233663 233798 233752 233932 234399 234767 234591 233686 232200
51800 232200 230532 229064 227911 226987 226272 225824 225497 224950 224035 223078 222662 223190 224638 226533 228091 228602 227968
51783 227968 226899 226423 227084 228607 230309 231833 233421 235438 237678 239291 239517 238444 236984 236174 236498
51768 236498 237790 239620 241792 244471 247759 251192 253920 255542 256535 257620 258927 260053 260777 261232 261387
51753 261387 260840 259311 256995 254216 251060 247628 244399 241953 240346 239097 237803 236630 236083 236427 237352
51738 237352 238187 238422 238060 237428 236725 235918 235113 234765 235317 236733 238472 239823 240212 239452 237983 236663 235956
51721 235956 235394 234210 232449 231048 230671 230856 230551 229214 227111 224731 222286 219720 216958 214063 211337
51706 211337 209200 207863 207132 206667 206345 206175 205979 205467 204685 204056 203839 203769 203453 202839 202079 201098 199701 198131
$$ packed form
51818B27541K16k18K57J450K046J366K98k5L03M29J35m6J80M67L68j76r05j486
51800B32200j668j468j153r24p15m48l27n47r15r57m16N28J448J895J558N11o34
51783B27968j069m76O61J523J702J524J588K017K240J613K26j073j460q10L24
51768B36498J292J830K172K679L288L433K728J622R93J085J307J126P24M55J55
51753B61387n47j529k316k779l156l432l229k446j607j249j294j173n47L44R25
51738B37352Q35K35l62o32p03q07q05l48N52J416J739J351L89p60j469j320p07
51721B35956n62j184j761j401l77J85l05j337k103k380k445k566k762k895k726
51706B11337k137j337p31m65l22j70j96n12p82o29k17p0l16o14p60r81j397j570
$$ plain form
51688 198131 197151 197405 198907 201256 204170 207594 211431 215496 219728 224194 228767 233014 236502 239081 240793
51673 240793 241721 242112 242523 243567 245470 247972 250555 252608 253607 253604 253522 254456 256423 258168 258465 257228 255011
51656 255011 251938 247836 243218 239205 236282 233798 231030 228067 225239 222318 219061 216118 214420 213724
51642 213724 212632 210335 207538 205275 203471 201334 198722 196309 194453 192676 190490 188212 186652 186333
51628 186333 187246 189020 190919 191916 191342 189522 187451 185772 184417 183244 182526 182471 182665 182493 181975 181663 181732
51611 181732 181726 181342 180922 180884 181060 181056 180935 181098 181679 182534 183649 185083 186526 187561 188399 189764 191845 193896
51593 193896 195253 196302 197995 200736 204127 207581 210784 213764 216960 221027 226134 231555 236382 240546
51579 240546 244699 249214 253856 258415 263005 267563 271651 275032 277969 280600 282482 283148 282829 282242 281917
$$ packed form
51688A98131r80K54J502K349K914L424L837M065M232M466M573M247L488K579J712
51673B40793R28L91M11J044J903K502K583K053R99lq2R34J967J745K97j237k217
51656B55011l073m102m618m013k923k484k768k963k828k921l257k943j698o96
51642B13724j092k297k797k263j804k137k612k413j856j777k186k278j560l19
51628A86333R13J774J899R97n74j820k071j679j355j173p18n5J94j72n18l12O9
51611A81732ol84m20l8J76mj21J63N81Q55J115J434J443J035Q38J365K081K051
51593A93896J357J049J693K741L391L454L203K980L196M067N107N421M827M164
51579B40546M153M515M642M559M590M558M088L381K937K631J882O66l19n87l25
$$ plain form
51564 281917 282079 282805 283825 284407 283968 282813 281820 281546 282092 283695 286762 291202 296243 301174 305845 310225
51548 310225 313966 316826 319261 322127 325837 330064 334137 337525 340042 341922 343683 345666 347646 349002
51534 349002 349263 348397 346776 345023 343788 343253 342756 341164 337869 333356 328706 324561 320645 316191 310755
51519 310755 304679 298866 294090 290422 287265 283996 280548 277358 274771 272641 270558 268320 265962 263424
51505 263424 260520 257386 254630 252734 251410 249935 248040 246128 244579 243243 241827 240471 239628 239579 240285
51490 240285 241490 242676 243112 242372 240873 239611 239264 239707 240423 241144 242009 243308 245200 247620 250382 253350
51474 253350 256489 259688 262679 265344 268078 271565 276099 281262 286365 291084 295628 300370 305454 310722
51460 310722 315962 321217 326817 333066 339885 346765 353042 358215 362149 365093 367366 368910 369296 368359 366637
$$ packed form
51564B81917J62P26J020N82m39j155r93k74N46J603L067M440N041M931M671M380
51548C10225L741K860K435K866L710M227M073L388K517J880J761J983J980J356
51534C49002K61q66j621j753j235n35m97j592l295m513m650m145l916m454n436
51519C10755o076n813m776l668l157l269l448l190k587k130k083k238k358k538
51505B63424k904l134k756j896j324j475j895j912j549j336j416j356q43m9P06
51490B40285J205J186M36p40j499j262l47M43P16P21Q65J299J892K420K762K968
51474B53350L139L199K991K665K734L487M534N163N103M719M544M742N084N268
51460C10722N240N255N600O249O819O880O277N173L934K944K273J544L86r37j722
$$ plain form
51445 366637 364842 363009 360524 356990 352649 347854 342626 336959 331209 325740 320402 314745 308654 302401
51431 302401 296191 290029 284075 278743 274297 270584 267359 264671 262706 261344 260138 258794 257580 257130
51417 257130 257820 259307 260764 261622 262094 262873 264249 265690 266428 266367 266119 266028 265456 263420 259825 255670 251881
51400 251881 248332 244331 239785 235347 231426 227531 222869 217304 211464 206040 201243 196868 192625 188309
51386 188309 183858 179389 175133 171202 167412 163488 159559 156280 154220 153189 152440 151512 150502 149407 147785
51371 147785 145417 142908 141047 139855 138853 138073 138009 138519 138602 137545 135795 134344 133778 134175 135396 137003
51355 137003 138286 138845 138881 138684 138278 137874 138105 139230 140550 141240 141471 142008 142987 143879 144570 145711 147857
51338 147857 150868 154209 157344 159835 161643 163425 165982 169341 172893 176420 180280 184423 187993 190304
$$ packed form
51445C66637j795j833k485l534m341m795n228n667n750n469n338n657o091o253
51431C02401o210o162n954n332m446l713l225k688j965j362j206j344j214m50
51417B57130O90J487J457Q58M72P79J376J441P38o1k48r1n72k036l595m155l789
51400B51881l549m001m546m438l921l895m662n565n840n424m797m375m243m316
51386A88309m451m469m256l931l790l924l929l279k060j031p49r28j010j095j622
51371A47785k368k509j861j192j002p80o4N10Q3j057j750j451n66L97J221J607
51355A37003J283N59L6j97m06m04K31J125J320O90K31N37R79Q92O91J141K146
51338A47857L011L341L135K491J808J782K557L359L552L527L860M143L570K311
$$ plain form
51324 190304 191637 192725 193922 195284 196899 198630 199879 200069 199118 197124 194059 190226 186567 183867 181784
51309 181784 179158 175212 170021 164070 157909 152141 147208 143145 139890 137715 136853 136730 136194 134681 132722
51294 132722 131135 130110 129280 128321 127204 126058 125037 124259 123732 123475 123647 124325 125154 125527 125318 125097 125452
51277 125452 126298 127098 127517 127560 127273 126734 126319 126533 127349 128024 127857 127028 126417 126593 127194 127433 126998 126279 125751
51258 125751 125340 124481 122770 120507 118540 117499 117107 116428 114951 113301 112592 113140 114177 114908 115392 116117
51242 116117 117083 117732 117753 117528 117684 118417 119329 119815 119590 119003 118800 119478 120897 122601 124323 125980 127335
51225 127335 128053 128112 127899 127784 127799 127798 127741 127777 128173 129160 130658 132181 133271 134011 134863 135930 136729 136843 136514
51206 136514 136331 136537 136945 137460 138307 139676 141324 142697 143391 143470 143338 143347 143524 143685 143734 143832 144294 145326 146728
$$ packed form
51324A90304J333J088J197J362J615J731J249J90r51j994l065l833l659k700k083
51309A81784k626l946n191n951o161n768m933m063l255k175q62j23n36j513j959
51294A32722j587j025q30r59j117j146j021p78n27k57J72O78Q29L73k09k21L55
51277A25452Q46Q00M19M3k87n39m15K14Q16O75j67q29o11J76O01K39m35p19n28
51258A25751m11q59j711k263j967j041l92o79j477j650p09N48J037P31M84P25
51242A16117R66O49K1k25J56P33R12M86k25n87k03O78J419J704J722J657J355
51225A27335P18N9k13j15J5jn7L6L96R87J498J523J090P40Q52J067P99J14l29
51206A36514j83K06M08N15Q47J369J648J373O94P9j32RJ77J61M9R8M62J032J402
$$ plain form
51187 146728 147854 148057 147378 146620 146498 146897 147249 147448 147864 148472 148579 147693 146256 145150 144741 144632 144084 142464
51169 142464 139676 136561 134519 134236 134883 135023 134110 132680 131250 129709 127881 126102 124966 124814 125559 126729
51153 126729 127594 127624 126988 126342 126116 126368 127298 129232 131835 133974 134867 134977 135306 136147 137009 137449 137345 136597
51135 136597 135280 134011 133506 133651 133585 132819 131744 130866 130111 129152 127958 126665 125298 123999 123240 123351 124000
51118 124000 124481 124422 123985 123545 123420 123724 124144 124028 123019 121547 120395 119866 119659 119470 119383 119692 120616 122212
51100 122212 124287 126424 128253 129694 130757 131307 131320 131253 131749 133013 134827 137016 139375 141217 141730 140989
51084 140989 140018 139487 138991 138107 137588 138693 141481 144530 146459 147180 147549 148267 149435 150801 152126 153338
51068 153338 154535 155804 156965 157607 157407 156397 154943 153610 152981 153291 154114 154629 154498 154353 155214 157288
$$ packed form
51187A46728J126K03o79p58j22L99L52J99M16O08J07q86j437j106m09j09n48j620
51169A42464k788l115k042k83O47J40r13j430j430j541j828j779j136j52P45J170
51153A26729Q65L0o36o46k26K52R30J934K603K139Q93J10L29Q41Q62M40j04p48
51135A36597j317j269n05J45o6p66j075q78p55r59j194j293j367j299p59J11O49
51118A24000M81n9m37m40j25L04M20j16j009j472j152n29k07j89q7L09R24J596
51100A22212K075K137J829J441J063N50J3o7M96J264J814K189K359J842N13p41
51084A40989r71n31m96q84n19J105K788L049J929P21L69P18J168J366J325J212
51068A53338J197J269J161O42k00j010j454j333o29L10Q23N15j31j45Q61K074
$$ plain form
51052 157288 159562 160754 160626 160165 160449 161521 162518 162691 162036 161020 160107 159591 159528 159577 159194 158204 157030 156213
51034 156213 155986 156487 157922 160066 161909 162487 162030 161724 162274 163282 164196 165218 166844 168893 170549 171280
51018 171280 171381 171658 172797 174976 177831 180777 183452 185885 188226 190526 192812 195162 197557 199879 202255
51003 202255 205177 209011 213531 218164 222579 226845 231225 236114 242000 249053 256815 264680 272643 281188
50989 281188 290455 300057 309870 320501 332658 346402 361437 377808 395928 416110 438608 463954
50977 463954 492655 524458 558516 594608 633761 677226 725092 776386 830318 886820 945778
50966 945778 1006444 1068003 1130240 1193006 1255175 1314758 1370167 1420820 1466329 1505633 1537427
50955 1537427 1561170 1577192 1586034 1588229 1584594 1576087 1563174 1545883 1524800 1501580 1478074 1455260
$$ packed form
51052A57288K274J192j28m61K84J072R97J73o55j016r13n16o3M9l83r90j174q17
51034A56213k27N01J435K144J843N78m57l06N50J008R14J022J626K049J656P31
51018A71280J01K77J139K179K855K946K675K433K341K300K286K350K395K322K376
51003B02255K922L834M520M633M415M266M380M889N886P053P762P865P963Q545
50989B81188R267R602R813J0631J2157J3744J5035J6371J8120K0182K2498K5346
50977D63954K8701L1803L4058L6092L9153M3465M7866N1294N3932N6502N8958
50966I45778O0666O1559O2237O2766O2169N9583N5409N0653M5509L9304L1794
50955A537427K3743J6022Q842K195l635q507j2913j7291k1083k3220k3506k2814
$$ plain form
50943 1455260 1433347 1412550 1393161 1375007 1357478 1340094 1322549 1304137 1283767 1260819 1235525
50932 1235525 1208200 1178540 1146088 1110993 1073757 1034457 992887 949491 905575 862395 820447
50921 820447 779847 741028 704668 671045 639791 610369 582734 557446 535175 516024 499426
50910 499426 484751 471896 461076 452192 444782 438601 433842 430578 428321 426447 424852 423853 423546 423576
50896 423576 423582 423625 424054 425061 426481 427998 429496 431194 433450 436470 440252 444730 449836 455480 461654 468482
50880 468482 476011 483994 492205 500903 510627 521489 533130 545561 559556 575849 594382 614785
50868 614785 637280 662583 691125 722977 758405 797896 841695 889939 943394 1003497 1071355
50857 1071355 1147101 1230450 1321526 1420881 1528942 1645641 1770330 1901832 2038734 2179678
$$ packed form
50943A455260k1913k0797j9389j8154j7529j7384j7545j8412k0370k2948k5294
50932A235525k7325k9660l2452l5095l7236l9300m1570m3396m3916m3180m1948
50921H20447m0600l8819l6360l3623l1254k9422k7635k5288k2271j9151j6598
50910D99426j4675j2855j0820q884p410o181m759l264k257j874j595r99l07L0
50896D23576OM3M29J007J420J517J498J698K256L020L782M478N106N644O174O828
50880D68482P529P983Q211Q698R724J0862J1641J2431J3995J6293J8533K0403
50868F14785K2495K5303K8542L1852L5428L9491M3799M8244N3455O0103O7858
50857A071355P5746Q3349R1076R9355J08061J16699J24689J31502J36902J40944
$$ plain form
50847 2179678 2323193 2467237 2609275 2746739 2876877 2996087 3100188 3185963 3252157 3298634
50837 3298634 3325082 3331216 3317985 3287835 3243837 3189108 3127060 3061446 2995748 2932653 2874165
50826 2874165 2821788 2776350 2737775 2705070 2676338 2648959 2620263 2588287 2551726 2509199 2459037
50815 2459037 2400101 2332475 2257015 2174502 2085570 1991324 1893561 1794293 1695303 1598212 1504634
50804 1504634 1415991 1333252 1257011 1187859 1126460 1073139 1027473 988500 955410 927950 906119
50793 906119 889713 878383 871974 870419 873256 879510 888223 898923 911408 925218 939451 953010
50781 953010 964939 974608 981765 986432 988664 988402 985518 979956 971844 961624 950081 938083 926093
50768 926093 913909 900916 886591 870914 854539 838628 824236 811667 800539 790578 782142 775784
$$ packed form
50847B179678J43515J44044J42038J37464J30138J19210J04101Q5775O6194M6477
50837C298634K6448O134j3231l0150m3998n4729o2048o5614o5698o3095n8488
50826B874165n2377m5438l8575l2705k8732k7379k8696l1976l6561m2527n0162
50815B459037n8936o7626p5460q2513q8932r4246r7763r9268r8990r7091r3578
50804A504634q8643q2739p6241o9152o1399n3321m5666l8973l3090k7460k1831
50793I06119j6406j1330o409j555K837O254Q713J0700J2485J3810J4233J3559
50781I53010J1929R669P157M667K232k62k884n562q112j0220j1543j1998j1990
50768I26093j2184j2993j4325j5677j6375j5911j4392j2569j1128r961q436o358
$$ plain form
50756 775784 771574 769166 768400 769521 772888 778812 787734 800144 816232 835864 858998 885894 916806
50743 916806 951823 991259 1035925 1086667 1143766 1207082 1276627 1352591 1434824 1522672 1615418
50732 1615418 1712410 1812488 1913559 2013078 2108780 2198507 2279466 2348267 2402094 2439616 2460506
50721 2460506 2464507 2451626 2423217 2382145 2331478 2273456 2210121 2144447 2080018 2019594 1964614
50710 1964614 1916063 1874935 1841382 1814039 1790797 1769982 1750333 1730434 1708908 1684919 1657627
50699 1657627 1625235 1585610 1538282 1485192 1429046 1371422 1312900 1254394 1197534 1143763 1093745
50688 1093745 1047784 1006449 970498 940376 915891 896409 881366 870636 864390 862698 865534 873136
50676 873136 885954 904076 927044 954525 986839 1024350 1066418 1111264 1156874 1201858 1245601
$$ packed form
50756G75784m210k408p66J121L367N924Q922J2410J6088J9632K3134K6896L0912
50743I16806L5017L9436M4666N0742N7099O3316O9545P5964Q2233Q7848R2746
50732A615418R6992J00078J01071R9519R5702Q9727Q0959O8801N3827L7522K0890
50721B460506M001j2881k8409m1072n0667n8022o3335o5674o4429o0424n4980
50710A964614m8551m1128l3553k7343k3242k0815j9649j9899k1526k3989k7292
50699A657627l2392l9625m7328n3090n6146n7624n8522n8506n6860n3771n0018
50688A093745m5961m1335l5951l0122k4485j9482j5043j0730o246j692K836P602
50676H73136J2818J8122K2968K7481L2314L7511M2068M4846M5610M4984M3743
$$ plain form
50665 1245601 1287992 1328928 1367825 1403559 1435089 1462071 1484687 1503076 1517225 1527289 1533643
50654 1533643 1536601 1536357 1533119 1527052 1518206 1506866 1493872 1480288 1466844 1454131 1443152 1435128 1430657
50641 1430657 1429628 1432035 1438371 1448976 1463396 1480674 1499914 1520423 1541683 1563360 1585035 1605788
50629 1605788 1624433 1640407 1654043 1665794 1675657 1683683 1690613 1697580 1705491 1715043 1727002 1741901
50617 1741901 1759634 1779722 1801762 1825167 1848618 1870302 1888702 1902816 1911708 1914439 1910612 1900732
50605 1900732 1885818 1866799 1844285 1818675 1790232 1758996 1724671 1686746 1644989 1599777 1551638
50594 1551638 1500553 1446223 1389240 1331459 1274750 1219758 1166333 1114801 1066137 1021008 979316
50583 979316 940746 905223 872774 843322 816780 793067 772049 753785 738778 727547 719862 714776
$$ packed form
50665A245601M2391M0936L8897L5734L1530K6982K2616J8389J4149J0064O354
50654A533643K958k44l238o067q846j1340j2994j3584j3444j2713j0979q024m471
50641A430657j029K407O336J0605J4420J7278J9240K0509K1260K1677K1675K0753
50629A605788J8645J5974J3636J1751R863Q026O930O967P911R552J1959J4899
50617A741901J7733K0088K2040K3405K3451K1684J8400J4114Q892K731l827r880
50605A900732j4914j9019k2514k5610k8443l1236l4325l7925m1757m5212m8139
50594A551638n1085n4330n6983n7781n6709n4992n3425n1532m8664m5129m1692
50583I79316l8570l5523l2449k9452k6542k3713k1018j8264j5007j1231p685n086
$$ plain form
50571 714776 711457 709713 709777 712006 716829 724477 734587 746476 759990 775769 794504 816250 840670
50558 840670 867606 897158 929432 964443 1002173 1042558 1085556 1131258 1179671 1230322 1282255
50547 1282255 1334479 1386082 1435894 1482497 1524987 1563599 1599419 1633605 1666957 1699828 1732133
50536 1732133 1763582 1794200 1824581 1855456 1887144 1919592 1952918 1987696 2024734 2064642 2107614
50525 2107614 2153518 2202120 2253124 2305937 2359570 2412957 2465207 2515291 2561628 2602379 2636129
50514 2636129 2661938 2678814 2685714 2682238 2668782 2645751 2613056 2570764 2519923 2462431 2400347 2335648
50502 2335648 2270378 2206611 2146337 2091529 2044029 2004965 1974386 1951636 1935858 1925964 1920661 1919012
50490 1919012 1920786 1925755 1932906 1940910 1949200 1957814 1966064 1971878 1972639 1966127 1950475 1923879 1885157
$$ packed form
50571G14776l319j744O4K229M823P648J0110J1889J3514J5779J8735K1746K4420
50558H40670K6936K9552L2274L5011L7730M0385M2998M5702M8413N0651N1933
50547A282255N2224N1603M9812M6603M2490L8612L5820L4186L3352L2871L2305
50536A732133L1449L0618L0381L0875L1688L2448L3326L4778L7038L9908M2972
50525B107614M5904M8602N1004N2813N3633N3387N2250N0084M6337M0751L3750
50514B636129K5809J6876O900l476j3456k3031l2695m2292n0841n7492o2084o4699
50502B335648o5270o3767o0274n4808m7500l9064l0579k2750j5778r894n303j649
50490A919012J774M969P151Q004Q290Q614Q250N814P61o512j5652k6596l8722
$$ plain form
50477 1885157 1834606 1774028 1705866 1632485 1556051 1478593 1401859 1327149 1255466 1187816 1125214
50466 1125214 1068327 1017246 971723 931494 896236 865399 838455 815270 795820 779544 765463
50455 765463 753203 743408 736784 733132 731737 732308 734941 739435 745353 752752 762202 773900 787351 802114
50441 802114 818419 836793 857394 879936 903962 928976 954652 981193 1009298 1039510 1071752
50430 1071752 1105612 1140822 1177223 1214468 1252074 1289712 1327252 1364586 1401606 1438304 1474776
50419 1474776 1511156 1547619 1584378 1621628 1659502 1698010 1736820 1775132 1812110 1847517 1881677
50408 1881677 1914650 1945763 1974140 1999319 2020996 2038399 2050399 2056247 2055835 2049249 2036365 2016897
50396 2016897 1990551 1957091 1916563 1869550 1816932 1759382 1697302 1631352 1562740 1492924 1423403
$$ packed form
50477A885157n0551o0578o8162p3381p6434p7458p6734p4710p1683o7650o2602
50466A125214n6887n1081m5523m0229l5258l0837k6944k3185j9450j6276j4081
50455G65463j2260r795o624l652j395N71K633M494N918P399R450J1698J3451J4763
50441H02114J6305J8374K0601K2542K4026K5014K5676K6541K8105L0212L2242
50430A071752L3860L5210L6401L7245L7606L7638L7540L7334L7020L6698L6472
50419A474776L6380L6463L6759L7250L7874L8508L8810L8312L6978L5407L4160
50408A881677L2973L1113K8377K5179K1677J7403J2000N848m12o586j2884j9468
50396B016897k6346l3460m0528m7013n2618n7550o2080o5950o8612o9816o9521
$$ plain form
50385 1423403 1355963 1292637 1234868 1182819 1135935 1094171 1058281 1028904 1005896 988816 977606
50374 977606 972341 972512 977082 985235 996646 1010855 1026683 1042511 1056869 1068515 1076113 1078278 1074090
50361 1074090 1063459 1047000 1025671 1000542 972662 942981 912377 881665 851466 822056 793546
50350 793546 766253 740762 717553 696719 678157 661846 647784 635765 625439 616603 609286 603612
50338 603612 599663 597411 596596 596763 597611 599270 601997 605648 609813 614543 620523 628345 637940 648995 661589
50323 661589 675960 691901 708897 726711 745339 764504 783867 803812 825276 848470 872404
50312 872404 896155 920043 944888 970457 995387 1018507 1039584 1058853 1076504 1092682 1107372
50301 1107372 1120141 1130549 1138879 1145865 1151456 1154540 1154247 1150946 1145426 1137725 1127601 1115797 1103792
$$ packed form
50385A423403o7440o3326n7769n2049m6884m1764l5890k9377k3008j7080j1210
50374I77606n265J71M570Q153J1411J4209J5828J5828J4358J1646P598K165m188
50361A074090j0631j6459k1329k5129k7880k9681l0604l0712l0199k9410k8510
50350G93546k7293k5491k3209k0834j8562j6311j4062j2019j0326q836p317n674
50338F03612l949k252q15J67Q48J659K727L651M165M730N980P822R595J1055J2594
50323F61589J4371J5941J6996J7814J8628J9165J9363J9945K1464K3194K3934
50312H72404K3751K3888K4845K5569K4930K3120K1077J9269J7651J6178J4690
50301A107372J2769J0408Q330O986N591L084k93l301n520p701j0124j1804j2005
$$ plain form
50288 1103792 1092008 1078890 1062167 1040822 1015673 988391 960339 932222 904392 877118 850578
50277 850578 824801 799850 775979 753420 732060 711609 692132 674145 658077 643896 631333
50266 631333 620167 610117 600813 592166 584486 577953 572183 566589 560925 555235 549575 544111 539197 534913
50252 534913 530772 526375 522133 518805 516530 514930 514017 514242 515557 517188 518642 520378 523101 526807 530882
50237 530882 534858 538761 542877 547431 552373 557341 561950 566133 570011 573523 576497 579079 581544 583707
50223 583707 585018 585351 585148 584578 583166 580642 577607 574894 572642 570453 568021 565159 561633 557594 553871
50208 553871 551159 549172 547236 545527 544928 545761 547496 549862 553360 558314 564096 569866 575639 582096 589664
50193 589664 598250 607635 617518 627200 635721 642491 647619 651599 654851 657517 659357 659788 658321 655089
$$ packed form
50288A103792j1784j3118j6723k1345k5149k7282k8052k8117k7830k7274k6540
50277H50578k5777k4951k3871k2559k1360k0451j9477j7987j6068j4181j2563
50266F31333j1166j0050r304q647p680o533n770n594n664n690n660n464m914m284
50252E34913m141m397m242l328k275j600r13K25J315J631J454J736K723L706M075
50237E30882L976L903M116M554M942M968M609M183L878L512K974K582K465K163
50223E83707J311L33k03n70j412k524l035k713k252k189k432k862l526m039l723
50208E53871k712j987j936j709n99Q33J735K366L498M954N782N770N773O457P568
50193E89664Q586R385R883R682Q521O770N128L980L252K666J840M31j467l232
$$ plain form
50179 655089 650734 645572 639111 630687 620602 610304 601332 594179 588267 582774 577252 571601 565869 560257
50165 560257 555126 550735 547008 543567 539965 535892 531332 526560 521891 517372 512903 508617 504904 501960
50151 501960 499578 497559 496017 495038 494392 493971 494243 495704 497960 499887 500862 501363 502220 503702 505567 507621
50135 507621 509880 512362 515023 517841 520747 523624 526476 529410 532320 534846 536909 538971 541402 543821
50121 543821 545527 546522 547544 548985 550212 550268 548881 546505 543585 540215 536486 532863 529994 528210 527203
50106 527203 526259 524906 523421 522576 522824 523854 525029 526091 527206 528538 530079 531922 534405 537895 542629
50091 542629 548765 556294 564778 573443 581794 590105 599182 609708 621845 635257 649434 664183 679973
50078 679973 697540 716922 737146 757260 777584 799551 824286 851673 880852 911246 942945
$$ packed form
50179F55089m355n162o461q424j0085j0298q972p153n912n493n522n651n732n612
50165E60257n131m391l727l441l602m073m560m772m669m519m469m286l713k944
50151E01960k382k019j542r79o46m21K72J461K256J927R75N01Q57J482J865K054
50135E07621K259K482K661K818K906K877K852K934K910K526K063K062K431K419
50121E43821J706R95J022J441J227N6j387k376k920l370l729l623k869j784j007
50106E27203r44j353j485q45K48J030J175J062J115J332J541J843K483L490M734
50091E42629O136P529Q484Q665Q351Q311R077J0526J2137J3412J4177J4749J5790
50078F79973J7567J9382K0224K0114K0324K1967K4735K7387K9179L0394L1699
$$ plain form
50067 942945 976421 1012143 1050370 1091064 1134085 1179556 1228032 1280293 1337050 1398663 1464698
50056 1464698 1533556 1602882 1670532 1734913 1794181 1845690 1887025 1917814 1940124 1956931 1970442
50045 1970442 1981963 1992732 2004085 2016496 2028708 2038009 2041295 2035859 2019544 1990861 1949478 1896512
50033 1896512 1834097 1764668 1690746 1615051 1540186 1467991 1399514 1335670 1277366 1224775 1177006
50022 1177006 1133108 1093065 1057256 1025210 995645 967763 941798 918092 896321 875978 857077
50011 857077 839870 824210 809676 796092 783394 771253 759468 748664 739946 733665 729000 724983
49999 724983 721471 718820 717074 715967 715495 715938 717331 719314 721528 723815 725968 727724 729181 730910 733370
49984 733370 736311 738952 740662 741424 741827 742710 744576 747080 749208 750153 749968 749271 748587 748241 748631 750148
$$ packed form
50067I42945L3476L5722L8227M0694M3021M5471M8476N2261N6757O1613O6035
50056A464698O8858O9326O7650O4381N9268N1509M1335L0789K2310J6807J3511
50045A970442J1521J0769J1353J2411J2212R301L286n436j6315k8683m1383n2966
50033A896512o2415o9429p3922p5695p4865p2195o8477o3844n8304n2591m7769
50022A177006m3898m0043l5809l2046k9565k7882k5965k3706k1771k0343j8901
50011H57077j7207j5660j4534j3584j2698j2141j1785j0804q718o281m665m017
49999G24983l512k651j746j107m72M43J393J983K214K287K153J756J457J729K460
49984G33370K941K641J710P62M03Q83J866K504K128R45j85o97o84l46L90J517
$$ plain form
49968 750148 752911 756931 762443 769604 777857 786155 794067 802320 811987 823474 836575 851205 867771
49955 867771 886948 909344 935261 964640 997378 1033829 1074778 1120817 1172141 1229235 1293341
49944 1293341 1365773 1446974 1536637 1634327 1739189 1849012 1960324 2069747 2174864 2273668
49934 2273668 2364021 2444414 2515199 2578553 2637132 2692885 2746862 2799492 2850517 2898587 2940967
49923 2940967 2973750 2992672 2994194 2976272 2938440 2881480 2807214 2718516 2619051 2512427 2401234
49912 2401234 2286860 2170330 2053280 1937879 1825822 1717705 1613717 1514760 1422501 1338190
49902 1338190 1261650 1191592 1126885 1067442 1013893 966508 924509 886540 851747 820193 792220
49891 792220 767711 746208 727381 710860 695673 680456 664485 648210 632598 618168 604821
$$ packed form
49968G50148K763M020N512P161Q253Q298P912Q253R667J1487J3101J4630J6566
49955H67771J9177K2396K5917K9379L2738L6451M0949M6039N1324N7094O4106
49944A293341P2432Q1201Q9663R7690J04862J09823J11312J09423J05117R8804
49934B273668R0353Q0393P0785O3354N8579N5753N3977N2630N1025M8070M2380
49923B940967L2783J8922J522j7922l7832n6960p4266q8698r9465j06624j11193
49912B401234j14374j16530j17050j15401j12057j08117j03988r8957r2259q4311
49902A338190p6540p0058o4707n9443n3549m7385m1999l7969l4793l1554k7973
49891G92220k4509k1503j8827j6521j5187j5217j5971j6275j5612j4430j3347
$$ plain form
49880 604821 592305 580496 569341 558754 548629 538931 529840 521740 514799 508561 502325 496041 490450
49867 490450 486101 482701 479770 477419 475830 474371 472124 469372 467619 467825 469321 470904 472313 474038
49853 474038 476200 478509 481077 484441 488632 492934 496765 500302 504061 508335 513226 518721 524467 529951
49839 529951 535300 541471 549198 558158 567714 578147 590441 605008 621403 639407 659735 683436
49827 683436 711147 743242 780213 822473 870013 922671 980650 1044439 1114242 1189476 1268595
49816 1268595 1349233 1428648 1504195 1573446 1634203 1685011 1725933 1758459 1784460 1805508 1823212
49805 1823212 1839474 1855684 1871733 1886036 1896205 1899335 1892074 1871259 1834845 1782263 1714317 1633225
49793 1633225 1542619 1446900 1350278 1256197 1167111 1084272 1007963 938412 876332 822162 775112
$$ packed form
49880F04821j2516j1809j1155j0587j0125r698r091q100o941o238o236o284n591
49867D90450m349l400k931k351j589j459k247k752j753K06J496J583J409J725
49853D74038K162K309K568L364M191M302L831L537L759M274M891N495N746N484
49839E29951N349O171P727Q960R556J0433J2294J4567J6395J8004K0328K3701
49827F83436K7711L2095L6971M2260M7540N2658N7979O3789O9803P5234P9119
49816A268595Q0638P9415P5547O9251O0757N0808M0922L2526K6001K1048J7704
49805A823212J6262J6210J6049J4303J0169L130p261k0815l6414n2582o7946q1092
49793A633225r0606r5719r6622r4081q9086q2839p6309o9551o2080n4170m7050
$$ plain form
49782 775112 733675 696945 664790 636884 612413 590876 572382 556832 543431 531419 520744
49771 520744 511645 503979 497336 491479 486285 481528 477059 473019 469667 467131 465402 464230 462944 460877
49757 460877 458201 455908 454716 454395 454439 454861 455852 457096 458047 458599 458979 459150 458852 458162 457609 457744 458912
49740 458912 461137 463854 466052 467263 468213 469873 471940 473061 472668 471887 472184 473613 474949 475293 475013 475128
49724 475128 476145 477679 478950 479471 479308 478899 478773 479285 480360 481437 481887 481632 481230 481312 482088 483469 485346
49707 485346 487505 489503 490970 491955 492756 493506 494171 494835 495692 496750 497781 498559 499048 499370 499723 500197 500591
49690 500591 500561 500084 499618 499583 499885 500208 500536 501046 501594 501676 500950 499636 498440 498178 499255 501223 502980 503714
49672 503714 503563 503208 503108 503375 504106 505330 506759 508048 509180 510253 511071 511423 511663 512447 513951 515827
$$ packed form
49782G75112m1437l6730l2155k7906k4471k1537j8494j5550j3401j2012j0675
49771E20744r099p666o643n857n194m757m469m040l352k536j729j172j286k067
49757D60877k676k293j192l21M4M22R91J244R51N52L80J71k98o90n53J35J168
49740D58912K225K717K198J211R50J660K067J121l93p81K97J429J336L44k80J15
49724D75128J017J534J271N21j63m09j26N12J075J077M50k55m02Q2P76J381J877
49707D85346K159J998J467R85Q01P50O65O64Q57J058J031P78M89L22L53M74L94
49690E00591l0m77m66l5L02L23L28N10N48Q2p26j314j196k62J077J968J757P34
49672E03714j51l55j00K67P31J224J429J289J132J073Q18L52K40P84J504J876
$$ plain form
49656 515827 517869 520181 522648 524806 526330 527276 527889 528654 530396 533610 537612 541094 543622 545901 548408
49641 548408 550664 552228 553572 555327 557336 559130 560821 562787 564935 567061 569632 573337 577992 582590
49627 582590 586498 590001 593713 597990 602958 608480 613922 618468 621921 624859 627895 631145 634518 638124
$$ packed form
49656E15827K042K312K467K158J524R46O13P65J742L214M002L482K528K279K507
49641E48408K256J564J344J755K009J794J691J966K148K126K571L705M655M598
49627E82590L908L503L712M277M968N522N442M546L453K938L036L250L373L606
$$ [...]
##END NTUPLES=NMR SPECTRUM
##END=
