##TITLE=NES1026_17915_9266881_sXGIX0Gfx3
##JCAMPDX= 6.0         $$ Bruker NMR JCAMP-DX V2.0
##DATA TYPE= NMR SPECTRUM
##DATA CLASS= NTUPLES
##ORIGIN= BRUKER
##OWNER= Administrator
$$ 1.72 TOPSPIN		Version 2.1
$$ 2015-08-24 17:26:39.858 -0700  Administrator@X
$$ Compression mode = diff/dup
##.OBSERVE FREQUENCY= 400.02188249412
##.OBSERVE NUCLEUS= ^1H
##.ACQUISITION MODE= SIMULTANEOUS (DQD)
##.ACQUISITION SCHEME= undefined
##.AVERAGES= 8
##.DIGITISER RES= 22
##SPECTROMETER/DATA SYSTEM= spect
##.PULSE SEQUENCE= zg30
##.SOLVENT NAME= COFFEE_meoh
##.SHIFT REFERENCE= INTERNAL, COFFEE_meoh, 1, 14.98509
##AUDIT TRAIL= $$ (NUMBER, WHEN, WHO, WHERE, PROCESS, VERSION, WHAT)
$$ ##TITLE= Audit trail, TOPSPIN		Version 2.1
$$ ##JCAMPDX= 5.01
$$ ##ORIGIN= Bruker BioSpin GmbH
$$ ##OWNER= Administrator
$$ $$ E:\/data/COFFEE/nmr/NES1026_17915_9266881_sXGIX0Gfx3/20/pdata/1/auditp.txt
$$ ##AUDIT TRAIL=  $$ (NUMBER, WHEN, WHO, WHERE, PROCESS, VERSION, WHAT)
(   1,<2015-08-24 17:26:32.451 -0700>,<Administrator>,<X>,<go>,<TOPSPIN 2.1>,
      <created by zg
	started at 2015-08-24 17:25:26.108 -0700,
	POWCHK enabled, PULCHK disabled,
       configuration hash MD5:
       21 0F 79 D6 B3 7B B4 F6 88 20 88 DB 03 48 BD 9F
       data hash MD5: 64K
       3D 5B 2A 9C FA 76 7C 6F 8C FC 7F ED DE AE 1D 69>)
(   2,<2015-08-24 17:26:35.811 -0700>,<Administrator>,<X>,<proc1d>,<TOPSPIN 2.1>,
      <Start of raw data processing
       efp LB = 0 FT_mod = 6 PKNL = 1 PHC0 = 0 PHC1 = 0 SI = 32K 
       data hash MD5: 32K
       DB 1A 5D 55 F3 75 DB C2 65 18 20 0E FC 00 32 A0>)
(   3,<2015-08-24 17:26:36.092 -0700>,<Administrator>,<X>,<proc1d>,<TOPSPIN 2.1>,
      <pk PHC0 = 90.802 PHC1 = 0 
       data hash MD5: 32K
       ED E8 C4 A2 4E 12 12 0C 01 DE B8 81 9F 90 9E 22>)
(   4,<2015-08-24 17:26:36.201 -0700>,<Administrator>,<X>,<proc1d>,<TOPSPIN 2.1>,
      <abs ABSG = 1 
       data hash MD5: 32K
       F9 4C E0 5B A3 4A 3C C4 9B F1 F0 56 FA A2 F5 65>)
(   5,<2015-08-24 17:26:36.264 -0700>,<Administrator>,<X>,<proc1d>,<TOPSPIN 2.1>,
      <abs ABSG = 2 
       data hash MD5: 32K
       59 0F 48 51 1D 5B 6D F9 6C EA 32 46 90 C2 C2 0F>)
(   6,<2015-08-24 17:26:36.311 -0700>,<Administrator>,<X>,<proc1d>,<TOPSPIN 2.1>,
      <abs ABSG = 3 
       data hash MD5: 32K
       05 70 02 E4 49 1D 8D 4A 35 F7 DE 6B 9B 98 A1 54>)
(   7,<2015-08-24 17:26:36.373 -0700>,<Administrator>,<X>,<proc1d>,<TOPSPIN 2.1>,
      <abs ABSG = 4 
       data hash MD5: 32K
       FB BC BE 3E 72 51 7F 21 1C DA 84 F8 43 CF AA 17>)
(   8,<2015-08-24 17:26:36.436 -0700>,<Administrator>,<X>,<proc1d>,<TOPSPIN 2.1>,
      <abs ABSG = 5 
       data hash MD5: 32K
       33 EB 37 D5 99 E3 CE 67 55 74 94 5C 12 68 68 57>)
$$ ##END=
$$ 
$$ $$ hash MD5
$$ $$ 24 52 CB DE F6 87 0A 36 31 8F 0B 39 D1 C2 6A 9E
##$RELAX= 
##$RELAX= 
##$RELAX= 
##$RELAX= 
##$RELAX= 
##$RELAX= 
##$RELAX= 
$$ Bruker specific parameters
$$ --------------------------
##$DU= <E:\>
##$EXPNO= 20
##$NAME= <NES1026_17915_9266881_sXGIX0Gfx3>
##$PROCNO= 1
$$ [...]
##$TP= (0..7)
150 150 150 150 150 150 150 150
##$TP07= 0
##$TPNAME0= <>
##$TPNAME1= <>
##$TPNAME2= <>
##$TPNAME3= <>
##$TPNAME4= <>
##$TPNAME5= <>
##$TPNAME6= <>
##$TPNAME7= <>
##$TPOAL= (0..7)
0.5 0.5 0.5 0.5 0.5 0.5 0.5 0.5
##$TPOFFS= (0..7)
0 0 0 0 0 0 0 0
##$TUNHIN= 0
##$TUNHOUT= 0
##$TUNXOUT= 0
##$USERA1= <user>
##$USERA2= <user>
##$USERA3= <user>
##$USERA4= <user>
##$USERA5= <user>
##$V9= 5
##$VALIST= <valist>
##$VCLIST= <CCCCCCCCCCCCCCC>
##$VD= 0
##$VDLIST= <DDDDDDDDDDDDDDD>
##$VPLIST= <PPPPPPPPPPPPPPP>
##$VTLIST= <TTTTTTTTTTTTTTT>
##$WBST= 2048
##$WBSW= 25
##$XGAIN= (0..3)
0 0 0 0
##$XL= 0
##$YL= 0
##$YMAX_a= 590196
##$YMIN_a= -492025
##$ZGOPTNS= <>
##$ZL1= 120
##$ZL2= 120
##$ZL3= 120
##$ZL4= 120
##$ABSF1= 14.98509
##$ABSF2= -5.573092
##$ABSG= 5
##$ABSL= 3
##$ALPHA= 0
##$AQORDER= 0
##$ASSFAC= 0
##$ASSFACI= 0
##$ASSFACX= 0
##$ASSWID= 0
##$AUNMP= <proc_prof1d_extract_pilot.lims>
##$AXLEFT= 0
##$AXNAME= <>
##$AXNUC= <1H>
##$AXRIGHT= 0
##$AXTYPE= 0
##$AXUNIT= <>
##$AZFE= 0.1
##$AZFW= 0.1
##$BCFW= 0
##$BC_mod= 0
##$BYTORDP= 0
##$COROFFS= 0
##$CY= 15
##$DATMOD= 1
##$DC= 0
##$DFILT= <>
##$DTYPP= 0
##$F1P= 0
##$F2P= 0
##$FCOR= 0.5
##$FTSIZE= 32768
##$FT_mod= 6
##$GAMMA= 0
##$GB= 0
##$INTBC= 1
##$INTSCL= 1
##$ISEN= 128
##$LB= 0
##$LEV0= 0
##$LPBIN= 0
##$MAXI= 10000
##$MC2= 0
##$MEAN= 0
##$ME_mod= 0
##$MI= 0
##$NCOEF= 0
##$NC_proc= -8
##$NLEV= 6
##$NOISF1= 0
##$NOISF2= 0
##$NSP= 0
##$NTH_PI= 0
##$NZP= 0
##$OFFSET= 14.98509
##$PC= 1
##$PHC0= 90.802
##$PHC1= 0
##$PH_mod= 1
##$PKNL= yes
##$PPARMOD= 0
##$PPDIAG= 0
##$PPIPTYP= 0
##$PPMPNUM= 2147483647
##$PPRESOL= 1
##$PSCAL= 4
##$PSIGN= 0
##$PYNMP= <proc.py>
##$REVERSE= no
##$SF= 400.02
##$SI= 32768
##$SIGF1= 0
##$SIGF2= 0
##$SINO= 400
##$SIOLD= 32768
##$SPECTYP= <>
##$SREGLST= <1H.CDCl3>
##$SSB= 0
##$STSI= 32768
##$STSR= 0
##$SW_p= 8223.68421052631
##$SYMM= 0
##$S_DEV= 0
##$TDeff= 65536
##$TDoff= 0
##$TI= <>
##$TILT= no
##$TM1= 0
##$TM2= 0
##$TOPLEV= 0
##$USERP1= <user>
##$USERP2= <user>
##$USERP3= <user>
##$USERP4= <user>
##$USERP5= <user>
##$WDW= 1
##$XDIM= 32768
##$YMAX_p= 432912964
##$YMIN_p= -683119
##$CURPLOT= <Network HP LaserJet P1505>
##$CURPRIN= <$Network HP LaserJet P1505>
##$DFORMAT= <normdp>
##$LAYOUT= <+/1D_H.xwp>
##$LFORMAT= <normlp>
##$PFORMAT= <normpl>
##$SURQMSG= 1
$$ End of Bruker specific parameters
$$ ---------------------------------
##NTUPLES= NMR SPECTRUM
##VAR_NAME=  FREQUENCY,     SPECTRUM/REAL,   SPECTRUM/IMAG
##SYMBOL=    X,             R,               I
##VAR_TYPE=  INDEPENDENT,   DEPENDENT,       DEPENDENT
##VAR_FORM=  AFFN,          ASDF,            ASDF
##VAR_DIM=   32768,         32768,           32768
##UNITS=     HZ,            ARBITRARY UNITS, ARBITRARY UNITS
##FACTOR=    0.250966925370066, 1,           1
##FIRST=     8223.43324360094, -153056,      -210968
##LAST=      0,             -314174,         -53339
##MIN=       0,             -683119,         0
##MAX=       8223.43324360094, 432912964,    0
$$ Real data points
##PAGE= N=1
##DATA TABLE= (X++(R..R)), XYDATA
$$ [...]
19497H6268b44488a2849A65629d2362H7606i6975l22315h5135I6163J64026m709
19486B55480a20283M4570n7968C1178Q5872b63717L7955B07909E911K18323j9527
19475B04707g1461n34724a17764K7626j91587A8701b65409H0727g9616A21418
19464g5085c3327k11607M6210B86810g5010L5444j0254j29334G4023o157o143
19453F1723b72655a33820I7585J07907a78462j39913A26164b3753k09753A37281
19442g6195k35332a04146j54496k9233L8868P8871J8599D09760g3654K8744j75329
19431b20239h6190j41189A72488k0490i2888C9130b12124l3348f8656l1592o1620
19420a61868C3286c49627h0442r0478P6232G1468c7005N310r4065l084b2186F4099
$$ plain form
19497 86268 -244488 -12849 165629 -42362 87606 -96975 -419290 -85135 96163 260189 255480
19486 255480 -120283 -75713 -133681 31178 117050 -263717 -225762 207909 5911 224234 204707
19475 204707 -71461 -606185 -117764 -90138 -281725 18701 -265409 80727 -79616 121418
19464 -75085 -33327 -244934 -198724 286810 -75010 -39566 -49820 -179154 74023 67866 61723
19453 61723 -272655 -133820 97585 205492 -178462 -318375 126164 -23753 -233506 137281
19442 -76195 -311527 -104146 -258642 -287875 -249007 -170136 -151537 409760 -73654 -44910 -220239
19431 -220239 -86190 -227379 172488 151998 -92888 39130 -212124 -245472 -68656 -100248 -161868
19420 -161868 33286 -349627 -80442 -170920 -94688 71468 -37005 -31695 -125760 -128844 -22186 64099
19407a13905B15179b08150K0421m262A35956a96580j89075g9470K3284m4568j25644
19396b26398B5257c77710b9958F219J27298B7931b88383J14623B65758c88636
19385a86348A7740O457a56651f2780A56118c99062d6754A53356b56499g6650K7470
19374d9180C8057a8761l82949b0880m8538B79234b51166n0619C24120c41196h0279
19362c30424d7939E6267l05k3445h2004j62194a2177j39099l950B9133a57399
19350a80739L4666F0351b87030h4667B8939a42820d1560k5183G1417e5250a5006
19338d89997H9772o484e8957l09464d2121l12376A08792O6095b2406j85929L1913
19327a76422E8722K11755b08832g2758m3086o4506M1752c5792m1350k46817f4112
$$ plain form
19407 -113905 215179 -208150 -187729 -191991 135956 -196580 -385655 -79470 -56186 -100754 -226398
19396 -226398 25257 -377710 -29958 6219 133517 27931 -288383 -173760 265758 -388636
19385 -186348 17740 24197 -156651 -62780 156118 -399062 -46754 153356 -256499 -76650 -49180
19374 -49180 38057 -18761 -401710 -20880 -69418 279234 -251166 -301785 324120 -341196 -80279
19362 -330424 -47939 56267 55962 32517 -82004 -244198 -12177 -151276 -155226 29133 -157399
19350 -180739 -146073 60351 -287030 -84667 28939 -142820 -41560 -66743 71417 -55250 -15006
19338 -489997 89772 83288 -58957 -368421 -42121 -354497 108792 174887 -22406 -208335 -176422
19327 -176422 58722 270477 -208832 -72758 -115844 -180350 -138598 -35792 -77142 -323959 -64112
19315c15286R841B25128a11621J8497F6728a23917M6206B26313a41973r593A30462
19303a68457E0267e973j78117M7097n2456g5171j27531i8836L5905I5894b68089
19291a49161D0222K63464g6074q9141O1261q7475D7756b26934H5329K02020a5721
19279a91457d3273B27112b0838k6422q4502j17021b8692j058j09437j79970A17890
19267a18916I4330a29532H3857B2292a70970F4546k4587b34240a11045H7220b92590
19255a04079J7944j10453b7058I3336e9507j40958G0887a77102e404k74975R0758
19244a89621B54382A8059M6752J23978b63326e0873p9409E6861N6447d7693G9455
19232D12438B6106b80328d791A53967b06156A88681P4316A24197J40220a14177
$$ plain form
19315 -315286 -305445 225128 -111621 -93124 66728 -123917 -77711 226313 -141973 -151566 130462
19303 -168457 50267 -5973 -184090 -136993 -189449 -75171 -202702 -98836 -62931 95894 -268089
19291 -149161 40222 303686 -76074 -165215 -103954 -191429 47756 -226934 85329 287349 -15721
19279 -191457 -43273 227112 -20838 -47260 -131762 -248783 -28692 -29750 -139187 -319157 117890
19267 -118916 94330 -129532 83857 22292 -170970 64546 39959 -234240 -111045 87220 -292590
19255 -104079 -86135 -196588 -27058 93336 -59507 -200465 70887 -177102 -5404 -280379 -189621
19244 -189621 254382 18059 64811 188789 -263326 -50873 -130282 56861 113308 -47693 79455
19232 412438 26106 -280328 -4791 153967 -206156 188681 262997 124197 264417 -114177
19221I5573L7628J20602g9421b6983p752m7686A27764c2490j77639m2335a03619
19209h8517A6519a27097B1984J40071a97423b380A04803f0150r7977D0041a05237
19197A44335a20788H591g1487a1603j94820h501m5641j23522q7894R1061P106
19186a67391G4228J7735a20950n2167I8570l8711c1783o6701B00019b46343A05698
19174b66161p3454I5020f6327A71019a33458L3926D1008d0793F4762J4668J21113
19163B00543a11835j23491B59287D2003J51057A6591b85481a40211J8103A76792
19152b8223m5823A86911a84665N3906J9055B94945e801k22587M4003j1238A50348
19140f6j74670F9450h9765q9741p9203A07060B9077D89L8875a66947B08745D9500
$$ plain form
19221 95573 133201 253803 -79421 -26983 -34735 -82421 127764 -32490 -210129 -252464 -103619
19209 -88517 16519 -127097 21984 162055 -197423 -2380 104803 -60150 -158127 40041 -105237
19197 144335 -120788 8591 -71487 -11603 -206423 -8501 -54142 -177664 -265558 -174497 -167391
19186 -167391 74228 91963 -120950 -173117 98570 59859 -31783 -98484 200019 -246343 105698
19174 -266161 -339615 95020 -66327 171019 -133458 -99532 41008 -40793 64762 79430 200543
19163 200543 -111835 -235326 259287 42003 193060 16591 -285481 -140211 -122108 176792
19152 -28223 -74046 186911 -184665 -130759 -111704 294945 -5801 -228388 -184385 -195623 150348
19140 -66 -174736 69450 -89765 -179506 -258709 107060 29077 489 39364 -166947 208745 49500
19127G4061c03790B77342A8665R1680b27900n5528G6248j5936J27844B919e4210
19115E2696b07317j7225d6537j3311k78731A24530l9499b16888k2792Q5573E375
19103A22365c1006n2428B07942c01266I222c41188j18330a99933m5668R2697k04232
19092c57136A13095b14806P5156f4178q1480k9299A13010a63765B6156b77044
19081G9667R0206b86580A68915Q5915b3441d459j51984a6659D0696K03764b94709
19069a77522B8546a48823C309a99687q9403E7748f5876k74910a18360f386l01159
19058c07545B21351a47563k38737D6909G04d2070B246b44094D04b28895j7701
19047b46596A0956R3722B9103b18528B95252a15037J5081K1712A22716C3477h2275
$$ plain form
19127 74061 -303790 277342 18665 110345 -227900 -283428 76248 60312 188156 2919 -54210
19115 52696 -207317 -224542 -46537 -59848 -338579 124530 85031 -216888 -239680 -154107 5375
19103 122365 -31006 -83434 207942 -301266 9222 -341188 -459518 -199933 -245601 -152904 -357136
19092 -357136 113095 -214806 -139650 -64178 -145658 -174957 113010 -163765 26156 -277044
19081 79667 169873 -286580 168915 254830 -23441 -4459 -156443 -16659 40696 244460 -294709
19069 -177522 28546 -148823 3309 -199687 -289090 57748 -65876 -340786 -118360 -6386 -307545
19058 -307545 221351 -147563 -386300 46909 704 -42070 2246 -244094 404 -228895 -246596
19047 -246596 10956 104678 29103 -218528 295252 -115037 -99956 -78244 122716 33477 -82275
19035D9504b95894A01236A7013R302N0085C3739J35098b7192A69273b47687D1510
19023a62429B6721a83496A70812c7653q8815j78912B25106H9007b5798j3736j07976
19012a47510A70510h5154B94608a1292p1454k2815m4302j63399E9036a58830I4281
19000i9252H4048a56307C3067c40923C0919N3357g2762A35553a79577f9674A07030
18988A7450a66435p7901a18982k36694A77823e1172m900B7050C318P3229N7448
18977A33995a10662j83591i0797B29880b7406G1315J27672J38656P07310B01047
18966A6552J31576n8467J31062b31680A63149a0888C3720J98584e3471n6514j84891
18955b94876J23917A26058a93544B4978e278D4867a89608A77151f3259C589K71557
$$ plain form
19035 49504 -295894 101236 17013 26315 76400 33739 168837 -27192 169273 -247687 41510
19023 -162429 26721 -183496 170812 -37653 -126468 -305380 225106 89007 -25798 -39534 -147510
19012 -147510 170510 -85154 294608 -11292 -82746 -105561 -149863 -313262 59036 -158830 94281
19000 -99252 84048 -156307 33067 -340923 30919 84276 -72762 135553 -179577 -69674 107030
18988 17450 -166435 -244336 -118982 -355676 177823 -51172 -56072 27050 3318 76547 133995
18977 133995 -110662 -294253 -90797 229880 -27406 71315 198987 337643 1044953 201047
18966 16552 148128 89661 220723 -231680 163149 -10888 33720 232304 -53471 -109985 -294876
18955 -294876 -170959 126058 -193544 24978 -5278 44867 -189608 177151 -63259 3589 275146
18944B75146j03559c02875b5760j60608c8869q4038j07886g3530B04047b8231
18933a11050j18377F1759b33410D1892i9464G9926M68390B69392a92193B75588
18922a0017k43530L4581d9992j25978I0103G928J71519J8425F5993a62772g0702
18910B28445a94206K0889A77083K29790j6610j15934F9648a9765E6013O4561l3619
18899H6955c69015A06150k1026c58922a55156A18888R4142D4585i6235j2923N2175
18888e6983r8684H311c41101J53818F4835a24944M1685A77010d97471a99005h9430
18876A88749a17571j4236j2233j27972g106j70819D0489c1971r1839a5869j06047
18865a21916e6579l936o1007L7101p096I763d3342n6867q8176A73709b0962A27575
$$ plain form
18944 275146 171587 -302875 -25760 -186368 -38869 -122907 -230793 -73530 204047 -28231
18933 -111050 -229427 61759 -233410 41892 -99464 79926 548316 269392 -192193 275588
18922 -10017 -253547 -218966 -49992 -175970 90103 7928 179447 197872 65993 -162772 -70702
18910 228445 -194206 -173317 177083 406873 390263 274329 69648 -19765 56013 120574 86955
18899 86955 -369015 106150 85124 -358922 -155156 118888 213030 44585 -96235 -109158 -56983
18888 -56983 -155667 8311 -341101 -187283 64835 -124944 -83259 177010 -497471 -199005 -89430
18876 188749 -117571 -131807 -144040 -272012 -7106 -177925 40489 -31971 -123810 -15869 -121916
18865 -121916 -56579 -60515 -121522 -84421 -91517 9763 -43342 -100209 -188385 173709 -20962 127575
18852b92163a26355p353N6334A00750B2129J33522a82971a2913j65642A8678J32314
18841A50992j6246J9872e16590A49552b91580b3370j54773P6584p2622K3929O5008
18830h5244k649i325o9024a2804B30085a14380a6406j60732A72001c1347B1112
18818c3810j14054A81262B199J52167a09957m7226A82893F1125J68085p7407J2298
18807A64101M0259c3768q645A5104K7132J45879c73754a23617j07564o3219h211
18795H8254a09368D6573K6347h2851B74257a04964o7694E8335k3324M4044a64151
18783C140b49711J5929C5783b20296A46314n7910b35690I3427e7016H6022i9931
18771a05236A03465a30289b2517j88077c2158A8857b29894e1921B00513G3803
$$ plain form
18852 -292163 -126355 -133708 -77374 100750 22129 155651 -182971 -12913 -178555 18678 150992
18841 150992 134746 154618 -516590 149552 -291580 -23370 -178143 -101559 -174181 -150252 -85244
18830 -85244 -87893 -9325 -78349 -12804 230085 -114380 -16406 -177138 172001 -31347 21112
18818 -33810 -147864 181262 2199 154366 -109957 -157183 182893 61125 229210 151803 164101
18807 164101 204360 -33768 -42413 15104 42236 188115 -373754 -123617 -231181 -294400 -8211
18795 88254 -109368 46573 72920 -82851 274257 -104964 -172658 58335 35011 79055 -164151
18783 3140 -249711 -233782 35783 -220296 146314 88404 -235690 93427 -57016 86022 -99931
18771 -105236 103465 -130289 -22517 -210594 -32158 18857 -229894 -51921 200513 73803
18760b46675m6804N7809H0060b3948A89632c30895a60412J8401m971A88462a04626
18748b35079P7225D036L2083a88005C7009d1065A53790a6628I1275e2303D0870
18736A3922J45388a54437A27901d2956A39826A552a41557f3393A83692C4544b09148
18724c5147j92843g045A4693J90425q4957B6536a33458B09724b34424N5132b2506
18712B93698a29359j2313C53734F7352g6228b2349G7532q779b10620A20966a05836
18700d9834B4874d55450A24120e4646k21698a8331k63527A55314a07593j03547
18690b11140E5592F068J29024Q1554a54683l4858K6535A37883b68478E9085i0686
18678A12914c22358I9757h7932j04401h7382E3281c36691D1709f7310A47889L4316
$$ plain form
18760 -246675 -293479 -235670 80060 -23948 189632 -330895 -160412 -142011 -146982 188462 -104626
18748 -235079 -157854 4036 36119 -188005 37009 -41065 153790 -16628 91275 -52303 40870
18736 13922 159310 -154437 127901 -42956 139826 1552 -141557 -63393 183692 34544 -209148
18724 -35147 -227990 -7045 14693 205118 120161 26536 -133458 209724 -234424 -179292 -22506
18712 293698 -129359 -141672 353734 67352 -76228 -22349 77532 68753 -210620 120966 -105836
18700 -49834 24874 -455450 124120 -54646 -276344 -18331 -281858 155314 -107593 -211140
18690 -211140 55592 6068 135092 216646 -154683 -189541 -163006 137883 -268478 59085 -90686
18678 112914 -322358 99757 -87932 -192333 -87382 53281 -336691 41709 -67310 147889 182205
18667A82205i7480k18735F212a46221A2945a17479j5252L3783J4554k22950A45287
18655b38002b7729B0270J43030a00474H118c64313C18558b18891A49106c4038
18644c47023b8623J3939G4851A1832b54879Q2834j20596B4775R2435h6392k91627
18633c78019D1933a13786c7458o2868B40185a40451j46341J12870B61000b7746
18622a15816F3309J65779q363a77737C6277L4817f7443q833A17276m8098c7412
18610f9783E1350a8666C33484h4741j41766e1936i471j07954a6923q063o4146
18599h9132n3664j980G5706c54728A1538K94319b09215a6585j5936a3460k47268
18588b60728k9256n1561a56042A76826c81287N8639O2044c784B6739J9053K795
$$ plain form
18667 182205 -97480 -316215 6212 -146221 12945 -117479 -132731 -98948 -84394 -307344 145287
18655 -238002 -27729 20270 163300 -100474 8118 -364313 318558 -218891 149106 -34038
18644 -347023 -28623 -14684 74851 11832 -254879 -172045 -292641 24775 117210 -86392 -378019
18633 -378019 41933 -113786 -37458 -100326 240185 -140451 -286792 -173922 261000 -27746
18622 -115816 63309 229088 220725 -177737 36277 71094 -67443 -76276 117276 69178 -37412
18610 -69783 51350 -18666 333484 -84741 -226507 -51936 -9471 -117425 -16923 -24986 -89132
18599 -89132 -142796 -144776 75706 -354728 11538 305857 -209215 -16585 -32521 -13460 -260728
18588 -260728 -289984 -341545 -156042 176826 -381287 -322648 -260604 -3784 26739 45792 48587
18577D8587b65244A59185c3124A26612e8812k10364K336b6941n1402C64894j80728
18566A84166a09748c3998m31284d6077K0287A8501J87600n8589c8408A44045d9446
18554A8260a3766A1798h1053q2109p7832P3059g3621F9368C555e1118j42079b9419
18541A11413i8574p2918A07075c10352A38096C6899a32948C84911c03452B92354
18530G137a96718A53897b66118A35007a23716A29609a39513J107b2347F0989a29469
18518a12277q6007H1087k6642K3280i5462b2295j57009A92408b27395A42319E8794
18506A29902n5304e1710G2655d02839h8657j34176J05131C56844I8810a25855
18495D012a23731j91234m798a2631E7454J15343a48891k80280h3435H3087h738
$$ plain form
18577 48587 -265244 159185 -33124 126612 -58812 -269176 -266840 -26941 -78343 364894 184166
18566 184166 -109748 -33998 -465282 -46077 -25790 18501 206101 147512 -38408 144045 -49446
18554 18260 -13766 11798 -81053 -163162 -240994 -167935 -73621 69368 3555 -51118 -193197 -29419
18541 111413 -98574 -171492 107075 -310352 138096 36899 -132948 384911 -303452 292354
18530 7137 -196718 153897 -266118 135007 -123716 129609 -139513 -138406 -22347 60989 -129469
18518 -112277 -198284 81087 54445 77725 -95462 -22295 -179304 192408 -227395 142319 58794
18506 129902 74598 -51710 72655 -402839 -88657 -222833 -117702 356844 98810 -125855
18495 4012 -123731 -314965 -319763 -12631 57454 172797 -148891 -429171 -83435 83087 -8738
18483a24030q8912e971Q07A93683c3293D9411J03407a70097n6271i6852j0642
18472a07494G6128b62904k7523g0193K0461p2516A33982c10385a22310P9A08209
18460A55804B2737J96496C0397O53a45758A33655k6135b12845A11136h0266B24622
18448b49194J22713C17294I1538b4405I2598a95722m9636I0897b27090H604J1165
18437A9769g2019n8852B4303b96651c6610I8260J38009j09026i8959M2391q1105
18426a37673c1215A29227e8775o15E7174A9956a63360g5659j93785A01210b80217
18414B21163G6125a25787j04466h5024B57426a17580A55819i7580C5422j1742
18404B3680c4770C44243A19391J46513d0844n2845r0142B09698m5661N4344O285
$$ plain form
18483 -124030 -212942 -5971 -5164 193683 -33293 49411 152818 -170097 -226368 -96852 -107494
18472 -107494 76128 -262904 -290427 -70193 -49732 -122248 133982 -310385 -122310 -122231 108209
18460 155804 22737 219233 30397 31050 -145758 133655 107520 -212845 111136 -80266 224622
18448 -249194 -126481 317294 91538 -24405 92598 -195722 -245358 90897 -227090 8604 19769
18437 19769 -72019 -130871 24303 -296651 -36610 98260 236269 127243 -98959 -56568 -137673
18426 -137673 -31215 129227 -58775 -59390 57174 19956 -163360 -75659 -269444 101210 -280217
18414 221163 76125 -125787 -230253 -85024 257426 -117580 155819 -97580 35422 23680
18404 23680 -34770 344243 119391 265904 -40844 -93689 -183831 209698 164037 218381 224666
18393B24666C8937J34354F3837Q6356b07117A12248g138j12656k10730d630G8802
18381b60767l7832a6869A8883e1912B51719a87856A51429b64976J17028m4476
18371a92424O3058J4689j20423C5525J56271j4287b00432E3446k4822g8172l5558
18360a13730I0815C5746b35505F4008a56981d3087C66763p1768f7136G8999c4882
18348i4814d2341k37544d049k95588A51214a13572r7210A10201C5899K70086A42730
18336d1273r9056B06320a46544A89395c03341J33942B03426b06285a4135k03815
18326b17950C65190a66790C3575c60127J42444B1967R4429c284j60428k724g2463
18314B44386c69731B18535a33824m9639m633L8715k4068f7174j3023B9126c28407
$$ plain form
18393 224666 38937 173291 63837 150193 -207117 112248 -7138 -119794 -330524 -4630 78802
18381 -260767 -298599 -16869 18883 -51912 251719 -187856 151429 -264976 -147948 -192424
18371 -192424 -129366 -114677 -235100 35525 191796 177509 -200432 53446 28624 -78172 -113730
18360 -113730 90815 35746 -235505 64008 -156981 -43087 366763 294995 -67136 78999 -34882
18348 -94814 -42341 -279885 -4049 -299637 151214 -113572 -210782 110201 35899 305985 142730
18336 -41273 -140329 206320 -146544 189395 -303341 -169399 203426 -206285 -14135 -217950
18326 -217950 365190 -166790 33575 -360127 -217683 21967 116396 -3284 -163712 -166436 -72463
18314 244386 -369731 218535 -133824 -183463 -188096 -149381 -173449 -67174 -80197 29126 -328407
18302E8413K20389a31914j30528j83085B39203d8007k38984D5906d8660p7116
18292a25776a2710k4032G7812N6346c36758l0556d6073B38364a30973g891p0389
18281g8280B57501a78174A17417l2622G057c25171i4080K3832L1630B1846K0677
18270D2523b2136j45354J018A08780g4525l7959j29132B7000c2659j18208d5674
18258F4435A4604L84c13502e0085H7503b38357d2846p1207E8553a06139Q205a1228
18245B28570p4219a44794E2783J13680d9973k17086c5139A1462K24791n3694B7933
18233H8623K5378C2995p061J01089c9801j36342A93230a53230N2749J4491p8671
18222a64661C4445a47420H5468b06886O1816A48914e3096j61122B5878J67906
$$ plain form
18302 58413 278802 -131914 -262442 -445527 239203 -48007 -286991 45906 -48660 -125776
18292 -125776 -12710 -36742 77812 134158 -336758 -367314 -46073 238364 -130973 -7891 -78280
18281 -78280 257501 -178174 117417 84795 7057 -325171 -94080 -70248 -38618 21846 42523
18270 42523 -22136 -167490 -166472 108780 -74525 -112484 -241616 27000 -32659 -150867 -45674
18258 64435 14604 14988 -313502 -50085 87503 -238357 -42846 -114053 58553 -106139 -97934 -11228
18245 228570 154351 -144794 52783 166463 -49973 -267059 -35139 11462 236253 182559 27933
18233 88623 114001 32995 25934 127023 -39801 -176143 193230 -153230 -100481 -85990 -164661
18222 -164661 34445 -147420 85468 -206886 -145070 148914 -53096 -214218 25878 193784
18212A93784a40410d4010k05707j82274A01491a42715A04441c78298O980d0192
18201a90238f8766p2054C36898b12682A00516a99655B65233A17356J22125h2046
18190G5199B4951R5405b5823J1096I870c48771a04506C433K05932q3084P7555
18179B03836J940c5555k19071I9229f7035B6240e12071J87315F2727A9817J30568
18168A50385c1499r205H8276a68817C6302a85044m2304A65676d7488I0564a91876
18156a53770C20353h7476L294A66509h8405A0056J05182B9771L66114b34602B55393
18144e4933A80274M1147a03252A90044p9664j3821L6273J66891J613b20941R5684
18133a25257r1718k30847J98122l8031O2226M4577A8311a79349L5229I5623M920
$$ plain form
18212 193784 -140410 -44010 -249717 -431991 101491 -142715 104441 -378298 -371318 -40192
18201 -190238 -68766 -140820 336898 -212682 100516 -199655 265233 117356 239481 -82046
18190 75199 24951 120356 -25823 -14727 9870 -348771 -104506 3433 209365 126281 203836
18179 203836 205776 -35555 -254626 99229 -67035 26240 -512071 -324756 62727 19817 150385
18168 150385 -31499 -40704 88276 -168817 36302 -185044 -227348 165676 -47488 90564 -191876
18156 -153770 320353 -87476 -84182 166509 -88405 10056 115238 29771 395885 -234602 255393
18144 -54933 180274 221421 -103252 190044 110380 96559 132832 299723 301336 -220941 -125257
18133 -125257 -216975 -447822 -249700 -287731 -225505 -180928 18311 -179349 -144120 95623 100543
18122A00543A6811b00353i3191a4721I9957a03232b8652G4944b61246A58763a84307
18110b14894B21781a87041c0269A77641b42524A05207b44494A91817H74e0073
18099A7771i1286j9340A23059a05949A73685A3531h8686B43984a06064B4385J15371
18088A39756C0276g6093B37569b93531B57971b02336C1978L4597a40915B62347
18077E2768a64692F701i1464B58597A13282j1315R8774c58955c7758A8323K9295
18066D7618A3830b88600h2989a7050F672c5970J2926m9028a5723n2136D4875h8904
18053B28193a56198f9412j5720j92473P4317N8242A18688a79095O353j21941a45214
18041f555D32380F9217K1236i6319A26433B2828a60944E8143j1784N3946a16031
$$ plain form
18122 100543 16811 -200353 -93191 -14721 99957 -103232 -28652 74944 -261246 158763 -184307
18110 -214894 221781 -187041 -30269 177641 -242524 105207 -244494 191817 874 -50073
18099 17771 -91286 -110626 123059 -105949 173685 13531 -88686 243984 -106064 24385 139756
18088 139756 30276 -76093 237569 -293531 257971 -202336 31978 66575 -140915 262347
18077 52768 -164692 6701 -91464 258597 113282 101967 200741 -358955 -37758 18323 47618
18066 47618 13830 -288600 -82989 -17050 6672 -35970 -23044 -72072 -15723 -67859 44875 -88904
18053 228193 -156198 -69412 -85132 -277605 -203288 -145046 118688 -179095 -172742 -294683 -145214
18041 -6555 432380 69217 90453 -96319 126433 22828 -160944 58143 46359 100305 -116031
18029a10675A38005h758A02594B706a90100A66580A1076a69751B10086J31166
18019C41252c27470B43692a05338N1617H4032N8754c23048a43383B85127a22618
18008A58087a52922F4067B4427M3854N8589M4900q2351b66828A53951D431a90331
17996B4525c34124B20619e3801A49243P1155A2295J06174J49038a16540A44417
17985b38122C2781K64703g2084G0473K11529e1682J6240B2662c0077H9529C8389
17973A09526b9288k01106A6112a30801f1844q2686G5753a65961o0235J9361A5538
17961g0869a0700n0634I2804e1351A65764a57206A34736R5495b74840f0897A84851
17949F3540f2779F9297b9948a2325n2985j49764I2751d1971m0536n4157c2982
$$ plain form
18029 -110675 138005 -8758 102594 2706 -190100 166580 11076 -169751 210086 341252
18019 341252 -327470 243692 -105338 -53721 84032 142786 -323048 -143383 285127 -122618
18008 158087 -152922 64067 24427 68281 126870 171770 89419 -266828 153951 4431 -190331
17996 24525 -334124 220619 -53801 149243 220398 12295 118469 267507 -116540 144417
17985 -238122 32781 297484 -72084 70473 282002 -51682 -35442 22662 -30077 89529 38389
17973 109526 -29288 -230394 16112 -130801 -61844 -144530 75753 -165961 -226196 -206835 15538
17961 -70869 -10700 -61334 92804 -51351 165764 -157206 134736 230231 -274840 -60897 184851
17949 63540 -62779 69297 -29948 -12325 -65310 -215074 92751 -41971 -82507 -136664 -32982
17937f5717A47030n1011a04441k39444a6137B25384g5001B11027Q6793A44366
17926c91999B20165F8368J64494A12980N9977F5043a49139a5714F8094h8047F672
17914A52980b43674a01127B72099a24528p8250l2004a5993C067f2030q5693j17850
17903b65573B5271d725j43355k4308a0912E264a43449f5794k65268a47074j61705
17892c08779I373K37560J60390I5385Q4973a99394b0155C465b7187B17443e3617
17880A09563A3746P20b37261A71768l1049b30751G6136a90079I3261k9247a83799
17868g2413b9297m2804r0136c5320B08451N1299o9215a3954c939j6377C24300
17856d3446a1821A65623O2937j12829i9041c4376j10271k2557a2877A9741a81805
$$ plain form
17937 -65717 147030 96019 -104441 -343885 -16137 225384 -75001 211027 297820 144366
17926 -391999 220165 68368 232862 112980 172957 65043 -149139 -15714 68094 -88047 6672
17914 152980 -243674 -101127 272099 -124528 -202778 -234782 -15993 3067 -62030 -147723 -265573
17903 -265573 25271 -4725 -148080 -172388 -10912 5264 -143449 -65794 -331062 -147074 -308779
17892 -308779 9373 246933 407323 95385 180358 -199394 -20155 3465 -27187 217443 -53617
17880 109563 13746 14466 -237261 171768 140719 -230751 76136 -190079 93261 64014 -183799
17868 -72413 -29297 -72101 -162237 -35320 208451 259750 190535 -13954 -3939 -20316 324300
17856 -43446 -11821 165623 228560 115731 -99041 -34376 -144647 -167204 -12877 19741 -181805
17844B6614J54371a9069D7199M2797g6780j6927C4952P2385n0366a18189A97387
17832e0454b2307k0447p9118B62713f8824o9917o6728A28750C7523K67963A10453
17820B85803H1823J27681j01048c91797H9609a32798j0710A26973A7901J65845
17810A83746n3878a31495B42937a12555q0321C9121O0443M4424a50601j18781
17800b69382A31912I114N7659O4536O8234M7013k3981D5587j2205J02800b80372
17788c3917D334J74744R250F9053M1956l3292h0107B20882R7195F7921L48817
17777D16738e4475D3912b61653F7493J09429D8969J35175M7548r9290c6634q55
17766c7489I6544a08018d1949k66759F0311K57913n9845L03254D9246J94704q4328
$$ plain form
17844 26614 180985 -19069 47199 89996 -76780 -93707 34952 107337 56971 -118189 197387
17832 -50454 -22307 -42754 -121872 262713 -68824 -138741 -205469 128750 37523 305486 110453
17820 285803 81823 209504 108456 -391797 89609 -132798 -143508 126973 17901 183746
17810 183746 129868 -131495 242937 -112555 -192876 39121 99564 143988 -150601 -269382
17800 -269382 131912 9114 66773 131309 199543 246556 222575 45587 33382 136182 -280372
17788 -33917 4334 179078 188328 69053 111009 77717 -80107 220882 318077 67921 416738
17777 416738 -54475 43912 -261653 67493 176922 48969 184144 231692 132402 -36634 -37489
17766 -37489 96544 -108018 -41949 -308708 60311 318224 258379 561633 49246 243950 159622
17755A59622B2643a69615H9390N528a809o9790F4109e1302A44995c27381C23756
17743D8847K28163n8353o2235i2786B8710J95488J11983A28539E6828J98303a6096
17731D40558B03692L140J24095c22266A4963J16136F4571b98915C05200a32095
17720B38036j06392O4169a47447a3121q5711D58270G2366e9936e737B98739A39874
17708B8757d25103H3333b10995f41C03447M3949j0010A42102Q8387k6897r9260
17697A04332J1757J21987d0689j00688b0399j77009A54566a87676A0125J45939
17687A56064a5478B20234C5746a21279A78547L7675b1703G2385N8160d4877p12
17676d5589o0867B27681g9951j04813g8857j06456d3557C50218A5283a46756m8633
$$ plain form
17755 159622 22643 -169615 89390 94918 -1809 -71599 64109 -51302 144995 -327381 323756
17743 48847 277010 218657 156422 -92786 28710 224198 336181 128539 56828 255131 -16096
17731 440558 203692 206832 330927 -322266 14963 131099 64571 -298915 305200 -132095
17720 238036 131644 195813 -147447 -13121 -98832 458270 72366 -59936 -5737 298739 139874
17708 28757 -425103 83333 -210995 -641 303447 347396 337386 142102 230489 203592 104332
17697 104332 116089 238076 -40689 -141377 -20399 -197408 154566 -187676 10125 156064
17687 156064 -15478 220234 35746 -121279 178547 216222 -21703 72385 130545 -44877 -45589
17676 -45589 -106456 227681 -79951 -184764 -78857 -185313 -43557 350218 15283 -146756 -195389
17665a95389d7574g670l7833B71204N4777l4902j17483k0662l1743k5743B3380
17653b07225B37974j17015K7083f5922A44782q844J4089j1823K0081J05201m1600
17642B21886C4258f6912c2089H2116C8763c39897B0926d3328j6199k2624C53597
17630h7548A89973h0664J2534b9533l1440B12724a27583B55796A07657D9744K50201
17619B99945A41219C2022a26713C10308A50141c18385F9874K5181J39568j16867
17609A17756J37582p6258J26139c5535G7243L81173D9600M75850A77369a1642
17598B26901c45708A89640a07900k9049J5890A20323Q0384C4952b7271C68812
17587B10811A2817h4697B7752J9491K06584a94776I9273p86J18361K8925a79878
$$ plain form
17665 -195389 -47574 -7670 -45503 271204 325981 291079 173596 152934 121191 95448 23380
17653 -207225 237974 120959 148042 -65922 144782 135938 150027 138204 158285 263486 221886
17642 221886 34258 -66912 -32089 82116 38763 -339897 20926 -43328 -59527 -82151 353597
17630 -87548 189973 -80664 -68130 -29533 -60973 212724 -127583 255796 107657 49744 299945
17619 299945 141219 32022 -126713 310308 150141 -318385 69874 95055 234623 117756
17609 117756 255338 179080 305219 -35535 77243 458416 49600 525450 177369 -11642
17598 226901 -345708 189640 -107900 -136949 -121059 120323 200707 34952 -27271 368812
17587 210811 12817 -84697 27752 47243 253827 -194776 99273 98487 216848 245773 -179878
17575d0394A96955F5939L20748j88196p6245e0454E2144L22092j74198R7511a44023
17563C24545j19400a25694B44405m8752c6706C46320l0082G9669N15069A56039
17552B90230G6032g2936C2704I41J76640K92147g9921A2509P4651k4612K87860
17541C50408k5423p1117L51245a06800B69587P5486Q8679i819B24965k9444l2811
17530A62710J30909n5234O69672C64110L85848J34109J2963K06352n9638k10726
17520H33018j67697B49233j20948M06413k63362K29033a4223B99569J73689L72069
17510H45327q529j07094K54145q4362k34169k41936J48754J20280k43914n8205
17500C90297m3196l9372k3703K16299A19360O4967P9579n0037K17534A75280J9613
$$ plain form
17575 -40394 196955 65939 386687 198491 122246 -50454 52144 374236 200038 297549 -144023
17563 324545 205145 -125694 244405 195653 -36706 346320 316238 79669 594738 156039
17552 290230 76032 -72936 32704 941 177581 469728 -79921 12509 87160 62548 350408
17541 350408 324985 253868 605113 -106800 269587 345073 433752 -9819 224965 195521 162710
17530 162710 293619 238385 908057 364110 749958 884067 897030 1103382 1043744 833018
17520 833018 665321 249233 128285 534698 271336 500369 -14223 299569 473258 845327
17510 845327 836798 729704 983849 899487 665318 423382 572136 692416 448502 390297
17500 390297 347101 307729 284026 500325 119360 184327 263906 213869 431403 175280 194893
17489A94893J23948J43828B28248K02126j88647O6487J15635D1271K94113K51751
17479E87135B87091J14161A72661L01756D5192O01436j78318K2131j47288J64266
17469E07419A32980J82701q0247L22361A17000K05858G3994K40897d2997A35723
17458D78226D0448L01060K43023k85541o7131r9400K64022L0240A32542r491L21476
17447D44527J66029p0476j34691j16263J09532K1026K11874k88288r9505J24783
17437C68548q2705A31470K05908K93625k21928A70553M1838L5417j4839J91714
17427D24683N0275A13578e3050F04297A72470J30332l2549m398J12703J26796
17417E05354A91713M05975F2336M45965k24895L36249j67707J64717Q9536k97729
$$ plain form
17489 194893 318841 462669 228248 430374 241727 308214 423849 41271 335384 587135
17479 587135 287091 401252 172661 474417 45192 646628 468310 490441 343153 507419
17469 507419 132980 315681 235434 557795 117000 322858 73994 314891 -42997 135723
17458 478226 40448 341508 584531 298990 231859 132459 396481 426721 132542 123051 444527
17447 444527 610556 540080 405389 289126 398658 419684 631558 343270 243765 368548
17437 368548 285843 131470 337378 631003 409075 170553 212391 247808 232969 424683
17427 424683 474958 113578 -53050 604297 172470 302802 270253 265855 378558 505354
17417 505354 191713 597688 62336 508301 283406 619655 451948 616665 706201 408472
17407D08472j59672p6509C4204J69888J97682j9583p5896j30334K53966f6885
17396F1073L20247H9764J82272Q7598j14780a4400C63685A37573J10097K11504
17386D59174j20375b38243E96057B32196j08557J54068J30626p7311P717O6553
17376D05292L2743L4959k06032o074A29456r881K21281p6411j22203P6349B2781
17364E03813A8190K31911J7918K70835B02313m846o6936a6873C43620k8526I2046
17352D8720J34016J40288P5809j79768m2412J99127L6905a30276N5241A51578
17341c9475B34243L6064l7924n0851C8290J44665R3355J36171A40460Q9366P6521
17330C06347J11566r107F6402N9080K08189j65528K29129F7161M03243A82477
$$ plain form
17407 408472 248800 172291 34204 204092 401774 382191 306295 175961 429927 -66885
17396 61073 381320 89764 272036 359634 244854 -14400 363685 137573 247670 459174
17386 459174 338799 -238243 596057 232196 123639 277707 408333 331022 338739 405292
17376 405292 438035 472994 266962 260888 129456 119575 340856 264445 142242 218591 22781
17364 503813 18190 250101 268019 538854 202313 197467 130531 -16873 343620 315094 92046
17352 48720 182736 323024 398833 219065 176653 375780 412685 -130276 -75035 151578
17341 -39475 234243 270307 232383 181532 38290 182955 276310 412481 140460 229826 306347
17330 306347 417913 408806 66402 125482 333671 168143 397272 67161 470404 182477
17319C55034K8449j15526K62502k36647K60654G0195L09533O8574Q1187n4597
17309D74892k19243J56592P372J0898j16897L170J40373j08104L9374j20081K8798
17298B97144J66986k16126J91646F7766J53249L40043B76185a4720F07326H6763
17287C56847D7812L72792N458j39455A19000K52347A55709K34173j53559E1552
17276B64576j26584N19507B04959J09057j17182J68757j21364P96494A40209C7747
17265D68130J27720k56433c2630D72585l9133j55472J81368q8902J18220j45813
17255C42853J8894J29183B12271g0462C08424p0809L41392k52583R8582j91394
17245B33612J79276K88257D6388K40126l616l8660J42701O5150l5831D7681M83546
$$ plain form
17319 355034 383483 267957 530459 293812 554466 70195 379728 448302 529489 474892
17309 474892 255649 412241 419613 430511 313614 316784 457157 349053 388427 268346 297144
17298 297144 464130 248004 439650 67766 221015 561058 276185 -14720 607326 86763
17287 356847 47812 420604 426062 286607 119000 371347 155709 389882 236323 51552
17276 264576 137992 657499 204959 314016 196834 365591 244227 1040721 140209 37747
17265 468130 595850 339417 -32630 472585 433452 277980 459348 370446 488666 342853
17255 342853 361747 490930 212271 -70462 308424 237615 579007 326424 425006 233612
17245 233612 412888 701145 46388 286514 282898 244238 386939 452089 416258 47681 531227
17234E31227j87025O6127p6320A41465K82934l3493j05578K8038M19447B96975
17223H6913M01372j8543A08095K38146j560R8302J49537j58066p9461J32551B14812
17211B19124L83284B91954K8926K50948j55254j1749R2790A98858K59038j5700
17201D42196q800J59661j35712j28655J41942J50253j68209p2376M4792J22813
17191E47905F8181N86868p4883j93750K4890R7789M3609j08143l0398M12753C71511
17179C32997J35461j22336J10234O7385j57327J07651k03140Q759K12554j913
17169D90325K44632r8755K25117k72441k16905K62147q701B71332N61104C15617
17158D42952J47396j65275M25609C73528K49832j03879k8516q1507Q9304J57391
$$ plain form
17234 531227 344202 410329 334009 141465 424399 390906 285328 313366 732813 296975
17223 86913 488285 469742 108095 346241 344681 442983 592520 434454 354993 487544 214812
17211 219124 602408 291954 320880 571828 416574 404825 497615 198858 457896 442196
17201 442196 433396 593057 457345 328690 470632 620885 452676 380300 425092 547905
17191 547905 68181 655049 580166 386416 411306 509095 552704 444561 414163 826916 371511
17179 332997 468458 346122 456356 523741 366414 474065 270925 279684 492238 490325
17169 490325 734957 636202 861319 588878 371973 634120 625419 271332 832436 315617
17158 442952 590348 425073 850682 373528 623360 519481 490965 409458 498762 656153
17148F56153k57654J43364R807J67960C15561K60300K46040K8727l10011j32961
17138D07656K52248n8204J73446m0691j6204k69415j1067K39611j44581K87588
17128H20387q056j54122r0017j13819M04744k93434N0131k04543J35506K93401
17118H40178l31854M05487l28597K33497k26581p8507L90563j90075K13297m47224
17108D80184J83196N2908k40834K46105q3885J21360J07719j49363J01270p870
17098H10790N0989j77388C19428J02856L28326J05305j3530j76636l6384K00494
17088H29859l9458j91325K45867R4944n356j49749J24107k7976K8376p4465l22562
17077E12262L60119k50398K06734R9110J2363o0918m7180k04238N08487r0049
$$ plain form
17148 656153 398499 541863 551670 719630 315561 575861 821901 850628 540617 407656
17138 407656 659904 601700 775146 734455 718251 448836 437769 677380 532799 820387
17128 820387 812331 658209 568192 454373 859117 565683 615814 411271 546777 840178
17118 840178 508324 913811 585214 818711 592130 513623 904186 714111 927408 480184
17108 480184 663380 716288 475454 721559 637674 759034 866753 717390 818660 810790
17098 810790 861779 684391 319428 422284 750610 855915 842385 665749 629365 829859
17088 829859 790401 599076 844943 939887 934531 784782 908889 880913 909289 834824 512262
17077 512262 872381 621983 828717 927827 940190 879272 832092 627854 1136341 1046292
17067A046292j98246n8909L22691q9881l09580K69812j10717l8736M36701l11730
17057I57697k68656N750M27160k66450J89737J34398j34575j07916J92510j57534
17047I72121p0050k25543L61254R3855N3675l10085k8536J48738R3902j29635
17037I59696j26440O0949J48289J38881K2166K19730l57142j37203J66220k6102
17027A069044K75375q4764m613j2686k30726m1M3558K10433j27140K52575q8184
17016A302831q9680J56425j59208M9605r9136K38186o8130Q7214k21250j3741
17006A183116J96608K34535q7749l99309L22925k85634N74630k25234j0923Q5185
16996A588150k44945j9098L28813M8728J7253l99703L45786j23244p9967j66269
$$ plain form
17067 1046292 848046 789137 1111828 1021947 712367 982179 871462 832726 1269427 957697
17057 957697 689041 694791 1121951 855501 1045238 1179636 1045061 937145 1129655 972121
17047 972121 902071 676528 1037782 1131637 1185312 875227 846691 995429 1089331 959696
17037 959696 833256 894205 1042494 1181375 1203541 1423271 1066129 928926 1095146 1069044
17027 1069044 1344419 1259655 1255042 1242356 1011630 1011589 1055147 1265580 1138440 1391015 1302831
17016 1302831 1213151 1369576 1210368 1259973 1160837 1399023 1330893 1418107 1196857 1183116
17006 1183116 1379724 1614259 1526510 1127201 1450126 1164492 1739122 1513888 1502965 1588150
16996 1588150 1343205 1324107 1652920 1701648 1718901 1319198 1664984 1541740 1461773 1295504
16986A295504L31745k38631p0747Q5876j333J0503J81722K76080l58483K00764
16976A713000O8978k24914l1962N0257K36913k66647J09494K24942k55718J29411
16966A753754j03154R5878j96237R5653K90666l61039M82629q3363j17656J69918
16956B027049l8996l02892M96592k13685J87711k73290K32910J23238k45049K0515
16946B014103K14913o2033J59386j07647j25648J85674k74078M06170k15028J44895
16936B340707j05455P9101P8970J77049l08386J82083N1880r6181L7632J5288
16926B452688r5521J88308J25745m5402N7329l7426j59260N73363O756k74260
16916B792320l3875J81359j56878r9308N26155l31765m502K56962q5938L6573
$$ plain form
16986 1295504 1627249 1388618 1317871 1403747 1402414 1412917 1594639 1870719 1512236 1713000
16976 1713000 1781978 1557064 1525102 1575359 1812272 1545625 1655119 1880061 1624343 1753754
16966 1753754 1650600 1746478 1550241 1645894 1936560 1575521 2058150 1974787 1857131 2027049
16956 2027049 1988053 1685161 2181753 1968068 2155779 1882489 2115399 2238637 1993588 2014103
16946 2014103 2229016 2166983 2326369 2218722 2093074 2278748 2004670 2410840 2195812 2340707
16936 2340707 2235252 2314353 2393323 2570372 2261986 2444069 2495949 2399768 2437400 2452688
16926 2452688 2357167 2545475 2671220 2625818 2683147 2645721 2486461 3059824 3066580 2792320
16916 2792320 2758445 2939804 2782926 2683618 3209773 2878008 2873506 3130468 3044530 3081103
16906C081103j7885r184N4707J11224J15347M3628r0945K65125m7331k53473J77862
16895C430178J31787J27687J85336l04867K79881k51830M73584J66507j62275
16886D075988m13274L35735J06015l32008L00968Q5935J62329M2726j45040L5201
16876D254575L25727J88728l5899k14361J07551L34028j774l28202l6676N64370
16866E158067k1277L03516n78321O54442m3137j86383M04204k52593K98085M7535
16856E784138N06393n57554N33715K2731J08792Q0842J50390p9495k21302J71580
16846F500230K40952K90870j8433J95813l2751J74496K0862M36080j42232K1916
16836G687803M46085j34886L9886L52254L42582j1834O142K01956j17832Q16913
$$ plain form
16906 3081103 3063218 3054034 3108741 3219965 3335312 3378940 3287995 3553120 3505789 3252316 3430178
16895 3430178 3561965 3689652 3874988 3570121 3850002 3598172 4071756 4238263 4075988
16886 4075988 3662714 3998449 4104464 3772456 4073424 4159359 4321688 4364414 4219374 4254575
16876 4254575 4580302 4769030 4733131 4518770 4626321 4960349 4958575 4630373 4593697 5158067
16866 5158067 5136790 5440306 4861985 5516427 5473290 5286907 5691111 5438518 5736603 5784138
16856 5784138 6290531 5732977 6266692 6289423 6398215 6479057 6629447 6549952 6328650 6500230
16846 6500230 6741182 7032052 7013619 7209432 7176681 7351177 7372039 7808119 7665887 7687803
16836 7687803 8133888 7999002 8038888 8391142 8733724 8721890 8728032 8929988 8812156 9629069
16826I629069k26678J11248K89070J74641K33200P9287K158M19318L31383m216
16816A1038480K67221J51999K42431L56271J96386R949N75285N6323Q71057n04856
16806A3260546L64456N60722J22808L48753M47196P4216N26178N56453L15081
16797A6576409K09534L73805K7198P29527L05369M51958K76058Q42586R1971M77647
16787B0362062Q34430M32683L42671P89855L14879N12408N64356Q75221P42119
16778B5770684M57151P93936Q87986L26224N49600J291828J038824M15247J132123
16769C2663603R03196P80223J004400R12838O93335R69502J384392J106949J461126
16760D1879564J294052Q80091J435093Q65413J362766J735954J229521J611162
$$ plain form
16826 9629069 9402391 9513639 9802709 9977350 10210550 10289837 10291995 10711313 11042696 11038480
16816 11038480 11305701 11457700 11700131 12056402 12252788 12262737 12838022 12894345 13765402 13260546
16806 13260546 13625002 14185724 14308532 14657285 15104481 15178697 15704875 16261328 16576409
16797 16576409 16785943 17159748 17186946 17916473 18221842 18673800 18949858 19792444 19884415 20362062
16787 20362062 21196492 21629175 21971846 22761701 23076580 23588988 24153344 25028565 25770684
16778 25770684 26227835 27021771 27909757 28235981 28785581 30077409 31116233 31531480 32663603
16769 32663603 33566799 34347022 35351422 36264260 36957595 37927097 39311489 40418438 41879564
16760 41879564 43173616 44053707 45488800 46354213 47716979 49452933 50682454 52293616
16752E2293616J364854J468061J516512J782112J473729J394358K085320J265911
16744F4644473J667334J617621J386233J690421J782188J530857J720736J307683
16736G7347546J319817J819565J059750J430322R58878J160624J138037N18633
16728H6753172Q96030O58041O25660L96158J78060J76736j47869l11049l46342
16719H8878597j32935q58804p24615j126773p41446j108667r50117j057331j678335
16710H0499574j329119j435864j570638j576666j440279j589578j826232j352225
16702F8378973j952333j297217j874864j586321j500336j694828j450731j618242
16694E5404101j640110j296978j472934j580264j193255j293000j238609j705555
$$ plain form
16752 52293616 53658470 55126531 56643043 58425155 59898884 61293242 63378562 64644473
16744 64644473 66311807 67929428 69315661 71006082 72788270 74319127 76039863 77347546
16736 77347546 78667363 80486928 81546678 82977000 83935878 85096502 86234539 86753172
16728 86753172 87649202 88307243 88932903 89329061 89507121 89683857 89535988 89224939 88878597
16719 88878597 88745662 87886858 87162243 86035470 85294024 84185357 83235240 82177909 80499574
16710 80499574 79170455 77734591 76163953 74587287 73147008 71557430 69731198 68378973
16702 68378973 66426640 65129423 63254559 61668238 60167902 58473074 57022343 55404101
16694 55404101 53763991 52467013 50994079 49413815 48220560 46927560 45688951 43983396
16686D3983396j100818j294419r74372j088701j106767o97413j508626r06107
16678C5306173j011575j189661q33167q22795r08137n42455o75966q69577j164385
16669B7288455k14668p42545r24230l89984n02587r34594l71840o40180o57972
16660B1909855l37000o95401m70257n21930l01054j99674p19702k75262l98980
16651A7990595m24746l77517k67640o43914l06709m05998k05595k68315j70477
16642A4919684o30934j09671n38685P371m75548J64165p59142q023l38432l01854
16632A1928931k15004J68958o80020j3693l54100Q0301p39565J28803l05938j88848
16622I809825j52596m6496j95162m4623k37900j50400K02190m84411k04759n04731
$$ plain form
16686 43983396 42882578 41588159 40613787 39525086 38418319 37720906 36212280 35306173
16678 35306173 34294598 33104937 32271770 31448975 30540838 29998383 29322417 28452840 27288455
16669 27288455 27073787 26331242 25407012 25017028 24514441 23579847 23208007 22567827 21909855
16660 21909855 21572855 20877454 20407197 19885267 19584213 19384539 18664837 18389575 17990595
16651 17990595 17565849 17188332 16920692 16276778 15970069 15564071 15358476 15090161 14919684
16642 14919684 14288750 14179079 13640394 13647765 13172217 13336382 12577240 12569217 12230785 11928931
16632 11928931 11713927 11882885 11202865 11189172 10835072 10915373 10175808 10304611 9998673 9809825
16622 9809825 9657229 9610733 9415571 9370948 9133048 8982648 9184838 8700427 8495668 7990937
16612G990937J40087R9772j84717o3700n12664M3539j74962J14035k79265j87786
16602F985276k47441L26061j31814r2022j9569m88638J49748k60604K26352n15762
16592E931587J72316L9716j88208k26596j49609J47215l30695J84735k09966j40026
16582E230469K29061l62456J35143p1132j28850J30920j13746p1625L08276m26434
16572D859626l50327P8652J12739o4532j57621r7483k72427L9435j57824J81758
16562D171996j49332J15266J31379k52558j55056J54106l44295o8688j07480L30486
16552C825824l1971l36741J82652k18949j29579m6709L54164L0313O0129m80018
16542C209115L0595Q3391O37J85470n22990L60625m19673J02312J71142j56292
$$ plain form
16612 7990937 8131024 8230796 8046079 7982379 7469715 7513254 7338292 7452327 7173062 6985276
16602 6985276 6737835 7063896 6932082 6840060 6820491 6331853 6481601 6220997 6447349 5931587
16592 5931587 6103903 6143619 5955411 5728815 5579206 5726421 5395726 5580461 5370495 5230469
16582 5230469 5459530 5097074 5232217 5161085 5032235 5163155 5049409 4977784 5286060 4859626
16572 4859626 4509299 4587951 4700690 4636158 4478537 4381054 4108627 4148062 3990238 4171996
16562 4171996 4022664 4137930 4269309 4016751 3861695 4015801 3671506 3602818 3495338 3825824
16552 3825824 3793853 3457112 3639764 3420815 3291236 3244527 3598691 3629004 3689133 3209115
16542 3209115 3239710 3323101 3323738 3509208 2986218 3346843 2927170 3029482 3200624 3044332
16532C044332k99022J87013J82889m59371N13619l57516J59244n33249J36002
16523B573941j54202J9825n3545L40045o3391J30453j91704R1058l2702k67040
16513B392738J77732k28615J944O2843l43561L54454j39800r2397j75813L39526
16503B349051q4096J3510r5279Q37j43110J72168q3061r8522j25546M77494n19918
16492A863528K37921Q1779r1259k46000q8254M2280J07193K90160j88403l6751
16482A972194r0553O1161j27295j51532K00421O2935j72381J23057n62991L05505
16472A620521o3919K23150R3476k94065L7192P6242j05575O0237j306L66908n09489
16461A503372K12923k36073k76500L36467j70895p9736M50731n32802M33720m1219
$$ plain form
16532 3044332 2745310 2932323 3115212 2655841 3169460 2811944 2971188 2437939 2573941
16523 2573941 2419739 2439564 2386019 2726064 2662673 2793126 2601422 2692480 2659778 2392738
16513 2392738 2570470 2341855 2343799 2406642 2063081 2417535 2277735 2185338 2009525 2349051
16503 2349051 2264955 2278465 2183186 2184023 2040913 2213081 2130020 2031498 1905952 2383446 1863528
16492 1863528 2101449 2183228 2091969 1845969 1757715 1799995 1907188 2197348 2008945 1972194
16482 1972194 1881641 1942802 1815507 1663975 1864396 1927331 1754950 1878007 1315016 1620521
16472 1620521 1556602 1779752 1873228 1579163 1616355 1692597 1587022 1647259 1645953 2012861 1503372
16461 1503372 1716295 1480222 1203722 1540189 1369294 1289558 1740289 1207487 1641207 1599988
16451A599988j79257L33677j3586q0943l93902R5768j28906J13528L36585L8974
16441A721926k33648k03086j87796P0531L08527k3566Q9190k67706j9928P8790
16431A333234k51976K84188k01995K14532j27971J874J62376l20104J25819n8042
16421A161935L715k03048J53844K49428k01367j83497J13344L04100m73949N526
16411I30031O9518Q4046J75227F03882J71677O8938K01370M5957j20791j81467
16401G89566K10267L02522j98218j17894K12198l18216K88124m07756J74068J62654
16391A097315n00698K15641J04286o2422L19479k61393K50763k89056k1684p2944
16381G79287l52709O43456l14641L21155j39544j6780J30056k59490J42189K95488
$$ plain form
16451 1599988 1420731 1754408 1740822 1659879 1265977 1361745 1232839 1346367 1682952 1721926
16441 1721926 1488278 1285192 1097396 1167927 1476454 1452888 1542078 1274372 1254444 1333234
16431 1333234 1081258 1365446 1163451 1377983 1250012 1251886 1414262 1094158 1219977 1161935
16421 1161935 1165650 962602 1116446 1365874 1164507 981010 1094354 1398454 924505 930031
16411 930031 999549 1083595 1258822 603882 775559 844497 1045867 1091824 971033 789566
16401 789566 999833 1302355 1104137 986243 1198441 880225 1168349 760593 934661 1097315
16391 1097315 596617 812258 916544 854122 1173601 912208 1162971 873915 852231 779287
16381 779287 426578 1070034 755393 1076548 937004 920224 1050280 790790 932979 1228467
16371A228467k59517j3149K1389k31745J77708M8550k5178M4332j72186R397l1670
16360G96398j9393r2261k11901j34774O79528m19457J35154J6011K51148D71899
16349H37382O347j6596l32774K31535j13021Q9226J23915k26391J00147n6326
16339F43444j27431J70838J73235j85611j06154K56221k47225o4472M98340l5688
16329I75497k09649j96726R339k68892n235J53044L15023r0194R1200k39490L78936
16318I12853k77337j09244m6509K27168K672j68915K03239k93205J33869J68492
16308G53083j78543J32415j2240J35348l49065j49823J4120J11506J02461O1443
16298F20705l04344L33585k40281L04160C07560L10316K13235k94780K36090M1114
$$ plain form
16371 1228467 968950 955801 977190 745445 923153 971703 946525 990857 818671 828068 796398
16360 796398 777005 684744 472843 338069 1017597 598140 733294 749305 1000453 471899
16349 837382 843729 827133 494359 725894 612873 702099 826014 599623 699770 643444
16339 643444 516013 686851 860086 674475 568321 824542 577317 512845 1011185 975497
16329 975497 765848 569122 578461 309569 304334 457378 772401 682207 773407 533917 912853
16318 912853 635516 526272 479763 706931 709603 540688 743927 450722 584591 753083
16308 753083 574540 706955 694715 830063 480998 331175 345295 456801 559262 620705
16298 620705 316361 649946 409665 713825 307560 617876 831111 536331 772421 813535
16288H13535k86192k60359K40845J83397C28345J87427j82022K81853r6094J98559
16278G18068k72529J73345J03820P0305C72385J89916j5830J91384j90083J84077
16268G31849l49148j33301Q743R4781L3409M350K37354m6591k23143L9268O8816
16257D66387K69635C62260j15540N33201j83990k92242J33356m9347j3072m4140
16247C30486J63827k00932G3671K59173K1472j55120J70910O8670J12930r8661
16237D53045J26142j65570q2742j54548L15726j24990k0870q6817p3803K70197
16227D55770O8818R9836B45722K39259k09385q2157J84815r861j36626l5632K13683
16216D09818B644K5636M38149q6599O3860r7443c527B20967A5573M06269n2552
$$ plain form
16288 813535 527343 266984 507829 691226 328345 515772 333750 615603 519509 718068
16278 718068 445539 618884 722704 793009 372385 562301 546471 737855 547772 731849
16268 731849 382701 249400 258143 352924 386333 390683 628037 581446 358303 397571 466387
16257 466387 736022 362260 246720 779921 595931 303689 437045 387698 374626 330486
16247 330486 494313 293381 73671 332844 354316 199196 370106 438776 551706 453045
16237 453045 579187 413617 330875 176327 492053 367063 346193 259376 185573 455770
16227 455770 524588 624424 245722 484981 275596 193439 378254 368393 231767 196135 409818
16216 409818 2644 28280 466429 379830 443690 346247 -3527 220967 15573 421842 369290
16205C69290n4306N0092A75058M38221B01794d8512C27935M3459L23264B21624
16194E02847J5156A58431K16685A65838L34933A51338J76990I3049N47714B64722
16183A10602K06733q5185r6484J17079K24533K7159j86939j05580J0712J10485
16173C33115D7833P8824A6028K16809P1140m235r8782M29472B84103Q8323q4652
16162B87774P3088J13182j88170o8841c2635A63582M916k8833L29775k26391B8571
16150A12601c4273C32246A02199J14731J75071d2697b588D61883A53727J73152
16140C26879q9147J25000q0773C6627h9470B43417A18247M566J97976J60890F9472
16128A18914C9051J71914I4485j3445B0871J40058J31439j5134A24245a70123
$$ plain form
16205 369290 314984 365076 175058 613279 201794 -48512 327935 371394 694658 221624
16194 502847 518003 158431 375116 165838 500771 151338 328328 93049 640763 264722
16183 110602 317335 232150 135666 252745 477278 504437 317498 211918 222630 333115
16173 333115 47833 126657 16028 232837 303977 299742 200960 630432 284103 372426 287774
16162 287774 360862 474044 285874 217033 -32635 163582 168498 139665 469440 243049 28571
16150 112601 -34273 332246 102199 216930 392001 -42697 -2588 461883 153727 326879
16140 326879 237732 362732 281959 36627 -89470 243417 118247 122813 320789 481679 69472
16128 118914 39051 210965 94485 81040 20871 160929 292368 277234 124245 -170123
16117B68552A20565M8645Q979m4558B4354a988B17835q0802L1407J51604c0827
16105A80244a5731B71666P7985j50582p6233O1199q6644P4935H2667K31103A30624
16093F1808N2084J10864q624J22480J7542A02284K69281r8800e1828E16604E2224
16081A07122A0642K77611I4252J81634j06400J33944j21737H5440M0655J48328
16071B74423A5607a24042C19955j52075M16242A74778A5861J48518a45781C36534
16060A77555E8835K9930A2578P8482K00281J48708B17972j00175K6305l8051d4393
16048b12446a7725A16390n5916J76041A8178e7097A31885K5835D2222J64056j01008
16037A05270P4790K9452H6331J47458A4836J95227D0579L0367l0476a0484A99155
$$ plain form
16117 268552 120565 169210 178189 133631 24354 -1988 217835 137033 168440 320044 -30827
16105 180244 -15731 271666 349651 199069 122836 184035 97391 172326 82667 313770 130624
16093 61808 113892 224756 216132 338612 356154 102284 371565 272765 -51828 516604 52224
16081 107122 10642 288253 94252 275886 169486 303430 181693 85440 126095 274423
16071 274423 15607 -124042 319955 167880 584122 174778 15861 164379 -145781 336534
16060 177555 58835 88765 12578 91060 291341 440049 217972 117797 144102 106051 -44393
16048 -212446 -17725 116390 60474 236515 18178 -57097 131885 157720 42222 206278 105270
16037 105270 180060 209512 86331 233789 14836 210063 40579 70946 40470 -10484 199155
16025F3464k5124K7898N1752N6239a93955A81427F4723L5704l5033a76415N8127
16014a18288A81385h2391c0899k3405L572a0219A39770h7695C5463a70384E6416
16002A16469g872G0424g3327B81172O1123j29220l3436d9336E80240b42793q22
15991b43615e9110B71819j24915L70187N41963J44961L5080n6014m73205M2295
15981G52171B78464d0765A23718O0530E224K26694r1128o9314O0622K17576B0917
15969D05229F9445O2604E5157A250K29662j03541o0585J947J26693a344r054B24879
15956f253C1344J78352K5041A16900A3943J72661e2628j4246A22605k973K6358
15945A45990j2068h3373D6372J52671j7884L4133e1968A35830b15017a06195C07859
$$ plain form
16025 63464 38340 66238 117990 174229 -193955 181427 64723 100427 65394 -176415 -118288
16014 -118288 181385 -82391 -30899 -54304 -50732 -10219 139770 -87695 35463 -170384 56416
16002 116469 -7872 70424 -73327 281172 342295 213075 179639 -49336 580240 -242793 -243615
15991 -243615 -59110 271819 146904 517091 1059054 1204015 1239095 1183081 709876 752171
15981 752171 278464 -40765 123718 184248 5224 231918 140790 71476 132098 349674 20917
15969 405229 69445 132049 55157 1250 230912 127371 66786 68733 195426 -1344 -10398 224879
15956 -6253 31344 209696 234737 116900 13943 186604 -52628 -66874 122605 119632 145990
15945 145990 133922 -83373 46372 199043 181159 215292 -51968 135830 -215017 -106195 307859
15933A09283H858N1926e4490j12153A3149c4640G8792c3633B09812a30984B46834
15921A06874b07030c1161D7622a68683A66545b92219A8039d327k35176C45933
15910A93579C903e4074l64474b344q4564E4293a08086A32117K83813A22071d8283
15898F1015d8817B5594a57457A66659a68312K1454j55621D9124K6399N4109M136
15887A33768a07464M4638I6598Q7714m1763R5930c5980K459C1786b94097a38212
15875B1370c24181B6608K46906H9239m4419b45970B19676a46882i295A86880c37076
15863a66635A07137j7676l8948J15779d0604F9295E089N8675b06079a9901G8151
15851a20549B6096a65370B16104f2532K0209A66634F6021b02592A8394a08640
$$ plain form
15933 109283 8858 60784 -54490 -166643 13149 -34640 78792 -33633 209812 -130984 246834
15921 106874 -207030 -31161 47622 -168683 166545 -292219 18039 -4327 -239503 345933
15910 193579 3903 -54074 -418548 -2344 -86908 54293 -108086 132117 415930 122071 -48283
15898 61015 -48817 25594 -157457 166659 -168312 -146858 -302479 49124 75523 129632 133768
15887 133768 -107464 -62826 96598 184312 142549 238479 -35980 -33521 31786 -294097 -138212
15875 21370 -324181 26608 273514 89239 44820 -245970 219676 -146882 -9295 186880 -337076
15863 -166635 107137 89461 50513 166292 -40604 69295 5089 63764 -206079 -19901 78151
15851 -120549 26096 -165370 216104 -62532 -42323 166634 66021 -202592 18394 -108640
15840b3065j1251k24424A84907c6523A22935L0737B6423h1016A2800a04975A17255
15828A02736a32074D3927J22328B65b6606B59899b65297c857C28351A50395b08205
15816B95301j27154a09539b1400k02460E9650c95558J63162P8940I2492m0788
15806E1704a09751I4415a72358N6662k3579M8771b4349B80379a54282L6058I2910
15794A54072N4462N4563F8970J2319b03278B51948H4081J71555m8446l5305a34608
15782i9547M6978o5515o6899g8076F9567a46130n6920n0885c8872k9839L219D4552
15769c01908M1214a7754k9491j16057a3796B21333d7820r5335B10713b1103C1073
15757a8649B47439J1603A24550b6081A70022C5558N93J44043q6268m30m1680a03690
$$ plain form
15840 -23065 -34316 -258740 184907 -36523 122935 153672 26423 -81016 12800 -104975 117255
15828 102736 -132074 43927 166255 265 -26606 259899 -265297 -3857 328351 150395 -208205
15816 295301 168147 -109539 -21400 -223860 59650 -395558 -232396 -153456 92492 51704
15806 51704 -109751 94415 -172358 -115696 -139275 -90504 -24349 280379 -154282 -118224 92910
15794 154072 208534 263097 68970 81289 -203278 251948 84081 255636 207190 171885 -134608
15782 -99547 -52569 -118084 -184983 -78076 69567 -146130 -203050 -253935 -38872 -68711 -65492 44552
15769 -301908 -260694 -17754 -47245 -163302 -13796 221333 -47820 -143155 210713 -21103 31073
15757 -18649 247439 259042 124550 -26081 170022 35558 36151 180194 93926 93496 51816 -103690
15744C0965O9360N9015c2626C0204c13975A46765M9329G6865K2794a75198B55862
15732g6925j35101B41910J96902A4713O8153A7304J50356n1414n7738e0954D2707
15720b03671A70724L4593a03052A76287a45145l7075A14541d0133A87329b93013
15709a7311j80289b6009k25057A37602n3913b26582E1546J95K03870C2962A6470
15697C5431K70033f3628b2112F3922F97J34470a51013B19208c1897I9091m5384
15686E3707b33057B27362E2979L182e7268l50354f9121A96816b7291j00074b3688
15674e5170l8710A17076n4971J03378k8842D2609a77156A97554a1813C05895a5670
15662B77972c2456N824A7835a25976n7205a250B82882g8396K9053A52247m6795
$$ plain form
15744 30965 100325 159340 -32626 30204 -313975 146765 196094 76865 99659 -175198 255862
15732 -76925 -212026 241910 438812 14713 82866 17304 167660 116246 58508 -50954 42707
15720 -203671 170724 205317 -103052 176287 -145145 -182220 114541 -40133 187329 -293013
15709 -17311 -197600 -26009 -251066 137602 83689 -226582 51546 51741 255611 32962 16470
15697 35431 305464 -63628 -22112 63922 697 135167 -151013 219208 -31897 99091 53707
15686 53707 -233057 227362 52979 56161 -57268 -407622 -69121 196816 -27291 -127365 -23688
15674 -55170 -93880 117076 62105 165483 136641 42609 -177156 197554 -11813 305895 -15670
15662 277972 -32456 -26632 17835 -125976 -183181 -1250 282882 -78396 -49343 152247 105452
15651A05452a74708A13414J74863m5507c26435A42321i1011A18185e0547j09937
15641a60484B7373q558J61723a38512G2068K11176a09484C44917a39423e6441
15630C15614B5070a50181a6670j68161B68774I8328D2176j9648a69899O3496L9896
15619f6507p7417K6868n760c4509r4035J3011e028F6334C1931I997O5889k7866
15607D8020j7737j4527Q8797m7439f0494n7876j33654B49792e10506A33434J3715
15596A47149a32652j50406f2836j3521m589B01999d4699k5071l45975J99222l6244
15585b52767B10286q7645e3265j11440G658J4733a63689r700j6981c2881F418
15573H2015c81262C15279e7839K1831D38803g0017j62121L6644j13050A49939
$$ plain form
15651 105452 -174708 113414 288277 242770 -326435 142321 -91011 118185 -50547 -160484
15641 -160484 27373 18815 180538 -138512 72068 283244 -109484 344917 -139423 -56441
15630 315614 25070 -150181 -16670 -184831 268774 98328 42176 22528 -169899 -106403 -66507
15619 -66507 -143924 -117056 -122816 -34509 -128544 -115533 -5028 66334 31931 9997 75886 48020
15607 48020 30283 15756 104553 57114 -60494 -118370 -252024 249792 -510506 133434 147149
15596 147149 -132652 -283058 -62836 -76357 -80946 201999 -44699 -69770 -415745 -216523 -252767
15585 -252767 210286 122641 -53265 -164705 7658 22391 -163689 -173389 -190370 -32881 6418
15573 82015 -381262 315279 -57839 -36008 438803 -70017 -232138 -195494 -308544 149939
15562A27654m3576A0852d20824d2398n2348l6713A4348Q1106a75990a157F9991
15550b21266B79043a53873m0879p226C8861b078j09934F1582R9161b0196C38566
15538a25187J5910I5592K09711p0279I5809J09413J36785j60199f5818B41097
15527D7565a72808d9753H1116K8110d8851F4579O6843K84755A5758c2115B29662
15515E05202j78439b8752D33897A23286f2952H061K13137H1216K6349a45153k430
15504a47583C50282a53116E9280i1411D3668N2255J75737j20312K3484b2641A31356
15492e9750B37253o0540j9586E3223b23352I5910a02793p0109A61055b94604F0054
15480A50767R5285m1570M9573J30643P0167K98302k79708I0545M32973j28374
$$ plain form
15562 127654 84078 10852 -420824 -42398 -94746 -131459 14348 95454 -175990 -1157 69991
15550 -221266 279043 -153873 -194752 -201978 38861 -2078 -112012 61582 160743 -20196 338566
15538 -125187 -109277 95592 305303 235024 95809 205222 342007 181808 -65818 241097
15527 47565 -172808 -49753 81116 109226 -48851 64579 131422 416177 15758 -32115 229662
15515 505202 326763 -28752 433897 123286 -62952 8061 221198 81216 107565 -145153 -147583
15504 -147583 350282 -153116 59280 -91411 43668 95923 271660 151348 174832 -22641 131356
15492 -59750 237253 176713 157127 53223 -223352 95910 -102793 -172902 161055 -294604 60054
15480 150767 246052 204482 254055 384698 454865 753167 473459 90545 523518 395144
15470C95144A75341a10390I3712M0112j4646O9746J08841E424K04845q2572A941
15458I8095i5257r0370A55094E0749N5275L2836n4761j3977K8156M487P6904J95447
15446C75116l855O1838K60262J75168N23283k83767C98512m0527j46293Q889j5016
15435B05565B6299L00110e3305j5450A44498c1555B23251m9137d1006B97046a15365
15423A58450b13553D44424d0944j74805r0685A71419c4039B4345M4909J9042A6001
15411C74810c3773k79494F1287L56257n2431F9636f0231n4024A66519d4902J4928
15400b9974q100D3735J86080D5133J34520a45735j0119A86308c8323A28748c8901
15388a08500B35970A05084m116J4729a63250O3507j78687J14705B72176g32D4555
$$ plain form
15470 395144 175341 -110390 93712 133824 119178 188924 297765 5424 210269 127697 1941
15458 98095 -95257 -185627 155094 50749 106024 138860 84099 70122 98278 102765 179669 375116
15446 375116 371261 433099 693361 868529 1391812 1108045 398512 357985 211692 220581 205565
15435 205565 26299 326409 -53305 -68755 144498 -31555 223251 174114 -41006 297046 -115365
15423 158450 -213553 444424 -40944 -215749 -306434 171419 -34039 24345 69254 88296 16001
15411 374810 -33773 -313267 61287 417544 365113 69636 -60231 -114255 166519 -44902 -29974
15400 -29974 -38074 43735 229815 45133 179653 -145735 -155854 186308 -38323 128748 -38901
15388 -108500 235970 105084 100968 115697 -163250 -99743 -278430 -163725 272176 -732 44555
15376A1439J02858L27362O7307k17474j12958G4521i6104A99775g0223C89451
15365A74423o4447R0112J64930b319B26168r2655J53422l8470J78020j80810J02821
15354C48496J4435I5068J40612a17651I4712J47873G732L4755f6375j12760a6466
15342D16144A42977L59004k22339m6977J74804j73895a8679A35166J28858o2993
15332B01031L39745A11495J53018P4808b21021F0514J84284a05238C19918E3180
15321D363L6304J09247J84770j53152R5436b7181j0475B91001a57367r2370G9917
15309B08845K64940G797K95227a48088p6826d0289p2026r002q7352B91469b31548
15297A89304J12365m8619a0907C3237J91518E0715N4856b03285D3276a52932A08299
$$ plain form
15376 11439 114297 441659 508966 291492 178534 74521 -96104 199775 -70223 389451
15365 174423 109976 200088 365018 -2319 226168 133513 286935 248465 426485 245675 348496
15354 348496 362931 95068 235680 -117651 94712 242585 7732 42487 -66375 -179135 -16466
15342 416144 142977 501981 279642 232665 407469 233574 -18679 135166 264024 201031
15332 201031 540776 111495 264513 339321 -221021 60514 244798 -105238 319918 53180
15321 4363 40667 149914 334684 181532 276968 -27181 -37656 291001 -157367 -249737 79917
15309 208845 473785 7797 303024 -148088 -224914 -40289 -112315 -121317 -208669 291469 -231548
15297 189304 301669 253050 -10907 33237 224755 50715 105571 -203285 43276 -152932 108299
15285D0948O0006K32706G3784i8003K8257B96966a74973I8725h262j97206i9340
15273E5881N183F997d8366m9365B01478a66585A14716c2578A35431C6553a83571
15261i4414k346j68250A29668Q308b0381k4672D6148M9318J34987I2418d4B919
15248A13765q283k698C2162C048N00584j10232J24465J295030O2382n66930Q61320
15237B169667j037280B83647A08653K55918c187B28425j11781a0139k41212A51782
15226d62682K27623B45401E4262K46577A17550h4788B3316J06305a36093b1217
15215A39564i6694C8554K91391a55327D90480f6651I8158J2532P6568c366A08710
15203A50672F891O1913n234B1929h8842B39043d9441F4833K28608A7908i8911
$$ plain form
15285 40948 100954 333660 73784 -98003 -69746 296966 -174973 98725 -8262 -205468 -99340
15273 55881 61064 6997 -48366 -97731 201478 -166585 114716 -32578 135431 36553 -183571
15261 -94414 -96760 -265010 129668 137976 -20381 -45053 46148 95466 230453 92418 -44 2919
15248 113765 105482 102784 32162 3048 503632 393400 517865 1812895 1875277 1308347 2169667
15237 2169667 1132387 283647 108653 364571 -3187 228425 116644 -10139 -251351 151782
15226 -462682 -235059 245401 54262 300839 117550 -84788 23316 129621 -136093 -21217
15215 139564 -96694 38554 329945 -155327 490480 -66651 98158 110690 187258 -3366 108710
15203 150672 6891 68804 63570 21929 -88842 239043 -49441 64833 293441 17908 -98911
15191B66i4606A00114a54846A03667a46653A10149J67219A30620C1732J25448
15181A57180E6226c8114l45969B1568K23447f8727C62718I1202J29253I5291a29003
15169a1286k13930c4520G6796b02786A951N3696K43806a15132B61912n9813a81198
15157B37243g7015F3430c3326D0973L97067i0329a5982o5555B00720a93208K3983
15146a69225g730j6893B32838a01473A49710b18873C38833M9305A78590c5287
15135g2194A76142B019i7114A60001K50409A2581K5848a14147N0766D8728L00296
15124C49024I7085a31457C96617a06393C95677k7655L2593A75621J62211k0189
15114C17643F5659R1472Q0530E4780J84971F4616a57509C3312R9087L57871H3804
$$ plain form
15191 266 -94606 100114 -154846 103667 -146653 110149 277368 130620 31732 157180
15181 157180 56226 -38114 -384083 21568 245015 -68727 362718 91202 220455 95291 -129003
15169 -11286 -225216 -34520 76796 -202786 1951 55647 299453 -115132 261912 202099 -181198
15157 237243 -77015 63430 -33326 40973 438040 -90329 -15982 -81537 200720 -193208 -169225
15146 -169225 -7730 -24623 232838 -101473 149710 -218873 338833 388138 178590 -35287
15135 -72194 176142 2019 -97114 160001 410410 12581 38429 -114147 -63381 48728 349024
15124 349024 97085 -131457 396617 -106393 395677 368022 400615 175621 337832 317643
15114 317643 65659 157131 237661 54780 239751 64616 -157509 33312 132399 490270 83804
15102a36872A16280f2230A48804n300A7960K10805o7439R7873c7935m6356b0497
15090F5724J42924D2837R17Q5381J02741H6166A6012K08034c8858A23818J18942
15079B42760e1554B28579j07739L5717H279K27873C7999c2166l5102B31222b4070
15067G0600e418A88296I69b6807o9875A78929K8567M8621J06217m5696A47954
15055C82051j48906L4308R5110K0737A12750k8116P0028J92396j50915J07962
15045C04105I8048J40316g140B4685L92913J15338A01644J68401L241H7596Q9468
15034A77064N3873l2117M10858P9348l34988K90632L5319K1987j0870B40995K80638
15023E21633j64960C3058Q0281M14422M9397k56819K27099G0977J54951k229L40681
$$ plain form
15102 -136872 116280 -62230 148804 143504 17960 228765 161326 259199 -37935 -84291 -20497
15090 65724 208648 42837 43754 129135 231876 86166 16012 224046 -38858 123818 242760
15079 242760 -51554 228579 120840 156557 8279 236152 37999 -32166 -67268 231222 -24070
15067 70600 -5418 188296 969 -26807 -96682 178929 207496 256117 362334 316638 147954
15055 382051 233145 267453 362563 383300 112750 84634 154662 347058 196143 304105
15045 304105 98048 238364 -7140 24685 417598 532936 101644 270045 273286 87596 177064
15034 177064 230937 198820 609678 689026 354038 644670 679989 701976 691106 240995 521633
15023 521633 356673 33058 113339 527761 577158 320339 547438 70977 225928 223699 564380
15012E64380p3227k09370K08992j30203j53878l6406J05085n0314O16471A12258
15001A84173M41161k14248Q2218j7356J18829E5754J93664K34490B13640J70901
14991C84541J59218A27306K47032o6149K35049r7947n2412J37897A50613M73422
14981F24035R7767J58464j1465k91158j03684A43623M15572N6435P9711n7738
14971F37603k34948K29806j47176K13589R6084C51705j01120L06147H9671O0115
14961A49786J60065q1870K41546k9894f1625D30660A84506J26910A42674O1333
14951B04007K39503l2838b9713C91950J99295o9561K2707J52499C30631J23289
14941D53920m6202J28260j6682B29344J21769J79139j30413M48717n1368J00244
$$ plain form
15012 564380 491153 281783 490775 360572 206694 170288 275373 225059 841530 112258
15001 184173 625334 411086 493304 475948 594777 55754 249418 483908 213640 384541
14991 384541 543759 127306 374338 308189 543238 445291 392879 530776 150613 624035
14981 624035 721802 880266 868801 577643 473959 143623 559195 615630 695341 637603
14971 637603 402655 632461 485285 698874 794958 351705 250585 556732 89671 149786
14961 149786 309851 227981 469527 439633 -61625 430660 184506 311416 142674 204007
14951 204007 443510 410672 -29713 391950 591245 521684 544391 696890 330631 453920
14941 453920 407718 535978 519296 229344 351113 530252 399839 848556 797188 897432
14931H97432K90614J09470l21465J69297K9578M62809j60715j33536j68291J70043
14921A345236l0003J63360N57292J08399O6430m07367n68427j38079M8966k04762
14911I41045l26352J9402j66948K11462B81775J39871J14060N7698l9861k30010
14901C23533A26863L58490Q17k41797R7455J84719a93374D66744J44137j16646
14891D94235P2605I4089N19000n2145R0417O28895o38701J14989l5754k05240
14881E15550J21520J91278j95277N199k75454L13436C07677L34381j46568P326
14871E02816J25813O3934j47849j02208J18970m514j28926L71281k86985j01430
14861D10902J32749J4158m8480r8552j94329J96444M7749M2058j84158N1543J04605
$$ plain form
14931 897432 1188046 1297516 976051 1145348 1174926 1637735 1477020 1343484 1175193 1345236
14921 1345236 1315233 1478593 2035885 2144284 2210714 1803347 1234920 1096841 1145807 941045
14911 941045 614693 634095 467147 678609 281775 421646 535706 593404 553543 323533
14901 323533 126863 485353 486170 244373 341828 526547 -193374 466744 610881 494235
14891 494235 566840 94089 613089 560944 651361 1280256 641555 756544 720790 515550
14881 515550 637070 828348 633071 638270 362816 676252 307677 642058 495490 502816
14871 502816 628629 692563 544714 442506 561476 556962 428036 799317 512332 410902
14861 410902 543651 557809 509329 410777 216448 412892 460641 502699 318541 370084 474689
14850D74689J12203J73160l60595j68165N43230k3510J95172L31393m60243K28146
14840A045480j67874r048Q3510k70349n1236o2104k0611K65103k53414O5249k7141
14829E97565j86860K7931p6996J26668j1364j39066O09479l18380j02360M75228
14819A001845k43178q2737j60232O8247j9471O1309C10631J74378N0360k22365
14809C13004M20684l08947J11878P26839l24353r9699q2593C66075J47530K53411
14799G67016l16165L9081J14074J1195q4485Q46o0115L0962q2088j97397M49612
14788F72536q300O7041B00982M11370M6034K19623k89163J52890j35756L16498
14778I22478K7810l25160L51658D80637J87217P1511J05290k61535R3967j98312
$$ plain form
14850 474689 586892 760052 399457 231292 774522 751012 946184 1277577 817334 1045480
14840 1045480 877606 868558 952068 681719 630483 568379 547768 812871 559457 624706 597565
14829 597565 410705 438636 361640 488308 476944 337878 947357 628977 526617 1001845
14819 1001845 758667 675930 515698 583945 564474 625783 310631 485009 535369 313004
14809 313004 733688 424741 536619 1263458 939105 839406 756813 366075 513605 767016
14799 767016 450851 489932 604006 615201 530716 531562 471447 502409 420321 222924 672536
14788 672536 664236 731277 200982 612352 658386 878009 588846 741736 605980 922478
14778 922478 950288 625128 976786 480637 667854 739365 844655 583120 677087 478775
14768D78775l8668N69113m73379J30060K43982C44167K89422k13490J90061k32055
14758C78105K31449j82220J26371j22844B14213J94407K05090K66546j96457B47923
14747G95817j64580r9780j6696J0591Q5226j20598L86911D07910L32450K6644
14737G67004l09817L32137M4332j04376j39528K73432N4786L55309m37335O52091
14727A488035K86731N7782r9880l02067m95761J38027K41269m36247q4569m7568
14717G45752o4803O31604m18315k35767K9865L22353l52060J91700j73693K9747
14707G06383L06562J25945m5858K53235j01135N48670Q4359l08076l62322n7796
14697A149967j88834J24860q8108o9168R8438j57265r04r2645J50948m6412j52796
$$ plain form
14768 478775 440107 1009220 535841 665901 909883 344167 633589 420099 610160 378105
14758 378105 609554 427334 553705 430861 214213 408620 613710 880256 683799 247923
14747 795817 631237 531457 514761 525352 610578 489980 876891 407910 740360 767004
14737 767004 457187 789324 833656 729280 589752 863184 917970 1273279 835944 1488035
14727 1488035 1774766 1832548 1732668 1430601 934840 1072867 1314136 877889 793320 745752
14717 745752 680949 1312553 894238 658471 688336 1010689 658629 850329 676636 706383
14707 706383 1012945 1138890 1093032 1346267 1245132 1793802 1878161 1570085 1207763 1149967
14697 1149967 961133 1085993 997885 928717 1027155 869890 868986 776341 927289 880877 728081
14686G28081Q5359k09920O116N28642l00876J79693l34346j09246K20071n3501
14676G40073K845K00416K91414m41820j58326K44079j4822K50216k02350l29613
14666E82112L66409j37834L17417j34197O8462k03694j46955K60565j82399Q0480
14656H70366L54579m4160k08826J66847L70029l49830r6661q7233m4358K80263
14646A211016l38049J82465j19532J30214l2975P9849j64411L88580j10484l78971
14636H47702J64846R1618j49720K11643l73304O98852j99918j61182K13435j53035
14626A190937p7958N0026l25352K36757K17460j44886L34009m07175L54528l46899
14616A081447O47407p75991M34296l77475L20267j19627K03951p0217p595Q5554
$$ plain form
14686 728081 813440 603520 609636 1138278 837402 1017095 682749 573503 793574 740073
14676 740073 742918 943334 1234748 792928 634602 878681 863859 1114075 911725 582112
14666 582112 948521 810687 1128104 993907 1062369 858675 711720 972285 789886 870366
14656 870366 1224945 1180785 971959 1138806 1508835 1159005 1062344 975111 930753 1211016
14646 1211016 872967 1055432 935900 1066114 1033139 1112988 948577 1337157 1226673 847702
14636 847702 1012548 1104166 954446 1166089 792785 1491637 1291719 1130537 1343972 1190937
14626 1190937 1112979 1163005 837653 1074410 1291870 1146984 1480993 1073818 1428346 1081447
14616 1081447 1728854 952863 1387159 1009684 1329951 1210324 1414275 1344058 1336463 1422017
14606A422017j49192K66648r1545J1618j80630K64555J4753k10395M0854J0476
14596A399159J91929n3372l64775J89352j37750J51472J16042L61839l04109J81719
14586A731506p6387k48705J09396J29329l13031P53383m38854p232j01966L03279
14576A840718j2685j0552J88864k00546r0472K30721k31713l1042O398M42051
14566B131742Q8498k98404J65156K65029r4563j18157J64214L47278k65693L64125
14556B749225J21619N0130r729K38633K18293Q93665O80888J802131M380362Q828482
14546A9953699J9835114M78075A4500848E848483k486075r19479o66875L60658
14538B136712L06747J005013K281766k495915j216805m24548M3903L44640j25800
$$ plain form
14606 1422017 1272825 1539473 1447928 1459546 1278916 1543471 1558224 1347829 1388683 1399159
14596 1399159 1591088 1537716 1172941 1362293 1224543 1376015 1492057 1853896 1549787 1731506
14586 1731506 1655119 1406414 1515810 1645139 1332108 2085491 1646637 1639405 1537439 1840718
14576 1840718 1828033 1817481 2006345 1805799 1715327 1946048 1714335 1683293 1689691 2131742
14566 2131742 2220240 1921836 2086992 2352021 2257458 2139301 2303515 2650793 2385100 2749225
14556 2749225 2870844 2920974 2911245 3149878 3368171 4261836 4942724 6744855 11125217 19953699
14546 19953699 39788813 40266888 14500848 5848483 3362408 2442929 1776054 2136712
14538 2136712 2443459 3448472 5730238 3234323 2017518 1592970 1636873 1981513 1855713
14529A855713K01428j18240J30178j52857J46156j35627J48524K52442n16380
14520A811337J76065J47900j78403j0165L95150k53o6323N2413L13870k64658
14510B376933K85820l22331O3817l3149J68493j08186R7639J87936j71037P7111
14500B623046j12102K41415r898J71881l43748M97688J38076o7950J1034m07519
14490B741923L07854J92975r7261m6405L78461j47955K10421k81351P30928p50249
14480C239341J77247K40106l62049L53752J15984M9594j15621N8567j21286J82887
14470C818522N9859J90257l67746K13681l04349L52005n1562P9215J50433J48088
14460D288403l04623Q2953J75688K27795m4867K55561l66292K77145k59940L04049
$$ plain form
14529 1855713 2057141 1938901 2069079 1916222 2062378 1926751 2075275 2327717 1811337
14520 1811337 1987402 2135302 1956899 1946734 2341884 2341631 2275308 2327721 2641591 2376933
14510 2376933 2662753 2340422 2404239 2371090 2539583 2431397 2529036 2716972 2545935 2623046
14500 2623046 2510944 2752359 2742461 2914342 2570594 3068282 3206358 3138408 3149442 2741923
14490 2741923 3049777 3242752 3145491 3099086 3477547 3329592 3540013 3258662 3989590 3239341
14480 3239341 3416588 3656694 3294645 3648397 3764381 3813975 3698354 3756921 3635635 3818522
14470 3818522 3878381 4068638 3700892 3914573 3610224 3962229 3910667 3989882 4140315 4288403
14460 4288403 3983780 4066733 4242421 4470216 4425349 4680910 4314618 4591763 4331823 4635872
14450D635872M44970k70479k35645J23074K18651j7619K17243k4569K51308J19356
14440E462162j52441j82963K62130M8305J25572J48241k22446M09755k75913M22484
14430F044886l72192N28187K79413k01095J56772J19773N41846k69663L74022
14421G201949K12606k7487j27137j27309L23406k69726N08647J02343O9543P6965
14411G943800K12519k88957M52846K24234L15268j68029K62947k680l00469N78477
14401I229956J14827J09789J9785K28557J85272q271L26718K32273J83261J74634
14391A0796801J65031O3295M8837K71970L91956N9382N17372M23129J00403K75013
14381A3113189K53652k40468P73559j00628J70109J7004N30256J35652N15671
$$ plain form
14450 4635872 5080842 4810363 4574718 4697792 4916443 4898824 5116067 5091498 5342806 5462162
14440 5462162 5309721 5126758 5388888 5437193 5562765 5711006 5488560 5898315 5622402 6044886
14430 6044886 5672694 6200881 6480294 6279199 6435971 6555744 7097590 6827927 7201949
14421 7201949 7414555 7387068 7259931 7132622 7456028 7186302 7694949 7797292 7866835 7943800
14411 7943800 8156319 7867362 8320208 8544442 8859710 8691681 8954628 8951948 8651479 9229956
14401 9229956 9344783 9454572 9474357 9702914 9888186 9879915 10206633 10438906 10622167 10796801
14391 10796801 10961832 11025127 11073964 11345934 11737890 11797272 12314644 12737773 12838176 13113189
14381 13113189 13366841 13126373 13899932 13799304 13969413 13986417 14516673 14652325 15167996
14372A5167996M67105q7028Q64781J04576N18336M51505K35091J77849N58061
14363A8458272m0572M53046L53137M02160N87209L00233P19769M44966L48000
14354B2026220K84565Q02741N49566N13826N69163N83215O36339Q65498Q84208
14345B7715341N13682Q65106M93489R20858Q33170Q10721R28366J031058Q60075
14336C4971866J054005J213576R61173R45724J435905J451148R36782J684093
14328D4654272J468920J416098R23486K013894J822567J724607J981146K134002
14320E8138992J910385J479471K820059K524990K033984K861206K604599L483584
14312G7857270K930798L046069L629638L400034M124529M135887M222115N007341
$$ plain form
14372 15167996 15635101 15548073 16412854 16517430 17035766 17487271 17722362 17900211 18458272
14363 18458272 18417700 18870746 19223883 19626043 20213252 20513485 21233254 21678220 22026220
14354 22026220 22310785 23113526 23663092 24176918 24746081 25329296 25965635 26831133 27715341
14345 27715341 28229023 29094129 29587618 30508476 31341646 32152367 33080733 34111791 34971866
14336 34971866 36025871 37239447 38200620 39146344 40582249 42033397 42970179 44654272
14328 44654272 46123192 47539290 48462776 50476670 52299237 54023844 56004990 58138992
14320 58138992 60049377 61528848 64348907 66873897 68907881 71769087 74373686 77857270
14312 77857270 80788068 83834137 87463775 90863809 94988338 99124225 103346340 108353681
14304A08353681M525450N219299N211288O399146N866307O568455O966239P602285
14296A56712150P799682Q163475Q691254R446510J0028089J0221751J1063630
14289B22126541J1487574J2032400J2595999J3239369J3203734J3929754J4535447
14282C13150818J4088803J4401143J4697314J3839589J3423848J3023727J1708592
14275D08333834J0047528Q570994N087879J13916K34749N24064r14570m080788
14267D27917606l803978o551647r850131j0967999j2967384j4371071j4770642
14260C54634754j5438953j5389796j5109575j5122943j4466192j3894437j3515016
14253B51697842j2923605j2081902j1734165j1309320j0560999j0126873q295074
$$ plain form
14304 108353681 112879131 118098430 123309718 129708864 135575171 142143626 149109865 156712150
14296 156712150 164511832 172675307 181366561 190813071 200841160 211062911 222126541
14289 222126541 233614115 245646515 258242514 271481883 284685617 298615371 313150818
14282 313150818 327239621 341640764 356338078 370177667 383601515 396625242 408333834
14275 408333834 418381362 426952356 432040235 432154151 432388900 432912964 431998394 427917606
14267 427917606 424113628 417561981 407711850 396743851 383776467 369405396 354634754
14260 354634754 339195801 323806005 308696430 293573487 279107295 265212858 251697842
14253 251697842 238774237 226692335 214958170 203648850 193087851 182960978 174665904
14246A74665904p253740q448108p517675p606461p243385o598834n878239n447773
14238A18671689n142496m883528m608402m993844m093670m123978l527730l320045
14230H3977996l483521k963220l669831k767791k571379k538173k459852j898752
14222F1625477k428949j944611j880739k120896j601851j763987j715552j561422
14214D6607470j201162j096408j643187j646323j154027j025664j343589k58842
14206C7238268j370381j079856r50201q18496j167709o67880k96356j040663q24171
14197B9022555j109885p79991n42916m38316p18849o09463m92950o62616m81625
14188B3185944o20739o27074m97449l34669o26546m53607k15584m70967m62546
$$ plain form
14246 174665904 167412164 158964056 151446381 143839920 136596535 129997701 124119462 118671689
14238 118671689 113529193 108645665 104037263 99043419 94949749 90825771 87298041 83977996
14230 83977996 80494475 77531255 73861424 71093633 68522254 65984081 63524229 61625477
14222 61625477 59196528 57251917 55371178 53250282 51648431 49884444 48168892 46607470
14214 46607470 45406308 44309900 42666713 41020390 39866363 38840699 37497110 37238268
14206 37238268 35867887 34788031 33837830 33019334 31851625 31183745 30887389 29846726 29022555
14197 29022555 27912670 27132679 26589763 26151447 25432598 24823135 24330185 23667569 23185944
14188 23185944 22565205 21938131 21440682 21106013 20479467 20025860 19810276 19339309 18876763
14179A8876763l61902l86418n48309m34194L2729p10711k12060n60740J36533
14170A5831691n03089k56453j81880n01723j73495l15007m17397Q7311m15078
14161A3154880J0139K1864o99772k37627M0518n49655M4754l52786j11941k50122
14151A1070252k01804J5404m59479J44115l15691J21465m08029j50333O7642l67787
14141I515755L8401l02648Q5142n87014K13478j32418k61474j60342j34466K8073
14131H302487p3943J28124k82278j78739j30061j44155j66566O864l13522M4167
14121G192378k38071r6649J68909k18264l86510J00549J73603l63357P1220J42122
14111F545930k24285j93927j87929K37633k85396k08800J90862l86886M56204
$$ plain form
14179 18876763 18514861 18128443 17580134 17145940 17178669 16467958 16255898 15695158 15831691
14170 15831691 15328602 15072149 14890269 14388546 14215051 13900044 13482647 13569958 13154880
14161 13154880 13165019 13186883 12487111 12249484 12290002 11740347 11785101 11432315 11320374 11070252
14151 11070252 10868448 10883852 10424373 10568488 10252797 10374262 9966233 9815900 9883542 9515755
14141 9515755 9554156 9251508 9336650 8749636 8963114 8830696 8569222 8408880 8274414 8302487
14131 8302487 8228544 8356668 8074390 7895651 7765590 7621435 7454869 7461733 7148211 7192378
14121 7192378 6954307 6857658 7026567 6808303 6421793 6522342 6695945 6332588 6403808 6545930
14111 6545930 6321645 6127718 5939789 6177422 5892026 5683226 5874088 5487202 5943406
14102E943406k55387k30273O4197r4467o2766J11327r8607o1817k70449J89426
14092E234590n60942n6403L74396K43255m67167k03005Q9872k81475j7076k37156
14082D118889M26616l39201K59087O1275m89782K22762o1271j851J59175l50192
14072D005507j01592k93621N11065l49132M7229J27520j75363L3741K72888n47705
14062C530537K16284k12128N54745n61165L66259l46493j62101K5571J40369l91207
14052C160671L63049j36297j36826K55880n41314J30935J51813k40178K06770
14043C214503k36194j51771K38183n14604K27628Q5597M4369l08603J99675K19987
14033C018770k62382j3650M3125J31750j46796N7835j98162M5012j47150P3281
$$ plain form
14102 5943406 5688019 5457746 5521943 5427476 5364710 5476037 5377430 5315613 5045164 5234590
14092 5234590 4673648 4617245 4991641 5234896 4767729 4564724 4654596 4373121 4356045 4118889
14082 4118889 4545505 4206304 4465391 4526666 4036884 4259646 4198375 4196524 4355699 4005507
14072 4005507 3903915 3610294 4121359 3772227 3819456 3946976 3771613 3805354 4078242 3530537
14062 3530537 3746821 3534693 4089438 3528273 3894532 3548039 3385938 3411509 3551878 3160671
14052 3160671 3523720 3387423 3250597 3506477 2965163 3096098 3247911 3007733 3214503
14043 3214503 2978309 2826538 3064721 2550117 2777745 2863342 2907711 2599108 2798783 3018770
14033 3018770 2756388 2742738 2785863 2917613 2770817 2828652 2630490 2675502 2528352 2601633
14023B601633j01598J89141j3469l30377K67143j06451r0693o5014J82059l21166
14013B211208J04435k31037N40411l81342l33312K05986p1785J79596J15428Q8068
14003B427656p53142M38786p6287J53582N3092p9963n98696M27577j9527J14087
13993B087165j41878L345K1272J70600R82101K680479O301640J7026636J7910915
13984D7042275k3122505A1065516m264336j727776q71174n71830k58122o29181
13976B743097K53354n38243M60927o04346N972j76303K1434k29425M42251k7607
13966B351111l34911j71629n9178K93447R1053k30423m5707j81871l0161K0742
13956A702473J86953q6530O3745p2726j00719J98560K9316l14790n0429J98273
$$ plain form
14023 2601633 2500035 2689176 2675707 2345330 2612473 2506022 2415329 2350315 2532374 2211208
14013 2211208 2315643 2084606 2625017 2243675 1910363 2116349 2044564 2224160 2339588 2427656
14003 2427656 1674514 2113300 2037013 2190595 2243687 2163724 1565028 1992605 1973078 2087165
13993 2087165 1945287 1948632 1969904 2140504 3122605 5803084 12104724 29131360 47042275
13984 47042275 23919770 11065516 6801180 5073404 4202230 3630400 3372278 2743097
13976 2743097 2996451 2458208 2919135 2314789 2320761 2144458 2165892 1936467 2378718 2351111
13966 2351111 2016200 1844571 1785393 2078840 2169893 1939470 1893763 1711892 1681731 1702473
13956 1702473 1889426 1802896 1866641 1793915 1693196 1891756 1921072 1606282 1555853 1754126
13946A754126J58434k64059j35641R5243J37285j1307m6694m53793K87041J37348
13936A657983N592m9609q3770J55865j79506P335l12339J10413m3333K72300j92945
13925A347986M7849k14699J61996j07204J77785N955Q550J0387p6663k15550L81071
13914A527463k22756J37108k43775K73637j40061q9226P4709J59215k88554J36361
13904A324121l6293j63690J01529j02092K6513Q5909l9167k55257L99281l35626
13894A005228J01608Q0707j39070J86774K14330l54912J3799M36000m40845l570
13884A100049k42197K48262k11680K44417k65302K04477j91062J76280r327L0816
13874A084733q1891l32217J55365p1810J30338j55669K92984k13232k9818K60760
$$ plain form
13946 1754126 1912560 1648501 1512860 1608103 1745388 1734081 1687387 1233594 1520635 1657983
13936 1657983 1663575 1613966 1530196 1686061 1506555 1513890 1201551 1311964 1268631 1540931 1347986
13925 1347986 1395835 1181136 1343132 1235928 1413713 1419668 1428218 1438605 1361942 1146392 1527463
13914 1527463 1304707 1441815 1198040 1471677 1331616 1242390 1317099 1476314 1187760 1324121
13904 1324121 1287828 1124138 1225667 1123575 1150088 1235997 1196830 941573 1340854 1005228
13894 1005228 1106836 1187543 1048473 1235247 1449577 1094665 1108464 1544464 1103619 1100049
13884 1100049 857852 1106114 894434 1138851 873549 1078026 886964 1063244 1053917 1084733
13874 1084733 1002842 670625 825990 754180 884518 728849 1021833 808601 778783 1039543
13864A039543k71383J91848J25298l0078r5418k95116k05337O87652l47919j72952
13854F26138K70088l9809L7536K28680j05932j01621j50565j88174L30347k64031
13844F42657M8435J81811L60743m32918R5853j12772k04849N4240K64477j37916
13834G59761J19959D32677N32716r5575k30793j2662L32928m54327L30761N1318
13824H87043J21263C94339M14570P9512n2220j15660q8608J58554n359K99299
13814A084427l29527L07936m22997P3391J88758j6168N2359o7030j23843J07234
13804H54540p2346J09944D38014K67536k17427L60345j40578N2394j99864J22877
13794F83297o6388J60790N74442o31100J23338j87670J40936K27282D61707M26120
$$ plain form
13864 1039543 768160 960008 1085306 1055228 959810 664694 459357 1147009 799090 626138
13854 626138 896226 856417 893953 1122633 1016701 915080 764515 576341 906688 642657
13844 642657 691092 872903 1233646 800728 896581 783809 578960 633200 897677 759761
13834 759761 879720 432677 965393 869818 639025 626363 959291 504964 835725 887043
13824 887043 1008306 394339 808909 888421 836201 720541 631933 790487 785128 1084427
13814 1084427 754900 1062836 639839 713230 901988 885820 938179 871149 747306 854540
13804 854540 782194 892138 438014 705550 488123 848468 707890 760284 560420 683297
13794 683297 616909 777699 1352141 721041 844379 656709 797645 1024927 461707 887827
13784H87827J00964k12652l84537J36510M09029j94041J49859k9245j73553j78757
13774E11404K86681K0765k17449L61977l34142M3487j68835K53992M6637k03259
13764F01258j72214L81024j73195j91169J64052k99310R3492K12566k51472J40965
13754E05997n7702r1746M59096j13392k26410K9825j15954o285P4494J42595k58132
13743C42386M18711k68123J38438r1411l9735m0243j09004K98832j10488k31414
13733C07949P9901Q4137J54082j73386K57316k43683M4960P1236R7017j39243
13723E40286K31858C73390K65047k91714M58134k77036B63812K06783J1359A73660
13712E40380O7580j60505J7945O9229j05792o4485M65043k80323L0500j7116j54175
$$ plain form
13784 887827 988791 776139 391602 528112 937141 743100 892959 863714 690161 511404
13774 511404 798085 818850 601401 963378 629236 672723 503888 757880 804517 601258
13764 601258 429044 810068 636873 445704 609756 310446 403938 616504 365032 505997
13754 505997 448295 356549 815645 702253 475843 505668 389714 383429 457923 600518 342386
13743 342386 761097 492974 631412 540001 500266 460023 351019 649851 539363 307949
13733 307949 387850 471987 626069 452683 709999 466316 511276 582512 679529 540286
13723 540286 772144 373390 638437 346723 804857 527821 263812 470595 481954 173660
13712 540380 607960 447455 465400 534629 428837 364352 829395 549072 579572 562456 408281
13701D08281A97264O36063l08195J60949k89675K28940k70095J55373j58375J88813
13691E41062o3611A04420L81630R867m3440k6442Q8214k11172K57190j08422j63041
13680B88804J60763J45181o7442l2919R824j78206L05962j61043j65122J54165
13670D59967l8144J82409j95345q9065Q6234K1698J54075k23163A21136M76329
13660E97465j50103l3803M5824K79334j22876k82546M6421q7292j9263J33726
13650D06887l1830J53601k09062L64405k75394N5214j32950j6032q1297J21900
13640C55442n7474R9950p7327l2551M2954k240J8374P9477j43929A03962K7453
13629A31415R7244A01100M53433B32091L67760k08401J07963L4005n9768k01016
$$ plain form
13701 408281 197264 833327 525132 686081 396406 625346 355251 510624 352249 541062
13691 541062 477451 104420 486050 495917 452477 426035 514249 303077 560267 451845 288804
13680 288804 449567 594748 527306 494387 504211 326005 631967 470924 305802 459967
13670 459967 421823 604232 408887 319822 406056 427754 581829 358666 121136 597465
13660 597465 447362 413559 459383 738717 615841 333295 379716 292424 273161 406887
13650 406887 375057 528658 319596 684001 408607 463821 330871 314839 233542 355442
13640 355442 297968 397918 320591 288040 330994 328754 347128 426605 282676 103962 131415
13629 131415 228659 101100 554533 232091 599851 391450 499413 533418 473650 272634
13619B72634j8394J03748K29924j00791E0850L63243o1042J71303B08784J78868
13609C87652j38562N4350p7488l4865J49248j54786K57298Q1360B25075J07057
13599C32132j33315J97587A63383Q8368J30274L8043j2937A75138J25378J0360
13589C10876J48565K2415B36034R4986r3058g092D59103J56325l05177g0704B43140
13577A17650k3671K61696P5009P3369A54630L56288k38793K83501j98195F3236
13566D54755j31343n2504O3225j23105J58066J44214a91203B71299r7337L4387
13556B08349L00366C4690J29345J74922A54033J2886J89984a42593E02699A98013
13545E38383k65193n2241A03426J80574j1281K80469A93420P2189R8005A45905
$$ plain form
13619 272634 254240 357988 587912 487121 50850 414093 353051 524354 208784 387652
13609 387652 249090 303440 225952 191087 340335 185549 442847 524207 225075 332132
13599 332132 198817 396404 163383 251751 382025 420068 407131 175138 300516 310876
13589 310876 459441 481856 236034 331020 237962 -7092 459103 615428 310251 -70704 243140
13577 117650 93979 355675 430684 504053 154630 510918 272125 555626 357431 63236
13566 454755 323412 270908 334133 211028 369094 513308 -191203 271299 173962 208349
13556 208349 508715 34690 164035 338957 154033 166919 356903 -142593 502699 198013
13545 538383 273190 220949 103426 284000 272719 553188 193420 265609 363614 145905
13534A86035M1447A11580J26279D0469J17301M9800K22457j78268e1528A93867
13523E1049e2382C00560j9047R2593A22472K0306M08219A93480l5477K04977J22589
13512D85569j97512I0003M55112A01214P0619n0121K33356j75831A6676J54281
13502A70957J49821E7459J61803a01622C39282J08871A86524I1675K46713j18302
13492B20086J6525a02556C71673n220j18287p3194P5330p9600K00185B4326K69662
13481B93988J0589M3371o5494a64431B12463b01528A10523e5618F7874K50153
13471C18027E3935J33425a2583B51017D0001R49K0098J11204O2277H0943j6183
13460F4760M7885L20339o9821r3534F5075r690J21962J47306d10m4792C25707
$$ plain form
13534 186035 227482 111580 237859 40469 157770 207570 430027 251759 -51528 193867
13523 51049 -52382 300560 281513 374106 122472 142778 550997 193480 158003 362980 485569
13512 485569 288057 90003 545115 101214 171833 121712 355068 179237 16676 170957
13502 170957 320778 57459 219262 -101622 339282 448153 186524 91675 338388 220086
13492 220086 236611 -102556 371673 366453 248166 174972 250302 170702 370887 24326 293988
13481 293988 304577 347948 282454 -164431 212463 -201528 110523 -55618 67874 318027
13471 318027 53935 187360 -12583 251017 40001 40950 61048 172252 234529 80943 64760
13460 64760 112645 432984 363163 269629 65075 55385 177347 324653 -410 -45202 325707
13448i247C56675p1643a23933D73866A94330a12361A62839J41731A07889J28901
13438B36790K61600j88833k2225J24498A35733a70553B61949J7068n8055r805
13428B11157J08013J8557C0910N9979J70648O8803A18348L25750A39276P1529
13418B10805J76921A88802K26697A10846N8800o2870d8521D73410k02782j20734
13408A49894K3164R0566l6082Q6528B4347J20614A0432L78000j78262a15671B34631
13396A20637j8782H833J33325J00291K7345J3333o3726R8313H6967K87314F9116
13384A25537f3197C4756M5819K13326i71H9522D3060K2695l1823J54046P3621
13373B61599A11971K77821j18923M6151b6836A04932K16973j60208K51809a50495
$$ plain form
13448 -9247 356675 285032 -123933 473866 194330 -112361 162839 304570 107889 236790
13438 236790 498390 309557 287332 411830 135733 -170553 261949 279017 220962 211157
13428 211157 319170 337727 30910 90889 261537 330340 118348 444098 139276 210805
13418 210805 387726 188802 415499 110846 169646 106776 -48521 473410 270628 149894
13408 149894 173058 263624 227542 314070 24347 144961 10432 388432 210170 -115671 234631
13396 120637 101855 8833 142158 242449 269794 283127 219401 317714 86967 374281 69116
13384 125537 -63197 34756 80575 293901 -971 89522 43060 65755 33932 187978 261599
13373 261599 111971 389792 270869 317020 -26836 104932 321905 161697 413506 -150495
13362C23361m7664k0695A08220K4368M8102O6280a15960C19400Q0239l7008k5118
13351C37513j56589K96533h2573A69356Q9014a3635E71M00063j71755J86478E8011
13339C42090I7114M63675A50946J73660a07338D16594j41556p6359J9689O2270
13329B80638J99862A61087n7310K7969M63589B01395G9938i6858C6757O1074b2516
13317H8454F856J35988F3182K69803J8531H9040C0039L99373j28762q6641L6126
13306B50135I876R1250a53002D53465j60784l3292K0336A30505d148C31943a07296
13294f6927A91848k6492L56457k27473l0204K0759h1417L8509j27621A25644J39257
13283B64901G5370c6317B0867d2117o4096e1430B75015g8262H2788j9332K95115
$$ plain form
13362 323361 275697 255002 108220 132588 180690 246970 -115960 319400 399639 362631 337513
13351 337513 180924 477457 -82573 169356 258370 -13635 571 400634 228879 415357 58011
13339 342090 97114 560789 150946 324606 -107338 416594 275038 198679 218368 280638
13329 280638 480500 161087 103777 131746 595335 201395 79938 -96858 36757 97831 -22516
13317 88454 6856 142844 63182 332985 351516 89040 30039 429412 300650 214009 250135
13306 250135 9876 101126 -153002 453465 292681 259389 279725 130505 -4148 331943 -107296
13294 -66927 191848 165356 521813 294340 264136 284895 -81417 -42908 -170529 125644 264901
13283 264901 75370 -36317 20867 -42117 -106213 -51430 275015 -78262 82788 63456 358571
13272C58571a43174G5168f4825I3432C4854b30931A02893d0388C01750F6169b77492
13260A59499d6236A92159n4313J02381P4869D2437R1378C0709d5113A28251Q9457
13249B17708G1671c0024B33843E8057L92707A36699K37093a00505K2737A5608
13238a8425H4964g8802G8733b3611B49514a51262L0758A39050n0450B1336i782
13226H201b0498A72225c6736j17893N6262B21051J76601j64156r5183L3785C21
13214a5815A7912d1947C48305A01912l6384L29716A56724b20969A00431N5462
13204A55893C3706P4988J6810J47093J18473j61287d9638B01163m1104J20104
13194B80163j04296E03L6030N43533G1801M30338a83673M1449j42478A64696E4829
$$ plain form
13272 358571 -143174 75168 -64825 93432 34854 -230931 102893 -40388 301750 66169 -277492
13260 159499 -46236 192159 137846 240227 315096 42437 133815 30709 -45113 128251 217708
13249 217708 71671 -30024 233843 58057 450764 136699 373792 -100505 -77768 15608
13238 -18425 84964 -78802 78733 -23611 249514 -151262 -120504 139050 88600 21336 -9782
13226 8201 -20498 172225 -36736 -154629 -98367 221051 397652 233496 138313 172098 321
13214 -15815 17912 -41947 348305 101912 65528 395244 156724 -220969 100431 155893
13204 155893 33706 108694 125504 272597 391070 229783 -49638 201163 160059 280163
13194 280163 175867 503 36533 580066 71801 502139 -183673 -142224 -284702 164696 54829
13182A9118a52074D91790A94815M7048i4044H1102J66038g2146A01199b72373
13171d1383C75346A67156k0838a68547c0215q0988c546B41858E9771K75236c0196
13159A81874a343B62750N8860e8339G0359A3892J6937h839j24437L7567j60562
13148b56271a744B20286b02146C164K41555K0547j03761d8466j34459j0855C6321
13136b75307C1846J03074c9474P226n4342A99785a87405H6859m1946M2898b02072
13124b93291C0602e5612a4616G5933Q4176D7329R8617C3374Q7837J04029a21080
13112C1471L12998A0377a52586i811k79162A73237b51328A18225b30796B17278
13101C15839c9970A07769a03243A0862J32764b01413p8291B22280b07828A06273
$$ plain form
13182 19118 -152074 491790 194815 241863 -94044 81102 247140 -72146 101199 -272373
13171 -41383 375346 167156 146318 -168547 -30215 -111203 -3546 241858 59771 335007 -30196
13159 181874 -1343 262750 321610 -58339 70359 13892 30829 -8839 -133276 -95709 -256271
13148 -256271 -1744 220286 -202146 3164 244719 265266 161505 -48466 -182925 -193780 36321
13136 -275307 31846 134920 -39474 -32248 -86590 199785 -187405 86859 44913 87811 -202072
13124 -293291 30602 -55612 -14616 75933 160109 47329 145946 33374 121211 225240 -121080
13112 31471 344469 10377 -152586 -9811 -288973 173237 -251328 118225 -230796 217278
13101 315839 -39970 107769 -103243 10862 143626 -201413 -279704 222280 -207828 106273
13090F742a58549A42924i2976F9294J44985a20245B8320R2490b42013B43650A16550
13078E8411J32044E4421a0964A70784a91235A04533h7383A39476e1506j01536
13068a53042B80031a50040F772N63324k83329N3187j29089h3660j10597R0541
13058a03716A02398a25798A1437h8609I0219m1985g5696I5295a89141E4731J13805
13047A68536K68272a2030G6015J40059J1113D69b03600a2816F5755J75407A02891
13035G4686a00692C06343K5218r3879a34394E4147A4565b05591A37882C1618c326
13023c5458j50965M4066b7770G3736a13379E936L7019J95263j05772L33221B172
13011i9351B30223b5565A82103a12862b4990D31043A17416c1390A63542N9918
$$ plain form
13090 6742 -158549 142924 -92976 69294 214279 -120245 28320 120810 -242013 243650 116550
13078 58411 190455 54421 -10964 170784 -191235 104533 -87383 139476 -51506 -153042
13068 -153042 280031 -150040 6772 570096 286767 339954 210865 -83660 -194257 -103716
13058 -103716 102398 -125798 11437 -88609 90219 48234 -75696 95295 -189141 54731 168536
13047 168536 436808 -12030 76015 216074 227187 469 -203600 -12816 65755 241162 102891
13035 74686 -100692 306343 331561 237682 -134394 54147 14565 -205591 137882 31618 -3326
13023 -35458 -186423 -142357 -27770 73736 -113379 5936 42955 238218 132446 465667 2172
13011 -99351 230223 -25565 182103 -112862 -24990 431043 117416 -31390 163542 223460
13001B23460i7244B7789M28114j31856C3273a4944H2329K7517b31839C12837n6193
12990B56644E1855J37210a50225A41357c48233i1489e902C07352i9149F1571R5211
12979A56782A7289a56042F0205g6195e949B4473c10560B90027f944j63188D011
12967a72084B70318F3442O2214B3659M15540A94221G1794i131l84048a48269A20556
12955d6507n7352k91669a33051j259I2442k1360c11707B37187a35275B59317a30295
12943C6343e8098I4844C2839b06702B9386K67869b03838H961P8648c8099B38941
12931i9589l8423D0730a58370f3750C51277a65266L5059B58499j05737a770B7430
12919a74177N1782r1608K1636N0288A14199e5980q8967o8039A83297p5003B8403
$$ plain form
13001 223460 -97244 27789 455903 324047 33273 -14944 82329 109846 -231839 312837 256644
12990 256644 51855 189065 -150225 141357 -348233 -91489 -5902 307352 -99149 61571 156782
12979 156782 17289 -156042 60205 -76195 -5949 24473 -310560 290027 -6944 -170132 4011
12967 -172084 270318 63442 125656 23659 439199 194221 71794 -9131 -393179 -148269 120556
12955 -46507 -103859 -395528 -133051 -134310 92442 71082 -311707 237187 -135275 259317 -130295
12943 36343 -58098 94844 32839 -206702 29386 297255 -203838 8961 87609 -38099 238941
12931 -99589 -138012 40730 -158370 -63750 351277 -165266 -130207 258499 152762 -1770 27430
12919 -174177 -122395 -214003 -192367 -142079 114199 -55980 -144947 -212986 183297 108294 28403
12907B71870i3159j53210F5223b64660Q7688D0495a1935E1796b70881b7382j32657
12896a60039J6711C97958j55055p5473i7580M8335B69587a08138M724i552A69812
12884a88312F8779c3797D3648a57712d2909B46420J38677h8517D5191b51118A63454
12872I6630c9647G642a1604r215k80661F4281J656c86706c0263l12570B49887
12860H1982J6382a5099B07202e5290A88590a61112F012J96685a66773A76519J62166
12849C38685i7510n7879O8181j71018B12923b01002F6993e2877a6222I1647q125
12838H3522K5754J28907J46107A46764R081b9189j01576b0455A98028I714K98781
12827C08495b0680B11145R6244A14512K9684J09492b01211G0914K3017h0515H714
$$ plain form
12907 271870 -93159 -246369 65223 -264660 -176972 40495 -11935 51796 -270881 -27382 -160039
12896 -160039 -143328 397958 242903 167430 -97580 -49245 269587 -108138 -103414 -9552 169812
12884 -188312 68779 -33797 43648 -157712 -42909 246420 385097 -88517 45191 -251118 163454
12872 96630 -39647 7642 -11604 -20819 -301480 64281 65937 -386706 -30263 -342833 249887
12860 81982 98364 -15099 207202 -55290 188590 -161112 6012 202697 -166773 176519 338685
12849 338685 -97510 -155389 -87208 -258226 212923 -201002 66993 -52877 -16222 91647 83522
12838 83522 109276 238183 384290 146764 155845 -29189 -130765 -20455 198028 9714 308495
12827 308495 -20680 211145 307389 114512 144196 253688 -201211 70914 93931 -80515 8714
12815C6530J39903a32419j11582D4056P9152E1723d4542o8458B6558a56158M1954
12804a14204D3926J62733j8465O7013A24878M324C2191J78500J37566D6652J22547
12793A69199m579a42240A00566j1538k3499J12700a80082h6536q3502N4637B36646
12781G1132a40457A17812a41479j68211J00091H9909J20920P6388r7957a17881
12770h6960i728n2045D9309K60160a01482d2282j15153I891J1239P7889D2096
12758b22143A04068h7659j2718j36127F9017a04898C2001a41569B32242E8901
12747B11450a77121M2946B221a3913B9917c18315F5726R7345a2689A10010l207
12736A06803J1594b56623C1871G960a42070I9144i2591B74491i5627m3702A72248
$$ plain form
12815 36530 176433 -132419 -244001 44056 123208 51723 -44542 -113000 26558 -156158 -114204
12804 -114204 43926 206659 188194 255207 124878 129202 32191 210691 348257 46652 169199
12793 169199 164620 -142240 100566 89028 65529 178229 -180082 -86536 -170038 -115401 236646
12781 71132 -140457 117812 -141479 -309690 -209599 89909 210829 287217 189260 -117881
12770 -86960 -9728 -61773 49309 309469 -101482 -42282 -157435 9891 21130 99019 42096
12758 -222143 104068 -87659 -100377 -236504 69017 -104898 32001 -141569 232242 58901
12747 211450 -177121 -134175 2221 -13913 29917 -318315 65726 163071 -12689 110010 106803
12736 106803 118397 -256623 31871 7960 -142070 99144 -92591 274491 -95627 -139329 172248
12724A24874N4127B5617g7084D0530P1240l807e3559j60092A32914K9745b96734
12712I1105c55581f6542K6431A80546n7331P8327k8835b00743A23943a54819H5494
12700C13451A10857b60148J11893f5053K0346A31395C8998A9244c7051q1612A77379
12688D7115k2895a07802C0043K84923a33529A49065o8289O4639f5709B2103L7428
12677E9531b1679k26342J15216H2184a21557A16776h3168K7504k8319j44401A79244
12665A60423M7524O0362i3555j05405b8423B31366m7912J1113l1112a57007D8513
12653A3656L0783j4945J20118e6299B00886P9936c7879A85627b134j82228l1337
12642b15699R7999b0901A1653K6272O2904a5134q0072A68940K37478E4080K0041
$$ plain form
12724 124874 179001 25617 -77084 40530 111770 107963 -53559 -213651 132914 162659 -296734
12712 91105 -355581 -66542 -40111 180546 123215 201542 172707 -200743 123943 -154819 85494
12700 313451 110857 -260148 -148255 -65053 -44707 131395 38998 19244 -37051 -118663 177379
12688 47115 24220 -107802 30043 314966 -133529 149065 80776 145415 -65709 22103 59531
12677 59531 -21679 -248021 -132805 82184 -121557 116776 -83168 -55664 -83983 -228384 179244
12665 160423 207947 268309 -93555 -198960 -28423 231366 183454 194567 163455 -157007 48513
12653 13656 44439 29494 149612 -56299 200886 280822 -37879 185627 -2134 -184362 -215699
12642 -215699 -117700 -20901 11653 37925 100829 -15134 -95206 168940 406418 54080 74121
12631G4121C6472e4005A09500L07364A05522P734P7063e18477F3695M6093a56245
12619c0822A90637r3709a44323G9730K89226B3943c4175q8851B24731C8368c3267
12607D08327G7346k4672b46323A20370b00563e9698k2722i042C93960b57847B24838
12595a29112K2577A8267Q771m813J76508M433J74307a13356p8402M8998D6502
12583B8454b2737F3004K27589a34691f2071j37007B51642F372b27915F1806a54058
12571D2770P3487a19096a8973O01l10910a48627c0780k3643B9425a45651A74580
12559a20045d6378A93802g0117m0308j8845A57993m4688f0108E0124L034K53722
12548C06880n0614A26733b52404a07622j9594o4321b5975E2280a14931A68993
$$ plain form
12631 74121 36472 -54005 109500 416864 105522 113256 190319 -518477 63695 109788 -156245
12619 -30822 190637 96928 -144323 79730 368956 23943 -34175 -123026 224731 38368 -33267
12607 408327 77346 52674 -246323 120370 -200563 -59698 -82420 -9042 393960 -257847 224838
12595 -129112 -106535 18267 27038 22225 198733 203166 377473 -113356 -191758 -142760 46502
12583 28454 -22737 63004 290593 -134691 -62071 -199078 251642 6372 -227915 61806 -154058
12571 42770 116257 -119096 -18973 -18372 -329282 -148627 -30780 -54423 29425 -145651 174580
12559 -120045 -46378 193802 -70117 -110425 -129270 157993 113305 -60108 50124 53158 306880
12548 306880 256266 126733 -252404 -107622 -127216 -191537 -25975 52280 -114931 168993
12537a24844j27821G8192K959L9918f1716p7501o624c5394C2547b40538b682k74649
12525b77331g267A50617C1262N0735b13540L9406A08288K0498J23763A02454B0850
12513A17037K86906H3559a43314c6447A00740J04076l0009A5386R3923d0174a9024
12501C330K1467e0756I7575b53944H1547k9698O0066R2008Q561f3419A31662J09798
12489B41460J33524A71997j699a585C07734L6946E1837d6A82928K40951A97220
12477G3192J65558b66875J08479B59799d06770J50316c7967o4850A96531i2755
12466a37790n6460B18885J948j06347a01507B74757O0006a44725I3553K4120A1753
12454a01724A76775l5084j1864m5021J35214o2967h3595k03062H3898c10021i4851
$$ plain form
12537 -124844 -252665 78192 81151 121069 -61716 -139217 -145841 -35394 32547 -240538 -2682 -277331
12525 -277331 -7267 150617 31262 81997 -213540 -174134 108288 128786 252549 102454 20850
12513 117037 403943 83559 -143314 -36447 100740 204816 174807 15386 109309 -40174 -19024
12501 3330 24797 -50756 97575 -253944 81547 51849 111915 203923 212484 -63419 131662 241460
12489 241460 374984 171997 170298 -1585 307734 344680 51837 -46 182928 423879 197220
12477 73192 238750 -266875 -158396 259799 -406770 -256454 -37967 -102817 196531 -92755
12466 -137790 -194250 218885 220833 114486 -101507 274757 334763 -144725 93553 117673 11753
12454 -101724 176775 141691 129827 84806 220020 157053 -83595 -286657 83898 -310021 -94851
12442D5303f3494j93313Q6049L4176q4984a08613A14038a1151q7496B87413H6028
12430f3372j03903R054b1549m2879p9412d7731q5705N0852G5120M0081a4006B95713
12417b34720C2691J20676G6356P6650a43368N1541B75133a63398G753a76728h6375
12405b0406j29658B46899B3241i1149j335l2835j40646F8352i7011r6483H0072
12393E006K71387E6172b8921J3959A77490o128a20710C49865E6237J74356J37178
12382C67771B3583a79958c0473m0020G0176R4369a0745A76554A0986O5438L06406
12371C82830A81359b33842b0055H5335c71462D1248b24600C97826h5684k29623
12361c15307j02642I5933J85884H5317b59365A46181E7575f3097A33941A8005
$$ plain form
12442 45303 -63494 -256807 -170758 -136582 -221566 -108613 114038 -11151 -98647 287413 86028
12430 -63372 -167275 -158221 -21549 -64428 -143840 -47731 -133436 -82584 75120 115201 -14006 295713
12417 -234720 32691 153367 76356 153006 -143368 -91827 275133 -163398 7753 -176728 -86375
12405 -20406 -150064 246899 23241 -91149 -92484 -125319 -265965 68352 -97011 -193494 80072
12393 5006 276393 56172 -28921 -14962 177490 171362 -120710 349865 56237 230593 367771
12382 367771 23583 -179958 -30473 -70493 70176 164545 -10745 176554 10986 76424 382830
12371 382830 181359 -233842 -20055 85335 -371462 41248 -224600 397826 -85684 -315307
12361 -315307 -417949 95933 281817 85317 -259365 146181 57575 -63097 133941 18005
12350c5425B0945a49284q6064B38068J87116H9995e9797j01042F8857a08977A11446
12338A44571b83865f0444J6290B35842A11943J75856j03130n2736J57405f0017
12327e4170D3026L35647E6794M09281j85829J3607N8335H4754K85508j78653n9351
12316A32258a62736j35033d3611J2283E3392M8587K6014b33853r524I3016J44952
12305B37968g4875I391L21905k5919i14p9904j05599c7559J4984C22147F969M2376
12293D9345O3616R8756C2830d2942j35344A62735f7536H1889J37899K29558i7715
12281B86498n0609a12223E0957J19220F7063J16649M9989r0775b7784l7565C75929
12269f9489n6638B93007g3917C15957h7147E2850d090r9583A41319E3246c5858
$$ plain form
12350 -35425 20945 -149284 -235348 238068 425184 89995 -59797 -160839 68857 -108977 111446
12338 144571 -283865 -60444 -44154 235842 111943 287799 184669 131933 289338 -60017
12327 -54170 43026 378673 56794 466075 280246 293853 352188 84754 370262 191609 132258
12316 132258 -162736 -297769 -43611 -31328 53392 101979 127993 -233853 -243377 93016 237968
12305 237968 -74875 9391 331296 305377 -914 -80818 -186417 -37559 -22575 322147 6969 49345
12293 49345 112961 211717 32830 -42942 -178286 162735 -67536 81889 219788 449346 -97715
12281 286498 235889 -112223 50957 170177 67063 183712 233701 142926 -27784 -65349 375929
12269 -69489 -126127 293007 -73917 315957 -87147 52850 -4090 -103673 141319 53246 -35858
12257A30009Q6097P5017j15811L3751d7505k7499F1411P9719D5217L02515J25426
12246D73158k03307i9007B48125B366J46759K27800A54931J15367j18311J68074
12236C20061c502C33229a2968B79664j29208a37157m2626A16007n0293b21671
12225a41998p2340I2879K98011j1245j24091A02288K71510Q6089N7634j85271
12215C32250j08973k746A06913K13737n3666j06515k3957j9351m4607L47243G5089
12203A85539d4590D21172B820d23819A68962g3886E55877C6232J29446a17084
12192b19701C07986r5291C1887K95955m274J21514A60205J39732j24767K54693
12182D29863j03117A60973G6156J71605J17614H48O6361f555B05234J26470a8497
$$ plain form
12257 130009 216106 291123 175312 209063 -47505 -75004 61411 141130 45217 347732 473158
12246 473158 269851 -99007 248125 2366 149125 376925 154931 270298 151987 320061
12236 320061 -3502 333229 -12968 279664 150456 -137157 -179783 116007 65714 -221671
12225 -141998 -214338 92879 390890 379645 255554 102288 373798 459887 517521 332250
12215 332250 223277 220531 106913 320650 266984 160469 136512 117161 72554 419797 75089
12203 185539 -44590 421172 2820 -423819 168962 -73886 555877 36232 165678 -117084
12192 -219701 307986 212695 31887 327842 323568 445082 160205 299937 175170 429863
12182 429863 326746 160973 76156 247761 365375 848 67209 -6555 205234 331704 -18497
12170H0051b2482B65054J11203o8287j30792b6984H1923L65491m1606A21545Q9131
12159B10676a54431C841K47556E7759K49866n1367I7757h9689C37788j63095a02361
12147A4005R5702A6580a0296C10399A49659J43336F276g0801B84811i7012A95798
12135A54216j2929a62343m6155D4519J56329N2103e7558I8230K87760A56310J12463
12124B68773m1272p6647K17875f7113C49878j41012K54458g5500I8887h7729F3737
12112a10654K9828C0901L18490a20764A81589J63128j67326B1076R7007L8011
12102A56094f9405B81033A29365L541l3239A7357J4458K56825K74425A12056m5698
12091F6358b014C80951b27150C4476L09215a60688a8857A4304J43950P6058k9737
$$ plain form
12170 80051 -22482 265054 376257 307970 177178 -26984 81923 447414 405808 121545 210676
12159 210676 -154431 3841 251397 57759 307625 256258 97757 -89689 337788 174693 -102361
12147 14005 109707 16580 -10296 310399 149659 292995 6276 -70801 284811 -97012 195798
12135 154216 141287 -162343 -208498 44519 200848 252951 -57558 98230 385990 156310 268773
12124 268773 227501 150854 368729 -67113 349878 208866 463324 -75500 98887 -87729 63737
12112 -110654 -80826 30901 349391 -120764 181589 344717 177391 21076 118083 156094
12102 156094 -69405 281033 129365 132906 99667 17357 31815 288640 563065 112056 66358
12091 66358 -2014 380951 -227150 34476 343691 -160688 -18857 14304 158254 234312 204575
12080B04575b31230g2920B74599p5953a18669C11110A13746a63221H2310k7924
12070E4386K05787E1923b21310C47721b28752E6025k3641K79130j37121b06371
12059C3521a66174M8507B35244C079J20950a38187l2208A80891Q0718B7320J92507
12048B19827B3815G721L3019A3475L03389A9290c2399F4466a7736k29767D2743
12036A8314e8309A14831B9351R72b32639B29736Q4557A1439b48972A58574m7340
12025A11234l6882g3485a316j02431C6461N3756i8279L8947F5217M2040i0456
12013A52206c04791a01575B46890b3557B41979a2632B1674e0931O238B7043K38450
12002B65493b05322p0790D8299a199A22668a17493L5870c1720B81671j00843J12463
$$ plain form
12080 204575 -231230 -72920 274599 198646 -118669 311110 113746 -163221 82310 54386
12070 54386 260173 51923 -221310 347721 -228752 56025 32384 311514 174393 -206371
12059 33521 -166174 -117667 235244 3079 124029 -138187 -170395 180891 261609 27320 219827
12048 219827 23815 7721 40740 13475 316864 19290 -32399 64466 -17736 -247503 42743
12036 18314 -58309 114831 29351 30323 -232639 229736 314293 11439 -248972 158574 111234
12025 111234 74352 -73485 -1316 -103747 36461 90217 -98279 -59332 65217 107257 -90456
12013 152206 -304791 -101575 246890 -23557 241979 -12632 21674 -50931 -44693 27043 265493
12002 265493 -205322 -276112 48299 -1199 122668 -117493 -81623 -31720 281671 180828 293291
11991B93291q6606O8449a75020J8065N820E7113a570B25733C8837P4854a23386
11979a66309H5123b71346B04360q4765b27183J9401B07754b31070E6095J3982
11969G0077J22709E6305g6825C80604a33720A40308l4669g4048k3749a9077A45685
11957i6522I6277b57543A17453b27963P1504A26308e8959l07330A7554a08663
11946c9919E4005J61232C9054a1843k61212C59169a09482D9339d34946j14672
11936e49618a9547r5406d3067h886A6264b2905B55877b73902b5913D4325j1257
11925C3068K20899c0956j86362Q1555k82530A95771A0388K72712A03805h4076
11914b95871B17479a54117B10491r8411a57137f812k77526A05283K4801F0727
$$ plain form
11991 293291 206685 275134 -175020 -156955 -151135 57113 -1570 225733 38837 113691 -123386
11979 -166309 85123 -271346 204360 119595 -227183 -207782 207754 -231070 56095 70077
11969 70077 192786 56305 -76825 380604 -133720 140308 105639 -74048 -97797 -19077 145685
11957 -96522 96277 -257543 117453 -227963 -156459 126308 -58959 -366289 17554 -108663
11946 -39919 54005 215237 39054 -11843 -273055 359169 -109482 49339 -434946 -549618
11936 -549618 -19547 -114953 -43067 -8886 16264 -22905 255877 -273902 -25913 44325 33068
11925 33068 253967 -30956 -217318 -135763 -418293 195771 10388 283100 103805 -84076
11914 -295871 217479 -154117 210491 112080 -157137 -6812 -284338 105283 130084 60727
11903A01822b06927l4352i1730B49431a87789j04501B79865E0541c8019F0779
11892f0698J3834R899j31445P8461j23623C2298c25898B7002a01921r6602i3327
11880c66391F0305g6346B11716R0292f7731H356c05762B45265g497q5045k9046
11869a21588D409a98002i3710A53923f2177C97600e6809a9420m06050K04843R9508
11858a21119B15614A9681J2767J65729r8707b30853D5107e9321E7256a40907A15434
11846B37599b4791m1737n2477B13990H5550a64226A5401f5374B6525J19046C4236
11834A95194g6313G9820a13903A71425d4365E4748c622l51076J16462M2341A32312
11822a24850k15541a33966d6698K0065G7635b87946L3133M1388f2747a0456j32504
$$ plain form
11903 101822 -206927 -241279 -91730 249431 -187789 -292290 279865 50541 -38019 60779
11892 -60698 -46864 -36965 -168410 -89949 -213572 32298 -325898 27002 -101921 -198523 -93327
11880 -366391 60305 -76346 211716 302008 -67731 8356 -305762 245265 -7497 -92542 -121588
11869 -121588 4409 -198002 -93710 153923 -62177 397600 -56809 -19420 -425470 -220627 -121119
11858 -121119 215614 19681 32448 198177 99470 -230853 45107 -59321 57256 -140907 115434
11846 237599 -24791 -66528 -119005 213990 85550 -164226 15401 -65374 26525 145571 34236
11834 195194 -76313 79820 -113903 171425 -44365 54748 -3622 -354698 -238236 -195895 132312
11822 -124850 -340391 -133966 -46698 -26633 77635 -287946 -254813 -213425 -62747 -10456 -142960
11811a42960B03806c8405l27677E2696b02885C8513K91838B2267R9646J08576
11801B30489N1169b31589C27088b47105O0263L7620j27533i766I8129a00898L4114
11790f6784A44110a26438B2614J63251p7478b50519J08671A56459a72429J0748
11780a61681L5314B13480a10072C0048J14158c78980a06901A1841a13543a227
11769f0105K2033B14650a32537B30235E0859b53238c7079q7618N3269a3383G7048
11757B5830d4939n6963j85298J6955a10900A98468q6154a07521a0104H746b20230
11745E1535i3042A39802C8207b10085B68295b2162j70700A0692a43829j6724j2274
11734a72827B91185F1016L15836A645L49058e5408D9389P0437J34495a58235m86648
$$ plain form
11811 -142960 203806 -38405 -366082 52696 -202885 38513 330351 22267 121913 230489
11801 230489 281658 -231589 327088 -247105 -186842 -149222 -276755 -9766 98129 -100898 -66784
11790 -66784 144110 -126438 22614 185865 108387 -250519 -141848 156459 -172429 -161681
11780 -161681 -126367 213480 -110072 30048 144206 -378980 -106901 11841 -113543 -1227
11769 -60105 -38072 214650 -132537 230235 50859 -253238 -37079 -124697 -71428 -13383 77048
11757 25830 -44939 -101902 -287200 -270245 -110900 198468 112314 -107521 -10104 8746 -220230
11745 51535 -93042 139802 38207 -210085 268295 -22162 -192862 10692 -143829 -160553 -172827
11734 -172827 291185 61016 376852 1645 350703 -55408 49389 119826 254321 -158235 -644883
11723f44883a18319M3259r3776D468d952A89474c6217A19304a34642c3210l2823
11712f6033n5916F4383a73999N4011B65823a3791B87630O6911h396B56776a4226
11700i5544A22869j4842K18753F1363a32113D1634a01642j60650A05097k7765
11690G7332c2560r4750n860k3075A30708b11480A12754J96290I741a00082l0498
11679a30580O3948k34722d13A18442b61076C3259N1844J63643k9230J32177a1156
11667f0148G3111k855a82360d977p749k35088j17568D4441i3651C52855b3087
11655i0779K2537D7142K70482a94320b325o5293B55657a85258g8037B55533a36743
11643b5297o0859I2326A2836J75103r3250d22380J16921a6636C1022b79733A22425
$$ plain form
11723 -644883 -118319 -75060 -168836 4468 -4952 189474 -36217 119304 -134642 -33210 -66033
11712 -66033 -121949 64383 -173999 -119988 265823 -13791 287630 354541 -8396 256776 -14226
11700 -95544 122869 108027 326780 61363 -132113 41634 -101642 -262292 105097 77332
11690 77332 -32560 -127310 -133170 -156245 130708 -211480 112754 309044 9741 -100082 -130580
11679 -130580 -66632 -301354 -413 118442 -261076 33259 85103 248746 219516 351693 -11156
11667 -60148 73111 70256 -182360 -4977 -12726 -247814 -365382 44441 -93651 352855 -23087
11655 -90779 -68242 47142 317624 -194320 -2325 -67618 255657 -185258 -78037 255533 -136743
11643 -25297 -86156 92326 12836 187939 94689 -422380 -305459 -16636 31022 -279733 122425
11631a71813I1803c6506j44666H4381B3059K39490J57324A33475f8435A98820
11620b79452C2967a51054P4136E8914j925K08416j01340g3777A06500Q2787b80759
11608a64600N5278p5367K2743A50662f9292E2332J53085b61273B4515b96738J11513
11597a85225F329a2311k80830B31980o4277K16167A33918J38672L4989a32471
11586A35381a57309A42379a50846n5213D0157b8113F1286K15647b4635o5560a2476
11574C46335d7562C6960l914K78592b5685j677A72768l1657K05345A26841L57144
11563D83985A89816C8388h8591m1052d2512A91257E0725M3251a0125B02225B1728
11551B42345a05806e572j05699A65795h3089C44965a29822E8923J48149J13607
$$ plain form
11631 -171813 91803 -36506 -181172 84381 23059 262549 419873 133475 -68435 198820
11620 -279452 32967 -151054 -76918 58914 56989 265405 164065 -73777 106500 189287 -280759
11608 -164600 -109322 -184689 -161946 150662 -69292 52332 205417 -261273 24515 -296738 -185225
11597 -185225 6329 -12311 -293141 231980 167703 383870 133918 272590 307579 -132471
11586 135381 -157309 142379 -150846 -206059 40157 -28113 61286 276933 -24635 -90195 -12476
11574 346335 -47562 36960 33046 311638 -25685 -27362 172768 141111 346456 126841 483985
11563 483985 189816 38388 -88591 -129643 -42512 191257 50725 93976 -10125 202225 21728
11551 242345 -105806 -5572 -111271 165795 -83089 344965 -129822 58923 207072 320679
11541C20679g5409A52728c69756C0099a29091O331k05948c7323j14730B62255
11530C55544j41631d1312A21508K71747A91873E8874L8954L237B1649e7934P67
11519e7167C2857K21259A2601b02105Q5953A43790C5071D114R1689R5047b27768
11507E2969AJ66058a68277m1382f785A0595K34068a55475d1491L29G5675K26250
11495C01925a10668l1237d117A91985c1086C68178h4049b1039A98557J57709p6125
11484B80141p3499K4913H2402o278N2581A8935c9323l3313A07142J57440q8051
11473A76531K3113e9191B71438l3830Q3722b6651A33567o0522J48810m8871m4487
11462A28497a35712A14044K35968f4568A3138N16463I7608R4280E9032K36994
$$ plain form
11541 320679 -75409 152728 -369756 30099 -129091 -122760 -328708 -37323 -152053 262255
11530 355544 213913 -41312 121508 393255 191873 58874 97828 101065 21649 -57934 -57167
11519 -57167 32857 254116 12601 -202105 -116152 143790 35071 4114 95803 190850 -227768
11507 52969 1 166059 -168277 -209659 -6785 10595 244663 -155475 -41491 -41162 75675 301925
11495 301925 -110668 -141905 -4117 191985 -31086 368178 -84049 -21039 198557 356266 280141
11484 280141 206642 231555 82402 76124 128705 18935 -39323 -72636 107142 264582 176531
11473 176531 199644 -59191 271438 237608 321330 -26651 133567 73045 221855 172984 128497
11462 128497 -135712 114044 350012 -64568 13138 529601 97608 191888 59032 296026
11452B96026m423D6102h2755A52092a15896B42210j3133g7765M964E1144a79935
11440b3917F8136c35222a0991j43742F0708n38L83351C6301a33763B55316A22030
11428B65554D1393a16133E1371K42647a8906j93763A37001B9402R7392c8819k14604
11417b53423A81896a07014k68975a27264l9467b3284m2537j61510B0766a36071
11406g9207G555M4394K20124I9267a1872m8254k19253M3208i8171D6070L6601
11395H2671b26049G4644M2388b30591N0562A21019a79525O8386k8738j27486J19507
11384a47856I1446O5449g2486A66364a1615F7662J52220m6803J9883a52841B53845
11372B69763H8426c03927a00187K0776l53916f9249j83079P3152E0147i1582C0159
$$ plain form
11452 296026 291603 46102 -82755 152092 -115896 242210 229077 -77765 -72801 51144 -179935
11440 -23917 68136 -335222 -10991 -154733 60708 60170 443521 36301 -133763 255316 122030
11428 265554 41393 -116133 51371 294018 -18906 -212669 137001 29402 126794 -38819 -253423
11417 -253423 181896 -107014 -375989 -127264 -166731 -23284 -65821 -227331 20766 -136071
11406 -79207 7555 51949 272073 99267 -11872 -60126 -279379 -236171 -98171 46070 82671
11395 82671 -226049 74644 117032 -230591 -180029 121019 -179525 -111139 -139877 -267363 -147856
11384 -147856 91446 156895 -72486 166364 -11615 67662 219882 173079 192962 -152841 253845
11372 269763 88426 -303927 -100187 -79411 -433327 -69249 -252328 -179176 50147 -91582 30159
11360b03466d5587B09376a31400B13705a81515d7377k20136e4480j4536J9075
11350d9941A51185l6728C4845J10031L7502F3611I88Q0419i4493C5387N9617c112
11337A58734i1872k80072B7163M4898a47059A94593e7777o1477A56762f8268N236
11326f3032k8165A8754J5765K5104i3959A5546J99640B8017b16191a03277B13213
11314B91795A36927a64647H9532a85323D2082b38079C29242b6782M654B1452J58388
11303A79840b3543A17L29739A6024O2634e8464j3551m1664b3863m07324a70948
11291A67789c88084e9737m1588a2291A30304c24178A50697b2377A43483g5387
11280A15047a30059q7699Q5336o1088A11120g7129q0349j19005A24015H500c24978
$$ plain form
11360 -203466 -45587 209376 -131400 213705 -181515 -47377 -267513 -54480 -69016 -49941
11350 -49941 151185 114457 34845 144876 182378 63611 988 81407 -94493 35387 95004 -3112
11337 158734 -91872 -371944 27163 72061 -147059 194593 -57777 -119254 156762 -68268 -63032
11326 -63032 -91197 18754 34519 59623 -93959 15546 215186 28017 -216191 -103277 213213
11314 291795 136927 -164647 89532 -185323 42082 -238079 329242 -26782 -22128 21452 179840
11303 179840 -23543 117 329856 16024 78658 -58464 -72015 -113679 -23863 -431187 -170948
11291 167789 -388084 -59737 -101325 -12291 130304 -324178 150697 -22377 143483 -75387
11280 115047 -130059 -217758 -132422 -193510 111120 -77129 -157478 -276483 124015 8500 -324978
11268a78939a1742L077c030C7018J53180b41930a12479H5777J11768a12316A53899
11256a87012M1575B3029J29595j0323E2906k1547b45612j36526a19846N4243j40005
11245b05608A78925b75685n2460O6542B76781r8306k7685B5832a87375C38014
11234a03067k07752K7493Q7228i2015A33671D4208a96370C18356b77971A18399
11223b11632f9117m0870A68008C1417b17196p9239D00834C4046b49584I6571a12814
11211h9190B5199a95588a9597A8443J37126K9137d0069J9835j02209j41355h7273
11199a65207a9090m26251a28615D2143K174N189c63514B4474J3806a17956B8898
11187C879b68791q5577a3204k68518a23110g864k0679p5094K1082m5880o4019
$$ plain form
11268 -178939 -11742 -8665 -3030 37018 190198 -241930 -112479 85777 197545 -112316 153899
11256 -187012 -145437 23029 152624 142301 52906 31359 -245612 -382138 -119846 -65603 -205608
11245 -205608 178925 -275685 -328145 -261603 276781 178475 150790 25832 -187375 338014
11234 -103067 -310819 -283326 -196098 -92015 133671 44208 -196370 318356 -277971 118399
11223 -211632 -69117 -109987 168008 31417 -217196 -296435 400834 34046 -249584 96571 -112814
11211 -89190 25199 -195588 -19597 18443 155569 184706 -40069 -20234 -122443 -263798 -87273
11199 -165207 -19090 -445341 -128615 42143 44317 49506 -363514 24474 38280 -117956 28898
11187 3879 -268791 -354368 -13204 -281722 -123110 -7864 -28543 -103637 -82555 -128435 -192454
11176a92454A69597C6572d1845a7919j46752b4704B79671a03681C6309K08143
11166B44452a2251j03645H4777b01476I8603a29534a2308D88972C2629c41081
11155F9837C0331f9230j32949g5310A67440e2283B12722a61406A87020p3032f4761
11143b21663B25750a69336A54680b09798A33764a5539j33480G1470a13211A7814
11132a22628b4817I3170J08723a5404C48019a00959B87039A18070f9878D7798
11121a59771J9507c9982j6891j25460C34302H484K01422a08714B87361A0695f7894
11109A53785g9550c7361H9440L9336J51599J57566k08683a11904B06701m672J06233
11098C08262E2213J00581P2216J25845F9622a26292A75536p6647f36n4883B23213
$$ plain form
11176 -192454 169597 36572 -41845 -17919 -164671 -24704 279671 -103681 36309 244452
11166 244452 -12251 -115896 84777 -201476 98603 -129534 -12308 488972 32629 -341081
11155 69837 30331 -69230 -202179 -75310 167440 -52283 212722 -161406 187020 113988 -64761
11143 -221663 225750 -169336 154680 -209798 133764 -15539 -149019 71470 -113211 17814
11132 -122628 -24817 93170 201893 -15404 348019 -100959 287039 118070 -69878 47798
11121 -159771 -140264 -39982 -56873 -182333 334302 8484 209906 -108714 287361 10695 -67894
11109 153785 -79550 -37361 89440 128776 280375 437941 229258 -111904 206701 202029 308262
11098 308262 52213 152794 225010 350855 69622 -126292 175536 98889 -636 -55519 223213
11086I2538B1505R9769M92171A159P5504k9436K53808J79587I0469k3484e6219
11074D69923B633M99997A79425H3320K53942N7267p7865A29874M26360F6516B3415
11062B09213L59332A90535K83021j33598J22792O0267K37892O2133B47757K19279
11052D67036J32774A58049P84040D39181L47528K12815k72008j10886K91463P154
11042I15247n7646k4708J1442J24540m280j83324L82945D84340L7322N02885k23842
11031H00705l62398M64354p3003j78518Q410K27185j51890k17538K37146J39314
11021H93767l90563L69710k3633r4073P9440j72656j43912q844L21410j49731
11011F80915j54197J10183k74369K18169K19395j29157K19966B89704K00737K65709
$$ plain form
11086 92538 21505 121274 613445 1159 76663 47227 301035 480622 90469 66985 -56219
11074 469923 2633 502630 179425 83320 337262 394529 316664 129874 556234 66516 23415
11062 209213 568545 190535 473556 339958 462750 523017 760909 823042 247757 467036
11052 467036 599810 158049 942089 439181 786709 999524 727516 616630 908093 915247
11042 915247 857601 832893 844335 968875 964595 781271 1164216 484340 521662 1024547 800705
11031 800705 438307 902661 829658 651140 659550 886735 734845 517307 754453 893767
11021 893767 503204 872914 849281 755208 834648 661992 518080 509236 830646 680915
11011 680915 526718 636901 362532 580701 800096 670939 890905 289704 490441 756150
11001G56150l56122K28250J90296k94252k455L83298C42396L86190J98686m06304
10991E20968L09895k55611J9738K91887j10998K12042k84474L72141n22507J11658
10981F64739N38235j46369m45696K50724M32805m03678J92662M25945k43735k04018
10971A061614N86506m17591O16592K20967L30025Q8773L38718O0474K11075j70906
10961B926247j33668l80644m28899p4260l07363n3300k00641r114J63548m37014
10951A064892K88830J9045k92418O8007j62477J71159m08076J44047l08964j71004
10941D13041J0133A97836A054O1943L8760J55147j4898A05074K70675b50332A58379
10929B9641K00306N4283I4104O1065K14792j81850a371j7210B94807b33588B3555
$$ plain form
11001 756150 400028 628278 818574 524322 521867 905165 342396 728586 927272 520968
10991 520968 830863 575252 594990 886877 775879 987921 703447 1075588 553081 664739
10981 664739 1202974 1056605 610909 861633 1294438 890760 1083422 1509367 1265632 1061614
10971 1061614 1648120 1230529 1847121 2068088 2398113 2486886 2825604 2886078 3097153 2926247
10961 2926247 2792579 2411935 1983036 1908776 1601413 1548113 1347472 1338358 1501906 1064892
10951 1064892 1353722 1372767 1080349 1148356 985879 1157038 748962 893009 584045 413041
10941 413041 423174 197836 1054 62997 101757 256904 242006 105074 375749 -250332 158379
10929 29641 229947 284230 94104 155169 369961 188111 -1371 -18581 294807 -233588 23555
10917C52774a98667A65439D1674g6414C40628a00445r808A58922b1765k3376n241
10906e0382A90269J887B4033J23934a52636B31838L0507a06184B58587j18425
10896A40162a97502A01328i3722o0183D952Q7750a58953G3363L9277K20054j43244
10885A89450a76096Q3717l2097o2538L9286B61438b79507B26500o0638a50489
10874C22517a8853j15240M0597Q841k2191B783K18713D3490c43516J27341k0434
10863b36609J14293K6529j73581J01729C9221J7894b34147A65115b92585h5888
10852A9171a67510D1640a29228M5096H4664f461B8770h47B72355b56709e4618
10840b50056e3454q3385O2587C5212n275J81723d6087C8966e8737D8631e4807
$$ plain form
10917 352774 -198667 165439 41674 -76414 340628 -100445 -110253 158922 -21765 -45141 -50382
10906 -50382 190269 192156 24033 147967 -152636 231838 262345 -106184 258587 140162
10896 140162 -197502 101328 -93722 -153905 4952 92702 -158953 73363 112640 332694 189450
10885 189450 -176096 -92379 -124476 -187014 -147728 261438 -279507 226500 165862 -150489
10874 322517 -18853 -134093 -93496 -84655 -106846 2783 221496 43490 -343516 -216175 -236609
10863 -236609 -122316 -95787 -269368 -167639 39221 57115 -234147 165115 -292585 -85888
10852 19171 -167510 41640 -129228 -84132 84664 -6461 28770 -847 272355 -256709 -54618
10840 -250056 -53454 -136839 -74252 35212 29937 211660 -46087 38966 -58737 48631 -54807
10828a76178O8913K4696G2841d2428j1342m1075c1712g414q6483j23529R9554
10817a17872l5623j57803R3666N1622B39004d2747p1819a9903l1559A24669l5677
10806H8992a66618A34504A1046d098j23932I5310K2223c5159l49743H5197a98360
10794g4249L4372j46902g2798C7912f198k99998I039a36410c2153E1719a70067
10782A50351b07837E5580a97608k3218L2292b7866g268A66380a72201J3732j19481
10771b77950J23103e4173B46361R4532g1971k6694A50022B0744a08865D6439a9667
10759B6594J15735d13m70126a18416B29479C4011c28349E2469c95928A14228M9192
10748A63420H0971l071a508n0682k21339d9930D7649a28217f0585H3774i5444
$$ plain form
10828 -176178 -107265 -82569 72841 -42428 -53770 -94845 -31712 -7414 -93897 -217426 -117872
10817 -117872 -153495 -311298 -217632 -166010 239004 -42747 -114566 -19903 -51462 124669 88992
10806 88992 -166618 134504 11046 -4098 -128030 95310 117533 -35159 -384902 85197 -198360
10794 -74249 -39877 -186779 -72798 37912 -6198 -306196 9039 -136410 -32153 51719 -170067
10782 150351 -207837 55580 -197608 -220826 -188534 -27866 -7268 166380 -172201 -158469 -277950
10771 -277950 -154847 -54173 246361 340893 -71971 -98665 150022 20744 -108865 46439 -19667
10759 26594 142329 -413 -470539 -118416 229479 34011 -328349 52469 -395928 114228 163420
10748 163420 80971 77900 -1508 -52190 -273529 -49930 47649 -128217 -60585 83774 -95444
10736A00981h7915m674A34487a02234b2024j08738e3501F6851a83990N1804j39040
10725b71226A77151H5498E246a04320c1817j37227l5615e1118J6031k45095A37581
10713F9210c9293q4961L8009d2486n9431c7150k5502A8501b8942k52494G0966
10701d05842i1452B36213c07423N439J29762k36180c4510A13499d22390c9560
10690B76097c65454A29251E1535h6554H85M7453b44394I4088b76566B56886a5444
10678A18891b2596j92962A92344b46324c1438j72B30949b61559R0095A15617l4927
10667H0690b22086B7972J5996b18309A7397b83932B08229d10489A19561f9763
10656B53218a7191k33785a00710k69301A9027c05210A5387L3563b23121j04876
$$ plain form
10736 100981 -87915 -92589 134487 -102234 -22024 -130762 -53501 66851 -183990 -132186 -271226
10725 -271226 177151 85498 5246 -104320 -31817 -169044 -204659 -51118 -35087 -280182 137581
10713 69210 -39293 -124254 -86245 -42486 -101917 -37150 -62652 18501 -28942 -281436 70966
10701 -405842 -91452 236213 -307423 -301984 -172222 -408402 -34510 113499 -422390 -39560
10690 276097 -365454 129251 51535 -86554 885 48338 -244394 94088 -276566 256886 -15444
10678 118891 -22596 -215558 192344 -246324 -31438 -31610 230949 -261559 -171464 115617 80690
10667 80690 -222086 27972 43968 -218309 17397 -283932 208229 -410489 119561 -69763
10656 253218 -17191 -250976 -100710 -370011 19027 -305210 15387 48950 -223121 -327997
10646c27997A50600a08884B045a44336e7780j81355h1768J5605j56082O8932j7549
10635a70862A31995b55146K4657N7452D825Q3216J2011a37289B38438b02027A52930
10623b40315B42730b18657E042K19806p0883a48298B79823A33121a03293B6247
10612A49867l8120b80631F2585j2244a27683A73562a98118J4192g3633j30612
10602b04245o3233h6530j38598g3621j43251i7509B1215a04401C73986b11460
10591a63358A91270a24614N5654c3890k17544a09393A00998a18365K2473j18497
10581b14389L4266O2377a4938o4492j51457J07335h028D6935J23993a86570O0537
10570a26033D2224a96876K2815D66420i9921o037A04286B9961J11214b51362B8747
$$ plain form
10646 -327997 150600 -108884 2045 -144336 -57780 -239135 -81768 -66163 -222245 -153313 -170862
10635 -170862 131995 -255146 -230489 -173037 4825 88041 100052 -137289 238438 -202027 152930
10623 -240315 242730 -218657 5042 224848 153965 -148298 279823 133121 -103293 26247
10612 149867 111747 -280631 62585 50341 -127683 173562 -198118 -183926 -73633 -204245
10602 -204245 -267478 -86530 -225128 -73621 -216872 -97509 21215 -104401 373986 -211460
10591 -163358 191270 -124614 -68960 -33890 -251434 -109393 100998 -118365 -95892 -214389
10581 -214389 -180123 -117746 -14938 -79430 -230887 -123552 -8028 46935 170928 -186570 -126033
10570 -126033 42224 -196876 -174061 466420 -99921 -105958 104286 29961 141175 -251362 28747
10558A06841k3198h3130K3064A34121A9466Q1438m8782a50934A69714e8608A76853
10546A91360r2069a03575C3974d0554p1950m1429A00512f1342E4928b665E2247
10534i6103K7721k9357A74277b42017E4054M4122J714b33553a7945j71116A5966
10522E8902j2619d21539h3267a5905C5203N1129J08420a05050k97209A11228c00742
10510c8333A1145b75107A06526B9252h835k37647F5920c13640J16062C64145j11377
10499B52768b10558O4275k9514j6680h1310B34416b03457A35061d4051A53483
10488a41308R298O3490k20476a124D5377j1806f14748a84847B57921j14639N4285
10477A97567J51278A25000J66480j064J3427O1885M5090j10525j3781G5996K04754
$$ plain form
10558 106841 83643 -83130 -60066 134121 19466 100904 52122 -150934 169714 -58608 176853
10546 191360 99291 -103575 33974 -40554 -112504 -153933 100512 -61342 54928 -2665 52247
10534 -96103 -68382 -97739 174277 -242017 54054 98176 99890 -233553 -17945 -189061 15966
10522 58902 46283 -421539 -83267 -15905 35203 86332 194752 -105050 -402259 111228 -300742
10510 -38333 11145 -275107 106526 29252 -8835 -246482 65920 -313640 -197578 364145 252768
10499 252768 -210558 -146283 -175797 -192477 -81310 234416 -203457 135061 -44051 153483
10488 -141308 -132010 -68520 -288996 -1124 45377 33571 -614748 -184847 257921 143282 197567
10477 197567 348845 125000 291480 290416 303843 365728 410818 300293 286512 75996 280750
10466B80750j26127N2612p6425h9175B04467E8191b445B54147a04985K7243B30157
10454a39941A07750k6105h4906A77828D5466J01495a9580k83243b5474j26781
10444a52255l6361m1188J04047C3211c35026b7775k33518f9017G8909c88854d7015
10432a19155m290e8746A48334L6339G4248N8382b91087g502l16327Q7776b1130
10420C4221a82322A53381R3849b0735k294B25139p7305b76419J28944j25463c6976
10408C4033a40482C6753b6571A16529a03587B4977e9663a7088h172A05936a9197
10396f7454p7724d1295l11084A46741a11110c5297D390a02785E6318A8738K5819
10385D4557A4513a34592e6323B28539b8660A20320C2441K47666l2964p980a3404
$$ plain form
10466 280750 154623 207235 130810 -89175 204467 58191 -2445 254147 -104985 -77742 230157
10454 -139941 107750 81645 -84906 177828 45466 146961 -19580 -302823 -25474 -152255
10444 -152255 -188616 -229804 -125757 33211 -335026 -27775 -261293 -69017 78909 -388854 -47015
10432 -119155 -123445 -58746 148334 184673 74248 132630 -291087 -7502 -323829 -236053 -21130
10420 34221 -182322 153381 247230 -20735 -23029 225139 147834 -276419 -147475 -272938 -36976
10408 34033 -140482 36753 -26571 116529 -103587 24977 -59663 -17088 -8172 105936 -19197
10396 -67454 -145178 -41295 -352379 146741 -111110 -35297 4390 -102785 56318 18738 44557
10385 44557 14513 -134592 -56323 228539 -28660 120320 32441 280107 247143 239163 -13404
10373a03675b5144G1149N7787e7996o577G9993K5535J9358J71185K47979k31071
10362C12979K38935m4697N9549j93490L698g4988C17854j14199J20643j56805
10352A67493R7982a87806B38494J09843J67590j32874N7265L30214k39201k23681
10342C07650j05211J0813J57628O4171P0617A74909J24007q817l7146G8265J70878
10331B49143j08770A6451a2384A05740K35172j01703c5379n3376A41165C7566
10320A40560a95612E0819M35141G0908a34566B81338a586B96816a42250C43276
10309B089b10940I6634c53998a32351l4089E0423a55747A4112M6581N4134J23886
10298B38713a9219n737C77882e4079p2548D0009a09063A7870K85630a5480j07724
$$ plain form
10373 -103675 -25144 71149 128936 -57996 -64573 79993 105528 124886 296071 544050 312979
10362 312979 551914 507217 566766 373276 376974 -74988 317854 203655 324298 167493
10352 167493 265475 -187806 238494 348337 515927 383053 440318 770532 531331 307650
10342 307650 202439 213252 370880 435051 505668 174909 298916 290099 252953 78265 249143
10331 249143 140373 16451 -12384 105740 340912 239209 -35379 -88755 141165 37566
10320 140560 -195612 50819 485960 70908 -134566 281338 -1586 296816 -142250 343276
10309 2089 -210940 96634 -353998 -132351 -166440 50423 -155747 14112 60693 114827 238713
10298 238713 -19219 -24956 377882 -54079 -126627 40009 -109063 17870 303500 -15480 -123204
10287a23204n4688A02480b020j00023D3732a62148P4911j8904o548B7647K28227
10276B55874a42542A96944n4300m5944M4077b07238D9474K07525f1061A02612
10265c73880E1804b21079a7098B92181b90634i2944j33840a2489A18179i978H7626
10253B21206E0191J95083m1512p9642R0395J40679A28460k1647J7488n6564a3308
10241a94281d1473J2759j94703R4808j76879e6811A35573c34740i7302A01336
10230a08359A008a98780d5758D0229K06321r6049b58831G7326h12p9942j56681
10219b37435D4771P2278a65299e0069l69904a55044A58407l8386b21994L0664
10209a91330B27834j09911J01527q3356C503a08107k19055J11206G1397F730L5178
$$ plain form
10287 -123204 -177892 102480 -2020 -102043 43732 -162148 -87237 -106141 -112689 27647 255874
10276 255874 -142542 196944 142644 96700 140777 -207238 49474 256999 -61061 102612
10265 -373880 51804 -221079 -17098 292181 -290634 -92944 -226784 -12489 118179 -9978 87626
10253 221206 50191 245274 203762 124120 214515 355194 128460 106813 124301 67737 -13308
10241 -194281 -41473 -28714 -223417 -128609 -305488 -56811 135573 -334740 -97302 101336
10230 -108359 1008 -198780 -45758 40229 246550 150501 -258831 77326 -812 -80754 -237435
10219 -237435 44771 117049 -165299 -50069 -419973 -155044 158407 120021 -221994 -191330
10209 -191330 227834 117923 219450 136094 3503 -108107 -327162 -215956 71397 6730 41908
10198D1908a68685m1448g0296K7813j38237f5051l68460J53426R2504C35489a6559
10186b25918A75706q3959k5861a00921R507L7631j17580O5060L8774I2390d41297
10174D5477g432A04087g9374D7983f1578k1739p1430d182B60737A00219d11013
10162a7016k6471q8500l06803J78388d9491F3780c2121j28465j01000K370Q3948
10151a75268A8788J10853b7339D178c45271a9099A56795h0768D9697f5474p6544
10140a42018k71183g4780B14917c41350h716A14055b44717C65754d1917E4030
10129d1276A52083B0112K3405a67152A67352b2429D63318a70616I2072i7430c0390
10117E7156J71134a53539m7362K074j60483L4315f875A10397b2261J862C5484
$$ plain form
10198 41908 -168685 -210133 -70296 -42483 -180720 -65051 -433511 -280085 -187581 335489 -16559
10186 -225918 175706 91747 65886 -100921 -91414 -53783 -171363 -106303 -67529 92390 -441297
10174 45477 -7432 104087 -79374 47983 -61578 -83317 -154747 -4182 260737 100219 -411013
10162 -17016 -43487 -131987 -438790 -260402 -49491 63780 -32121 -160586 -261586 -259216 -175268
10151 -175268 18788 129641 -27339 4178 -345271 -19099 156795 -80768 49697 -65474 -142018
10140 -142018 -413201 -74780 214917 -341350 -8716 114055 -244717 365754 -41917 54030
10129 -41276 152083 20112 43517 -167152 167352 -22429 463318 -170616 92072 -97430 -30390
10117 57156 228290 -153539 -200901 -198827 -359310 -324995 -6875 110397 -22261 -20399 35484
10105a95282H3274K8153A1436b557n255E5910h0042a1356C4143J66519a30065
10093a69474F1542b22816b7408f666l1781o834i783l13137A26875c77983d3454
10081a87605n7728n7541c4335A5424a06008k4833j46916a13225c6799N77j19223
10070a55445k13203A61580B2491a914B63290j28306d1388E6598f1788A5188L36076
10059C51264A65104o3595j5802c6946A53147b05361D1220e9558E6980b45964j4444
10048b60408A24104b77966a00114d64n3172C3165J24609o8681h8785A35155e1179
10036D0151j8188a12149E2114a15557k4282A2989b27169D3775e3071l6848k96204
10025c86123A28284J04193a25851A09383f4635k2503l15251A56926c7978k74171
$$ plain form
10105 -195282 83274 111427 11436 -2557 -7812 55910 -80042 -11356 34143 200662 -130065
10093 -169474 61542 -222816 -27408 -6666 -38447 -45281 -9783 -322920 126875 -377983 -43454
10081 -187605 -245333 -302874 -34335 15424 -106008 -130841 -277757 -113225 -36799 -36222 -155445
10070 -155445 -368648 161580 22491 -1914 263290 134984 -41388 56598 -61788 15188 351264
10059 351264 165104 101509 85707 -36946 153147 -205361 41220 -59558 56980 -245964 -260408
10048 -260408 124104 -277966 -100114 -464 -53636 33165 157774 89093 -88785 135155 -51179
10036 40151 21963 -112149 52114 -115557 -139839 12989 -227169 43775 -53071 -89919 -386123
10025 -386123 128284 232477 -125851 109383 -64635 -87138 -402389 156926 -37978 -312149
10015c12149O0676f6473K5352j25938g1617j72360E4661K39788c05159j18339
10005d23498B05343c69962n0545A15616e1298q121I5611b62860J9149B59453b68144
9993h3329o2257P521l48031K38238Q0260A06444D7569l591M6870h0212B5877d2357
9980B42697C4943A4375K9292a38090n071K113E1854F190a35766J3135j58661D5876
9967A8945a98636B11422b6981r5589a6415k02487O1976A9798a47297K8198k81992
9956d01091c8100j08077m6c6428k19284B1392d868j85660e5756J0922k04807H6738
9943a10179G8107d59817B22492C7499a89871A24056A0184b25759A52923a76133
9932b86048i5941B5411a5770E0260n809a67208g5522l14471a3165j76898j98307
$$ plain form
10015 -312149 -251473 -66473 -41121 -167059 -71617 -243977 54661 294449 -305159 -423498
10005 -423498 205343 -369962 -420507 115616 -51298 -59419 95611 -262860 -243711 259453 -268144
9993 -83329 -145586 -138065 -486096 -247858 -167598 106444 47569 43978 90848 -80212 25877 -42357
9980 242697 34943 14375 43667 -138090 -143161 -141048 51854 6190 -135766 -122631 -281292 45876
9967 18945 -198636 211422 -26981 -122570 -16415 -218902 -156926 19798 -147297 -119099 -401091
9956 -401091 -38100 -146177 -146223 -36428 -255712 21392 -4868 -190528 -55756 -44834 -249641 86738
9943 -110179 78107 -459817 222492 37499 -189871 124056 10184 -225759 152923 -176133
9932 -286048 -95941 25411 -15770 50260 44451 -167208 -75522 -389993 -13165 -190063 -388370
9921c88370F1343j6944K48204k3303c80768A56960a18485C57K35013b60151f6971
9909e9779j01740A01143A0047J06363b45412Q0206C1887n113b56094H6955J58081
9898B45036I5889c2285m2219L4720C0011L8345b54995J09197e5237j28771R1573
9887i2435j32105e4576a1006p4622N469c8027D8405j6109b88058C1323a02407
9875E3509b34781J5710R6462A4055J45859b53977A90085A3879K4329a55120D0708
9863d4297k41263C445J36026e8300j78277C5570i6033o5618j52689F5893B5142
9851c25827h6977C4278h2661J6430q3111B12791a8315m8901I9066c826j14093
9840a17919c9351I8657J40886h5408j50150J08724N0812p4440C1216i6191j86677
$$ plain form
9921 -388370 61343 44399 292603 269300 -380768 156960 -118485 357 235370 -260151 -66971
9909 -59779 -161519 101143 10047 116410 -245412 -165206 31887 26774 -256094 86955 245036
9898 245036 95889 -32285 -74504 -39784 30011 68356 -254995 -145798 -55237 -184008 -92435
9887 -92435 -224540 -54576 -11006 -85628 -80159 -38027 48405 32296 -288058 31323 -102407
9875 53509 -234781 -219071 -122609 14055 159914 -253977 190085 13879 38208 -155120 40708
9863 -44297 -285560 3445 139471 -58300 -236577 35570 -96033 -161651 -314340 65893 25142
9851 -325827 -86977 34278 -82661 -66231 -149342 212791 -18315 -67216 99066 -3826 -117919
9840 -117919 -39351 98657 239543 -85408 -235558 -126834 -76022 -150462 31216 -96191 -282868
9829b82868H4579B9621J30053C8841d27021E5299c1590p749A20208B5872c18968
9817B32704f6951j15026N8080B00781O347r3463d17930h6682A51374a08241A02738
9805b97339C66163c0090I7018b9471k25949o8436j03829A57343a92778O6545n4708
9794a80941M4659D26933a98570A18927e2161J6258A59517d5830a2693B9833K6596
9783E6429K9114a47289O4831j94523j81538c8133a3301M384j89743A35286d0055
9771I9768D6970J9196a26482C5674a83500A23803a66451j06046g8437j81492A94145
9759C06199B8824c15218f0133m8626E1778b77949N6417A27839b6328j11938a0969
9747e5952j13544m6289e756l01650B77824a66634D0730b58506A31421C6895a89468
$$ plain form
9829 -282868 84579 29621 159674 38841 -427021 55299 -31590 -39339 120208 25872 -318968
9817 232704 -66951 -181977 -123897 200781 207128 113665 -417930 -86682 151374 -108241 102738
9805 -297339 366163 -30090 97018 -29471 -255420 -323856 -427685 157343 -192778 -126233 -180941
9794 -180941 -136282 426933 -198570 118927 -52161 -35903 159517 -45830 -12693 29833 56429
9783 56429 85543 -147289 -82458 -276981 -458519 -38133 -13301 -8917 -198660 135286 -40055
9771 99768 46970 66166 -126482 35674 -183500 123803 -166451 -272497 -78437 -259929 194145
9759 306199 28824 -315218 -60133 -108759 51778 -277949 -221532 127839 -26328 -138266 -10969
9747 -55952 -169496 -215785 -5756 -307406 277824 -166634 40730 -258506 131421 36895 -189468
9735B4042b32133c9433j65018L4166A45214C2636f3556A99412d08314f6884C4102
9723I9017J2391f5101o607j72744k8964h375A13486j6512a92220Q2616B065p39
9711A326d44508A79446a98990K7027H9002k1766a51718B8910j0933l840J62373
9700A76510i8093L754L6009r9376B20997h8356l02960h2607k00468i7117L871
9689i3246j23816P1409d8011B35R7172B3317a29026G4373b20231a01170B11490
9677b6581H5575i7377k97100g7568A01475Q748c61124a11701D4540j1887j7L0963
9665F3599J62803b2340k52054i8193q758M1103K3581j38719B588e8013F1172N9464
9653A20636e65818g5234p3825f5215B14121a05175j56886L2834A97489l8051a00166
$$ plain form
9735 24042 -232133 -39433 -204451 -170285 145214 32636 -63556 199412 -408314 -66884 34102
9723 99017 111408 -65101 -71708 -244452 -273416 -8375 113486 96974 -192220 -109604 2065 1326
9711 1326 -444508 179446 -198990 -171963 89002 67236 -151718 28910 17977 14137 176510
9700 176510 -98093 -94339 -58330 -157706 220997 -88356 -391316 -82607 -283075 -97117 -93246
9689 -93246 -217062 -145653 -48011 235 97407 23317 -129026 74373 -220231 -101170 211490
9677 -26581 85575 -97377 -394477 -77568 101475 110223 -361124 -111701 44540 32653 32636 63599
9665 63599 226402 -22340 -274394 -98193 -106951 -65848 -42267 -180986 2588 -58013 61172 120636
9653 120636 -565818 -75234 -149059 -65215 214121 -105175 -262061 -229227 197489 159438 -100166
9641A57359i2639m991o9958f4806K2878G3841a47310f5138k0938F7929a20982
9629e1635F384K14370e2863q2931B02606b46691J21866c9972l1565A22256h7555
9617h0475G8492K1343i0885m7717C3248a55472A63567b84127a05847I7157a03915
9605f74l6675j21559j49782A57584m1579f9760A47114a30517a2928p2655m2037
9594a27620k0735k85723J97191I2892L633D5143b0231q0833L769K1270E1034Q662
9582E9696c98333B801g247k24839E9336a393I4266b1559A138b65948H2066a97127
9569b20535B6769h3613Q364F4929i051F6193N80B4170b53421C9211b26232O8009
9557a58223J9984c1491n2652B5070b13622m2911o0259e7736j52917d8342j96077
$$ plain form
9641 157359 -92639 -97630 -167588 -64806 -41928 73841 -147310 -65138 -86076 67929 -120982
9629 -51635 6384 220754 -52863 -135794 202606 -246691 -124825 -39972 -71537 122256 -87555
9617 -80475 78492 99835 -90885 -138602 33248 -155472 163567 -284127 -105847 97157 -103915
9605 -674 -37349 -158908 -308690 157584 116005 -69760 147114 -130517 -12928 -85583 -127620
9594 -127620 -148355 -434078 -236887 92892 96525 45143 -20231 -101064 -97295 -76025 51034 59696
9582 59696 -398333 2801 -7247 -232086 59336 -1393 94266 -21559 1138 -265948 82066 -197127
9569 -220535 26769 -83613 -75249 64929 -9051 66193 66773 24170 -253421 39211 -226232 -158223
9557 -158223 -138239 -31491 -84143 25070 -213622 -256533 -316792 -57736 -210653 -48342 -244419
9546b44419C5700f0339I6405e8025j72401P5542A39216d25744a04050A54445i4541
9534D8237i9029K6924J7883j59673C2806O155a0020j26847B25221r9519M9314
9523A75016C619g3872j6455k6853A75615A5282a90102f710j66785I7818g9334
9511A1930e7327o3319k59568B15346h3832q1023A82936H698N0723c65162a13522
9499e54662A30913j6255A2722J53115A6750e3376a3692l78106B3458Q1665a9759
9487G4870d3494l20805k2123h0773b6141k52864A40620c46119a42983e3396K3632
9476b9764r4058m1753N8099k37094C9263d4645L986o8718A70517l9556E4801a58095
9463A28189d3703j86110O1923g6924j99622a4624q5526q198o1394m3386j57429
$$ plain form
9546 -244419 35700 -60339 96405 -58025 -230426 -154884 139216 -425744 -104050 154445 -94541
9534 48237 -99029 -72105 -54222 -213895 32806 38961 -10020 -136867 225221 125702 175016
9523 175016 3619 -73872 -90327 -117180 175615 15282 -190102 -6710 -173495 97818 -79334
9511 11930 -57327 -120646 -380214 215346 -83832 -164855 182936 8698 59421 -365162 -113522
9499 -554662 130913 114658 12722 165837 16750 -53376 -13692 -391798 23458 105123 -19759
9487 74870 -43494 -364299 -386422 -80773 -26141 -279005 140620 -346119 -142983 -53396 -29764
9476 -29764 -123822 -165575 -107476 -344570 39263 -44645 -40659 -109377 170517 130961 54801 -158095
9463 128189 -43703 -229813 -167890 -76924 -276546 -14624 -100150 -108348 -169742 -213128 -370557
9452c70557a76166j6745i4688H2744g8558j36823i9458k99626a71955g1542K8504
9441d3038R777q4562I3695g8398E9379J52922H2606b46728B09444e411k21733
9430b27144Q0457b1243j01460B66308b03862j87691a01897K3880j26230g7274
9419d34570B74597a78635Q6310B61672q4867a74382K7197j47365f6522B24710
9408a68403e5299p9375G5604b7485j82450r404r3944M5209E10b23654O4287D80869
9395B06945b78690A48740J36212i1736e553j05288A7699f7223j4735B66909j8651
9384B48258m4193a63173p0862G3453J32340a21519N2932n9260A33634B6596a23852
9372B3909a07504B20884N9031b05439L0982A09101J58243a09869L9214a3229k50736
$$ plain form
9452 -370557 -176166 -192911 -94688 82744 -78558 -215381 -99458 -399084 -171955 -71542 -43038
9441 -43038 -33261 -117823 93695 -78398 59379 212301 82606 -246728 209444 -5411 -227144
9430 -227144 -146687 -21243 -122703 266308 -203862 -391553 -101897 -78017 -204247 -77274
9419 -434570 274597 -178635 -92325 261672 176805 -174382 -147185 -294550 -66522 224710
9408 -168403 -55299 -134674 75604 -27485 -209935 -219339 -313283 -268074 510 -223654 -159367 480869
9395 206945 -278690 148740 284952 -91736 -5553 -110841 17699 -67223 -81958 266909 248258
9384 248258 204065 -163173 -234035 73453 205793 -121519 -68587 -127847 133634 26596 -123852
9372 23909 -107504 220884 279915 -205439 -174457 109101 267344 -109869 -70655 -13229 -263965
9361b63965o4323A20291d6372j93551c0071B5300J7517A3912J99214a77403j04936
9350b82339h9484j82565d4658j9056n1104j40016Q151C050P8920a39730d2160
9338G2216J29747C3721a50604k23539n654a72642A3419J32800R2725d8819A6640
9326B5978N4625J12320A2596M0875a24453H2323I284b71024b3690l5999o8392
9315a28081F6767L4524e6205B7282c68001A19643a16381k2650A7890a1168j4620
9304b5788A9777a96707N0291F8501b83090Q3869j9403F7382a29297B86164f8133
9292A54760a62638A1703J19012K61801A03886a43527D308a97102G2149b35640
9281A06d33757a8003k71054D9603b63587d0501o936j7103j57317n5940A86258
$$ plain form
9361 -263965 -328288 120291 -46372 -239923 -30071 25300 42817 13912 213126 -177403 -282339
9350 -282339 -89484 -272049 -44658 -63714 -114818 -254834 -246683 3050 81970 -139730 -42160
9338 72216 201963 33721 -150604 -374143 -379797 -172642 13419 146219 238944 -48819 16640
9326 25978 80603 192923 12596 53471 -124453 82323 9284 -271024 -23690 -59689 -128081
9315 -128081 66767 101291 -56205 27282 -368001 119643 -116381 -139031 17890 -11168 -25788
9304 -25788 19777 -196707 -146416 68501 -283090 -199221 -218624 67382 -129297 286164 -68133
9292 154760 -162638 11703 130715 392516 103886 -143527 4308 -197102 72149 -235640
9281 106 -433757 -18003 -289057 49603 -263587 -40501 -47437 -64540 -221857 -277797 186258
9269a87401E5137L6566J39273i6671k44562J29044j77682J91258N9172d9046l9478
9258h8524J934j26864i3061K7533B1313i6899m6131f4872C538J55005b1636j55017
9246a76653O3129C477e4693B90037b72108a09737A6828G528J24509b6244A03214
9234a40103N9518j34837n78B3450R4244c56768F3977d7645n9726B88463b43964
9222a04666j9602e395j49618J3523q7091e2696B2659e6465A3289a4794k6870q6979
9210a28643j6573K9144C3048h7770C35574A6436b23563L1337C7902f851A34353
9198c41309a27242d1622o0299j42148B68186A1815L886a52672k13736A87174e8427
9186b09892r0347A30539h8036D8193a38251E9775M8474b31343Q8673k14794h3258
$$ plain form
9269 -187401 55137 91703 230976 -96671 -341233 -212189 -389871 -198613 -139441 -49046 -88524
9258 -88524 -86590 -213454 -93061 -65528 21313 -96899 -143030 -64872 3538 158543 -21636 -176653
9246 -176653 -113524 3477 -54693 290037 -272108 -109737 16828 7528 132037 -26244 103214
9234 -140103 -80585 -215422 -216000 23450 117694 -356768 63977 -47645 -107371 288463 -243964
9222 -104666 -124268 -5395 -155013 -141490 -228581 -52696 22659 -56465 13289 -14794 -41664 -128643
9210 -128643 -145216 -116072 33048 -87770 335574 16436 -223563 -192226 37902 -6851 134353
9198 -341309 -127242 -41622 -101921 -244069 268186 11815 15701 -152672 -366408 187174 -58427
9186 -209892 -300239 130539 -88036 48193 -138251 59775 108249 -231343 -142670 -357464 -83258
9174b63075c8216j17957l8254g0138E8088c41504J62123d7392p1481H4806a44932
9162A030a4730c625o8199j2557j59305B144c58638P0663J40668c4357B30334e6845
9149b02507R3033o4284M9952p2874B10691a05685A47542d4374A03194M5814E9109
9137H5099N6159a78562A59038F8737a09661a9346A2684h5919K2331A96915A8693
9125g1876k17684C08390H5469d4343m2914c894A78599b25566P622j78521g7312
9113d05240J27995B86560G2712Q4940a59921C4292a54286c0143B07856d4254q795
9102e3049B04026a24209n4800M0726d6015A76987a70965G1781B4949b39417J17261
9091a22156A84857r1571g9189B70853F845b02520O9449j17997a07756c3903B7493
$$ plain form
9174 -263075 -38216 -156173 -194427 -70138 58088 -341504 -179381 -47392 -118873 84806 -144932
9162 1030 -14730 -3625 -71824 -84381 -243686 2144 -358638 -287975 -147307 -34357 230334 -56845
9149 -202507 -109474 -173758 -123806 -196680 210691 -105685 147542 -44374 103194 149008 59109
9137 85099 141258 -178562 159038 68737 -109661 -19346 12684 -85919 -63588 196915 18693
9125 -71876 -289560 308390 85469 -44343 -87257 -3894 178599 -225566 -217944 -396465 -77312
9113 -405240 -277245 286560 72712 157652 -159921 34292 -154286 -30143 207856 -44254 -53049
9102 -53049 204026 -124209 -179009 -138283 -46015 176987 -170965 71781 24949 -239417 -122156
9091 -122156 184857 93286 -79189 270853 6845 -202520 -133071 -251068 -107756 -33903 27493
9079a7320k8484C26933b34764M7929d665j6796j11057O0682j11490B6986K63848
9068B90834J30391a67944A15444J48537a89143L0145a8448C4985g2431J9496k8453
9057h1388G6135J12543k8294g4463E5735B0476J06203Q21h3931D9495b29144h0093
9044D998a54554j07401r3805Q0189D8247O9059a20065j56866R0649D3449K31325
9033B74774a81784b3834P518j08879j91025K3677B32328b00805j3817a3995I9467
9021C493b25284f6063j36939N9893A4639b45403A86800b52549K3078J01739A8977
9009c40710C3118M2577K01156A9788K07650a67614J0023b5841E2410g7689q480
8998h6169E7955a53j70882B03136f6014p0583A29074J67553f8015k7095n3961
$$ plain form
9079 -17320 -45804 326933 -234764 -186835 -4665 -21461 -132518 -71836 -183326 26986 290834
9068 290834 421225 -167944 115444 263981 -189143 -158998 -18448 34985 -72431 -52935 -81388
9057 -81388 76135 188678 160384 -74463 55735 20476 126679 127500 -83931 49495 -229144 -80093
9044 4998 -154554 -261955 -355760 -275571 48247 117306 -120065 -276931 -186282 43449 274774
9033 274774 -181784 -23834 -16316 -125195 -316220 -292543 232328 -200805 -214622 -13995 99467
9021 3493 -225284 -66063 -203002 -143109 14639 -245403 186800 -252549 -229471 -127732 18977
9009 -340710 33118 75695 276851 19788 227438 -167614 -157591 -25841 52410 -77689 -86169
8998 -86169 57955 -153 -171035 203136 -66014 -136597 129074 296627 -68015 -95110 -149071
8987a49071B68973q7604h2209C1592b82796A81212c81693a65207A1605a19033
8976a04566j32563B11779c2903A92232a66236j27166A00479b73073b5103L90A22515
8964h5349A73390a12754K523p9724f2840K4030A33440C3757a65952n8292N6696
8953a67548o8555q483K4451c3166B61713l1505a21961f0473j25187M0191j11586
8942b57055O9090N2957A22517a9174j74200A39858b20624F4230b12028J5913A76350
8930A304L130B17c2148j57092b7071j43183e7716a0687A47528a86391D18904L25585
8918G44489K056795L46302G82725G5070c3019C3496J59099c48036C2150J52902
8908A85052A8668K06993A1462g6030j38417o0278C0178K89657H3638a34960A96804
$$ plain form
8987 -149071 268973 181369 -82209 31592 -282796 181212 -381693 -165207 11605 -119033
8976 -104566 -237129 211779 -32903 192232 -166236 -293402 100479 -273073 -25103 -24713 122515
8964 -85349 173390 -112754 -110231 -189955 -62840 -38810 133440 33757 -165952 -224244 -167548
8953 -167548 -236103 -244586 -220135 -33166 261713 230208 -121961 -60473 -185660 -145469 -257055
8942 -257055 -187965 -135008 122517 -19174 -193374 139858 -220624 64230 -212028 -196115 176350
8930 1304 4434 217 -32148 -189240 -27071 -170254 -57716 -10687 147528 -186391 418904 744489
8918 744489 2801284 3147586 782725 75070 -33019 33496 192595 -348036 32150 185052
8908 185052 18668 225661 11462 -76030 -214447 -274725 30178 319835 83638 -134960 196804
8896G7891a9869j41370L1855n5638D1824c02610a2268j57213M5843b1490A44048
8884H4994b68408d712k72586B9895b0759A43909e770j45683L2625C03844b07085
8872a86140B30685a33066j8183j15691J28323j49044a43664g0311A56953a18775
8861b9920B49123d6694o3666a5177e612D2702J78344b67003a00234B20573b71146
$$ plain form
8896 77891 -19869 -161239 -129384 -185022 41824 -302610 -12268 -169481 -123638 -21490 144048
8884 84994 -268408 -4712 -277298 29895 -20759 143909 -5770 -151453 -118828 303844 -207085
8872 -186140 230685 -133066 -151249 -266940 -138617 -287661 -143664 -70311 156953 -118775
8861 -29920 249123 -46694 -110360 -15177 -5612 42702 221046 -267003 -100234 220573 -271146
$$ [...]
##END NTUPLES=NMR SPECTRUM
##END=
