##TITLE=NES1026_17915_9266881_sXGIX0Gfx3
##JCAMPDX= 6.0         $$ Bruker NMR JCAMP-DX V2.0
##DATA TYPE= NMR SPECTRUM
##DATA CLASS= NTUPLES
##ORIGIN= BRUKER
##OWNER= Administrator
$$ 1.72 TOPSPIN		Version 2.1
$$ 2015-08-24 17:39:43.420 -0700  Administrator@X
$$ Compression mode = diff/dup
##.OBSERVE FREQUENCY= 400.02188249412
##.OBSERVE NUCLEUS= ^1H
##.ACQUISITION MODE= SIMULTANEOUS (DQD)
##.ACQUISITION SCHEME= undefined
##.AVERAGES= 64
##.DIGITISER RES= 22
##SPECTROMETER/DATA SYSTEM= spect
##.PULSE SEQUENCE= noesygpps1d.comp
##.SOLVENT NAME= COFFEE_meoh
##.SHIFT REFERENCE= INTERNAL, COFFEE_meoh, 1, 14.96336
##AUDIT TRAIL= $$ (NUMBER, WHEN, WHO, WHERE, PROCESS, VERSION, WHAT)
$$ ##TITLE= Audit trail, TOPSPIN		Version 2.1
$$ ##JCAMPDX= 5.01
$$ ##ORIGIN= Bruker BioSpin GmbH
$$ ##OWNER= Administrator
$$ $$ E:\/data/COFFEE/nmr/NES1026_17915_9266881_sXGIX0Gfx3/22/pdata/1/auditp.txt
$$ ##AUDIT TRAIL=  $$ (NUMBER, WHEN, WHO, WHERE, PROCESS, VERSION, WHAT)
(   1,<2015-08-24 17:39:37.920 -0700>,<Administrator>,<X>,<go>,<TOPSPIN 2.1>,
      <created by zg
	started at 2015-08-24 17:28:08.451 -0700,
	POWCHK enabled, PULCHK disabled,
       configuration hash MD5:
       21 0F 79 D6 B3 7B B4 F6 88 20 88 DB 03 48 BD 9F
       data hash MD5: 64K
       2B A8 D4 B9 63 D1 73 9C 82 CE 37 17 3C 2B 37 31>)
(   2,<2015-08-24 17:39:41.373 -0700>,<Administrator>,<X>,<proc1d>,<TOPSPIN 2.1>,
      <Start of raw data processing
       efp LB = 0.3 FT_mod = 6 PKNL = 1 PHC0 = 0 PHC1 = 0 SI = 128K 
       data hash MD5: 128K
       B8 B4 98 2E 42 C2 48 C4 C6 6F 89 CA 78 53 75 68>)
(   3,<2015-08-24 17:39:42.233 -0700>,<Administrator>,<X>,<proc1d>,<TOPSPIN 2.1>,
      <pk PHC0 = -86.42395 PHC1 = 0 
       data hash MD5: 128K
       AC BD 27 56 0A 27 FC 87 5B 14 22 C8 73 E5 89 C6>)
(   4,<2015-08-24 17:39:42.608 -0700>,<Administrator>,<X>,<proc1d>,<TOPSPIN 2.1>,
      <abs ABSG = 1 
       data hash MD5: 128K
       32 7F 99 60 78 1A 02 22 04 07 6B 2D 1A 4D FA 6B>)
(   5,<2015-08-24 17:39:42.701 -0700>,<Administrator>,<X>,<proc1d>,<TOPSPIN 2.1>,
      <abs ABSG = 2 
       data hash MD5: 128K
       DA D6 A9 8D 0B FC C5 7C 65 97 89 C2 55 CB 14 6F>)
(   6,<2015-08-24 17:39:42.780 -0700>,<Administrator>,<X>,<proc1d>,<TOPSPIN 2.1>,
      <abs ABSG = 3 
       data hash MD5: 128K
       E8 DF 68 3D 07 F5 2A 21 B9 6F 8C FB F1 19 6D 54>)
(   7,<2015-08-24 17:39:42.873 -0700>,<Administrator>,<X>,<proc1d>,<TOPSPIN 2.1>,
      <abs ABSG = 4 
       data hash MD5: 128K
       89 17 99 15 5F 1B 6D BE 79 43 39 F1 9E 17 7A 85>)
(   8,<2015-08-24 17:39:42.998 -0700>,<Administrator>,<X>,<proc1d>,<TOPSPIN 2.1>,
      <abs ABSG = 5 
       data hash MD5: 128K
       10 AC 08 C2 E6 8B 45 D0 17 D9 3C 6E 9E 60 07 65>)
$$ ##END=
$$ 
$$ $$ hash MD5
$$ $$ 38 A9 EF C0 3A 73 86 92 EB 0E 6F CC D1 D0 71 A8
##$RELAX= 
##$RELAX= 
##$RELAX= 
##$RELAX= 
##$RELAX= 
##$RELAX= 
##$RELAX= 
##$RELAX= 
$$ Bruker specific parameters
$$ --------------------------
##$DU= <E:\>
##$EXPNO= 22
$$ [...]
##$TP07= 0
##$TPNAME0= <>
##$TPNAME1= <>
##$TPNAME2= <>
##$TPNAME3= <>
##$TPNAME4= <>
##$TPNAME5= <>
##$TPNAME6= <>
##$TPNAME7= <>
##$TPOAL= (0..7)
0.5 0.5 0.5 0.5 0.5 0.5 0.5 0.5
##$TPOFFS= (0..7)
0 0 0 0 0 0 0 0
##$TUNHIN= 0
##$TUNHOUT= 0
##$TUNXOUT= 0
##$USERA1= <user>
##$USERA2= <user>
##$USERA3= <user>
##$USERA4= <user>
##$USERA5= <user>
##$V9= 5
##$VALIST= <valist>
##$VCLIST= <CCCCCCCCCCCCCCC>
##$VD= 0
##$VDLIST= <DDDDDDDDDDDDDDD>
##$VPLIST= <PPPPPPPPPPPPPPP>
##$VTLIST= <TTTTTTTTTTTTTTT>
##$WBST= 2048
##$WBSW= 25
##$XGAIN= (0..3)
0 0 0 0
##$XL= 0
##$YL= 0
##$YMAX_a= 8187711
##$YMIN_a= -17268638
##$ZGOPTNS= <>
##$ZL1= 120
##$ZL2= 120
##$ZL3= 120
##$ZL4= 120
##$ABSF1= 14.96336
##$ABSF2= -5.594822
##$ABSG= 5
##$ABSL= 3
##$ALPHA= 0
##$AQORDER= 0
##$ASSFAC= 0
##$ASSFACI= 0
##$ASSFACX= 0
##$ASSWID= 0
##$AUNMP= <proc_prof1d_extract.lims>
##$AXLEFT= 0
##$AXNAME= <>
##$AXNUC= <1H>
##$AXRIGHT= 0
##$AXTYPE= 0
##$AXUNIT= <>
##$AZFE= 0.1
##$AZFW= 0.1
##$BCFW= 0
##$BC_mod= 0
##$BYTORDP= 0
##$COROFFS= 0
##$CY= 15
##$DATMOD= 1
##$DC= 0
##$DFILT= <>
##$DTYPP= 0
##$F1P= 0
##$F2P= 0
##$FCOR= 0.5
##$FTSIZE= 131072
##$FT_mod= 6
##$GAMMA= 0
##$GB= 0
##$INTBC= 1
##$INTSCL= 1
##$ISEN= 128
##$LB= 0.3
##$LEV0= 0
##$LPBIN= 0
##$MAXI= 10000
##$MC2= 0
##$MEAN= 0
##$ME_mod= 0
##$MI= 0
##$NCOEF= 0
##$NC_proc= -2
##$NLEV= 6
##$NOISF1= 0
##$NOISF2= 0
##$NSP= 0
##$NTH_PI= 0
##$NZP= 0
##$OFFSET= 14.96336
##$PC= 1
##$PHC0= -86.42395
##$PHC1= 0
##$PH_mod= 1
##$PKNL= yes
##$PPARMOD= 0
##$PPDIAG= 0
##$PPIPTYP= 0
##$PPMPNUM= 2147483647
##$PPRESOL= 1
##$PSCAL= 4
##$PSIGN= 0
##$PYNMP= <proc.py>
##$REVERSE= no
##$SF= 400.020008693647
##$SI= 131072
##$SIGF1= 0
##$SIGF2= 0
##$SINO= 400
##$SIOLD= 131072
##$SPECTYP= <>
##$SREGLST= <1H.CDCl3>
##$SSB= 0
##$STSI= 131072
##$STSR= 0
##$SW_p= 8223.68421052631
##$SYMM= 0
##$S_DEV= 0
##$TDeff= 65536
##$TDoff= 0
##$TI= <>
##$TILT= no
##$TM1= 0
##$TM2= 0
##$TOPLEV= 0
##$USERP1= <user>
##$USERP2= <user>
##$USERP3= <user>
##$USERP4= <user>
##$USERP5= <user>
##$WDW= 1
##$XDIM= 131072
##$YMAX_p= 456857342
##$YMIN_p= -11055
##$CURPLOT= <Network HP LaserJet P1505>
##$CURPRIN= <$Network HP LaserJet P1505>
##$DFORMAT= <normdp>
##$LAYOUT= <+/1D_H.xwp>
##$LFORMAT= <normlp>
##$PFORMAT= <normpl>
##$SURQMSG= 1
$$ End of Bruker specific parameters
$$ ---------------------------------
##NTUPLES= NMR SPECTRUM
##VAR_NAME=  FREQUENCY,     SPECTRUM/REAL,   SPECTRUM/IMAG
##SYMBOL=    X,             R,               I
##VAR_TYPE=  INDEPENDENT,   DEPENDENT,       DEPENDENT
##VAR_FORM=  AFFN,          ASDF,            ASDF
##VAR_DIM=   131072,        131072,          131072
##UNITS=     HZ,            ARBITRARY UNITS, ARBITRARY UNITS
##FACTOR=    0.0627417313425164, 1,          1
##FIRST=     8223.62146879497, 2109,         -58271
##LAST=      0,             3668,            -58224
##MIN=       0,             -11055,          0
##MAX=       8223.62146879497, 456857342,    0
$$ Real data points
##PAGE= N=1
##DATA TABLE= (X++(R..R)), XYDATA
$$ [...]
60938F074016o90615n70178m72263l95364l36131k90780k56120k28613k04613
$$ 6074016 5383401 4813223 4340960 3945596 3609465 3318685 3062565 2833952 2629339
60929B629339j82589j63303j47074j32394j17865j03724r0627p8504o7644n9462
$$ 2629339 2446750 2283447 2136373 2003979 1886114 1782390 1691763 1613259 1545615 1486153
60919A486153n4997n3468n3172n2912n1971m9704m6053m1799l7602l3334k8795
$$ 1486153 1431156 1377688 1324516 1271604 1219633 1169929 1123876 1082077 1044475 1011141 982346
60908I82346k4361k0532j7441j5158j3709j2616j1176r457q140p345o560n856
$$ 982346 957985 937453 920012 904854 891145 878529 867353 857896 849756 842411 835851 829995
60896H29995n948o711o990o393o020o691p583p556o841o478o843p667q797j0104
$$ 829995 824047 817336 810346 803953 797933 791242 783659 776103 769262 762784 755941 748274 739477 729373
60882G29373j1098j1403j1207j0712r747q337p071o287n557m536l638l248k898
$$ 729373 718275 706872 695665 684953 675206 666869 659798 653511 647954 643418 639780 636532 633634
60869F33634j943m97Q38J803K458K846L190L913N032O044O810P868R419J0825
$$ 633634 631691 631194 632032 633835 636293 639139 642329 646242 651274 657318 664128 671996 681415 692240
60855F92240J1645J2435J3733J4946J5100J4293J3610J3876J5018J6293J6681
$$ 692240 703885 716320 730053 744999 760099 774392 788002 801878 816896 833189 849870
60844H49870J5495J3090J0658Q952P724O604N812N485N015L738J734n42k828m791
$$ 849870 865365 878455 889113 898065 905789 912393 918205 923690 928705 932443 934177 933635 930807 926016
60830I26016n915o246o559p212p563p205p005q010r976j1783j2837j3206j2870
$$ 926016 920101 913855 907296 900084 892521 885316 878311 870301 860325 848542 835705 822499 809629
60817H09629j1768j0270q804p230n229l033j224o0N37P75J141K235L914N213N575
$$ 809629 797861 787591 778787 771557 766328 763295 762071 762011 762548 763323 764464 766699 770613 775826 781401
60802G81401N460N276M590L163J806J243Q59l26k004k984k828k081j302q22r65
$$ 781401 786861 792137 796727 799890 801696 802939 803798 803472 801468 798484 795656 793575 792273 791451 790486
60787G90486j562j599l70J487K934M021N352O675P312P568Q347R511J0043R819
$$ 790486 788924 787325 786955 788442 791376 795397 800749 807424 814736 822304 830651 840162 850205 860024
60773H60024R863J0625J1231J0848R777Q741P898O971N763M200K348N88p11j677
$$ 860024 869887 880512 891743 902591 912368 921109 929007 935978 941741 945941 948289 948877 948166 946489
60759I46489k694l681m180m054l612l060k371j633j035o15m20o92j515k636m056
$$ 946489 943795 940114 935934 931880 928268 925208 922837 921204 920169 919554 919134 918442 916927 914291 910235
60744I10235o243r190j1788j2994j3133j3193j3319j3031j2490j2347j2486j2111
$$ 910235 903992 894802 883014 870020 856887 843694 830375 817344 804854 792507 780021 767910
60732G67910j1043r874q877p762o550n653m995m046k799j824j201l53Q90J947
$$ 767910 756867 746993 738116 730354 723804 718151 713156 709110 706311 704487 703286 702933 703823 705770
60718G05770K402K507K560K484K257K021J738J302R86J013P95n00k650m546n702
$$ 705770 708172 710679 713239 715723 717980 720001 721739 723041 724027 725040 725835 725335 722685 718139 712437
60703G12437o588p380p558p032o683p110p727p649o928o336o402p062p866q151
$$ 712437 705849 698469 690911 683879 677196 670086 662359 654710 647782 641446 635044 627982 620116 611965
60689F11965p411n778m007k808k414k657l044k919k061j055n49k61O73K468M419
$$ 611965 604554 598776 594769 591961 589547 586890 583846 580927 578866 577811 577262 577001 577674 580142 584561
60674E84561N795O419O494O474O943Q028R072R472R514R684R667Q981Q198Q291
$$ 584561 590356 596775 603269 609743 616686 624714 633786 643258 652772 662456 672123 681104 689302 697593
60660F97593Q986R129Q614Q532R376J0444J1304J2423J3890J4874J4853J4251
$$ 697593 706579 715708 724322 732854 742230 752674 763978 776401 790291 805165 820018 834269
60648H34269J3261J1304Q392N798M459L696K467R76ko18j625k985l962m384m853
$$ 834269 847530 858834 867226 873024 877483 881179 883646 884622 884620 884002 882377 879392 875430 871046 866193
60633H66193n762o838p757q608r606j0684j1506j1765j1513j1186j1101j1005
$$ 866193 860431 853593 845836 837228 827622 816938 805432 793667 782154 770968 759867 748862
60621G48862j0382r166p801o682n978n816o060n958m786k890j361n56L32J972
$$ 748862 738480 729314 721513 714831 708853 703037 696977 691019 686233 683343 681982 681426 681758 683730
60607F83730M039N909P552R229J0874J2220J3294J4425J5905J7653J8996J9018
$$ 683730 687769 693678 701230 710459 721333 733553 746847 761272 777177 794830 813826 832844
60595H32844J7485J5223J3019J0592P354L726N92k162n305q539j0652j1533j2560
$$ 832844 850329 865552 878571 889163 896517 900243 900835 898673 893368 884829 874177 862644 850084
60582H50084j4502j6405j7159j7002j6718j6437j5978j5494j4983j3981j2480
$$ 850084 835582 819177 802018 785016 768298 751861 735883 720389 705406 691425 678945
60571F78945j1356j1168j1225j0528r033p358n951n072m904n028m461k853j036
$$ 678945 667589 656421 645196 634668 625635 618277 612326 607254 602350 597322 592861 590008 588972
60558E88972J10O92J236J828K407L106L732L621K643J650J303J224R49R30J849
$$ 588972 589082 589774 591010 592838 595245 598351 602083 605704 608347 609997 611300 612524 613473 614403 616252
60543F16252L609N703P916J0065J1799J3355J5706J9232K3043K6451L0202L5268
$$ 616252 619861 625564 633480 643545 655344 668699 684405 703637 726680 753131 783333 818601
60531H18601M1134M6308M9801N1065M9201M3539L4684K3880J1804j059j3216k2680
$$ 818601 859735 906043 955844 1006909 1056110 1099649 1134333 1158213 1170017 1168958 1155742 1133062
60519A133062k8544l1151l0952k8230k3760j8667j3596q740m458j098J561L788
$$ 1133062 1104518 1073367 1042415 1014185 990425 971758 958162 949422 944964 943866 945427 949215
60507I49215N053M642K972J351N26L48P95K360N243R001J3216J7870K2982K8402
$$ 949215 954268 958910 961882 963233 963759 964107 964902 967262 972505 981506 994722 1012592 1035574 1063976
60493A063976L4180M0647M8044N6354O5341P4423Q2723Q9757R5914J02016J08755
$$ 1063976 1098156 1138803 1186847 1243201 1308542 1382965 1465688 1555445 1651359 1753375 1862130
60482A862130J17066J28481J44419J65456J91791K23852K61070K99954L33839
$$ 1862130 1979196 2107677 2252096 2417552 2609343 2833195 3094265 3394219 3728058
60473C728058L54552L54265L27058K70859J88842Q8652j9901j26462k20796k94197
$$ 3728058 4082610 4436875 4763933 5034792 5223634 5312286 5292385 5165923 4945127 4650930
60463D650930l41726l63399l63300l47629l22682k93209k61912k30503k00818
$$ 4650930 4309204 3945805 3582505 3234876 2912194 2618985 2357073 2126570 1925752
60454A925752j74393j51359j30861j12535r6829q3852p2853o3125n4650m7518
$$ 1925752 1751359 1600000 1469139 1356604 1259775 1175923 1103070 1039945 985295 937777
60444I37777m1348l5705l0639k6473k3213k0500j8016j5810j4240j3499j3129
$$ 937777 896429 860724 830085 803612 780399 759899 741883 726073 711833 698334 685205
60433F85205j2298j0753r153q168p600o875n924n032m148l099k248k138k535k615
$$ 685205 672907 662154 653001 644833 637233 630358 624434 619402 615254 612155 609907 607769 605234 602619
60419F02619k069j328o19L89J753K796K953K610K587L031L254K664J591J021J540
$$ 602619 600550 599222 598603 598992 600745 603541 606494 609104 611691 614722 617976 620640 622231 623252 624792
60404F24792K644L241K868K076J593J463J305J050J006J319J762K104K403K863
$$ 624792 627436 630677 633545 635621 637214 638677 639982 641032 642038 643357 645119 647223 649626 652489
60390F52489L549M218M516M418M268M180L663K330P57n5q4l31j353k581l307l516
$$ 652489 656038 660256 664772 669190 673458 677638 681301 683631 684388 684333 684249 683918 682565 679984 676677 673161
60374F73161l309k439r01N88J358J408R68J14p83r59k24O44J010J152J479J826
$$ 673161 669852 667413 666512 667100 668458 669866 670834 670948 670165 669206 668982 669626 670636 671788 673267 675093
60358F75093K170L084M675N980O288O252O718P271P088O557O690P459P935P824
$$ 675093 677263 680347 685022 691002 697290 703542 710260 717531 724619 731176 737866 745325 753260 761084
60344G61084P693P803P741P117N907M280K757K036J930J215o36k257k102o95J73
$$ 761084 768777 776580 784321 791438 797345 801625 804382 806418 808348 809563 808927 806670 804568 803873 804046
60329H04046Mp5P69K178L545M502M551L423J792N64m32j993l982n394n876n972
$$ 804046 804050 803975 804744 806922 810467 814969 819520 822943 824735 825299 824867 822874 818892 813498 807622 801650
60313H01650n943n529m853m419m163l659l102k986k886j886j30J327K229L252
$$ 801650 795707 790178 785325 780906 776743 773084 769982 766996 764110 762224 762094 763421 765650 768902
60299G68902M469N114N087N234N784N909N144L899K267k07l090m854m853m205
$$ 768902 773371 778485 783572 788806 794590 800499 805643 809542 811809 811602 808512 803658 798805 794600
60285G94600m023l988l429k592j818n94J477L481M136L517K916L263M389N613
$$ 794600 790577 786589 783160 780568 778750 778156 779633 783114 787250 790767 793683 796946 801335 806948
60271H06948O478O970P369P796Q022Q043Q608J0505J3400J6150J8249K0179K2301
$$ 806948 813426 820396 827765 835561 843583 851626 860234 870739 884139 900289 918538 938717 961018
60258I61018K4408K6420K8611L0915L2967L4995L7715M1124M4451M7609N1578
$$ 961018 985426 1011846 1040457 1071372 1104339 1139334 1177049 1218173 1262624 1310233 1361811
60247A361811N6899O2840O8582P4315Q0549Q7218R3976J00658J06884J11856J14958
$$ 1361811 1418710 1481550 1550132 1624447 1704996 1792214 1886190 1986848 2093732 2205588 2320546
60236B320546J16035J14806J10839J04355R6217Q6918P6336O4692N2676M0296
$$ 2320546 2436581 2551387 2662226 2766581 2862798 2949716 3026052 3090744 3143420 3183716
60226C183716K6757J1988k773j6371k8612l9179m6928n1084n2292n1603m9213
$$ 3183716 3210473 3222461 3219688 3203317 3174705 3135526 3088598 3037514 2985222 2933619 2884406
60215B884406m4903l8877l1366k2125j1159P42J2898K5464L8575N1518O3710P5787
$$ 2884406 2839503 2800626 2769260 2747135 2735976 2736718 2749616 2775080 2813655 2865173 2928883 3004670
60203C004670Q8667J01884J13735J22878J29037J32351J32585J29066J21155J09014
$$ 3004670 3093337 3195221 3308956 3431834 3560871 3693222 3825807 3954873 4076028 4185042
60193D185042R3905P7272N9517M0285J9857o18k0471l9829n8358p4785q8239r8957
$$ 4185042 4278947 4356219 4415736 4456021 4475878 4475260 4454789 4414960 4356602 4281817 4193578 4094621
60181D094621j06962j11120j10418j05379r7318q6920p4318n9917m4229k7460
$$ 4094621 3987659 3876539 3766121 3660742 3563424 3476504 3402186 3342269 3298040 3270580
60171C270580r869P892K5356M2521N9095P4141Q6853R6808J03023J04007R9444
$$ 3270580 3260711 3268603 3293959 3336480 3395575 3469716 3556569 3653377 3756400 3860407 3959851
60160C959851R0823P9604O5833M9476L1870J4615j996j8152l2923m4865n3578
$$ 3959851 4050674 4130278 4196111 4245587 4277457 4292072 4290076 4271924 4239001 4194136 4140558
60149D140558n9337o1703n9876n4055m5180l3630j9313k720J5266L4337N4511
$$ 4140558 4081221 4019518 3959642 3905587 3860407 3826777 3807464 3804744 3820010 3854347 3908858
60138C908858P5296R6277J18194J42176J67987J94191K19972K45649K71417K96762
$$ 3908858 3984154 4080431 4198625 4340801 4508788 4702979 4922951 5168600 5440017 5736779
60128E736779L21184L44339L65129L81560L91900L95447L92000L81192L62589
$$ 5736779 6057963 6402302 6767431 7148991 7540891 7936338 8328338 8709530 9072119
60119I072119L36049L01980K61559K16436J67779J15852O0918M176n2810j09086
$$ 9072119 9408168 9710148 9971707 10188143 10355922 10471774 10532692 10536868 10484058 10374972
60109A0374972j63947k15770k62025l00350l29115l47321l54663l51712l39585
$$ 10374972 10211025 9995255 9733230 9432880 9103765 8756444 8401781 8050069 7710484
60100G710484l19644k93737k64055k32057j98030j62345j26486r2058n9325k7688
$$ 7710484 7390840 7097103 6833048 6600991 6402961 6240616 6114130 6022072 5962747 5935059
60090E935059K856L1671N8363Q2668J03694J20169J31185J35798J32558J20654
$$ 5935059 5937915 5969586 6027949 6110617 6214311 6334480 6465665 6601463 6734021 6854675
60080F854675J01304P6990M9502J9829j0469l9278o5347q8591j09006j26425j41338
$$ 6854675 6955979 7032969 7082471 7102300 7091831 7052553 6987206 6898615 6789609 6663184 6521846
60069F521846j54658j66386j75495j81242j83609j82480j77602j69594j59873
$$ 6521846 6367188 6200802 6025307 5844065 5660456 5477976 5300374 5130780 4970907
60060D970907j49173j37079j23277j08198r2058p4389n5137l5365j6165K458K1109
$$ 4970907 4821734 4684655 4561378 4453180 4361122 4286733 4231596 4196231 4180066 4182524 4203633
60049D203633L9979N8783P7170R4712J10789J24781J35913J42875J44299J39889
$$ 4203633 4243612 4302395 4379565 4474277 4585066 4709847 4845760 4988635 5132934 5272823
60039E272823J30514J16956R9242P7445N2482K5649k082k9941n7092q2854j06685
$$ 5272823 5403337 5520293 5619535 5696980 5749462 5775111 5773029 5743088 5685996 5603142 5496457
60028E496457j27592j44097j55230j61208j62777j60310j53898j43929j31114
$$ 5496457 5368865 5224768 5069538 4908330 4745553 4585243 4431345 4287416 4156302
60019D156302j16203r9907q2833o5207m6984k8450j0333O996K4067M1733O0294
$$ 4156302 4040099 3940192 3857359 3792152 3745168 3716718 3706385 3713381 3737448 3779181 3839475
60008C839475P9498R9041J18619J37695J55593J71728J85423J95513K00513J99218
$$ 3839475 3918973 4018014 4136633 4274328 4429921 4601649 4787072 4982585 5183098 5382316
59998E382316J91213J76890J57184J33232J06033P6388M5105J3099j8816n0061
$$ 5382316 5573529 5750419 5907603 6040835 6146868 6223256 6268361 6281460 6262644 6212583
59988F212583q0010j07596j31421j50355j63897j71915j74247j70874j62495j50435
$$ 6212583 6132573 6024977 5893556 5743201 5579304 5407389 5233142 5062268 4899773 4749338
59978D749338j35757j18764r9693p9500n9381l9706k0168q55J7603L5125N2498
$$ 4749338 4613581 4494817 4395124 4315624 4256243 4216537 4196369 4195514 4213117 4248242 4300740
59967D300740P0155Q7230J02317J14651J24030J30011J31889J29343J22695J12608
$$ 4300740 4370895 4458125 4560442 4675093 4799123 4929134 5061023 5190366 5313061 5425669
59957E425669R9840Q5139O9158N2498L5844J9824M840q506j8941k5225k7288k5879
$$ 5425669 5525509 5610648 5679806 5732304 5768148 5787972 5792812 5784306 5765365 5740140 5712852 5686973
59945E686973k0875j0887N080K6402N1721Q0213J11502J45237J81425K20397K61605
$$ 5686973 5666098 5655211 5660291 5686693 5738414 5818627 5930129 6075366 6256791 6477188 6738793
59934F738793L03165L43285L81349M16782M47509M70338M82085M79439M58679
$$ 6738793 7041958 7385243 7766592 8183374 8630883 9101221 9583306 10062745 10521424
59925A0521424M17179L55145K75157J80640P5901l2869j38194k33292l13181l74710
$$ 10521424 10938603 11293748 11568905 11749545 11825446 11792577 11654383 11421091 11107910 10733200
59915A0733200m16925m41282m50285m45781m29197m02947l70375l34272k96276
$$ 10733200 10316275 9874993 9424708 8978927 8549730 8146783 7776408 7442136 7145860
59906G145860k57523k18873j80603j42825j06110p0902l6680k691L0655O2306
$$ 7145860 6888337 6669464 6488861 6346036 6239926 6169024 6132344 6129653 6160308 6222614
59896F222614R2171J20986J48566J73317J93508K07886K14965K12920K00555J77594
$$ 6222614 6314785 6435771 6584337 6757654 6951162 7159048 7374013 7586933 7787488 7965082
59886G965082J43951R9886M7151j0824p0191j27513j79504k23101k56305k78434
$$ 7965082 8109033 8208919 8256070 8245246 8175055 8047542 7868038 7644937 7388632 7110198
59876G110198k89665k91010k84628k73024k57827k40122k21716k04931j90845
$$ 7110198 6820533 6529523 6244895 5971871 5714044 5473922 5252206 5047275 4856430
59867D856430j78874j68372j59594j52720j46881j40752j33513j24929j15038
$$ 4856430 4677556 4509184 4349590 4196870 4049989 3909237 3775724 3650795 3535757
59858C535757j04015r1967p8834o4916n1266l8829k7573j7275q873l881k638m377
$$ 3535757 3431742 3339775 3260941 3196025 3144759 3105930 3078357 3061082 3052209 3048328 3045690 3041313
59846C041313q911j6762k7319l8196m7006n2876n5968n6567n5106n2108m7685
$$ 3041313 3032402 3015640 2988321 2950125 2903119 2850243 2794275 2737708 2682602 2630494 2582809
59835B582809m1768l5031k8593k2646j6310r088j384O562J5077K3997L2442M0149
$$ 2582809 2541041 2506010 2477417 2454771 2438461 2429373 2427989 2434551 2449628 2473625 2506067 2546216
59823B546216M7922N6124O3861P0365P6125Q1661Q5928Q6789Q2604P2898N8371
$$ 2546216 2594138 2650262 2714123 2784488 2860613 2942274 3028202 3114991 3197595 3270493 3328864
59812C328864M1091K4093R898n50p331j0656j0922r097o402l716j316J532O705
$$ 3328864 3369955 3394048 3403946 3403396 3396065 3385409 3374487 3365390 3358988 3355272 3353956 3355488 3362193
59799C362193J6138L0152M7436O6776Q8080J11612J37348J65586J97112K32245
$$ 3362193 3378331 3408483 3455919 3522695 3610775 3722387 3859735 4025321 4222433 4454678
59789D454678K70355L10686L52428L92956M26190M43041M33388L88772L06150
$$ 4454678 4725033 5035719 5388147 5781103 6207293 6650334 7083722 7472494 7778644
59780G778644J91442N9268p2123j86980k75178l32544l60256l63455l48846l22662
$$ 7778644 7970086 8029354 7957231 7770251 7495073 7162529 6802273 6438818 6089972 5767310
59770E767310k90083k55080k19935j85566j52982j23790r8810p7127n7297l8950
$$ 5767310 5477227 5222147 5002212 4816646 4663664 4539874 4441064 4363937 4306640 4267690
59760D267690k2417p516O465K0003L3262M6473N9767P3022Q6319J00190J15002
$$ 4267690 4245273 4237757 4244222 4264225 4297487 4343960 4403727 4476749 4563068 4663258 4778260
59749D778260J30640J47158J65084J84633K05313K26929K50258K76119L04330
$$ 4778260 4908900 5056058 5221142 5405775 5611088 5838017 6088275 6364394 6668724
59740F668724L34272L65911L99510M34746M70707N06344N40275N70383N94076
$$ 6668724 7002996 7368907 7768417 8203163 8673870 9180214 9720489 10290872 10884948
59731A0884948O08642O11165N99096N71808N31445M81968M27886L74269L26930
$$ 10884948 11493590 12104755 12703851 13275659 13807104 14289072 14716958 15091227 15418157
59722A5418157K91378K71344K68478K82745L12566L55107M07126M65322N25634
$$ 15418157 15709535 15980879 16249357 16532102 16844668 17199775 17606901 18072223 18597857
59713A8597857N82977O32371O69809O91531O93150O70636O22194N48938M54343
$$ 18597857 19180834 19813205 20483014 21174545 21867695 22538331 23160525 23709463 24163806
59704B4163806L43676K23609J01508j5116j18727k02536k62326k97417l09264
$$ 24163806 24507482 24731091 24832599 24817483 24698756 24496220 24233894 23936477 23627213
59695B3627213k99347k68724k19041j53043p4063J4648J10426K11680L17840M28460
$$ 23627213 23327866 23059142 22840101 22687058 22612995 22627643 22738069 22949749 23267589 23696049
59685B3696049N42395O57869P72738Q84042R87132J075294J139849J170507J156344
$$ 23696049 24238444 24896313 25669051 26553093 27540225 28615519 29755368 30925875 32082219
59676C2082219J087450R56947P63257N12425K19075r5546m07567o94073r35551
$$ 32082219 33169669 34126616 34889873 35402298 35621373 35525827 35118260 34424187 33488636
59667C3488636j118367j236829j292901j293671j249308j172651j078797r83795
$$ 33488636 32370269 31133440 29840539 28546868 27297560 26124909 25046112 24062317
59659B4062317r03410q51574q36672q56994r00244r49099r88359j008699j006714
$$ 24062317 23158907 22307333 21470661 20613667 19713423 18764324 17775965 16767266 15760552
59650A5760552r83731r44121q93109q35270p74380p13441o54192n97232n43167
$$ 15760552 14776821 13832700 12939591 12104321 11329941 10616500 9962308 9365076 8821909
59641H821909m93033m47335m05542l66994l31610k99308k69584k42020k16454
$$ 8821909 8328876 7881541 7475999 7109005 6777395 6478087 6208503 5966483 5750029
59632E750029j92422j69406j47857j28839j12323r7063q2506o9414n8173m8074
$$ 5750029 5557607 5388201 5240344 5111505 4999182 4902119 4819613 4750199 4692026 4643952
59622D643952l9051l2552k9642k9646l1672l6133m3473n2617o2054p1379q0581
$$ 4643952 4604901 4572349 4542707 4513061 4481389 4445256 4401783 4349166 4287112 4215733 4135152
59611D135152q8800r5086r9440j01954j01934r9099r4618q9558q3342p5087o5509
$$ 4135152 4046352 3951266 3851826 3749872 3647938 3548839 3454221 3364663 3281321 3206234 3140725
59600C140725n6139m7429l9051l1160k3884j6442q246j41O816J2894J8618K3194
$$ 3140725 3084586 3037157 2998106 2966946 2943062 2926620 2918374 2918233 2925049 2937943 2956561 2979755
59588B979755K5759K7226K8963L0407K9989K7850K5601K3837K2010K0547K0848
$$ 2979755 3005514 3032740 3061703 3092110 3122099 3149949 3175550 3199387 3221397 3241944 3262792
59577C262792K3102K5996K8965L3020L9092M6972N6143O6256P6652Q6782R7263
$$ 3262792 3285894 3311890 3340855 3373875 3412967 3459939 3516082 3582338 3658990 3745772 3843035
59566C843035J09335J23166J37943J53469J70269J88179K06311K24482K43219
$$ 3843035 3952370 4075536 4213479 4366948 4537217 4725396 4931707 5156189 5399408
59557E399408K62057K79235K93306L03893L10733L13235L11259L05082K94482
$$ 5399408 5661465 5940700 6234006 6537899 6848632 7161867 7473126 7778208 8072690
59548H072690K78970K59170K36852K13414J89408J65548J43057J22765J04782
$$ 8072690 8351660 8610830 8847682 9061096 9250504 9416052 9559109 9681874 9786656
59539I786656Q8944P4565O0238M5674L3897K9941L6696N2965P5473J00953J25740
$$ 9786656 9875600 9950165 10010403 10056077 10089974 10119915 10156611 10209576 10285049 10386002 10511742
59528A0511742J45110J54632J51767J35671J06213O3912J0410n1548j18470j86456
$$ 10511742 10656852 10811484 10963251 11098922 11205135 11269047 11279457 11227909 11109439 10922983
59518A0922983k51756l11178l61942m01691m29349m45555m51529m47959m35723
$$ 10922983 10671227 10360049 9998107 9596416 9167067 8721512 8269983 7822024 7386301
59509G386301m16953l94064l68199l39806l10229k81196k53088k25277j98026
$$ 7386301 6969348 6575284 6207085 5867279 5557050 5275854 5022766 4797489 4599463
59500D599463j72503j49039j27027j06562q8479p2439n6710m0225k3572p461Q382
$$ 4599463 4426960 4277921 4150894 4044332 3955853 3883414 3826704 3786479 3762907 3755446 3763828
59489C763828K4423M0613N7003P3928R1293J08745J26667J45818J65876J85640
$$ 3763828 3788251 3828864 3885867 3959795 4051088 4159833 4286500 4432318 4598194 4783834
59479D783834K04818K24071K42954K59360K71431K78563K80103K74426K59970
$$ 4783834 4988652 5212723 5455677 5715037 5986468 6265031 6545134 6819560 7079530
59470G079530K35930K01554J56349J01830M1823j9823q0734j38803j90992k34547
$$ 7079530 7315460 7517014 7673363 7775193 7817016 7797193 7716459 7577656 7386664 7152117
59460G152117k68438k92780l07733l13857l12643l05760k94306k79334k62325
$$ 7152117 6883679 6590899 6283166 5969309 5656666 5350906 5056600 4777266 4514941
59451D514941k44446k26019k07276j88938j71546j54913j38764j23422j09441
$$ 4514941 4270495 4044476 3837200 3648262 3476716 3321803 3183039 3059617 2950176
59442B950176r7089q6300p6561o6874n6732m6997l8875l2101k5435j8776j3246
$$ 2950176 2853087 2766787 2690226 2623352 2566620 2519623 2480748 2448647 2423212 2404436 2391190
59431B391190r005m761lM076O606Q437J0491J2218J2950J3556J5323J8041K0573
$$ 2391190 2382185 2377424 2377421 2381497 2388103 2396540 2407031 2419249 2432199 2445755 2461078 2479119 2499692
59418B499692K2833K6089L1430L8440M5084M8641M7680M3708M0310M0251M4020
$$ 2499692 2522525 2548614 2580044 2618484 2663568 2712209 2759889 2803597 2843907 2884158 2928178
59407B928178N1042O0971P3359Q7509J03443J21641J40840J57574J69450J78252
$$ 2928178 2979220 3040191 3113550 3201059 3304502 3426143 3566983 3724557 3894007 4072259
59397D072259J88603K04111K25736K53086K85718L23145L64555M08784M54259
$$ 4072259 4260862 4464973 4690709 4943795 5229513 5552658 5917213 6325997 6780256
59388F780256M99145N41609N79442O09247O26932O29604O16649N89007N48591
$$ 6780256 7279401 7821010 8400452 9009699 9636631 10266235 10882884 11471891 12020482
59379A2020482M98771M44109L88578L34580K84016K39001K00519J67181J36319
$$ 12020482 12519253 12963362 13351940 13686520 13970536 14209537 14410056 14577237 14713556
59370A4713556J05760P3846L8688j477m7327r8381j53115k08537k60287l04098
$$ 14713556 14819316 14893162 14931850 14930373 14883046 14784665 14631550 14423013 14162726 13858628
59360A3858628l37082l57626l65287l61718l50863l37224l24153l14118l09369
$$ 13858628 13521546 13163920 12798633 12436915 12086052 11748828 11424675 11110557 10801188
59351A0801188l11083l18242l28281l38655l47325l52493l52819l47781l37288
$$ 10801188 10490105 10171863 9843582 9504927 9157602 8805109 8452290 8104509 7767221
59342G767221l21381l00661k76462k50092k22403j94419j67484j42301j18602
$$ 7767221 7445840 7145179 6868717 6618625 6396222 6201803 6034319 5892018 5773416
59333E773416r6494p7266o2097n0657m1875l5509l2121l1959l4707l9996m7362
$$ 5773416 5676922 5599656 5537559 5486902 5445027 5409518 5377397 5345438 5310731 5270735 5223373
59322E223373n5967o4909p3617q1584q8152r2945r6048r7421r6695r3895q9739
$$ 5223373 5167406 5102497 5028880 4947296 4859144 4766199 4670151 4572730 4476035 4382140 4292401
59311D292401q4786p8829p1513o2999n3724m4120l4844k6564j9135j1611l341
$$ 4292401 4207615 4128786 4057273 3994274 3940550 3896430 3861586 3835022 3815887 3804276 3800935
59300C800935N639J5317K5857L6878M7742N8806P1269Q5430J00337J15470J31365
$$ 3800935 3806574 3821891 3847748 3884626 3932368 3991174 4062443 4147873 4248210 4363680 4495045
59289D495045J48006J64191J79274J93991K08440K20671K28595K32021K31330
$$ 4495045 4643051 4807242 4986516 5180507 5388947 5609618 5838213 6070234 6301564
59280F301564K25206K11424J89289J59925J24690Q4680M1503k738m6178q7037
$$ 6301564 6526770 6738194 6927483 7087408 7212098 7296778 7338281 7335543 7289365 7202328
59270G202328j23138j52545j74439j88876j96276j98113j97434j97484j99575
$$ 7202328 7079190 6926645 6752206 6563330 6367054 6168941 5971507 5774023 5574448
59261E574448k02607k04257k02255j95277j83547j68421j51119j32246j12633
$$ 5574448 5371841 5167584 4965329 4770052 4586505 4418084 4266965 4134719 4022086
59252D022086r3526p5488n7996m0593k3480o475J1444L0819N1099P2075R4686
$$ 4022086 3928560 3853072 3795076 3754483 3731003 3724528 3735972 3766791 3817890 3889965 3984651
59241C984651J19563J46017J73517K03043K35704K70975L07453L44340L80769
$$ 3984651 4104214 4250231 4423748 4626791 4862495 5133470 5440923 5785263 6166032
59232F166032M14446M42167M61127M68619M61339M36398L92869L31644K54584
$$ 6166032 6580478 7022645 7483772 7952391 8413730 8850128 9242997 9574641 9829225
59223I829225J64757O6610l5208j36664k33229l19159l89271m41038m74290m89879
$$ 9829225 9993982 10060592 10025384 9888720 9655491 9336332 8947061 8506023 8031733 7541854
59213G541854m89596m76345m53089m22276l86857l50492l15459k81621k48568
$$ 7541854 7052258 6575913 6122824 5700548 5313691 4963199 4647740 4366119 4117551
59204D117551k17490j89569j64153j40285j18712j00376q4162o8422n3767m2076
$$ 4117551 3900061 3710492 3546339 3406054 3287342 3186966 3102804 3034382 2980615 2938539
59194B938539l3386k6054j9395j3869r042l701K048P073J1546J6874K3194K9109
$$ 2938539 2905153 2879099 2859704 2845835 2836793 2833092 2835140 2842213 2853759 2870633 2893827 2922936
59182B922936L4173L9579M5952N2339N7893O2794O6894O9103O8891O7007O4051
$$ 2922936 2957109 2996688 3042640 3094979 3152872 3215666 3282560 3351663 3420554 3487561 3551612
59171C551612N9409N2289M2834L1686J9377O556o044j8218l0150m1461n1169n8703
$$ 3551612 3611021 3663310 3706144 3737830 3757207 3763763 3757719 3739501 3709351 3667890 3616721 3558018
59159C558018o4196o7755o9241o8813o6938o3857n9696n4881m9816m4337l8258
$$ 3558018 3493822 3426067 3356826 3288013 3221075 3157218 3097522 3042641 2992825 2948488 2910230
59148B910230l2091k6374k0683j4260p297o10N614J1821J8154K4412L0663L7048
$$ 2910230 2878139 2851765 2831082 2816822 2809525 2808915 2814529 2826350 2844504 2868916 2899579 2936627
59136B936627M3438N0023N7598O6390P5396Q3960R3068J03737J15024J25220J34303
$$ 2936627 2980065 3030088 3087686 3154076 3229472 3313432 3406500 3510237 3625261 3750481 3884784
59125C884784J43522J53098J61970J69460J75532J79826J82058J83019J83547
$$ 3884784 4028306 4181404 4343374 4512834 4688366 4868192 5050250 5233269 5416816
59116E416816J82955J80171J75887J71648J67171J60726J51925J41919J30609
$$ 5416816 5599771 5779942 5955829 6127477 6294648 6455374 6607299 6749218 6879827
59107F879827J15688R4912O7555L3465p351n3511j02137j50385j95874k35651
$$ 6879827 6995515 7090427 7157982 7191447 7184096 7130585 7028448 6878063 6682189 6446538
59097F446538k66665k87870l00482l05902l04726k97868k86890k72721k55550
$$ 6446538 6179873 5892003 5591521 5285619 4980893 4683025 4396135 4123414 3867864
59088C867864k36324k16947j98513j80813j63826j48319j34543j21830j09957
$$ 3867864 3631540 3414593 3216080 3035267 2871441 2723122 2588579 2466749 2356792
59079B356792r9554r0827q3195p6428p0831o5976o0740n4906m9343m4430l9740
$$ 2356792 2257238 2166411 2083216 2006788 1935957 1869981 1809241 1754335 1704992 1660562 1620822
59068A620822l5505l2633l0901k8821k5848k3161k1592k0393j8716j6831j5146
$$ 1620822 1585317 1552684 1521783 1492962 1467114 1443953 1422361 1401968 1383252 1366421 1351275
59057A351275j3421j1760j1044j1475j1860j1134r594q065o917o482p303r191
$$ 1351275 1337854 1326094 1315050 1303575 1291715 1280581 1270987 1262922 1256005 1249523 1242220 1233029
59045A233029j0932j1560j1145r978p897m819j019L422Q546J3799J8339K2170
$$ 1233029 1222097 1210537 1199392 1189414 1181517 1176698 1175679 1179101 1187647 1201446 1219785 1241955
59033A241955K5790K8705K9617K8207K5443K1954J7479J2095O660J814k080m091
$$ 1241955 1267745 1296450 1326067 1354274 1379717 1401671 1419150 1431245 1437905 1439719 1437639 1433548
59021A433548l448j289K08P72K285N642R265J1501J2648J3636J4345J4312J3622
$$ 1433548 1430100 1428811 1429019 1429791 1432076 1437718 1446983 1458484 1471132 1484768 1499113 1513425 1527047
59008A527047J2150R148M531n42n186r552j3513j6034j6825j7145j7902j8178
$$ 1527047 1539197 1548345 1552876 1552334 1547148 1537596 1524083 1508049 1491224 1474079 1456177 1437999
58996A437999j6742j3925j0902q098n369k918j024N69K254M058N906P738R110
$$ 1437999 1421257 1407332 1396430 1388332 1382963 1380045 1379021 1379590 1381844 1385902 1391808 1399546 1408656
58983A408656R524R373R567J0194J0600J0888J1965J3991J6193J8355K1004K3925
$$ 1408656 1418180 1427553 1437120 1447314 1457914 1468802 1480767 1494758 1510951 1529306 1550310 1574235
58971A574235K6234K8185L1086L4970L8228M0048M1287M2287M1900L9732L7352
$$ 1574235 1600469 1628654 1659740 1694710 1732938 1772986 1814273 1856560 1898460 1938192 1975544
58960A975544L6097L5365L4260L3284L3213L3797L4825L6967M0537M4728M9204
$$ 1975544 2011641 2047006 2081266 2114550 2147763 2181560 2216385 2253352 2293889 2338617 2387821
58949B387821N4769O1447O7601P2325P7046Q3339R0593R7454J04122J11657J20179
$$ 2387821 2442590 2504037 2571638 2643963 2721009 2804348 2894941 2992395 3096517 3208174 3328353
58938C328353J29352J39575J51303J64211J78319J94723K13909K34611K55836
$$ 3328353 3457705 3597280 3748583 3912794 4091113 4285836 4499745 4734356 4990192
58929D990192K78751L04979L34233L65302L98353M34497M73789N15357N58747
$$ 4990192 5268943 5573922 5908155 6273457 6671810 7106307 7580096 8095453 8654200
58920H654200O03590O48540O91934P32762P69515P98576Q15179Q15353P95736
$$ 8654200 9257790 9906330 10598264 11331026 12100541 12899117 13714296 14529649 15325385
58911A5325385P52461O82143N84062M60441L15396J54990j2179j76288l28774
$$ 15325385 16077846 16759989 17344051 17804492 18119888 18274878 18262699 18086411 17757637
58902A7757637m63413n75960o64052p27286p66569p83574p81160p63324p33825
$$ 17757637 17294224 16718264 16054212 15326926 14560357 13776783 12995623 12232299 11498474
58893A1498474o95228o49767o00188n49163m98945m52384m12911l82284l58958
$$ 11498474 10803246 10153479 9553291 9004128 8505183 8052799 7639888 7257604 6898646
58884F898646l39635l21738l03858k85183k65834k46931k29252k12433j96118
$$ 6898646 6559011 6237273 5933415 5648232 5382398 5135467 4906215 4693782 4497664
58875D497664j80786j66567j52538j38248j24731j12905j02055r1231q0955p2207
$$ 4497664 4316878 4150311 3997773 3859525 3734794 3621889 3519834 3428603 3347648 3275441
58865C275441o4659n7333n0218m3920l8412l3311k8652k4367j9729j4348q852
$$ 3275441 3210782 3153449 3103231 3059311 3020899 2987588 2958936 2934569 2914840 2900492 2891640
58854B891640l666J886Q219J4417J9662K4690L0605L7257M4087N1424N9699O8179
$$ 2891640 2887974 2889860 2898079 2912496 2932158 2956848 2987453 3024710 3068797 3120221 3179920 3248099
58842C248099P5985Q3494R1602J00392J09618J19587J30429J41541J52840J65462
$$ 3248099 3324084 3407578 3499180 3599572 3709190 3828777 3959206 4100747 4253587 4419049
58832D419049J80094J95837K12041K29954K51078K75047L00763L28592L59792
$$ 4419049 4599143 4794980 5007021 5236975 5488053 5763100 6063863 6392455 6752247
58823F752247L94650M32638M73562N17086N61909O06801O51447O94798P33471
$$ 6752247 7146897 7579535 8053097 8570183 9132092 9738893 10390340 11085138 11818609
58814A1818609P63133P80538P82835P66023P25901O60040N67768M49564L08354
$$ 11818609 12581742 13362280 14145115 14911138 15637039 16297079 16864847 17314411 17622765
58805A7622765J50772j4342j78230l32529m69251n82774o71261p34970p74316
$$ 17622765 17773537 17759195 17580965 17248436 16779185 16196411 15525150 14790180 14015864
58796A4015864p90914p88925p73158p46540p10943o69242o24656n78991n33219
$$ 14015864 13224950 12436025 11662867 10916327 10205384 9536142 8911486 8332495 7799276
58787G799276m88803m46667m05964l65712l26735k90290k55859k22054j88707
$$ 7799276 7310473 6863806 6457842 6092130 5765395 5475105 5219246 4997192 4808485
58778D808485j56535j26557j02077q9615r4370j14594j42077j67683j85140j91523
$$ 4808485 4651950 4525393 4423316 4333701 4239331 4124737 3982660 3814977 3629837 3438314
58768C438314j87444j76635j63016j47949j31546j15250j00963q8665p7234o6812
$$ 3438314 3250870 3074235 2911219 2763270 2631724 2516474 2415511 2326846 2249612 2182800
58758B182800n8108n0264m1957l3872k7706k3335j9341j5616j2932j0744q017
$$ 2182800 2124692 2074428 2032471 1998599 1970893 1947558 1928217 1912601 1899669 1888925 1880908
58747A880908n666n516p395r809j2958j8169k4769l0307l3768l5940l6826l5591
$$ 1880908 1875242 1869726 1862331 1852522 1839564 1821395 1796626 1766319 1732551 1696611 1659785 1624194
58735A624194l3033l1340l1105l1027l0588l0499l0592k9881k8839k8982l0031
$$ 1624194 1591161 1559821 1528716 1497689 1467101 1436602 1406010 1376129 1347290 1318308 1288277
58724A288277l0075k8797k7883k7977k7752k6456k4853k3221k0828j7931j5938
$$ 1288277 1258202 1229405 1201522 1173545 1145793 1119337 1094484 1071263 1050435 1032504 1016566
58713A016566j5071j4014j2269j0714r452p438m653k460j335m51J25r37l810o886
$$ 1016566 1001495 987481 975212 964498 955046 947608 942955 940495 939160 938709 938834 937897 934087 927201
58699I27201r100j0888j2440j3082j2910j2929j3076j2105r835p594o034m487
$$ 927201 918101 907213 894773 881691 868781 855852 842776 830671 820836 813242 807208 802721
58687H02721k786j688j062L16K686M982O937R527J2995J6309J8857K0856K2020
$$ 802721 799935 798247 797185 797501 800187 805169 812106 821633 834628 850937 869794 890650 912670
58674I12670K1942K1878K3989K8557L4076M0107M7856N7845O9169Q0730R0198
$$ 912670 934612 956490 980479 1009036 1043112 1083219 1131075 1188920 1258089 1338819 1429017
58663A429017R1832P9009N0669J3341k3835n4151p3915q1902q0092p2670o2780
$$ 1429017 1520849 1599858 1650527 1663868 1640033 1585882 1511967 1430065 1349973 1277303 1214523
58652A214523n1542m0220l0759k3433j6519r259k870K074O754J1705J5823J8804
$$ 1214523 1162981 1122761 1092002 1068569 1052050 1042791 1039921 1041995 1048749 1060454 1076277 1095081
58640A095081K2124K6429L0327L2946L5483L8965M2677M6178N0680N7052O4287
$$ 1095081 1117205 1143634 1173961 1206907 1242390 1281355 1324032 1370210 1420890 1477942 1542229
58629A542229P1424P9254Q8903J00303J13163J27926J44622J62185J79706J97011
$$ 1542229 1613653 1692907 1781810 1882113 1995276 2123202 2267824 2430009 2609715 2806726
58619B806726K13441K27614K38724K46269K48043K40329K20729J89250J46657
$$ 2806726 3020167 3247781 3486505 3732774 3980817 4221146 4441875 4631125 4777782
58610D777782R4212L5455k4112p9946j29340j69639j98395k15858k24611k26132
$$ 4777782 4871994 4907449 4883337 4803391 4674051 4504412 4306017 4090159 3865548 3639416
58600C639416k20305k08663j94950j81301j66787j50837j35179j21099j07727
$$ 3639416 3419111 3210448 3015498 2834197 2667410 2516573 2381394 2260295 2152568
58591B152568r4490q2639p2725o3297n3733m5829m0826l7230l3290k9398k6350
$$ 2152568 2058078 1975439 1902714 1839417 1785684 1739855 1699029 1661799 1628509 1599111 1572761
58580A572761k3505k0417j8101j6894j5105j1531p370m000r10K507N091N597M471
$$ 1572761 1549256 1528839 1510738 1493844 1478739 1467208 1459838 1455838 1454928 1457435 1462526 1468123 1472594
58567A472594K237k090r310j8168k6581l3349l7660l8685l6790l3556k9588k3997
$$ 1472594 1474831 1472741 1463431 1445263 1418682 1385333 1347673 1308988 1272198 1238642 1209054 1185057
58555A185057j6654q890j481N561J0420R687K499p918j8034k6767l3538l6809
$$ 1185057 1168403 1159513 1158032 1163593 1174013 1183700 1186199 1178281 1160247 1133480 1099942 1063133
58543A063133l6441l4763l3331l0968k6671k1938j8377j5438j2404j0337j0055
$$ 1063133 1026692 991929 958598 927630 900959 879021 860644 845206 832802 822465 812410
58532H12410j0339r969r485r348q601o934n774n717n217l348j451n41L90J864
$$ 812410 802071 792102 782617 773269 764668 757734 751960 746243 741026 737678 736227 735686 736076 737940
58518G37940K504J822J610K728L364K419J647K270K505Q50r89j039l18m90q00
$$ 737940 740444 742266 743876 746604 749968 752387 754034 756304 758809 759659 758670 757631 757313 756823 756023
58503G56023Q7J469K422L882O583R134J0504J1960J4245J5344J3597J0522Q160
$$ 756023 756110 757579 760001 763883 770466 779600 790104 802064 816309 831653 845250 855772 863932
58490H63932O094L600J935J743Q39k475o312q176q579q979q743p106n617n514
$$ 863932 870026 873626 875561 877304 878143 875668 869356 861180 852601 843622 834879 827773 822156 816642
58476H16642n232l573k713m848q280j0204j1016j2415j3675j3323j2407j2452
$$ 816642 811410 807837 805124 800276 791996 781792 770776 758361 744686 731363 718956 706504
58464G06504j2223r991o975n131l610r42J463J700J156K150L663L293J706J341
$$ 706504 694281 684290 677315 672184 668574 667632 669095 670795 671951 674101 677764 681057 682763 684104
58450F84104K269L089M299P046J0044J1563J2932J6306K0287K1561J9615J6224
$$ 684104 686373 689462 693761 700807 710851 722414 735346 751652 771939 793500 813115 829339
58438H29339J1604M850k874r167j3564j6762j8104j6946j5060j4344j3577j0752
$$ 829339 840943 845793 842919 833752 820188 803426 785322 768376 753316 738972 725395 714643
58426G14643o942m434k768k28K401L382L777N880R168J1563J3325J6031J8982
$$ 714643 707701 703267 700499 700271 702672 706054 709831 715711 724879 736442 749767 765798 784780
58413G84780K0256K0072J9662J8128J3891P931K305l009q546j2677j3996j4333
$$ 784780 805036 825108 844770 862898 876789 884720 887025 884016 875470 862793 848797 834464
58401H34464j5733j6542j4398j0909r219q911p633n791n226n088l543j792j949
$$ 834464 818731 802189 787791 776882 767663 758752 751119 745328 740102 735014 731471 729679 727730
58388G27730k739j761j75n83k078k121j379j780j688J760P239J1262J3924J7324
$$ 727730 724991 723230 723055 722472 720394 718273 716894 715114 713426 715186 722425 733687 747611 764935
58374G64935K0094J9235J6041J4422J4451J3205J0942J0606J2008J2271J1497
$$ 764935 785029 804264 820305 834727 849178 862383 873325 883931 895939 908210 919707
58363I19707J2386J4702J5654J5348J6432J8705J9328J7930J6324J3864Q464J680
$$ 919707 932093 946795 962449 977797 994229 1012934 1032262 1050192 1066516 1080380 1088844 1090524
58351A090524k666m481o813r834j0834r596q489p609n095j668K74J406M187P763
$$ 1090524 1087858 1083377 1076564 1066730 1055896 1046300 1037811 1030202 1025107 1023439 1023713 1025119 1029306 1037069
58337A037069R353R553J0906J2508J1797J0317J1661J4927J6273J5805J6674J8617
$$ 1037069 1046422 1055975 1066881 1079389 1091186 1101503 1113164 1128091 1144364 1160169 1176843 1195460
58325A195460J8879J8343K0114K3106K3698K2490K2604K2637J8640J1854P036
$$ 1195460 1214339 1232682 1252796 1275902 1299600 1322090 1344694 1367331 1385971 1397825 1404861
58314A404861M245J8m475m708j524j39q65P67M833O569N403N953R431J2189J3322
$$ 1404861 1409106 1409124 1404649 1399941 1398417 1398278 1397413 1398180 1403013 1409582 1414985 1420938 1430369 1442558 1455880
58299A455880J5694J9041J9932J8911J9870K2284K2172K0387K1584K5277K6707
$$ 1455880 1471574 1490615 1510547 1529458 1549328 1571612 1593784 1614171 1635755 1661032 1687739
58288A687739K6155K8326L2931L5402L6497M1164M8087N0798M9207M9167N0418
$$ 1687739 1713894 1742220 1775151 1810553 1847050 1888214 1936301 1987099 2036306 2085473 2135891
58277B135891M6307L6409K8047K3917J9474J3951J2560J5916J8577J9787K4476
$$ 2135891 2182198 2218607 2246654 2270571 2290045 2303996 2316556 2332472 2351049 2370836 2395312
58266B395312L2148L6411L6995M0343M6854M9974M9434N2362N9376O2932O1662
$$ 2395312 2427460 2463871 2500866 2541209 2588063 2638037 2687471 2739833 2799209 2862141 2923803
58255B923803O2745O7733O9888O8307P0391P7433Q2132Q3248Q7942R6686J01319
$$ 2923803 2986548 3054281 3124169 3192476 3262867 3340300 3422432 3505680 3593622 3690308 3791627
58244C791627J01160J05094J14374J20059J20853J26255J37990J46376J49472
$$ 3791627 3892787 3997881 4112255 4232314 4353167 4479422 4617412 4763788 4913260
58235D913260J57252J71979J83556J89448J99517K15838K28289K35723K50027
$$ 4913260 5070512 5242491 5426047 5615495 5815012 6030850 6259139 6494862 6744889
58226F744889K73113K92386L05393L25398L55676L83169M05010M35252M77267
$$ 6744889 7018002 7310388 7615781 7941179 8296855 8680024 9085034 9520286 9997553
58217I997553N16943N51840N98038O59264P20234P80033Q58421R58907J062147
$$ 9997553 10514496 11066336 11664374 12323638 13043872 13823905 14682326 15641233 16703380
58208A6703380J167416J301293J473051J665291J883055K164590K528017K961265
$$ 16703380 17870796 19172089 20645140 22310431 24193486 26358076 28886093 31847358
58200C1847358L483926M160070N028340O083779P348463Q883048J0711940J2843820
$$ 31847358 35331284 39491354 44519694 50603473 57951936 66834984 77546924 90390744
58192I0390744J5402595J8625493K2715184K7853733L4276005M1721583M8268183
$$ 90390744 105793339 124418832 147134016 174987749 209263754 250985337 299253520
58185B99253520N0051995M3242839K7156157N503863j5677358l1534387m0343301
$$ 299253520 349305515 392548354 419704511 425208374 409531016 377996629 337653328
58178C37653328m2996045m1447933l7609523l2911526k8192910k3799480j9847390
$$ 337653328 294657283 253209350 215599827 182688301 154495391 130695911 110848521
58171A10848521j6413539j3526216j1128008r143789p536253o258380n219564
$$ 110848521 94434982 80908766 69780758 60636969 53100716 46842336 41622772
58164D1622772m344457l612553l006527k476136j984859j538579j136708p45337
$$ 41622772 37278315 33665762 30659235 28183099 26198240 24659661 23522953 22777616
58156B2777616l45303M8097M42185Q89076J427264K067462K855253L825734M785077
$$ 22777616 22432313 22480410 22922595 23811671 25238935 27306397 30161650 33987384 38772461
58147C8772461N211921M554421K709540J80834k251015m000063m890248n062638
$$ 38772461 43984382 48538803 51248343 51429177 49178162 45178099 40287851 35225213
58139C5225213m776770m268683l695552l139120k634437k194010j818248j502440
$$ 35225213 30448443 26179760 22484208 19345088 16710651 14516641 12698393 11195953
58131A1195953j242764j034145q65790p25969o09502n14802m37481l73312l22997
$$ 11195953 9953189 8919044 8053254 7327285 6717783 6202981 5765500 5392188 5069191
58122E069191k86984k59902k36745k19416k10157k03834j93998j81388j69335
$$ 5069191 4782207 4522305 4285560 4066144 3855987 3652153 3458155 3276767 3107432
58113C107432j56131j39362j22428j09015r6006p9213o1601m8744m0837l5895
$$ 3107432 2951301 2811939 2689511 2580496 2484490 2405277 2343676 2294932 2254095 2218200
58103B218200l5854m2150m9827n3247n3771n5439n7404n7243n7355o1168o6600
$$ 2218200 2182346 2140196 2090369 2037122 1983351 1927912 1870508 1813265 1755910 1694742 1628142
58092A628142o9507p0109p0236o8169o2019n4546m9012m4009l7552l2117l0257
$$ 1628142 1558635 1488526 1418290 1350121 1288102 1233556 1184544 1140535 1102983 1070866 1040609
58081A040609k9471k6833k4385k4490k4386k1180j7846j8200j9942j8895j6239
$$ 1040609 1011138 984305 959920 935430 911044 889864 872018 853818 833876 814981 798742
58070G98742j5369j5174j2791r793r308r945q558o293o015o411m512j704j527
$$ 798742 783373 768199 755408 745615 736307 726362 717804 711511 705496 699085 694573 692869 691342
58057F91342l580m975n715p523r430r553r201j0423j1617j0227p590o467o070
$$ 691342 687762 682787 677072 669549 660119 650566 641365 630942 619325 609098 601508 595041 588971
58044E88971m175j856j394j705n13J079Q98K90J702L808L834K759L385N121N331
$$ 588971 584796 582940 581546 579841 579328 580407 581305 581595 583297 587105 590939 593698 597083 602204 607535
58029F07535M225L745L396J715J51Q66K297J536m18m47J133J501N63N61J442J145
$$ 607535 611760 615505 618901 620616 620767 621633 623930 625466 625048 624601 625734 627235 627798 628359 629801 630946
58013F30946k26o60j8K70M10J410K102Q37j069j337j017k825o303q642r320r968
$$ 630946 630720 630060 630042 630312 630722 632132 634234 635071 634002 632665 631648 628823 622520 613878 604558 594590
57997E94590j0562r755q202p644p354n317k240o61p31o35l99j424k860k433n25
$$ 594590 584028 574273 566071 558427 551073 545756 543516 542855 542124 541489 541090 539666 536806 534373 533848
57982E33848L19k63k71P64J289J013J185J732J361M27M76J159P46n81j139j149
$$ 533848 534167 533904 533633 534397 535686 536699 537884 539616 540977 541404 541880 543039 543785 543204 542065 540916
57966E40916k380m596n698n369n334n935n613m006k529j625l23J267J780J227
$$ 540916 538536 533940 528242 522873 517539 511604 505991 501985 499456 497831 497508 498775 500555 501782
57952E01782J144J969K673L037L777M452L792K175J228R86j13k415m602o041p239
$$ 501782 502926 504895 507568 510605 514382 518834 522626 524801 526029 527015 526902 524487 519885 513844 506605
57937E06605q068p966p745q771j0380j0473q677o734n741n162m391l301j449J165
$$ 506605 498537 490571 482826 474055 463675 453202 444525 437791 432050 426888 422497 419196 417747 418912
57923D18912L116L234K624K778K809J122j165j568l38N4q66j115J10J615L060
$$ 418912 422028 425262 427886 430664 433473 434595 433430 431862 431524 431578 430712 429597 429707 431322 434382
57908D34382N413Q160R243Q353P470P488P044N295L289J852M58j080k058k560
$$ 434382 439795 447955 457198 465551 473021 480509 487553 492848 496137 497989 498447 497367 495309 492749
57894D92749l530m760m928m003l397l458l104k225k118l072l788l636l319k975
$$ 492749 489219 484459 479531 475528 472131 468673 465569 463344 461226 458154 454366 450730 447411 444436
57880D44436j862k27O89R25J758L142L576K992L192M833O310O483O170O168N922
$$ 444436 442574 442347 443036 443961 445719 448861 452437 455429 458621 463454 469764 476247 482417 488585 494507
57865D94507N080M312L768K654R83j31n06j186k237k417j610j341k113k533j935
$$ 494507 499587 503899 507667 510321 511304 511173 510667 509481 507244 504827 503217 501876 499763 497230 495295
57850D95295j597k272k730k019j161j252j648j366p81o31p01o01o43r83j203j401
$$ 495295 493698 491426 488696 486677 485516 484264 482616 481250 480469 479838 479137 478536 477893 476910 475707 474306
57834D74306k369m028n187n547o301p992r439r654r300r226r185q896q933r499
$$ 474306 471937 467909 462722 457175 450874 442882 433443 423789 414489 405263 396078 387182 378249 368750
57820C68750r636q692p357o404n530m408l557l368l280k738j976j277n24O8nl47
$$ 368750 359114 350422 343065 336661 331131 326723 323166 319798 316518 313780 311804 310527 310003 310071 310066 309719
57804C09719K03J771L190L915M723O024P102P674Q578J0224J1886J3276J5166
$$ 309719 309922 311693 314883 318798 323521 329545 336647 344321 352899 363123 375009 388285 403451
57791D03451J7612J9081J8286J5530J1481O231M51m168o812q499j0181j1299j1221
$$ 403451 421063 440144 458430 473960 485441 491672 492123 487955 481143 472644 462463 451164 439943
57778D39943j0695j0623j0644j0128r399q844p938o279m600l643l013k098j127
$$ 439943 429248 418625 407981 397853 388454 379610 371672 365393 360793 357150 354137 352039 350912
57765C50912m10M38J640K632L164L846M819N145M397L647L768M042L563K882K955
$$ 350912 350502 350940 352580 355212 358376 362222 367041 372186 376583 380230 383998 388040 391603 394485 397440
57750C97440L535L876M083M544M909M793M733N279N880N784N330N283N663O146
$$ 397440 400975 404851 408934 413478 418387 423180 427913 433192 439072 444856 450186 455469 461132 467278
57736D67278O872P911Q750R178R860J1102J2032J2032J2001J2984J4469J5365
$$ 467278 474150 482061 490811 499989 509849 520951 532983 545015 557016 570000 584469 599834
57724E99834J5864J6981J8797K0526K1906K3371K5116K7006K9179L1810L4621
$$ 599834 615698 632679 651476 672002 693908 717279 742395 769401 798580 830390 865011
57713H65011L7317M0205M3751M8050N3200N9586O7194P5477Q4425R4893J07163
$$ 865011 902328 942533 986284 1034334 1087534 1147120 1214314 1289791 1374216 1469109 1576272
57702A576272J20277J33668J48299J65133J83410K01585K18963K34982K47633
$$ 1576272 1696549 1830217 1978516 2143649 2327059 2528644 2747607 2982589 3230222
57693C230222K53942K51413K37988K11566J71451J20102O2185K158n6200j08703
$$ 3230222 3484164 3735577 3973565 4185131 4356582 4476684 4538869 4541027 4484827 4376124
57683D376124j51138j81190j98987k05908k03753j94820j81324j64431j44490
$$ 4376124 4224986 4043796 3844809 3638901 3435148 3240328 3059004 2894573 2750083
57674B750083j22108r8152p2904m6083j7543J2987M6155Q1000J11577J26715J15293
$$ 2750083 2627975 2529823 2456919 2410836 2393293 2406280 2452435 2533435 2645012 2771727 2887020
57663B887020P3878J0725n7438j13835j49176j63096j60244j46217j26280j05007
$$ 2887020 2960898 2971623 2914185 2800350 2651174 2488078 2327834 2181617 2055337 1950330
57653A950330q4938o6014m7408k9513j3411P95J4022K6962L9807N2902O6684Q1158
$$ 1950330 1865392 1799378 1751970 1722457 1709046 1709841 1723863 1750825 1790632 1843534 1910218 1991376
57641A991376R6120J11653J27804J44183J60383J76318J91421K04065K12320K14641
$$ 1991376 2087496 2199149 2326953 2471136 2631519 2807837 2999258 3203323 3415643 3630284
57631C630284K09156J93327J65487J26395P8526K4671l1687q5561j31890j68008
$$ 3630284 3839440 4032767 4198254 4324649 4403175 4427846 4396159 4310598 4178708 4010700
57621D010700j93854k10183k17733k17905k12688k03648j91723j78046j63953
$$ 4010700 3816846 3606663 3388930 3171025 2958337 2754689 2562966 2384920 2220967
57612B220967j50105j36432j23103j10753r9678q9551q0095p1471o3889n7283
$$ 2220967 2070862 1934430 1811327 1700574 1600896 1511345 1431250 1359779 1295890 1238607
57602A238607n1449m6214m1493l7419l4111l1171k7917k4407k1539j9682j7987
$$ 1238607 1187158 1140944 1099451 1062032 1027921 996750 968833 944426 922887 903205 885218
57591H85218j5772j3745j2906j2872j2365j0967r312p904o688n631m750l741k357
$$ 885218 869446 855701 842795 829923 817558 806591 797279 789375 782687 777056 772306 768565 766208
57578G66208j046m09k52J36J086K521M403O428P789Q079Q033Q564R595J0669J2064
$$ 766208 765162 764753 764501 764637 765723 768244 772647 779075 786864 794943 802976 811540 821135 831804 843868
57563H43868J4151J6319J7841J9412K2350K6528L0515L3716L6946M0842M5167
$$ 843868 858019 874338 892179 911591 933941 960469 990984 1024700 1061646 1102488 1147655
57552A147655M9889N5602O2502P0092P8234Q7429R7642J08017J18283J29348J41789
$$ 1147655 1197544 1253146 1315648 1385740 1463974 1551403 1649045 1757062 1875345 2004693 2146482
57541B146482J54529J65673J73934J78501J77974J70271J53661J27624R3048N2052
$$ 2146482 2301011 2466684 2640618 2819119 2997093 3167364 3321025 3448649 3541697 3593749
57531C593749P634l6775p7739j12344j38833j56796j66725j69593j66864j60301
$$ 3593749 3601383 3564608 3486869 3374525 3235692 3078896 2912171 2742578 2575714 2415413
57521B415413j51240j40307j28139j15785j03967r2590q1577p1594o3120n5474
$$ 2415413 2264173 2123866 1995727 1879942 1775975 1683385 1601808 1530214 1467094 1411620
57511A411620m7652l9784l2795k7030k2065j7611j3635r921o327l149m13K713
$$ 1411620 1363968 1324184 1291389 1264359 1242294 1224683 1211048 1201127 1194800 1191651 1191238 1193951
57499A193951O811J1020J4224J6947K0727K5869L1244L6277M1600M7705N4297
$$ 1193951 1200762 1211782 1226006 1242953 1263680 1289549 1320793 1357070 1398670 1446375 1500672
57488A500672O1351O9490P8912Q9062R9722J11324J23831J36307J47909J58281
$$ 1500672 1562023 1631513 1710425 1799487 1899209 2010533 2134364 2270671 2418580 2576861
57478B576861J66503J70522J68213J58274J39927J12664P6973L4923j0283n4986
$$ 2576861 2743364 2913886 3082099 3240373 3380300 3492964 3569937 3604860 3594577 3539591
57468C539591r5480j28817j53635j69946j78252j79455j75282j67778j58124j46659
$$ 3539591 3444111 3315294 3161659 2991713 2813461 2634006 2458724 2290946 2132822 1986163
57458A986163j33862j20535j07241r4522q3393p4521o7078n9646n2152m5690m0605
$$ 1986163 1852301 1731766 1624525 1530003 1446610 1372089 1305011 1245365 1193213 1147523 1106918
57447A106918l6201l2310k9487k7415k4742k1057j7552j5195j3629j2331j1419
$$ 1106918 1070717 1038407 1008920 981505 956763 935706 918154 902959 889330 876999 865580
57436H65580j0656r165o967n425n257n331m438l020k133j777j387j013r42q42
$$ 865580 854924 845759 838792 833367 828110 822779 818341 815321 813188 811411 810024 809011 808069 807227
57422H07227l84rj38k89J55R63J662K508L922N552O667P058O878O183N320N039
$$ 807227 806843 806834 806696 806407 806562 807525 809187 811695 815617 821169 827836 834894 841772 847955 853275 858314
57406H58314N557O152O270O334O741O983O531N805N463N470N668O418P745Q639
$$ 858314 863871 870023 876293 882627 889368 896351 902882 908687 914150 919620 925288 931706 939451 948090
57392I48090Q337P618P736Q649R358R511R552R712R927J0393J1271J2114J2454
$$ 948090 956427 964045 971781 980430 989788 999299 1008851 1018563 1028490 1038883 1050154 1062268 1074722
57379A074722J2663J3309J4129J4455J4326J4236J4159J3747J3201J3014J3038
$$ 1074722 1087385 1100694 1114823 1129278 1143604 1157840 1171999 1185746 1198947 1211961 1224999
57368A224999J2613J1518J0125Q849Q001P808Q094Q360Q643R609J1176J2029J1395
$$ 1224999 1237612 1249130 1259255 1268104 1276105 1283913 1292007 1300367 1309010 1318619 1329795 1341824 1353219
57355A353219J0353J0329J1089J1461J1351J1530J2016J2128J1921J2061J2481
$$ 1353219 1363572 1373901 1384990 1396451 1407802 1419332 1431348 1443476 1455397 1467458 1479939
57344A479939J2504J2147J1993J1970J1622J1458J2547J4724J6626J7604J8242
$$ 1479939 1492443 1504590 1516583 1528553 1540175 1551633 1564180 1578904 1595530 1613134 1631376
57333A631376J8881J9162J9283K0123K1595K2426K2216K2380K4030K6207K7276
$$ 1631376 1650257 1669419 1688702 1708825 1730420 1752846 1775062 1797442 1821472 1847679 1874955
57322A874955K7168K7050K7423K7822K8023K8467K9373L0274L0708L0846L1182
$$ 1874955 1902123 1929173 1956596 1984418 2012441 2040908 2070281 2100555 2131263 2162109 2193291
57311B193291L1868L2631L3253L3983L5233L6966L8733M0396M2285M4431M6196
$$ 2193291 2225159 2257790 2291043 2325026 2360259 2397225 2435958 2476354 2518639 2563070 2609266
57300B609266M7193M8036M9492N1281N2458N2744N2622N2310N1441M9754M7323
$$ 2609266 2656459 2704495 2753987 2805268 2857726 2910470 2963092 3015402 3066843 3116597 3163920
57289C163920M4107L9867L4535K8223K1094J3765P487L174N04j367k546k614j614
$$ 3163920 3208027 3247894 3282429 3310652 3331746 3345511 3352998 3356172 3356676 3355309 3352763 3350149 3348535
57276C348535J76L021P126J1580J5173J8076K1351K4935K7603K8962L0032L1460
$$ 3348535 3348711 3351732 3358858 3370438 3385611 3403687 3425038 3449973 3477576 3506538 3536570 3568030
57264C568030L2670L3211L3629L4404L5146L5416L5343L4981L4138L3247L3232
$$ 3568030 3600700 3633911 3667540 3701944 3737090 3772506 3807849 3842830 3876968 3910215 3943447
57253C943447L4004L4297L3647L3237L4045L5425L6492L7672L9729M2137M3756
$$ 3943447 3977451 4011748 4045395 4078632 4112677 4148102 4184594 4222266 4261995 4304132 4347888
57242D347888M4479M5070M5874M6671M7368M7910M7896M7127M6134M5342M4257
$$ 4347888 4392367 4437437 4483311 4529982 4577350 4625260 4673156 4720283 4766417 4811759 4856016
57231D856016M2342M0193L8816L8062L6781L4496L2099L0895L1405L3058L4609
$$ 4856016 4898358 4938551 4977367 5015429 5052210 5086706 5118805 5149700 5181105 5214163 5248772
57220E248772L5153L5013L5315L6391L7281L7209L6715L6691L7074L7447L8147
$$ 5248772 5283925 5318938 5354253 5390644 5427925 5465134 5501849 5538540 5575614 5613061 5651208
57209E651208L9599M1040M1157L9991L9109L9694M1231M2238M1743L9953L7937
$$ 5651208 5690807 5731847 5773004 5812995 5852104 5891798 5933029 5975267 6017010 6056963 6094900
57198F094900L6699L6294L6019L5516L5130L4920L4082L2114K9827K8300K7373
$$ 6094900 6131599 6167893 6203912 6239428 6274558 6309478 6343560 6375674 6405501 6433801 6461174
57187F461174K6170K4707K3877K3888K3844K2903K1239J9734J9194J9768K0732
$$ 6461174 6487344 6512051 6535928 6559816 6583660 6606563 6627802 6647536 6666730 6686498 6707230
57176F707230K1174K1239K2071K3913K5152K4293K2059K0242J9031J7077J3913
$$ 6707230 6728404 6749643 6771714 6795627 6820779 6845072 6867131 6887373 6906404 6923481 6937394
57165F937394J0606P852N037J587k157n898r954j4320j8174k1012k3312k5542
$$ 6937394 6948000 6955852 6960889 6962476 6960319 6954421 6944467 6930147 6911973 6890961 6867649 6842107
57153F842107k7355k8288k8457k7984k6500k3729j9878j5020q877j685N590J2342
$$ 6842107 6814752 6786464 6758007 6730023 6703523 6679794 6659916 6644896 6636019 6634334 6639924 6652266
57141F652266J8897K5344L0695L3874L4874L4186L1782K7410K1432J4618P506
$$ 6652266 6671163 6696507 6727202 6761076 6795950 6830136 6861918 6889328 6910760 6925378 6932884
57130F932884O87m727p518p000k934M688J5206K7217L9391N0870O0685O7713P1964
$$ 6932884 6933571 6928844 6921326 6914326 6911392 6916080 6931286 6958503 6997894 7048764 7109449 7177162 7249126
57117G249126P5189P9571Q6496R7082J12721J33969J59668J88240K19130K52327
$$ 7249126 7324315 7403886 7490382 7587464 7700185 7834154 7993822 8182062 8401192 8653519
57107H653519K87853L27369L75270M36435N13452O07756P22913Q65196J041985
$$ 8653519 8941372 9268741 9644011 10080446 10593898 11201654 11924567 12789763 13831748
57098A3831748J261908J535923J875393K288307K778059L344018L979788M671198
$$ 13831748 15093656 16629579 18504972 20793279 23571338 26915356 30895144 35566342
57090C5566342N399076O143524O882613P588983Q232648Q782814R193865R387236
$$ 35566342 40965418 47108942 53991555 61580538 69813186 78596000 87789865 97177101
57082I7177101R265743Q766598P900899O728961N297269L614812J698286l70391
$$ 97177101 106442844 115209442 123110341 129839302 135136571 138751383 140449669 140079278
57074A40079278k442295m354614n984911p270204q197636q786514r070609r085442
$$ 140079278 137636983 133282369 127297458 120027254 111829618 103043104 93972495 84887053
57066H4887053q865978q452116p891351p233988o526585n808281n108577m446429
$$ 84887053 76021075 67568959 59677608 52443620 45917035 40108754 35000177 30553748
57058C0553748l833662l280571k796633k385447k041859j755726j517053j317082
$$ 30553748 26720086 23439515 20642882 18257435 16215576 14459850 12942797 11625715
57050A1625715j147600j002037q76548p68573o75221n94037n24028m64421m13263
$$ 11625715 10478115 9476078 8599530 7830957 7155736 6561699 6037671 5573250 5159987
57041E159987l68447l29272k95765k67119k41902k19220j98774j80369j64155
$$ 5159987 4791540 4462268 4166503 3899384 3657482 3438262 3239488 3059119 2894964
57032B894964j50632j39497j29226j18747j08728j00292r3221q6544q0184p4736
$$ 2894964 2744332 2604835 2475609 2356862 2248134 2147842 2054621 1968077 1887893 1813157
57022A813157p0052o5348o0479n5990n2021m8154m4234m0453l6728l2868k9277
$$ 1813157 1743105 1677757 1617278 1561288 1509267 1461113 1416879 1376426 1339698 1306830 1277553
57011A277553k6608k4748k2853k0368j7341j3820r588m468J801R823K0023L2002
$$ 1277553 1250945 1226197 1203344 1182976 1165635 1151815 1142227 1137759 1139560 1149383 1169406 1201408
56999A201408M5258O0575P9796J04317J35066J74104K23367K77689L18091L16136
$$ 1201408 1246666 1307241 1387037 1491354 1626420 1800524 2023891 2301580 2619671 2935807
56989B935807K51734J31115j2573j38592k21039k56511k56211k35173k06948j81338
$$ 2935807 3187541 3318656 3306083 3167491 2946452 2689941 2433730 2198557 1991609 1810271
56979A810271j62134j47267j33096j18437j04168r0777p8004o5997n5194m5578
$$ 1810271 1648137 1500870 1367774 1249337 1145169 1054392 976388 910391 855197 809619
56969H09619l7088l0257k5350k1561j8072j5077j2771j0131o011n89N554J2914
$$ 809619 772531 742274 716924 695363 677291 662214 649443 639312 633301 632712 638266 651180
56957F51180K1754K9664L2284K6789J3947k864j9334l1547l7623l8650l7127l4455
$$ 651180 672934 702598 734882 761671 775618 772754 753420 721873 684250 645600 608473 574018
56945E74018l0644k5972k1383j7288j3232q964m822r20L063P276J1757J7104K4205
$$ 574018 543374 517402 496019 478731 465499 456535 451713 450793 453856 461132 472889 489993 514198
56932E14198L3112M2615N0404N2984M6543K9899O713j6395l4215m5071m9636m9462
$$ 514198 547310 589925 640329 693313 739856 769755 776468 760073 725858 680787 631151 581689
56920E81689m6527m2478l7757l2284k6771k2277j8761j5474j2605j0980j0289
$$ 581689 535162 492684 454927 422643 395872 373595 354834 339360 326755 315775 305486
56909C05486r210p391n753m704l670k588k210k481k269j161j06K93O62J475K231
$$ 305486 296276 288885 283132 278428 274758 272170 269960 267479 265210 264049 263943 264236 264898 266373 268604
56894B68604K658L408M902O706Q638J1293J4874J8711K2318K5543K7056K4311
$$ 268604 271262 274670 279572 286278 294916 306209 321083 339794 362112 387655 414711 439022
56882D39022J6220M816o449j5196k0434k1970k0632j8033j5135j1737p848m318
$$ 439022 455242 460058 453609 438413 417979 396009 375377 357344 342209 330472 322624 318306
56870C18306j431J803O001J0348J4133J8135K3269K9118L5173M2448N1955O1728
$$ 318306 316875 318678 324679 335027 349160 367295 390564 419682 454855 497303 549258 610986
56858F10986O6757O2210M6492K2135n202k9080m5164n2598n2981m8709m2235l5510
$$ 610986 677743 739953 786445 808580 803378 774298 729134 676536 623555 574846 532611 497101
56846D97101k9097k2279j4622o775O21P858J5453K3432L1904M1564N3096O6902
$$ 497101 468004 445725 431103 424328 424949 432807 448260 471692 503596 545160 598256 665158
56834F65158Q3237J00620J13049J11066Q8361M7704l06m3873p5277r2063r6033
$$ 665158 748395 849015 962064 1073130 1161491 1209195 1208889 1165016 1089739 997676 901643
56823I01643r1410q2342p1228n9261m7579l6959k7136j7593q631p55O524J4222
$$ 901643 810233 727891 656663 597402 549823 512864 485728 468135 459504 458749 465273 479495
56811D79495K2731L2037M2767N5693O9736Q0808Q2769P0386M3066O763k8662n5213
$$ 479495 502226 534263 577030 632723 702459 783267 866036 936422 979488 986251 957589 902376
56799I02376p0273p5226p2550o5012n5706m6780l8449l0301k2784j6443j0650
$$ 902376 832103 756877 684327 619315 563609 516829 478380 448079 425295 408852 398202
56788C98202m534J561O817J1538J6766K2879K9714L7142M3895M6391M0711K6175
$$ 398202 393668 395229 402046 413584 430350 453229 482943 520085 563980 610371 651082 677257
56776F77257O176j4255l0912m1324m5221m4390m1195l6945l2095k7339k3415k0240
$$ 677257 683433 669178 638266 596942 551721 507331 466136 429191 397096 369757 346342 326102
56764C26102j7318j4697j2656j0848q820o984n999n534m745l720l323l782m386
$$ 326102 308784 294087 281431 270583 261763 254779 248780 243246 238501 234781 231458 227676 223290
56751B23290m509m086l273k343j743j591j464j189j240j767k077j773j532j885
$$ 223290 218781 214695 211422 209079 207336 205745 204281 203092 201852 200085 198008 196235 194703 192818
56737A92818k186j814j368j466j438n90J87k79j428j918j817k018k139j078O42
$$ 192818 190632 188818 187450 185984 184546 183956 184143 183864 182436 180518 178701 176683 174544 173466 174108
56722A74108J165M5j202j457j244j310j402r97j27Q09J310Q80l39j307j311j022
$$ 174108 175273 175318 174116 172659 171415 170105 168703 167706 167579 168388 169698 170578 170239 168932 167621 166599
56706A66599j294j588r10K72O38J37q6L62P66P23M74qp57r19L40K178K905K338
$$ 166599 165305 163717 162807 163079 163717 163854 163768 164130 164896 165619 166093 166085 165328 164409 164749 166927 169832 172170
56688A72170J743J587J093J04l79J08P96J028J033J089J088J073J120P81k57j206
$$ 172170 173913 175500 176593 176697 176318 176426 177222 178250 179283 180372 181460 182533 183653 184434 184177 182971
56672A82971j147n37m23n91k06K44m51j845k232j384q30j193j348o95k44p32j393
$$ 182971 181824 181287 180864 180273 180067 180311 179860 178015 175783 174399 173569 172376 171028 170333 170089 169357 167964
56655A67964j389r77o57m55n38j266k228k511k093j691j270k75P33M93p07j223
$$ 167964 166575 165598 164941 164486 163948 162682 160454 157943 155850 154159 152889 152614 153347 153840 153133 151910
56639A51910o80m18q50o29Q26J987J554L56j79L2L74P76J254J346R39O24O15L40
$$ 151910 151230 150812 149962 149333 150159 152146 153700 154056 153877 153909 154283 155059 156313 157659 158598 159222 159837 160177
56621A60177l08n11Q4P58R45R84J074P73ro23p20o11l49K89Q41N51j53j28M16
$$ 160177 159869 159358 159442 160200 161145 162129 163203 163976 163967 163344 162624 162013 161664 161953 162794 163345 163192 163064 163480
56602A63480J10j164j912j430n92J12J281K673K786J311N0L49J324J672J492J244
$$ 163480 163590 162426 160514 159084 158492 158604 159885 162558 165344 166655 166705 167054 168378 170050 171542 172786
56586A72786O39l55q03k10P15J475K444L468L475K368J555J729J820J110N15P69
$$ 172786 173425 173070 172267 172057 172772 174247 176691 180159 183634 186002 187557 189286 191106 192216 192731 193500
56570A93500J134J093J425K442K990K519K359L456M599M485L841L850M024L428
$$ 193500 194634 195727 197152 199594 202584 205103 207462 210918 215517 220002 223843 227693 231717 235145
56556B35145K654K806L572L911L749L495K895J710N96J21j54n89o76l52p49k466
$$ 235145 237799 240605 244177 248088 251837 255332 258227 259937 260533 260654 260500 259911 259235 258883 258134 255668
56540B55668m311m946m598m104l577l124l370m161m117k730j393j215j370r48
$$ 255668 251357 246411 241813 237709 234132 231008 227638 223477 219360 216630 215237 214022 212652 211704
56526B11704o39j186j775j579j388j982k458j901j198j431j842j290l77k75o16
$$ 211704 211065 209879 208104 206525 205137 203155 200697 198796 197598 196167 194325 193035 192658 192383 191767
56511A91767m55j45l91o15q6L94k15j233j351p54l41JO65R48K06n99l77J75r6
$$ 191767 191312 191167 190776 190161 190075 190469 190254 189021 187670 186916 186575 186576 187241 188189 188395 187796 187419 187594 187498
56492A87498o17k19N74M58l46o59m54m70m15M71J691K128J889J955K509L030L357
$$ 187498 186881 186662 187236 187694 187348 186689 186235 185765 185350 185821 187512 189640 191529 193484 195993 199023 202380
56475B02380L314K268M39n06L31J448J155J00j79J65J89L25J413K581K411J354
$$ 202380 205694 207962 208401 207895 208226 209674 210829 210929 210750 210915 211104 211429 212842 215423 217834 219188
56459B19188Q03N64n35k174k889k330j274j3J433K272J979J620K318L276L236
$$ 219188 219991 220555 220020 217846 214957 212627 211353 211340 212773 215045 217024 218644 220962 224238 227474
56444B27474K772L003L208K094M93K25J011J064K01k31r5n44j575j887j229o86
$$ 227474 230246 233249 236457 238551 239044 239269 240280 241344 241545 241314 241219 240675 239100 237213 235984 235298
56428B35298p38r10j190j881k356j830r84j033j600j477q69q81j319j101l91k54
$$ 235298 234560 233650 232460 230579 228223 226393 225409 224376 222776 221299 220430 219549 218230 217129 216738 216484
56412B16484n56k92M52P60P03R52J138N88NM37J204R68J61R5M22j68j280j266
$$ 216484 215928 215636 216088 216848 217551 218503 219641 220229 220234 220671 221875 222843 223004 223099 223521 223353 222073 220807
56394B20807P0J488K533L478L674K346O18L95J543K405K554K755K809J950Q69
$$ 220807 220877 222365 224898 228376 232050 234396 235014 235409 236952 239357 241911 244666 247475 249425 250294
56379B50294Q99J650J747J390J710K289J837P85N67R19N67j04J63P49J60q49k97
$$ 250294 251193 252843 254590 255980 257690 259979 261816 262601 263168 264087 264654 264550 264713 265462 265622 264773 264476
56362B64476J412K084J566J635K376K138J075J167K489K937K057J841L053M036
$$ 264476 265888 267972 269538 271173 273549 275687 276762 277929 280418 283355 285412 287253 290306 294342
56348B94342L911L875M560M915M630M969O330P450P707P946Q451Q439P998Q161
$$ 294342 298253 302128 306688 311603 316233 321202 327532 334982 342689 350635 359086 367525 375523 383684
56334C83684Q698Q155O429M997M378L644K528J753J285M90k13k23o23k560m519
$$ 383684 392382 400537 406966 411963 416341 419985 422513 424266 425551 426041 425828 425605 424982 422422 417903
56319D17903m288k873k961m130l524j044K74o71j709j568j455j723r45Q40J646
$$ 417903 413615 410742 407781 403651 400127 399083 399357 398686 396977 395409 393954 392231 391286 392126 393772
56304C93772J273J814L571M188K948K196L226M389M574N018O208O561N703N750
$$ 393772 395045 396859 400430 404618 407566 409762 412988 417377 421951 426969 433177 439738 445441 451191
56290D51191P661R583J0284J1066J2702J3710J3379J3486J5203J7117J7982J8764
$$ 451191 458852 468435 478719 489785 502487 516197 529576 543062 558265 575382 593364 612128
56278F12128K0395K2089K3361K5158K7807L0325L2762L6601M1909M6942N1390
$$ 612128 632523 654612 677973 703131 730938 761263 794025 830626 872535 919477 970867
56267I70867N7045O4390P1722P8550Q6491R5756J04181J10997J18078J26131J33007
$$ 970867 1027912 1092302 1164024 1242574 1329065 1424821 1529002 1639999 1758077 1884208 2017215
56256B017215J37161J39452J40186J37788J31786J23721J13789J00060Q2444O3915
$$ 2017215 2154376 2293828 2434014 2571802 2703588 2827309 2941098 3041158 3123602 3187517
56246C187517M6467K9474J3324N82q193j5788k3624k9575l2449l4607l7936m1167
$$ 3187517 3233984 3263458 3276782 3277364 3269171 3253383 3229759 3200184 3167735 3133128 3095192 3054025
56234C054025m3638m7852n5500o4410p2164p9530q7761r5606j01648j06659j11256
$$ 3054025 3010387 2962535 2907035 2842625 2770461 2690931 2603170 2507564 2405916 2299257 2188001
56223B188001j14004j14008j12513j10061j05262r8199r1720q7258q2774p6767
$$ 2188001 2073997 1959989 1847476 1737415 1632153 1533954 1442234 1354976 1272202 1195435
56213A195435p0808o5997o0601n3529m6601m1116l5700k9724k5057k2203j8518
$$ 1195435 1124627 1058630 998029 944500 897899 856783 821083 791359 766302 744099 725581
56202G25581j2779p686n268l716j383P4n52j071K65J672J595J854M033O303O820
$$ 725581 712802 705116 699848 696132 694749 694823 694271 693200 693465 695137 696732 698586 702619 708922 715742
56187G15742O790P358P066N204L898M060L204J00k456k527k433m085n288m159
$$ 715742 722532 729890 736956 742160 746058 750118 753322 753422 750966 748439 746006 741921 736633 732474
56173G32474k928l674m345k842j063j010q71J253L538M129M746O878Q398P759
$$ 732474 729546 725872 721527 718685 717622 716612 715741 716994 720532 724661 729407 736285 744683 752442
56159G52442P420R277J0921J0380J0208J2665J5301J5744J6451J9999K4114K6239
$$ 752442 759862 769139 780060 790440 800648 813313 828614 844358 860809 880808 904922 931161
56147I31161K8767L4595M1727M7522N4344O5528P9577R3806J10155J31717J56621
$$ 931161 959928 994523 1036250 1083772 1138116 1203644 1283221 1377027 1487182 1618899 1775520
56136A775520J80357K00749K15613K19431K08257J85397J57641J29245J03784
$$ 1775520 1955877 2156626 2372239 2591670 2799927 2985324 3142965 3272210 3375994
56127C375994Q6950Q1166Q0593P6951O7299N1973L0157L644j9525l2258l6501
$$ 3375994 3462944 3544110 3624703 3701654 3768953 3820926 3851083 3854727 3835202 3802944 3766443
56116C766443l8936m2818m9882o5213r2277j25868j56771j80806j97567k04418
$$ 3766443 3727507 3684689 3634807 3569594 3477317 3351449 3194678 3013872 2816305 2611887
56106B611887j99066j85304j69215j52013j32366j12631r6250q2061o7506n4449
$$ 2611887 2412821 2227517 2058302 1906289 1773923 1661292 1565042 1482981 1415475 1361026
56096A361026m5741l9303l1883k5146k1858j9699j5302j0697r136q485n426k146
$$ 1361026 1315285 1275982 1244099 1218953 1197095 1177396 1162094 1151397 1142261 1133776 1128350 1126204
56084A126204j999k647n72J949J488O01K900N675N158M290P173J0664J0015Q071
$$ 1126204 1124205 1121558 1120986 1122935 1124423 1125024 1127924 1133599 1138757 1143047 1150220 1160884 1170899 1178970
56070A178970R925J3226J3017J1494J3353J6033J4511J1466J2520J5516J4902
$$ 1178970 1188895 1202121 1215138 1226632 1239985 1256018 1270529 1281995 1294515 1310031 1324933
56059A324933J2689J4431J8225J8435J6652J8135K1072K0376J8464K1038K5768
$$ 1324933 1337622 1352053 1370278 1388713 1405365 1423500 1444572 1464948 1483412 1504450 1530218
56048A530218K6427K4680K6342K9674K9175K7170K9477L3272L1732K7142K6555
$$ 1530218 1556645 1581325 1607667 1637341 1666516 1693686 1723163 1756435 1788167 1815309 1841864
56037A841864K8162K5091J9341J8369K1171K1453K1286K7429L7150M2069M3226
$$ 1841864 1870026 1895117 1914458 1932827 1953998 1975451 1996737 2024166 2061316 2103385 2146611
56026B146611M7933N4694N6194N4255N6680O2019O2793O0864O3895O9628O9886
$$ 2146611 2194544 2249238 2305432 2359687 2416367 2478386 2541179 2602043 2665938 2735566 2805452
56015B805452O7038O9879P6402P7849P6511Q1626R0893R4489R4243R9756J08891
$$ 2805452 2872490 2942369 3018771 3096620 3173131 3254757 3345650 3440139 3534382 3634138 3743029
56004C743029J11843J11276J17756J28499J32059J30914J37077J48516J53190
$$ 3743029 3854872 3966148 4083904 4212403 4344462 4475376 4612453 4760969 4914159
55995D914159J53393J61746J75888J82545J84193J95249K14210K26988K35525
$$ 4914159 5067552 5229298 5405186 5587731 5771924 5967173 6181383 6408371 6643896
55986F643896K54347K80922K99577L12900L37868L72613M00084M22917M59778
$$ 6643896 6898243 7179165 7478742 7791642 8129510 8502123 8902207 9325124 9784902
55977I784902N08743N51009N89515O44917P14793P78605Q41682R29580J040024
$$ 9784902 10293645 10844654 11434169 12079086 12793879 13572484 14414166 15343746 16383770
55968A6383770J148644J261605J410682J597430J799515K032390K342696K741179
$$ 16383770 17532414 18794019 20204701 21802131 23601646 25634036 27976732 30717911
55960C0717911L211753L788072M544611N510458O675347Q077065R784464J1807138
$$ 30717911 33929664 37717736 42262347 47772805 54448152 62525217 72309681 84116819
55952H4116819J4155604J6993387K0588925K5151682L0909436L8148625M6421754
$$ 84116819 98272423 115265810 135854735 161006417 191915853 230064478 276486232
55945B76486232N3222950N4038463M4963820K6058397K087480k0296266l6310446
$$ 276486232 329709182 383747645 428711465 454769862 456857342 436561076 400250630
55938D00250630m4660750m6627646m4390392l9969427l4825279k9765513k5096484
$$ 400250630 355589880 308962234 264571842 224602415 189777136 160011623 134915139
55931A34915139k0923962j7323038j4304769j1794824r717761q038784o705398
$$ 134915139 113991177 96668139 82363370 70568546 60850785 52812001 46106603
55924D6106603n626035m733800m011382l435450k954270k536838k190531j913162
$$ 46106603 40480568 35746768 31735386 28299936 25345666 22808828 20618297 18705135
55916A8705135j674669j459371j280981j141950j018999r00919q01889p26050
$$ 18705135 17030466 15571095 14290114 13148164 12129165 11228246 10426357 9700307
55908I700307o55490n83695n25981m86504m47948m03512l67509l44850l20578
$$ 9700307 9044817 8461122 7935141 7448637 7000689 6597177 6229668 5884818 5564240
55899E564240k88991k63963k50882k36135k13706j95735j87470j77208j60099
$$ 5564240 5275249 5011286 4760404 4524269 4310563 4114828 3927358 3750150 3590051
55890C590051j47598j44252j38554j25664j16583j16056j13125j02471r4056r2761
$$ 3590051 3442453 3298201 3159647 3033983 2917400 2801344 2688219 2585748 2491692 2398931
55880B398931q8808p7405o8432o7546o6121n8761n3131n3627n2414m5354m0593
$$ 2398931 2310123 2232718 2164286 2096740 2030619 1971858 1918727 1865100 1812686 1767332 1726739
55869A726739m2800m4365m0392l7250l8438l6751k8501k1328k0045j8341j1977
$$ 1726739 1683939 1639574 1599182 1561932 1523494 1486743 1458242 1436914 1416869 1398528 1386551
55858A386551o879o704n530k82K089k787q783j0712j2040j5047j5388j2888j5819
$$ 1386551 1379672 1372968 1367438 1367156 1369245 1366458 1357675 1346963 1334923 1319876 1304488 1291600 1275781
55845A275781k7498l9799m6271n0515n5430n5968m9628m3085m1040l8752l2449
$$ 1275781 1248283 1208484 1162213 1111698 1056268 1000300 950672 907587 866547 827795 795346
55834G95346k7026k6341k5723k1148j6614j5576j3979q573l532k363j568J553
$$ 795346 768320 741979 716256 695108 678494 662918 648939 640366 636834 634471 632903 634456
55822F34456L050L67k046j014n03l396n566l979k793n465q439q388q255j0480
$$ 634456 637506 637873 635827 634813 634310 630914 625348 621369 618576 613111 604672 596284 588029 577549
55808E77549j1711r837q782j0867j1745q534n526o243p135m938l137n132p802
$$ 577549 565838 556001 547219 536352 524607 516073 510547 504304 497169 492231 489094 483962 476160
55795D76160p821p857j0692j3349j2756j1269j1324j0598p546n527o429o383k821
$$ 476160 468339 460482 449790 436441 423685 412416 401092 390494 382948 377421 370992 364609 361788
55782C61788O38J176J882M580M506j727r292j2453j2864j4459j5846j4284j1989
$$ 361788 362426 363602 365484 370064 374570 372843 363551 351098 338234 323775 307929 293645 281656
55769B81656j2029j2428j0276p441o639o178l876j863k402l206j835l61r39j269
$$ 281656 269627 257199 246923 239482 232843 226665 222789 220926 218524 215318 213483 213122 212183 210914
55755B10914P95K782K482K501N137P436O305L859K798J269k638o075o341n938
$$ 210914 211709 214491 216973 219474 224611 232047 238352 242211 245009 246278 243640 237565 231224 225286
55741B25286p525q507o113l206l429m800l947k439l123m129k570n08j200k852
$$ 225286 217761 209254 203141 199935 196506 191706 187759 185320 182197 178068 175498 174990 173790 170938
55727A70938k038k82j181l747m366l024k255k009p68M78N8o62K54J535J457J596
$$ 170938 168900 168618 167437 163690 159324 156300 154045 152036 151268 151746 151804 151142 151396 152931 154388 155984
55711A55984L670N561M917L747M933P052P156N936N545N061K662l36j941l308
$$ 155984 159654 165215 170132 173879 178812 185864 193020 198956 204501 209562 212224 211888 209947 206639
55697B06639n925p855p078n544n578n350k527Q02J681J742M117P726R654J0506
$$ 206639 200714 192859 185781 180237 174659 169309 166782 167584 169265 171007 175124 182850 192504 203010
55683B03010J2261J3426J1579Q432P208P102N341K593J273N86j660m264m638l742
$$ 203010 215271 228697 240276 248708 255916 263018 268359 270952 272225 272811 271151 266887 262249 258507
55669B58507m106m904l941k649l897o618p699p652r129j1336j1219r212q555r660
$$ 258507 254401 249497 245556 242907 239010 232392 224693 217041 207912 196576 185357 176145 167590 157930
55655A57930j0017q995q182p571n856l817l232l284k066n63r78k288j843k38j44
$$ 157930 147913 138918 130736 123165 117309 113492 110260 106976 104910 104347 103369 101081 99238 99000 98856
55640I8856j347j451o15j054k520k713j712j667k563k421j300j067j577j024L64
$$ 98856 97509 96058 95443 94389 91869 89156 87444 85777 83214 80793 79493 78426 76849 75825 76189
55625G6189O71j05m10m50j498k727k357j155j136j705q74O52N64p40r63k71p41
$$ 76189 76860 76755 76345 75895 74397 71670 69313 68158 67022 65317 64443 65095 65659 64919 63956 63685 62944
55608F2944k129k236j012l46l32L72J041k03k423k772j099J39K03N33J248J047
$$ 62944 60815 58579 57567 57221 56889 57261 58302 58099 55676 52904 51805 51944 52147 52680 53928 54975
55592E4975K46K91O11l80j738j223M99Q54n2R5J195R05p98j443n64k21q90q76
$$ 54975 55221 55512 56123 55743 54005 52782 53281 54135 54083 54178 55373 56278 55480 54037 53473 53252 52362 51486
55574E1486k2q0j053j017R5K93o06o33M30N92n25r80q6P84J248K276L239K269
$$ 51486 51464 51384 50331 49314 49409 49702 49096 48463 48893 49485 48960 47980 47894 48678 49926 52202 55441 57710
55556E7710n5r50J71J111R70J228K229K386J562J615K786L054J948J545K678L526
$$ 57710 57655 56705 56876 57987 58957 60185 62414 64800 66362 67977 70763 73817 75765 77310 79988 83514
55540H3514L045K626L157L448K693J798J284M12p56j090p21j154k493l196k912
$$ 83514 86559 89185 92342 95790 98483 100281 101565 101977 101221 100131 99410 98256 95763 92567 89655
55525H9655k925l436l261k527k771l966m362l691l581m369m490l540k926k959
$$ 89655 86730 83294 80033 77506 74735 70769 66407 62716 59135 54766 50276 46736 43810 40851
55511D0851k264o29M08L49K24Q2j037k361j889n7M64q06j397k60N98j29j038r72
$$ 40851 38587 37958 38366 38715 38939 39021 37984 35623 33734 33677 34141 33335 31938 31678 32276 32147 31109 30137
55493C0137q13j102q13K67O85n9o39n56q44j434q24Q08J227j30j154q45p51j518
$$ 30137 29324 28222 27409 27676 28361 28302 27663 27107 26263 24829 24005 24813 26040 25910 24756 23911 23160 21642
55475B1642j347N27J945J237k45p76p16p99m57M21N47m32r21j28N66L38L64J192
$$ 21642 20295 20822 22767 24004 23759 22983 22267 21468 21011 21432 21979 21547 20626 20498 21064 21402 21766 22958
55457B2958J293j17j303q96j40m53r45k87Q72J187O97J13m10o12O8J010O32r79
$$ 22958 24251 24134 22831 21935 21795 21342 20397 20110 20982 22169 22866 22979 22569 21957 22025 23035 23667 22688
55439B2688j739p69L11L14J92O92Q07N5j84P74J349M02o85m36K92J46l24N6R58
$$ 22688 20949 20180 20491 20805 20997 21689 22496 22551 22367 23141 24490 24892 24207 23771 24063 24209 23885 23941 24899
55420B4899J443J507J362O00o02r57M3J204J479J218P61k61j381j160L56J220
$$ 24899 26342 27849 29211 29811 29209 28252 28295 29499 30978 32196 32957 32696 31315 30155 30511 31731
55404C1731O31J87R32J543Q39k13n34p71j518j854j274j017j762k092j002R3k84
$$ 31731 32362 32549 33481 35024 35863 35650 35116 34345 32827 30973 29699 28682 26920 24828 23826 23919 23635
55387B3635j215j181n54m05m83k38l14j221j930j465n04O7P00J758K194J291K48
$$ 23635 22420 21239 20685 20280 19797 19559 19245 18024 16094 14629 14125 14192 14892 16650 18844 20135 20383
55370B0383L20Q58P24K28J58K05q2j79K18K49m99r42l63K71J05q4M43Q97N43J53
$$ 20383 20703 21561 22285 22513 22671 22876 22794 22615 22833 23082 22583 21641 21278 21549 21654 21570 22013 22910 23453 23606
55350B3606L76L97l39p60p0O99N72K98N91N37n22j334p91O1l5l78L2L31n46j658
$$ 23606 23982 24379 24040 23280 23210 23909 24481 24779 25370 25907 25385 24051 23260 23321 23286 22908 22940 23271 22725 21067
55330B1067j597q94q11j031n93J00K00J80O83R35J78n40OR84R30K41K20O66N77
$$ 21067 19470 18576 17765 16734 16141 16241 16441 16621 17304 18239 18417 17877 17883 18867 19797 20038 20258 20924 21501
55311B1501J97L94P93N37O5K70O98L72l42m88l00n62j032j083j020j200q89L65
$$ 21501 21698 22092 22885 23422 23487 23757 24455 24827 24485 23997 23697 23135 22103 21020 20000 18800 17911 18276
55293A8276J362R99K24M03Q87K58j015j361p40l40l42j8M73L80RK34P58N97j30
$$ 18276 19638 20637 20861 21264 22151 22409 21394 20033 19293 18953 18611 18593 19066 19446 19455 19689 20447 21044 20914
55274B0914m84m03m77n27O3R41J160O13r7o94j075q24lM60K18L10J334K066J337
$$ 20914 20430 20027 19550 19023 19086 20027 21187 21800 21703 21009 19934 19110 19107 19567 19785 20095 21429 23495 24832
55255B4832K5m09k32n21j062j015o77p61p88j6Q23O23j39k67P0k6k28L70J326
$$ 24832 24857 24448 24216 23695 22633 21618 20941 20180 19392 19376 20199 20822 20683 20416 20486 20460 20232 20602 21928
55236B1928J390N27k37m81l66L21J504J972R07n00n57M86J115Q75M04r1o70p52
$$ 21928 23318 23845 23608 23127 22761 23082 24586 26558 27465 26965 26408 26894 28009 28884 29288 29197 28527 27775
55218B7775k1N41J59k08M86J284P86k56q6J066J386L64q34j396j384p23M34R37
$$ 27775 27754 28295 28454 28246 28732 30016 30802 30546 30460 31526 32912 33276 32442 31046 29662 28939 29373 30310
55200C0310O8r28n11O81J001N31M60N75k48j540j690o75j5k00k74J62N15O18P24
$$ 30310 30378 29450 28939 29620 30621 31152 31612 32187 31939 30399 28709 28034 28019 27819 27545 27707 28222 28840 29564
55181B9564L97p28j533p80P14J241R47J178J735J286J35j23M46K10r51j328l85
$$ 29564 29961 29233 27700 26920 27634 28875 29822 31000 32735 34021 34156 34033 34479 34689 33738 32410 32025
55164C2025M28L30K73P70R63N10L65R37J355J207J226J703J860J399J133J540
$$ 32025 32453 32783 33056 33826 34789 35299 35664 36601 37956 39163 40389 42092 43952 45351 46484 48024
55148D8024K110K493K916L256L125K980L749N201O210O594P167Q037Q455Q327
$$ 48024 50134 52627 55543 58799 61924 64904 68653 73854 80064 86658 93825 101862 110317 118644
55134A18644Q191P735O140L795J882K94k065m921o631o742o504o614o439n831
$$ 118644 126835 134570 140710 144505 146387 146681 144616 139695 133064 126322 119818 113204 106765 100934
55120A00934n702o220o272n282l943k753j467l67l50j272j830j519j172j208r94
$$ 100934 95232 89012 82740 77458 73515 70762 69295 68928 68578 67306 65476 63957 62785 61577 60583
55105F0583k94K52M13O94J042Q71M25N86J152J030K75O7O05Q82P63J200K124K272
$$ 60583 60289 60541 60954 61648 62690 63561 63986 64572 65724 66754 67029 67096 67701 68583 69346 70546 72670 74942
55087G4942J504J247J954K331J678J011R95Q32O0l74J23P63R95J492K563L255
$$ 74942 76446 77693 79647 81978 83656 84667 85662 86494 86554 86180 86303 87066 88061 89553 92116 95371
55071I5371L036K823L339L876L638K968K380J692R17O75R78R08K23j1R24K380
$$ 95371 98407 101230 104569 108445 112083 115051 117431 119123 120040 120715 121693 122601 122824 122813 123737 126117
55055A26117L545M409M975M920M529M544M731M061K604J531R33l65k351l386k983
$$ 126117 129662 134071 139046 143966 148495 153039 157770 161831 164435 165966 166899 166534 164183 160797 157814
55040A57814k766l642m184l218j912j698j934j381n29o15j512k271k826l621m284
$$ 157814 155048 151406 147222 144004 142092 140394 138460 137079 136550 135935 134423 132152 129326 125705 121421
55025A21421m202l745l765m291m673m442l455j885n92n34j376j735j245j017j590
$$ 121421 117219 113474 109709 105418 100745 96303 92848 90963 90371 89837 88461 86726 85481 84464 82874
55010H2874k010j640j278j551j775j415j195j630j953j578j187j202o73Q65J991
$$ 82874 80864 79224 77946 76395 74620 73205 72010 70380 68427 66849 65662 64460 63787 64652 66643
54995F6643J421K08J85J287K065J996J636J244Q24R90K191L521L679K799K149
$$ 66643 68064 68272 68457 69744 71809 73805 75441 76685 77509 78499 80690 84211 87890 90689 92838
54980I2838K331K912L527M232N032N863O898Q166R273J0038J0972J2506J4332
$$ 92838 95169 98081 101608 105840 110872 116735 123633 131799 141072 151110 162082 174588 188920
54967A88920J5873J6863J7077J6290J4961J4024J3579J2705J0919Q642N771J291
$$ 188920 204793 221656 238733 255023 269984 284008 297587 310292 321211 329853 335624 336915
54955C36915m843j0823j5002j7677j9815k1182k0960j9249j6872j4358j2109j0728
$$ 336915 332072 321249 306247 288570 268755 247573 226613 207364 190492 176134 164025 153297
54943A53297j0202r570q211o653n443m313l181k728l059l012j888o16r8L07J363
$$ 153297 143095 133525 125314 118661 113218 108905 105724 102996 99937 96925 95037 94421 94323 94630 95993
54928I5993K345K389K285L284N071O545P781R486J1290J2292J2794J3709J4656
$$ 95993 98338 100727 103012 106296 111367 117912 125693 135179 146469 158761 171555 185264 199920
54915A99920J4242J2005Q555M122j382o980j0923j2673j3316j3870j4206j3812
$$ 199920 214162 226167 234722 238844 237462 230482 219559 206886 193570 179700 165494 151682
54903A51682j2661j1055r316p773o513n312m212l773m214m708m270k940j457k31
$$ 151682 139021 127966 118650 110877 104364 99052 94840 91067 86853 82145 77875 74935 73478 73247
54889G3247O05O78j81j271j676j351q90n34r9L99O87N95O3r17j996k604k646k510
$$ 73247 73852 74530 74349 73078 71402 70051 69161 68627 68528 68927 69614 70209 70272 69355 67359 64755 62109 59599
54871E9599k211j358k65J9p55j454j263q24r63j298j100m97K2M76Q16N09l69o55
$$ 59599 57388 56030 55765 55784 55029 53575 52312 51488 50525 49227 48127 47630 47652 48128 48944 49453 49084 48429
54853D8429J83R22L78o39n79M70J186J127R18P42J59o96j101q94o42o37n71j49
$$ 48429 48612 49534 49912 49273 48694 49164 50350 51477 52395 53137 53296 52600 51499 50605 49963 49326 48755 48606
54835D8606O34J605K349K407J935J626J627J342P17O04J221J538J088J011K175
$$ 48606 49240 50845 53194 55601 57536 59162 60789 62131 62848 63452 64673 66211 67299 68310 70485
54820G0485L500L639L187L601M785N483N511N857O925Q221R637J1548J3746J5400
$$ 70485 73985 77624 80811 84412 89197 94680 100191 106048 112973 121194 130831 142379 156125 171525
54806A71525J6086J5906J4865J2972J0582P777L928j248o676j0859j3275j4133
$$ 171525 187611 203517 218382 231354 241936 249713 253641 252393 245717 234858 221583 207450
54794B07450j3566j2004j0478r544q652p505o868o980o508m588k636k359l047
$$ 207450 193884 181880 171402 161858 153206 145701 138833 131853 125345 120757 118121 115762 112715
54781A12715k778j420l19L07J419K983L894M014M261M736M695M420N275P563J0073
$$ 112715 109937 108517 108198 108505 109924 112907 116801 120815 125076 129812 134507 138927 144202 151765 161838
54766A61838J1946J3470J4801J5451J5345J5034J4483J2887R900O056J890k346
$$ 161838 173784 187254 202055 217506 232851 247885 262368 275255 285155 291211 293101 290755
54754B90755o152r105j1559j3891j5412j5318j4310j3805j3774j3009j1342r859
$$ 290755 284603 275498 263939 250048 234636 219318 205008 191203 177429 164420 153078 143219
54742A43219q925p751o144n005m712m472l714k802k086j464j102j345j806j720
$$ 143219 134294 126543 120399 115394 110682 106210 102496 99694 97608 96144 95042 93697 91891 90171
54728I0171j306j427j971j980j427j245j498j187k37P4p85j586j169MQ51J049
$$ 90171 88865 87438 85467 83487 82060 80815 79317 78130 77893 77967 77182 75596 74427 74431 75282 76331
54712G6331Q30L62o5o5K32L68M51R07J418J229N54L67P33P34K42K39R77J392Q30
$$ 76331 77161 77523 77458 77393 77625 77993 78444 79351 80769 81998 82552 82919 83652 84386 84628 84867 85844 87236 88066
54693H8066j2m91r00j325j015K77J518J767J331Q38K67l62l39P14J978K426K091
$$ 88066 88054 87563 86663 85338 84323 84600 86118 87885 89216 90054 90321 89959 89620 90334 92312 94738 96829
54676I6829J701J676K047K762L536L930L928L930L978L710L150K780K655K409
$$ 96829 98530 100206 102253 105015 108551 112481 116409 120339 124317 128027 131177 133957 136612 139021
54662A39021K185K610L555M022L601K994K732K523K221K388L269M218M773N260
$$ 139021 141206 143816 147371 151393 154994 157988 160720 163243 165464 167852 171121 175339 180112 185372
54648A85372N842N948N272M430L924L286J901r7k407n123q015r981j0158r101
$$ 185372 191214 197162 202434 206864 210788 214074 215975 215878 213471 208348 200333 190352 180194 171093
54634A71093q147p864p841p554o907o074n235m405l431k345j594j485j595j271
$$ 171093 162946 155082 147241 139687 132780 126706 121471 117066 113635 111290 109696 108211 106616 105345
54620A05345n95j51j1K51O52Q37R31J441K259K738K686K421J853O63p07j400j495
$$ 105345 104750 104599 104588 104839 105491 106328 107259 108700 110959 113697 116383 118804 120657 121320 120613 119213 117718
54603A17718j815k330k170j378j144j871k472k238j936k380l080l188k687j915
$$ 117718 115903 113573 111403 110025 108881 107010 104538 102300 100364 97984 94904 91716 89029 87114
54589H7114q45K88N97l99j920k789k606j662m72K49L0n78m61M53R72M05n65j147
$$ 87114 86269 86557 87154 86755 84835 82046 79440 77778 77306 77555 77585 77007 76546 76999 77971 78376 77811 76664
54571G6664j479j763j506m36P94J429J442J030J57q20j046l74L12M12L95O83R16
$$ 76664 75185 73422 71916 71480 72274 73703 75145 76175 76332 75512 74466 74092 74404 74816 75211 75894 76810
54554G6810Q92J125J710J812J113O57J223J973J814J213J380K361L129L146K735
$$ 76810 77702 78827 80537 82349 83462 84119 85342 87315 89129 90342 91722 94083 97212 100358 103093
54539A03093K335K279K876L921M482L954K859J965J203J45r98j759k318l149m101
$$ 103093 105428 107707 110583 114504 118986 122940 125799 127764 128967 129112 128114 126355 124037 120888 116787
54524A16787m611m571m330m008l425k548j663j153j268j753j763p69M58O17l01
$$ 116787 112176 107605 103275 99267 95842 93294 91631 90478 89210 87457 85694 84925 85383 86000 85699
54509H5699r66p12l55n38o16P9R51J096O82M14L70L20M41Q71J111P58K62K05L33
$$ 85699 84733 84021 83666 83128 82512 82591 83542 84638 85320 85734 86104 86424 86865 87736 88847 89605 89867 90072 90405
54490I0405R1m30p69p99n54J00R69J333Q54P8m66r67j565j778j332p66m86p5O95
$$ 90405 90496 90066 89297 88498 87944 88044 89013 90346 91200 91278 90812 89845 88280 86502 85170 84404 83918 83843 84538
54471H4538J089N96n0k2K02k19q64o93K06P46N21J80K48N29P40Q83R44Q01L88
$$ 84538 85627 86223 86173 86151 86353 86134 85270 84577 84783 85529 86050 86230 86478 87007 87747 88630 89574 90375 90763
54452I0763k81j110j677j464o27ro6l79m92m26j16P24J682J639L47r41j084m44
$$ 90763 90482 89372 87695 86231 85604 85595 85529 85150 84658 84232 84116 84840 86522 88161 88508 87567 86483 86039
54434H6039N0J62k6o72j426j182L74J902K157J589J141N84n49j446j025J92Q70
$$ 86039 86089 86251 86225 85553 84127 82945 83319 85221 87378 88967 90108 90692 90143 88697 87672 87864 88734
54417H8734R09J162J600J462R53J142K131K852K776K481K440K453K476K867L561
$$ 88734 89643 90805 92405 93867 94820 95962 98093 100945 103721 106202 108642 111095 113571 116438 119999
54402A19999L893L549K972K713K940L506L921L487K091N95k50p68j566k309k336
$$ 119999 123892 127441 130413 133126 136066 139572 143493 146980 149071 149666 149416 148648 147082 144773 142437
54387A42437j959k057k591k730k281j931k084k453k783l099l179k668j796j219
$$ 142437 140478 138421 135830 133100 130819 128888 126804 124351 121568 118469 115290 112622 110826 109607
54373A09607j155j319j584k082k707l068k895k087o78P76J395J027O06Q21J202
$$ 109607 108452 107133 105549 103467 100760 97692 94797 92710 92032 92808 94203 95230 95836 96657 97859
54358I7859J137R86J206J328R38Q82K023L464L603K540J870K229K685K588K459
$$ 97859 98996 99982 101188 102516 103454 104336 106359 109823 113426 115966 117836 120065 122750 125338 127797
54343A27797K735K991K804K350J809J067K72j93m16q48j473j909k272l011l844
$$ 127797 130532 133523 136327 138677 140486 141553 141825 141632 141216 140368 138895 136986 134714 131703 127859
54328A27859l914l158k581k892l680m179m129l638k886k160j725j506j262j008
$$ 127859 123945 120787 118206 115314 111634 107455 103326 99688 96802 94642 92917 91411 90149 89141
54314H9141q41o48m89q84k082l336l650k956j949j030k25K67K70P4Oj63o74j156
$$ 89141 88300 87652 87163 86279 84197 80861 77211 74255 72306 71276 71051 71318 71588 71662 71668 71505 70831 69675
54296F9675j197j039r45n47K89O97K9q57q15k28k64q55r49m37k20n40o96l64Q3
$$ 69675 68478 67439 66494 65947 66236 66933 66962 66105 65290 65062 64798 63943 62994 62557 62337 61797 61101 60737 60820
54277F0820N07J016J239Q30L86O06R06L55m46j58R52J345P48M31Q28R55M85L82
$$ 60820 61327 62343 63582 64412 64798 65404 66310 66665 66219 66061 67013 68358 69106 69537 70365 71320 71805 72187
54259G2187R38J081L55j68K36P77O89M78O50O78J16m24m05l30o62q62l71L60O38
$$ 72187 73125 74206 74561 74393 74629 75406 76095 76573 77223 77901 78017 77593 77188 76858 76196 75334 74963 75323 75961
54240G5961M63K7p60j599j657q61l19o96j158p67N6L17o6n14p97r43p01J2O24
$$ 75961 76424 76451 75691 74092 72435 71574 71255 70559 69401 68634 68690 69007 68941 68427 67630 66687 65986 65998 66622
54221F6622N75J11j59lM93J251J925J909J090J38k95k21L4K14j9q77j848k051
$$ 66622 67197 67308 67149 67146 67639 68890 70815 72724 73814 73952 73657 73436 73470 73684 73665 72788 70940 68889
54203F8889j414p36m37j60J81M5o48j061o43J01N19N97M79J09k00J71J035J303
$$ 68889 67475 66739 66302 66142 66323 66368 65720 64659 64016 64117 64636 65233 65712 65821 65621 65792 66827 68130
54185F8130O09o6N9L94J72j81J58R99J441J092K68n58r59o86j21Ql04k85L13P33
$$ 68130 68739 68673 68732 69126 69298 69117 69275 70274 71715 72807 73075 72517 71558 70872 70751 70759 70455 70170 70483 71216
54165G1216M90J70L62P25P28M83J97l19r02p60K82J167J037M56L23M18N0n94p55
$$ 71216 71706 71876 72238 72963 73691 74174 74371 74052 73150 72390 72672 73839 74876 75332 75655 76073 76123 75529 74774
54146G4774l57N7K27K59K39L87J080K023K096Q42o42j086p32o17q29o59j05Oo29
$$ 74774 74417 74474 74701 74960 75199 75586 76666 78689 80785 81627 80985 79899 79167 78550 77721 77062 76957 76963 76334
54127G6334j279j237o85l31n37r57q70n1P83P83J98M1M95O05j28r01r98q94j244
$$ 76334 75055 73818 73133 72802 72265 71308 70438 70387 71170 71953 72151 72192 72687 73292 73164 72263 71265 70371 69127
54108F9127j660j454q71n83n75m91m73p53r14n46j44l98r93j065n27j4J66J34
$$ 69127 67467 66013 65142 64559 63984 63493 63020 62267 61353 60807 60663 60265 59272 58207 57680 57666 57832 57966
54090E7966j68q09j285r36J31J185J737J730J229N23K08M52N86Q9m64k09O70J256
$$ 57966 57798 56989 55704 54768 54899 56084 57821 59551 60780 61303 61511 61963 62549 62638 62174 61965 62635 63891
54072F3891J222R75P71N52M57O73Q86O55J35j65k23l52m86l25PJ61K56O43J182
$$ 63891 65113 66088 66859 67411 67868 68541 69427 70082 70217 70052 69829 69477 68991 68666 68673 68834 69090 69733 70915
54053G0915J416J289J054O89J08j93M52J854L052L401L072K516K103K168K791
$$ 70915 72331 73620 74674 75363 75471 75278 75730 77584 80636 84037 87109 89625 91728 93896 96687
54038I6687L475L560L050K580K568K814K879K601K250K382L327M631N342N122
$$ 96687 100162 103722 106772 109352 111920 114734 117613 120214 122464 124846 128173 132804 138146 143268
54024A43268M691M771N106M990M264L227K030Q20J30L53J011J224P35%n42p62
$$ 143268 147959 152730 157836 162826 167090 170317 172347 173167 173297 173650 174661 175885 176620 176620 176078 175316
54008A75316o59l73k96o47j184j598j919k208k308k275k558l231l565k979k000
$$ 175316 174657 174284 173988 173341 172157 170559 168640 166432 164124 161849 159291 156060 152495 149516 147516
53993A47516j541j679j764j503j160r11n67J6P39J308J293M80o40j222j136j075
$$ 147516 145975 144296 142532 141029 139869 138958 138391 138407 139146 140454 141747 142227 141587 140365 139229 138154
53977A38154j321j266n86L2Jj66J52N39K76m12r07j273j831k180j766r81n85m64
$$ 138154 136833 135567 134981 135013 135014 134848 135000 135539 135815 135403 134496 133223 131392 129212 127446 126465 125880 125416
53959A25416q1K71j38j017j209k62J069J908J953J291L84N5O40J374J403J117
$$ 125416 125335 125606 125468 124451 123242 122980 124049 125957 127910 129201 129585 129640 130280 131654 133057 134174
53943A34174J509K565L427L872M420N097N298M986M864N075M777L388J437j51
$$ 134174 135683 138248 141675 145547 149967 155064 160362 165348 170212 175287 180064 183452 184889 184738
53929A84738j013j388j706k250k831k929k420j874j666j323l80P47J473K076L017
$$ 184738 183725 182337 180631 178381 175550 172621 170201 168327 166661 165338 164958 165705 167178 169254 172271
53914A72271L891M106M030M286M551M343M380N503O763O509N124M669N618O085
$$ 172271 176162 180268 184298 188584 193135 197478 201858 207361 214124 220633 225757 230426 236044 242129
53900B42129M792K836J649R75k6j097j610j857k427l034l039k509j922j422j136
$$ 242129 246921 249757 251406 252381 252355 251258 249648 247791 245364 242330 239291 236782 234860 233438 232302
53885B32302j545k759l994m512m579m839n287n519n460n171m507l616l286l942
$$ 232302 230757 227998 224004 219492 214913 210074 204787 199268 193808 188637 184130 180514 177228 173286
53871A73286m719m395l069k088k298l125l513l179k659k477k656k975l367l816
$$ 173286 168567 164172 161103 159015 156717 153592 150079 146900 144241 141764 139108 136133 132766 128950
53857A28950m015l574k689k063j981j898j446j218j769k394j930o06N3o82j827
$$ 128950 124935 121361 118672 116609 114628 112730 111284 110066 108297 105903 103973 103367 103420 102738 100911
53842A00911k133j543p69k36Ok4j58o6K51K57l59j062r86K2J111J231L11n06p6
$$ 100911 98778 97235 96466 96230 96236 96212 96054 95988 96239 96496 96137 95075 94089 94111 95222 96453 96764 96258 96182
53823I6182J213J781R86N6K27Q99P72qj96M13Q64Q45R90J334J089L27K33J144
$$ 96182 97395 99176 100162 100218 100445 101344 102116 102108 101912 102325 103189 104034 105024 106358 107447 107774 108007 109151
53805A09151J895J744J575K269L253L620L587L788M155M472N063N869N814M326
$$ 109151 111046 112790 114365 116634 119887 123507 127094 130882 135037 139509 144572 150441 156255 160581
53791A60581K691K499L401L742K949J884J159N33j3P7Q90J652J721J183L42o33
$$ 160581 163272 165771 169172 172914 175863 177747 178906 179439 179426 179503 180393 182045 183766 184949 185291 184658
53775A84658j322j168l06L33Q0p60j510j891j979j832j610j632j966k178j867
$$ 184658 183336 182168 181862 182195 182275 181515 180005 178114 176135 174303 172693 171061 169095 166917 165050
53760A65050j248r17j068j318j266r06m56j02k1m06j188j897k081j818j527j403
$$ 165050 163802 162885 161817 160499 159233 158327 157871 157769 157748 157342 156154 154257 152176 150358 148831 147428
53744A47428j358j418j672j821j406o62m79j193j937j742q33k32m62j225k036
$$ 147428 146070 144652 142980 141159 139753 139091 138612 137419 135482 133740 132907 132675 132213 130988 128952
53729A28952k572k565j972j132l98K50Q29J078R73J088J774K493K615K433K544
$$ 128952 126380 123815 121843 120711 120313 120563 121392 122470 123443 124531 126305 128798 131413 133846 136390
53714A36390K692K156J028P4l74n03k84L59Q77P03K97N29J203J450J337J767K760
$$ 136390 139082 141238 142266 142340 141966 141463 141179 141538 142415 143118 143415 143944 145147 146597 147934 149701 152461
53697A52461L339L277L488M290M712M016K742J681Q91K64NK4j33l46P4J071J659
$$ 152461 155800 159077 162565 166855 171567 175583 178325 180006 180897 181161 181166 181190 181057 180711 180785 181856 183515
53680A83515J517J527K205K860K950K967L186K842J558M12N45J586K463K852K835
$$ 183515 185032 186559 188764 191624 194574 197541 200727 203569 205127 205539 206084 207670 210133 212985 215820
53665B15820K130Q35N6N24J325J221M88K71O81R18P97Q27J024R67Q20J113J572
$$ 215820 217950 218785 218841 219365 220690 221911 222399 222670 223351 224269 225066 225893 226917 227884 228704 229817 231389
53648B31389J297K06p97j117j065r93p54k53J65J90mj9L13Q05R78M42o07j419
$$ 231389 232686 232892 232095 230978 229913 228920 228166 227913 228078 228268 228264 228245 228558 229363 230341 230783 230176 228757
53630B28757j433p68Q7O78P03K19o0N49J530J575M60m52j51O58Q83P46J052J630
$$ 228757 227324 226556 226643 227321 228024 228243 228183 228732 230262 231837 232297 231845 231694 232352 233235 233981 235033 236663
53612B36663J756J508J525J829K026K261K871L392L117K430K377L056L599L689
$$ 236663 238419 239927 241452 243281 245307 247568 250439 253831 256948 259378 261755 264811 268410 272099
53598B72099L931M604N229N518N762N973N660M806M229M478N041N121M672M289
$$ 272099 276030 280634 285863 291381 297143 303116 308776 313582 317811 322289 327330 332451 337123 341412
53584C41412M457N182O101O674O584O040N479N061M637M222L968L817L519L103
$$ 341412 345869 351051 357152 363826 370410 376450 381929 386990 391627 395849 399817 403634 407153 410256
53570D10256K937L259L857M228L888K744J305K90j30m02o92n41K32Q08K33j285
$$ 410256 413193 416452 420309 424537 428425 431169 432474 432764 432634 432232 431540 430999 431231 432039 432272 430987
53554D30987k614k985k538j776j164j082j574k157k311k055j759j549j393j372
$$ 430987 428373 425388 422850 421074 419910 418828 417254 415097 412786 410731 408972 407423 406030 404658
53540D04658j480j374q50k42K1L4R0R6j50m16k84L05J162K138K839K626J534P15
$$ 404658 403178 401804 400954 400712 400733 400767 400857 400953 400803 400387 400103 400408 401570 403708 406547 409173 410707 411422
53522D11422J201K555L546L744L660L659L701L991M856O039O892P302P745Q487
$$ 411422 412623 415178 418724 422468 426128 429787 433488 437479 442335 448374 455266 462568 470313 478800
53508D78800R401J0454J1683J2812J3556J4132J4801J5194J4956J4747J5598J7345
$$ 478800 488201 498655 510338 523150 536706 550838 565639 580833 595789 610536 626134 643479
53496F43479J8768J9286J9528K0148K1052K2068K3297K4526K5163K5265K5757
$$ 643479 662247 681533 701061 721209 742261 764329 787626 812152 837315 862580 888337
53485H88337K7183K8876K9882L0139L0243L0483L0663L0585L0282K9881K9588
$$ 888337 915520 944396 974278 1004417 1034660 1065143 1095806 1126391 1156673 1186554 1216142
53474A216142K9649L0193L1127L2215L3154L3721L4000L4266L4373L3606L1559
$$ 1216142 1245791 1275984 1307111 1339326 1372480 1406201 1440201 1474467 1508840 1542446 1574005
53463A574005K8872K6541K4725K2947K1227K0183J9885J9518J8417J6953J5899
$$ 1574005 1602877 1629418 1654143 1677090 1698317 1718500 1738385 1757903 1776320 1793273 1809172
53452A809172J5428J5109J4693J4437J4597J4723J3716J0907P010L492Q99j607
$$ 1809172 1824600 1839709 1854402 1868839 1883436 1898159 1911875 1922782 1929792 1933284 1934183 1932576
53440A932576m768q040j0547j2498j4758j7515k0247k2740k5126k7059k7943k8014
$$ 1932576 1927808 1919768 1909221 1896723 1881965 1864450 1844203 1821463 1796337 1769278 1741335 1713321
53428A713321k8327k9487l1081l2468l3368l3638l3230l2592l2366l2511l2239
$$ 1713321 1684994 1655507 1624426 1591958 1558590 1524952 1491722 1459130 1426764 1394253 1362014
53417A362014l1027k9176k7207k5263k3333k1547k0024j8675j7241j5393j2919
$$ 1362014 1330987 1301811 1274604 1249341 1226008 1204461 1184437 1165762 1148521 1133128 1120209
53406A120209j0038p302m860k232Q36L748N923P819J0306J3346J6156J8437K0569
$$ 1120209 1110171 1102869 1098009 1095777 1096613 1100361 1106284 1114103 1124409 1137755 1153911 1172348 1192917
53393A192917K2743K4729K6357K7546K8059K8065K8522L0131L2246L3892L5434
$$ 1192917 1215660 1240389 1266746 1294292 1322351 1350416 1378938 1409069 1441315 1475207 1510641
53382A510641L7948M1210M3885M5706M7881N1025N4259N6857N9316O2040O4344
$$ 1510641 1548589 1589799 1633684 1679390 1727271 1778296 1832555 1889412 1948728 2010768 2075112
53371B075112O5786O7247O9659P2446P4366P5227P5742P6163P6092P5437P4593
$$ 2075112 2140898 2208145 2277804 2350250 2424616 2499843 2575585 2651748 2727840 2803277 2877870
53360B877870P3703P2366P0150O6952O2883N8157N3200M8662M5254M3323M2314
$$ 2877870 2951573 3023939 3094089 3161041 3223924 3282081 3335281 3383943 3429197 3472520 3514834
53349C514834M0874L7994L3970K9807K5783K1284J5962J0247M463j859r566j9213
$$ 3514834 3555708 3593702 3627672 3657479 3683262 3704546 3720508 3730755 3735218 3733359 3723793 3704580
53337C704580l0817m3624n6007o6319p3988p9313q2435q3351q2808q2032q1325
$$ 3704580 3673763 3630139 3574132 3507813 3433825 3354512 3272077 3188726 3105918 3023886 2942561
53326B942561q0021p7993p6120p4877p3727p2424p1744p2104p2468p1580o9524
$$ 2942561 2862540 2784547 2708427 2633550 2559823 2487399 2415655 2343551 2271083 2199503 2129979
53315B129979o7176o4817o2225n9533n6972n4087n0227m5569m0913l6603l2441
$$ 2129979 2062803 1997986 1935761 1876228 1819256 1765169 1714942 1669373 1628460 1591857 1559416
53304A559416k8519k5391k3395k2239k1423k0571j9433j7816j5613j2871r907
$$ 1559416 1530897 1505506 1482111 1459872 1438449 1417878 1398445 1380629 1365016 1352145 1342238
53293A342238p342n695m836m174l403k651j913r16K27R53J133J488K723M697O805
$$ 1342238 1334896 1329201 1324365 1320191 1316788 1314137 1312224 1311308 1311535 1312488 1313621 1315109 1317832 1322529 1329334
53278A329334Q796J0790J2900J5221J7897K0898K3874K6493K8628L0227L1240
$$ 1329334 1338130 1348920 1361820 1377041 1394938 1415836 1439710 1466203 1494831 1525058 1556298
53267A556298L1869L2434L3001L3448L3899L4551L5125L5060L4277L3154L1843
$$ 1556298 1588167 1620601 1653602 1687050 1720949 1755500 1790625 1825685 1859962 1893116 1924959
53256A924959L0229K8560K7216K5928K4117K2074K0782K0326J9460J7148J3537
$$ 1924959 1955188 1983748 2010964 2036892 2061009 2083083 2103865 2124191 2143651 2160799 2174336
53245B174336R167M270p60n295r453j4124j9491k4555k8720l2682l6948m0623
$$ 2174336 2183503 2187773 2187013 2181718 2172265 2158141 2138650 2114095 2085375 2052693 2015745 1975122
53233A975122m2759m3856m4943m5949m6235m6012m5942m5805m4767m2761m0451
$$ 1975122 1932363 1888507 1843564 1797615 1751380 1705368 1659426 1613621 1568854 1526093 1485642
53222A485642l8155l5887l4214l3932l4846l5852l6271l6363l6524l6767l6987
$$ 1485642 1447487 1411600 1377386 1343454 1308608 1272756 1236485 1200122 1163598 1126831 1089844
53211A089844l7031l6477l4929l2592l0049k7495k4706k1669j8787j6504j5110
$$ 1089844 1052813 1016336 981407 948815 918766 891271 866565 844896 826109 809605 794495
53200G94495j4702j4936j5045j4553j3784j3328j3282j3395j3576j3799j3819
$$ 794495 779793 764857 749812 735259 721475 708147 694865 681470 667894 654095 640276
53189F40276j3523j3245j3248j3198j2649j1828j1332j1304j1400j1319j1008
$$ 640276 626753 613508 600260 587062 574413 562585 551253 539949 528549 517230 506222
53178E06222j0478r917r684r904j0325j0787j1409j2013j2003j1276j0558j0362
$$ 506222 495744 485827 476143 466239 455914 445127 433718 421705 409702 398426 387868 377506
53166C77506j0175r404q410p864p629p183o709o729o994o732n834m933m331l701
$$ 377506 367331 357927 349517 341653 334024 326841 320132 313403 306409 299677 293843 288910 284579 280878
53152B80878k849k042j519j259j215j312j279r30m79j80J00N33Q69Q30O63O97
$$ 280878 278029 275987 274468 273209 271994 270682 269403 268473 267994 267814 267914 268447 269316 270146 270809 271506
53136B71506P25L96p7k63k45l99p50j205k030l329m339m153l009k120k235l021
$$ 271506 272231 272627 272550 272287 272042 271643 270893 269688 267658 264329 259990 255837 252828 250708 248473 245452
53120B45452l783m098l832l179k669k650k827k794k689k832l010k807k341k004
$$ 245452 241669 237571 233739 230560 227891 225241 222414 219620 216931 214099 211089 208282 205941 203937
53106B03937j770j442j312j775k408k352j527p53o31r52j184r64j87Q12J257O79
$$ 203937 202167 200725 199413 197638 195230 192878 191351 190598 189967 189015 187831 186867 186680 187492 188749 189428
53090A89428n07j584k399l084l366k969k376k309k632k572j963j434j403j617
$$ 189428 188921 187337 184938 181854 178488 175519 173143 170834 168202 165630 163667 162233 160830 159213
53076A59213j694j515j171r71j256j713j395r7R42O51k11k52K86l0j322k046j308
$$ 159213 157519 156004 154833 153862 152606 150893 149498 149401 150343 150994 150783 150531 150817 150787 149465 147419 146111
53059A46111J3Q57J298J671J650R59Q1m33o64p28l14O35J336J014j17j148j452
$$ 146111 146124 146981 148279 149950 151600 152559 152640 152207 151543 150815 150501 151136 152472 153486 153369 152221 150769
53042A50769r96j47N16M94k05j154k030k687k885k474j795j304q99k74K04j44
$$ 150769 149773 149626 150142 150636 150431 149277 147247 144560 141675 139201 137406 136102 135203 134929 135133 134989
53026A34989j049j362n92M82R91R14N56l2o68q21l56J35J52r2k50l81n45m20Q9
$$ 134989 133940 132578 131986 132468 133459 134373 134929 134897 134229 133408 133052 133187 133339 133247 132997 132616 132071 131651 131740
53007A31740M25J19l84k24P02J565J553P71J91O47J863K697K540K166K662L960
$$ 131740 132165 132284 131900 131676 132378 133943 135496 136267 136458 137105 138968 141665 144205 146371 149033 152993
52991A52993N022N244M867M175L244K470K325K427J769J31j541k423k672k736
$$ 152993 158015 163259 168126 172301 175545 178015 180340 182767 184536 184667 183126 180703 178031 175295
52977A75295k681k527k455k320j702p56k88n68q77o81m49q22j611k215k434k342
$$ 175295 172614 170087 167632 165312 163610 162854 162566 161998 161121 160440 159991 159169 157558 155343 152909 150567
52961A50567j868j078m28k51l77n90r53j331j232n09K61N41M81M33L80K54K99
$$ 150567 148699 147621 147193 146942 146565 145975 145022 143691 142459 141950 142211 142752 143233 143666 144046 144300 144599
52944A44599O47R78R90P93N30J57j25J30Q04J029L36o48j047p62j75M77R72R64
$$ 144599 145246 146224 147214 148007 148537 148694 148569 148699 149503 150532 150868 150220 149173 148411 148236 148713 149685 150649
52926A50649N93N49R32Q34k08j128p36M23Q17J57l30J28Q63R22K84m38p47l55
$$ 150649 151242 151791 152723 153557 153349 152221 151485 151908 152725 152882 152552 152680 153543 154465 154749 154311 153564 153209
52908A53209P86K150K770K224J170N59N45N58K67L8L44J046J574J669J616J683
$$ 153209 153995 156145 158915 161139 162309 162868 163413 163971 164238 164276 164620 165666 167240 168909 170525 172208
52892A72208J684J348Q40N40M49K75k8k38k57r5M53J500K514K758K322K048K227
$$ 172208 173892 175240 176080 176620 177069 177344 177316 177078 176821 176726 177179 178679 181193 183951 186273 188321 190548
52875A90548K209J634J300K077L488M219L789L039K919L306L330K563J558J134
$$ 190548 192757 194391 195691 197768 201256 205475 209264 212303 215222 218528 221858 224421 225979 227113
52861B27113J274J152L06o76r51n41j03M7j2l94j197j855j587n79J68K25J15J65
$$ 227113 228387 229539 229845 229169 228218 227677 227574 227621 227609 227215 226018 224163 222576 221997 222165 222390 222505 222670
52843B22670m3p96j705k380k861l040k562j698j399j990k633k610k291k208k026
$$ 222670 222627 221831 220126 217746 214885 211845 209283 207585 206186 204196 201563 198953 196662 194454 192428
52828A92428j239k29K25k9o01j212j696j778j521j416j579j468r27o83j122j427
$$ 192428 191189 190960 191185 191156 190555 189343 187647 185869 184348 182932 181353 179885 178958 178275 177153 175726
52812A75726q68j82m97j509j942j540j274j616j878j436n96P0M48O22M96R8k88
$$ 175726 174858 174676 174179 172670 170728 169188 167914 166298 164420 162984 162388 162458 162906 163528 164024 164122 163834
52795A63834n15p78j180j444j258p25k79k65o05r28j040j147j431j591j290r04
$$ 163834 163319 162541 161361 159917 158659 157934 157655 157390 156785 155857 154817 153670 152239 150648 149358 148454
52779A48454j154j892k082j281l45j70n30p60q91j242j488j051j98J64l82j397
$$ 148454 147300 145408 143326 142045 141700 141530 141000 140240 139349 138107 136619 135568 135370 135534 135152 133755
52763A33755k218k408j860j042q27j513k267k156j381q47q18p98n14k63k55l11
$$ 133755 131537 129129 127269 126227 125400 123887 121620 119464 118083 117236 116418 115620 115106 114843 114588 114277
52747A14277k67j43N4K51J42n04j409k029k134j799j136l98j1l1J97J205K512
$$ 114277 114010 113867 113921 114172 114314 113810 112401 110372 108238 106439 105303 104905 104894 104863 105060 106265 108777
52730A08777L051K410J122j0m66r9P76J448J480J141R57J044J178J240J178Q84
$$ 108777 111828 114238 115360 115350 114884 114785 115561 117009 118489 119630 120587 121631 122809 124049 125227 126111
52714A26111M22O5j88o62j370j852j965k173k579k543j839j342j767k494k525
$$ 126111 126533 126598 126410 125748 124378 122526 120561 118388 115809 113266 111427 110085 108318 105824 103299
52699A03299j948j484j249j028j103j751k317k037j302r80r36n19o3m23j234j185
$$ 103299 101351 99867 98618 97590 96487 94736 92419 90382 89080 88100 87164 86645 86582 86159 84925 83740
52683H3740j06P10M51k70p08r15j064r65o60n48n93l59Rr9m84j84Q93J528R56
$$ 83740 83634 84344 84795 84525 83817 82902 81838 80873 80213 79665 79072 78713 78722 78623 78139 77955 78848 80376 81332
52664H1332j25p92j095j363j337p77j47O2Jr6l60n91l9J360K337J843N65p4J41
$$ 81332 81207 80415 79320 77957 76620 75843 75696 75758 75759 75663 75303 74712 74673 76033 78370 80213 80778 80704 80845
52645H0845L53K26K60O50R85J193J789K822L424K888J586L83m39j117j619j577
$$ 80845 81198 81424 81684 82334 83319 84512 86301 89123 92547 95435 97021 97404 96965 95848 94229 92652
52629I2652j043o75r20j411j532j238q94n76j00L65M25J85J77L90K35l24m80J29
$$ 92652 91609 90934 90014 88603 87071 85833 84939 84363 84263 84628 85053 85238 85415 85805 86040 85716 85236 85365
52611H5365P23O57M98R59J565J385N51j09m04o66p05j05P15R79Q60J065J383J035
$$ 85365 86088 86745 87243 88202 89767 91152 91703 91594 91190 90524 89819 89714 90429 91408 92268 93333 94716 95751
52593I5751L36M97J582K208J640P14K58J2k87n9R25J728J547R09P12Q17N65L2
$$ 95751 96087 96584 98166 100374 102014 102728 102986 102998 102711 102652 103577 105305 106852 107761 108473 109290 109855 109887
52575A09887j30L21J114J943K533K640K366K072J724R86J62J12Q08J053K16o75
$$ 109887 109757 110078 111192 113135 115668 118308 120674 122746 124470 125456 125618 125730 126538 127591 127807 127132
52559A27132m49N55J255J387J301R27J15m66n5Q86J219P69M19O34R67J073J193
$$ 127132 126683 127238 128493 129880 131181 132108 132223 131757 131702 132588 133807 134576 134995 135629 136596 137669 138862
52542A38862J392J197L10q76j805k267k247j705p79J07N61N24K05q4j27j6m1k73
$$ 138862 140254 141451 141761 140885 139080 136813 134566 132861 132082 132189 132750 133274 133479 133395 133268 133252 133211 132938
52524A32938l93j60K02L59L14K54J84J16L35R98J635J542O76k36n03j07M82Q42
$$ 132938 132545 132385 132587 132946 133260 133514 133698 133814 134149 135147 136782 138324 139000 138764 138261 138154 138636 139478
52506A39478R24R80J196J357J102N30K76O94J304J376Q64M08M76Q49J027Q53N71
$$ 139478 140402 141382 142578 143935 145037 145567 145843 146537 147841 149217 150081 150489 150965 151814 152841 153694 154265
52489A54265M46M26L16J35J39L77N23L22kq4O6K61N78J140J609J494Q83K76j69
$$ 154265 154711 155137 155453 155588 155727 156104 156627 156949 156947 156863 156929 157190 157768 158908 160517 162011 162894 163170 163001
52470A63001o49j055j078r62j313k134k728k776k611k354j725r92j076k099k801
$$ 163001 162352 161297 160219 159257 157944 155810 153082 150306 147695 145341 143616 142624 141548 139449 136648
52455A36648k149p53R5J58J69M87P41N88J35l27n61n36n65j006j593j570p42J41
$$ 136648 134499 133746 133841 133999 134168 134655 135396 135984 136119 135792 135231 134695 134130 133124 131531 129961 129219 129360
52437A29360M74N18O59P04M84M16P44Q70L30k18R4R04J106M38l64p63q12n74m7
$$ 129360 129834 130352 131011 131715 132199 132615 133359 134229 134559 134341 134435 135339 136445 136883 136519 135756 134944 134370 134323
52418A34323L54K18k9M52J526K012J234o3p28n24r5O7J50N99J317J597J004J85
$$ 134323 134677 134895 134866 135318 136844 138856 140090 140027 139299 138775 138680 138747 138897 139496 140813 142410 143414 143599
52400A43599K44J225J962J662R31O74Q56J060J514K506L357L135K105J335J081
$$ 143599 143843 145068 147030 148692 149623 150297 151153 152213 153727 156233 159590 162725 164830 166165 167246
52385A67246P41K97N19J535K382K393K025J880J768J315Q19Q62J517K373K987
$$ 167246 167987 168284 168803 170338 172720 175113 177138 179018 180786 182101 182920 183782 185299 187672 190659
52370A90659L026K336J246M33K20L03L35L80O69J203J834K371K518K048J253Q13
$$ 190659 193685 196021 197267 197700 197920 198223 198558 198938 199607 200810 202644 205015 207533 209581 210834 211647
52354B11647J014J458J665J636J666J931K458L153L652L502K721J900J534J474
$$ 211647 212661 214119 215784 217420 219086 221017 223475 226628 230280 233782 236503 238403 239937 241411
52340B41411J301R87Q69J149J634J908J668R86L40K88R28J783K260K220K016J973
$$ 241411 242712 243699 244568 245717 247351 249259 250927 251913 252253 252541 253469 255252 257512 259732 261748 263721
52324B63721J982J657R85N74R87J908K371J908J054N44N13P15J076J538J803J767
$$ 263721 265703 267360 268345 268919 269906 271814 274185 276093 277147 277691 278204 278919 279995 281533 283336 285103
52308B85103J880K512L184L102K342J809K040K647L027L111L221L627M334N160
$$ 285103 286983 289495 292679 295781 298123 299932 301972 304619 307646 310757 313978 317605 321939 327099
52294C27099N828O287O765P324P548P162O660O782P458P896P776P681Q159Q923
$$ 327099 332927 339214 345979 353303 360851 368013 374673 381455 388913 396809 404585 412266 420425 429348
52280D29348R358R426R628J0265J1081J1589J1593J1277J0934J0710J0733J1269
$$ 429348 438706 448132 457760 468025 479106 490695 502288 513565 524499 535209 545942 557211
52268E57211J2410J3612J4033J3525J2824J2544J2463J2162J1755J1475J1082
$$ 557211 569621 583233 597266 610791 623615 636159 648622 660784 672539 684014 695096
52257F95096J0354R760R774R909R278P926O790O346O137N689M979M002K646J212
$$ 695096 705450 715210 724984 734893 744171 752097 758887 765233 771370 777059 782038 786040 788686 789898
52243G89898K95k7k81p59j217j528j948k475k640k227j594j044m59J60N08O15
$$ 789898 790193 790166 789885 789126 787909 786381 784433 781958 779318 777091 775497 774453 773994 774154 774662 775277
52227G75277J118K417M008N132N641N969O565P606Q946J0021J0318J0116J0370
$$ 775277 776395 778812 782820 787952 793593 799562 806127 813733 822679 832700 843018 853134 863504
52214H63504J1522J2886J3511J3292J2853J2746J3041J3371J3052J1567R244P153
$$ 863504 875026 887912 901423 914715 927568 940314 953355 966726 979778 991345 1000589 1007742
52202A007742N956N232M230K842J391j09j893l827n421o423p008p410p717q031
$$ 1007742 1013698 1018930 1023160 1026002 1027393 1027284 1025391 1021564 1016143 1009720 1002712 995302 987585 979554
52188I79554q495r188j0079j1076j1917j2161j1609j0714j0312j0815j1667j1800
$$ 979554 971059 961871 951792 940716 928799 916638 905029 894315 884003 873188 861521 849721
52176H49721j0727r193q462q837r259q631p278o452o623p012o855o366o067n877
$$ 849721 838994 829801 821339 812502 803243 794612 787334 780882 774259 767247 760392 754026 747959 742082
52162G42082n385m652m125l964l898l704l507l533l757l825l326k236j082m76
$$ 742082 736697 732045 727920 723956 720058 716354 712847 709314 705557 701732 698406 696170 695088 694612
52148F94612m91p50j037j484k107k575k588k223j735j321j112j154j369j780k680
$$ 694612 694121 693371 692334 690850 688743 686168 683580 681357 679622 678301 677189 676035 674666 672886 670206
52133F70206m129n382n493m583l850m066m660m704m167l714l739m109m593m947
$$ 670206 666077 660695 655202 650619 646769 642703 638043 633339 629172 625458 621719 617610 613017 608070
52119F08070m847m209l476l241l624m288m839m981m547l738l019k544j902q19
$$ 608070 603223 599014 595538 592297 588673 584385 579546 574565 570018 566280 563261 560717 558815 557996
52105E57996K07M50p6o62p51l44L48J145J862K389K862L435L973M299M647N414
$$ 557996 558203 558653 558577 557915 557164 556820 557168 558313 560175 562564 565426 568861 572834 577133 581780 587194
52089E87194O511P414P937Q523R580J0891J1980J2736J3396J4095J4758J5442
$$ 587194 593705 601119 609056 617579 627159 638050 650030 662766 676162 690257 705015 720457
52077G20457J6386J7660J8932J9778K0109K0151K0097J9920J9524J8913J8205
$$ 720457 736843 754503 773435 793213 813322 833473 853570 873490 893014 911927 930132
52066I30132J7628J7407J7459J7220J6144J4431J2911J2037J1380J0340Q859P155
$$ 930132 947760 965167 982626 999846 1015990 1030421 1043332 1055369 1066749 1077089 1085948 1093103
52054A093103N218L143J445L85o83k468m472n584n829o453q031r566j0016r813
$$ 1093103 1098321 1101464 1102909 1103294 1102611 1100143 1095671 1090087 1084258 1077805 1069774 1060208 1050192 1040379
52040A040379j0008j0607j0721j0047r298r098r229r122q612p928p218o375n287
$$ 1040379 1030371 1019764 1009043 998996 989698 980600 971371 962249 953637 945709 938491 932116 926829
52027I26829m112l192k626k070j114J61J320K165K933L825M723N480O164O856
$$ 926829 922717 919525 916899 914829 913715 913876 915196 917361 920294 924119 928842 934322 940486 947342
52013I47342P438P795P983Q125Q238Q261Q005P195N875M655M104L952L353K003
$$ 947342 954780 962575 970558 978683 986921 995182 1003187 1010382 1016257 1020912 1025016 1028968 1032321 1034324
51999A034324L70j271l239n591p578q504q743r331j0793j2848j5010j7037j8939
$$ 1034324 1034694 1033423 1030184 1024593 1017015 1008511 999768 990437 979644 966796 951786 934749 915810
51986I15810k0807k2584k3927k4553k4785k5278k6018k6217k5473k4503k4123
$$ 915810 895003 872419 848492 823939 799154 773876 747858 721641 696168 671665 647542
51975F47542k4060k3417k2015k0539j9497j8729j7957j7277j6866j6566j5982
$$ 647542 623482 600065 578050 557511 538014 519285 501328 484051 467185 450619 434637
51964D34637j4898j3557j2484j1896j1289r952q008o463n973o054n828n214m764
$$ 434637 419739 406182 393698 381802 370513 360561 352553 346090 340117 334063 328235 323021 318257
51951C18257m643m368l560k441j529j137j190j307j078m89j3j12p47j541k203
$$ 318257 313614 309246 305686 303245 301716 300579 299389 298082 297004 296515 296502 296390 295643 294102 291899
51936B91899k620k708k497k219k056j952j767j582j618k007k694l469l999m072
$$ 291899 289279 286571 284074 281855 279799 277847 276080 274498 272880 270873 268179 264710 260711 256639
51922B56639l885l781l720l343k642k105k060k348k749l190l378k860j856j296
$$ 256639 252754 248973 245253 241910 239268 237163 235103 232755 230006 226816 223438 220578 218722 217426
51908B17426j575j890j410n50l02p73j193j169j035j039r47n65p9K32K54l3n57
$$ 217426 215851 213961 212551 212001 211699 210926 209733 208564 207529 206490 205543 204978 204899 205131 205385 205352 204795
51891B04795j152j684k138k379k163j603j270j408j491j008l19j34m75p66o84
$$ 204795 203643 201959 199821 197442 195279 193676 192406 190998 189507 188499 188180 188046 187571 186805 186121
51876A86121l35J90P81J057Q18N41P43J081Q17J28jP97J716J875J298N96K49M38
$$ 186121 185786 185976 186757 187814 188632 189173 189916 190997 191814 191942 191941 192738 194454 196329 197627 198223 198472 198910
51858A98910J043J539J411Q87Q41J694K805L218K714J852J296J281J583J732J422
$$ 198910 199953 201492 202903 203790 204631 206325 209130 212348 215062 216914 218210 219491 221074 222806 224228
51843B24228P39j4o94j285j657j602j152n54QM47O34N08L14M17Q74J384J677J708
$$ 224228 224967 224953 224259 222974 221317 219715 218563 218009 218017 218464 219098 219606 219920 220337 221211 222595 224272 225980
51825B25980J584J435J342J210Q61L58K0m9j51n15r71j293j458j358p37J59M98
$$ 225980 227564 228999 230341 231551 232412 232770 232790 232741 232590 232075 231104 229811 228353 226995 226258 226417 226915
51808B26915j09r36j132q86r35j336j542j342r08k43N99J019N64j04N8Q97J239
$$ 226915 226806 225870 224738 223852 222917 221581 220039 218697 217789 217546 218145 219164 219728 219624 219682 220579 221818
51791B21818O19j43k64J26N86R55J027N29k42n23j27L19M02N15J152K203L244
$$ 221818 222437 222294 222030 222156 222742 223697 224724 225253 225011 224488 224361 224680 225082 225597 226749 228952 232196
51774B32196L888L751K743J544J077J316J343P36L3l74q35j561k104k163k131
$$ 232196 236084 239835 242578 244122 245199 246515 247858 248594 248627 248253 247418 245857 243753 241590 239459
51759B39459k320k437k322k384k753k765j965r39m59m64n33p17j165j490j233
$$ 239459 237139 234702 232380 229996 227243 224478 222513 221574 221115 220651 220118 219401 218236 216746 215513
51744B15513n52J40P64J222J162O70N26J036J329P09l8K16J101J277M65l15m27
$$ 215513 214961 215101 215865 217087 218249 218919 219445 220481 221810 222519 222481 222697 223798 225075 225540 225225 224798
51727B24798k86l34m32m93p54j171j358j322j498j890k002j761j743k144k341
$$ 224798 224512 224178 223746 223253 222499 221328 219970 218648 217150 215260 213258 211497 209754 207610 205269
51712B05269j915j339j204j295j047m48om5m81j065j532j630j359j027q91q59
$$ 205269 203354 202015 200811 199516 198469 198021 198015 197970 197489 196424 194892 193262 191903 190876 189985 189126
51696A89126o73k41L15P88R76Q60P36J013J707K381K598K328J951K030L045M905
$$ 189126 188453 188212 188527 189315 190291 191151 191887 192900 194607 196988 199586 201914 203865 205895 208940 213845
51680B13845O731P456O785N344L828K449J217L00j87l97m99n08n66r95j801k413
$$ 213845 220576 228032 234817 240161 243989 246438 247655 247955 247768 247371 246872 246364 245798 244803 243002 240589
51664B40589k343j889j784k314l127l801m208m346m187l711k974k060j259j113
$$ 240589 238246 236357 234573 232259 229132 225331 221123 216777 212590 208879 205905 203845 202586 201473
51650B01473j879k989l419k752j569o78l04k64m95j020j539j563r95l26j02m35
$$ 201473 199594 196605 193186 190434 188865 188187 187883 187619 187124 186104 184565 183002 182007 181681 181579 181144
51634A81144j049j645k030k079j740j078k94L57O74O52N11M83N17L28j54n41l38
$$ 181144 180095 178450 176420 174341 172601 171523 171229 171586 172260 172912 173423 173906 174423 174751 174597 174056 173718
51617A73718M32J123J084L33m05m08L52J183J374Q28N7k81J77J273K357K665K009
$$ 173718 174150 175273 176357 176690 176285 175877 176229 177412 178786 179614 179671 179390 179567 180840 183197 185862 187871
51600A87871J054O71J055J686K077K201K256K443L008M067N164N506M871M010
$$ 187871 188925 189596 190651 192337 194414 196615 198871 201314 204322 208389 213553 219059 223930 227940
51586B27940L766M173M670M907M928M854M734M588M268L459K138Q22m1n94j157
$$ 227940 231706 235879 240549 245456 250384 255238 259972 264560 268828 272287 274425 275247 275206 274612 273455
51571B73455j595j626j410j246q41L42K048L270L466L160L135L597M256M793M959
$$ 273455 271860 270234 268824 267578 266737 267079 269127 272397 275863 279023 282158 285755 290011 294804 299763
51556B99763M661M155L899L998M118L947L398K392R46m08r07n06j05m36j227j831
$$ 299763 304424 308579 312478 316476 320594 324541 327939 330331 331277 330869 329962 329456 329351 328915 327688 325857
51540C25857k293l138m401n320n218m270l289k895k979l027k810k617k737l002
$$ 325857 323564 320426 316025 310705 305487 301217 297928 295033 292054 289027 286217 283600 280863 277861
51526B77861l073k967k965l127l295l514l891m086l511k171q24j62k29p66j573
$$ 277861 274788 271821 268856 265729 262434 258920 255029 250943 247432 245261 244437 244275 244046 243280 241707
51511B41707k310k500k045j390r05m63K9J93l51j279j880j859j498j117p78m24
$$ 241707 239397 236897 234852 233462 232557 232094 232123 232316 231965 230686 228806 226947 225449 224332 223554 223130
51495B23130j00P6M1j13j38J18N43R34J228J403J309R51P43J021J494J682J794
$$ 223130 223030 223106 223147 223034 222896 223014 223557 224491 225719 227122 228431 229382 230125 231146 232640 234322 236116
51478B36116K435L490M128M079M050M601N362N790N978O124N985N450N070N306
$$ 236116 238551 242041 246169 250248 254298 258899 264261 270051 276029 282153 288138 293588 298658 303964
51464C03964N715N605N039M500M009L366K860K892L032K390R05n30j317j818k636
$$ 303964 309679 315284 320323 324823 328832 332198 335058 337950 340982 343372 344277 343747 342430 340612 337976
51449C37976l847n169o346p136p282o821o146n618n273m924m449l933l671l897
$$ 337976 334129 328960 322614 315478 308196 301375 295229 289611 284338 279414 274965 271032 267361 263464
51435B63464m341m269l306j963j022n73j02O00J160J248J015P96P11O73N54K18
$$ 263464 259123 254854 251548 249585 248563 247990 247888 248488 249648 250896 251911 252707 253418 254091 254645 254863
51419B54863l61r69j345j551j895k488l069l347l366l411l700m196m690n031n239
$$ 254863 254502 253533 252188 250637 248742 246254 243185 239838 236472 233061 229361 225165 220475 215444 210205
51404B10205n348n192m604l796l279l313l651l929l949l610k877k070j702j812
$$ 210205 204857 199665 195061 191265 187986 184673 181022 177093 173144 169534 166657 164587 162885 161073
51390A61073j822j341p19n02p04j035j473k115k699k763k239j478q23l77q0K38
$$ 161073 159251 157910 157191 156689 155985 154950 153477 151362 148663 145900 143661 142183 141360 140983 140903 141141
51374A41141O91R97O36m20j486j983k041j952j521o23J53J55k67k18M09Q59P87
$$ 141141 141832 142829 143465 143045 141559 139576 137535 135583 134062 133439 133592 133747 133480 133262 133671 134530 135317
51357A35317P25J123J620J655J249P96M82K46J76N29J433K592L380L336K667K136
$$ 135317 136042 137165 138785 140440 141689 142485 142967 143213 143389 143918 145351 147943 151323 154659 157326 159462
51341A59462K306L008L627L700L175K380J939K264K913K886J874O57j02p69j854
$$ 159462 161768 164776 168403 172103 175278 177658 179597 181861 184774 187660 189534 190191 190089 189320 187466
51326A87466k885l101k800k882l348l385k954k999l861m544m122k954j977j497
$$ 187466 184581 181480 178680 175798 172450 169065 166111 163112 159251 154707 150585 147631 145654 144157
51312A44157j278j346j924k812l394l208k354j346p07n17l73J8K95p5q66j212
$$ 144157 142879 141533 139609 136797 133403 130195 127841 126495 125788 125271 124898 124916 125211 125136 124270 123058
51296A23058p53q9J03j14k89k54q1K27N87P37O08M93N49M23j65p96p78j16M94
$$ 123058 122305 122216 122319 122205 121916 121662 121581 121808 122395 123132 123740 124233 124782 125205 125040 124244 123466 123350 123844
51277A23844O16N29N77N86K46k38m59o16j367k682l451k753j164r6q4m46n13l36
$$ 123844 124460 124989 125566 126152 126398 126160 125701 125085 123718 121036 117585 114832 113668 113572 113488 113042 112529 112193
51259A12193q4L58Q09O82j01p70q14o27n49j63O92J095L03q52j012k04N39R52
$$ 112193 112109 112467 113276 113958 113857 113087 112273 111646 111097 110934 111626 112721 113024 112172 111160 110956 111495 112447
51241A12447J504J906J303Pn16K02Q72L94o11r50m18L99J112J538J466J054R07
$$ 112447 113951 115857 117160 117167 116651 116853 117725 118119 117508 116558 116140 116539 117651 119189 120655 121709 122616
51224A22616J200J376J123R91J404J779J371M71L2L84R69J161Q29K76M1M78J337
$$ 122616 123816 125192 126315 127306 128710 130489 131860 132331 132363 132747 133716 134877 135706 135982 136023 136501 137838
51207A37838J925J934J700J506J150M94j24l39j90K21R36J694J818J071R8l79
$$ 137838 139763 141697 143397 144903 146053 146547 146423 146084 145894 146115 147051 148745 150563 151634 151732 151353
51191A51353l81k41M5N33Q65O98K61j03n47j329k123k374k066j596j113n51j20
$$ 151353 150972 150731 150776 151309 152174 152872 153133 153030 152483 151154 149031 146657 144591 142995 141882 141331 141211
51174A41211k14q20j508j894j885j543j054o81n02l17qK86M75O47O81K90l67n58
$$ 141211 140997 140177 138669 136775 134890 133347 132293 131612 131110 130793 130785 131071 131546 132193 132874 133164 132797 132239
51156A32239N6Q39J070R12R49J143R87M38M9J28L35J18p44j921k741k726k185
$$ 132239 132295 133134 134204 135116 136065 137208 138195 138633 138682 138810 139145 139263 138519 136598 133857 131131 128946
51139A28946j893k094k242j964j593j412j070l54J33j51o66n11J98O00M35J86
$$ 128946 127053 124959 122717 120753 119160 117748 116678 116324 116457 116306 115640 115129 115327 115927 116362 116548
51123A16548K0m01j057j362j071n83j97L07J096J907K404K450J983J120M53O35
$$ 116548 116568 116167 115110 113748 112677 112094 111897 112204 113300 115207 117611 120061 122044 123164 123617 124252
51107A24252J472J951J418L06n13n95q3O50J181J322J368J779K430K589J848P57
$$ 124252 125724 127675 129093 129399 128886 128291 128208 128858 130039 131361 132729 134508 136938 139527 141375 142132
51091A42132K22N02J040J186Q33L74J73J11k06p87j054n22N29J378J697J708J635
$$ 142132 142354 142856 143896 145082 145915 146289 146462 146573 146367 145580 144526 144004 144533 145911 147608 149316 150951
51074A50951J496J375J440J625J644J451J338J463J613J513J101M37l93j162j546
$$ 150951 152447 153822 155262 156887 158531 159982 161320 162783 164396 165909 167010 167447 167054 165892 164346
51059A64346j424j000n79m28p77j647k586k851k110q29R2O1p28j478j450o61J60
$$ 164346 162922 161922 161343 160915 160138 158491 155905 153054 150944 150115 150207 150268 149540 148062 146612 145951 146111
51042A46111M32L42M22P52R70R68J056J307J262O00k45m74J04Q68J154R78Q62
$$ 146111 146543 146885 147307 148059 149029 149997 151053 152360 153622 154222 153977 153503 153607 154475 155629 156607 157469
51025A57469J102J512J808J997K174K194J925J624J686J980J989J621J401J655
$$ 157469 158571 160083 161891 163888 166062 168256 170181 171805 173491 175471 177460 179081 180482 182137
51011A82137K039K115K021K113K394K687L069L622L999L791L218L001L539M552
$$ 182137 184176 186291 188312 190425 192819 195506 198575 202197 206196 209987 213205 216206 219745 224297
50997B24297N450N835N700N474N759O721P874Q655R062R499J0172J0977J1759
$$ 224297 229747 235582 241282 246756 252515 259236 267110 275765 284827 294326 304498 315475 327234
50984C27234J2484J3305J4631J6796J9514K2027K4085K6241K8883L1625L4237
$$ 327234 339718 353023 367654 384450 403964 425991 450076 476317 505200 536825 571062
50973E71062L7414M1728M6355M9918N2334N4728N7557N9944O1084O1282O1103
$$ 571062 608476 650204 696559 746477 798811 853539 911096 971040 1032124 1093406 1154509
50962A154509O0279N8017N3936M8323M1785L4931K8055K0999J3636O441J00n436
$$ 1154509 1214788 1272805 1326741 1375064 1416849 1451780 1479835 1500834 1514470 1520911 1521011 1515575
50950A515575j0852j6268k0786k3444k4119k3292k1557j9643j8273j7520j6786
$$ 1515575 1504723 1488455 1467669 1444225 1420106 1396814 1375257 1355614 1337341 1319821 1303035
50939A303035j5908j5698j6960j9297k1590k3377k5162k7451l0090l2629l4886
$$ 1303035 1287127 1271429 1254469 1235172 1213582 1190205 1165043 1137592 1107502 1074873 1039987
50928A039987l6978l9031m0992m2547m3215m2702m1197l9171l6876l4179l0989
$$ 1039987 1003009 963978 922986 880439 837224 794522 753325 714154 677278 643099 612110
50917F12110k7691k4914k2878k1169j9245j6990j4651j2428j0425q852p829o947
$$ 612110 584419 559505 536627 515458 496213 479223 464572 452144 441719 432867 425038 418091
50905D18091n536l522j618m73KK59M78O79R76J326J423J225J169J490J775J719
$$ 418091 412555 409033 407415 406942 406944 407203 407681 408360 409336 410662 412085 413310 414479 415969 417744 419463
50889D19463J796K512L454L888L891M104M608M993N315O058P209Q284R225J0383
$$ 419463 421259 423771 427225 431113 435004 439108 443716 448709 454024 460082 467291 475575 484800 495183
50875D95183J1634J2499J3176J4409J6199J7696J8651J9899K2069K4823K7836
$$ 495183 506817 519316 532492 546901 563100 580796 599447 619346 641415 666238 694074
50864F94074L1459L5823M0268M4493M9373N5800O3378P1173P9116Q7659R6540
$$ 694074 725533 761356 801624 846117 895490 951290 1014668 1085841 1164957 1252616 1349156
50853A349156J04944J12774J20660J28711J35922J41089J43733J44014J42091
$$ 1349156 1454100 1566874 1687534 1816245 1952167 2093256 2236989 2381003 2523094
50844B523094J37620J29583J16877R9434P8764N7006L5489J4460n956k4957m1275
$$ 2523094 2660714 2790297 2907174 3006608 3085372 3142378 3177867 3192327 3186371 3161414 3120139
50833C120139n3882o2515o7550o9391o7991o3243n5790m7046l8265l0085k3188
$$ 3120139 3066257 3003742 2936192 2866801 2798810 2735567 2679777 2632731 2594466 2564381 2541193
50822B541193j8759j7756k0050k4727l1067l8793m7610n7043o6573p5595q3397
$$ 2541193 2522434 2504678 2484628 2459901 2428834 2390041 2342431 2285388 2218815 2143220 2059823
50811B059823q9500r3853r6391r6722r4600r0528q5357p9421p2530o4720n6559
$$ 2059823 1970323 1876470 1780079 1683357 1588757 1498229 1412872 1333451 1260921 1196201 1139642
50800A139642m8631m1048l3617k6252j9130j2458o083N25P645J4721K0796K5632
$$ 1139642 1091011 1049963 1016346 990094 970964 958506 952423 952948 960593 975314 996110 1021742
50788A021742K9882L3932L7146L8627L8294L6670L3992L0125K5118J9257J2781
$$ 1021742 1051624 1085556 1122702 1161329 1199623 1236293 1270285 1300410 1325528 1344785 1357566
50777A357566O060r2m908q488j1670j5074j8643k2106k5344k8292l0909l3321
$$ 1357566 1363626 1363534 1358626 1350138 1338468 1323394 1304751 1282645 1257301 1229009 1198100 1164779
50765A164779l5631l7464l8149l7455l5827l3778l1312k8168k4317k0072j5830
$$ 1164779 1129148 1091684 1053535 1016080 980253 946475 915163 886995 862678 842606 826776
50754H26776j1884q366n154j863J943O425J1289J5919J9865K3243K6688L0813
$$ 826776 814892 806526 801372 799509 801452 807877 819166 835085 854950 878193 904881 935694
50742I35694L5787M1396M7377N3610O0077O6722P3381P9863Q6199R2448R8133
$$ 935694 971481 1012877 1060254 1113864 1173941 1240663 1314044 1393907 1480106 1572554 1670687
50731A670687J02057J03122J01189R6695Q9663P9736O7111N2596L6607J8989J89
$$ 1670687 1772744 1875866 1977055 2073750 2163413 2243149 2310260 2362856 2399463 2418452 2418641
50720B418641j8146l4306m7650n8084o5134o8265o7699o4171n8215n0398m1934
$$ 2418641 2400495 2366189 2318539 2260455 2195321 2127056 2059357 1995186 1936971 1886573 1844639
50709A844639l4223k7846k2618j8391j5234j3121j2225j3399j7457k3942l1306
$$ 1844639 1810416 1782570 1759952 1741561 1726327 1713206 1700981 1687582 1670125 1646183 1614877
50698A614877l8346m4758n0237n3943n5279n4647n2952n0680m7639m3373l7685
$$ 1614877 1576531 1531773 1481536 1427593 1372314 1317667 1264715 1214035 1166396 1123023 1085338
50687A085338l1049k4537j8974j4073q856k897L314R392J5824K3349L1928M0715
$$ 1085338 1054289 1029752 1010778 996705 987849 984952 988266 997658 1013482 1036831 1068759 1109474
50675A109474M8946N6610O4346P2658Q1117Q8332R2925R4533R3615R0486Q4916
$$ 1109474 1158420 1215030 1279376 1352034 1433151 1521483 1614408 1708941 1802556 1893042 1977958
50664A977958P6770O6504N4999M3150L1723K1147J1324J985o744j4480k1268k7609
$$ 1977958 2054728 2121232 2176231 2219381 2251104 2272251 2283575 2285560 2278816 2264336 2243068 2215459
50652B215459l3693l9156m3709m7474n0390n1897n1631m9972m7436m3851l8740
$$ 2215459 2181766 2142610 2098901 2051427 2001037 1949140 1897509 1847537 1800101 1756250 1717510
50641A717510l2240k5135j8085j1298m838J138O452J0824J3819J5215J5427J5093
$$ 1717510 1685270 1660135 1642050 1630752 1625914 1627052 1633504 1644328 1658147 1673362 1688789 1703882
50629A703882J4229J2286R145N659K963J489R93J196K069L637N861Q745J2225
$$ 1703882 1718111 1730397 1739542 1745201 1748164 1749653 1750646 1751842 1753911 1757548 1763409 1772154 1784379
50616A784379J5904J9053K0998K1356J9930J6705J1992O427O29m956r869j3576
$$ 1784379 1800283 1819336 1840334 1861690 1881620 1898325 1910317 1916744 1917373 1912417 1902548 1888972
50604A888972j5979j7702j9605k2055k4995k8482l2713l7583m2689m7779n2615
$$ 1888972 1872993 1855291 1835686 1813631 1788636 1760154 1727441 1689858 1647169 1599390 1546775
50593A546775n6460n8352n8285n7473n6923n6174n4066n0426m6293m2572l9145
$$ 1546775 1490315 1431963 1373678 1316205 1259282 1203108 1149042 1098616 1052323 1009751 970606
50582I70606l5515l1746k8322k5353k2339j8835j5080j1738r049o518l628n83
$$ 970606 935091 903345 875023 849670 827331 808496 793416 781678 772629 766111 762483 761900
50570G61900K066M304O636R217J1668J3939J6634K0120K3939K7595L1322L5500
$$ 761900 763966 768270 774906 784123 795791 809730 826364 846484 870423 898018 929340 964840
50558I64840L9810M3725M7505N1878N6900O1842O6114O9555P1948P2886P2198
$$ 964840 1004650 1048375 1095880 1147758 1204658 1266500 1332614 1402169 1474117 1547003 1619201
50547A619201O9919O5895O0031N2888M5478L8535L2493K8004K5479K4239K3048
$$ 1619201 1689120 1755015 1815046 1867934 1913412 1951947 1984440 2012444 2037923 2062162 2085210
50536B085210K1596K0534J9864J8580J6347J4392J3884J4471J5462J7534K1835
$$ 2085210 2106806 2127340 2147204 2165784 2182131 2196523 2210407 2224878 2240340 2257874 2279709
50525B279709K7779L3296L7354M0906M4828M8119M8986M7026M3359L8879L3194
$$ 2279709 2307488 2340784 2378138 2419044 2463872 2511991 2560977 2608003 2651362 2690241 2723435
50514B723435K5505J5857N185n615j6289k6996l7715m8001n7153o4605p0120p3650
$$ 2723435 2748940 2764797 2769982 2764367 2748078 2721082 2683367 2635366 2578213 2513608 2443488 2369838
50502B369838p4971p3626o9403o2813n4785m5900l6258k6315j7295j0245m901
$$ 2369838 2294867 2221241 2151838 2089025 2034240 1988340 1952082 1925767 1908472 1898227 1893326
50491A893326j34M540Q614J1764J4608J7693K0221K0352J6714R271j101j3359
$$ 1893326 1893192 1897732 1906346 1918110 1932718 1950411 1970632 1990984 2007698 2016969 2015868 2002509
50479B002509k6604m0059n2922o4219p2990p8821q2159q3684q3419q0857p6019
$$ 2002509 1975905 1935846 1882924 1818705 1745715 1666894 1584735 1501051 1417632 1336775 1260756
50468A260756o9980o3978n8306n2473m6318m0460l5509l1348k7456k3722k0453
$$ 1260756 1190776 1126798 1068492 1016019 969701 929241 893732 862384 834928 811206 790753
50457G90753j7734j5141j2232r058o078l720k062p59P65K805N120P294R230J1077
$$ 790753 773019 757878 745646 736588 730510 726790 724728 723969 724734 727539 732659 739953 749183 760260
50443G60260J2760J4104J5365J7056J9185K1173K2788K4521K6673K8749L0264
$$ 760260 773020 787124 802489 819545 838730 859903 882691 907212 933885 962634 992898
50432I92898L1578L3263L5120L6570L7646L8794L9847M0148L9671L9210L9346
$$ 992898 1024476 1057739 1092859 1129429 1167075 1205869 1245716 1285864 1325535 1364745 1404091
50421A404091L9851M0195M0054L9167L7500L5678L4629L4588L4991L5447L6022
$$ 1404091 1443942 1484137 1524191 1563358 1600858 1636536 1671165 1705753 1740744 1776191 1812213
50410A812213L6420L5718L3488L0457K7492K4477K0866J6779J2731Q541L375l083
$$ 1812213 1848633 1884351 1917839 1948296 1975788 2000265 2021131 2037910 2050641 2059182 2062557 2059474
50398B059474j0178j7157k3973l0993l8313m5646n2695n9334o5307o9988p2660
$$ 2059474 2049296 2032139 2008166 1977173 1938860 1893214 1840519 1781185 1715878 1645890 1573230
50387A573230p3113p1798o9242o5543o0676n5089m9411m3642l7198k9904k2474
$$ 1573230 1500117 1428319 1359077 1293534 1232858 1177769 1128358 1084716 1047518 1017614 995140
50376I95140j5708r656l887J785P217J2184J6338J9143K0268J9897J8259J5061
$$ 995140 979432 969776 965889 967674 974891 987075 1003413 1022556 1042824 1062721 1080980 1096041
50364A096041R796K669n196j2599j9030k4517k8981l2065l3606l4000l3826l3195
$$ 1096041 1105837 1108506 1103310 1090711 1071681 1047164 1018183 986118 952512 918512 884686 851491
50352H51491l1775k9543k7154k5234k3591k1609j9202j6844j4747j2636j0393
$$ 851491 819716 790173 763019 737785 714194 692585 673383 656539 641792 629156 618763
50341F18763q318o548m811l056j799j391j336p26Q14K918M909O274O967P473Q368
$$ 618763 610445 603897 599086 596030 594231 592840 591504 590778 591592 594510 599419 605693 612660 620133 628501
50326F28501R668J0924J1972J3135J4554J5901J7016J8244J9761K1159K2155K3218
$$ 628501 638169 649093 661065 674200 688754 704655 721671 739915 759676 780835 802990 826208
50314H26208K4874K6818K8368K9428L0266L0611K9747K7493K4530K1699J9424
$$ 826208 851082 877900 906268 935696 965962 996573 1026320 1053813 1078343 1100042 1119466
50303A119466J7729J6310J4576J2056Q807N203J462k294n797q845j1520j3749
$$ 1119466 1137195 1153505 1168081 1180137 1188944 1194147 1195609 1193315 1187518 1178673 1167153 1153404
50291A153404j5005j5104j5032j6139j8626k1569k4331k6998k9398l0738l0721
$$ 1153404 1138399 1123295 1108263 1092124 1073498 1051929 1027598 1000600 971202 940464 909743
50280I09743l0056k9371k8327k6550k4654k3430k2465k0646j7942j5647j4588
$$ 909743 879687 850316 821989 795439 770785 747355 724890 704244 686302 670655 656067
50269F56067j4040j2845j1026r600r147r199r041q479p717o885o047n405n100
$$ 656067 642027 629182 618156 608556 599409 590210 581169 572690 564973 558088 552041 546636 541536
50256E41536m935m582m091l824l851l737l088k076j194o72l76j32J36N61J278
$$ 541536 536601 532019 527928 524104 520253 516516 513428 511352 510158 509486 509110 508978 509114 509675 510953
50241E10953K215L100L745M210M602M875M864M506M034L836M040M273L982L148
$$ 510953 513168 516268 520013 524223 528825 533700 538564 543070 547104 550940 554980 559253 563235 566383
50227E66383K414K275K373J883O16o39j050p95q84j907l245l693k863j661j264
$$ 566383 568797 571072 573445 575328 575944 575305 574255 573460 572576 570669 567424 563731 560868 559207 557943
50212E57943j921k958l711l981l709k792j376L0J081J923K797L689M581N689P124
$$ 557943 556022 553064 549353 545372 541663 538871 537495 537525 538606 540529 543326 547015 551596 557285 564409
50197E64409Q584R794J0942J2267J3327J3349J2244J0818R778Q941P671N799L801
$$ 564409 572993 582787 593729 605996 619323 632672 644916 655734 665512 674453 682124 687923 691724
50184F91724K123O17j200l456n664p289q367r340j0361j1091j1239j0943j0438
$$ 691724 693847 694464 693264 689808 684144 676855 668488 659148 648787 637696 626457 615514 605076
50171F05076r679q609p465o541n730m727l589k829k824l365l825l687k989k221
$$ 605076 595397 586788 579323 572782 567052 562325 558736 555907 553083 549718 545893 542206 539217 536996
50157E36996j829j821j996k289k576k368j288J20P68L99l9K47Q67J105J047J205
$$ 536996 535167 533346 531350 529061 526485 524117 522829 522949 523717 524116 524077 524324 525191 526296 527343 528548
50141E28548J526J659J799K358L069L341L388L944M930N356M840M231M256M463
$$ 528548 530074 531733 533532 535890 538959 542300 545688 549632 554562 559918 564758 568989 573245 577708
50127E77708M073L230K650K480K274J881J662J778J739R40n69k000k528k055j240
$$ 577708 581781 585011 587661 590141 592415 594296 595958 597736 599475 600415 599846 597846 595318 593263 592023
50112E92023o73k37N01J461K065K173K385L228M394N194N484N772O578P911R384
$$ 592023 591350 591113 591614 593075 595140 597313 599698 602926 607320 612514 617998 623770 630348 638259 647643
50097F47643J0617J1659J3055J5346J8409K1493K4096K6605K9831L4151L9324
$$ 647643 658260 669919 682974 698320 716729 738222 762318 788923 818754 852905 892229
50086H92229M5069N1427N8575O6561P5365Q5078R5735J06887J17339J25497J30027
$$ 892229 937298 988725 1047300 1113861 1189226 1274304 1370039 1476926 1594265 1719762 1849789
50075A849789J30212J25777J16662J03196Q6501O8494N1543L7860K8836K4476
$$ 1849789 1980001 2105778 2222440 2325636 2412137 2480631 2532174 2570034 2598870 2623346
50065B623346K3502K4209K5042K4315J9959J0366m413k2874m3435o4995q6061
$$ 2623346 2646848 2671057 2696099 2720414 2740373 2750739 2746326 2723452 2680017 2615022 2528961
50054B528961j04228j17326j24836j27692j26797j22339j14557j04608r4161q4218
$$ 2528961 2424733 2307407 2182571 2054879 1928082 1805743 1691186 1586578 1492417 1408199
50044A408199p4656o5073n5874m8095m2134l7135l2039k6929k2759j9874j7443
$$ 1408199 1333543 1268470 1212596 1164501 1122367 1085232 1053193 1026264 1003505 983631 966188
50033I66188j4625j1626r269p852o968o203n521n029m675m347m025l830l966m542
$$ 966188 951563 939937 930668 922816 915848 909645 904124 899095 894420 890073 886048 882218 878252 873710
50019H73710n389o133o604o957p333p485p041o021m921m267m242m598m768m151
$$ 873710 868321 862188 855584 848627 841294 833809 826768 820747 815826 811559 807317 802719 797951 793800
50005G93800k559m87J278K362L073L936N199O850Q806J0843J2456J3211J3291
$$ 793800 791241 790754 792032 794394 797467 801403 806602 813452 822258 833101 845557 858768 872059
49992H72059J3420J4063J4957J5573J5842J6088J6457J6847J7312J8034J8834
$$ 872059 885479 899542 914499 930072 945914 962002 978459 995306 1012618 1030652 1049486
49981A049486J9202J9084J9156K0093K1887K4208K7049L0533L4441L8497M3044
$$ 1049486 1068688 1087772 1106928 1127021 1148908 1173116 1200165 1230698 1265139 1303636 1346680
49970A346680M8881N6494O5768P6430Q8352J01468J15773J31306J47576J62982
$$ 1346680 1395561 1452055 1517823 1594253 1682605 1784073 1899846 2031152 2178728 2341710
49960B341710J75198J82302J83245J77541J65345J48212J29202J11599R7513Q7590
$$ 2341710 2516908 2699210 2882455 3059996 3225341 3373553 3502755 3614354 3711867 3799457
49950C799457Q1618P8896P8236P7858P5454O8432N4662L3322N243k7481o1922
$$ 3799457 3881075 3959971 4038207 4116065 4191519 4259951 4314613 4347935 4353178 4325697 4263775
49939D263775r4714j22828j44585j59977j70005j75856j78624j79194j77883j74444
$$ 4263775 4169061 4046233 3901648 3741671 3571666 3395810 3217186 3037992 2860109 2685665
49929B685665j68695j61067j52307j42841j32656j21725j10390r9336q9293q0605
$$ 2685665 2516970 2355903 2203596 2060755 1928099 1806374 1695984 1596648 1507355 1426750
49919A426750p3019o6043n9540n3814m9029m4848m0778l6690l2830k9518k6961
$$ 1426750 1353731 1287688 1228148 1174334 1125305 1080457 1039679 1002989 970159 940641 913680
49908I13680k5252k4278k3736k3315k2871k2360k1723k0840j9639j8204j6846
$$ 913680 888428 864150 840414 817099 794228 771868 750145 729305 709666 691462 674616
49897F74616j5889j5248j4424j3117j1672j0575r702q513o909n397m388l811l445
$$ 674616 658727 643479 629055 615938 604266 593691 583989 575476 568567 563170 558782 554971 551526
49884E51526l206k951k475j848j364j052o34j06J31m5j59K66J137K048K728L055
$$ 551526 548320 545369 542894 541046 539682 538630 537996 537890 538021 537976 537817 538083 539220 541268 543996 547051
49868E47051L022K911L141L746M399N092O242P915R537J0784J2123J4022J6070
$$ 547051 550073 552984 556125 559871 564270 569362 575604 583519 593056 603840 615963 629985 646055
49855F46055J7575J8583J9760K1590K4218K7789L2334L7578M3421N0290N8430
$$ 646055 663630 682213 701973 723563 747781 775570 807904 845482 888903 939193 997623
49844I97623O7236P6068Q5386R6131J07979J19103J27678J32685J33061J27260
$$ 997623 1064859 1140927 1226313 1322444 1430423 1549526 1677204 1809889 1942950 2070210
49834B070210J14605R6671P6616N7330M0648K7883K0196J7982K0220K4581K8207
$$ 2070210 2184815 2281486 2358102 2415432 2456080 2483963 2504159 2522141 2542361 2566942 2595149
49823B595149K8490K3504J2116n915k9749n7303q5466j10829j30634j43431j49089
$$ 2595149 2623639 2647143 2659259 2653344 2623595 2566292 2480826 2369997 2239363 2095932 1946843
49812A946843j48353j42401j32778j21273j09403r7899q6864p6425o6864n8256
$$ 1946843 1798490 1656089 1523311 1402038 1292635 1194736 1107872 1031447 964583 906327
49802I06327n0509m3929l9132l5979l3207k9656k5592k2214k0063j8579j7038
$$ 906327 855818 811889 772757 736778 703571 673915 648323 626109 606046 587467 570429
49791E70429j5278j3451j1715j0313r480q976q173o815n418m680m757n189n413
$$ 570429 555151 541700 529985 519672 510192 501216 493043 486228 480810 476130 471373 466184 460771
49778D60771n152m562m029l731l377k617j620r33p09n76l25k75o43r32m62O62
$$ 460771 455619 451057 447028 443297 439920 437303 435683 434750 434041 433465 433140 432865 432222 431290 430828 431490
49762D31490J524J421O04j37l58k11O9N74J429K260K461J964J406J288J338J090
$$ 431490 433014 434435 435039 434902 434544 434333 434402 434976 436405 438665 441126 443090 444496 445784 447122 448212
49746D48212P21P88J253J450J088P29R61J615K060J973J432O87J51K89J036J511
$$ 448212 448933 449721 450974 452424 453512 454241 455202 456817 458877 460850 462282 462969 463120 463409 464445 465956
49730D65956R11l89j163q24p7Q2m24q70p02K3R30J674J998J855J491J216J034
$$ 465956 466867 466478 465315 464491 464414 464496 464072 463202 462500 462523 463453 465127 467125 468980 470471 471687 472721
49713D72721P78N50O30R36R80N87K54M71R94J236J177J328J774J847R86l74j182
$$ 472721 473499 474049 474679 475615 476595 477182 477436 477907 478901 480137 481314 482642 484416 486263 487249 486875 485693
49696D85693r11n9M48J99m31q26p91n58k98P3N25P02L64j65m05l61m05o16o84
$$ 485693 484782 484723 485171 485370 484939 484113 483322 482764 482466 482539 483064 483766 484130 483965 483560 483199 482794 482178 481494
49677D81494m31o8J59K34K47L17N98J049J219P28p0l96p8K57K20K55R52K154L128
$$ 481494 481063 480995 481154 481388 481635 481952 482550 483599 484818 485546 485476 485080 485002 485259 485479 485734 486686 488840 491968
49658D91968L321K765J965J637K132K981L318K923K428K353K544K689K815K890
$$ 491968 495289 498054 500019 501656 503788 506769 510087 513010 515438 517791 520335 523024 525839 528729
49644E28729K616K016J666J809J861J394R92J355K099K398K438L123M437N162
$$ 528729 531345 533361 535027 536836 538697 540091 541083 542438 544537 546935 549373 552496 556933 562095
49630E62095M512L193K483K859L838M674M889M452L772L328L162K946K553K294
$$ 562095 566607 569800 572283 575142 578980 583654 588543 592995 596767 600095 603257 606203 608756 611050
$$ [...]
##END NTUPLES=NMR SPECTRUM
##END=
