##TITLE=NES1027_Brazil_9268334_IjYqnQ15Sc
##JCAMPDX= 6.0         $$ Bruker NMR JCAMP-DX V2.0
##DATA TYPE= NMR SPECTRUM
##DATA CLASS= NTUPLES
##ORIGIN= BRUKER
##OWNER= Administrator
$$ 1.72 TOPSPIN		Version 2.1
$$ 2015-07-11 22:21:02.425 -0700  Administrator@X
$$ Compression mode = diff/dup
##.OBSERVE FREQUENCY= 400.02188249412
##.OBSERVE NUCLEUS= ^1H
##.ACQUISITION MODE= SIMULTANEOUS (DQD)
##.ACQUISITION SCHEME= undefined
##.AVERAGES= 8
##.DIGITISER RES= 22
##SPECTROMETER/DATA SYSTEM= spect
##.PULSE SEQUENCE= zg30
##.SOLVENT NAME= COFFEE_meoh
##.SHIFT REFERENCE= INTERNAL, COFFEE_meoh, 1, 14.98509
##AUDIT TRAIL= $$ (NUMBER, WHEN, WHO, WHERE, PROCESS, VERSION, WHAT)
$$ ##TITLE= Audit trail, TOPSPIN		Version 2.1
$$ ##JCAMPDX= 5.01
$$ ##ORIGIN= Bruker BioSpin GmbH
$$ ##OWNER= Administrator
$$ $$ E:\/data/COFFEE/nmr/NES1027_Brazil_9268334_IjYqnQ15Sc/20/pdata/1/auditp.txt
$$ ##AUDIT TRAIL=  $$ (NUMBER, WHEN, WHO, WHERE, PROCESS, VERSION, WHAT)
(   1,<2015-07-11 22:20:54.910 -0700>,<Administrator>,<X>,<go>,<TOPSPIN 2.1>,
      <created by zg
	started at 2015-07-11 22:19:49.128 -0700,
	POWCHK enabled, PULCHK disabled,
       configuration hash MD5:
       21 0F 79 D6 B3 7B B4 F6 88 20 88 DB 03 48 BD 9F
       data hash MD5: 64K
       88 2F A0 3D 19 65 05 A4 13 AF 01 54 E0 2A 84 23>)
(   2,<2015-07-11 22:20:58.238 -0700>,<Administrator>,<X>,<proc1d>,<TOPSPIN 2.1>,
      <Start of raw data processing
       efp LB = 0 FT_mod = 6 PKNL = 1 PHC0 = 0 PHC1 = 0 SI = 32K 
       data hash MD5: 32K
       1C EF B4 F5 9C A3 5F E7 6B C9 26 0D 5A 79 8C B4>)
(   3,<2015-07-11 22:20:58.519 -0700>,<Administrator>,<X>,<proc1d>,<TOPSPIN 2.1>,
      <pk PHC0 = 93.04321 PHC1 = 0 
       data hash MD5: 32K
       31 3E 90 EB BB A0 F7 D1 7D 37 77 D1 F4 F2 DE EF>)
(   4,<2015-07-11 22:20:58.644 -0700>,<Administrator>,<X>,<proc1d>,<TOPSPIN 2.1>,
      <abs ABSG = 1 
       data hash MD5: 32K
       F8 FC 2B DD D1 D6 62 57 1D F5 7C CF B1 CB E4 15>)
(   5,<2015-07-11 22:20:58.706 -0700>,<Administrator>,<X>,<proc1d>,<TOPSPIN 2.1>,
      <abs ABSG = 2 
       data hash MD5: 32K
       A3 43 14 85 EE AE 46 AF 5A D9 95 7D C5 E6 91 8F>)
(   6,<2015-07-11 22:20:58.769 -0700>,<Administrator>,<X>,<proc1d>,<TOPSPIN 2.1>,
      <abs ABSG = 3 
       data hash MD5: 32K
       47 E5 0C 1F 5F 26 9E 42 D5 18 B7 D6 C7 63 AB 86>)
(   7,<2015-07-11 22:20:58.831 -0700>,<Administrator>,<X>,<proc1d>,<TOPSPIN 2.1>,
      <abs ABSG = 4 
       data hash MD5: 32K
       1E 64 20 51 34 19 44 D2 30 92 9C 35 3F 98 98 BB>)
(   8,<2015-07-11 22:20:58.910 -0700>,<Administrator>,<X>,<proc1d>,<TOPSPIN 2.1>,
      <abs ABSG = 5 
       data hash MD5: 32K
       D7 E9 E6 A0 CD AD AD 3D 39 18 76 B3 C9 8A 8A 5F>)
$$ ##END=
$$ 
$$ $$ hash MD5
$$ $$ 84 9B 58 34 39 E3 96 71 9F CD 86 68 00 3E 2D E9
##$RELAX= 
##$RELAX= 
##$RELAX= 
##$RELAX= 
##$RELAX= 
##$RELAX= 
##$RELAX= 
$$ Bruker specific parameters
$$ --------------------------
##$DU= <E:\>
##$EXPNO= 20
##$NAME= <NES1027_Brazil_9268334_IjYqnQ15Sc>
##$PROCNO= 1
$$ [...]
150 150 150 150 150 150 150 150
##$TP07= 0
##$TPNAME0= <>
##$TPNAME1= <>
##$TPNAME2= <>
##$TPNAME3= <>
##$TPNAME4= <>
##$TPNAME5= <>
##$TPNAME6= <>
##$TPNAME7= <>
##$TPOAL= (0..7)
0.5 0.5 0.5 0.5 0.5 0.5 0.5 0.5
##$TPOFFS= (0..7)
0 0 0 0 0 0 0 0
##$TUNHIN= 0
##$TUNHOUT= 0
##$TUNXOUT= 0
##$USERA1= <user>
##$USERA2= <user>
##$USERA3= <user>
##$USERA4= <user>
##$USERA5= <user>
##$V9= 5
##$VALIST= <valist>
##$VCLIST= <CCCCCCCCCCCCCCC>
##$VD= 0
##$VDLIST= <DDDDDDDDDDDDDDD>
##$VPLIST= <PPPPPPPPPPPPPPP>
##$VTLIST= <TTTTTTTTTTTTTTT>
##$WBST= 2048
##$WBSW= 25
##$XGAIN= (0..3)
0 0 0 0
##$XL= 0
##$YL= 0
##$YMAX_a= 643979
##$YMIN_a= -533930
##$ZGOPTNS= <>
##$ZL1= 120
##$ZL2= 120
##$ZL3= 120
##$ZL4= 120
##$ABSF1= 14.98509
##$ABSF2= -5.573092
##$ABSG= 5
##$ABSL= 3
##$ALPHA= 0
##$AQORDER= 0
##$ASSFAC= 0
##$ASSFACI= 0
##$ASSFACX= 0
##$ASSWID= 0
##$AUNMP= <proc_prof1d_extract_pilot.lims>
##$AXLEFT= 0
##$AXNAME= <>
##$AXNUC= <1H>
##$AXRIGHT= 0
##$AXTYPE= 0
##$AXUNIT= <>
##$AZFE= 0.1
##$AZFW= 0.1
##$BCFW= 0
##$BC_mod= 0
##$BYTORDP= 0
##$COROFFS= 0
##$CY= 15
##$DATMOD= 1
##$DC= 0
##$DFILT= <>
##$DTYPP= 0
##$F1P= 0
##$F2P= 0
##$FCOR= 0.5
##$FTSIZE= 32768
##$FT_mod= 6
##$GAMMA= 0
##$GB= 0
##$INTBC= 1
##$INTSCL= 1
##$ISEN= 128
##$LB= 0
##$LEV0= 0
##$LPBIN= 0
##$MAXI= 10000
##$MC2= 0
##$MEAN= 0
##$ME_mod= 0
##$MI= 0
##$NCOEF= 0
##$NC_proc= -8
##$NLEV= 6
##$NOISF1= 0
##$NOISF2= 0
##$NSP= 0
##$NTH_PI= 0
##$NZP= 0
##$OFFSET= 14.98509
##$PC= 1
##$PHC0= 93.04321
##$PHC1= 0
##$PH_mod= 1
##$PKNL= yes
##$PPARMOD= 0
##$PPDIAG= 0
##$PPIPTYP= 0
##$PPMPNUM= 2147483647
##$PPRESOL= 1
##$PSCAL= 4
##$PSIGN= 0
##$PYNMP= <proc.py>
##$REVERSE= no
##$SF= 400.02
##$SI= 32768
##$SIGF1= 0
##$SIGF2= 0
##$SINO= 400
##$SIOLD= 32768
##$SPECTYP= <>
##$SREGLST= <1H.CDCl3>
##$SSB= 0
##$STSI= 32768
##$STSR= 0
##$SW_p= 8223.68421052631
##$SYMM= 0
##$S_DEV= 0
##$TDeff= 65536
##$TDoff= 0
##$TI= <>
##$TILT= no
##$TM1= 0
##$TM2= 0
##$TOPLEV= 0
##$USERP1= <user>
##$USERP2= <user>
##$USERP3= <user>
##$USERP4= <user>
##$USERP5= <user>
##$WDW= 1
##$XDIM= 32768
##$YMAX_p= 453446848
##$YMIN_p= -635130
##$CURPLOT= <Network HP LaserJet P1505>
##$CURPRIN= <$Network HP LaserJet P1505>
##$DFORMAT= <normdp>
##$LAYOUT= <+/1D_H.xwp>
##$LFORMAT= <normlp>
##$PFORMAT= <normpl>
##$SURQMSG= 1
$$ End of Bruker specific parameters
$$ ---------------------------------
##NTUPLES= NMR SPECTRUM
##VAR_NAME=  FREQUENCY,     SPECTRUM/REAL,   SPECTRUM/IMAG
##SYMBOL=    X,             R,               I
##VAR_TYPE=  INDEPENDENT,   DEPENDENT,       DEPENDENT
##VAR_FORM=  AFFN,          ASDF,            ASDF
##VAR_DIM=   32768,         32768,           32768
##UNITS=     HZ,            ARBITRARY UNITS, ARBITRARY UNITS
##FACTOR=    0.250966925370066, 1,           1
##FIRST=     8223.43324360094, -216968,      -15680
##LAST=      0,             -150303,         -177753
##MIN=       0,             -635130,         0
##MAX=       8223.43324360094, 453446848,    0
$$ Real data points
##PAGE= N=1
##DATA TABLE= (X++(R..R)), XYDATA
$$ [...]
19463a06990I441i1925q7263B32567a79197C24439E8945c32617b499B12740p9654
19452A33086a63291j3605f397B2995D455R6785L88436a62692A3776K1911c04038
19440B60067c8913n8740E8016e2939I6014h9446l17695O5701J16477j87740B35977
19428a29308j5453e7433j12678B6828c8890A23068I009c84616c2330l289p5741
19417a11360b7755K510H1252m539b36618G0536a564n2007l2620p2094k59762a13943
19404d0594A70306j9154n7695a04725H2284Q4999E3524M4800h8536p2985n0376
19393b11897O8014P0848l7012B24234a8307l20611a22732A86038C5893b04135
19382b10867e689m3405A02150c03601J07062C9016J03428b07419j06787Q1317
$$ plain form
19463 -106990 9441 -91925 -179188 232567 -179197 324439 58945 -332617 -2499 212740 133086
19452 133086 -163291 -176896 -6397 22995 4455 101240 489676 -162692 13776 35687 -304038
19440 260067 -38913 -97653 58016 -52939 96014 -89446 -407141 -341440 -224963 -412703 235977
19428 -129308 -144761 -57433 -170111 26828 -38890 123068 9009 -384616 -32330 -35619 -111360
19417 -111360 -27755 -25245 81252 76713 -236618 70536 -1564 -53571 -86191 -158285 -418047 -113943
19404 -40594 170306 151152 93457 -104725 82284 167283 53524 98324 -88536 -161521 -211897
19393 -211897 -143883 -73035 -110047 224234 -18307 -338918 -122732 186038 35893 -204135
19382 -210867 -5689 -49094 102150 -303601 -196539 39016 142444 -207419 -314206 -232889
19372b32889B83513r9718a76266m0222b1979k5987j04760L412A77618a01062j70160
19361b71222o4389a31164o1181H0263a96634e2933k30518N4280A31515b96186
19350A94250G3398M8888E8757K5110K52531H1249a44891p8278j63071J47753M506
19339b33981a6045o5638I124B382a84466A10781b14718a370j30229A2531J39565
19328A52096c15529a2117B92972c02781g1041j81340i6855k75857l9172a14822
19317b5825o8529A95953E9758j4408b80542C6186J11712N0286a75256p5609g2055
19305a15326N2877b677A41181m1246i745r6269j76177g2568D20085G7452i8706
19293a23893b8787l19165a04992d0922n3989A5650a98920P5478k65431f5918b6550
$$ plain form
19372 -232889 283513 183795 -176266 -216488 -21979 -47966 -152726 -149314 177618 -101062 -271222
19361 -271222 -335611 -131164 -192345 80263 -196634 -52933 -283451 -229171 131515 -296186
19350 194250 73398 122286 58757 83867 336398 81249 -144891 -223169 -386240 -238487 -233981
19339 -233981 -16045 -81683 9124 2382 -184466 110781 -214718 -1370 -131599 12531 152096
19328 152096 -315529 -12117 292972 -302781 -71041 -252381 -96855 -372712 -411884 -114822
19317 -25825 -94354 195953 59758 45350 -280542 36186 147898 198184 -175256 -250865 -72055
19305 -115326 -62449 -2677 141181 99935 -9745 -106014 -282191 -72568 420085 77452 -98706
19293 -123893 -28787 -347952 -104992 -40922 -94911 15650 -198920 -123442 -388873 -65918 -26550
19281B3914c23267g2178A05118B7523a45495d319j29045J5895j0462d7535r3175
19270a40710F9227J7281b2791j30785C09184a20431C6869a50535q447D0648b1342
19258A69938a58375b4368m6666A44572D2765a70936h0252n2965A11867D0896d71354
19246b3690p7532a2347C8796a88966A54234b24398P8221P1975l24506a18454Q141
19235a10313C79239i4624b3210j34597L1197q687m55823K71665B10198a69653
19224C10562A05702h1129A5853M3460G18K3778e6666k01864d7404C29336a73542
19212A93856G4983b00771M6892r7261N2925j65691D22217b28809B9663d1607m5118
19201h6725j20771A6560a70956j37111A54842G0716b32685p619c049l00943A19244
$$ plain form
19281 23914 -323267 -72178 105118 27523 -145495 -4319 -133364 -117469 -127931 -47535 -140710
19270 -140710 69227 86508 -22791 -153576 309184 -120431 36869 -150535 -158982 40648 -21342
19258 169938 -158375 -24368 -71034 144572 42765 -170936 -80252 -133217 111867 40896 -471354
19246 -23690 -101222 -12347 38796 -188966 154234 -224398 -146177 -74202 -398708 -118454 -110313
19235 -110313 379239 -94624 -23210 -157807 -126610 -135297 -591120 -319455 210198 -169653
19224 310562 105702 -81129 15853 59313 718 24496 -56666 -258530 -47404 329336 -173542
19212 193856 74983 -200771 -153879 -251140 -198215 -363906 422217 -228809 29663 -41607 -86725
19201 -86725 -207496 16560 -170956 -308067 154842 70716 -232685 -240304 -3049 -303992 119244
19189A13190E5125e3649k6251k5120A09283c17495f4768l12549c4851k00831R0746
19178a44936A89010a61556B72010F3664Q293Q0669o168p1036b77576L1344B07897
19166A33553a07462A5434g7715a6236I875M7883b58649i8723l4501j936j49941
19155b85101d1437k82089J60181E213c39782c4226G0811a07846j29994c9347k7716
19144f7063m6032f263o7420K5896j26891A02770c8366j23025j74258B02345D4421
19132d56807a63337d3538B98188d02104C19233a64868e0230A77326R0673n2409
19122B15590J90089A7006M1922b09758B2502b51743N5871i2930A77318e0988D1719
19110A7162c81747a35307o5154A65623d58661a245j44796M430B39299b73575C09306
$$ plain form
19189 113190 55125 -53649 -79900 -105020 109283 -317495 -64768 -377317 -34851 -235682 -144936
19178 -144936 189010 -161556 272010 63664 71957 152626 146458 75422 -277576 -246232 207897
19166 133553 -107462 15434 -77715 -16236 9875 57758 -258649 -98723 -133224 -135160 -285101
19155 -285101 -41437 -323526 -163345 5213 -339782 -34226 70811 -107846 -237840 -39347 -67063
19144 -67063 -113095 -6263 -73683 -47787 -174678 102770 -38366 -161391 -335649 202345 44421
19132 -456807 -163337 -43538 298188 -402104 319233 -164868 -50230 177326 267999 215590
19122 215590 405679 17006 58928 -209758 22502 -251743 -195872 -92930 177318 -50988 41719
19110 17162 -381747 -135307 -200461 165623 -458661 -1245 -146041 -141611 239299 -273575 309306
19098c571j79108Q1117j45812N2874h7499A12570a01903A59526H302d7900j12010
19087a59910k146a7619j89720C2613b10401r4328A74611a07139N2017D308d022
19075a74638k15150g479A68481c16726K0728i8735m1021A20407b93800A19335
19064a78921k0439d8293A97097h5478A84974b48605Q2953k59124A6868c08930
19053F1709K15106b78646a36626r3051L0002h8598c7334l04031a12693l0346M8844
19042i4195A44109k9795a24017B9237e3934k40241C3751L2232a11791D86L44353
19031C44839d7735A18561j9479d0620k28240A33231B7729J46449c5834A15791
19020E4075a55995K0144j64802C90149j18118j4064g9570A66754b85265R7860
$$ plain form
19098 -3571 -182679 -101562 -247374 -194500 -87499 112570 -101903 159526 8302 -47900 -159910
19087 -159910 -162056 -17619 -207339 32613 -210401 -304729 174611 -107139 -55122 4308 -4022
19075 -174638 -389788 -7479 168481 -316726 -295998 -98735 -139756 120407 -293800 119335
19064 -178921 -199360 -48293 197097 -85478 184974 -248605 -165652 -424776 16868 -308930
19053 61709 276815 -278646 -136626 -229677 -199675 -88598 -37334 -341365 -112693 -143039 -94195
19042 -94195 144109 114314 -124017 29237 -53934 -294175 33751 65983 -111791 486 344839
19031 344839 -47735 118561 99082 -40620 -268860 133231 27729 174178 -35834 115791
19020 54075 -155995 -135851 -300653 390149 272031 257967 -79570 166754 -285265 -187405
19010a87405r3000B37592C7247J24426a52799L1214j78470J22190A77260a58024
18999d62183B8123a04292k04889G4915k767b28726A85720m5906f4032J3487k75098
18988c25643R1934D6860a14285l83601C57089b40743B4691a61428E6429b05949
18977F5220M0925B4296a92765B22469p7180g3449B44702A00592K2410J01671J25842
18966C50515B4657b41514B1019G955L8257j8057b45C9545a86313N4655j22484
18955b54142M4537p8285E2471P3052f4932A29113b43351a06820j90528a12611
18944b1949A17300a53777L5481B85382I9488g2878o2715k42670J81819A10579
18933f6933p1260j68045G6655g817l204A7281c48119i008k36795A32093N6126
$$ plain form
19010 -187405 -280405 237592 37247 161673 -152799 -121585 -300055 -177865 177260 -158024
18999 -462183 28123 -104292 -309181 74915 72148 -228726 185720 139814 -64032 -50545 -325643
18988 -325643 -233709 46860 -114285 -497886 357089 -240743 24691 -161428 56429 -205949
18977 65220 106145 24296 -192765 222469 145289 -73449 244702 100592 123002 224673 350515
18966 350515 24657 -241514 21019 7955 46212 28155 -245 39545 -186313 -131658 -254142
18955 -254142 -209605 -287890 52471 125523 -64932 129113 -243351 -106820 -297348 -112611
18944 -21949 117300 -153777 -118296 285382 99488 -72878 -135593 -378263 -196444 110579
18933 -66933 -138193 -306238 76655 -7817 -11021 17281 -348119 -9008 -245803 132093 188219
18922A88219a26900f2008b5318k96634F1948M1223f3226B78052B6228a7726p8541
18911i6267r8188A89979f0446B57411r7630k7290K3217b46160b9247m4342A4394
18899a18084A67915a33599A58193l451b22312R7900j33293g8791j19622j06870
18889c05283E6016b62925N0741J8849j23710i6045J1179A750e3667j8184a1713
18877a23697j2863A17330b86777B0400d40710Q0361a80146e1500k4769C70520
18866A44554b37580A57189i7874c1224B84327a37892e4345o8103B22185g298n7566
18855f4864k38653i9354j19752p7705e3578j77467I1439e1275i337B51158a46325
18843f6572I2786J9015b44083j40612D3654P1180g8005j61047B24069g843m2197
$$ plain form
18922 188219 -126900 -62008 -25318 -321952 61948 103171 -63226 278052 26228 -17726 -96267
18911 -96267 -194455 189979 -60446 257411 159781 132491 155708 -246160 -29247 -73589 14394
18899 -118084 167915 -133599 158193 154742 -222312 -124412 -257705 -78791 -198413 -305283
18889 -305283 56016 -262925 -212184 -193335 -317045 -96045 -84866 1750 -53667 -71851 -11713
18877 -123697 -136560 117330 -286777 20400 -440710 -360349 -180146 -51500 -76269 370520
18866 144554 -237580 157189 -97874 -31224 284327 -137892 -54345 -122448 222185 -7298 -64864
18855 -64864 -303517 -99354 -219106 -296811 -53578 -231045 91439 -51275 -9337 251158 -146325
18843 -66572 92786 111801 -244083 -384695 43654 114834 -78005 -239052 224069 -7843 -50040
18832e0040A26011d759q160C2920n331J90081l328c30286J51798K4659C54792
18820c02141A12092E5610K37254O7447b95065A09639K53564j43377r2674a27322
18809I0749a23369A64685N5175o1572J794E3714P5224O9302q2360a63901P502
18798a56399j90451K977i9223A23048j0901C407J73610a86248e7726C32494g3514
18786E8088d46739A86202b110j42787a8974j9771k43992J37889H2137i924q0769
18775i0693B5787M3499b81924J27424B53584a15585j2068j31076d1127K0185B77781
18763b97083b4898B1351K62838b41746r3563a54461c459k4161p7566k06731G9443
18751B45827j0836A11635K2858J54523a35092n0842d6358k5692j3398A0149J45140
$$ plain form
18832 -50040 126011 -4759 -12919 32920 27589 217670 214342 -330286 -178488 -153829 354792
18820 -302141 112092 55610 292864 360311 -295065 109639 363203 219826 127152 -127322
18809 90749 -123369 164685 219860 158288 160082 53714 128938 198240 115880 -163901 -156399
18798 -156399 -346850 -343873 -99223 123048 112147 3407 177017 -186248 -57726 332494 -73514
18786 58088 -446739 186202 -2110 -144897 -18974 -38745 -282737 -144848 82137 -9924 -90693
18775 -90693 25787 69286 -281924 -154500 253584 -115585 -127653 -258729 -41127 -20942 277781
18763 -297083 -24898 21351 284189 -241746 -335309 -154461 -3459 -27620 -105186 -311917 79443
18751 245827 234991 111635 134493 289016 -135092 -185934 -46358 -72050 -85448 10149 155289
18740A55289f9477j05891m9272l7497A05168a50862j44468J31320A02047O1145
18730A63192n2169a15659A00077a09640H3905c01651I5919b22271N445A27704
18719e10495a72490j20028i680m1644o7176k5800A69420J00854a44733b8003k52025
18708b80028G3548J27719a14641a6322j68440M7224A96365a57317A98025a9383
18697b01931l0993D0744N74A5176a94991a8074l49913a47469j06477a26001l0652
18686a56653r2611c7077F9706d0949p1632B32934e18344K02388J7907O9393f1635
18674I8161b2641e853k00789j84197A10653d2883p8928p5777d2830k69881i8430
18662a47263A6405O9035f0190a1646A66969J48279b8713o0722A88170C9642a32785
$$ plain form
18740 155289 -69477 -175368 -224640 -262137 105168 -150862 -295330 -164010 102047 163192
18730 163192 111023 -115659 100077 -109640 83905 -301651 95919 -222271 -216826 127704
18719 -510495 -172490 -292518 -9680 -51324 -118500 -144300 169420 270274 -144733 -28003 -280028
18708 -280028 73548 201267 -114641 -16322 -184762 -137538 196365 -157317 198025 -19383
18697 -201931 -232924 40744 41318 15176 -194991 -18074 -367987 -147469 -253946 -126001 -156653
18686 -156653 -249264 -37077 69706 -40949 -112581 232934 -518344 -315956 -298049 -228656 -61635
18674 98161 -22641 -5853 -206642 -390839 110653 -42883 -121811 -197588 -42830 -312711 -98430
18662 -147263 16405 85440 -60190 -11646 166969 315248 -28713 -89435 188170 39642 -132785
18650b74905P9438R3037m8591A76988a11587M1372E0637Q2864L3097c15489G2365
18638b71987j51418c8267r1385A98137g0448j02983A38990H929a14499m6540B1783
18626I0556P9961i8786j28367R3937A23291a75478H1347a39815N8165L4735b0994
18614B14356b24014B0311K44467G5640a09040k01423A01830a53659B7803J8917
18604D6720l996c62212B1319a69028P8085k1703A91015a22761C44800c95686Q550
18593c87136J45587b4330j8733F4775R6571b09371A62525a6278k01420R6158D6931
18581A40076J9658g5013K7164j77862F4932J02056E149Q0639c3304A37801g2169
18569b18814A07997M4953M1390h4841A40370J60457A40541N0777K7925c90783
$$ plain form
18650 -274905 -195467 -102430 -151021 176988 -111587 -70215 50637 133501 166598 -315489 72365
18638 -271987 -423405 -38267 -129652 198137 -70448 -173431 138990 8929 -114499 -161039 21783
18626 90556 170517 -98786 -227153 -133216 123291 -175478 81347 -139815 -81650 -46915 -20994
18614 214356 -224014 20311 264778 75640 -109040 -310463 101830 -153659 27803 46720
18604 46720 42724 -362212 21319 -169028 -90943 -112646 191015 -122761 344800 -395686 -387136
18593 -387136 -241549 -24330 -43063 64775 161346 -209371 162525 -16278 -217698 -121540 46931
18581 140076 159734 -75013 -47849 -225711 64932 166988 5149 85788 -33304 137801 -72169
18569 -218814 107997 152950 194340 -84841 140370 300827 140541 191318 219243 -390783
18558i2627d587A47273J981a0093A2579a0473k25144B12160g0712B4125b9740
18546c9011p7852M1472J7197B6977Q1788Q6243h050r4081C0517h4188k68828h0417
18533A70788a75385j5932G6887c48055a62695C2313J54682h5290C2815b55048
18522B21995b16278d8277k73404D5957J63382e20016a75383j40976B20605b3867
18511A08691f2826C1552f036A2375c5404n7455j00967A06331l5227a38174j35676
18500b73850J15470j66224J47251E7744c268k13284k1643i2728j10148O3523D912
18488E7844c7280k38665B00296H6853d31807H527b96718i3647j9151B97153a59050
18476H1967f8176a9380B99449f1319C01400A21731g9129j18994H1372C8213N7807
$$ plain form
18558 -92627 -4587 147273 149254 -10093 12579 -10473 -235617 212160 -70712 24125 -29740
18546 -39011 -116863 -75391 -58194 26977 108765 195008 -8050 -102131 30517 -84188 -353016 -80417
18533 170788 -175385 -191317 76887 -348055 -162695 32313 186995 -85290 32815 -255048
18522 221995 -216278 -48277 -321681 45957 209339 -520016 -175383 -316359 220605 -23867
18511 108691 -62826 31552 -6036 12375 -35404 -92859 -193826 106331 71104 -138174 -273850
18500 -273850 -158380 -324604 -177353 57744 -3268 -216552 -238195 -92728 -202876 -139353 4912
18488 57844 -37280 -275945 200296 86853 -431807 8527 -296718 -93647 -112798 297153 -159050
18476 81967 -68176 -19380 299449 -61319 301400 121731 -79129 -198123 81372 38213 96020
18465I6020c4491j80316K3267k01042H5095b03690l1969A01571b3907j73300A63155
18453B4813a18599I4938a62055D40569C0038K8044a95608O6604N6820B93706A07157
18441a22964G4729a2803B13796a3524A32655i3865E3023e9345n4585k45649g1037
18429c90742D7844b53700B1199a46540j02354A5924C034J05690a65563C20800
18418i0934p2751b3772j06545A44822J74086b58216a17512k43947h7668B80197
18407D0264d18574C51524B3571a20825D4550i8233B33289a14599D3871L06329
18397C50200G4881L35030L2438H1312K0485d12516A0987j012M468K35871k8710
18386B21604b7703A42888a59743D4883d14874C33630a50753C9749P4373J1709
$$ plain form
18465 96020 -34491 -214807 -191540 -392582 85095 -203690 -235659 101571 -23907 -197207 163155
18453 24813 -118599 94938 -162055 440569 30038 58082 -195608 -129004 -72184 293706 107157
18441 -122964 74729 -12803 213796 -13524 132655 -93865 53023 -59345 -113930 -359579 -71037
18429 -390742 47844 -253700 21199 -146540 -248894 15924 3034 108724 -165563 320800
18418 -90934 -163685 -23772 -130317 144822 318908 -258216 -117512 -361459 -87668 280197
18407 40264 -418574 351524 23571 -120825 44550 -98233 233289 -114599 43871 350200
18397 350200 74881 409911 442349 81312 101797 -412516 10987 9975 14443 250314 221604
18386 221604 -27703 142888 -159743 44883 -414874 333630 -150753 39749 114122 125831
18376A25831D0749K20559J06885a17204j9450J9935N4941B34386a1584C1599L4426
18365F6025B7941K615a61712A38420J5159b14325B45373H968d7978k41732f6849
18353a40214m584c0903j50618D0189g2554G231e323j28522a3137C8632J68831
18342B07463G7085c2750j34379E9949c0627r1939d4284B0977c78115A44356l0232
18331A14124C1247A4615M16903I425J00467D8794b52974O9090N3740B32843m1318
18320A91525a92177A45998b63756A61L585b50663j51612a45686f4781j08906e4683
18308B78856c84j37077I7270J69487d09234D6099a1497r4598G7391e7020A43384
18296b40327a17214k3631B32818o9088d4084j10770M3601F0886P3122c29540c9321
$$ plain form
18376 125831 40749 261308 368193 -117204 -136654 -116719 -61778 234386 -11584 31599 66025
18365 66025 27941 30556 -161712 138420 153579 -214325 245373 8968 -47978 -289710 -66849
18353 -140214 -144798 -30903 -181521 40189 -72554 7231 -5323 -133845 -13137 38632 207463
18342 207463 77085 -32750 -167129 59949 -30627 -122566 -44284 20977 -378115 144356 114124
18331 114124 31247 14615 431518 9425 109892 48794 -252974 -183884 -130144 232843 191525
18320 191525 -192177 145998 -263756 161 3746 -250663 -402275 -145686 -64781 -173687 -54683
18308 278856 -384 -137461 97270 266757 -409234 46099 -11497 -106095 77391 -57020 143384
18296 -240327 -117214 -140845 232818 163730 -44084 -154854 -111253 60886 134008 -329540 -39321
18284f6048A5592a00190k1355L4033H1459J50112c2746l9480A79329d965D9523
18272c4947j07351E5191P2975a61691j12949H1251a56600H0380d7605q3729d0553
18260a7598l18523a45111I3622c12665e9891j22426M2985o7113B89997l7079j04569
18249A48349a22964M7171D0751J60160I4664a39689j19140B19501n9102e6724
18238b28246l108A03020I568O9787k3097J51341k8765f4827C3379b10750g1063
18226a72728D5488h3982j42263n1242A38400C6740b40397A6746J41426b09797
18215h2993j1271c2111n8210B57c7343p71r1661f0413j79425q860J18796A1527
18202H1696h8580A61885h4327G5285j2731h5947k10819J33938d7314a0191A12415
$$ plain form
18284 -66048 15592 -100190 -121545 -87512 81459 231571 -32746 -72226 179329 -4965 49523
18272 -34947 -142298 55191 128166 -161691 -274640 81251 -156600 80380 -47605 -131334 -40553
18260 -17598 -336121 -145111 93622 -312665 -59891 -182317 -139332 -206445 289997 252918 148349
18249 148349 -122964 -75793 40751 200911 94664 -139689 -258829 219501 160399 -56724
18238 -228246 -231354 103020 9568 79355 56258 207599 178834 -64827 33379 -210750 -71063
18226 -172728 45488 -83982 -226245 -277487 138400 36740 -240397 16746 158172 -209797
18215 -82993 -94264 -32111 -90321 257 -37343 -38114 -129775 -60413 -239838 -248698 -129902 11527
18202 81696 -88580 161885 -84327 75285 62554 -85947 -296766 -162828 -47314 -10191 112415
18190B46902f5101q8311A33714D4541K86994b09646I9911a03846j9231I967c45464
18178h5468l00A915O2049b72208Q8310K5867f4705B679M1993a30965A30158m4463
18166H5695N4734a95036A64204c59223J12505d165E8060R5753a32881J8506A16323
18154f5788C9688i7734A59319C888J45572O2921a49196F3710J7242b7482J604
18143b5878C19851d6112l53492A334J18072a06646N942j7211M1518B6694K4169
18132E0863a91255D5934a5623p5293A30695J15778d8749j66389I3285J8034l85
18121A10934B9059a23529C21290a12198C36841a8641p6053L2813n4814M6609A43282
18109D3177J87132E8187J40792c25329A82448g3000j43098d7929k733A94451H813
$$ plain form
18190 246902 -65101 -153412 133714 44541 331535 -209646 99911 -103846 -123077 9967 -345464
18178 -85468 -85768 1915 63964 -272208 -183898 -158031 -64705 2679 44672 -130965 130158 85695
18166 85695 140429 -195036 164204 -359223 -246718 -4165 58060 153813 -132881 -114375 116323
18154 -65788 39688 -97734 159319 3888 149460 212381 -149196 63710 80952 -27482 -25878
18143 -25878 319851 -46112 -399604 1334 119406 -106646 -100704 -117915 -76397 26694 50863
18132 50863 -191255 45934 -15623 -90916 130695 246473 -48749 -215138 93285 111319 110934
18121 110934 29059 -123529 321290 -112198 336841 -18641 -94694 -61881 -116695 -70086 143282
18109 43177 230309 58187 198979 -325329 182448 -73000 -216098 -47929 -50662 194451 8813
18097B91457d7316F3183a62983j22169D12170D2804c12644A68151g4783R329n6945
18086a22399B2445a08881A67905a42172M3641A0773c0126B67347j11383J48184
18076C04148O5778d329l17767A0138e4324A52463B8967c70555A93888p9841Q1375
18065A95422c4929j26420B00727J43128a60191j63240E4331c8833N841A5791f2477
18053D5294c7392A43164g3372B0571J0437c29503D0407c9946B8266a36296B39303
18041C32092g7923A93350E9648J7548C0867b86407a9829K481A64564C0636a6339
18029a46690f1188B95721c2120r669A25508h302H5259b23955B02758R349A03715
18017a16718E1938b290B80030g1346B17133I1837c76464J63889B63464C6216J17801
$$ plain form
18097 291457 -47316 63183 -162983 -285152 412170 42804 -312644 168151 -74783 -65454 -122399
18086 -122399 22445 -108881 167905 -142172 -98531 10773 -30126 267347 155964 304148
18076 304148 369926 -4329 -322096 10138 -54324 152463 28967 -370555 193888 114047 195422
18065 195422 -34929 -161349 200727 343855 -160191 -323431 54331 -38833 -32992 15791 -62477
18053 45294 -37392 143164 -73372 20571 31008 -329503 40407 -39946 28266 -136296 239303
18041 332092 -77923 193350 59648 77196 30867 -286407 -19829 -17348 164564 30636 -16339
18029 -146690 -61188 295721 -32120 -41789 125508 -8302 85259 -223955 202758 212107 103715
18017 -116718 51938 -2290 280030 -71346 217133 91837 -376464 -212575 263464 36216 154017
18006A54017c39858B14610A3278J91398a25980A05913f1815A50299G3738a67171
17995A36044b64600i3286A45330a02231I5064N0163E1935A3538i2808C44762d7340
17983e9278A11627Q0989a80996b4363l0330k57229J31243A8526a41548q3959P5286
17972a50221n0835B53386N1035b4567H7969K40974b31815a6775F274J64298d8087
17960B5942J46491b2641O268A53628J3069D8562a66143g1799I4421C6669Q8609
17949A25278b59816A76780c9579A38653K7438B0542J01170J4848A5662N9254K06610
17938B81526a68324j0814A42281C8208b60081J22028f0425j30476I6411a00310
17927G4058B4656b08942D474J67671K3914B9573J4053L02216E7023i7528j8667
$$ plain form
18006 154017 -339858 214610 13278 204676 -125980 105913 -61815 150299 73738 -167171
17995 136044 -264600 -93286 145330 -102231 95064 145227 51935 13538 -92808 344762 -47340
17983 -59278 111627 192616 -180996 -24363 -54693 -311922 -180679 18526 -141548 -225507 -150221
17972 -150221 -201056 253386 304421 -24567 87969 328943 -231815 -16775 6274 170572 -48087
17960 25942 172433 -22641 -16373 153628 166697 48562 -166143 -71799 94421 36669 125278
17949 125278 -259816 176780 -39579 138653 166091 20542 121712 136560 15662 74916 281526
17938 281526 -168324 -179138 142281 38208 -260081 -138053 -60425 -190901 96411 -100310
17927 74058 24656 -208942 4474 172145 196059 29573 43626 345842 57023 -97528 -116195
17916a16195C47620h9564A73622d3163B88480j04048G7587b0010C696b83151F7119
17904C1663a5152B84230j09447c99367f0956A90195m1376N8028h7425I3318F383
17892F2476g1389r9161B72600o5687a25586k21686A05622a675A22557R8996c76823
17880F4372O6895c7806D72a01004l1334j51608q3178J01747J15646q0135D1296
17868F1876K1922n411Q3495G4519a51484A4720a17396D8930a74724b3930A3427
17856A60305E9422M8542C2027L37414a22223N1624B37915a92069B1811a29505
17845i3050B04990G8118P8840D6786a43983C20481C3148J53149g8727F276A295
17833A60853F0220g0148A92236a22390P64I9858J67023b5537A05278J74302A02189
$$ plain form
17916 -116195 347620 -89564 173622 -43163 288480 184432 77587 -20010 3696 -283151 67119
17904 31663 -15152 284230 174783 -399367 -60956 190195 148819 206847 -87425 93318 6383
17892 62476 -71389 -170550 272600 206913 -125586 -347272 105622 -1675 122557 221553 -376823
17880 64372 131267 -37806 472 -101004 -132338 -283946 -367124 -265377 -149731 -229866 41296
17868 61876 83798 78387 161882 74519 -151484 14720 -117396 48930 -174724 -23930 13427
17856 160305 59422 107964 32027 369441 -122223 -70599 237915 -192069 21811 -129505
17845 -93050 204990 78118 156958 46786 -143983 320481 33148 186297 -78727 6276 1295
17833 160853 60220 -70148 192236 -122390 -121626 99858 266881 -25537 105278 279580 102189
17821I6955j4017R7464K39113a6409A28947b1786o010h811A53188k1938a9973
17809b73774a12263B99428a02855A39394k5391a17055C3021K2542k0330J35460
17799A70693j2215M5301J7831C6185B936a4892A15780E2112i4380C26892E3624
17787A28117e0199C60152A04622D6531Q141P2596g9096p8811J1242A58723n0447
17776A08276D424h6659c8842j9171B43548a78297a9459B19610b24328A04211K2081
17765A26292a82458a2933C8353a03380G7356p752K31212I3425J424O3881E4824
17753D5132d215A74676B329c2586A79669J67531A4734a31893B96875E1088L67711
17742D18799B05067k8151L88056A45699a6496q9392A4772a00204J2473E4182a0169
$$ plain form
17821 96955 82938 180402 419515 -16409 128947 -21786 -27796 -8811 153188 131250 -19973
17809 -273774 -112263 299428 -102855 139394 114003 -117055 33021 55563 35233 170693
17799 170693 158478 203779 221610 36185 2936 -14892 115780 52112 -94380 326892 53624
17787 128117 -50199 360152 104622 46531 54672 127268 -79096 -157907 -146665 158723 108276
17776 108276 4424 -86659 -38842 -58013 243548 -178297 -19459 219610 -224328 104211 126292
17765 126292 -182458 -12933 38353 -103380 77356 69604 300816 93425 94849 158730 54824
17753 45132 -4215 174676 2329 -32586 179669 347200 14734 -131893 296875 51088 418799
17742 418799 205067 176916 564972 145699 -16496 -105888 14772 -100204 -87731 54182 -10169
17730A67306o2149d4743G0049c5786C69576h3517B83290h2629A99222I088e4342
17718I1224c998C55962b21532A8681K04555a09473F7179L36470A1839J50299J21482
17707B83620h0989I7738D5192J71929O4888O473b34435C10022F7737a71805h3763
17695A2670L3313H642e675H5902A4112L74727j71556h5200A83011l4625H987c69334
17682A05816j5788g9216A67470k1518J02165H3790a43581f6274k5846E1215J70872
17671B22087p2241g6331C27588j36546N1104d4635B75811a27941PB19875a94816
17659C12804i0328j96014A31422J06255k8372J61753j17270B0494Q118J45145
17649A73757N8840a70187g5153a0002B27248J99490k00186Q4873j47043B2833
$$ plain form
17730 167306 105157 -44743 70049 -35786 369576 -83517 283290 -82629 199222 9088 -54342
17718 91224 -3998 355962 -221532 18681 223236 -109473 67179 403649 11839 162138 283620
17707 283620 -80989 97738 45192 217121 282009 288482 -234435 310022 67737 -171805 -83763
17695 12670 45983 8642 -5675 85902 14112 388839 217283 -85200 183011 148386 8987 -369334
17682 105816 90028 -79216 167470 145952 248117 83790 -143581 -66274 -92120 51215 222087
17671 222087 149846 -76331 327588 191042 242146 -44635 275811 -127941 -127934 219875 -194816
17659 312804 -90328 -286342 131422 237677 209305 371058 253788 20494 28612 173757
17649 173757 232597 -170187 -75153 -10002 227248 426738 226552 311425 164382 22833
17638a62740c0818n2270D47808a27996J0509A94045D2759b9273A69506m2780J36502
17627B63228d9634j73264M1144A16142j7479n136J75462C8864J12480J65720M6432
17616C63496A09312M4095M19006H7211B525K44358o8835K69835a19535l6932B59240
17604G7581L66097b0364B32230a96108A54480A4935L2036f1862r5809f8094C63857
17592B69112H8559J14728j2195J11554J42253A37269Q7670j00274j2098J16762
17582B29329c29139A86455n4359J11661G2320b9958D43362k0950D5457N6283M15126
17571E16866k05654i9302C9564J39805J97327q6582j06035C2464O6083f7705D73610
17559a6269I7468J66764J17471j02477J31547n7682P5291A61499j0840L6196o6680
$$ plain form
17638 -162740 -30818 -83088 447808 -127996 -117487 194045 42759 -29273 169506 126726 263228
17627 263228 -49634 -222898 -181754 116142 98663 93527 268989 38864 151344 317064 363496
17616 363496 109312 153407 572413 87211 2525 246883 178048 447883 -119535 -156467 259240
17604 77581 443678 -20364 232230 -196108 154480 14935 46971 -61862 -157671 -68094 363857
17592 269112 88559 203287 191092 302646 444899 137269 224939 124665 112567 229329
17582 229329 -329139 186455 132096 243757 72320 -29958 443362 422412 45457 101740 516866
17571 516866 311212 -99302 39564 179369 376696 290114 184079 32464 98547 -67705 473610
17559 -16269 97468 264232 381703 279226 410773 353091 428382 161499 150659 186855 120175
17548A20175a42611E33871I7323J35538c7962J1291B64229L425j05406J07916
17538B70164K02804i860D7800K9147K42790a72945A94292O2898J14747K02A50250
17526C78769L0073A65220M49575d7863C65654j06640J80107J23518j73011J49372
17516E39000o9198j09187I8711J59534Q5515J1482n818l5024k4368J06886A48872
17504D09592r9532H6329N9748K6168p4389J36701C9204L90544c499B0559L56575
17493C77134q191J17657L29880k63257A95457J64013L4401j93989J85258Q2682
17483D67822j89825r5503K47169j14472Q1043j25379j05192K40379j16122r405
17473B80515L65613J26527C28869M86816j91316j17036B20663K43131K33368A10110
$$ plain form
17548 120175 -142611 533871 97323 232861 -37962 -26671 264229 267654 162248 270164
17538 270164 472968 -9860 47800 76947 319737 -172945 194292 257190 371937 372139 150250
17526 378769 408842 165220 614795 -47863 365654 259014 439121 562639 389628 539000
17516 539000 469802 360615 98711 258245 343760 355242 349424 314400 290032 396918 148872
17504 409592 310060 86329 146077 172245 97856 234557 39204 429748 -3499 20559 377134
17493 377134 368943 486600 816480 553223 195457 359470 393871 199882 385140 467822
17483 467822 277997 182494 429663 315191 396234 270855 165663 406042 289920 280515
17473 280515 646128 772655 328869 815685 624369 507333 220663 463794 697162 110110
17462C29470K06433j87458J9426j42631J6417O6427J33857j78443q7742L90983
17452E66739o0854A25828M65401k10436N57487C65246J95691L20212L23246j22385
17442A082010r3074J6916k97934o5181j35377J39126m0853o8486K37576j49075
17432F25648j35247m0036J99069l3775j5714k20751L16245K3782j23447j32413
17422D63361k7141L34299j66440P9323k74906J03470j41967K03232L72665J80216
17412A126112l09235L05741k82979J07612k24338k44213p5306J16181A81340R9493
17402B80833o7194J02583j5001p0336L92191k60453A13543K65562J96626P1739
17392F47470k56276L419P712a7192D03789J33454o4717r5106m770J07937B12810
$$ plain form
17462 329470 535903 348445 367871 225240 241657 308084 441941 263498 175756 566739
17452 566739 505885 125828 591229 380793 938280 365246 560937 881149 1204395 1082010
17442 1082010 988936 1005852 707918 642737 507360 646486 605633 537147 774723 625648
17432 625648 490401 450365 649434 615659 599945 379194 695439 719221 595774 463361
17422 463361 436220 770519 604079 683402 408496 511966 369999 573231 945896 1126112
17412 1126112 816877 1122618 839639 947251 722913 478700 403394 519575 181340 280833
17402 280833 213639 316222 301221 230885 623076 362623 113543 379105 575731 647470
17392 647470 391194 394613 402325 -17192 403789 537243 472526 377420 372650 480587 212810
17380D46035l0262A99525K47231j01303o2600k1907L51147k51782G8418K37116
17370C15534J4884k5445K17627p6887l6625j24629J30351n7030J86904k39502
17360C05182F5380K53077j39546L38224B03596J60889J23904a34907C68585J18759
17350D87344j04883H4173L19399K06075B04381j0184J31554J43585H9318L69045
17340D58363j64838R3351J77278j76901K33829k29890J33788B16803L06837p4067
17330D49573n4749A69234J44668K0845J7177c3374C75002J60033B24118J61151
17320C85269L3216o5149J54426E2724L8312K97373N5227A70229N30396C20488
17309F84766k64152J87084k94569J9973L0758O286j40528J98466L35590l49717
$$ plain form
17380 446035 415773 199525 446756 345453 282853 260946 612093 360311 78418 315534
17370 315534 330418 304973 522600 445713 409088 284459 414810 357780 544684 305182
17360 305182 65380 318457 178911 517135 203596 364485 488389 -134907 368585 487344
17350 487344 382461 84173 403572 609647 204381 194197 325751 469336 89318 458363
17340 458363 293525 386876 564154 387253 621082 391192 524980 216803 523640 449573
17330 449573 394824 169234 313902 334747 351924 -33374 375002 535035 224118 385269
17320 385269 418485 353336 507762 52724 91036 388409 443636 170229 700625 320488
17309 684766 420614 607698 313129 333102 363860 370146 229618 428084 763674 413957
17299D13957K5604r9252A68868J52242K28058j59907K3507j74960L46497o5493
17289E18812L5003H2918K31421J25125j08592J55637j57736A44940J70500l399
17279C12041j2641J65369K4122L0462d1430C81827o2807L09195A98157R5843K09816
17268E03816n2204P4660K7546j83233O1000L0485l4079K05894j16199j54743J04616
17257D67559J12092k41783O0852K18540J331k23540J01847B38703L39524R6317
17247F74544J59007A32571M58228L6890r0610K9091M475r5905B22512K17531R0350
17236E30393J27433k17456L8585k24623M69552C51530J64198j9718P166J93471
17226F96647k51891L9083j91537M20479k1694k8571M6668B84291M92748j91749
$$ plain form
17299 413957 439561 340309 168868 321110 549168 389261 412768 237808 584305 518812
17289 518812 553815 82918 314339 439464 330872 486509 328773 144940 315440 312041
17279 312041 299400 464769 488891 519353 -41430 381827 319020 628215 198157 294000 503816
17268 503816 451612 526272 553818 370585 431585 462070 427991 633885 517686 362943 467559
17257 467559 579651 337868 398720 617260 618591 395051 496898 238703 578227 674544
17247 674544 833551 132571 590799 627689 537079 566170 570645 474740 222512 440043 530393
17236 530393 657826 440370 478955 254332 723884 351530 515728 496010 503176 696647
17226 696647 444756 483839 292302 712781 691087 662516 709184 284291 777039 585290
17216E85290j30522L0786J07138J489j94041J13349K48219j38406R5316j47824
17206E70794o1840J22440r5395K6443J6224M8086j2053N6764J40836l38630j40293
17195C33376N15636R7047C92959K51372q7269Q6019q8550L88172l39256N3690
17185F57137K46879l84557J21024K5712l16984R8190m5358J85519j80674P425
17175D14313M02971L5614C62752K63148n9661J53231k21669N109M41568j64844
17165G79634L1532j08294l325l8219K4456J37485j6753j3042p3134L60365l09932
17154G70773L03745k92476k33563M24044j14177C98239O42298k72021j13575l4992
17144F19949P1818j4817L34627q1401C77077M97808m7326J91934m7464K32504
$$ plain form
17216 585290 454768 485554 592692 594181 400140 513489 761708 623302 718618 570794
17206 570794 508954 631394 535999 562442 578666 626752 614699 671463 812299 473669 333376
17195 333376 849012 946059 392959 644331 557062 643081 554531 942703 603447 657137
17185 657137 904016 519459 640483 666195 349211 447401 402043 587562 406888 414313
17175 414313 817284 852898 362752 625900 566239 719470 497801 502910 944478 779634
17165 779634 811166 702872 699547 661328 685784 823269 806516 793474 720340 1080705 770773
17154 770773 1074518 782042 548479 972523 858346 398239 1040537 768516 654941 619949
17144 619949 691767 676950 1011577 930176 377077 874885 827559 1019493 972029 1204533
17134A204533l50320L0126k59843K02243j61024K7994J94797j233k07643o2923
17124F16707K71648j79993L54473k65933J70202m03880O58853n47555M25320m06245
17114F93597L08472k17866K14249j03444M36535E33509L37231m818K85195l91391
17104G59726M92950k01699k37180O2901K06870J13735E03015K08567N21757j40148
17094A093191J51081m0272J0240j25382q0399k9331L04900j23966k3682J04394
17084A240774K52050l24627k04917L36099R3625o0894l24938J13554j48660K22909
17074A194975R6988J29237O6012j15346L3512j36515K30026k93878o5584L9701
17064A179128m4143n89M62975j15148m50928J97792k7740L26062m01387N19334
$$ plain form
17134 1204533 854213 884339 624496 826739 665715 693709 888506 887273 679630 616707
17124 616707 888355 708362 1062835 796902 967104 563224 1222077 674522 1099842 693597
17114 693597 1002069 784203 998452 895008 1331543 533509 870740 865922 1151117 759726
17104 759726 1252676 1050977 813797 876698 1083568 1197303 503015 711582 1233339 1093191
17094 1093191 1244272 1204000 1214240 1088858 1008459 979128 1284028 1160062 1136380 1240774
17084 1240774 1492824 1168197 963280 1299379 1393004 1332110 1007172 1120726 972066 1194975
17074 1194975 1291963 1421200 1487212 1371866 1405378 1268863 1498889 1205011 1139427 1179128
17064 1179128 1134985 1134396 1597371 1482223 1031295 1229087 1201347 1527409 1126022 1645356
17054A645356n57349K19036j21853K29225k2958L0030j906n8660j74448K29574
17044A416047j14288J1773j08351j7569j05517M67216j08604k36089L63107j91140
17034A376585M4080J74672k28299L8568q5025O9467m3847J6974j1654Q7137K82365
17023A721023k58751J42157k21098L64321m3665j20978o0136K03859l7328m02865
17013A286539J36745L45829J9903k12170K35149J08104k39760K2345K66140l08291
17003A660533R802L64380l79570M5435J99174j20869k98526M00462j31949J67888
16993A916760J11474p8265J63675m5345q2675Q3816m20071K04266K16354j26531
16983A943458K42147k51566R6133k20319M73071j52805M3977J76222o93022M46868
$$ plain form
17054 1645356 1088007 1307043 1185190 1414415 1391457 1421487 1419581 1360921 1186473 1416047
17044 1416047 1301759 1313532 1205181 1187612 1082095 1549311 1440707 1204618 1567725 1376585
17034 1376585 1420665 1595337 1367038 1405606 1320581 1390048 1346201 1363175 1351521 1438658 1721023
17023 1721023 1462272 1604429 1383331 1747652 1703987 1583009 1522873 1726732 1689404 1286539
17013 1286539 1423284 1769113 1789016 1576846 1811995 1920099 1680339 1702684 1968824 1660533
17003 1660533 1670335 2034715 1655145 1700580 1899754 1778885 1480359 1880821 1748872 1916760
16993 1916760 2028234 1949969 2113644 2068299 1985624 2069440 1649369 1853635 2069989 1943458
16983 1943458 2185605 1934039 2030172 1809853 2282924 2130119 2174096 2350318 1657296 2104164
16973B104164n2968J08031o5315K51309j33277r0849K35023j20829O9324l67352
16963A937261M81246n6574k12350M04146j59999J76049k74042q221j82832N76676
16953B681360Q8323l63419J30647o5023J22686R9754m6225J46124Q9849l90006
16943B494070J15711J09602j7218J28915J60877j30705N6969j02379M6153L45721
16933C207716l19689K81849k99467L56331j53094J04886l63103M52990l23301
16924B945118L18677K60293j11380J34736k48488J22818k42250N79689j88972
16915C570241O7726k15474M17326l12652P1571K94946k72205P01668m67352K68913
16905D124708r1501j26347K79305l38237K26497K09737m1246J97R2488K0524k02822
$$ plain form
16973 2104164 2051196 2159227 2093912 2345221 2211944 2121095 2356118 2235289 2304613 1937261
16963 1937261 2418507 2361933 2149583 2553729 2393730 2569779 2295737 2287516 2104684 2681360
16953 2681360 2769683 2406264 2536911 2471888 2594574 2694328 2648103 2794227 2884076 2494070
16943 2494070 2609781 2719383 2702165 2831080 2991957 2861252 2918221 2815842 2861995 3207716
16933 3207716 2888027 3169876 2870409 3226740 3073646 3178532 2815429 3268419 2945118
16924 2945118 3263795 3524088 3412708 3547444 3298956 3421774 3179524 3759213 3570241
16915 3570241 3637967 3422493 3839819 3527167 3598738 3893684 3621479 4323147 3855795 4124708
16905 4124708 4033207 3906860 4186165 3847928 4074425 4284162 4242916 4243113 4335601 4356125 4153303
16894D153303J37940K77787Q0514j14055J59362J94399l28923j04289J55103J28721
16884D739862K63857J05378N3281L66627k33929K77536j63515j48184J54216k5960
16874E389169L25464k77059M62243J02405o6913k14611K41635j73365M18527J24530
16864F332025N4334k74835M52591j87627J25602M3280l5621L93472k03610K80658
16854F980269K1051K31471l0635K50997k52634J15254N04552O5476p1713N2579
16844G866667N32357j50820l0399K91929J50411J49764J46001N0279k8275J5580
16834H993494N65031m6301j94681M53024L53000J22123L0719P0629N17406k57536
16824A0606908N01601J60132J19006J55973K07595K79942O6629N7983R4878J76816
$$ plain form
16894 4153303 4291243 4569030 4649544 4535489 4694851 4889250 4560327 4456038 4611141 4739862
16884 4739862 5003719 5109097 5162378 5529005 5295076 5572612 5409097 5260913 5415129 5389169
16874 5389169 5714633 5437574 5899817 6002222 5935309 5720698 5962333 5788968 6207495 6332025
16864 6332025 6386359 6111524 6564115 6376488 6502090 6545370 6509749 6903221 6699611 6980269
16854 6980269 7001320 7232791 7202156 7453153 7200519 7315773 7820325 7885801 7814088 7866667
16844 7866667 8399024 8248204 8217805 8509734 8660145 8809909 8955910 9006189 8977914 8993494
16834 8993494 9558525 9512224 9317543 9770567 10123567 10245690 10276409 10347038 10864444 10606908
16824 10606908 11108509 11268641 11387647 11543620 11751215 12031157 12097786 12155769 12250647 12427463
16814A2427463P36823J20716k0512L94081Q7683M72311L05132L54454K3305K10963
16804A5112419M39938J11267M39844K45741K76451L32151J63909N00872O98078
16795A8320670O7911L10690O24577M57958M00164J03326M07322O68119M20175
16786B1780912P37618K00939N85802O26246J94403P61703Q76144P5115P05224
16777B6544106R14722L69681N86828N77214O00321J036209K24699J302855P00529
16768C2857164Q96679O18578R93431Q37316J020239P26112J329692O05172J259097
16759D1143480J216287R52470J192211J081039Q37188J847695R55623J332016
16751E0558009J257348J688093R93962J939270J129404J758294J383977J631537
$$ plain form
16814 12427463 13164286 13285002 13264490 13658571 13746254 14218565 14523697 14878151 14901456 15112419
16804 15112419 15552357 15663624 16103468 16349209 16625660 16957811 17121720 17622592 18320670
16795 18320670 18388581 18699271 19323848 19781806 20181970 20285296 20692618 21360737 21780912
16786 21780912 22518530 22719469 23305271 23931517 24125920 24887623 25763767 25838882 26544106
16777 26544106 27458828 27828509 28415337 28992551 29592872 30629081 30853780 32156635 32857164
16768 32857164 33753843 34372421 35365852 36203168 37223407 37949519 39279211 39884383 41143480
16759 41143480 42359767 43312237 44504448 45585487 46422675 48270370 49225993 50558009
16751 50558009 51815357 53503450 54497412 56436682 57566086 59324380 60708357 62339894
16743F2339894J843835J301605J877249J484732K020936J276991J873348J739896
16735G5758486K099128J628193J573638J849096J715982J590796J574814J244888
16727H9035021J491204J592597R19534J608396J086409Q17597J160445P22105
16719I8433308N95665M97071N70401m2498L07125p00028L05958n08137n90919
16710I8867946o65848p89828j133354j228359r49759j250378j400149j546426
16702H9903845j562728j551370j929184j452517k035192j406558j929066j973984
16694G6063246j688045j951915j828473j588556j964660j830121j973939j496436
16686F1741101j734149j683609j949833j219471j799678j184313j472588j366302
$$ plain form
16743 62339894 64183729 65485334 67362583 68847315 70868251 72145242 74018590 75758486
16735 75758486 77857614 79485807 81059445 82908541 84624523 86215319 87790133 89035021
16727 89035021 90526225 92118822 93038356 94646752 95733161 96550758 97711203 98433308
16719 98433308 99028973 99526044 100096445 100053947 100361072 99661044 99967002 99458865 98867946
16710 98867946 98202098 97412270 96278916 95050557 94100798 92850420 91450271 89903845
16702 89903845 88341117 86789747 84860563 83408046 81372854 79966296 78037230 76063246
16694 76063246 74375201 72423286 70594813 69006257 67041597 65211476 63237537 61741101
16686 61741101 60006952 58323343 56373510 55154039 53354361 52170048 50697460 49331158
16678D9331158j680842j209562j476879q42665j697161j077202r74093j383870
16670C8988884j028015j025821q97489j049603r72417j060958n39010r37276q63309
16661C0614986n67373j098668q95690n88538l81998j061576o19810l71720r79308
16652B4050305k79617q69032l09711n54643m19218r88825l33349m67881J4739
16643A9842768q56352l64832m35657p18129j68466k83165n57702k42004L7427
16634A6253888o46130k89647m66087l02680m17358j83758k66057l05712o43001
16625A2733458J16431r7303m94664k60054k49737k11040n7876j4924n29726j19071
16615A0815494j57235o7372k32908k78955n62730J12052Q3613l24899j73248J75312
$$ plain form
16678 49331158 47650316 46440754 44963875 44121210 42424049 41346847 40372754 38988884
16670 38988884 37960869 36935048 36037559 34987956 34015539 32954581 32415571 31478295 30614986
16661 30614986 30047613 28948945 28053255 27464717 27082719 26021143 25401333 25029613 24050305
16652 24050305 23770688 22901656 22591945 22037302 21618084 20629259 20295910 19828029 19842768
16643 19842768 18986416 18621584 18185927 17467798 17299332 17016167 16458465 16216461 16253888
16634 16253888 15607758 15318111 14852024 14549344 14131986 13948228 13682171 13376459 12733458
16625 12733458 12849889 12752586 12257922 11997868 11748131 11537091 11479215 11464291 10934565 10815494
16615 10815494 10658259 10590887 10357979 10079024 9516294 9628346 9711959 9387060 9213812 9389124
16605I389124o03922J95578k64565r5911o20948L01289l38696k44762M83818o58664
16595G542341j16722j45765k67999M56629l67421K4625j75555m58742J21782k88930
16585F324243L12149q1251k12453k17619L2164l73966L70094m31997L14143q11309
16575E224198O82125k68582q9194r7526k02644J00064j77545m15687J85701l28250
16565D612660L06239N6739j87960j33237O180l56815J41354o8374K1605k27978
16555D170413j52486J86733k69751J53095M49478k39535n66585K7360K4203K34485
16545D017410j7718k19664l35272M65464o81850K59540k50271q3349K38707m7531
16535C345466j7481k1035O0202J37387l00954j08816P6440J5366o31264O43610
$$ plain form
16605 9389124 8785202 8980780 8716215 8620304 7999356 8300645 7961949 7717187 8201005 7542341
16595 7542341 7425619 7279854 7011855 7468484 7101063 7125688 6950133 6491391 6613173 6324243
16585 6324243 6636392 6555141 6342688 6125069 6157233 5783267 6153361 5721364 6035507 5224198
16575 5224198 5906323 5637741 5548547 5451021 5248377 5348441 5170896 4755209 4940910 4612660
16565 4612660 4918899 4975638 4787678 4654441 4660621 4303806 4445160 4376786 4398391 4170413
16555 4170413 4017927 4204660 3934909 4088004 4537482 4297947 3731362 3758722 3782925 4017410
16545 4017410 3999692 3780028 3444756 3910220 3228370 3487910 3237639 3154290 3392997 3345466
16535 3345466 3327985 3306950 3367152 3504539 3203585 3094769 3171209 3186575 2555311 3198921
16525C198921k16437m8263K39932j64666m2380k42464K46369N1810m82673K47027
16515B787176p7444O8479m2753o5871J10121j12995k86635O8360k68086M78784
16505B659136l00851k78872L78528j3402k88322K12138j38643j9089L71829l03107
16495B279345O1608j71226k68737K02587j24904r9682K45533L6649l82553K85654
16485B064274l66484K99033O3679J8893j55343j54775q4710m9062P4156J78859
16475A888520P5801n1774j50284q9737J13342j9202J83008o17695K82222J75814
16465A790015k42530J70600K39259n99845L08481j79061o4331N53168j19355j44850
16455A711551l14683L0989K83507n19536J15401J91450o7059Q0828J62730m46939
$$ plain form
16525 3198921 2982484 2934221 3174153 3009487 2967107 2724643 2971012 3022822 2540149 2787176
16515 2787176 2709732 2778211 2735458 2669587 2779708 2666713 2380078 2448438 2180352 2659136
16505 2659136 2358285 2079413 2457941 2444539 2156217 2368355 2229712 2210623 2582452 2279345
16495 2279345 2340953 2169727 1900990 2103577 1978673 1878991 2124524 2161173 1778620 2064274
16485 2064274 1697790 1996823 2060502 2079395 1924052 1769277 1684567 1635505 1709661 1888520
16475 1888520 1964321 1912547 1762263 1672526 1785868 1766666 1949674 1331979 1614201 1790015
16465 1790015 1547485 1718085 1957344 1357499 1665980 1486919 1422588 1975756 1856401 1711551
16455 1711551 1396868 1427857 1711364 1191828 1307229 1498679 1431620 1512448 1675178 1228239
16445A228239L85719m01407M0255q3282R1401L97606p48174M47272j934o4989
16435A290706k85291J04895L5767O1764p3818j3134K8788M95157o60968M29749
16425A413615k81340o1903R5664R6154q2088J03745l59034J2036j86846N30879
16415A280882j46619J10042l07199M4087J60935K7852m2603j19186q9518k94352
16405F24321r6063L70387K72746k26729J06704m01835j19499K97991K36688k93666
16395G71045K14721o8429L30507k68459J1883j90090J75640K3588C94068K83067
16385F77135L29675j36474K56822m57482K77225j7461o4512m6293K26856l61342
16375F84149M2318Q6672M3402q0123j56647L26751j63755k49250N970J36381j24832
$$ plain form
16445 1228239 1613958 1212551 1252806 1169524 1260925 1658531 910357 1357629 1355695 1290706
16435 1290706 1005415 1110310 1146077 1207841 1134023 1120889 1149677 1644834 983866 1413615
16425 1413615 1132275 1070372 1166036 1262190 1180102 1283847 924813 936849 750003 1280882
16415 1280882 1134263 1244305 937106 981193 1142128 1169980 1127377 1008191 918673 624321
16405 624321 528258 898645 1171391 944662 1051366 649531 530032 828023 1064711 771045
16395 771045 985766 917337 1247844 979385 991268 801178 976818 1000406 394068 677135
16385 677135 1006810 870336 1127158 669676 946901 929440 864928 818635 1045491 684149
16375 684149 726467 813139 856541 776418 619771 946522 782767 533517 539487 675868 551036
16364E51036P8831J38231o3647P8665p928j31717K5026l15682K86763L92970j64967
16353H67581j50257j74866K09270K41391l05827j93553J87557K7211r4551K54029
16343H67985l84918j52805J92952L28345p3768o9164j00128J62516o3609k01290
16333E06116J73131J24066l06545J595J25115R4632j22387o6606K36480o0301
16323G05296j07112k337k21137J35074j38663K11029O0326J24662l01358q1222
16313C84558N9987K46789j33523k2569p9123j09663J96665l1968r0322K94711
16303G15542A72676J29696J23851J44374j0086j01570K81445j53758k347n2935
16293E31346J75342k61946c5490D59737A58665L62962n4435J14341k48472N0482
$$ plain form
16364 551036 629867 768098 704451 783116 775188 643471 668497 352815 639578 1032548 867581
16353 867581 717324 542458 751728 993119 687292 493739 681296 708507 613956 867985
16343 867985 483067 330262 523214 851559 777791 708627 608499 771015 707406 506116
16333 506116 679247 803313 496768 498363 623478 718110 595723 529117 765597 705296
16323 705296 598184 595847 374710 509784 371121 582150 642476 767138 465780 384558
16313 384558 444545 691334 557811 535242 456119 346456 543121 511153 420831 715542
16303 715542 172676 302372 426223 570597 560511 458941 740386 586628 584281 531346
16293 531346 706688 444742 -35490 459737 158665 521627 467192 581533 333061 383543
16283C83543r5179L79272C13381l167J36907M13j39153K43900j06665K72333C40576
16271F60803k40963L01206A04225N2802K99350m0898q6829J03484L00505B49850
16260C31620J48736m5371J14593j65883K59984l03597A09921P0693J29864p1100
16250B39378K3690k7862N6093E2175O56820j62575I9925b6474A69484N3255L6848
16239B59587J17226J77429k30592K07163k47150P5802l0104K0003K62348B98099
16228D83420B21510K99117b4000C91459o4155q9773J56625j94915J25447E6855
16217C05739J08610a15510A62606A2336M49174I3494O2894m8994J78464P0008
16207C55866j32419J35620j73475J38334n8432A02608c841B83662j31969K96286
$$ plain form
16283 383543 288364 667636 313381 310214 447121 447534 308381 552281 445616 717949 340576
16271 660803 419840 721046 104225 157027 456377 415479 328650 432134 732639 249850
16260 331620 480356 434985 549578 383695 643679 340082 109921 180614 310478 239378
16250 239378 263068 235206 291299 52175 708995 546420 99925 -26474 169484 222739 259587
16239 259587 376813 554242 323650 530813 283663 359465 329361 349364 611712 298099
16228 483420 221510 520627 -24000 391459 327304 237531 394156 199241 324688 56855
16217 305739 414349 -115510 162606 12336 461510 93494 156388 107394 285858 355866
16207 355866 223447 359067 185592 323926 265494 102608 -3841 283662 151693 447979
16197D47979A69593a44772B13453K30925B03642K19211e7566a3961D16058j17818
16187B98240r8492l8366R9212O4243L3057o3168j12871d6592a5758C41127L5717
16176C76844B3525K76776p3348o288H7098L4129K45665E1530Q9230J05506q9832
16165A56434l8895R2821Q621L8480L8170j08862m3087k5049J16766P1532L6966
16154C43897j44133J23392J24523D4757M0019N73076A21135J31372K4412j00291
16144A76628N9172p0017J21409E9608L8190L25721A41801N2647p3983J96217Q613
16133C25295O6894j12912J12532D4048J02817N0123p3488N6681H9130J21273D7278
16121C06179m1123l9398j02363J1186o1711K28816q005f0444B14606J54636A08877
$$ plain form
16197 447979 169593 -144772 213453 444378 203642 422853 -57566 -13961 416058 298240
16187 298240 199748 161382 260594 324837 357894 294726 181855 -46592 -15758 341127 376844
16176 376844 23525 300301 226953 220665 87098 121227 366892 51530 140760 246266 156434
16165 156434 117539 210360 218981 257461 295631 186769 143682 118633 235399 306931 343897
16154 343897 199764 323156 447679 44757 84776 657852 121135 252507 276919 176628
16144 176628 235800 165783 287192 59608 97798 423519 141801 194448 120465 316682 325295
16133 325295 392189 279277 391809 44048 146865 196988 123500 180181 89130 210403 47278
16121 306179 265056 225658 123295 134481 72770 301586 293581 -60444 214606 369242 108877
16109A13162r057m2226J26115A5712K71351q7369e0202C86551j51577C9923M275
16098D4198J35587d3032D6067K3296K4082K19683J76642Q6717A03498J11822K2715
16087B38035j4002L26792B44890A03805K18927j46966e684A7566L55840j3317
16077C60089j75819C6014P9234J26233K02655a39671B06126k080r7160k6314c27370
16065B70311h0077C07219E209K46598D6891a81856G9752K05528A23399K59968
16055C83367L22746A6006K08986J5284a50087C60314p9001f9296J1890D3190a1683
16043A74952l4900A5847d3257B53180A22377R9463j05442J62798l1076G847M0671
16032D8518f0620C02357D1933J73776j00542J3317q010J1889l8178L7326a000
$$ plain form
16109 113162 104105 61879 187994 15712 287063 199694 -50202 386551 234974 39923 44198
16098 44198 179785 -43032 46067 69363 93445 313128 489770 576487 103498 215320 238035
16087 238035 224033 550825 244890 103805 322732 175766 -5684 17566 373406 360089
16077 360089 184270 36014 115248 241481 444136 -139671 206126 204046 106886 80572 -327370
16065 270311 -80077 307219 5209 251807 46891 -181856 79752 285280 123399 383367
16055 383367 706113 16006 224992 240276 -150087 360314 281313 -69296 -57406 43190 -11683
16043 174952 140052 15847 -43257 253180 122377 221840 116398 279196 248120 7847 48518
16032 48518 -60620 302357 41933 215709 115167 128484 120474 132363 94185 131511 -1000
16020g2088B59115G6202e1161k752D6806L51158A2130K18797a49220B41770g3982
16008D54647i0578A36230k7925J18757a9238B92457j3551D7347F759K5647K4012
15997E6418N4401L26543o1921j63632J01744L22077k1303J70806K71105J99818
15987A256056n14887A40952A2637K98093j27179K2881c2805k46545J34139m6231
15977a91442A08954J73922p8572C3934J15123m2699K00136a84000M0050D6429
15966F0295M9477K88314j7127D7943M4134l1170a9351c512A22865o13h4432C01994
15953B03008D4376c50656E0251J68533c09339B7386R8991L19792A39956g0830
15942A16033a75553I4340b7945k00755O0545A39425D2484g3220N383B75794C5456
$$ plain form
16020 -72088 259115 76202 -51161 -53913 46806 397964 12130 230927 -149220 241770 -73982
16008 454647 -90578 136230 108305 227062 -19238 292457 278906 47347 6759 32406 56418
15997 56418 110819 437362 375441 211809 313553 635630 614327 785133 1056238 1256056
15987 1256056 741169 140952 12637 310730 183551 206432 -32805 -279350 -145211 -191442
15977 -191442 108954 282876 204304 33934 149057 106358 306494 -184000 -143950 46429
15966 60295 109772 398086 380959 47943 92077 60907 -19351 -3512 122865 122252 -84432 301994
15953 203008 44376 -350656 50251 218784 -309339 27386 126377 446169 139956 -70830
15942 116033 -175553 94340 -27945 -228700 -168155 139425 42484 -73220 -67837 275794 35456
15930a09503b3253A27360g4434F8275M1506J21443j02738J57832p6669B3910J64159
15919A88069L3566a22354E0531J30779K7669b32198A54632a17987J6521L8814
15909f2652A22544l5389B266f0454E0644b25364A30691e9076j43096Q7969b6081
15897i2376j5990B06939J10773F7043b1474B34104j3151C7030J07003h526B47788
15885B2349J67205j6493b25706D5875J9591q53j7306K18162r9476l7656J00333
15874B28670d4216a7224A52708n2442Q2231h6575k64889J71837P5884A45650b1900
15862a36883H4958b87587i9350b6426j29157A84565e6760I7461K03219F585K09538
15851B16123e2783A26133l1862L1259P6929l1031P0490e5647m8396j02154A40052
$$ plain form
15930 -109503 -23253 127360 -74434 68275 109781 231224 128486 286318 209649 23910 188069
15919 188069 221635 -122354 50531 181310 208979 -232198 154632 -117987 -101466 -62652
15909 -62652 122544 87155 2266 -60454 50644 -225364 130691 -59076 -202172 -114203 -26081
15897 -92376 -108366 206939 317712 67043 -21474 234104 220953 37030 144033 -8526 247788
15885 22349 189554 173061 -225706 45875 65466 64613 47307 265469 165993 128337 228670
15874 228670 -44216 -17224 152708 100266 182497 -86575 -351464 -179627 -103743 145650 -21900
15862 -136883 84958 -287587 -99350 -26426 -155583 184565 -56760 97461 300680 6585 216123
15851 216123 -52783 126133 94271 125530 202459 171428 241918 -55647 -104043 -206197 140052
15839c4449B17767F3576J15756J19892j25335n8004n2327a71078A07735D1082
15828a03538B68564a42903K9392n4192j19532k9249L4580j41941A37597b52826
15817a35053A70789p5079J31562H2270n968i3876p9868j20439A53398E6335a46332
15805a4362j77604Q0445A93545b24006e8207E7486K72398A1281N4078b16824r887
15794b26711A5313A201L40824A05479K71860H5386C3887L05436A51977n6990a28842
15782C05338d07195g8656L5902m592j260B10640C8997K25938G7057b0792j48576
15771a69368A42450a21880p5640C31895A7909L13229B3787I083e7808q6923d0565
15759A13931J45620c2985k6548A38863a24575C9813a86214b5430m7842E99805
$$ plain form
15839 -34449 217767 63576 179332 299224 173889 115885 63558 -171078 107735 41082
15828 -103538 268564 -142903 -113511 -167703 -287235 -316484 -281904 -423845 137597 -252826
15817 -135053 170789 95710 227272 82270 76302 -93876 -173744 -294183 153398 56335 -146332
15805 -14362 -191966 -111521 193545 -224006 -58207 57486 329884 11281 65359 -216824 -226711
15794 -226711 15313 1201 342025 105479 377339 85386 33887 339323 151977 94987 -128842
15782 305338 -407195 -78656 -42754 -47346 -48606 210640 38997 264935 77057 -20792 -169368
15771 -169368 142450 -121880 -197520 331895 17909 331138 23787 9083 -57808 -144731 -40565
15759 113931 259551 -32985 -59533 138863 -124575 39813 -186214 -25430 -73272 599805
15748B20538d0134A0221a76528C2314d5264B43868J24910j12865A09601D7481
15737B33050d6728j57313f1320n2845j9453L2148H9862e4127A655a73338A40346
15725e2556b2500B87906a01570B4761i2274q2254l82258A74024n3217D1345D28
15713a901G1769A1535b99717B21222k9689b1993A1015a84793P4745A05779b09842
15701G0813J4115b07666a831p1351L3493j68153B09457r5524J84935f1331A70583
15689C1680J74341c0480D08763a64916C3374g435k93749d6226b0228h291A56855
15677d06759g0310n1718H5520b84281A01748l2503K06719A23255k7806g6746h941
15665I4039a56597r9603A83610Q618k5117a67808k39014D369a26382A17544c9666
$$ plain form
15748 220538 -40134 10221 -176528 32314 -45264 243868 368778 255913 109601 47481
15737 233050 -46728 -204041 -61320 -114165 -133618 -101470 89862 -54127 1655 -173338 140346
15725 -52556 -22500 287906 -101570 24761 -92274 -174528 -556786 174024 120807 41345 428
15713 -1901 71769 11535 -299717 221222 191533 -21993 11015 -184793 -110048 105779 -209842
15701 70813 84928 -207666 -1831 -73182 -39689 -207842 209457 113933 298868 -61331 170583
15689 31680 206021 -30480 408763 -164916 33374 -7435 -301184 -46226 -20228 -8291 156855
15677 -406759 -70310 -122028 85520 -284281 101748 69245 275964 123255 95449 -76746 -8941
15665 94039 -156597 -256200 183610 192228 167111 -167808 -406822 4369 -126382 117544 -39666
15653d6468A30261a92518A17169J09207O2171a73481l8985A90561a9488D4251
15642I7923c7472D7091E216J00744N1077D1861J90085A13532h5734C05847A50040
15630c8351r4109A93046d7876J1339r5358K9914D98389r7583A83103k6858m253
15619A51992c0549j4162k18669e8891k4669A29709d5311j74389G5592J57444a00786
15607a82529m8213A32372L3307g2626C8293b37030C3347J30216a20457K4302f631
15595F5807a83862G022J3657f2444A27062f6105Q918B41764f807j34004j01094
15584b41905B06355D4908a44328B26365c7775k69395a11091j32430p35A25915
15573b19792I3513c027A23164e3374A99880I2331b60038E9453g1758j5238C72947
$$ plain form
15653 -46468 130261 -192518 117169 226376 288547 -173481 -212466 190561 -19488 44251
15642 97923 -37472 47091 5216 105960 157037 41861 231946 113532 -85734 305847 150040
15630 -38351 -132460 193046 -47876 -36537 -131895 -101981 498389 400806 183103 156245 151992
15619 151992 -30549 -44711 -263380 -58891 -83560 129709 -45311 -219700 75592 233036 -100786
15607 -182529 -230742 132372 165679 -72626 38293 -237030 33347 163563 -120457 -96155 -6631
15595 65807 -183862 7022 20679 -62444 127062 -66105 -57187 241764 -6807 -140811 -241905
15584 -241905 206355 44908 -144328 226365 -37775 -307170 -111091 -243521 -244256 125915
15573 -219792 93513 -3027 123164 -53374 199880 92331 -260038 59453 -71758 -86996 372947
15561F743a41322I7579b73854i5499D3470J18289b03935A58415m4648l7046O3221
15550A39942a92143A60322o7605k7611h8995F6596g3304A81505B097L32069E6947
15538a47570D5620e1929H7951b40789f2151j15129n0470b9103j2604e182B69904
15526c8550C32928f7520o0160q5277B99651a7277H6123J73079d02960b6436A93713
15514I4124l1623B3913f3183k50704G8731K86184H5352O3363j3881a09128I0484
15502G886K36732e2990k3590p0758k23105A40351e2742j08722E4957c89285a5873
15490a80310h0287L2676A64369J86217A35005a84884B59121r7387a50603P1645
15480g8958C5057J01304a485C5281h6263E9836K24905b42345A82946f6443A21614
$$ plain form
15561 6743 -141322 97579 -273854 -95499 43470 161759 -203935 158415 113767 76721 139942
15550 139942 -192143 160322 92717 65106 -88995 66596 -73304 181505 2097 334166 56947
15538 -147570 45620 -51929 87951 -240789 -62151 -177280 -227750 -29103 -41707 -5182 269904
15526 -38550 332928 -67520 -127680 -212957 299651 -17277 86123 259202 -402960 -26436 193713
15514 94124 62501 23913 -63183 -313887 78731 364915 85352 148715 134834 -109128 90484
15502 7886 244618 -52990 -76580 -147338 -370443 140351 -52742 -161464 54957 -389285 -15873
15490 -180310 -80287 -47611 164369 350586 135005 -184884 259121 161734 -150603 -78958
15480 -78958 35057 136361 -1485 35281 -86263 59836 284741 -242345 182946 -66443 121614
15468B50618F2892j7237a59314m7457H6618J33989B1627J4054j0817N5383a19234
15456B33518j05545J17735a289B00680I8578K7881b0524j06693G116J88868N0442
15445B46426C5611J09288a30301C27060A13702m7767Q8557K28172r4911G0862
15434d0519j94835j00491A22137B4918J22170A4919b0417G5931K62545a08730
15423A71546d3544J4260k15523b6753B14477C212J10103A5647a59928B05110a22127
15411B35696H434h6977A35021K155m8766b43498a10690B73334B6475b8478B03127
15399a4788m6290B84716q7552M2234o1315C5175J60388J12219h2332D0794M2093
15388H2887J77954c5352B64578a31735C75482a34228j15415A51476R0367E0696
$$ plain form
15468 250618 62892 45655 -159314 -206771 86618 220607 21627 35681 24864 80247 -119234
15456 233518 127973 245708 -1289 200680 98578 126459 -20524 -127217 7116 195984 246426
15445 246426 35611 144899 -130301 327060 113702 65935 154492 382664 287753 70862
15434 -40519 -235354 -335845 122137 24918 147088 14919 -20417 75931 338476 -108730
15423 171546 -43544 -29284 -244807 -26753 214477 3212 113315 15647 -159928 205110 -122127
15411 235696 8434 -86977 135021 137176 88410 -243498 -110690 273334 26475 -28478 203127
15399 -14788 -61078 284716 197164 239398 178083 35175 195563 307782 -82332 40794 82887
15388 82887 260841 -35352 264578 -131735 375482 -134228 -249643 151476 241843 50696
15377B53288j03183J84333M1765l3031F7865L45777r7581r0169J33872A76971
15366G3888J91359k7024G3946R5638J8360b33067A28134A4953N4547J63983o2988
15355A70495B607d9531A83699J55598k1283b06844R5517M6158B1203c43166B01397
15343C9756a50491I724a28200L3360p4785I8124A4366b7618F0131J00645f6179
15331G1606J06343d6778j377p3103A39955J32255M4628H8201i4632b0690A9394
15319b01339A62178J25895A17839n6145O9928a05323C02296M7114j48574O8113
15309B68949N3874Q5654p8403p8872n5219c35300A17007J18839I0242b7695A91872
15297E9127L1793m2153b36000B30227D5878c67149F1836a71353B2837J08954h9190
$$ plain form
15377 253288 150105 334438 376203 343172 67865 413642 316061 225892 359764 176971
15366 73888 265247 238223 73946 169584 187944 -233067 128134 14953 69500 233483 170495
15355 170495 2607 -49531 183699 339297 318014 -206844 -111327 -65169 21203 -343166 201397
15343 39756 -150491 9724 -128200 -94840 -169625 98124 14366 -27618 60131 160776 -66179
15331 71606 177949 -46778 -48155 -121258 139955 272210 316838 88201 -94632 -20690 19394
15319 -201339 162178 288073 117839 61694 131622 -105323 302296 349410 200836 268949
15309 268949 322823 408477 330074 251202 195983 -335300 117007 235846 90242 -27695 191872
15297 59127 90920 48767 -236000 230227 45878 -367149 61836 -171353 22837 131791 -89190
15285b8541A50712i4939j31415f2935r080G3324P8460M06132a4063o6109a9256
15273a62557A25438M3193i2063B61456m6385J73670A11286M4204J4830i4222A58190
15261B099i9686A72213h7799C3978a16505C89504A01989K36033b5156B96349o8549
15250B27800J09558L33372K62073P84880K21554n42831P46235A063553E27755
15240C34664n1814C6078J47759n7688o2277J81921a03436B92817J38094j90368
15230B40543K3008a61662C74875a58618D35072e50754a06180A63621K6453a45900
15219A04910C4474R1048K12073b0914E6113a13371E2924J33121e766D06009A67952
15207A48352b5674B67086C5313a3229B7728L72306j66899r4410L586J7037J6476
$$ plain form
15285 -28541 150712 -94939 -226354 -62935 -72015 73324 151784 557916 -14063 -80172 -19256
15273 -162557 125438 168631 -92063 261456 215071 388741 111286 155490 170320 -94222 158190
15261 2099 -99686 172213 -87799 33978 -116505 389504 101989 338022 -25156 296349 227800
15250 227800 337358 670730 932803 1717683 1939237 1396406 2142641 1063553 527755
15240 334664 282850 36078 183837 126149 63872 245793 -103436 292817 430911 240543
15230 240543 263551 -161662 374875 -158618 435072 -550754 -106180 163621 190074 -145900
15219 104910 34474 125522 337595 -20914 56113 -113371 52924 186045 -5766 406009 167952
15207 148352 -25674 267086 35313 -13229 27728 400034 233135 138725 142311 159348 175824
15196A75824f8358b3012B96545B3653J10605A2985K7757J22905m3447a84003H3699
15184f0260A76257L25406h8526B35922G1392g40C6771a69730A50445b1711D2696
15172b00655D36618a68612n7358e6989A1788J16414C1952i9916A78223j0864k6581
15161A40778m6876K38679A6518f7098a9119A48200F5537a43887C21625n4779K824
15150B69670k1820I7302J6897M0997p1087J55558j00249K2167L2067p8930j0536
15139A04186K31822d1708a9630I8817l4544g0274C80469A17835m8931a17039B19400
15127A72688C0770J67399J5983R48L5853O3370j25824J32005q5682A09157J31132
15116B40289A07137A1511J94210m4753J72741J79439o8541j36419h2150C35390
$$ plain form
15196 175824 -68358 -23012 296545 23653 134258 12985 40742 163647 120200 -184003 83699
15184 -60260 176257 501663 -88526 235922 71392 -740 36771 -169730 150445 -21711 42696
15172 -200655 436618 -168612 -225970 -56989 11788 128202 31952 -99916 178223 167359 140778
15161 140778 93902 332581 16518 -67098 -19119 148200 65537 -143887 321625 266846 269670
15150 269670 247850 97302 114199 155196 84109 239667 139418 161585 193652 114722 104186
15139 104186 336008 -41708 -19630 98817 64273 -70274 380469 117835 68904 -117039 219400
15127 172688 30770 198169 214152 215100 250953 314323 188499 320504 234822 109157 240289
15116 240289 107137 11511 205721 160968 333709 513148 444607 308188 -82150 335390
15105A37551h0106A2058M06295a44084C96411A31569J93874j13458N2611K62119
15095E26715A85059J74429j47862B3746L17189j41213K17317q8205a7658A15616
15084A37076K47972A62250n3443J31661q1361g183l401A43880L9162A0744g6565
15072D77822A80563K09113K9152A09064L76938A62660M4924N7614J82918p9074
15062C69042r1441q65J83991H4548J68518J84917K6349Q6068j86556K1965r3586
15051B92223K80614m6265j67762j17532J30656L11784j61908B46386J13478m2404
15041C17460j19974D8921L4105k4676K14725o6104J57996j18894b9777H1109J97343
15030B78452j33697O6895b2871G0734J42773L7817R4945H9801P7959J55752E7638
$$ plain form
15105 137551 -80106 12058 418353 -144084 396411 131569 325443 211985 264596 526715
15095 526715 185059 359488 211626 23746 340935 199722 417039 328834 -17658 115616
15084 137076 385048 162250 108807 240468 159107 -7183 -10584 143880 183042 10744 -76565
15072 477822 180563 389676 418828 109064 486002 162660 207584 265198 448116 369042
15062 369042 277601 276736 460727 84548 253066 437983 464332 550400 363844 385809 292223
15051 292223 572837 526572 358810 241278 371934 683718 521810 246386 359864 317460
15041 317460 197486 48921 83026 58350 273075 206971 364967 246073 -29777 81109 278452
15030 278452 144755 211650 -22871 70734 213507 251324 346269 89801 167760 323512 57638
15018A18902J53105j25965J2424K55016j51156l0922P3061K2178j46985J53653
15008C33311O9559j79868j1138I6503J73677m8301a71296A17938N1683K44165
14998D13786j00890A36857M56753k88270J58935j5455k00187k1085m496J44180
14988C67232j48401J62114q0089j30283l3819J20982J08733R0319j82282K88030
14978E62536A88943J02045K94392J78651m1576B95541J28134k1572k1888q9930
14968B90285J17037n5623J72820J93275j28686L54960J24084m14648J03366K27466
14958I84336j43467l23009B47299N823J8612J05346j43463L89609k38603l2414
14948C52209j34342j0143N65913C16742K86198M9025o3184j89654K95350o2456
$$ plain form
15018 118902 272007 146042 158466 413482 262326 231404 304465 326643 179658 333311
15008 333311 402870 223002 211864 96503 270180 221879 -171296 117938 169621 413786
14998 413786 312896 136857 593610 305340 464275 448820 248633 227548 223052 367232
14988 367232 218831 380945 300856 170573 136754 257736 366469 456788 274506 562536
14978 562536 188943 290988 585380 764031 722455 295541 423675 402103 380215 290285
14968 290285 407322 351699 524519 717794 589108 944068 1068152 653504 756870 984336
14958 984336 840869 517860 247299 253122 271734 377080 233617 623226 384623 352209
14948 352209 217867 207724 773637 316742 602940 651965 588781 399127 694477 632021
14938F32021K2871j88074B01645K77932A48952p3161J12528N52701A90753M91002
14928F81755C31842j00111K53053j04702N9392j85893O0195j0412q8081L23421
14918E38704Q4570B98990K11542l8987K24207A09599L67506D4069K64010m897
14908C03182K04156n1359K02840o9433j08822k21024L85641q4182B34648M03855
14898F38503j92581j55367L10495k51246L68403j53382B69626K9113J58673M4016
14888E01428J7049p9579A54542K27634K5504N4113j43594q1219M9617J73164B18006
14876A25033J78185K17605k07395K49694k17456j7763R9101J08249J39428k12690
14866D61991k9142K256j05172F6382J47349J07070J10869p4821R1272K57521j7935
$$ plain form
14938 632021 654892 466818 201645 479577 148952 75791 188319 741020 190753 681755
14928 681755 331842 231731 484784 380082 439474 253581 313776 303364 215283 538704
14918 538704 623274 298990 510532 471545 695752 109599 477105 44069 308079 303182
14908 303182 507338 455979 658819 589386 480564 259540 645181 560999 234648 638503
14898 638503 445922 290555 601050 349804 718207 564825 269626 298739 457412 501428
14888 501428 518477 438898 154542 382176 407680 461793 318199 236980 286597 459761 218006
14876 125033 303218 520823 313428 563122 345666 327903 427004 535253 674681 461991
14866 461991 432849 435105 329933 66382 213731 320801 431670 356849 448121 705642 687707
14855F87707q5553j16712o9399K00572J0597J32535M6753l58647P31259E47329
14844F98162j7556l29664J45205J8015K04910p2279k85935J62646J36469N2603
14834G12576k37031p8936L06055J4433k93473J06014O2942r9484J72832K3947
14824F89875j11950L0968J50313M540k49431J01311R8874l30461K06451B81365
14813E84051m6030k62807J44311J76267L64493m29748o8085J48060J44051j19917
14803F34646j96543M39752K36929m95204K52375l27101L80311P1629q9390C72470
14792E78006J61078r4527M55978j65862L5101k31648J32212j78061J34445k6969
14782G99753r4119k02186J00706O8142J81983j24595K08782o9823j29659L86671
$$ plain form
14855 687707 602154 485442 416043 616615 627212 759747 806500 447853 1179112 547329
14844 698162 680606 350942 496147 514162 719072 646793 360858 523504 659973 712576
14834 712576 475545 396609 702664 717097 423624 529638 592580 493096 665928 689875
14824 689875 577925 608893 759206 763746 514315 615626 714500 384039 590490 281365
14813 584051 538021 275214 419525 595792 960285 530537 462452 610512 754563 634646
14803 634646 438103 877855 1114784 619580 871955 544854 925165 996794 907404 372470
14792 578006 739084 644557 1100535 934673 969774 738126 870338 692277 826722 799753
14782 799753 705634 503448 604154 672296 854279 729684 938466 868643 738984 1125655
14772A125655E39423M86483j33116K30257k01498K28054D46426N70370D75904
14762I51322k49968k78108L94371l03851L06255C86668N85565k67086K5282P76705
14752A507134n38239J50298R5244k30227l722o2668M5103j44258K57819l01984
14742G74500K52964j13038j85620P7567k9129J84416L03570n48309Q6965P4622
14732H78508J04754m5340r2409K10364l37467N18192Q853j21241j28512L5451
14722A031153K88345k33216l45685k09428K21323M8503p6776K4636p9745K68621
14712I37731k48308M6646J05707J70584j88307L02024l5317r2475L8330j48637
14702H87978K5607P9273k1764o2205j24258J85289k09062N35604l80057Q1852
$$ plain form
14772 1125655 539423 1025906 892790 1123047 921549 1149603 446426 1016796 475904
14762 951322 701354 423246 817617 513766 820021 386668 972233 705147 730429 1507134
14752 1507134 968895 1119193 1214437 984210 980488 917820 962923 818665 1076484 774500
14742 774500 1027464 914426 728806 806373 777244 961660 1265230 716921 803886 878508
14732 878508 983262 937922 845513 1055877 718410 1236602 1245455 1124214 995702 1031153
14722 1031153 1319498 1086282 740597 531169 752492 800995 724219 748855 669110 937731
14712 937731 689423 736069 841776 1012360 824053 1126077 1090760 998285 1036615 887978
14702 887978 913585 992858 971094 908889 784631 969920 760858 1296462 916405 998257
14692I98257k18499J99578J87041J44810N00371n37315k17517Q6731P7180J62806
14682A383443l20267M33349l33204L24387k96473K31107l83741j55948J39107
14673A021760J49870k45363P05876l61668J2l3110K1329K61556l55358m0055j92352
14662I32497M43663m94002L89889K4730J73729n04825L92505M136k45236L949
14652A121035Q3079J7013J32155P3503p3102J33193j18200J30695N51538j42277
14642A908632k8329m66231Q1892j9017m13059J3426J97766j01233K94346k7821
14632A440372k02122j03583L23438n1336m2461L52733J66685K08994l52564K47364
14622A987520k76414l07229j7426N01482Q6632k74630j11112O7418j15634o1026
$$ plain form
14692 998257 779758 979336 1166377 1311187 1811558 1274243 1056726 1143457 1220637 1383443
14682 1383443 1063176 1496525 1163321 1487708 1191235 1422342 1038601 882653 1021760
14673 1021760 1171630 926267 1632143 1270475 1270487 1237377 1258706 1520262 1164904 1124849 932497
14662 932497 1376160 882158 1272047 1296777 1470506 965681 1358186 1362322 1117086 1121035
14652 1121035 1204114 1221127 1353282 1426785 1353683 1486876 1368676 1499371 2050909 1908632
14642 1908632 1880303 1414072 1495964 1476947 1063888 1077314 1275080 1173847 1468193 1440372
14632 1440372 1238250 1134667 1458105 1406769 1364308 1717041 1883726 2092720 1740156 1987520
14622 1987520 1711106 1403877 1386451 1887933 1974565 1699935 1588823 1656241 1540607 1479581
14612A479581K5088L31331k28688J10765l13300K77991j11605O1641L6995j05014
14602A564785L52562j82722j62658J86530R4941n3250K42135n43399M46965k76643
14592A669246J50381K561j11962J74482l4377K41887n6082q4584O1454o4490Q2374
14581B030890J92189K37251l46634J76816O086J50425P267j017M74761k75437
14571B652597O19593l41917k2765m99131j09842M03738L25088j68171l3340N6694
14561B882544L2957n0846J10798J74592M9310J51685K72575L04086J93656N96662
14551D718019N53948J354201K271459M282658O354203J4783370J5726510A7164073
14542I708453m240384k418782p12514m74907K90386n7585o4303M0920K54084k43391
$$ plain form
14612 1479581 1504669 1836000 1607312 1718077 1404777 1682768 1571163 1632804 1669799 1564785
14602 1564785 1917347 1734625 1571967 1758497 1853438 1800188 2042323 1498924 1945889 1669246
14592 1669246 1819627 1822188 1710226 1884708 1850331 2092218 2036136 1951552 2013006 1948516 2030890
14581 2030890 2223079 2460330 2113696 2290512 2296598 2447023 2454290 2453273 2928034 2652597
14571 2652597 3272190 2930273 2907508 2408377 2298535 2702273 3027361 2859190 2825850 2882544
14561 2882544 2915501 2864655 2975453 3150045 3199355 3351040 3623615 3927701 4121357 4718019
14551 4718019 5271967 6626168 8897627 13180285 19534488 34317858 50044368 17164073
14542 9708453 5468069 3049287 2336773 1861866 2152252 2094667 2030364 2071284 2325368 2081977
14532B081977L96287q4397q5070R5639J76007K92731J07430n15199j06149M84038
14522B843294k98532n046M7903k8292r3101L71439k36607M38732j31828k6594
14512B881368M7905k71715N31556j93405o9375K86967l90018P24918k54J59684
14502C707631k73336L70654l17285L40645l13918L15612j7568R6465m9427k45455
14492C614018M1275l08983N81772J04381q4531j4360K79422p5984k63209N8347
14482C932148J85749r3206K50885j05848l76219O36941k27929L39625K8460O2804
14472D633410o9436j6598K659J64014N6986o8806m5680K66545k07063L3171O23056
14461E372258k75189K1553P1701K96108l02252J03616L56381J05757K43865j23570
$$ plain form
14532 2081977 2478264 2393867 2308797 2404436 2580443 2873174 2980604 2465405 2359256 2843294
14522 2843294 2544762 2539716 2587619 2559327 2466226 2837665 2601058 3039790 2907962 2881368
14512 2881368 2929273 2657558 3189114 2995709 2926334 3213301 2823283 3548201 3547947 3707631
14502 3707631 3434295 3804949 3487664 3828309 3514391 3830003 3812435 3908900 3859473 3614018
14492 3614018 3655293 3346310 3928082 4032463 3947932 3933572 4212994 4137010 3873801 3932148
14482 3932148 4117897 4024691 4275576 4169728 3793509 4430450 4202521 4542146 4570606 4633410
14472 4633410 4563974 4547376 4550035 4714049 4771035 4702229 4656549 4923094 4716031 4749202 5372258
14461 5372258 5097069 5118622 5190323 5486431 5184179 5287795 5644176 5749933 5993798 5870228
14451E870228R0590j49539k08752K01158K14084M89530n45614k6806M30890k56340
14441F109429L54573r4924L96573k12405j817J33169n8427J1294K68367J02576
14431G008408j87470P17758k26771K70189K32024L75479j97831l2606j67531M29061
14421H220710n6866M71533j80239M26292Q259L26245n6227J57237Q5457j16197
14411I286204o4067L90072k771L53204L84183j9871K31104J48594J6489L69460
14401A1092601Q5867J46136j1816J43020P21500R926l43558O42024K25915k54943
14391A2456672M01382P4999L50620L56457L16586J98982N2052L82832J76896O28671
14381A5396149J35313J08927L56565R7898M33783L03164M74282K50907K07037
$$ plain form
14451 5870228 5960818 5811279 5602527 5803685 6017769 6507299 5961685 5934879 6365769 6109429
14441 6109429 6464002 6369078 6765651 6553246 6551429 6684598 6626171 6637465 6905832 7008408
14431 7008408 6820938 7538696 7311925 7582114 7814138 8189617 7991786 7959180 7791649 8220710
14421 8220710 8163844 8635377 8455138 8881430 8889689 9215934 9159707 9316944 9402401 9286204
14411 9286204 9222137 9612209 9609438 9962642 10346825 10326954 10558058 10706652 10723141 11092601
14401 11092601 11178468 11324604 11312788 11455808 12177308 12187234 11843676 12485700 12711615 12456672
14391 12456672 12858054 12933053 13283673 13640130 13956716 14155698 14207750 14590582 14767478 15396149
14381 15396149 15531462 15640389 15996954 16094852 16528635 16831799 17306081 17556988 17764025
14372A7764025L42670K88871Q27376k04102P01459L26961N68334L07637K93540
14363B1216771L06308P05175L18191O55017O60789L21640N29424M03646P26609
14354B5843570L86634O79926O55251N40441Q62307O88166J97301J204654L31678
14345C1389928J316286L23036P33158J335870Q09048J387428Q61232N76844J035408
14336C9768238J244556Q81202J382388J325283J217835J394699J134846J562660
14328D9911707J262273J962393J249828J909948J755740J953758K124334K217038
14320F4347019J969567K140984K741448K424438K931473K556017K838782L234622
14312H5184350L451657L128968L621978L732342L716492L996506M407975M393986
$$ plain form
14372 17764025 18106695 18395566 19222942 19018840 19720299 20047260 20615594 20923231 21216771
14363 21216771 21523079 22228254 22546445 23201462 23862251 24183891 24713315 25116961 25843570
14354 25843570 26230204 26910130 27565381 28105822 28968129 29656295 29853596 31058250 31389928
14345 31389928 32706214 33029250 33762408 35098278 35907326 37294754 38155986 38732830 39768238
14336 39768238 41012794 41893996 43276384 44601667 45819502 47214201 48349047 49911707
14328 49911707 51173980 53136373 54386201 56296149 58051889 60005647 62129981 64347019
14320 64347019 66316586 68457570 71199018 73623456 76554929 79110946 81949728 85184350
14312 85184350 88636007 91764975 95386953 99119295 102835787 106832293 111240268 115634254
14304A15634254N027834M878978N640405N766826N582109O562835O323192P282023
14296A62698456P615690Q267340Q148485R084372R536132R722057R977414J0929456
14288B35979402J0466291J2175291J2757708J2856523J3233933J3760142J4265666
14281C25494956J4456050J4669949J4697342J4563115J3644392J3640476J2338439
14274D23504719J0631355P099667J180508K020035L120283N890281j076305n113389
14266D47257154m480289r315903j2277594j3782016j5029362j5698333j6182674
14259C60490983j6481337j6304249j6136076j5320905j5415725j4586339j3775312
14252B52471040j1315105j2683505j2308235j1133377j0672768r748140r689963
$$ plain form
14304 115634254 120662088 125541066 131181471 136948297 142530406 149093241 155416433 162698456
14296 162698456 170314146 178581486 186729971 195814343 205350475 215072532 225049946 235979402
14288 235979402 246445693 258620984 271378692 284235215 297469148 311229290 325494956
14281 325494956 339951006 354620955 369318297 383881412 397525804 411166280 423504719
14274 423504719 434136074 441235741 442416249 444436284 447556567 453446848 452370543 447257154
14266 447257154 442776865 433460962 421183368 407401352 392371990 376673657 360490983
14259 360490983 344009646 327705397 311569321 296248416 280832691 266246352 252471040
14252 252471040 241155935 228472430 216164195 205030818 194358050 184609910 174919947
14245A74919947q611445q073016p569152p503685o660577o862749n440833n385237
14237A18813253n135412n189118m620515m688376m489330l902651l075154l805474
14229H3907223k889380l276889l160754k770460k824554k691827k270395k066434
14221F1956530k541142j687493j918253j999090j914621j526757j740383j644774
14213D6984017p39195j820534j371936j295633j425545j250011m95030r92216
14205C7593917j333384j271761o77593r02953j135616k82002j086594r75816n14116
14196B9414082j195739p20850l61702m67418p17733o27885o15183j114695l35397
14187B3257480k82801n84110p59896j97283m39291k75164m78015m21453n21810
$$ plain form
14245 174919947 166308502 158235486 150666334 143162649 136502072 129639323 124198490 118813253
14237 118813253 113677841 108488723 103868208 99179832 94690502 90787851 87712697 83907223
14229 83907223 81017843 77740954 74580200 71809740 68985186 66293359 64022964 61956530
14221 61956530 59415388 57727895 55809642 53810552 51895931 50369174 48628791 46984017
14213 46984017 46244822 44424288 43052352 41756719 40331174 39081163 38586133 37593917
14205 37593917 36260533 34988772 34311179 33408226 32272610 31990608 30904014 29928198 29414082
14196 29414082 28218343 27497493 27135791 26668373 25950640 25322755 24707572 23592877 23257480
14187 23257480 22974679 22390569 21630673 21433390 20994099 20718935 20240920 19819467 19297657
14178A9297657k30615m89402k25959n48017k31340l91144k85178j81495k21929
14169A6492578p88289n53720K70668l81156L8748p22579o1958k67524P505m26783
14159A3607490m26005Q5799m33934j15134j25151l92764k71334J40884n43740
14150A1526111j35604j48042o3337l9315n23566k24484J03734l53705J79627k40680
14140A0080739l0967o49257J39674k1146m08355k7745m12509J4622J3790l42314
14130H356532j37848k3753K60452k78587m2665m39519j12189L9389N3142n00635
14120G174319J07685l9846K33227n94681J2302l73075M54322n29309J7117J31205
14110F593266j44731O4769j09294l71884Q8636J04215n51870K89517l98141J12425
$$ plain form
14178 19297657 19067042 18577640 18351681 17803664 17572324 17181180 16896002 16714507 16492578
14169 16492578 15704289 15150569 15421237 15040081 15078829 14356250 14294292 14026768 14034273 13607490
14159 13607490 13181485 13267284 12833350 12718216 12593065 12200301 11928967 12069851 11526111
14150 11526111 11390507 11242465 11179128 11139813 10616247 10391763 10495497 10141792 10321419 10080739
14140 10080739 10049772 9400515 9540189 9519043 9110688 9082943 8670434 8685056 8698846 8356532
14130 8356532 8218684 8194931 8455383 8176796 8134131 7694612 7582423 7621812 7674954 7174319
14120 7174319 7282004 7242158 7475385 6880704 6893006 6519931 6974253 6444944 6462061 6593266
14110 6593266 6448535 6513304 6404010 6032126 6120762 6224977 5673107 5962624 5564483 5676908
14100E676908o8604r9654l09057L26846k68111j17985K77723k02569j75246K75347
14090E315598k38683j5871l15195N28209o34264P0606J4143l8130j46333p0083
14080D469997j30786l59080M84631l89168K91039q6580l38153K64025j72111k4066
14070D009748p6652P6062J80779m64233Q4191L58938j37863k65625j22257K57570
14060C900658j56719r6873J96073m89215L46712j84130l5314L7769j12604L0937
14050C437294j63089K51322R2551r4930m55905j4031J44853k21143R9215J37874
14040C214011l35824O1985J13978L0069K7162p5282L77666k42419j80518J08857
14030C099685M7470k05541q4694l60211K92965l04572L7411K31954K92041k82543
$$ plain form
14100 5676908 5608304 5508650 5199593 5526439 5258328 5140343 5418066 5215497 5040251 5315598
14090 5315598 5076915 5061044 4745849 5274058 4639794 4710400 4724543 4686413 4540080 4469997
14080 4469997 4339211 3980131 4464762 4075594 4366633 4280053 3941900 4205925 4033814 4009748
14070 4009748 3933096 4009158 4189937 3725704 3809895 4168833 4030970 3765345 3643088 3900658
14060 3900658 3743939 3647066 3843139 3353924 3700636 3516506 3481192 3518961 3406357 3437294
14050 3437294 3274205 3525527 3618078 3523148 3067243 3053212 3198065 2976922 3076137 3214011
14040 3214011 2878187 2940172 3054150 3084219 3111381 3036099 3413765 3171346 2990828 3099685
14030 3099685 3147155 2941614 2856920 2496709 2789674 2485102 2522513 2754467 3046508 2763965
14020B763965J24174o19211j88102L99783K06084l3215j21153l422Q295O938j75865
14009B368271k54191M04558l86379p7270K44757Q1567q5736l5950K63814o0648
13999B462793n3406j73003j23830J19804m7776K69971K02811P5858j94873N01687
13989C040036Q93915K749899M592243R801344K4499336j4187275A3339345o357139
13981F982206j772890j116849n89472k14824k05700k74408m2089O1211l37169
13972B490016l4171n0043j0572k44270j41289K85391k63167N9806P3144l02345
13962A862500j7933L12028l07539N6769R1535m15927N32994k22263r5262K3262
13952A820164j09687K81092j92666J48603r7994k33465J77937r1510j96674L73234
$$ plain form
14020 2763965 2888139 2268928 2080826 2480609 2686693 2653478 2532325 2528903 2537198 2544136 2368271
14009 2368271 2114080 2518638 2132259 2054989 2299746 2381313 2295577 2259627 2523441 2462793
13999 2462793 2409387 2236384 2112554 2232358 2184582 2454553 2657364 2733222 2538349 3040036
13989 3040036 3933951 6683850 11276093 21077437 45576773 31389498 13339345 6982206
13981 6982206 5209316 4092467 3502995 3288171 3082471 2808063 2765974 2827185 2490016
13972 2490016 2455845 2405802 2395230 2150960 2009671 2295062 2031895 2091701 2164845 1862500
13962 1862500 1844567 2156595 1849056 1905825 1997360 1581433 2114427 1892164 1796902 1820164
13952 1820164 1710477 1991569 1798903 1947506 1849512 1616047 1793984 1702474 1505800 1879034
13942A879034k87521L05509k84639K86501l45896O8656j76847K08228k0452J10051
13932A742624k05183L29698m21270J15379R1544m3055l73631N48691j73278K7655
13922A639174l09428L318M68735J44619j76660K6019l09422K6643L4904P7867
13912A625769o0561o6787l15356L16203q5768j49071J85248O7188j33527M0884
13902A424222N64n0112j05614Q6707k31833L78456n5099k35209n7394j53443J35883
13891A137128J20849l10884K71038R5031L4691J21360k95550L68363j46595m27117
13881I68314M18265j71557j70391K26362k77036J58561r5694J67344l06688P6855
13871I94335K31073j49378k34606K26309j92215K69509k03226j89412j0843K29977
$$ plain form
13942 1879034 1591513 1897022 1612383 1898884 1552988 1621644 1444797 1653025 1632573 1742624
13932 1742624 1537441 1867139 1445869 1561248 1652792 1609737 1236106 1784797 1611519 1639174
13922 1639174 1329746 1333064 1801799 1946418 1769758 1795777 1486355 1512998 1547902 1625769
13912 1625769 1565208 1498421 1183065 1499268 1413500 1264429 1449677 1516865 1383338 1424222
13902 1424222 1424786 1374674 1269060 1355767 1123934 1502390 1447291 1212082 1154688 1001245 1137128
13891 1137128 1257977 947093 1218131 1313162 1347853 1469213 1173663 1542026 1395431 968314
13881 968314 1386579 1215022 1044631 1270993 993957 1152518 1056824 1224168 917480 994335
13871 994335 1225408 1076030 841424 1067733 875518 1145027 941801 752389 741546 971523
13861I71523L04980k75052J1184K2077N5766k37372J12033j50253K24885r5627
13851I44144J72K30672J1424k51434j12885n3571J60261P4441J75110m0530l22178
13840H15626P4968m0124O2798L7666j18951K18041j36226j66005j13193L67040
13830A001640l48205R7113j3874O8274j60184J03922j7702J36747Q3861O7543
13820A019135P3049j63485r2964K56268k47309j21645K09496k72941J00208k05516
13810E54296J03738k9087K68518k82996Q7864j02323K61354q5047K1144J66051
13800I63512k29569K2185J46908p5414k64277J25150L57856k01092L6291k36784
13790F44766K4812J71295l0865j08256k45108K33289J51059J31133D85825L53534
$$ plain form
13861 971523 1276503 1001451 1012635 1034712 1090478 853106 965139 814886 1039771 944144
13851 944144 944316 1174988 1186412 934978 822093 768522 928783 1003224 1178334 1137804 815626
13840 815626 890594 850470 913268 950934 831983 1050024 913798 747793 634600 1001640
13830 1001640 653435 750548 736674 804948 644764 748686 730984 867731 951592 1019135
13820 1019135 1092184 928699 835735 1092003 844694 723049 932545 659604 759812 554296
13810 554296 658034 628947 897465 614469 702333 600010 861364 776317 797461 963512
13800 963512 733943 756128 903036 827622 563345 688495 1046351 845259 881550 644766
13790 644766 669578 840873 810008 701752 456644 689933 840992 972125 485825 839359
13780H39359j45582k07220M2137J60830j5580J73097n4858k14065K82934P850
13770H68902l6485j08440J30045k61351L70423C98000N51771C85989J77975L44460
13760I08424k92937L5774N8062j39720K540Q4977N6001Q7347j61836n0720O1886
13749F49798Q0694l62406L38964k25713N9898M25759l17668k41563K49269j44506
13739E12526N7219L0760o4197J35377k76234J9200L29795j81985J1015p7771O6372
13728E62077K65803k15634k24173j36064L63377n6743O1625j59553l6871Q8349
13718E12193J64126B09584K12136K3812n811K10717j16268P3657M53526m37308
13708F24045j57804l7643Q9293K44747o96k49897N9048J84721A69582J61065K54009
$$ plain form
13780 839359 693777 486557 528694 689524 673944 847041 792183 578118 861052 868902
13770 868902 832417 723977 854022 592671 963094 398000 949771 385989 563964 908424
13760 908424 615487 651261 709323 569603 572143 657120 713121 800468 638632 587912 649798
13749 649798 730492 368086 707050 481337 541235 966994 649326 407763 657032 512526
13739 512526 569745 600505 536308 671685 395451 414651 744446 562461 573476 495705 562077
13728 562077 827880 612246 388073 252009 615386 558643 620268 460715 423844 512193
13718 512193 676319 209584 421720 445532 439721 650438 534170 607827 1061353 624045
13708 624045 466241 428598 517891 762638 761942 512045 571093 755814 169582 330647 584656
13697E84656K2567J58630j69525q822k04394K60529j89425A87300L89731B30928
13686F40685j47168i3627C73387o7498J38488j6720A55537N4083K49955A58760
13675C47103j47557K68889j38333J17569j7895K89564A54363J17775Q0319j50326
13665B02131K1698J51237J16873B22719J58878J47526A04687L48087o8494N239
13655C89519m7939Q6358J83444j70626n9265P300P3704P4180j58458L8285L5114
13644D51616j74051K81118j86471K8279j40164K82533J0542j27562K8851a8120
13633G2570K54246j06714L21129L4103k23935J74080a33783D56229j53813K52494
13623E54910B45908r7480J88640J51871j97298J01825c2907A08298J35245Q5833
$$ plain form
13697 584656 607223 765853 596328 587506 383112 643641 454216 187300 577031 230928
13686 640685 493517 -93627 373387 305889 444377 427657 155537 209620 459575 158760
13675 347103 199546 468435 330102 447671 429776 719340 154363 272138 352457 202131
13665 202131 223829 375066 491939 222719 381597 529123 104687 452774 384280 389519
13655 389519 341580 427938 611382 440756 381491 388791 462495 536675 378217 416502 451616
13644 451616 277565 558683 372212 400491 260327 542860 553402 425840 454691 -18120
13633 72570 326816 220102 541231 575334 351399 525479 -133783 456229 302416 554910
13623 554910 245908 148428 337068 488939 291641 393466 -32907 108298 243543 329376
13613C29376J13565J66468B52948R6825K10451L2800k91820K90974j35128A01918
13602D62355A52881K12393Q2248A38745K32880J61478H1345L03251r2474J99768
13592D91890j81747L51834B80426G3732N33784k20982E5605K1120K73102A03212
13581A67973R7370J61194j01966j1418k5742L89193B88735J43906j44820J81073
13571D68894K02669k94595M4674A50177K87640J47125B53515Q8560A02379L82364
13561D84743K76378C01029k5401J81771j9472M1644r6113h3808B78232p0854k5735
13550A81643D8470L51457n1537J11818j22544M2274p6354J23454R1391k03365
13540C15064j09193G1054K12521J47835j26500G7003J93002F9294a15207B30063
$$ plain form
13613 329376 442941 609409 252948 349773 560224 593024 301204 592178 457050 101918
13602 462355 152881 365274 447522 138745 371625 533103 81345 384596 292122 491890
13592 491890 310143 661977 280426 73732 607516 386534 55605 76725 349827 103212
13581 167973 265343 426537 324571 313153 287411 676604 288735 432641 287821 468894
13571 468894 671563 376968 421642 150177 437817 584942 253515 342075 102379 484743
13561 484743 761121 301029 275628 457399 437927 479571 383458 -83808 278232 207378 181643
13550 181643 48470 399927 348390 460208 337664 379938 303584 427038 518429 315064
13540 315064 205871 71054 283575 431410 304910 77003 270005 69294 -115207 230063
13529A37796J9076a16544C87600o8760p8989r2563J10870J1642L5796R8944g2021
13517B19490J37819f2824H2566K65890A69523J88376J9271F6711b12C24031j29184
13506A94847L1883I9338M21667G9155j9127J84380J6820l4231q9128K94010B15339
13494B50530J79548j99708m5462a2117C26156A5739M44388A11346P0085f8099
13483D82476B26358d5476C00864q5121K75431D6478K7170L6933m5595O0299J06317
13472B31602M515j05138L37930A68612d7255D07559g2862D6986J05116P8347P2561
13461C03010q5631k1582p7957j1134J57532l6574R0951A50873J73367n4831a09422
13449C96184o5810J60995A77905J12358F6869K61320j37673K01531A16812q363
$$ plain form
13529 137796 156872 -116544 387600 318840 239851 147288 258158 269800 305596 404540 -72021
13517 219490 357309 -62824 82566 348456 169523 357899 377170 66711 -212 324031 194847
13506 194847 226730 99338 521005 79155 60028 244408 261228 226997 137869 431879 215339
13494 250530 430078 230370 184908 -12117 326156 15739 460127 111346 181431 -68099
13483 482476 226358 -45476 300864 215743 491174 46478 73648 110581 64986 125285 231602
13472 231602 236117 130979 468909 168612 -47255 407559 -72862 46986 152102 230449 303010
13461 303010 217379 195797 117840 106706 264238 227664 318615 150873 324240 269409 -109422
13449 396184 330374 491369 177905 290263 66869 328189 190516 392047 116812 108449
13439A08449L11034A68543p6386f2854A54166M5667a26467b0052k50376A98578
13428C92543e9205B69345A22028g5389B72382a44944D35324j88140p2932F678
13417I4242J90691r0930k539a53228B06237J57648H8139K73549B4930N00050A4892
13405C20168k5210A40412L55419m1481B05828J11057l5686A04659l4189L89681
13395D60151r3150c622B48790H1410M93861A98849M3491k8946i9375r2192C73011
13383d6053D11862E069i3548B85910J00316F7826r879c72307g7943A83015J0337
13372A93352l957P7197O7092L8226j30575p3309M1818a4749B87691M1159o3521
13361B65329o5215k0149l2879L14488k08406R0914l8512p7283J02617A35167R0700
$$ plain form
13439 108449 419483 168543 92157 -62854 154166 199833 -126467 -20052 -270428 198578
13428 392543 -59205 269345 122028 -75389 272382 -144944 435324 247184 174252 6678
13417 94242 284933 194003 191464 -153228 206237 363885 88139 361688 24930 524980 14892
13405 320168 294958 140412 495831 454350 205828 316885 281199 104659 70470 460151
13395 460151 367001 -3622 248790 81410 575271 198849 242340 213394 -99375 -191567 373011
13383 -46053 411862 5069 -93548 285910 386226 67826 57947 -372307 -77943 183015 193352
13372 193352 189395 266592 333684 371910 241335 168026 209844 -14749 287691 328850 265329
13361 265329 200114 179965 147086 461574 253168 344082 305570 228287 330904 135167 225867
13350B25867r5546J86578A24083J88927H6413g7538A20030J37123E8788N76033
13340F34821N6337l39567j10953J61386J94260j91411K81995J31653D06646N94737
13330A001383m70844P6653j12161Q3470J00418B6988L76129N5443q8672J15959
13320D85847A49000O6820N7748A25020L86127B25647N9733E1527M6871K39856
13310C38254A67079K41535j41541g4670C22971J71604j15191H1884K18640k0778
13300B79746A4832K53850C7599J3114J08173F3187K35964B9256J53744K28495
13290D11495A05191J9719K51264a76071B03468a4442C96850F4859K52469A28704
13279B56308j21931o4539i7443B89447G0020j4933b08869A9681g8729a6792C5348
$$ plain form
13350 225867 130321 316899 124083 313010 86413 -77538 120030 257153 58788 634821
13340 634821 691158 351591 240638 402024 596284 404873 686868 818521 406646 1001383
13330 1001383 530539 607192 495031 578501 678919 26988 403117 458560 369888 485847
13320 485847 149000 215820 273568 125020 511147 225647 285380 51527 98398 338254
13310 338254 167079 408614 267073 -74670 322971 494575 379384 81884 300524 279746
13300 279746 14832 268682 37599 50713 158886 63187 299151 29256 183000 411495
13290 411495 105191 124910 376174 -176071 203468 -14442 396850 64859 317328 128704
13279 256308 134377 69838 -97443 289447 70020 55087 -208869 19681 -78729 -16792 35348
13267d928B91270k1724G9742b54954b3112D13852j99174M42191B96941c4483k9849
13256f4332C50825I7606J7630D1807f5029C8443h5432A32790B5862K84767M6253
13245C56882A53421A9926g9453d886B02059a08106B06978k2332a39317b2836M154
13234a8682n0993E0160P73L73096j69202j1902d2238B95282b01623D89272a3295
13222C91967j94631A3637B964L78776c11089A52449F543K55646a99578e2517B68419
13210E998a50045B76567L5845c47A00031a3041l8545o5719A8475k789d1729A43445
13197A46028j7336l9212l6510K56692A07634i4418A78941E2740J31327a4146m9652
13186f3798d74j5152A29343j6940m4342J15052f1073B1470j0206b09879g1855
$$ plain form
13267 -4928 291270 269546 79742 -254954 -23112 413852 214678 656869 296941 -34483 -64332
13256 -64332 350825 97606 115236 41807 -65029 38443 -85432 132790 25862 310629 356882
13245 356882 153421 19926 -79453 -4886 202059 -108106 206978 184646 -139317 -22836 -18682
13234 -18682 -69675 50160 50933 424029 254827 242925 -42238 295282 -201623 489272 -13295
13222 391967 197336 13637 2964 381740 -311089 152449 6543 262189 -199578 -52517 268419
13210 5998 -150045 276567 312412 -347 100031 -13041 -51586 -117305 18475 15686 -41729 143445
13197 146028 128692 89480 52970 309662 107634 -94418 178941 52740 184067 -14146 -63798
13186 -63798 -474 -15626 129343 112403 68061 183113 -61073 21470 11264 -209879 -71855
13174H552K1602L20932K9724A34282O3965A1006K7000N7699K13746a35659B77397
13162A61796J14396j09577g2529l5125A55660a95254A49516b50629A85032g5601
13151A06600H239K54366A3039d5591m0984Q587B39242g3057D9971J6313K4181
13140I0465R333a08518j91587B59547E5731K4924A0355J61743l2195J23861b98852
13128B36406A00568J53492D9793K37502A8113J1136a02304B02833L21336h9805
13117b09420A0306f8370B70441G8430L5670O7267a10309B52573e2148B51961J16124
13106C68085h1503G9010b04069m4443h9072D47598F5356o901K94074a28775a221
13094i2513d0463A33148i1395A36139p877a87698B44167A5533b0580j0351D7639
$$ plain form
13174 8552 30154 351086 380810 134282 198247 11006 38006 95705 309451 -135659 277397
13162 161796 276192 166615 -72529 -107654 155660 -195254 149516 -250629 185032 -75601
13151 106600 8239 262605 13039 -45591 -86575 -77988 239242 -73057 49971 66284 90465
13140 90465 99798 -108518 -300105 259547 55731 80655 10355 172098 139903 263764 -298852
13128 236406 100568 254060 49793 287295 18113 29249 -102304 202833 524169 -89805
13117 -209420 10306 -68370 270441 78430 114100 181367 -110309 252573 -52148 251961 368085
13106 368085 -81503 79010 -204069 -248512 -89072 447598 65356 58455 352529 -128775 -1221
13094 -92513 -40463 133148 -91395 136139 128262 -187698 244167 15533 -20580 -30931 47639
13082a73018f1365B9404O5139a67191E840L11920B6151a586B4806J41333F2509
13070F8222a23213B4369K21528a583k02848B01609K2245L31456A96349h312j6426
13059b4738A21246J13151f4669A19280K09806j45127h6598I4753a48912d0673
13048I5706O1026K38173A08781i9382d8808B68921Q6206A58540g397j34314a3660
13036A77901b90214C28796I2060P6018d25604A14994R5941L2384h4903a3273B94981
13024a08229I5258Q7595b52097A45128b21515J02809A31835J90600q7961C1525
13013a55917A47089a57250A98370g0898B18752r6459a40298J8185B31202K67629
13003D98831l5194h7164E4891a16143B74149E7437a12126G4919a40562d7339I8415
$$ plain form
13082 -173018 -61365 29404 94543 -167191 5840 317760 26151 -1586 24806 166139 62509
13070 68222 -123213 24369 245897 -1583 -204431 201609 223854 555310 196349 -8312 -24738
13059 -24738 121246 234397 -64669 119280 329086 183959 -86598 94753 -148912 -40673
13048 95706 156732 394905 108781 -99382 -48808 268921 355127 158540 -7397 -141711 -13660
13036 177901 -290214 328796 92060 168078 -425604 114994 210935 243319 -84903 -13273 294981
13024 -108229 95258 182853 -252097 145128 -221515 -118706 131835 322435 234474 31525
13013 -155917 147089 -157250 198370 -70898 218752 122293 -140298 -122113 231202 498831
13003 498831 463637 -87164 54891 -116143 274149 57437 -112126 74919 -140562 -47339 98415
12991E1007K37631j09675i9962j32683R3016I0933c6123r5762j02679g3575J1383
12980f2192j90956k70805C01057A2854K38367d6927B2557c52444D537J50299A9090
12968b62217B73067b30600Q0331a689C8485J56440d6803A71604a2660L727A08015
12956A12083L7550c75782H3015e8044q3824e2381E0878d1609A7616g5678A36381
12944d228q2846C67602i2077k17203B2439a33566H7601a07035j11686I3073a20874
12932G6370Q0733C3814a4293B43786O4684c30191J06592i4712H6929l8473b21575
12920A39338a05729A80771q0855k807a25387D1069a06006q7894e2339r63k29464
12909b82766C4146f3293c0333p9011D8492i0562k16559a22272A92313a04413M7156
$$ plain form
12991 51007 288638 178963 -99962 -232645 -139629 90933 -36123 -131885 -234564 -73575 -62192
12980 -62192 -253148 -523953 301057 12854 251221 -46927 22557 -352444 4537 154836 19090
12968 -262217 273067 -230600 -150269 -1689 38485 194925 -46803 171604 -12660 -8933 108015
12956 112083 149633 -375782 83015 -58044 -141868 -52381 50878 -41609 17616 -75678 136381
12944 -4228 -87074 367602 -92077 -309280 22439 -133566 87601 -107035 -218721 93073 -120874
12932 76370 157103 33814 -14293 243786 308470 -330191 -223599 -94712 86929 48456 -221575
12920 139338 -105729 180771 99916 97109 -125387 41069 -106006 -193900 -52339 -53302 -282766
12909 -282766 34146 -63293 -30333 -109344 48492 -90562 -307121 -122272 192313 -104413 -57257
12898e7257m2071a066A83457K01636A33147R5007e9084A88904a16688E319J41501
12887A46820F198O1284k0048d1337h764k33551A70393N6932d6401C9536K63685
12876C03221G4733a32762m10379a75080k3810B05442o8768h6557f959A59919E9276
12864b04005C17053c34557B51088B4240a53009B00092b53810H5315B3484b77358
12853C11202B5590a7554r4446j84235F3612P688c5517I6647J4172b07069R5917
12842a11152A91140K2099e9011l32751G1612j2170K85207j66811B7246J44071
12832A71317J97123h2950A06461L418f930C19048j30662h8638K2208D86443a21162
12820a8654A68356e7008n9835A93212g7840j04711O1545C62173e9799A7771P1384
$$ plain form
12898 -57257 -99328 -1066 183457 385093 133147 228154 -59084 188904 -116688 5319 146820
12887 146820 6198 67482 47434 -41337 -8764 -242315 170393 227325 -46401 39536 303221
12876 303221 74733 -132762 -543141 -175080 -198890 205442 136674 -86557 -6959 159919 59276
12864 -204005 317053 -334557 251088 24240 -153009 200092 -253810 85315 23484 -277358
12853 311202 25590 -17554 -112000 -296235 63612 71300 -35517 96647 110819 -207069 -111152
12842 -111152 191140 213239 -59011 -391762 71612 59442 344649 177838 27246 171317
12832 171317 368440 -82950 106461 109879 -6930 319048 188386 -88638 -66430 486443 -121162
12820 -18654 168356 -57008 -116843 193212 -77840 -182551 -121006 362173 -59799 17771 89155
12809H9155a14841b4916A4016a78108G7977a99065A3404J03545J26854H4649O6344
12798A50993C6116r507b15201B5510a53422B723b17268G4873J50488g9255k21221
12787c00476d3396k09092e6334C9155a94077i0038B67068a04741j14085i0869
12776c4982i598l04009B44326p2382p4827N3028a60969j73416P5003F6626J3225
12765G9851a66470n3981k1719p8953i4588A16604m3861a10549A321J42280F3795
12753a46448m9239B14586b07212K7899A10726K8941a00436b5945A30826h476A3648
12741B71080c0471I7252l292a6162k08456a03029e062l5309A09573J0308a83805
12729B14756q4717I162M0246a90158R3280G4720d0836A82848j9371n9184a86469
$$ plain form
12809 89155 -114841 -24916 14016 -178108 77977 -199065 13404 116949 243803 84649 150993
12798 150993 36116 26609 -215201 25510 -153422 2723 -217268 74873 225361 -79255 -300476
12787 -300476 -43396 -252488 -56334 39155 -194077 -90038 267068 -104741 -218826 -90869
12776 -34982 -9598 -313607 244326 171944 97117 150145 -160969 -334385 -259382 66626 79851
12765 79851 -166470 -220451 -242170 -321123 -94588 116604 72743 -110549 1321 143601 63795
12753 -146448 -195687 214586 -207212 -179313 110726 139667 -100436 -25945 130826 -8476 13648
12741 271080 -30471 97252 93960 -16162 -224618 -103029 -5062 -40371 109573 119881 -183805
12729 214756 130039 9162 49408 -190158 -96878 74720 -40836 182848 163477 104293 -186469
12717d8067j04866k4168F6252b41988F4737P1870K20897j24843j09015l8229Q0538
12706A65955k0472D7138N6229a02695b3902E539J34631J18033c12712B2997L5324
12695E8321a9637g74j84314h4018j37682f9527B7519a79799A7564a30960C74204
12683d1553C3820A3365f9984C30852g5713f241E5421J42130p40K24339c15480
12671H7656L6828m1538a15556A39985a3523A53125D9534a33588j5226b8909F4443
12659D60349d4391H2326c0202A49434j5660A1628d6256C11544b23028j2627C68360
12647a50303O1260K4419E0359a72106C74264a86488C58836B6089a15181b5218
12636B25800j11193a07215c6104A80911N5085q1985A9778J1457b9395D24041k01744
$$ plain form
12717 -48067 -152933 -177101 66252 -241988 64737 136607 357504 232661 123646 85417 165955
12706 165955 145483 47138 103367 -102695 -23902 5539 140170 258203 -312712 22997 58321
12695 58321 -19637 -774 -185088 -84018 -221700 -69527 27519 -179799 17564 -130960 374204
12683 -41553 33820 13365 -69984 330852 -75713 -6241 55421 197551 196811 421150 -315480
12671 87656 124484 82946 -115556 139985 -13523 153125 49534 -133588 -148814 -28909 64443
12659 460349 -44391 82326 -30202 149434 133774 11628 -46256 311544 -223028 -235655 368360
12647 -150303 -89043 -64624 50359 -172106 374264 -186488 358836 26089 -115181 -25218
12636 225800 114607 -107215 -36104 180911 235996 154011 19778 31235 -29395 424041 222297
12625B22297h5568r281A89074I2833c81387E3049f2969r327A55807d17995d222
12613D6512J90943a95673Q3049B9053O819a52559g688B42396E4654f6319L3117
12602c3202B71243I3096a18314m061b2488B51411d1976C1783a7004A79958q754
12591A71204B3322h7489j15840c9089i907l39121J37573C02348d6043l7118A35084
12579G7434N3019K00206f6305A16909a3065j26764j0503K1208q044D7320J16183
12568A63503b25689e8766n2501A07610L24166f0770A12793l6112l891K69934a76912
12556a72067A58281J93130L27851K74051j29835K28221l30540j62077B04698A00792
12545a36727f3803I9357k9729Q3403p2589R0891J89685i804k08353C06721g0420
$$ plain form
12625 222297 -85568 -94849 189074 92833 -381387 53049 -62969 -72296 155807 -417995 -4222
12613 46512 237455 -195673 -112624 29053 35872 -152559 -7688 242396 54654 -66319 -33202
12602 -33202 271243 93096 -118314 -122375 -22488 251411 -41976 31783 -17004 179958 171204
12591 171204 23322 -87489 -203329 -39089 -9907 -349028 -211455 302348 -46043 -83161 135084
12579 77434 130453 330659 -66305 116909 -13065 -139829 -150332 -129124 -137168 47320 163503
12568 163503 -225689 -58766 -111267 107610 431776 -60770 112793 76681 72790 342724 -176912
12556 -172067 158281 351411 679262 953313 823478 1051699 721159 559082 204698 100792
12545 -136727 -63803 99357 69628 153031 80442 171333 361018 -9804 -218157 306721 -70420
12533A31994J5170H542K43070m7364P2853R141J24547l3371O55478J72894L96894
12522A602684J9177j00816j79107F56951M9926B21547a15344a2900C13523a33105
12511I3919a51102a7968q5276B23443q9278B5679L24404a09651F2802d2859e030
12499A66843E9208K36641I2463K54629L89070K09732j78168J71613K1699l52982
12489F08056k21504A36383a14053d4341m741E4102c8073E9034g6325C33906A21369
12477a65468C02181a24279N6501j89469e0997J2004l7468J0415H8643l7136b52259
12465b91769R1798e7833j20664P7905A47621e9097m5221M8610j13196q877d2527
12453d6096D27461b39862A24791f3972j32378O7691G8140a1038A71732E0094a06234
$$ plain form
12533 131994 147164 8542 251612 204248 277101 286242 410789 377418 1032896 1205790 1602684
12522 1602684 1621861 1521045 1341938 656951 706877 221547 -115344 -12900 313523 -133105
12511 93919 -151102 -17968 -103244 223443 134165 25679 350083 -109651 62802 -42859 -5030
12499 166843 59208 295849 92463 347092 736162 945894 767726 939339 961038 608056
12489 608056 386552 136383 -114053 -44341 -49082 54102 -38073 59034 -76325 333906 121369
12477 -165468 302181 -124279 -67778 -257247 -50997 -38993 -76461 -66046 88643 51507 -252259
12465 -291769 -199971 -57833 -178497 -100592 147621 -59097 -104318 -55708 -168904 -177781 -42527
12453 -46096 427461 -239862 124791 -63972 -196350 -128659 78140 -11038 171732 50094 -106234
12441A61078b663C8330K866h9007b313j18317B17100G0622k3306i3890H4455b88003
12428c07999A63328a07005H6505J53706n8223R870E1428e2307C40710j26623b9799
12416C46806d34437d9311r8175p4335c3595l81022h6288a2074C63293A0230O1384
12405G1614c1388B11303a22093j50702h0339k5776K5675n6020G388a99344o7864
12394b67208A14206B7865j937J2242a6624D3351b90757O6206a07921a9752m2421
12383f2173A67086a77509L6495k2132C6172L1844d47408K22220j0962I5755a2512
12371A0174J91697a10261F4024Q1593j4454a2910H1210a8899C09543B6753b4816
12359F7210R2172N0478A8158K53984r610c0927B02577m620n555g0546C50528c01456
$$ plain form
12441 161078 -2663 38330 41196 -89007 -2313 -120630 217100 70622 47316 -93890 84455 -288003
12428 -307999 163328 -107005 86505 240211 181988 191858 51428 -52307 340710 214087 -29799
12416 346806 -434437 -49311 -147486 -221821 -33595 -414617 -86288 -12074 363293 10230 71614
12405 71614 -31388 211303 -122093 -272795 -80339 -106115 -80440 -136460 7388 -199344 -267208
12394 -267208 114206 27865 25928 38170 -16624 43351 -290757 -224551 -107921 -19752 -62173
12383 -62173 167086 -177509 -141014 -163146 36172 68016 -447408 -225188 -236150 95755 -12512
12371 10174 201871 -110261 64024 145617 131163 -12910 81210 -18899 309543 26753 -24816
12359 67210 159382 209860 18158 272142 262532 -30927 202577 197957 192402 -70546 350528 -301456
12346a05584A44243l3355R5664b13379B72287a95250D8209A0270h1202B47285
12335I6986a87828C98187f7510A23356a0379k68277N2008n0154A94842l5997E397
12323c008A30239i7944k92795I6564R4760J74777A4569J37562i0690L7210k62902
12312c16382a17378B45551a47127f4042q9849j9165K6164l5400e0401B4219K01508
12301B25727G826R0150K81512a703G7879B8883a07977A80146b84049A23783a35278
12289g4776j92652c1201k40686Q5573G8495e1263k95559a73044r1820F4511R3757
12278A58268b42157o7483E7074J9658Q6465c4535D11790k05067J35474B2893Q4596
12267A07489c7988B65416A18330B6956R4275d0536a3014B23819f7634k6619A33258
$$ plain form
12346 -105584 144243 110888 206552 -213379 272287 -195250 48209 10270 -81202 247285
12335 96986 -187828 398187 -67510 123356 -10379 -278656 -226648 -276802 194842 158845 5397
12323 -3008 130239 -97944 -390739 96564 191324 366101 14569 152131 -90690 -53480 -316382
12312 -316382 -117378 245551 -147127 -64042 -153891 -173056 -146892 -182292 -50401 24219 225727
12301 225727 7826 97976 379488 -1703 77879 28883 -107977 180146 -284049 123783 -135278
12289 -74776 -267428 -31201 -271887 -186314 78495 -51263 -346822 -173044 -264864 64511 158268
12278 158268 -242157 -309640 57074 76732 163197 -34535 411790 206723 342197 22893 107489
12267 107489 -37988 265416 118330 26956 121231 -40536 -13014 223819 -67634 -94253 133258
12255F741f715D6646c9170A52824c2485A6624a1868r6616D07444p7004C3219a60979
12242c9857A88960k0370N0895k3169m6251o8389J9556c0988C22544a30950A68417
12230B81346N6330G0297K34787J9699C7724K07608L1045C4207L31245H6480M47985
12219E34465J49752B16032Q1078N15712k65049m6715o1197M6591l2058O3629k20234
12208B97789J01991R674J32539j02127O5186j64882G5699J77749A21218N3376
12198A74594J53409A8930M17022j63342M99152k3438n9057k80652J68021B87070
12187F26153J15523l22281K04375C06598K16809j26252K13653O2910j51317j31344
12177C91057j31176K53742a0266B17751F9974N27249k68835j296m3992D6752L86979
$$ plain form
12255 6741 -6715 46646 -39170 152824 -32485 16624 -11868 -108484 407444 330440 33219 -160979
12242 -39857 188960 168590 219485 196316 150065 81676 101232 -30988 322544 -130950 168417
12230 281346 337676 70297 305084 324783 37724 245332 276377 34207 365452 86480 534465
12219 534465 684217 216032 297110 812822 547773 501058 439861 486452 454394 518023 297789
12208 297789 399780 409454 541993 439866 505052 340170 75699 253448 121218 174594
12198 174594 328003 18930 435952 272610 771762 748324 689267 408615 576636 287070
12187 626153 741676 419395 623770 306598 523407 397155 610808 673718 522401 391057
12177 391057 259881 513623 -10266 217751 69974 597223 328388 327092 283100 46752 433731
12166D33731j56585k0216H5305N48248j56607L32120C73812J52821B22222K46953
12156D69175k7930O2343I8410L63106j41727G0586Q9195K96074j37868E3539J57759
12145B11298p7186a30571B5213L21933e9427C61747A9728L22197L48008A56452
12134i9752B93369l464A08801L03184j37568a47787C2177J67343r1736R42b9099
12122E0263a27917b0393k07330g1806D2696i5478C04026A8308a0621k2246A87146
12110A10101a10258E16280A46838a27214C6466L9267l556P2815e10412a8616J180
12099a7436A5443b90611A25428C0143R0061a79536f3768j3073H8433K8205m2933
12088G3705L953a26163A282d6934G160a11830I297J41040J9299h2118K4045A86356
$$ plain form
12166 433731 277146 256930 85305 633553 476946 809066 373812 526633 222222 469175
12156 469175 441245 503588 98410 461516 319789 70586 159781 455855 317987 53539 211298
12145 211298 134112 -130571 25213 347146 -59427 361747 19728 341925 689933 156452
12134 -99752 293369 289905 108801 411985 274417 -147787 32177 199520 107784 108726 -29099
12122 50263 -127917 -20393 -227723 -71806 42696 -95478 304026 18308 -10621 -32867 187146
12110 110101 -110258 516280 146838 -127214 36466 75733 72177 144992 -510412 -18616 -17436
12099 -17436 15443 -290611 125428 30143 120204 -179536 -63768 -76841 88433 116638 73705
12088 73705 77658 -126163 1282 -46934 7160 -111830 9297 150337 169636 -82118 -58073 186356
12075A03668b9674j242j74581c687j77788B4872c82019g3504b958k42993h0038
12063A79164i6789b4458r9255L4697B9573R7167b1126A06164i7533B75305g3331
12051I7804J45141I5667Q5153F0928b40967g2111o2504M4276D226Q2870a48013
12039H9980J30319a45091j08952K81b005G3608Q5327a11171a4817r6B62278C9576
12026h6254b6564C54174H0319L5411a89418C22207G5824b66392r770C70818A17519
12014h7927K1946j21331j3772G7566c74188A00638J19782C2874m220K87519C4823
12002A7995i3467r5488A21747i7949H6180b69211a19984b3139r2478j0998c0168
11990a94002A76921a16208D7438g7721B63107g7916k21176a39582A23638e97089
$$ plain form
12075 103668 -29674 -30916 -205497 -3687 -181475 24872 -382019 -73504 -2958 -245951 -80038
12063 179164 -96789 -24458 -123713 -89016 29573 126740 -21126 106164 -97533 275305 -73331
12051 97804 242945 95667 180820 60928 -240967 -72111 -134615 -90339 4226 87096 -148013
12039 89980 220299 -145091 -254043 -253762 -2005 73608 158935 -111171 -14817 -14913 262278 39576
12026 -86254 -26564 354174 80319 115730 -189418 322207 75824 -266392 -276162 370818 117519
12014 -87927 -65981 -187312 -201084 77566 -374188 100638 220420 32874 28654 316173 34823
12002 17995 -93467 -188955 121747 -97949 86180 -269211 -119984 -23139 -115617 -126615 -30168
11990 -194002 176921 -116208 47438 -77721 263107 -77916 -299092 -139582 123638 -597089
11979a0071l5347H5587J8912a11251K0635A9661a29187G9297g6176j31360B34603
11967b06427A14768a05629f48r5786c1208j066m6664a9820B33610C107O525j967
11955G665B735a82955c0405k09425a03376C24043j38348b41191R5144O6674l09086
11944c88459e8480j26322A72012b48043C2323g3105A01803f1865p8797A14605
11933f9627A07538A0379J17006b26809l2987a21503A14897j3251h1099K1302l9596
11922i9393a109C7407a59811F0755J23028a15073L9605k1696o0717o7568a03328
11910a12443B44104g0968B25388F8812b99591o2862A40832a8039m2978j72170
11900b33187a8613p2274J8991k31849J50498A334a05246H9506a37883c3016k35397
$$ plain form
11979 -10071 -45418 85587 104499 -111251 -90616 19661 -129187 79297 -76176 -207536 234603
11967 -206427 114768 -105629 -648 -96434 -31208 -32274 -78938 -19820 233610 3107 9632 7665
11955 7665 2735 -182955 -30405 -239830 -103376 324043 185695 -241191 -146047 -79373 -388459
11944 -388459 -58480 -184802 172012 -248043 32323 -73105 101803 -61865 -140662 114605
11933 -69627 107538 10379 127385 -226809 -259796 -121503 114897 101646 -81099 -59797 -99393
11922 -99393 -1109 37407 -159811 60755 183783 -115073 -75468 -97164 -157881 -225449 -103328
11910 -112443 244104 -70968 225388 68812 -299591 -362453 140832 -18039 -61017 -233187
11900 -233187 -18613 -90887 -71896 -303745 -153247 1334 -105246 89506 -137883 -33016 -268413
11889b68413i3580D1149L2968C0913c1451A29708b26981h7264A09398B0910L14541
11878C35451G5120e8672l74040a06490l35636K07051i7846E9928b09167j4502
11868b23669E3542i778B35383b09814B2571a3420j47368O9501C2091a04232a6145
11856B48345F7923a59539a4592j73778N9744L08B5546R4502a77580K5697L1579
11845a20304K2534b7138A35212b00926J9801C34923E3373e7518k07154a6259j91398
11834b07657A50323h561j88067k86131B44467a36402l7865b2133F5977a51895
11823E5845a61525K1174B1355a79200j31914J01131A17489b73439N352b7002Q840
11812a8162o2631A8004f2234j50260j44199C00435A32592b29756B21764J05582
$$ plain form
11889 -268413 -93580 41149 74117 30913 -31451 129708 -226981 -87264 109398 20910 335451
11878 335451 75120 -58672 -432712 -106490 -442126 -235075 -97846 59928 -209167 -223669
11868 -223669 53542 -9778 235383 -209814 22571 -13420 -160788 -91287 32091 -104232 -16145
11856 248345 67923 -159539 -14592 -188370 -128626 -128318 25546 120048 -177580 -151883 -120304
11845 -120304 -97770 -27138 135212 -200926 -181125 334923 53373 -57518 -264672 -16259 -207657
11834 -207657 150323 -8561 -196628 -482759 244467 -136402 -174267 -22133 65977 -151895
11823 55845 -161525 -140351 21355 -179200 -311114 -209983 117489 -273439 -268087 -27002 -18162
11812 -18162 -80793 18004 -62234 -212494 -356693 300435 132592 -229756 221764 327346
11802C27346b56282A14435d10466L3568Q5571B16109a45423A44942F2875a20939
11791B55009K5635d099k23106n0231b7132C5957K73665a25345o5552A08423h156
11779b47220D0532N2493b414j81767j75536A85318o5886J70113c5983B44546a96848
11767H4924a15180i64A62306a274k0883A53432B4696a47565j02864j38795a72722
11755c36798c9830F1029h8832A46499c87318a52592B98454A00959J87108o873
11745B81194j28390d9311a9353A4673a8853B5608c20432C32991h7047H8358J98652
11734B87010a29019A2055c965r6248A7065b63460P8363k8396c5732A44080n0674
11723I3406p08c61356a37343A01277M9681a1594A48748D7372P598f8223A46708
$$ plain form
11802 327346 -256282 114435 -410466 -376898 -291327 216109 -145423 144942 62875 -120939
11791 255009 280644 -4099 -227205 -277436 -27132 35957 309622 -125345 -190897 108423 -8156
11779 -247220 40532 93025 -2414 -184181 -359717 185318 119432 289545 -35983 244546 -196848
11767 84924 -115180 -964 162306 -1274 -22157 153432 24696 -147565 -250429 -389224 -172722
11755 -336798 -39830 61029 -88832 146499 -387318 -152592 298454 100959 288067 281194
11745 281194 152804 -49311 -19353 14673 -18853 25608 -320432 332991 -87047 88358 287010
11734 287010 -129019 12055 -3965 -100213 17065 -263460 -185097 -213493 -35732 144080 93406
11723 93406 92698 -361356 -137343 101277 150958 -11594 148748 47372 54970 -68223 146708
11711B49236a29j08712H0924j6621d50279B43270b6878j47806A28372J16276p2707
11700A71941M9159a35001k45432a57155o7265k22578e855j57761C6383K9211a0673
11688a87198a5383A86579i5653J1479j741j2611n7654q540c040j83907B9950c87809
11675A94681l0844g5081a4963B67815p9281B4890R1447B855Q0905j3252b95863
11663c3327B04017c23873J01260a9075C193M08716D2110g7033L1109A32710c0687
11651A00497O2770d2689n6082I2718a03496m7141j22363b4715m1554D4904d4766
11639D4774g6552k27463f8033n1679k02706B8185c75548C01467a79407A08162
11628B88777o2458n7722n9101a44174A13035a34671d8396m763G8680B106L9335
$$ plain form
11711 249236 -129 -108841 80924 64303 -450279 243270 -26878 -174684 128372 244648 171941
11700 171941 221100 -135001 -380433 -157155 -224420 -446998 -5855 -163616 36383 65594 -10673
11688 -187198 -15383 186579 -95653 -84174 -85915 -98526 -156180 -164720 -3040 -186947 29950 -387809
11675 194681 163837 -75081 -14963 267815 188534 24890 116337 2855 83760 70508 -295863
11663 -33327 204017 -323873 -222613 -19075 3193 411909 42110 -77033 -45924 132710 -30687
11651 100497 163267 -42689 -98771 92718 -103496 -150637 -273000 -24715 -66269 44904 -44766
11639 44774 -76552 -304015 -68033 -119712 -322418 28185 -375548 301467 -179407 108162
11628 288777 226319 168597 109496 -144174 113035 -134671 -48396 -53159 78680 2106 41441
11617D1441d409B18910J59802A12857Q6800A3571J68758c3050A20432d2326f544
11605I2465a40554A77382o276k6907b49135A83390p0555d47911A41962a1337k46205
11594b57542a02447I5990g951C9770A3070P0388b11431A24668k7596M4615d9391
11582A33873b92367B25143E882i0685J2708B57894j760J41344a5200C25951a59258
11570A86969a36367L0300A35536O9298Q035o899c2641m5606I2070K5686c07760
11558a20413B97772n4178G8308a92976f2090B08870F956Q4336b9473B70364A03594
11546B19423b10761B79670g3275J4755k05506G2851c66975E1815J61678f7008
11535A35680m3362a89734h0897A11870g7412I410J75644P0923a998p5129B48789
$$ plain form
11617 41441 -4409 218910 378712 112857 199657 13571 182329 -33050 120432 -42326 -6544
11605 92465 -140554 177382 171106 144199 -249135 183390 112835 -447911 141962 -11337 -257542
11594 -257542 -102447 95990 -7951 39770 13070 83458 -211431 124668 97072 141687 -49391
11582 133873 -292367 225143 5882 -90685 -77977 257894 256134 397478 -15200 325951 -159258
11570 186969 -136367 -106067 135536 204834 212869 205970 -32641 -78247 92070 117756 -307760
11558 -120413 297772 243594 78308 -192976 -62090 208870 6956 91292 -29473 270364 103594
11546 219423 -210761 279670 -73275 -58520 -264026 72851 -366975 51815 213493 -67008
11535 135680 92318 -189734 -80897 111870 -77412 9410 185054 255977 -1998 -77127 248789
11523a80214c3893n5405o8335A0814J53255D3189i7405B16097G8248B6070L77071
11512D03141H3958a35299B99073b08836C46986j51121f5993A25999l2953K0001
11502A13047J20212n283H4359a14875G7846J33047E9596J79531R0007K4271Q482
11491C61887l5163o3314j1397J34920K1522j17277j31346R3423I7587P1339A0621
11479B2481L22845m7548L49894I3552R1352p4775R2762L5450L64497k84051j34222
11468A84565L6605J19456J28608q6676N2567K14920A3494L88650j33860K08744
11458D77028j38057J95757j83893N3851q6940J80570K78562B82974G2238N45928
11448F18166B62315P5523A26096J94416J42809k11153L42698L4279A25721R5163
$$ plain form
11523 -180214 -33893 -89298 -157633 10814 164069 43189 -97405 216097 78248 26070 403141
11512 403141 83958 -135299 299073 -208836 346986 195865 -65993 125999 93046 113047
11502 113047 233259 227976 84359 -114875 77846 210893 59596 239127 329134 353405 361887
11491 361887 326724 263410 252013 386933 408455 291178 159832 253255 97587 168926 10621
11479 22481 345326 297778 647672 93552 184904 110129 202891 238341 602838 318787 184565
11468 184565 221170 340626 469234 382558 435125 650045 13494 402144 268284 477028
11458 477028 338971 534728 350835 404686 317746 498316 776878 282974 72238 618166
11448 618166 262315 337838 126096 320512 463321 252168 594866 629145 125721 220884
11438B20884P8671K57958j6686j11663O0010H9713L6467J5359k9456K00815L00453
11427F13351k21481n438a328o9582E6502K37255J90323o1763a94745A04332P4397
11416A78729K71583E2050C082P9420b2054C1358L32255A08927K89658j85941f0736
11404B55786F3588a80706I4128h7133B2800J36190b62074J03984A17509l3073
11394H4436Q7594J13803A05388b28803C5604K47798G2111E509J22675k6126j3727
11383H8331K41953d504B54568C6166J28230a0881n3620C13948a01743A5953e00028
11371A4696P9176L3771f5298A25025f315l7108j05110O4781k8397g259r2343o2042
11359a61644j67193a17669l05296J83270I9254b9026c294j78945G5164c2008A13677
$$ plain form
11438 220884 299555 557513 540827 429164 489174 89713 126180 141539 112083 312898 613351
11427 613351 391870 386432 -1328 -70910 56502 293757 484080 422317 -194745 104332 178729
11416 178729 450312 52050 3082 82502 -22054 31358 363613 108927 398585 212644 -60736
11404 255786 63588 -180706 94128 -87133 22800 158990 -262074 -158090 117509 84436
11394 84436 172030 285833 105388 -228803 35604 283402 72111 5509 128184 102058 88331
11383 88331 330284 -4504 254568 36166 164396 -10881 -64501 313948 -101743 15953 -500028
11371 14696 93872 127643 -65298 125025 -6315 -43423 -148533 -83752 -112149 -7259 -99602 -161644
11359 -161644 -328837 -117669 -422965 -239695 99254 -29026 -3294 -182239 75164 -32008 113677
11347A27950o1428a38860j58137b6701j94750B46243b9972k24379o7331b0431
11336i4410b1753I7370a0264o7491J4877j13300C48860A26099f0141E9612L6870
11325I6482B1537J05174o0665M8577a04363n3913A64864J29535l545a82299j32138
11314c14437J39501A07778L0822c24307f2407b2982l35946A01139g5111A47027
11303I100e8871A95412g1432r589m3697A40201J54216a10123F2290b73122a34437
11291A53964c8427H8157o513d6390G5001M1180j9403a75723H8952a03082j34745
11280b37827L5229A0626a33703I9889C0332J1101e0451b15G180a91028B15816
11268g2192j24787H7399a56274P2249B03491b01848r4236i8152d5926b2944D8459
$$ plain form
11347 127950 66522 -138860 -296997 -26701 -221451 246243 -29972 -254351 -321682 -20431
11336 -94410 -21753 97370 -10264 -77755 -62878 -176178 348860 126099 -60141 59612 96482
11325 96482 21537 126711 66046 114623 -104363 -158276 164864 294399 290854 -182299 -314437
11314 -314437 -174936 107778 138600 -324307 -62407 -22982 -358928 101139 -75111 147027
11303 9100 -58871 195412 -71432 -81021 -124718 140201 294417 -110123 62290 -273122 -134437
11291 153964 -38427 88157 81644 -46390 75001 116181 96778 -175723 88952 -103082 -237827
11280 -237827 -202598 10626 -133703 99889 30332 41433 -50451 -215 7180 -191028 215816
11268 -72192 -196979 87399 -156274 -84025 203491 -201848 -296084 -98152 -45926 -22944 48459
11256f8745o1642M6247j6822m0971k7812G109c6791j44615j08158J16281d4641
11244G4754A4913Q9622f0754m4115B58528b11793A01855f7147A32158b6743q3124
11233a09867l35962c1820k18147e9887A35987m3635K55226e6560l37668h6145
11222A1255f8357j9953l74611H8596c38959a25258a8641F6023h3573B20410b56824
11210A2895b8695A90772e6532J8507o0383Q67A50774D0119J50104n3756b01767
11198f2280n0399A34513a42994D1169j2009a51759C14868B4004h4563L1255n6562
11187a09870F8548C3742a6998H0312R8877K0212p0911I92L06066o5416A7014P389
11175B4403b39993i0166m15989A45753b13320e6158l05759a04708q6369F2083
$$ plain form
11256 -68745 -130387 -84140 -100962 -141933 -169745 7109 -36791 -181406 -289564 -173283 -44641
11244 74754 14913 104535 -60754 -104869 258528 -211793 101855 -67147 132158 -26743 -109867
11233 -109867 -445829 -31820 -249967 -59887 135987 92352 347578 -56560 -394228 -86145
11222 11255 -68357 -88310 -462921 88596 -338959 -125258 -18641 66023 -83573 220410 -256824
11210 12895 -28695 190772 -56532 -38025 -98408 -97541 150774 40119 190223 136467 -201767
11198 -62280 -112679 134513 -142994 41169 29160 -151759 314868 24004 -84563 -53308 -109870
11187 -109870 68548 33742 -16998 80312 179189 199401 128490 992 307058 241642 17014 24403
11175 24403 -239993 -90166 -506155 145753 -213320 -56158 -361917 -104708 -191077 62083
11164B38576c2928k66465B61822C230J1221c8087D792J10764J83983J50637a83196
11152e6296C3448b15388Q4600p6632h5125A58960G7653a0427q8889A95633a92116
11140f8846A74625g3027k12500H3636k7k4861J92721e410A35743E3840b90419
11128B68050i3346l9270C75275j82727J28627k9065o7335q7996J69208A35315
11117D41219K36660B56365O3177J59818j46667E2216O1823f5343F0611J99942
11107B60553o6476B7401M93313k17735a1138k4635C71992H7179J89750N4985M8007
11096C79921J70289J34488l19112K03654N8509k83273K06724Q7196B03350J81104
11086C84454Q9894Q2478K75287D12753P2190J93455k91353J66056J07052l14110
$$ plain form
11164 238576 -32928 -299393 261822 3230 14451 -38087 4792 115556 299539 450176 -183196
11152 -56296 33448 -215388 -130788 -207420 -85125 158960 77653 -10427 -99316 195633 -192116
11140 -68846 174625 -73027 -285527 83636 83609 58748 251469 -5410 135743 53840 -290419
11128 268050 -93346 -132616 375275 192548 321175 292110 224775 136779 305987 135315
11117 441219 677879 256365 319542 479360 332693 52216 114039 -65343 60611 260553
11107 260553 194077 27401 520714 302979 -11138 -35773 371992 87179 276929 331914 379921
11096 379921 550210 684698 365586 569240 627749 344476 551200 638396 203350 384454
11086 384454 474348 556826 832113 412753 484943 678398 387045 553101 660153 346043
11076C46043M38083P1215j05481l6172l48316L31080L46833k95839r2659L48568
11066A003355k63269l05748L90449L27567j16854k69052L18920J55163L6527j73063
11056A103995K4977J19740K26628q4250Q4445k5524K2475J88750J64200j83502
11046A641934L46250K00706K35058o6828r4900J10311L7663M6662L5500l46305
11036B146051L4935l2144J35034L17838n38443J75592l47205q432j17578M66425
11026B232073n4961l41381K02644M8253j72990K17835J68518m96049J45052P5356
11016B024350J16779j55414j46714l906P2673k26069j8054n5020j92520J24243
11006A540348K08697K1463K30467k72857K12855J02891m31199M21599k66822n0910
$$ plain form
11076 346043 784126 855341 749860 713688 365372 696452 1043285 747446 654787 1003355
11066 1003355 740086 434338 824787 1152354 1035500 766448 1085368 1240531 1277058 1103995
11056 1103995 1128972 1248712 1475340 1391090 1475535 1450011 1472486 1661236 1825436 1641934
11046 1641934 1988184 2188890 2423948 2357120 2262220 2372531 2410194 2456856 2492356 2146051
11036 2146051 2180986 2148842 2283876 2601714 2063271 2238863 1891658 1883226 1765648 2232073
11026 2232073 2177112 1835731 2038375 2086628 1913638 2131473 2299991 1803942 1948994 2024350
11016 2024350 2141129 1985715 1839001 1835095 1907768 1681699 1663645 1608625 1416105 1540348
11006 1540348 1749045 1770508 2000975 1728118 1940973 2043864 1612665 2034264 1767442 1716532
10996A716532O9018k70019J3645J69100Q2420k03206J17324k41798P4571L04419
10986A832006r1835J77640l14453J04706K08825j07831J87977l5781K54855o761
10976B209348n3359M56071J39023J32111J57655q27N35878O6232P25849K48129
10966D616110O07609P92352Q91755P32211J290325R47408O53282o63919j299288
10957H567845k281887r76369j452747m10109o00249l28501j14383p0463q31241
10948A501896N01069M3382k00290k27438m51737M0691J03536k73329q2323m52935
10938E02522J77991k0804k98591J59257j74369M8222I0377L90857j66794j16280
10928A98160M8653p4870C2095M610A3331J3502J82011M5567o7073L57511A73883
$$ plain form
10996 1716532 1785550 1515531 1529176 1698276 1780696 1577490 1694814 1453016 1527587 1832006
10986 1832006 1740171 1917811 1603358 1708064 1916889 1809058 1997035 1961254 2216109 2209348
10976 2209348 2155989 2612060 2751083 2883194 3040849 3040022 3575900 3642132 4367981 4616110
10966 4616110 5223719 6016071 6907826 7640037 8930362 9877770 10531052 9867133 8567845
10957 8567845 6285958 5309589 3856842 3446733 2846484 2517983 2403600 2333137 1501896
10948 1501896 2002965 2046347 1846057 1618619 1166882 1207573 1311109 1037780 955457 502522
10938 502522 680513 659709 361118 520375 346006 394228 90377 481234 314440 198160
10928 198160 246813 171943 32095 36705 13331 26833 208844 254411 187338 544849 173883
10916B03181E2507c81221F86436B1684a05950b2771n1552E1994a76614D3463K8771
10905G2234M2338a9760B22973P22k3362d58982g9027b3033j03619A80648J30401
10894C11049Q7911E8832g1037a4871C11453C4925M8305a61332g8974j04725c4321
10882A7223O1609d4191j36541G7905a28883D0637e1026k17553J19556F3989a69013
10870c10137J20409f0694b9026o3056G5522J5218a2379A17096e1813E7319J0159
10859F7478c302G1346P2409J3098C2623a05610B85837N3846A00614a47597A79548
10847A02739J01510A3348g8079F4217b18137P7220j62030g0325l09743e7573K4781
10836c2792k46073j47240f382A11239a87554A83012l0618Q4668a52239C23577
$$ plain form
10916 203181 52507 -381221 686436 21684 -105950 -22771 -74323 51994 -176614 43463 72234
10905 72234 114572 -19760 222973 223695 200333 -458982 -79027 -23033 -126652 180648 311049
10894 311049 398960 58832 -71037 -14871 311453 34925 83230 -161332 -78974 -183699 -34321
10882 17223 78832 -44191 -180732 77905 -128883 40637 -51026 -268579 -149023 63989 -169013
10870 -310137 -189728 -60694 -29026 -92082 75522 90740 -12379 117096 -51813 57319 67478
10859 67478 -3302 71346 143755 156853 32623 -105610 285837 339683 100614 -147597 179548
10847 102739 204249 13348 -78079 64217 -218137 -140917 -302947 -70325 -380068 -57573 -32792
10836 -32792 -278865 -426105 -6382 111239 -187554 183012 152394 237062 -152239 323577
10825C51772r8806D9915C024f1403A546K88374j41703l9232C3650a02088J8645
10814h3443f788j65472l0811Q2009l08088b66n9246k7396j59162e3065k83021
10803c36086b4036C32413b18835J07171A14128b31940J4444A19613n5874b05436
10792a37522P336j70389A04296b0562j22754E0629j2075J93734j12994a30193
10781e2065D6665c45080E1562A080a88682f7563m4630L0433A5276J18118b51347
10769A19798B5016N6697b5888C2453a22054j15222O4185j17680G6351b00j7917
10758a8117l2812a9964k24854a07061A83504b19452e2093j35013A79006d2002
10747A03045B2435J51411C2101j5366b9487I3351b27377a09430J1425L6577A8240
$$ plain form
10825 351772 252966 49915 3024 -61403 1546 289920 148217 108985 33650 -102088 -83443
10814 -83443 -6788 -172260 -203071 -121062 -429150 -266 -59512 -86908 -246070 -53065 -336086
10803 -336086 -24036 332413 -218835 -111664 114128 -231940 -217496 119613 63739 -205436
10792 -137522 -130186 -300575 104296 -20562 -143316 50629 38554 232288 119294 -130193
10781 -52065 46665 -345080 51562 1080 -188682 -67563 -112193 -81760 15276 133394 -251347
10769 119798 25016 81713 -25888 32453 -122054 -237276 -173091 -290771 76351 -200 -18117
10758 -18117 -50929 -19964 -244818 -107061 183504 -219452 -52093 -187106 179006 -42002
10747 103045 22435 173846 32101 16735 -29487 93351 -227377 -109430 -98005 -61428 18240
10735a50600D0251a42642A4456J40774o3460c3462c676A36658a97026j66007a38336
10723g9626c6856j4015b3347p7760o6724O5942b7521j33269j13266f2491A22376
10711C11878c2604j12794A83139r228b47489A38849c19011O8985M690i6171I2013
10699c25227O7165A33608c00655d6253C9412d4357m8259j16148j6523D7246N1836
10688I9082b52482g58k6037k58645R8482J5722c444A57972A8950d2627m0746A09307
10675A06973a38802f8885K200j70918G8991b92021A76790K9576b6086l07392j01333
10664d34811a04214M2178r8279O8615J7811g686j27594A66012b69293J27697B14541
10652a80354n103j20127O9274e7949j1861A8424b47019R5447P3203b4861j73393
$$ plain form
10735 -150600 40251 -142642 14456 155230 91770 -33462 -3676 136658 -197026 -363033 -138336
10723 -79626 -36856 -50871 -23347 -101107 -167831 -101889 -27521 -160790 -274056 -62491 122376
10711 311878 -32604 -145398 183139 173911 -247489 138849 -319011 -250026 -245336 -96171 92013
10699 -325227 -258062 133608 -300655 -46253 39412 -44357 -92616 -208764 -225287 47246 99082
10688 99082 -252482 -758 -26795 -285440 -186958 -171236 -3444 157972 18950 -42627 -83373 109307
10675 106973 -138802 -68885 -66685 -237603 78991 -292021 176790 206366 -26086 -333478 -434811
10664 -434811 -104214 -62036 -160315 -91700 -73889 -7686 -135280 166012 -269293 -141596 214541
10652 -180354 -185457 -305584 -236310 -57949 -69810 18424 -247019 -151572 -78369 -24861 -198254
10641a98254P3983Q626A27458m1620a86779k02182d0908l9822C03715A36599d21985
10629c3519n6906A86291c9564B03015b07331F2141K55726c22445D7302J09839
10619A57141a94855C4688a33112D7541H222Q8789l9122b83204J11061b4219j67553
10608a91772G471K069C178L1586a39848k48818O5542J21480d2964B52007J0498
10597B62505I2299a65390d0128B0926b12756A31952a04138P695r4906p7139D2617
10585a05846b8134E6625a25026A48827E0481A1440J98969e1859H7308b91948k17891
10574e09839a78428h7975C8905c33760B39753I8251a03366D1373P3383b51876
10563a8535A4783d1050C4429R6770d08747H044K36123c09m4040A15854a72839
$$ plain form
10641 -198254 -124271 -115645 127458 85838 -186779 -388961 -40908 -80730 303715 136599 -421985
10629 -33519 -90425 186291 -39564 203015 -207331 62141 317867 -322445 47302 157141
10619 157141 -194855 34688 -133112 47541 8222 97011 57889 -283204 -172143 -24219 -191772
10608 -191772 7471 9540 3178 34764 -139848 -388666 -323124 -201644 -42964 252007 262505
10597 262505 92299 -165390 -40128 20926 -212756 131952 -104138 -96443 -191349 -268488 42617
10585 -105846 -28134 56625 -125026 148827 50481 11440 210409 -51859 87308 -291948 -509839
10574 -509839 -178428 -87975 38905 -333760 239753 98251 -103366 41373 114756 -251876
10563 -18535 14783 -41050 34429 131199 -408747 8044 244167 -309 -44349 115854 -172839
10551b97357g8654C6292a91350F8149g1983B13039i9041l6076A95056a461B04979
10539B046a71016j58177h0029j7142H7347O4229F5254B2220J80930p5031J02568
10528B30687b68005J08594C64062d0100j70608B30041b6968r3063C75302a9754
10517A74378B7712A2723d655A40172C7716i7550D4168L3217b61674a20712C1725
10505a63422k58224a3308G7191J79664D7197A3310P5946Q3890g3403A0869K05887
10494B16756H489K23376B9225N2320a37142A0409K2364e6139J3308J4401J2740
10483a5690k7622a9506k2974E4687j3456A2054O0062g2171N798l2564B86245m8900
10471B37345Q5662P2341j78639r0813O2999J14119E7425R2093d0045k3543k00786
$$ plain form
10551 -297357 -78654 36292 -191350 68149 -71983 213039 -99041 -135117 195056 -1461 204979
10539 2046 -171016 -329193 -80029 -97171 87347 151576 65254 22220 203150 128119 230687
10528 230687 -268005 -159411 364062 -40100 -210708 230041 -26968 -120031 375302 -19754
10517 174378 27712 12723 -4655 140172 37716 -97550 44168 77385 -261674 -120712 31725
10505 -163422 -421646 -13308 77191 256855 47197 13310 89256 173146 -73403 10869 216756
10494 216756 8489 231865 29225 81545 -137142 10409 32773 -56139 -42831 -28430 -15690
10483 -15690 -43312 -19506 -42480 54687 41231 12054 72116 -72171 -66373 -98937 286245 237345
10471 237345 323007 395348 216709 125896 188895 303014 57425 149518 -40045 -63588 -264374
10460b64374j9102k8460g6940j77078A44795a26473B8132J8934f1700j04853B00829
10448b20434c4844j89717b5105j11838A78933p3424P9291o4129l2942r735c8560
10436c48236A6383K00461a07594j27746A65944l9656B4601A349L8597J02131g6816
10424a02367F2969a08028b7228a1288C20252a60613H7174a18938H1148C9799e5283
10412F3360c6831a091k02595h2874b8882B0268a82450A14126a01695D4643M7665
10401I2308A7405a10395B96a70100k33469J64596C20192A41054b1928A64492a92793
10389A12093K09899k0110Q5761p7305M0291K43949j26975q3376j24370J04452
10379C64309n5794F2204K65239J25994p7544m8755Q5952R7153r5277R7754o3951
$$ plain form
10460 -264374 -283476 -311936 -76940 -254018 144795 -126473 28132 47066 -61700 -166553 200829
10448 -220434 -34844 -224561 -25105 -136943 178933 105509 184800 120671 87729 77994 -38560
10436 -348236 16383 216844 -107594 -235340 165944 126288 24601 1349 39946 142077 -76816
10424 -102367 62969 -108028 -27228 -11288 320252 -160613 87174 -118938 81148 39799 -55283
10412 63360 -36831 -1091 -203686 -82874 -28882 20268 -182450 114126 -101695 44643 92308
10401 92308 17405 -110395 296 -170100 -403569 -238973 320192 141054 -21928 164492 -192793
10389 112093 321992 301882 387643 310338 350629 594578 467603 384227 259857 364309
10379 364309 308515 62204 327443 453437 375893 327138 413090 510243 414966 512720 448769
10368D48769j89262K53008j24004K20463J72565j98005L41857k50525J55445J69174
10358I99485K74157M50527q553n74322l88480p2198J54248k13973j59274J27106
10348E88723J36558k33814K14978M99721L90877K1676k87633n17491m00937K42231
10338F54889j56291K02531m6221k01485K49297j76258j20340J88597j04793K8221
10328E18147K51470r8069I7044J9336P4465G5629K23444A40557K30643e1657C92058
10316F42641J28536j6128j01917j34630j54557j81730R6018A25139M6566b70090
10305c14275j6419A09883K84315H4896P5403p5941O4019a67658A06982j0905a41364
10293g4380E3780J04128g8642k02878B13260L9511A4786K37187a10896A86471
$$ plain form
10368 448769 259507 512515 388511 608974 781539 583534 925391 674866 830311 999485
10358 999485 1273642 1724169 1715616 1141294 752814 680616 834864 620891 461617 588723
10348 588723 725281 491467 706445 1206166 1597043 1618719 1331086 813595 412658 654889
10338 654889 498598 701129 654908 453423 702720 526462 406122 594719 489926 518147
10328 518147 769617 671548 97044 116380 190845 75629 299073 140557 371200 -51657 392058
10316 642641 771177 755049 653132 518502 363945 182215 278233 125139 171705 -270090
10305 -314275 -330694 109883 394198 84896 160299 84358 148377 -167658 106982 96077 -141364
10293 -74380 53780 157908 -78642 -281520 213260 252771 14786 251973 -110896 186471
10282f4464K515B8608N9748a35245A35754h0554k33726B1106A112b4212C14989
10270E0767Q6346b34019G4048a0605D7103d6233A14064d7287K795B44093o6927
10259A77166c3653B27684H848L14872l8175f7044A13232q011D431M704J87955
10248A97090J31867A25783i227k83433B05948a44196K2988o463A16485R0804a93013
10236b59938K3502E4236a175k8738l63474a23846r4526c1045D7442d5314E8042
10224a7862I0676d18971h2952L2053l6612H433g4802r1021O8837k00133P2192
10213b24927l18338A21741a70461b2975j4309k9333p7748o7341r58A10261a80100
10201a85946b3817B69707a36215n2292h7354k084c3175j71307A2628J2848a48347
$$ plain form
10282 -64464 -61949 28608 88356 -135245 135754 -80554 -314280 21106 1112 -24212 314989
10270 50767 137113 -234019 74048 -10605 47103 -46233 114064 -47287 -44492 244093 177166
10259 177166 -33653 227684 8848 323720 285545 -67044 113232 105221 4431 9135 197090
10248 197090 328957 125783 -9227 -292660 205948 -144196 -121208 -127671 116485 207289 -193013
10236 -259938 -236436 54236 -1175 -29913 -393387 -123846 -218372 -31045 47442 -45314 58042
10224 -17862 90676 -418971 -82952 -50899 -87511 8433 -74802 -165823 -96986 -297119 -224927
10213 -224927 -543265 121741 -170461 -22975 -37284 -66617 -144365 -211706 -212664 110261 -180100
10201 -185946 -23817 269707 -136215 -188507 -87354 -89438 -33175 -204482 12628 25476 -148347
10189a01360p9967c1091E4635a37357k21483K2036a62118J9095q5273a5522B26080
10177A36844b2410j3983q2878k1308A64854d9843k8283l4749j7716E2023a09094
10165b6263F3986K2818c8498J8995j22217L7372C702e06700b40702C3897a32777
10153A57729B6199P5127A6615Q3689b37781j91255i8382K0397m4867B81345I3889
10141C30440h7068j3586a6407k89636A32667l6824D2585c05240d7950j6478l58014
10130d22442a08780j89370a11500o2852j53176C6582J85399k9470c78634b7385
10119a37324A35061D4790a85376h8107P441j90419B9645h9083C14785a49246C9424
10107d9950n2761q2246k1436b5896k71141N4457m4877J18389D4383K18435H5738
$$ plain form
10189 -101360 -181327 -31091 54635 -137357 -358840 -336804 -162118 -143023 -228296 -15522 226080
10177 136844 -22410 -36393 -119271 -140579 164854 -49843 -78126 -112875 -130591 52023 -109094
10165 -26263 63986 86804 -38498 -19503 -141720 -104348 3702 -506700 -240702 33897 -132777
10153 157729 26199 101326 16615 100304 -237781 -429036 -98382 -77985 -122852 281345 93889
10141 330440 -87068 -100654 -16407 -306043 132667 95843 42585 -305240 -47950 -64428 -422442
10130 -422442 -108780 -298150 -111500 -174352 -327528 36582 221981 192511 -378634 -27385
10119 -137324 135061 44790 -185376 -88107 -80666 -271085 29645 -89083 314785 -149246 39424
10107 -49950 -102711 -184957 -206393 -25896 -297037 -242580 -287457 -169068 44383 262818 85738
10095C9181J10938d4863j22399k7622m2322a14604H2805J09024a16193D7941b49235
10083b58698d1931j20672k65166a35881A25397a06557k8673p574N5136J6554A40075
10071A11121a11394L8674A66044p2067J7692e40076h7924k93499A32531a5319
10060B26066F0010R8281A6659f2692D3516i6907o8592A23223b55912D4576b70878
10048c02759l0989G4077d49054A78543a09811A90870A6493b12513a551p2113k94667
10037c68331N1709a15383A0113a59138B50509C1933d11001a46225d4582j482j9115
10026f5179k21889d5873p4747o7305n6254A71085i1738G0033O4790e8598A56239
10014G9159b69419B0178a46657A00523b34067h2415A25901a10718C1639E397b57557
$$ plain form
10095 39181 150119 -44863 -167262 -194884 -237206 -114604 82805 191829 -116193 47941 -249235
10083 -258698 -41931 -162603 -427769 -135881 125397 -106557 -135230 -142804 -87668 -71114 140075
10071 111121 -111394 -72720 166044 93977 111669 -540076 -87924 -381423 132531 -15319
10060 226066 60010 158291 16659 -62692 43516 -96907 -165499 123223 -255912 44576 -270878
10048 -302759 -333748 74077 -449054 178543 -109811 190870 16493 -212513 -1551 -73664 -368331
10037 -368331 -316622 -115383 10113 -159138 250509 31933 -411001 -146225 -44582 -46064 -65179
10026 -65179 -287068 -45873 -120620 -187925 -244179 171085 -91738 70033 134823 -58598 156239
10014 79159 -269419 20178 -146657 100523 -234067 -82415 125901 -110718 31639 5397 -257557
10002A69558p9199i3220l15506A67488f0837l2468l33446I3417g3872A66740b31137
9990A90183B2012b93124C02947q324e9358k2890D9944a63327I5291i6717A15928
9978d3335j66433L1113E6526b5700j34140A44282d66753A02087i1776O067k77008
9967c62717b3041j9275q2754N9189K7196D4812H470b98105C18983F5607M7338
9956A12945b61783B05962b25920h2056k78227C896a50509B45419b59704Q8338
9946a71366B5739h0933k09540D6932j8827a16092m31550b00046j39224a68226
9935a16118k3874D3191r257c43559G891J80259d76375E1336K49871a41223l44440
9924d85663J99393C28251a45630N2924j1165e1562j81497A45754a45637q9668
$$ plain form
10002 169558 90359 -93220 -408726 167488 -60837 -93305 -426751 93417 -73872 166740 -231137
9990 190183 22012 -293124 302947 294623 -59358 -82248 49944 -163327 95291 -96717 115928
9978 -43335 -209768 -178655 56526 -25700 -159840 144282 -466753 102087 -91776 -85709 -362717
9967 -362717 -23041 -42316 -125070 -65881 -38685 44812 8470 -298105 318983 65607 112945
9956 112945 -261783 205962 -225920 -82056 -360283 3896 -150509 245419 -259704 -171366
9946 -171366 25739 -80933 -290473 46932 28105 -116092 -547642 -200046 -339270 -168226
9935 -116118 -139992 43191 33934 -343559 7891 188150 -476375 51336 301207 -141223 -485663
9924 -485663 -286270 328251 -145630 -92706 -103871 -51562 -233059 145754 -145637 -235305
9914b35305D0197f6732p990m14994B23403a00178G3030O1436p397E2719b78608
9902c38922O5155c6789p5593A16039h3090C17383a10652o9393A83505a9712p8005
9891i7717C9115d6964b3113k9379B6296b5431B32368a94569A74319m3507q354
9880A22458N6112a97926B1215c54175A70179L6386e7754b5159B9023d28291b07209
9868b75638b9442n1171A0900c72132a52920j75605A19715a23031i301j02062F7159
9856e81709K56085C94096I6746J48923c5994m2878B5648f4369l5502q9190Q6642
9845a02419B27222d5722G7678i1530H5899a43684O4209k0042n5461N9975H4318
9833G61b14778j35557C69000c32564B16464A3823K92761e9441A25936m9503c32568
$$ plain form
9914 -235305 40197 -66732 -74722 -489716 223403 -100178 73030 134466 127069 52719 -278608
9902 -338922 -273767 -36789 -112382 116039 -83090 317383 -110652 -180045 183505 -19712 -97717
9891 -97717 39115 -46964 -23113 -52492 26296 -25431 232368 -194569 174319 130812 122458
9880 122458 178570 -197926 21215 -354175 170179 206565 -57754 -25159 29023 -428291 -207209
9868 -275638 -29442 -80613 10900 -372132 -152920 -328525 119715 -123031 -9301 -111363 67159
9856 -581709 -325624 394096 96746 245669 -35994 -78872 25648 -64369 -99871 -189061 -102419
9845 -102419 227222 -45722 77678 -91530 85899 -143684 -79475 -99517 -154978 -95003 84318
9833 761 -214778 -350335 369000 -332564 216464 13823 306584 -59441 125936 76433 -332568
9821a8301B8413g655r2829r4381P3211B52768a92431D0592h9031r0320N8A91704
9808C8251h0076j63368P9102a05l10108G3219b38322B5463J76938E5150b59454
9796a21167m1459g8221A93101a70846d5158q6583D3427e28556A5039c4943l3760
9785f8703g208D7344c3643j49579A90646a35474J5955E4134a93349N161h6611
9773a70154o041m531d5320G7748M9464O840c12502F7756J63876o0223b07147k8268
9761b35415a3441C0868b41483A84160H8601c48985A59564b32717I9027a36107
9750a4075k54208B2108b88775R3030N5602J8773b8063B04781b89754i931k18998
9739b28929k799j06485k5645a02323j55792A10583L6847f020p5764a2652k77011
$$ plain form
9821 -18301 28413 -7655 -100484 -194865 -121654 252768 -192431 40592 -89031 -179351 -179293 191704
9808 38251 -80076 -243444 -164342 -105 -310213 73219 -238322 25463 202401 55150 -259454
9796 -121167 -162626 -78221 193101 -170846 -45158 -131741 43427 -528556 15039 -34943 -68703
9785 -68703 -7208 47344 -33643 -183222 190646 -135474 -119519 54134 -193349 -188188 -86611
9773 -170154 -176195 -180726 -45320 77748 127212 134052 -312502 67756 231632 171409 -207147 -235415
9761 -235415 -13441 30868 -241483 184160 88601 -348985 159564 -232717 99027 -136107
9750 -14075 -268283 22108 -288775 -195745 -140143 -121370 -28063 204781 -289754 -9931 -228929
9739 -228929 -231728 -338213 -363858 -102323 -258115 110583 147430 -6020 -81784 -12652 -289663
9728b89663n2622B9935n965c7047n3920l9302F8402a5257A61584g9829j42375
9717b22204i1102k7713L7893b8871j30688C33372H3760b904C8960J74353c24051
9705A40989b41191J2738h545q2809m46789a29554r3192a2741j48596L0844j22132
9694b52625h4318A56391e01889K02360D7671M997f0221J1156q0660e8974k9938
9683h8912a6487k26009d5472j84642j19417a8440A8661b97969A25892h0030E858
9671F8178a60642A1179a04427n1513f4679R032k73068D9013j8278a00949j46825
9660b47774A92606g675k83213a09722d8525A83059I1050b0304A29140a360j7839
9649a9199D6521c30520i9235k4343a3293H4946a91317A2241P7820b62579i8680
$$ plain form
9728 -289663 -342285 29935 23970 -37047 -90967 -130269 68402 -15257 161584 -79829 -222204
9717 -222204 -91102 -118815 -80922 -28871 -159559 333372 83760 -2904 38960 213313 -324051
9705 140989 -241191 -228453 -8545 -91354 -538143 -129554 -222746 -12741 -161337 -130493 -252625
9694 -252625 -84318 156391 -501889 -299529 47671 52668 -60221 -49065 -129725 -58974 -88912
9683 -88912 -16487 -242496 -45472 -230114 -349531 -18440 18661 -297969 125892 -80030 5858
9671 68178 -160642 11179 -104427 -155940 -64679 -55647 -328715 49013 30735 -100949 -247774
9660 -247774 192606 -7675 -290888 -109722 -48525 183059 91050 -20304 129140 -1360 -19199
9649 -19199 46521 -330520 -99235 -123578 -13293 84946 -191317 12241 90061 -262579 -98680
9637A09730a49848j09681C9812Q7456a02047j61775i8053b062j98335B4739b45419
9625d0747m8090A07911b39471R7296K8429l9398I2322a62740E4601B3421a36134
9613f1532j29683B76487a04386G1005a52378l1302f5604l82142M0432a43382A32523
9601F6003f8675m3437K4003j27813H5356d12582a51576f066j91172E9800d41020
9589b72330J25704f8462A06748g9292q399o3942A61049a72107L1791k59109A96633
9577b63040a1346B6669c01607Q3438A55168O9737b78421a12343l1723A5407g7169
9565d261j69289N4809j39987C5366c11526A30505h8038j58075L9572A00634O4842
9554A65476B4041b1743k18092c3175m9817M0450A29065b36622h9113k14907h9454
$$ plain form
9637 109730 -149848 -259529 39812 127268 -102047 -263822 -98053 -2062 -200397 24739 -245419
9625 -40747 -88837 107911 -239471 -142175 -113746 -153144 92322 -162740 54601 23421 -136134
9613 -61532 -191215 276487 -104386 71005 -152378 -183680 -65604 -447746 -407314 -143382 132523
9601 66003 -68675 -112112 -88109 -215922 85356 -412582 -151576 -6066 -197238 59800 -441020
9589 -272330 -146626 -68462 106748 -79292 -87691 -151633 161049 -172107 -140316 -399425 196633
9577 -263040 -11346 26669 -301607 -218169 155168 224905 -278421 -112343 -144066 15407 -77169
9565 -4261 -173550 -118741 -258728 35366 -311526 130505 -88038 -246113 -206541 100634 165476
9554 165476 24041 -21743 -239835 -33175 -82992 -42542 129065 -236622 -89113 -304020 -89454
9542a00519D644f0366p489m0933c993j50851a6872l03639a37241j3827H4171h5797
9529a94164I911J60778b64154f062j64824G423m59b36887A22149b36241a3798
9517b33497A68237a92714f8232p1550j14655G4323b9374C67332i2737a7524k36070
9506b53594n5052B57630c28301Q1617h852A64791i401H23c2537A8905K7245J1238
9494E7388g2941j9814A35051a53684d5046j74757c5421n7367j8976c0958B87021
9482b4430k33868n2518B0457c12442a03654D5770K13851H8491k0132c36852B18762
9470i2269j19500H0363b7010E3980a23683G5615j6884h1027G2854l261c98321
9458a78602I6149d3608j17524f1530k6455L7516m5701A99001a29601f551L224
$$ plain form
9542 -100519 4644 -60366 -67855 -108788 -3993 -154844 -16872 -320511 -137241 -151068 84171 -85797
9529 -194164 9911 170689 -264154 -6062 -170886 7423 6964 -236887 122149 -236241 -13798
9517 -233497 168237 -192714 -68232 -139782 -254437 74323 -29374 367332 -92737 -17524 -253594
9506 -253594 -308646 257630 -328301 -246684 -8852 164791 -9401 823 -32537 18905 46150 57388
9494 57388 -72941 -92755 135051 -153684 -45046 -219803 -35421 -92788 -111764 -30958 287021
9482 -24430 -258298 -310816 20457 -312442 -103654 45770 259621 88491 68359 -336852 218762
9470 -92269 -211769 80363 -27010 53980 -123683 75615 58731 -81027 72854 69593 -398321
9458 -178602 96149 -43608 -161132 -61530 -87985 -50469 -96170 199001 -129601 -6551 -3327
9447c327A78658b58521b8741k38135A39060Q1505c83750a58945A29528E3532J58309
9436B11841b42024B6039a46133k5080I9461c92050J50787P3983B7429Q8235C836
9424f629j45281A39031c5753G7419b83235B19568F3677e3205o1406k02107h3983
9412b08188B50212b12708C7940d5391J4671B53148a79715D5235L5943m434b72358
9400E6689J0492a97537B0643L7364e11752C2441O9139J01169b0425k13799Q8497
9389a45727d1776j88489j53806A48066a48090k41558a84370n6901E6919g5715
9378B8287a74134g1397e712r8416j77432a37826j24489M1283j13539h6368j65537
9367b51905D3701M1721l5642i3443m9270A450b60196B85289f8607B03037F0098
$$ plain form
9447 -3327 178658 -258521 -28741 -266876 139060 220565 -383750 -158945 129528 53532 211841
9436 211841 -242024 26039 -146133 -171213 99461 -392050 -241263 -167280 27429 115664 3836
9424 -6629 -151910 139031 -35753 77419 -283235 219568 63677 -53205 -114611 -316718 -83983
9412 -208188 250212 -212708 37940 -45391 -30720 253148 -179715 45235 81178 76744 -272358
9400 56689 67181 -197537 20643 58007 -511752 32441 101580 202749 -20425 -234224 -145727
9389 -145727 -41776 -230265 -384071 148066 -148090 -389648 -184370 -241271 56919 -75715
9378 28287 -174134 -71397 -5712 -104128 -281560 -137826 -262315 -221032 -334571 -86368 -251905
9367 -251905 43701 85422 49780 -93443 -142713 1450 -260196 285289 -68607 203037 60098
9355A05028a99523C7717b57444J01283A02289F273a78015d5409j5573I0042a95250
9343a28635B16077c30109B05616c95526F0256a81288f9024b4772B77347b23458
9332A69729g8535A65409G4978L3146b53657g432r3264A82R6306a73228I2824a22758
9319b28757N5623H3384a16847C55691a92165j85579a25414f1377C3981a70830
9308h4738A17235a83095a0087J097D3849O8949l5456g2111j52785J03484K57R042
9296a12113B3592J08915a35978C24547c1118k43878I875b47264A86775F6649a31121
9284c63318A0581Q0214b4175D4761L89228a46474j29883F2335L08359a50785j46534
9273b97319a3160r8507k85981P4373A66376K8727b00015A23613a45526A68045
$$ plain form
9355 105028 -199523 37717 -257444 -156161 102289 6273 -178015 -45409 -60982 90042 -195250
9343 -128635 216077 -330109 205616 -395526 60256 -181288 -69024 -24772 277347 -223458
9332 169729 -78535 165409 74978 108124 -253657 -7432 -100696 182 96488 -173228 92824 -122758
9319 -228757 -173134 83384 -116847 355691 -192165 -377744 -125414 -61377 33981 -170830
9308 -84738 117235 -183095 -10087 -8990 43849 112798 77342 -72111 -224896 -121412 -121155 -112113
9296 -112113 23592 132507 -135978 324547 -31118 -274996 9875 -247264 186775 66649 -131121
9284 -363318 10581 90795 -24175 44761 433989 -146474 -276357 62335 370694 -150785 -297319
9273 -297319 -13160 -111667 -397648 -323275 166376 195103 -200015 123613 -145526 168045
9262A88133B402K78269b23278Q9668D6950g7797r6359c4173j4860k0069C2639
9250b41692A34196E3098i4126j36673a04486L865j2255K8358l2827j06133R4955
9239a28523C91946e6666E764b68557d304k61283N8593B08196a65974g4845r2748
9228a67593p2927P0927Q4355k42348A98472a65611m4215K303d8822q0331e8741
9216B8272a02293a3964l05570F1613c4609A88609c30231C13335g733l04370c7074
9204a15970j25725j35394c9200A62574f4529B45849c03286a24708F012a5523m7635
9193f3158p5112a2212C6691b32249j77315A77197a02129G4733a01789C8977b28698
9181c47184B4424b9989k2209c051m8444A07217c43411Q1458A43412I030a50284
$$ plain form
9262 188133 2402 280671 -223278 -133610 46950 -77797 -174156 -34173 -49033 -69102 32639
9250 -241692 134196 53098 -94126 -230799 -104486 -100621 -112876 -84518 -117345 -223478 -128523
9239 -128523 391946 -56666 5764 -268557 -4304 -265587 -206994 208196 -165974 -74845 -167593
9228 -167593 -240520 -169593 -85238 -327586 198472 -165611 -209826 -207523 -48822 -129153 -58741
9216 28272 -102293 -13964 -319534 61613 -34609 188609 -330231 313335 -7733 -312103 -37074
9204 -115970 -241695 -377089 -39200 162574 -64529 245849 -303286 -124708 6012 -15523 -63158
9193 -63158 -138270 -12212 36691 -232249 -409564 177197 -102129 74733 -101789 38977 -228698
9181 -347184 24424 -29989 -52198 -3051 -51495 107217 -343411 -261953 143412 9030 -150284
9169B2422J5884a25020a5878l73999A3178f4737b9065p7158c9978F77b56553b9447
9156B53375b67244N6661B15847e7127j73724a6226o8585j16954d9238j42879f0233
9144a45710k36128c8595j15535M8522D0044h4578F413b44616K0456Q472G6531
9132a67655N189E5830e5789A84477a42046E4449a62549A59138a07303E1167J54660
9121B05827a17082N4213M153j54186J00896e2687A35003k2689b1066l23800e9915
9109b44937B88093a79253l5651J05031b2216D0147a02393o0617A44719c46088
9098b86153C26302f3860l3901m3845c199k38240a7841r1724N1240A08419a7142
9086f4591a5403K556m0421E6777a61638j79603h6897A4517g1795D1101a18086
$$ plain form
9169 22422 38306 -125020 -15878 -389877 13178 -64737 -29065 -106223 -39978 677 -256553 -29447
9156 253375 -267244 -210583 215847 -57127 -230851 -16226 -84811 -201765 -49238 -192117 -60233
9144 -145710 -381838 -38595 -154130 -105608 40044 -84578 6413 -244616 -224160 -215688 76531
9132 -167655 -162466 55830 -55789 184477 -142046 54449 -162549 159138 -107303 51167 205827
9121 205827 -117082 -62869 -58716 -212902 -112006 -52687 135003 112314 -21066 -344866 -59915
9109 -244937 288093 -179253 -214904 -109873 -22216 40147 -102393 -163010 144719 -346088
9098 -286153 326302 -63860 -97761 -141606 -3199 -241439 -17841 -109565 -58325 108419 -17142
9086 -64591 -15403 -12847 -53268 56777 -161638 -341241 -86897 14517 -71795 41101 -118086
9074a82990k77696B541J67652D4257K03908D1487f3484L0658k00898j77083C51035
9062b43825F1582F09J21070n5214Q3076L10855E0110J20229c08628J52023j91952
9051c48557a70120p1714L5746h728B29178o70A03431b00945P606Q9617m6023J5408
9039a34337K8776K4828o5484N1780A4769Q2591d4705m9966G3878K87494b60195
9027D3791b26965A08330G99d37604a25991F5169a8753j13341A03970b70628e8772
9015A65672E5805b36057N6050g0038A65795A8060c21575d176C32496a24306R288
9004a15018A14782J01862r7214n2279c93524A99796b35523l4697C8199e1158A17178
8992a38468N7053j39628p4035j46877a57028A98359h0891B7768P2261b66636A17755
$$ plain form
9074 -182990 -460686 2541 170193 44257 248165 41487 -63484 -32826 -233724 -410807 351035
9062 -243825 61582 609 121679 66465 149541 460396 50110 170339 -308628 -156605 -348557
9051 -348557 -170120 -241834 -206088 -8728 229178 228508 103431 -200945 -193339 -103722 -149745 -134337
9039 -134337 -105561 -80733 -146217 -94437 14769 97360 -44705 -94671 73878 361372 -260195
9027 43791 -226965 108330 799 -437604 -125991 65169 -18753 -132094 103970 -270628 -58772
9015 165672 55805 -236057 -180007 -70038 165795 18060 -321575 -4176 332496 -124306 -115018
9004 -115018 114782 216644 119430 67151 -393524 199796 -235523 -270220 38199 -51158 117178
8992 -138468 -81415 -221043 -295078 -441955 -157028 198359 -80891 27768 100029 -266636 117755
8980c63955C21312j11879b62839G2210A1032K06652h720B06871i1628B55148F6294
8968B04453a05738p6417C98b14491j13374A90511a09151M8864N738C60970b99423
8956e0170H9554Q0530g1951B957c83131B8465a24215O447e6399C11882A06623
8944A3916a70880D1103b68460a887k20490A7509L0204a97764f3932C2981e4680
8932b16936j554J2110D1814c06763a43502B00529h2281K0707A16483O6927D9731
8920a16587N2400n2183B01454b3283B64760k9303H0494a10126K2653l46062A62610
8908I9219a66236a6127k03259k27720a09269r9424C4806b89991G3799M0499J79131
8897B93429c2514k65358i9348j5882A3408a42334A96769D6356a55537B3142P9526
$$ plain form
8980 -363955 321312 209433 -262839 72210 11032 217684 -8720 206871 -91628 255148 66294
8968 204453 -105738 -182155 398 -214491 -327865 190511 -109151 -60287 -54549 360970 -299423
8956 -50170 89554 170084 -71951 2957 -383131 28465 -124215 -117768 -56399 311882 106623
8944 13916 -170880 41103 -268460 -1887 -222377 17509 47713 -197764 -63932 32981 -54680
8932 -216936 -218490 -206380 41814 -306763 -143502 200529 -82281 -61574 116483 183410 49731
8920 -116587 -64187 -116370 201454 -23283 264760 235457 80494 -110126 -87473 -433535 162610
8908 99219 -166236 -16127 -219386 -447106 -109269 -208693 34806 -289991 73799 114298 293429
8897 293429 -32514 -297872 -99348 -115230 13408 -142334 196769 46356 -155537 23142 102668
8886A02668J85832g6304A8937N3452A3712a06836C9398b86862A88307J4244i6892
8874B9958N8928a73589a6310j07882j36970B16051c9284l74511c7128R089I3961
8862a35858q5548A68722J06168F378i4724A11833n216a80469d9179I0339J05072
$$ plain form
8886 102668 288500 -76304 18937 72389 13712 -106836 39398 -286862 188307 202551 -96892
8874 29958 88886 -173589 -16310 -124192 -261162 216051 -39284 -413795 -37128 -28039 93961
8862 -135858 -221406 168722 274890 6378 -94724 111833 106617 -180469 -49179 90339 195411
$$ [...]
##END NTUPLES=NMR SPECTRUM
##END=
