##TITLE=NES1027_Brazil_9268334_IjYqnQ15Sc
##JCAMPDX= 6.0         $$ Bruker NMR JCAMP-DX V2.0
##DATA TYPE= NMR SPECTRUM
##DATA CLASS= NTUPLES
##ORIGIN= BRUKER
##OWNER= Administrator
$$ 1.72 TOPSPIN		Version 2.1
$$ 2015-07-11 22:34:05.988 -0700  Administrator@X
$$ Compression mode = diff/dup
##.OBSERVE FREQUENCY= 400.02188249412
##.OBSERVE NUCLEUS= ^1H
##.ACQUISITION MODE= SIMULTANEOUS (DQD)
##.ACQUISITION SCHEME= undefined
##.AVERAGES= 64
##.DIGITISER RES= 22
##SPECTROMETER/DATA SYSTEM= spect
##.PULSE SEQUENCE= noesygpps1d.comp
##.SOLVENT NAME= COFFEE_meoh
##.SHIFT REFERENCE= INTERNAL, COFFEE_meoh, 1, 14.96451
##AUDIT TRAIL= $$ (NUMBER, WHEN, WHO, WHERE, PROCESS, VERSION, WHAT)
$$ ##TITLE= Audit trail, TOPSPIN		Version 2.1
$$ ##JCAMPDX= 5.01
$$ ##ORIGIN= Bruker BioSpin GmbH
$$ ##OWNER= Administrator
$$ $$ E:\/data/COFFEE/nmr/NES1027_Brazil_9268334_IjYqnQ15Sc/22/pdata/1/auditp.txt
$$ ##AUDIT TRAIL=  $$ (NUMBER, WHEN, WHO, WHERE, PROCESS, VERSION, WHAT)
(   1,<2015-07-11 22:34:00.675 -0700>,<Administrator>,<X>,<go>,<TOPSPIN 2.1>,
      <created by zg
	started at 2015-07-11 22:22:30.956 -0700,
	POWCHK enabled, PULCHK disabled,
       configuration hash MD5:
       21 0F 79 D6 B3 7B B4 F6 88 20 88 DB 03 48 BD 9F
       data hash MD5: 64K
       B1 6D D2 0D 0C 35 60 04 81 EF EF A2 A2 3B AD 37>)
(   2,<2015-07-11 22:34:03.863 -0700>,<Administrator>,<X>,<proc1d>,<TOPSPIN 2.1>,
      <Start of raw data processing
       efp LB = 0.3 FT_mod = 6 PKNL = 1 PHC0 = 0 PHC1 = 0 SI = 128K 
       data hash MD5: 128K
       3B 10 33 F3 18 2B 34 AF 99 E0 E1 A8 42 18 FF 7C>)
(   3,<2015-07-11 22:34:04.769 -0700>,<Administrator>,<X>,<proc1d>,<TOPSPIN 2.1>,
      <pk PHC0 = -84.78149 PHC1 = 0 
       data hash MD5: 128K
       F9 D0 5A C6 DD AF 47 C6 40 D7 3A C4 73 95 91 74>)
(   4,<2015-07-11 22:34:05.160 -0700>,<Administrator>,<X>,<proc1d>,<TOPSPIN 2.1>,
      <abs ABSG = 1 
       data hash MD5: 128K
       A6 D9 6F 16 93 30 72 13 8A AA C2 BD E5 B2 F5 0E>)
(   5,<2015-07-11 22:34:05.253 -0700>,<Administrator>,<X>,<proc1d>,<TOPSPIN 2.1>,
      <abs ABSG = 2 
       data hash MD5: 128K
       4E E4 A8 B4 BB D1 C4 DF 68 11 4F FF 49 CE 39 BF>)
(   6,<2015-07-11 22:34:05.347 -0700>,<Administrator>,<X>,<proc1d>,<TOPSPIN 2.1>,
      <abs ABSG = 3 
       data hash MD5: 128K
       6B 8C 86 29 64 C6 7C 00 38 71 21 C8 E9 16 D9 F6>)
(   7,<2015-07-11 22:34:05.441 -0700>,<Administrator>,<X>,<proc1d>,<TOPSPIN 2.1>,
      <abs ABSG = 4 
       data hash MD5: 128K
       4B 90 90 01 ED 0E 99 2D 70 7E A7 57 82 61 CA 79>)
(   8,<2015-07-11 22:34:05.566 -0700>,<Administrator>,<X>,<proc1d>,<TOPSPIN 2.1>,
      <abs ABSG = 5 
       data hash MD5: 128K
       10 B0 11 0C 70 02 34 18 97 53 35 45 29 97 D1 23>)
$$ ##END=
$$ 
$$ $$ hash MD5
$$ $$ E6 35 F1 0C 6A 87 C2 B1 39 F7 A4 B6 6E 61 82 44
##$RELAX= 
##$RELAX= 
##$RELAX= 
##$RELAX= 
##$RELAX= 
##$RELAX= 
##$RELAX= 
##$RELAX= 
$$ Bruker specific parameters
$$ --------------------------
##$DU= <E:\>
##$EXPNO= 22
$$ [...]
##$TP07= 0
##$TPNAME0= <>
##$TPNAME1= <>
##$TPNAME2= <>
##$TPNAME3= <>
##$TPNAME4= <>
##$TPNAME5= <>
##$TPNAME6= <>
##$TPNAME7= <>
##$TPOAL= (0..7)
0.5 0.5 0.5 0.5 0.5 0.5 0.5 0.5
##$TPOFFS= (0..7)
0 0 0 0 0 0 0 0
##$TUNHIN= 0
##$TUNHOUT= 0
##$TUNXOUT= 0
##$USERA1= <user>
##$USERA2= <user>
##$USERA3= <user>
##$USERA4= <user>
##$USERA5= <user>
##$V9= 5
##$VALIST= <valist>
##$VCLIST= <CCCCCCCCCCCCCCC>
##$VD= 0
##$VDLIST= <DDDDDDDDDDDDDDD>
##$VPLIST= <PPPPPPPPPPPPPPP>
##$VTLIST= <TTTTTTTTTTTTTTT>
##$WBST= 2048
##$WBSW= 25
##$XGAIN= (0..3)
0 0 0 0
##$XL= 0
##$YL= 0
##$YMAX_a= 14556747
##$YMIN_a= -23313731
##$ZGOPTNS= <>
##$ZL1= 120
##$ZL2= 120
##$ZL3= 120
##$ZL4= 120
##$ABSF1= 14.96451
##$ABSF2= -5.593672
##$ABSG= 5
##$ABSL= 3
##$ALPHA= 0
##$AQORDER= 0
##$ASSFAC= 0
##$ASSFACI= 0
##$ASSFACX= 0
##$ASSWID= 0
##$AUNMP= <proc_prof1d_extract.lims>
##$AXLEFT= 0
##$AXNAME= <>
##$AXNUC= <1H>
##$AXRIGHT= 0
##$AXTYPE= 0
##$AXUNIT= <>
##$AZFE= 0.1
##$AZFW= 0.1
##$BCFW= 0
##$BC_mod= 0
##$BYTORDP= 0
##$COROFFS= 0
##$CY= 15
##$DATMOD= 1
##$DC= 0
##$DFILT= <>
##$DTYPP= 0
##$F1P= 0
##$F2P= 0
##$FCOR= 0.5
##$FTSIZE= 131072
##$FT_mod= 6
##$GAMMA= 0
##$GB= 0
##$INTBC= 1
##$INTSCL= 1
##$ISEN= 128
##$LB= 0.3
##$LEV0= 0
##$LPBIN= 0
##$MAXI= 10000
##$MC2= 0
##$MEAN= 0
##$ME_mod= 0
##$MI= 0
##$NCOEF= 0
##$NC_proc= -2
##$NLEV= 6
##$NOISF1= 0
##$NOISF2= 0
##$NSP= 0
##$NTH_PI= 0
##$NZP= 0
##$OFFSET= 14.96451
##$PC= 1
##$PHC0= -84.78149
##$PHC1= 0
##$PH_mod= 1
##$PKNL= yes
##$PPARMOD= 0
##$PPDIAG= 0
##$PPIPTYP= 0
##$PPMPNUM= 2147483647
##$PPRESOL= 1
##$PSCAL= 4
##$PSIGN= 0
##$PYNMP= <proc.py>
##$REVERSE= no
##$SF= 400.020008231417
##$SI= 131072
##$SIGF1= 0
##$SIGF2= 0
##$SINO= 400
##$SIOLD= 131072
##$SPECTYP= <>
##$SREGLST= <1H.CDCl3>
##$SSB= 0
##$STSI= 131072
##$STSR= 0
##$SW_p= 8223.68421052631
##$SYMM= 0
##$S_DEV= 0
##$TDeff= 65536
##$TDoff= 0
##$TI= <>
##$TILT= no
##$TM1= 0
##$TM2= 0
##$TOPLEV= 0
##$USERP1= <user>
##$USERP2= <user>
##$USERP3= <user>
##$USERP4= <user>
##$USERP5= <user>
##$WDW= 1
##$XDIM= 131072
##$YMAX_p= 427601945
##$YMIN_p= -11365
##$CURPLOT= <Network HP LaserJet P1505>
##$CURPRIN= <$Network HP LaserJet P1505>
##$DFORMAT= <normdp>
##$LAYOUT= <+/1D_H.xwp>
##$LFORMAT= <normlp>
##$PFORMAT= <normpl>
##$SURQMSG= 1
$$ End of Bruker specific parameters
$$ ---------------------------------
##NTUPLES= NMR SPECTRUM
##VAR_NAME=  FREQUENCY,     SPECTRUM/REAL,   SPECTRUM/IMAG
##SYMBOL=    X,             R,               I
##VAR_TYPE=  INDEPENDENT,   DEPENDENT,       DEPENDENT
##VAR_FORM=  AFFN,          ASDF,            ASDF
##VAR_DIM=   131072,        131072,          131072
##UNITS=     HZ,            ARBITRARY UNITS, ARBITRARY UNITS
##FACTOR=    0.0627417313425164, 1,          1
##FIRST=     8223.62146879497, 1219,         -111182
##LAST=      0,             4302,            -110741
##MIN=       0,             -11365,          0
##MAX=       8223.62146879497, 427601945,    0
$$ Real data points
##PAGE= N=1
##DATA TABLE= (X++(R..R)), XYDATA
$$ [...]
64291 428065 429101 429739 429923 430326 431557 433370 435095 436799 439418 443587 448894 454523 460156 466003 472467
64276 472467 480082 489301 499948 511177 522182 532601 542152 550481 557758 564878 572644 581125 590163
64263 590163 600051 611302 624118 638495 654500 672123 691224 711956 734865 760304 788237 818884
64251 818884 852922 890731 932220 977949 1029659 1088911 1155893 1230455 1313829 1408402 1516337
64240 1516337 1639605 1781070 1944221 2131637 2344739 2585350 2856606 3162100 3504979
64231 3504979 3888295 4315320 4788362 5306547 5863570 6445113 7025570 7565623 8013905
64222 8013905 8315156 8423974 8318957 8010104 7535419 6948910 6306403 5654877 5027675
64213 5027675 4445006 3917297 3448434 3037583 2680508 2371418 2104596 1874788 1676979
64204 1676979 1506633 1360038 1233839 1124516 1028861 944793 871110 806657 750266 701220
64194 701220 658953 622260 589431 559277 531538 506318 483630 463412 445450 429212 414135
64183 414135 400002 386682 373853 361524 350487 341448 333871 326529 319162 312657 307533 303150 298702
64170 298702 294140 289742 285523 281557 278260 275818 273742 271484 269166 267323 266144 265301 264325 262885 260918
64155 260918 258789 257178 256609 257109 258347 259968 261863 264224 267252 270651 273671 275972 278197 281216 285079
64140 285079 289265 293705 298785 304396 309773 314426 318456 321802 323920 324510 323868 322175 319100 314520 309075
64125 309075 303498 297910 292211 286706 281745 277108 272364 267643 263570 260542 258490 257234 256615 256308 255874
64110 255874 255112 254186 253389 252933 252884 253187 253743 254533 255559 256713 257869 259135 260792 262841 264886 266535
64094 266535 267713 268475 268750 268504 267972 267520 267357 267520 268015 268780 269597 270237 270770 271671 273455 276144 279161
64077 279161 281962 284726 288103 292213 296317 299712 302600 305660 309128 312843 316973 322089 328490 335851
64063 335851 343553 351034 357965 364619 371972 380934 391410 402484 413422 424002 434020 443150 451350
64050 451350 458683 464625 468193 469072 468115 466522 465057 464235 464604 466298 468750 471396 474468 478715 484489
64035 484489 491426 498963 506933 515689 525704 537002 549054 561389 574197 588062 603232 619549
64023 619549 636961 655568 675096 694864 714434 733999 754032 774943 797111 820788 845877
64012 845877 872204 899995 929684 961255 994302 1028684 1064507 1101473 1139055 1177519 1218042
64001 1218042 1261446 1307481 1355682 1406312 1460039 1517274 1578274 1643415 1713002 1787407 1867874
63990 1867874 1956609 2055441 2164855 2284965 2417212 2564570 2730448 2917981 3130202 3370428
63980 3370428 3642588 3951543 4302795 4701379 5151087 5654816 6214852 6831786 7502968
63971 7502968 8222332 8981740 9772451 10585861 11413418 12245436 13069049 13866825 14617499
63962 14617499 15298359 15887895 16368233 16727270 16959396 17063830 17041666 16893903 16621343
63953 16621343 16225687 15711247 15086998 14367860 13573922 12727844 11851997 10966402 10087507
63944 10087507 9227910 8397227 7603562 6854513 6157267 5517987 4940742 4426452 3972763
63935 3972763 3575219 3228719 2928016 2667486 2441240 2243762 2070359 1917132 1780903
63926 1780903 1659207 1550185 1452332 1364331 1284823 1212184 1144744 1081499 1022392 967605 916745
63915 916745 868994 823882 781524 742172 705856 672386 641347 612131 584270 557755 532823
63904 532823 509513 487743 467677 449637 433552 418856 405040 392119 380426 370135 361080 352969
63892 352969 345598 338818 332310 325528 318080 310147 302363 295221 288792 282999 277879 273458 269651 266459
63878 266459 263914 261606 258631 254440 249595 245349 242549 241149 240560 240045 238929 236885 234118 231029 227732
63863 227732 224127 220376 216904 213811 210638 206898 202688 198598 195153 192466 190349 188551 186796 184737
63849 184737 182089 178978 176057 174092 173342 173370 173429 172953 171790 170189 168594 167297 166238 165288 164663 164809
63833 164809 165804 167056 167673 167076 165375 163386 162249 162617 164075 165536 166284 166478 166688 167233 168011 168665 168791
63816 168791 168240 167294 166343 165313 163695 161243 158414 155983 154331 153116 151524 148973 145780 142991 141320
63801 141320 140433 139637 138989 139103 139998 140872 141103 140855 140516 140167 139804 139563 139435 139156 138611 137979 137421 137055 137207
63782 137207 138121 139310 139905 139763 139598 139852 140242 140666 141688 143521 145285 145927 145429 144540 143804 143371 143333 143669
63764 143669 144135 144692 145743 147637 150268 153434 157067 160853 164279 167467 171328 176366 181954 187378 192919
63749 192919 199224 206231 213548 221372 230120 239455 248561 257204 265709 273914 280777 285025 285821 283091
63735 283091 277749 271341 264872 258177 250819 243207 236162 229741 223198 216013 208406 201018 194538 189404
63721 189404 185359 181562 177584 173943 171281 169509 168291 167766 168099 168796 169309 169839 170725 171525 171690 171806
63705 171806 173124 175987 179632 183383 187134 190863 194608 198845 203981 209527 214558 218940 223266 227796
63691 227796 232325 236900 241620 245847 248676 250211 251259 251730 250449 246774 241346 234959 227760 219912
63677 219912 212106 204896 198275 192296 187399 183798 181195 179393 178469 178101 177519 176512 175831 176192 177473
63662 177473 179196 181160 183289 185417 187570 189961 192518 195007 197700 201193 205400 209511 213236 217341
63648 217341 222614 229000 236039 243359 250360 256199 260627 264197 267215 269172 269672 269277 268830 268507 267999
63633 267999 267128 265796 263923 261923 260673 260528 260859 261070 261451 262405 263417 263512 262359 260250 257376 253862
63617 253862 250242 247141 244496 241664 238288 234642 231237 228459 226545 225514 225122 225037 225016 224855 224475 224202
63601 224202 224585 225709 227017 228035 228926 230048 231408 232980 235213 238702 243367 248350 252760 256446 260121
63586 260121 264761 270687 277204 283255 288295 292264 294996 296305 296552 296368 295734 294058 291351 288538 286350
63571 286350 284696 283524 283513 285307 288630 292702 297003 301146 304585 307137 309377 311964 314932 318086 321584
63556 321584 325508 329358 332618 335486 338398 341186 343364 344895 345868 345616 343000 337634 330191 321471 311739
63541 311739 301078 289853 278605 267778 257658 248400 240090 232882 226953 222196 218165 214480 211091
63528 211091 208018 205153 202568 200670 199752 199663 200151 201129 202346 203291 203907 204949 207053 209740 211973 213478
63512 213478 214925 216963 219754 223452 228478 235103 243092 251868 260787 269274 277038 284307 291662 299552
63498 299552 307896 316044 323061 328346 332063 334796 336712 337364 336348 333739 329794 324793 319332 314145
63484 314145 309225 303763 297453 291305 286491 282892 279539 276147 273323 271395 269869 268145 266169 264283
63470 264283 262958 262707 263836 266170 269323 273154 277618 282350 286892 291290 296018 301376 307393 314155
63456 314155 321758 329951 338358 346963 355801 364186 370916 375452 378353 380258 380925 379640 376288 371655
63442 371655 366865 362755 359623 357294 355450 354021 353317 353704 355166 357122 358582 358532 356397 352280 346767
63427 346767 340451 333619 326344 318873 311898 306289 302394 299672 297256 294762 292327 290027 287754 285695
63413 285695 284378 283996 284126 284361 284842 285871 287392 289258 291668 294920 298922 303312 307945 312935 318351
63398 318351 324134 330242 336676 343448 350540 357707 364325 369820 374318 378342 381746 383561 383252 381517
63384 381517 379366 376950 373928 370586 367803 366102 365374 365419 366177 367473 369006 370623 372176 373163 372889 371043
63368 371043 367865 363800 359235 354410 349339 343925 338264 332612 326905 320746 314109 307606 301648 295801
63354 295801 289498 283018 277180 272322 268167 264422 260906 257191 252808 247864 243092 239238 236641 235210
63340 235210 234440 233717 232940 232626 232994 233324 232782 231643 231059 231743 233413 235421 237346 239019 240480 241950
63324 241950 243453 244571 244861 244388 243482 242236 240637 238860 236938 234440 231120 227663 225157 223955 223596
63309 223596 223599 223659 223274 222026 220233 218664 217581 216668 215842 215440 215521 215663 215597 215520 215663 216022 216571 217267 217829
63290 217829 218025 218157 218767 219865 220907 221465 221418 220577 218789 216456 214406 213139 212578 212406 212158 211270 209773
63273 209773 208742 209244 210896 212383 213331 214656 216899 219362 221287 222890 224605 226135 227027 227589 228471
63258 228471 229733 230982 232202 233867 236348 239662 243639 247974 252219 256024 259375 262509 265780 269722
63244 269722 274905 281425 288709 296028 303106 310156 317489 325201 333128 341119 349470 358983 370341 383449
63230 383449 397670 412551 427964 443694 459434 475189 491223 507468 523401 538602 553107
63219 553107 567140 580868 594502 608277 622208 636132 649997 663877 677656 690913 702997
63208 702997 713026 720024 723440 723302 719576 711783 699838 684809 668109 650170 630748 610268 589895
63195 589895 570362 551775 534664 520061 508231 498286 489550 482438 477566 474788 473637 474023 475959
63182 475959 479293 484292 491812 502158 514219 526417 538242 550283 563026 576218 589234 601643
63170 601643 613462 625202 637498 650435 663393 675728 687340 698370 708645 717679 724963 730085
63158 730085 732789 733089 731025 726260 718249 706949 692981 676965 659134 639816 619832 600088 581014
63145 581014 562565 544534 526856 509934 494677 481790 470993 461401 452571 444605 437288 429940
63133 429940 422278 414642 407200 399713 392388 386101 381272 377232 373215 369307 365919 362992 360342 358215
63119 358215 356859 355991 355290 354993 355432 356390 357472 358760 360471 362339 363931 365346 367100 369525 372745
63104 372745 376964 382291 388395 394667 400501 405266 408532 410692 412846 415579 418222 419787 420158 419858 419128
63089 419128 417940 416608 415635 415058 414497 413848 413525 414025 415483 417524 419471 421030 422852 425924 430276 434979
63073 434979 439644 445049 451780 459171 466337 473488 481266 489473 497462 505343 513732 522657 531799 541497
63059 541497 552407 564374 576843 590364 606485 625914 647808 671128 695708 721666 748752
63048 748752 776802 806180 837224 869713 903247 937593 972387 1007013 1041173 1075104 1108859
63037 1108859 1141809 1173250 1203206 1232296 1261130 1290059 1319160 1348075 1376092 1402561 1426913
63026 1426913 1448165 1464863 1475919 1481096 1480293 1472728 1457468 1434627 1405509 1371556 1333606 1292274
63014 1292274 1248612 1204141 1160350 1118341 1078782 1042028 1008327 977984 951283 928279 908894
63003 908894 893335 882197 875868 873888 875279 879597 887405 899539 916100 936239 958648 982082
62991 982082 1005764 1029685 1054391 1080142 1106407 1132402 1157861 1182837 1207041 1229985 1251663
62980 1251663 1272423 1292026 1309374 1323279 1332978 1337781 1336766 1329108 1314338 1292237 1262974 1227547
62968 1227547 1187570 1144303 1098271 1049947 1000411 951046 902945 856702 812378 769635 728470
62957 728470 689942 655565 625784 599600 575801 553864 533543 514575 497280 482593 470803
62946 470803 460879 451622 442801 434597 426706 418847 411488 405142 399333 393171 386604 380252 374327 368586
62932 368586 363130 358327 354003 349509 344612 339664 334895 330149 325307 320443 315645 311102 307203 304072
62918 304072 301279 298518 296204 294708 293393 291256 288339 285608 283523 281635 279671 278098 277327 277073 276828
62903 276828 276477 276175 276076 276352 277151 278331 279542 280597 281493 282069 282002 281138 279607 277732 276051 275098 274764
62886 274764 274203 272841 271208 270186 269742 269117 268080 267240 267149 267789 268910 270214 271164 271325 270982 270886 271301
62869 271301 271834 272167 272371 272460 272267 271840 271417 270962 270298 269712 269818 270724 271918 273115 274613 276635 278844
62852 278844 280762 282336 283931 286050 288945 292171 294701 296060 297204 299560 303233 306860 309310 310808
62838 310808 312211 313886 315620 317121 318252 319148 320238 321777 323296 324072 324182 324555 325843 327796 329916
62823 329916 332069 334183 335946 337216 338411 340120 342549 345482 348528 351295 353668 356005 358803 362169
62809 362169 365930 370181 375284 381335 388086 395447 403618 412787 423082 434691 447464 460601 473463
62796 473463 486627 501395 518243 536607 556308 578152 602776 629751 658342 688493 720548
62785 720548 754609 790713 829197 870349 914006 959783 1007320 1055946 1104603 1152564 1199905
62774 1199905 1246827 1292707 1336056 1375091 1408043 1433315 1449818 1457159 1455355 1444569 1425192 1397893
62762 1397893 1363490 1323023 1277896 1229503 1178645 1125804 1072001 1018771 967167 917366 869443
62751 869443 823886 781066 740848 703155 668336 636565 607375 580277 555425 533208 513561
62740 513561 496110 480643 467059 455157 444828 436161 429007 422780 417062 412087 408320 405936 405034
62727 405034 405845 408227 411323 414343 417473 421527 426893 433330 440614 448752 457670 467325 478259 491504
62713 491504 507584 525817 544880 564015 583581 604520 627504 652741 680429 710972 744542
62702 744542 780711 818883 858944 901091 945113 990237 1035612 1080458 1123695 1163890 1199687
62691 1199687 1229983 1253694 1269854 1278087 1278565 1271411 1256516 1234062 1204789 1169588 1129219 1084579
62679 1084579 1036930 987758 938659 891150 846037 802939 761037 720396 682017 646544 613610
62668 613610 582674 553832 527494 503835 482845 464361 447725 431923 416462 401743 388343
62657 388343 376415 365957 356992 349143 341636 334225 327649 322747 319530 317410 315847 314390 312643 310649
62643 310649 308877 307396 305577 303021 300213 297725 295309 292464 289456 287015 285268 283680 281918 280145
62629 280145 278580 277308 276539 276525 277181 278149 279235 280562 282356 284815 288084 292123 296631 301254 305754
62614 305754 309957 313877 317982 322978 329134 336086 343489 351550 360714 371199 383011 396087 410262
62601 410262 425439 441941 460288 480501 502070 524656 548194 572196 595757 618678 641845
62590 641845 665867 689843 712029 731311 747538 760778 770730 776569 777093 771531 760554 745976
62578 745976 729050 709594 687182 662375 636185 609126 581636 554746 529273 504795 480533
62567 480533 457001 435709 417306 401034 386046 372244 359637 347841 336767 327125 319681 314275
62555 314275 309991 306113 302639 299952 298230 297256 296751 296728 297322 298291 299061 299347 299426 299662 300150 300953 302231
62538 302231 303884 305553 307278 309667 313009 316752 320392 324374 329483 335735 342644 350386 359884 371637
62524 371637 385058 399121 413315 427875 443427 460547 479511 500359 523049 547342 572567
62513 572567 597894 622883 647376 670743 691789 709601 724032 735084 742306 745073 743074 736355
62501 736355 725377 711170 694785 676390 655637 633048 610122 587709 565373 542966 521645
62490 521645 502377 484388 466293 448136 431136 415873 401891 388765 376471 364874 353877
62479 353877 343931 335500 328185 321208 314590 309007 304646 301027 297750 294621 291273 287495 283770 280680
62465 280680 278037 275445 273394 272723 273159 273493 273219 273029 273587 274768 276180 277509 278263 278087 277570 277986 279950
62448 279950 282959 286305 289800 293552 297730 302638 308401 314550 320522 326440 332791 339552 346464 353925
62434 353925 362601 372145 381364 389740 397855 406135 414160 421435 427889 433335 437273 439556 440542 440338 438634
62419 438634 435503 431571 427170 422108 416528 411221 406775 403111 400072 397741 395927 394180 392636 392121
62405 392121 393151 395535 399183 404431 411226 418882 427109 436479 447442 459660 472820 487291 503399
62392 503399 520834 539384 559522 581442 604108 626100 647022 667301 686955 705344 721973
62381 721973 736822 749907 760999 769776 775905 779099 779439 777542 774195 769958 765266 760549 755927 751015
62367 751015 745314 738685 731330 723606 715995 708843 701940 694691 686938 679183 671729 664034 655342 645675
62353 645675 635743 626060 616605 607329 598627 591137 585193 580563 576784 573720 571641 570673 570435 570434 570525 570565
62337 570565 569892 567735 564087 559592 554552 548543 541117 532391 522907 513332 504324 496236 488866 481865
62323 481865 475364 469746 464898 460286 455741 451607 448136 445360 443594 443291 444197 445315 445918 446069 446006 445728
62307 445728 445486 446027 447849 450559 453347 455806 458091 460571 463519 466923 470495 474095 478040 482724 488083
62292 488083 493852 500098 506961 514086 521032 528088 535985 544910 554555 564919 576120 587504 598100
62279 598100 608139 619128 632070 646489 661407 676378 691274 706033 720995 736620 752465
62268 752465 767253 780343 792240 803368 813271 821471 828193 833716 837926 840971 843412 845163 845288
62255 845288 843515 840955 838485 835406 830671 824700 818919 814073 809942 806198 802627 798938 795297 792733
62241 792733 792232 793668 796288 799840 804507 810136 816287 822765 829471 836112 842708 849959 858442 867839
62227 867839 877609 887930 899158 910803 922006 932731 943650 955085 966951 979518 993259 1007970
62215 1007970 1022928 1038052 1054166 1071988 1091425 1112017 1133513 1155894 1179235 1203641 1228988
62204 1228988 1254730 1280221 1305083 1328922 1350898 1370057 1386032 1399037 1409245 1416566 1421124 1423710
62192 1423710 1425696 1428422 1432394 1437076 1441851 1447269 1454868 1465548 1478642 1492794 1507193 1521619 1535904
62179 1535904 1549839 1563149 1575144 1584933 1592346 1598083 1602478 1604804 1604369 1601702 1597974 1593748 1588958
62166 1588958 1583528 1577225 1569345 1559418 1547956 1535838 1523253 1509933 1496033 1482085 1468374 1455118
62154 1455118 1442912 1432211 1422644 1413606 1405267 1398219 1392381 1387090 1382171 1378071 1375013 1372834 1371561
62141 1371561 1371317 1371532 1371102 1369624 1367952 1367235 1367715 1368589 1368795 1367859 1366157 1364266 1362077 1358882 1354484 1349677
62125 1349677 1345303 1341343 1337398 1333521 1330032 1327006 1324519 1322937 1322371 1322347 1322646 1324006 1327330 1332634 1339363
62110 1339363 1347037 1354763 1360803 1363787 1364062 1363037 1361779 1361310 1363513 1370001 1379978 1390395 1398291 1402061
62096 1402061 1400879 1394533 1384089 1371323 1357021 1340757 1322517 1303320 1283919 1264119 1243943 1224413
62084 1224413 1206548 1190481 1176167 1164033 1154151 1145513 1136963 1128373 1120189 1112234 1103661 1093880 1082941
62071 1082941 1071181 1058978 1046764 1034902 1023582 1012957 1003189 994274 986083 978747 972768 968648
62059 968648 966620 966875 969831 976168 986870 1003106 1025615 1054012 1086829 1122003 1156867 1187641
62047 1187641 1209628 1218457 1211474 1188478 1151737 1105250 1053348 999606 946849 897473 852983 813347
62035 813347 777629 745487 717549 694318 675291 659386 645817 634410 625411 619053 615028 612421
62023 612421 610535 609623 610414 613079 617177 622434 628877 636251 644062 652263 661187 670550 679107 685538 689213
62008 689213 689872 687140 680744 670950 658541 644540 630010 615797 602281 589556 577824 567367
61996 567367 558245 550350 543718 538469 534578 532035 531073 531833 533883 536493 539248 542104 545084 548432 552803
61981 552803 558712 565890 573680 581936 591023 601221 612756 626139 641732 659051 677165 695628
61969 695628 714387 732993 750782 767660 783830 798805 811657 822362 831976 841338 850516 859776
61957 859776 870140 882527 897053 913634 932677 954806 980479 1010304 1045256 1086186 1133364
61946 1133364 1186756 1246461 1312818 1386546 1468991 1561899 1666743 1784255 1914055 2053660
61936 2053660 2197147 2334657 2453175 2538368 2577706 2564474 2500318 2394244 2259141 2108702
61926 2108702 1955449 1808890 1674349 1553847 1448041 1356773 1278398 1210161 1149773 1095976
61916 1095976 1047746 1004121 964912 930405 900093 872786 848238 827530 811370 799064 789588
61905 789588 782628 777901 774392 770991 767294 763161 758105 751647 743808 734937 725510 716329 708330 702089
61891 702089 698055 697185 700311 706810 714974 724014 734770 748234 764491 783372 804830 828113 851785
61878 851785 875255 899244 924163 949173 973525 997561 1021531 1044608 1066181 1087043 1108133
61867 1108133 1128968 1148515 1166799 1184401 1201056 1216091 1229757 1242842 1255299 1266396 1275953
61856 1275953 1284270 1291054 1295555 1297692 1298138 1297347 1295423 1292900 1290836 1290090 1291036 1293716 1297570 1301314 1303951
61841 1303951 1305889 1308431 1312324 1317528 1324277 1333610 1346847 1365172 1389800 1422165 1463873 1516623
61829 1516623 1581858 1660275 1752104 1858077 1979278 2115080 2261152 2409359 2548427 2664210
61819 2664210 2741230 2767106 2737333 2656379 2535102 2387611 2228813 2071718 1925035 1793097
61809 1793097 1677765 1579729 1498303 1431442 1376742 1332131 1295574 1265018 1239073 1217297 1199481
61798 1199481 1184960 1172777 1162103 1152326 1143001 1133865 1124692 1115073 1104509 1092607 1078992 1063288
61786 1063288 1045616 1026930 1008422 990601 973281 956380 940339 925835 913362 903026 894507
61775 894507 887275 881069 876028 872293 869750 868250 867625 867333 866637 865543 865035 865973 868145 870733 873117
61760 873117 874813 875357 874987 874845 875676 876782 877023 876451 876038 876150 876264 876031 875685 875421 875222 875334 876168 877690
61742 877690 879579 881960 885353 889898 895276 901378 908435 916489 925308 934818 945052 955712 966344
61729 966344 976863 987352 997460 1006637 1014844 1022402 1029312 1035548 1042002 1050311 1061581 1075958 1093516
61716 1093516 1114774 1140187 1169917 1204446 1244713 1291096 1342599 1397161 1452081 1503655 1547001
61705 1547001 1577280 1591715 1590695 1577161 1555008 1527787 1498414 1469362 1442168 1416352 1389346
61694 1389346 1358278 1321940 1280911 1236322 1189185 1140708 1092397 1045632 1001448 960646 923655
61683 923655 890398 860759 835047 813432 795132 778904 764368 752088 742206 733757 725690 718030
61671 718030 711555 706632 702750 699094 695282 691536 688217 685268 682267 679042 675933 673317 671140 669110
61657 669110 666911 663973 659558 653674 647536 642469 638523 634724 630413 625722 620979 616381 612165 608365
61643 608365 604434 599817 594934 590957 588556 587427 587106 587566 588839 590671 592825 595349 598374 601947 606102
61628 606102 610691 615118 618682 621293 623563 626199 629561 633689 638341 643120 648001 653665 660899 669702
61614 669702 679372 689301 699318 709434 719819 730851 742687 754925 767192 779856 793611 808636
61602 808636 824871 842949 863968 888363 915640 945093 975987 1007189 1037627 1067331 1097222
61591 1097222 1127859 1159324 1192563 1229772 1272989 1323102 1380749 1447349 1524470 1612601 1711134
61580 1711134 1819066 1934917 2055797 2176648 2290098 2386948 2457626 2494381 2493094 2453980
61570 2453980 2381464 2283493 2169885 2050082 1931585 1819774 1718172 1628414 1550394 1483147
61560 1483147 1425806 1377820 1338536 1306813 1280988 1259259 1240199 1222807 1205967 1188268 1168855
61549 1168855 1148354 1128360 1109954 1093190 1077919 1064490 1053389 1044732 1038403 1034373 1032626 1033078
61537 1033078 1035783 1041046 1049255 1060737 1075805 1094696 1117496 1144295 1175315 1210637 1250020 1293366
61525 1293366 1341296 1394974 1455602 1524441 1603055 1692861 1794496 1908080 2034001 2172994
61515 2172994 2325696 2492803 2675480 2874698 3089809 3317935 3554194 3791120 4017186
61506 4017186 4216649 4372390 4470824 4506657 4485500 4422844 4339442 4255715 4188356 4149618 4147586
61495 4147586 4186697 4269118 4396476 4570044 4789211 5050193 5346003 5666377 5996766 6317688
61485 6317688 6605836 6836408 6985490 7032554 6963795 6776176 6480581 6101601 5672353 5225926
61475 5225926 4788246 4375981 3998468 3660019 3361030 3098891 2869306 2667382 2488514
61466 2488514 2329485 2188904 2065983 1958974 1865473 1783966 1714052 1655170 1606180 1566374
61456 1566374 1535844 1514422 1501110 1495128 1496818 1507028 1526041 1553576 1589406 1633616 1686514 1748581
61444 1748581 1820332 1902265 1995193 2100473 2219512 2353124 2501552 2664398 2839305 3020272
61434 3020272 3197368 3357754 3486904 3570736 3599677 3572653 3497642 3388708 3262336 3134379
61424 3134379 3017159 2917873 2840160 2786985 2761075 2763148 2791873 2846191 2926129 3030589 3155333
61413 3155333 3293160 3433890 3562867 3661032 3709026 3692928 3608102 3460560 3265933 3045042
61403 3045042 2817214 2595934 2389379 2202759 2038875 1897858 1778336 1678949 1598214 1533745
61393 1533745 1482857 1443744 1415422 1396974 1387514 1386264 1391829 1401752 1413305 1424155 1431802 1433343
61381 1433343 1426936 1413076 1393715 1370546 1344625 1316725 1286894 1254145 1217678 1178296 1137906
61370 1137906 1098045 1059572 1023316 990047 959987 933029 909212 888418 869995 853315 838304
61359 838304 824836 812119 799508 787516 777232 769025 762491 757329 753538 751081 750051 750889 753774
61346 753774 758129 763427 770144 779162 790509 803408 817341 832412 848845 866776 886334 907311
61334 907311 928882 950067 970125 988066 1002261 1011326 1015237 1015201 1012903 1010404 1010108 1013785 1021694 1033239
61320 1033239 1048245 1067039 1089645 1115559 1143954 1173394 1201590 1226105 1245253 1257919 1263060
61309 1263060 1260198 1250289 1235532 1218438 1201389 1186513 1175200 1167800 1164249 1164584 1168483 1174882 1182770
61296 1182770 1192061 1203139 1216023 1230572 1246926 1264992 1283818 1302090 1318812 1332893 1342711 1346987
61284 1346987 1345882 1340707 1333072 1324933 1318669 1316033 1317353 1322440 1331745 1345708 1363624 1384247 1407125
61271 1407125 1432298 1459110 1486464 1513923 1541455 1568274 1593059 1615149 1634618 1651514 1666217
61260 1666217 1680383 1696262 1715028 1736736 1761848 1791618 1826931 1867868 1914698 1968359 2029862
61249 2029862 2100124 2180551 2272866 2378172 2497052 2630836 2782004 2952915 3144464 3355773
61239 3355773 3584126 3824384 4068017 4302009 4508499 4667359 4762498 4788343 4751684 4668232
61229 4668232 4557287 4437087 4321213 4216980 4127038 4052807 3996475 3960527 3946647 3955336 3985904
61218 3985904 4036746 4105972 4190909 4285361 4376757 4446615 4474547 4443161 4342485 4173563 3949003
61207 3949003 3688353 3411035 3132276 2863311 2612278 2383813 2179188 1997935 1839014
61198 1839014 1700608 1580248 1475790 1385522 1307190 1238199 1177276 1124792 1080908 1044493 1014381
61187 1014381 990475 972611 959300 948680 940226 934636 932443 933483 937288 943033 949029 952785 951712
61174 951712 943944 929032 908296 884222 859222 834983 812688 793163 776576 762571 750974 742057
61162 742057 736031 732775 732052 733394 735703 737719 739144 740751 743204 746386 750031 754298 759296 764636
61148 764636 769929 775404 781662 789036 797384 806380 816000 826878 839945 855351 872040 888926 906129
61135 906129 924294 942903 960114 974122 983727 987617 984325 973520 956684 936110 913630 890446
61123 890446 867534 845845 826352 809920 796757 786140 777176 769641 763592 758598 754195 750833 749395
61110 749395 749920 751685 754369 758166 762922 768227 774271 781415 788954 795528 800903 806198 812212 818615
61096 818615 824898 830946 836567 841575 846573 852500 859327 866400 874037 883305 894126 905307 916702
61083 916702 929505 943748 957350 968634 978226 987421 996157 1003897 1011180 1018845 1026601 1033675 1040190
61070 1040190 1046804 1053622 1060518 1067966 1076652 1086768 1098391 1111908 1127496 1144889 1164214 1186156
61058 1186156 1210725 1236950 1264416 1293966 1325965 1359028 1391489 1423090 1454094 1483805 1511284
61047 1511284 1536713 1560792 1583391 1604025 1623096 1641550 1659840 1678226 1697521 1718547 1741403
61036 1741403 1766151 1793601 1824508 1858667 1895655 1935736 1979250 2026086 2076712 2132670 2194923
61025 2194923 2262790 2335748 2415214 2503068 2599308 2702552 2811981 2927323 3048129 3174967
61015 3174967 3310670 3458773 3621404 3800317 3998888 4221010 4468729 4743300 5048408
61006 5048408 5391202 5781506 6231990 6757090 7368227 8070672 8868018 9768947 10787697
60997 10787697 11942572 13261861 14789677 16575680 18655009 21042105 23731993 26665299
60989 26665299 29649872 32324239 34264073 35204466 35205703 34614714 33863539 33285716 33063357
60980 33063357 33245023 33725139 34199519 34218910 33386692 31573073 28969993 25954077 22889946
60971 22889946 20017468 17449525 15216622 13304332 11677237 10297192 9132553 8156153
60963 8156153 7341017 6661332 6095086 5623289 5227937 4892275 4601926 4344768 4111062
60954 4111062 3894768 3693597 3506705 3333134 3172932 3028065 2900563 2790403 2696135 2616626
60944 2616626 2550746 2495892 2448440 2405822 2367229 2332332 2300355 2270572 2242744 2216637 2191769
60933 2191769 2168095 2146483 2128034 2113121 2101443 2092765 2087196 2084766 2084944 2086547 2087888 2086988 2081894
60920 2081894 2071069 2053625 2029345 1998596 1962225 1921440 1877741 1833041 1789781 1750598 1717482
60909 1717482 1691173 1671501 1658297 1651633 1651028 1654758 1660433 1666261 1671413 1675142 1676029 1672427 1663452 1649226
60895 1649226 1630292 1607169 1580497 1551273 1520661 1489509 1458072 1426219 1394012 1362086 1331351
60884 1331351 1302230 1274391 1247331 1221020 1195780 1171793 1149084 1127764 1107753 1088359 1068682
60873 1068682 1048583 1028870 1010369 993209 977002 961256 945553 929953 915404 903114 893238
60862 893238 884846 877552 872426 870650 871913 874846 878431 882109 884964 886036 885511 884757 885090 887073 890880
60847 890880 896457 903201 910159 916743 922776 927991 932246 936175 940791 946285 951972 957442 962928 968356
60833 968356 972980 976388 979044 981336 982694 982203 979574 975070 968916 961289 952600 943407 934138 924925
60819 924925 915371 904573 891983 878265 864681 851532 837984 823515 808616 793676 778149 761488
60807 761488 744187 727181 710684 694287 677880 661948 647254 634568 624319 616088 608779 601609
60795 601609 594662 588349 582846 578224 574494 571221 567745 564144 561336 559890 559465 559794 561381 564578 568744
60780 568744 573037 577421 582201 587127 591760 596240 600971 605915 610890 616140 621967 628054 633777 638884
60766 638884 643479 647711 651877 656243 660290 662738 662929 661493 658982 654625 647327 637362 626120 614651
60752 614651 603345 592578 582602 573067 563597 554677 547075 540616 534435 528289 522714 517982 513730 509651
60738 509651 505786 502123 498556 495245 492452 490125 488147 486848 486655 487389 488410 489274 489792 489779 489377 489316
60722 489316 490204 491765 493275 494452 495407 496139 496704 497456 498472 499215 499457 500013 501788 504593 507717 511115
60706 511115 515129 519667 524677 530826 538460 546446 553342 559420 566104 573707 581217 588148 594991 601698
60692 601698 607335 611605 615257 618490 620216 619541 616914 613287 609155 604844 600697 596340 590740 583654
60678 583654 576215 569481 563229 556788 550236 544012 538026 532012 526379 521955 519088 517548 517035 517313 517978
60663 517978 518535 518701 518480 518013 517330 516018 513198 508280 501780 495045 489095 484070 479715 475879 472513
60648 472513 469553 466941 464472 461793 458921 456511 455135 454546 454226 454294 455073 456043 456236 455661 455372 455982 456972
60631 456972 457652 457980 458120 458010 457736 457746 458338 459350 460507 461628 462487 462985 463503 464468 465571 466036 465737 465396
60613 465396 465627 466411 467583 469161 470985 472578 473494 473483 472533 471267 470970 472389 474686 476444 477560 479204
60597 479204 482064 485707 489694 494138 498929 503437 507360 510934 514097 516283 517355 517868 518180 518166 518018
60582 518018 518340 519087 519299 518313 516513 514593 512836 511352 510168 508823 506693 504027 501825 500482 499494
60567 499494 498688 498667 499575 500510 500714 500518 500524 500682 500693 500601 500492 500295 500292 500971 502089 502774 503021 504154 507245 511932
60547 511932 517318 523129 529403 535962 542897 550793 559753 568968 577958 587437 598199 609848 621498
60534 621498 633251 646225 661473 679420 699921 722321 745776 769793 793987 817171 837509
60523 837509 853849 866088 873983 876755 874535 869146 862649 855878 849114 843218 839123 836848 835898 836222
60509 836222 838146 841987 848335 857991 870967 886274 903440 923424 947284 974764 1005182 1038964
60497 1038964 1077307 1120897 1169968 1225053 1286529 1353696 1425266 1500620 1580013 1664037 1753693
60486 1753693 1850672 1956810 2073420 2201069 2338517 2480509 2617414 2738674 2836913 2908482
60476 2908482 2951436 2965131 2952166 2919335 2875719 2829412 2784871 2741708 2695526 2640600 2572333
60465 2572333 2487818 2385689 2266988 2136005 1999083 1862299 1730512 1607814 1497383 1400511
60455 1400511 1316575 1244252 1182475 1130490 1087715 1053594 1027146 1006771 990938 978987 970906
60444 970906 966663 966121 969170 975388 983977 994560 1007599 1023435 1041374 1060371 1080069 1100340 1120210
60431 1120210 1138184 1153468 1166111 1176272 1184163 1190635 1197059 1204695 1214749 1228760 1248192 1273693
60419 1273693 1305224 1342713 1386120 1435290 1490337 1551819 1619957 1694169 1774066 1860399 1954208
60408 1954208 2055632 2164427 2281036 2405773 2537052 2671378 2804748 2932818 3049816
60399 3049816 3148942 3224713 3274606 3298651 3298668 3278426 3243672 3201067 3156795 3115765 3081324 3055351
60387 3055351 3038687 3031243 3031338 3035408 3039301 3040125 3036626 3028329 3015315 2998917 2981926 2967787 2959751
60374 2959751 2960314 2970458 2989053 3013263 3039445 3063259 3079174 3080698 3061533 3016800 2944150 2845048
60362 2845048 2725211 2592978 2456415 2321483 2192141 2071229 1960971 1862897 1777478 1703906
60352 1703906 1640635 1586375 1540366 1501738 1469280 1442130 1420055 1402619 1388677 1377110 1367412
60341 1367412 1359100 1351335 1343658 1336220 1328538 1318976 1306482 1291982 1276883 1260963 1243115 1223593
60329 1223593 1203951 1184897 1165695 1145790 1125819 1106886 1089887 1075706 1065006 1057528 1052293 1048578
60317 1048578 1046128 1044693 1044301 1045822 1050212 1057127 1065191 1073625 1082731 1092758 1103281 1113867 1124560
60304 1124560 1135570 1147214 1160280 1175677 1193581 1213457 1234910 1258007 1283002 1310493 1341593
60293 1341593 1377157 1417066 1461033 1509704 1563922 1623223 1686312 1752877 1823575 1898021 1973931
60282 1973931 2048535 2119845 2186422 2247150 2301866 2351468 2397028 2439326 2479314 2518087 2556115
60271 2556115 2593158 2629155 2664530 2699666 2735016 2772038 2813223 2860843 2916056 2979034 3049094
60260 3049094 3124581 3203398 3283850 3364515 3443666 3519841 3592961 3663903 3732788 3798408 3859245
60249 3859245 3914116 3962078 4002997 4038396 4070609 4100798 4128631 4153722 4176052 4194930 4209213
60238 4209213 4219302 4227823 4237753 4250861 4268316 4291342 4320237 4353633 4389735 4427904 4468648 4513155
60226 4513155 4563608 4623182 4694668 4779333 4877472 4989312 5114608 5252004 5399737 5556873
60216 5556873 5723284 5898507 6080762 6266298 6448698 6618674 6765111 6877135 6946522 6969913
60206 6969913 6949959 6894309 6812885 6715151 6608404 6497030 6382925 6267247 6152118 6040551
60196 6040551 5935229 5838225 5751733 5677933 5617752 5570404 5534213 5507168 5486789 5470533 5456747
60185 5456747 5444608 5432947 5419661 5401939 5375901 5335885 5275225 5188173 5070554 4919166 4732620
60174 4732620 4513853 4270867 4014112 3753402 3496933 3251372 3021465 2809889 2617955
60165 2617955 2445934 2292678 2156165 2035094 1929095 1837033 1756322 1684679 1621529 1566807
60155 1566807 1519270 1476985 1438719 1403855 1371575 1341151 1312733 1286974 1264063 1243651 1225350
60144 1225350 1208719 1193128 1178259 1164459 1152170 1141269 1131308 1122017 1113320 1105371 1098820 1094381
60132 1094381 1091795 1089876 1087927 1086445 1086072 1086683 1088001 1090240 1093474 1097187 1101350 1107345 1116831 1129988
60118 1129988 1145554 1162256 1179578 1197494 1216185 1235855 1256265 1276612 1296184 1314829 1332374
60107 1332374 1347995 1360679 1370051 1376285 1379415 1379129 1375122 1367439 1356715 1344178 1331056 1317878 1304652
60094 1304652 1291638 1279347 1267808 1256590 1245602 1235081 1224643 1213312 1200898 1188523 1177324
60083 1177324 1167424 1158616 1151219 1145613 1141579 1138670 1136778 1135929 1136175 1138037 1142338 1149118 1157400 1166556
60069 1166556 1177242 1190506 1206664 1225639 1247747 1273475 1302885 1335798 1372187 1412200 1456361
60058 1456361 1505952 1562295 1625167 1692577 1762303 1832343 1898941 1955090 1992343 2004423 1989301
60047 1989301 1949099 1889103 1816334 1737676 1658618 1583108 1513587 1450839 1394655 1345156 1302892
60036 1302892 1267501 1237385 1211321 1189443 1172032 1158314 1147262 1138709 1132823 1129122 1126851 1125677
60024 1125677 1125300 1125005 1124371 1123850 1124035 1124984 1126816 1130121 1135075 1140959 1147343 1154991 1164806 1176549 1189403
60009 1189403 1203023 1217266 1231751 1246687 1263488 1283599 1307304 1334462 1365652 1401580 1442075
59998 1442075 1486730 1535978 1590637 1651018 1717436 1790931 1872328 1961028 2055644 2155142 2258146
59987 2258146 2361466 2460352 2549817 2624895 2680434 2712238 2718615 2700228 2659038 2598500 2524302
59976 2524302 2443448 2362058 2284323 2212905 2149391 2094666 2049704 2015763 1993246 1981016 1977717
59965 1977717 1983234 1998061 2021960 2054373 2095650 2146757 2208188 2280240 2363907 2460298 2569392
59954 2569392 2690329 2822554 2965483 3117205 3274256 3432222 3585511 3727036 3849375
59945 3849375 3946418 4013457 4046808 4044949 4009974 3946833 3861277 3759264 3647407 3532181 3418352
59934 3418352 3308984 3206536 3112801 3028217 2952633 2886721 2831512 2786912 2752018 2726694 2711447
59923 2711447 2705870 2708714 2719692 2739963 2770693 2812345 2865597 2931770 3012168 3107930 3220704
59912 3220704 3352459 3504497 3677495 3872366 4089974 4329971 4591127 4873006 5176360
59903 5176360 5501714 5848482 6215150 6598274 6989446 7372263 7721241 8003322 8183196
59894 8183196 8232919 8141939 7921094 7598289 7209593 6790599 6370433 5969344 5599914 5269652
59884 5269652 4982213 4737523 4533067 4366153 4234706 4136411 4068568 4029247 4017716 4033596
59874 4033596 4076481 4146632 4245203 4373522 4532819 4724766 4951699 5216346 5522064 5873178
59864 5873178 6274373 6729829 7243377 7818432 8455825 9150812 9891690 10659110 11424239
59855 11424239 12148681 12790992 13317887 13711574 13968612 14094515 14100153 14000826 13815680 13566279
59845 13566279 13273955 12955567 12619019 12261503 11871742 11434682 10937302 10374852 9755138
59836 9755138 9097716 8428513 7773903 7156654 6593075 6091403 5653000 5275535 4954895
59827 4954895 4685130 4459241 4271538 4118562 3997280 3903564 3833205 3783277 3751409 3734237
59817 3734237 3727275 3725863 3725861 3724263 3719972 3713756 3707136 3701691 3699261 3701643 3709412 3721759 3738112 3759485
59803 3759485 3788022 3826014 3875806 3939965 4020844 4120211 4239342 4378674 4536814 4710164
59793 4710164 4893556 5080736 5264442 5437320 5593826 5731304 5849626 5950667 6038091 6116211
59783 6116211 6187825 6252904 6308911 6351440 6374648 6372788 6342831 6285954 6206814 6112126 6009805
59772 6009805 5907916 5813221 5730525 5663229 5613623 5582460 5569048 5571895 5588490 5614160 5642252
59761 5642252 5666193 5681147 5683705 5671011 5640821 5591865 5523579 5435798 5328891 5203746 5061402
59750 5061402 4903010 4730096 4544490 4348344 4144970 3939428 3737314 3542912 3359136
59741 3359136 3188706 3033984 2895668 2773037 2665718 2574126 2498053 2436242 2387681 2352080
59731 2352080 2328622 2315494 2311116 2314667 2324795 2338915 2354372 2369296 2381872 2389993 2392507 2390073
59719 2390073 2384308 2377023 2370729 2368630 2373163 2385168 2405063 2433993 2473195 2523032 2583268 2653643
59707 2653643 2733837 2823718 2924073 3036132 3159807 3293136 3433625 3578760 3724495 3864488
59697 3864488 3991919 4101571 4190014 4255437 4298677 4323488 4334248 4333231 4320082 4292602 4247038
59686 4247038 4178807 4084952 3966494 3828312 3677319 3521128 3367337 3222531 3091524 2977574
59676 2977574 2882675 2807283 2750540 2711581 2690268 2686356 2698688 2725814 2766721 2820302 2884533
59665 2884533 2956568 3032962 3109304 3180291 3240905 3287473 3317862 3331677 3330632 3317730 3295568
59654 3295568 3266053 3231611 3195063 3157568 3117959 3075021 3029502 2983225 2937584 2894033 2855048
59643 2855048 2823153 2799429 2783721 2775444 2773054 2773286 2772043 2765869 2752150 2728974 2696071 2655586
59631 2655586 2611046 2565798 2522792 2484909 2454190 2431007 2414787 2405307 2402757 2407089 2418080 2435643
59619 2435643 2459448 2488529 2521631 2557342 2593490 2627102 2655517 2676943 2689704 2692150 2684138 2667859
59607 2667859 2646496 2622784 2599260 2578468 2561694 2548219 2536859 2527574 2520874 2516725 2515201 2517397
59595 2517397 2524428 2536176 2552076 2572497 2598211 2629140 2664847 2705791 2752993 2806936 2867778
59584 2867778 2935988 3011338 3091396 3171889 3248232 3316124 3371730 3413048 3441086 3458686 3468255
59573 3468255 3471295 3469368 3464095 3456463 3447429 3439325 3435737 3440022 3454526 3480739 3518995 3567934 3624832
59560 3624832 3686036 3746203 3797785 3832807 3845673 3834066 3798049 3739786 3663946 3576504 3481798
59549 3481798 3380663 3271505 3153222 3027695 2900235 2777441 2663972 2561212 2468900 2387138
59539 2387138 2316289 2255856 2204633 2161653 2126136 2096778 2071939 2050306 2030632 2011090 1989644
59528 1989644 1965025 1936905 1905456 1871278 1835464 1799145 1763148 1728234 1695056 1663558 1633130
59517 1633130 1603751 1576178 1550615 1526209 1502429 1479866 1458834 1438330 1417440 1396767 1377199
59506 1377199 1358072 1337850 1316145 1293977 1272702 1253741 1238600 1227804 1220247 1214709 1211490 1211406
59494 1211406 1213900 1217448 1221313 1225559 1229802 1233451 1236841 1240805 1245299 1249666 1253944 1258550 1262907 1265742
59480 1265742 1266637 1266137 1264478 1261604 1258377 1256432 1256524 1257916 1259499 1260721 1261495 1262077 1263059 1264786 1266930 1269174
59464 1269174 1271854 1275199 1278641 1281837 1285783 1291737 1299595 1308541 1318801 1331384 1346473 1363480 1382496
59451 1382496 1404276 1428850 1455366 1483313 1512791 1543751 1576060 1610132 1646418 1684504 1723814
59440 1723814 1764795 1808129 1853115 1898300 1943538 1990036 2038537 2088895 2141296 2196378 2254174
59429 2254174 2314487 2378189 2446174 2516555 2584694 2646988 2703592 2757055 2809788 2863604 2920280
59418 2920280 2981100 3046244 3115493 3189111 3267350 3349355 3433208 3517220 3601340 3687624 3779467
59407 3779467 3880176 3992223 4117617 4258162 4414806 4587298 4774823 4975847 5185901
59398 5185901 5395611 5591665 5759730 5886757 5962847 5983827 5952810 5878291 5770238 5637798
59388 5637798 5489170 5331544 5170656 5011118 4857069 4711986 4578428 4458713 4355007
59379 4355007 4267728 4194689 4133083 4081529 4038922 4002368 3968274 3934990 3902592 3870476 3837121
59368 3837121 3801984 3765646 3728016 3688210 3646311 3603615 3561048 3519042 3479102 3443864 3415338
59357 3415338 3394561 3382944 3382217 3392735 3413448 3443721 3483444 3530797 3581243 3628847 3666929 3687272
59345 3687272 3681158 3643048 3573093 3476176 3359765 3232593 3103182 2977910 2860642 2754087
59335 2754087 2660351 2580018 2512099 2455495 2409668 2373914 2347194 2328893 2318711 2315940 2320146 2332462
59323 2332462 2354624 2386726 2427585 2477431 2538397 2612005 2698011 2796229 2907621 3032749 3170839
59312 3170839 3321412 3485587 3664806 3859195 4067614 4287904 4516142 4746574 4973032
59303 4973032 5189910 5391830 5573668 5731276 5861178 5959565 6023040 6050647 6043890 6004793
59293 6004793 5935495 5839489 5720547 5579222 5412301 5217265 4996583 4757408 4508857 4260516
59283 4260516 4021601 3799315 3597837 3419100 3263653 3130533 3017747 2923788 2847904 2788703
59273 2788703 2743843 2711494 2690600 2679178 2674031 2672977 2675927 2682831 2691985 2701413 2710742 2720566 2730863
59260 2730863 2740922 2750021 2757530 2763204 2767857 2772680 2777520 2781065 2783142 2785472 2789596 2795553 2803264 2813705
59246 2813705 2827679 2844575 2862937 2880748 2894366 2898876 2891057 2871470 2843215 2809899 2775261 2742952
59234 2742952 2715260 2692870 2676483 2667291 2665179 2668181 2674868 2685912 2702298 2723536 2748910 2779083
59222 2779083 2815082 2856918 2904671 2959831 3024165 3098105 3181434 3274678 3378695 3493887 3620869
59211 3620869 3760842 3914058 4078891 4253595 4437980 4632015 4833570 5038588 5242563
59202 5242563 5440812 5628620 5802935 5963761 6113176 6254071 6390844 6530007 6677984
59193 6677984 6837976 7008817 7184735 7353968 7498248 7596170 7629007 7585294 7463381 7272613
59183 7272613 7031776 6763952 6490942 6230746 5997283 5799804 5642513 5526006 5449176 5409380
59173 5409380 5401973 5421309 5462404 5521216 5594180 5678577 5772929 5876191 5986955 6104255 6228894
59162 6228894 6363410 6511104 6675290 6858405 7060838 7280678 7514669 7758606 8006915
59153 8006915 8253346 8492986 8722775 8939567 9138519 9313469 9457345 9561698 9617794 9619777
59143 9619777 9566522 9460531 9306795 9113194 8889505 8643728 8379669 8098628 7802220 7493086
59133 7493086 7175122 6854873 6541567 6244245 5969368 5721579 5504740 5320658 5168367
59124 5168367 5046358 4954429 4891993 4856012 4842556 4849508 4876166 4920999 4981178 5053187 5132131
59113 5132131 5211046 5282329 5339515 5377228 5391169 5379917 5345915 5293406 5226474 5150155 5071639
59102 5071639 4998089 4933947 4881854 4844917 4825970 4825361 4841448 4872878 4918768 4977112 5044483 5116766
59090 5116766 5188885 5254724 5309149 5350303 5379663 5401303 5422260 5451856 5498259 5565833 5656525
59079 5656525 5772085 5912923 6075861 6255067 6444497 6637933 6827581 7003956 7155355
59070 7155355 7264987 7310424 7270516 7135691 6912642 6621263 6288611 5942897 5607487 5297155
59060 5297155 5019325 4777727 4573824 4406467 4273184 4172162 4101581 4057414 4033100 4020394
59050 4020394 4009128 3988023 3949392 3893778 3828506 3762010 3700746 3649787 3612644 3589652 3578572
59039 3578572 3577279 3584635 3599345 3620221 3647731 3683489 3728202 3781914 3846284 3924740 4020143 4133772
59027 4133772 4266556 4419684 4593795 4789081 5006331 5246821 5511467 5801330 6118467
59018 6118467 6464713 6839643 7240467 7662423 8096616 8527258 8932570 9288818 9573848
59009 9573848 9770413 9871424 9884090 9827668 9726074 9601628 9471886 9346751 9226321 9103270
58999 9103270 8969118 8818900 8651690 8469432 8275722 8074063 7866880 7657168 7450680
58990 7450680 7255055 7077058 6921637 6792270 6689548 6609347 6544307 6487325 6432670 6374981
58980 6374981 6309832 6235472 6152376 6061482 5964669 5866232 5771411 5683451 5603929 5535324 5480574
58969 5480574 5439721 5408941 5382980 5357117 5327850 5294891 5263130 5240498 5233285 5244661 5276727
58958 5276727 5331113 5407497 5504284 5621258 5759252 5916619 6087741 6264599 6436859 6589842
58948 6589842 6705480 6767591 6766401 6699561 6572368 6398084 6195358 5982882 5776069 5587243
58938 5587243 5425658 5296149 5199589 5135625 5103877 5102764 5129565 5182300 5259669 5358615 5473750
58927 5473750 5599744 5732907 5870777 6012669 6161245 6321245 6495228 6681053 6872412
58918 6872412 7058812 7224507 7350663 7421370 7428355 7371540 7258102 7101388 6917739 6722027
58908 6722027 6526067 6340064 6172732 6029384 5912012 5821665 5758547 5719171 5695428 5677125
58898 5677125 5654025 5616261 5556705 5474855 5376519 5268383 5154047 5035130 4913251 4789470
58888 4789470 4663722 4535983 4406357 4273271 4133581 3985570 3830458 3670619 3508418
58879 3508418 3347431 3192368 3046420 2910163 2783757 2668261 2563916 2469188 2382779 2305024
58869 2305024 2236407 2176274 2123851 2079021 2041346 2009878 1984462 1965592 1952493 1943155 1936684 1933760
58857 1933760 1934385 1937327 1942281 1950341 1961561 1974254 1987582 2002803 2021200 2042814 2067882 2097290
58845 2097290 2130734 2166710 2205317 2248974 2299579 2357201 2422391 2497125 2582047 2674890 2772711
58834 2772711 2873301 2972878 3064351 3139307 3190198 3210320 3194841 3144081 3064189 2963298 2848560
58823 2848560 2727177 2606911 2493147 2387192 2289099 2200281 2121969 2053325 1993063 1941243
58813 1941243 1897848 1861323 1830198 1804598 1784700 1769359 1757682 1750274 1747532 1748333 1751733 1758172
58801 1758172 1767729 1779072 1791551 1806449 1824673 1845141 1866928 1891150 1919195 1951038 1986889
58790 1986889 2028621 2077964 2135239 2201554 2280106 2373251 2480034 2598361 2727039 2862364
58780 2862364 2993537 3104448 3180988 3217158 3216832 3192147 3159024 3131354 3118158 3125356 3158039
58769 3158039 3220098 3313687 3440696 3603623 3804204 4043032 4321766 4644260 5014677 5436294
58759 5436294 5912637 6446689 7036207 7669687 8325402 8969569 9553381 10016949 10304138
58750 10304138 10379556 10237034 9898960 9410597 8829632 8212158 7602295 7030500 6516210
58741 6516210 6069104 5690504 5377448 5125903 4930007 4781176 4670398 4589951 4531378 4484236
58731 4484236 4439527 4393275 4345484 4297790 4254015 4220404 4202121 4200108 4212219 4234611 4259437
58720 4259437 4273461 4262266 4215592 4128089 3998436 3831201 3637852 3432425 3226220 3027511
58710 3027511 2843481 2679116 2535469 2411729 2308041 2224371 2158362 2106869 2068374 2041869
58700 2041869 2025151 2016614 2017155 2027978 2048150 2076671 2115015 2165105 2226627 2299160 2385200 2488003
58688 2488003 2607920 2743721 2896031 3066162 3252391 3449807 3652101 3850344 4031706
58679 4031706 4183890 4301774 4388147 4449084 4490832 4519154 4537152 4542631 4529533 4491937 4425422
58668 4425422 4326076 4191232 4021733 3822820 3604174 3380088 3166744 2975706 2810210 2668794
58658 2668794 2550435 2454243 2377012 2314807 2265913 2229658 2203791 2185702 2174633 2169887 2168394
58647 2168394 2166804 2164385 2160913 2153423 2138300 2115254 2086230 2052022 2013245 1973090 1935445 1901278
58635 1901278 1870007 1843048 1822448 1807162 1794316 1783249 1774897 1768368 1761853 1756172 1753694 1754326 1756094
58622 1756094 1759125 1765533 1775873 1789080 1805359 1825640 1848669 1872095 1896046 1922314 1950573 1978940
58610 1978940 2007806 2039460 2074171 2110204 2147656 2188764 2234330 2283190 2335324 2392336 2454842
58599 2454842 2522501 2596766 2680619 2775621 2882198 3002857 3142231 3303889 3489849 3703076
58589 3703076 3947677 4226759 4542793 4899929 5303443 5757445 6265777 6834264 7468319
58580 7468319 8167147 8920687 9708800 10498137 11239016 11868788 12321152 12536698 12475480 12132151
58570 12132151 11543445 10777399 9911094 9013877 8141080 7330812 6602075 5959483 5402057
58561 5402057 4926691 4526007 4189205 3906768 3671247 3473518 3302460 3149307 3009344
58552 3009344 2879412 2757430 2644590 2544196 2457347 2382342 2317949 2263872 2218263 2178551
58542 2178551 2144903 2119473 2102265 2091159 2085754 2087436 2095862 2109299 2128428 2155845 2191768 2234246
58530 2234246 2283679 2342980 2412948 2491717 2579238 2678233 2789943 2912762 3045587 3188584
58520 3188584 3339780 3494329 3647645 3795998 3934536 4059626 4174476 4289019 4413703
58511 4413703 4556734 4726924 4934064 5184707 5480609 5821325 6203828 6618020 7045533
58502 7045533 7463193 7845004 8163211 8395217 8533221 8584204 8558853 8461952 8291570 8042057
58492 8042057 7707914 7291353 6809603 6292062 5768715 5262667 4790962 4365156 3988678
58483 3988678 3658251 3370164 3122384 2910823 2728790 2571600 2437577 2323657 2224642 2137931
58473 2137931 2064393 2003269 1950712 1904649 1866480 1836432 1811570 1789818 1771691 1756652 1742061
58462 1742061 1727141 1713836 1702644 1691918 1682181 1676300 1674270 1672634 1670331 1670045 1672431 1674341 1674594
58449 1674594 1676242 1680952 1686216 1690415 1695696 1703421 1711462 1718519 1726580 1736608 1746265 1754359 1763304 1774865
58435 1774865 1787848 1802381 1822015 1849024 1881776 1919125 1963294 2016117 2076777 2145754 2226843
58424 2226843 2322569 2431405 2551886 2685240 2830126 2976038 3102779 3184930 3200058 3140900
58414 3140900 3022900 2875505 2723553 2578934 2447122 2332757 2236593 2154602 2084261 2026919
58404 2026919 1981947 1944581 1912208 1886977 1869438 1855525 1842755 1833462 1828758 1825077 1820071 1816261
58392 1816261 1815492 1815279 1813895 1813520 1815102 1815835 1815123 1817205 1824302 1832985 1841015 1851775 1867860 1886055
58378 1886055 1902948 1919954 1938502 1955761 1969665 1983115 1998951 2015711 2032265 2051308 2074164
58367 2074164 2097344 2118308 2139405 2162294 2184052 2202853 2221797 2242984 2263514 2281579 2300581
58356 2300581 2322764 2344764 2364172 2384559 2409190 2435662 2461726 2490609 2525398 2563795 2603365
58345 2603365 2646354 2694428 2744499 2794762 2848987 2909821 2973906 3038602 3107106 3181352 3255974
58334 3255974 3324746 3386603 3439821 3477186 3493645 3493166 3482394 3463666 3439797 3418617 3405893 3399723
58322 3399723 3397977 3404776 3423414 3449883 3480274 3517969 3566661 3623038 3683364 3750555 3827539 3910643
58310 3910643 3997057 4091982 4200760 4320943 4450134 4594679 4762329 4953216 5166566 5409439
58300 5409439 5689921 6008177 6363203 6762187 7214411 7722073 8285325 8908807 9592659
58291 9592659 10321593 11069707 11807914 12497432 13084540 13514806 13750846 13772685 13573553 13168965
58281 13168965 12603306 11934482 11213990 10485917 9791956 9161820 8603683 8115027 7697259
58272 7697259 7350765 7065294 6828567 6638197 6494106 6387000 6306320 6251863 6225346 6218372
58262 6218372 6221283 6235903 6266669 6307388 6350022 6398239 6458467 6525910 6593480 6665986 6750906
58251 6750906 6843707 6937077 7035807 7147215 7266084 7384960 7509936 7649718 7798705 7948049
58241 7948049 8103705 8275734 8459776 8647713 8846413 9066452 9302395 9544352 9798757
58232 9798757 10077111 10374841 10682748 11008384 11363751 11743164 12136554 12552928 13006534
58223 13006534 13492237 13999961 14540464 15129895 15762564 16427672 17139086 17918572 18764416
58214 18764416 19668929 20651983 21743353 22947893 24264307 25721618 27358527 29184746
58206 29184746 31205033 33464610 36029474 38945884 42271884 46132957 50699016 56125208
58198 56125208 62552835 70120356 78907249 88912192 100169974 112868928 127322445
58191 127322445 143939959 163321922 186213854 213143872 244208389 279358236 318345988
58184 318345988 359258540 396617066 421897954 427601945 411916499 379735251 339319389
58177 339319389 297976575 260080762 227505456 200560460 178437607 159605107 142521441
58170 142521441 126272847 110703580 96136148 83001415 71561169 61806983 53554354
58163 53554354 46599295 40768873 35883686 31763528 28277920 25341174 22861079 20738313
58155 20738313 18909697 17345072 16003258 14830550 13797105 12894342 12098912 11375521
58147 11375521 10711695 10114348 9574539 9068876 8593029 8161190 7773452 7413950 7080052
58138 7080052 6783944 6525210 6289084 6072136 5884063 5723750 5577804 5443346 5329391
58129 5329391 5235322 5149642 5070135 5004604 4952122 4904138 4864262 4847188 4857674 4889144 4942692
58118 4942692 5028861 5150628 5302790 5488338 5717594 5990113 6293001 6615089 6943464 7244393
58108 7244393 7466259 7567433 7531781 7361010 7070421 6694013 6275923 5849461 5432320 5039577
58098 5039577 4686191 4375704 4100920 3858536 3651603 3477372 3326108 3193767 3083701
58089 3083701 2994474 2917899 2850610 2795978 2753162 2715518 2681079 2653532 2631531 2608037 2581608
58078 2581608 2557669 2537337 2515569 2491650 2470981 2454928 2439110 2423274 2412756 2408502 2405356 2401895
58066 2401895 2402488 2408146 2414843 2422418 2435693 2455011 2474825 2493228 2513665 2535350 2551322 2558492
58054 2558492 2561203 2562714 2561523 2558243 2557781 2562141 2568528 2576569 2589932 2609012 2629587 2650592 2675834
58041 2675834 2706291 2738197 2770557 2807242 2849840 2895739 2945132 3002793 3070982 3147560 3232808
58030 3232808 3331076 3443869 3568323 3704613 3858187 4032927 4228929 4448793 4699147 4983685
58020 4983685 5300984 5650640 6034256 6447786 6879202 7315748 7746973 8158785 8532069
58011 8532069 8851172 9109042 9302440 9428321 9486724 9480313 9407941 9264910 9053202 8786991
58001 8786991 8486386 8171413 7863588 7585514 7353602 7174821 7052814 6992292 6995096 7057493
57991 7057493 7174468 7341793 7550415 7782291 8013256 8215412 8355863 8401180 8330191 8142298
57981 8142298 7853635 7489815 7082399 6663744 6258128 5878537 5532453 5226065 4961236
57972 4961236 4734111 4540540 4379642 4250116 4147557 4068170 4011288 3975890 3958500 3956820
57962 3956820 3971568 4002467 4046337 4101359 4169475 4252427 4349222 4459487 4585333 4727873 4885874
57951 4885874 5059892 5253486 5467845 5698648 5939584 6183786 6418587 6622719 6772156
57942 6772156 6846979 6833235 6725310 6531460 6273557 5977226 5663284 5348441 5047663 4770820
57932 4770820 4520108 4294607 4095115 3922038 3772118 3641061 3527266 3430254 3347927 3278101
57922 3278101 3220318 3173503 3134177 3099413 3069250 3043958 3021373 2999135 2977132 2955572 2933172
57911 2933172 2909318 2885559 2862914 2840167 2816698 2794286 2774246 2755680 2738671 2726239 2720700
57900 2720700 2720673 2723861 2730078 2739302 2749662 2759976 2771854 2786780 2803454 2820340 2838363 2858636
57888 2858636 2879765 2899957 2919704 2940141 2960741 2980832 3001345 3022947 3044341 3064277 3083180
57877 3083180 3101103 3116434 3128500 3139094 3149548 3158687 3165597 3171781 3178576 3184982 3190253 3196101 3204017
57864 3204017 3212801 3220999 3229370 3238718 3247785 3255724 3264250 3274826 3286034 3296230 3306409 3317854 3329253
57851 3329253 3338974 3348046 3358101 3368336 3377368 3386185 3396382 3407248 3417468 3428072 3440834 3455250
57839 3455250 3470043 3486345 3506547 3531006 3558415 3588438 3621646 3657988 3697617 3742204 3793235
57828 3793235 3850116 3912003 3980330 4057492 4144268 4240505 4346959 4464422 4592513 4731663
57818 4731663 4885064 5056506 5247481 5458295 5690347 5944472 6217485 6501512 6784382
57809 6784382 7047700 7265988 7412066 7465902 7420130 7280918 7066556 6803151 6516901 6227723
57799 6227723 5948662 5688181 5450731 5236946 5046192 4878583 4733392 4607335 4496684
57790 4496684 4399964 4316901 4246277 4186675 4137597 4097630 4063243 4031895 4004916 3984822 3971160
57779 3971160 3961514 3955192 3953035 3954623 3958589 3965118 3975543 3989900 4007127 4027028 4049920 4075158
57767 4075158 4102281 4132846 4168874 4210203 4255587 4305461 4361042 4421223 4482606 4541807 4595115
57756 4595115 4636542 4659448 4660892 4642996 4610483 4568787 4523768 4480385 4440933 4405892 4376137
57745 4376137 4352639 4334659 4320475 4309811 4303702 4302150 4303740 4307450 4313214 4320928 4330430 4342075 4355806
57732 4355806 4370179 4383883 4397593 4412604 4428344 4443167 4456935 4470753 4484706 4498028 4511155
57721 4511155 4525360 4540489 4555206 4569477 4584747 4601463 4618374 4634666 4651082 4668541 4686991
57710 4686991 4705913 4724833 4743313 4761392 4779813 4798863 4817510 4834804 4851397 4868315 4885082
57699 4885082 4900755 4916118 4932943 4951528 4970791 4990492 5011499 5034072 5057712 5082562 5109267
57688 5109267 5137545 5166527 5196449 5228486 5263080 5300042 5340097 5384697 5434341 5488685 5548273
57677 5548273 5614604 5688498 5769939 5859731 5960034 6073048 6200082 6341620 6496890 6662607
57667 6662607 6831473 6990075 7117775 7191317 7195909 7134180 7024122 6888684 6747269 6613465
57657 6613465 6495228 6395181 6312537 6246059 6194784 6156757 6129223 6110323 6099072 6093931 6093153
57646 6093153 6096469 6104506 6116478 6130263 6144867 6160912 6178506 6196493 6214283 6232738 6252716 6274119
57634 6274119 6296714 6320508 6345019 6369454 6393859 6418892 6444467 6469872 6495176 6521005 6547015
57623 6547015 6572165 6596538 6621307 6646775 6672073 6696929 6722132 6747959 6773684 6799006 6824507
57612 6824507 6850476 6876708 6903711 6932575 6963282 6994528 7025552 7056869 7088987 7121808 7155531
57601 7155531 7190726 7227138 7263768 7300418 7337888 7376460 7415521 7454903 7495181 7536354 7577565
57590 7577565 7618336 7658664 7697720 7733988 7767101 7798137 7827785 7855563 7881198 7905309 7928355
57579 7928355 7950306 7971773 7994091 8017834 8042521 8068106 8095265 8123848 8152576 8180888 8209707
57568 8209707 8239756 8270516 8301539 8333501 8367135 8402213 8438263 8475260 8513035 8550978 8588932
57557 8588932 8627446 8666753 8706460 8746601 8787877 8830432 8873407 8916073 8958370 9000083 9040703
57546 9040703 9080516 9120638 9161551 9202718 9243925 9285705 9328065 9370148 9411736 9453755 9496697
57535 9496697 9539760 9582194 9624325 9666626 9708902 9751132 9793961 9837628 9881383 9924694 9968082
57524 9968082 10012142 10056648 10101268 10146290 10192012 10238178 10284429 10330557 10376130 10420880 10465741
57513 10465741 10512328 10561007 10610500 10659705 10708698 10757616 10805961 10853542 10900839 10947880 10994001
57502 10994001 11039262 11084821 11131305 11178112 11224925 11272521 11321396 11370916 11420580 11470759 11521457
57491 11521457 11571757 11621424 11671621 11723028 11774603 11825346 11875945 11927398 11979232 12030497 12081498
57480 12081498 12133095 12185081 12236654 12287916 12339709 12392366 12445563 12498877 12551781 12603834 12655588
57469 12655588 12708409 12762652 12817004 12870452 12923740 12977892 13032521 13086887 13141541 13197459 13254413
57458 13254413 13311601 13369142 13427506 13486155 13544250 13602173 13660996 13720862 13781204 13841990 13903478
57447 13903478 13965196 14026579 14088187 14150965 14214680 14278482 14342571 14407770 14473659 14538678 14602219
57436 14602219 14665309 14729088 14793765 14859145 14925111 14991430 15058005 15125376 15194143 15263917 15333755
57425 15333755 15403520 15473946 15545481 15617973 15691332 15765475 15839704 15913222 15986283 16059838 16134034
57414 16134034 16208090 16281718 16355614 16430371 16505856 16581891 16658541 16735377 16811275 16885334 16957380
57403 16957380 17027312 17094705 17159521 17222652 17285297 17348067 17410929 17473703 17536359 17598983 17661642
57392 17661642 17724346 17787308 17851197 17916641 17983267 18049816 18115656 18181568 18248462 18315919 18382828
57381 18382828 18448956 18514968 18581244 18647679 18714466 18782038 18850210 18918268 18986050 19054225 19123419
57370 19123419 19193639 19264527 19335550 19406081 19475983 19546063 19617246 19689386 19761540 19833358 19905516
57359 19905516 19978878 20053968 20131137 20210398 20290971 20371702 20452052 20532169 20612036 20691138 20768948
57348 20768948 20845191 20919748 20992829 21065059 21136806 21207705 21277473 21346721 21416080 21484962 21552309
57337 21552309 21618396 21684594 21751402 21817939 21883560 21948726 22013895 22078705 22142854 22206849 22271275
57326 22271275 22335898 22399992 22463130 22525349 22586928 22648168 22709006 22768919 22827677 22885943 22944376
57315 22944376 23002447 23059045 23114077 23168387 23222317 23275643 23328888 23383111 23438024 23491778 23543238
57304 23543238 23593239 23642954 23692285 23740691 23788385 23835656 23881924 23926571 23970062 24013240 24056036
57293 24056036 24097767 24138348 24178439 24218690 24259446 24300948 24343354 24386879 24432190 24480156 24530937
57282 24530937 24583951 24639025 24696843 24757878 24821543 24886609 24951665 25014981 25075100 25132050 25186777
57271 25186777 25238697 25285010 25323199 25353025 25375136 25389107 25394359 25392034 25384363 25372676 25357330 25338987
57259 25338987 25318481 25295824 25270735 25243961 25216817 25189830 25163567 25141298 25129754 25136430 25165765
57248 25165765 25216697 25282565 25353681 25421787 25483417 25539762 25594281 25650726 25711854 25777900 25845895
57237 25845895 25911272 25970335 26021328 26064392 26101732 26137113 26173834 26213210 26255575 26301643 26351723
57226 26351723 26404513 26458336 26512981 26568847 26624834 26678905 26730383 26779893 26827201 26870821 26909710
57215 26909710 26943516 26970995 26989808 26998248 26995790 26981879 26955782 26918074 26871060 26817526 26760115
57204 26760115 26701664 26644429 26588703 26533431 26478241 26423607 26369318 26314369 26258247 26200574 26139617
57193 26139617 26073170 26001136 25925542 25847859 25768067 25686247 25602943 25517598 25428550 25334767 25235772
57182 25235772 25129980 25015549 24893042 24764924 24632260 24494213 24350574 24201690 24045770
57173 24045770 23879725 23703239 23518740 23327013 23126659 22918314 22705043 22488227 22268352
57164 22268352 22050138 21839928 21638601 21450884 21308610 21267606 21357101 21529792 21680060 21723233
57154 21723233 21653599 21525538 21392711 21274725 21168868 21070979 20978434 20884530 20779933 20657942
57144 20657942 20514394 20344686 20144806 19914581 19657330 19376934 19077563 18765814 18450670
57135 18450670 18140887 17844084 17568260 17321594 17109078 16930421 16781906 16658539 16553199
57126 16553199 16455933 16356982 16250227 16132138 15998559 15844998 15669631 15473733 15259681 15030995
57116 15030995 14794073 14557258 14328053 14112985 13918773 13749776 13603961 13474564 13356258
57107 13356258 13247631 13149202 13063950 13000380 12971050 12987553 13060876 13206851 13446913 13803874
57097 13803874 14303042 14979179 15877988 17050684 18552008 20441054 22772854 25583167
57089 25583167 28882864 32661266 36881210 41467016 46302743 51237115 56086564 60675629
57081 60675629 64955074 69112980 73497170 78314446 83351847 88003243 91580613 93614012
57073 93614012 93929610 92573086 89735862 85708683 80806500 75285562 69327460 63087653
57065 63087653 56732344 50430619 44337868 38593438 33313051 28569848 24389061 20763861
57057 20763861 17668390 15057575 12871345 11049599 9539999 8292222 7255866 6389076
57049 6389076 5662579 5052282 4534378 4090115 3708266 3379209 3091673 2837409 2613230
57040 2613230 2415641 2238370 2077349 1933035 1805333 1690681 1586220 1492363 1409079 1333857
57030 1333857 1265343 1205051 1153657 1109404 1071727 1042543 1022386 1009124 1002146 1004191 1017566 1042137
57018 1042137 1078201 1127751 1191981 1271156 1366208 1473355 1574289 1638204 1640139 1577257 1466771
57007 1466771 1332237 1193630 1064358 950528 852442 769159 701027 647221 603996 567857
56997 567857 538478 516548 500898 489669 482161 477617 474228 471220 469937 471208 473698 476462 480914
56984 480914 488632 499570 514096 534020 558867 582951 598730 602134 593485 575469 552419 529667
56972 529667 510903 496645 486445 480989 480644 483902 489335 497738 510614 527964 549367 575918 609293
56959 609293 649960 697993 754637 821455 898344 982700 1068806 1147337 1208189 1246493 1265290
56948 1265290 1271130 1268172 1257295 1238456 1211485 1175825 1131822 1081932 1029371 976383 924903 877564
56936 877564 836515 802264 775137 756785 748736 750485 760661 779057 805178 834427 856998 861539
56924 861539 840966 796541 737180 673838 613482 558277 509196 467881 434637 407311 383744
56913 383744 363771 347714 334652 323522 314370 307103 300374 293048 285574 278772 272544 266896 262798
56900 262798 260736 259711 258964 259512 262744 268702 276830 287214 299951 314617 331415 351487 374955
56887 374955 400101 425744 452842 482161 511449 536287 552706 558159 551829 535844 515106 494206
56875 494206 475071 458322 445277 437236 434211 435981 443134 455719 472317 492096 516533 547471
56863 547471 584775 627602 676619 733085 796884 867150 942962 1020234 1088537 1134405 1149497
56852 1149497 1135248 1100409 1055679 1009902 968544 934003 907281 889231 880038 878603 883751 895679
56840 895679 915320 942880 978205 1022219 1076862 1143526 1222195 1312034 1412007 1519844 1628672
56829 1628672 1723584 1783590 1791606 1745558 1659552 1553928 1445017 1342935 1254004 1181480 1125287
56818 1125287 1083973 1056965 1044031 1043963 1055516 1078702 1113731 1159735 1215970 1283120 1361940 1451643
56806 1451643 1550707 1657042 1764326 1858647 1921732 1939486 1908696 1837789 1742700 1640244 1542006
56795 1542006 1452712 1373469 1305018 1247375 1198600 1156077 1118291 1084170 1051988 1020655 991372
56784 991372 966647 948406 938040 937022 945883 963102 985548 1008387 1023806 1022510 999524 958066
56772 958066 906368 851746 798799 750778 709399 673867 642556 615449 593312 575367 559844
56761 559844 546200 534852 525294 516447 508420 502129 497654 494649 493771 495929 500603 506633 514241 524657
56747 524657 538288 554834 574682 598619 626766 659274 697361 742020 792395 847092 906468
56736 906468 972068 1044506 1123436 1208612 1299003 1391447 1481917 1567425 1645168 1711083 1761770
56725 1761770 1797457 1821147 1835363 1841707 1842851 1842369 1842495 1843758 1846540 1851126 1856579 1861632 1866630 1873009
56711 1873009 1881110 1890191 1900142 1911281 1922720 1932638 1939849 1943371 1940997 1930227 1910271 1881359 1842636
56698 1842636 1793023 1733899 1668796 1600504 1530497 1461086 1395792 1337168 1286014 1242935 1208864
56687 1208864 1183660 1165710 1153248 1144841 1138685 1132906 1126626 1119583 1111089 1100884 1090673 1083088 1079172
56674 1079172 1078328 1080482 1086667 1097550 1112876 1132166 1154469 1177651 1199444 1219054 1236486 1250909
56662 1250909 1261391 1268894 1275810 1283721 1293060 1304387 1318154 1333453 1348684 1363094 1376120 1385834
56650 1385834 1390050 1388634 1383004 1373859 1361394 1347226 1333798 1322014 1311547 1303324 1299555 1301308 1308113
56637 1308113 1319909 1337148 1358748 1381953 1404651 1426249 1446241 1463717 1478360 1490251 1498719
56626 1498719 1503058 1504217 1503895 1502138 1497886 1491865 1486779 1484427 1484533 1486483 1490012 1493768 1495288 1493118
56612 1493118 1487520 1478843 1466884 1452142 1436008 1419266 1401817 1384052 1367031 1351114 1335820 1321120
56600 1321120 1307448 1294372 1280631 1265360 1247964 1227085 1201269 1170375 1134867 1094255 1048052
56589 1048052 997812 946280 894908 844123 795449 750979 711011 674580 642222 615873 596006
56578 596006 581363 571599 567745 569788 576282 586885 602928 624807 650896 679681 710956 744387
56566 744387 778830 813735 849359 884990 918713 949509 977893 1003922 1026254 1043625 1055751
56555 1055751 1062340 1062680 1056568 1044276 1025564 1000160 969128 934200 895884 853921 809293 763845
56543 763845 718129 671664 625197 580559 538376 498081 460171 426139 396098 368820 344336
56532 344336 324133 308349 295016 282606 271348 261703 253561 247265 243480 241667 240456 239547 239385
56519 239385 239233 237812 235751 234913 235277 234948 233359 231894 231118 229941 227904 225810 223753 220980 217982
56504 217982 216287 215853 215196 214325 214883 217065 219221 220969 223883 228479 233321 237761 242812 248616 253832
56489 253832 258334 263693 270116 275618 279137 281779 284070 284821 283740 282423 281503 279377 274921 268992 262228
56474 262228 253933 244349 235504 228480 222119 215517 209471 204504 199807 195146 191494 188888 186119 183291
56460 183291 182010 182287 182138 181166 181483 183840 185969 186262 186136 187088 188217 188404 188365 188836 189160 189261 190536
56443 190536 193232 195426 196047 196433 197482 197967 197226 196754 197471 198097 198002 198827 201354 203522 203660 203099 203404
56426 203404 203545 202095 199970 198649 197755 196520 195660 195749 195688 194729 194072 194629 195300 195224 195513 196856 197756 197190
56408 197190 196848 198481 201070 202741 203571 204440 205056 205164 205855 207643 209060 209049 208821 209538 210181 209648 208934
56391 208934 209218 209792 209915 210700 213024 215505 216657 217253 218503 219752 220045 220194 221244 222635 223808 225808
56375 225808 229313 232812 234682 235371 235833 235673 234637 233970 234426 234820 234338 234286 235709 237370 237989 238424 239672
56358 239672 240804 240888 240974 242172 243696 244667 245815 247573 248666 248433 248343 249324 249980 249353 248957 249961 250963
56341 250963 250838 251219 253647 256725 258755 260861 264788 269753 274148 278239 282508 285344 285227 283460 282219
56326 282219 281606 280950 281008 282423 283865 284122 284212 285294 286518 287105 288272 290803 293062 293825 294680 297122 299703
56309 299703 300746 301465 303553 306030 307363 308490 310830 313468 315243 317468 321638 326485 330195 333468
56295 333468 337564 341493 344093 346756 351125 356078 359968 363722 368820 374273 378569 382543 387448 392289
56281 392289 395905 399496 404234 408756 411932 415646 421783 428965 435388 442246 451058 460311 468372 477092
56267 477092 488742 501847 513983 526277 541040 557074 571489 584319 597300 609822 620018
56256 620018 628294 636051 642581 646705 649625 652599 653816 651253 646591 642531 638298 631676 623425 615687
56242 615687 608031 599104 590256 583515 577832 571383 565617 562918 562251 561361 561353 564728 570653 576578 582855
56227 582855 591406 601365 610358 618534 627084 634330 637659 637995 638181 638330 636774 633998 631612 629038 625249
56212 625249 622038 621499 622049 620994 619134 618830 619637 620160 622008 627429 635053 642379 650211 660088 669793
56197 669793 676392 681505 688499 696577 702780 707763 714272 721792 728007 733751 741316 749640 756386 762917
56183 762917 772047 782790 792624 802758 815705 829889 842516 855655 873315 894348 914445 933535
56171 933535 955007 979133 1003534 1028834 1057605 1088923 1120022 1152216 1189284 1231415 1276723
56160 1276723 1327199 1386935 1455901 1531779 1616608 1715333 1829285 1957556 2103339 2272154
56150 2272154 2464812 2678163 2910657 3159790 3415171 3661320 3887065 4086827 4255873
56141 4255873 4392845 4505965 4608365 4706501 4798425 4880691 4948743 4992396 5000877 4973902 4921258
56130 4921258 4851940 4770266 4680396 4584738 4476795 4343685 4177531 3979257 3753163 3505976
56120 3505976 3250741 3003010 2771783 2559856 2371344 2210917 2076643 1962054 1865042 1787055
56110 1787055 1724777 1671441 1625919 1591684 1567171 1546103 1527153 1514168 1506686 1499339 1490963 1485398
56098 1485398 1482934 1479787 1476279 1476577 1480165 1482541 1484389 1490697 1500760 1508633 1513693 1520989 1530877 1538383
56084 1538383 1543491 1551914 1564743 1577220 1588562 1602971 1620109 1634796 1647109 1662665 1681972 1699779
56072 1699779 1715725 1735056 1757952 1778920 1797722 1819984 1845968 1869867 1891236 1915869 1944302
56061 1944302 1971001 1996007 2025452 2059321 2090839 2119374 2151548 2188059 2222022 2252169 2284854
56050 2284854 2321144 2354908 2385736 2420555 2460325 2498428 2534302 2574906 2620535 2663331 2702297
56039 2702297 2745348 2793912 2840374 2883666 2932144 2987689 3042218 3093469 3148757 3209512 3267969
56028 3267969 3323154 3384151 3453436 3523139 3591799 3668055 3753396 3838322 3920173 4007424 4101673
56017 4101673 4193294 4280040 4371649 4470753 4567798 4660349 4758257 4864102 4968250 5069357 5179577
56006 5179577 5303009 5429474 5556106 5693804 5845457 5999765 6153997 6320479 6503038
55997 6503038 6690156 6879234 7083718 7308140 7540800 7779529 8038792 8322563 8617083
55988 8617083 8919697 9246605 9602162 9969945 10344916 10743848 11172827 11616711 12072980
55979 12072980 12562527 13094025 13652766 14238606 14878088 15584285 16343421 17157108 18057061
55970 18057061 19061478 20160304 21361637 22706739 24220340 25895819 27750999 29847934
55962 29847934 32239432 34958304 38089107 41794826 46249741 51604458 58023279 65664384
55954 65664384 74598158 84843778 96523688 109903182 125309114 143191840 164266061
55947 164266061 189314445 218753821 252641839 290995500 333073132 375231793 409707630
55940 409707630 427101348 421665630 394867654 354045034 307839868 262571762 221516708
55933 221516708 185871623 155686659 130415200 109364245 91959290 77692125 66016650
55926 66016650 56427832 48557674 42110281 36782205 32317272 28565923 25421309 22751645
55918 22751645 20443977 18452459 16748163 15267739 13953718 12796565 11793377 10906215
55910 10906215 10098534 9372671 8735337 8162292 7629738 7145856 6720086 6333346 5967301
55901 5967301 5632205 5338240 5068691 4807500 4565213 4352541 4155244 3959607 3776963
55892 3776963 3619060 3473454 3326469 3187547 3068251 2958849 2847423 2741787 2651520 2567668
55882 2567668 2480305 2397804 2329623 2267825 2204015 2147162 2106568 2073774 2038653 2007314 1987168
55871 1987168 1969978 1946107 1920195 1896573 1864242 1812925 1750414 1688630 1625971 1558211 1493077
55860 1493077 1438520 1388918 1337437 1289954 1252903 1219574 1182391 1146954 1120397 1097506 1071898
55849 1071898 1049529 1037529 1030416 1020517 1011511 1008758 1006793 999515 992788 993977 998434 998886 998838 1004187
55835 1004187 1010609 1011781 1011638 1016349 1022296 1023791 1024945 1032494 1044559 1057539 1076320 1106611 1144649
55822 1144649 1185285 1232787 1293048 1362730 1436988 1520764 1621642 1738404 1867202 2012265
55812 2012265 2179894 2368104 2572149 2793417 3031869 3274936 3503378 3702434 3858623
55803 3858623 3953569 3973176 3919344 3804174 3638132 3432140 3203792 2970029 2737344 2507482
55793 2507482 2287293 2084122 1897262 1723386 1565517 1427900 1307340 1198541 1102858 1023021
55783 1023021 954529 891271 834651 788280 748751 710659 675788 648223 625089 601212 578297
55772 578297 560436 544992 527134 509179 496222 486410 474641 462166 453478 447144 438697 429484
55760 429484 423901 420741 415718 409861 407244 407125 406150 405587 408716 413913 417799 422251 430900 441698 450123
55745 450123 456354 462033 463762 457778 447659 439515 432894 424376 416553 414705 417471 419398 420378 424245
55731 424245 430466 435696 441493 452056 465872 477693 487295 498523 511146 521461 529684 539146 549279
55718 549279 556606 561550 567244 572998 576004 578207 584429 594884 606338 619194 636500 657369 678543
55705 678543 701316 729933 764184 800520 839489 885105 937734 994521 1056157 1126619 1206956
55694 1206956 1295979 1396321 1513167 1647540 1797248 1963891 2152418 2364080 2595746 2845138
55684 2845138 3109798 3380624 3641996 3877984 4073611 4212798 4283612 4286984 4235148 4141959
55674 4141959 4019836 3883894 3750857 3632488 3535195 3465454 3429490 3427718 3455288 3507839 3580893
55663 3580893 3664018 3741768 3800482 3828912 3813557 3741178 3607817 3420836 3192458 2936476
55653 2936476 2669832 2409433 2164991 1939124 1734157 1553472 1396593 1259163 1138570
55644 1138570 1034586 944575 863861 791247 728827 676065 629390 587679 552633 523403 496402
55633 496402 470830 448987 430753 413165 395922 381797 370951 360112 348077 336872 326901 316180
55621 316180 305048 296516 291095 286092 280548 276010 272081 266373 259401 254416 251724 248262 243355 239690
55607 239690 237917 235500 231761 228929 227343 224757 221310 220005 221170 221573 220178 219738 221370 222575 222068
55592 222068 221784 222670 223110 223008 224862 229269 233679 236876 240515 245134 249087 252508 257819 265148 271701
55577 271701 276866 283383 292297 301319 309535 319079 330718 342351 353432 366359 381860 397491 412392
55564 412392 429108 448954 469882 490880 514276 541826 572551 606356 645826 692529 745332
55553 745332 804107 871386 948756 1035570 1132792 1244041 1370963 1511433 1664021 1830137
55543 1830137 2009629 2197896 2389109 2578314 2758148 2917031 3042681 3124432 3151354 3113452
55533 3113452 3008536 2845748 2640624 2409322 2167869 1931343 1709718 1506589 1323553
55524 1323553 1162827 1024282 904064 798732 707853 630777 564473 506671 457759 417332
55514 417332 382152 349751 320961 296680 275235 255118 237275 222432 209016 195895 184364
55503 184364 175348 167392 159383 152444 147168 141831 135401 129513 125506 122221 118573 115455 113237 110266
55489 110266 105827 101770 99287 96891 93434 90189 87937 85012 80390 75880 73090 70972 68454 66613
55475 66613 66001 64650 61163 57173 54447 52095 49011 46497 45901 45943 44893 43370 42744 42680 42383 42294 42622
55458 42622 42139 40304 38619 38149 37778 36512 35284 34812 33994 32160 30656 30500 30713 30542 30966 32402 33426
55441 33426 33419 33888 35498 36514 36022 35941 37747 39870 40505 40485 41157 41884 41975 42726 45185 47904 49096 49102 48869
55422 48869 48080 46631 45717 45644 44790 42525 40750 40760 41073 40275 39452 39773 40199 39649 38950 38591 37155 34108
55404 34108 31502 30730 30280 28953 28404 29901 31394 30668 28882 28113 27887 27108 26997 28905 31284 31967 31584
55387 31584 31780 31949 30838 29532 29722 30526 30021 28497 27412 26600 25288 24356 24790 25335 24450 23176 23303
55370 23303 24066 23490 21771 20541 19928 18997 18068 17971 18018 17131 16003 15892 16396 16586 17017 18322 19210 18290
55352 18290 16606 15959 15988 15336 14394 14371 14838 14653 14283 14751 15367 14830 13601 12933 12620 11825 11025 11014 11142
55333 11142 10668 10572 11886 13595 14378 15025 16798 18831 19556 19380 19530 19593 18656 17556 17491 17617 16521 14829
55315 14829 13894 13214 11759 10543 11136 12725 13356 13063 13130 13354 12740 11952 12322 13243 13183 12503 12669 13520 13858
55296 13858 13871 14370 14475 12780 10219 9144 10028 11378 12252 12654 12236 10962 10212 10993 11944 11381 10140
55279 10140 9950 10227 9262 7486 6593 6415 5698 5146 6504 9143 10662 10617 10653 11218 11098 10168 9760 10161
55261 10161 10287 9915 9909 10229 9995 9440 9642 10505 11061 11426 12349 13370 13602 13746 14968 16399 16239 14818
55243 14818 13984 13923 13263 11951 11334 11514 11267 10552 10602 11531 12176 12330 12856 13648 13631 12648 11421 10045 8603
55224 8603 8527 10913 14085 15434 15160 15518 16890 17607 17393 17828 19198 19876 19227 18464 18169 17472 16189 15444
55206 15444 15731 16409 17313 18759 19899 19357 17618 16552 16488 15990 14666 13843 14216 15017 15770 16773 17647
55189 17647 17466 16489 15906 15940 16059 16644 18235 19541 18711 16358 14870 14926 15242 15481 16563 18105 18458 17542
55171 17542 16971 17146 16954 16503 17232 18924 19548 18623 17945 18314 18376 17511 17058 17681 18090 17514 17077 17635 18421
55152 18421 18811 19343 20106 20208 19718 20085 21817 23705 25055 26618 28647 30166 30967 32196 34166 35612
55136 35612 35940 36175 36923 37388 37153 36908 36711 35567 33458 31702 30609 28975 26669 25334 25567 25678 24501
55119 24501 23288 23518 24729 25827 26823 27972 28767 28999 29362 29981 29785 28249 26414 25414 25354 26222 28253
55102 28253 30725 32055 31842 31333 31353 31455 31577 32580 34403 35542 35167 34113 33169 32191 31493 32080 33661
55085 33661 34398 33563 32660 33070 34364 35788 37583 39819 41662 42751 43818 45240 46551 47893 50110
55070 50110 52822 54397 54520 54824 56287 58081 59657 61697 64166 65728 66180 67198 69511 71557 72182
55055 72182 72382 72954 72650 70385 67338 65144 63649 62056 60635 59726 58560 56575 54499 52858 50947
55040 50947 48502 46715 46257 46010 45098 44432 44749 44911 43777 42226 41637 41831 42156 43128 45214 47307 48119
55023 48119 48093 48363 48902 49092 49024 48876 48118 46697 45936 46941 49110 51207 52775 53569 53189 52415 53265 56341
55005 56341 59685 61644 63235 66167 70220 74452 79359 85761 92752 98947 104897 112314 121608 131960
54991 131960 143177 155748 169584 184197 199607 215685 231099 244075 253621 259132 259808 255656
54979 255656 248133 238604 227077 213574 199616 186957 175794 165581 156683 149803 144516 139708 134897
54966 134897 130088 125122 120102 115634 111804 108014 104592 103146 104194 105908 106565 106901 108602 111839 115910
54951 115910 121102 128070 136289 144773 153676 163747 175002 187114 200073 213102 224026 231194 235082
54938 235082 236561 234700 227947 216620 202651 187692 172914 159657 148511 138456 128425 119016
54926 119016 111329 105062 99334 94440 91117 88866 86682 84671 83333 82037 79924 77608 76224 75454
54912 75454 74229 72768 72080 71886 70894 68850 66618 64393 61451 57668 53923 50990 49052 48086 47752 47261
54896 47261 46259 45348 44951 44447 43358 42402 42251 42266 41741 41306 41693 42179 41855 41420 42026 43193 43642 43431
54878 43431 43441 43545 43158 42937 43946 45565 46169 45620 45300 45897 46852 47752 48655 49217 49093 48974 49769 51049
54860 51049 51728 51878 52364 53167 53705 54348 55863 57715 58748 59302 60834 63614 66628 69709 73875 79368
54844 79368 85115 90492 96119 102576 109667 117300 125920 135876 147292 160565 175896 192381 208524
54831 208524 223534 237142 248503 256468 260654 261113 257397 249249 237811 224757 210549 194952 178865
54818 178865 164057 151286 140198 130847 123719 118318 113419 108847 105554 103811 102752 101842 101429 101665
54804 101665 102186 103114 105170 108581 112868 117818 123661 130310 137441 145332 154635 165441 177465 190846
54790 190846 205726 221334 236594 251330 265668 278589 288325 293948 295457 292770 286038 276646 266405
54777 266405 255814 244293 231799 218888 205601 191870 178760 167736 158731 150387 142021 133918
54765 133918 125955 117688 109784 103677 99632 96574 93883 91865 90470 89092 87746 86895 86054 84148 81403
54750 81403 79259 78152 76979 75069 73093 71571 70071 68448 67484 67595 68055 68064 67592 66769 65548 64405
54734 64405 64340 65673 67648 69475 70905 71677 71389 70235 68997 68156 67738 67945 68997 70409 71418 72027
54718 72027 72663 73034 72548 71699 71699 72713 73696 74017 74072 74299 74828 76104 78507 81232 82744 82601 81839 81595
54700 81595 82365 84383 87428 90320 92005 93157 95490 99473 103982 108087 111786 115033 117532 119623 122060
54685 122060 124855 127558 130463 134136 137932 140672 142703 145564 149624 153900 158334 164209 171929 180349
54671 180349 188951 198853 210805 223727 236118 247444 257350 264834 269174 270658 269576 265453 257968
54658 257968 247829 236251 224258 212725 202196 192414 182904 174056 166705 160740 155304 150234 145967
54645 145967 142175 138009 133729 130469 128321 126258 124042 122409 121154 118972 115723 113030 111939 111617
54631 111617 111034 110281 109542 108395 107014 106557 107446 108611 109191 109733 110958 112656 114484 116543 118413 118939
54615 118939 117772 115981 114477 112971 111030 108941 106965 104978 103329 102731 102890 102643 101849 101558 101865 101441
54599 101441 99855 98504 98265 98039 96707 94943 93877 93493 93508 94359 96043 97342 97492 97446 98299 99673 100772
54582 100772 101763 102875 103413 103017 102836 104096 106473 109070 111895 115146 118083 120061 121808 124379 127587
54567 127587 130706 133985 138232 143537 149544 156353 164150 172527 181054 189868 198993 207881 216350 224963
54553 224963 233614 240777 245130 246926 246847 244652 240095 234086 227724 221102 214323 208612 204947 202297 198730
54538 198730 193774 188477 183674 179480 176030 173434 171113 168181 164361 159972 155439 151386 148583 147181
54524 147181 146552 146303 146638 147279 147213 146158 145132 144787 144431 143540 142865 142919 142754 141559 140225 139816 139629 138377
54506 138377 136312 134484 132799 130567 128257 126808 125699 123574 120601 118520 118327 119365 120631 121605 121859
54491 121859 121249 120633 121133 122509 123298 122736 121637 121186 121725 122845 123970 124628 124635 124100 123095 121583 119853
54474 119853 118476 117474 116192 114393 112768 111894 111504 111353 111847 113051 114031 114082 113812 114096 114793 115422 116206
54457 116206 117381 118267 118172 117510 116937 116112 114506 112701 111666 111315 111020 110906 111422 112101 112106 111579 111192 110761
54439 110761 109566 107820 106605 106442 106823 106944 106161 104180 101657 100062 100011 100354 99836 98929 98882 99729 100572
54422 100572 101190 101886 102184 101220 99287 97652 96915 96717 96862 97514 98379 98809 98684 98298 97592 96457 95459 95277
54404 95277 95733 96301 97143 98575 99989 100579 100788 101804 103826 106042 108073 110236 112492 114328 115662 116832
54388 116832 117836 118513 119246 120419 121398 121121 119483 117191 114584 111700 109162 107696 106897 105640 103644
54373 103644 101549 99612 97440 94950 92529 90270 88042 86171 85115 84637 84196 83835 83747 83436 82468 81607
54357 81607 81894 82865 83098 82346 81736 81877 82170 82150 82219 82797 83761 84895 86036 86769 86874 86930 87592 88570 89342
54338 89342 90502 93029 96385 98760 99323 99006 98961 99449 100352 101622 102985 104168 105550 107690 110214 112126
54322 112126 113178 113904 114445 114424 113931 113548 113403 113212 113107 113302 113127 111665 109253 107039 105159 102731 99661
54305 99661 96962 95048 93178 90963 89135 88331 88246 88386 88659 88871 88623 88003 87507 87075 86233 85240 84971 85438
54287 85438 85569 84823 83988 83935 84532 85137 85363 85066 84352 83735 83546 83180 81815 79797 78292 77648 77212 76789
54269 76789 76907 77509 77686 77067 76282 75670 74731 73303 72192 72056 72600 73341 74304 75527 76670 77488 78013 78103
54251 78103 77624 77170 77609 78769 79553 79538 79385 79539 79679 79800 80600 82241 83783 84467 84745 85474 86834 88488
54233 88488 90131 91442 92144 92415 92700 92959 92687 91773 90741 90157 90464 92158 95226 98560 100951 102526
54217 102526 104150 105638 105840 104502 102684 101243 100194 99647 99878 100224 99387 97306 95329 94133 92851
54202 92851 90817 88763 87545 86890 86136 85177 83995 82275 80122 78261 77006 75903 74844 74452 74870 75235
54186 75235 74849 73900 72574 70596 68190 66373 65678 65578 65662 66210 67099 67388 66803 66438 67178 68439 69325 69977
54168 69977 70838 71526 71473 71025 70987 71596 72597 73749 74687 74933 74642 74645 75318 76059 76308 76347 76642 77227 78082 79234
54148 79234 80109 79742 78117 76344 75076 73794 72049 70321 69050 67968 66968 66525 66651 66531 65849 65314
54132 65314 65230 64838 63768 62858 62625 62295 61320 60551 60730 61076 60685 60214 60726 61808 62384 62615 63457 64836
54114 64836 65706 65639 65087 64417 63822 63878 65038 66706 67718 67586 66629 65269 64011 63577 64191 65098 65511 65597
54096 65597 65819 65929 65502 64885 64654 64631 64369 64221 64919 66412 67977 69245 70314 71172 71739 72291 73169 74316
54078 74316 75507 76613 77251 76848 75631 74833 75273 76380 77276 77979 78789 79444 79901 81122 83816 86977 88913
54061 88913 89317 89171 89046 88734 88373 88648 89764 91158 92334 93300 94246 95387 97018 99193 101565 103960
54045 103960 106708 109920 112998 115471 117733 120282 122851 125115 127609 131027 135120 139217 143354 147941
54031 147941 152799 157544 162508 168217 174227 179603 184268 188869 193428 197193 199825 201820 203740 205715
54017 205715 207647 209177 209621 208676 207081 205908 205337 204713 203539 201681 198901 195072 190744 186741 183173
54002 183173 179469 175300 170912 166677 162828 159471 156432 153322 150165 147487 145384 143111 140299 137925
53988 137925 137150 137599 137717 136550 134318 131552 128653 126195 124712 124064 123678 123395 123474 123865 124089 123870 123371
53971 123371 122787 122076 121077 119715 118287 117569 118145 119442 120145 119811 119373 119735 120754 122040 123688 125553
53955 125553 126873 127553 128897 132004 136225 140268 143978 147936 152100 156205 160846 166744 173369 179648
53941 179648 185657 192270 199507 206597 213492 220912 228885 236452 242775 247489 250109 250340 248941 247171
53927 247171 245377 243145 240717 239085 238697 239237 240740 243795 248537 254455 261341 269445 278553 287914 297201
53912 297201 306618 315828 323661 329151 332237 333441 333566 333618 334188 334820 334695 333867 333054 332352 331079 328855
53896 328855 325962 322611 318687 314268 309628 304744 299539 294453 289896 285249 279344 271970 264059 256431
53882 256431 249187 242312 235947 229966 224027 218107 212385 206770 201207 196131 191828 187762 183490 179839
53868 179839 177949 177395 176503 174410 171609 168591 165335 162192 159856 158116 155834 152520 148868 145488 142223
53853 142223 138960 136001 133262 130252 127210 125224 124760 125054 125350 125699 126094 125878 124741 123451 122889 122985
53837 122985 123150 123171 123122 122935 122594 122401 122637 123285 124203 125229 126093 126739 127671 129355 131324 132615 133135 133745
53819 133745 134914 136203 137262 138453 140103 141907 143519 145104 146907 148805 150658 152677 155196 158381
53805 158381 162242 166572 170922 175077 179444 184462 189823 194874 199552 204198 208647 212401 215610 218941
53791 218941 222493 225646 228036 229888 231375 232430 233215 234039 234832 235397 235922 236453 236238 234620 232261 230248
53775 230248 228272 225060 220479 215739 211470 207198 202911 199508 197149 194704 191563 188653 186847 185488
53761 185488 183426 180607 177828 175619 174081 173188 172652 172013 171219 170559 169875 168678 167229 166514 166832 167341
53745 167341 167319 166883 166128 164707 162816 161533 161534 162257 162829 163006 162814 162229 161707 162052 163242 164301 164782 165308
53727 165308 166122 166329 165337 164008 163460 163640 163925 164275 164897 165501 165865 166546 168179 170473 172589 174065 174866
53710 174866 175107 175165 175470 175793 175516 174998 175640 178040 181120 183774 186310 189327 192293 194401 196058 198254
53694 198254 200989 203560 206038 209329 213883 219195 224416 228845 232151 234788 237817 241741 245908 249676
53680 249676 253524 258237 263632 269107 275009 282363 291344 300967 310247 318882 326888 334404 341920 349991
53666 349991 358469 366510 373481 379595 385650 392398 400073 408246 416172 423467 430393 437460 444978 452991
53652 452991 461249 469081 475708 480900 485044 488516 491341 493527 495258 496712 498027 499420 500869 501877
53638 501877 502165 502283 502732 502781 501335 498801 496718 495428 493628 490646 487635 485792 484765 483725 482777 482185
53622 482185 481220 479003 475833 472658 469729 466684 463395 459936 456300 452886 450650 449972 449943 449499 448678 448109
53606 448109 447947 448117 448852 450174 451458 452421 453881 456665 460291 463661 466550 469555 473129 477564 483432
53591 483432 491022 499665 508390 516963 525664 534558 543724 553640 564487 575521 585863 595379 604144
53578 604144 611816 618551 625814 635058 645973 657075 667673 678186 688872 699480 710047 721001
53566 721001 732441 744138 756260 769331 783433 797978 812153 825127 836205 845269 852755 858758
53554 858758 862757 864782 866072 867637 868833 868336 866061 863044 859835 856111 851601 846323 840072 832691
53540 832691 824795 817359 810604 804033 797366 790680 783809 776435 768665 760814 752798 744456 736315 729330
53526 729330 723982 720185 717766 716445 715689 715273 715584 716809 718261 719218 719868 720716 721663 722609 724276 727299
53510 727299 730960 734034 736625 740052 745182 751992 760492 770834 782531 794697 807160 820456 834873
53497 834873 850405 867534 887019 908926 932780 958552 986587 1016660 1048094 1080775 1115042
53486 1115042 1150695 1187209 1225016 1265587 1310059 1358564 1410903 1466920 1526073 1587484 1650534
53475 1650534 1714770 1779304 1843164 1906270 1969313 2032769 2096923 2162816 2232285 2306959 2387882
53464 2387882 2475915 2571491 2673941 2781826 2893900 3008755 3123579 3234299 3337325 3430616
53454 3430616 3513276 3585109 3646658 3698828 3742335 3778299 3809376 3839395 3871813 3909145 3953557
53443 3953557 4006592 4067850 4134780 4204171 4273430 4340630 4404513 4464870 4522129 4575993 4624675
53432 4624675 4665357 4694979 4711015 4712579 4701018 4678862 4648150 4610104 4565675 4515137 4457203
53421 4457203 4389790 4312077 4225292 4131844 4034691 3937263 3842419 3750862 3661263 3571953 3481562
53410 3481562 3388202 3289670 3185338 3077212 2968764 2863342 2763689 2671837 2588728 2514339
53400 2514339 2448346 2390243 2339110 2294254 2256222 2226329 2205183 2192502 2188290 2193063 2206718 2228253
53388 2228253 2256841 2292255 2334082 2381617 2434798 2494084 2558991 2627735 2698814 2771995 2847381
53377 2847381 2924506 3002975 3083183 3165876 3251662 3341433 3436521 3538054 3646746 3763552 3889727
53366 3889727 4025857 4171450 4325656 4487516 4655289 4826558 4999691 5174673 5352350
53357 5352350 5533645 5719655 5911343 6108342 6308524 6508954 6706610 6898252 7081108
53348 7081108 7254717 7421684 7586221 7752385 7923465 8101455 8286240 8476133 8670012
53339 8670012 8868225 9070796 9275451 9477757 9671900 9850016 10001267 10113019 10173865 10176591
53329 10176591 10120182 10010428 9858186 9675618 9472917 9257320 9033269 8802289 8563353
53320 8563353 8314735 8056231 7789890 7519272 7248204 6979529 6714199 6451469 6190136
53311 6190136 5929581 5669979 5412294 5158296 4910091 4669420 4437692 4216345 4006482
53302 4006482 3808331 3622048 3449019 3291360 3150084 3024778 2915142 2821563 2743819 2680290
53292 2680290 2628899 2587819 2554903 2527674 2504504 2484912 2468234 2453157 2439122 2427106 2418266
53281 2418266 2412820 2410824 2412877 2419088 2428364 2439675 2453161 2469108 2486709 2504967 2524058 2544844
53269 2544844 2567722 2592950 2621419 2653907 2690032 2728887 2770256 2814327 2860823 2909661 2962180
53258 2962180 3020675 3086885 3161702 3245850 3339434 3440647 3545945 3652124 3758131 3865228
53248 3865228 3975991 4093109 4218395 4352346 4494093 4641051 4788438 4929929 5059603
53239 5059603 5173349 5268742 5344511 5400507 5437162 5454164 5450096 5423804 5375424 5305677 5215307
53228 5215307 5106283 4982775 4849635 4709974 4564915 4415422 4263562 4112309 3964953
53219 3964953 3824510 3692926 3570621 3456880 3350226 3248104 3146841 3042610 2932321
53210 2932321 2813687 2685475 2548321 2404565 2256633 2106284 1955993 1809968 1672614
53201 1672614 1546467 1432368 1330815 1241939 1164702 1097487 1039330 989691 947380 910842 879239
53190 879239 852216 828730 807223 786967 768350 751704 736566 722069 707412 691994 675765
53179 675765 659343 643251 627219 610816 594428 578864 564231 549965 535762 521753 507961
53168 507961 494389 481577 470293 460652 452014 443578 434562 424240 412652 401084 390976 382423
53156 382423 374455 366606 359361 353121 347589 342329 337221 332256 327472 323196 319768 316919 313838 309977
53142 309977 305484 300969 297133 294382 292370 290126 287029 283435 280017 276950 274212 272159 271029 270242
53128 270242 268972 267170 265304 263356 260869 257833 254680 251471 247841 243768 239797 236497 234177 232901
53114 232901 232194 231019 228774 226223 224713 224568 224879 224786 224248 223658 223420 223931 225358 227310 229168 230720
53098 230720 232144 233604 235278 237511 240462 243833 247443 251578 256217 260399 263147 264590 265360 265299 263764
53083 263764 260884 257459 253740 249302 244100 238618 232998 226987 220878 215556 211399 207846 204219 200315
53069 200315 196195 192152 188926 187108 186201 184948 182748 180134 177876 176310 175567 175640 176090 176356 176484 176931
53053 176931 177671 178217 178575 179406 181113 183418 185866 188045 189366 189531 189294 189890 191543 193355 194717 195830
53037 195830 196612 196261 194503 192364 190946 190101 189001 187437 185818 184237 182327 179882 177033 173844 170186
53022 170186 166144 162277 159319 157588 156628 155530 153717 151398 149158 147318 145824 144474 142935 140860
53008 140860 138356 136050 134301 132684 130691 128579 126892 125524 123982 122313 120921 119718 118311 116927
52994 116927 116236 116178 115870 114826 113504 112510 111975 111903 112367 113157 113866 114497 115371 116339 116762 116449 115881 115336 114497
52975 114497 113239 112064 111383 111020 110865 111441 113235 115814 118076 119300 119698 119994 120671 121548 122114 122276 122519
52958 122519 123164 123885 124351 124903 126018 127447 128575 129356 130138 130841 131120 131179 131561 132244 132869 133696 135288 137223
52940 137223 138258 138020 137519 137697 138385 139018 139463 139664 139325 138478 137775 137742 138296 139227 140557 142068 143197 143756
52922 143756 144206 144870 145472 145725 145809 145953 146116 146369 146959 147701 147844 146935 145336 143680 142361 141678 141780 142243
52904 142243 142358 142098 142138 142670 142933 142296 141044 139745 138578 137670 137308 137283 136775 135495 134355 134316 135164 136049
52886 136049 136701 137419 138249 138945 139525 140205 140849 140991 140367 139201 138031 137435 137676 138454 139219 139741 140081 140076 139447
52867 139447 138503 138112 138735 140017 141518 143243 145218 147204 149178 151506 154260 156991 159524 162379 165872
52852 165872 169331 171659 172283 171141 168263 163892 158666 153218 147856 142904 138873 135913 133489 131043
52838 131043 128616 126526 124827 123449 122470 121897 121520 121271 121371 121837 122234 122189 121735 120980 119958 119016 118732
52821 118732 119094 119334 118961 118391 118086 117677 116498 114499 112060 109349 106519 104253 103400 104129 105782 107467
52805 107467 108543 108800 108559 108413 108573 108580 107893 106601 105401 105012 105576 106487 106901 106668 106507 106850 106907 105687
52787 105687 103606 102037 101378 100733 99657 98878 98808 98591 97363 95454 93575 91730 89816 88499 88516 89612
52771 89612 91025 92502 94054 95204 95380 94788 94184 94048 94546 95864 97938 100154 101872 103033 103837 104253
52755 104253 104286 104229 104126 103489 102048 100318 98940 98097 97931 98778 100285 101115 100437 99090 98396 98412 98355 98141
52737 98141 98297 98661 98409 97353 96226 95597 95330 95159 95105 95275 95781 96773 97977 98460 97530 95746 94393 94117
52719 94117 94630 95522 96586 97491 97908 98041 98482 99502 100858 102157 102986 103038 102580 102459 103041 103515 102954 101689
52701 101689 100804 100604 100470 100112 99926 100157 100573 101084 101856 102671 102932 102556 102178 102230 102357 102048 101394 100897 100824
52682 100824 100910 100615 99687 98636 98444 99542 101309 102867 104016 104977 105672 105900 105991 106556 107661 108833 109778
52665 109778 110539 111074 111232 111109 110904 110556 110002 109550 109413 109110 108032 106470 105316 104815 104374 103671 103156 103297
52647 103297 103957 104700 105219 105312 104991 104734 105125 106044 106647 106318 105340 104471 104215 104493 104709 104145 102636 100857
52629 100857 99643 99089 98696 98227 97928 97978 98226 98539 98900 99129 98928 98303 97593 97039 96638 96360 96197 95997 95634
52610 95634 95312 95365 95819 96494 97452 98901 100682 102184 102816 102383 101063 99362 97961 97306 97324 97737 98440 99367
52592 99367 100203 100615 100621 100529 100683 101384 102718 104236 105239 105671 106231 107269 108147 108163 107520 106761 105888 104846 104321
52573 104321 105066 106712 108196 109162 110044 110927 111345 111230 111121 111326 111677 112250 113494 115422 117324 118628 119506
52556 119506 120475 121880 123955 126849 130294 133525 135711 136436 135924 135090 135079 136303 138051 139364 139985 140137
52540 140137 139881 139424 139571 140907 142629 143179 142064 140338 139215 138986 139337 139978 140671 141263 141911 142894 144132
52523 144132 145304 146366 147442 148298 148541 148317 148242 148610 149213 149929 150936 152297 153808 155284 156586 157474
52507 157474 157856 158027 158213 158090 157252 155847 154236 152357 150125 148101 146959 146574 146414 146523 147255 148286
52491 148286 148906 149087 149318 149552 149414 149239 149752 150670 150891 150168 149454 149370 149500 149450 149423 149362 148662 147294 146172
52472 146172 145868 145887 145766 145928 146798 147896 148533 148774 149089 149650 150549 152073 154093 155637 155788 154731 153504
52455 153504 152996 153436 154479 155441 155829 155900 156408 157650 159170 160489 161601 162605 163422 164039 164610 165186 165760
52438 165760 166501 167334 167533 166541 165092 164557 165142 165795 165945 166106 166520 166494 165711 165012 165069 165265 164668 163325 161817
52419 161817 160299 158858 158106 158491 159496 160320 160965 161967 163463 165166 166824 168115 168505 167867 166841 166012
52403 166012 165127 163739 162163 161117 160750 160710 160881 161384 162060 162560 162867 163202 163536 163602 163304 162780 162220 161884
52385 161884 162102 162935 164009 164895 165454 165656 165398 164729 163979 163495 163452 163931 164837 165763 166395 167022 168055 169125
52367 169125 169413 168909 168481 168564 168680 168558 168684 169266 169607 169200 168698 169083 170494 172453 174639 176825 178671
52350 178671 180203 181948 184004 185606 186261 186690 187894 189808 191632 192977 193992 194802 195666 197285 200139
52335 200139 203700 206949 209478 211554 213428 215196 217111 219408 221941 224405 226644 228421 229346 229525 229873
52320 229873 231263 233662 236473 239188 241303 242230 242000 241578 241854 242752 243871 245379 247521 249790 251493
52305 251493 252783 254246 255851 257246 258874 261697 265767 269943 273254 275917 278859 282716 287472 292715
52291 292715 298064 303466 309072 314843 320594 326438 332666 339046 344912 350307 356338 363826 372204 380366
52277 380366 388061 395778 403805 412176 421164 430984 441230 451228 460763 470017 479218 488854 499658 511673
52263 511673 523845 535273 546373 558007 569974 581371 592023 602490 612840 622537 631526 640458
52251 640458 649647 658656 667047 674874 682344 689586 696873 704506 712308 719631 725876 730836 734707 738133
52237 738133 741845 745789 748985 750825 752075 753934 756468 758737 760151 760913 761377 761842 762900 765154 768592
52222 768592 772839 777850 783706 789917 795760 801183 806726 812618 818706 825119 832263 840279 849137 859015
52208 859015 869703 879966 888552 895867 903563 912343 921165 928880 935681 942434 949334 955758 961012 964853
52194 964853 967556 969720 971691 973111 973308 972055 969586 966028 961423 956249 951262 946677 941954 936449
52180 936449 929941 922568 914728 906934 899343 891555 883284 874954 867083 859407 851303 842848 834697 827061
52166 827061 819629 812375 805588 799173 792797 786788 781960 778367 775076 771390 767588 764154 761078 758249
52152 758249 755891 754134 752627 750966 749183 747550 746176 744967 743765 742372 740706 738941 737253 735536
52138 735536 733569 731330 728827 725866 722390 718774 715347 711916 708239 704563 701133 697530 693219 688447
52124 688447 683842 679438 674874 670213 665662 660758 654915 648648 643216 639044 635485 632076 628934 625904
52110 625904 622462 618757 615655 613424 611294 608709 606171 604460 603739 603738 604165 604693 605205 606194 608176 610714
52094 610714 612885 614793 617587 621741 626404 630803 635257 640397 646364 653313 661644 671111 680587 689455
52080 689455 698471 708616 719866 731730 744176 757143 769813 781395 792290 803719 816403 830184
52068 830184 844624 859311 873836 888057 902234 916561 930836 944893 958945 973024 986472
52057 986472 998481 1008859 1017881 1025674 1032184 1037435 1041418 1043957 1045049 1045108 1044546 1043344 1041289 1038398
52043 1038398 1034848 1030737 1026087 1020838 1014718 1007484 999388 991014 982545 973722 964680 956199 948768 941955
52029 941955 935118 928303 921975 916252 910868 905668 900798 896544 893246 891142 890056 889373 888532 887508 886919
52014 886919 887813 891044 896402 902510 908097 913150 918277 923346 927757 931847 936773 942729 948432 952741
52000 952741 955794 958060 959331 959314 958312 956549 953536 948845 942866 936044 927989 918086 906480 893627
51986 893627 879354 863159 845127 825840 805633 784601 763118 741701 720523 699517 678739
51975 678739 658085 636944 614742 591721 568774 546690 525904 506673 488980 472353 456173
51964 456173 440089 424017 408070 392760 378865 366672 355621 345004 334750 325308 317136 310517
51952 310517 305441 301305 297151 292583 288144 284573 282089 280630 280113 280089 279655 278287 276354 274425 272575
51937 272575 270771 269354 268497 267653 266172 264169 262241 260594 258965 257149 255105 252822 250485 248502 246972
51922 246972 245456 243655 241909 240591 239399 237799 235765 233582 231215 228500 225729 223475 221891 220593
51908 220593 219196 217723 216580 216292 216983 218022 218541 218425 218351 218869 220086 222374 226495 232559 239639 247004
51892 247004 255026 264345 274859 286315 299379 315311 334889 358163 384784 413955 444425 474979
51880 474979 504305 529849 547592 553971 547914 530729 504827 473282 439660 406820 375902 347152
51868 347152 321238 298817 279372 261744 245732 232104 221032 211546 202749 194702 187889 182346
51856 182346 177537 172748 167640 162664 158706 156009 153855 151630 149583 147998 146394 144371 142602 141900
51842 141900 141880 141647 141400 142000 143201 143688 142888 141454 139836 137670 135002 132895 132217 132585 133013 132950 132333
51825 132333 131374 130706 131022 132102 132738 132080 130621 129475 129116 129248 129568 130167 131266 132803 134208 134654 133737
51808 133737 131933 130175 129044 128534 128426 128449 128262 127697 126986 126412 125848 125040 124138 123516 123219 123114 123385 124344
51790 124344 125829 127281 128295 128639 127986 126305 124421 123505 123894 124874 125583 125696 125324 124807 124602 124967 125777
51773 125777 126904 128473 130381 132031 133112 134187 135809 137497 138487 139111 140373 142297 143825 144402 144675
51758 144675 145393 146465 147330 147542 146850 145386 143880 143051 142736 142251 141498 140925 140457 139406 137593 135634 133941
51741 133941 132251 130381 128654 127336 126369 125824 125844 125960 125339 123948 122686 122109 121901 121849 122337 123386 124126
51724 124126 123895 123197 122902 123106 123328 123298 122943 122091 120822 119828 119858 120967 122565 123949 124599 124361 123655 123140
51706 123140 122945 122641 122087 121848 122522 124124 126346 128900 131384 133344 134865 136655 139264 142582 146256
51691 146256 150123 153932 157123 159168 159803 158864 156501 153685 151810 151402 151746 152093 152657 154061 156348 158971
51675 158971 161360 163158 164296 165129 166090 167090 167716 168084 168747 169567 169546 168219 166428 165186 164544 164140 164146
51658 164146 164871 166039 167292 168937 171399 174287 176774 178632 180165 181357 181898 181916 181920 182000 181729 180883 179723
51641 179723 178471 176998 175130 172896 170370 167572 164541 161358 158098 154969 152319 150314 148656 146876
51627 146876 144777 142483 140238 138376 137293 137144 137610 138165 138548 138910 139656 141159 143416 145929 148124 149960
51611 149960 151861 154060 156257 157887 158312 156898 153532 149212 145537 143254 141743 140109 138232 136551
51597 136551 135411 135052 135731 137352 139340 141258 143145 144926 146030 146110 145769 145922 146677 147365 147567 147636 148264
51580 148264 149845 152192 154640 156508 157590 158071 158055 157635 157437 158377 160557 163028 165066 167064 169621 172338
51564 172338 174295 175388 176386 177810 179410 180716 181561 182054 182447 182987 183548 183563 182667 181274 180145 179547 179167
51547 179167 178661 177845 176571 174882 173245 172149 171500 170755 169639 168325 166992 165571 163972 162250 160504
51532 160504 158860 157559 156805 156452 155967 154814 152893 150658 148758 147422 146281 144926 143474 142197 140870
51517 140870 139119 137354 136515 136635 136455 134985 132782 131112 130457 130483 131015 132138 133557 134636 135071 135045 134772
51500 134772 134421 134322 134749 135539 136362 137288 138608 140156 141304 141660 141348 140643 139707 138745 138009 137498 136930 136141
51482 136141 135351 134989 135278 135950 136376 136126 135432 134850 134470 133831 132726 131594 130919 130680 130741 131320 132619 134286
51464 134286 135705 136609 137093 137328 137598 138300 139521 140894 142173 143576 145203 146611 147411 147893 148437 148731
51448 148731 148230 147091 145981 145183 144504 143824 143069 141865 140019 138162 137118 136678 135838 134276 132768 131884
51432 131884 131116 129727 127825 126065 124665 123245 121475 119424 117290 115096 112850 110859 109684 109570 110051
51417 110051 110427 110615 111077 111840 112200 111762 111198 111334 111886 111857 110922 109660 108490 107191 105645 104365 103968
51400 103968 104574 105875 107444 108798 109554 109772 109909 110268 110723 111069 111414 112057 113092 114191 114732 114263 112975
51383 112975 111621 110811 110527 110439 110365 110172 109539 108238 106543 105017 104041 103777 104277 105210 105755 105296 104105 102948
51365 102948 102224 101894 102039 102863 104243 105755 107110 108152 108595 108316 107756 107481 107437 107211 106917 107165 108136 109322
51347 109322 110234 110800 111017 110824 110467 110350 110367 110032 109436 109428 110474 111922 112849 113171 113443 113893 114178 113964 113297
51328 113297 112434 111635 111136 111126 111673 112715 114052 115351 116272 116693 116755 116684 116645 116732 116953 117229 117462 117528 117179 116151
51308 116151 114576 113083 112268 112164 112409 112794 113390 114315 115621 117247 118889 120092 120731 121208 121929 122816 123556
51291 123556 123990 124015 123479 122614 122153 122514 123216 123605 123710 123775 123442 122313 121060 120860 121764 122572 122463 121805 121178
51272 121178 120552 119828 119388 119553 120124 120826 121692 122609 123081 122937 122832 123565 125201 127190 128945 129986 130036 129456
51254 129456 129278 130300 132313 134521 136445 138096 139530 140709 141651 142430 143168 144248 146191 148940 151542
51239 151542 153046 153671 154624 156741 159639 162306 164152 165305 166173 167123 168550 170870 174093 177509 180200
51224 180200 182054 183945 186721 190248 193817 197212 200847 204854 208607 211414 213357 215146 217261 219439
51210 219439 220999 221539 221275 220716 220058 219034 217319 214853 211717 207990 203852 199529 194968 189986 184977
51195 184977 180947 178338 176245 173416 169795 166343 163595 161107 158353 155414 152698 150564 149249 148614
51181 148614 147851 146143 143763 141936 141361 141427 141155 140353 139477 138869 138611 138819 139545 140456 140977 140893 140658 141020
51163 141020 142216 143583 144128 143585 142636 141913 141251 140261 139250 138890 139232 139697 139966 140259 140795 141593 142737
51146 142737 144218 145582 146422 147146 148503 150321 151517 151530 150953 150562 150510 150765 151532 152819 154202 155434 156708
51129 156708 158002 158769 158733 158485 158854 160104 162011 164255 166404 168081 169496 171339 173809 176271 178243
51114 178243 180143 182644 185845 189583 194054 199558 205953 212897 220319 228197 236195 243968 251554 259118
51100 259118 266520 273517 279970 285568 289745 292317 293824 294843 295366 295310 295180 295572 296313 296659 296176 294866
51084 294866 292632 289260 284848 279779 274232 268142 261584 254868 248252 241795 235445 229124 222871 217071
51070 217071 212299 208690 205727 202892 200231 198000 196100 194260 192520 191094 189917 188769 187696 186928
51056 186928 186459 186076 185745 185671 186007 186767 187965 189585 191426 193148 194414 194915 194528 193645 193156 193802 195536
51039 195536 197626 199288 200237 200808 201686 203320 205563 207964 210309 212612 214752 216607 218461 220698 223059
51024 223059 224889 226254 228128 231179 235032 239118 243576 248768 254426 259914 265039 270056 275114 280154
51010 280154 285200 290410 295990 302266 309516 317524 325683 333809 342465 352256 363207 375073 387690
50997 387690 400697 413582 426542 440797 457495 476697 497887 520982 546307 574106 604664
50986 604664 638388 675121 713855 753865 795673 840054 886487 933528 980441 1027500 1074699
50975 1074699 1121055 1165271 1206340 1243395 1275683 1302919 1325183 1342392 1354299 1361046 1363251 1361554
50963 1361554 1356498 1348814 1339289 1328389 1316469 1304292 1292781 1282213 1272226 1262743 1254271 1247029 1240144
50950 1240144 1232076 1221695 1208763 1193478 1175750 1154997 1130745 1103260 1073299 1041260 1007022
50939 1007022 970720 933109 894875 856216 817604 780331 745665 713806 684260 656854 631711
50928 631711 608629 587339 568207 551858 538160 526265 515660 506560 499313 494029 490683 488925
50916 488925 487878 486893 486482 487750 490795 494471 497899 501491 506168 512223 519280 526792 534127 540571 545802
50901 545802 550240 554642 559364 564045 567868 570195 571194 571868 573257 575655 578865 582996 588579 595903 604699
50886 604699 614579 625480 637647 651440 667188 684999 704766 726508 750615 777584 807800 841804
50874 841804 880373 923883 971912 1024019 1080606 1142456 1209731 1282197 1360228 1444594 1535152
50863 1535152 1630482 1729062 1830097 1932894 2035911 2136774 2232861 2321673 2401047 2469375
50853 2469375 2525599 2569021 2599327 2616792 2622234 2616857 2602351 2580910 2554776 2525900 2496279 2468281
50841 2468281 2444069 2424839 2410938 2402275 2397938 2395813 2393477 2389417 2382589 2370976 2351681 2322738
50829 2322738 2284115 2236696 2180917 2116655 2043886 1963224 1876284 1785551 1693405 1601287 1510329
50818 1510329 1422526 1340228 1264398 1194406 1129898 1071869 1021431 978361 941556 910301 884410
50807 884410 863599 847395 835420 827322 822689 821375 823611 829370 837927 848350 860188 873361 887608
50794 887608 902248 916280 928500 937851 943836 946405 945456 940800 932604 921355 907381 890991 873171
50781 873171 855337 838052 820631 802454 784067 766525 750206 734892 720604 707670 696156
50770 696156 685821 676606 668815 662832 658939 657312 657968 660786 665755 673105 683122 695949 711579
50757 711579 729884 750725 774370 801704 833579 869970 910258 954323 1002705 1055580 1112393
50746 1112393 1172726 1236763 1304259 1373647 1442796 1510326 1575515 1637099 1692770 1739850 1776164
50735 1776164 1800405 1812097 1811451 1799323 1777400 1748309 1715096 1680339 1645881 1613266 1583960 1559017
50723 1559017 1538970 1524156 1514673 1509776 1507713 1506385 1503866 1498315 1488044 1472078 1450297 1422756
50711 1422756 1389229 1349609 1304375 1254562 1201606 1147311 1093332 1040572 989609 941741 898676
50700 898676 860910 827297 796773 769771 747307 729448 715468 705027 698360 695657 696912 702020
50688 702020 710318 720414 731255 743240 757581 774754 794140 814899 836436 858113 879222 899362
50676 899362 918430 936275 952731 967742 980910 991140 997320 999365 998083 994139 987701 978981 968480
50663 968480 956563 943260 928573 912727 896061 878971 861880 845018 828397 812339 797823
50652 797823 785898 776939 770839 767676 767605 770314 775234 782229 791483 802696 815048 828055 841776
50639 841776 855994 869786 882347 893820 904868 915752 926267 936398 946506 956716 966552 975561
50627 975561 984204 993702 1004717 1016404 1027093 1035786 1042496 1047125 1048659 1045867 1038408 1026847 1011849
50614 1011849 993807 973088 950249 926003 901283 877209 854818 834856 817876 804167 793333
50603 793333 784319 776275 769209 763487 758983 755028 750820 745427 737806 727545 715493 703034 690722
50590 690722 678092 664735 650920 637146 623664 610631 598277 586711 575934 566213 558076 551741
50578 551741 546826 542825 539641 537429 536177 535721 536130 537913 541732 547866 555922 565160 575226 586551
50564 586551 599885 615491 632838 651049 669576 688546 708437 729323 750391 770389 788608
50553 788608 805211 820630 834950 847998 859685 870082 879539 888888 899157 910743 923185 936001
50541 936001 949380 963766 979238 995823 1014003 1034250 1056284 1079461 1103820 1130128 1158816
50530 1158816 1189399 1220997 1252982 1284958 1316491 1347054 1376037 1402694 1426173 1445565 1459905
50519 1459905 1468387 1470805 1467620 1459352 1446208 1428561 1407399 1383733 1357745 1329167 1298508 1267383
50507 1267383 1237494 1209642 1183765 1159539 1136724 1115134 1094391 1073802 1052813 1031779 1011982
50496 1011982 994488 979214 965488 953232 943096 935723 931532 931057 934653 941745 950986 961373 972688
50483 972688 984632 996114 1005684 1012264 1015095 1013288 1005934 992649 973927 951086 925928 900166
50471 900166 874850 850262 826321 803097 781047 760912 743269 728012 714451 702101 691198
50460 691198 682214 675138 669714 666120 664769 665471 667448 670355 674789 681528 690742 702298 716468 733884
50446 733884 754896 779323 806854 837508 871688 909974 952941 1001048 1054427 1112557 1174128
50435 1174128 1237388 1300569 1361778 1418681 1468940 1511279 1545817 1573209 1593917 1608611 1618558
50424 1618558 1624912 1627828 1626842 1621829 1613128 1601189 1586979 1572415 1559388 1548102 1537173 1525516
50412 1525516 1513370 1501355 1489391 1477070 1464329 1451063 1436504 1419645 1400120 1378165 1353865
50401 1353865 1326945 1297288 1265242 1231323 1195909 1159347 1122174 1084995 1048218 1012083 977001
50390 977001 943694 912797 884437 858561 835586 816238 800572 787702 776904 768530 763271 760855
50378 760855 760135 760302 761409 763853 768000 774293 783009 793831 806234 820251 836106 852937 868722
50365 868722 881933 892630 901490 908341 912315 913087 911224 907429 902025 895292 887846 880445 873536 867117
50351 867117 861014 855298 850457 847070 845306 844818 845147 846116 847835 850509 854368 859716 866848 875784 886085
50336 886085 897135 908807 921834 937375 956298 979149 1006578 1039188 1076900 1119302 1166981
50325 1166981 1221874 1285667 1358425 1439379 1528376 1625486 1729282 1836541 1943569 2046963
50315 2046963 2143074 2227970 2298673 2354112 2394640 2421054 2434207 2434837 2423229 2399303 2363298 2316173
50303 2316173 2259243 2193864 2121644 2044697 1965486 1886545 1810202 1738097 1670864 1608592 1551465
50292 1551465 1499579 1452359 1408879 1368861 1332735 1300720 1272475 1247803 1226977 1210118 1196871
50281 1196871 1186938 1180290 1176570 1174971 1175122 1177605 1183136 1191669 1202615 1215453 1229760 1245085 1261251
50268 1261251 1278516 1297069 1316742 1337474 1359593 1383279 1408122 1433653 1459996 1487591 1516587
50257 1516587 1546896 1578557 1611652 1646088 1681855 1719355 1759172 1801604 1846656 1894367 1945041
50246 1945041 1999351 2058264 2122619 2192789 2269142 2352786 2445250 2547382 2659219 2781288 2915437
50235 2915437 3064135 3229629 3414270 3621077 3853378 4114318 4407213 4736003 5104852
50226 5104852 5517744 5978966 6493475 7065912 7699006 8392609 9142870 9940588 10769797
50217 10769797 11608175 12428996 13203568 13904503 14510519 15010996 15407223 15709659 15933000
50208 15933000 16090587 16188836 16223545 16180550 16040668 15785970 15404744 14894879 14265989 13539290
50198 13539290 12744315 11913350 11076152 10257003 9474326 8741312 8066091 7451571 6896305
50189 6896305 6396711 5948941 5548980 5191842 4871716 4583170 4322008 4085104 3869975
50180 3869975 3674658 3497758 3338346 3195791 3069412 2957966 2859517 2772129 2694645 2626559
50170 2626559 2567196 2515342 2469687 2429406 2394260 2364391 2340069 2321406 2308121 2299641 2295406 2295012
50158 2295012 2298185 2304761 2314638 2327615 2343320 2361502 2382369 2406532 2434585 2466733 2502756 2542215
50146 2542215 2584753 2630311 2679141 2731729 2788688 2850414 2916594 2986249 3058682 3134310 3214141
50135 3214141 3298613 3387523 3480987 3579589 3683334 3791402 3903630 4021578 4147374 4281980
50125 4281980 4425392 4578214 4742016 4918199 5107532 5311310 5532451 5775072 6043418
50116 6043418 6341616 6674327 7047213 7466637 7938995 8470565 9068107 9739600 10494039
50107 10494039 11340294 12286058 13337386 14497685 15764998 17128306 18564773 20039205
50099 20039205 21506200 22915785 24222640 25396010 26425191 27317192 28088008 28752152
50091 28752152 29314412 29765245 30079872 30221727 30150724 29834564 29258662 28430467 27377283
50082 27377283 26139901 24764959 23298251 21780568 20246789 18726971 17247185 15829164
50074 15829164 14489825 13241567 12092795 11047955 10107511 9268508 8525596 7871983 7300162
50065 7300162 6802285 6370113 5995019 5668618 5383554 5133466 4912483 4715372 4538210
50056 4538210 4378240 4232867 4099324 3975435 3859844 3751120 3647146 3545854 3446122 3347685
50046 3347685 3250802 3156350 3065607 2979394 2897767 2820834 2749262 2683573 2623634 2569318 2521058
50035 2521058 2479166 2443306 2413257 2389413 2371663 2358429 2347813 2339208 2332784 2327970 2323802 2320612
50023 2320612 2319996 2322927 2328871 2336964 2347039 2359224 2373454 2389781 2408496 2429606 2452783 2478089
50011 2478089 2506214 2537754 2572872 2611964 2656148 2706693 2764396 2829786 2903604 2986807 3080382
50000 3080382 3185415 3303243 3435583 3584800 3753951 3946241 4164585 4412241 4693699
49991 4693699 5014160 5378018 5788551 6249341 6765274 7341681 7982739 8690619 9464820
49982 9464820 10300543 11186442 12103045 13022746 13911846 14735037 15461617 16071195 16556821
49973 16556821 16924772 17191022 17374573 17489106 17536263 17503568 17367581 17100632 16678960 16090334
49963 16090334 15339183 14447573 13451656 12395029 11321463 10269268 9268163 8338294 7490750
49954 7490750 6729204 6052160 5454975 4931214 4473646 4075134 3728981 3428671 3167722
49945 3167722 2940190 2741149 2566513 2412626 2276286 2154922 2046420 1948903 1860867 1781234
49935 1781234 1709039 1643272 1583176 1528261 1477770 1430614 1386223 1344870 1306610 1270479 1235402
49924 1235402 1201422 1169185 1138617 1109091 1080615 1053714 1028089 1002429 975883 948960 922726
49913 922726 897772 874163 851734 830148 809179 789087 770154 751825 733009 713488 694305
49902 694305 676520 660202 644943 630626 617251 604540 592281 580662 569904 559914 550622 542279
49890 542279 535062 528718 522947 517755 513099 508550 503746 498896 494463 490564 487037 483807 480726 477239
49876 477239 472811 467754 463150 459698 456884 453676 449914 446630 444824 444327 444256 444302 444848 445838 446366 445807
49860 445807 444687 443800 443050 441875 440351 439035 437970 436780 435550 434726 434141 433064 431309 429446 427749
49845 427749 425743 423135 420454 418405 417122 416384 416076 416146 416488 417019 417533 417522 416669 415533 415029 415204 415221 414675
49827 414675 414128 414075 414174 413898 413293 412649 411941 411044 410065 409119 408120 406944 405421 403132 399822 396104 393015
49810 393015 390740 388534 386091 384016 382585 381016 378693 376263 374746 374099 373420 372083 370026 367353 364431
49795 364431 362073 360901 360648 360529 360060 359181 357912 356404 355038 354082 353488 353206 353271 353329 352711 351328 349948
49778 349948 349176 348778 348457 348540 349241 349959 350032 349598 348932 347669 345625 343832 343508 344286 344630 343934 343120 343142 343922
49759 343922 344939 345922 346642 346811 346529 346282 346270 346245 346150 346301 346781 347304 347967 349435 351897 354294 355250 354629
49741 354629 353734 353911 355238 356686 357345 357293 357229 357525 358000 358582 359653 361449 363509 365144 366198 366964 367547
49724 367547 367900 368376 369671 372041 374880 377215 378474 378792 378777 378983 379463 379820 379749 379403 379148 379184 379547 380176
49706 380176 380721 380562 379418 377857 376900 377109 378211 379441 380091 379974 379576 379615 380316 381331 382405 383691 385174
49689 385174 386309 386651 386464 386276 386203 386179 386500 387511 389004 390476 391830 393272 394776 396240 398020 400563
49673 400563 403572 406180 408058 409725 411597 413381 414674 415630 416661 417887 419275 421034 423375 426014
49659 426014 428333 430146 431961 434245 436662 438428 439447 440674 443092 446640 450528 454292 457953 461357
49645 461357 464200 466799 470039 474184 478426 482021 485244 488682 492204 495266 497835 500326 502909 505592
49631 505592 508741 512830 517723 522781 527630 532327 536831 540835 544210 547256 550436 554043 558039 562049
49617 562049 565719 569295 573496 578547 583693 588078 591864 596088 601652 608644 616353 623686 630110 636420
49603 636420 643994 652885 661457 668515 674913 682142 690152 697841 705160 713236 722550 732440 742559 753416
49589 753416 765100 776626 787188 797131 807147 817330 827644 838568 850490 862861 874632 885255
49577 885255 894811 903444 911224 918483 925785 933473 941337 948782 955412 961552 968107 975621 983607 991113
49563 991113 997784 1003965 1009858 1015186 1019794 1024034 1028329 1032688 1036823 1040467 1043487 1045961 1048221 1050580
49549 1050580 1052986 1055131 1056908 1058576 1060559 1063234 1066671 1070306 1073253 1075353 1077637 1081256 1086305 1092207
49535 1092207 1098798 1106230 1114088 1121566 1128482 1135258 1141956 1148190 1154049 1160116 1166380 1171982 1176314 1179506
49521 1179506 1181611 1182164 1181037 1178873 1176147 1172416 1167057 1160120 1151976 1142715 1132490 1121888 1111281
49508 1111281 1100218 1088116 1075333 1062930 1051514 1040868 1030607 1020732 1011498 1003058 995240 987509
49496 987509 979204 970024 960261 950510 941218 932490 924110 915736 907255 898976 891289 884196 877426 870926
49482 870926 864877 859335 854202 849444 844919 840210 835145 830370 826728 824176 821930 819568 817152 814327
49468 814327 810388 805550 801209 798440 796973 795999 795238 794702 794237 793964 794491 796033 797908 799602 801766 805289
49452 805289 809699 813260 814507 813151 809759 805313 800956 797449 794738 792330 790037 788115 786904 786689
49438 786689 787575 789132 790504 791414 792757 795625 799940 804676 809282 814226 820086 826779 833894 841274 848936
49423 848936 856749 864527 872367 880673 889850 899994 910846 921988 933104 944150 955387 967297
49411 967297 980226 993897 1007451 1020242 1032413 1044310 1055542 1065283 1073503 1081186 1089064 1096701
49399 1096701 1103187 1108224 1112138 1115241 1117650 1119492 1120941 1122223 1123791 1126203 1129629 1133728 1138181 1142956
49385 1142956 1147959 1152933 1157945 1163364 1168956 1173609 1176586 1178684 1181561 1186125 1192027 1198488 1205100 1211949
49371 1211949 1219404 1227722 1236678 1245754 1254924 1264898 1276214 1288463 1300768 1312758 1324615 1336500
49359 1336500 1348490 1360866 1373986 1387885 1402365 1417365 1432922 1448855 1464730 1479994 1494046
49348 1494046 1506551 1517947 1529214 1540800 1552122 1562509 1572244 1582216 1592873 1603908 1614677 1624504
49336 1624504 1632941 1640158 1646736 1652707 1657372 1660535 1663284 1666698 1670352 1673038 1674557 1675740 1676894 1677428
49322 1677428 1677081 1676440 1675988 1675536 1674870 1674124 1673177 1671480 1668949 1666327 1664258 1662611 1661190 1660478 1661063 1662691
49306 1662691 1664464 1665711 1666235 1666051 1665416 1664875 1664792 1664954 1665175 1666066 1668576 1672669 1677112 1680819 1683969 1687411
49290 1687411 1691463 1695863 1700628 1706124 1712059 1717148 1720345 1721946 1722790 1722655 1720267 1714921 1707254 1698150
49276 1698150 1687583 1675021 1660329 1643715 1625208 1604898 1583476 1561886 1540491 1519033 1497333
49265 1497333 1475586 1454047 1432860 1412212 1392289 1373077 1354497 1336721 1320026 1304424 1289670
49254 1289670 1275603 1262190 1249365 1237126 1225691 1215262 1205769 1197102 1189419 1182800 1176777 1170693
49242 1170693 1164459 1158515 1153003 1147475 1141494 1135154 1128865 1122906 1117358 1112226 1107505 1103235 1099521 1096423
49228 1096423 1093882 1091873 1090487 1089702 1089264 1089049 1089353 1090544 1092533 1094952 1097751 1101240 1105506 1110105 1114414
49213 1114414 1118153 1121570 1125339 1130199 1136497 1144016 1152260 1160808 1169418 1178057 1186946 1196268 1205685 1214475
49199 1214475 1222309 1229548 1236588 1243401 1250009 1256890 1264357 1271943 1278915 1285120 1290811 1296011 1300626 1304870
49185 1304870 1308948 1312544 1315232 1317184 1318871 1320335 1321436 1322540 1324212 1326384 1328659 1331339 1335310 1340986
49171 1340986 1348125 1356680 1366904 1378550 1390866 1403585 1417069 1431352 1445991 1461147 1477773 1496164
49159 1496164 1515262 1534130 1553382 1574309 1597093 1620766 1644598 1668486 1691869 1712991 1729740
49148 1729740 1741195 1748381 1753544 1758583 1764052 1769632 1775238 1781204 1787568 1793953 1800393 1807590 1815930 1824784
49134 1824784 1833185 1840703 1847082 1851592 1853530 1853194 1851690 1849839 1847773 1845481 1843046 1840218 1836354 1831114
49120 1831114 1824967 1818758 1812961 1807527 1802269 1797136 1792113 1787091 1782056 1777405 1773881 1771988 1771524 1771888
49106 1771888 1772830 1774626 1777526 1781409 1786179 1792177 1799787 1808725 1818096 1827278 1836515 1846555 1857900 1870571
49092 1870571 1884516 1899887 1916764 1934838 1953672 1973263 1994009 2016021 2038780 2061670 2084539
49081 2084539 2107511 2130456 2152972 2174673 2195226 2214240 2231453 2246822 2260216 2271290 2280100
49070 2280100 2287491 2294184 2299518 2301727 2299578 2293322 2284169 2273467 2262413 2251644 2240679 2228303 2213937
49057 2213937 2198221 2181967 2165090 2147049 2127965 2108719 2090159 2072750 2056836 2042620 2029693
49046 2029693 2016984 2003455 1988775 1973324 1957719 1942456 1927897 1914422 1902462 1892366 1884274
49035 1884274 1878104 1873529 1869922 1866655 1863747 1862097 1862777 1866088 1871526 1878528 1886834 1896240 1906457 1917465
49021 1917465 1929702 1943639 1959257 1975993 1993155 2010493 2028529 2048206 2070010 2093574 2118322
49010 2118322 2144164 2171167 2198938 2227114 2256327 2287841 2322106 2358391 2396104 2435714 2477907
48999 2477907 2522562 2569244 2618327 2670887 2727516 2787715 2850369 2914468 2979386 3044890 3110932
48988 3110932 3177219 3242944 3307053 3368817 3428150 3485504 3541599 3597268 3653446 3711197 3771491
48977 3771491 3834756 3900821 3969579 4041588 4117664 4198063 4282548 4371101 4463754 4559439 4655592
48966 4655592 4749411 4839207 4924287 5004071 5077950 5145895 5208731 5267799 5324598 5380557 5436600
48955 5436600 5492650 5547618 5599866 5647571 5688720 5721099 5742620 5751845 5748316 5732503 5705701 5670172
48943 5670172 5629178 5586207 5543746 5502867 5464047 5427855 5394504 5363247 5332976 5303263 5274319
48932 5274319 5246189 5218818 5192892 5169827 5150658 5135396 5123477 5114207 5106718 5100255 5094848 5091073
48920 5091073 5088884 5087266 5085451 5083994 5084281 5087441 5094046 5104421 5118740 5137067 5159677 5187115 5219779
48907 5219779 5257791 5301458 5351450 5408195 5471433 5540564 5615176 5695024 5779940 5870055 5965796
48896 5965796 6067491 6175216 6289108 6409433 6536361 6670262 6812290 6963971 7125959
48887 7125959 7297754 7478810 7669052 7867925 8073763 8284669 8499491 8717444 8937552
48878 8937552 9159111 9382052 9606015 9829570 10051047 10269637 10484932 10695941 10901470
48869 10901470 11101056 11294504 11480734 11658163 11826335 11986427 12140099 12288504 12432278
48860 12432278 12571577 12705780 12833512 12952966 13061857 13157431 13237426 13301111 13348739 13380041
48850 13380041 13394139 13391157 13373013 13342168 13300134 13247565 13185124 13113562 13033185 12943801 12845003
48839 12845003 12736058 12615686 12482618 12336663 12179007 12011270 11834624 11650157 11459851
48830 11459851 11266506 11072263 10877538 10681710 10484558 10286583 10088334 9890416 9694294
48821 9694294 9502398 9317059 9139769 8971543 8813207 8664907 8526009 8396045 8275231
48812 8275231 8163653 8060566 7965247 7878063 7799957 7731194 7671347 7620320 7578579 7546466 7523961
48801 7523961 7511154 7508331 7515516 7532374 7558646 7594308 7639288 7693316 7755966 7826581 7904266 7988265
48789 7988265 8078228 8173900 8274857 8380792 8491668 8607135 8726120 8847482 8970841 9096431
48779 9096431 9224591 9355855 9491018 9630370 9773193 9918771 10067623 10220922 10378862
48770 10378862 10540407 10704461 10870433 11037676 11205275 11372538 11538925 11703321 11864021
48761 11864021 12019545 12168882 12310820 12443749 12566324 12677831 12777831 12866071 12942896 13009111
48751 13009111 13065214 13111300 13147945 13176633 13199063 13216431 13229566 13239289 13246383 13251582 13255700 13259383
48739 13259383 13262448 13263687 13261191 13252286 13233085 13198779 13144892 13068177 12966515 12838583 12684015
48728 12684015 12503615 12299289 12074134 11832645 11580264 11322208 11062701 10805136 10552416
48719 10552416 10306715 10069012 9838941 9615059 9395558 9179261 8966118 8756659 8551222
48710 8551222 8350021 8153662 7962944 7778278 7599872 7428416 7264928 7109939 6963418
48701 6963418 6825545 6696902 6577776 6467908 6367123 6275640 6193635 6120976 6057520 6003126
48691 6003126 5957251 5919080 5888139 5864213 5846602 5834189 5826465 5823816 5826528 5834171 5846270 5862995
48679 5862995 5884697 5911184 5941871 5976326 6014507 6056794 6103870 6155943 6211929 6269846 6328185
48668 6328185 6386249 6443126 6497257 6547518 6594008 6637272 6677439 6714702 6749953 6784142 6817381
48657 6817381 6849297 6879903 6909440 6937743 6964514 6990151 7015694 7042051 7069777 7099602 7132624
48646 7132624 7169805 7211421 7256962 7305452 7355977 7407977 7460892 7513597 7564601 7612813 7657602
48635 7657602 7698101 7733171 7762330 7785887 7803562 7813552 7813554 7802199 7778810 7742221 7690814 7623739
48623 7623739 7541538 7445724 7338388 7222167 7099924 6974166 6846927 6720079 6595395 6474316
48613 6474316 6357785 6246143 6138987 6035442 5934889 5837144 5741730 5647519 5553689 5460689
48603 5460689 5369677 5281289 5195606 5113099 5034768 4961286 4892592 4828374 4768360 4711996 4658394
48592 4658394 4606859 4557193 4509373 4463332 4419221 4377562 4339016 4304188 4273679 4247955 4226939
48581 4226939 4209942 4196169 4185286 4177508 4173261 4172720 4175464 4180551 4187022 4194359 4202468 4211438 4221501
48568 4221501 4233004 4246112 4260585 4276045 4292377 4309623 4327549 4345582 4363240 4380437 4397360
48557 4397360 4414151 4430644 4446320 4460522 4472802 4482997 4490998 4496622 4499761 4500483 4498919 4495255 4489792
48544 4489792 4482730 4473896 4463125 4450926 4438180 4424926 4410082 4392749 4373312 4352723 4331194 4308236
48532 4308236 4283603 4257385 4229282 4198640 4165335 4130165 4094267 4058469 4023062 3987676 3951383
48521 3951383 3913519 3874499 3835380 3796592 3757626 3718115 3678662 3640298 3603428 3567575 3531873
48510 3531873 3495604 3458496 3420863 3383461 3347088 3312210 3278862 3246793 3215770 3185844 3157157
48499 3157157 3129393 3101749 3073776 3045945 3018922 2992530 2966069 2939570 2914030 2890170 2867602
48488 2867602 2845500 2823591 2802053 2780845 2759715 2738802 2718819 2700513 2684071 2668991 2654507
48477 2654507 2640238 2626524 2613922 2602399 2591241 2579882 2568520 2557753 2547888 2538864 2530611 2523109
48465 2523109 2516157 2509423 2502735 2496076 2489297 2482109 2474440 2466612 2459075 2452077 2445596 2439364 2432849 2425441
48451 2425441 2416965 2407963 2399237 2391086 2383143 2374944 2366433 2357789 2349073 2340264 2331496 2322948 2314457 2305487
48437 2305487 2295544 2284493 2272500 2259846 2246887 2234017 2221531 2209513 2197845 2186297 2174741
48426 2174741 2163373 2152533 2142054 2130985 2118389 2104389 2089969 2075643 2060804 2044578 2026920
48415 2026920 2008511 1989904 1971210 1952422 1933606 1914741 1895655 1876119 1855932 1835032 1813779
48404 1813779 1792900 1772849 1753267 1733413 1713204 1693543 1675549 1659583 1645051 1630950 1616531
48393 1616531 1601621 1586569 1571961 1558303 1545790 1534221 1523183 1512463 1502325 1493224 1485226 1477878
48381 1477878 1470695 1463568 1456622 1449887 1443305 1436932 1430946 1425536 1420872 1417093 1414147 1411734 1409512 1407320
48367 1407320 1405118 1402769 1400056 1396961 1393760 1390733 1387718 1384099 1379371 1373625 1367169 1359672 1350197 1338341
48353 1338341 1324885 1310828 1296237 1280698 1264678 1249480 1235711 1222601 1209126 1195246 1181648
48342 1181648 1168786 1156590 1144779 1133162 1121857 1111413 1102386 1094618 1087257 1079635 1071725 1063697
48330 1063697 1055627 1047845 1040958 1035150 1029874 1024509 1018859 1012841 1006348 999821 994233 989974 986289 982341
48316 982341 978242 974501 971170 968223 966118 965045 964159 962586 960808 959988 960127 960087 959384 958846 959242 960293
48300 960293 961425 962723 964627 967309 970752 975039 980191 986107 992921 1001117 1011090 1022953 1036929 1053556
48286 1053556 1073299 1096290 1122681 1152994 1187914 1227940 1273423 1324615 1380845 1438702 1490441
48275 1490441 1524910 1532063 1508628 1460155 1397380 1330469 1266094 1208041 1158320 1117154 1083267
48264 1083267 1055186 1032141 1013520 998240 985261 974380 965946 959888 955472 952063 949847 949616 951812
48251 951812 955834 960416 964707 968749 972905 977226 981632 986190 990785 994933 998503 1002314 1007308 1013366
48237 1013366 1019652 1025837 1032102 1038042 1042644 1045663 1048128 1051013 1054035 1056222 1057125 1057000 1056263 1055214 1054016
48222 1054016 1052603 1050859 1049051 1047759 1047110 1046445 1045006 1042662 1039804 1036974 1034850 1034068 1034524 1035107 1034714
48207 1034714 1033406 1032161 1031592 1031410 1031194 1031049 1031134 1030844 1029155 1025950 1022472 1019992 1018297 1016057 1012524 1008170
48191 1008170 1003561 998511 992807 987004 981776 976908 971626 965613 959035 951940 944335 936554 928763 920426
48177 920426 911074 901319 892248 883999 875923 867963 860783 854539 848586 842559 836668 830809 824439 817685
48163 817685 811476 806214 801267 796176 791302 786736 781684 775609 769174 763281 758004 753188 749294 746759
48149 746759 745134 743670 742205 740680 738465 735177 731646 729084 727607 726517 725683 725628 726425 727563 728845
48134 728845 730416 731833 732110 731014 729595 729020 729444 730259 730945 731353 731615 732143 733395 735282 737044 738033
48118 738033 738542 739566 741695 744456 746873 748609 750304 752668 755516 758037 759876 761486 763375 765519
48104 765519 767676 769807 771931 773963 776000 778403 781280 784172 786549 788385 789993 791589 793248 794977
48090 794977 796624 798018 799401 801248 803411 804914 805066 804354 803843 804055 804975 806691 809376 812831 816632
48075 816632 820666 825120 830050 835454 841628 848948 857224 865628 873294 879870 885631 891235 897192 903384
48061 903384 909296 914834 920581 926994 933792 940472 947082 954075 961649 969612 977638 985362 992552 999454
48047 999454 1006579 1013810 1020164 1024898 1028403 1031513 1034412 1036797 1038673 1040285 1041517 1042013 1041667 1040512 1038437
48032 1038437 1035636 1032949 1031062 1029664 1028120 1026623 1025855 1025752 1025516 1024797 1023906 1022880 1021242 1018827 1016043
48017 1016043 1013152 1010006 1006633 1003413 1000468 997517 994451 991486 988606 985555 982439 979563 976502 972136
48003 972136 965939 958550 950676 942080 932017 920074 906147 890260 872960 855363 838170 821055
47991 821055 803528 786030 769510 754218 739571 725106 710927 697276 684251 672026 660872
47980 660872 650738 641222 632219 624268 617945 612954 608211 602935 597446 592709 589190 586515 584228 582494
47966 582494 581725 581768 581904 581635 581157 580964 581227 581678 581989 582177 582612 583551 584630 585018 584229 582633 580999 579761
47948 579761 578911 578351 577978 577573 576958 576218 575534 574942 574496 574380 574505 574287 573322 572114 571578 571914 572538 573076
47930 573076 573794 574897 575996 576590 576768 577147 578319 580450 583239 586216 589234 592688 597025 602220 607932
47915 607932 613973 620289 626718 633219 640149 647762 655539 662679 669167 675741 682762 689863 696836 704071
47901 704071 711777 719377 726149 732024 737358 742307 746823 750956 754723 757818 759817 760647 760702 760517 760322
47886 760322 759748 758113 755242 751901 749003 746543 743872 740955 738638 737522 737307 737533 738235 739343 740067
47871 740067 739624 738362 737500 737867 739338 741421 743955 747186 751493 757111 763912 771390 778936 786150 792955
47856 792955 799603 806607 814409 823010 832027 841074 849845 857921 864927 871002 876720 882341 887422 891334
47842 891334 893926 895506 896453 897035 897406 897616 897742 897976 898388 898693 898591 898235 897892 897266 895760 893542 891693
47825 891693 891001 891112 891137 890606 889580 888306 887149 886367 885700 884599 883128 882055 881699 881335 880319 879259
47809 879259 879352 880908 883204 885561 887931 890575 893744 897537 901595 905051 907302 908683 909895 910930 911103
47794 911103 910042 908049 905500 902449 898918 895057 890881 886174 880770 874687 867953 860615 852904 845109
47780 845109 837264 829170 820673 811708 802231 792424 782813 773812 765309 757067 749381 742802 737289 732199
47766 732199 727122 722178 717388 712420 707256 702622 699296 697255 695824 694437 692955 691436 689975 688729
47752 688729 687786 686997 686134 685249 684718 684884 685685 686596 686923 686281 684949 683726 683195 683047 682287 680279 677543
47735 677543 675222 673773 672465 670387 667686 665406 664265 664077 664452 665533 667750 671222 675802 681481 688320
47720 688320 696100 704380 712959 721999 731661 741809 752098 762213 772056 781802 791691 801600 810935
47707 810935 819092 826049 832368 838670 845210 851825 858136 863851 869070 874266 879837 885677 891199 895783
47693 895783 899197 901719 903823 905616 906562 906025 904045 901279 898128 894383 889937 885320 881134 877352 873615
47678 873615 869970 866748 863952 861312 858901 857143 856226 856008 856565 858301 861367 865452 870338 876213 883228
47663 883228 891102 899529 908670 918873 930052 941687 953372 965097 976944 988694 999821 1009851
47651 1009851 1018791 1027158 1035464 1043622 1051014 1057212 1062400 1066902 1070503 1072564 1072788 1071580 1069515 1066638
47637 1066638 1062453 1056460 1048527 1038845 1027800 1015946 1003852 991743 979373 966368 952652 938470
47625 938470 924168 910179 897085 885364 874950 865321 856108 847462 839735 833021 827172 822159 818214
47612 818214 815615 814320 813814 813335 812426 811271 810406 810138 810441 811258 812586 814201 815648 816620 817052 816753 815248
47595 815248 812246 808006 803003 797461 791407 784988 778442 771871 765331 759073 753412 748369 743553 738402
47581 738402 732565 726167 719756 713797 708153 702235 695641 688363 680353 671360 661453 651281 641453 631949
47567 631949 622438 612923 603731 595081 587035 579618 572610 565406 557535 549232 541141 533514 526077 518589
47553 518589 511162 504024 497311 491099 485438 480378 476065 472635 469771 466652 462692 458200 453902 450073
47539 450073 446520 443231 440379 437754 434790 431299 427708 424446 421585 419172 417372 416011 414404 412019
47525 412019 409065 406095 403250 400245 397013 394011 391781 390362 389270 388004 386485 384948 383518 382166
47511 382166 381106 380860 381663 383034 384202 384837 385110 385300 385768 387055 389443 392388 394925 396684 398080 399453
47495 399453 400592 401307 401982 403157 404873 406723 408377 409726 410698 411243 411515 411905 412874 414706 417254 419918
47479 419918 422033 423416 424461 425725 427541 429988 432933 436106 439354 442856 446860 451241 455745 460640
47465 460640 466639 473846 481213 487483 492507 497261 502688 508938 515679 522644 529609 536167 541983 547285
47451 547285 552752 558678 564469 569344 573493 578081 583839 589999 595014 598176 600130 601920 603995 606187
47437 606187 608128 609444 609853 609374 608294 606754 604555 601579 598203 594983 591985 588650 584411 579310 573926
47422 573926 568716 563582 558153 552466 547160 542894 539700 537013 534274 531380 528722 526888 526204 526389 526852
47407 526852 527453 528708 530982 533782 536310 538548 541225 544760 548739 552577 556245 560147 564639 569771
47393 569771 575160 579969 583375 585259 586231 586840 587092 586795 585912 584321 581685 578007 574044 570695 567987
47378 567987 565037 561003 555865 550282 544937 540071 535503 531008 526607 522505 518832 515644 513151 511693
47364 511693 511349 511760 512485 513475 515113 517840 521679 526002 529853 532799 535470 538987 543772 549243 554716
47349 554716 560184 566005 572144 578085 583311 587613 591092 594109 597044 599807 601708 602097 601069 599285
47335 599285 597139 594390 590623 585847 580491 574951 569238 563100 556450 549602 542996 536721 530473 524014
47321 524014 517505 511240 505234 499223 493026 486766 480780 475368 470538 465969 461298 456535 452099 448377
47307 448377 445343 442641 439941 437215 434760 433036 432263 432070 431731 430938 430240 430560 432273 434786 436987 438114
47291 438114 438362 438726 440097 442378 444570 445802 446126 446243 446655 447253 447612 447382 446445 444943 443284 441972
47275 441972 441301 441200 441372 441564 441646 441570 441428 441558 442370 443850 445330 446075 446142 446417 447720 450115 453165 456534
47257 456534 460102 463831 467844 472428 477603 482930 488099 493420 499319 505583 511720 517898 524880 532977
47243 532977 541631 550104 557991 565051 571225 577069 583535 590961 598731 606248 613657 621264 628770 635595
47229 635595 641559 646704 650773 653461 654980 655841 656185 655787 654657 653158 651517 649572 647038 643844 640261
47214 640261 636929 634557 633225 632096 630152 627241 624122 621579 619819 618676 618037 617997 618843 620923 624277
47199 624277 628420 632703 636980 641651 646978 652600 657873 662562 666955 671371 675671 679457 682695 685937
47185 685937 689675 693571 696586 697933 697737 696700 695346 693683 691342 687882 683142 677462 671419 665306
47171 665306 659145 653258 648414 645036 642636 640420 638278 636765 636191 636279 636789 638034 640504 644172 648519
47156 648519 653216 658578 665155 673027 681759 691087 701287 712608 724641 736751 748998 762056 776136
47143 776136 790563 804574 817973 830733 842570 853394 863633 873491 882217 888780 893116 896127
47131 896127 898514 900233 901063 901098 900490 899207 897269 894929 892376 889512 886235 882768 879565 876920 874715
47116 874715 872510 869886 866802 863598 860640 858003 855561 853164 850616 847656 844238 840678 837351 834330
47102 834330 831456 828613 825699 822536 819084 815676 812782 810632 809291 808939 809715 811286 812894 813904 814241
47087 814241 814376 815015 816637 819055 821532 823526 825189 826993 829040 831019 832647 833758 834086 833398 831860
47072 831860 829915 827641 824398 819281 811940 803005 793643 784451 774828 763830 751701 739961 729683
47059 729683 720318 710781 701113 692193 684168 676254 668166 660794 655121 651108 647991 645120 642227 639350
47045 639350 636908 635507 635390 636320 638128 640951 644754 649157 654048 659916 667097 675066 682947 690495 698033
47030 698033 705545 712426 718193 723054 727573 732033 736253 739904 742843 745174 747109 748867 750681 752868
47016 752868 755707 759223 763130 767049 770717 774033 777044 779988 783221 786953 790981 794696 797464 799171
47002 799171 800497 802513 805804 809970 814086 817649 820982 824828 829649 835315 841334 847356 853438 859802
46988 859802 866434 873184 880222 887926 896118 903809 910130 915215 919786 924175 928257 932088 935853 939155
46974 939155 941102 941336 940474 939286 937948 936437 935150 934576 934533 934251 933216 931672 930301 929669 929964 931037
46958 931037 932520 934003 935247 936313 937534 939364 942202 946289 951649 957979 964652 971097 977279 983596
46944 983596 990209 996686 1002506 1007599 1012111 1015966 1019054 1021672 1024240 1026603 1028095 1028342 1027628 1026456 1025056
46929 1025056 1023399 1021358 1018772 1015673 1012469 1009641 1007260 1005120 1003228 1001763 1000594 999432 998556 998816
46915 998816 1000573 1003096 1005341 1007045 1008704 1010726 1013037 1015428 1018027 1021317 1025723 1031032 1036298 1040542
46901 1040542 1043666 1046393 1049320 1052357 1055222 1058113 1061455 1065184 1068621 1071225 1073343 1076105 1080474 1086356
46887 1086356 1092780 1098988 1105159 1111898 1119375 1127349 1135771 1144801 1154414 1164586 1175874 1189091 1204241
46874 1204241 1220284 1236222 1251936 1267788 1283883 1299990 1315730 1330558 1343957 1355964 1367115
46863 1367115 1377645 1387099 1394955 1401242 1406300 1410399 1413866 1417034 1419712 1421171 1421128 1420256 1419267 1417996 1416077
46848 1416077 1414059 1413026 1413238 1413989 1414792 1415951 1417811 1420188 1422916 1426455 1431452 1437932 1445308 1453207 1461962
46833 1461962 1472180 1483891 1496254 1508157 1519066 1529176 1538797 1547852 1556011 1563063 1568962 1573678
46821 1573678 1577125 1579131 1579360 1577549 1573987 1569549 1565121 1561094 1557450 1554000 1550438 1546577 1542818 1540010
46807 1540010 1538509 1537684 1536731 1535721 1535418 1536348 1538550 1542092 1547262 1554125 1562242 1570981 1579970 1589294 1599398
46792 1599398 1610675 1622951 1635529 1648026 1661011 1675506 1691913 1709679 1727916 1746093 1764200
46781 1764200 1782421 1800631 1818114 1834005 1848227 1861585 1874606 1886572 1896196 1902999 1907479 1910019
46769 1910019 1910290 1907818 1902655 1895337 1886526 1876784 1866315 1854816 1841900 1827854 1813607 1799869 1786497
46756 1786497 1772893 1758771 1744406 1730311 1716860 1704163 1692197 1681085 1671135 1662568 1655348 1649392
46744 1649392 1644770 1641474 1639244 1637950 1637894 1639296 1641633 1644045 1646402 1649466 1653892 1659553 1665993 1673037
46730 1673037 1680661 1688596 1696438 1703949 1711087 1717944 1724801 1731933 1739130 1745687 1751213 1756222 1761587 1767536
46716 1767536 1773493 1778756 1783024 1786338 1788959 1791393 1794163 1797354 1800605 1803713 1806991 1810796 1814927 1818860
46702 1818860 1822521 1826372 1830650 1834993 1839080 1843182 1847626 1851957 1855258 1857227 1858329 1858788 1858058 1855530
46688 1855530 1851200 1845282 1837668 1828290 1817693 1806666 1795425 1783566 1770710 1756726 1741482 1724876
46676 1724876 1707127 1688667 1669714 1650300 1630713 1611536 1593155 1575468 1558075 1540511 1522321
46665 1522321 1503286 1483636 1463830 1444081 1424309 1404447 1384557 1364718 1345126 1326194 1308157
46654 1308157 1290623 1273024 1255592 1239477 1225709 1214392 1205001 1197044 1190183 1184096 1178732 1174634
46642 1174634 1172642 1173202 1176107 1181044 1188211 1198201 1211137 1226118 1241805 1257651 1274187 1291984 1310699
46629 1310699 1329423 1347515 1364606 1380152 1393708 1405592 1416597 1426984 1436277 1444086 1450543 1455834
46617 1455834 1459937 1463126 1466157 1469591 1473339 1477221 1481628 1487249 1494471 1503286 1513556 1525007 1537243
46604 1537243 1550065 1563621 1578006 1592939 1608063 1623253 1638421 1653277 1667550 1681135 1693794
46593 1693794 1705053 1714729 1723142 1730318 1735386 1737401 1736627 1734326 1731272 1727035 1720822 1712448 1702321 1690987
46579 1690987 1678965 1666602 1653777 1640033 1625305 1610223 1595338 1580342 1564573 1548193 1532286
46568 1532286 1517567 1503443 1488729 1473084 1457373 1442645 1429169 1416536 1404334 1392421 1380726
46557 1380726 1369128 1357638 1346552 1336375 1327504 1319889 1313003 1306375 1300252 1295412 1292156 1289798 1287466
46544 1287466 1285162 1283529 1282807 1282550 1282380 1282419 1282821 1283391 1283854 1284154 1284325 1284511 1285281 1287417 1291107 1295789 1301036
46527 1301036 1307089 1314088 1321378 1328223 1334861 1342083 1349984 1357969 1365965 1374767 1384868 1395674 1406314
46514 1406314 1416755 1427638 1439327 1451638 1464375 1477638 1491567 1506176 1521511 1537732 1554900
46503 1554900 1572920 1591780 1611618 1632252 1652785 1672101 1689945 1707278 1725289 1744097 1762610
46492 1762610 1779554 1794401 1807392 1819031 1829651 1839085 1846563 1851245 1853115 1853086 1852013 1849953 1846736
46479 1846736 1842908 1839422 1836514 1833486 1829637 1824866 1819256 1812740 1805507 1798217 1791278 1784212 1776210 1767122
46465 1767122 1757448 1747535 1737283 1726571 1715360 1703282 1689609 1673922 1656520 1637983 1618685 1598956
46453 1598956 1579323 1560182 1541396 1522675 1504236 1486723 1470462 1455200 1440652 1426961 1414506
46442 1414506 1403547 1394230 1386675 1380790 1376183 1372451 1369462 1367173 1365380 1363972 1363287 1363840 1365597 1367803
46428 1367803 1369701 1371251 1372986 1375248 1377718 1379738 1380982 1381771 1382688 1383989 1385501 1387073 1388900 1391272
46414 1391272 1394182 1397424 1400942 1404818 1408974 1413237 1417802 1423315 1430297 1438546 1447310 1455985 1464670 1474194
46400 1474194 1485694 1499922 1516730 1535268 1554878 1575720 1598400 1623165 1649789 1678219 1708831
46389 1708831 1741803 1776481 1811827 1847349 1883203 1919268 1954615 1988129 2019363 2048322 2074625
46378 2074625 2097380 2115992 2130636 2141666 2148790 2151191 2148392 2140805 2129434 2115212 2098690 2080213
46366 2080213 2060208 2039204 2017659 1996041 1975068 1955564 1937755 1921053 1905029 1890496 1879019
46355 1879019 1871267 1866443 1863568 1862752 1864847 1870358 1879216 1891230 1906121 1923335 1942458 1963749 1987803
46342 1987803 2014750 2044288 2076382 2111293 2148877 2188417 2229304 2271446 2314779 2358795 2402736
46331 2402736 2445926 2487789 2527856 2565956 2602021 2635541 2665468 2690824 2711132 2726108 2735330
46320 2735330 2738465 2735581 2726942 2712726 2693157 2668691 2639787 2606692 2569773 2529925 2488401 2446221
46308 2446221 2403937 2361848 2320234 2279429 2239952 2202602 2168239 2137358 2109924 2085616 2064198
46297 2064198 2045657 2030105 2017632 2008286 2002098 1999030 1998910 2001550 2006916 2015019 2025590 2038072 2052136
46284 2052136 2067975 2085833 2105405 2126041 2147493 2170121 2194337 2220072 2246816 2273981 2301209
46273 2301209 2328541 2356271 2384416 2412338 2439038 2463802 2486336 2506361 2523388 2536930 2546780
46262 2546780 2553041 2555960 2555597 2551566 2543324 2530927 2515179 2496860 2476188 2453469 2429790 2406438
46250 2406438 2383861 2361834 2340390 2319912 2300589 2282615 2266737 2253621 2242705 2232716 2223448 2215936
46238 2215936 2210657 2206728 2203397 2201154 2200549 2200755 2200353 2198969 2197288 2195845 2194592 2193296 2191627 2189084 2185456
$$ [...]
##END NTUPLES=NMR SPECTRUM
##END=
