##TITLE=NES1028_10332_9268290_OmHLmCDfxT
##JCAMPDX= 6.0         $$ Bruker NMR JCAMP-DX V2.0
##DATA TYPE= NMR SPECTRUM
##DATA CLASS= NTUPLES
##ORIGIN= BRUKER
##OWNER= Administrator
$$ 1.72 TOPSPIN		Version 2.1
$$ 2015-07-10 20:45:02.285 -0700  Administrator@X
$$ Compression mode = diff/dup
##.OBSERVE FREQUENCY= 400.02188249412
##.OBSERVE NUCLEUS= ^1H
##.ACQUISITION MODE= SIMULTANEOUS (DQD)
##.ACQUISITION SCHEME= undefined
##.AVERAGES= 8
##.DIGITISER RES= 22
##SPECTROMETER/DATA SYSTEM= spect
##.PULSE SEQUENCE= zg30
##.SOLVENT NAME= COFFEE_meoh
##.SHIFT REFERENCE= INTERNAL, COFFEE_meoh, 1, 14.98509
##AUDIT TRAIL= $$ (NUMBER, WHEN, WHO, WHERE, PROCESS, VERSION, WHAT)
$$ ##TITLE= Audit trail, TOPSPIN		Version 2.1
$$ ##JCAMPDX= 5.01
$$ ##ORIGIN= Bruker BioSpin GmbH
$$ ##OWNER= Administrator
$$ $$ E:\/data/COFFEE/nmr/NES1028_10332_9268290_OmHLmCDfxT/10/pdata/1/auditp.txt
$$ ##AUDIT TRAIL=  $$ (NUMBER, WHEN, WHO, WHERE, PROCESS, VERSION, WHAT)
(   1,<2015-07-10 20:44:54.941 -0700>,<Administrator>,<X>,<go>,<TOPSPIN 2.1>,
      <created by zg
	started at 2015-07-10 20:43:49.081 -0700,
	POWCHK enabled, PULCHK disabled,
       configuration hash MD5:
       21 0F 79 D6 B3 7B B4 F6 88 20 88 DB 03 48 BD 9F
       data hash MD5: 64K
       F5 BB 2D 81 4E 2B 84 B8 83 BC D8 71 CE C0 74 F8>)
(   2,<2015-07-10 20:44:58.144 -0700>,<Administrator>,<X>,<proc1d>,<TOPSPIN 2.1>,
      <Start of raw data processing
       efp LB = 0 FT_mod = 6 PKNL = 1 PHC0 = 0 PHC1 = 0 SI = 32K 
       data hash MD5: 32K
       10 F7 F3 EB 89 4E E1 92 1F 97 7C 04 8A 68 81 65>)
(   3,<2015-07-10 20:44:58.425 -0700>,<Administrator>,<X>,<proc1d>,<TOPSPIN 2.1>,
      <pk PHC0 = 92.38953 PHC1 = 0 
       data hash MD5: 32K
       BB 2F BA AB A6 E3 9E 6D A1 DB 1A 88 7D A8 6A 9F>)
(   4,<2015-07-10 20:44:58.550 -0700>,<Administrator>,<X>,<proc1d>,<TOPSPIN 2.1>,
      <abs ABSG = 1 
       data hash MD5: 32K
       23 1C 53 18 F9 D0 3F 7C D4 3A 68 12 D2 E0 26 9F>)
(   5,<2015-07-10 20:44:58.613 -0700>,<Administrator>,<X>,<proc1d>,<TOPSPIN 2.1>,
      <abs ABSG = 2 
       data hash MD5: 32K
       7A 70 AE BC FC 93 9D 1A F9 58 01 51 79 01 9F B8>)
(   6,<2015-07-10 20:44:58.675 -0700>,<Administrator>,<X>,<proc1d>,<TOPSPIN 2.1>,
      <abs ABSG = 3 
       data hash MD5: 32K
       8B 68 D8 8D 5F 45 B8 7E 89 E2 63 10 CD A3 07 60>)
(   7,<2015-07-10 20:44:58.738 -0700>,<Administrator>,<X>,<proc1d>,<TOPSPIN 2.1>,
      <abs ABSG = 4 
       data hash MD5: 32K
       01 94 54 DF 35 A4 4E 60 C4 A0 0C 2C A6 70 4E 95>)
(   8,<2015-07-10 20:44:58.785 -0700>,<Administrator>,<X>,<proc1d>,<TOPSPIN 2.1>,
      <abs ABSG = 5 
       data hash MD5: 32K
       72 F9 35 E0 F6 64 6B 08 DC 6D 03 05 5E 39 5E 91>)
$$ ##END=
$$ 
$$ $$ hash MD5
$$ $$ CF 12 11 FB 6A 32 44 AE 90 F4 3E 02 B2 68 7C 66
##$RELAX= 
##$RELAX= 
##$RELAX= 
##$RELAX= 
##$RELAX= 
##$RELAX= 
##$RELAX= 
$$ Bruker specific parameters
$$ --------------------------
##$DU= <E:\>
##$EXPNO= 10
##$NAME= <NES1028_10332_9268290_OmHLmCDfxT>
##$PROCNO= 1
$$ [...]
150 150 150 150 150 150 150 150
##$TP07= 0
##$TPNAME0= <>
##$TPNAME1= <>
##$TPNAME2= <>
##$TPNAME3= <>
##$TPNAME4= <>
##$TPNAME5= <>
##$TPNAME6= <>
##$TPNAME7= <>
##$TPOAL= (0..7)
0.5 0.5 0.5 0.5 0.5 0.5 0.5 0.5
##$TPOFFS= (0..7)
0 0 0 0 0 0 0 0
##$TUNHIN= 0
##$TUNHOUT= 0
##$TUNXOUT= 0
##$USERA1= <user>
##$USERA2= <user>
##$USERA3= <user>
##$USERA4= <user>
##$USERA5= <user>
##$V9= 5
##$VALIST= <valist>
##$VCLIST= <CCCCCCCCCCCCCCC>
##$VD= 0
##$VDLIST= <DDDDDDDDDDDDDDD>
##$VPLIST= <PPPPPPPPPPPPPPP>
##$VTLIST= <TTTTTTTTTTTTTTT>
##$WBST= 2048
##$WBSW= 25
##$XGAIN= (0..3)
0 0 0 0
##$XL= 0
##$YL= 0
##$YMAX_a= 581215
##$YMIN_a= -485945
##$ZGOPTNS= <>
##$ZL1= 120
##$ZL2= 120
##$ZL3= 120
##$ZL4= 120
##$ABSF1= 14.98509
##$ABSF2= -5.573092
##$ABSG= 5
##$ABSL= 3
##$ALPHA= 0
##$AQORDER= 0
##$ASSFAC= 0
##$ASSFACI= 0
##$ASSFACX= 0
##$ASSWID= 0
##$AUNMP= <proc_prof1d_extract_pilot.lims>
##$AXLEFT= 0
##$AXNAME= <>
##$AXNUC= <1H>
##$AXRIGHT= 0
##$AXTYPE= 0
##$AXUNIT= <>
##$AZFE= 0.1
##$AZFW= 0.1
##$BCFW= 0
##$BC_mod= 0
##$BYTORDP= 0
##$COROFFS= 0
##$CY= 15
##$DATMOD= 1
##$DC= 0
##$DFILT= <>
##$DTYPP= 0
##$F1P= 0
##$F2P= 0
##$FCOR= 0.5
##$FTSIZE= 32768
##$FT_mod= 6
##$GAMMA= 0
##$GB= 0
##$INTBC= 1
##$INTSCL= 1
##$ISEN= 128
##$LB= 0
##$LEV0= 0
##$LPBIN= 0
##$MAXI= 10000
##$MC2= 0
##$MEAN= 0
##$ME_mod= 0
##$MI= 0
##$NCOEF= 0
##$NC_proc= -8
##$NLEV= 6
##$NOISF1= 0
##$NOISF2= 0
##$NSP= 0
##$NTH_PI= 0
##$NZP= 0
##$OFFSET= 14.98509
##$PC= 1
##$PHC0= 92.38953
##$PHC1= 0
##$PH_mod= 1
##$PKNL= yes
##$PPARMOD= 0
##$PPDIAG= 0
##$PPIPTYP= 0
##$PPMPNUM= 2147483647
##$PPRESOL= 1
##$PSCAL= 4
##$PSIGN= 0
##$PYNMP= <proc.py>
##$REVERSE= no
##$SF= 400.02
##$SI= 32768
##$SIGF1= 0
##$SIGF2= 0
##$SINO= 400
##$SIOLD= 32768
##$SPECTYP= <>
##$SREGLST= <1H.CDCl3>
##$SSB= 0
##$STSI= 32768
##$STSR= 0
##$SW_p= 8223.68421052631
##$SYMM= 0
##$S_DEV= 0
##$TDeff= 65536
##$TDoff= 0
##$TI= <>
##$TILT= no
##$TM1= 0
##$TM2= 0
##$TOPLEV= 0
##$USERP1= <user>
##$USERP2= <user>
##$USERP3= <user>
##$USERP4= <user>
##$USERP5= <user>
##$WDW= 1
##$XDIM= 32768
##$YMAX_p= 445040746
##$YMIN_p= -707151
##$CURPLOT= <Network HP LaserJet P1505>
##$CURPRIN= <$Network HP LaserJet P1505>
##$DFORMAT= <normdp>
##$LAYOUT= <+/1D_H.xwp>
##$LFORMAT= <normlp>
##$PFORMAT= <normpl>
##$SURQMSG= 1
$$ End of Bruker specific parameters
$$ ---------------------------------
##NTUPLES= NMR SPECTRUM
##VAR_NAME=  FREQUENCY,     SPECTRUM/REAL,   SPECTRUM/IMAG
##SYMBOL=    X,             R,               I
##VAR_TYPE=  INDEPENDENT,   DEPENDENT,       DEPENDENT
##VAR_FORM=  AFFN,          ASDF,            ASDF
##VAR_DIM=   32768,         32768,           32768
##UNITS=     HZ,            ARBITRARY UNITS, ARBITRARY UNITS
##FACTOR=    0.250966925370066, 1,           1
##FIRST=     8223.43324360094, 139055,       -148680
##LAST=      0,             38805,           -53414
##MIN=       0,             -707151,         0
##MAX=       8223.43324360094, 445040746,    0
$$ Real data points
##PAGE= N=1
##DATA TABLE= (X++(R..R)), XYDATA
$$ [...]
19496d07910J70417J94r5468d764B53252A744K03384a33292d9518A3604h5789
19484A25848d9761k06040i4887D6614j8946L06209a79136A09062a66918J6674
19474a50244H4642d8939H089J33311K9843a03158A84164c79583g8297M139k00880
19463b75038q1445J66984R1075c5922j53671O3848j26677E3726i9134c8780A70628
19451a68991d2774j25694a0458n5392r5086d8032o0610r221A4714a68144G917
19439c25824P6974C9962b60129F6720J54132r9978a86966C6305a12375M265l7034
19428a45144j71645M537h7046q6277A01102b97517e5508a7006k72014A10615d6605
19416a52001g2056A6315c6572k80757e6911m9997l5816H7297b43333E2216N916
$$ y = [-407910, -237493, -237299, -332767, -4764, 253252, 1744, 205128, -133292, -49518, 13604, -85789, 125848, -49761, -255801, -94887, 46614, 27668, 333877, -179136, 109062, -166918, -150244, 84642, -48939, 8089, 141400, 171243, -103158, 184164, -379583, -78297, -74158, -275038, -356483, -189499, -98424, -35922, -189593, -125745, -252422, 53726, -99134, -38780, 170628, -168991, -42774, -168468, -10458, -65850, -160936, -48032, -108642, -117863, 14714, -168144, 7917, -325824, -248850, 39962, -260129, 66720, 220852, 120874, -186966, 36305, -112375, -108110, -145144, -316789, -312252, -87046, -173323, 101102, -297517, -55508, -17006, -289020, 110615, -46605, -152001, -72056, 16315, -36572, -317329, -56911, -106908, -142724, 87297, -243333, 52216, 58132]
19405E8132f9763K7327J7707j32805B7072a13054Q915A51102i3198j94137e0382
19393c0486j51382h8146k70458B46950E6431d6881n16566f4342p096K0871D7617
19381a8795l40335A18325e7442C3976J3915j6023b3446C1302H019J76037h2791
19369g9374A14852D9952a26501N3637A28351b92200A05363N7125i536k6042A54519
19357A73385g1820k345l43347a38815G8904g7432a1459B1140j0316b13849C4952
19345A9740h8767j28089G3208c67244F0790j4702a07877A57574b0627k47844R9141
19334a69330c5334j14609e9735B28466f0943n60m9791A44495C8862h2656p2348
19323a55004j72357E2410c13300a39210A57695J025B2171a72127A26103c6993
$$ y = [58132, -69763, -42436, -24729, -157534, 27072, -113054, -104139, 151102, -93198, -287335, -50382, -30486, -181868, -88146, -358604, 246950, 56431, -46881, -563447, -64342, -71438, -50567, 47617, -18795, -359130, 118325, -57442, 33976, 47891, 31868, -23446, 31302, 8019, 184056, -82791, -79374, 114852, 49952, -126501, -72864, 128351, -292200, 105363, 162488, -9536, -35578, 154519, 173385, -71820, -74165, -417512, -138815, 78904, -77432, -11459, 21140, 10824, -213849, 34952, 19740, -88767, -216856, 73208, -367244, 60790, 46088, -107877, 157574, -20627, -268471, -169330, -35334, -149943, -59735, 228466, -60943, -61503, -111294, 144495, 38862, -82656, -155004, -327361, 52410, -313300, -139210, 157695, 158720, 22171, -172127, 126103, -36993]
19312a99439E6654a95944N9988J7908F0210c70722c8265a325A257d7043k62829
19301c09872d3239L56p469j16344F775a50787B69923a10607C0950a53370D9385
19289F8877b50222A36268E9238b785j22831a5076B6822a30098A3094K49046D4797
19277B27477d4804k35348P4928C8277a77777M1600c0913E01104e5732B9841a5089
19265c77925g5075k9131c5433G2980b8548B21338j06652h9196A60961a34307j61769
19254b96076b6139D5269f3316n0756j85637N3553d8981H7931J6979b06282N7260
19243a49022d8582J741l36090a78559D6874d9003I9082a16206j23235B97847M520
19232C02367h0317B027f7043A60475a96090A95782E2372J95262a27800A83613
$$ y = [-199439, 56654, -195944, -135956, -118048, 60210, -370722, -38265, -1325, 1257, -47043, -309872, -43239, -42883, -50352, -166696, 6775, -150787, 269923, -110607, 30950, -153370, 49385, 68877, -250222, 136268, 59238, -2785, -125616, -15076, 26822, -130098, 13094, 262140, 44797, 227477, -44804, -280152, -205224, 38277, -177777, -136177, -30913, 501104, -55732, 29841, -15089, -377925, -75075, -104206, -35433, 72980, -28548, 221338, 114686, -89196, 160961, -134307, -296076, -26139, 45269, -63316, -114072, -299709, -246156, -48981, 87931, 104910, -206282, -149022, -48582, -46841, -382931, -178559, 46874, -49003, 99082, -116206, -239441, 297847, 302367, -80317, 2027, -67043, 160475, -196090, 195782, 52372, 247634, -127800, 183613]
19221i1848j22044A6716J82214a26651c3925j17108P140A49541g3786B01775b5103
19209a31995f3849B13629j269e90643b71303a33841n54528D6494J97947J6339
19199B60780a72904j27119A8105a99577m7432L8722o7658J28978B91408a46084
19188a16184j20813d4951D0758A277c3063p6058C575g4752C15953i5867n2015
19177a47882g1874A39014l9724f23k81580b8007l3509D7044B3112c27158j7487
19166c44645a51329j82976d1307j00875G2630c8238J1526m16178a64179e8296
19155a23103A70713i2206m933d1108B1889d28846h5873j06668n6747C7232a15733
19143i3533k3181j1973A41364a67481A32807B4505g3376k45902J39088Q553j03435
$$ y = [-91848, -213892, 16716, 198930, -126651, -33925, -151033, -143893, 149541, -73786, 201775, -25103, -131995, -63849, 213629, 212360, -590643, -271303, -133841, -688369, 46494, 244441, 260780, -172904, -300023, 18105, -199577, -247009, -208287, -275945, -146967, 291408, -146084, -116184, -236997, -44951, 40758, 1277, -33063, -109121, 3575, -74752, 315953, -95867, -147882, -71874, 139014, 99290, -623, -282203, -28007, -61516, 47044, 23112, -327158, -344645, -151329, -334305, -41307, -142182, 72630, -38238, -26712, -442890, -164179, -58296, -123103, 170713, -92206, -97139, -41108, 21889, -428846, -85873, -192541, -249288, 37232, -115733, -93533, -116714, -128687, 141364, -167481, 132807, 24505, -73376, -319278, -180190, -171637, -275072]
19132b75072Q6470q8355e476f92A06068n1250a56981j14017O3308E6623b515A38919
19119G3698J23625a70258b6044M182B1794J16798a51178a7335k26731j2788C09701
19107a34403K4087k3263A67190b45684J13835j88657B59387j12852M9997G9336
19096A68527R4783C4502c05525A98798a85353A2519J89742c40905f0695k8224
19086h8919l8587j33227C8368f2768j30190B53527a83622F6338b01944f2746k55120
19075c17866g606l4238m1159G6917a71533A21064a49548A95227a5117A76960E0180
19063D512i8315M8370l662j48698O797M1974j92852p8808E1849b40637j0453a25238
19050a75961B15128o846l3177b446l08712A18223D5793e4006a0851k41727I5457
$$ y = [-275072, -188602, -276957, -5476, -692, 106068, 54818, -156981, -270998, -207690, 56623, -2515, 138919, 73698, 197323, -170258, -26044, -21862, 21794, 138592, -151178, -17335, -244066, -256854, 309701, -134403, -110316, -133579, 167190, -245684, -131849, -320506, 259387, 146535, 196532, 79336, 168527, 263310, 34502, -305525, 198798, -185353, 12519, 202261, -340905, -60695, -88919, -127506, -260733, 38368, -62768, -192958, 253527, -183622, 66338, -201944, -62746, -317866, -7606, -41844, -83003, 76917, -171533, 121064, -149548, 195227, -15117, 176960, 50180, 4512, -98315, -49945, -53607, -202305, -195508, -153534, -346386, -425194, 51849, -240637, -251090, -125238, -175961, 215128, 208282, 175105, -2446, -311158, 118223, 45793, -54006, -10851, -252578, 95457]
19038A68108k4309m5001J2920g7053p1101e558k09663f6572q6804B27591H9808
19026B98461P7375B4832b6181A56266k446g5768B03072b60315O1887R8520H5160
19014A10766j3184O3659a76285A05478a4144j5367j19706p1635A62531F394c5463
19002g1679q0107d4956l15776A96148i8689k9742H667a14664o3872A20179c63959
18990a29179B3289l209R6953c7406E3887a34965d6538r062A32736a50532j49585
18979c00117A22568J9771m4289a68161P3297A18886P9148K30436Q018P3046A53583
18967F9311J11692j0195D3628M8940a80882F3456I745a51464e0475b0736c004
18955h2458A37191f2151B8155J12441c27064a6891N818l36157f2248j29397L4888
$$ y = [168108, 143799, 98798, 111718, -77053, -148154, -5558, -215221, -66572, -153376, 227591, 89808, 298461, 375836, 24832, -26181, 156266, 153820, -75768, 203072, -260315, -198428, -99908, 85160, 110766, 97582, 161241, -176285, 105478, -14144, -29511, -149217, -220852, 162531, 6394, -35463, -71679, -151786, -44956, -360732, 196148, -98689, -128431, 8667, -114664, -178536, 120179, -363959, -129179, 23289, 20080, 117033, -37406, 53887, -134965, -46538, -55600, 132736, -150532, -300117, 122568, 142339, 98050, -168161, -94864, 118886, 198034, 428470, 436488, 509534, 153583, 69311, 181003, 170808, 43628, 92568, -180882, 63456, 9745, -151464, -50475, -20736, -3004, -82458, 137191, -62151, 28155, 140596, -327064, -16891, -11073, -347230, -62248, -191645, -156757]
18944a56757I9867a47033A26409i6820C25910M76c32165i2954A97878k0635J00997
18933B78240b10621o6817J03941E41098B66044C233N4473a15106D785e1100A28644
18921C45523L6620f1716k7654A71687b25274E5952N487B2200c02461B33847r7733
18910A36114e2841C70334K92192q978B4423a84442j71346A26038h6550b2583k58806
18899b81389J26983c7113A99751a70611J8277J0A15480b0765k30284l87843a89533
18887h4721b0733B9916J11051N4463M37b98051i6814j73332G0429K06352a53089
18875a51862k23738f4328I6442a66732L3490D765R804K58063c87624a00085k69332
18864c69417I56L6005a04219j5718F094Q5289i0140A82089a43631j37894E7410
$$ y = [-156757, 99867, -147033, 126409, -96820, 325910, 326386, -332165, -92954, 197878, 177243, 278240, -210621, -277438, -173497, 541098, 266044, 3233, 57706, -115106, 4785, -51100, 128644, 345523, 382143, -61716, -89370, 171687, -225274, 55952, 61439, 22200, -302461, 233847, 136114, -52841, 370334, 662526, 653548, 24423, -184442, -355788, 126038, -86550, -22583, -281389, -154406, -37113, 199751, -170611, -152334, -152324, 115480, -20765, -251049, -638892, -189533, -84721, -20733, 29916, 140967, 195430, 195867, -298051, -96814, -270146, 70429, 276781, -153089, -151862, -375600, -64328, 96442, -166732, -133242, 4765, 14569, 272632, -387624, -100085, -369417, 956, 36961, -104219, -119937, 6094, 91383, -90140, 182089, -143631, -281525, 57410]
18852B5743J8430a17225b2357C04474Q2740j00759B8145d23064A4832P9748G363
18840a77356C39807b4034j13618b5642o788H7689d77028f1482E402K6211d0049
18828D2341b0918m9353q113F2258a81058G8034Q3655J45556G7997b49154a8616
18816e8754l49617f8921k98955A36957K11988j43561L86G9616Q3176e8872A69458
18804a74666A24848c13438c6316k11176Q7529g1885o4286l5422a7034A72870b44599
18792a78053L4972C0112A265J30922c591j94714m3475A04350a08118o5801J6662
18781a57257r8323N282a14011K3135E4318J007c66302c5579a6117F1905k3062
18770C8843M1733b7009j9246j1074k37590A82948a85331o1614a15900B2935j1299
$$ y = [25743, 44173, -117225, -22357, 304474, 387214, 286455, 28145, -423064, 14832, 94580, 7363, -177356, 339807, -24034, -137652, -25642, -32430, 87689, -477028, -61482, 5402, 31613, -40049, 42341, -20918, -70271, -78384, 62258, -181058, 78034, 161689, 307245, 77997, -249154, -18616, -58754, -408371, -68921, -367876, 136957, 348945, 205384, 205770, 79616, 162792, -58872, 169458, -174666, 124848, -313438, -36316, -247492, -159963, -71885, -136171, -171593, -17034, 172870, -244599, -178053, -143081, 30112, 1265, 132187, -3591, -198305, -241780, 104350, -108118, -173919, -157257, -255580, -250298, -114011, -90876, 54318, 55325, -366302, -35579, -16117, 61905, 38843, 80576, -27009, -46255, -57329, -294919, 182948, -185331, -246945, -115900, 22935, 11636]
18759A1636d80386c0872j81017j53417f5330l06317a43081E2317a60017m1874
18749b01891M1271j66871A04499P3552c28008F8940a36587o2321O3982p7149c4974
18737A22052M2570c39078i0215L4337j98748A25928c86282J601c2767A41927F7417
18725F9304b86386c7112H6818J35753b8512j10118A7870a27070j80103c3099j8766
18714e1865A8873J15975h7840l84138G273K8365a14922e0482B0052a08131e260
18702c5240B22094b87348a19607D7167a03003A78091c75327a01408B69247a83296
18691g6803n6138j08838D11592b82743A27929a77680n583k53014D3265j2365c46162
18679b54475A27849a65447I2923f131j19732N0619K0388k01612J1750B8731A084
$$ y = [11636, -480386, -30872, -211889, -365306, -65330, -371647, -143081, 52317, -160017, -201891, -160620, -327491, 104499, 178051, -328008, 68940, -136587, -198908, -134926, -212075, -34974, 122052, 164622, -339078, -90215, -55878, -254626, 125928, -386282, -384681, -32767, 141927, 67417, 69304, -286386, -37112, 86818, 222571, -28512, -138630, 17870, -127070, -307173, -33099, -51865, 18873, 134848, -87840, -471978, 7273, 35638, -114922, -50482, 20052, -108131, -5260, -35240, 222094, -287348, -119607, 47167, -103003, 178091, -375327, -101408, 269247, -183296, -76803, -132941, -241779, 411592, -282743, 127929, -177680, -183263, -436277, 43265, 30900, -346162, -254475, 127849, -165447, 92923, -6131, -125863, -75244, -54856, -256468, -244718, 28731, 1084]
18667A09963R0552N2707g8437p6410F3735n437B5686a09485L7813k17715n70a25492
18654b30373A30301K34690A0918e5303k56078R9042C21301i0280I4748I26f1285
18642e8341j73349O7058j0757e3621m40906a77601l3589A80164B8111d0957a6589
18630G44K53091h8918P02r0226f2824N393j60456e5447E23505G7058J68412H3047
18617A13868g8293A45409g0288a7191j55501j36097A74063P0563i7268j75247
18607b72515d2088D7677a15085b4502k20069A22225A0082J41213d8570n003G1889
18595a08996r8718j07875a32029B33094d6252j11207F8417B0529d7591j23037
18585a70628O0341B96247b93189a38679A62052J91178b08808a02759G8873L7919
$$ y = [109963, 200515, 253222, -78437, -154847, 63735, 58298, 25686, -109485, -71672, -289387, -289957, -125492, -230373, 130301, 364991, 10918, -55303, -311381, -212339, 321301, -90280, 94748, 926, -61285, -58341, -231690, -164632, -175389, -53621, -494527, -177601, -211190, 180164, 28111, -40957, -16589, 744, 253835, -88918, -88216, -178442, -62824, -57431, -217887, -55447, 523505, 77058, 245470, 83047, 113868, -78293, 145409, -70288, -17191, -172692, -308789, 174063, 244626, -97268, -272515, -42088, 47677, -115085, -24502, -244571, 122225, 10082, 151295, -48570, -53573, 71889, -108996, -207714, -315589, -132029, 233094, -46252, -157459, 68417, 20529, -47591, -170628, -110287, 296247, -293189, -138679, 162052, 353230, -208808, -102759, 78873, 116792]
18575A16792a26716G4998c715A27224a397n3549D2177b52685O0626E0887K41371
18564B92258b49688B7716l824J15441E2344J1254b10926d6074B1039J61243A7692
18552a54324I3693d2618n4970B16197b12528k30075A05719M0991i0279o5524J4353
18541a41450O8817a4756j65346a6081G2210J18197q8419P6274a45131f0367j1607
18530g1974A08174B0982a03134p6015o5335B18277b09511M9015M5193M2815k85595
18519c58083D467d7589A848a64682b9026E5953e6059n9072A17322b94046a19719
18507A88794a17341r7976C4295g2342q4663G2844a94008g5716k01339A24740c77999
18495a44913m5850M0384g4004I1341a58337k785G6902J10826b15539F6405b28126
$$ y = [116792, -126716, 74998, -3715, 127224, -1397, -54946, 42177, -252685, -192059, 50887, 292258, -249688, 27716, 23892, 139333, 52344, 63598, -210926, -46074, 21039, 182282, 17692, -154324, 93693, -42618, -97588, 216197, -212528, -442603, 105719, 146710, -90279, -155803, -141450, -72633, -14756, -180102, -16081, 72210, 190407, 101988, 178262, -145131, -60367, -71974, 108174, 20982, -103134, -179149, -244484, 218277, -209511, -160496, -115303, -72488, -358083, 4467, -47589, 1848, -164682, -29026, 55953, -56059, -115131, 117322, -294046, -119719, 188794, -117341, -215317, 34295, -72342, -157005, 72844, -194008, -75716, -277055, 124740, -377999, -144913, -190763, -150379, -74004, 91341, -158337, -161122, 76902, 187728, -215539, 66405, -228126]
18483b18351O5626d6188m25487K09604A04814c73774a81382C3308M2732K4310
18473A00350a92666K3102j01116C0263K4896M8557a4479j46140n573e1202F9987
18461c03190a32455p0716B27168i8610A19763e8483k67914A4906b2358k49608
18451b71966i0043j0796K9984K6913B74242a1384k32059d382A1199f2542A04180
18439D2227a92417r3633A39140N3923F4270a57320e8785I5961e8330m5217F6238
18427a10996N5424j75536A8685J06323b5921f391k16193A74993h3842C30623a19373
18415a51370K3561d564G1923J7256l7618d1049B83101o1275J37635a82339A06019
18403f4350B56942a12116j8928A67957N4827o1229m5627a0644A8106h3840m3686
$$ y = [-218351, -152725, -46188, -471675, -262071, 104814, -373774, -181382, 33308, 76040, 100350, -192666, -169564, -270680, 30263, 55159, 103716, -14479, -160619, -166192, -51202, 69987, -303190, -132455, -203171, 227168, -98610, 119763, -58483, -326397, 14906, -22358, -271966, -90043, -100839, -70855, -43942, 274242, -11384, -243443, -4382, 11199, -62542, 104180, 42227, -192417, -286050, 139140, 193063, 64270, -157320, -58785, 95961, -58330, -103547, 66238, -110996, -55572, -231108, 18685, 125008, -25921, -6391, -222584, 174993, -83842, 330623, -119373, -151370, -127809, -4564, 71923, 89179, 51561, -41049, 283101, 221826, 359461, -182339, 106019, -64350, 256942, -112116, -131044, 167957, 222784, 161555, 115928, -10644, 18106, -83840, -127526]
18392a27526J6542A23839D1124g9626j11323M3438j46957A43169n9840c08943
18381f8445A69445D5467N1274P3510a07506H3684d6048n5330B19580b04853A30953
18369b12179a8138D1240i6040c6448j73202P562O0929H1724a02702B5853n602
18358B0251M58001c7823k5273A03175b65951b1912B40863e2257l1996l555l971
18347i1779A1085K09560g0056H3355M664a25233B43463a93444I7391a69978P2875
18336i7103I6607a60698n6342p8290a08005j3966o9094A31845A3347c8152l5355
18325g3507q8595f8467k46233C1941a14763k49582B7577a52541a5669F9631h3123
18313d2169j44304A80494F40L69062l8383a89749B02082i8082D373K34966E0630
$$ y = [-127526, -110984, 123839, 41124, -79626, -190949, -147511, -294468, 143169, 83329, -308943, -68445, 169445, 45467, 96741, 170251, -107506, 83684, -46048, -101378, 219580, -204853, 130953, -212179, -18138, 41240, -96040, -36448, -209650, -202088, -141159, 81724, -102702, 25853, 20251, 478252, -37823, -63096, 103175, -265951, -21912, 240863, -52257, -84253, -87808, -91779, 11085, 220645, -70056, 83355, 88019, -125233, 243463, -193444, 97391, -169978, -97103, 96607, -160698, -217040, -295330, -108005, -121971, -191065, 131845, 13347, -38152, -73507, -162102, -68467, -314700, 31941, -114763, -364345, 27577, -152541, -15669, 69631, -83123, -42169, -186473, 180494, 640, 369702, 331319, -189749, 202082, -98082, 4373, 239339, 50630]
18301H2765b55979h8382K069D0080J62356C3108f4974r020G7484b95338b3536
18289f8859r2284A29381a34933c8794F2234f3461l33641a46808N8102n5454D9292
18277A36818h4782L9487B85770a0998A17610c9567r8984I3124b03054C0279e3070
18265B55157A08322A2382R7001a11563j36589i7272E5036c12369J20954C98397
18254a49401A03604J0546a25995I6286a80874A84499a8741B0898J35338h0339
18243B64696q8078g2417E3187d2394k02201K3788J8746p98j69712G2256a11017
18231b41600L9137j12085e110o6929b6356B05326i1224E8200L62669A38263h9979
18219A72810n9686B8552a95525b9755D6275a91733j08144J28871a6855D15800
$$ y = [82765, -255979, -88382, -86313, 40080, 202436, 33108, -64974, -73994, 77484, -295338, -23536, -68859, -161143, 129381, -134933, -38794, 62234, -63461, -397102, -146808, -88706, -144160, 49292, 136818, -84782, -45295, 285770, -10998, 117610, -39567, -138551, 93124, -203054, 30279, -53070, 255157, 108322, 12382, 109383, -111563, -248152, -97272, 55036, -312369, -191415, 398397, -149401, 103604, 114150, -125995, 96286, -180874, 184499, -18741, 20898, 156236, -80339, 264696, 176618, -72417, 53187, -42394, -244595, -220807, -202061, -202859, -372571, 72256, -111017, -241600, -202463, -314548, -5110, -72039, -26356, 205326, -91224, 58200, 420869, 138263, -89979, 172810, 113124, 28552, -195525, -29755, 46275, -191733, -299877, -171006, -16855, 415800]
18208e6529l55350f5351b7471j81367e686p1173A87935o8095C6253a2727E7962
18196e6590m9861A15678J13549a62740c7190C21289D693L70842A26063B3668a6862
18184b33102g0563k25G9146e3689j26042d2455j92229I9107J04730L0i2372E9136
18171A52965e3843l2252k51630B70192d23819H470J08001a71701K0177I3201e71
18159i7188j52655B5684O8863b83496g904F3267a56113B43268b38238k8979P2317
18148a94900g755B79130d4236A32566J20625j1898g5553A29391C9688L55421F4165
18136d9219C51629a8513E2949b1785B4411b578A310a27495a8186k01145k04098
18125d23429K00017M3410k6199C1092N9562K19431c0302k0789o8387B0113J22442
$$ y = [-56529, -411879, -65351, -27471, -208838, -5686, -76859, 187935, 119840, 36253, -12727, 57962, -56590, -106451, 115678, 229227, -162740, -37190, 321289, 4693, 375535, 126063, 23668, -16862, -233102, -70563, -70788, 79146, -53689, -179731, -42455, -234684, 99107, 203837, 203867, -92372, 59136, 152965, -53843, -86095, -337725, 270192, -423819, 8470, 116471, -171701, -151524, 93201, -571, -97188, -249843, 25684, 94547, -283496, -7904, 63267, -156113, 243268, -238238, -267217, -194900, -7755, 279130, -44236, 132566, 253191, 241293, -75553, 129391, 39688, 395109, 64165, -49219, 351629, -18513, 52949, -21785, 24411, -2578, 1310, -127495, -18186, -219331, -423429, -223412, -180002, -206201, 31092, 90654, 310085, -30302, -51091, -119478, 20113, 142555]
18114A42555a56225E4381b47472d7845J0655l0357k18103A31110L408b57824J18682
18103a39142O9n9680A13636m293J18873e5986E0249a49887B9212N471A6220a69404
18090B28195r0250h4970B84892h1822j04803A93617b05602C41212i9161A13301
18079a72042E1979J47875a16745j20436A24864O7735d25939a45334B07220h35
18068I8601a88385g0890k29588A13319a14951j90436i3515B66648d2567J8766
18058b3801o7342a5773A99385a75543f536I376J05938N3023K8749J2330D5525
18046A38246l4678P6656g2151G6760J20767p8309C8655d3517j75210f0477E3483
18034a20574C41902n6261a69989o1275B96327k7620C3990f7327k8544A11427a93366
$$ y = [142555, -156225, 54381, -247472, -47845, -37190, -67547, -285650, 131110, 134518, -257824, -139142, -139073, -198753, 113636, 109343, 228216, -55986, 50249, -149887, 29212, 34683, 16220, -169404, 228195, 137945, -84970, 284892, -81822, -186625, 193617, -205602, 341212, -99161, 113301, -172042, 51979, 199854, -116745, -237181, 124864, 192599, -425939, -145334, 207220, -835, 98601, -188385, -70890, -300478, 113319, -114951, -305387, -93515, 266648, -42567, -23801, -91143, -15773, 199385, -175543, -6536, 9376, 115314, 168337, 197086, 209416, 45525, 138246, 103568, 180224, -72151, 76760, 197527, 119218, 38655, -43517, -218727, -60477, 53483, -120574, 341902, 285641, -169989, -231264, 296327, 268707, 33990, -67327, -95871, 111427, -193366]
18022b90669A2979J0316M05529a69315M1342D0840c34662D92203a03130B97457
18011f089k0794o4502q7703N3369j36499C3f5127l6916l2811A5424G41P1137B9496
17997B27084a38105B38509b00828i4571D3214A2527e6974n6859D46576f3271H7158
17985A74366a6896k53150A04573J34681F9660b12695j08112J7360g2948b9280
17974h8787D3602c01p1263f021F7777a52229p715D2749N2408e0633H9359a13850
17961a1556H455K47621b83827d1260o4126A93961a09402A6175g0737B1549d41
17949A20317J27567k5143B2788a05962I7532B1958Q4382J8619m0929a02818D29375
17937i5101D17279E3724a31943c8682j48947N1227A26726a74061N1807k9757B0464
$$ y = [-290669, 12979, 23295, 428824, -169315, -127973, 40840, -334662, 492203, -103130, 297457, -6089, -26883, -91385, -179088, -125719, -262218, 33, -65127, -102043, -134854, 15424, 741, 71878, 29496, 227084, -138105, 238509, -200828, -94571, 43214, 12527, -56974, -113833, 446576, -63271, 87158, 174366, -16896, -270046, 104573, 239254, 69660, -212695, -320807, -303447, -72948, -29280, -88787, 43602, -301, -71564, -6021, 67777, -152229, -159944, 42749, 95157, -50633, 89359, -113850, -11556, 8455, 256076, -283827, -41260, -105386, 193961, -109402, 16175, -70737, 21549, -441, 120317, 247884, 222741, 22788, -105962, 97532, 21958, 106340, 124959, 84030, -102818, 429375, -95101, 417279, 53724, -131943, -38682, -187629, -136402, 126726, -174061, -122254, -152011, 20464]
17925b55150F2977k9117J25845a53236N2039p4501C4497K327A061J95770b50095
17913e9938E7753a98396K1326C44083c01885A67140B7369d5108B47371A06980
17902G1387b70323A44148a76870i684r4176B65981m5989b10281A18794D4447b05647
17890b67042J25068I1703a10498A75870A40c28481H2795M802a04708C982K8264
17879C2246J77642K5618J14064G3790d5111B0276g0602A9500l463a88613A04948
17867a8106k02941A59168b38664n0149I8107A4298b0339k06084D1464a58331B7945
17855c9554B21447K7899b50558A30768K1849h055p0400C4627J83252a19278L8515
17844h0763F9755a15372n3359f7990D7532e3484A65517J60783g41E5497P9483
$$ y = [-255150, 62977, 33860, 159705, -153236, -101197, -175698, 34497, 36824, 1061, 196831, -250095, -59938, 57753, -198396, -177070, 344083, -301885, 167140, 27369, -45108, 247371, 106980, 71387, -270323, 144148, -176870, -9684, -103860, 265981, 219992, -210281, 118794, 44447, -205647, -267042, -141974, 91703, -110498, 175870, 140, -328481, 82795, 87597, -104708, 3982, 32246, 209888, 235506, 349570, 73790, -45111, 20276, -70602, 19500, 16037, -188613, 104948, -18106, -221047, 159168, -238664, -288813, 98107, 14298, -20339, -226423, 41464, -158331, 27945, -39554, 221447, 249346, -250558, 130768, 152617, -8055, -78455, 34627, 217879, -119278, -80763, 69755, -115372, -168731, -67990, 47532, -53484, 165517, 326300, -741, 55497, 134980]
17833A34980J0529m1263q246K37531E7588L6336h2262A7061K30869r7936J4539
17822A64533b83982C59445e7374B71731q0653a50543I5510a14200J2096A5739
17811B08028f1313j11607b9666n9744b9020k4985I0458J23957h405k52852B08474
17799i0165l3743C15914F5518a53102O1404E8407M4545A5961a23659B08381L0032
17788B38413E9800K24248j12524p8038K91412E8194j2115P3779a7809B4929K605
17777B7534L13864i0942A17245J58446A16687a17964B2774a23804D6145J30058
17767A76203a21700m172j91559Q3139D53967a8660B63004o6261L34365h0417j25293
17756b05710M5082D02582A27972R3331N4626a04501B99811F890d6449A41406j0070
$$ y = [134980, 145509, 104246, 96000, 333531, 57588, 93924, -82262, 17061, 247930, 149994, 164533, -283982, 359445, -57374, 271731, 191078, -150543, 95510, -114200, -102104, 15739, 208028, -61313, -172920, -29666, -89410, -29020, -54005, 90458, 214415, -8405, -261257, 208474, -90165, -123908, 315914, 65518, -153102, -91698, 58407, 102952, 15961, -123659, 208381, 238413, 59800, 284048, 171524, 93486, 384898, 58194, 46079, 119858, -17809, 24929, 27534, 341398, -90942, 117245, 275691, 116687, -117964, 22774, -123804, 46145, 176203, -121700, -125872, -317431, -234292, 453967, -18660, 263004, 196743, 531108, -80417, -205710, -160628, 402582, 127972, 221303, 275929, -104501, 299811, 6890, -46449, 141406, 131336]
17745A31336k1421m096O9814a18721C04577e8291A8466J09961d5828b2696A24324
17733B21315j03107a42140k06680a14759B44158J00221a82999B59455F3919f595
17722B6193J22390l1562O5425L1449J55629j75533l336a2383C8837h5665B69700
17710A6907Q170J97981H5349J62122R2458q6665j14170F125J52840c2115E1566
17698C4043d6270j18521I1737b70083C01560i3542B10513a82116A60818g7358
17687A51626o4866b9214A37466A2848b1235D0913A6936K58602o0603m5353a13551
17675B09272b33677a13037F0430c8328B29106a66486A26707e4112E53284j17187
17665D36097H8859D2932E94L77976a60626A30721J3595n1314P4331J1439L48404
$$ y = [131336, 109915, 105819, 175633, -118721, 304577, -58291, 18466, 128427, -45828, -22696, 124324, 221315, 118208, -142140, -348820, -114759, 244158, 344379, -182999, 259455, 63919, -6595, 26193, 148583, 117021, 182446, 213895, 369524, 193991, 190655, -12383, 38837, -85665, 269700, 16907, 25077, 223058, 85349, 247471, 339929, 253264, 139094, 6125, 158965, -32115, 51566, 34043, -46270, -164791, 91737, -270083, 301560, -93542, 210513, -182116, 160818, -77358, 151626, 86760, -29214, 137466, 12848, -21235, 40913, 16936, 275538, 214935, 169582, -113551, 209272, -233677, -113037, 60430, -38328, 229106, -166486, 126707, -54112, 553284, 436097, 88859, 42932, 594, 378570, -160626, 130721, 144316, 93002, 167333, 178772, 527176]
17654E27176B56727d6616q2563G7011b58115B16405f7214A97058J60969A09662
17643a78569B66097h3302n8569k06841A04875L4300B8070K26404A3488K13780
17633B27268n012k1766c10257A41585a51846D07292b2127A8301a18655j06629
17623b25284f4361o0477H2995A2141J15220J24843N6692A18155J96841G3420J39528
17612B12948M3998d9738H0538C8424J14673J67069A8269J04168K36785A45879
17601A16347P2416J52061j1467j44236O4663J35226A52966c3659B34173C1725
17590c962j55274m5105B27450A4037K90368a7986B33263j4926I1388L4162E6850
17578B63566m9543a92553B32989A08595J15243a36319q47B44643J44671A56032
$$ y = [527176, 256727, -46616, -129179, 77011, -258115, 216405, -67214, 197058, 358027, 109662, -178569, 266097, -83302, -141871, -348712, 104875, 139175, 28070, 254474, 13488, 227268, 222256, 200490, -310257, 141585, -151846, 407292, -22127, 18301, -118655, -225284, -64361, -124838, 82995, 12141, 127361, 252204, 308896, 118155, 314996, 73420, 212948, 256946, -49738, 80538, 38424, 153097, 320166, 18269, 122437, 359222, 145879, 116347, 188763, 340824, 329357, 185121, 249784, 385010, 152966, -33659, 234173, 31725, -3962, -159236, -204341, 227450, 14037, 304405, -17986, 233263, 218337, 91388, 125550, 56850, 263566, 214023, -192553, 232989, 108595, 223838, -136319, -137166, 244643, 389314, 156032]
17567a84981h7622J9726B86683i3196D5258K49218m1995C3820M73086F6860J61830
17556B28690r5240D2786N8274J96150Q2032D1741K03651m2919H6838d2417A42752
17544A34740Q3949g3949c578D01711I6700b9542E90025A44894J28912B6934K30645
17533B57579C9974j695j8090J19475K12200K72675k88187n0503M78353j09971
17523F54231K56419P6612j80891l69890j04752D9493K52881R4237m2342A01451
17512C53243R9538j8835M07252R3695K70141n64988J62814l63022j68713K624
17502B73749p8723R0860E0498J38436K19737p9049J3180n1162m8o3907L41371
17491E69056B27493J57993A05133m607D4628J46566J13775E792J69608N77686
$$ y = [-184981, -87622, -67896, 286683, -93196, 45258, 294476, 252481, 33820, 506906, 66860, 228690, 133450, 42786, 101060, 297210, 379242, 41741, 245392, 202473, 86838, -42417, 142752, 134740, 218689, -73949, -3578, 401711, 96700, -29542, 590025, 144894, 273806, 26934, 257579, 39974, 38279, 20189, 139664, 351864, 624539, 336352, 285849, 764202, 654231, 910650, 987262, 806371, 436481, 331729, 49493, 302374, 396611, 354269, 101451, 353243, 452781, 433946, 841198, 934893, 1205034, 640046, 802860, 439838, 271125, 273749, 195026, 285886, 50498, 188934, 408671, 329622, 342802, 291640, 291592, 227685, 569056, 227493, 385486, 105133, 100526, 44628, 191194, 304969, 5792, 175400, 753086]
17481G53086b02962A51450J30630K24273A24252L83289m6410H5310K73018M6748
17471D05076A49686J66717p8229J66057F3832M93906j43239j30445A00436g3949
17460B58388J22202j02388F1756N6155J62494I4766J81405p0264P6302o967A34546
17448B29557J07701L8797A20618M00493B46854R8976j55033K77061n3692j57726
17438B56440E2964L19616G0983K08077O2509K38470j83856N0417C0829M77662
17428E08491q9829k01996l5129L01902j8840j46019A51679M97782B43874o6265
17418A77609Q3357K00020E7180c03750C94068J8019H2217L67056A83418K50053
17408D33471A23250L16106k03832K04633A75707C2412L21090h7390A39625K25472
$$ y = [753086, -202962, 151450, 282080, 506353, 124252, 507541, 461131, 85310, 358328, 405076, 149686, 316403, 238174, 404231, 63832, 557738, 414499, 284054, 100436, -73949, 258388, 380590, 278202, 61756, 117911, 280405, 94766, 276171, 205907, 282209, 275242, 134546, 229557, 337258, 376055, 120618, 521111, 246854, 345830, 190797, 467858, 414166, 256440, 52964, 372580, 70983, 279060, 341569, 580039, 396183, 446600, 30829, 508491, 418662, 216666, 181537, 483439, 464599, 318580, 151679, 649461, 243874, 177609, 260966, 460986, 57180, -303750, 394068, 412087, 82217, 449273, 183418, 433471, 123250, 439356, 235524, 440157, 175707, 32412, 353502, -87390, 139625, 365097]
17398C65097g1814B52812O7773n5232n5975P3216J08131j35556O7913K3281m818
17387C41545A58765a83598A66144N7132I5204N1417j5696A3167J80827K4528r7092
17376A21430K41349j71919K22063j96381O2057J75942A61196J84343p6943K10915
17366D79511I2956M7484L4068E5160N7621K26006a0222B47256q6220L0126P4292
17355B65454n1146Q6239o3384j3908j10267C1758J50514K15348a8369A87336q7836
17344I9500D7965N00949A42098B8456J99215M7091m8258J41816j29378M042m6519
17333A96465K51697A86332q8312J00601o5429J63348j11504K3676J60964n4926
17323C14750a31435N6271B67408M3262K51626j06376H5919L87698k04945m9609
$$ y = [365097, -71814, 252812, 320585, 265353, 209378, 282594, 390725, 255169, 323082, 346363, 341545, 158765, -183598, 166144, 223276, 95204, 146621, 130925, 13167, 193994, 218522, 121430, 362779, 190860, 412923, 216542, 278599, 454541, 161196, 345539, 268596, 479511, 92956, 140440, 174508, 55160, 112781, 338787, -10222, 247256, 161036, 191162, 265454, 214308, 300547, 237163, 223255, 112988, 31758, 182272, 397620, -18369, 187336, 99500, 47965, 548914, 142098, 28456, 227671, 274762, 226504, 368320, 238942, 242984, 196465, 448162, 186332, 98020, 198621, 133192, 296540, 185036, 208712, 369676, 314750, -131435, -75164, 267408, 310670, 562296, 455920, 85919, 473617, 268672, 219063]
17313B19063J31757j46611p1915Q7068L0789q5755K26468Q6962q7092A62057M80603
17302F42660j97685M5491B05952L52786A18531J40471J52508l5211A78688K9484
17292B08172P1291P112M431K75793j33950A39946K33065A85895O1879K7273l7161
17281B37886J02767O1984M252L8692K8777k22335j9801J45235I5596K14771n7525
17270B52842L45932k38030J05746j33338j38585J06247K08869K1202B61314M4214
17260C05528K68529B37865K9966J89944j79230R9503q1486P344F8932P05787G7381
17248A04149D9014M32130N6400q2050j67604j07831f1575B50635K81814A20330
17237C62928J2851j33258J46709A94097B4067A1379L42037N2616j89143p386p7815
$$ y = [219063, 350820, 204209, 132294, 219362, 250151, 164396, 390864, 477826, 390734, 162057, 642660, 444975, 490466, 205952, 558738, 118531, 259002, 411510, 376299, 178688, 208172, 279463, 286575, 291006, 566799, 432849, 139946, 373011, 185895, 247774, 275047, 237886, 340653, 402637, 406889, 445581, 474358, 252023, 232222, 377457, 95596, 310367, 252842, 598774, 360744, 466490, 333152, 194567, 300814, 509683, 530885, 261314, 305528, 574057, 237865, 267831, 457775, 278545, 378048, 296562, 303906, 68932, 774719, 77381, 104149, 49014, 481144, 537544, 455494, 287890, 180059, -61575, 250635, 532449, 120330, 362928, 375779, 242521, 389230, 194097, 24067, 11379, 353416, 406032, 216889, 209503, 131688]
17226A31688K43376K7513J8992j48822n0860J8583j5132g6020E84444q931j78473
17215C97040J73034r5008J22089B09210K27077q6983N15904C23438G8762J12336
17205A91098Q0489J27558j11002J03316J36013r6054l3852j873J88297R3024B45741
17193C37986Q0833Q7560k24077K04909L6734O675j84719o5736L66600C08822J57779
17182D66601J09622B79613J34908m17J27951J86638j69943k16047J26666K7930
17172D97299A16778L01322J06234j68770L75629l21806J27381j67977J34648L25645
17162H29084j90153l16629M47716l65348n3579M85681C92729R1051n136j35571
17152C43073K87866j38103K14755o2023p5668r1273J01084j65654K37867p4138
$$ y = [131688, 375064, 402577, 421569, 272747, 221887, 240470, 225338, -76020, 584444, 575513, 397040, 570074, 475066, 597155, 209210, 436287, 349304, 865208, 323438, 78762, 191098, 271587, 399145, 288143, 391459, 527472, 431418, 397566, 395693, 583990, 677014, 245741, 337986, 418819, 506379, 282302, 487211, 523945, 530620, 345901, 280165, 646765, 308822, 466601, 576223, 279613, 414521, 414104, 542055, 728693, 558750, 342703, 469369, 497299, 116778, 418100, 524334, 355564, 731193, 409387, 536768, 368791, 503439, 829084, 638931, 322302, 770018, 404670, 351091, 836772, 392729, 483780, 478644, 343073, 630939, 492836, 707591, 645568, 569900, 478627, 579711, 414057, 651924, 577786]
17142E77786J94117k33322R0919P6665j17036j6185j55549J72671j67865Q3951
17132E06152q3589K08762k2087K6774k30483L95910l10563K64422k27149p7412
17122D50737K56103k50527O6824o3778A89997K75610j99453L50994j39036O6636
17112E44748J75889B43961L21270m118Q8396J11563l74288J70260Q2935m1917
17102E98062j08412m0208K23693m3314M2442o1720q3040K52405l11406R53J97917
17091F67372R6049l06269J74670k31063M38050C68630O24546m07414K00164j17421
17081F68505Q3819M3253r57L21946n0455k83594j5900M103l34j96105P3657L92008
17069A039946n6103l40087N4622j4775J52976j11337J2993k3894Q295K39090j31599
$$ y = [577786, 771903, 538581, 629500, 706165, 589129, 572944, 417395, 590066, 422201, 506152, 422563, 631325, 609238, 636012, 405529, 801439, 490876, 755298, 528149, 450737, 706840, 456313, 523137, 459359, 189997, 465607, 266154, 617148, 478112, 544748, 720637, 243961, 565231, 561113, 649509, 761072, 386784, 557044, 639979, 598062, 489650, 449442, 673135, 629821, 672263, 610543, 527503, 779908, 468502, 469455, 667372, 763421, 457152, 631822, 400759, 838809, 368630, 993176, 585762, 785926, 668505, 752324, 795577, 794620, 1116566, 1066111, 782517, 766617, 770720, 770386, 574281, 647938, 1039946, 983843, 643756, 698378, 683603, 836579, 725242, 738235, 714341, 722636, 961726, 830127]
17058H30127n4896P0455K60299l01879L33L43647k56902l37773K34950J14553
17048I02914k4856L2956k36986J22903Q5067k1624J58978j90526j91785L56349
17038I93390k41768L13001L5291k09123J62158j67061K32881k35796J26048j66307
17028H42714L47164j35832K00424k32029O4711k35804J63325J5362K4282L4128
17018A088445l3822K74012m44539n5823M14141J46129j79506j27629q2419k368
17008I96621J44963J27123k70647K80556n9645J04914K50684p50019M85426j68814
16998A141162P7093r1046l48J97092J07986J47672p920l33290J38275j92691l433
16987A180552k1348M1327J57263N8252K52579j64275m40202M27583J89249K37924
$$ y = [830127, 775231, 845686, 1105985, 804106, 804439, 1148086, 891184, 553411, 788361, 902914, 878058, 911014, 674028, 796931, 881998, 860374, 1019352, 828826, 637041, 993390, 751622, 1064623, 1099914, 890791, 1052949, 885888, 1118769, 882973, 1009021, 842714, 1189878, 1054046, 1254470, 1022441, 1087152, 851348, 1014673, 1030035, 1054317, 1088445, 1054623, 1328635, 884096, 828273, 1242414, 1388543, 1209037, 1081408, 998989, 996621, 1141584, 1268707, 998060, 1278616, 1218971, 1323885, 1574569, 824550, 1309976, 1141162, 1218255, 1127209, 1126861, 1323953, 1431939, 1579611, 1571691, 1238401, 1376676, 1183985, 1180552, 1159204, 1200531, 1357794, 1416046, 1668625, 1504350, 1064148, 1491731, 1680980, 1918904]
16977A918904p24314M40933n3210l24173N04517k96380L36199j96675k57617N32127
16967A880311K76085l57540m40013J04322N15520l97360J53618L29811k05473
16958A859281j25779m63348K14297J66792l942Q2423o8953J68412n1672K27124
16948B004635N0756k5722k04558K54233J16682k9832k21036J46146j40779O3118
16938B013643R194j28419J60890M25444l10632M0511K09387m6088j60718L9791
16928B253003J83870j48744j79804M16525j53145M2712k41855O32780l40495p2479
16918B392368M30112l33547r7936L31559P6513K04675l24980K33070l24822J5908
16908B602920L31834k20913J31121j77579L25036k41252L55000J20346k32438
$$ y = [1918904, 1194590, 1635523, 1582313, 1258140, 1762657, 1466277, 1802476, 1605801, 1348184, 1880311, 2156396, 1798856, 1358843, 1463165, 1978685, 1581325, 1734943, 2064754, 1859281, 1733502, 1270154, 1484451, 1651243, 1647301, 1729724, 1660771, 1829183, 1777511, 2004635, 2055391, 2029669, 1825111, 2079344, 2196026, 2166194, 1945158, 2091304, 1950525, 2013643, 2022837, 1894418, 2055308, 2480752, 2170120, 2210631, 2420018, 2373930, 2213212, 2253003, 2436873, 2288129, 2108325, 2524850, 2371705, 2414417, 2172562, 2805342, 2464847, 2392368, 2822480, 2488933, 2390997, 2722556, 2799069, 3003744, 2678764, 2911834, 2587012, 2602920, 2934754, 2713841, 2844962, 2667383, 2992419, 2751167, 3106167, 3226513, 2994075]
16899B994075J66875J35780n4105N6906m0179p5037O7636l0577m7212L35448j16421
16888C393189N45450n24645K10480j06364K35796k7937j43880N10365q8915l00756
16878C702783o592L66378J8183M96107l69445M07966p6139m25968J37718J35433
16868D386424Q803J32235M7816J31642N80214o68277L54436Q8918K0953J02940
16858E186104j08787N19380k28599L0412K4693L19376K85674k06828J03133J11911
16848F036469o8701K13417k93692K16236K53151J47674M84131j88922K0823K47961
16838G068547K22317K0632J62867n4369N00158K25321o7396K30212j87522K26055
16828H346822n011N24683K24028J05447n669K1914J85689K18804J30075L20961
$$ y = [2994075, 3160950, 3296730, 3242625, 3299531, 3259352, 3184315, 3251951, 3221374, 3174162, 3509610, 3393189, 3938639, 3413994, 3624474, 3518110, 3753906, 3725969, 3582089, 4092454, 4003539, 3702783, 3696191, 4062569, 4080752, 4576859, 4207414, 4615380, 4539241, 4113273, 4250991, 4386424, 4395227, 4527462, 4575278, 4706920, 5287134, 4618857, 4973293, 5062211, 5083164, 5186104, 5077317, 5596697, 5368098, 5398510, 5423203, 5742579, 6028253, 5821425, 5924558, 6036469, 5967768, 6181185, 5887493, 6103729, 6356880, 6504554, 6988685, 6799763, 6820586, 7068547, 7290864, 7311496, 7474363, 7419994, 7920152, 8145473, 8078077, 8308289, 8120767, 8346822, 8341811, 8866494, 9090522, 9195969, 9190300, 9212214, 9397903, 9616707, 9746782, 10067743]
16818A0067743J54510L26731J71301m0379L35735K27198J93802J60394N00025
16809A2097060L65291K37337R8268Q4469Q77719l04058O15906K41537J67323Q65751
16799A5346603l95376J130129k51788O15120K27399L87453N92591N18358K77949
16790A8448438N14612M96859O67171L38621L06014Q95187R1760P18233M71132
16781B2948027R27924M74653N54909R43822Q94023M35537Q22083P25874O82118
16772B9408970J078895J077494N94127J141244L04750J424857Q05746Q69873J570149
16763C8276105J159211N21250J514291J506596J104456J412431J322987J080077
16755D7897404J604347J548195J497587J661547J403344J381722J620488K117828
$$ y = [10067743, 10222253, 10548984, 10720285, 10679906, 11015641, 11242839, 11436641, 11597035, 12097060, 12462351, 12699688, 12797956, 12882425, 13760144, 13456086, 14071992, 14313529, 14480852, 15346603, 14951227, 16081356, 15829568, 16444688, 16672087, 17059540, 17652131, 18170489, 18448438, 18963050, 19459909, 20127080, 20465701, 20771715, 21666902, 21758662, 22476895, 22948027, 23875951, 24350604, 24905513, 25849335, 26743358, 27178895, 28000978, 28726852, 29408970, 30487865, 31565359, 32159486, 33300730, 33605480, 35030337, 35836083, 36705956, 38276105, 39435316, 39956566, 41470857, 42977453, 44081909, 45494340, 46817327, 47897404, 49501751, 51049946, 52547533, 54209080, 55612424, 56994146, 58614634, 60732462]
16747F0732462J070920K043830J531833J488279J905677J616803J765585J541598
16739G3696987J674194J835929J265750J622721J098233J508385J012389J137503
16731H4852091R63152R99159N89939P66157L12420M37430J50816J4099N5390l04170
16721H8836483m82801o09672o46940q03631q83370j194517j003125j189198j142859
16712H0880370j519712j439168j303879j840898j575311j704724j348426j831481
16704F8316771j495558j917784j614217j480335j298006j957741j659723j244988
16696E5648419j537143j421384j681474j386328j612269j272004j073553j366441
16688D4297823j355935r34157j124828j099700j314557r31713j401964q17786
$$ y = [60732462, 61803382, 63847212, 65379045, 66867324, 68773001, 70389804, 72155389, 73696987, 75371181, 77207110, 78472860, 80095581, 81193814, 82702199, 83714588, 84852091, 85815243, 86814402, 87404341, 88170498, 88482918, 88920348, 89071164, 89085263, 89140653, 88836483, 88353682, 87744010, 87097070, 86293439, 85410069, 84215552, 83212427, 82023229, 80880370, 79360658, 77921490, 76617611, 74776713, 73201402, 71496678, 70148252, 68316771, 66821213, 64903429, 63289212, 61808877, 60510871, 58553130, 56893407, 55648419, 54111276, 52689892, 51008418, 49622090, 48009821, 46737817, 45664264, 44297823, 42941888, 42007731, 40882903, 39783203, 38468646, 37536933, 36134969, 35317183]
16680C5317183r83600q11619j062876n66189r55011q48885j066823m50926o40273
16671B7930981q47337q75532m55437n99387q89284l38411p45184m01417p51968
16662B2027024k74911o59400j86997o26222n13053m72188o17866j52319o25005
16653A7899063l01862m11184l30097l47304m92671n30356l3451k07817m27893
16644A4816428j39296j64490o14124l37057j10471j22273m76319n8199o49786
16635A2144413k6554k51395o0867k72033k50238n702m13040k08142k57832j96747
16625A0201863J26504m35322J87138n29589l17386J73798J58220m69151k76006
16616H820069J35290l08166l27070o9617k60300P2455R2125m16458J677l57140
$$ y = [35317183, 34333583, 33521964, 32459088, 31892899, 30937888, 30089003, 29022180, 28571254, 27930981, 27083644, 26208112, 25752675, 25153288, 24264004, 23925593, 23180409, 22778992, 22027024, 21752113, 21092713, 20905716, 20279494, 19766441, 19294253, 18676387, 18524068, 17899063, 17597201, 17186017, 16855920, 16508616, 16015945, 15485589, 15452138, 15244321, 14816428, 14677132, 14512642, 13898518, 13561461, 13450990, 13328717, 12852398, 12794199, 12144413, 12117859, 11866464, 11805597, 11533564, 11283326, 11277624, 10864584, 10656442, 10398610, 10201863, 10328367, 9893045, 10080183, 9550594, 9233208, 9407006, 9565226, 9096075, 8820069, 8955359, 8647193, 8320123, 8250506, 7990206, 8062661, 8154786, 7738328, 7740005, 7382865]
16606G382865k09158J54990K44419n7998m58376j8325j25524q7608k24529j73725
16596F427031J50531j64280j30497j58251Q1261k0624k67412R9744K34236m79508
16586E772231l61403L32457k79553j77076N4892k10952J57487p1279j68998l87868
16576D659938J85179L39517l31585K30969q0077j59653j09844k60290Q8976j78388
16566D384742n0480M54831k71636m9236k65105j2001K63572l96254J74276k46812
16556C985897K63436j58734o49910Q56334l09109o1984J76640m34386m196K77236
16546C941224m38756j66560O0391L4895J9169k208J08529Q7780l23176k1547k03963
16535C095778N26291l44050J70580Q2813m53610j24897K33402q4153l42404K45284
$$ y = [7382865, 7173707, 7328697, 7573116, 7515118, 7056742, 7038417, 6912893, 6825285, 6600756, 6427031, 6577562, 6413282, 6282785, 6124534, 6205795, 6185171, 5917759, 6017503, 6251739, 5772231, 5410828, 5743285, 5463732, 5286656, 5341548, 5130596, 5288083, 5216804, 5047806, 4659938, 4845117, 5184634, 4853049, 5084018, 5003941, 4844288, 4734444, 4474154, 4563130, 4384742, 4334262, 4789093, 4517457, 4468221, 4203116, 4191115, 4454687, 4058433, 4232709, 3985897, 4249333, 4090599, 3440689, 4297023, 3987914, 3925930, 4102570, 3668184, 3663988, 3941224, 3502468, 3335908, 3396299, 3431194, 3450363, 3448155, 3556684, 3644464, 3321288, 3299741, 3095778, 3622069, 3278019, 3448599, 3531412, 3077802, 2952905, 3186307, 3102154, 2759750, 3005034]
16525C005034R159j18972j31096J01973K88755l86268Q6609m10522L75085K66874
16515C086631n88525q2471M15155l62008J03782J11984l53947J69919J56485j89366
16505B467639J56175k13152N5272k25820J75832k07378O5281K34924k00859k5691
16495B282223J18673J7657k91086Q0425J08883m4683o5905j6554J80667k55861
16485B114439R7520j46340n7822L6977J3045k00273P8427K51242n5585j40339
16475A991291K48772l35388j63863j70179K08825m7563J10083o6900J49764k57269
16465A667573j92183N00537N8661m25490J95657q4234r1049K01655K8624k40445
16455A619306M8867l26326N52508l65047J68827J05316j92806J15397j85300j11845
$$ y = [3005034, 3014193, 2895221, 2764125, 2866098, 3154853, 2768585, 2855194, 2444672, 2819757, 3086631, 2498106, 2415635, 2830790, 2468782, 2572564, 2684548, 2330601, 2500520, 2657005, 2467639, 2623814, 2410662, 2465934, 2240114, 2415946, 2208568, 2273849, 2508773, 2307914, 2282223, 2400896, 2418553, 2127467, 2207892, 2316775, 2272092, 2206187, 2189633, 2370300, 2114439, 2211959, 2065619, 2007797, 2044774, 2057819, 1857546, 1935973, 2187215, 2131630, 1991291, 2240063, 1904675, 1740812, 1570633, 1779458, 1731895, 1841978, 1775078, 1924842, 1667573, 1475390, 1975927, 2034588, 1609098, 1804755, 1720521, 1629472, 1831127, 1859751, 1619306, 1668173, 1341847, 1894355, 1529308, 1698135, 1803451, 1610645, 1726042, 1540742, 1428897]
16445A428897K93052o8172j29280J45515N9167j51456J72046j01406k87998N1626
16435A411991J07841K22407n40963j00284K35648L61042O3524m45240J7630j79918
16425A153678O64957k66999k09186O5017k27497K78253J50841p8720q7628K62279
16415A704995n74553K18078r2923L1553N4380L6315k59889K48537J22706k57465
16405A231734k3109Q8021j82035K05817k14974j74173M45769J210j44242l25333
16395I08685K26395K12190k87791J04026J01297j31782L7241M3027L0444k26641
16385A017091l969j69137K65299m2555L36326j64603j82534K80698m10830j53476
16375G72310L04487J1295q9712N7088P3976k833j34673K41554r1433k60940j61079
$$ y = [1428897, 1721949, 1653777, 1524497, 1670012, 1729179, 1577723, 1749769, 1648363, 1360365, 1411991, 1519832, 1742239, 1201276, 1100992, 1336640, 1697682, 1761206, 1315966, 1333596, 1153678, 1818635, 1551636, 1342450, 1407467, 1179970, 1458223, 1609064, 1530344, 1442716, 1704995, 1130442, 1348520, 1255597, 1287150, 1341530, 1377845, 1117956, 1366493, 1489199, 1231734, 1208625, 1296646, 1114611, 1320428, 1105454, 931281, 1377050, 1378260, 1234018, 908685, 1135080, 1347270, 1059479, 1163505, 1264802, 1133020, 1170261, 1213288, 1243732, 1017091, 1013122, 843985, 1109284, 1066729, 1403055, 1238452, 1055918, 1336616, 925786, 772310, 1076797, 1088092, 998380, 1055468, 1129444, 1126611, 991938, 1233492, 1142059, 881119, 720040]
16364G20040K27960M94241m63706k8735k0411J73710q06q7123j49894J82082p1433
16353I75925j55573L15494m6155L2894k35413L40574m99593J07519o5205M12161
16343A182628l54188o0452j1739L68761l63893N8244K39448O5030k79342J05969
16333I50466J31466k51366P0791j99266Q7930L48622j82911l05926j48618J58634
16323F59822J99644J3055M010J21310k36558N8280P5424m0661k47946k89341K79389
16312E96428J28246J53261l53236O5612J17004O0119j01789O9710q3673J25136
16302G76818K25715k65927j68296M1738J2838K2001K3009N9630p098K80378m98436
16291E02370J24314k8360J54741J88680m67366R1896K03057o3738q1888J67741
$$ y = [720040, 948000, 1442241, 978535, 949800, 929389, 1103099, 1102293, 1015170, 865276, 1047358, 975925, 820352, 1135846, 1089691, 1122585, 887172, 1227746, 728153, 835672, 770467, 1182628, 828440, 767988, 756249, 1125010, 761117, 819361, 1058809, 1123839, 844497, 950466, 1081932, 830566, 901357, 702091, 790021, 1138643, 955732, 649806, 501188, 659822, 859466, 872521, 876531, 997841, 761283, 819563, 894987, 854326, 606380, 317039, 596428, 724674, 877935, 524699, 590311, 707315, 767434, 665645, 735355, 651682, 776818, 1002533, 736606, 568310, 610048, 622886, 644887, 667896, 727526, 720428, 1000806, 502370, 626684, 598324, 753065, 941745, 474379, 566275, 769332, 705594, 623706, 791447]
16281G91447q2809k46778J06169J39905R3785k5794k13288K56950j91192L66155
16271I94550p678D84726J78125j74247P0649J37806O4689P1837k89912j15943
16261D27730k6190M19784l38652J52475J72726j94651J48103k04640J44298A89816
16250B92553L85847M7752q7427J01334K23105j42939k58547J09611o8545j40594
16240D62150r755j9434L24441l04122j93652K77236j18819M2433p8904K0146L5882
16229D37602N1223R6428j01166J42741L1898n8011r6798J08751B63129K67419
16219E30548p6794l3445N1905p3074J95285o460k89438M06894k97494J8873J10083
16208E36883O135n1192j331A72544P4125j17446K42433J54223n4766k30342L68573
$$ y = [791447, 708638, 461860, 568029, 707934, 801719, 775925, 562637, 819587, 628395, 994550, 986872, 484726, 662851, 488604, 559253, 697059, 761748, 833585, 543673, 427730, 401540, 821324, 482672, 635147, 807873, 613222, 761325, 556685, 700983, 189816, 292553, 678400, 726152, 638725, 740059, 963164, 820225, 561678, 671289, 602744, 462150, 452395, 432961, 757402, 453280, 259628, 536864, 418045, 460478, 381574, 401720, 437602, 488825, 585253, 484087, 626828, 658726, 600715, 503917, 612668, 263129, 530548, 453754, 420309, 472214, 399140, 594425, 587965, 298527, 705421, 407927, 426800, 536883, 543018, 491826, 490495, 172544, 246669, 129223, 371656, 525879, 471113, 240771, 609344]
16197F09344J41427j73073B55255A15966L07557r5647l8728J55352r2246j52689
16187A99565L61081j80417j10860L30276k77730L006j12751L6436K81413k16199
16177C13820J03849K1189p2633J48820j02449j52720M0562L1288K2251k4107G5368
16165E61700k32906J33399j01749l3926j561K38154j81146B4743K74212J91605
16155D90560q4083J17275k42892m9026j04795J68940q3632j5394L26922A00747
16144C13285A03841L98719B20430r4309L54906A98751j752n3645a7612a226D26222
16132E81046B58082K65416j57360j25095J37965r7029P7489A12316J26401o5869
16122A72848a01314A89405K17477A03712J99236n1705a9015B23184L8107m1480
$$ y = [609344, 750771, 577698, 255255, 115966, 423523, 327876, 289148, 444500, 352254, 199565, 560646, 380229, 269369, 599645, 321915, 324921, 212170, 248606, 530019, 313820, 417669, 438858, 366225, 515045, 412596, 259876, 300438, 331726, 353977, 329870, 75368, 561700, 328794, 462193, 360444, 326518, 324957, 563111, 381965, 24743, 298955, 490560, 406477, 523752, 280860, 231834, 127039, 295979, 212347, 196953, 523875, 100747, 313285, 103841, 502560, 220430, 126121, 481027, 198751, 196999, 143354, -17612, -1226, 426222, 581046, 258082, 523498, 366138, 241043, 379008, 281979, 359468, 112316, 238717, 172848, -101314, 189405, 406882, 103712, 302948, 251243, -19015, 223184, 261291, 219811]
16112B19811K76147L9331p1815j88309M1204m2036A3997J50189K4028a43180e8469
16100C48025j45256K7882L1472J00369R9318r57k02358G6498J01996B2437K99062
16089C21499N1291h1215A86246M9340K15445j74443M36524B37945Q3146m9778
16079B71313c3882B22847j6175o9926J41500k2023J30092A71305M1730K64569
16069D77604A23887b02608D14414A09982m0669K71742B6547P5900R8328K81130
16059D81905J30291j96014q9474O9241m8I4635J75609C8900E806O4912a18769
16047e5009F57829a6098j53063A68724i1988r630E50831h3204G2679b7754j69805
16036a97559A53330p4785d7046a9183A35588o1361J33008c49333E92143A79707
$$ y = [219811, 495958, 535289, 463474, 275165, 316369, 274333, 13997, 164186, 188214, -143180, -58469, 348025, 202769, 230651, 262123, 362492, 461810, 460853, 258495, 76498, 178494, 22437, 321499, 372790, -81215, 186246, 235586, 451031, 276588, 713112, 237945, 321091, 271313, -33882, 222847, 206672, 136746, 278246, 256223, 386315, 171305, 213035, 477604, 123887, -202608, 414414, 109982, 69313, 341055, 26547, 102447, 200775, 481905, 612196, 416182, 326708, 395949, 395901, 94635, 270244, 38900, 5806, 70718, -118769, -55009, 657829, -16098, -169161, 168724, -91988, -101618, 550831, -83204, 72679, -27754, -197559, 153330, 78545, -47046, -19183, 135588, 74227, 207235, -349333, 592143, 179707]
16025B04632Q496M2552m5522a53004A23392J47779a5310D6523J61089d4773E77046
16013A98878H6912A3508J01792m9264L95657B01133a50432B87116E5966J06562
16003A62528J01285b7599C2464P9120J07096M05345f2637F1057Q3082b43124A52961
15991A71845q4780J60811O8030L9031J60955L18373l3281j2110K2909M4836l09318
15980E47301j65127J45277B51788o8098K17200a73436O5510C18606A47060K1144
15970A68204P4004h6555L2330j7344B92819b303A68710b65058B054g1757B4394
15958B42955f7122b3069j04342A1365M20463E8626i7506B09520B9634b38944B64926
15946b30734B93784n8227h8548K5453A95497F2218J20567C4937J48577O8500F8721
$$ y = [204632, 213128, 255680, 210158, -153004, 123392, 271171, -15310, 46523, 207612, -44773, 577046, 198878, 86912, 13508, 115300, 66036, 461693, 201133, -150432, 287116, 55966, 162528, 263813, -27599, 32464, 111584, 218680, 624025, -62637, 61057, 144139, -243124, 152961, 171845, 87065, 247876, 315906, 354937, 515892, 834265, 800984, 788874, 811783, 856619, 547301, 382174, 527451, 251788, 183690, 400890, -173436, -107926, 318606, 147060, 168204, 242208, -86555, -54225, -71569, 292819, -2303, 168710, -265058, 2054, -71757, 24394, 242955, -67122, -23069, -127411, 11365, 431828, 58626, -97506, 209520, 29634, -238944, 264926, -230734, 293784, 235557, -88548, -63095, 195497, 62218, 182785, 34937, 183514, 252014, 68721]
15934a6973B3581j1459f8513A99729b09726C6971h311B30178R2441h6482C23468
15922G646L34147A56476K2467J91502A15822a82191P713k2533B67912l4028I8655
15910D436J73820a75321H1378L5376b50262F2373K20945b22396E917g4227l318
15899g7545k44007i7104B63279o2230a33261a0620B81398d7000l6584C0497c3760
15887i8742B03496b05095A4669c77471D2272b3680A19748E8831B5868a06746A1471
15875b63231j4125A65154m4749a10024C59823L1827h880B7432a1399p3278A21683
15863b90393A84025n1270c51630k5826G6987P5556a0140p323k58719A73537G3096
15851b7368h742A44262K2116a21550H7963m0258J25169o0079L46286G7365q234
$$ y = [-16973, 23581, 12122, -68513, 199729, -209726, 36971, -8311, 230178, 322619, -86482, 323468, 7646, 341793, 156476, 178943, 370445, 115822, -182191, -174478, -197011, 267912, 233884, 98655, 4436, 178256, -175321, 81378, 116754, -250262, 62373, 283318, -222396, 5917, -74227, -77545, -321552, -97104, 263279, 201049, -133261, -10620, 281398, -47000, -83584, 30497, -33760, -98742, 203496, -205095, 14669, -377471, 42272, -23680, 119748, 58831, 25868, -106746, 11471, -263231, -277356, 165154, 120405, -110024, 359823, 391650, -8880, 27432, -11399, -84677, 121683, -290393, 184025, 132755, -351630, -377456, 76987, 152543, -10140, -17463, -276182, 173537, 73096, -27368, -8742, 144262, 166378, -121550, 87963, 47705, 172874, 112795, 459081, 77365, 69131]
15840F9131B9806J37387c3766A8957Q6152n1951g1076j08503P1743k1388I4252
15828B23928H2909K4700D9185J01757b42394I0055A1263J25749m3173b63314A15857
15816B07707r8795c04256n4901b2542B9486b44805A9919K47110A8049b65789f6125
15804b23473j83557H0506B2756J62513c07315I6520O8882J06574A25238d5081
15793A90857e2298k5228A698a84923F0560B2721b11874Q7278a5683D0109K06042
15782B46151M9127A26566a53580C7303M85567F5126h435q200H2548c10547A64430
15770C44089A16251a21111b0099k23581L6202E9737N9706c2368C42185I0782O3558
15759A54340b9556D6673Q8416R6122d7263F4986a5094C4342R3249k5453B0763
$$ y = [69131, 29806, 167193, -33766, 18957, 105109, 53158, -71076, -179579, -107836, -129224, 94252, 223928, 82909, 107609, 49185, 150942, -242394, 90055, 11263, 137012, 93839, -263314, 115857, 207707, 108912, -304256, -359157, -22542, 29486, -244805, 19919, 267029, 18049, -265789, -66125, -223473, -407030, 80506, 22756, 185269, -307315, 96520, 165402, 271976, 125238, -45081, 190857, -52298, -77526, 1698, -184923, 60560, 22721, -211874, -124596, -15683, 40109, 246151, 295278, 126566, -153580, 37303, 522870, 65126, -8435, -16635, 82548, -310547, 164430, 344089, 116251, -121111, -20099, -243680, -207478, 59737, 119443, -32368, 342185, 90782, 154340, -29556, 46673, 135089, 231211, -47263, 64986, -15094, 34342, 127591, 102138, 20763]
15747B29170K9605m8733q6897l5066a02026C06541A2265h9939A07392i1025C0289
15735e2265A17757K21362a712k3324G4408i863j09231N8986C68629a95797B19637
15723B68485H4010b82446B53039r3354K7718c33724c8529k45036a02440L0346
15713g2094B87287a40868O9048B06707a11660B43947p9834k9074e4946q8745I0972
15701H3303f9819A05756b2972B82709a69785A51254b5497I965B574K20751B7457
15689a91026h7335J844C7891a03363A07532a0763A29265N3301H7497g412l0216
15678c7628D1992a7358B96178B3808K7245J9386J53504b95475I3941J79307k8275
15667B44973a58171L8421e0959n3122B49326a36082M3706K7277P587A63312a50219
$$ y = [229170, 258775, 210042, 123145, 88079, -102026, 306541, 12265, -89939, 107392, -91025, 30289, -52265, 117757, 339119, -1712, -25036, 74408, -9863, -119094, -60108, 368629, -195797, 219637, 268485, 84010, -282446, 253039, 159685, 187403, -333724, -38529, -283565, -102440, -72094, 287287, -140868, -71820, 206707, -111660, 243947, 164113, 135039, -54946, -143691, 90972, 83303, -69819, 105756, -22972, 282709, -169785, 151254, -25497, 9965, 2574, 223325, 27457, -191026, -87335, -85491, 37891, -103363, 107532, -10763, 129265, 182566, 87497, -7412, -37628, 41992, -17358, 296178, 23808, 51053, 70439, 223943, -295475, 93941, 273248, 244973, -158171, -119750, -50959, -104081, 249326, -136082, -92376, -65099, -57512, 163312, -150219]
15655E8860r111a33354B29842f006j03055d4463B30807a25903A81959Q636L41963
15644E32558A7378h8624j02146P5788A04383i8778o3237l36682c3934B05765l147
15633B02618h7312q0443E421K38667C2787b37949a05665A00355c42539A88086
15622a22860n7150g9102b1754j66453B1360P3154a69637g0096C20498f8106B2831
15610C7308a44305P29j11471r3345D1152J31544b11311B09051o5496g2842j64246
15599b37088L4410A70162C3355a35392L2704C6058J31561b51653e9816E0784b18926
15587g883A38721a68757c1247j69652c5799C4021a97805i8306o1966a2233j25868
15576a38101N2937I5703j0687A4128h5308m30954H4862b92540D3664d0669D610
$$ y = [58860, 49749, -133354, 229842, -6006, -109061, -44463, 230807, -125903, 181959, 190595, 532558, 17378, -88624, -190770, -114982, 104383, -98778, -162015, -498697, -33934, 205765, 202618, -87312, -167755, 5421, 244088, 32787, -237949, -105665, 100355, -342539, 188086, -122860, -180010, -79102, -21754, -188207, 21360, 94514, -169637, -70096, 320498, -68106, 22831, 37308, -144305, -143576, -255047, -348392, 41152, 172696, -211311, 209051, 143555, -72842, -237088, -202678, 170162, 33355, -135392, -102688, 36058, 167619, -251653, -59816, 50784, -218926, -7883, 138721, -168757, -31247, -200899, -35799, 34021, -197805, -98306, -160272, -12233, -138101, -85164, 95703, 85016, 14128, -85308, -516262, 84862, -292540, 43664, -40669, 4610]
15564D1310N2493a05826E7257A7259D613J88325C7632b7513E0638P2681F1251
15552i7105q2735M2918a9671H6402a79201D55288a02549p2686B63172a53419A53332
15540A25571a26666k36562a19895a616A7824K81666i3982L3083A24026a35784
15529C38157A61147L7871o8065f1079O753A77360C4061J85064d5112C10593p8252
15518B32341N8193F0290L19815J18475a80089C14350J25451I5393J68012j09802
15508A53603B7574M7519L2037J5332A428a01090d8885m4255A67098l9677b0902
15496F3035b9526A71846a60725A95544I4813i4976B30736b35391a0686A51048
15485a25660a3049o683D52398k23127G0139R1048Q9958j22260J83582Q3963l8752
$$ y = [41310, 93803, -105826, 57257, 17259, 4613, 192938, 37632, -27513, 50638, 123319, 61251, -97105, -179840, -136922, -19671, 86402, -179201, 455288, -102549, -175235, 263172, -153419, 153332, 125571, -126666, -363228, -119895, -1616, 17824, 299490, -93982, -60899, 124026, -135784, 338157, 161147, 199018, 130953, -61079, -54326, 177360, 34061, 219125, -45112, 310593, 232341, 290534, 60290, 380105, 498580, -180089, 314350, 439801, 95393, 263405, 153603, 27574, 75093, 107130, 122462, 1428, -101090, -48885, -93140, 167098, 127421, -20902, 63035, -29526, 171846, -160725, 195544, 94813, -94976, 230736, -235391, -10686, 151048, -125660, -13049, -19732, 452398, 229271, 70139, 161187, 251145, 128885, 312467, 396430, 357678]
15474C57678K00061K5163B87028R4197b1524k58302B29285N6116B6349Q6385O9900
15463A82634J83309G622c8801p1766A90427b0570A96144P7094J8371H6085b59481
15451a95406A25874i0962B8886K22827A3697L16632M42343k99514J51893L18773
15441I43824m42694p1358A54627Q2927j16096J49072c8963j90433A20971h2103
15430C02484b51633C32954j29600Q0907I0912B7365L09018J34298a88005F5214
15419C1836N7223c22318B29973J23120b18162g7718J5672D7796N3733a05669j92002
15408b97671a25681E9499g5546A7852e7781j39758I459J19160L7646c604A08254
15396A35658A8916P888a4609B03466D0651K8102P0424c20146A22378a88825C06433
$$ y = [357678, 557739, 582902, 287028, 381225, -21524, -279826, 229285, 285401, 26349, 112734, 182634, 365943, 7622, -38801, -110567, 190427, -20570, 196144, 273238, 291609, 86085, -259481, -195406, 125874, -90962, 28886, 251713, 13697, 330329, 772672, 473158, 625051, 943824, 501130, 429772, 154627, 237554, 121458, 270530, -38963, -229396, 120971, -82103, 302484, -251633, 332954, 203354, 284261, 90912, 27365, 336383, 470681, -188005, 65214, 31836, 89059, -322318, 229973, 353093, -218162, -77718, -62046, 47796, 101529, -105669, -297671, -125681, 59499, -75546, 17852, -57781, -197539, 9459, 128619, 166265, -3604, 108254, 135658, 18916, 26804, -14609, 203466, 40651, 68753, 139177, -320146, 122378, -188825, 306433]
15384C06566h4361b7081F8695b00125A33086k5852J41236G7444K13914e2916A2030
15372D71104f5259C42588M3781j05445G0610c258B77918j26275O3104C3031L6729
15361F9760a90172D01471n9646l0418B5448K21703c7245E9383K9999j3097B5111
15349b46257a17480E8761a67342C2620O4536J7942i7022D19216m1990k7389Q8641
15338D38478a14054E50101e386C5784K7014J19092d3298A26264i819j8162G1188
15326d2866D0112g2851A54297J25367c4936C21795a51121E2043J34180D2639P3005
15315A15644K40848G3101R8062H5532D1305J68832E8927K37615m6244L9518C7454
15303i7388l16148A01297C668b00856H6746L0349C7084K41672a99976g5627p8755
$$ y = [306566, -84361, -27081, 68695, -200125, 133086, 107234, 248470, 77444, 291358, -52916, 12030, 471104, -65259, 342588, 386369, 280924, 70610, -3258, 277918, 151643, 214747, 33031, 69760, -190172, 401471, 341825, 311407, 25448, 247151, -37245, 59383, 89382, 76285, 25111, -246257, -117480, 58761, -167342, 32620, 97156, 115098, -97022, 419216, 377226, 349837, 438478, -114054, 550101, -5386, 35784, 62798, 181890, -43298, 126264, -9819, -27981, 71188, -42866, 40112, -72851, 154297, 279664, -34936, 321795, -151121, 52043, 186223, 42639, 115644, 356492, 73101, 171163, 85532, 41305, 210137, 58927, 296542, 250298, 289816, 37454, -97388, -413536, 101297, 3668, -200856, 86746, 117095, 37084, 278756, -199976, -75627, -154382]
15292a54382a6958C63572a39875D6253K37440D5930a64419a7371A84948Q0593
15282B65541a16079B2023K69831A02320R5700G3548M663L2773a55240M2620A93082
15270c8535A41264g0840A45039a32127c9995A17262a36769F4591l0952J21538
15260A55177b65612D8142J27261L0824B6807d44358A34747h0819I9479a447j461
15249b908F2083k8393a04807B63236l9859m2686P25186J027371p50175M36064
15239A619137L8688G78246C56736B4524h4165j54578A71716a93193i0631C42401
15228A1300K34584J32824c2181B18258k5003d3358k01086f3129k2710D1525R5751
15217A37276c1768k2452B47453o5724c30810H624K74835k4250d20575J85604I5004
$$ y = [-154382, -16958, 363572, -139875, 46253, 283693, 45930, -164419, -17371, 184948, 265541, -116079, 22023, 291854, 102320, 198020, 73548, 78211, 110984, -155240, -112620, 193082, -38535, 141264, -70840, 145039, -132127, -39995, 117262, -136769, 64591, 33639, 155177, -265612, 48142, 175403, 206227, 26807, -444358, 134747, -80819, 99479, -1447, -2908, 62083, 33690, -104807, 263236, 223377, 180691, 905877, 1933248, 1183073, 1619137, 1657825, 778246, 356736, 24524, -84165, -238743, 171716, -193193, -90631, 342401, 11300, 245884, 378708, -32181, 218258, 193255, -43358, -244444, -63129, -85839, 41525, 137276, -31768, -54220, 247453, 181729, -330810, 8624, 283459, 259209, -420575, -234971, 95004]
15205a21095C5110a08649E0306a17114E6709K02540a9702A64346d9456A39459
15194a17864A01917J34769A10981P4578b593k07963C25335d56202B2953J5786
15184C8739L1970A608J45567a87590A91821a9410o2530A71294G1664K56506G6849
15172E0938J99362g5582a5609j52723I3775a92583G4029R4578e8176k7551B6250
15160H4165c01567C71576C8586i116G6612l2342L24449b52950A16463Q2130Q5772
15149B84365f0100B43362B1984J292O5845a61040k0008C16915A4473j953i9698
15137B38379M7502G3355J90525c6308F8522J42979A05255B2203K31024B5544K84262
15126C09806E4972l266J43692N020A5321J06880l4818r40K60959l8116M07561
$$ y = [-121095, 35110, -108649, 50306, -117114, 56709, 259249, -19702, 164346, -49456, 139459, -117864, 101917, 236686, 110981, 185559, -2593, -210556, 325335, -456202, 22953, 38739, 70709, 1608, 147175, -187590, 191821, -19410, -81940, 171294, 71664, 328170, 76849, 50938, 250300, -75582, -15609, -168332, 93775, -192583, 74029, 168607, -58176, -85727, 26250, 84165, -301567, 371576, 38586, -9116, 76612, 44270, 368719, -252950, 116463, 198593, 284365, -60100, 243362, 21984, 23276, 89121, -161040, -181048, 316915, 14473, 12520, -99698, 238379, 285881, 73355, 263880, -36308, 68522, 211501, 105255, 22203, 253227, 25544, 309806, 54972, 51706, 195398, 200418, 15321, 122201, 87383, 86443, 347402, 309286, 716847]
15115G16847f0508A40522q444R1213c67k10487C8977a6413D93389A37077b53489
15103B26634k5747O0300E1690j6013J04701J76116I8336i6535n4299A9002J53782
15092A72784A3881g3752o6390f417A37471b8821B29341J7298j672b98085A75085
15080a18246A6839L3642K00226R1317h3421C6184b4888F15126j68767A97977K08506
15069D06483l5011b215D3255i6106H7672L72409G5484b8267B52163n5105r0149
15058A06909O5621o936L6800J59974E7333L12832r4497o2977L56351a18696C24532
15046C71556J78877p5447A69304J34174H7259J08349K76756k20360L18699j48443
15036D22260A66257J98079A53666Q7192J48056L95474C69447K40923j50298m9874
$$ y = [716847, -60508, 140522, 132078, 223291, -367, -210854, 38977, -16413, 493389, 137077, -253489, 226634, 200887, 261187, 51690, 35677, 140378, 316494, 98336, -96535, -150834, 19002, 172784, 13881, -73752, -140142, -6417, 137471, -28821, 229341, 246639, 244967, -298085, 175085, -118246, 16839, 50481, 250707, 342024, -83421, 36184, -24888, 615126, 446359, 197977, 406483, 371472, -2215, 43255, -96106, 87672, 460081, 75484, -28267, 252163, 197058, 106909, 172530, 165594, 202394, 362368, 57333, 370165, 275668, 212691, 569042, -118696, 324532, 371556, 550433, 474986, 169304, 303478, 87259, 195608, 472364, 252004, 570703, 422260, 166257, 364336, 153666, 240858, 388914, 784388, 369447, 610370, 460072, 410198]
15026D10198J51032j71960q9142j7614A7100J43465K62166j77551J24061J79979
15016E49220j44177j98117Q5156R355K632B4392N96824B87788P0546J43191F8166
15004C84171L9988B0599L14806j61470L0400J59130N5086A53575L78814q3132
14994D49257J25442j46879k10692j9792J99511J46450J97847J7642C72861M7180
14984D20041j67555J53633J84997J65974k69146K59725k29629J20078m0892j77418
14974D19808E5393L94674k2307P7677k23959M26034C16672J80920n865j66441
14964C25286A34135F1218N4506J96821h086C80154j11723E8921L00742K58788
14954F18451l9964A9821J63992L25908A49230M65482k70056K39834k46787L83109
$$ y = [410198, 561230, 389270, 300128, 282514, 17100, 160565, 422731, 245180, 369241, 549220, 405043, 206926, 292082, 301437, 304069, 24392, 621216, 287788, 358334, 501525, 68166, 384171, 424159, 20599, 335405, 173935, 204335, 363465, 418551, 153575, 532389, 449257, 574699, 427820, 217128, 197336, 396847, 543297, 741144, 758786, 372861, 420041, 252486, 406119, 591116, 757090, 487944, 747669, 518040, 638118, 597226, 419808, 55393, 450067, 427760, 505437, 281478, 707512, 316672, 497592, 491727, 325286, 134135, 61218, 115724, 312545, -8086, 380154, 268431, 58921, 359663, 618451, 578487, 19821, 183813, 509721, 149230, 614712, 344656, 584490, 337703, 720812]
14944G20812j73364j67354J63957m4628j88985j17766N4157A9709M35981K86924
14934G42614A60041M99760J10667K14484p7417J73327k22359L94747l34216M48319
14924A367353n6674K5123m08675K07501M50957O433K02912k1826l19740j00281
14914A353083n23532O0362k56772k16556j39634J6170N8036A47394J60639K27638
14904E35671j25377n0015o3739A8109M62315j01724m5407O7808P8807J8806M1727
14893E40441j73274A19961L48727j25798J40968J54387p6616J9404j8117P2953
14883F35869m2672k04063J05062K9638k17896L97403J74434l80458k8197B28753
14872C71374q5805P72k7617L08724q7329L10016j3589J0901B43551L69852l06514
$$ y = [720812, 547448, 380094, 544051, 499423, 310438, 192672, 246829, 19709, 455690, 742614, 160041, 659801, 770468, 984952, 907535, 1080862, 858503, 1253250, 919034, 1367353, 1310679, 1335802, 927127, 1134628, 1585585, 1592018, 1794930, 1773104, 1453364, 1353083, 829551, 889913, 633141, 416585, 276951, 293121, 351157, 147394, 308033, 535671, 410294, 360279, 296540, 18109, 480424, 378700, 333293, 401101, 479908, 498714, 540441, 367167, 119961, 468688, 342890, 483858, 638245, 561629, 581033, 562916, 635869, 593197, 389134, 494196, 523834, 305938, 703341, 877775, 497317, 469120, 228753, 371374, 285569, 286341, 258724, 567448, 480119, 790135, 776546, 787447, 243551, 613403, 306889]
14861C06889L9354K83429J31405A74682J24935J87827A67630o478K11726j35836
14851B37042R3621M40051B63291J49375J02573j8025A86137M80843N7795J77414
14841I02189M9477K74642n15251k8623l27513L38565l33180K81706J25847C05082
14830G02241B24932K81631j82072J89176k35173L61615k69312J38734J2701j0498
14820E11734l7348L23509k51678j4775q8369J12709K46130j92439c9157H76834
14809D70267K37r6817L40228n0053K18211j45758m8408O9521J40172B64168L73689
14798F37857P6373k13597K30264j08390K4556j43044j14433M55601B40649J00398
14788C41047M26369l76630j85036L91050k07967K42443R025k75737M12879j71935
$$ y = [306889, 346243, 629672, 761077, 174682, 299617, 487444, 167630, 161152, 372878, 237042, 330663, 770714, 263291, 412666, 515239, 497214, 186137, 666980, 724775, 902189, 951666, 1226308, 711057, 682434, 354921, 693486, 360306, 642012, 767859, 305082, 702241, 224932, 506563, 324491, 513667, 278494, 640109, 370797, 509531, 522232, 511734, 474386, 797895, 546217, 531442, 443073, 555782, 801912, 609473, -39157, 876834, 470267, 470504, 373687, 713915, 663862, 882073, 736315, 687907, 757428, 897600, 264168, 637857, 714230, 500633, 730897, 622507, 647063, 504019, 389586, 845187, 240649, 341047, 767416, 390786, 205750, 596800, 388833, 631276, 640301, 364564, 777443, 605508]
14778F05508p0118J11970J39870J10920j99649L29222p6847C20551M35585k82439
14768D73697j3676J43393K33827j29279k66337P1005J44239i980D43426N6437
14758D99863M7074A48290K25153M32590j20514o8438r3394k61360J78961J47274
14748E88562k83994K20254N2572K36690j07946j07717K8634n5466k23469P6529
14738D24649J85758k66792M1366N46282D06608L59868Q6133k05532L15342Q1026
14728A043445r3201M3776K59403M7159q0094N2423K2444m47818k3909j88214j16955
14717E18459L59548j54380j22261j2286M9329K49162j85419k26942M03097m2206
14707H36101q1175K29604O7713J18365q1564L18870j28151R5850K74550r8583
$$ y = [605508, 535390, 647360, 787230, 898150, 698501, 1027723, 950876, 320551, 756136, 473697, 460021, 603414, 837241, 707962, 441625, 512630, 656869, -9980, 443426, 499863, 546937, 148290, 373443, 806033, 685519, 617081, 523687, 262327, 441288, 588562, 304568, 524822, 577394, 814084, 706138, 598421, 627055, 571589, 348120, 424649, 610407, 343615, 384981, 931263, 406608, 766476, 852609, 647077, 962419, 1043445, 950244, 994020, 1253423, 1300582, 1220488, 1272911, 1295355, 847537, 823628, 635414, 518459, 878007, 723627, 601366, 589080, 638409, 887571, 702152, 475210, 878307, 836101, 754926, 984530, 1052243, 1170608, 1089044, 1407914, 1279763, 1375613, 1650163, 1551580]
14697A551580j95674k73813Q8314q6607j97108M1256m01327J08954Q1670J04675
14687H21920K08642r3220l72286M30958r0079K9054r6913k73251J30992P4079
14677G69896N4204m7858M0756j50324O1081J63072Q3848L6309m13728J00323J89707
14666H87286j43835M73189k55584j38303J5670j86815P388L04766j45283N1095
14656H69574O1259L88133m43248K75302P7539l44589J16458q7036N6127L45281
14646A314800m14565J13466K81452j71934j41970n8482K76814l14749J98077k09476
14636H73433M37782k92901j17602L48055q3750k27786q4114L52695M5808q755
14626A242865J26974n19707K70733O6201l08825O4908M37000J13210n1675k18427
$$ y = [1551580, 1355906, 1082093, 1170407, 1083800, 886692, 927948, 526621, 635575, 717245, 821920, 1030562, 937342, 565056, 996014, 905935, 934989, 838076, 564825, 695817, 769896, 824100, 776242, 816998, 666674, 727755, 890827, 974675, 1010984, 597256, 697579, 887286, 743451, 1216640, 961056, 822753, 838423, 651608, 658996, 963762, 818479, 869574, 930833, 1318966, 875718, 1151020, 1228559, 883970, 1000428, 913392, 969519, 1314800, 900235, 1013701, 1295153, 1123219, 981249, 922767, 1199581, 884832, 1082909, 873433, 1311215, 1018314, 900712, 1248767, 1165017, 937231, 853117, 1205812, 1251620, 1242865, 1369839, 850132, 1120865, 1187066, 878241, 943149, 1380149, 1493359, 1441684, 1223257]
14616A223257n4909O738J60155J86188l57280J24899j0536K7459K44002l78779
14606A171194N5270R3898j73948K34886J8155k21718j58884L08383j09897K3397
14596A240736K32634j42204m8487R2282j15884J83564k8100l3978K17377J15320
14586A713260j88714K40498l82229L82941j94479l8046k1027K48084l9493l75928
14576A344867J05141L66576j39116q7523o6754K17072K41353j40438j22652r3506
14566A625020N85359j81279j03186j81543P8332K43629l3124O7718L4551J94917
14556B330394M2971K25437L49999R0203J93221N12162M81482J278618K903022
14547H407509Q047122K0272835K421838A8010262q491276m068500k237473q40058
$$ y = [1223257, 1168348, 1175086, 1335241, 1521429, 1164149, 1289048, 1278512, 1305971, 1549973, 1171194, 1226464, 1320362, 1146414, 1381300, 1399455, 1177737, 1018853, 1327236, 1217339, 1240736, 1473370, 1331166, 1282679, 1374961, 1259077, 1442641, 1414541, 1380563, 1597940, 1713260, 1524546, 1765044, 1382815, 1765756, 1571277, 1533231, 1512204, 1760288, 1720795, 1344867, 1450008, 1816584, 1677468, 1589945, 1523191, 1740263, 1981616, 1841178, 1718526, 1625020, 2210379, 2029100, 1925914, 1744371, 1822703, 2066332, 2033208, 2100926, 2135477, 2330394, 2373365, 2598802, 2948801, 3039004, 3232225, 3744387, 4225869, 5504487, 8407509, 16454631, 36727466, 39149304, 18010262, 9518986, 5450486, 3213013, 2372955]
14539B372955M52827K345329j577683j353447R5944o80872J25082q669L69309
14530B140775l42514J96496Q4921j63950j0638J97021l72051K23671J8366J69015
14520B141112p1066j07057N42434m78563J26236n9682q5071K08351N22883o27067
14510B112510L66566J7160P3050k31828K63594Q5111m23633K68027k08580J35514
14500B457491l2583L78375j33916r6650J87857L29546n31437N97942m33010r8825
14490B624790O80839n27991J16599J21448j34577J56007J78048k77344L64878
14481C302697n6199j9358j31760L91582k30770J57387j3585J71674j02731m176
14471C464761k54010L30995k9963j4765R7809K35548p570r9628j89584K79448
$$ y = [2372955, 2825782, 5171111, 3593428, 2239981, 2335925, 1655053, 1780135, 1771466, 2140775, 1798261, 1994757, 2079678, 1915728, 1905090, 2102111, 1730060, 1953731, 1972097, 2141112, 2070046, 1962989, 2505423, 2026860, 2153096, 2093414, 2008343, 2216694, 2739577, 2112510, 2479076, 2496236, 2569286, 2337458, 2601052, 2686163, 2262530, 2530557, 2321977, 2457491, 2424908, 2803283, 2669367, 2572717, 2760574, 3090120, 2558683, 3156625, 2723615, 2624790, 3305629, 2777638, 2894237, 3015685, 2881108, 3037115, 3215163, 2937819, 3302697, 3246498, 3227140, 3095380, 3486962, 3256192, 3413579, 3399994, 3571668, 3468937, 3464761, 3210751, 3541746, 3511783, 3497018, 3594827, 3830375, 3822805, 3723177, 3533593, 3813041]
14461C813041l0159N3362J81831r7017K15362J28172K42671l32161J50697J20831
14451D446630j3688K6153k50361L49524k00688M64301j50953K7320K20446n0816
14441D867868J1239J97117Q1415O0095j04980L42041O3223k00275J69703l9492
14431E447954K28702J14957P3912O6444q7785Q5572J03062K34090j48894L64205
14421F482219J80800K72678k06323n5255J81332j22607J72865N28699n21837M51599
14411G364170q885K01465j43452Q21723l21749M41948l78141M39897m75306M65252
14401H406922J48281j82115L37384L68638k50987K71391L01168R0631K61414K05494
14391I958221J3208L93999l90731O69434M5083J80936M49704q2202K71428K86402
$$ y = [3813041, 3782882, 3836244, 4018075, 3921058, 4136420, 4264592, 4507263, 4175102, 4325799, 4446630, 4432942, 4459095, 4208734, 4558258, 4357570, 4821871, 4670918, 4698238, 4918684, 4867868, 4879107, 5076224, 5157639, 5217734, 5112754, 5454795, 5518018, 5317743, 5487446, 5447954, 5676656, 5791613, 5865525, 5931969, 5844184, 5929756, 6032818, 6266908, 6118014, 6482219, 6663019, 6935697, 6729374, 6674119, 6855451, 6732844, 6905709, 7434408, 6912571, 7364170, 7355285, 7556750, 7413298, 8235021, 7913272, 8355220, 7977079, 8416976, 7941670, 8406922, 8555203, 8373088, 8710472, 9079110, 8828123, 9099514, 9400682, 9491313, 9752727, 9958221, 9971429, 10365428, 9974697, 10644131, 10689214, 10870150, 11319854, 11237652, 11509080, 11795482]
14381A1795482L22538K48898L4698j19844J97376L49615M31792K55678J72991
14372A3689224J79195M18925N19429Q789N77791K16199M70453k33887N91298N85714
14362A7023130J98224J33290P33867K33236O06488K46726O82775j18819M80071
14353B0218988R89623K61198N95984M30664N81762P62224Q43233K13223Q67418
14344B5764317N16478P57185O04589O73959N75336J254137O22031P75169R47655
14335C2490856J254278R42120J079570O22452J144826J339955J322274J279943
14327D1476274J304339J333139J360522J730465J929202J295000J736698J427575
14319E3593214K610963J569598K294447J893744K576687K240864K913561K724589
$$ y = [11795482, 12118020, 12366918, 12401616, 12281772, 12479148, 12828763, 13260555, 13516233, 13689224, 13868419, 14287344, 14806773, 14815562, 15393353, 15609552, 16080005, 15846118, 16437416, 17023130, 17221354, 17354644, 18088511, 18321747, 18928235, 19174961, 19857736, 19738917, 20218988, 21208611, 21469809, 22065793, 22496457, 23078219, 23840443, 24683676, 24896899, 25764317, 26280795, 27037980, 27642569, 28316528, 28891864, 30146001, 30768032, 31543201, 32490856, 33745134, 34687254, 35766824, 36389276, 37534102, 38874057, 40196331, 41476274, 42780613, 44113752, 45474274, 47204739, 49133941, 50428941, 52165639, 53593214, 56204177, 57773775, 60068222, 61961966, 64538653, 66779517, 69693078, 72417667]
14311G2417667K858506L252292L171371M099480L361501L970534M112685M852951
14303A02096987M696764N280463N507781N759275N908079O706160P005058P211583
14295A50172150Q522986Q239279R108918R819053J0249835J0830109J1592333
14288B18534663J2160545J3007141J3650995J3994507J4398095J5130187J5688144
14281C16564277J5639027J6094223J5513044J5123503J4663992J3730378J2116943
14274D19445387J0905767Q443566N087110J158916j630292k837632p106983m487738
14266D28978101l525824o273938q642157j0277912j3767005j5507007j6213004
14259C54771254j6180469j6025390j5934019j5477985j5023411j4340689j4147948
$$ y = [72417667, 75276173, 78528465, 81699836, 85799316, 89160817, 93131351, 97244036, 102096987, 106793751, 112074214, 117581995, 123341270, 129249349, 135955509, 142960567, 150172150, 158695136, 166934415, 176043333, 185862386, 196112221, 206942330, 218534663, 230695208, 243702349, 257353344, 271347851, 285745946, 300876133, 316564277, 332203304, 348297527, 363810571, 378934074, 393598066, 407328444, 419445387, 430351154, 438794720, 443881830, 445040746, 443410454, 440572822, 433465839, 428978101, 425452277, 419178339, 410536182, 400258270, 386491265, 370984258, 354771254, 338590785, 322565395, 306631376, 291153391, 276129980, 261789291, 247641343]
14252B47641343j3050700j2627942j2290694j0918537q502955j0210542r120746
14245A70919227r094020p863419p483547p795086o730510o266508n964223n014197
14237A14707717n477433m986822m749079m290336m240740l662471l292787l477742
14229H0530307l378495l213829k597974l278901k492934k321400k720248k322182
14221E8204344j506282k215288j978350j586769j748514j785284j736367j192488
14213D4455002j021626j670920j443788j039541j445982q73481q25584r78010
14205C5156070j694221m78235j022408j155058n85878m92740j148513p18226p88659
14196B7072132o90583p53690n38134r14155k38101p58078m57663o14963p00839
$$ y = [247641343, 234590643, 221962701, 209672007, 198753470, 190250515, 180039973, 170919227, 161825207, 153961788, 146478241, 138683155, 131952645, 125686137, 119721914, 114707717, 109230284, 104243462, 99494383, 95204047, 90963307, 87300836, 84008049, 80530307, 77151812, 73937983, 71340009, 68061108, 65568174, 63246774, 60526526, 58204344, 56698062, 54482774, 52504424, 50917655, 49169141, 47383857, 45647490, 44455002, 43433376, 41762456, 40318668, 39279127, 37833145, 36959664, 36134080, 35156070, 33461849, 32983614, 31961206, 30806148, 30220270, 29727530, 28579017, 27860791, 27072132, 26381549, 25627859, 25089725, 24175570, 23937469, 23179391, 22721728, 22106765, 21405926]
14187B1405926q4166p05323m80423j54206p43471m83221m91828R9667o15372j67449
14177A7580134o51708l29025p7630o01599k47239j27432l43997m57929l80383
14168A4363192p6161k78284l80920j27061k09421m44438k81010K50223l58542
14159A2457578r8396j90268m02851l32657j09909j78000j97504k14290o31346
14150A0102357J32864l89652q1779m2467K0698m70686L43314k83546p8637J32970
14140I385436o05681M2401l32666N7594l64159N0779k51065P0866j80361J13553
14130G986697m58929j84210m5471K74785m43587l2770J62464m47193o749j93313
14120F611724n3358L5185j94297j48412J55281j43914J73574o09815R8115J20432
$$ y = [21405926, 21321760, 20616437, 20136014, 19981808, 19238337, 18755116, 18263288, 18362955, 17747583, 17580134, 16928426, 16599401, 16521771, 15920172, 15672933, 15545501, 15201504, 14743575, 14363192, 14287031, 14008747, 13627827, 13500766, 13291345, 12846907, 12565897, 12816120, 12457578, 12359182, 12168914, 11766063, 11433406, 11323497, 11145497, 10947993, 10733703, 10102357, 10235221, 9845569, 9763790, 9721323, 9742021, 9271335, 9614649, 9331103, 9252466, 9385436, 8779755, 8822156, 8489490, 8547084, 8182925, 8233704, 7982639, 8053505, 7873144, 7986697, 7527768, 7343558, 7298087, 7572872, 7129285, 7096515, 7258979, 6811786, 6805037, 6611724, 6558366, 6593551, 6399254, 6250842, 6406123, 6262209, 6435783, 5825968, 5924083, 6044515]
14110F044515o2834j88370J3685k61777j63951k07395L99741j71231j64765J51536
14100E389154l50702K11659L1804l98213Q3677n82130K87150j6771J02112n7323
14090D700417J51227j52049l01378k21381p9726J50508j22879M40187o08871Q7534
14080D043589N3856j58980p0084Q201k18306P7975l77421N94609p3379j60562
14070C719498k5234j72592n9440L35078n49407L40989l04885K91368l6912k44412
14060C294051J62636J10052j66124J29364l89785Q5073l55762L63626J92131m14231
14050C011031j02701J86425k12633k06465L18692j91790J83187m63102K34073
14041B756717l1774p4803J34001k93718J53183l18866R6755K51996O59k59716
$$ y = [6044515, 5981681, 5793311, 5806996, 5545219, 5381268, 5173873, 5573614, 5402383, 5237618, 5389154, 5038452, 5250111, 5281915, 4883702, 4967379, 4385249, 4672399, 4655628, 4757740, 4700417, 4851644, 4699595, 4398217, 4176836, 4097110, 4247618, 4124739, 4564926, 3956055, 4043589, 4097445, 3938465, 3868381, 3876582, 3658276, 3736251, 3358830, 3953439, 3880060, 3719498, 3694264, 3521672, 3462232, 3797310, 3247903, 3588892, 3284007, 3575375, 3538463, 3294051, 3456687, 3566739, 3400615, 3529979, 3140194, 3225267, 2869505, 3233131, 3425262, 3011031, 2908330, 3094755, 2882122, 2675657, 2994349, 2802559, 2985746, 2522644, 2756717, 2724943, 2650140, 2784141, 2490423, 2643606, 2324740, 2421495, 2673491, 2674150, 2414434]
14031B414434O35400l31344j30509l6282k36551J46423j88953q2447O7435j67894
14021B089712K92279M7567n37802K17213j33654L47091j62622l59011L32644j14152
14011B019265J26538k017l57855L63090m81732L827K65670J59442l81448p0128
14001A644652o973L54553j66966O0649l40982J02383L7693j91760L37749j00610
13991A730388j53914K18814N77318J149767N371411J7666150J6737954j8033112
13983B5264776j1054609n019051l177250j412783j012170n17634J05203n40532
13975B635950J7405k17585j15113J95174l38717j35156k0429k47504J55378k71127
13965A658276J41961J09020L08447o8390n07213O8304l9456j5892J70390r2693
$$ y = [2414434, 3049834, 2718490, 2587981, 2551699, 2315148, 2461571, 2272618, 2190171, 2257606, 2089712, 2381991, 2429558, 1891756, 2108969, 1975315, 2322406, 2159784, 1800773, 2133417, 2019265, 2145803, 2143786, 1785931, 2149021, 1667289, 1671116, 1936786, 2096228, 1714780, 1644652, 1637679, 1992232, 1825266, 1885915, 1544933, 1647316, 1685009, 1493249, 1830998, 1730388, 1576474, 1795288, 2372606, 3522373, 8893784, 26559934, 43297888, 25264776, 14210167, 9191116, 6013866, 4601083, 3588913, 3071279, 3176482, 2635950, 2653355, 2435770, 2320657, 2515831, 2177114, 2041958, 2021529, 1774025, 1929403, 1658276, 1800237, 1909257, 2217704, 2149314, 1642101, 1710405, 1670949, 1655057, 1825447, 1732754]
13955A732754j86757K28328j92377m729j46142J97391R7163n6988J79389m23600
13945A424432Q8329M4052j21899K05776p7248k42649K55028k55108q1917J50478
13935A389274j02433L66175j49081q2521o1541q2375K74101l02222L11146l19912
13925A240611K48514j84616J63186m84280N37355n5189o1645l39748J82283j93898
13915A052573J0999k5481M52722p14562L94870P9449j62015K61305m5198k23876
13905A080786m4811L25278l00785K93485j70499j40931m7749J73185k026Q8320
13895A254253m26889J33354j3000J4771K03713l13275O08859p22501L04820K17702
13885A261807m33326L20539M5948k20420K73702k1622k57392k6216M8861j43461
$$ y = [1732754, 1545997, 1774325, 1581948, 1577219, 1431077, 1628468, 1725631, 1668643, 1848032, 1424432, 1512761, 1556813, 1434914, 1640690, 1563442, 1320793, 1575821, 1320713, 1238796, 1389274, 1286841, 1653016, 1503935, 1421414, 1359873, 1277498, 1551599, 1249377, 1560523, 1240611, 1489125, 1304509, 1467695, 983415, 1520770, 1465581, 1403936, 1064188, 1246471, 1052573, 1063572, 1038091, 1490813, 776251, 1171121, 1250570, 1088555, 1349860, 1304662, 1080786, 1035975, 1361253, 1060468, 1353953, 1183454, 1042523, 994774, 1167959, 1165933, 1254253, 827364, 960718, 947718, 962489, 1166202, 852927, 1461786, 739285, 1044105, 1261807, 828481, 1149020, 1194968, 974548, 1248250, 1226628, 969236, 943020, 991881, 848420]
13875H48420J63403j58179J30773J50576o1175l64582M54512O2203l03891L1490
13865I53550J83541k85924M4314J44580l45377M71119r8694k56228K12766n11573
13855E12074M05113J54693k58001M0323K72263m05041C32193O46110l06769p1997
13845E99537O9734j4401N88260m19640k73991M14969m18321N273L01658K8385
13835H81463J33668l72458J51208J7251P8272m15423J92493R05K2966K68767m9834
13824I09278j22686n9856O4734j77552L32236j28389L4281k73783L43690m04116
13814E17837K64698Q9137k98296K81761j78636o0289O7573j07008L13183j48897
13804G41063k58307J00935J84790j65837J37097L216j2059L1260j19384j00658
$$ y = [848420, 1011823, 853644, 984417, 1134993, 1073818, 709236, 1163748, 1225951, 922060, 953550, 1137091, 851167, 895481, 1040061, 694684, 1165803, 1067109, 810881, 1023647, 512074, 917187, 1071880, 813879, 854202, 1126465, 721424, 332193, 978303, 671534, 599537, 669271, 654870, 1243130, 823490, 549499, 964468, 546147, 551420, 853078, 881463, 1015131, 642673, 793881, 811132, 889404, 473981, 666474, 667379, 690345, 959112, 909278, 786592, 726736, 791470, 613918, 946154, 817765, 852046, 578263, 921953, 517837, 782535, 871672, 573376, 855137, 676501, 616212, 683785, 576777, 889960, 741063, 482756, 583691, 768481, 602644, 739741, 742957, 730898, 762158, 642774, 542116]
13794E42116K30830j19479L6017k01823J84994p150M8689j07225L2451k01989
13784D37431R2457q9683M68875k53727O8965C22517L60557j45564J99804B69446
13773D71572N8553l9650J70560B70682J15772L53053B52922L15042q8795k118
13763D77051M5412j86665J42903J65169m2145K41022l5595G5030L26881N4770
13753D56681N3981N3812j0703n3033R3219Q717K8322j6319j21285k16776K7003
13742C03619K5190K82508A84633L20729J60874N1967k40002O8487J40187O1389
13732G48264l37863J70007p8574k9233K64353l13819l7533K46237B22446L39740
13722E62186L4813n8219J1517Q3554j55574K7893j7055k25481K4444J33850A66527
$$ y = [542116, 772946, 653467, 689484, 487661, 672655, 665505, 714194, 606969, 639420, 437431, 529888, 440205, 909080, 655353, 724318, 322517, 683074, 537510, 737314, 269446, 471572, 530125, 490475, 661035, 270682, 386454, 739507, 252922, 567964, 479169, 477051, 522463, 335798, 478701, 643870, 601725, 842747, 807152, 75030, 401911, 456681, 510662, 564474, 553771, 500738, 593957, 602674, 630996, 614677, 493392, 276616, 303619, 328809, 611317, 184633, 505362, 666236, 718203, 478201, 546688, 686875, 748264, 410401, 580408, 501834, 472601, 736954, 423135, 385602, 631839, 222446, 562186, 596999, 538780, 550297, 633851, 478277, 506170, 489115, 263634, 288078, 421928, 166527]
13710E94098B50823L80753B12387P505J52642j21625M0700K31921j05315j47234
13700B70981q4285L31899A89252K00974A21282K03698j41956L57092j59682j87028
13690A93406M74527j30373p0357q5923o553K15092k71859J67285J41430I6640
13679B88024L16165j22598K12232I4753J09185J97166Q5259A78049J69488J69473
13669E17010l8628r8186j48186K1831J37141K35533C04713G1693K5390J27190
13659B24273n2672L74023j02062J13233B15010J1343J04162r6339A03435L02218
13649D05653J70303A30814a4686D21578j3734O7985A31589K85361M455j64932
13639B56473K34904B06616J45503J2749q1880j26654Q8061k32D5696Q3867L2248
$$ y = [594098, 250823, 631576, 212387, 219892, 372534, 250909, 291609, 523530, 418215, 270981, 186696, 518595, 189252, 390226, 121282, 324980, 183024, 540116, 380434, 193406, 667933, 537560, 467203, 381280, 374727, 589819, 317960, 485245, 626675, 96640, 288024, 604189, 481591, 693823, 94753, 203938, 401104, 486363, 178049, 347537, 517010, 478382, 380196, 232010, 253841, 390982, 626515, 304713, 71693, 97083, 224273, 171601, 545624, 443562, 556795, 215010, 226353, 330515, 234176, 103435, 405653, 575956, 130814, -14686, 421578, 407844, 475829, 131589, 416950, 421405, 256473, 491377, 206616, 352119, 364868, 282988, 156334, 244395, 244163, 45696, 129563, 161811]
13628A61811o0026K83774q0364L58196j45721m019r8672I8701K21618A00727N9325
13617A60052K26836j55622J23885A51376K27864J56808k09943r0272p5340N056
13607A65549J02774k9710m9101L72316j17988j81699R6707K98648k48242m5829
13597C63425A81357M16515B7753J76855o200l9684K8313J39403J10436j65395
13587B71481N140m9199J54391k3181n0097Q0139j90790J56636C5892J98259f3099
13575E65362k21967m618j05287J48673j32640R8178J79900k01906A55618J3553
13565A69171L79788l1140j20271m0889A64431J07053f7102D99379j96374J11398
13555D14403r8163j47886j459O7363J88925h5018I9604J61039a8159D42728a2731
$$ y = [161811, 101785, 385559, 305195, 663391, 517670, 513651, 414979, 98701, 320319, 100727, 160052, 386888, 231266, 355151, 151376, 379240, 536048, 326105, 235833, 160493, 165549, 268323, 238613, 189512, 561828, 443840, 262141, 358848, 657496, 409254, 363425, 181357, 597872, 27753, 204608, 198408, 158724, 187037, 326440, 436876, 271481, 276621, 227422, 381813, 358632, 308535, 388674, 197884, 354520, 35892, 234151, -63099, 565362, 343395, 338777, 233490, 382163, 249523, 347701, 527601, 325695, 155618, 169171, 548959, 517819, 397548, 356659, 164431, 271484, -67102, 499379, 303005, 414403, 316240, 168354, 166895, 234258, 423183, -85018, 99604, 260643, -18159, 442728, -12731]
13543C43252n28j40118b09984C09962n4250B3772M07501J9579A05658a1357D61236
13531A59537o7954K86395k3873C3406K84368j05328C2091J66347J4070K6175I6885
13519D01142g0686D86950D0381Q0599J2296e2427B76768J17752I5717e9654D36551
13507F469M17266G9560M44916A11513J91559P6448n9736K6549H4095a33189B40413
13495C08456A28643K22344J12541k25912r8492M9411n9178K6682o1049J46312
13485B41302A14301A2726a11325B19550a45621B71217J09859j03814A25765l6345
13475H9420K94888A58830M79090A66655K5665P2104N0845G0961a10375D21423
13464F0985c0832B11240b66260F1975j5233Q4807n987J01838J33413j17101m9056
$$ y = [343252, 342724, 202606, -209984, 309962, 255712, 23772, 431273, 450852, 105658, -11357, 461236, 159537, 91583, 377978, 354105, 33406, 317774, 212446, 32091, 198438, 212508, 238683, 96885, 401142, -70686, 486950, 40381, 120980, 133276, -52427, 276768, 394520, 95717, -59654, 436551, 6469, 423735, 79560, 524476, 111513, 303072, 379520, 319784, 346333, 84095, -133189, 240413, 308456, 128643, 350987, 463528, 237616, 139124, 188535, 129357, 156039, 94990, 241302, 114301, 12726, -111325, 219550, -145621, 271217, 381076, 277262, 125765, 89420, 384308, 158830, 637920, 166655, 192320, 264424, 315269, 70961, -110375, 421423, 60985, -30832, 211240, -266260, 61975, 46742, 131549, 125562, 227400, 360813, 243712, 194656]
13453A94656e5166A46268R2131j19137P0113J04834a46902E46148H4173K49162
13443C33335A05072a92274E27748j83355F8212L08101A05885M7109J95297d0184
13432D56536B07662F6785J7112N5768b63328B86083A04737C2482J16945J48420
13422B97847E2773J22702R8139g1481J1328O058B5664J19557F2511K0679J33949
13411B17139j3416M562L1255a00439C07532j51693D279J46953i1755B68648a3675
13399a09620C30482a14693j54427e2654B88428H0835J31791a6411D3141a614C34127
13387B94646f3480A08620a41580A99192q9480L8591b5538H5092J66504J56681
13377D08277J1268A43970K44522b08108E1789J87669q3189D1982L11987C322K61636
$$ y = [194656, -55166, 146268, 238399, 119262, 189375, 294209, -146902, 546148, 84173, 333335, 105072, -192274, 527748, 344393, 68212, 376313, 105885, 152994, 348291, -40184, 456536, 207662, 66785, 83897, 139665, -263328, 286083, 104737, 32482, 149427, 297847, 52773, 175475, 273614, -71481, -60153, -54095, 25664, 145221, 62511, 83190, 217139, 203723, 208285, 239540, -100439, 307532, 155839, 4279, 151232, -91755, 268648, -13675, -109620, 330482, -114693, -269120, -52654, 288428, 80835, 212626, -16411, 43141, -1614, 334127, 294646, -63480, 108620, -141580, 199192, 109712, 148303, -25538, 85092, 251596, 408277, 419545, 143970, 388492, -208108, 51789, 239458, 156269, 41982, 353969, 3322, 264958]
13366B64958L04235B00177a16964C15930h9410B82727d2687g561A79866E8721
13355B42392a64456B89349j24505j3913n7939K20213a67318e0806g156I9895c8283
13343f9718C2034M19333g7168A17J86945J25066j54488O0583J45162J53175c4703
13331C81984j13248K12362b3545A39541j7205L428J62993L08984F0907K89069
13321C49976a51814B70681K4929F2853J43628p7195R3598C6437l88K99150b4520
13309C17898C8379K59466F7387R9720k7101P0431L49267E5067J44776L20977k16476
13298C04344J39199A3546a14914E23998A19391K8048c6040A33167J37402n4279
13288B16290a29191B06669l1823M03670e0568B73227b47862A08661J94754a1937
$$ y = [264958, 569193, 200177, -116964, 315930, -89410, 282727, -42687, -7561, 179866, 58721, 242392, -164456, 289349, 164844, 150931, 92992, 313205, -167318, -50806, -7156, 99895, -38283, -69718, 32034, 451367, -77168, 117, 187062, 312128, 157640, 218223, 363385, 516560, -34703, 381984, 268736, 481098, -23545, 139541, 122336, 125764, 288757, 597741, 60907, 349976, -151814, 270681, 295610, 62853, 206481, 129286, 222884, 36437, 36049, 335199, -24520, 317898, 38379, 297845, 67387, 167107, 140006, 210437, 559704, 55067, 199843, 520820, 304344, 443543, 13546, -114914, 523998, 119391, 147439, -36040, 133167, 270569, 216290, -129191, 206669, 174846, 578516, -50568, 273227, -247862, 108661, 303415, -11937]
13277c3587E1687a15609J6411B04896a50388G865K77861A30657L9024O9126A16656
13265B58437d6844I7789l7888L16022b00976G6150b80986H1204a40422C20719
13254B05317a4242I4622h226C2379b22120C556f293C42471j42305K18970b3443
13242B72441C6053K81838m5103J98095A47136b52104d4672A54623C2816J48296
13232A81112q552F1368J19335m5908m017f0712C48506F0784K5764a93098A5643
13220c51622b432j42624A34053a39569B51667H1059j4042J10490J58741e1077
13209e2264A68783f1289C5798p031a10889A43316k5084J21732f0371I3209L2931
13198A26140K55019b39830B16085a15076j1147B33030G4336J32359a72724A54001
$$ y = [-33587, 51687, -115609, -99198, 204896, -150388, 7865, 285726, 130657, 169681, 238807, 116656, 258437, -46844, 97789, 59901, 375923, -200976, 76150, -280986, 81204, -140422, 320719, 205317, -14242, 94622, -8226, 32379, -222120, 3556, -6293, 342471, 200166, 419136, -23443, 272441, 36053, 317891, 272788, 470883, 147136, -252104, -44672, 154623, 32816, 181112, 172560, 61368, 180703, 134795, 130778, -60712, 348506, 60784, 86548, -193098, 15643, -351622, -2432, -145056, 134053, -139569, 251667, 81059, 67017, 177507, 336248, -51077, -52264, 168783, -61289, 35798, 28767, -110889, 143316, 118232, 239964, -60371, 93209, 126140, 381159, -239830, 216085, -115076, -126223, 233030, 74336, 206695, -172724, 154001]
13187a32468B86767J5188o652a02199A65457b39063B49638o3046G5680J89273
13177B64953d8592A90418A8619a65112A06111K57612H5364a13959j2800A30968
13166d4881A52990F3425a20920A34671g5350K4507j32884A34159J01337P314H4624
13154A03083B9746l522K83920A37171K9889a39585B905B99K05417b07734K4249
13143a83485A05625b2618j39548h174A50788b64260a10831A58719A7516J16108
13133A33624B7336K24157a73894L5658r6033A97730k5398a32903o1201g1711D798
13121A66010L9207q5533K06561g8145G9048b47319d8820G8250J59660I497J46168
13110A55665i5409B07877D9531b48032e2514A47446f0435k5307i530L329A48990
$$ y = [-132468, 286767, 301955, 295303, -102199, 165457, -239063, 249638, 186592, 75680, 264953, -48592, 190418, 18619, -165112, 106111, 363723, 85364, -113959, -126759, 130968, -44881, 152990, 63425, -120920, 134671, -75350, -50843, -183727, 134159, 235496, 242810, 84624, 103083, 29746, 26224, 310144, 137171, 167060, -139585, 2905, 299, 205716, -207734, -183485, 105625, -22618, -162166, -8174, 150788, -264260, -110831, 158719, 17516, 133624, 27336, 251493, -173894, -138236, -234269, 197730, 172332, -132903, -194104, -71711, 4798, 166010, 205217, 119684, 326245, -78145, 79048, -247319, -48820, 78250, 237910, 9497, 155665, -95409, 207877, 49531, -248032, -52514, 147446, -60435, -85742, -9530, -6201, 148990]
13098A42938m8516J14782E4504c07980M4441B24213a6879j29023N345G7427b26245
13086A14476i5449k23779a19226B15409E5648M1070K89498F3339j7049c4641j15206
13075a49847d0324B39426e3865j56333D7232b45412a7197H7666A5229J87204D6844
13063f0214p5196j7746B06534a17464e2632A5334a20723D02949a57044N8868l6180
13052a34356B3762Q0501J40079l8633i755A2551g4980A19007a16064H0355K20232
13041C00587a37595I7975f8765B5851a89528C00288a57095m0692A90486J5439
13031B05925l9148a42525B19284c9042m1367G5626Q665i6500G7356Q5786R5130
13020B58272i2915A19195b51403b6045A61720b5994j9436k18765A00835P0309
$$ y = [142938, 94422, 209204, 54504, -307980, -263539, 224213, -16879, -145902, -140557, 77427, -226245, 114476, -95449, -319228, -119226, 215409, 55648, 96718, 386216, 63339, 46290, -34641, -149847, -40324, 239426, -53865, -210198, 47232, -245412, -17197, 87666, 15229, 202433, 46844, -60214, -135410, -153156, 206534, -117464, -52632, 15334, -120723, 402949, -157044, -98176, -134356, 23762, 104263, 244342, 205709, -9755, 12551, -74980, 119007, -116064, 80355, 300587, -137595, 97975, -68765, 25851, -189528, 300288, -157095, -197787, 190486, 205925, 166777, -142525, 219284, -39042, -80409, 75626, 84291, -96500, 77356, 163142, 258272, -92915, 119195, -251403, -26045, 161720, -25994, -45430, -264195, 100835, 171144]
13010A71144K8739B9412J16471C9730N5286J13269a01002e969C7119J08265J84639
12999C30023a16589A95277B408a80885b8602l0978A60150a15740j93038O7980
12989b40798A30285a0841A06480a09403F366g6820C2177J83724a39013A70903
12978C4093a24093l2846E5735J87340F5267c4772r8350a1414j04636J3810A16747
12966a78828A33081C8126A2464K22283h7640A32853c67419d8734B72456b80645
12955B29i5780j52542b5131A92148c1706j31168B4064c0020B11755b185D7455
12943D13586F4450c54428A06934R5697i1720A40888i1444I2711a5578j69137A53511
12931E2032J03164O4690g7110c217B0883a67178C06229D2504a28836G2442B7594
$$ y = [171144, 199883, 29412, 145883, 39730, 95016, 208285, -101002, -5969, 37119, 145384, 330023, -116589, 195277, 2408, -180885, -28602, -59580, 160150, -115740, -308778, -240798, 130285, -10841, 106480, -109403, 6366, -76820, 32177, 215901, -139013, 170903, 34093, -124093, -156939, 55735, 243075, 65267, -34772, -133122, -11414, -116050, -102240, 116747, -178828, 133081, 38126, 12464, 234747, -87640, 132853, -367419, -48734, 272456, -280645, 229, -95780, -248322, -25131, 192148, -31706, -162874, 24064, -30020, 211755, -2185, 47455, 413586, 64450, -354428, 106934, 202631, -91720, 140888, -91444, 92711, -15578, -184715, 153511, 52032, 155196, 219886, -77110, -3217, 20883, -167178, 306229, 42504, -128836, 72442, 27594]
12919B5368c7438r237l4090F9422J68276b20081b6972m060j544A62717J86147
12908C48864g752G420a20476B46834A05544c46095A903c2119A47909a48565M9983
12897i8582k7092N7486A79063m572c09982d8818a0306q4206l6643B70737i9030
12885B01254d4941D502J8426c21600J40822j290Q7337I863N6697K185B4247G878
12872B04816n4601P1700c6354A93222J6593J04327a75329E6761Q0637M6571a41467
12860H611c37409g9940c8541j55968B93942G3755i6842j17931k7311J05174l8506
12849a75416M1830C33612F9500J66532b6931j58828I5798R5612c7425J2318k55428
12838b80535Q4084L0756G2010a71905j61144J61757J4508P0336J1178A2045J0893
$$ y = [25368, -37438, -46675, -80765, 69422, 237698, -220081, -26972, -31032, -32576, 162717, 348864, -7752, 7420, -120476, 246834, 105544, -346095, 1903, -32119, 147909, -148565, -98582, -125674, -68188, 179063, 174491, -309982, -48818, -10306, -94512, -131155, 270737, -99030, 201254, -44941, 4502, 22928, -321600, -180778, -182068, -94731, 9863, 66560, 68745, 24247, 7878, 204816, 150215, 221915, -36354, 193222, 209815, 314142, -175329, 56761, 137398, 183969, -141467, 8611, -337409, -79940, -38541, -194509, 293942, 73755, -96842, -214773, -242084, -136910, -175416, -133586, 333612, 69500, 236032, -26931, -185759, 95798, 191410, -37425, -25107, -280535, -196451, -165695, 72010, -171905, -333049, -171292, -156784, -86448, -75270, 12045, 22938]
12827B2938J31066I988c56743A07123b0082A54467L7592n2039a30017a4178B74002
12815a73603Q5922j54940E1654a50111A74828a99556B14567O1133i4278j610H2420
12803A8443K373J83803b32574A82029b92178f8028A85612f4811n2516B98525b58481
12791A46718F6320J15883c71375A38459d3976B65983b6756B36572a67848n7178
12781b25026f1847B7218a03209B3987a80250F5437J95861A07775a34222A41364
12770b22379F6833j9335A4278R114Q9702d41655A74089a85250c2282B29465E8571
12758d6766G3149a6163j2058B12506a42669G4215b65195J20743j67687c6541j13019
12747a49560n6974l6121H674h9423c3194A57403d669E2132J96333C868b47817
$$ y = [22938, 154004, 9988, -356743, 107123, -20082, 154467, 192059, 140020, -130017, -14178, 274002, -173603, -87681, -242621, 51654, -150111, 174828, -199556, 214567, 275700, -94278, -95888, 82420, 18443, 20816, 204619, -232574, 182029, -292178, -68028, 185612, -64811, -117327, 298525, -258481, 146718, 66320, 182203, -371375, 138459, -43976, 265983, -26756, 236572, -167848, -225026, -61847, 27218, -103209, 23987, -180250, 65437, 261298, 107775, -134222, 141364, -222379, 66833, 47498, 14278, 23392, 113094, -441655, 174089, -185250, -32282, 229465, 58571, -46766, 73149, -16163, -28221, 212506, -142669, 74215, -265195, -144452, -312139, -36541, -149560, -206534, -242655, 8674, -89423, -33194, 157403, -4669, 52132, 248465, 3868, -247817]
12735A45654o7468l1070f1347A8488a93936A74875j6469a81465D2722J74915B5216
12723b99266D9219a2152m0395F0043e743m2048A10709c9782j96625B61920C6266
12711B92119g4175A50167L43975j63775e6061j3534A36416b5224j19669E6685
12700i2781B18975b17422f5574l10629a37787A14534h2999k48931J04243C72008
12689A52793p088K7538i2480A28488g1694B31108f8789J8598B30321l5122G2980
12677A29584m5534a2713H6125J78685R5696a19410A11884c03671A8065e1671B9359
12665E32N830f3946G4141N3039f3499o2967J8843I4260e0562m5991F8976a33698
12652B55997a76754c7156D8193J9884M3302c20635D9882g6193A35796a9649B7237
$$ y = [145654, 78186, 47116, -61347, 18488, -193936, 174875, 158406, -181465, 42722, 217637, 25216, -299266, 49219, -12152, -52547, 60043, -5743, -47791, 110709, -39782, -236407, 261920, 36266, 292119, -74175, 150167, 494142, 330367, -56061, -69595, 136416, -25224, -144893, 56685, -92781, 218975, -217422, -65574, -376203, -137787, 114534, -82999, -331930, -227687, 372008, 152793, 145705, 173243, -92480, 128488, -71694, 231108, -68789, -50191, 230321, 195199, 72980, 129584, 84050, -12713, 86125, 264810, 360506, -119410, 111884, -303671, 18065, -51671, 29359, 532, 6362, -63946, 74141, 127180, -63499, -126466, -107623, 94260, -50562, -96553, 68976, -133698, 255997, -176754, -37156, 48193, 68077, 111379, -320635, 49882, -76193, 135796, -19649, 27237]
12640a08802B48508a04198C5506j1867J31081b910p2298B09177A8117O4123b13582
12628G9411J09655p2881l2972B9390J12399k9004e5348F3273O3034J77960A06299
12616I1988B171c7516j27050E2334a59542q4275A15486c05299A2345b71448A61615
12604F6938b05498A18266a38943E6922J82713b49345B57416L158j27809l0589
12594A02176k9923f071o2821H694d6761k74928E5530N8432J5165b57811a7891
12582A233c9829B17343c606p9273K9508l0052A05246a40043B1337F732h7532j97545
12570b85077A85886a66671c474E6069a08636J2998D4831O2048A2946a47610P0065
12559g7545a8002B71666r8567a62073L3878m0721A66522c7116F4459c22324C43474
$$ y = [-108802, 248508, -104198, 35506, 23639, 154720, -2910, -75208, 209177, 18117, 82240, -213582, 79411, 189066, 116185, 83213, 29390, 141789, 112785, -55348, 63273, 126307, 304267, 106299, 91988, 2171, -37516, -164566, 52334, -159542, -243817, 115486, -305299, 12345, -271448, 161615, 66938, -205498, 118266, -138943, 56922, 239635, -249345, 257416, 260574, 132765, 102176, 72253, -6071, -68892, 8694, -46761, -321689, 55530, 113962, 129127, -257811, -17891, 1233, -39829, 217343, -3606, -82879, -53371, -83423, 105246, -140043, 21337, 6732, -87532, -285077, 185886, -166671, -3474, 56069, -108636, -95638, 44831, 106879, 12946, -147610, -77545, -18002, 271666, 173099, -162073, -128195, -168916, 166522, -37116, 64459, -322324, 343474]
12547h4174Q284H2910j2175O6912J58093b86618J30552f7174H3580a59046A70654
12535c1222G8243b58936B43852B043J92242a5594I611h4002m8175E8822K11139
12524B69961E9057B3041K18668h3827k2591A557M5598L13877b9043B13091o9977
12513A43114b1012j16158I7443b99604A18523R6034n4149K767A0156J82444f3740
12501H6812n96J654c2677q8059b1796C7874A5525i3530B38726b206j57559E7279
12488H2533l7956K65750b25476c6061j71179A4370b67357e7627j83738a4923F95
12476A32505a60228A85127f7036a5476A3144a05405k14261J07483B94501b10638
12465a6669B1308g1907C22442b69176A85206O8492L8020j17032B1006a11046A39272
$$ y = [-84174, -75890, 82910, 70735, 137647, 295740, -286618, -156066, -67174, 83580, -159046, 170654, -31222, 78243, -258936, 243852, 2043, 194285, -15594, 9611, -84002, -132177, 58822, 269961, 59057, 23041, 241709, -83827, -106418, 1557, 47155, 361032, -29043, 213091, 143114, -21012, -137170, 97443, -299604, 118523, 214557, 160408, 163175, 10156, 192600, -63740, 86812, 86216, 87870, -32677, -120736, -21796, 37874, 15525, -93530, 238726, -2206, -159765, 57279, 82533, 44577, 310327, -225476, -36061, -207240, 14370, -267357, -57627, -241365, -14923, 695, 132505, -160228, 185127, -67036, -15476, 13144, -105405, -319666, -212183, 294501, -210638, -16669, 21308, -71907, 322442, -269176, 185206, 253698, 291718, 174686, 21006, -111046, 139272]
12453i9140D7582b6788p7162B5006K2890a80611m4974A79169k7781a2474k683
12442a5157e378j37213a2202B69619A19505B0700J56101i5970C9853b67756O6136
12431b01620O3622L5110F2779P4592L03497A45519e9926G6465a38050n4840c6705
12419E736b33301J4296C4945J3985J87390d0872q0572k31797A14853A1950K07890
12408B19840E7964a30647L0797O533j30379J6682j29613C0131a53342K1052B64796
12396b05883k23058e6069F3924J11264b3286j04299A82340k1096k2949J99454
12386C37749j63320m2242e7854q495a4884A476J01024K18308C5517a02510A12239
12374B2258J05914K63161A27660E8080N1298h4883J5339A9192M9023b18258l093
$$ y = [-99140, 47582, -26788, -103950, 25006, 47896, -180611, -225585, 179169, 151388, -12474, -15157, -5378, -142591, -12202, 269619, 119505, 20700, 176801, -95970, 39853, -267756, -201620, -137998, -102888, 62779, 137371, 440868, 145519, -59926, 76465, -138050, -192890, -36705, 5736, -233301, -219005, 34945, 48930, 236320, -40872, -121444, -353241, 114853, 11950, 219840, 57964, -130647, -99850, -93317, -223696, -207014, -336627, 30131, -153342, -132290, 264796, -205883, -428941, -56069, 63924, 175188, -23286, -127585, 182340, 161244, 138295, 337749, 174429, 132187, -57854, -66349, -14884, 1476, 102500, 320808, 35517, -102510, 112239, 22258, 128172, 391333, 127660, 58080, 109378, -84883, -69544, 19192, 68215, -218258, -221351]
12363b21351b9843p4324j47033M5522h4264B53425f7943k16394k06487B2003d41254
12351A77720C8015P2100J29428A12290F603i6024l8108O0550G163J287R2433L8577
12339A39460a1786k0198o1885J1230A99046F5038R9639J18252N0515H4896f9025
12327B08395k3801h3126A72400J5287a12913e2221A46886l7941J13325K71600
12317D93870A22299n7436Q5848L18838F5000a5673E1193L74979A50838E2343K72833
12306C25176a31874d9477a3669A63628a15344A1523K85091A19080K5329G0904
12295I5282L29457b1970A96063K0166c357F4278J1675B2382N1248B1684R5024
12284A16708M196J38946F8245f2840I1317b8825r1820A00106R6493R5914A27306
$$ y = [-221351, -29843, -104167, -251200, -205678, -84264, 253425, -67943, -284337, -490824, 22003, -441254, 177720, 38015, 110115, 239543, 112290, 6603, -96024, -134132, -73582, 7163, 8450, 100883, 139460, -11786, -31984, -93869, -82639, 199046, 65038, 164677, 282929, 333444, 84896, -69025, 208395, 184594, -83126, 172400, 187687, -112913, -52221, 146886, 108945, 222270, 493870, 122299, 64863, 150711, 469549, 65000, -15673, 51193, 426172, 150838, 52343, 325176, -131874, -49477, -13669, 163628, -115344, 11523, 296614, 119080, 144409, 70904, 95282, 424739, -21970, 196063, 216229, -3357, 64278, 75953, 22382, 73630, 21684, 116708, 120904, 259850, 68245, -62840, 91317, -28825, -120645, 100106, 196599, 292513, 127306]
12272A63689o2850a0440A11032i341F7885J0276b02145B7860M38694e7646o0601
12261a18247A29330M7137J11g4194A29237b63296D28803A21825M0618e6359H5210
12249b29n4301B28108N2838q1680c6147B79120j27843k1906l2687J00898q2459
12238A15123C8520e4595j18513A47411b11392Q0693A74962p3949P5854B9108L94250
12227D23358b4745k66823A81395p4095a45472B60424q0604R6305r2893L6258J90205
12216D09695A79394k8588K4468O6353J3305p31m8337K43002F5090i0149A03962
12204E4024a4922j29853C87633D2540e2279C66826A17835J28174J39111D8028
12193A71877L15660i3596C3404L480J91559a4398A52486K49579I0701r298K95573
$$ y = [163689, 100839, -10440, 111032, -9341, 67885, 78161, -202145, 27860, 466554, -57646, -118247, 129330, 176467, 176578, -74194, 129237, -263296, 428803, 121825, 162443, -56359, 85210, -229, -54530, 228108, 280946, 199266, -36147, 279120, 151277, 129371, 96684, 197582, 115123, 38520, -54595, -173108, 147411, -211392, -130699, 174962, 101013, 176867, 29108, 423358, -24745, -291568, 181395, 107300, -145472, 260424, 179820, 276125, 183232, 219490, 409695, 179394, 150806, 175274, 241627, 254932, 254201, 205864, 448866, 65090, -90149, 103962, 54024, -14922, -144775, 387633, 42540, -52279, 366826, 117835, 246009, 385120, 48028, 171877, 487537, -93596, 33404, 36884, 228443, -14398, 152486, 402065, 90701, 81403, 376976]
12182C76976k6629j54861a01204Q448p578C0606P0127O5456K48024b87510A47774
12170B58103a97152A49601R3937r7828J91655a02666K8265A56041K83431l5466
12160D04006k0416j35603C6595b0002C82433F792J39813l0415l1464e8197k81073
12149c39270H478d2274J7407a0713B30611o3707J10662f2147D5106K36605A17037
12137A67473p0576b07585G8047k1077M20646A49784b48736J8299B14700J3233
12127B27933j05350B5870a06801C92699g2766F9439O7014J1420k3682B8306a05610
12115G5694J31105g4794A9836Q3675A8974L17a79288B5390b30610C9926Q1698
12104A21624B1281K83567H6595J2490l8174Q23f1976j95305c4254A88831b29843
$$ y = [376976, 350347, 195486, -101204, -92756, -100334, 30606, 100733, 166189, 414213, -287510, 147774, 258103, -197152, 149601, 243538, 145710, 337365, -102666, -74401, 156041, 439472, 404006, 383590, 247987, 36595, -20002, 382433, 6792, 146605, 116190, 84726, -58197, -339270, 8478, -42274, -24867, -10713, 230611, 166904, 277566, -62147, 45106, 281711, 117037, 167473, 96897, -207585, 78047, 56970, 477616, 149784, -248736, -230437, 214700, 227933, 122583, 25870, -106801, 392699, -72766, 69439, 136453, 147873, 124191, 28306, -105610, 75694, 206799, -74794, 19836, 103511, 18974, 19291, -179288, 25390, -230610, 39926, 121624, 21281, 304848, 86595, 99085, 60911, 61734, -61976, -257281, -34254, 188831, -229843]
12092a55441A53319l9799K28730d5287M91a0513B40039N3670A3318R9747A5785
12080A20110C7174a09667D67757F2910i694n4646B96353j03832c8178F3700B3936
12068A36585b11449l4510k35836A0017J03516a60041N562A40067C7533R4648n2710
12057G9471M4630a76792A35752o2754b8082B96546j7447b0917C28550d7452j29145
12046a76597A63504J93947G7025M28185B5073J54823a61800r9358A55481g4055
12035G9104d6261o2575A26759A9103J90347a53810N0347n7720D4329a3920n1854
12024f5774B0709J45311p1830J7387K2675c4779B37054H2283D0924e0301j68468
12013b18769E7600Q1652a43880M3621A50269J59612o1938N3981a46618A73957
$$ y = [-155441, 153319, 113520, 342250, -45287, -44796, -10513, 240039, 293709, 13318, 113065, 15785, 120110, 37174, -109667, 467757, 62910, -9694, -64340, 296353, 192521, -38178, 63700, 23936, 136585, -211449, -245959, -481795, 10017, 113533, -160041, -154479, 140067, 37533, 132181, 79471, 124101, -176792, 135752, 72998, -28082, 296546, 279099, -20917, 328550, -47452, -176597, 163504, 357451, 77025, 505210, 25073, 179896, -161800, -261158, 155481, -74055, 79104, -46261, -108836, 126759, 19103, 209450, -153810, -103463, -161183, 44329, -13920, -65774, 20709, 166020, 94190, 111577, 134252, -34779, 237054, 82283, 40924, -50301, -218769, 57600, 139252, -143880, -100259, 150269, 309881, 247943, 301924, -146618, 173957]
12002c1991k93569i0515B948b56445A44765h8396m4624A13669a46733E6551a14129
11990E5683b68373A36844a88491c176C11892a8431j03916D880e6496A35782K0615
11979A56397c56177a5746p4941F7905O9652e7136k8866p786D4651c2445a1143
11967b24618A90710b76643h8371D0439b84545d779A6647e4517E1218O1691a2193
11955b98732a6465A37687A7177K17803g3337k05043B2949J16472a99588g5749
11944b95187J00833a5083j77636B83786a47065E7260K698J98525C2941a72064
11933c5440j53675I4251J04468J45130a49105O6301A20512C4279h4008B09238
11922A6906g2594H4444K9062d47704c1519p573f59B07490p4929C7040a2135j11862
$$ y = [-31991, -325560, -90515, 2948, -256445, 144765, -88396, -133020, 113669, -146733, 56551, -114129, 55683, -268373, 136844, -188491, -3176, 311892, -18431, -122347, 4880, -56496, 135782, 156397, -356177, -15746, -90687, 67905, 137557, -57136, -86002, -93788, 44651, -32445, -11143, -224618, 190710, -276643, -88371, 40439, -284545, -4779, 16647, -54517, 51218, 112909, -12193, -298732, -16465, 137687, 17177, 234980, -73337, -278380, 22949, 139421, -199588, -75749, -295187, -194354, -15083, -192719, 283786, -147065, 57260, 59958, 258483, 32941, -172064, -35440, -189115, 94251, 198719, 343849, -149105, -82804, 120512, 34279, -84008, 209238, 16906, -72594, 84444, 113506, -447704, -31519, -39092, -659, 207490, 132561, 37040, -12135, -123997]
11910a23997C64824G1194b77081H4227a29198c2692k1711h752l4409j96791A05564
11898f1181r612l8679p4363a0701n9632o268o8400B38908b95404H0710c93060
11886c891q2946B78563b9933k30208b5148j68221F0372r778A2422O9112a6018
11874a42927q8240j3114G5290b5203o2238j44103g6380B4205f9845j56818b3359
11862C409J53826o3066b57092J00337m503A24406D9898a58247c1131M989q2183
11851a08325R379F0660L02921a81739j6363P0550c2724A22573c87320A00618g6024
11839c22915J4043J33613J4378F5951K18007h5206I1043a04084A5535i6157k01060
11828b97217M0064B8652e6772A56572j8039J00603h3601j81680G6059a48597f9770
$$ y = [-123997, 364824, 71194, -277081, 84227, -129198, -32692, -54403, -8752, -43161, -239952, 105564, -61181, -70793, -109472, -183835, -10701, -70333, -76601, -145001, 238908, -295404, 80710, -393060, -3891, -86837, 278563, -29933, -260141, -25148, -193369, 60372, 50594, 12422, 81534, -16018, -142927, -231167, -244281, 75290, -25203, -87441, -231544, -76380, 24205, -69845, -226663, -23359, 3409, 157235, 94169, -257092, -156755, -161258, 124406, 49898, -158247, -31131, -26142, -108325, -98946, 60660, 363581, -181739, -198102, -127552, -32724, 122573, -387320, 100618, -76024, -322915, -308872, -175259, -160881, 65951, 283958, -85206, 91043, -104084, 15535, -96157, -297217, -257153, 28652, -56772, 156572, 138533, 239136, -83601, -265281, 76059, -148597, -69770]
11816f6676Q464I2216A5198Q7039j3403a49868m822a7542l84143J58654D1615
11804F845a51340A44798J0226K00490b01024O9490O5298A73482k2387d8050F245
11792a95843H8290K3762c68080d7404k0179B39653C6294J2346e8991b5704o4116
11781h9820A35043b17167A740c11657q7738a96165C16435j7843d9338C6856K93281
11770C30137C2924a61427O5455A08997a91232B15800a46332j98729N2162H0976
11759B1918L9101f9109A39045k444b45038A352b9794A65753k3146C374J96520
11748A99894b7065E660N0169i6555k62385J06411a04181A0375f2593j15929D7536
11736h607k50221B16846F791b97742e7436A18487b74020B29793G9217a52917A1597
$$ y = [-66676, -58212, 92216, 15198, 102237, 88834, -149868, -154690, -17542, -401685, -243031, 41615, 6845, -151340, 144798, 155024, 355514, -201024, -131534, -66236, 173482, 151095, -48050, 6245, -195843, 88290, 112052, -368080, -47404, -67583, 239653, 36294, 48640, -58991, -25704, -89820, 135043, -217167, 1740, -311657, -399395, -196165, 316435, 298592, -49338, 36856, 330137, 32924, -161427, -95972, 108997, -191232, 215800, -146332, -345061, -292899, 80976, 21918, 61019, -69109, 139045, 136601, -245038, 1352, -29794, 165753, 142607, 3374, 199894, -27065, 5660, 55829, -96555, -358940, -252529, -104181, 10375, -62593, -178522, 47536, -8607, -258828, 216846, 6791, -297742, -57436, 118487, -274020, 229793, 79217, -152917, 11597]
11724B50964a76816c9015j27785A4222b10244A20006a63054l2718B99411b92187
11713d07283H7577P0582a27118N7420I7958b17766A16394b79674I9083E2J85979
11702A86031a8630C30781a54119f4791q5207G0968a24828A56019p7573L8381e7323
11690d63481B17980e1649l53384f4479a9304o8032A02474d63788o1508E7667J04114
11679A61781d8017K0664I7380O9295a0979A12036e5331H1214J56000o6175a61318
11667d5908p5341j58708a3782A59459b5988j9205j77392A70611G9986J29718H6916
11655b39075C04606G9987c06282D7776b35028A32813a15118b8423A36598m3237
11645I3361D1584J30570D1485a56067j22658c3690o4979b2769A560a05818D126
$$ y = [250964, -176816, -39015, -166800, 14222, -210244, 120006, -163054, -195772, 299411, -292187, -407283, 87577, 158159, -127118, -69698, 97958, -217766, 116394, -279674, 99083, 52, 186031, -18630, 330781, -154119, -64791, -149998, 70968, -124828, 156019, 78446, 116827, -57323, -463481, 217980, -51649, -405033, -64479, -19304, -87336, 102474, -463788, -525296, 57667, 161781, -48017, -27353, 97380, 166675, -10979, 112036, -55331, 81214, 237214, 171039, -161318, -45908, -121249, -279957, -13782, 159459, -25988, -45193, -222585, 170611, 79986, 209704, 86916, -239075, 304606, 79987, -306282, 47776, -235028, 132813, -115118, -28423, 136598, 93361, 41584, 172154, 41485, -156067, -278725, -33690, -98669, -22769, 1560, -105818, 4126]
11633a80513J1661E8358E575K85322a4863H8139K6687a57520A76204a02627j46884
11622b49511B44609G7481h6363b361p9914L518c912G8644a52007f0671K4577B05668
11609B22145a12600B04291I0442b37431a11467j89610a48643L4804B31478f1732
11598a05745A21800a2436m3678D5307J90032g733H9990L6836f9265G5355c0850
11586A20580a1214j09338J9837m1110I0166b4389m0065H0349M0777J34824c8741
11574f7703b1055m9220B58521p2133a25120B00972a02601j06822B32786F8625
11563a94854E8773J5610B3477K24414a3501B77260E0435b0029B74961l2230F3446
11551A9154L47229e4192A57841J6480F1590K0474a59685k9120M1319C15878A54409
$$ y = [-180513, -168852, 58358, 5575, 290897, -14863, 88139, 114826, -157520, 176204, -102627, -249511, 244609, 77481, -86363, -2361, -82275, -78757, -3912, 78644, -152007, -60671, -36094, 205668, 222145, -112600, 204291, 90442, -237431, -111467, -301077, -148643, -113839, 231478, -61732, -105745, 121800, -12436, -56114, 45307, 235339, -7733, 89990, 126826, -69265, 75355, -30850, 120580, -11214, -120552, -100715, -141825, 90166, -24389, -64454, 80349, 121126, 255950, -38741, -67703, -21055, -70275, 258521, 186388, -125120, 200972, -102601, -209423, 232786, 68625, -194854, 58773, 74383, 23477, 247891, -13501, 277260, 50435, -20029, 274961, 242731, 63446, 19154, 366383, -54192, 157841, 174321, 61590, 82064, -159685, -188805, -147486, 315878, 154409]
11539a09552B5614g0756B2960e04554B34152M7535r9342l6119b40165C42462A02601
11527A41480C8659c0590A64438f2617K4053A21192a6737k1623A98780K6302c76879
11515I0895J72336D1848b03061N7212a6240E7918K55248j18917e2951C17502q2338
11504B35164b50235B48176C8844e4388A95262P171M0197f5798A38833J09257B1315
11492E19032A09651K70093a21328B09321A6785a8093N747C41376b37692H9067
11481A10352d531G8870K16832A27094a34183B54072j24602m8383j7460g1138A88559
11469i2684A15699P5886b95252B3840c968A50455A4931J49541J80604I2966h1022
11457A64020K12081d9245o2580C45605c10375H0418M5021a43639A45369A5532
$$ y = [-109552, 25614, -70756, 22960, -504554, 234152, 281687, 182345, 146226, -240165, 342462, 102601, 141480, 38659, -30590, 164438, -62617, -38564, 121192, -16737, -38360, 198780, 225082, -376879, 90895, 263231, 41848, -203061, -145849, -16240, 57918, 313166, 194249, -52951, 317502, 235164, -250235, 248176, 38844, -54388, 195262, 202433, 242630, -65798, 138833, 248090, 21315, 519032, 109651, 379744, -121328, 209321, 16785, -18093, -12346, 341376, -237692, 89067, 110352, -4531, 78870, 295702, 127094, -134183, 254072, 129470, 81087, 63627, -71138, 188559, -92684, 115699, 191585, -295252, 23840, -3968, 150455, 14931, 164472, 345076, 92966, -81022, 164020, 376101, -49245, -111825, 345605, -310375, 80418, 125439, -143639, 145369, 15532]
11446A65474B6537P6126d78988H6969h2775A48657f696B177J65403e6040F754
11434h9901D7395K15927a67285M2334B12561a16365B23860j02621a26986B81657
11423a37883C86838j57407b95795A10050d3549E0004K01848J4378E3216e8270
11412b47051j6781A09413a66227k28573J26221A3663J95932H4512L33251E4545
11401a60891g9567K9371j27513B41191K1897P5234c0153J368j63376n6927A01830
11389A29735d2571r2376o4800A08505Q357a41286f6165k7503q0726L131F0851
11377a87599e8974C23642e0323j76473A49967D7541K4951a04158k1278C635d447
11365b77063K6471h9172n4787b8107A96755C7260b27465q353d2665j83488l6879
$$ y = [165474, 26537, 102663, -478988, 86969, -82775, 148657, -6696, 2177, 167580, -56040, 6754, -89901, 47395, 263322, -167285, -124951, 212561, -116365, 223860, 121239, -126986, 281657, -137883, 386838, 229431, -295795, 110050, -43549, 50004, 251852, 266230, 53216, -58270, -247051, -263832, 109413, -166227, -394800, -268579, 13663, 209595, 84512, 417763, 54545, -160891, -79567, -50196, -177709, 241191, 263088, 338322, -30153, -28785, -192161, -249088, 101830, 129735, -42571, -134947, -199747, 108505, 116862, -141286, -66165, -93668, -174394, -171263, 60851, -187599, -58974, 323642, -50323, -226796, 149967, 47541, 72492, -104158, -125436, 3635, -4447, -277063, -250592, -89172, -143959, -28107, 196755, 37260, -227465, -235818, -42665, -226153, -263032]
11354b63032A64102A4727K16721B4278J81992b43257h9221A06276J74516K4754
11344C05546d13188c2836j70651B12712c0852k17519F2272a11909n9124g8060
11333F8917a8318O609q9127j22071M2673j9262G026g8129j12808L0528O4908E5299
11320a39414r0389j51683a3469m2009j42043K6853h0782I7094P5799F2742A5398
11308a1970A08265a88331J5336K3160n3471F8864K1989c5531F2422a33197j32252
11297b65449j2536A57600p3490a02316M0796j12869C6467c31151A55180A964L291
11286E255f5173o5831G2360P3552D7735O8785d63362A03545C9479D597M7294R066
11274F0957j7176a48683d8685j2246k16384A33648B8046h8229q7138j0738e0295
$$ y = [-263032, 164102, 14727, 231448, 24278, 206270, -243257, -89221, 106276, 280792, 305546, -413188, -32836, -203487, 212712, -30852, -248371, 62272, -111909, -171033, -78060, 68917, -18318, -11709, -100836, -222907, -180234, -199496, 7026, -78129, -190937, -160409, -95501, 55299, -139414, -229803, -381486, -13469, -55478, -197521, -170668, -80782, 97094, 172893, 62742, 15398, -11970, 108265, -188331, -172995, -149835, -203306, 68864, 90853, -35531, 62422, -133197, -265449, -277985, 157600, 84110, -102316, -61520, -174389, 36467, -331151, 155180, 1964, 5255, -65173, -131004, 72360, 145912, 47735, 116520, -463362, 103545, 39479, 4597, 51891, 60957, 43781, -148683, -48685, -60931, -277315, 133648, 28046, -88229, -175367, -186105, -50295]
11262G5611f7456I3188a08382b9656j0223B03459q7668E0773d0054D3457a95657
11250b9125j47744B226J98920b82762N3267n4009D883c84261a00459A45145m2426
11239A02719m7293j3629b68662A03626i8126M5950C0996a23260M473L3257I8857
11227C1094K06161G9385j9078K48251b08521A31886a8734B93954A09959b0516
11216C805a12841H8757l7791d7399F32h9983n2847M6416A07421b32078h9784p9166
11204a68950C30991a37316F9684d7931F4217P5820N3245E0159P9285a61590A1926
11192A28632b4842j26067D1546M648c54864f7900F0646a60090j6373C03114p4013
11181B29101f6264B15184c37780c9896j83006A83927O5777A1014d5718k60069
$$ y = [75611, -67456, 93188, -108382, -29656, -39879, 203459, 115791, 50773, -40054, 43457, -195657, -29125, -176869, 2226, 201146, -282762, -229495, -283504, 4883, -384261, -100459, 145145, 102719, 55426, 41797, -268662, 103626, -98126, -52176, 30996, -123260, -118787, -85530, 98857, 31094, 237255, 79385, 60307, 308558, -208521, 131886, -18734, 293954, 109959, -20516, 3805, -112841, 88757, 50966, -47399, 632, -89983, -142830, -96414, 107421, -232078, -89784, -168950, 330991, -137316, 69684, -47931, 64217, 140037, 193282, 50159, 129444, -161590, 11926, 128632, -24842, -150909, 41546, 46194, -354864, -67900, 60646, -160090, -176463, 303114, 229101, -66264, 215184, -337780, -39896, -222902, 183927, 249704, 11014, -45718, -305787]
11171c05787h486D0919J36098d4044A1618N0496K94155i0299o661r569k04741
11160c11270J24393M0131k25165K4288J67476A13166b02545O4406Q382k34849
11150c64606a21762F2834K78661a08120j30185B15578c8226k99151a27969E3477
11139A16246D7128a83848C6008a03321j605A5515c23087L0306j01185G0951f1794
11127a39880A6907J56107b45449A86592O3479e212B97766C3049F067O3035a48927
11115a82945A85b4661A35304o0294l1514J04716b1667F8530R1078i1981A25620
11103E7025a23797A06567h022C0936L2J23729K89161G9391J44765F066J74442
11092A80508f817p2696A93643Q849f0627A87716c6915A46159r710J1583J80414
$$ y = [-305787, -8486, 40919, 177017, -44044, 11618, 62114, 356269, -90299, -96960, -106529, -311270, -186877, -146746, -371911, -347623, -180147, 113166, -202545, -138139, -129757, -364606, -121762, 62834, 341495, -108120, -238305, 215578, -38226, -337377, -127969, 53477, 116246, 47128, -183848, 36008, -103321, -104926, 15515, -323087, -292781, -393966, 70951, -61794, -139880, 16907, 173014, -245449, 186592, 250071, -5212, 297766, 33049, 6067, 69102, -148927, -182945, 185, -24661, 135304, 75010, 43496, 148212, -21667, 68530, 159608, -91981, 125620, 57025, -123797, 106567, -8022, 30936, 30968, 154697, 443858, 79391, 224156, 6066, 180508, -6817, -79513, 193643, 202492, -60627, 187716, -36915, 146159, 136449, 148032, 328446]
11081C28446o6788a7375D8777d2391C39891j50429J092E3246J42755H0182L15890
11070C96072K7751L0883A43825K08188n9806P394A06068Q8191J71959G6871O03540
11059F80411B06462q6553J15738J004J46221p7801K47877o924A6212N21592j30412
11048D07392L3804K99628M0210l89207K62824k42902J64494j77705J54606k24297
11038C28847N75113C74455M0223M51490l52418J7483Q2882k42845K07217K34746
11028H13233j11552k18211K85499p9477l31944J30188K4501R0676M0546K44871
11018H88330G4500P08689j35989J35496j13765k35443J31779A570L76096J15547
11008D93213A79786N05670r7926L3025o0084k03555J60006Q9126j81688K05837
$$ y = [328446, 261658, -17375, 48777, -42391, 339891, 189462, 190554, 53246, 196001, 80182, 396072, 423823, 454706, 143825, 352013, 292207, 299601, 106068, 194259, 366218, 76871, 680411, 206462, 119909, 235647, 236651, 382872, 305071, 552948, 546024, 16212, 537804, 407392, 441196, 740824, 781034, 391827, 654651, 411749, 576243, 398538, 553144, 328847, 903960, 374455, 414678, 866168, 513750, 531233, 614115, 371270, 578487, 813233, 701681, 483470, 768969, 689492, 357548, 487736, 512237, 602913, 643459, 888330, 74500, 783189, 647200, 782696, 668931, 433488, 565267, 1570, 377666, 493213, 179786, 685456, 587530, 620555, 560471, 356916, 516922, 606048, 424360, 630197]
10998F30197l12923j00395L60236q4119j31594R6154J43288K00217k41310k13346
10988C46405K50771B89920K59764J64093j52778k09026p6799K33456L23542l88669
10978D43503q6538M49566J5497K64229j12186j55231K62357K32086j94025M96195
10968A615453J41757j54728P37071K177k1432K04884j14993j99050k48211l8798
10958A924130l30706J31679p46185K4437L28212l2118K9191j57291j16735J17332
10948A171946M7342j80539P4846k27466j44150l32329K95696l42793J39094p1207
10938D30440r1362j28362J43201q9115J4953E4877L60493A07358b54202A34898
10927A22707b46726h0618D8762P1399J38773l7441c1962B37413g1413C6937d30408
$$ y = [630197, 317274, 216879, 577115, 492996, 361402, 457556, 600844, 801061, 559751, 346405, 597176, 289920, 549684, 713777, 560999, 351973, 275174, 508630, 832172, 443503, 356965, 806531, 822028, 1086257, 974071, 818840, 1081197, 1313283, 1119258, 1615453, 1757210, 1602482, 2339553, 2341730, 2320298, 2525182, 2410189, 2211139, 1962928, 1924130, 1593424, 1725103, 978918, 1003355, 1331567, 1299449, 1328640, 1171349, 1054614, 1171946, 1219288, 1038749, 1113595, 886129, 741979, 409650, 705346, 362553, 501647, 430440, 339078, 210716, 353917, 264802, 279755, 54877, 415370, 107358, -254202, 134898, 122707, -246726, -80618, 48762, 120161, 258934, 221493, -31962, 237413, -71413, 36937, -430408]
10915A26575n4945J95308f0973D5882a58541F8352O2536a65760D03267a00253
10904A43728o8800a90066d5677J2454A69814d2171k53612J09563i0840j77479
10894b68319i5996q1921a3185E5121a65784Q0826B4323a43637D8427c02350C17500
10882c95752g6364r3985A07010g4658L4024B3952f7348k3561A32902L4131H0322
10870A01083c25165F7643f6938k70330A23874k0746b617j64560l6779A98638J36262
10859C34900a35454c9498a3505B00339i1688A61796R7101e6482K2280l1414L255
10848f2361B55907P9126a2576M6B37982i4204B23542b26302O2267d9991r2469
10837a42460j52343A81674c4156B11385J57531b35300R0911B6190c7253R243E1322
$$ y = [126575, 71630, 266938, -60973, 45882, -158541, 68352, 130888, -165760, 403267, -100253, 143728, 74928, -190066, -45677, -33223, 169814, -42171, -295783, -186220, -90840, -268319, -95996, -177917, -13185, 55121, -165784, -84958, 24323, -143637, 48427, -302350, 317500, -395752, -76364, -170349, 107010, -74658, -40634, 23952, -67348, -90909, 132902, 167033, 80322, 101083, -325165, 67643, -66938, -337268, 123874, 103128, -2617, -167177, -203956, 198638, 334900, -135454, -39498, -13505, 200339, -91688, 161796, 258897, -56482, -34202, -65616, -62361, 255907, 335033, -12576, -12530, 237982, -94204, 223542, -226302, -164035, -49991, -142460, -294803, 181674, -34156, 211385, 368916, -235300, -144389, 26190, -37253, -28010, 51322]
10825F127b04204g5079k13783e0271B43873r9084I263a16818L397B87883e7250
10813b41760O7526b7826O198j15434k89344E7771a76972A00928a33433b0867G4485
10801A2832a19205j86556a52662B20267b55460d0912A14723G506b74749A31049
10790b14621j44062A24059b03101B34376A03410K21053c01369A15010h3048F6303
10779b58202I18b80133J14124k01301E2432L213a94257p0418J22753e3394p1047
10768a24441K3381B72269B059h9865j67572C9549R7781g2149j9271C1685h420
10756a97186k30343b12872A77429q1699l9792L2682M4856b02014E1358R5822b11271
10744A42586a42924J3094M8022j36809H6172a58151A3170b5937E0011P7986b7250
$$ y = [6127, -204204, -75079, -288862, -50271, 243873, 144789, 9263, -116818, -113421, 287883, -57250, -241760, -174234, -27826, -21628, -137062, -426406, 57771, -176972, 100928, -133433, -20867, 74485, 12832, -119205, -305761, -152662, 220267, -255460, -40912, 114723, 7506, -274749, 131049, -214621, -358683, 124059, -203101, 234376, 103410, 324463, -301369, 115010, -83048, 66303, -258202, 918, -280133, -166009, -367310, 52432, 55645, -194257, -264675, -141922, -53394, -124441, -101060, 272269, 2059, -89865, -257437, 39549, 137330, -72149, -91420, 31685, -8420, -197186, -427529, -212872, 177429, 95730, 55938, 88620, 133476, -202014, 51358, 147180, -211271, 142586, -142924, -129830, -81808, -218617, 86172, -158151, 13170, -25937, 50011, 127997, -27250]
10732C3724a4511H2531a12176A89952J56414h4546A14321a18453A91922J83285
10722C75207i2253j702d1265k888l8833j93546a05846j83383M7597B50472a8142
10710a09604I6692c63864J17122g4254m5077j84541b1782r2854M9685B8517d6306
10698b19363b2938B21573b92383b650q3409k11680I5737g5782A9956L27920j31334
10687B16542a01411B67952A3973b16588C32495A08317a15967k5958D2689a052
10676a23767B42182b15697B55319j02072C3421J03185K59764a89962k1431n2177
10666b63570b0487k33295G7923b73685B0837a32936J8975a2915k03182i099A69684
10654d2594j81819e2367j30887j72544J76014A46356a10967n8985j57039a19423
$$ y = [33724, -14511, 82531, -112176, 189952, 346366, -84546, 114321, -118453, 191922, 375207, -92253, -93955, -41265, -44153, -82986, -276532, -105846, -289229, -241632, 250472, -18142, -109604, 96692, -363864, -246742, -74254, -119331, -303872, -21782, -114636, -64951, 28517, -46306, -219363, -22938, 221573, -292383, -2650, -86059, -297739, 95737, -75782, 19956, 347876, 216542, -101411, 267952, 13973, -216588, 332495, 108317, -115967, -141925, 42689, -1052, -123767, 242182, -215697, 255319, 153247, 33421, 136606, 396370, -189962, -211393, -263570, -20487, -253782, 77923, -273685, 20837, -132936, -113961, -12915, -216097, -9099, 169684, -42594, -224413, -52367, -183254, -355798, -179784, 146356, -110967, -169952, -326991, -119423]
10643b0465j90097i907j64998d3298k55667o2950J03416P1037j31770B00801a05985
10631a20772B24107q4163P3744B0558c2117Q097k40523A53319f6004B68167d5596
10619H5273a89879I1798L3085b70637A61915e4001l11579N8017c131p4317l40960
10608d18408J42897a18585m7246j58241A43074M8396n0818Q5903a0201j23414
10598a33615A007K14681h8146j83693k77458e0475l2007A93726L7589i0312J2611
10587g7701N585j81910G1562f6142J045I6197e3435j2675k89266M4535C1513a33757
10574h6017l4871l4362A82366A5872b44137g5479A11865A6975c08850b5245p0381
10563i5626B23995H1908e5948m4201B07147b13669J04490A89397O7878A17052
$$ y = [-20465, -210562, -9907, -174905, -43298, -298965, -361915, -258499, -187462, -319232, 200801, -105985, -120772, 224107, 139944, 213688, 20558, -32117, -24020, -264543, 153319, -66004, 268167, -45596, 85273, -189879, 91798, 124883, -270637, 161915, -54001, -365580, -307563, -3131, -77448, -418408, -275511, -118585, -165831, -324072, 143074, 191470, 140652, 226555, -10201, -133615, 1007, 215688, -88146, -271839, -549297, -50475, -82482, 193726, 231315, -90312, -77701, -72116, -254026, 71562, -66142, -65097, 96197, -53435, -66110, -355376, -310841, 31513, -133757, -86017, -120888, -155250, 182366, 15872, -244137, -75479, 111865, 16975, -308850, -25245, -95626, 223995, 81908, -55948, -100149, 207147, -213669, -109179, 189397, 257275, 117052]
10552B75739D290L04666f1674e970r3402B8493i9429l4520L1975k8038i711j14071
10540a23782b8792C49978h0560p2044L1971p5550i2509E2095c9070k40145A25687
10528b38370C1043d15722b53A36404A2379a96557H9238a86969A9599a04214b9551
10516a49031j99147a31197B2473J97272p7759c29542J30535A75034B7485d9496
10505A39319k5137C0476K38676j34129o3354C1648P6297C7829a14653B5521J84862
10494B10383b23449M1718B84397b72146Q9212K9394I7585O004a5440l61980a12779
10482c1525p1502F2362c89864D1695i6299I1232R0556o5947L47145A30221J63845
10471B94066J22148B878J40400J99648F0774J52888a498A66356a85343A7549D532
$$ y = [275739, 4290, 308956, -61674, -5970, -99372, 28493, -99429, -133949, -101974, -130012, -9711, -123782, -28792, 349978, -80560, -152604, -120633, -196183, -92509, 52095, -39070, -279215, 125687, -238370, 31043, -415722, -253, 136404, 12379, -196557, 89238, -186969, 19599, -104214, -29551, -149031, -348178, -131197, 22473, 219745, 141986, -329542, -199007, 175034, 27485, -49496, 139319, 114182, 30476, 269152, 135023, 71669, 31648, 107945, 37829, -114653, 25521, 210383, -223449, -181731, 284397, -272146, -182934, -153540, 97585, 103589, -15440, -377420, -112779, -31525, -103027, 62362, -389864, 41695, -96299, 91232, 181788, 115841, 462986, 130221, 294066, 416214, 2878, 143278, 342926, 60774, 213662, -1498, 166356, -185343, 17549, 4532]
10459c03342a00264A154h9961B9507K29440a64904C73972c6985l13514B7458b09779
10447e3965j88995E6751f9190C10645C748J7997c13857D6111a09881j40774a09867
10435B37985a07846n5936J8174B55075a1724j01123M5927f669j75421O7455A8784
10423B65188n662a55754G4072a73946j80957a01614j54070B4384a18410I3745
10412E930c46361A8415g8771C78267e9651b2557a323p7334b5620q273B63894b61722
10399G072c1105j65059c3187A21162b1095A1167e1745q4889F2272M11799a60364
10387A94915e7272m9746A11999i8467E1249L49190A19878B384b7334A95031a92000
10375c3889F9758a12190E1837M937c6600A71771J98745b35197B94640c9997B64443
$$ y = [-303342, -100264, 1154, -89961, 29507, 258947, -164904, 373972, -36985, -350499, 27458, -209779, -53965, -242960, 56751, -69190, 310645, 3748, 21745, -313857, 46111, -109881, -250655, -109867, 237985, -107846, -163782, -145608, 255075, -11724, -112847, -66920, -6669, -182090, -114635, 18784, 265188, 259526, -155754, 74072, -173946, -354903, -101614, -255684, 24384, -118410, 93745, 5930, -346361, 18415, -78771, 378267, -59651, -22557, -1323, -78657, -25620, -33893, 263894, -261722, 7072, -31105, -196164, -33187, 121162, -21095, 11167, -51745, -136634, 62272, 474071, -160364, 194915, -57272, -107018, 111999, -98467, 51249, 400439, 119878, 2384, -27334, 195031, -192000, -33889, 69758, -112190, 51837, 56774, -36600, 171771, 370516, -235197, 294640, -39997, 264443]
10363B49175R1621j56533M06739k85141A51334p4792a1157B39175N7897A11676
10352b4896C13629P6275B1400K04148L20937B18483J44583M32115A72734P3589
10342B46323j08125M2146n9960J2356O5319g974E1885L0872B2101L18748j56149
10331A84700J3621b2795E0470L3445K45464A343e3259A42700k903j0601J71941
10320C01137a5363j01094C58660A36762l7773N6913B9710b39026G6685e9595H726
10308a03245j666L1620j60568d5442r7420n8431j2444j87378F4467i0591k6903
10297a17494A56996c98556H2108J42259E1866a59850j85735D5628P4141g1721
10286B524a00105k51188A30433m1916R2702b09772A22130a87516G5372K2199a04548
$$ y = [249175, 340796, 184263, 591002, 305861, 151334, 76542, -11157, 239175, 297072, 111676, -24896, 313629, 389904, 21400, 225548, 546485, 218483, 363066, 795181, 172734, 246323, 138198, 180344, 120384, 132740, 198059, -7974, 51885, 82757, 22101, 340849, 184700, 198321, -22795, 50470, 83915, 329379, 1343, -53259, 142700, 139797, 129196, 301137, -15363, -116457, 358660, 136762, 98989, 155902, 29710, -239026, 76685, -59595, 8726, -103245, -104911, -73291, -233859, -45442, -142862, -201293, -213737, -401115, 64467, -90591, -117494, 156996, -398556, 82108, 224367, 51866, -159850, -345585, 45628, 119769, -71721, 2524, -100105, -351293, 130433, 88517, 181219, -209772, 122130, -187516, 75372, 97571, -104548]
10274i0628n3364c5597k15008b5079H6098J61454D8987c70635a2839A04681e1482
10262c75906J74033L1142D3980a56991m2789f7589D7694a11369j17381A99665
10251I8605M06232B26637K30935j36062b1557m2849A1405J7507c84172d2915j86880
10240b29795j10415f0621j26769P2672L1659A13034D6986g9538a8126B38261o0723
10229A77538F8339b7226k39345a10336k90408A04750b29401C36513A22336a47116
10218b97712A69968b03196j41014a06922j09332j52682g1776K0529J5689j15144
10208a50702J5339A89927a09451b1215E846a51242J3672M2221J8786j4102C8730
10196B31412g6915m5105d7561J6993B01943b65569A97617b93100P0787A29430
$$ y = [-90628, -143992, -35597, -250605, -25079, 86098, 247552, 48987, -370635, -12839, 104681, -51482, -375906, -201873, -170731, 43980, -156991, -199780, -67589, 47694, -111369, -228750, 199665, 98605, 504837, 226637, 457572, 321510, -21557, -64406, 11405, 28912, -384172, -42915, -229795, -340210, -60621, -187390, -114718, -83059, 113034, 46986, -79538, -18126, 238261, 177538, 68339, -27226, -266571, -110336, -400744, 104750, -229401, 336513, 122336, -147116, -297712, 169968, -203196, -344210, -106922, -216254, -368936, -71776, -51247, -35558, -150702, -135363, 189927, -109451, -21215, 5846, -151242, -137570, -95349, -76563, -90665, 38730, 231412, -76915, -122020, -47561, -30568, 201943, -265569, 197617, -293100, -222313, 129430]
10185g1185B28299D6968K08586b50143j0041D6503r677c3396A83011d0970k74145
10174c15115B93472a96851A09824i9263K0145l96882B3507a06710M6027i612o7783
10163g7395A50522d3586K906n3286j64059f7864q2001n5179Q9322k76828i1574
10151a22476k071p7971R4992J0036I1966a06161A8167a26478k31646Q5859b1512
10139a23325L3315k6955L5427I0816J67561a03054A44587R7007b07792D4191c33507
10127B4652G675a68149P9110B33975c32326A5416J02228f1620D1104f4332j33979
10116a98311j89469A33608e3086C0963a40780A07608a15242j51008O4830e8593
10105D7110e9696j49238m985A72461j0654B3025M5011b7517r5181k34201i4889
$$ y = [-71185, 228299, 46968, 255554, -250143, -260184, 46503, 36826, -33396, 183011, -40970, -315115, 293472, -196851, 109824, -99263, -79118, -476000, 23507, -106710, -60683, -9612, -77395, 150522, -43586, -40680, -93966, -258025, -67864, -149865, -205044, -115722, -392550, -91574, -122476, -124547, -202518, -107526, -97490, 91966, -106161, 18167, -126478, -358124, -272265, -21512, -123325, -90010, -116965, -81538, 90816, 258377, -103054, 144587, 241594, -207792, 44191, -333507, 24652, 7675, -168149, -89039, 233975, -332326, 15416, 117644, -61620, 41104, -64332, -198311, -387780, 133608, -53086, 30963, -140780, 107608, -115242, -266250, -201420, -58593, 47110, -59696, -208934, -213919, 172461, 161807, 23025, 68036, -27517, -122698, -356899, -94889]
10093b19657f6368I5994c6992l124J7341j20145q4729j20597M6503j88760a32499
10081b41230a08682B84582a82335g059A5739a31379B71208e0412k61031g6314
10070B4532a12640D8465j6593j2422L652c2112A51946d4300C09403a38504B65573
10058a25049A14821b1042l34542i163B8342N1061a9321j95054I7716C7440f7676
10046a77947L4747k8965A35278J8265F0276j493Q0161g2663G4511b90121A60596
10034a25243A45393D0090c39870a60299L6102j57354l63069I5629a23717j25595
10024b49312O684a08494k30150J04159A00897a27059I5323i2208A5594a69233
10013a46730P0953k78480J64814H5779a58192l8821j2302l385J3235e4168B6241
$$ y = [-219657, -66368, 95994, -36992, -40116, -22775, -142920, -227649, -348246, -301743, -490503, -132499, -241230, -108682, 284582, -182335, -7059, 15739, -131379, 271208, -50412, -311443, -76314, 24532, -112640, 48465, 31872, 19450, 23102, -32112, 151946, -44300, 309403, -138504, 265573, -125049, 114821, -21042, -355584, -9163, 28342, 79403, -19321, -214375, 97716, 37440, -67676, -177947, -143200, -172165, 135278, 153543, 60276, 58783, 138944, -72663, 74511, -290121, 160596, -125243, 145393, 40090, -339870, -160299, -124197, -281551, -644620, 95629, -123717, -249312, -242628, -108494, -338644, -234485, 100897, -127059, 95323, -92208, 15594, -169233, -146730, -75777, -354257, -189443, 85779, -158192, -197013, -209315, -212700, -199465, -54168, 26241]
10001A99880E5357i1500C45136b07057g5087d877j6101A23515g2885A1689a65098
9989a87734q7211E0352b15525c8468C45832c03629a45664A15122C2684n525M8521
9978G5680k1059j8778c82176d2153k7330C1327a38782f6791p8279j80007b9679
9966a45950A21912b52823R281e9018J486j10645f5418C4409c81893Q9737a30613
9954C941e5951l3729L0584b4621A42590f7405p1519q3057C00810c0522E1274e1271
9941G1595a57938g075j24492L6486m9877C09897C2609J70061b75300A6127J28175
9930A44302b1605l6650A59729c88271B8987d9144l5564G2660b14591K8344Q5915
9919a00332p0067a1448j64011D2174d6326B43884F2062M6209Q906a26552k41692
$$ y = [199880, 55357, -91500, 345136, -207057, -75087, -4877, -20978, 123515, -72885, 11689, -165098, -187734, -274945, 50352, -215525, -38468, 345832, -303629, -145664, 115122, 32684, 27159, 75680, 54621, 35843, -382176, -42153, -69483, 31327, -138782, -66791, -145070, -325077, -29679, -145950, 121912, -252823, -243542, -59018, -57532, -168177, -65418, 34409, -381893, -292156, -130613, 3941, -55951, -89680, -59096, -24621, 142590, -67405, -138924, -221981, 300810, -30522, 51274, -51271, 71595, -157938, -7075, -131567, -95081, -144958, 309897, 32609, 202670, -275300, 16127, 144302, -21605, -58255, 159729, -388271, 28987, -49144, -84708, 72660, -214591, -186247, -100332, -170399, -11448, -175459, 42174, -46326, 243884, 62062, 108271, 117177, -126552, -368244]
9908c68244a9309l70782A03213a78524j973B30222a60486G7189n173d28932b09801
9896i9620D5528a21962j17516f9654D9610b3449k14185j91611a23463B12M02181
9885D02393j90025a00401j30420a00909l9961B6867c6055C8264b33784N2669g5845
9873e3257o8534l1320j9125J3693q3829B91687F8890b98252A98211d747A81127
9861c18084A05558j4333B0622L63926i9803A52722b06071P9893o852h192m38106
9850d46298O8370f1891j18368j33367A48373a28153j4207j72145a04995o3826
9840a68821j13514c0234a4617A19410a12536L6508K6923D759d04052a59043A82111
9828F2955a30703F860J51680c42330a53441j9719r0617F7001a16294C95629a26253
$$ y = [-368244, -19309, -390091, 103213, -178524, -180497, 230222, -160486, 77189, 72016, -428932, -209801, -99620, 45528, -121962, -239478, -69654, 49610, -23449, -237634, -429245, -123463, 212, 402393, 212368, -100401, -230821, -100909, -140870, 26867, -36055, 38264, -233784, -181115, -75845, -53257, -121791, -153111, -172236, -158543, -242372, 291687, 68890, -298252, 198211, -4747, 181127, -318084, 105558, 91225, 20622, 384548, -99803, 152722, -206071, -126178, -133030, -8192, -446298, -377928, -61891, -180259, -313626, 148373, -128153, -142360, -314505, -104995, -168821, -282335, -30234, -14617, 119410, -112536, -76028, -49105, 4759, -404052, -159043, 182111, 62955, -130703, 6860, 158540, -342330, -153441, -173160, -263777, 67001, -116294, 395629, -126253]
9816b18365L9850O9704m1939J8704b3762C23730g6382j72495A46501J34455d1939
9804A82817B2429b2833k86396A52669f4979A5c63628L4634a6674k46563A26821
9792H9113a2081o4925J1456j68140L8314m3671d3211A6963a58536F0542b60743
9780E1337N6611a61268j2408c4717A59157a7323A84584a75722e0443k47439e7894
9768b18689c5361C24960a67324B24961b70925M4736H9988k8338d62145a30985
9757a82360P3858B19643b60728a26727d7027j51226j45241a52563g0101F1391
9746B06223m4387a82835N4788M8383p4680e6138A26527c449l97643D7194J9478
9735F6672a22540j8812J743j75012r8464F0686A1831i1827I0339a90628N7576
$$ y = [-218365, -178515, -108811, -150750, -132046, -23762, 323730, -76382, -248877, 146501, 280956, -41939, 182817, 22429, -22833, -309229, 152669, -64979, 15, -363628, -328994, -16674, -263237, 126821, 89113, -12081, -77006, -65550, -233690, -195376, -239047, -43211, 16963, -158536, 60542, -260743, 51337, 107948, -161268, -173676, -34717, 159157, -17323, 184584, -175722, -50443, -297882, -57894, -218689, -35361, 324960, -167324, 224961, -270925, -226189, 89988, 61650, -462145, -130985, -182360, -108502, 219643, -260728, -126727, -47027, -198253, -343494, -152563, -70101, 61391, 206223, 161836, -182835, -128047, -79664, -154344, -56138, 126527, -3449, -401092, 47194, 66672, -122540, -141352, -139609, -314621, -413085, 60686, 11831, -91827, 90339, -190628, -133052]
9724a33052A15884R5935e7163l03672A31886A8472K4471a59051A17523J9222b11117
9712e6030j12254k9857d7582j32031l0504g9325A05307a39615a6045l2404p2020
9701a20469A61656d87641A33013b29821d4629A53520c2066i461j95542j8102h5602
9689C73640h3724j24344g8709R314k16764a21846j80270A26221h8401p780k160
9678i8341A26143K8766f5503A02825c17157A17950c16731H8179b02471b7326m83250
9667e10576a07540L7525j02759l6929M0540a3824l0213A12137l1989J6634P9750
9656A76532h2012B71292b94774d7823L40A39086a71272k1550A7163b41501Q5237
9645a56264b1982A61443B7543b199l94812J67482N2849g6831j63136R5513B6975
$$ y = [-133052, 115884, 211819, -57163, -360835, 131886, 18472, 42943, -159051, 117523, 136745, -211117, -56030, -168284, -198141, -47582, -179613, -210117, -79325, 105307, -139615, -16045, -48449, -120469, 161656, -487641, 133013, -229821, -44629, 153520, -32066, -9461, -205003, -223105, -85602, 373640, -83724, -208068, -78709, -69395, -286159, -121846, -302116, 126221, -88401, -96181, -98341, 126143, 154909, -65503, 102825, -317157, 117950, -316731, 88179, -202471, -27326, -510576, -107540, -70015, -172774, -209703, -169163, -13824, -44037, 112137, 80148, 96782, 176532, -82012, 271292, -294774, -47823, -47483, 139086, -171272, -192822, 17163, -241501, -156264, -21982, 161443, 27543, -2199, -397011, -229529, -176680, -76831, -239967, -144454, 26975]
9633F4918a59922B42977e8728j47359n6498A83526d6644m5623j15972A60520b12023
9621a3833j60205k52303O5626c770j46040l16265C3920M0103c1263C2547a38143
9609A26868b23630A18569a50859g3130L3851j60594a0906j62559B50259b39465
9598H7266L14145a03114B33857B0694Q2369B483L25438A31573m1595J844a16863
9586G3931B1340a85981h8209I4316c56683F5514R9798O3816c06592A3321c09506
9574F4984P6475a86300j4480p1657m1416a2811A58515B0620L6212a78129D78015
9562a13908B44545A21419a9271r5784r4420K6051m00570e1808A29150a68370B2849
9550B395N8449c77516B12289h4619H0765b60395j26475G6392c12266J52821H4947
$$ y = [64918, -159922, 242977, -58728, -206087, -262585, 183526, -46644, -92267, -208239, 160520, -212023, -13833, -174038, -426341, -360715, -3770, -149810, -466075, 33920, 74023, -31263, 32547, -138143, 126868, -223630, 118569, -150859, -73130, -39279, -199873, -10906, -173465, 250259, -239465, 87266, 401411, -103114, 233857, 20694, 103063, 2483, 327921, 131573, 89978, 91822, -116863, 73931, 21340, -185981, -88209, 94316, -356683, 65514, 165312, 229128, -306592, 13321, -309506, 64984, 141459, -186300, -200780, -272437, -313853, -12811, 158515, 20620, 56832, -178129, 478015, -113908, 244545, 121419, -19271, -115055, -209475, -183424, -583994, -51808, 129150, -168370, 22849, 2395, 60844, -377516, 212289, -84619, 80765, -260395, -386870, 76392, -312266, -159445, 84947]
9538a9723l05013b7894l6912l7655A65822b99142L555A84969b23772a08142e3332
9526d34152J92312m4289A3726b57260A80898b39066c4056B26192a30728L8658
9516i2070k8743e0359k66914J25056F2685Q6190k9681j097c35866b2198j63343
9505a85541H2898b88957J13519r5000I267J74880d4546j09782c8272j53651j5792
9494b07715B7460c92617E624c16413a152k61473J01721A04148b6689B3874a65567
9482a4953k83256F245J95888D3530K39005A06305d91693G139J8286b84302n8303
9471c42605B3324a99335A24850B6074c8114C06959b0841j65804c7601j28053A26180
9459A6759c26745c5583j69748I9725b7520g197C35821b2510C1054J35604A3726
$$ y = [-19723, -324736, -27894, -64806, -102461, 165822, -299142, -295587, 184969, -223772, -108142, -53332, -434152, -241840, -286129, 13726, -257260, 180898, -239066, -34056, 226192, -130728, -92070, -120813, -50359, -317273, -192217, 62685, 148875, 119194, 118097, -335866, -22198, -185541, 82898, -288957, -175438, -270438, 9267, 184147, -44546, -154328, -38272, -191923, -207715, 27460, -392617, 5624, -316413, -1152, -262625, -160904, 104148, -26689, 23874, -165567, -14953, -298209, 6245, 202133, 43530, 282535, 106305, -491693, 7139, 25425, -284302, -342605, 23324, -199335, 124850, 26074, -38114, 306959, -20841, -186645, -37601, -165654, 126180, 16759, -326745, -35583, -205331, 99725, -27520, -7197, 335821, -22510, 31054, 166658, 13726]
9447A140L1784R6883f3430A2982a80416g0492J8133b3145J0238j06283A33922
9435a00173i154j1617k19904A49878e654G7885a01066B00023c59311G3675d8491
9423b46499g9988B1363L0043J87123D3667K58447d2377H962J14033a06077A19119
9411D5803P0478c4383g125k6949j43780E4358a07033q7131B6064O4345B0907a29756
9398A87335A7711a55125C8369b30982J00682j16194B3378b6252A37021D3642c68316
9386d1560p9432O0178j56442R5385C44849A5863b99737h006j3693B418L31876
9375C34294d8580B8876P3082j8746d04638A0703N5991i2127k84795a38554k51986
9364c90540f3808j30883B5477b95736a10623C6763d9348k36517Q5958O3430C60953
$$ y = [1140, 32924, 129807, -63430, 12982, -180416, -70492, -52359, -23145, -12907, -119190, 133922, -100173, -9154, -20771, -240675, 149878, -5654, 77885, -101066, 200023, -359311, 73675, -48491, -246499, -79988, 21363, 51406, 238529, 43667, 302114, -42377, 8962, 122995, -106077, 119119, 45803, 116281, -34383, -7125, -34074, -177854, 54358, -107033, -194164, 26064, 90409, 20907, -129756, 187335, 17711, -155125, 38369, -230982, -130300, -246494, 23378, -26252, 137021, 43642, -368316, -41560, -120992, -60814, -217256, -121871, 344849, 15863, -299737, -8006, -21699, 2418, 334294, -48580, 28876, 101958, 83212, -404638, 10703, 66694, -92127, -376922, -138554, -390540, -63808, -194691, 25477, -295736, -110623, 36763, -49348, -285865, -199907, -136477, 360953]
9352I6200f6726k07992a4840j41979n0877b3041l14259b4990j39361L6822G9893
9340C2951b00320D2863a67175M6103j41721c5930l04719C5837a22537Q051r6930
9329b11416J4543A13015c1274B77207A24153a6186G2410b38610J8903j50402a29032
9317a9135k92457a45381b6922k2913n9281n4718b1322C56699a96059n7576M5783
9306b07852n3060J00248B18905a48963B00350b85505g1038A62658m6275a15093
9295e68l08074J51145P240G3333a19805k84567C3376d4859n767l1614B31101q7220
9283A43881a46783g2431l15886q528A49821C9914c07692e4197G3035f8811k04457
9272b73268h1009E8368P3404k6694g6286H9820f1050j01688k28529O2820A0771
$$ y = [96200, -66726, -274718, -14840, -156819, -207696, -23041, -337300, -24990, -164351, -127529, 79893, 32951, -200320, 42863, -167175, -121072, -262793, -35930, -340649, 35837, -122537, -114486, -211416, -196873, 113015, -31274, 277207, 124153, -16186, 72410, -238610, -219707, -370109, -129032, -19135, -311592, -145381, -26922, -49835, -109116, -163834, -21322, 356699, -196059, -253635, -207852, -260912, -160664, 218905, -148963, 200350, -285505, -71038, 162658, 116383, -115093, -568, -308642, -157497, -150257, 73333, -119805, -404372, 33376, -44859, -50626, -82240, 231101, 143881, -146783, -72431, -388317, -396845, 149821, 39914, -307692, -54197, 73035, -68811, -273268, -81009, 58368, 131772, 105078, -76286, 89820, -61050, -162738, -391267, -328447, 10771]
9260A09339c9672k02026C8828b6012I7055a49103j21172A11888a38244j03173
9250b41417H6571B056a24627I8563H711J57606p3344k9959a57021H685a59173
9238a87019R2246p2251C9647d5950C3200K43868a62437F4804b19581O0047A04655
9226e7835q5321k18374H9379b84459J15679j0113a4875D2951f572B24352a99256
9214d05465B35964C6214K41365c04493M6062a19160b8217j5707d989k21206D4086
9202A51346b38970k836O5836Q5205D403J19073L0693d888H6320J55524a70659
9190a53741J8467J7297e6318C1292a82792j02967B5835K06568j13071b41183G2556
9178g0048A96108D526a79300J0750l3649F5305a80579j84819f2915r4606O4329
$$ y = [109339, -39672, -241698, 38828, -26012, 97055, -149103, -270275, 111888, -138244, -241417, 86571, 2056, -124627, 98563, 8711, 166317, 92973, 63014, -157021, 8685, -159173, -187019, -94773, -167024, 39647, -45950, 33200, 277068, -162437, 64804, -219581, -159534, 104655, -57835, -143156, -361530, 89379, -284459, -168780, -178893, -14875, 42951, -6572, 224352, -199256, -405465, 235964, 36214, 277579, -304493, -258431, -119160, -28217, -43924, -4989, -226195, 44086, 151346, -238970, -241806, -175970, -90765, 4403, 123476, 154169, -4888, 86320, 241844, -170659, -153741, -135274, -117977, -56318, 31292, -182792, -285759, 25835, 232403, 119332, -241183, 72556, -70048, 196108, 4526, -179300, -168550, -202199, 65305, -180579, -365398, -62915, -157521, -93192]
9167i3192L4304l577l6227c4202m4204B99938o9488H1968a18729j29666J13370
9156a35025j14541A98686r654a80538f005A94716J01466a6974B50137a31896C34910
9144A9805b8206C86489b18688G4136M59703d9987m909j2614f086j30588A89234
9132b24921E7744b41129Q8362B19040d3920A35614b91762M5648F6464c30954i2297
9120b86875a26548p5453A17220K4909h951C16141g9744H5457e4413j21027I2924
9108g1926M21B37760J2379F7772h0066K7078k12754c1912B09564f4498l02901
9097c67399g6800a0040n5665l45989m0230a43677A80139G3162b69891D1254J85241
9086B26495N7844e3994A4194J49761a80829k11534J63246C1966a51731r4480k5965
$$ y = [-93192, -58888, -62465, -98692, -34202, -78406, 299938, 230450, 81968, -118729, -248395, -135025, -249566, 198686, 189032, -180538, -6005, 194716, 296182, -16974, 250137, -131896, 334910, 19805, -28206, 386489, -218688, 74136, 533839, -49987, -54896, -67510, -6086, -136674, 189234, -224921, 57744, -241129, -152767, 219040, -43920, 135614, -291762, -246114, 66464, -330954, -92297, -286875, -126548, -202001, 117220, 142129, -8951, 316141, -79744, 85457, -54413, -175440, 92924, -71926, -71505, 237760, 250139, 67772, -80066, -52988, -265742, -31912, 209564, -64498, -367399, -76800, -10040, -65705, -411694, -451924, -143677, 180139, 73162, -269891, 41254, 226495, 284339, -53994, 14194, 163955, -180829, -392363, -229117, 31966, -151731, -246211, -272176]
9075b72176I7023L5361e7182j74411F5571a66788p1024R7762f2844G6837c04440
9063h0612G8249d18130B6883a04080n03263a44355D9460J2547a97264B85083e15785
9051A7324i5918B00302h8044o4109B2793P8612g4487k47416k3087a71892N5407
9040a16485D8872b89697b8355j50719B4577b65134h4062b845k26527a6527C8414
9028a29454D00985a1422k01150Q2334k42865d9614j59957k0401A10270a65405
9017c576k29221A21178B4797b27611Q729j10119J09828B0503a3320j39936F1898
9005g8966E1489c84234A2456c7675B40986a47747E019O5807N0051b83142A57997
8993C169a74427J3558A33529D2822b36211d1329p5144A35315j1766i8866c6588
$$ y = [-272176, 97023, 132384, -57182, -231593, 65571, -166788, -237812, -140050, -62844, 76837, -304440, -80612, 78249, -418130, 26883, -104080, -607343, -144355, 49460, 62007, -197264, 285083, -515785, 17324, -95918, 200302, -88044, -152153, 22793, 101405, -74487, -321903, -344990, -171892, -116485, 48872, -289697, -28355, -179074, 24577, -265134, -84062, -2845, -229372, -16527, 38414, -129454, 400985, -11422, -212572, -130238, -373103, -49614, -209571, -229972, 110270, -165405, -3576, -232797, 121178, 24797, -227611, -218882, -329001, -219173, 20503, -13320, -153256, 61898, -78966, 51489, -384234, 12456, -37675, 240986, -147747, 5019, 70826, 120877, -283142, 157997, 3169, -174427, -160869, 133529, 42822, -236211, -41329, -116473, 135315, 123549, -98866, -36588]
8981C3777L53229a90553M2803C2753e2984k60596B724K8235J13718D1285q907
8970C2378f4623j45012B84903a30138M7900q4580g7777J9289F3835l087c01139
8958i3172a9477j03930H3640a53145r2799A72681E984c6309J4396j80454J8657
8947a83710c4599m3244B44125e9356A3336b93824C50889A5540R8136b5678C3343
8935a27943K0868o1564H6488b40831A57726k8363C9169P4948d72212F4945a34023
8923B45145F58J08223F749a5107m5005E92236K95002C25533F9959c0510I2305
8911a69633K3826O9579j820F5534h7540B26888f5741H5178J20293a19961Q94I7539
8898e6961A68583e3154k12979f6675A29447h2043D1558R8073b56106j61689J58202
$$ y = [33777, 387006, -190553, -147750, 32753, -52984, -313580, 2724, 30959, 144677, 41285, 32378, -64623, -209635, 284903, -130138, -82238, -166818, -77777, -58488, 63835, 60748, -301139, -93172, -19477, -123407, 83640, -153145, -245944, 172681, 5984, -36309, -21913, -202367, -183710, -34599, -77843, 244125, -59356, 13336, -293824, 350889, 15540, 113676, -25678, 33343, -127943, -107075, -168639, 86488, -240831, 157726, 129363, 39169, 114117, -472212, 64945, -134023, 245145, 658, 108881, 6749, -15107, -60112, 592236, 887238, 325533, 69959, -30510, 92305, -169633, -145807, -76228, -78048, 65534, -87540, 226888, -65741, 85178, 205471, -119961, -119067, 97539, -56961, 168583, -53154, -266133, -66675, 129447, -82043, 41558, 139631, -256106, -417795, -259593]
8887b59593a17543a9387E0899b63194e3949C2805b47152A28410A1849K55906b44676
8875a68146A40146b04320e3193m7852L403K0079q0927F0420J5538b8624C8928
8863a22239A65586i7629j14837c756j33118o9106i9653l97425a54518E2410b97272
8851B7684b36471K2905A79694c14489j53416g0043j56262e8913j31196K0219r70
8840a70860b490G0672b0020m5781j01681l0036q5065f5818B28391c77270A48957
$$ y = [-259593, -117543, -19387, 50899, -263194, -53949, 32805, -247152, 128410, 11849, 267755, -244676, -168146, 140146, -204320, -53193, -101045, -97642, -77563, -158490, 60420, 75958, -28624, 38928, -122239, 165586, -97629, -212466, -3756, -136874, -205980, -99653, -497078, -154518, 52410, -297272, 27684, -236471, -213566, 179694, -314489, -467905, -70043, -226305, -58913, -190109, -169890, -170860, -2490, 70672, -20020, -65801, -167482, -197518, -282583, -65818, 228391, -377270, 148957]
$$ [...]
##END NTUPLES=NMR SPECTRUM
##END=
